##TITLE=Analysis number 313836
Compound Code cc 42210
Book Reference 433/169/5
Project Code adrs
Chemist Name victoriam
##JCAMPDX= 6.0         $$ Bruker NMR JCAMP-DX V2.0
##DATA TYPE= NMR SPECTRUM
##DATA CLASS= NTUPLES
##ORIGIN= Bruker BioSpin GmbH
##OWNER= NMR
$$ XWIN-NMR		Version 3.5
$$ Fri Sep 23 09:38:41 2005 GMT Daylight Time (UT+1h)  MAYBRIDGE\NMR@NMR_250MHZ
##.OBSERVE FREQUENCY= 250.131544655141
##.OBSERVE NUCLEUS= ^1H
##.ACQUISITION MODE= SIMULTANEOUS (DQD)
##.ACQUISITION SCHEME= undefined
##.AVERAGES= 16
##.DIGITISER RES= 18
##SPECTROMETER/DATA SYSTEM= dpx250
##.PULSE SEQUENCE= zg30
##.SOLVENT NAME= CDCl3
##.SHIFT REFERENCE= (INTERNAL, CDCl3, 0, 16.522)
##AUDIT TRAIL= $$ (NUMBER, WHEN, WHO, WHERE, WHAT)
$$ ##TITLE= Audit trail, XWIN-NMR		Version 3.5
$$ ##JCAMPDX= 5.01
$$ ##ORIGIN= Bruker BioSpin GmbH
$$ ##OWNER= NMR
$$ C:\u/data/dgb/nmr/ADRS/9870/pdata/1/auditp.txt
$$ ##AUDIT TRAIL=  $$ (NUMBER, WHEN, WHO, WHERE, WHAT)
(   1,<2005-09-23 09:38:16.49 +100>,<MAYBRIDGE\NMR>,<NMR_250MHZ>,
      <created by zg, POWCHK disabled, PULCHK disabled
       configuration hash MD5:
       62 19 C7 07 E1 42 D1 B7 37 6C 3D D0 77 39 F9 E6
       data hash MD5: 64K
       28 7C 4F 2D CB EF 5C 6D 52 11 27 1B 4C 93 17 AC>)
(   2,<2005-09-23 09:38:27.49 +100>,<MAYBRIDGE\NMR>,<NMR_250MHZ>,
      <Start of raw data processing
       ef LB = 0.3 FT_mod = 6 PKNL = 1 SI = 32K 
       data hash MD5: 32K
       1B E0 1E 71 B5 E9 CA 71 50 EA CC 7B 30 B8 C8 AF>)
(   3,<2005-09-23 09:38:31.27 +100>,<MAYBRIDGE\NMR>,<NMR_250MHZ>,
      <apk 
       data hash MD5: 32K
       93 D8 CF B5 E3 EF EC B1 25 9B 05 3B 55 97 E5 98>)
(   4,<2005-09-23 09:38:32.69 +100>,<MAYBRIDGE\NMR>,<NMR_250MHZ>,
      <abs ABSG = 5 
       data hash MD5: 32K
       D5 1A 6E A0 3B 97 D0 50 26 3E 9E 2A 8A 8A 77 8A>)
$$ ##END=
$$ 
$$ hash MD5
$$ FC A2 E3 BD 1F 65 C3 06 44 F3 65 6A 27 D8 DA 44
##$RELAX= 
##$RELAX= 
##$RELAX= 
##$RELAX= 
##$RELAX= 
##$RELAX= 
##$RELAX= 
$$ Bruker specific parameters
$$ --------------------------
##$DU= <C:\u>
##$EXPNO= 9870
##$NAME= <ADRS>
##$PROCNO= 1
##$TYPE= <nmr>
##$USER= <dgb>
##$AMP= (0..31)
100 100 100 100 100 100 100 100 100 100 100 100 100 100 100 100 100 100 
100 100 100 100 100 100 100 100 100 100 100 100 100 100 
##$AQSEQ= 0
##$AQ_mod= 3
##$AUNM= <au_zg>
##$AUTOPOS= <8 >
##$BF1= 250.13
##$BF2= 250.13
##$BF3= 250.13
##$BF4= 250.13
##$BF5= 500.13
##$BF6= 500.13
##$BF7= 500.13
##$BF8= 500.13
##$BYTORDA= 1
##$CFDGTYP= 0
##$CFRGTYP= 5
##$CHEMSTR= <none>
##$CNST= (0..31)
1 1 145 1 1 1 1 1 1 1 1 1 1 1 1 1 1 1 1 1 1 1 1 1 1 1 1 1 1 1 1 1 
##$CPDPRG= <>
##$CPDPRG1= <>
##$CPDPRG2= <>
##$CPDPRG3= <>
##$CPDPRG4= <mlev>
##$CPDPRG5= <mlev>
##$CPDPRG6= <mlev>
##$CPDPRG7= <mlev>
##$CPDPRG8= <mlev>
##$CPDPRGB= <>
##$CPDPRGT= <>
##$D= (0..31)
0 1 0 0 0 0 0 0 0 0.06 0 0 0 0 0 0 0.0002 0 0 0 0 0 0 0 0 0 0 0 0 0 0 
0 
##$DATE= 1127464695
##$DBL= (0..7)
120 120 120 120 120 120 120 120 
##$DBP= (0..7)
150 150 150 150 150 150 150 150 
##$DBP07= 0
##$DBPNAM0= <>
##$DBPNAM1= <>
$$ [...]
##$SUBNAM7= <"">
##$SUBNAM8= <"">
##$SUBNAM9= <"">
##$SW= 20.6930455092707
##$SWIBOX= (0..15)
0 0 3 0 0 0 0 0 0 0 0 0 0 0 0 0 
##$SW_h= 5175.983436853
##$TD= 65536
##$TD0= 1
##$TE= 294.16
##$TE2= 300
##$TE3= 300
##$TEG= 300
##$TL= (0..7)
0 120 120 120 120 120 120 120 
##$TP= (0..7)
150 150 150 150 150 150 150 150 
##$TP07= 0
##$TPNAME0= <>
##$TPNAME1= <>
##$TPNAME2= <>
##$TPNAME3= <>
##$TPNAME4= <>
##$TPNAME5= <>
##$TPNAME6= <>
##$TPNAME7= <>
##$TPOAL= (0..7)
0.5 0.5 0.5 0.5 0.5 0.5 0.5 0.5 
##$TPOFFS= (0..7)
0 0 0 0 0 0 0 0 
##$TUNHIN= 0
##$TUNHOUT= 0
##$TUNXOUT= 0
##$USERA1= <user>
##$USERA2= <user>
##$USERA3= <user>
##$USERA4= <user>
##$USERA5= <user>
##$V9= 5
##$VALIST= <valist>
##$VCLIST= <CCCCCCCCCCCCCCC>
##$VD= 0
##$VDLIST= <DDDDDDDDDDDDDDD>
##$VPLIST= <PPPPPPPPPPPPPPP>
##$VTLIST= <TTTTTTTTTTTTTTT>
##$WBST= 1024
##$WBSW= 4
##$XGAIN= (0..3)
0 0 0 0 
##$XL= 0
##$YL= 0
##$YMAX_a= 468376
##$YMIN_a= -552704
##$ZGOPTNS= <>
##$ZL1= 120
##$ZL2= 120
##$ZL3= 120
##$ZL4= 120
##$ABSF1= 16.522
##$ABSF2= -4.171173
##$ABSG= 5
##$ABSL= 3
##$ALPHA= 0
##$AQORDER= 0
##$ASSFAC= 0
##$ASSFACI= 0
##$ASSFACX= 0
##$ASSWID= 0
##$AUNMP= <proc_1d>
##$AZFE= 0.1
##$AZFW= 0.1
##$BCFW= 0
##$BC_mod= 0
##$BYTORDP= 0
##$COROFFS= 0
##$CY= 12.5
##$DATMOD= 1
##$DC= 0
##$DFILT= <>
##$DTYPP= 0
##$F1P= 14.0000005364418
##$F2P= -0.99999901652339
##$FCOR= 0.5
##$FTSIZE= 32768
##$FT_mod= 6
##$GAMMA= 0
##$GB= 0
##$INTBC= 1
##$INTSCL= 1
##$ISEN= 128
##$LB= 0.3
##$LEV0= 0
##$LPBIN= 0
##$MAXI= 10000
##$MC2= 0
##$MEAN= 0
##$ME_mod= 0
##$MI= 0
##$NCOEF= 0
##$NC_proc= -2
##$NLEV= 6
##$NOISF1= 0
##$NOISF2= 0
##$NSP= 0
##$NTH_PI= 0
##$NZP= 0
##$OFFSET= 16.522
##$PC= 1
##$PHC0= 132.1767
##$PHC1= 4.204509
##$PH_mod= 1
##$PKNL= yes
##$PPARMOD= 0
##$PSCAL= 4
##$PSIGN= 0
##$REVERSE= no
##$SF= 250.13
##$SI= 32768
##$SIGF1= 0
##$SIGF2= 0
##$SINO= 400
##$SIOLD= 32768
##$SREGLST= <1H.CDCl3>
##$SSB= 0
##$STSI= 32768
##$STSR= 0
##$SW_p= 5175.98343685301
##$SYMM= 0
##$S_DEV= 0
##$TDeff= 65536
##$TDoff= 0
##$TI= <Analysis number 999999
Compound Code 99
Book Reference 9
Project Code 9>
##$TILT= no
##$TM1= 0
##$TM2= 0
##$TOPLEV= 0
##$USERP1= <user>
##$USERP2= <user>
##$USERP3= <user>
##$USERP4= <user>
##$USERP5= <user>
##$WDW= 1
##$XDIM= 32768
##$YMAX_p= 333787756
##$YMIN_p= -151748
$$ End of Bruker specific parameters
$$ ---------------------------------
##NTUPLES= NMR SPECTRUM
##VAR_NAME=  FREQUENCY,     SPECTRUM/REAL,   SPECTRUM/IMAG
##SYMBOL=    X,             R,               I
##VAR_TYPE=  INDEPENDENT,   DEPENDENT,       DEPENDENT
##VAR_FORM=  AFFN,          ASDF,            ASDF
##VAR_DIM=   32768,         32768,           32768
##UNITS=     HZ,            ARBITRARY UNITS, ARBITRARY UNITS
##FACTOR=    0.157963299565203, 1,           1
##FIRST=     4132.6476996994, 0,             0
##LAST=      -1043.33573715361, 0,           0
##MIN=       -1043.33573715361, -151748,     0
##MAX=       4132.6476996994, 333787756,     0
$$ Real data points
##PAGE= N=1
##DATA TABLE= (X++(R..R)), XYDATA
$$ [...]
##PAGE= N=2
##DATA TABLE= (X++(I..I)), XYDATA
19008 -3151417 -3113294 -3076670 -3042572 -3006172 -2968922 -2935186 -2902442 -2867484 -2830540 -2792716 -2758609
18997 -2758609 -2727729 -2694241 -2661294 -2634448 -2604705 -2569159 -2530884 -2493393 -2452099 -2412071 -2373058
18986 -2373058 -2338774 -2308740 -2281449 -2253154 -2223535 -2193954 -2159668 -2120149 -2086003 -2056292 -2024100
18975 -2024100 -1991295 -1959179 -1926250 -1892828 -1862055 -1833402 -1804415 -1772394 -1736256 -1701795 -1672604
18964 -1672604 -1646833 -1625574 -1609190 -1587094 -1571169 -1570148 -1575149 -1570915 -1559007 -1537155 -1509228 -1481663
18952 -1481663 -1454827 -1426964 -1400691 -1383011 -1375341 -1371132 -1369020 -1358962 -1338405 -1313928 -1289252 -1268249
18940 -1268249 -1255122 -1245508 -1233545 -1217335 -1195181 -1168530 -1140151 -1114883 -1093158 -1070506 -1044453
18929 -1044453 -1014681 -984142 -952661 -921742 -889635 -854956 -822820 -796061 -767750 -739111 -715897
18918 -715897 -702656 -689000 -670974 -653190 -642315 -644144 -654338 -660069 -657612 -648014 -631650 -606884
18906 -606884 -581964 -566809 -565446 -582287 -611682 -635113 -643529 -637757 -616064 -586399 -563615 -553774
18894 -553774 -556653 -559013 -555509 -545328 -527750 -503892 -476861 -450468 -426415 -401645 -379296 -357280
18882 -357280 -334812 -313000 -291383 -267448 -244923 -222177 -200444 -178066 -158081 -142003 -126809
18871 -126809 -112713 -97200 -78211 -55563 -34748 -10687 13748 40876 69402 98589 121712
18860 121712 131011 124839 110727 89682 72674 68516 77499 95699 119891 142791 149273 143023 133299
18847 133299 127048 132335 150452 170461 189425 202709 216964 232073 245928 261640 281134 300210
18835 300210 320272 341097 359526 379469 399667 416007 430384 443819 458296 476230 494476
18824 494476 512354 531930 550716 569176 586604 602367 620497 641416 657327 671857 686322
18813 686322 698903 709702 721814 737380 756033 772914 790305 803782 814034 815982 804720 788555
18801 788555 773513 767802 772905 780863 793190 809565 830664 848425 864164 875534 885678 897470
18789 897470 909535 925211 944205 963933 985163 1002769 1018164 1035523 1054833 1075112 1092377
18778 1092377 1110280 1130954 1148622 1166016 1183134 1204501 1223672 1244869 1266900 1288044 1307327
18767 1307327 1322231 1327600 1331248 1331342 1329244 1334007 1351223 1370948 1394842 1416278 1431612 1428277 1419855
18754 1419855 1416194 1415723 1425286 1444173 1467478 1487616 1500733 1509710 1518553 1528105 1541959 1562717 1584623
18741 1584623 1606488 1628150 1645848 1665849 1682911 1701199 1721552 1740019 1761601 1783463 1806349
18730 1806349 1828954 1844542 1854229 1861671 1869840 1883638 1903754 1931086 1959776 1984483 1994240 1985695
18718 1985695 1977201 1975650 1981248 1999829 2025129 2051621 2073329 2088410 2101355 2115877 2131903 2152465
18706 2152465 2174190 2191712 2210053 2228633 2249668 2272090 2296173 2322107 2344461 2366889 2390829
18695 2390829 2421945 2456504 2487135 2514676 2541229 2569580 2602050 2632139 2655845 2677918 2705062
18684 2705062 2734842 2765021 2790024 2813593 2842669 2878787 2912973 2940771 2960284 2948573 2901474
18673 2901474 2841368 2784629 2738631 2691350 2645798 2616450 2608522 2606674 2603257 2608156 2621928 2639387
18661 2639387 2656055 2661166 2647285 2639702 2649185 2676323 2722925 2778452 2833567 2882080 2923046 2962741
18649 2962741 2998730 3033021 3071977 3115799 3164104 3212298 3249846 3276390 3301607 3334953 3376754
18638 3376754 3422332 3475190 3533124 3580990 3615962 3649663 3686493 3739036 3786569 3811480 3808955
18627 3808955 3762865 3661408 3507949 3351929 3224544 3143565 3103528 3080080 3063622 3049083
18617 3049083 3040745 3047205 3069546 3091072 3110089 3148054 3200202 3258462 3312002 3355635 3380436 3387836
18605 3387836 3387817 3393422 3416842 3460461 3518689 3584611 3648838 3709183 3768838 3825949 3886631 3956026
18593 3956026 4028950 4102981 4169641 4204797 4212265 4220305 4242935 4277815 4313280 4339904 4371867 4391974
18581 4391974 4371481 4338075 4325470 4330398 4344914 4345888 4339657 4337837 4341335 4346456 4364419 4392150 4419138
18568 4419138 4444189 4465836 4485821 4513143 4548900 4598737 4661819 4731121 4802378 4867631 4930068
18557 4930068 4990669 5047362 5101923 5156573 5215676 5275535 5335469 5392979 5452328 5514430 5581067
18546 5581067 5647078 5711678 5775199 5838768 5900446 5959910 6018888 6076310 6135558 6197946 6263457
18535 6263457 6334522 6410351 6482096 6550536 6625520 6706185 6785760 6851306 6897506 6943433 7001321
18524 7001321 7066354 7138300 7224048 7322039 7419624 7511278 7604346 7700884 7806732 7920067 8035998
18513 8035998 8153896 8267149 8351134 8412782 8480216 8551920 8609769 8652524 8711084 8780720 8861187
18502 8861187 8978838 9119394 9275294 9439247 9593476 9735624 9876611 10026477 10189825
18493 10189825 10378511 10575143 10773107 10973226 11178455 11381439 11578402 11779887 11985948
18484 11985948 12215648 12478545 12763563 13060790 13368855 13652742 13907131 14142084 14366601
18475 14366601 14586024 14845210 15212492 15694236 16314865 17086000 17987723 19007676 20101800
18466 20101800 21137870 21705504 21252039 19434202 16416830 13769478 12115551 11667292
18458 11667292 12494341 14056453 15908817 17754062 18975121 18731778 17332065 15471465
18450 15471465 12619098 8652187 5556729 3651022 2901625 3607173 5188731 7010052
18442 7010052 8787283 10309821 11127110 10702682 9596763 8685572 8172715 8357372 9202249
18433 9202249 10380992 11638184 12905054 14193591 15476109 16758295 18095130 19412901
18425 19412901 20509743 21050672 21109065 21261286 21561933 22028071 23037407 24764131 27149364
18416 27149364 30243768 33700614 36193525 35574604 31882798 28175804 25548223 23130077
18408 23130077 17876550 7949648 -3537216 -13186843 -19054875 -20134781 -17407867 -13140036
18400 -13140036 -9164293 -6911984 -7000992 -7940682 -8645743 -9318200 -10420771 -12326372 -14010878
18391 -14010878 -14943043 -14896120 -13617023 -11647664 -9556800 -7586190 -5774706 -4105797
18383 -4105797 -2535794 -1033072 413213 1834837 3304707 4882409 6593024 8449105
18375 8449105 10445137 12558377 14687367 16390276 16489757 14375695 11733624 9906455
18367 9906455 9518480 11180578 14403401 17770405 19088404 16606976 10649354 2742320
18359 2742320 -4167232 -9213116 -13925185 -18893402 -22472771 -24550059 -24865987 -23079799
18351 -23079799 -20118441 -16901773 -13764659 -10725741 -7787276 -5130887 -3192356 -2264057
18343 -2264057 -2979286 -5801211 -8686989 -10515109 -10977083 -9679929 -7118355 -4001168
18335 -4001168 -765280 1906691 1888517 -3344004 -11170815 -17880607 -22737564 -24279070
18327 -24279070 -22800514 -19939274 -16841953 -14302549 -13629436 -15847687 -19076630 -21757755
18319 -21757755 -23460102 -23466424 -22181702 -20454147 -18739910 -17148653 -15680097 -14312073
18311 -14312073 -13022493 -11784036 -10534721 -9270695 -8232137 -8118352 -9317824 -10728058
18303 -10728058 -11788764 -12254864 -11814574 -10749564 -9432765 -8030870 -6578985 -5066381
18295 -5066381 -3454088 -1717944 -15936 1025573 788058 -506427 -3152753 -6920171
18287 -6920171 -11764882 -16809878 -20487793 -22645850 -23507688 -23517657 -23087625 -22463903 -21725346
18278 -21725346 -20784293 -19701428 -18617850 -17609091 -16689492 -15847643 -15062332 -14317411 -13601752
18269 -13601752 -12903867 -12242142 -11749349 -11738891 -12295473 -12918765 -13383666 -13566665 -13358955
18260 -13358955 -12901346 -12363685 -11814272 -11269763 -10729323 -10172957 -9589276 -9003578 -8581468
18251 -8581468 -8696074 -9335856 -9929674 -10347287 -10406514 -10013980 -9348143 -8613549 -8123186 -8517709
18241 -8517709 -9910192 -11312518 -12438180 -13043096 -12950212 -12446789 -11848409 -11393575 -11371526
18232 -11371526 -11782997 -12193911 -12495089 -12573501 -12385674 -12067624 -11734422 -11429272 -11151555
18223 -11151555 -10904957 -10683173 -10475546 -10290003 -10130963 -9999486 -9881758 -9771703 -9663873
18214 -9663873 -9558594 -9452420 -9347992 -9244611 -9148501 -9058777 -8972520 -8892371 -8809127 -8721949
18204 -8721949 -8631722 -8545644 -8462067 -8378812 -8297004 -8221678 -8149221 -8079450 -8009392 -7937639 -7869116
18193 -7869116 -7804241 -7739397 -7674782 -7610070 -7549329 -7489924 -7428376 -7368818 -7310328 -7252578 -7197389
18182 -7197389 -7141829 -7089755 -7044401 -7000466 -6954990 -6909243 -6859339 -6805199 -6751197 -6701808 -6663558
18171 -6663558 -6628995 -6601800 -6575142 -6544741 -6510167 -6470695 -6429752 -6387255 -6346943 -6306731 -6266159
18160 -6266159 -6225896 -6182352 -6139825 -6099745 -6069577 -6051024 -6035415 -6019985 -5995033 -5960047 -5918434
18149 -5918434 -5875960 -5831130 -5789086 -5747941 -5708369 -5673455 -5647322 -5627869 -5605547 -5578089 -5544437
18138 -5544437 -5506264 -5465835 -5427044 -5390291 -5354117 -5315720 -5277336 -5235768 -5189641 -5143463 -5097567
18127 -5097567 -5052090 -5005326 -4960456 -4917548 -4871014 -4816936 -4756330 -4689602 -4611547 -4525661 -4432544
18116 -4432544 -4332266 -4221860 -4094498 -3944955 -3757869 -3519586 -3218062 -2913841 -2967330 -3929802
18106 -3929802 -5136376 -6079406 -6805393 -7007806 -6836911 -6576624 -6343803 -6151506 -5998227
18097 -5998227 -5872982 -5766278 -5673006 -5590138 -5513955 -5442320 -5378863 -5324854 -5274496 -5223611 -5176855
18086 -5176855 -5137588 -5102257 -5067690 -5033059 -5000238 -4965403 -4930748 -4897852 -4866141 -4837227 -4811903
18075 -4811903 -4788740 -4766787 -4741414 -4714842 -4687730 -4662809 -4638673 -4612328 -4590777 -4573616 -4555160
18064 -4555160 -4535704 -4516663 -4497715 -4479230 -4464389 -4449219 -4433182 -4421139 -4405169 -4389442 -4372553
18053 -4372553 -4354716 -4337434 -4321771 -4307896 -4291401 -4275785 -4261451 -4244831 -4231072 -4216895 -4204435
18042 -4204435 -4190710 -4176572 -4160861 -4143174 -4124699 -4110881 -4097195 -4079764 -4064918 -4052817 -4041246
18031 -4041246 -4029539 -4016079 -4005628 -3997737 -3985375 -3972323 -3959869 -3946998 -3932057 -3918061 -3904331
18020 -3904331 -3888318 -3874202 -3862164 -3849472 -3838110 -3824951 -3812181 -3798975 -3784394 -3769192 -3754711
18009 -3754711 -3740742 -3728819 -3718097 -3705737 -3694730 -3684412 -3674680 -3665117 -3656551 -3649984 -3641420 -3629374
17997 -3629374 -3619621 -3608975 -3597732 -3588577 -3580531 -3571322 -3561649 -3551459 -3542276 -3531689 -3519857 -3508985
17985 -3508985 -3501748 -3490629 -3476710 -3465580 -3456504 -3446933 -3435449 -3423688 -3413645 -3402651 -3390873 -3376895
17973 -3376895 -3362276 -3349903 -3339667 -3326382 -3312085 -3301985 -3291910 -3282927 -3274359 -3266409 -3251582 -3238536
17961 -3238536 -3227411 -3215299 -3203839 -3191165 -3179928 -3169430 -3160799 -3150265 -3135861 -3122860 -3107631
17950 -3107631 -3090361 -3072511 -3058183 -3055045 -3064767 -3075724 -3082594 -3082986 -3075771 -3064458 -3058821 -3060568 -3056787
17937 -3056787 -3053042 -3058085 -3070866 -3085096 -3102720 -3111038 -3106674 -3093297 -3072898 -3053420 -3033440 -3014933
17925 -3014933 -2997707 -2981929 -2968446 -2952709 -2938534 -2922028 -2904035 -2891701 -2883871 -2879178 -2871538 -2862341
17913 -2862341 -2847024 -2829043 -2816215 -2817289 -2821650 -2826405 -2828524 -2822620 -2813599 -2800479 -2784231 -2777071 -2783268
17900 -2783268 -2804139 -2840423 -2886031 -2924117 -2950429 -2961337 -2959371 -2958559 -2960753 -2968955 -2991266 -3014096
17888 -3014096 -3025957 -3022629 -3001359 -2971715 -2943864 -2917918 -2902100 -2902080 -2914237 -2928814 -2941854 -2949851
17876 -2949851 -2951256 -2948453 -2941466 -2932339 -2915911 -2895286 -2872997 -2855782 -2839841 -2829441 -2819529 -2807844
17864 -2807844 -2795796 -2782547 -2767003 -2750355 -2735469 -2722216 -2710552 -2698370 -2687683 -2680466 -2674751 -2672341
17852 -2672341 -2671142 -2668593 -2668172 -2677034 -2687997 -2693368 -2691451 -2680075 -2664743 -2648847 -2637754 -2633709 -2632190
17839 -2632190 -2627982 -2616954 -2611608 -2624562 -2642878 -2667245 -2693863 -2713669 -2718244 -2713346 -2701537 -2686984
17827 -2686984 -2672819 -2661556 -2655936 -2653417 -2652092 -2649472 -2640090 -2628524 -2617375 -2608234 -2596180 -2585327
17815 -2585327 -2575611 -2565084 -2556252 -2548013 -2537642 -2529768 -2519922 -2513410 -2508355 -2499718 -2488272 -2477711 -2469976
17802 -2469976 -2461532 -2451750 -2441631 -2430893 -2419163 -2408696 -2400289 -2399065 -2400565 -2401323 -2401569 -2399100 -2388928
17789 -2388928 -2378080 -2372902 -2377789 -2393840 -2416728 -2441533 -2460840 -2466519 -2461994 -2457708 -2453370 -2449731 -2448305
17776 -2448305 -2450751 -2450345 -2446712 -2441041 -2431634 -2423085 -2416181 -2410240 -2403226 -2398045 -2389012 -2378877 -2369880 -2361176
17762 -2361176 -2355653 -2348405 -2341606 -2336929 -2330772 -2322420 -2314374 -2307274 -2299888 -2293579 -2285060 -2275300 -2266293 -2258666
17748 -2258666 -2252343 -2252351 -2253865 -2253228 -2253576 -2252180 -2244916 -2233566 -2227380 -2231069 -2239521 -2250959 -2261672 -2267538
17734 -2267538 -2266723 -2258803 -2251893 -2248745 -2250422 -2250949 -2251296 -2249394 -2245243 -2237989 -2231666 -2225200 -2217167 -2210974 -2205244
17719 -2205244 -2199475 -2194206 -2190790 -2185779 -2181518 -2177941 -2173437 -2170279 -2163270 -2157502 -2154013 -2151524 -2149263 -2145366
17705 -2145366 -2141897 -2137390 -2133756 -2128647 -2124768 -2122114 -2119719 -2116508 -2112466 -2108786 -2106201 -2104573 -2103699 -2100698
17691 -2100698 -2096879 -2091576 -2089171 -2085272 -2081662 -2077700 -2071844 -2066517 -2064784 -2063506 -2059148 -2052263 -2046630 -2042109
17677 -2042109 -2038010 -2036728 -2033457 -2032261 -2029676 -2026168 -2023431 -2020460 -2016369 -2013896 -2012765 -2009469 -2004931 -2001012
17663 -2001012 -2000560 -1995491 -1991242 -1990103 -1989088 -1986345 -1979413 -1973751 -1970262 -1966873 -1963664 -1961192 -1957686 -1954890
17649 -1954890 -1952294 -1949860 -1948879 -1946596 -1944103 -1941205 -1937241 -1934683 -1933400 -1931614 -1929090 -1926418 -1923863 -1920143
17635 -1920143 -1917611 -1913885 -1912942 -1911289 -1906627 -1904142 -1901192 -1896304 -1892686 -1889671 -1888080 -1885386 -1884084 -1884700
17621 -1884700 -1882626 -1879126 -1874949 -1872468 -1869805 -1869474 -1868359 -1865682 -1863427 -1861215 -1858902 -1857799 -1852211 -1848298
17607 -1848298 -1845676 -1843772 -1839007 -1836159 -1832658 -1829650 -1826916 -1825099 -1822224 -1818975 -1815561 -1813144 -1811419 -1808155
17593 -1808155 -1805488 -1804915 -1805914 -1801484 -1796223 -1791686 -1789539 -1787296 -1785494 -1783535 -1782311 -1781354 -1779804 -1780175 -1779306
17578 -1779306 -1776723 -1775399 -1775266 -1773604 -1769102 -1764452 -1760269 -1755183 -1753297 -1751282 -1748648 -1745878 -1740811 -1739391
17564 -1739391 -1739682 -1735259 -1731240 -1730644 -1728812 -1726708 -1723025 -1718177 -1715668 -1716943 -1716988 -1711686 -1708504 -1707009 -1703350
17549 -1703350 -1700746 -1698619 -1696357 -1693707 -1693170 -1690813 -1687491 -1684162 -1685214 -1683648 -1681245 -1678580 -1676874 -1674630
17535 -1674630 -1670507 -1669566 -1669087 -1667421 -1665068 -1663629 -1663629 -1660337 -1659938 -1657860 -1653361 -1652393 -1649607 -1647496 -1646613 -1645411
17519 -1645411 -1642654 -1637950 -1632398 -1631442 -1629996 -1627797 -1628384 -1626866 -1621349 -1618587 -1618463 -1616283 -1613474 -1611871 -1606999
17504 -1606999 -1604001 -1602744 -1601775 -1600346 -1597478 -1596607 -1596308 -1594089 -1590126 -1587009 -1581882 -1577843 -1577201 -1575074 -1570936
17489 -1570936 -1569502 -1569708 -1567740 -1565003 -1561492 -1558792 -1557222 -1555104 -1552080 -1549060 -1546035 -1543086 -1537361 -1532051
17475 -1532051 -1526801 -1524825 -1522282 -1521988 -1520535 -1519823 -1518987 -1517338 -1515505 -1511872 -1509245 -1507908 -1505790 -1504722 -1499200
17460 -1499200 -1493070 -1486884 -1480105 -1472121 -1463472 -1454307 -1444801 -1433359 -1414846 -1397281 -1388117 -1422072 -1490896
17447 -1490896 -1545433 -1588938 -1608960 -1599927 -1582148 -1568049 -1555099 -1547958 -1545646 -1544696 -1540779 -1536230 -1533237
17434 -1533237 -1527058 -1522216 -1517652 -1513418 -1509582 -1504706 -1501946 -1499083 -1496308 -1491201 -1488312 -1485662 -1481983 -1478496
17420 -1478496 -1476573 -1476240 -1474467 -1473640 -1470076 -1469139 -1467866 -1465029 -1459860 -1456006 -1456218 -1457391 -1457793 -1458052 -1454870
17405 -1454870 -1452721 -1448880 -1445379 -1445509 -1442115 -1440099 -1438416 -1435351 -1435085 -1432691 -1429856 -1425920 -1423793 -1421095
17391 -1421095 -1418609 -1416769 -1415021 -1412462 -1410816 -1408943 -1406459 -1406193 -1405879 -1404247 -1401646 -1398297 -1395620 -1393610
17377 -1393610 -1392258 -1389841 -1386564 -1385374 -1382189 -1381224 -1378063 -1376998 -1375907 -1375851 -1372640 -1370685 -1369784 -1370380 -1367132
17362 -1367132 -1365173 -1364306 -1362245 -1359290 -1356250 -1353588 -1353007 -1352343 -1349502 -1347582 -1346428 -1342136 -1342130 -1342613 -1339641 -1334635
17346 -1334635 -1330584 -1327502 -1327344 -1326538 -1323683 -1318629 -1315605 -1316450 -1314105 -1310290 -1307290 -1305023 -1303281 -1301299 -1296966
17331 -1296966 -1290112 -1283170 -1279873 -1276378 -1271074 -1265292 -1259704 -1255001 -1255597 -1270983 -1298162 -1320801 -1334916
17318 -1334916 -1339235 -1334812 -1329802 -1323866 -1317858 -1310435 -1305850 -1304603 -1302019 -1297789 -1293655 -1288941 -1287090 -1284110
17304 -1284110 -1281679 -1278175 -1276931 -1273209 -1268037 -1266053 -1262614 -1259590 -1257659 -1257102 -1254758 -1254497 -1253412 -1251540
17290 -1251540 -1249155 -1244990 -1240224 -1237294 -1237674 -1236488 -1233410 -1232013 -1229925 -1224694 -1223377 -1221578 -1220752 -1219696
17276 -1219696 -1216627 -1213319 -1211151 -1207981 -1202462 -1196694 -1194531 -1192095 -1189586 -1185299 -1179180 -1176907 -1171986 -1165682
17262 -1165682 -1160502 -1157154 -1153849 -1147311 -1142681 -1136406 -1129998 -1124249 -1114613 -1103765 -1093462 -1081281 -1070184
17249 -1070184 -1057152 -1037481 -1013775 -994083 -1001247 -1056912 -1131821 -1195198 -1240286 -1256632 -1248142 -1229970
17237 -1229970 -1209045 -1189497 -1171471 -1155797 -1141838 -1124968 -1109199 -1093794 -1076511 -1060275 -1043195
17226 -1043195 -1023324 -999182 -978471 -948336 -914617 -878073 -832722 -777509 -712209 -629257 -526878
17215 -526878 -452855 -539909 -882976 -1298059 -1640289 -1874880 -1937249 -1881249 -1796008 -1720009 -1657749
17204 -1657749 -1605538 -1562441 -1526796 -1497144 -1471523 -1449761 -1431469 -1414971 -1401357 -1389002 -1375958
17193 -1375958 -1365917 -1357292 -1350687 -1343921 -1338532 -1332744 -1324435 -1319424 -1314434 -1305737 -1298348 -1296080 -1291460 -1288201
17179 -1288201 -1281802 -1275745 -1271900 -1268589 -1262654 -1257063 -1255598 -1254365 -1254459 -1252987 -1248048 -1243323 -1238794 -1234840
17165 -1234840 -1229358 -1225564 -1223596 -1220725 -1218813 -1219483 -1217554 -1214464 -1213826 -1212985 -1211193 -1206968 -1204000 -1201087 -1197343
17150 -1197343 -1194674 -1194142 -1193196 -1190184 -1191109 -1188469 -1184461 -1183126 -1181073 -1178025 -1175679 -1176070 -1175953 -1177862 -1175354
17135 -1175354 -1172457 -1170376 -1168604 -1167774 -1164805 -1161794 -1159993 -1158039 -1156335 -1155510 -1156188 -1156243 -1156270 -1151612 -1148378 -1149659
17119 -1149659 -1149235 -1146803 -1144733 -1142662 -1137912 -1134184 -1133049 -1132223 -1130886 -1130896 -1129859 -1129669 -1129917 -1131022 -1130487 -1127463
17103 -1127463 -1125417 -1123285 -1122258 -1122306 -1119767 -1119172 -1118255 -1117199 -1112477 -1109841 -1107646 -1106268 -1105846 -1103850 -1103748
17088 -1103748 -1103231 -1102326 -1101763 -1100032 -1097590 -1097162 -1097843 -1100064 -1096915 -1093958 -1093964 -1095496 -1091114 -1086797 -1084111 -1084728
17072 -1084728 -1086097 -1087035 -1083809 -1081765 -1078492 -1077946 -1077513 -1076388 -1075997 -1073484 -1070122 -1069828 -1070283 -1068721 -1069357 -1069959
17056 -1069959 -1071183 -1069022 -1067694 -1066196 -1067317 -1065358 -1062885 -1059149 -1056839 -1054766 -1052211 -1051702 -1050092 -1047377
17042 -1047377 -1046565 -1043776 -1039978 -1036133 -1034686 -1036580 -1038991 -1042560 -1048291 -1050171 -1049594 -1046657 -1045175 -1045385 -1045668
17027 -1045668 -1046365 -1045479 -1040515 -1037689 -1035127 -1031999 -1031293 -1029369 -1026617 -1026768 -1026568 -1029914 -1037034 -1041276 -1042706
17012 -1042706 -1040879 -1039510 -1039512 -1037121 -1034753 -1032940 -1031867 -1030411 -1028511 -1027240 -1025231 -1022151 -1021175 -1020462 -1019244
16997 -1019244 -1018368 -1016607 -1015798 -1014243 -1012719 -1013053 -1012258 -1013008 -1011540 -1007648 -1007133 -1007290 -1006809 -1005791 -1005919 -1003797
16981 -1003797 -999138 -996483 -997487 -998009 -996630 -995583 -992062 -990220 -988302 -987286 -986080 -985191 -985244 -986840 -987552
16966 -987552 -989530 -991028 -988090 -985975 -986352 -987953 -987126 -984522 -983606 -983690 -980704 -979704 -981087 -980070 -981766
16951 -981766 -983642 -982290 -980044 -977031 -973008 -969999 -969483 -969834 -972544 -970784 -968036 -967178 -967394 -968867 -967207
16936 -967207 -965745 -963637 -962266 -961554 -961682 -960540 -959627 -959002 -957233 -956906 -954706 -955812 -955503 -955619 -957400 -956331
16920 -956331 -954522 -952568 -951419 -949971 -947329 -946664 -947400 -948309 -948496 -946582 -944530 -943461 -939060 -935496 -936592
16905 -936592 -941047 -942274 -939013 -938068 -935329 -931794 -930809 -932320 -932560 -931626 -929251 -926722 -925750 -925757 -925744 -924266 -922624
16888 -922624 -921181 -923653 -925271 -922750 -919646 -917509 -916148 -913155 -913881 -913470 -913271 -916134 -918294 -917762 -918198
16873 -918198 -918369 -918305 -915902 -913890 -915244 -914656 -914906 -912044 -910105 -908260 -906911 -904755 -903851 -903517 -904660 -904160
16857 -904160 -904599 -903906 -903089 -903051 -900379 -896674 -893211 -890765 -890066 -890833 -892192 -890912 -887017 -886031 -887491 -886443
16841 -886443 -885690 -884575 -884449 -887222 -886306 -884294 -884728 -886277 -886465 -887033 -887518 -889484 -890717 -892028 -892934 -891231
16825 -891231 -886649 -882101 -881832 -882609 -884692 -885139 -886781 -885518 -885987 -884207 -883556 -883583 -882530 -880753 -879076 -875254
16809 -875254 -874336 -874274 -870358 -868996 -869635 -869018 -869256 -866612 -864339 -864483 -863830 -861895 -859252 -859409 -861434 -861114 -860486
16792 -860486 -859774 -858006 -857439 -858614 -858246 -857571 -857158 -856758 -857528 -858869 -858603 -857505 -855255 -854842 -851602 -850379
16776 -850379 -851653 -850777 -850498 -850771 -852022 -850944 -847165 -845240 -844200 -844276 -845699 -843974 -842302 -840756 -841644 -841670
16760 -841670 -841182 -839495 -838136 -838041 -837598 -837800 -837207 -837545 -836665 -837076 -836468 -835043 -832574 -831721 -830533 -830164 -827330
16743 -827330 -825848 -826503 -827442 -825531 -825442 -826548 -825513 -822953 -821519 -820378 -820292 -822077 -821837 -821911 -821533 -820315 -819190
16726 -819190 -817524 -815818 -814747 -815131 -814957 -813941 -811178 -808392 -808331 -809440 -808240 -806257 -806042 -804672 -806325
16711 -806325 -806504 -804061 -802355 -802692 -800803 -802059 -801110 -801309 -802138 -804622 -803913 -800429 -797147 -796316 -796259 -795233
16695 -795233 -794694 -793337 -792630 -793746 -792197 -789889 -790443 -787926 -788471 -789181 -790630 -791117 -790478 -787936 -787251 -784881
16679 -784881 -783879 -784038 -784106 -784496 -781331 -781266 -779064 -779408 -779766 -777235 -775857 -774070 -774524 -773371 -771108 -772160
16663 -772160 -771933 -769891 -770715 -771359 -772440 -774253 -773742 -771206 -770981 -771526 -773942 -778334 -777816 -773997 -775887 -777159
16647 -777159 -775301 -775406 -776402 -775437 -773718 -771642 -770309 -766268 -763281 -764243 -766298 -767758 -770894 -770046 -768839
16632 -768839 -768811 -767125 -765388 -763622 -764407 -763142 -762259 -763594 -762790 -759715 -757382 -760124 -761705 -758612 -757002
16617 -757002 -756507 -756807 -756826 -753987 -755432 -754759 -752118 -752443 -754045 -751238 -749071 -749624 -750473 -749203 -748013 -746571
16601 -746571 -745298 -746321 -746327 -745385 -745333 -745106 -743602 -740531 -737179 -735433 -738257 -738529 -736188 -736071 -735966 -736133 -735676
16584 -735676 -738674 -739963 -740628 -740923 -738686 -736565 -734214 -734041 -734511 -733741 -732289 -728630 -726667 -726716 -725584 -725970
16568 -725970 -722741 -721762 -723584 -724993 -726168 -724561 -723843 -725022 -725286 -723714 -725106 -725933 -725853 -722192 -719431 -721368
16552 -721368 -719557 -718974 -719485 -718881 -719891 -719376 -717475 -715642 -714297 -714934 -714552 -713720 -712006 -711957 -712139 -713132 -712576
16535 -712576 -712650 -711871 -711482 -710789 -710451 -710005 -708514 -708807 -708167 -706413 -706482 -707356 -706394 -705692 -701773 -701365 -704605 -703756
16517 -703756 -701421 -699727 -699366 -699851 -699507 -698599 -697133 -696376 -696530 -694816 -694158 -693617 -693014 -693971 -695328 -696274 -695233
16500 -695233 -694397 -692707 -692724 -690300 -687856 -686882 -688115 -687218 -688024 -686480 -685547 -685274 -685826 -686974 -688203 -687022
16484 -687022 -685592 -683361 -680173 -680559 -682079 -680578 -679554 -679133 -679046 -677262 -676717 -674647 -675327 -675900 -674616 -676024
16468 -676024 -673536 -670111 -670413 -674812 -677466 -677995 -678770 -676004 -672739 -672604 -673208 -671368 -669869 -670159 -670379 -669932
16452 -669932 -669553 -668566 -669857 -669491 -668178 -669047 -667668 -666696 -665045 -663690 -664566 -663295 -662707 -661175 -663320 -663779
16436 -663779 -663925 -663762 -664695 -663550 -660721 -659462 -662153 -662376 -661045 -659675 -658524 -657191 -658449 -658241 -657500 -657605
16420 -657605 -655320 -652462 -651285 -651642 -652266 -651753 -650319 -650805 -652222 -651798 -651085 -649779 -649014 -649108 -649594 -649299 -647848
16403 -647848 -644821 -643265 -640341 -641439 -641077 -641364 -640400 -642265 -642944 -639939 -639658 -639916 -639108 -639117 -641092 -640450 -638147
16386 -638147 -637641 -635960 -636023 -634726 -633434 -633720 -634616 -635489 -635911 -633793 -632333 -630694 -630233 -632117 -634670 -634793
16370 -634793 -635884 -635676 -633691 -634804 -634767 -631090 -628738 -628108 -625046 -624585 -625093 -625078 -623569 -624553 -622756 -621770 -622637
16353 -622637 -623170 -621450 -618970 -616186 -617507 -620936 -621202 -618784 -618976 -619599 -619436 -617991 -615617 -614572 -613417
16338 -613417 -613375 -616655 -618800 -617743 -617503 -615778 -614965 -615316 -614276 -613332 -614179 -612502 -611339 -608179 -608625 -609694
16322 -609694 -611066 -612003 -610471 -611286 -607332 -604864 -606012 -603770 -602784 -600836 -601531 -602021 -601542 -600694 -602458 -603695
16306 -603695 -602606 -602454 -604021 -601763 -599979 -602911 -603452 -602029 -600460 -598280 -597222 -598017 -596872 -595450 -595123
16291 -595123 -595294 -593476 -592374 -591320 -590682 -590794 -591255 -594194 -594212 -591424 -591300 -591354 -593211 -592642 -588495 -587298 -587471
16274 -587471 -586503 -583185 -582214 -584808 -583700 -581411 -580418 -580297 -579720 -581845 -586494 -589271 -590724 -591640 -589980 -587178
16258 -587178 -584746 -584102 -585561 -583863 -582175 -584023 -583267 -582454 -580975 -577408 -575851 -576048 -576440 -576845 -577769 -575281
16242 -575281 -573895 -573506 -570312 -568529 -569438 -569720 -570083 -570226 -572535 -570509 -569987 -571698 -570939 -571229 -570368 -568506
16226 -568506 -565542 -565619 -567143 -566766 -567153 -569379 -570043 -570206 -569645 -568384 -568693 -568910 -567578 -569730 -569709 -567390 -566319
16209 -566319 -564140 -562511 -564422 -565468 -564234 -563165 -562805 -562553 -561122 -558387 -557112 -556581 -557255 -557604 -558947
16194 -558947 -560077 -556618 -552569 -552678 -553825 -555116 -555458 -555642 -554797 -553399 -552431 -555420 -557010 -556095 -553664 -551570
16178 -551570 -553234 -554831 -553633 -549918 -550596 -552105 -549190 -547285 -547345 -547295 -548009 -550090 -550186 -548018 -549121 -548750
16162 -548750 -547881 -547426 -544904 -542187 -541046 -539978 -540784 -541601 -539497 -540141 -541596 -540765 -541761 -542459 -540821 -538602
16146 -538602 -537280 -538135 -538677 -540976 -541168 -541362 -536587 -535101 -536097 -535387 -534214 -533999 -534592 -533330 -531954 -532896
16130 -532896 -533985 -533158 -534514 -534402 -532749 -533190 -533533 -532187 -531307 -530377 -529349 -528981 -530304 -530302 -527254 -526767 -525619
16113 -525619 -523765 -523023 -524034 -525533 -524482 -525919 -525811 -523134 -524559 -525026 -522986 -521398 -521346 -521537 -519532 -519050
16097 -519050 -518670 -517447 -516417 -517242 -519597 -521770 -520172 -517778 -514985 -514102 -513799 -510865 -511116 -510048 -508657
16082 -508657 -508618 -509420 -511537 -516298 -520508 -521034 -519263 -520029 -518810 -515892 -515997 -515202 -514460 -514084 -516135 -518437
16066 -518437 -518329 -515064 -511998 -510116 -509611 -511885 -512400 -513526 -512494 -509605 -507989 -506880 -506065 -506340 -507818
16051 -507818 -506456 -505113 -504717 -502716 -502846 -504410 -504202 -502332 -501744 -501236 -500298 -499333 -498606 -496679 -496365 -495478 -493524
16034 -493524 -490329 -488103 -490889 -493977 -493662 -491538 -487933 -485583 -487614 -491181 -494584 -498127 -499030 -498269 -497636
16019 -497636 -497548 -492957 -491108 -490820 -490689 -490882 -489966 -488395 -488045 -487891 -487571 -485677 -481491 -478931 -476124 -475732 -475501
16002 -475501 -473754 -471623 -470245 -468621 -471446 -475026 -479506 -484369 -489817 -494098 -498990 -500261 -498523 -494969
15988 -494969 -491048 -491927 -493941 -495874 -500873 -502170 -502471 -500876 -500092 -500081 -498711 -494941 -494041 -492798 -492279 -491578
15972 -491578 -491566 -489292 -487358 -487880 -486861 -484951 -483629 -483789 -484023 -481110 -481920 -486431 -487933 -487633 -486279 -484809
15956 -484809 -481594 -481260 -479128 -478914 -479734 -479473 -479291 -478446 -478279 -477855 -475315 -475215 -475301 -475448 -474981 -474886 -473733 -472132
15938 -472132 -470459 -470660 -469876 -470030 -469097 -469862 -469913 -468939 -468962 -468920 -465882 -463874 -465890 -463697 -462152 -464228 -465185
15921 -465185 -464461 -461800 -459889 -459342 -461698 -460626 -458106 -454119 -452463 -451999 -451575 -450182 -449182 -451110 -452049
15906 -452049 -451461 -452892 -453888 -459980 -465234 -466735 -468939 -471260 -472671 -471548 -468174 -467546 -467433 -465330 -464531
15891 -464531 -463443 -463075 -462268 -461127 -460990 -458957 -457862 -457793 -458827 -458373 -457730 -457601 -455510 -456526 -455229 -455436
15875 -455436 -456032 -454266 -451606 -449061 -451650 -453203 -451524 -449957 -449507 -450049 -450150 -450581 -450617 -448754 -448408 -450719
15859 -450719 -450315 -448639 -447836 -446251 -443607 -441976 -439707 -439969 -437912 -439441 -439180 -439768 -439027 -438413 -438842 -439127
15843 -439127 -438724 -437949 -435890 -435096 -433482 -430387 -428436 -428339 -426628 -425910 -424900 -425739 -425479 -428579 -430589 -434450
15827 -434450 -437099 -441978 -445583 -447347 -447356 -444295 -439637 -439972 -440147 -439504 -439278 -441231 -441045 -439779 -437134 -436479
15811 -436479 -434060 -432909 -431220 -429894 -428010 -427118 -428164 -428227 -428760 -428740 -429481 -427455 -427663 -429473 -426768 -424418
15795 -424418 -425395 -426062 -423528 -424694 -424911 -423452 -422191 -422585 -421675 -421335 -423060 -424061 -422360 -421083 -419711 -420307
15779 -420307 -419141 -415440 -413013 -411229 -413232 -415772 -415135 -412904 -411605 -412926 -413096 -410790 -408605 -406185 -402180
15764 -402180 -399902 -396601 -393597 -392980 -398904 -409412 -415072 -420551 -425007 -424939 -420306 -420120 -421331 -421993 -420350
15749 -420350 -420156 -419651 -419792 -420049 -418744 -416019 -416146 -415303 -415258 -412353 -410981 -411466 -409412 -409022 -409341 -410238 -410288 -409932
15731 -409932 -413059 -416947 -414982 -414824 -415832 -419491 -418728 -418196 -416316 -414186 -410356 -406711 -405742 -408407 -409007
15716 -409007 -407428 -404998 -407252 -405409 -402605 -401382 -398804 -400920 -402571 -402924 -404365 -404307 -403702 -407806 -411527
15701 -411527 -409892 -410370 -412931 -412820 -411558 -409586 -409033 -406824 -405992 -406264 -406902 -409282 -408686 -407285 -407017 -405366
15685 -405366 -403490 -403217 -403971 -402101 -400828 -398845 -395910 -395823 -394899 -395554 -399001 -396738 -395758 -395480 -394081 -396156
15669 -396156 -395585 -394065 -395497 -395569 -393498 -392453 -389828 -386931 -388345 -388361 -389223 -390699 -390678 -391514 -390898 -390230 -389940
15652 -389940 -389235 -389129 -387177 -383140 -381542 -383403 -383368 -382276 -381904 -384307 -385984 -385077 -385089 -382544 -380416 -381129
15636 -381129 -380528 -377895 -376198 -375888 -374853 -374276 -374525 -374244 -373163 -373413 -375071 -376022 -376357 -375679 -373604 -372293
15620 -372293 -372114 -370945 -370529 -371817 -370959 -370102 -370225 -374721 -375437 -378650 -382712 -387762 -388377 -388629 -386979 -385656
15604 -385656 -383718 -384700 -385100 -384546 -385265 -386794 -385486 -382789 -380120 -379531 -378048 -379115 -380355 -379975 -378788 -376700
15588 -376700 -374363 -376098 -377760 -375415 -374291 -375165 -373523 -371237 -371064 -372464 -371464 -369977 -369590 -368205 -369451
15573 -369451 -369533 -370160 -373635 -374179 -371123 -371195 -370830 -368978 -368977 -367820 -366508 -366801 -366551 -365226 -365248 -365983 -366206 -365933
15555 -365933 -366377 -366745 -365026 -362725 -361521 -361564 -360717 -363021 -363302 -363278 -361963 -361306 -361964 -360968 -358553 -358778 -359761
15538 -359761 -358863 -358503 -357832 -355208 -354750 -353939 -353073 -354101 -355066 -355187 -353217 -352172 -353854 -352688 -352803 -353996
15522 -353996 -354211 -352981 -352536 -352212 -352757 -352251 -352288 -352822 -351730 -352151 -351324 -350990 -350232 -349993 -349842 -350896 -353428 -353278
15504 -353278 -349280 -347742 -350492 -348376 -346942 -348291 -348247 -348842 -348405 -347962 -345750 -343789 -345179 -346581 -346017 -347702
15488 -347702 -347724 -343259 -340464 -339018 -340256 -341858 -340790 -342320 -343120 -341939 -341956 -344153 -344873 -341392 -338629 -337860
15472 -337860 -340486 -342677 -342892 -341378 -338557 -335925 -333910 -334866 -336108 -337050 -338099 -336477 -335935 -332013 -333295
15457 -333295 -334192 -334404 -332980 -331860 -331331 -329947 -329560 -332723 -332984 -332885 -332025 -333080 -332087 -332420 -333816 -333507 -334817
15440 -334817 -332301 -329514 -328597 -330434 -329308 -326269 -325653 -326454 -325988 -323932 -323878 -324150 -323875 -323730 -325191 -325748 -327060
15423 -327060 -328501 -328669 -330368 -328594 -328818 -326567 -324487 -323553 -321947 -322829 -321555 -321856 -320715 -317882 -320746
15408 -320746 -323171 -321821 -320527 -320742 -320533 -320229 -321934 -322569 -322026 -320138 -320000 -318854 -319728 -319854 -320192 -320279 -316787
15391 -316787 -316800 -316281 -313788 -311761 -313332 -315210 -314992 -314589 -313351 -314323 -314118 -314170 -314416 -310981 -311254 -311643 -311462
15374 -311462 -310876 -311687 -310831 -308056 -308256 -307694 -308746 -309172 -308783 -308184 -307305 -305435 -304229 -305320 -305649 -303573 -301630
15357 -301630 -297011 -295509 -294459 -293593 -292168 -290894 -291440 -291294 -291473 -294167 -299486 -305422 -312327 -320279 -322500
15342 -322500 -322799 -324194 -323322 -321863 -322706 -321416 -317294 -314293 -312647 -312606 -312417 -312984 -314101 -314165 -311561 -309940
15326 -309940 -309909 -309522 -305192 -305424 -303595 -301931 -302715 -304255 -304522 -306620 -305885 -304358 -302742 -302977 -302342 -301958 -299314
15309 -299314 -296033 -296361 -298994 -298538 -297313 -296901 -295072 -295929 -297710 -295296 -295591 -296727 -297710 -297988 -298234 -295987
15293 -295987 -294037 -293122 -292879 -292569 -294825 -296189 -294728 -294816 -294592 -294772 -294026 -295469 -296798 -296133 -293582 -292042
15277 -292042 -291049 -290937 -289881 -289251 -288596 -288831 -287399 -288958 -291659 -291469 -289628 -288190 -287874 -289176 -287768 -288053
15261 -288053 -288695 -288447 -288552 -287326 -286038 -284764 -285922 -285973 -285161 -283178 -283518 -283520 -284983 -287515 -288498 -286570 -282040
15244 -282040 -281123 -282792 -282576 -281101 -281693 -282775 -282377 -282873 -280681 -277403 -277245 -277281 -278591 -277702 -276540 -276592 -274995
15227 -274995 -272299 -272837 -273817 -272403 -271989 -273652 -273810 -273208 -274027 -275404 -275275 -273745 -272653 -272457 -273011 -272146 -270825
15210 -270825 -272152 -272534 -268955 -269168 -270255 -271138 -270653 -270485 -270700 -269466 -268827 -269911 -270063 -268467 -266931 -268046
15194 -268046 -267564 -268048 -269475 -267489 -267377 -267080 -267372 -267312 -265617 -263622 -263604 -263132 -262011 -261598 -262547 -263054 -261651
15177 -261651 -261893 -263245 -265255 -265466 -263958 -264992 -265868 -263518 -260209 -260270 -259000 -258435 -260019 -262288 -260645 -259099
15161 -259099 -257273 -258447 -257858 -258298 -258041 -256637 -257369 -257657 -256085 -255691 -256389 -257126 -259535 -259144 -257415 -257790 -258656
15144 -258656 -259363 -258998 -258433 -257604 -254638 -253643 -254396 -253335 -254235 -256357 -256345 -254420 -253904 -254721 -251908 -251424 -253633
15127 -253633 -254454 -253683 -252895 -254324 -254859 -252291 -247987 -247453 -249360 -249546 -248102 -245489 -245165 -245288 -247027 -247701
15111 -247701 -245069 -242276 -241890 -242163 -242477 -242341 -241729 -241317 -240312 -241823 -243956 -242286 -242296 -242269 -244402 -244322 -244613
15094 -244613 -245260 -244804 -241951 -239407 -239830 -240364 -240667 -241425 -240265 -239735 -240385 -238401 -238319 -238894 -239951 -238027 -235539
15077 -235539 -233817 -231595 -231095 -232641 -231904 -231721 -230970 -228524 -227629 -227536 -227684 -225456 -225159 -224136 -223283 -223585 -226194
15060 -226194 -225131 -224642 -221697 -217039 -212161 -211932 -217437 -227589 -238795 -248563 -254102 -256218 -254304 -250266
15046 -250266 -250623 -250062 -246676 -244948 -244064 -245541 -245541 -242514 -240301 -239011 -236263 -235699 -237587 -237688 -235836 -236652
15030 -236652 -238885 -237331 -235483 -233752 -232761 -232750 -232748 -232919 -232916 -230284 -229487 -230649 -231441 -233352 -232921 -232060 -229794 -226775
15012 -226775 -227524 -227744 -228411 -229301 -228404 -226296 -225194 -223079 -225186 -224919 -224583 -224265 -223670 -223981 -225214 -224979 -225059
14995 -225059 -227851 -229706 -229400 -226122 -224563 -224259 -225533 -224583 -221979 -220211 -220835 -221266 -222278 -220133 -217111
14980 -217111 -217654 -218966 -221128 -221704 -219183 -218457 -217335 -214634 -214336 -214101 -215975 -215551 -216182 -216195 -218841 -215533
14964 -215533 -212911 -213681 -212539 -213902 -213032 -212841 -214282 -215290 -215128 -213928 -215818 -215031 -211882 -211127 -211315 -212563
14948 -212563 -212878 -211372 -211318 -209064 -208574 -209278 -211557 -210752 -209345 -207540 -205359 -204614 -206197 -206840 -205737 -206756
14932 -206756 -205491 -207227 -209016 -207222 -206664 -208906 -208290 -206639 -206074 -206332 -206212 -205249 -205454 -203543 -200799 -200392
14916 -200392 -202365 -202882 -202792 -203651 -204196 -201875 -202527 -204493 -205584 -205702 -205426 -203943 -204863 -203509 -203686 -200962 -199504
14899 -199504 -201120 -200803 -201200 -201651 -202034 -201270 -201093 -200106 -200435 -199051 -196267 -193795 -192764 -193727 -194479 -195100 -194966
14882 -194966 -193792 -195858 -200185 -196393 -195510 -196438 -195476 -195252 -196322 -196256 -196841 -194500 -194250 -194009 -194337 -193426 -194442
14865 -194442 -193763 -192611 -192547 -190538 -191788 -192749 -193419 -194823 -192254 -191201 -189974 -187700 -187752 -188315 -188757 -190350
14849 -190350 -190798 -190454 -189432 -187977 -188179 -188515 -188945 -190389 -188527 -184736 -182284 -184515 -185276 -186657 -186652 -185096
14833 -185096 -182705 -182745 -184518 -184686 -182593 -182020 -184310 -183335 -180140 -180706 -181262 -182100 -183003 -181854 -177475 -176247
14817 -176247 -176121 -176811 -177219 -175691 -174741 -175452 -175167 -176195 -178604 -180494 -180760 -178921 -175216 -173891 -174830 -173074
14801 -173074 -173079 -171748 -169114 -171700 -173739 -175708 -175750 -173690 -173079 -171093 -170254 -169822 -170061 -171400 -171159 -171431 -169295
14784 -169295 -169194 -169992 -168180 -168273 -168122 -167752 -170717 -170629 -171342 -172386 -171414 -172056 -168545 -167729 -168719 -170367 -172359
14767 -172359 -171442 -168180 -165107 -162825 -162035 -163825 -164856 -164891 -165315 -164758 -164823 -162409 -160387 -162169 -163637 -162405
14751 -162405 -160813 -161848 -163256 -162082 -162445 -163458 -160588 -159326 -161024 -160014 -158901 -159072 -161293 -162169 -161589
14736 -161589 -160677 -161077 -161374 -160769 -162282 -162306 -157693 -155269 -156742 -158411 -158274 -159062 -158538 -159104 -159102 -160337 -159790 -158732
14718 -158732 -158737 -156616 -158338 -159303 -158213 -158481 -158905 -158477 -155712 -154660 -153099 -153860 -154000 -155293 -155199 -152343 -152528
14701 -152528 -151587 -152298 -153992 -152983 -152231 -151042 -151111 -151904 -151337 -151856 -151112 -151990 -151855 -151173 -153361 -155556 -153253
14684 -153253 -152673 -151837 -150780 -148633 -147164 -147922 -149090 -147204 -146277 -147473 -146484 -147576 -149040 -146957 -144958
14669 -144958 -145719 -147875 -147961 -145298 -144924 -146602 -144852 -141833 -139918 -137484 -136065 -135339 -135055 -135743 -135042 -134742
14653 -134742 -134729 -136581 -138839 -135396 -134622 -137360 -138509 -138036 -136864 -134758 -133758 -135234 -136132 -136356 -136638 -135645
14637 -135645 -132731 -133139 -134650 -135651 -133051 -131725 -131926 -132182 -133293 -133407 -134475 -132165 -129980 -130063 -131953 -131807
14621 -131807 -130075 -128199 -127079 -129038 -129724 -128664 -127388 -126031 -125907 -126585 -128981 -127428 -124873 -122627 -122100
14606 -122100 -123310 -124428 -123882 -123623 -123295 -123497 -123881 -124677 -125604 -126952 -126450 -124618 -122783 -123585 -122441 -119343
14590 -119343 -118191 -118722 -117628 -115489 -114641 -115821 -115701 -114879 -116611 -120155 -124245 -123310 -122777 -124287 -124661 -124457
14574 -124457 -122452 -121011 -120844 -122506 -121194 -119632 -119484 -119322 -115632 -114903 -116331 -114878 -114432 -117289 -115863
14559 -115863 -113224 -112796 -111258 -111270 -111008 -112536 -113891 -115358 -113576 -112149 -112487 -111086 -110523 -110750 -108520 -106973
14543 -106973 -107332 -107070 -108089 -109877 -108510 -105103 -102458 -103017 -104971 -105425 -103674 -98253 -96583 -98764 -101387
14528 -101387 -98961 -96158 -98072 -98796 -100234 -102852 -104066 -106756 -107904 -106706 -102182 -102390 -104057 -102811 -103779
14513 -103779 -103119 -100597 -99889 -96104 -93939 -96528 -99193 -99829 -96906 -93326 -92837 -90496 -84917 -84150 -92059
14498 -92059 -99581 -106212 -110116 -113313 -113736 -112490 -109777 -107816 -105784 -102926 -104145 -103375 -103025 -103796 -102439
14483 -102439 -100589 -100034 -101235 -102404 -102848 -103800 -102658 -98544 -97697 -97155 -95951 -93600 -93875 -94612 -94233 -94326 -92859
14466 -92859 -92191 -90813 -89637 -87829 -86525 -88000 -89333 -89972 -88934 -86170 -86110 -88220 -85849 -84432 -83226
14451 -83226 -81902 -80423 -76681 -74270 -72273 -72312 -74399 -78629 -82334 -86499 -90905 -91999 -91452 -91232 -94796
14436 -94796 -96604 -96108 -95709 -92702 -90662 -89981 -87827 -85344 -86963 -87796 -87666 -87332 -85466 -85738 -83127 -84472
14420 -84472 -84878 -82646 -83540 -83633 -83166 -85614 -85186 -82298 -83684 -84399 -82252 -80170 -79401 -76747 -74096 -73847 -75012
14403 -75012 -75974 -73694 -73865 -74787 -73663 -73534 -74522 -75304 -76306 -73732 -72541 -74095 -73506 -72142 -69534 -68518
14387 -68518 -69213 -69868 -69790 -68897 -67473 -69348 -70627 -68568 -64827 -63720 -66010 -66491 -64319 -62437 -65700 -67717
14371 -67717 -66573 -63730 -62482 -62249 -60760 -59440 -57937 -58917 -59683 -60423 -62209 -64443 -64250 -62815 -62264 -61736
14355 -61736 -61433 -61495 -61924 -61572 -59412 -56329 -55785 -55137 -54955 -56075 -55335 -56213 -55234 -53341 -51867 -51126 -51863 -51100
14337 -51100 -51564 -53081 -54474 -56473 -54682 -51748 -50619 -51355 -51008 -51966 -49346 -47478 -45821 -46544 -46320 -46437
14321 -46437 -45887 -46001 -46428 -45221 -45170 -43776 -43357 -41585 -41276 -39804 -38483 -37689 -39461 -39885 -40440 -39886 -39601
14304 -39601 -37674 -38266 -37174 -38516 -36895 -35451 -34636 -32310 -31769 -32486 -33557 -35018 -33443 -30467 -30700 -31759
14288 -31759 -31946 -27951 -28096 -30174 -29820 -31795 -32718 -33215 -32288 -30587 -30543 -29259 -29540 -28900 -27659 -28149 -25857
14271 -25857 -22119 -22831 -20671 -18881 -19447 -17508 -18332 -22402 -22044 -21600 -21252 -17646 -17029 -16395 -14681 -16178
14255 -16178 -14007 -11221 -10472 -9846 -9619 -8410 -10583 -10990 -6291 -5482 -5203 -5599 -5928 -6686 -8046 -6448 -4181
14238 -4181 -1260 189 3 3150 4602 2611 2332 3194 5312 9771 13086 15730 15107 14068 16489 17890
14222 17890 21006 21184 23559 28390 32061 33548 36514 39586 40657 44807 51252 55529 59553 65541 74854
14207 74854 87030 101031 113494 110484 67880 9510 -38853 -73988 -85001 -78870 -65055 -51773
14195 -51773 -41137 -36866 -31977 -27132 -22389 -18927 -15442 -10280 -7224 -2293 -250 2571 7705 10738
14181 10738 12184 14434 15613 15193 13771 9448 3686 1018 76 2569 6146 7082 10170 15474 17708
14166 17708 17915 21735 24914 25140 25020 25244 26482 28676 30327 31666 31599 32280 34209 36580 38350 38013
14150 38013 39003 38922 40667 42325 43288 44578 46104 46919 48564 50097 51698 53989 57147 57923 58877 63603
14134 63603 65468 65908 66989 69863 72689 73995 76646 79600 81303 83444 85508 88324 90358 93872 97755
14119 97755 93930 89154 85611 82747 81160 84273 88036 93082 97055 100397 103865 106169 110947 116557
14105 116557 119334 120798 120689 118491 116157 112840 110446 112197 118586 122700 124309 125697 128531 132177
14091 132177 136519 142783 149978 157233 160312 164345 166719 167761 171673 180331 185618 189969 193764 200322
14077 200322 207314 215677 220187 226630 234380 239622 246652 255254 264217 274618 283909 291169 299978 312094
14063 312094 322116 328739 335228 344285 356365 370986 384661 399483 415728 435410 455069 479037
14051 479037 502757 526170 553944 586957 622643 663751 709999 761280 815740 877353 950068
14040 950068 1035254 1138513 1264877 1416154 1604045 1844533 2138813 2369254 2134323 1083027
14030 1083027 -163900 -1180421 -1890490 -2090652 -1935370 -1687117 -1455184 -1260540 -1101219
14021 -1101219 -972184 -862519 -772525 -700395 -634626 -573056 -515044 -457036 -400083 -342344 -283858
14010 -283858 -218503 -148341 -72653 -1376 13525 -125400 -369741 -576905 -738735 -807714 -788405
13999 -788405 -734813 -679983 -631380 -588199 -551394 -518425 -489426 -464277 -441300 -422994 -408618
13988 -408618 -397842 -387525 -375747 -365321 -355177 -344321 -334461 -328630 -318030 -308878 -301539 -292958
13976 -292958 -285897 -278695 -274543 -268664 -263169 -259244 -252561 -246110 -239555 -235301 -231680 -228294 -222649 -218570
13962 -218570 -215034 -211856 -208682 -206458 -200084 -195182 -196165 -195183 -192239 -188151 -183233 -181439 -179736 -177058 -174247
13947 -174247 -171162 -169463 -164968 -163683 -162179 -156956 -153337 -150904 -149215 -147329 -144946 -142412 -141816 -142002 -141673
13932 -141673 -140420 -140028 -137621 -135487 -134261 -131806 -130779 -130358 -126943 -122688 -121242 -119749 -117876 -115437 -114220
13917 -114220 -113686 -112008 -110710 -109901 -109162 -106546 -107054 -108375 -106157 -102844 -100099 -95913 -94326 -94881 -94345 -94459
13901 -94459 -94157 -92761 -92487 -90193 -86965 -84358 -83027 -81461 -80622 -81479 -79353 -80013 -82288 -81643 -79168 -76049
13885 -76049 -76367 -76016 -74604 -73417 -71495 -69569 -69298 -66736 -64072 -61224 -59417 -60589 -65437 -67884 -71290
13870 -71290 -74979 -73526 -74034 -73246 -72870 -75843 -74030 -71675 -70739 -67023 -63376 -61318 -60301 -57662 -56311
13855 -56311 -55797 -52648 -49927 -48869 -50236 -51176 -50983 -49695 -48982 -48359 -47872 -47778 -44455 -43300 -46084 -44349
13839 -44349 -42892 -41933 -39526 -40034 -39160 -40715 -41745 -38500 -36246 -36982 -36412 -36265 -35343 -34988 -33891 -32296
13823 -32296 -30673 -30207 -28802 -26648 -26922 -25321 -22797 -21942 -22364 -22573 -20450 -18468 -17511 -16871 -17198 -16932 -15591
13806 -15591 -13489 -12188 -13561 -14204 -14142 -13048 -7833 -3575 -4099 -4607 -2123 -1870 -4686 -5771 -5617 -8556
13790 -8556 -7787 -10667 -10686 -9002 -5636 -3032 98 2382 621 560 2592 3202 2009 173 -2190 -1871
13774 -1871 -2740 -5713 -6082 -6330 -4993 -2052 -1057 2135 3777 3577 6268 9105 8747 9214 7457 5665
13758 5665 2916 -1881 -3446 -1545 2608 6653 9671 9438 10236 10751 11213 12866 14588 15609 16946 17007
13742 17007 19325 20785 20321 21162 22838 24841 28280 30040 28309 28074 30017 31176 30397 27182 26430 24574
13726 24574 26291 30296 31567 31283 34114 36965 37438 37667 39891 43043 43823 45446 47806 47028 46024 44848
13710 44848 46379 47608 50018 49510 50618 48834 49946 50481 52780 56333 59398 60405 60929 64271 69373
13695 69373 71413 71777 75601 78271 81047 83019 85249 84635 85511 84594 83604 83960 81854 80585 82149 85610
13679 85610 90593 93063 94079 94550 95058 94698 99623 105572 107873 111264 115911 116340 120725 125890 130742
13664 130742 134556 139144 142128 146700 153057 158313 163513 168208 172213 180623 190018 199189 205998 211766
13650 211766 218298 225899 235062 245591 256908 271030 287525 304366 323992 342494 362080 386255
13638 386255 414246 450372 496039 550740 619207 704424 809434 935203 1026909 892706 408965
13627 408965 -123059 -557642 -853944 -925066 -848710 -740456 -643698 -562438 -496961 -443083 -400428
13616 -400428 -364844 -337022 -313276 -290855 -269445 -251116 -234508 -218940 -204030 -191564 -184339 -174058
13604 -174058 -163373 -153645 -144933 -136565 -128220 -124100 -122433 -119186 -114449 -109490 -105082 -101395 -96078 -94311
13590 -94311 -94555 -94612 -91993 -87924 -82289 -77864 -73917 -72443 -68741 -65728 -64630 -64065 -63957 -62050 -59055 -53855
13574 -53855 -50528 -50404 -48889 -45426 -42301 -39895 -39603 -40115 -39558 -37125 -33986 -33354 -32334 -28928 -24661 -19705
13558 -19705 -16731 -19624 -26708 -32086 -34184 -34371 -28192 -25125 -25124 -28216 -29472 -28292 -25882 -23990 -25682
13543 -25682 -23139 -17994 -14664 -14714 -13211 -8538 -7247 -10545 -11619 -8990 -8129 -7491 -5004 -1272 -907 -1634
13527 -1634 145 3805 1732 885 1291 -256 -1566 -2750 -4173 -3483 -2472 -581 562 3807 8040
13512 8040 11900 12971 14965 15181 17003 16424 12767 11926 12326 13277 13812 13978 14939 17516 19189 21438 22842
13495 22842 25224 25564 25959 26246 27837 28497 29020 29177 31039 36101 39874 41423 45725 48048 45105 38180
13479 38180 28914 20130 13074 12202 12396 13061 16374 19661 24408 25523 25088 26702 26606 27609 28926 30200
13463 30200 31094 33044 33228 33207 31971 33912 38202 40116 41460 44581 44446 46533 47777 48375 47190 45342
13447 45342 46544 48047 45871 44157 43582 45164 45883 48331 53915 55159 55858 54328 52418 50927 49550
13432 49550 47961 48301 49106 49927 51824 52515 52598 50590 49199 48454 51337 54915 57142 55007 57081 57420
13416 57420 59683 61472 61030 61741 62840 65286 67134 69810 72141 71672 71685 74484 77018 79906 83555 88519
13400 88519 94197 96873 95434 91432 75202 54849 40416 31239 29130 29453 33003 35553 39388 44386
13386 44386 45747 46889 48685 50993 53255 54816 55738 59996 60396 61202 60534 61927 65781 62753 56201
13371 56201 54998 52462 52702 53547 53707 54470 58219 61270 61954 61887 62591 65496 66635 67338 70071 70192 69571
13354 69571 69921 67859 63762 66790 70946 73883 73765 75056 74620 73940 75615 75643 76234 76011 76854 79648 80297
13337 80297 79394 79892 79507 78184 81735 82031 82156 84966 87861 91690 92356 91407 90583 90227 89503 91978 97234
13320 97234 101646 104435 103604 101187 97460 89868 85287 81748 81176 83077 84478 83807 84967 84614 85082 85463
13304 85463 87920 90066 90282 91254 90581 90487 90967 92919 95749 97637 97064 96045 95998 96127 96757 98532 100122
13287 100122 102642 103378 104092 104321 108163 107954 104900 103534 106316 110101 113587 114739 111759 113539 115958
13272 115958 115716 115993 116701 118109 120210 119964 118868 120446 121338 120305 119901 120549 125461 128500 130597 134052
13256 134052 132988 133664 138523 143361 146851 147153 147878 148344 151838 158153 164637 172096 178200 185966 195263
13241 195263 206416 221707 231686 225354 185846 125508 71705 29372 9027 9360 16193 27421
13229 27421 39784 49157 56550 61678 64417 65324 70334 73421 76815 81179 84261 86532 85620 85744 86902
13214 86902 85756 85780 86221 88963 93245 94333 95211 97449 98643 101472 105390 108375 110058 110671 108995 105270
13198 105270 103472 102621 105885 107451 105972 104378 105527 108579 110090 109891 113135 115756 116640 120029 121671
13183 121671 121754 123158 123516 125895 128593 127662 127918 128138 129771 132083 132668 128426 122379 119479 115875 112287
13167 112287 110636 111608 113189 115504 119421 121154 122304 122987 124398 124365 124268 125995 128851 132151 131652 128971
13151 128971 128292 127883 130338 134394 136104 132767 130934 131282 132598 130348 130585 131764 133723 133094 132935 135802
13135 135802 136879 139220 141251 141238 141876 143535 145556 145856 144353 140265 133868 127218 123040 123354 125287
13120 125287 126851 127650 128394 129894 131043 132847 133276 132499 132827 136350 137825 139769 143082 143844 141775 141488
13104 141488 139421 138284 135671 136405 139136 139216 139515 140401 144621 145549 145064 146658 149953 150541 149335 148916
13088 148916 148183 150174 152379 151164 150378 150902 150067 148311 146681 147084 144718 142319 143224 144714 146855 149595
13072 149595 154673 156787 157094 156725 156981 157637 160460 160751 158038 158535 159088 158860 158543 159908 163504 166140
13056 166140 165623 164561 166705 166872 165303 165317 166785 168225 168938 165412 163184 164224 165273 164347 165984 168456
13040 168456 168347 168663 169615 168445 167051 167603 165840 164561 167576 169392 170900 170009 169776 171567 171099 171298
13024 171298 171640 172028 173736 173590 173418 173697 173884 176855 181507 180655 178116 179584 181581 181257 181756 179136
13008 179136 179195 180409 183659 184898 183889 182978 182168 183223 185439 185379 183362 182678 182997 185802 187056 186218
12992 186218 188046 190164 190046 190350 191857 191690 189164 190243 193896 195099 194716 195434 198126 198706 199211 198778
12976 198778 200725 203039 199094 197032 197127 196748 196005 197429 198692 199432 201033 205833 206994 204400 201948
12961 201948 202661 202409 202318 199864 198123 198889 198372 197323 195096 194704 192241 192145 192654 192818 194800 197164 194901
12944 194901 197085 200092 199160 198782 198502 193414 194185 196227 197582 197831 199494 199235 199264 198350 200197 203142
12928 203142 204300 205286 206066 206814 209345 208383 208048 208893 209940 210085 210117 206386 203160 202907 203395 204481 206156
12911 206156 206651 207402 206725 205457 208791 211445 210436 209145 207753 206460 207738 208153 212067 216071 216920
12896 216920 214614 216605 218758 218549 219794 217974 217859 217475 217349 219641 221663 221896 221261 220225 219821 219148
12880 219148 221647 223503 223279 221846 222907 223796 228013 228543 227691 228644 229509 230481 230559 231503 231994 232967 233313
12863 233313 234351 233421 230389 229487 229745 230418 227959 225943 227418 230256 233692 234384 233881 234441 234497 236071
12847 236071 236357 234227 233056 232661 233175 235026 236689 235762 237163 238600 240442 240081 239708 240465 241329 244801
12831 244801 244502 243669 245579 244633 242762 243269 243302 246505 248946 248759 248844 250970 252613 252890 252811 252139 250503
12814 250503 251232 250710 249893 250082 252438 253987 253640 256546 257848 258732 258879 259948 257593 253672 253156 252088
12798 252088 250858 251332 253106 255234 254991 250872 249929 250920 252879 255489 257485 257289 255613 257739 257684 257565
12782 257565 257604 255997 255752 258410 259405 262330 264943 265103 265027 265598 266982 266971 266838 264933 265640 268662 270914
12765 270914 270403 269528 271115 271791 270835 272781 271368 273782 275051 270140 266961 268429 269654 267835 268719
12750 268719 268670 268889 270857 271608 268925 269187 271345 271653 271617 272347 272876 273078 274691 276249 278443 279091 281006
12733 281006 282929 281658 281305 282121 282351 284330 285781 286526 287861 290438 292221 290482 290683 292177 294075
12718 294075 293918 291936 290017 287331 288649 290907 290962 289945 289057 291203 292242 292241 292767 292108 291874 293174 293726
12701 293726 293251 294452 294904 297285 297949 299513 300357 299232 299063 299372 296592 298599 301168 300957 303018 305584
12685 305584 307168 304811 305852 309526 312684 311951 309984 307885 306563 310205 310432 309076 307940 307989 309538
12670 309538 310314 312162 314603 316178 315507 315979 316534 317438 316793 317236 318456 317501 317396 317149 314820 311798 313138
12653 313138 315963 317565 319731 319500 317326 314058 313596 314048 311906 310255 308507 309399 313501 316316 318587
12638 318587 320123 319397 319669 322192 323613 322769 322737 323652 322729 322824 321376 321028 324290 327339 327745 328436 329200
12621 329200 330799 331686 333781 335207 333937 331716 330328 329961 330127 331135 332311 334050 333567 331742 330973
12606 330973 333804 336053 333784 333574 333000 328180 324763 325269 329557 333198 333840 335937 337342 337720 340097
12591 340097 340761 340779 338156 336150 333616 333443 335908 339454 339859 340548 342657 343407 342976 342628 344930 347287
12575 347287 346329 346672 347088 347903 347503 347837 350883 353280 351985 353661 353997 354564 355712 353992 354798 354055 356332
12558 356332 357637 358292 358567 359739 361739 360940 362183 363370 362236 361338 360988 362758 367873 369935 369221 367935
12542 367935 366870 366190 366425 365471 365322 365247 366098 366888 367294 367989 367767 368851 371170 372714 373743 373051 370712
12525 370712 371870 372128 372250 373218 375961 377373 376622 376372 377542 381068 385059 385342 386552 383675 380739 381170
12509 381170 383395 387370 389113 391129 389958 387494 385893 387748 389676 391322 391138 388987 389764 390296 390971
12494 390971 392490 393124 394532 393470 394015 395296 396283 398095 402322 405964 405702 407330 407760 406831 407967 413390
12478 413390 418638 420774 416156 408540 400217 392915 390501 393612 395905 395916 397083 398961 402406 404128 407123
12463 407123 407080 403714 403796 407538 410984 412864 417345 417553 417574 419741 421707 421150 419867 419941 418816 420480 420985
12446 420985 421000 422468 425666 430032 435299 439650 441662 444348 446319 449738 452584 457354 464907 468664 464763
12431 464763 444088 418450 398561 383109 380593 383028 388847 394968 398397 403624 404305 405663 410303
12418 410303 412772 418314 422109 422579 425070 427048 428474 427444 427808 428319 428867 427529 427459 429836 434637 438641
12402 438641 443002 442676 439081 439574 441191 444912 446810 449799 454555 458412 462717 468593 475133 481297 482594
12387 482594 471249 444863 419761 403326 394374 392062 396245 403865 408631 411500 414265 417230 420868
12374 420868 424301 425358 427354 431401 436022 440644 442306 442432 443686 444338 441023 439720 440120 439941 441411
12359 441411 442772 445883 448355 449533 449726 449246 450543 451656 451078 452532 453570 456881 462398 463978 465275
12344 465275 470937 469935 460309 451050 446368 444514 444924 444166 446284 450614 450314 450161 451635 453775 457496
12329 457496 460881 459945 461925 464626 465428 466470 470992 475435 474226 471007 470492 470483 468749 466710 463719 464833
12313 464833 466976 467304 467159 464304 467519 470028 473046 474161 473368 475132 476404 476745 478451 479344 479830 479914
12297 479914 481346 481154 484398 487399 486743 485282 485419 485879 486427 485205 483213 486384 491209 492659 493456 494232
12281 494232 495298 495890 499265 501934 503554 502956 502645 506196 509442 508594 506944 505278 503463 500234 498006
12266 498006 499138 498800 498564 499255 501838 503278 504417 505995 504737 505610 507331 508168 510847 511084 513270 515918
12250 515918 515715 513642 514341 513849 515209 518523 521228 522777 522372 519783 521148 522074 523234 526714 531216
12235 531216 529390 528387 529039 528957 531583 533077 534853 533881 535777 539884 540021 537090 535619 535324 534786 535767
12219 535767 537158 537506 536887 536207 539306 541011 542349 544875 546487 546156 549196 549541 549137 550853 554436 553098
12203 553098 552157 551293 553035 555046 558082 560143 559178 557537 554937 552379 550640 551403 552425 556818 556159
12188 556159 556091 557166 558481 558772 561053 564047 566657 569452 568372 567210 568393 569495 570507 571045 569933
12173 569933 570991 571564 572059 574088 579108 582718 582704 582374 585227 585264 585040 586118 586791 589564 591556 593657
12157 593657 597352 601697 603668 606948 608930 602301 589424 576574 565939 560326 560825 566080 571083 577006
12143 577006 580265 581903 584770 584226 586712 589155 587491 586948 588737 593042 595585 596674 597471 596915 599520
12128 599520 600677 603958 606821 609136 610562 613550 617443 616962 615074 614373 614456 616380 617409 619021 622330
12113 622330 626984 631521 637026 637918 637788 631829 618644 603862 590694 584251 583536 588843 593655 599342
12099 599342 602784 603922 607632 611247 613292 612518 614829 615478 614919 615753 616823 617956 620392 623029 625468
12084 625468 626620 629941 631506 631599 633192 634002 636361 636790 638020 641115 641591 638879 642989 646888 649705
12069 649705 650443 651785 652090 650750 650385 650035 645911 640659 638480 635201 635980 638014 641235 644782 645271 645086
12053 645086 645521 647999 650153 652268 655301 656494 656899 657380 656423 656918 658990 662636 665361 666443 665935 668870
12037 668870 669276 670634 673100 672606 673058 673985 673634 674951 676614 677264 677520 677896 679895 679397 678621 679848 681483
12020 681483 683310 685560 687512 685675 687292 690476 689425 690259 690555 692275 693221 693372 692889 691545 693467
12005 693467 697322 698742 701777 703161 706936 708335 705960 706735 706085 706362 707514 708359 708622 710539 710027 709160
11989 709160 710543 713617 717242 719416 718314 718149 721709 725756 726604 723584 723392 726385 726419 727071 727094 725635
11973 725635 724927 725372 725772 728324 733997 736937 738069 737738 736831 738261 738590 739998 742542 744273 742212 742992
11957 742992 746136 748158 747218 748886 751247 752114 754421 753474 753256 752427 753267 754362 755505 758923 761298 761428
11941 761428 761228 762924 765392 767437 768762 769069 768601 768446 767597 766910 769292 771940 774773 777755 778952 779944
11925 779944 780304 780037 782683 785201 785572 785006 786682 789957 791548 790825 792956 793676 793399 794621 795895 799211
11909 799211 799341 798294 797223 798775 803605 803197 802032 803408 807055 808365 806577 806243 808947 812033 813886
11894 813886 813784 815302 816158 816151 816421 818758 820442 821399 823724 825840 828138 830185 830369 830837 833321 834845
11878 834845 834707 833846 833400 833433 831459 833308 837426 841596 844747 845106 845474 843842 844785 847890 851083 852033
11862 852033 854538 856718 856235 858922 859626 857536 860290 862211 863868 866316 866989 866865 865718 867169 866779
11847 866779 867194 866985 869804 874895 876032 876339 876385 873622 874537 876282 880599 883317 884811 886078 886870 887331
11831 887331 891665 894094 893859 894501 896036 898127 897758 898595 899422 900753 900579 901723 903220 905344 908235 910646
11815 910646 911068 911725 911574 910160 911857 915237 915767 914947 914453 915847 921599 922925 922311 924393 925738 929697
11799 929697 933158 933673 933626 935531 935730 936505 938083 942337 945826 948550 950796 952337 950346 949388 951620 954438
11783 954438 954588 957122 958905 957471 957394 959952 962850 964624 964956 965183 966798 965574 964847 968166 970359 971928
11767 971928 973487 976444 978989 979236 979241 984207 987347 987179 990368 992087 990275 990226 992438 991826 995034 998728
11751 998728 998442 999538 1002053 1005973 1009554 1012004 1012656 1012196 1015335 1016881 1017801 1018368 1019251 1020331 1023643 1026516
11735 1026516 1026971 1027838 1028353 1024601 1024873 1025849 1027352 1029699 1031337 1032444 1036116 1038390 1040741 1041540 1045064
11720 1045064 1047628 1049426 1052686 1055224 1054870 1052822 1052988 1054075 1054914 1056704 1059004 1063124 1068949 1071390 1070148
11705 1070148 1070231 1072897 1075156 1076802 1077649 1078244 1080297 1079694 1080370 1084437 1084567 1085693 1089368 1092838 1094653 1097906
11689 1097906 1099120 1098779 1099089 1101635 1103254 1106317 1111024 1113089 1114326 1116125 1116702 1117529 1122461 1126265 1123804
11674 1123804 1122146 1121665 1124844 1127807 1130436 1134205 1136132 1138296 1141451 1142141 1142254 1145273 1148381 1150463 1150746
11659 1150746 1153726 1155143 1156438 1156021 1157926 1162008 1165170 1167032 1167914 1169959 1173528 1177702 1177029 1178551 1179477
11644 1179477 1182166 1183345 1185340 1188291 1190069 1191607 1192923 1194847 1196427 1196313 1196777 1197366 1199339 1202400 1205890
11629 1205890 1209855 1211233 1210067 1209154 1210978 1215799 1219931 1222640 1222016 1221834 1222107 1224484 1227615 1230911 1233344
11614 1233344 1236266 1240509 1243249 1245448 1247239 1249565 1250276 1253954 1258996 1260834 1262674 1262753 1264803 1267252 1268848
11599 1268848 1269275 1274250 1277827 1281145 1282582 1283321 1284215 1289670 1293811 1293931 1293702 1295501 1299839 1302305 1306086
11584 1306086 1311674 1312837 1313089 1313815 1314637 1316704 1319298 1319186 1321947 1325208 1325600 1328771 1330773 1331394 1334084
11569 1334084 1337410 1339923 1337668 1338921 1341862 1346613 1351334 1355644 1355687 1357254 1360368 1365048 1368307 1370334
11555 1370334 1370808 1372785 1374416 1377860 1378242 1380657 1384075 1389922 1393606 1395569 1394578 1398711 1404907 1408782 1408987
11540 1408987 1410268 1412115 1415601 1415713 1417740 1421551 1423164 1426774 1426870 1427996 1431587 1436929 1439392 1443015 1446651
11525 1446651 1449035 1450154 1452236 1455292 1458489 1461797 1464285 1465732 1468392 1469271 1470441 1472243 1474036 1478159
11511 1478159 1481751 1484277 1485932 1487288 1489889 1495074 1500664 1502805 1503629 1505661 1510589 1513913 1514234 1517858
11497 1517858 1521610 1523724 1527324 1530495 1531757 1534443 1540744 1546238 1550665 1555088 1556675 1557420 1560449 1563489
11483 1563489 1566800 1569182 1575203 1576070 1575458 1577543 1583150 1586807 1589454 1591570 1595332 1597080 1596567 1601736 1606632
11468 1606632 1607955 1609153 1615064 1621977 1625890 1631026 1634451 1638406 1643712 1648457 1651679 1654029 1656722 1661409
11454 1661409 1664466 1667292 1668949 1670662 1673984 1677888 1681836 1686727 1690730 1694378 1698661 1702263 1706840 1708094
11440 1708094 1707948 1710324 1710604 1713682 1719472 1723048 1725398 1730332 1733061 1736869 1740171 1745879 1752352 1758651
11426 1758651 1762197 1767056 1771690 1774117 1773931 1775652 1780855 1786790 1791580 1794393 1799861 1804788 1807296 1811228
11412 1811228 1815373 1818137 1819984 1824267 1829819 1832862 1837337 1838005 1840672 1844957 1851619 1856615 1858706 1862800
11398 1862800 1868289 1874824 1878774 1883697 1889813 1896419 1900672 1905527 1912621 1916634 1919342 1924569 1928347 1929836
11384 1929836 1934928 1942963 1945663 1948245 1951583 1958051 1963639 1967255 1969746 1971234 1974262 1981529 1988138 1995443
11370 1995443 2004145 2010295 2014146 2017126 2022704 2028591 2034313 2040262 2039739 2040770 2047379 2051920 2053508 2055648
11356 2055648 2059252 2065208 2070376 2076232 2084901 2091834 2098917 2108232 2117645 2122511 2125863 2130150 2135651 2141830
11342 2141830 2145555 2151626 2156987 2161179 2168851 2176690 2185521 2191882 2197677 2201017 2208922 2218629 2224331 2228564
11328 2228564 2233854 2237815 2242904 2248588 2259878 2271412 2287356 2303335 2313549 2321521 2322320 2323129 2325316
11315 2325316 2333414 2343229 2352177 2363208 2372076 2381716 2391884 2399260 2404920 2412381 2422353 2430444 2439263
11302 2439263 2449667 2460995 2471079 2482811 2496411 2512890 2529940 2546108 2562881 2575367 2584868
11291 2584868 2596738 2608197 2620054 2634894 2651808 2672548 2695422 2721004 2746643 2779049 2819486
11280 2819486 2863587 2910831 2959931 3016354 3083110 3158885 3247364 3355475 3481775 3600841 3594762
11269 3594762 3246421 2643492 2103402 1673431 1455391 1455220 1556083 1674286 1780342 1866432
11259 1866432 1935311 1995036 2047669 2094923 2138858 2177261 2211781 2243794 2275559 2303060 2328094
11248 2328094 2348133 2368601 2388291 2405374 2420530 2432332 2443208 2456780 2471576 2487138 2500892
11237 2500892 2512303 2525943 2537638 2549069 2557845 2568325 2583883 2601071 2618891 2636884 2654475
11226 2654475 2670554 2682528 2690796 2701482 2710711 2719181 2731104 2742296 2752226 2761489 2772353 2781928
11214 2781928 2793063 2801548 2811881 2823104 2834478 2845781 2857520 2870070 2877860 2885813 2898390 2908677
11202 2908677 2920226 2931386 2937593 2942581 2949436 2953188 2956947 2965995 2977491 2987984 3002614 3015734
11190 3015734 3027780 3041212 3055510 3069787 3085533 3102803 3119437 3129838 3135606 3142761 3151048 3161416
11178 3161416 3173571 3183646 3192135 3199740 3210040 3217620 3221232 3228460 3244294 3263033 3279953 3295264
11166 3295264 3306971 3312828 3319732 3332695 3347268 3364563 3386363 3406069 3428331 3449240 3467812 3485486
11154 3485486 3502769 3519490 3536294 3555913 3573162 3588059 3600509 3613603 3627892 3644605 3659182
11143 3659182 3670796 3682916 3696812 3710830 3723126 3735231 3747769 3761749 3775610 3788788 3802957
11132 3802957 3822799 3847026 3869113 3890026 3913548 3934881 3954438 3972283 3991148 4015104 4040407
11121 4040407 4059882 4084217 4122630 4174041 4209593 4216386 4237206 4258359 4255545 4224259 4172303 4126582
11109 4126582 4114067 4107208 4098039 4105563 4125148 4148858 4172714 4196468 4218526 4240016 4266008 4292803
11097 4292803 4322480 4353156 4382546 4415327 4448808 4482915 4513353 4539884 4564563 4585874 4600311
11086 4600311 4615311 4634076 4655851 4676592 4696245 4718979 4743397 4767775 4793063 4820840 4849565
11075 4849565 4878520 4903043 4924194 4943838 4961390 4980156 4998502 5021694 5050229 5081548 5107738
11064 5107738 5129837 5149306 5162378 5169688 5179454 5201203 5231558 5270075 5309086 5343524 5368299 5385547
11052 5385547 5404499 5429680 5476679 5532812 5597751 5670974 5739541 5793192 5833800 5870416 5907924
11041 5907924 5944296 5976679 6008924 6042920 6080290 6122016 6164044 6205205 6247509 6290171 6333339
11030 6333339 6379654 6428354 6471983 6497722 6487910 6454057 6423589 6412973 6427487 6464894 6511225
11019 6511225 6559459 6608436 6656564 6709076 6770428 6835558 6892998 6945714 6992368 7036979 7081190
11008 7081190 7127537 7180445 7233828 7285865 7342920 7399247 7451936 7503317 7557094 7616083 7675655
10997 7675655 7732810 7790441 7844878 7900251 7957312 8012384 8060990 8109814 8173148 8237381 8295013
10986 8295013 8386171 8496195 8563005 8638708 8763728 8887364 8961076 9010852 9063841 9128324 9202151
10975 9202151 9277195 9352743 9426843 9508365 9594205 9678094 9765413 9852485 9939039 10027245 10114536
10964 10114536 10200853 10291717 10385150 10479108 10577666 10685113 10801485 10927497 11055554 11183718
10954 11183718 11314852 11447912 11577792 11704960 11832038 11961041 12100363 12248922 12400088
10945 12400088 12550506 12695371 12839114 12980782 13115636 13261151 13420137 13583720 13745835
10936 13745835 13911997 14087164 14266212 14444233 14629264 14822277 15023799 15241819 15474635
10927 15474635 15720330 15972586 16222766 16470624 16724832 16983632 17251914 17529328 17816148
10918 17816148 18121630 18446193 18786415 19138277 19499701 19873102 20245049 20606518 20973895
10909 20973895 21357326 21762569 22198194 22670943 23184280 23721784 24286070 24881490 25496172
10900 25496172 26142585 26830531 27537608 28259165 29006555 29785459 30595468 31449312 32365419
10891 32365419 33350887 34413097 35562290 36812981 38162540 39609387 41154273 42754490
10883 42754490 44273890 45528024 46772460 48307000 50185027 52570738 55449054 58728610
10875 58728610 62365043 66401933 70947390 76085135 81898425 88510239 96019752 104537449
10867 104537449 114353743 125697664 138795237 154060226 171646196 187839570 187400359
10860 187400359 139733957 46755704 -38077910 -107877770 -159360550 -177494651 -171081093
10853 -171081093 -155874972 -139944077 -125745272 -113596511 -103139201 -94102482 -86315858
10846 -86315858 -79563980 -73660329 -68486172 -63943056 -59908248 -56267970 -52957842 -49890191
10838 -49890191 -47019785 -44367830 -42052665 -40295666 -38936836 -37620440 -36297332 -34829697
10830 -34829697 -33207979 -31547180 -29911941 -28291188 -26660685 -25007232 -23321283 -21564836
10822 -21564836 -19669835 -17582627 -15296979 -13231513 -13146734 -17544405 -24251795 -29953634
10814 -29953634 -34292075 -35978701 -35278846 -33649098 -31951247 -30409308 -29050438 -27851578
10806 -27851578 -26791256 -25849555 -25012859 -24277281 -23621196 -23023629 -22469049 -21945663 -21447310
10797 -21447310 -20973684 -20524256 -20091519 -19676400 -19284045 -18912478 -18564953 -18241701 -17936713
10788 -17936713 -17643167 -17356030 -17073903 -16795200 -16528388 -16271619 -16023300 -15783325 -15552874
10779 -15552874 -15329417 -15112538 -14901412 -14698937 -14496227 -14292798 -14104100 -13932190 -13772750
10770 -13772750 -13616420 -13459555 -13299907 -13142336 -12981876 -12824561 -12674833 -12534295 -12401591
10761 -12401591 -12275344 -12153220 -12036769 -11920682 -11800817 -11683102 -11566433 -11445378 -11327518
10752 -11327518 -11211410 -11093992 -10976301 -10861358 -10750133 -10639121 -10530152 -10423335 -10317249
10743 -10317249 -10208328 -10097852 -9989285 -9884407 -9781450 -9676169 -9566303 -9460914 -9400128
10734 -9400128 -9389756 -9359096 -9308383 -9284344 -9246153 -9172129 -9082659 -8992230 -8904098 -8835276 -8830824
10723 -8830824 -8856842 -8866402 -8861379 -8819380 -8745353 -8665247 -8587116 -8512046 -8437485 -8367986 -8300838 -8241070
10711 -8241070 -8184834 -8126654 -8069126 -8006461 -7940482 -7876921 -7820310 -7765918 -7716965 -7675941 -7642838
10700 -7642838 -7607014 -7560490 -7511439 -7459791 -7407157 -7351130 -7290809 -7231781 -7180595 -7132639 -7081621
10689 -7081621 -7034133 -6993562 -6951193 -6905138 -6858689 -6816196 -6776477 -6737851 -6695171 -6654162 -6615434
10678 -6615434 -6574468 -6530897 -6485316 -6440756 -6401468 -6365662 -6332418 -6312702 -6323129 -6345909 -6349711
10667 -6349711 -6334282 -6315903 -6290310 -6250795 -6206243 -6167557 -6138584 -6119841 -6101113 -6073479 -6033820
10656 -6033820 -5990276 -5942956 -5900437 -5861290 -5827024 -5796834 -5770241 -5742932 -5715324 -5682984 -5650048
10645 -5650048 -5620362 -5588555 -5558411 -5532117 -5504233 -5483535 -5463530 -5440691 -5416385 -5392036 -5366972
10634 -5366972 -5344609 -5321273 -5292760 -5262596 -5232305 -5197764 -5168589 -5149560 -5134752 -5125475 -5118825 -5109334
10622 -5109334 -5093346 -5076578 -5060673 -5044791 -5028618 -5009880 -4984170 -4959018 -4933217 -4907164 -4881157
10611 -4881157 -4855730 -4834433 -4812888 -4794376 -4773250 -4750621 -4725142 -4705010 -4683522 -4663569 -4647525
10600 -4647525 -4632809 -4615739 -4597519 -4578822 -4562269 -4550597 -4539893 -4525153 -4505102 -4487137 -4471459
10589 -4471459 -4457072 -4443309 -4433108 -4423677 -4411071 -4396505 -4377798 -4357681 -4339130 -4321545 -4302624
10578 -4302624 -4283672 -4268706 -4254245 -4238650 -4224276 -4209904 -4196271 -4180085 -4161393 -4142352 -4125827
10567 -4125827 -4112638 -4099658 -4088238 -4077727 -4064654 -4051229 -4038864 -4030244 -4023469 -4018549 -4012351 -4009606
10555 -4009606 -4011106 -4003039 -3988819 -3972574 -3954171 -3941095 -3931447 -3920701 -3909007 -3895522 -3879347 -3863934
10543 -3863934 -3849566 -3831646 -3815624 -3799558 -3782313 -3766992 -3750911 -3736319 -3720858 -3704159 -3688480
10532 -3688480 -3674937 -3666191 -3658838 -3653980 -3643327 -3630573 -3618516 -3609241 -3599199 -3586033 -3573299 -3563959
10520 -3563959 -3555114 -3542172 -3531987 -3523357 -3513403 -3502702 -3489446 -3476698 -3466810 -3453640 -3439003 -3425761
10508 -3425761 -3413802 -3402680 -3390698 -3376942 -3365722 -3351789 -3336575 -3322097 -3308279 -3290873 -3276428
10497 -3276428 -3261516 -3249680 -3240036 -3229713 -3218266 -3207799 -3194919 -3184496 -3174906 -3163832 -3149776 -3138117
10485 -3138117 -3126725 -3116453 -3102372 -3086300 -3070754 -3059385 -3053921 -3054235 -3052913 -3050069 -3040185 -3024478
10473 -3024478 -3008965 -2992741 -2975545 -2957314 -2936678 -2917329 -2900428 -2887587 -2873734 -2856279 -2834474
10462 -2834474 -2809141 -2782738 -2754381 -2720161 -2684000 -2646168 -2605466 -2558655 -2508806 -2453378 -2392090
10451 -2392090 -2318542 -2228372 -2124647 -2000781 -1866719 -1789126 -1962775 -2496559 -3074826 -3549543
10441 -3549543 -3862389 -3930810 -3841942 -3707778 -3575593 -3452002 -3340468 -3262266 -3269926 -3353494
10431 -3353494 -3435271 -3500529 -3525933 -3505556 -3461539 -3415869 -3375710 -3333283 -3295257 -3262258 -3233121
10420 -3233121 -3209290 -3188727 -3169442 -3150054 -3130282 -3109522 -3087535 -3066787 -3050164 -3034038 -3019408
10409 -3019408 -3005197 -2989263 -2973400 -2959049 -2947503 -2939638 -2935173 -2930506 -2921991 -2912480 -2897870 -2878865
10397 -2878865 -2864548 -2857406 -2852812 -2846450 -2838503 -2830078 -2821602 -2811945 -2806231 -2803002 -2797965 -2792797 -2788133 -2786678
10383 -2786678 -2782890 -2777096 -2770954 -2764333 -2759320 -2756154 -2751181 -2742011 -2732696 -2722613 -2712417 -2702662 -2694296
10370 -2694296 -2684687 -2678042 -2673098 -2669069 -2668489 -2666130 -2660855 -2655708 -2649286 -2645023 -2639297 -2631722 -2621839 -2611358
10356 -2611358 -2603245 -2597845 -2592977 -2587794 -2583439 -2580197 -2574299 -2569359 -2563773 -2554984 -2548479 -2543301 -2536850 -2530650
10342 -2530650 -2525241 -2520546 -2516589 -2512288 -2509891 -2506033 -2502177 -2500720 -2496079 -2490144 -2485291 -2481519 -2475030 -2467828
10328 -2467828 -2462832 -2459384 -2451625 -2449369 -2445715 -2440864 -2438017 -2433357 -2429721 -2424383 -2418184 -2414059 -2410707 -2406435
10314 -2406435 -2402647 -2396242 -2388866 -2386197 -2381066 -2375275 -2369486 -2365615 -2361819 -2358767 -2352440 -2348424 -2344720 -2341088
10300 -2341088 -2338794 -2334847 -2330904 -2327157 -2323688 -2318461 -2313619 -2305680 -2299946 -2295148 -2290516 -2288027 -2283343 -2280995
10286 -2280995 -2280186 -2278060 -2272610 -2270995 -2270279 -2268938 -2264082 -2256941 -2252655 -2248962 -2243094 -2239319 -2232692 -2227050
10272 -2227050 -2224522 -2222317 -2218074 -2212337 -2209331 -2206197 -2201421 -2197853 -2193611 -2188804 -2184008 -2180052 -2174408 -2171257
10258 -2171257 -2170667 -2167499 -2163469 -2161683 -2159385 -2156141 -2152034 -2149428 -2147896 -2144733 -2140798 -2137889 -2135490 -2133389
10244 -2133389 -2131129 -2124016 -2118307 -2115166 -2112509 -2110116 -2106996 -2104970 -2104460 -2102288 -2099277 -2096613 -2093420 -2089099
10230 -2089099 -2083381 -2078216 -2077036 -2077619 -2076397 -2072387 -2070546 -2069256 -2066866 -2060559 -2057179 -2052912 -2048970 -2047117
10216 -2047117 -2044627 -2039887 -2036557 -2034994 -2033897 -2030141 -2024490 -2022152 -2017759 -2012711 -2009435 -2008184 -2007882 -2003883
10202 -2003883 -2001344 -1996438 -1991336 -1987723 -1984186 -1982403 -1977091 -1978945 -1975962 -1972816 -1971393 -1970853 -1966807 -1961603
10188 -1961603 -1955093 -1953240 -1950002 -1947182 -1946079 -1944860 -1944042 -1942676 -1939844 -1935503 -1932649 -1929939 -1927129 -1924922
10174 -1924922 -1921957 -1916554 -1909861 -1906676 -1900686 -1894254 -1889468 -1883524 -1877807 -1873000 -1868014 -1861457 -1853410 -1845395
10160 -1845395 -1842484 -1847287 -1864049 -1884294 -1900016 -1908245 -1910218 -1906443 -1898875 -1889920 -1887501 -1886530 -1884445
10147 -1884445 -1880486 -1874999 -1869976 -1866778 -1863215 -1861252 -1857490 -1854040 -1849749 -1845468 -1842633 -1841321 -1838080 -1836664
10133 -1836664 -1835288 -1834264 -1832933 -1829958 -1826436 -1823449 -1819115 -1814172 -1811880 -1809335 -1808517 -1807764 -1804271 -1801314
10119 -1801314 -1801301 -1798675 -1796216 -1791367 -1789648 -1786619 -1782548 -1780840 -1781809 -1780244 -1779422 -1777768 -1774637 -1772104 -1767211
10104 -1767211 -1765252 -1764209 -1760704 -1757776 -1754310 -1752222 -1753911 -1752195 -1748575 -1745226 -1743758 -1739619 -1739513 -1739929
10090 -1739929 -1737831 -1734413 -1730513 -1728381 -1728236 -1726493 -1723197 -1719624 -1715719 -1713315 -1713469 -1710958 -1708659 -1708326 -1703283
10075 -1703283 -1700209 -1698110 -1695127 -1691132 -1686371 -1685441 -1684830 -1683585 -1679426 -1676225 -1673982 -1674101 -1673702 -1671143 -1670234
10060 -1670234 -1668414 -1666737 -1664541 -1663402 -1663010 -1659702 -1656799 -1654267 -1651771 -1648938 -1647159 -1646033 -1644630 -1642597
10046 -1642597 -1641978 -1638974 -1637037 -1635618 -1633590 -1629907 -1626644 -1624389 -1619100 -1615041 -1612528 -1612991 -1613815 -1610793 -1608096
10031 -1608096 -1604341 -1603651 -1600863 -1594127 -1588861 -1585654 -1582590 -1576119 -1570950 -1563866 -1556050 -1546555 -1537970 -1537852
10017 -1537852 -1561274 -1594248 -1618083 -1635977 -1640364 -1635172 -1630521 -1623781 -1616000 -1610815 -1606409 -1602011 -1598448
10004 -1598448 -1596748 -1595719 -1592208 -1587714 -1585048 -1578934 -1573753 -1571353 -1570210 -1568127 -1567604 -1568376 -1565250 -1561903
9990 -1561903 -1557529 -1555095 -1555846 -1553169 -1551925 -1548146 -1547276 -1543132 -1539658 -1537763 -1536854 -1534717 -1534536 -1531591 -1528702
9975 -1528702 -1526686 -1524337 -1523532 -1518344 -1515278 -1511834 -1507675 -1507405 -1504082 -1501434 -1501374 -1499241 -1496402 -1492891 -1489977
9960 -1489977 -1489100 -1486082 -1484174 -1482806 -1480277 -1477143 -1474945 -1470116 -1464953 -1459000 -1453194 -1449285 -1440817 -1430658
9946 -1430658 -1422113 -1422324 -1441741 -1477381 -1507190 -1531330 -1546184 -1547151 -1538986 -1531237 -1524514 -1518578 -1511650
9933 -1511650 -1505174 -1499168 -1493566 -1489815 -1487483 -1483648 -1481356 -1478829 -1476271 -1472505 -1472655 -1472119 -1468961 -1466811 -1464220
9918 -1464220 -1460989 -1461873 -1461893 -1458701 -1456652 -1454761 -1452316 -1448922 -1447231 -1445399 -1441724 -1437978 -1434127 -1430073 -1427705
9903 -1427705 -1429784 -1432157 -1429259 -1425010 -1421966 -1421754 -1421518 -1417337 -1413918 -1412968 -1412637 -1411217 -1407511 -1405030 -1403566
9888 -1403566 -1399258 -1396098 -1395197 -1393936 -1392256 -1392471 -1393468 -1393208 -1390871 -1388396 -1388031 -1388758 -1385078 -1380366 -1379524 -1377311
9872 -1377311 -1373335 -1369218 -1366448 -1364427 -1361962 -1358286 -1354553 -1351457 -1348836 -1345557 -1339791 -1333807 -1331174 -1328257
9858 -1328257 -1326308 -1320988 -1312905 -1313214 -1329585 -1361428 -1395810 -1418031 -1428722 -1429541 -1421876 -1414410 -1405621
9845 -1405621 -1395991 -1392078 -1387612 -1382150 -1379635 -1374221 -1371804 -1370243 -1365037 -1362730 -1360475 -1356957 -1351938 -1349118
9831 -1349118 -1347225 -1344500 -1343532 -1341925 -1337735 -1332525 -1328051 -1326962 -1323881 -1321727 -1317294 -1312345 -1309333 -1305436
9817 -1305436 -1299030 -1288667 -1282492 -1279311 -1274466 -1273442 -1279730 -1299862 -1325820 -1350084 -1371134 -1382394 -1385687
9804 -1385687 -1385962 -1383835 -1379345 -1373928 -1369117 -1364389 -1358995 -1354612 -1352683 -1349645 -1345943 -1342844 -1340982 -1338456
9790 -1338456 -1334652 -1333397 -1331590 -1329252 -1326611 -1324319 -1321797 -1321504 -1321370 -1321481 -1319747 -1315599 -1310442 -1307378 -1307195
9775 -1307195 -1308186 -1306714 -1306365 -1305312 -1305048 -1302633 -1300675 -1300700 -1299508 -1297368 -1296249 -1294732 -1292210 -1289523 -1285490
9760 -1285490 -1285993 -1285633 -1284141 -1283862 -1284470 -1283590 -1282572 -1283023 -1283711 -1281054 -1277591 -1275654 -1273004 -1269118 -1266854 -1268270
9744 -1268270 -1267396 -1266339 -1266715 -1263636 -1261923 -1261675 -1260977 -1258798 -1258522 -1258997 -1257678 -1255620 -1255575 -1254201 -1251545 -1251026
9728 -1251026 -1250147 -1247965 -1248293 -1246580 -1245405 -1243679 -1241088 -1240858 -1241837 -1241741 -1239472 -1238872 -1240391 -1240805 -1236332 -1233179
9712 -1233179 -1232337 -1232654 -1233343 -1231845 -1231172 -1229121 -1228218 -1225558 -1224193 -1225129 -1225083 -1224895 -1223068 -1221622 -1217849 -1214452
9696 -1214452 -1215302 -1216873 -1216420 -1214443 -1213370 -1214430 -1213474 -1212737 -1210606 -1211011 -1212947 -1214396 -1212037 -1208505 -1206226
9681 -1206226 -1205602 -1204186 -1202954 -1201823 -1202706 -1199979 -1198771 -1199012 -1197756 -1197289 -1196454 -1195578 -1194314 -1194862 -1195664 -1196820
9665 -1196820 -1197923 -1197407 -1194998 -1193373 -1192211 -1191603 -1188103 -1188193 -1186241 -1182720 -1181584 -1180501 -1179136 -1178725 -1177329
9650 -1177329 -1176071 -1174351 -1173072 -1173969 -1172481 -1173871 -1175883 -1176444 -1174448 -1173138 -1172479 -1170779 -1170622 -1168576 -1165311
9635 -1165311 -1164510 -1164285 -1165538 -1162788 -1161064 -1159958 -1159090 -1159776 -1159235 -1159204 -1158049 -1157505 -1155349 -1152754 -1149965 -1148947
9619 -1148947 -1149954 -1151226 -1150081 -1148304 -1149722 -1149531 -1147079 -1145111 -1145323 -1143471 -1140382 -1139884 -1140411 -1142071 -1141601
9604 -1141601 -1138524 -1135681 -1136001 -1136537 -1134192 -1133766 -1134838 -1135393 -1133086 -1131034 -1128636 -1129010 -1127771 -1128039 -1127673 -1127574
9588 -1127574 -1125313 -1125563 -1124810 -1124704 -1123946 -1122034 -1120756 -1119752 -1118256 -1116641 -1118486 -1118851 -1118348 -1116855 -1114634 -1114781
9572 -1114781 -1113745 -1113945 -1113417 -1112710 -1112137 -1109013 -1109135 -1110251 -1110109 -1108440 -1106045 -1106967 -1104981 -1104272 -1102564 -1100966
9556 -1100966 -1100251 -1099370 -1096808 -1095178 -1096073 -1097127 -1097306 -1098300 -1095728 -1095516 -1098074 -1096158 -1093623 -1093560 -1093557 -1093490 -1092617 -1092746
9538 -1092746 -1089110 -1086029 -1085345 -1085053 -1086263 -1087817 -1086765 -1087820 -1088841 -1086803 -1086799 -1087956 -1086070 -1084191 -1082258
9523 -1082258 -1078621 -1078662 -1077582 -1077705 -1078874 -1078821 -1076885 -1075180 -1074760 -1072786 -1070815 -1070618 -1070944 -1069277 -1068543 -1066998
9507 -1066998 -1066686 -1066036 -1066121 -1068802 -1069946 -1067772 -1068004 -1068081 -1065209 -1062995 -1061339 -1064655 -1063512 -1058559 -1055319 -1054747
9491 -1054747 -1056099 -1056396 -1059088 -1055619 -1050903 -1050984 -1050593 -1051487 -1050363 -1050237 -1049695 -1048578 -1048587 -1046863 -1044938 -1045658 -1045251
9474 -1045251 -1044659 -1046445 -1048350 -1048191 -1047279 -1043707 -1043071 -1041342 -1039783 -1039632 -1037254 -1038426 -1039671 -1039462 -1039633 -1037746
9458 -1037746 -1032713 -1034762 -1033584 -1032283 -1033463 -1033805 -1030805 -1027362 -1028515 -1028013 -1028850 -1028924 -1028199 -1029426 -1028880 -1027304
9442 -1027304 -1025639 -1023303 -1021653 -1022065 -1019936 -1018186 -1016368 -1017573 -1018904 -1017772 -1019461 -1019576 -1018264 -1017877 -1019025
9427 -1019025 -1019208 -1018600 -1018369 -1017035 -1011893 -1010794 -1011707 -1012951 -1011145 -1008974 -1009499 -1010474 -1008995 -1006255 -1005952 -1004444
9411 -1004444 -1004682 -1005024 -1005251 -1003270 -1001088 -999122 -996964 -995401 -996972 -1000616 -1004409 -1002453 -999543 -1000873 -1000385
9396 -1000385 -1000838 -998206 -996714 -998151 -996480 -993450 -992350 -992768 -994406 -993008 -993527 -994530 -992909 -992316 -989377
9381 -989377 -986680 -986533 -988176 -989544 -986144 -984674 -984348 -982525 -983332 -983590 -983586 -984395 -981738 -982461 -981592 -980240 -979977
9364 -979977 -980376 -980137 -983053 -982602 -980301 -977752 -975782 -973457 -970406 -967347 -967548 -969502 -969177 -969873 -969473 -969492 -968085
9347 -968085 -966985 -967302 -968002 -967769 -967806 -967808 -971034 -971334 -969872 -970010 -971923 -971043 -969160 -968964 -968585 -966288 -965225 -964075
9329 -964075 -963674 -962435 -963922 -963379 -961085 -961653 -960853 -958449 -957674 -958741 -959869 -957967 -956200 -955888 -957396 -958186
9313 -958186 -955783 -956757 -957605 -957127 -957657 -958663 -956136 -954185 -954182 -953058 -949895 -948739 -945366 -943763 -942700 -943362
9297 -943362 -943866 -941677 -943269 -944873 -945211 -942755 -941107 -939300 -936565 -935905 -937028 -938179 -937324 -937562 -935937 -936232
9281 -936232 -937665 -939376 -937798 -933251 -931922 -934030 -935646 -934863 -933462 -930806 -930564 -927278 -928459 -930156 -931376
9266 -931376 -931923 -927819 -925918 -927880 -929893 -928288 -926953 -926182 -925382 -924053 -921266 -920646 -921290 -921584 -922295 -922052
9250 -922052 -920454 -918052 -914146 -912534 -910751 -912008 -913229 -913079 -914554 -913556 -914526 -912506 -912313 -913370 -910814
9235 -910814 -907854 -907419 -909077 -907964 -907543 -906938 -907220 -907251 -906415 -906246 -908212 -908164 -906535 -906333 -903456 -903131 -901244
9218 -901244 -900713 -901614 -905149 -906323 -903968 -903565 -902097 -897934 -897798 -897885 -898664 -899607 -899557 -898867 -896764 -897407 -898196 -897115
9200 -897115 -896589 -897168 -897044 -897603 -899048 -896668 -893644 -892411 -891355 -891984 -890183 -890064 -893074 -894111 -892707 -892029
9184 -892029 -891424 -889963 -890217 -888630 -887181 -884524 -883053 -884579 -885435 -885494 -884525 -882725 -882431 -880478 -880614 -883232
9168 -883232 -887307 -887051 -884682 -882526 -882460 -880020 -878116 -877142 -876837 -876896 -877593 -877177 -875651 -874890 -874618 -874356 -873194
9151 -873194 -872672 -873991 -874945 -873133 -869973 -868548 -870337 -869977 -868847 -871752 -871038 -868464 -866706 -865850 -867449 -869505
9135 -869505 -867637 -865476 -866324 -867640 -867860 -866230 -863925 -862515 -861974 -862305 -863012 -864394 -864480 -865006 -862801 -861788
9119 -861788 -859893 -859617 -860170 -858465 -858485 -858635 -857190 -858144 -859716 -857115 -857975 -856798 -855555 -853605 -850188 -851087
9103 -851087 -851957 -852387 -853315 -854599 -856739 -855374 -851741 -850834 -849407 -848605 -849328 -847361 -847916 -848192 -850086 -850784 -847760
9086 -847760 -845574 -844858 -845658 -846507 -843958 -841233 -843930 -844584 -843195 -843781 -843476 -841278 -840609 -841707 -840558 -839012
9070 -839012 -838119 -838416 -838855 -838833 -839449 -840429 -840922 -838228 -837189 -838068 -836503 -835392 -835929 -837185 -835799 -834779 -834550
9053 -834550 -836375 -837646 -836184 -831963 -833451 -832689 -830205 -829522 -827731 -829196 -829111 -827895 -826090 -825616 -826915 -825494
9037 -825494 -824457 -825182 -825718 -826562 -828655 -828770 -827329 -825577 -825310 -826500 -827420 -825938 -824020 -823040 -823331 -822137
9021 -822137 -819804 -818358 -820042 -821427 -819068 -818512 -817793 -818389 -819284 -817216 -816830 -815443 -813919 -814367 -814251 -812154
9005 -812154 -811311 -811559 -810281 -810358 -809757 -810852 -812192 -812331 -811664 -806751 -804626 -806975 -808046 -808879 -810302 -807733
8989 -807733 -805985 -806982 -806803 -804918 -803814 -804294 -804537 -804013 -804829 -806602 -805945 -804815 -802271 -799842 -799583 -800866
8973 -800866 -802098 -802990 -803767 -802005 -797625 -796537 -796789 -795574 -793562 -794511 -794799 -794195 -793206 -794710 -794597 -791874
8957 -791874 -790319 -791382 -792408 -792198 -790222 -789006 -790123 -790286 -789646 -787667 -785797 -788117 -792783 -792505 -789733
8942 -789733 -789478 -789183 -788435 -786216 -786471 -785533 -783926 -784405 -783729 -781008 -782507 -781416 -780385 -781010 -780662 -778572 -776354
8925 -776354 -777854 -777221 -775770 -777240 -778844 -779302 -777284 -770267 -770756 -772681 -768393 -765632 -764485 -764836 -764260 -760888
8909 -760888 -757986 -760144 -767867 -776205 -781817 -783856 -783756 -784302 -783535 -783914 -783590 -782079 -781773 -780657 -780858 -780427
8893 -780427 -775771 -774186 -773653 -772990 -772194 -768673 -766583 -766533 -768737 -768001 -765257 -764613 -766146 -764674 -763386 -763294 -761478
8876 -761478 -760623 -759933 -757136 -753894 -753692 -751823 -749114 -748696 -747783 -746990 -746481 -746183 -747782 -749576 -753779 -763377
8860 -763377 -771992 -779921 -783487 -782744 -782273 -781250 -779163 -775420 -771904 -770052 -769027 -767618 -763983 -762548 -762348
8845 -762348 -761843 -760303 -759611 -758115 -757389 -755243 -754024 -753910 -753803 -753348 -753662 -751608 -748379 -747653 -746081 -744609
8829 -744609 -744314 -743418 -743590 -743328 -742150 -740746 -740303 -740479 -738718 -737852 -735882 -733578 -735782 -743092 -752935 -759448
8813 -759448 -764594 -764473 -761863 -760543 -757206 -753937 -753561 -751855 -750678 -753616 -753487 -751236 -750282 -748478 -747383
8798 -747383 -747445 -745170 -743319 -741834 -743447 -744325 -743275 -741867 -742171 -740805 -738722 -739667 -740537 -739085 -738957 -741875
8782 -741875 -742406 -739191 -736439 -736944 -738911 -738235 -735406 -731475 -729824 -728105 -729546 -729591 -728244 -729605 -730066 -728578
8766 -728578 -730192 -732469 -731608 -730504 -729639 -727438 -729585 -730269 -733293 -736558 -735033 -732177 -732561 -732639 -729930 -729434
8750 -729434 -729543 -729349 -727123 -726102 -725942 -722854 -721737 -720003 -717440 -716341 -716078 -716733 -715135 -714593 -715279 -713751
8734 -713751 -713933 -713901 -714552 -713135 -710126 -710426 -710728 -706571 -703774 -703097 -703138 -702841 -702723 -704048 -704488 -706198 -709346
8717 -709346 -709406 -713643 -716010 -716896 -717771 -717476 -715527 -714724 -714280 -711990 -709371 -709564 -708914 -709660 -705278 -703300 -703615
8700 -703615 -703924 -702749 -703468 -700862 -699260 -696564 -694616 -691912 -687493 -686551 -686916 -687023 -687047 -689900 -694368 -699523
8684 -699523 -699519 -693132 -686903 -684604 -684844 -681594 -677826 -673463 -674733 -678342 -682256 -686761 -689443 -686817 -683026
8669 -683026 -682797 -688489 -693255 -695841 -698019 -699313 -700003 -697619 -693014 -685330 -678436 -675104 -670764 -667749 -665649
8654 -665649 -665427 -667715 -673556 -680494 -685329 -686741 -686939 -684087 -680339 -678463 -682579 -689931 -695516 -702578 -710219
8639 -710219 -712805 -714174 -716768 -718664 -717676 -713005 -707893 -703189 -701228 -700893 -697312 -695460 -691657 -685360 -680556
8624 -680556 -683822 -694562 -710000 -721426 -726456 -726096 -721246 -719004 -715380 -709915 -701903 -694715 -689656 -682763
8610 -682763 -673658 -668360 -675411 -695987 -712881 -723485 -727431 -726125 -720855 -714547 -710957 -708410 -704460 -701424
8596 -701424 -699411 -696291 -695102 -700671 -712614 -723311 -732218 -736542 -735010 -729152 -722153 -715384 -710242 -704679
8582 -704679 -700352 -695991 -695175 -698096 -702625 -705892 -709538 -710862 -709990 -705197 -699929 -696069 -691648 -685396 -678793
8567 -678793 -675509 -669588 -662514 -658973 -658612 -664341 -669180 -671670 -671533 -665494 -653463 -639667 -624831 -614013
8553 -614013 -613628 -628351 -645675 -662429 -688491 -723033 -757081 -787083 -806074 -808584 -799572 -790009 -778600
8540 -778600 -766283 -756943 -749224 -743955 -738556 -734382 -730309 -722890 -717434 -713656 -711772 -711138 -706811 -702714
8526 -702714 -698165 -692119 -688494 -686911 -683441 -677367 -673749 -670904 -663589 -657633 -652887 -643331 -636855 -626781
8512 -626781 -610400 -589704 -571354 -567717 -596653 -649316 -694038 -735853 -772439 -799230 -815787 -826434
8500 -826434 -829215 -820940 -811463 -800256 -791160 -785101 -777240 -767612 -759557 -755212 -753445 -749452 -745885 -742910
8486 -742910 -740639 -736187 -733213 -731101 -727161 -721520 -718449 -716313 -716485 -714002 -711978 -709861 -706092 -700441 -698646
8471 -698646 -696664 -690502 -683204 -677335 -670478 -661841 -656732 -662933 -684744 -711595 -734224 -752288 -762768
8458 -762768 -764374 -761152 -758113 -756090 -752484 -749128 -744311 -741743 -741616 -739241 -734341 -731935 -730007 -729096 -727380
8443 -727380 -722873 -719003 -716514 -717571 -718128 -716255 -714161 -712797 -712210 -708437 -706010 -706872 -707356 -708519 -710795
8428 -710795 -711335 -710138 -708368 -706617 -705262 -704702 -704860 -705157 -704505 -702529 -702552 -703124 -704433 -705065 -702059 -700374 -701663
8411 -701663 -698465 -697024 -698237 -698352 -696054 -692696 -689778 -688263 -690706 -690283 -689462 -692495 -692907 -689075 -686891
8396 -686891 -687918 -688982 -687499 -688306 -689277 -688861 -688021 -688955 -686546 -684445 -685008 -685146 -684470 -683753 -682980 -685402 -685526
8379 -685526 -684773 -682025 -679800 -680369 -680375 -681900 -681018 -681027 -681360 -680602 -679677 -678469 -678212 -678364 -676397 -676129 -673813 -672671
8361 -672671 -673651 -674316 -672360 -670380 -669686 -671136 -672747 -675425 -675387 -674200 -671471 -669382 -671536 -670821 -669190 -669584
8345 -669584 -672490 -671765 -671970 -673381 -671444 -669174 -669073 -667693 -665602 -666189 -671636 -671834 -668296 -665537 -664627 -666110
8329 -666110 -668032 -667413 -667020 -667559 -668057 -666798 -666759 -665934 -664619 -664501 -665025 -665130 -666263 -664410 -663167 -661187 -659884
8312 -659884 -660552 -661474 -660967 -658497 -656949 -654625 -653283 -654191 -656119 -657361 -658983 -659197 -660417 -659308 -657514 -657149
8296 -657149 -657299 -657667 -658143 -659196 -658606 -654885 -655320 -656591 -657298 -658100 -658411 -657424 -654559 -653011 -654547 -653615 -654127
8279 -654127 -653776 -652269 -651032 -650757 -650105 -652549 -652324 -650025 -649053 -647430 -645014 -645070 -645557 -644200 -643469 -643513 -646080
8262 -646080 -647673 -647588 -645947 -645985 -645807 -647347 -647910 -649215 -648336 -646466 -647064 -646227 -645760 -645726 -648490 -651350 -649104
8245 -649104 -647149 -644818 -641280 -640405 -639767 -640490 -640403 -641017 -640730 -641287 -643906 -644970 -643779 -641934 -640791 -638137
8229 -638137 -635810 -637030 -637485 -638777 -639691 -637348 -637018 -636784 -639074 -639544 -637912 -635742 -635994 -635937 -636635 -638771 -637531
8212 -637531 -636275 -637526 -635903 -635115 -633283 -629668 -627009 -626010 -629770 -634263 -635558 -637812 -638244 -637086 -636687
8197 -636687 -635062 -631805 -633085 -633338 -631907 -628800 -629794 -630788 -630969 -629054 -629373 -626722 -626192 -628485 -631537 -629909
8181 -629909 -629495 -629584 -630510 -631103 -631486 -631045 -629064 -628804 -628534 -627265 -627949 -627020 -626459 -627879 -626912 -625834 -625458 -625384
8163 -625384 -627793 -626065 -626038 -625514 -625305 -622246 -621242 -624529 -625032 -623438 -622031 -621618 -621959 -620950 -623044 -622112
8147 -622112 -625153 -624882 -622081 -622385 -621852 -620910 -619340 -620190 -619088 -617973 -619002 -618961 -617091 -615789 -615221 -614169
8131 -614169 -616419 -617329 -618009 -619033 -619020 -617737 -618362 -615189 -613610 -615820 -617413 -617488 -615033 -614828 -614489 -615020 -615136
8114 -615136 -615880 -616234 -616035 -618205 -616515 -617327 -617293 -614645 -613630 -613362 -614772 -614157 -611850 -610685 -610583 -611703 -611577
8097 -611577 -612202 -610250 -611776 -613045 -613161 -615120 -613213 -613128 -612457 -610137 -607205 -607086 -608110 -609783 -609343 -610419
8081 -610419 -609406 -608153 -608158 -606214 -605627 -605229 -607136 -608048 -607360 -610895 -612838 -612423 -611844 -611870 -610168 -609731 -609958 -609170
8063 -609170 -609075 -607506 -605977 -605071 -604793 -602980 -604245 -603731 -604162 -603384 -603318 -604278 -603826 -601136 -602880 -605265 -606357
8046 -606357 -606627 -606600 -606379 -603902 -603184 -604726 -605986 -607221 -609713 -608579 -607226 -606157 -606916 -609123 -607640 -605857
8030 -605857 -605507 -605494 -604795 -604763 -604650 -603919 -602615 -602004 -602108 -602652 -604412 -603219 -603451 -604201 -601312 -599802 -602169 -600424
8012 -600424 -599862 -599464 -599856 -599905 -599379 -600152 -602552 -602244 -602080 -602384 -600876 -601611 -603249 -602918 -602227 -603547 -603625 -602632
7994 -602632 -604673 -607807 -605513 -602720 -601584 -600765 -599272 -600378 -602547 -602548 -600061 -595497 -596275 -599259 -601440 -599348
7978 -599348 -598694 -596765 -595341 -595252 -599051 -600452 -600029 -598044 -597154 -597951 -601624 -600666 -598771 -597558 -597161 -598023 -597369
7961 -597369 -598603 -597542 -598045 -599342 -597657 -597168 -597243 -598708 -597706 -597647 -596923 -596386 -597886 -598367 -596310 -595127 -592756
7944 -592756 -592135 -593286 -592862 -593163 -593161 -591638 -593551 -594426 -594538 -595104 -595433 -594072 -595056 -594568 -596466 -595577 -594859 -595316
7926 -595316 -594909 -595614 -595261 -593667 -589525 -588411 -588832 -590146 -590646 -588700 -586840 -588346 -587767 -588577 -589214 -588671 -589325
7909 -589325 -589671 -589491 -585823 -584207 -585161 -587045 -587293 -585620 -584456 -585465 -586623 -589283 -590209 -589376 -588136 -588075
7893 -588075 -587967 -587065 -587234 -588398 -589184 -588353 -585991 -586909 -587585 -584383 -585533 -584973 -585569 -586360 -585799 -586920 -587344
7876 -587344 -588313 -586335 -584577 -582646 -583657 -583032 -581128 -579725 -579580 -579821 -578192 -576440 -576507 -574980 -574232 -574148 -576092
7859 -576092 -578728 -578495 -577353 -576197 -576652 -577263 -575717 -575681 -574837 -575078 -575387 -574192 -571904 -571707 -573674 -576137 -575086
7842 -575086 -572696 -574587 -575816 -576271 -576055 -574832 -572546 -572929 -573417 -571306 -570675 -571165 -571983 -573133 -572592 -570182
7826 -570182 -570132 -570453 -570027 -570712 -572631 -574594 -574816 -574092 -570804 -569406 -568533 -567201 -567011 -567682 -567765 -567308 -568488 -568418
7808 -568418 -569488 -568764 -570081 -570469 -567039 -565654 -566719 -568315 -569133 -569375 -569302 -570488 -571599 -569203 -569186 -572149
7792 -572149 -572163 -569412 -567150 -562316 -560573 -563689 -564367 -566211 -567614 -565360 -568895 -570591 -568973 -568200 -566897
7777 -566897 -564767 -565132 -565364 -565363 -565214 -564522 -562761 -564252 -563200 -560180 -560494 -562760 -563625 -564611 -565440 -562146 -560449
7760 -560449 -561005 -561728 -560440 -561356 -562414 -561719 -559305 -560285 -561926 -563131 -563152 -561435 -562016 -560891 -557515 -557723 -557946
7743 -557946 -558252 -558140 -560581 -562454 -562465 -563337 -561993 -561656 -562823 -560934 -560410 -559101 -558316 -559671 -557742 -556726
7727 -556726 -559533 -558125 -557915 -555648 -556767 -556438 -554928 -553207 -552589 -554637 -555722 -555164 -555262 -556002 -554693 -553679
7711 -553679 -553104 -553056 -552338 -554476 -557304 -557413 -557251 -556891 -555584 -555240 -556119 -553447 -553018 -552122 -553840 -555550 -554506
7694 -554506 -552884 -552066 -551712 -550347 -551202 -550969 -549815 -548364 -551237 -553742 -555401 -555801 -553320 -552132 -552537 -551089
7678 -551089 -550202 -548850 -548604 -548987 -547377 -546931 -545767 -545387 -545492 -546790 -549975 -549863 -548826 -550285 -552146 -552941
7662 -552941 -553051 -552246 -550825 -548942 -548222 -550653 -552466 -553005 -553878 -552474 -548678 -548515 -546359 -544952 -545445 -548614
7646 -548614 -550804 -550616 -551539 -550831 -549205 -548182 -547423 -548707 -549948 -548842 -546196 -545585 -546089 -546490 -544767 -544003
7630 -544003 -542401 -543332 -541818 -540239 -541494 -542663 -542903 -540134 -539623 -540854 -539720 -537757 -536925 -537518 -537169 -539262
7614 -539262 -541501 -541274 -544839 -545984 -544068 -542882 -540901 -541503 -542438 -543735 -542671 -540783 -541252 -541280 -537799 -535714
7598 -535714 -535113 -535874 -537963 -538517 -540205 -540330 -538518 -538588 -540352 -539354 -536480 -537215 -537427 -536269 -535338 -535328 -535418 -537330
7580 -537330 -535110 -534059 -535666 -536854 -538117 -538344 -540745 -540004 -539207 -538955 -540862 -538605 -536189 -534278 -532640
7565 -532640 -532825 -534449 -533364 -533347 -532617 -532134 -532612 -531542 -531022 -534138 -536706 -535973 -533518 -531526 -530934 -530461 -532129
7548 -532129 -530501 -531969 -532164 -530966 -531700 -533374 -533361 -534052 -533560 -532267 -529061 -526700 -526816 -530502 -533804 -533128
7532 -533128 -530817 -530643 -531417 -529443 -531331 -530336 -530544 -529775 -529438 -527562 -526201 -526167 -528062 -529320 -528936 -529281 -530118
7515 -530118 -530525 -529721 -529308 -529929 -528955 -529731 -532140 -529293 -527774 -525865 -525903 -527168 -527204 -527154 -528401 -526807 -526625 -529415
7497 -529415 -530159 -527519 -526071 -525023 -525751 -522824 -522613 -521896 -521800 -523913 -524337 -523048 -520699 -520577 -523620 -525122
7481 -525122 -525880 -527237 -526782 -527524 -525857 -524166 -523965 -523465 -525267 -526313 -529799 -529057 -525255 -522988 -521847 -521592
7465 -521592 -521236 -520385 -519679 -521204 -521568 -519747 -519236 -520663 -522219 -523173 -522369 -520550 -519310 -519410 -519057 -519801 -521985
7448 -521985 -523730 -525248 -524556 -522619 -521397 -520653 -520373 -519206 -516970 -515963 -517381 -519960 -520618 -520056 -520588 -518746
7432 -518746 -518084 -519163 -518486 -518589 -521110 -522125 -519316 -518165 -519642 -520484 -518152 -517770 -517787 -518193 -517789 -516073 -515137
7415 -515137 -514492 -513881 -514695 -515056 -515064 -516013 -517517 -519082 -519249 -517277 -515328 -515468 -516274 -517344 -516163 -519414 -520267
7398 -520267 -518612 -517274 -516553 -516122 -514763 -513306 -514126 -516070 -517548 -516427 -514893 -515155 -513675 -513038 -511038 -508448
7382 -508448 -508188 -508996 -509693 -511536 -511825 -511550 -510566 -509528 -508652 -509263 -510134 -511226 -511094 -510749 -510760 -511291 -510166 -511293
7364 -511293 -509531 -510578 -511895 -510805 -510844 -510764 -509823 -510001 -508846 -509479 -509180 -510144 -512956 -512819 -510877 -510034 -509762
7347 -509762 -509019 -509077 -510313 -511228 -511344 -511107 -510778 -508448 -508905 -507693 -505525 -503672 -504462 -505622 -504918 -503370 -505662
7330 -505662 -506798 -507587 -506455 -507305 -504831 -501828 -500839 -502923 -502933 -502176 -501259 -503195 -505437 -504557 -504542 -504033 -504472
7313 -504472 -504895 -503027 -501017 -502252 -505033 -507767 -506579 -502767 -502088 -501088 -500753 -504180 -504104 -501645 -500949 -501531
7297 -501531 -502115 -500653 -501132 -502385 -501412 -499839 -500300 -503441 -504837 -505755 -506629 -504812 -502669 -503826 -504161 -502978
7281 -502978 -502740 -500203 -498908 -497915 -497095 -497322 -498645 -498959 -500326 -501973 -503922 -505243 -504459 -500687 -499492 -499141
7265 -499141 -497219 -498423 -497202 -495967 -495681 -494279 -493919 -494656 -495394 -496063 -496740 -499133 -499229 -497946 -496595 -498937
7249 -498937 -499234 -499269 -499529 -499739 -499734 -499274 -496812 -495280 -495617 -496317 -497775 -497429 -495643 -493107 -492533 -491985 -490368 -491924
7231 -491924 -492301 -491823 -491672 -490248 -490604 -493983 -492124 -492659 -494762 -493750 -490903 -490427 -491599 -492452 -493021 -493209 -492880
7214 -492880 -490958 -493355 -493584 -492933 -489852 -487490 -489462 -489677 -489630 -488497 -491066 -493851 -494433 -492542 -491833 -490528
7198 -490528 -491176 -491964 -493665 -493077 -492964 -493242 -493659 -495204 -493202 -492707 -492201 -490735 -489059 -489108 -487341 -486602 -487153
7181 -487153 -487734 -488111 -487392 -490205 -490764 -490940 -491520 -492701 -490691 -489107 -488431 -484795 -485415 -486604 -486170 -486728 -487417
7164 -487417 -486703 -484992 -486391 -487782 -486435 -485069 -484678 -484545 -485185 -485692 -485558 -483878 -484985 -486935 -487524 -485488
7148 -485488 -485044 -488954 -489655 -490445 -491364 -489409 -485403 -483069 -480667 -483494 -486769 -487822 -487376 -487402 -486922 -485003
7132 -485003 -485222 -483362 -482666 -481509 -478719 -479702 -480229 -479024 -479088 -480860 -482770 -485653 -486703 -484964 -483490 -484767
7116 -484767 -484105 -481267 -481330 -480254 -481362 -483248 -482990 -480944 -480791 -481714 -482279 -483750 -485239 -485524 -482740 -481023
7100 -481023 -480168 -481037 -482333 -482362 -480038 -478626 -480848 -480491 -478778 -478932 -479297 -477838 -477581 -479033 -483163 -485775
7084 -485775 -482271 -479113 -478404 -478299 -478572 -479273 -479485 -479906 -482802 -481502 -481628 -483945 -483950 -480214 -480244 -479853 -478689 -479277
7066 -479277 -479106 -479347 -479232 -480482 -479044 -477937 -477254 -476973 -477659 -479155 -479950 -478901 -478830 -477799 -478652 -477165 -477041
7049 -477041 -480053 -477870 -476883 -478051 -478894 -477166 -474911 -472459 -475469 -478551 -477790 -478881 -476936 -474986 -474391
7034 -474391 -475243 -477549 -478132 -475709 -474992 -476920 -478300 -476120 -471927 -471076 -476944 -478415 -478972 -477677 -477552 -474896
7018 -474896 -473279 -473704 -473309 -474849 -474261 -471921 -471722 -470660 -468717 -466273 -466556 -467131 -469557 -471325 -469712 -470524
7002 -470524 -470311 -472772 -474862 -472206 -471929 -471307 -471592 -472474 -472466 -473083 -471191 -472208 -471989 -472544 -472300 -470973 -470532 -469934
6984 -469934 -469640 -470415 -470090 -468623 -467685 -469263 -471792 -472988 -472459 -471339 -471917 -470866 -468647 -467277 -466884 -464999
6968 -464999 -464842 -463968 -465628 -468558 -470506 -468796 -466362 -467037 -467962 -468330 -469414 -470137 -469549 -465261 -463702 -464257
6952 -464257 -467125 -467339 -468520 -466084 -465333 -464677 -464694 -467871 -469436 -466951 -467194 -469059 -468435 -468889 -469394 -468947 -467022
6935 -467022 -467380 -466336 -465178 -468191 -467978 -464315 -462081 -461254 -462790 -464069 -463736 -462130 -463253 -462828 -463291 -465586
6919 -465586 -465034 -464480 -463636 -465935 -466794 -465095 -464841 -463861 -464336 -464204 -462336 -461463 -461839 -462834 -464691 -463430 -460877
6902 -460877 -459280 -459991 -460806 -460142 -459601 -460734 -460662 -460299 -460130 -461097 -463290 -462254 -462366 -460218 -460765 -461168 -460927 -462582
6884 -462582 -464402 -464748 -463587 -461699 -458308 -460865 -462684 -464306 -463338 -462003 -459208 -458809 -460341 -459330 -458163
6869 -458163 -456542 -458129 -460404 -460052 -459302 -459030 -460135 -461680 -461641 -461507 -462462 -461267 -462384 -460463 -459170 -459087 -459136
6852 -459136 -458827 -459384 -459535 -458934 -458279 -458800 -457101 -455632 -453891 -453863 -455721 -456637 -456793 -458803 -463359 -463109 -459349
6835 -459349 -457745 -458338 -459638 -458377 -458514 -458928 -456653 -455135 -454245 -454199 -453298 -453681 -454373 -454978 -452608 -452948 -453786
6818 -453786 -452058 -452166 -454086 -452238 -452407 -453985 -452073 -450625 -450144 -451300 -450976 -451087 -451690 -450984 -453877 -456141
6802 -456141 -457545 -456910 -458213 -459151 -459660 -458042 -456779 -456805 -457627 -458249 -457768 -457752 -455812 -456967 -457288 -454112 -452904
6785 -452904 -456778 -459350 -457734 -456131 -455395 -452804 -449896 -449446 -450965 -454906 -455291 -456967 -454572 -451513 -449265
6770 -449265 -448878 -447875 -444448 -442311 -444529 -446638 -450675 -452111 -452416 -452210 -453283 -454506 -455203 -453232 -452768 -452808
6754 -452808 -450407 -449941 -449846 -451555 -452463 -452257 -450793 -449683 -451898 -454369 -454456 -453124 -449588 -449287 -449616 -449597 -447980
6737 -447980 -446478 -447251 -446654 -448345 -449129 -447474 -446708 -447656 -447679 -448627 -447806 -446621 -447920 -449729 -449691 -449427 -449804 -449035
6719 -449035 -450004 -448862 -448303 -450869 -449602 -447972 -447024 -447176 -446223 -445809 -447137 -446271 -445617 -446754 -448158 -447957 -449226
6702 -449226 -449838 -449761 -447719 -444843 -445605 -445759 -445287 -445401 -444863 -446042 -446148 -446381 -447830 -445547 -444820 -444810 -442738 -443170
6684 -443170 -444069 -443966 -445903 -444805 -443202 -444357 -444701 -444647 -442393 -446156 -448537 -444719 -443312 -443603 -440642 -439427
6668 -439427 -441497 -442691 -443661 -443910 -443899 -443165 -441542 -440416 -440463 -441434 -440926 -438205 -438477 -441415 -444160 -443523 -440484
6651 -440484 -439378 -440076 -440155 -441122 -440780 -442363 -443008 -441029 -439527 -439891 -440042 -440929 -440637 -439843 -440264 -441418 -439062
6634 -439062 -438159 -440035 -443028 -440246 -439014 -439542 -439528 -439037 -439033 -442101 -441218 -436841 -434895 -432420 -433372 -434749 -433513
6617 -433513 -435789 -439321 -441111 -441021 -441926 -442868 -441523 -441592 -440393 -436113 -435685 -436428 -436082 -435926 -435753 -435302 -435491 -436175
6599 -436175 -437253 -438562 -438067 -434547 -431729 -433404 -435253 -438042 -436364 -436230 -436043 -437049 -436796 -439119 -440552
6584 -440552 -440350 -437434 -436947 -437266 -438101 -438521 -440040 -439845 -439956 -438147 -436059 -437389 -437841 -438860 -439012 -435733 -432642
6567 -432642 -431461 -430480 -432119 -433445 -432761 -432473 -431875 -431976 -435446 -438498 -437110 -435296 -436784 -434980 -433826 -434813
6551 -434813 -438988 -438351 -435800 -433740 -434095 -434095 -434180 -435191 -436671 -437172 -435375 -435155 -434394 -433422 -430620 -429497 -430357
6534 -430357 -432232 -431647 -430827 -431041 -430033 -430741 -431610 -431845 -432782 -433939 -433509 -432087 -430972 -432052 -432247 -434029 -431510
6517 -431510 -429981 -431244 -430681 -430159 -430233 -432247 -431444 -430377 -429557 -429548 -429733 -429269 -428828 -428913 -431314 -431738 -431272 -430022
6499 -430022 -429122 -430005 -432211 -432683 -433293 -432168 -431484 -432387 -432365 -430685 -429067 -428244 -428003 -426979 -428138 -430531 -432306
6482 -432306 -431935 -430874 -429421 -429574 -427685 -428231 -427471 -425706 -423880 -421223 -423273 -425914 -428019 -428770 -428128 -427985
6466 -427985 -429765 -427909 -425764 -422279 -421838 -424688 -426618 -429320 -431501 -430584 -428707 -428165 -427662 -426226 -425850 -426728
6450 -426728 -426894 -426077 -427125 -430645 -430554 -429778 -428720 -427852 -426353 -424198 -422746 -422609 -422704 -423157 -426207 -424122 -424780
6433 -424780 -424912 -423203 -424223 -424866 -423896 -424662 -423450 -422945 -424095 -425428 -428178 -428731 -425935 -424022 -421869 -419809
6417 -419809 -421642 -419739 -418175 -418368 -420901 -422174 -419562 -419245 -420323 -420401 -421192 -422426 -422400 -420743 -422459 -422221
6401 -422221 -422425 -422785 -422348 -423364 -424052 -425382 -425069 -424192 -421770 -422665 -423580 -423100 -424180 -425359 -424529 -422170 -421951
6384 -421951 -422509 -425948 -425308 -424186 -421412 -420215 -420319 -419523 -419459 -420199 -418807 -420109 -421464 -420995 -420825 -420229 -420042
6367 -420042 -420389 -420805 -416968 -418357 -419656 -418725 -418955 -420185 -418910 -416661 -416834 -418338 -420461 -420605 -420926 -420064
6351 -420064 -419112 -419053 -418427 -418821 -416641 -415941 -417286 -420917 -420377 -418081 -415998 -417843 -417102 -419065 -419691 -419305 -420825
6334 -420825 -421873 -418996 -418594 -418233 -416641 -414621 -415147 -413953 -413687 -413550 -413327 -413552 -415263 -415675 -417373 -417170 -416289
6317 -416289 -414022 -411562 -411959 -412495 -413301 -414943 -418198 -417158 -412571 -412526 -413995 -413834 -413425 -413843 -414157 -413671 -414593
6300 -414593 -415371 -413670 -414184 -415028 -414683 -412165 -410818 -410474 -412423 -415122 -414507 -413382 -414540 -414890 -413041 -413276
6284 -413276 -412591 -410119 -411171 -412050 -413170 -414741 -415727 -414384 -414928 -414164 -413536 -413988 -414285 -416357 -416339 -415040 -415707
6267 -415707 -416247 -416450 -415796 -413517 -413206 -412503 -411756 -412484 -411975 -412673 -413982 -413920 -411954 -412409 -411336 -411719 -411193 -411313
6249 -411313 -409315 -408249 -410346 -411103 -410670 -410097 -413645 -414565 -414112 -413600 -413390 -410242 -409507 -408938 -410159 -411861 -408630
6232 -408630 -407505 -409941 -411160 -412451 -412366 -411988 -411764 -410990 -409213 -409493 -408925 -409152 -409344 -409698 -408541 -407064 -407588
6215 -407588 -408374 -406559 -406733 -409312 -412006 -412625 -410999 -408410 -409677 -408909 -408567 -409504 -411827 -412573 -411094 -407460
6199 -407460 -406027 -409011 -409757 -407016 -403995 -406165 -406945 -405906 -407584 -410233 -408614 -406743 -405149 -406453 -405680
6184 -405680 -406082 -406170 -406151 -406549 -401976 -405131 -410721 -410955 -410407 -408590 -407223 -404931 -403025 -405408 -405246 -404268 -403374
6167 -403374 -404238 -404040 -404401 -406063 -406281 -406121 -406821 -408495 -406817 -403052 -400808 -400168 -402177 -403437 -403093 -402596 -401944
6150 -401944 -404619 -408405 -411182 -410308 -407078 -406045 -406112 -403954 -399440 -399727 -401129 -403038 -403939 -404172 -404433 -403729
6134 -403729 -403315 -403909 -403982 -401882 -402124 -401747 -401083 -401199 -401108 -400995 -400247 -400203 -400289 -399794 -399931 -403713 -403953 -401280 -398379
6115 -398379 -397643 -399188 -396009 -396881 -398001 -398218 -398001 -396885 -399078 -401611 -400914 -398039 -395153 -395746 -397638 -399116
6099 -399116 -400527 -401192 -401535 -401231 -401391 -403117 -403396 -401519 -400089 -399030 -398308 -398647 -397705 -397444 -399088 -400014 -402064
6082 -402064 -402173 -400329 -400429 -401864 -400506 -398705 -399019 -398798 -397846 -397993 -398207 -399411 -399260 -399510 -401014 -398612 -397023
6065 -397023 -397253 -397856 -397606 -397559 -398207 -397591 -397267 -397902 -400033 -401360 -401539 -401697 -398242 -396543 -398131 -401103 -402304
6048 -402304 -400416 -399229 -399335 -397346 -395057 -396747 -398155 -397087 -397474 -398755 -398228 -399794 -400107 -398886 -398936 -396837
6032 -396837 -393990 -394075 -394713 -397110 -397877 -399061 -398173 -397832 -398140 -397459 -395732 -395428 -397436 -398637 -399342 -399997 -399325
6015 -399325 -399304 -397225 -397591 -398698 -397543 -394396 -394623 -396528 -396025 -396102 -395432 -396490 -395494 -394510 -393607 -391856 -391038
5998 -391038 -392272 -393892 -392903 -393884 -396037 -395312 -391629 -387997 -389817 -392156 -394181 -394370 -392865 -392891 -394150 -396211
5982 -396211 -397336 -396063 -395663 -395571 -394751 -395085 -395870 -395383 -393863 -394441 -395300 -394546 -392095 -390780 -391997 -395300 -393734
5965 -393734 -392158 -393900 -391656 -389433 -387713 -389226 -391722 -390884 -391454 -389187 -387902 -389200 -390542 -393217 -394915
5950 -394915 -394996 -394198 -393025 -393977 -394634 -392882 -392595 -392113 -391743 -393734 -395012 -394800 -394314 -394067 -392520 -391668 -390863 -392298
5932 -392298 -393762 -392501 -390517 -391980 -394803 -394527 -393655 -391368 -389354 -390632 -390809 -390667 -389100 -386482 -386096 -388334
5916 -388334 -389005 -388685 -389108 -389131 -390658 -389936 -389513 -389345 -389421 -389300 -388935 -388421 -387584 -387507 -388837 -388812 -386442 -385209 -386224
5897 -386224 -386955 -388041 -389919 -390459 -391036 -391937 -389762 -389164 -384938 -382258 -384286 -386014 -387707 -387468 -388197 -386767
5881 -386767 -385232 -384367 -382751 -381829 -382729 -384553 -384281 -385441 -386632 -388752 -387390 -387949 -388040 -387745 -388859 -390102
5865 -390102 -387687 -385969 -386972 -390039 -390411 -390108 -391136 -390779 -387839 -386568 -387570 -387509 -383445 -382201 -383353 -380967
5849 -380967 -380435 -382572 -382779 -384519 -388046 -388174 -388335 -388062 -385728 -386458 -386383 -386960 -386901 -385188 -385113 -383197 -382816 -384629
5831 -384629 -385376 -385317 -383653 -384054 -386460 -388150 -385880 -383785 -383072 -381797 -381048 -382103 -382988 -384003 -383529 -384121 -383857
5814 -383857 -383011 -382243 -380861 -379499 -378586 -378442 -379138 -379281 -379774 -382739 -385123 -387181 -385953 -384438 -384823 -382813
5798 -382813 -383062 -384246 -386016 -386214 -384722 -382924 -380458 -379874 -380408 -381738 -381658 -379169 -377731 -377963 -381068 -381720
5782 -381720 -382921 -382155 -381838 -380000 -378203 -378283 -379553 -380106 -381786 -383486 -382797 -380489 -380330 -380752 -378846 -379057 -380147
5765 -380147 -380082 -381751 -384203 -385052 -386320 -385695 -383562 -381595 -380401 -382331 -383699 -383222 -380839 -378765 -378400 -377116
5749 -377116 -377110 -376697 -376001 -378657 -379954 -378132 -378277 -379869 -378474 -375948 -374558 -375169 -375665 -375393 -376400 -377969 -381655
5732 -381655 -384552 -382342 -379300 -379368 -380729 -378866 -377402 -377292 -376475 -375818 -377696 -380790 -379105 -378431 -378137 -377422
5716 -377422 -377161 -378271 -378358 -377611 -376617 -375852 -375557 -376210 -378658 -380658 -377995 -376499 -377155 -379668 -380107 -379633 -379045
5699 -379045 -377831 -375566 -376453 -376113 -375209 -374457 -374141 -376128 -377892 -378798 -379362 -379288 -379853 -377996 -374937 -373833 -374468
5682 -374468 -371885 -373007 -377389 -378471 -379137 -380735 -380618 -378732 -374654 -372646 -373202 -373912 -377285 -376435 -373773 -374395
5666 -374395 -373995 -375044 -375172 -374639 -373913 -373293 -376026 -378747 -377869 -377071 -375487 -374973 -375326 -375961 -374642 -375301 -374721
5649 -374721 -375116 -373307 -373645 -374045 -372654 -371268 -371314 -372076 -373653 -373674 -373812 -373886 -372907 -371789 -372788 -374363 -372994 -373309
5631 -373309 -372792 -374332 -375280 -374524 -373276 -373291 -373018 -372781 -372830 -371096 -369947 -370322 -370897 -370047 -369961 -371805 -371470 -371586
5613 -371586 -373320 -374634 -374746 -373336 -373299 -374546 -371738 -370653 -371252 -375544 -376964 -375626 -376562 -377106 -375622 -374093
5597 -374093 -375390 -373377 -373478 -374613 -373533 -371844 -373958 -375483 -372089 -370484 -370072 -371235 -372469 -371292 -370651
5582 -370651 -368028 -369720 -372134 -372766 -371936 -370997 -370998 -370543 -369758 -370308 -371450 -372923 -373097 -370844 -369190 -367249 -366536
5565 -366536 -369335 -370648 -367576 -364767 -363879 -367354 -366779 -366772 -366874 -366292 -366299 -365619 -364271 -365160 -366963 -367236 -367812 -366752
5547 -366752 -366082 -364703 -366258 -366416 -368416 -368396 -368897 -367393 -368427 -370827 -371369 -368395 -367275 -365686 -364954 -364295
5531 -364295 -362673 -364292 -366233 -365905 -367431 -366868 -364404 -364606 -364263 -363461 -364168 -364589 -364600 -364996 -366307 -367511 -367148
5514 -367148 -366826 -367015 -364878 -361266 -361124 -364004 -368239 -369050 -364152 -362501 -361183 -362205 -362583 -362617 -361411 -360819
5498 -360819 -361968 -363021 -362801 -364343 -364512 -366082 -367245 -366740 -364819 -363427 -363012 -365073 -366537 -366746 -367221 -367837
5482 -367837 -369657 -370185 -370587 -366614 -363452 -364152 -365420 -365414 -364325 -363121 -364809 -366933 -369288 -369066 -366868 -365384
5466 -365384 -367084 -365816 -364663 -363267 -362685 -363142 -363441 -362422 -362160 -365911 -367886 -364854 -362469 -362365 -362783 -362727
5450 -362727 -363234 -364681 -364295 -362327 -362034 -363254 -363967 -362076 -361480 -364720 -364350 -363821 -365415 -365752 -365418 -365852 -367001
5433 -367001 -367630 -365444 -363627 -360558 -360113 -362533 -362722 -362341 -361861 -361998 -362976 -362540 -361210 -363602 -363421 -361611 -362851
5416 -362851 -365599 -365093 -365014 -363059 -359859 -358891 -358377 -356964 -355648 -356426 -359631 -360421 -360349 -360466 -359728 -359215 -356933
5399 -356933 -357052 -360993 -361650 -363661 -361739 -359510 -357803 -358384 -359075 -360628 -361151 -358591 -359400 -358616 -358781 -359371 -361066
5382 -361066 -362659 -362013 -361004 -359201 -358056 -358694 -360426 -359260 -357659 -359144 -360884 -362202 -363385 -364661 -360899
5367 -360899 -360317 -360633 -359495 -358603 -358025 -361460 -364121 -362442 -359615 -359758 -359494 -358447 -358325 -357389 -357260 -357207 -357671
5350 -357671 -358319 -356121 -356499 -359764 -360115 -360340 -361802 -361031 -358993 -357273 -356807 -357428 -360159 -359511 -360055 -357939 -355321
5333 -355321 -354915 -355215 -355361 -355348 -356088 -356197 -355965 -353201 -353671 -355681 -355525 -356730 -355322 -356594 -357632 -354677 -352910
5316 -352910 -354975 -354862 -354039 -353657 -354282 -353787 -351369 -348941 -351147 -355407 -358053 -357226 -357739 -358693 -357150 -355368
5300 -355368 -355638 -355542 -354886 -355250 -355528 -355640 -354381 -354802 -357146 -358767 -357563 -356019 -353226 -354278 -355569 -355552 -355267
5283 -355267 -354403 -357199 -357644 -355850 -355439 -353476 -352492 -353533 -354715 -355626 -357260 -356591 -353507 -353163 -351695 -352807
5267 -352807 -353886 -354302 -354454 -353012 -352256 -352901 -352649 -354054 -356128 -354573 -352278 -351594 -352048 -353759 -356109 -354148
5251 -354148 -352190 -351685 -353349 -354640 -352789 -353052 -352490 -353068 -353007 -350796 -353217 -354380 -354109 -353615 -352334 -352499 -354759
5234 -354759 -356090 -357394 -355257 -352743 -351151 -351134 -351317 -349985 -349929 -351280 -351989 -351561 -350310 -351616 -353035 -357273
5218 -357273 -358902 -355143 -351113 -349892 -351024 -351714 -350220 -349967 -350389 -350695 -353344 -353912 -352201 -349661 -351100 -353523
5202 -353523 -354330 -353972 -353868 -353349 -352353 -352081 -352146 -350917 -350546 -352065 -352099 -350074 -349982 -351076 -350931 -350168 -351406 -351394 -349889
5183 -349889 -347778 -347846 -350826 -351581 -352578 -354296 -354574 -356042 -356237 -355991 -353920 -351185 -348532 -351407 -353074 -352433
5167 -352433 -348881 -347785 -346491 -346448 -346958 -347946 -349604 -348348 -346349 -346338 -346882 -346930 -347734 -348396 -350564 -350079 -348745
5150 -348745 -350137 -352359 -353195 -355100 -352847 -349718 -348493 -348024 -347237 -348490 -349228 -347380 -346049 -345760 -346892 -347762
5134 -347762 -348810 -349242 -346972 -344640 -344069 -343280 -342932 -343964 -343510 -347632 -348739 -347646 -347066 -346663 -349074 -349269
5118 -349269 -349068 -345915 -344335 -345484 -348592 -348514 -348211 -347799 -347795 -348619 -346853 -345342 -348741 -350166 -349839 -350741 -350025
5101 -350025 -350754 -349981 -349025 -346409 -348125 -349681 -349521 -348453 -348674 -346507 -344418 -346578 -347702 -347826 -346051 -344802
5085 -344802 -345764 -344628 -343460 -343578 -344713 -343130 -344316 -347320 -347562 -346366 -345954 -344920 -343790 -342793 -340742 -341691
5069 -341691 -344506 -344371 -344861 -345019 -348679 -349398 -345060 -343607 -345420 -344195 -342923 -343829 -345522 -344043 -342531 -344274
5053 -344274 -344450 -343249 -342526 -343996 -342718 -342302 -342698 -342989 -342221 -341536 -341311 -340575 -340362 -342060 -344961 -344223 -343605
5036 -343605 -345080 -344613 -342436 -342517 -344647 -345801 -347345 -345189 -343602 -343589 -345430 -345896 -344952 -345070 -346007 -345886 -345276
5019 -345276 -344277 -344059 -345294 -344666 -342765 -344671 -345089 -342889 -342223 -340832 -341270 -343482 -344876 -344195 -342643 -340050
5003 -340050 -338929 -340863 -342110 -342310 -342319 -341575 -340560 -339894 -342783 -344599 -343103 -340373 -339769 -338354 -337629 -335794
4987 -335794 -335912 -340644 -342074 -342824 -343386 -343070 -341718 -343096 -343577 -343692 -346185 -346748 -346358 -346427 -343645 -341782 -339438
4970 -339438 -339860 -343018 -347478 -347053 -342729 -342281 -342181 -338806 -337075 -336561 -338336 -341565 -341135 -339446 -339904 -341134
4954 -341134 -340777 -338508 -339981 -340807 -341144 -340071 -339363 -338980 -340813 -340652 -340529 -339455 -338314 -338111 -337792 -335211 -333719
4937 -333719 -334085 -332808 -335570 -336779 -335287 -335270 -337263 -338737 -341713 -343153 -342961 -341837 -340689 -338298 -336931
4922 -336931 -338440 -339117 -339363 -339020 -336740 -335436 -336699 -338816 -338721 -338990 -337578 -335510 -335197 -335849 -339673 -342050
4906 -342050 -341671 -340078 -338286 -339492 -339273 -336796 -338591 -337806 -337112 -337610 -339164 -339287 -337468 -334446 -335031 -337059
4890 -337059 -339143 -336861 -336056 -336173 -336716 -339290 -339791 -339994 -339152 -339080 -339612 -339680 -338911 -338392 -337849 -337900 -337551 -336597 -335370
4871 -335370 -337267 -337049 -337427 -337009 -334630 -333264 -332669 -334629 -337396 -339218 -338736 -337124 -336358 -336595 -337252 -338938
4855 -338938 -336838 -333945 -331816 -330401 -331526 -333185 -335536 -335592 -333425 -333069 -331851 -331360 -333269 -335802 -335509 -335630
4839 -335630 -335658 -336817 -337360 -337389 -338617 -338715 -337403 -338772 -338604 -336354 -335990 -335094 -335216 -336643 -335842 -332917 -331906
4822 -331906 -331859 -333970 -336385 -338238 -339651 -337795 -335220 -333195 -331593 -331913 -331161 -329541 -329674 -332560 -335131 -337537
4806 -337537 -336555 -335334 -334679 -334719 -335512 -333689 -333664 -334299 -332627 -333364 -333501 -334454 -336136 -335287 -334713 -337028 -335229 -334195
4788 -334195 -333898 -334054 -332540 -332277 -334207 -335645 -336575 -335815 -334113 -332318 -333591 -335656 -335270 -336155 -334239 -332065
4772 -332065 -329180 -329968 -331161 -332730 -332779 -330671 -329280 -330752 -331793 -331211 -330320 -330369 -331181 -331115 -332026 -334709 -334507
4755 -334507 -332205 -331264 -331778 -332917 -333894 -331995 -328795 -328879 -329326 -329991 -331122 -330208 -330012 -331351 -331729 -332052 -332554
4738 -332554 -332962 -332181 -330939 -330468 -330900 -331394 -330256 -329545 -332349 -332078 -330851 -329485 -327720 -327309 -328306 -330206 -330301
4721 -330301 -331276 -329561 -327252 -330555 -332003 -332391 -331894 -331208 -329154 -327679 -329465 -329091 -329391 -328896 -329231 -331244
4705 -331244 -330724 -328268 -328010 -329894 -330384 -328242 -328682 -328634 -327266 -326633 -326947 -326980 -329761 -331047 -328385 -327755 -330019
4688 -330019 -329771 -328137 -328221 -327091 -327928 -327588 -328006 -328123 -327060 -326721 -326265 -327120 -327540 -327056 -328888 -327171 -325530
4671 -325530 -326558 -326810 -325815 -327080 -328561 -326562 -324977 -328014 -327070 -325892 -327711 -328746 -328397 -326854 -326428 -327345
4655 -327345 -326048 -325318 -323932 -326220 -325836 -325385 -325521 -325583 -326628 -325736 -327182 -327545 -329035 -328171 -328060 -328056 -327326 -327748
4637 -327748 -329161 -328394 -326195 -326690 -325082 -326489 -327062 -327285 -326372 -323563 -322224 -321373 -322532 -323525 -321740 -322992
4621 -322992 -323927 -324349 -323331 -323541 -323600 -325540 -326458 -326425 -325427 -324768 -325668 -327843 -329065 -328705 -326346 -324830 -324180 -324142
4603 -324142 -323548 -324868 -327163 -324247 -323123 -325114 -326842 -325653 -322109 -320010 -321081 -323035 -326228 -325986 -325303
4588 -325303 -321943 -321575 -321580 -322297 -324320 -325099 -326348 -324403 -324994 -326561 -328079 -329779 -328701 -326781 -326851 -328175 -328716
4571 -328716 -327983 -324995 -327925 -326617 -324104 -323715 -322091 -323025 -325318 -325740 -323815 -322175 -321256 -321737 -323099 -324034
4555 -324034 -323300 -322512 -320816 -323976 -323631 -321850 -320908 -320508 -319776 -320082 -321429 -322203 -323373 -321963 -319969 -321887
4539 -321887 -322200 -321690 -321447 -320403 -319973 -321606 -324006 -321635 -321562 -323927 -322680 -323428 -322749 -322666 -322304 -322774 -326420
4522 -326420 -327743 -327036 -325991 -324565 -321267 -319992 -320982 -321159 -322549 -323100 -323641 -323046 -323125 -324256 -324618 -324365 -323737
4505 -323737 -323163 -323922 -322146 -319938 -320585 -322604 -323547 -326499 -329628 -328054 -325964 -322222 -320695 -322354 -320739
4490 -320739 -318988 -317216 -318273 -321422 -323097 -323579 -322719 -320670 -319912 -319041 -317434 -317997 -317462 -316563 -318294 -319982
4474 -319982 -320992 -321315 -322262 -321433 -321324 -321732 -322836 -323804 -324704 -323216 -322163 -321273 -321133 -321365 -320247 -318846 -318961
4457 -318961 -320414 -318973 -318563 -317841 -319533 -320552 -320169 -320741 -318673 -318244 -319601 -319056 -317756 -316144 -317699 -320244
4441 -320244 -320007 -319331 -320153 -320345 -318227 -318037 -316674 -315302 -315040 -315796 -317637 -317381 -316572 -316641 -314984 -314417 -314560 -316171
4423 -316171 -316636 -317582 -320427 -320181 -319645 -317915 -318088 -317839 -319419 -319316 -316293 -314749 -315948 -316972 -319737 -322976
4407 -322976 -323442 -321812 -322078 -321694 -324039 -323695 -321011 -318802 -320115 -319960 -318482 -316712 -315718 -315289 -317270 -315409
4391 -315409 -314641 -318061 -319672 -320965 -318651 -315783 -316770 -317865 -317739 -316874 -316831 -317403 -316129 -315477 -316915 -318658
4375 -318658 -320458 -319781 -318358 -318397 -318693 -318440 -317708 -318936 -318187 -317051 -317406 -317013 -318716 -320134 -319522 -318622 -318724
4358 -318724 -317942 -316722 -314558 -314619 -315627 -317291 -316470 -315342 -315264 -313358 -313117 -312045 -312572 -313825 -315593 -318953
4342 -318953 -316647 -315420 -315491 -314812 -315183 -315743 -315946 -314882 -315562 -318366 -319265 -317369 -314675 -314139 -315547 -315636 -313460
4325 -313460 -312591 -314370 -313568 -311058 -311156 -309565 -312637 -317265 -315995 -314421 -312360 -310601 -309518 -311212 -312869
4310 -312869 -314010 -316697 -317648 -316622 -316226 -316493 -317760 -315454 -314248 -314565 -315305 -315977 -313246 -311578 -313475 -312223
4294 -312223 -312595 -313324 -313684 -312266 -312595 -312496 -312503 -311580 -309975 -309448 -308609 -309754 -310348 -311855 -311312 -310751 -309827 -307239
4276 -307239 -308085 -309383 -311843 -311527 -308654 -306333 -309353 -310656 -310704 -309832 -310664 -313558 -314370 -312910 -311348 -309121
4260 -309121 -311630 -312834 -311975 -310257 -308728 -306432 -307457 -312172 -314277 -314558 -313134 -314533 -313724 -311582 -313565
4245 -313565 -312993 -312932 -314830 -317416 -316738 -313550 -310821 -310312 -311247 -312776 -311659 -310926 -313060 -312796 -312658 -313865 -315241
4228 -315241 -316090 -312874 -310027 -310807 -311124 -311359 -312951 -310667 -308923 -306494 -306924 -307701 -308982 -308745 -307277 -307078
4212 -307078 -309601 -309573 -306720 -307287 -308324 -307207 -308195 -308458 -309447 -307655 -308617 -309812 -311102 -311377 -310249 -310301 -310869
4195 -310869 -309273 -310932 -311958 -308910 -307523 -308294 -309939 -311456 -311649 -308996 -306538 -309398 -310390 -307921 -308889
4180 -308889 -309917 -308189 -307509 -306570 -307104 -308032 -309240 -308755 -308001 -307803 -306093 -307398 -307204 -309150 -310403 -309142
4164 -309142 -308875 -310744 -309022 -307410 -306452 -305786 -307219 -311056 -310714 -308565 -308556 -306568 -307247 -307208 -307760 -308011 -308636 -309255
4146 -309255 -309343 -309007 -309675 -308479 -307962 -306930 -307444 -307681 -307309 -309602 -309382 -307109 -305756 -305826 -304849 -302463 -302917 -303826
4128 -303826 -302611 -304642 -304192 -304270 -306844 -307637 -306859 -306763 -306181 -306563 -305847 -304271 -306251 -308342 -308406 -306379 -307348 -308424
4110 -308424 -306674 -305461 -306320 -307904 -306451 -306243 -305124 -306531 -307946 -303827 -305647 -309044 -308304 -308688 -312188
4095 -312188 -313517 -311475 -311253 -309937 -309706 -310065 -308001 -306098 -306478 -307233 -306186 -306357 -307031 -308880 -308714 -308723 -310591
4078 -310591 -311856 -309390 -308050 -308348 -307304 -305496 -305240 -304140 -303990 -305136 -305744 -305975 -304563 -307015 -308028 -305965
4062 -305965 -305326 -304522 -303228 -303066 -303158 -303425 -303348 -303567 -305061 -306361 -305588 -304394 -304780 -306252 -304603 -303964 -303741 -303383
4044 -303383 -302590 -301438 -303202 -304505 -304415 -303858 -300958 -301149 -303222 -303683 -304117 -304782 -306616 -306218 -303724 -301685 -304140
4027 -304140 -307661 -305739 -304193 -303605 -303353 -304649 -304346 -301048 -300797 -302682 -303319 -301973 -300504 -302489 -301738 -303753
4011 -303753 -303198 -302761 -304390 -306154 -307116 -305752 -302971 -303328 -303612 -301978 -301237 -304537 -307787 -306365 -303562 -303451
3995 -303451 -303678 -303785 -304516 -302881 -304660 -304433 -301801 -302967 -303823 -303398 -303606 -303817 -305285 -302124 -299002 -298345 -299300
3978 -299300 -299007 -300498 -300505 -301168 -302567 -303691 -303399 -302587 -302883 -303220 -303054 -303403 -303374 -301977 -300272 -300775 -301507 -301387
3960 -301387 -301408 -302569 -303246 -302674 -303070 -302808 -301761 -301452 -300441 -299119 -297051 -297056 -298670 -301041 -300959 -299131 -295497
3943 -295497 -296518 -297922 -297694 -299784 -300947 -301006 -299553 -299672 -299916 -300692 -301865 -301953 -301591 -302772 -304760 -305956 -304342
3926 -304342 -302873 -301595 -302076 -301028 -300600 -301466 -301293 -298601 -296546 -296267 -297733 -299756 -298509 -298142 -297275 -296979
3910 -296979 -295894 -296523 -297780 -298460 -298814 -296331 -296223 -297876 -298968 -299599 -299210 -298018 -298205 -298952 -298809 -299592 -299583 -299715
3892 -299715 -297834 -295766 -295328 -296863 -297775 -298286 -297544 -296590 -295683 -293855 -294737 -296638 -299432 -300964 -300353 -299301
3876 -299301 -299696 -300161 -298669 -298884 -298317 -297743 -297107 -295447 -294760 -296601 -300092 -300467 -300276 -300258 -299277 -297145 -297234 -295889
3858 -295889 -297107 -297929 -297591 -298894 -298604 -299238 -299690 -297430 -298693 -297419 -295167 -299695 -301006 -299106 -298404 -298060
3842 -298060 -299420 -297309 -298475 -299281 -296240 -296588 -297652 -296804 -298002 -299302 -300603 -300127 -297516 -296752 -296824 -297657
3826 -297657 -295803 -296718 -298061 -299851 -299524 -297669 -296741 -297295 -297632 -297385 -297145 -299128 -300950 -300155 -297006 -295852
3810 -295852 -295699 -294489 -296156 -297977 -297554 -298742 -297706 -295744 -294099 -294707 -296464 -294598 -293569 -298128 -300896
3795 -300896 -300348 -299355 -296991 -298320 -296605 -296185 -295508 -294721 -294534 -294144 -293805 -294839 -294577 -291932 -290858 -292445 -293571
3778 -293571 -293618 -293859 -294809 -296044 -295976 -295046 -293038 -290911 -292596 -294452 -295528 -296032 -295860 -294198 -292239 -291607 -292262
3761 -292262 -293369 -294242 -294409 -294267 -295557 -297669 -298130 -296823 -295795 -294773 -293908 -294461 -297450 -297636 -295753 -294815
3745 -294815 -293343 -293550 -292997 -292901 -292010 -292848 -292580 -291675 -295123 -293795 -295005 -295505 -294434 -292239 -291457 -293525 -294512
3728 -294512 -292612 -291081 -289716 -291225 -291387 -291814 -291896 -291980 -293805 -292831 -290630 -289939 -291764 -293295 -292267 -292897 -292314
3711 -292314 -291977 -294451 -294824 -296457 -295416 -296090 -296356 -296775 -296316 -294881 -292177 -290910 -292283 -293273 -293805 -293913 -292729
3694 -292729 -291090 -291216 -293552 -294057 -293556 -293445 -294219 -291669 -290867 -292035 -293197 -292540 -292558 -291466 -291736 -290064 -288796
3677 -288796 -290613 -291169 -289394 -288153 -289594 -290085 -289995 -292530 -294468 -293342 -294272 -294782 -296575 -296717 -294671 -292578
3661 -292578 -293735 -296571 -295244 -293427 -293871 -292834 -292379 -290637 -288783 -289643 -292562 -292199 -294970 -297078 -295869
3646 -295869 -293614 -292365 -292989 -291691 -290101 -290335 -289727 -289855 -290315 -290171 -290350 -290529 -287863 -286437 -285976 -289477 -291249
3629 -291249 -292104 -292349 -291254 -291978 -292109 -291011 -290524 -290756 -289655 -289883 -292631 -293190 -290503 -289131 -289209 -288467 -291278
3612 -291278 -289681 -289464 -293624 -294732 -293558 -293397 -293232 -293018 -292678 -290068 -286099 -285099 -286375 -287749 -288081 -288774
3596 -288774 -288730 -288796 -288648 -286807 -286736 -287699 -288606 -288108 -288583 -289162 -287881 -288461 -290402 -290259 -289247 -288855 -290060 -292166
3578 -292166 -292192 -290860 -290350 -289982 -290396 -289173 -288925 -287738 -289129 -290198 -288918 -289323 -288675 -288987 -289788 -290420 -290257
3561 -290257 -290720 -289993 -288552 -290192 -287708 -288005 -286978 -286316 -291139 -288610 -286378 -285485 -286061 -288351 -287831 -288079
3545 -288079 -289534 -290394 -291354 -290370 -290018 -292445 -293245 -291824 -293094 -294397 -290882 -288263 -287170 -286129 -288278 -291586
3529 -291586 -293240 -292634 -290516 -289722 -290838 -293196 -292208 -291042 -288362 -284805 -282827 -281595 -281617 -282359 -284413 -286273
3513 -286273 -285829 -283242 -283594 -284871 -285275 -284659 -283725 -286906 -288575 -288311 -286855 -288034 -288444 -288868 -291777 -290361
3497 -290361 -289327 -288450 -288783 -287906 -286994 -285257 -282511 -279725 -281233 -283965 -285502 -283801 -282452 -287778 -289740
3482 -289740 -289034 -286252 -281699 -282710 -280551 -278853 -284145 -285930 -282494 -283403 -283409 -284687 -287011 -286510 -285609 -284369
3466 -284369 -283645 -282620 -284559 -284606 -283367 -283639 -282276 -283626 -283114 -284092 -288977 -288262 -286665 -284275 -283589 -283692 -283608
3449 -283608 -284890 -287674 -287802 -288944 -288202 -287391 -286225 -285657 -283675 -284757 -286043 -285826 -283236 -280735 -279952 -281625
3433 -281625 -282499 -281928 -283369 -287952 -291714 -290685 -291256 -294187 -292870 -289473 -287088 -286422 -285913 -284913 -286364 -283916
3417 -283916 -282499 -282906 -283341 -283749 -284790 -288280 -289273 -287410 -287325 -286075 -285937 -284949 -284268 -285639 -284634 -283735 -284479
3400 -284479 -281564 -280025 -280889 -278799 -282262 -288966 -293472 -291225 -289928 -285640 -279405 -276968 -275076 -273356 -280279
3385 -280279 -290752 -290972 -287418 -286625 -283965 -282480 -284619 -285870 -283021 -282664 -284774 -285043 -283941 -286171 -286918
3370 -286918 -286687 -286922 -285879 -282993 -278723 -277037 -280675 -281480 -278954 -282692 -283569 -279027 -280630 -287088 -294021
3355 -294021 -299003 -298894 -293190 -285333 -282651 -283088 -283677 -284724 -285828 -286947 -285866 -283045 -282853 -283429 -284692 -282943
3339 -282943 -283886 -283946 -281598 -280900 -281742 -280624 -279341 -278856 -280423 -279616 -277203 -276959 -279906 -280802 -283291 -285149 -283963
3322 -283963 -280951 -279229 -279173 -280015 -283778 -282586 -278377 -273526 -273680 -277200 -275791 -276766 -286253 -289280 -287846 -283630
3306 -283630 -282535 -287472 -293118 -290871 -285429 -282520 -279151 -278899 -281172 -283981 -285778 -287343 -287492 -285952 -286199
3291 -286199 -285770 -282233 -280692 -279847 -278842 -278658 -278314 -277545 -276844 -279232 -282680 -280364 -280116 -281872 -281844 -281602 -279148
3274 -279148 -278469 -275245 -273522 -274376 -274907 -276741 -281742 -281926 -279570 -283460 -286134 -283719 -284541 -282864 -281030 -280709
3258 -280709 -280989 -279299 -278983 -282761 -286456 -286290 -284954 -283622 -279150 -278491 -279039 -279110 -279519 -281430 -280231 -278608
3242 -278608 -277229 -277455 -278923 -278148 -277897 -277970 -276695 -275483 -275628 -276663 -278492 -278692 -278426 -279160 -279430 -279619 -277078
3225 -277078 -276966 -277295 -278370 -279291 -281620 -280749 -279709 -279104 -277638 -277912 -277773 -279460 -277446 -276210 -277785 -278411
3209 -278411 -277118 -277782 -276196 -276291 -278281 -278861 -278488 -278719 -280072 -280751 -280963 -278071 -276610 -276499 -275143 -274001 -274631
3192 -274631 -273743 -273851 -276070 -278662 -278933 -276926 -278173 -279132 -277437 -277087 -276439 -277113 -278369 -280659 -281606 -278958
3176 -278958 -278535 -277541 -275857 -276314 -275806 -277513 -278162 -278677 -280659 -279611 -277273 -273157 -272103 -273228 -276202 -276832
3160 -276832 -277020 -275117 -274025 -277301 -276590 -273955 -273102 -274161 -278873 -281034 -281338 -280937 -279471 -277745 -276594 -277022
3144 -277022 -275329 -275015 -273304 -274319 -276296 -277334 -277267 -277541 -277262 -276891 -275803 -274683 -274545 -276667 -275970 -274439
3128 -274439 -275137 -275893 -273976 -275393 -278594 -278625 -277663 -276796 -275760 -274194 -272525 -271977 -274220 -275198 -276021 -276325 -276704
3111 -276704 -274842 -275465 -277292 -277106 -277481 -277550 -277143 -276537 -279120 -278446 -277818 -279288 -278726 -277653 -275954 -275206 -274270
3094 -274270 -274059 -276912 -276144 -274897 -276684 -275633 -272262 -271902 -271900 -272964 -276127 -278206 -279066 -277371 -277984 -278629 -279622
3077 -279622 -278493 -276624 -276780 -277093 -277390 -276708 -274817 -273267 -273606 -274800 -274493 -274746 -275139 -274544 -275508 -273292 -270055
3060 -270055 -272691 -272176 -272824 -273450 -273532 -275869 -277221 -274787 -275042 -275300 -276171 -276314 -275322 -275131 -275078 -273395 -274684 -277529
3042 -277529 -277506 -273535 -273443 -275875 -274490 -274170 -274961 -273818 -273826 -275304 -277394 -277174 -276150 -274080 -274870 -274920 -274655 -273862
3024 -273862 -271904 -271423 -271837 -272001 -274070 -276305 -274289 -273051 -273490 -272734 -272116 -271906 -271261 -271742 -272473 -271858 -272047
3007 -272047 -274393 -274751 -275817 -274591 -273253 -275791 -274154 -272429 -271553 -271080 -273863 -273699 -274667 -274319 -272142 -271835
2991 -271835 -271132 -272013 -273689 -272816 -271150 -270853 -271828 -270079 -268837 -269055 -271729 -272314 -273201 -271708 -270689 -273110
2975 -273110 -274079 -272450 -271520 -271764 -271756 -271601 -270416 -271136 -268907 -269078 -270189 -270117 -269909 -271236 -273124 -272366 -269619 -268219
2957 -268219 -267680 -269778 -273448 -276467 -275783 -272569 -271946 -270340 -269421 -269707 -270881 -270203 -269646 -270039 -271266 -272247 -271852
2940 -271852 -275236 -275052 -272593 -270697 -272197 -273385 -270154 -269461 -270243 -271639 -273343 -273623 -272643 -270735 -269841 -270985
2924 -270985 -273394 -273132 -272078 -269007 -268992 -270636 -271350 -271083 -269026 -267626 -270086 -270003 -268459 -268220 -268699 -268974 -268804
2907 -268804 -267638 -266832 -269684 -269237 -266290 -267934 -266021 -267086 -269914 -271028 -270553 -271004 -268505 -267708 -268328 -269657
2891 -269657 -272293 -271688 -268288 -269235 -270098 -269548 -270593 -273507 -270600 -267504 -266729 -266386 -268649 -270153 -269757 -270431
2875 -270431 -268820 -268507 -270777 -269536 -267534 -267515 -268532 -268993 -268709 -268015 -270375 -271265 -269485 -267507 -269077 -271667
2859 -271667 -271666 -272068 -270982 -268790 -268047 -268297 -267608 -269259 -269681 -267681 -266909 -266793 -266036 -265937 -265148 -266791 -266002 -265862
2841 -265862 -266632 -266712 -269418 -267630 -264729 -265183 -266660 -267076 -268405 -267190 -266124 -269041 -270451 -272265 -271042 -270706
2825 -270706 -272019 -272564 -270679 -270351 -270918 -270176 -270590 -270879 -268847 -267705 -268836 -270197 -269424 -268171 -268165 -268091 -269384
2808 -269384 -270424 -272280 -271162 -271638 -271871 -269303 -267736 -266120 -265287 -264571 -265706 -265367 -267894 -269269 -268685 -268429
2792 -268429 -267157 -266085 -267205 -268701 -268910 -269275 -268273 -269513 -271657 -270196 -268612 -269514 -268962 -269846 -266771 -265573
2776 -265573 -266415 -267660 -269958 -269720 -267527 -266434 -266908 -266746 -268824 -269844 -270022 -272286 -271929 -268821 -267988 -268796
2760 -268796 -270236 -269405 -268957 -269588 -270696 -270513 -267938 -267994 -265958 -265725 -266940 -265742 -264660 -264642 -268286 -269740 -269911
2743 -269911 -269486 -268855 -269473 -269048 -267691 -266787 -266572 -264477 -265228 -265233 -264831 -264861 -266192 -265060 -263618 -265158 -266072 -266921
2725 -266921 -264782 -263643 -264395 -264021 -264357 -265463 -267975 -268989 -270157 -269729 -266521 -263998 -264432 -263396 -264531 -264464
2709 -264464 -263790 -265422 -265959 -267069 -267634 -268204 -268407 -268156 -266638 -265583 -265064 -266690 -266067 -262545 -263146 -266387 -269452
2692 -269452 -271325 -271706 -272006 -269174 -266898 -265913 -265479 -265019 -263854 -264371 -264058 -264430 -263987 -262962 -262934 -265477 -265481 -263837
2674 -263837 -262799 -266703 -267884 -265831 -264007 -264479 -264851 -266092 -266622 -265270 -263225 -262407 -262783 -264251 -264369 -265236
2658 -265236 -264688 -263545 -263256 -264801 -266486 -267119 -267237 -265733 -263339 -263375 -267493 -267071 -265425 -266902 -265687 -266319
2642 -266319 -264822 -262997 -262321 -263861 -263415 -261639 -260373 -261238 -261190 -262428 -263498 -262234 -260996 -263288 -264056 -262944
2626 -262944 -260932 -259424 -261500 -265982 -268270 -268532 -266984 -263912 -261216 -259860 -257978 -259813 -261159 -260626 -258214
2611 -258214 -259017 -260668 -260814 -261193 -260423 -259830 -258028 -258741 -258514 -259186 -260037 -258166 -257448 -257518 -253707 -251612 -262018
2594 -262018 -269439 -265147 -260069 -258881 -253596 -256175 -254259 -252115 -262054 -268936 -266144 -263588 -264114 -263959 -264014
2579 -264014 -264216 -264397 -263934 -262634 -268306 -270451 -270392 -267455 -265122 -263064 -260792 -261675 -262813 -263982 -265314 -264114
2563 -264114 -264042 -260944 -261130 -263402 -262992 -263305 -266668 -267300 -266369 -263586 -259945 -259763 -261848 -261128 -259921 -256941 -254548
2546 -254548 -254935 -253530 -258704 -268099 -271154 -267110 -266505 -263087 -257872 -257472 -255882 -251294 -255420 -266715 -270592
2531 -270592 -269162 -268882 -265415 -262068 -265915 -269974 -267542 -265255 -261528 -261431 -260870 -257614 -258751 -260576 -261187 -262932
2515 -262932 -263496 -263207 -261440 -261832 -261462 -259075 -259445 -259872 -260828 -260631 -258521 -255804 -257529 -259243 -261065 -262474
2499 -262474 -263907 -261773 -258660 -256900 -256686 -258146 -257646 -259048 -260471 -263475 -263591 -261181 -257953 -256934 -256812
2484 -256812 -257083 -259239 -258339 -258044 -258693 -253989 -253425 -255825 -257183 -258035 -257956 -255823 -257355 -257231 -261285 -262770 -260386
2467 -260386 -255845 -256122 -260141 -261692 -261234 -259249 -256940 -255742 -256153 -256495 -257479 -259042 -259782 -258339 -256768 -257355
2451 -257355 -259268 -260291 -260569 -258815 -257542 -257271 -257358 -256074 -258627 -259600 -260944 -259732 -258104 -257636 -258147 -259768
2435 -259768 -259328 -259246 -259610 -258499 -257046 -257840 -258082 -256161 -254611 -255832 -255931 -254298 -255027 -257843 -259881 -260407 -259905
2418 -259905 -257785 -256845 -256490 -255467 -256796 -259030 -259927 -259374 -258131 -257379 -258476 -257645 -255838 -255375 -258285 -261931
2402 -261931 -263681 -263434 -261654 -259663 -260831 -260175 -257537 -259151 -259082 -257949 -257956 -260774 -261624 -259372 -257444 -256849 -256598
2385 -256598 -256930 -258494 -259006 -259527 -259887 -259864 -258618 -258753 -258256 -257668 -257169 -259857 -261704 -261488 -259789 -257119 -255266
2368 -255266 -254467 -255445 -257364 -256526 -254757 -255011 -254604 -252986 -255185 -256575 -256723 -256196 -255775 -255332 -256139 -257639 -256860
2351 -256860 -255955 -255517 -255817 -254905 -254313 -255511 -256118 -257794 -256221 -256103 -256505 -255041 -256148 -257448 -257210 -258521 -259071
2334 -259071 -257802 -259141 -257604 -255504 -256054 -258000 -257279 -257285 -258341 -256191 -255258 -255474 -254672 -255610 -254909 -253896 -253598
2317 -253598 -251160 -252212 -253238 -252392 -254179 -254066 -253445 -252229 -251991 -251108 -251946 -252517 -252333 -253020 -254768 -256787 -257146
2300 -257146 -256015 -254799 -253279 -253497 -254305 -254149 -256570 -259671 -258900 -259313 -258735 -256276 -253067 -252363 -253441 -253396 -253217
2283 -253217 -252616 -254547 -256929 -257580 -257819 -258412 -259571 -259030 -259222 -257730 -257296 -258736 -258847 -258291 -255838 -256985 -256057
2266 -256057 -254377 -251565 -251427 -253885 -253947 -254082 -256690 -259537 -260916 -258046 -254725 -254214 -255432 -257030 -257402 -255400
2250 -255400 -252559 -251707 -252396 -254993 -257625 -256813 -256876 -257085 -257627 -257421 -257835 -256564 -255002 -257105 -255360 -254614 -253803
2233 -253803 -254840 -255945 -253263 -254184 -253763 -254016 -256319 -255044 -252614 -253288 -256641 -256969 -254684 -253505 -253204 -253140
2217 -253140 -252696 -252652 -252883 -251844 -251056 -249379 -248256 -249628 -252282 -251427 -248983 -251469 -254053 -254559 -253018 -252525
2201 -252525 -248923 -248616 -251872 -253287 -253018 -253290 -253467 -253095 -251684 -253052 -256733 -256382 -255180 -253603 -254739 -255771
2185 -255771 -255650 -254351 -253535 -252910 -251607 -251712 -251486 -251731 -250308 -254052 -257286 -254895 -252048 -250812 -252222 -250800
2169 -250800 -248522 -247952 -250190 -249995 -249183 -251493 -253707 -253997 -251103 -246869 -247303 -249855 -252219 -254113 -252497 -251273
2153 -251273 -252294 -253457 -253798 -256616 -256617 -253871 -253837 -254470 -253511 -256441 -257316 -254673 -251193 -251125 -248607 -247473 -246579
2136 -246579 -248460 -250479 -251437 -251952 -251077 -251506 -253734 -255865 -253891 -251677 -250800 -249298 -248077 -247883 -248636 -251268
2120 -251268 -254813 -254502 -251196 -249171 -250840 -253414 -254398 -255304 -255192 -253748 -253559 -253758 -254504 -254368 -250763 -251277 -250775
2103 -250775 -250231 -248872 -249720 -250677 -253795 -254465 -251853 -250563 -251933 -253156 -252267 -252868 -253708 -252708 -251581 -250494
2087 -250494 -249756 -250093 -250563 -248886 -248227 -246459 -243960 -247679 -250012 -253992 -255067 -254028 -253203 -252914 -252684 -252121
2071 -252121 -253779 -254347 -253167 -253000 -251850 -250401 -248792 -246545 -245000 -244472 -245522 -246902 -248430 -248702 -246632
2056 -246632 -246319 -251281 -253171 -254180 -253591 -254343 -252400 -251294 -252464 -252722 -251312 -251241 -251342 -251929 -250482 -251440 -251857
2039 -251857 -251263 -251324 -253194 -251731 -249391 -247159 -246023 -247140 -248911 -250311 -249725 -251492 -251533 -250272 -248822 -248048
2023 -248048 -247869 -247871 -247948 -248202 -246066 -245941 -247287 -249830 -251402 -251296 -249473 -247187 -245358 -245092 -245792 -247739 -250395
2006 -250395 -252041 -251800 -250638 -252188 -252597 -252031 -251216 -249523 -248643 -249887 -251616 -251532 -250559 -251147 -250209 -247375 -248264
1989 -248264 -249665 -249989 -248373 -249069 -249532 -248544 -248309 -248342 -247957 -246381 -247259 -250209 -250507 -248163 -248138 -250470 -250284 -248298
1971 -248298 -248486 -247522 -247729 -248195 -247910 -249035 -249404 -251024 -250340 -249763 -248752 -248903 -248074 -247605 -245548 -244508 -245961
1954 -245961 -247783 -248676 -247191 -246969 -248380 -248529 -249616 -248519 -246104 -247566 -246932 -247681 -247798 -247083 -245453 -245322
1938 -245322 -246403 -248070 -249514 -248401 -244727 -243987 -245772 -247286 -248759 -250914 -251635 -248360 -246640 -247241 -246624
1923 -246624 -247572 -248057 -247716 -246443 -248117 -249781 -247195 -244929 -246699 -248503 -249648 -249618 -250943 -250956 -249838 -250146
1907 -250146 -250067 -249288 -246519 -247505 -246855 -245915 -244033 -243739 -243357 -242279 -243790 -245611 -245493 -245487 -245158 -244926 -246156 -247588
1889 -247588 -246984 -247308 -246868 -244715 -245851 -247586 -246339 -245470 -245074 -246478 -247286 -246914 -247118 -246510 -245084 -246764 -248844
1872 -248844 -250305 -250453 -249089 -247081 -246005 -244103 -241466 -240667 -242335 -243383 -242998 -244196 -247752 -245603 -244242
1857 -244242 -243763 -241949 -241297 -242558 -244103 -245025 -246526 -246631 -245928 -244923 -246883 -249766 -250009 -249462 -248429 -245813
1841 -245813 -243011 -244789 -244405 -246147 -250442 -250408 -247812 -248438 -247153 -245527 -245537 -246225 -248048 -247431 -245611 -244952 -244954
1824 -244954 -247050 -248177 -248922 -249676 -246459 -243646 -242774 -244428 -244539 -242625 -245636 -247759 -246984 -246168 -244569 -243861
1808 -243861 -241066 -241237 -244649 -245386 -246215 -245982 -245949 -246885 -245862 -243842 -245314 -249612 -250363 -250322 -249960 -248649 -247096
1791 -247096 -246260 -246289 -243633 -240247 -242249 -245986 -247539 -247412 -248588 -248349 -248619 -248082 -246112 -245226 -245376 -243863 -244211
1774 -244211 -246469 -247090 -246039 -245840 -244833 -243590 -243382 -243413 -243176 -243398 -244543 -243782 -241444 -240954 -242798 -244029 -244320
1757 -244320 -241168 -240494 -242326 -242561 -242632 -242072 -242485 -242341 -242210 -242699 -242709 -244240 -242907 -244430 -243113 -241796 -242429
$$ [...]
##END NTUPLES=NMR SPECTRUM
##END=
