##TITLE=Analysis number 314395
Compound Code cc 42304
Book Reference 449/36
Project Code adrs
Chemist Name davee
##JCAMPDX= 6.0         $$ Bruker NMR JCAMP-DX V2.0
##DATA TYPE= NMR SPECTRUM
##DATA CLASS= NTUPLES
##ORIGIN= Bruker BioSpin GmbH
##OWNER= NMR
$$ XWIN-NMR		Version 3.5
$$ Tue Oct 18 08:34:08 2005 GMT Daylight Time (UT+1h)  MAYBRIDGE\NMR@NMR_250MHZ
##.OBSERVE FREQUENCY= 250.131544655141
##.OBSERVE NUCLEUS= ^1H
##.ACQUISITION MODE= SIMULTANEOUS (DQD)
##.ACQUISITION SCHEME= undefined
##.AVERAGES= 16
##.DIGITISER RES= 18
##SPECTROMETER/DATA SYSTEM= dpx250
##.PULSE SEQUENCE= zg30
##.SOLVENT NAME= CDCl3
##.SHIFT REFERENCE= (INTERNAL, CDCl3, 0, 16.522)
##AUDIT TRAIL= $$ (NUMBER, WHEN, WHO, WHERE, WHAT)
$$ ##TITLE= Audit trail, XWIN-NMR		Version 3.5
$$ ##JCAMPDX= 5.01
$$ ##ORIGIN= Bruker BioSpin GmbH
$$ ##OWNER= NMR
$$ C:\u/data/dgb/nmr/ADRS/10900/pdata/1/auditp.txt
$$ ##AUDIT TRAIL=  $$ (NUMBER, WHEN, WHO, WHERE, WHAT)
(   1,<2005-10-18 08:33:49.53 +100>,<MAYBRIDGE\NMR>,<NMR_250MHZ>,
      <created by zg, POWCHK disabled, PULCHK disabled
       configuration hash MD5:
       62 19 C7 07 E1 42 D1 B7 37 6C 3D D0 77 39 F9 E6
       data hash MD5: 64K
       49 5E 24 63 A2 53 A8 27 E8 28 52 FA 7B FB 3C AC>)
(   2,<2005-10-18 08:34:00.61 +100>,<MAYBRIDGE\NMR>,<NMR_250MHZ>,
      <Start of raw data processing
       ef LB = 0.3 FT_mod = 6 PKNL = 1 SI = 32K 
       data hash MD5: 32K
       06 3F E1 68 8E F0 99 53 12 60 A7 97 42 75 82 1C>)
(   3,<2005-10-18 08:34:02.24 +100>,<MAYBRIDGE\NMR>,<NMR_250MHZ>,
      <apk 
       data hash MD5: 32K
       FE 52 3B B0 5C 9A 48 D4 2C 2C 62 D4 DA B5 4C 56>)
(   4,<2005-10-18 08:34:02.99 +100>,<MAYBRIDGE\NMR>,<NMR_250MHZ>,
      <abs ABSG = 5 
       data hash MD5: 32K
       41 95 B3 98 00 97 F5 83 41 79 70 62 AB 66 4B 37>)
$$ ##END=
$$ 
$$ hash MD5
$$ 95 95 20 8C AD 5E C0 0B DD FF 54 99 0D FC A8 E5
##$RELAX= 
##$RELAX= 
##$RELAX= 
##$RELAX= 
##$RELAX= 
##$RELAX= 
##$RELAX= 
$$ Bruker specific parameters
$$ --------------------------
##$DU= <C:\u>
##$EXPNO= 10900
##$NAME= <ADRS>
##$PROCNO= 1
##$TYPE= <nmr>
##$USER= <dgb>
##$AMP= (0..31)
100 100 100 100 100 100 100 100 100 100 100 100 100 100 100 100 100 100 
100 100 100 100 100 100 100 100 100 100 100 100 100 100 
##$AQSEQ= 0
##$AQ_mod= 3
##$AUNM= <au_zg>
##$AUTOPOS= <2 >
##$BF1= 250.13
##$BF2= 250.13
##$BF3= 250.13
##$BF4= 250.13
##$BF5= 500.13
##$BF6= 500.13
##$BF7= 500.13
##$BF8= 500.13
##$BYTORDA= 1
##$CFDGTYP= 0
##$CFRGTYP= 5
##$CHEMSTR= <none>
##$CNST= (0..31)
1 1 145 1 1 1 1 1 1 1 1 1 1 1 1 1 1 1 1 1 1 1 1 1 1 1 1 1 1 1 1 1 
##$CPDPRG= <>
##$CPDPRG1= <>
##$CPDPRG2= <>
##$CPDPRG3= <>
##$CPDPRG4= <mlev>
##$CPDPRG5= <mlev>
##$CPDPRG6= <mlev>
##$CPDPRG7= <mlev>
##$CPDPRG8= <mlev>
##$CPDPRGB= <>
##$CPDPRGT= <>
##$D= (0..31)
0 1 0 0 0 0 0 0 0 0.06 0 0 0 0 0 0 0.0002 0 0 0 0 0 0 0 0 0 0 0 0 0 0 
0 
##$DATE= 1129620828
##$DBL= (0..7)
120 120 120 120 120 120 120 120 
##$DBP= (0..7)
150 150 150 150 150 150 150 150 
##$DBP07= 0
##$DBPNAM0= <>
##$DBPNAM1= <>
$$ [...]
##$SUBNAM7= <"">
##$SUBNAM8= <"">
##$SUBNAM9= <"">
##$SW= 20.6930455092707
##$SWIBOX= (0..15)
0 0 3 0 0 0 0 0 0 0 0 0 0 0 0 0 
##$SW_h= 5175.983436853
##$TD= 65536
##$TD0= 1
##$TE= 294.16
##$TE2= 300
##$TE3= 300
##$TEG= 300
##$TL= (0..7)
0 120 120 120 120 120 120 120 
##$TP= (0..7)
150 150 150 150 150 150 150 150 
##$TP07= 0
##$TPNAME0= <>
##$TPNAME1= <>
##$TPNAME2= <>
##$TPNAME3= <>
##$TPNAME4= <>
##$TPNAME5= <>
##$TPNAME6= <>
##$TPNAME7= <>
##$TPOAL= (0..7)
0.5 0.5 0.5 0.5 0.5 0.5 0.5 0.5 
##$TPOFFS= (0..7)
0 0 0 0 0 0 0 0 
##$TUNHIN= 0
##$TUNHOUT= 0
##$TUNXOUT= 0
##$USERA1= <user>
##$USERA2= <user>
##$USERA3= <user>
##$USERA4= <user>
##$USERA5= <user>
##$V9= 5
##$VALIST= <valist>
##$VCLIST= <CCCCCCCCCCCCCCC>
##$VD= 0
##$VDLIST= <DDDDDDDDDDDDDDD>
##$VPLIST= <PPPPPPPPPPPPPPP>
##$VTLIST= <TTTTTTTTTTTTTTT>
##$WBST= 1024
##$WBSW= 4
##$XGAIN= (0..3)
0 0 0 0 
##$XL= 0
##$YL= 0
##$YMAX_a= 396861
##$YMIN_a= -302615
##$ZGOPTNS= <>
##$ZL1= 120
##$ZL2= 120
##$ZL3= 120
##$ZL4= 120
##$ABSF1= 16.522
##$ABSF2= -4.171173
##$ABSG= 5
##$ABSL= 3
##$ALPHA= 0
##$AQORDER= 0
##$ASSFAC= 0
##$ASSFACI= 0
##$ASSFACX= 0
##$ASSWID= 0
##$AUNMP= <proc_1d>
##$AZFE= 0.1
##$AZFW= 0.1
##$BCFW= 0
##$BC_mod= 0
##$BYTORDP= 0
##$COROFFS= 0
##$CY= 12.5
##$DATMOD= 1
##$DC= 0
##$DFILT= <>
##$DTYPP= 0
##$F1P= 14.0000005364418
##$F2P= -0.99999901652339
##$FCOR= 0.5
##$FTSIZE= 32768
##$FT_mod= 6
##$GAMMA= 0
##$GB= 0
##$INTBC= 1
##$INTSCL= 1
##$ISEN= 128
##$LB= 0.3
##$LEV0= 0
##$LPBIN= 0
##$MAXI= 10000
##$MC2= 0
##$MEAN= 0
##$ME_mod= 0
##$MI= 0
##$NCOEF= 0
##$NC_proc= -5
##$NLEV= 6
##$NOISF1= 0
##$NOISF2= 0
##$NSP= 0
##$NTH_PI= 0
##$NZP= 0
##$OFFSET= 16.522
##$PC= 1
##$PHC0= -66.9643
##$PHC1= 15.75564
##$PH_mod= 1
##$PKNL= yes
##$PPARMOD= 0
##$PSCAL= 4
##$PSIGN= 0
##$REVERSE= no
##$SF= 250.13
##$SI= 32768
##$SIGF1= 0
##$SIGF2= 0
##$SINO= 400
##$SIOLD= 32768
##$SREGLST= <1H.CDCl3>
##$SSB= 0
##$STSI= 32768
##$STSR= 0
##$SW_p= 5175.98343685301
##$SYMM= 0
##$S_DEV= 0
##$TDeff= 65536
##$TDoff= 0
##$TI= <Analysis number 999999
Compound Code 99
Book Reference 9
Project Code 9>
##$TILT= no
##$TM1= 0
##$TM2= 0
##$TOPLEV= 0
##$USERP1= <user>
##$USERP2= <user>
##$USERP3= <user>
##$USERP4= <user>
##$USERP5= <user>
##$WDW= 1
##$XDIM= 32768
##$YMAX_p= 418846792
##$YMIN_p= -742330
$$ End of Bruker specific parameters
$$ ---------------------------------
##NTUPLES= NMR SPECTRUM
##VAR_NAME=  FREQUENCY,     SPECTRUM/REAL,   SPECTRUM/IMAG
##SYMBOL=    X,             R,               I
##VAR_TYPE=  INDEPENDENT,   DEPENDENT,       DEPENDENT
##VAR_FORM=  AFFN,          ASDF,            ASDF
##VAR_DIM=   32768,         32768,           32768
##UNITS=     HZ,            ARBITRARY UNITS, ARBITRARY UNITS
##FACTOR=    0.157963299565203, 1,           1
##FIRST=     4132.6476996994, 0,             0
##LAST=      -1043.33573715361, 0,           0
##MIN=       -1043.33573715361, -742330,     0
##MAX=       4132.6476996994, 418846792,     0
$$ Real data points
##PAGE= N=1
##DATA TABLE= (X++(R..R)), XYDATA
$$ [...]
23074A344076N05789M64954L3565j77868n38917m35111l02995j51549l00261L6704
$$ 1344076 1849865 2314819 2348384 2170516 1631599 1196488 893493 741944 441683 478387
23064D78387J60412j44786L6971Q597l471l344L9322o3273k1135L4404r7899j67119
$$ 478387 638799 494013 530984 539581 536110 532766 572088 508815 487680 522084 424185 257066
23052B57066l40083q3497M1578M56K4016j54818J25626L00450J86950J6903n8185
$$ 257066 -83017 -166514 -124936 -124480 -100464 -255282 -129656 170794 357744 374647 316462
23041C16462j55780j3302j2457L7454j9341J43989J19493r6870Q9710j16655m0449
$$ 316462 160682 147380 134923 172377 153036 297025 416518 319648 409358 292703 252254
23030B52254k2851N9975L2618p9075j82881n1872o5812M7602J02604p3960l12754
$$ 252254 229403 289378 321996 242921 60040 8168 -57644 -10042 92562 18602 -294152
23019b94152l5428Q3559J93565J55331R768j84398j87574j8901p727J15047J40804
$$ -294152 -329580 -246021 -52456 102875 112643 -71755 -259329 -278230 -285957 -170910 -30106
23008c0106q397j99833n1944K29835J02392P1812m1023K9209p7494J9727q7045
$$ -30106 -38503 -238336 -290280 -60445 41947 113759 72736 101945 24451 44178 -42867
22997d2867p0019M6168p263K4325P5006n1693N091K909r0517j83618l8898J88708
$$ -42867 -112886 -66718 -73981 -49656 25350 -26343 -21252 -18343 -108860 -292478 -331376 -142668
22985a42668J08579r8627n0840K8436K47663j37754j13234J06975k8505J8835
$$ -142668 -34089 -132716 -183556 -155120 92543 -45211 -158445 -51470 -79975 -61140
22975f1140K30854j17960p2620R0389m954m6238k507j03764J0474o7495j62661
$$ -61140 169714 51754 -20866 69523 64569 18331 15824 -87940 -77466 -144961 -307622
22964c07622m9212M6189J73296K10276m1029j66756Q0207M5933j31230K4945K96727
$$ -307622 -356834 -310645 -137349 72927 31898 -134858 -54651 -8718 -139948 -115003 181724
22953A81724O2096k07385o2156J45000K7127j45788l9747J74630R5674j51515
$$ 181724 243820 36435 -25721 119279 146406 618 -39129 135501 231175 79660
22943G9660j3896M9508m9960o2740J89615p2304J87881l4864l0841j22276j48545
$$ 79660 65764 115272 65312 2572 192187 119883 307764 272900 242059 119783 -28762
22932b8762J54257J59551R3962p3224j96512n1028j57576K870J59595q5793l4472
$$ -28762 125495 285046 379008 305784 109272 58244 -99332 -96462 63133 -22660 -57132
22921e7132r1945J38793Q6374j69242j03794N7058R1734J42311J23264K2730p9544
$$ -57132 -149077 -10284 76090 -93152 -196946 -139888 -48154 94157 217421 240151 160607
22910A60607J2484k6496j30315k4354J12060P5021J54075R7513j61543L295O5200
$$ 160607 173091 146595 16280 -8074 103986 179007 333082 430595 269052 272347 337547
22899C37547j59500l29977k75899J21813K65116p7271O3385m7549N8266M2490
$$ 337547 178047 -151930 -427829 -306016 -40900 -118171 -54786 -102335 -44069 -1579
22889a579k4216P8218j1487p4864J07094j7331J78135j26760J52443J25001k10341
$$ -1579 -25795 52423 40936 -33928 73166 55835 233970 107210 259653 384654 174313
22878A74313k06455J92317L4642j48280m8258k00610j5625K9506J0568J97661
$$ 174313 -32142 160175 194817 46537 -1721 -202331 -217956 -188450 -177882 19779
22868A9779J60116n2958k7822Q1031j17993j78742j28785m8093J6618J29927L7170
$$ 19779 179895 126937 99115 180146 62153 -116589 -245374 -293467 -276849 -146922 -109752
22857a09752R8411P9024j22442o1103m1558J87577Q2920m9546n8332m8147P060
$$ -109752 -11341 67683 -54759 -115862 -157420 30157 113077 63531 5199 -42948 -35888
22846c5888M2592O0650L0785j31892J12438J30076r4490L1517q7680k20984K2889
$$ -35888 6704 67354 98139 -33753 78685 208761 114271 145788 58108 -162876 -139987
22835a39987l8253Q5276l33908l15458J82281L71010K8958l3661J3018O8053K37444
$$ -139987 -178240 -92964 -426872 -742330 -560049 -189039 -160081 -193742 -180724 -112671 124773
22824A24773r3168J17862J52307j81620j8090j06722j56227m7600K6303j4180
$$ 124773 31605 149467 301774 120154 102064 -4658 -160885 -208485 -182182 -196362
22814a96362N54J46620J59909j20321L201j96431j81604K30780J51104r5384j23170
$$ -196362 -195808 -49188 110721 -9600 -6399 -202830 -384434 -153654 -2550 -97934 -221104
22803b21104q6155j2377K30213K064q2876P418O0918K1898J6570M130j30077N7756
$$ -221104 -307259 -319636 -89423 -87359 -170235 -162817 -101899 -80001 -63431 -59301 -189378 -131622
22791a31622J16162R0199J04161N2019j0000j5212j89088L9609J87517j24063
$$ -131622 -15460 74739 178900 230919 220919 205707 16619 56228 243745 119682
22781A19682k55098k2270J21115K41117J00924j76017j6394r4433j14412N9322
$$ 119682 -135416 -157686 -36571 204546 305470 129453 113059 18626 -95786 -36464
22771c6464P4712o6125O0618k2801j29292L8775O9858q705M7509p9968P7233K5411
$$ -36464 38248 -27877 32741 9940 -119352 -80577 -10719 -19424 28085 -51883 25350 50761
22759E0761J16687P4081j98467O547K05171J07203j32943n4028P8829o4773J9438
$$ 50761 167448 241529 43062 49609 254780 361983 229040 175012 253841 189068 208506
22748B08506N5221j2580k01309o0285O1486J39704p5485j34136k66515R7049J54011
$$ 208506 263727 251147 49838 -10447 51039 190743 115258 -18878 -285393 -188344 -34333
22737c4333q3063J39441N4974j38233j37169j0523J44888M3007K9882j50733J48723
$$ -34333 -117396 22045 77019 -61214 -198383 -208906 -64018 -21011 8871 -141862 6861
22726F861K45287J6526K83q0594j90128P5194K3169m8864r9200j28545N2278J67298
$$ 6861 252148 268674 268957 188363 -1765 73429 96598 47734 -51466 -180011 -127733 39565
22714C9565K18748j91869r1683M5666k6743m5734j08307k63179O5089L71753K06117
$$ 39565 258313 66444 -25239 20427 -6316 -52050 -160357 -423536 -358447 13306 219423
22703B19423R7055l5805P637k4852j03791j60987q5884P2576K5779R769L2633
$$ 219423 316478 280673 288310 263458 159667 -1320 -87204 -14628 11151 20920 53553
22692E3553M2745j09206j05133K56479L15208j0475k60683N7352J38323o4308
$$ 53553 96298 -12908 -118041 138438 453646 443171 182488 239840 378163 313855
22682C13855k76574j77852j86072J47259K85871R8484R2487J52099j68753n8813
$$ 313855 37281 -140571 -326643 -179384 106487 204971 297458 449557 280804 221991
22672B21991o3444L5626j06085K4076j22382O8758j1366J17870J13310Q8452j42146
$$ 221991 158547 194173 88088 112164 -10218 58540 47174 165044 278354 366806 224660
22661B24660l2984J06905o3701j04850m6657k1663k30833k9580N7322J30721K75775
$$ 224660 191676 298581 234880 130030 83373 61710 -169123 -198703 -141381 -10660 265115
22650B65115J16291R8923k26354l8035l6519l9874R9708K9286K2395m2453j02925
$$ 265115 381406 480329 253975 215940 179421 139547 239255 268541 290936 248483 145558
22639A45558o7764k61763J75873J97383O6133J46222J50312L6880j48808k8928
$$ 145558 77794 -183969 -8096 189287 255420 401642 551954 588834 440026 411098
22629D11098J47681J30550J039j7757j94689m736M398p1170M1947P3954j03423
$$ 411098 558779 689329 690368 672611 477922 473186 477584 406414 448361 522315 418892
22618D18892Q1940j20343j47213J00753J50568J20868J77968J09971J15489J96427
$$ 418892 500832 380489 233276 334029 484597 605465 783433 893404 1008893 1205320
22608A205320K74367N64403N22839J18449m85355m34180k85336l14032j05008
$$ 1205320 1479687 2044090 2566929 2685378 2200023 1765843 1480507 1166475 1061467
22599A061467j04844k7072o540R1788l4001r3185k2654o5690k4940j336q1483
$$ 1061467 956623 929551 923011 1014799 980798 887613 864959 799269 774329 772993 691510
22588F91510l6185o3740j45941l7242p8488L838J22890J15767J12965K13633J8871
$$ 691510 655325 591585 445644 408402 329914 333752 456642 572409 685374 899007 917878
22577I17878k06330r4892k20178N8318Q8547P1904k1164L7776m1779r2487R028
$$ 917878 711548 616656 396478 454796 543343 615247 594083 631859 590080 497593 506621
22566E06621N2863N9796O4525q7684m5296J43095J63976J68579k60990j43020
$$ 506621 559484 619280 683805 596121 550825 693920 857896 1026475 765485 622465
22556F22465R9877J88093Q3845L9195J55647K01878N83k41694k53510R5640J45988
$$ 622465 722342 910435 994280 1033475 1189122 1391000 1391583 1149889 896379 992019 1138007
22545A138007K10695J05995J1454L18870Q8734J42417J71232j31796r0003J97639
$$ 1138007 1348702 1454697 1466151 1785021 1873755 2016172 2187404 2055608 1965605 2163244
22535B163244M04945L40820M72266M41206J1751N9587L72683M59382L20041L90164
$$ 2163244 2568189 2909009 3381275 3822481 3834232 3893819 4266502 4725884 5045925 5436089
22525E436089M45043O58455P48313O20656P25067O75419Q32122J060699J210320
$$ 5436089 5881132 6539587 7287900 7908556 8633623 9309042 10141164 11201863 12412183
22516A2412183J086298J341896J896876J789995K068726K652489L118391L756082
$$ 12412183 13498481 14840377 16737253 18527248 20595974 23248463 26366854 30122936
22508C0122936M912560P091640J0697132J7187282K9568677M9024996O5984236
$$ 30122936 35035496 42127136 52824268 70011550 99580227 148605223 214589459
22501B14589459P1723668Q1579876N0953789q0679062j21824173p3605098l9411564
$$ 214589459 286313127 367893003 418846792 338167730 216343557 142738459 103326895
22494A03326895k2756362j3887425r101396o493531m823643l672213k472153j330703
$$ 103326895 80570533 66683108 57581712 51088181 46264538 42592325 40120172 38789469
22486C8789469j089015j462936k575615l367631l531192l350309l018611k581163
$$ 38789469 37700454 36237518 33661903 30294272 26763080 23412771 20394160 17812997
22478A7812997j999034j562676j306181j378095j437571r61804r69261q81994
$$ 17812997 15813963 14251287 12945106 11567011 10129440 9167636 8198375 7316381
22470G316381r10365o14879n12924n09412m98379l70167k28018j90046l41441
$$ 7316381 6406016 5791137 5278213 4768801 4270422 3900255 3672237 3482191 3140750
22461C140750k31943j38934k94468k02583k65778p8624l18814m27640m5885N7962
$$ 3140750 2908807 2769873 2475405 2272822 2007044 1928420 1609606 1181966 1136081 1194043
22451A194043j7216j98484k08256o4659j87892J7300r8402j08536L2334j19507
$$ 1194043 1176827 978343 770087 705428 517536 534836 436434 327898 360232 240725
22441B40725K3551K1559J30652j8580k5970j62953P2283R2858Q1855L453r5730
$$ 240725 264276 285835 416487 397907 371937 208984 281267 374125 455980 459433 363703
22430C63703k19171Q503J45259K37684m9246j3216j51620l03822j15738m6314
$$ 363703 144532 153035 298294 535978 486732 473516 321896 18074 -97664 -143978
22420a43978P0438K22287K07724N7494j56590J19851Q0790j95480m3619J27510
$$ -143978 -73540 148747 356471 413965 257375 377226 458016 262536 218917 346427
22410C46427M978k5430k74823j7392p1403O9433J42773J66331n3930j40039j14445
$$ 346427 351405 325975 51152 33760 -37643 31790 174563 340894 286964 146925 32480
22399C2480p698J77767K16053L18433L80118L04583K45731K07168K28638m35382
$$ 32480 24782 202549 418602 737035 1117153 1421736 1667467 1874635 2103273 1667891
22389A667891o37260m29704j09931r4054l3218J28508Q8070j33724J6235j25581
$$ 1667891 1030631 600927 490996 396942 363724 492232 580302 446578 462813 337232
22379C37232k6832J95314J97035P448j08712P7011M3925j63063m43826l18473
$$ 337232 310400 505714 702749 710197 601485 678496 722421 559358 115532 -202941
22369b02941j23905J30754N2229J22947j971j06534P3094J2092K4386K57712M2331
$$ -202941 -326846 -196092 -143863 -20916 -22887 -129421 -56327 -44235 -19849 237863 280194
22358B80194Q7080O4456m6541M6021j08817j82252k10635j4960K62846m0561n0093
$$ 280194 367274 431730 385189 431210 322393 140141 -70494 -85454 177392 136831 86738
22347H6738J026o6150p6122j94477r4977K1250P2542J506J55575p3322n576M9082
$$ 86738 87764 21614 -54508 -248985 -343962 -322712 -250170 -248664 -93089 -166411 -171987 -122905
22335a22905P6638J17308m6429j66373k79496n1498L22652O5558P517o2988j26470
$$ -122905 -46267 71041 24612 -141761 -421257 -472755 -150103 -84545 -77028 -140016 -266486
22324b66486N295J18435J61966K17148o0762j96823j63595P9771J11255K8599
$$ -266486 -261191 -142756 19210 236358 175596 -21227 -184822 -105051 6204 34803
22314C4803l5664j92279k22588Q2195J75068q210m6641J12591j57561o3315J47668
$$ 34803 -861 -193140 -415728 -333533 -158465 -166675 -213316 -100725 -258286 -321601 -173933
22303a73933M088L342J23428o6539N5215j01752o6916K63732l306o5160K68423
$$ -173933 -169845 -166503 -43075 -109614 -54399 -156151 -223067 40665 37359 -27801 240622
22292B40622j53892j14889K6172Q8547j85153M8682K3385m3162Q0118J08524l2209
$$ 240622 86730 -28159 -1987 86560 -98593 -49911 -26526 -69688 10430 118954 86745
22281H6745K8765K859m1589j44381j57178O8418Q1958q0804j57373K48990J11935
$$ 86745 115510 118369 76780 -67601 -224779 -156361 -74403 -155207 -312580 -63590 48345
22270D8345j8022L5987O0970J06143j3190R1971k7723N4042j31802k36470k40216
$$ 48345 30323 66310 127280 233423 220233 312204 284481 338523 206721 -29749 -269965
22259b69965o1796J887J02054P4247J00141Q1531j95874n0985J48433P7451Q7465
$$ -269965 -331761 -329874 -227820 -153573 -53432 28099 -167775 -218760 -70327 7124 94589
22248I4589n4793j61276k1995Q3923k3595q3867J34904J26414n2263R6940O2514
$$ 94589 39796 -121480 -143475 -59552 -83147 -167014 -32110 94304 42041 138981 201495
22237B01495L5655J26140P5121j95365j11848N5026Q3992J2433o6611P8405j02397
$$ 201495 237150 363290 438411 243046 131198 186224 270216 282649 216038 294443 192046
22226A92046M2273j14326r5999P1359J9290j42156q2429k1651r0213L9285P3332
$$ 192046 234319 119993 23994 95353 114643 -27513 -109942 -131593 -221806 -182521 -109189
22215a09189j7770J11624J85933q967l1566K9664m8494j11457j73382q1498J92695
$$ -109189 -126959 -15335 170598 161631 130065 159729 111235 -222 -173604 -255102 -62407
22204f2407J58408j40667J30220K10625J36429k47292l54350m9029J9344J76248
$$ -62407 96001 -44666 85554 296179 432608 185316 -169034 -218063 -198719 -22471
22194b2471J94148l0088J24255M103j70425P5075L3354Q8869J07216l3093J7512
$$ -22471 171677 141589 265844 269947 99522 174597 207951 296820 404036 370943 388455
22183C88455o980K5006m7916o1930k0815L7548n6003k24088N052Q9912R6720L1093
$$ 388455 381475 406481 358565 296635 275820 313368 257365 33277 38329 128241 224961 256054
22171B56054n5643m8317n6178K390j62022q6077l1693N6590r8869r5994K15740
$$ 256054 200411 152094 95916 98306 -63716 -149793 -181486 -124896 -223765 -319759 -104019
22160a04019K01731Q9206l0156q5047j91876k29632R1135J86472N3783j07447
$$ -104019 97712 186918 156762 71715 -120161 -349793 -258658 -72186 -18403 -125850
22150a25850k00257o2144P5719j370o3594l6711K90696j56289q0306L1858J80084
$$ -125850 -326107 -388251 -312532 -313902 -377496 -414207 -123511 -279800 -360106 -328248 -148164
22139a48164p5147L1068j53795J3888J91469N7196P3692J2969J979P8747J93419
$$ -148164 -223311 -192243 -346038 -332150 -140681 -83485 -9793 3176 5155 83902 277321
22128B77321J9834j55927k21159j53428J20124j0018q1710N9353m3683J9574J76082
$$ 277321 297155 141228 -79931 -233359 -113235 -123253 -204963 -145610 -189293 -169719 6363
22117F363Q9770o1802L1863j6453l46366q645J31040J15002o9073j70796m977
$$ 6363 96133 34331 66194 49741 -296625 -305270 -174230 -59228 -128301 -299097 -304074
22106c04074M97201L64007r8228j02209p6693j95726J56998K31328l44527k24387
$$ -304074 193127 557134 458906 356697 280004 84278 241276 472604 128077 -96310
22096i6310O2627k64444m7596J17566j9274O0034P8060M6382Q4955K18633R4318
$$ -96310 -33683 -298127 -345723 -228157 -247431 -187397 -109337 -62955 22000 240633 334951
22085C34951j60844j14180o1116j02090Q8290J63496o9926j47542R5195j40614
$$ 334951 174107 59927 -1189 -103279 -14989 148507 78581 -68961 26234 -114380
22075a14380l20928q7787n6301L2951L34278L5485p19J55677L72287J92298j98122
$$ -114380 -435308 -523095 -579396 -546445 -212167 -176682 -177401 -21724 350563 542861 344739
22064C44739k34039r1259M5449N3254J0102J00832J64668j87460l96439o5173
$$ 344739 110700 19441 64890 118144 128246 229078 393746 206286 -190153 -255326
22054b55326J80643l0254K8182Q0312M6955n0383j73073l2202J82261m3828j98294
$$ -255326 -74683 -104937 -76755 3557 50512 129 -172944 -205146 -22885 -66713 -265007
22043b65007L0959J46770J56243N3081j97241p2373J58066P8084o7191p856J5337
$$ -265007 -234048 -87278 68965 122046 -75195 -147568 10498 88582 21391 13535 28872
22032B8872l2625j59142L3625j0714M8439m1610K7338R9872j99931k01241K9196
$$ 28872 -3753 -162895 -129270 -139984 -91545 -133155 -105817 -5945 -205876 -407117 -377921
22021c77921J05051q1775k15933J42811J75410K093J01791J61958K01704M6588
$$ -377921 -272870 -354645 -570578 -427767 -252357 -250264 -148473 13485 215189 261777
22011B61777j72579K9331Q9219J29085j63226K4734O4217q3127K1368j3839j82131
$$ 261777 89198 118529 207748 336833 173607 198341 262558 179431 200799 186960 4829
22000D829m0742j02898L3364j64871l568L64935J55985j01999j55658m4769n2220
$$ 4829 -35913 -138811 -105447 -270318 -273886 91049 247034 145035 -10623 -55392 -107612
21989a07612K4686q4642p0599P2162P2894j76576j32643K880M8671j7756r8397
$$ -107612 -82926 -167568 -238167 -166005 -93111 -269687 -402330 -399450 -350779 -368535 -466932
21978d66932M9099J92183M2168Q320J87849j77343p8786M228Q7719L01754J2530
$$ -466932 -417833 -225650 -183482 -175162 12687 -164656 -243442 -239214 -151495 150259 162789
21967A62789j37860j02798l1038J2685j16731j68840M820J56825o5964o5641N942
$$ 162789 24929 -77869 -108907 -96222 -212953 -381793 -376973 -220148 -286112 -351753 -345811
21956c45811K11253M8851q9692j99705J7962J98108J33333R1192p6929K0715O9110
$$ -345811 -134558 -85707 -175399 -375104 -357142 -159034 -25701 65491 -11438 9277 78387
21945G8387p4381j14654j4039R3050K4109o3644P2720P0731K70311j0778j96807
$$ 78387 4006 -110648 -124687 -31637 -7528 -71172 1548 72279 342590 331812 135005
21934A35005l0681o4130J73892m8037k62409O2256Q5895j5849j09023J7568r3162
$$ 135005 104324 40194 214086 166049 -96360 -34104 51791 35942 -73081 -55513 -148675
21923a48675J71283K72976M10302K44956K3575L58695L13522j97680n47185m78139
$$ -148675 22608 295584 705886 950842 974417 1333112 1646634 1448954 901769 423630
21913D23630j19945j9035k3064l8902k09208m3855O7426R7391k17582j75092O4887
$$ 423630 303685 284650 261586 222684 13476 -30379 37047 134438 -83144 -258236 -193349
21902a93349J33447N0093o9861R1906Q1970J9774j79952J3418N4369K9444o4345
$$ -193349 -59902 -9809 -79670 12236 94206 113980 -65972 -52554 1815 31259 -33086
21891c3086P2319P9097J9428j24419j25239j91218P4674q7681k3580J16946K05369
$$ -33086 39233 118330 137758 13339 -111900 -303118 -228444 -316125 -339705 -222759 -17390
21880a7390k0870L8179k2071m9661j5052P6054M0271j76502k05293J09115Q831
$$ -17390 -38260 -81 -22152 -71813 -86865 -10811 29460 -147042 -352335 -243220 -234389
21869b34389o6784K07844J52505j53105j41110j15301N7316K24710K12368J07572
$$ -234389 -301173 -93329 59176 -93929 -235039 -350340 -293024 -68314 144054 251626
21859B51626K54830J7843k90816j79870j6832K3189j68042j43206J93913J19485
$$ 251626 506456 524299 233483 53613 36781 59970 -108072 -251278 -57365 62120
21849F2120l1764n6271m5234j24615J26351N4967J72399J67248j31994k73603
$$ 62120 30356 -25915 -71149 -195764 -69413 -14446 157953 325201 193207 -80396
21839h0396l5898J8621O2393K4484Q0811M0624k2155j27385K5957r4605m7309
$$ -80396 -116294 -97673 -35280 -10796 70015 110639 88484 -38901 -12944 -107549 -154858
21828a54858M2577P3727J86681o3588q5649R7314M8926p6577j41602k10454q4363
$$ -154858 -112281 -38554 148127 84539 -1110 96204 145130 68553 -73049 -283503 -367866
21817c67866j03859L7959R6522J75774l5635j15301Q6588L29822J52530j01871
$$ -367866 -471725 -433766 -337244 -161470 -197105 -312406 -225818 104004 256534 154663
21807A54663o5258k5334J41028q0379q8602j60727j62527J60155K5804k1615q0271
$$ 154663 89405 64071 205099 124720 36118 -124609 -287136 -126981 -101177 -122792 -203063
21796b03063J43456q691k35073o5567K10516j36841Q9458N9142M9717R3817j31450
$$ -203063 -59607 -68298 -303371 -368938 -158422 -295263 -205805 -146663 -96946 -3129 -134579
21785a34579J1183J60950J23977J16024r4071k15139j76300j985J60018K05373
$$ -134579 -123396 37554 161531 277555 183484 -31655 -207955 -209940 -49922 155451
21775A55451r2054j58125m9193P3319R522J01110J52324Q5453Q4062m5751m5684
$$ 155451 63397 -94728 -143921 -70602 -61080 40030 192354 277807 361869 316118 270434
21764B70434j34801P433Q2655l76q4881j6001j21257n7409J88882J56057R1285
$$ 270434 135633 143066 225721 225345 140464 124463 3206 -54203 134679 290736 382021
21753C82021j10203j69395o0667q6925K2817j4440J08424Q7722K40027q6638q6442
$$ 382021 271818 102423 41756 -45169 -22352 -36792 71632 159354 399381 312743 226301
21742B26301o1702r5523k70032j44535J18149J61983m8195q0088Q2422k0840q1310
$$ 226301 164599 69076 -200956 -345491 -227342 -65359 -113554 -193642 -111220 -132060 -213370
21731b13370J3081J5251j37286K31793n8998o1503q6742R5081J06593J04153Q5023
$$ -213370 -200289 -185038 -322324 -90531 -149529 -211032 -297774 -202693 -96100 8053 93076
21720I3076J61419K3957j02770k43417r5012l6132n0503p6634l1936o6308J04787
$$ 93076 254495 278452 175682 -67735 -162747 -198879 -249382 -326016 -357952 -424260 -319473
21709c19473J62834J05605J3982k41759j54163Q1109K4034k410j23544O625J37315
$$ -319473 -156639 -51034 -37052 -278811 -432974 -351865 -327831 -330241 -453785 -447160 -309845
21698c09845O4307p8547j68071K39268K1952P3302P9477O9114J36602q8052K5607
$$ -309845 -245538 -324085 -492156 -252888 -230936 -157634 -78157 -9043 127559 39507 65114
21687F5114j5648o3268j20338N2293J7039O9526R9618J65161J04880j86985q4123
$$ 65114 49466 -13802 -134140 -81847 -64808 4718 104336 269497 374377 187392 103269
21676A03269l7373K2232j8385r9926n5020O7407J27641L1359j66847k20179r4468
$$ 103269 65896 88128 69743 -30183 -85203 -17796 109845 141204 -25643 -245822 -340290
21665c40290L6378J16460N0528J81769j47785R2508j52552o3405J54214J57721
$$ -340290 -303912 -187452 -136924 44845 -102940 -10432 -162984 -226389 -72175 85546
21655H5546J16607L4185k80791j23026Q6279J28576O3637n265j35697r0975m2405
$$ 85546 202153 236338 -44453 -167479 -81200 47376 111013 105748 -29949 -120924 -163329
21644a63329N3526K37477r725k30297j6396M3044J07252m2172q059J55571J6261
$$ -163329 -109803 127674 117949 -112348 -128744 -85700 21552 -20620 -28679 126892 143153
21633A43153j13696J25480m6611Q2739r3864j04791q4478P1249j69303l3817J2976
$$ 143153 29457 154937 108326 191065 97201 -7590 -92068 -20819 -190122 -223939 -210963
21622b10963P5121p7341j35714K44278K40041m6970m8251q5049n1665K2788P140
$$ -210963 -135842 -213183 -348897 -104619 135422 88452 40201 -44848 -96513 -73725 -66585
21611f6585J70069p7904j97192j02106K34911K8623p3956O587j09992O8189M0668
$$ -66585 103484 25580 -171612 -273718 -38807 -10184 -84140 -77553 -187545 -119356 -78688
21600g8688N3156n9541L546q9889r2763K1795J15195R8075j73071J67386J24087
$$ -78688 -25532 -85073 -81527 -171416 -264179 -242384 -127189 -29114 -202185 -34799 89288
21589H9288K02494j09994J51205r2740k44652j29239j57101O9170R8237n9424
$$ 89288 291782 181788 332993 240253 -4399 -133638 -290739 -221569 -123332 -182756
21579a82756j118k9609K68461O4041l1468O5266j0895l32468k95691K7708O4737
$$ -182756 -183874 -213483 54978 119019 87551 152817 141922 -190546 -486237 -458529 -393792
21568c93792L7785Q7510Q7245J2388J27473O9578j95236n9123J73234k3161L091
$$ -393792 -356007 -268497 -181252 -168864 -41391 28187 -167049 -226172 -52938 -76099 -73008
21557g3008J03361Q3220J74090n1374k34282k07207o2945M3868K371J45460J8558
$$ -73008 30353 113573 287663 236289 2007 -205200 -268145 -224277 -221906 -76446 -57888
21546e7888M96j8318k9704k783L2972Q7145q7839j61805o1289j97190O9504L95457
$$ -57888 -57392 -75710 -105414 -108197 -75225 11920 -75919 -237724 -299013 -496203 -426699 -31242
21534c1242q0959j54637j2809M5854o449J6246m0263p924J42196j02959j21361
$$ -31242 -112201 -266838 -279647 -233793 -240242 -223996 -264259 -272183 -129987 -232946 -354307
21523c54307R1019m6644j41359J49530Q3917O8703J63284R5792r8046J47943k33505
$$ -354307 -263288 -309932 -451291 -301761 -217844 -149141 14143 109935 11889 159832 -73673
21512g3673j34492n7198p8850K55286K22154r9180m7659j74927j05313l7900J2333
$$ -73673 -208165 -265363 -344213 -88927 133227 34047 -13612 -188539 -293852 -331752 -319419
21501c19419J07602j25642o6328O4547n6577J15292M2393j70765j6286R4482k2181
$$ -319419 -211817 -337459 -403787 -339240 -395817 -280525 -238132 -408897 -425183 -330701 -352882
21490c52882L3205J11961O0681r2829M5635J06647L42227Q2390k57814l8228p7001
$$ -352882 -319677 -207716 -147035 -239864 -194229 -87582 254645 337035 79221 40993 -36008
21479c6008m9939l9786j18192J12879O8760p3320r1574J35409K91652n5537o2272
$$ -36008 -85947 -125733 -243925 -131046 -62286 -135606 -227180 -91771 199881 144344 82072
21468H2072Q9037J04986q2972p7170o745l2898j22119j47012j07182j69501n455
$$ 82072 171109 276095 193123 115953 109208 76310 -45809 -192821 -300003 -469504 -474959
21457d74959J63350J08921O6716Q5686J14837m9659p996q0638j99439K06755J59594
$$ -474959 -311609 -202688 -135972 -50286 64551 14892 6896 -73742 -273181 -66426 93168
21446I3168o7702q4277j29539O2202R1539q6899k79508j6831J93410K18694j5913
$$ 93168 25466 -58811 -188350 -126148 -34609 -121508 -401016 -417847 -224437 -5743 -21656
21435b1656J8198k469j34412N5585M8303M7678n2815q6950q2572L2019M4542O4840
$$ -21656 -3458 -5927 -140339 -84754 -36451 11227 -41588 -128538 -211110 -179091 -134549 -69709
21423f9709j59686l4217l856J89204M9961j73625q7305J00511m812j05147k1922
$$ -69709 -229395 -263612 -267468 -78264 -28303 -201928 -289233 -188722 -193534 -298681 -320603
21412c20603J54454K59581n000j71189n5876O6880k84156K9354K70084j00513
$$ -320603 -166149 93432 88432 -82757 -138633 -71753 -355909 -326555 -56471 -156984
21402a56984k30939J00147K90629J68836M1890j1590j07485J11595Q8062l01978
$$ -156984 -387923 -287776 2853 171689 213579 201989 94504 206099 294161 -7817
21392g817k35061J457l2549L0267j243O6937m4748j35611J07640J09752N8386
$$ -7817 -242878 -241421 -273970 -243703 -244946 -178009 -222757 -358368 -250728 -140976 -82590
21381h2590N8849J477r5320j06244k31487O2657p0674J39901P8369j74671k24918
$$ -82590 -23741 -22264 -117584 -223828 -455315 -392658 -463332 -323431 -245062 -419733 -644651
21370f44651N8747K94790K98704O6506k58059o1238K34271J9965K720O9548j92591
$$ -644651 -585904 -291114 7590 74096 -183963 -245201 -10930 9035 11755 81303 -111288
21359a11288q3683O6358n6457j40885j00162l2907K9643J10044K41205N7198O3771
$$ -111288 -194971 -128613 -185070 -325955 -426117 -459024 -429381 -319337 -78132 -20934 42837
21348D2837P8046j45704j02698P055o7465J06390K50824j7868Q286Q2660L8474
$$ 42837 120883 -24821 -127519 -120464 -187929 -81539 169285 151417 159703 242363 280837
21337B80837L6473o1903k6790Q3455J8221o4893j22462k34638j09792K27279J34769
$$ 280837 317310 255407 228617 312072 330293 265400 142938 -91700 -201492 25787 160556
21326A60556j88439k0295j52141K33384J90552K6481J77390r5959j87633m5660
$$ 160556 -27883 -48178 -200319 33065 223617 250098 427488 331529 143896 98236
21316I8236L7712k9644j95695P7378K39523J14600j70076l24738J8035K93j37831
$$ 98236 135948 106304 -89391 -12013 227510 342110 172034 -152704 -134669 -134376 -272207
21305b72207J37673K7703j6495J2738J02294J10279j16327r835q9985L7193p8958
$$ -272207 -134534 -106831 -123326 -110588 -8294 101985 -14342 -24177 -114162 -76969 -155927
21294a55927n5980q1262J94656P421p7583P809Q6387l3480j17858P4686J56280
$$ -155927 -211907 -293169 -98513 -91092 -168675 -160866 -74479 -107959 -225817 -151131 5149
21283E149j90429j78085J18410L32506J63798O0138j35356n3270m1159j01210
$$ 5149 -185280 -363365 -244955 87551 251349 311487 176131 122861 81702 -19508
21273a9508n4800J03841P8976m7168J0760j14698j54854K9582K21629K9973p655
$$ -19508 -74308 29533 108509 61341 72101 -42597 -197451 -167869 53760 83733 76078
21262G6078M7204o3094j44203l635m4354r4365J57763N1506p0043K5650L6781
$$ 76078 123282 60188 -84015 -87650 -132004 -226369 -68606 -17100 -87143 -61493 -24712
21251b4712P1275N5602n2482P3499K1631J0509k03958j46825j66075j22524J3395
$$ -24712 46563 102165 49683 123182 144813 155322 -48636 -195461 -361536 -484060 -470665
21240d70665J61323J06449J41671K88413K6031j28079j05582j02275j26641j43782
$$ -470665 -309342 -202893 -61222 227191 253222 125143 19561 -82714 -209355 -353137
21230c53137j76649k06125Q852K21516J06166k5746J22010o26j17277L45847q9267
$$ -353137 -529786 -735911 -727059 -505543 -399377 -425123 -303113 -303739 -421016 -75169 -164436
21219a64436r3042n1688N650J90105J36470Q6288p2271o8405q1608L2627N5530
$$ -164436 -257478 -309166 -303516 -113411 23059 109347 37076 -31329 -112937 -80310 -24780
21208b4780J54136l3769j54214l4373K79625K46361r4588k39615j08182k4606
$$ -24780 129356 95587 -58627 -93000 186625 432986 338398 98783 -9399 -34005
21198c4005J0918j40569o6933o046n0851k6408l3083P1871j7773r0905j19885
$$ -34005 -23087 -163656 -230589 -236635 -287486 -313894 -346977 -275106 -292879 -383784 -503669
21187e03669J1975M4015J95757M1615q3494p8187O0274M8753K4656K7157J09088
$$ -503669 -491694 -447679 -251922 -210307 -293801 -371988 -311714 -262961 -238305 -211148 -102060
21176a02060J28835N7866M0267o1033J2881j43712q5347k9482P7712L8232J14716
$$ -102060 26775 84641 124908 63875 76756 -66956 -152303 -181785 -104073 -65841 48875
21165D8875M9808j10730k11568m82012o414K03216L70270J81837j84094j20967
$$ 48875 98683 -12047 -223615 -705627 -712041 -508825 -138555 43282 -140812 -261779
21155b61779O1437Q0900J09109o4347l3671K33438K40401k40659k10085o1320
$$ -261779 -200342 -119442 -10333 -74680 -108351 125087 365488 124829 -85256 -146576
21145a46576R9035M1966J2203j06043j38569k1824N5136l3088j35580P0634J15727
$$ -146576 -47541 -5575 6628 -99415 -237984 -259808 -204672 -237760 -373340 -302706 -186979
21134a86979N5997J55930J4817m23193M84J31455J02077J18170P2285k9264l3929
$$ -186979 -130982 24948 39765 -383428 -382944 -251489 -149412 -31242 41043 11779 -22150
21123b2150q284J8746r6376k87016K03154K90125N4522j58955q8510O1371O0734
$$ -22150 -30434 -11688 -108064 -395080 -191926 98199 152721 -6234 -94744 -33373 27361
21112B7361j20429j7353j5306j02096j154K2052R4350L4481j2736L2922P5892
$$ 27361 -93068 -110421 -125727 -227823 -228977 -206925 -112575 -78094 -90830 -57908 17984
21101A7984O1555m0983J07148j64636j68957j39765R147J88139M2005n531j56831
$$ 17984 79539 38556 145704 -18932 -187889 -327654 -318507 -130368 -88363 -93894 -250725
21090b50725J64276L01823L15733r1594l9576P1604j38337j18054n6723n0608
$$ -250725 -86449 215374 531107 439513 399937 471541 333204 215150 158427 107819
21080A07819Q6436k37077p5194P1804K7628P0116p8641O9486R5867j70167J18696
$$ 107819 194255 -42822 -118016 -46212 -18584 51532 -27109 42377 138244 -31923 86773
21069H6773O6630r3152j24386k87194l3587J81612J8389P7827m0761M5529J12669
$$ 86773 153403 60251 -64135 -351329 -384916 -203304 -184915 -107088 -147849 -102320 10349
21058A0349j35913J1004R8076k6419j95196N246n807mJ32670k5091L3839q69J358
$$ 10349 -125564 -114560 -16484 -42903 -238099 -232853 -238660 -238664 -105994 -131085 -97246 -98115 -96757
21045i6757m1753J68997J70831J21879q1952k17131M9570M2696j5959r8838j11503
$$ -96757 -138510 30487 201318 323197 241245 24114 73684 116380 100421 1583 -109920
21034a09920N8078P6506q5448o1175j30208L11318K14336n6224M9310L8691j57096
$$ -109920 -51842 24664 -60784 -121959 -252167 59151 273487 217263 266573 305264 148168
21023A48168l15985j38117j14072j8368J47360J26414j09941P2020J8731J18133
$$ 148168 -167817 -305934 -420006 -438374 -291014 -164600 -274541 -202521 -183790 -65657
21013f5657o6024k05459J09431r4883N3939L5482o716j4772J24430N1080J73706
$$ -65657 -131681 -337140 -227709 -322592 -268653 -233171 -239887 -254659 -130229 -79149 94557
21002I4557n436m7699j30259M9174K2425q4919o7859j96689j09680J074J67831
$$ 94557 89121 41422 -88837 -39663 -17238 -102157 -170016 -366705 -476385 -475311 -307480
20991c07480L8586L6307O2708K6464Q2387J72358j14869P4963q4189r4016L3647
$$ -307480 -268894 -232587 -169879 -143415 -61028 111330 -3539 71424 -12765 -106781 -73134
20980g3134m2736j29681K7413k30278Q2295Q9968l4824J72403N7252J1197N7637
$$ -73134 -115870 -245551 -218138 -448416 -366121 -276153 -310977 -138574 -81322 -70125 -12488
20969a2488j51381j38134q6913K2101M7324J24717P9300q4307r8590R2723J03137
$$ -12488 -163869 -302003 -388916 -366815 -319491 -194774 -115474 -199781 -298371 -205648 -102511
20958a02511P8150j55256J86137M0910o4679J61648J85997N3623m6451r2873o985
$$ -102511 -24361 -179617 6520 47430 -17249 144399 330396 384019 337568 244695 237710
20947B37710p8726p2239j79810k34249l0501K29541j1249J84105J93321J47650
$$ 237710 158984 86745 -93065 -327314 -357815 -128274 -139523 44582 237903 385553
20937C85553k01328q2453j07990j40589O7202J2171n4330Q032J91816J02638n5374
$$ 385553 184225 101772 -6218 -146807 -79605 -67434 -121764 -113732 78084 180722 125348
20926A25348r7327k18613n0259J15742K79625J01563j96488j80818j86179K20975
$$ 125348 28021 -190592 -240851 -125109 154516 256079 59591 -121227 -307406 -86431
20916h6431K01110K9760n5260o158J5025l0232K97836j42535m4403j70951k05282
$$ -86431 114679 144439 89179 83021 98046 67814 365650 223115 178712 7761 -197521
20905a97521J45962J36291m6486K5130j53642o5304l2241L7139J00101n7860K686
$$ -197521 -51559 84732 38246 63376 -90266 -155570 -187811 -150672 -50571 -108431 -105745
20894a05745L6453J74004Q2977j03130j36919m1768J01346Q1099k08312j56407
$$ -105745 -69292 104712 187689 84559 -52360 -94128 7218 88317 -119995 -276402
20884b76402R6409J56649Q1751J20783l69360j91694J37121K39897J8456j25731
$$ -276402 -179993 -23344 58407 179190 -190170 -381864 -244743 -4846 13610 -112121
20874a12121Q1361J62754K59773l9169l0285P858j08023k55549j79436K2858O6482
$$ -112121 -30760 131994 391767 352598 322313 330171 222148 -33401 -212837 -189979 -123497
20863a23497o4207j0750L4671R6673p4755r1319J70901n935p6209J4813J3616
$$ -123497 -187704 -198454 -163783 -67110 -141865 -233184 -62283 -68218 -144427 -129614 -115998
20852a15998m6872q3498k2446J65322Q233j2047J7104o1268j31313J97583J04304
$$ -115998 -162870 -246368 -268814 -103492 -95259 -107306 -90202 -151470 -282783 -85200 19104
20841A9104J59460K2317j13554n9183j49027L4781k8023r8516j41999Q5041J76481
$$ 19104 178564 200881 87327 28144 -120883 -86102 -114125 -212641 -354640 -269599 -93118
20830i3118L7437p4096J8181J24341J52297L8005k5523j86789q6963K4745J61326
$$ -93118 -55681 -129777 -111596 12745 165042 203047 177524 -9265 -96228 -71483 89843
20819H9843J05427r2293j42505k03123k23859o8095J28213K52565J97959j79922
$$ 89843 195270 102977 -39528 -242651 -466510 -534605 -406392 -153827 44132 -135790
20809a35790Q3285R9091m6917O0662M3820j04980j0731O647j31295P0863P4163
$$ -135790 -52505 46586 -331 60331 104151 -829 -11560 -4913 -136208 -65345 8818
20798H818Q5243o8510j16930j54843k13863J45624K05844Q7832o2221q6615L7671
$$ 8818 94061 25551 -91379 -246222 -460085 -314461 -108617 -20785 -83006 -169621 -131950
20787a31950J46536J64735p5389k41105j5095J28681r5657J7858n6442q461P0229
$$ -131950 14586 179321 103932 -137173 -152268 -23587 -119244 -101386 -157828 -166289 -96060
20776i6060m3494J39635l8412j38591L6188j08253k50633j1056K74577Q7489J35241
$$ -96060 -139554 81 -38331 -176922 -140734 -248987 -499620 -510676 -236099 -148610 -13369
20765a3369J14478m822j08368j22469j69416k41311k173J19780R7429k7592p5219
$$ -13369 101109 96287 -12081 -134550 -303966 -545277 -547450 -427670 -330241 -357833 -433052
20754d33052m0364m6361J93519K65296J51699o1882j68094j74114p8699J63962
$$ -433052 -473416 -519777 -326258 -60962 90737 28855 -139239 -313353 -392052 -228090
20744b28090K07271J36442j16175O6304K5716k13651q0026J86422N3808r6660
$$ -228090 -20819 115623 -552 65752 91468 -122183 -202209 -15787 38021 -58639
20734e8639l09505j20692L557K38404L16305M4970J01010k2599j79956j56629
$$ -58639 -368144 -488836 -485279 -246875 69430 114400 215410 192811 12855 -143774
20724a43774o3499O1931P5844j08929j16404J7140J1988n7867K9906J37499J22871
$$ -143774 -207273 -145342 -69498 -178427 -294831 -277691 -265703 -323570 -293664 -156165 -33294
20713c3294J57364R3569J84329K1120k01867j05327L5236P2734j24801j35951
$$ -33294 124070 217639 401968 423088 221221 115894 151130 223864 99063 -36888
20703c6888J0505O7219j68785R3876L5027l7379J614M1114O9317K28986n7978
$$ -36888 -26383 40836 -127949 -34073 954 -36425 -34811 6303 75620 304606 246628
20692B46628o599j93617j0620l2475j62436o6494M2760J57416Q7235M4810R3816
$$ 246628 240029 46412 35792 3317 -159119 -225613 -182853 -25437 61798 106608 200424
20681B00424M6850m2446j44012Q7138k8634n8573k8736j52725M1405J79528j26787
$$ 200424 247274 204828 60816 147954 119320 60747 32011 -120714 -79309 100219 -26568
20670b6568j99262k9271K4928M9294J83551P2506r2941J12742J73751k6219p9262
$$ -26568 -225830 -255101 -230173 -180879 2672 75178 -17763 94979 268730 242511 163249
20659A63249r5829K27528L1986k70353o4942P7759q5132o5138o5976J72123K03112
$$ 163249 67420 294948 326934 56581 -8361 69398 -15734 -80872 -146848 25275 228387
20648B28387P4775j76208j30696J90277K49633M1733m9567p2583j44926l07784
$$ 228387 303162 126954 -3742 186535 436168 477901 428334 355751 210825 -96959
20638i6959k19922p2252J61349K46455J22189O008r9730R4939J39718j09396j64966
$$ -96959 -316881 -389133 -227784 18671 140860 146868 47138 142077 281795 172399 7433
20627G433r9922j72187j44506l8147o7334K32187P6963K3882j0762K3657J01114
$$ 7433 -92489 -264676 -409182 -447329 -514663 -282476 -205513 -181631 -192393 -168736 -67622
20616f7622J12529O6729l0785P3526K4935o8908j29611r6913j89857k1907K54147
$$ -67622 44907 111636 80851 154377 179312 110404 -19207 -116120 -305977 -327884 -73737
20605g3737o1036o6493N4198R0734l403J9969J67639j02658j88460M1892L4775
$$ -73737 -134773 -201266 -147068 -56334 -59737 -39768 127871 25213 -163247 -121355 -86580
20594h6580j31845j19280J37017o6149j22775K2187J06098Q6691J40531J42755
$$ -86580 -218425 -337705 -200688 -266837 -389612 -367425 -261327 -174636 -34105 108650
20584A08650j12924J24867N1870p0326q2625K08250j80969q1392j8734r1426l1926
$$ 108650 -4274 120593 172463 102137 19512 227762 46793 -34599 -53333 -144759 -176685
20573a76685J55169K04547P7313r8117J04370j40653j13039P2133R109n1177N9889
$$ -176685 -21516 183031 260344 162227 266597 125944 12905 85038 94147 42970 102859
20562A02859k3139q9108n1442O935K30890J55120R3573K70139J12584k16273j42496
$$ 102859 79720 -9388 -60830 -53895 176995 332115 425688 695827 808411 592138 449642
20551D49642L4574N8395l34234n5509m856p4418l9184m9406q8896O9220K07546
$$ 449642 484216 542611 208377 152868 148012 73594 34410 -14996 -103892 -34672 172874
20540A72874j00840o2480p7078m6417k9194N7336J1799J36345N6665p3954k526
$$ 172874 72034 9554 -67524 -113941 -143135 -85799 -74000 62345 119010 45056 42530
20529D2530J10944n6498k13269l77290r8453K08063J64428L80643L2057j08950
$$ 42530 153474 96976 -116293 -493583 -592036 -383973 -219545 161098 193155 84205
20519H4205l23919j2997J75835j4780J60289n1304N343k8481j34752j87313J33974
$$ 84205 -239714 -252711 -76876 -91656 68633 17329 22672 -5809 -140561 -327874 -193900
20508a93900Q5556K00527J82377j61447m8748R2710j17493j66294O3175J51919
$$ -193900 -108344 92183 274560 113113 64365 157075 39582 -126712 -63537 88382
20498H8382J38446R5823p813j75159Q8415J01176k15631j49230l2949R5324J83551
$$ 88382 226828 322651 314838 139679 228094 329270 113639 -35591 -68540 26784 210335
20487B10335m536k46638q68K9797l4379R8545m4269r6228o2330P427O4705N3075
$$ 210335 205799 -40839 -41707 -11910 -46289 52256 7987 -88241 -150571 -143144 -78439 -25364
20475b5364J15757K62520l4381j311j75372k75469k21078J11001l8507Q1340J50701
$$ -25364 90393 352913 318532 317221 141849 -133620 -354698 -243697 -282204 -200864 -50163
20464e0163P1106R6143k29791R3171K7283j6536N6116J20261M4064k3141J0979
$$ -50163 20943 117086 -112705 -19534 7749 -8787 47329 167590 211654 188513 199492
20453A99492J8535L5289q4528k17043O7748K63859R1142K4134k39020j82962n6739
$$ 199492 218027 253316 168788 -48255 19493 283352 374494 398628 159608 -23354 -80093
20442h0093J64894Q3414j05143j7869J06833l06802j61620k0297J15648J82012
$$ -80093 84801 168215 63072 45203 152036 -154766 -316386 -336683 -221035 -39023
20432c9023p5965k53183P0301K88929J53650q4422K3797n5248n4226R8361K05
$$ -39023 -114988 -368171 -297870 -8941 144709 60287 84084 28836 -25390 72971 73176
20421G3176K32818l1087k25320r1998n1020J09961J93352M8847j15845N5139R6526
$$ 73176 305994 274907 49587 -42411 -93431 16530 209882 258729 142884 198023 294549
20410B94549j06372k37878p2426P1468P4323j39837K7540J95150K63j52964K8951
$$ 294549 188177 -49701 -122127 -50659 23664 -116173 -88633 106517 106780 -46184 -17233
20399a7233Q3515l9580k9362r6853m4438K7507P3113j41052J44661J88045m670
$$ -17233 66282 26702 -2660 -99513 -143951 -116444 -43331 -184383 -39722 148323 143653
20388A43653L56j29135J2004K60153J2105q0089j09655k00847Q426L7209j52995
$$ 143653 144009 14874 26878 287031 299136 219047 109392 -91455 -83029 -45820 -198815
20377a98815J59323K8305J4709M0278k13901J82144J5146j19787k705Q5269k2709
$$ -198815 -39492 -11187 3522 43800 -170101 12043 27189 -92598 -95303 -10034 -32743
20366c2743l3662n325j18990R4974O1214L8081K65299k40251k42840P8477L0779
$$ -32743 -66405 -71730 -190720 -95746 -34532 3549 268848 28597 -214243 -135766 -104987
20355a04987j80394J8803K6157L2262L3308J54946L0035J97255O7604l6566o9732
$$ -104987 -285381 -266578 -240421 -208159 -174851 -19905 10130 207385 274989 238423 168691
20344A68691m7026J92397J40104j77211k02948k19676j04936M9314K51647n5848
$$ 168691 121665 314062 454166 276955 74007 -145669 -250605 -201291 50356 -5492
20334e492q8897p1842j18107O0378J72178J3352j49401k503L70125Q701k36685
$$ -5492 -94389 -166231 -284338 -223960 -51782 -38430 -187831 -190334 179791 188492 -48193
20323d8193j07948J45787L770N7440Q5251j03049N6413k0219q0939R7534m9062
$$ -48193 -156141 -10354 -6584 50856 136107 33058 89471 69252 -11687 85847 36785
20312C6785N6733Q5703j73743j25019q345n4751Q8264J32324J67374j40549n5455
$$ 36785 93518 179221 5478 -119541 -127886 -182637 -94373 37951 205325 64776 9321
20301I321K71219J44675J44301J383q3313l1264p3474J95434l0813k61136j82853
$$ 9321 280540 425215 569516 570899 487586 456322 382848 578282 547469 286333 103480
20290A03480j05785m5753r0491J47845j20608K06070K3985k47351L3891M164M2957
$$ 103480 -2305 -48058 -138549 9296 -111312 94758 118743 -128608 -94717 -90553 -47596
20279d7596K446L4094Q6041O2492j16738j51481L13281J93596j63046m07926p4932
$$ -47596 -45150 -11056 74985 137477 20739 -130742 182539 376135 213089 -194837 -269769
20268b69769J09576l2152j7590R9075J60718O6443j78459K9247L08075n8415j12997
$$ -269769 -160193 -192345 -209935 -110860 49858 116301 -62158 -32911 275164 216749 103752
20257A03752j69859R2063K83809K4265m1473J64153o3809j17870n7400l03742
$$ 103752 -66107 25956 309765 334030 292557 456710 392901 275031 217631 -86111
20247h6111L6614K6096K6347L2998j0821o3441k14178K32699N9641n3066J41491
$$ -86111 -49497 -23401 2946 35944 25123 -38318 -252496 -19797 39844 -13222 128269
20236A28269L1401R0522k32605k45345k5029J84711Q179O4333L03917l8674k11937
$$ 128269 159670 250192 17587 -227758 -252787 -68076 -59897 4436 308353 269679 57742
20225E7742k04104J79701K66549r6669k28723n9634L5119J98789p6796K24745
$$ 57742 -146362 33339 299888 203219 -25504 -85138 -50019 148770 71974 296719
20215B96719J51200j17504l89843l07542j88479J02613J88214L0932k7053P9729
$$ 296719 447919 330415 -59428 -366970 -555449 -452836 -264622 -233690 -260743 -181014
20205a81014Q9258P2533J37736L6725J6424j23027j62818L5794l5546q8389R1771
$$ -181014 -91756 -19223 118513 155238 171662 48635 -114183 -78389 -113935 -202324 -110553
20194a10553J25779J66713K9959j66967j94853O724J17144J03619j52701N1373
$$ -110553 15226 181939 211898 44931 -149922 -143198 -26054 77565 -75136 -23763
20184b3763Q547J67448O4270j6968q1079P8387q3867p6858j45198J20318K3337
$$ -23763 -15216 152232 216502 199534 118455 196842 112975 36117 -109081 11237 34574
20173C4574r7729R733J64585P2086P0177q4803p8715p2283J42213P3015j49399
$$ 34574 -63155 -53422 111163 183249 253426 168623 89908 17625 159838 232853 83454
20162H3454k07611k9523J24305J76166K16122j76154j70420j69172n8636M3425
$$ 83454 -124157 -153680 -29375 146791 362913 186759 16339 -152833 -211469 -168044
20152a68044j2640K86198K5996Q2452n2458k1973r0190l09725k38508J18550N4090
$$ -168044 -180684 105514 131510 213962 161504 139531 49341 -260384 -498892 -380342 -326252
20141c26252p1480J88650J79159o6637o0340P2677m6151j68351n0085P0295l1007
$$ -326252 -397732 -209082 -29923 -96560 -156900 -84223 -130374 -298725 -348810 -278515 -309522
20130c09522J46903k14591l9553R3137J47851K91627R3324j31124r67j44869J02061
$$ -309522 -162619 -377210 -416763 -323626 -175775 115852 209176 78052 77085 -67784 34277
20119C4277J48719q2077j59495J6071J21260O5919j18171l7386N1776j09868j02456
$$ 34277 182996 100919 -58576 -42505 78755 144674 26503 -10883 40893 -68975 -171431
20108a71431O0119J1616m6000N184J35594L7726K4191N3276j1800M5920J46701
$$ -171431 -111312 -99696 -145696 -140512 -4918 32808 56999 110275 98475 144395 291096
20097B91096K1984j86096j15175P572l9751L466K21097L05948k13835K3770o6174
$$ 291096 313080 126984 11809 19381 -20370 -16904 204193 510141 296306 320076 253902
20086B53902j74953M6763r3338j18549M7765O5161j64216K6155O1221o10l5854
$$ 253902 78949 125712 32374 -86175 -38410 26751 -137465 -111310 -50089 -50699 -86553
20075h6553m8967N303K02808R6123M865r9389k7422l3858m6674p0912Q7971J67157
$$ -86553 -135520 -130217 72591 168714 173579 74190 46768 12910 -33764 -104676 -16705 150452
20063A50452J86050k9142j86381L4885j49914q7272q5749l8504k43826m5210K17591
$$ 150452 336502 307360 120979 155864 5950 -81322 -167071 -205575 -449401 -494611 -277020
20052b77020M7178J30237J67756l5619R3355O9177k59526j83496J37431J49565
$$ -277020 -229842 -99605 68151 32532 125887 195064 -64462 -247958 -110527 39038
20042C9038n3681J64107j00874k39724L6154J35564Q6457J87355O6367j0981m5509
$$ 39038 -14643 149464 48590 -191134 -154980 -19416 67041 254396 320763 309782 264273
20031B64273j9690k2449m8198j4634J90267J04605j24544j66705j97963L9110
$$ 264273 244583 222134 173936 159302 349569 454174 329630 162925 -35038 4072
20021D072K4426q1694r0639j08527j06793N8376J70145m7591J55439J7456o5010
$$ 4072 28498 -53196 -143835 -252362 -359155 -300779 -130634 -178225 -22786 -5330 -70340
20010g0340Q1084O6213q1935Q1549J09053r0731k39411j06867J18698k34555O4554
$$ -70340 10744 76957 -4978 76571 185624 94893 -144518 -251385 -132687 -367242 -302688
19999c02688k3821J23112j25P0503J84013J94788r036L1176K20885j21802k22391
$$ -302688 -326509 -203397 -203522 -133019 50994 245782 236746 267922 488807 367005 144614
19988A44614n351l1899J02778J38106l3649r9870M0469L0389J72769K30050j42229
$$ 144614 139263 107364 210142 348248 314599 214729 255198 285587 458356 688406 546177
19977E46177p0587q6012j81719k64081K7259j9740J46992M9836k6616N8352M2318
$$ 546177 475590 389578 207859 -56222 -28963 -48703 98289 148125 121509 179861 222179
19966B22179K75017L1126j51883o3650N440J51605J15473K60891p7865j71485
$$ 222179 497196 528322 376439 312789 318229 469834 585307 846198 768333 596848
19956E96848n9923k3847J03180o7792k49894o425p8477K05790K55083k102q4270
$$ 596848 536925 513078 616258 548466 298572 292147 213670 419460 674543 672441 588171
19945E88171r9383N8921J48671j05038r7277l8137k8710p4780j12902r4481J65846
$$ 588171 488788 547709 696380 591342 494065 455928 427218 352438 239536 145055 310901
19934C10901o7785J51843O1622j76395o0193R5893K43500J18815j18244q2693
$$ 310901 243116 394959 456581 280186 219993 315886 559386 678201 559957 477264
19924D77264k6855k05295K37203J44675M2797J09580J93029R8982k96496l72o1174
$$ 477264 450409 245114 482317 626992 669789 779369 972398 1071380 774884 774512 713338
19913G13338k95321J36001j34878j06351j08478N5301n000K05533J7449n7832
$$ 713338 418017 554018 419140 312789 204311 259612 254612 460145 477594 419762
19903D19762L1418J83711K7557j08294J20000K6104j41218j39131j21208j8963
$$ 419762 451180 634891 662448 554154 674154 700258 559040 419909 298701 279738
19893B79738Q1080L1041k57090r8723Q8910J72352o243j06884O221k26028N2227
$$ 279738 360818 391859 134769 36046 124956 297308 291065 184181 190402 -35626 16601
19882A6601O618j31009l7233K78426k3975k0247j09928p7652J39157l2586k30531
$$ 16601 23219 -107790 -145023 133403 109428 89181 -20747 -98399 40758 8172 -222359
19871b22359P4051j87911Q3746J29241Q8365J69690J19847j25495m3806J06150
$$ -222359 -148308 -336219 -252473 -123232 -34867 134823 254670 129175 85369 191519
19861A91519L1835j54648k01895J44934K96830O498j84647J27527j26423k06310
$$ 191519 223354 68706 -133189 11745 308575 315073 130426 257953 131530 -74780
19851g4780j46930J14581K09250j4050k59340K8207k6041Q9631K14732o8964j67079
$$ -74780 -221710 -107129 102121 88071 -171269 -143062 -169103 -79472 135260 66296 -100783
19840a00783K62436J15595j15041m8772j17225l2000R5074n1818Q3358j03182
$$ -100783 161653 277248 162207 113435 -3790 -35790 59284 7466 90824 -12358
19830a2358q3779M8844R3466j03225J87221J35555k72923j53516J10854m223K61090
$$ -12358 -96137 -47293 46173 -57052 130169 265724 -7199 -160715 -49861 -54084 207006
19819B07006J49354j34894k0207m8885L6680j54737k6402J02312J39825l1910
$$ 207006 356360 221466 201259 152374 189054 34317 7915 110227 250052 218142
19809B18142j03483j03920J3992l6293q1536m7601n8792L077l8912p979J82382
$$ 218142 114659 10739 24731 -11562 -93098 -140699 -199491 -196414 -235326 -243305 -60923
19798f0923J64802N9973L6077j9708k0548o9622p364R0248j21295K3797j53771
$$ -60923 103879 163852 199929 180221 159673 90051 82687 172935 51640 75437 -78334
19787g8334j13515j8892K82632O8822J81049O446j7887O8342l7756j21401j97661
$$ -78334 -191849 -210741 71891 140713 321762 328208 310321 378663 340907 219506 21845
19776B1845k34692J36394k4335N7235n7158N9270O4806M0132L6042j81648k5525
$$ 21845 -212847 -76453 -100788 -43553 -100711 -41441 23365 63497 99539 -82109 -107634
19765a07634J48315O3955J1190o4403j90490m8361J5051J53262J67756P00m7644
$$ -107634 40681 104636 115826 51423 -139067 -187428 -172377 -19115 148641 149341 101697
19754A01697Q1317L1411j3601L988k7662m5002o8784j50478n168m2153n776K71737
$$ 101697 183014 214425 200824 204812 177150 132148 63364 -87114 -92282 -134435 -140211 131526
19742A31526R0122J13784r761k2267l3599j42049j45312M7735O9238N5256O5640
$$ 131526 221648 335432 325671 303404 269805 127756 -17556 30179 99417 154673 220313
19731B20313L6951l964j6084r0914j1401P7922j37983r9965j88292n3667J69057
$$ 220313 257264 253300 237216 146302 134901 212823 74840 -25125 -213417 -267084 -98027
19720i8027n530j08556O858j99656n6997Q7111J65160J31280m79472Q1661K09670
$$ -98027 -103557 -212113 -205255 -404911 -461908 -374797 -209637 -78357 -557829 -476168 -266498
19709b66498q7056K00875q546Q4739K04597R7050j31779J48746Q3748m5590k05748
$$ -266498 -353554 -152679 -161225 -76486 128111 225161 93382 242128 325876 280286 74538
19698G4538o0366J86083J60016J32757n3988k19804j49828j09103l1340j3058
$$ 74538 14172 200255 360271 493028 439040 219236 69408 -39695 -71035 -84093
19688h4093M0470k2540j97396q220J11120J66718J25315n9153N6298q5053L3396
$$ -84093 -43623 -66163 -263559 -271779 -160659 6059 131374 72221 128519 43466 76862
19677G6862M9693j72779j65084k60824J54441L39790K21341J14588j05153j34192
$$ 76862 126555 -46224 -211308 -472132 -317691 22099 243440 358028 252875 118683
19667A18683J18598r51j13163l2577q1186l7767j82998j14640J48555N5150L8748
$$ 118683 237281 236330 123167 90590 9404 -28363 -211361 -326001 -177446 -122296 -83548
19656h3548K47795N583N1833L06245l4363l23426q7826L6560L2627J39900m0109
$$ -83548 164247 169830 221663 527908 493545 170119 82293 118853 151480 291380 251271
19645B51271k20117k30656p0833J63099j1820m9498P6351l5029L8737p7690J9870
$$ 251271 31154 -199502 -270335 -107236 -119056 -168554 -92203 -127232 -88495 -166185 -146315
19634a46315K75707J73962m1421J13322o9834k3790j474j80395r8746j04982l6692
$$ -146315 129392 303354 261933 375255 305421 281631 280157 99762 1016 -103966 -140658
19623a40658K84526J14600M9647N9558N1023K8637q9164j67927j13410N9768q1219
$$ -140658 143868 258468 308115 367673 418696 447333 358169 190242 76832 136600 55381
19612E5381m3655O8439J21213J52461J91837q3052o0096r7139L693N0808p2361
$$ 55381 11726 80165 201378 353839 545676 462624 402528 305389 309082 359890 287529
19601B87529j78575n0069p5778J05762k8886L4342k7714J02869L1374L8161j144
$$ 287529 108954 58885 -16893 88869 59983 94325 66611 169480 200854 239015 237871
19590B37871J36330J37791j96579J9261n5259j10833j7094J93885J83534p37J90769
$$ 237871 374201 511992 315413 334674 279415 168582 151488 345373 528907 528170 718939
19579G18939K6239p3962j01497k4702l2593M4102J00062K33331n5901k91065j66156
$$ 718939 745178 671216 569719 545017 512424 556526 656588 889919 834018 542953 376797
19568C76797J53237j50943j76724K0258J45976J4543j7039q3240n4720J92206
$$ 376797 530034 379091 202367 222625 368601 383144 366105 282865 228145 420351
19558D20351J55801j44576J1313k9005O7672O2606N0343J17148o5731J0992p3461
$$ 420351 576152 431576 442889 413884 481556 544162 594505 711653 645922 656914 583453
19547E83453p0066J2810K6221l3505j16432L418j17137O0698K72530J02061Q9359
$$ 583453 513387 526197 552418 518913 402481 405899 288762 349460 621990 724051 813410
19536H13410J18791j3676j76101q3126J21792K39305O1660k2213O4452K1929J26397
$$ 813410 932201 918525 742424 659298 781090 1020395 1082055 1059842 1124294 1146223 1272620
19525A272620l399K2131j74310k48667J2894J82037K75172J0342L1107J27728
$$ 1272620 1269221 1291352 1117042 868375 881269 1063306 1338478 1348820 1379927 1507655
19515A507655L7710J22692L98565M02445L85087M42919J53040M908q0239j25544
$$ 1507655 1545365 1668057 2066622 2469067 2854154 3297073 3450113 3455021 3374782 3249238
19505C249238k50073n5164k4919P5342K39728M61221L79551J38777M6059L0323
$$ 3249238 2999165 2944001 2919082 2994424 3234152 3695373 4074924 4213701 4259760 4290083
19495D290083k9296K1694J52120J04763L68644L50861M77446O19599R76973J057117
$$ 4290083 4260787 4282481 4434601 4539364 4908008 5258869 5736315 6355914 7332887 8390004
19485H390004J404292J717105J544547K008816J038124j71307o6806L59053J7053
$$ 8390004 9794296 11511401 13055948 15064764 16102888 15931581 15864775 16223828 16240881
19476A6240881m02767n10098M37018J146031J582465K404895L031811M160288
$$ 16240881 15838114 15328016 15765034 16911065 18493530 20898425 23930236 28090524
19468B8090524O250007R886169J4662614J8086496J8843002J7549278J0030752
$$ 28090524 34340531 44226700 58889314 76975810 95818812 113368090 123398842
19461A23398842j2966507k3177284j5510911n973438J570945Q505017J4370546
$$ 123398842 110432335 87255051 71744140 65770702 67341647 75846664 90217210
19454I0217210J8714110K1636315J5145736m430392j8999605j7617987j1484907
$$ 90217210 108931320 130567635 145713371 141282979 122283374 104665387 93180480
19447I3180480j1103314j0209492n714259j078717K416088M875891N617853K203372
$$ 93180480 82077166 71867674 66153415 65074698 67490786 72366677 77984530 80187902
19439H0187902m571427o493013k798169M56137K675237J006766m732399n182466
$$ 80187902 75616475 69123462 66325293 66781430 69456667 70463433 65731034 60548568
19431F0548568j166353J963922L679601L519031l29592l809899k189001J815616
$$ 60548568 59382215 61346137 65025738 68544769 68215177 64405278 62216277 64031893
19423F4031893N234573Q650188J1437792R556668N649449N214721L382824J963753
$$ 64031893 69266466 77916654 89354446 98911114 104560563 109775284 113158108 115121861
19415A15121861j661282m963275n839717r198144q865145m815252j176917P2610
$$ 115121861 113460579 108497304 102657587 93459443 84594298 79779046 78602129 78674739
19407G8674739J108576O054028J2524839J8922015K1050582J4396197M002695
$$ 78674739 79783315 85837343 98362182 117284197 138334779 152730976 156733671
19400A56733671j4327851l1815983k6852273j5880482q699839m624713k990984
$$ 156733671 142405820 110589837 83737564 67857082 59157243 54532530 51541546
19393E1541546l534267l075661j963587k608666m474373l970415l049673k463756
$$ 51541546 48007279 44931618 42968031 40359365 35884992 31914577 28864904 26401148
19385B6401148k014925j765692j636392j574637j213788r71142p15855j39595
$$ 26401148 24386223 22620531 20984139 19409502 18195714 17224572 16508717 16369122
19377A6369122o98072j424292j457424j102903r34526n73986o57759r19611q24027
$$ 16369122 15671050 14246758 12789334 11686431 10751905 10177919 9520160 8600549 7776522
19368G776522n90629m28041k53269j52852k93647o7434j33123J88928M54306M4282
$$ 7776522 7185893 6757852 6504583 6351731 6058084 5990650 5857527 6046455 6500761 6545043
19358F545043l93702o88039n03050l23704k36765l4204K0398l47739k60158r3150
$$ 6545043 6151341 5463302 4960252 4636548 4399783 4365579 4385977 4038238 3778080 3684930
19348C684930M995R5264Q281M8935J93792K09904J29604L8387p2496k80063k00586
$$ 3684930 3689925 3785189 3793470 3842405 4036197 4246101 4375705 4414092 4341596 4061533 3860947
19337C860947k60496k51670J3601J584l30139l74162j79845M7488L91475J09965
$$ 3860947 3600451 3348781 3362382 3363966 3033827 2659665 2479820 2527308 2918783 3028748
19327C028748K95526K69406J48820j13490M2573k6747j12428j51147k23866j21114
$$ 3028748 3324274 3593680 3742500 3629010 3671583 3644836 3532408 3381261 3157395 3036281
19317C036281j92929L6094K24324K00532K92857R8787J18912P2504k9310j37832
$$ 3036281 2843352 2879446 3103770 3304302 3597159 3695946 3814858 3887362 3858052 3720220
19307C720220p7643j09600l88o8624k16395j54668P5475k40110M9650O440J8551
$$ 3720220 3642577 3532977 3532589 3463965 3247570 3092902 3168377 2928267 2977917 2984357 3002908
19296C002908l4857m4707o4123R207j7564K53936K78213J89533j11384j23346
$$ 3002908 2968051 2923344 2859221 2868428 2850864 3104800 3383013 3572546 3461162 3337816
19286C337816p3417O8463K17322K16087J80698k09519m09872m36244l96982j61439
$$ 3337816 3264399 3332862 3550184 3766271 3946969 3737450 3327578 2891334 2494352 2332913
19276B332913o8911r8088l6004j97436m523J7128P4415N1207o9568J46694M30574
$$ 2332913 2264002 2165914 2129910 1932474 1927951 1945079 2019494 2070701 2001133 2147827 2578401
19265B578401M45910K81231M48480M43770k07315m10659l48204j70812k48843
$$ 2578401 3024311 3305542 3754022 4197792 3990477 3579818 3231614 3060802 2811959
19256B811959m18392j83025L36717J48109K40156J87039K30636M05029J21804
$$ 2811959 2393567 2210542 2547259 2695368 2935524 3122563 3353199 3758228 3880032
19247C880032n81782o17164n67414k76737p1499j13494j57129K8129M190j81550
$$ 3880032 3298250 2681086 2113672 1836935 1765436 1651942 1494813 1522942 1527132 1345582
19237A345582j7810l78543n9218N5725K01366j7883M8865J76610k1394j66200
$$ 1345582 1327772 949229 890011 945736 1147102 1129219 1178084 1354694 1333300 1167100
19227A167100j73865K4022k8407j12924R09j28414q8241R84p1334r7971M1467
$$ 1167100 993235 1017257 988850 875926 876835 748421 660180 661164 589830 491859 533326
19216E33326P2904j61796K12924J10053j49458o7472j50973k27403R9382K47901
$$ 533326 606230 444434 657358 767411 617953 550481 399508 172105 271487 519388
19206E19388j27986j47306K45453L8675k5444Q4377r4385p4086M3761M2848R809
$$ 519388 391402 244096 489549 528224 502780 587157 492772 418686 462447 505295 515104
19195E15104K9988O705m4110j05756j03380J91912M3619j24701J0105m3039M8171
$$ 515104 545092 551797 507687 401931 298551 490463 534082 409381 419486 376447 424618
19184D24618k77627q3886R6587J0213K22212L2050M0160o6450j00172m4673j12454
$$ 424618 146991 63105 159692 169905 392117 424167 464327 397877 297705 253032 140578
19173A40578q3249j67910K16537K20092N7808J99168j92983l4675L3925Q200Q0706
$$ 140578 57329 -110581 105956 326048 383856 583024 390041 355366 389291 397491 478197
19162D78197m8079r0862J29735k26924k10120J46983J88786k05227j67240J02195
$$ 478197 430118 339256 468991 242067 31947 178930 367716 162489 -4751 97444
19152I7444J51614q9147l3161N397r9587J54682J89457L437k18427n3685P8399
$$ 97444 249058 159911 126750 132147 32560 187242 376699 380136 161709 108024 186423
19141A86423J06097J75268p1561j12090j48078K39284l1060l6194K93805J55971
$$ 186423 292520 467788 396227 284137 136059 375343 344283 308089 601894 757865
19131G57865k15124j27709j02556K8461K31611N9356m5131n0136m681q0910j06114
$$ 757865 542741 415032 312476 340937 572548 631904 586773 536637 531956 451046 344932
19120C44932o1527J9690J23519j01319L766R4771K9466p7972R9128Q0555J00386
$$ 344932 283405 303095 426614 325295 329061 423832 453298 375326 474454 555009 655395
19109F55395J55065p1860j56535L1453J65725K66002p4175j06027k08064n8703
$$ 655395 810460 738600 582065 613518 779243 1045245 971070 865043 656979 598276
19099E98276K22510K15500K27232L8353n1660j13400J90109j8935r6375j83491
$$ 598276 820786 1036286 1263518 1301871 1250211 1136811 1326920 1307985 1211610 1028119
19089A028119o2838L7973J2132K22318K03159J09290Q6257O7793p1592k12379
$$ 1028119 965281 1003254 1015386 1237704 1440863 1550153 1636410 1704203 1632611 1420232
19079A420232N8960J76960J40314j07451l11879r9076Q3396K49860k19121O7183
$$ 1420232 1479192 1656152 1796466 1689015 1377136 1278060 1361456 1611316 1392195 1459378
19069A459378J06599N8779k0635O6780J26483K07356J93194N6153k291k12008
$$ 1459378 1565977 1624756 1604121 1670901 1797384 2004740 2197934 2254087 2251796 2039788
19059B039788k280K62656J53904N3133O8917n7731K05393R9700L74637M37259
$$ 2039788 2037508 2300164 2454068 2507201 2576118 2518387 2723780 2823480 3198117 3635376
19049C635376N02889L82828r6853l16820j11233L17452L30256J63888J13301J72573
$$ 3635376 4138265 4521093 4424240 4107420 3996187 4313639 4643895 4807783 4921084 5093657
19039E093657J4006J98054M89334K43228K68413N09738O58451P71351Q33522J015344
$$ 5093657 5107663 5305717 5795051 6038279 6306692 6816430 7474881 8246232 9079754 10095098
19029A0095098J208850P52204K25802K86581L65815J13790j38573o33112m39030
$$ 10095098 11303948 12056152 12281954 12568535 12934350 13048140 12909567 12276455 11837425
19020A1837425j07185L58120O51806P60671Q33946J247848J760260K680482L717906
$$ 11837425 11730240 12088360 12740166 13500837 14334783 15582631 17342891 20023373 23741279
19011B3741279M584134N342270N147635K661492K23800J563780O050443J0302116
$$ 23741279 28325413 33667683 38815318 41476810 41700610 43264390 49314833 59616949
19003E9616949J2894662J4407182J1247499l772002j4529285j0719269l857406
$$ 59616949 72511611 86918793 98166292 94394290 79865005 69145736 65288330
18996F5288330j86774L06177J467474L197820Q23740l198383j414657K110236
$$ 65288330 65101556 65407733 66875207 70073027 70896767 67698384 66283727 68393963
18988F8393963M400306L563724r64598l747804j301582K995047Q211032J3885520
$$ 68393963 72794269 76357993 75393395 71645591 70344009 73339056 81550088 95435608
18980I5435608J7887389J8502270J1118046m990560k0904722k1089702j1467544
$$ 95435608 113322997 131825267 142943313 137952753 117048031 95958329 84490785
18973H4490785k635014K964135O180999P174487K598987q242629j3283099j0151099
$$ 84490785 81855771 84819906 91000905 98175392 100774379 92531750 79248651 69097552
18965F9097552n504458j899369L28408K259390M358196N960434R323939J4069100
$$ 69097552 63593094 61693725 62022133 64281523 68639719 74600153 83924092 97993192
18957I7993192J7435343J8541252Q870766j0276607j6658439j1391470m828544
$$ 97993192 115428535 133969787 142840553 132563946 115905507 104514037 99685493
18950I9685493j101426o569819j2623136r193816k956971K807396Q823330J4571652
$$ 99685493 98584067 92014248 79391112 70197296 67240325 70047721 78871051 93442703
18942I3442703J7857044J9348422J4907602n967945k4910467k2343353j4499929
$$ 93442703 111299747 130648169 145555771 139587826 114677359 92334006 77834077
18935G7834077j1937442j0924251q523075n980138m048558k787833j643469n08570
$$ 77834077 65896635 54972384 46449309 40469171 36420613 33632780 31989311 31480741
18927C1480741J35058L45471K38378j086237j626424j023659p53586j796009j947580
$$ 31480741 31615799 31961270 32199648 31113411 29486987 28463328 27709742 25913733 23966153
18918B3966153j054679q7864o5363j299939k567372k493515j530150p26302l29177
$$ 23966153 22911474 22823610 22758247 21458308 18890936 16397421 14867271 14140969 13811792
18909A3811792l13096j05691J87800O17326N84706J3794j266627j965152j762390
$$ 13811792 13498696 13393005 13580805 14198131 14782837 14796631 13530004 11564852 9802462
18900I802462j265053n84749j14893J8966Q2580j61963o7199Q7924m87209p75516
$$ 9802462 8537409 7952660 7837767 7856733 7939313 7777350 7710151 7798075 7310866 6535350
18890F535350o68112n80652m31531l79184r9368j71568l73399k69566k7442j9109
$$ 6535350 5867238 5286586 4855055 4475871 4376503 4204935 3831536 3561970 3534528 3515419
18880C515419P6250q1722k04112k96728l26088l15315N7206R1049j62081l40441
$$ 3515419 3591669 3509947 3305835 3009107 2683019 2367704 2424910 2515959 2353878 2013437
18870B013437p1160k6251J5489J2153K22682K99435K80494J79327K77927K50807
$$ 2013437 1942277 1916026 1931515 1943668 2166350 2465785 2746279 2925606 3203533 3454340
18860C454340k05588l50302k5396K05980K00091J05990K52953N03682O16193M06316
$$ 3454340 3248752 2898450 2873054 3079034 3279125 3385115 3638068 4141750 4757943 5164259
18850E164259m0854o95010m92535k34074N8173K32394K18437K1696j5090l23016
$$ 5164259 5123405 4428395 3935860 3701786 3759959 3992353 4210790 4232486 4217396 3894380
18840C894380o42269o50816l60728k16810k45964k0340K82933j66864K180Q9375
$$ 3894380 3252111 2601295 2240567 2023757 1777793 1757453 2040386 1873522 1875702 1965077
18830A965077j67160l48537j53225N3978j9516p8065L4135j91810N2876k06758
$$ 1965077 1797917 1449380 1296155 1350133 1330617 1252552 1286687 1094877 1147753 940995
18820I40995j63274P2589K41804j2949k11003j118M0778O0493M9331k49240k55753
$$ 940995 777721 850310 1092114 1079165 868162 867044 907822 968315 1017646 768406 512653
18809E12653k04258J00726J26764j17641j74855k84R2175j7958j931L2254J82220
$$ 512653 308395 409121 535885 418244 243389 243105 335280 317322 315391 347645 529865
18798E29865J00680k01450k20847o4584O7690K16730J59699j50096m8268J47619
$$ 529865 630545 429095 208248 143664 211354 428084 587783 437687 389419 537038
18788E37038J69471J46754J04025M0705k56417j4655J09441k187k16113n7896
$$ 537038 706509 853263 957288 997993 741576 726921 836362 834175 618062 560166
18778E60166K5086K8976m6607K15133L38773R3710J5685m3240M936o6136j57893
$$ 560166 585252 614228 567621 782754 1121527 1215237 1230922 1187682 1192618 1126482 968589
18767I68589J90967K98357L76972L65331K15892p6383n40712l40710k92746j68792
$$ 968589 1159556 1457913 1834885 2200216 2416108 2339725 1799013 1458303 1165557 996765
18757I96765l2171k54306k06412J66532m4120p484J5794J38239r0537j1713n7335
$$ 996765 964594 710288 503876 670408 626288 618804 634598 772837 682300 670587 613252
18746F13252j25081j8265J90751L7977M9083N3567J89674j57073j17585j08428
$$ 613252 488171 469906 660657 698634 747717 801284 990958 833885 716300 607872
18736F07872J03532N7926j75932j3654J87444K63588K7826k10063r4540Q8233
$$ 607872 711404 769330 593398 579744 767188 1030776 1058602 848539 753999 842232
18726H42232L03353m8320j44382n7295r0659N7781j695p8953o8774J38756J5764
$$ 842232 1145585 1097265 952883 895588 804929 862710 861015 782062 713288 852044 867808
18715H67808r5679j11626J83161P1616o3240O4664K2943j21421J78259O5001j01068
$$ 867808 772129 660503 843664 915280 852040 916704 939647 818226 996485 1061486 960418
18704I60418m9019K18108L8588n8373L2403n0888j24743j31945R6002J9017o0866
$$ 960418 911399 1129507 1168095 1109722 1142125 1091237 966494 834549 930551 949568 888702
18693H88702j41974j14709J28995J46153j6879J04625J3426O7740p6337l387M3370
$$ 888702 746728 632019 761014 907167 890288 994913 1008339 1076079 999742 996355 1039725
18682A039725j63314k20021o0624K65758j2833L805J2020J67746J44467J50131
$$ 1039725 876411 656390 595766 861524 848691 852496 864516 1032262 1176729 1326860
18672A326860m0166L37773K74136J32129K8486j47894k40213M5196J73969Q8172
$$ 1326860 1286694 1624467 1898603 2030732 2059218 1911324 1671111 1716307 1890276 1978448
18662A978448j45871k7090J96126J88218J8948L0785K53006J15892M6202M40355
$$ 1978448 1832577 1805487 2001613 2189831 2208779 2239564 2492570 2608462 2654664 3095019
18652C095019N53977L44365M82421N81651N73538P30285J77735q05616q23790
$$ 3095019 3648996 3993361 4475782 5057433 5630971 6361256 6538991 5733375 4909585
18643D909585k48375N8645p0785L30967O74004O41720L00637j71145r7301j1315
$$ 4909585 4661210 4719855 4649070 4980037 5654041 6295761 6596398 6425253 6327952 6316637
18633F316637k46316n38111l43126n6453n2776O9547J5926K19798K64069J80060
$$ 6316637 6070321 5532210 5189084 5132631 5079855 5149402 5165328 5385126 5649195 5829255
18623E829255N28955N43772K85205M14812R55849J153872J028357J253904K022862
$$ 5829255 6358210 6901982 7187187 7601999 8557848 9711720 10740077 11993981 14016843
18614A4016843K734349L010351L037592K585824J694390K43598K35169J419243
$$ 14016843 16751192 19761543 22799135 25384959 27079349 27322947 27558116 28977359
18606B8977359K037937K078900K903462M904896O492307Q441001P616732J082396
$$ 28977359 31015296 33094196 35997658 40902554 47394861 55835862 63452594 64534990
18598F4534990k009236j262631n12294M051q19877p84582J953468M976628P580231
$$ 64534990 62525754 61263123 60750829 60754880 59935003 59150421 61103889 66080517 73660748
18589G3660748Q273718R603544J5521520K2627574K7518553K6840280J5534964
$$ 73660748 81934466 91538010 107059530 129687104 157205657 184045937 199580901
18582A99580901K421051r235297j4200451o683059j50637n344017j0706663p366226
$$ 199580901 202001952 192766655 178566204 171883145 171732508 166388491 155681828 148315602
18574A48315602p147365r010331l933417K274202O249843O573175O67454l730753
$$ 148315602 141168237 132157906 128224489 130498691 136748534 143321709 143989163 140258410
18566A40258410j88453L049866P039409J5016304K1217101K4102638K3085854
$$ 140258410 140069957 143119823 150159232 165175536 186392637 210495275 233581129
18559B33581129J8160143R046235l736003j3712303j3495769j5743421j8406113
$$ 233581129 251741272 260787507 257051504 243339201 229843432 214100011 195693898
18552A95693898j2732782p162340r355092q095616k4454P609611J2051101J3787228
$$ 195693898 182961116 175798776 166443684 158348068 158323614 165933225 177984326 191771554
18544A91771554J8945451K5093897K6037389K8480956M684658m3365156m5384937
$$ 191771554 210717005 235810902 261848291 290329247 295013905 251648749 206263812
18537B06263812k7002537j5378345j0285049r878311q396190n852836j33894O109735
$$ 206263812 179261275 163882930 153597881 143719570 135323380 129470544 129336650 135446385
18529A35446385J1537759J3207266J1180867J0778550R939169N003958Q218823
$$ 135446385 146984144 160191410 171372277 182150827 192089996 197093954 205312777
18522B05312777J7631772K4040169J6965745k440143j2429071j3141326j820801
$$ 205312777 222944549 246984718 263950463 261510320 249081249 235939923 234119122
18515B34119122J1025724J4538625N563100j1218012k8170221l1108054j9715405
$$ 234119122 245144846 259683471 265246571 254028559 225858338 194750284 175034879
18508A75034879r298859l473460k418934q417177j3292153r211192k602907L103197
$$ 175034879 165736020 162262560 159843626 151426449 138134296 128923104 126320197 129423394
18500A29423394L504383j526382k378715o622571j5177750j5232878j0858485
$$ 129423394 132927777 131401395 129022680 122400109 107222359 91989481 81130996
18493H1130996p038902m036853j612141N51563K872954N271991N871054M937610
$$ 81130996 74092094 70055241 68443100 68994663 71867617 77139608 83010662 87948272
18485H7948272O028563O485804J734574l210758j373615L987359P113774N857410
$$ 87948272 93976835 100462639 102197213 98986455 97612840 101600199 108713973 114571383
18477A14571383P499472O925450N293102Q372569M952350m603835n136649l659076
$$ 114571383 122070855 128996305 134289407 142661976 147614326 143010491 137873842 134214766
18469A34214766j1211764j9010397j8987081j4814304j0192760o933955m667465
$$ 134214766 123003002 103992605 85005524 70191220 59998460 53064505 48397040
18462D8397040k907344j589382m17499J72272L73705Q117n06053j39388R66800
$$ 48397040 45489696 43900314 43482815 43655087 44028792 44036909 43530856 43391468 44358268
18453D4358268K154770J656999j02253j821928m138646n118780l344212j557376
$$ 44358268 46513038 48170037 48067784 46245856 42107210 36988430 33644218 32086842
18445C2086842K5066J624997L383025M132123M204565M399239o93412o845363
$$ 32086842 32111908 33736905 37119930 41252053 45456618 49855857 49162445 42317082
18437D2317082n301989k541391k092421l273719k762721j803984r37418K02082
$$ 42317082 37015093 34473702 32381281 29107562 26344841 24540857 23603439 23805521
18429B3805521N49482J059223Q42057j359603k352261j601113m50709O93575J820441
$$ 23805521 24355003 25414226 26256283 24896680 22544419 20943306 20492597 21186172 23006613
18420B3006613K538632L080507L154827J796068J55512k041211m599704m064375
$$ 23006613 25545245 28625752 31780579 33576647 33732159 31690948 27091244 23026869
18412B3026869k492813j734768r10110l52586m62079n31700m96943r13091r62301
$$ 23026869 20534056 18799288 17889178 17536592 17074513 16542813 16045870 15132779 14170478
18403A4170478m09881k92468j17556k10683k68951k88963o04995p13258l02673
$$ 14170478 13760597 13468129 13350573 13139890 12870939 12581976 11976981 11263723 10961050
18394A0961050J78947L07744L18086L70128k80078l69568l40669n82705o89032
$$ 10961050 11139997 11447741 11765827 12135955 11855877 11486309 11145640 10562935 9873903
18385I873903p68370o95663n62212n3981M6183J92899L30594N00059P38297R66673
$$ 9873903 9105533 8409870 7847658 7793677 7839860 8032759 8363353 8863412 9601709 10568382
18375A0568382P63888l39314j103795q50010n83458r18263j036281q92416m94329
$$ 10568382 11332270 10992956 9889161 9039151 8455693 7537430 6501149 5608733 5114404
18366E114404k57861Q472K2094M1263R5740j77728j58942k58024k39432l94055
$$ 5114404 4856543 4865015 4887109 4928372 5024112 4846384 4687442 4429418 4189986 3795931
18356C795931k08018l02735j55232o3272K7983k22j96864k15893r6666R403K7317
$$ 3795931 3587913 3285178 3129946 3066674 3094657 3094435 2897571 2681678 2585012 2594415 2621732
18345B621732p5712N2130p4723m4779j38772q7097k19575j88981j73904M339J35495
$$ 2621732 2546020 2598150 2523427 2478648 2339876 2252779 2033204 1844223 1670319 1674658 1810153
18334A810153L14358L43499K04447j05951J53616M85139J68938N2350r0508q8446
$$ 1810153 2124511 2468010 2672457 2566506 2720122 3205261 3374199 3426549 3336041 3247595
18324C247595k38202l46365l32357m63033k86346n0692j05506M4575M24J80135
$$ 3247595 3009393 2663028 2330671 1867638 1581292 1530600 1425094 1469669 1470093 1650228
18314A650228m9629j65405j60379j89012j9918J50924J10632J32479J93384J3112
$$ 1650228 1600599 1435194 1274815 1085803 1065885 1216809 1327441 1459920 1653304 1666416
18304A666416j07768k03055j49348o8702O0842J6853P3471R6908l5493Q7508n8217
$$ 1666416 1558648 1355593 1206245 1137543 1198385 1215238 1288709 1385617 1350124 1437632 1379415
18293A379415k40532N9033J23462R3535R8142j60405p6906O0881k5112j22892
$$ 1379415 1138883 1197916 1321378 1414913 1513055 1352650 1275744 1336625 1311513 1188621
18283A188621J93765K61999r3336p9624j1382j31284J4487j4705j21051Q0275
$$ 1188621 1382386 1644385 1551049 1471425 1460043 1328759 1343246 1328541 1207490 1287765
18273A287765j1664l448K18252j15396k43002j09705n1802l995m0301J14887J73753
$$ 1287765 1276101 1272653 1490905 1375509 1132507 1022802 971000 967005 926704 1041591 1215344
18262A215344l38948o1630o3382J43649O8259J56893O8784J89521N255L2527o5622
$$ 1215344 876396 814766 751384 895033 963292 1120185 1188969 1378490 1383745 1416272 1350650
18251A350650j07627n4659L3127l0920l09741l08308j41755K17564K91048O3893
$$ 1350650 1243023 1188364 1221491 1190571 880830 572522 430767 648331 939379 1003272
18241A003272r1030q1371j02212j22296K51801M0265M2187P9716Q127p0739j81694
$$ 1003272 912242 830871 728659 606363 858164 898429 940616 1020332 1028459 957720 776026
18230G76026l14579k57243J02958R4698r3152N470M0918L2147K24925L4948j00996
$$ 776026 461447 204204 307162 401860 308708 314178 355096 387243 612168 647116 546120
18219E46120j55p9586j58918J4913Q9301l3398J21340K00072M3462k6043n4817
$$ 546120 545965 466379 307461 322374 411675 378277 499617 699689 743151 717108 662291
18208F62291K4515L1587j4381l03301O5287J19645m8919l06459J1903j5974P4378
$$ 662291 686806 718393 704012 400711 465998 585643 536724 230265 242168 226194 300572
18197C00572R4024K82692n3210j75662p7577q5611J23660Q2031l9610J15386j54117
$$ 300572 394596 677288 624078 448416 370839 285228 408888 490919 451309 566695 412578
18186D12578q8071j62435j18331O916M2669K32249L14911j7901K7628n2357Q4585
$$ 412578 324507 162072 43741 50657 93326 325575 640486 622585 650213 597856 682441
18175F82441R0125k0779j07006n7890K04903j26442k21521k99693R8915K96418
$$ 682441 772566 751787 644781 586891 791794 665352 443831 144138 243053 539471
18165E39471J36614Q516J37353n6700j72966K2589q0607j08696J44350K20106
$$ 539471 676085 684601 821954 765254 592288 614877 534270 425574 569924 790030
18155G90030J26022j07187j17906K03095L33813J25437k7509m0555j11051O0947
$$ 790030 916052 808865 690959 894054 1227867 1353304 1325795 1285240 1174189 1235136
18145A235136K40029J30632J64556K7986J17689K69811J45884K39872J96775Q6565
$$ 1235136 1475165 1605797 1770353 1798339 1916028 2185839 2331723 2571595 2768370 2854935
18135B854935K22167K61919J87491L56461M08887J89341K77044N62648M80073
$$ 2854935 3077102 3339021 3526512 3882973 4291860 4481201 4758245 5320893 5800966
18126E800966N38604O37015O75433P50222J013320J127646J118325J251096J262440
$$ 5800966 6339570 6976585 7652018 8402240 9415560 10543206 11661531 12912627 14175067
18117A4175067J498880J772731K454774L066602L892375N531424Q098675J2975585
$$ 14175067 15673947 17446678 19901452 22968054 26860429 32391853 40490528 53466113
18109E3466113K3081228L9851178N4229451N7004702O7997165N0118724p3123835
$$ 53466113 76547341 116398519 170627970 227632672 295629837 345748561 272624726
18102B72624726j01985951n7012040k9926811j7209171j0835372p485839n323119
$$ 272624726 170638775 113626735 83699924 66490753 55655381 48169542 42846423
18095D2846423l692682k950125k153530j352825n86060j137179k178768k872480
$$ 42846423 39153741 36203616 34050086 32697261 32111201 30974022 28795254 25922774
18087B5922774k913786k768091k197628k012982j720708j345535j033112q12546
$$ 25922774 23008988 20240897 18043269 16030287 14309579 12964044 11930932 11118386
18079A1118386r39643j016356r15451o41352q03962n58782n66585l51616m33898
$$ 11118386 10178743 9162387 8246936 7605584 6801622 6242840 5676255 5324639 4890741
18070D890741l41913m1824m9130k06536k98447k89897l31473l11449M9740M0177
$$ 4890741 4548828 4507004 4457874 4251338 3952891 3662994 3331521 3020072 3069812 3109989
18060C109989k0358l01996l11613j31470j45734L3484j19648j71082m4816q4799
$$ 3109989 3089631 2787635 2476022 2344552 2198818 2232302 2112654 1941572 1896756 1811957
18050A811957k5030j95336J8887j62966j59403K561L9442J50139K21004K40844
$$ 1811957 1786927 1591591 1610478 1447512 1288109 1290670 1330112 1480251 1701255 1942099
18040A942099K37460l01766k47786m5801J6179P3979j04538j6171j68598J60934
$$ 1942099 2179559 1877793 1630007 1584206 1600385 1674364 1569826 1553655 1385057 1545991
18030A545991L4522k33150j26122Q0536n0498K13748J31731L6174k6869o3106
$$ 1545991 1580513 1347363 1221241 1301777 1251279 1465027 1596758 1632932 1606063 1542957
18020A542957l63379j39897J04542R9513K37541K24877k9439m3423m1636l26860
$$ 1542957 1179578 1039681 1144223 1243736 1481277 1706154 1676715 1633292 1591656 1264796
18010A264796k23402l8930j03741j49695j74573j53818J48846K6715j27480M1121
$$ 1264796 1041394 1002464 898723 749028 574455 420637 569483 596198 468718 509839
18000E09839Q9405p8615J11710M33356k9433r2424P7214j55789j11961K718J10206
$$ 509839 599244 520629 632339 1065695 1036262 943838 1021052 865263 753302 756020 866226
17989H66226q9296J3391K52669M7800p4464J33321j410O2638J12715r938J11153
$$ 866226 776930 790321 1042990 1090790 1016326 1149647 1148237 1210875 1323590 1313652 1424805
17978A424805K5781j37329m01784j80320J78407o5442k7892J3909j22988L5990
$$ 1424805 1450586 1313257 911473 731153 909560 844118 816226 830135 707147 743137
17968G43137N7585L21787k00906j45499j17123j06375R8442m5214Q7710k4538
$$ 743137 800722 1122509 921603 776104 658981 552606 651048 605834 693544 669006
17958F69006j53098j17889k3699J43329j38852k4850j8176n6042K11457R6455
$$ 669006 515908 398019 374320 517649 378797 353947 335771 279729 491186 587641
17948E87641j63559j07325r4790J11096J25559J06449j186J7900j9908k37856
$$ 587641 424082 316757 221967 333063 458622 565071 563885 581785 561877 324021
17938C24021n2897L78486R3263L389j54555k23200L6035J05785O0531j8009j76565
$$ 324021 271124 649610 742873 746262 591707 368507 404542 510327 570858 552849 376284
17927C76284p0155k9222L7764k5387J40514J20258R3055k22544k11527O5745m4004
$$ 376284 306129 276907 314671 289284 429798 550056 643111 420567 209040 274785 230781
17916B30781r1623J62855P0655J15277J11487n7024j01601k08414k2093J05380
$$ 230781 139158 302013 372668 487945 599432 542408 440807 232393 210300 315680
17906C15680O6883o7814j19028j10088j35758N0307L31475K40916m5667l82115
$$ 315680 382563 314749 195721 85633 -50125 182 331657 572573 526906 144791
17896A44791j5662J02167L20856M0799q4486N3047l9037R0365j52911j04175q8564
$$ 144791 129129 231296 552152 592951 508465 561512 522475 612840 459929 355754 267190
17885B67190j26736n3401n0700j4125J38443M5875j39231K6397q8444J53456J37892
$$ 267190 140454 87053 36353 22228 160671 206546 67315 93712 5268 158724 296616
17874B96616j03894q7290j17960r253K56396J83284Q6051k0017j43581j75721
$$ 296616 192722 105432 -12528 -21781 234615 417899 503950 483933 340352 164631
17864A64631J63536J36032j05382K8740J24712M0591k02561j00690k7087K019
$$ 164631 328167 464199 358817 387557 512269 552860 350299 249609 222522 224541
17854B24541N1600j46945N9908K78534K5708Q9617r1352o7398l7087R0770N0706
$$ 224541 276141 129196 189104 467638 493346 582963 491611 424213 387126 477896 528602
17843E28602j49970k9877o6680r6548l0479q0238p0038J83903P4094J28877r3335
$$ 528602 378632 348755 282075 185527 155048 74810 4772 188675 262769 391646 298311
17832B98311k52183j23009J08244N8005k9349N8703m036j96595j53904J23174
$$ 298311 46128 -76881 31363 89368 60019 118722 114686 -81909 -235813 -112639
17822a12639J01929R0504m772j93982r2008Q5839L9598L8597N3223K8463j46168
$$ -112639 -10710 79794 75022 -118960 -210968 -125129 -85531 -46934 6289 34752 -111416
17811a11416q2768K41361K95513J19136k07967n8397P2504j29383k95815j05792
$$ -111416 -194184 47177 342690 461826 253859 195462 267966 138583 -157232 -263024
17801b63024J46897J64829L0331L69946m7111j26836K56405J46396k17813j61902
$$ -263024 -116127 48702 79033 448979 401868 275032 531437 677833 460020 298118
17791B98118p8098j80584P1378j7600R8939j43328P5380n8071m3656J02829j14342
$$ 298118 220020 39436 110814 93214 192153 48825 124205 66134 22478 125307 10965
17780A0965p2293N8667J48618j66200j1132K67055l053o5320O0778j69438J84320
$$ 10965 -61328 -2661 145957 -20243 -31375 235680 232627 167307 228085 58647 242967
17769B42967J07291q8163O5971K8583o2561o647k75526j81268P2180J35244K9929
$$ 242967 350258 262095 328066 356649 294088 287441 11915 -169353 -97173 38071 68000
17758F8000j5020n4305m0211o807k6500p1823J5887M1570q1580K045J30461m4642
$$ 68000 52980 -1325 -41536 -48343 -74843 -146666 -130779 -89209 -170789 -168744 -38283 -82925
17746h2925n8254q4081m8241Q8841p1412o1320Q807j84044J89727L69847J73424
$$ -82925 -141179 -225260 -273501 -184660 -256072 -317392 -308585 -492629 -302902 66945 240369
17735B40369k98077q5450K32465O6856L0631j36342j30041j72541O2575M3819
$$ 240369 -57708 -143158 89307 156163 186794 50452 -79589 -252130 -189555 -145736
17725a45736J55148q8956j40634J20534L8207k62317J48607Q7277k5503l8293
$$ -145736 9412 -79544 -220178 -99644 -61437 -323754 -175147 -87870 -113373 -151666
17715a51666j33076J20028K38044O3727j42017j91695o2971K16485K33446R102
$$ -151666 -284742 -164714 73330 137057 -4960 -196655 -259626 -43141 190305 199407
17705A99407n6533n2291J025k7996j59612K3139O8628K1175K3962K51437M4292
$$ 199407 142874 90583 91608 63612 -96000 -72861 -4233 16942 40904 292341 336633
17694C36633j34407J4733J06333p1066j59252j9142M3327J2323M1895j84005k5376
$$ 336633 202226 216959 323292 252226 92974 73832 117159 129482 171377 -12628 -38004
17683c8004J12434J42824l5508k44779L335J01124j58815j1321K08915j38071
$$ -38004 74430 217254 181746 -63033 -59698 41426 -117389 -128710 80205 -57866
17673e7866j63613q4027j03028J10648p4493L5941K06429J39891p1291j3290J48518
$$ -57866 -221479 -305506 -408534 -297886 -372379 -336438 -130009 9882 -61409 -74699 73819
17662G3819K00008p3264j78640p4412j84253j85344J86926Q7709R492l47519P9080
$$ 73819 273827 200563 21923 -52489 -236742 -422086 -235160 -147451 -137959 -485478 -406398
17651d06398L71953K05726j90941M848L03173n0330j60221p1285K9943P519K65585
$$ -406398 -34445 171281 -19660 -14812 288361 238031 77810 6525 36468 43987 309572
17640C09572j2233j50571K7041K8585o3614O03P1829p8900r7649k56273j34104
$$ 309572 297339 146768 173809 202394 138780 139383 211212 132312 34663 -221610 -355714
17629c55714q314O4799J7263J75133J18073P6250j24072l27297j01274K00432
$$ -355714 -364028 -299229 -281966 -106833 11240 87490 -36582 -363879 -465153 -264721
17619b64721K15638J24925P107N8488j28725r4792r5284k77732l1277J89302j6304
$$ -264721 -49083 75842 82949 141437 12712 -82080 -177364 -455096 -486373 -297071 -313375
17608c13375q3342R7931J05338J81234J80489m0145l63486j73451R1723P5980
$$ -313375 -396717 -298786 -193448 -12214 168275 128130 -235356 -408807 -317084 -241104
17598b41104L4539K5288J4222j14615j7403P4362L60894M9599l35695O1464j18159
$$ -241104 -206565 -181277 -167055 -281670 -299073 -224711 136183 185782 -149913 -88449 -206608
17587b06608m0772M11457J62257n8352j3688L9294J11194N5801q6535j57988k16363
$$ -206608 -247380 164077 326334 267982 254294 293588 404782 460583 374048 216060 -303
17576c03m4297J53050J87717M0461p3701r1699k20686l7020J2185r5527J02225
$$ -303 -44600 108450 296167 336628 262927 171228 -49458 -86478 -74293 -169820 -67595
17565f7595m4664j0452J27631J87208J34416q412m8985p563j07582j51070M3321
$$ -67595 -112259 -122711 4920 192128 326544 318132 269147 261584 154002 2932 46253
17554D6253J04575j2213k45j27392J84295m9620j49485J3220J03640P8123j11415
$$ 46253 150828 138615 138370 10978 195273 145653 -3832 9388 113028 191151 79736
17543G9736j18883J41164j57998j20980K324Q4004l2833N7626J37371J54591j02911
$$ 79736 -39147 102017 -55981 -176961 -174637 -90633 -123466 -65840 71531 226122 123211
17532A23211k1522J33831j09770j44108O0707N0166K32049q585p8004k01676j57019
$$ 123211 101689 235520 125750 -18358 42349 92515 324564 315979 237975 36299 -120720
17521a20720K3739j37808J03783J16360p2190j44541L2581P2681m2344k18989
$$ -120720 -96981 -234789 -131006 -14646 -86836 -231377 -198796 -126115 -168459 -387448
17511c87448m9313O8079J26557J33009j23356p582M1638l911J36623K50257l6172
$$ -387448 -436761 -368682 -242125 -109116 -232472 -240054 -198416 -202327 -65704 184553 148381
17500A48381k41630j00048K23800m7891k96660R157J23355R2210P4129J52440
$$ 148381 -93249 -193297 30503 -17388 -314048 -304891 -181536 -89326 -15197 137243
17490A37243j20225j41130O9095K75162L2852j04982p8411l726J85622J12504
$$ 137243 17018 -124112 -55017 220145 252997 148015 69604 65878 251500 364004
17480C64004j82508j15941k6145K46139J4476j52510j41682n0993J09154J31916
$$ 364004 181496 65555 39410 285549 300025 147515 5833 -45160 63994 195910
17470A95910j02885p2798j55714k1728J00134K6605l1775j4395k7368J20605K29791
$$ 195910 93025 20227 -135487 -157215 -57081 -30476 -62251 -76646 -104014 16591 246382
17459B46382J07209j06794o3401L1704k0934m8722L5565m8877p1921r4912J14500
$$ 246382 353591 246797 183396 215100 194166 145444 181009 132132 60211 -34701 79799
17448G9799Q5501k5521J10942J81356m2240Q1756K03861J29751J23658J50529
$$ 79799 165300 139779 250721 432077 389837 471593 675454 805205 928863 1079392
17438A079392L94013J73727m99017l92392k76431j11974J6504O2817p9813r0337
$$ 1079392 1473405 1647132 1148115 755723 479292 367318 383822 446639 366826 276489
17428B76489J98371L0874l915r3823j68110J8364K08693j14315k17200j03255
$$ 276489 474860 505734 501819 407996 239886 258250 466943 352628 135428 32173
17418C2173J04814J91669j24773k3034k81455k4089k2527R043j32179N2956J45622
$$ 32173 136987 328656 203883 180849 -100606 -124695 -147222 -138179 -270358 -217402 -71780
17407g1780l7915L3973M1859J29103L384j05065j47634M0448J5605J6259L0403
$$ -71780 -109695 -75722 -33863 95240 98624 -6441 -154075 -113627 -98022 -81763 -51360
17396e1360k26434j18917J57360r666P5110L1070q2617k15151j49075L38857K22807
$$ -51360 -277794 -396711 -239351 -249017 -173907 -142837 -225454 -440605 -589680 -250823 -28016
17385b8016l3967K5238n5127k8469J42992J71160J51210K10454l378k10505k33118
$$ -28016 -61983 -36745 -91872 -120341 22651 193811 345021 555475 552097 341592 108474
17374A08474q7230n8378N1290q3325J52963J18461j77396j62808K1855J75889
$$ 108474 21244 -37134 14156 -69169 83794 202255 24859 -137949 -116094 59795
17364E9795r670r5934j72755j4284r1474J23089K98468J94145L7217k11921Q3714
$$ 59795 50125 -45809 -218564 -232848 -324322 -201233 97235 291380 328597 116676 200390
17353B00390K3712K7957O1255J1001j28160j41693J31275J66422l8890k21802
$$ 200390 224102 252059 313314 324315 196155 54462 185737 352159 313269 91467
17343I1467j26520P4363k452P6790N4296J50336j11341K487P150j65075k61907
$$ 91467 -35053 39310 36858 113648 167944 318280 206939 209426 216576 51501 -210406
17332b10406j0560M0586k3385K4155M7348N0828j00598o5673o5512j35302o7030
$$ -210406 -220966 -180380 -203765 -179610 -132262 -81434 -182032 -247705 -313217 -448519 -515549
17321e15549K06622J60914j76476l1719J18476J34834J71662K4520q8420M5350
$$ -515549 -308927 -148013 -324489 -356208 -237732 -102898 68764 93284 4864 50214
17311E0214J18014J08256j43016j51384j22126L4678R7092j08367P261m3555J8721
$$ 50214 168228 276484 133468 -17916 -140042 -105364 -8272 -116639 -109378 -152933 -134212
17300a34212p3775Q4149L1090j92443Q3257J6020N7317J68757K3553j06940O8221
$$ -134212 -207987 -123838 -92748 -285191 -201934 -185914 -128597 40160 63713 -43227 24994
17289B4994k74368r0837J59023J08215J8607k8351n0270l3984N2684L8540k03748
$$ 24994 -249374 -340211 -181188 -72973 -54366 -82717 -132987 -166971 -114287 -75747 -279495
17278b79495M7674J72920n4692J07465R8775K9822j09636R3466J99591K2296j55118
$$ -279495 -231821 -58901 -113593 -6128 92647 122469 12833 106299 305890 328186 173068
17267A73068k89312J51693J8502j8071p1468J04270J09173j6315O7639J59905
$$ 173068 -116244 35449 53951 35880 -35588 68682 177855 161540 229179 389084
17257C89084K1240o2304R569N5285j07110l1128r4568P4386q2761j1634q5069
$$ 389084 410324 348020 357589 412874 305764 274636 180068 254454 171693 160059 74990
17246G4990j27596O0761j71944p3398O9426P5196m881R9356k3386q217J34678
$$ 74990 -52606 8155 -163789 -237187 -167761 -92565 -97446 1910 -21476 -29693 104985
17235A04985O9198J26391j8160k61198k60409q5527J73869K58873m9501j14478
$$ 104985 174183 300574 282414 21216 -239193 -324720 -150851 108022 58521 -55957
17225e5957K40668L5300M5731K84490j22293k66421N0040J07020k6109j41087
$$ -55957 184711 220011 265742 550232 427939 161518 211558 318578 292469 151382
17215A51382O7532P6553N6248J9122k50660l8152J12748L0124l01734q5144j7962
$$ 151382 218914 295467 351715 370837 120177 82025 194773 224897 -76837 -161981 -179943
17204a79943l0614J86723R4531k8062J13681l4676J57256p3756k39214p2753K02352
$$ -179943 -210557 -23834 70697 42635 156316 121640 278896 205140 -34074 -106827 95525
17193I5525J86426N347k6723r668j1106n9418k39703n5445J6270Q1394K57712
$$ 95525 281951 287298 260575 250907 239801 180383 -59320 -114765 -98495 -17101 240611
17182B40611j0702j61328j4762L6222j34169o6390j02156K971K30044p9995R2091
$$ 240611 229909 68581 53819 90041 -44128 -110518 -212674 -209703 20341 -59654 32437
17171C2437R0179j21152j01938o145l726K25876o1774p5636k37809P2774J91390
$$ 32437 122616 1464 -100474 -106619 -110345 115531 53757 -21879 -259688 -186914 4476
17160D476j89791j64595m0718K89507M7701J88q4410j51448J7872o949M306J40619
$$ 4476 -185315 -349910 -390628 -101121 -53420 -53232 -137642 -289090 -271218 -278167 -273861 -133242
17148a33242K999N6838K9228M2958j06961o5471J19329M7184n6057j30751j22403
$$ -133242 -130243 -73405 -44177 -1219 -108180 -173651 -54322 -7138 -63195 -193946 -316349
17137c16349L403P7299J4757K6665O3505J3673L8613P8751K3231N9714j52702
$$ -316349 -312946 -235647 -220890 -194225 -130720 -117047 -78434 317 23548 83262 -69440
17126f9440k5433J6399j53072l1267K94134L66245j64011k85658J12698J36531
$$ -69440 -94873 -78474 -231546 -262813 31321 397566 233555 -52103 60595 197126
17116A97126P0510j07531p475k5034J05796K8584J24698j20625j52439n8257J68528
$$ 197126 267636 160105 152630 127596 233392 261976 386674 266049 113610 55353 223881
17105B23881l4021k01350N9385O4519M2272j9735l4924K528j29223J2503K6736
$$ 223881 189860 -11490 47895 112414 154686 134951 100027 102555 -26668 -14165 12571
17094A2571N5511j63124j45989N4234J29618J3999O7961l2938L6071k356j22293
$$ 12571 68082 -95042 -241031 -186797 -57179 -43180 24781 -8157 27914 25558 -96735
17083i6735o0670K57209K10710k9077j89869j84499j28252L5581K895N2610M3797
$$ -96735 -157405 99804 310514 281437 91568 -92931 -221183 -185602 -182707 -130097 -86300
17072h6300q8549J49715M5487L8036j61775m4428K55637J34164M9948j95566k68064
$$ -86300 -174849 -25134 20353 58389 -103386 -147814 107823 241987 291935 96369 -171695
17061a71695j88517R5551K75562m6876K1520M6947K5032M8452k23132k53909J6777
$$ -171695 -360212 -264661 10901 -35975 -14455 32492 57524 105976 -117156 -371065 -354288
17050c54288L5003k2693J71545J81018J49401r7104j42217J36313J74133j57660
$$ -354288 -319285 -341978 -170433 10585 159986 62882 -79335 56978 231111 73451
17040G3451l21217N9213K82972o2562k40K72545J44851k69293k09062k4112l0255
$$ 73451 -247766 -188553 94419 31857 31617 304162 449013 179720 -29342 -53454 -83709
17029h3709j18449r0525K56120K71362m5348k5332o476l7446J42900P1238r6647
$$ -83709 -202158 -292683 -36563 234799 189451 164119 157643 120197 263097 334335 237688
17018B37688j32936O165O7311j86933n9380J7002l3155r296J03476Q2754L6309
$$ 237688 104752 110917 178228 -8705 -68085 -51083 -84238 -93534 9942 92696 129005
17007A29005m6976j80011j31081J75961J9972k60860j0935J6077l6690K07369
$$ 129005 82029 -97982 -229063 -53102 -33130 -293990 -304925 -288848 -325538 -118169
16997a18169N1736j53293p5100K1104K36223J87118R0546j30347j61699j0969
$$ -118169 -66433 -219726 -294826 -273722 -37499 149619 240165 109818 -51881 -62850
16987f2850n3699K09780M2313n7123L7925j65019M0650K33321j25784j00440l8813
$$ -62850 -116549 93231 135544 78421 116346 -48673 -8023 225298 99514 -926 -39739
16976c9739K3133O8841m2172n6616J8054j25353j34518o7647M2570Q2659J68409
$$ -39739 -16606 52235 10063 -46553 -28499 -153852 -288370 -356017 -313447 -230788 -62379
16965f2379M6270r8796j23039J65177J41684L835n3533J64707r2482j46129o2402
$$ -62379 -16109 -114905 -237944 -72767 68917 72752 19219 183926 91444 -54685 -117087
16954a17087K6134l0298k06347p1758n8024l8927Q5623p559K1652J28452r72j197
$$ -117087 -90953 -121251 -327598 -399356 -457380 -496307 -410684 -418243 -396591 -268139 -269111 -270308
16942b70308r319K92921K90713o6666k5428n2607J3639O600J3149o0717M4425
$$ -270308 -279627 13294 304007 237341 211913 159306 172945 179545 192694 131977 176402
16931A76402M6429j12984m4538r641p0306m1231K28183K1534P097L1177K9063
$$ 176402 222831 109847 65309 55668 -14638 -55869 172314 193848 200945 232122 261185
16920B61185o8937N238j42263r1016k80559J6168J92107P8903J18738K4427k56163
$$ 261185 192248 197486 55223 -35793 -316352 -300184 -108077 -29174 89564 113991 -142172
16909a42172k05732J59413M0490J18128K907J37052O0825l01278j37893K4374
$$ -142172 -347904 -188491 -148001 -29873 -26966 110086 170911 -130367 -268260 -243886
16899b43886P4124J81051K52109J77109n1510k43997l2148j66453j26659J20204
$$ -243886 -169762 11289 263398 440507 388997 145000 112852 -53601 -180260 -60056
16889f0056k5744j57012J37471L3086p509J12466R2324k99359m7060J32533m2115
$$ -60056 -85800 -242812 -105341 -72255 -79764 32702 125026 -174333 -221393 -88860 -130975
16878a30975R5197j18526o9590J19105l5526j10530q6675J28593N1806Q3756K17601
$$ -130975 -35778 -154304 -223894 -104789 -140315 -250845 -337520 -208927 -157121 -73365 144236
16867A44236J49523n2789j92031k42111J96749L1565q4468K23009o1276j50642
$$ 144236 293759 240970 48939 -193172 3577 35142 -49326 173683 112407 -38235
16857c8235j04694L0094J574K36220o7199p7486k8595J48329M6198P9769n0244
$$ -38235 -142929 -112835 -111261 124959 57760 -19726 -48321 100008 146206 225975 175731
16846A75731j98266r3351m3078P5708L3517o2981j14988J33219O5810L5362p8814
$$ 175731 -22535 -115886 -158964 -83256 -49739 -112720 -227708 -94489 -28679 6683 -72131
16835g2131n9384J67744j30736P222J26131j37427j79936J47072J53415J09461
$$ -72131 -131515 36229 -94507 -87285 38846 -98581 -278517 -131445 21970 131431
16825A31431O2538j26834K815l3866K8309j12433j37617K34366j43684k46812
$$ 131431 193969 67135 69950 36084 64393 -48040 -185657 48709 -94975 -341787
16815c41787n710J11439p1717P1527J68428r074J40006K79771j07032j77157M7389
$$ -341787 -347497 -236058 -307775 -236248 -67820 -76894 63112 342883 235851 58694 106083
16804A06083l39667j42826L06516J19155Q6602j1200p6008M8351O7514j39735
$$ 106083 -233584 -376410 -69894 49261 135863 124663 48655 97006 164520 24785
16794B4785k92214L15142K16306j87543j60554J01659N6308Q692j71115P2345
$$ 24785 -267429 47713 264019 76476 -84078 17581 73889 82581 -88534 -16189
16784a6189R8918k34024j31928j3001K23847R5622P8925J09120l34997K8337J84180
$$ -16189 82729 -151295 -283223 -296224 -72377 23245 102170 211290 -123707 -95370 88810
16773H8810j8676J1089J51226j7179j97612m5765p1383m3233N3937M8817k836
$$ 88810 70134 81223 232449 215270 17658 -28107 -99490 -142723 -88786 -39969 -42805
16762d2805J58532o1489M6787J1344j22757q5008K41038J47069j12846p4042J42934
$$ -42805 115727 54238 101025 112369 -10388 -95396 145642 292711 179865 105823 248757
16751B48757o5472o6448k9560J0805P7697n972j31827j12602K5295P7975N1951
$$ 248757 183285 116837 87277 98082 175779 169807 37980 -74622 -49327 28648 80599
16740H0599r0768m3812M8841j53270J6676m8711J03121n7632n7197J47649J06855
$$ 80599 -10169 -53981 -5140 -158410 -141734 -190445 -87324 -144956 -202153 -54504 52351
16729E2351k16665j38910m2680J8722J01579J6736M6227O1497O4122L4294N2884
$$ 52351 -164314 -303224 -345904 -327182 -225603 -208867 -162640 -101143 -37021 -2727 50157
16718E0157N658R0774o6542j48226k47815k263j01333N4311L01694J22594O8797
$$ 50157 55815 146589 80047 -68179 -315994 -318257 -419590 -365279 -63585 59009 127806
16707A27806j4571k6800j12451R7877n319o3421p8664o5304O334m2757J37161
$$ 127806 113235 86435 -26016 71861 66542 3121 -75543 -140847 -134513 -177270 -40109
16696d0109l6019M3669l4129k17902r1157Q0202l8099J17198J13988j16862P4595
$$ -40109 -76128 -32459 -66588 -284490 -375647 -295445 -333544 -216346 -102358 -219220 -144625
16685a44625K10859k2475J06300p0174o2825P0913K42067l8374j67167j16339
$$ -144625 66234 43759 150059 79885 17060 87973 330040 291666 124499 8160
16675H160j25514j15961J07116J44215J04479Q0507r7756k57172Q7086L9143M5552
$$ 8160 -117354 -233315 -126199 18016 122495 203002 105246 -151926 -64840 -25697 19855
16664A9855Q6957Q0934K759K08534J2307k75101j37536j7340q1107r5627J76771
$$ 19855 106812 187746 190505 399039 411346 136245 -1291 -18631 -99738 -195365 -18594
16653a8594k4321k0735L9368j62453k37708O3367K40999n5635j59930J83168J96439
$$ -18594 -42915 -63650 -24282 -186735 -424443 -361076 -120077 -175712 -335642 -152474 43965
16642D3965M1180q6795q2616O6137j16957Q4241J26752P5160q4378O2906M2974
$$ 43965 85145 -1650 -84266 -18129 -135086 -50845 75907 151067 66689 129595 172569
16631A72569n5205J07691j34758n7408O4828Q2570p1431j26638P5700P8379j35947
$$ 172569 117364 225055 90297 32889 97717 180287 108856 -17782 57918 136297 350
16620C50m3112R7212p4468O9996j02381p1165p2044M7233J96349L8720m2459j15673
$$ 350 -42762 54450 -20018 49978 -52403 -123568 -195612 -148379 47970 86690 44231 -71442
16608g1442j58745O85K03639Q1757J87345J22345k38087j34655M9231P7123K5342
$$ -71442 -230187 -229502 -25863 55894 243239 365584 127497 -7158 42073 119196 144538
16597A44538O9192j26215o9880k56747J15920J04782K256j72794o3295j57217
$$ 144538 213730 87515 17635 -239112 -123192 -18410 -16154 -188948 -252243 -409460
16587d09460l0539K79123J05473j1929J70375N8734q3442M741M9667j69281o639
$$ -409460 -439999 -160876 -55403 -67332 103043 161777 78335 83076 132743 -36538 -43177
16576d3177J22859K6331j32754m8021k8147N2906m8366J31237j35630o4506p4608
$$ -43177 79682 106013 -26741 -74762 -102909 -50003 -98369 32868 -102762 -167268 -241876
16565b41876J0162O4492J45344j07799j68722K39119j7423q7098K4251j21059
$$ -241876 -231714 -167222 -21878 -129677 -298399 -59280 -76703 -163801 -139550 -260609
16555b60609j9264J61011m6973l2011N6125J98637P3318j0055j00344p5453K2470
$$ -260609 -279873 -118862 -165835 -197846 -141721 56916 130234 120179 19835 -55618 -33148
16544c3148m8719J30846j11860q038R8192P7609j2695j39192Q6114N7407Q7461
$$ -33148 -81867 48979 -62881 -70919 27273 104882 92187 -47005 39109 96516 183977
16533A83977j0765K6570N7347N0775k57543j07513o4533o910K08793O9462P214
$$ 183977 173212 199782 257129 307904 50361 -57152 -121685 -128595 80198 149660 156874
16522A56874j15573K76229Q0500j44697j59066q2665R9563r435K2775l5308m4579
$$ 156874 41301 317530 398030 253333 94267 11602 111165 101730 124505 89197 44618
16511D4618j506j07208J04651l3105P0038P5550j42938k54933p0342R4957J17157
$$ 44618 43112 -64096 40555 7450 77488 153038 10100 -244833 -315175 -220218 -103061
16500a03061L2281q3190K1958j22386j21860J8785P3695J09395K10725K8093j55443
$$ -103061 -70780 -153970 -132012 -254398 -376258 -357473 -283778 -174383 36342 64435 -91008
16489i1008k5116N0060m1559K1777Q1081l2060J11777J41856M5872Q5356j07407
$$ -91008 -116124 -66064 -107623 -85846 -4765 -36825 74952 216808 262680 348036 240629
16478B40629m00047j06122O9431J30671J85090N3015O2141J5034l3155k4611o0945
$$ 240629 -159418 -265540 -196109 -65438 119652 172667 234808 249842 216687 192076 131131
16467A31131l4279j4845R5408J69677J54422j14368j5212j1795j87991q6307J56947
$$ 131131 96852 82007 177415 347092 501514 387146 371934 360139 172148 85841 242788
16456B42788J12323j32236j5777K790k4165j00010q9348R9159R8706K39341J40849
$$ 242788 355111 222875 207098 209888 185723 85713 -3635 95524 194230 433571 574420
16445E74420k9877j81860n550j5164p7404J00799l6671j32997J25750j1680j06216
$$ 574420 544543 362683 357133 341969 264565 365364 328693 195696 321446 309766 203550
16434B03550m8916k08300l6045P0791P5974q6822r2714j6114o758L9734J5452
$$ 203550 154634 -53666 -89711 -18920 57054 -29768 -122482 -138596 -145354 -105620 -90168
16423i0168L4549N6955K0686R8232Q5453j18203j09758j14412P1588M9247j01681
$$ -90168 -55619 1336 22022 120254 205707 87504 -22254 -136666 -65078 -15831 -117512
16412a17512J02561K08004N1175q418l230k48214J27920P2295L9025l4005M262
$$ -117512 -14951 193053 244228 235810 232580 -15634 112286 184581 223606 189601 193863
16401A93863j03163j45157j51629j64807J9078J86411L1390j57312J05680M9213
$$ 193863 90700 -54457 -206086 -370893 -351815 -165404 -134014 -291326 -185646 -136433
16391a36433K61358k0595k3192p660m4444p9816j59807J58284k5105j50887J21500
$$ -136433 124925 104330 81138 73478 29034 -50782 -210589 -52305 -77410 -228297 -106797
16380a06797J29214j5959q2287r432J3987j18715l3459J83817J42197k03846j38118
$$ -106797 22417 6458 -75829 -85261 -71274 -189989 -223448 -39631 102566 -101280 -239398
16369b39398P2428J93344J2628p7985Q5947J59438q1137l51010j19402P331K5813
$$ -239398 -166970 26374 39002 -38983 46964 206402 125265 -225745 -345147 -337816 -312003
16358c12003o9323J7621J63256Q6791R7263M546L1049k12421K6127J83153r5754
$$ -312003 -381326 -363705 -200449 -113658 -16395 -11849 19200 -193221 -167094 16059 -79695
16347g9695M3632R951p4701J10222K12258q6703k48226j36162l4123N9021J26018
$$ -79695 -36063 -26112 -100813 9409 221667 134964 -113262 -249424 -283547 -224526 -98508
16336i8508J9268M2880M6526N5523J70770L39142j52893j08637j97467j69562
$$ -98508 -79240 -36360 10166 65689 236459 575601 422708 314071 116604 -52958
16326e2958j11579K4032j6088N599j7885j54204R2163R7166r0707l5228j0368
$$ -52958 -164537 -140505 -156593 -150994 -168879 -323083 -230920 -133754 -224461 -259689 -270057
16315b70057J92662P4627l8897l4506r3933J65705P6519R7785K1060J2459j23599
$$ -270057 -77395 -2768 -41665 -76171 -170104 -4399 72120 169905 190965 203424 79825
16304G9825m5453M9197O5270o9176P6018O1497q8618O4836N4776j7622j48245
$$ 79825 34372 83569 148839 79663 155681 217178 128560 193396 248172 230550 82305
16293H2305M8810n6959j92095j44139J43817j4155l0136j46377o4044J79990J61193
$$ 82305 131115 74156 -117939 -262078 -118261 -132416 -162552 -308929 -372973 -192983 -31790
16282c1790P8725n3073q6591j72884R4387K42719P6468j2982k71953k38823J6432
$$ -31790 46935 -6138 -92729 -265613 -171226 71493 147961 134979 -136974 -375797 -359365
16271c59365j0557K96648J57487R4110J49266k28696j85033j10241O3501J47932
$$ -359365 -369922 -73274 84213 178323 327589 98893 -86140 -196381 -132880 15052
16261A5052J56697j26074k07070k4107K33461Q7813q2295j26080k6225J26386
$$ 15052 171749 45675 -161395 -185502 47959 135772 53477 -72603 -98828 27558
16251B7558l825k119J72159j3248j33009N7495J50956O9494j27380n2888j65748
$$ 27558 23733 21614 193773 180525 47516 105011 255967 325461 198081 145193 -20555
16240b0555J54948K47876l22526k77232j72010K59023K31164N9790j00175p2432
$$ -20555 134393 382269 59743 -217489 -389499 -130476 100688 160478 60303 -12129
16230a2129J90464k3188r5718J74498J17284p0199j62020p9978K7186J5605r1765
$$ -12129 178335 155147 59429 233927 351211 281012 118992 39014 66200 81805 -9960
16219i960j33557Q0822J89747j26148R878j66488m2941J84108J23756j6495j41615
$$ -9960 -143517 -62695 127052 904 10782 -155706 -198647 -14539 109217 92722 -48893
16208d8893J11660J93669o3665j01514J98982L4764O5779O387l2733J23752k54097
$$ -48893 62767 256436 192771 91257 290239 325003 390782 397169 364436 488188 234091
16197B34091l09949P7493l8990M1813p75r7949L5253j8281k180o6429J14944J36245
$$ 234091 -75858 1635 -37355 4458 3683 -94266 -59013 -77294 -79474 -145903 -30959 105286
16185A05286J72980j92947o1850P811j85388p1181J3494N2953j7805j91172k1760
$$ 105286 278266 85319 23469 31280 -154108 -225289 -211795 -158842 -176647 -367819 -389579
16174c89579J31329J66123K77644J9876j44732r0950R7385M3638L7122L4444j65965
$$ -389579 -258250 -92127 185517 205393 60661 -30289 67096 110734 147856 182300 16335
16163A6335l14796j34977J38214Q9227o7113j41536J72874J80202m5334p7233
$$ 16335 -298461 -433438 -295224 -205997 -273110 -414646 -241772 -61570 -106904 -184137
16153a84137r8786o0469n2400m2669L0535K97236J50193J35582J13823k20891
$$ -184137 -282923 -343392 -395792 -438461 -407926 -110690 39503 175085 288908 68017
16143F8017k65460k8642M9114J24991M4055J8044j35556O2558M7404J60997M0459
$$ 68017 -197443 -226085 -176971 -51980 -7925 10119 -125437 -62879 -15475 145522 185981
16132A85981j1050j06709j30075J1104n365j37784K8182L6522L3763M1306o8974
$$ 185981 174931 68222 -61853 -50749 -56114 -193898 -165716 -129194 -95431 -54125 -123099
16121a23099L3175L6796K3227J76279r5397l79662m598M3605j07820K75826K40618
$$ -123099 -89924 -53128 -29901 146378 50981 -328681 -333279 -289674 -397494 -121668 118950
16110A18950M3625O6536p3565j91390k04413O4844R1010j21776J37819J06220
$$ 118950 162575 229111 155546 -35844 -240257 -175413 -84403 -206179 -68360 37860
16100C7860o4097p8994J44553J25599m7541l47739k18611K04210J99406N693O9960
$$ 37860 -26237 -105231 39322 164921 117380 -230359 -448970 -244760 -45354 -39661 30299
16089C0299j38389P1034Q4082j44738j28460L7102m0824n3513p7618P8882J36283
$$ 30299 -108090 -37056 47026 -97712 -226172 -189070 -229894 -283407 -361025 -282143 -145860
16078a45860p6964R4622j7987M2688n6183j72759m7136K25586J03780j16979M6956
$$ -145860 -222824 -128202 -146189 -103501 -159684 -332443 -379579 -153993 -50213 -167192 -120236
16067a20236j69878M1263J02475J52843p3363J451J5783J83812O1059m0009j00805
$$ -120236 -290114 -248851 -146376 6467 -66896 -65445 -49662 134150 195209 155200 54395
16056E4395j63840j00826J65834K10500l5549l26778l4644K07936J80332J04813
$$ 54395 -109445 -210271 -44437 166063 130514 -196264 -230908 -22972 157360 262173
16046B62173p3269m4580j10225m481K2230j397L1537J28247p9025j45719j1886
$$ 262173 188904 144324 34099 29618 51848 50451 81988 210235 131210 -14509 -26395
16035b6395Q5145J47845R0681k75651j66903n8633K0378J53790J31656k09656
$$ -26395 58750 206595 297276 21625 -145278 -203911 -183533 -29743 101913 -107743
16025a07743j16156j22651j43142J36269K72920L16539J97215j55484m539l3688
$$ -107743 -223899 -346550 -489692 -353423 -80503 236036 433251 277767 273228 239540
16015B39540R7818o2486p8910j89821M052n0910k77555J44930J11738O8746J07555
$$ 239540 337358 274872 195962 6141 10193 -40717 -318272 -173342 -61604 7142 114697
16004A14697K02335J04868o9948m2529P4738m9551k99986j00718p1545Q8993R9227
$$ 114697 317032 421900 351952 309423 384161 334610 34624 -66094 -137639 -48646 50581
15993E0581k1697K3224j39368j32307O8925K4249k1016j72027R1092J88984j421
$$ 50581 28884 52108 -87260 -219567 -150642 -126393 -147409 -319436 -228344 -39360 -40781
15982d0781k4507J30052M7680M9534P6379k24371j9434J04813J58432J01879j3551
$$ -40781 -65288 64764 112444 161978 238357 13986 -5448 99365 257797 359676 346125
15971C46125o9868k08078j08687N084P5660k9140N0306n7764j00924j07008K25002
$$ 346125 276257 68179 -40508 -35424 40236 11096 61402 3638 -97286 -204294 20708
15960B0708J47502j30563m2373J21093N4361p5572k6864o0238K33066K7381n3960
$$ 20708 168210 37647 -4726 116367 170728 95156 68292 8054 241120 268501 214541
15949B14541o3441r8263r770J49568n0989l18176J58584Q4100j5151J59361J27709
$$ 214541 151100 52837 43067 192635 141646 -176530 -17946 66154 51003 210364 338073
15938C38073p4598m4886p7449j07587j1762R5456K85288j75106l95022M656J56129
$$ 338073 263475 218589 141140 33553 21791 117247 402535 227429 -167593 -162937 -6808
15927f808J81665J01305N7021j46784j47367l3363J04733m381q4606l3110j43526
$$ -6808 174857 276162 333183 186399 39032 5669 110402 106021 21415 -11695 -155221
15916a55221j47435j37138J70492K74443o1701m5366L4961J14309J70362J74535
$$ -155221 -302656 -439794 -269302 5141 -56560 -101926 -66965 47344 217706 392241
15906C92241n0890j06704M6667R3525p6524k32695l40121R3910K3227j09730j31764
$$ 392241 341351 234647 281314 374839 298315 65620 -274501 -180591 -157364 -267094 -398858
15895c98858O3000Q0063K4655O7854l635k89682o2827J07918J40931P6164P6232
$$ -398858 -335858 -255795 -231140 -163286 -166921 -456603 -519430 -411512 -270581 -194417 -118185
15884a18185K00232M9553J40484p6085l58250j93377k6509J51592O0400O0388
$$ -118185 82047 131600 272084 195999 -162251 -355628 -382137 -230545 -170145 -109757
15874a09757J77050J29862k4171j63952j91675l831O3237K33739K5918j49368
$$ -109757 67293 197155 172984 9032 -182643 -186474 -123237 110502 136420 -12948
15864a2948M6778J59117m5751o925L3871j45921j2456J85652o8157j64882j30644
$$ -12948 33830 192947 147196 140271 174142 28221 15765 201417 133260 -31622 -162266
15853a62266k77n7743L6644l7207J66197K68796M7023k16749J89252Q8820k69520
$$ -162266 -162543 -220286 -183642 -220849 -54652 214144 261167 44418 233670 322490 52970
15842E2970k14029n5754K12557o4593j26570M9293J48865J2720K521k0040j10016
$$ 52970 -161059 -216813 -4256 -68849 -195419 -146126 2739 15459 17980 -2060 -112076
15831a12076j00901J44551K37766k1342j91888j23835Q3613j19169P8680l2599
$$ -112076 -212977 -68426 169340 147998 -43890 -167725 -84112 -203281 -124601 -157200
15821a57200r9845n0080n4133r7604K30317K03759J47132j11655j91154o6148
$$ -157200 -257045 -307125 -361258 -458862 -228545 -24786 122346 10691 -180463 -246611
15811b46611j24635M8737J25973R0276J24182J5939L0581J58010m3013k40817
$$ -246611 -371246 -322509 -196536 -106260 17922 33861 64442 222452 179439 -61378
15801f1378J02839L1205k09937J12142O2201O3097O6642K49444M9866k00264l1647
$$ -61378 41461 72666 -137271 -25129 37072 100169 166811 416255 466121 265857 234210
15790B34210m2889r7744j01471L8015J00083N1794k0259j65496K3999Q7259k16156
$$ 234210 191321 93577 -7894 30121 130204 181998 161739 -3757 20242 107501 -108655
15779a08655n7842N4307M3082J63200J93980L366o7106Q246j53163p2883N7999
$$ -108655 -166497 -112190 -69108 94092 288072 291438 224332 232578 79415 6532 64531
15768F4531j87204Q8664J02614k25737k90566J52921J59858o2000O7444P911N4913
$$ 64531 -122673 -34009 68605 -157132 -447698 -294777 -134919 -196919 -129475 -121564 -66651
15757f6651N1310J38293j42910j55023j3843K7147j2014J60041J830j72932N0729
$$ -66651 -15341 122952 -19958 -174981 -188824 -161677 -173691 -13650 -11820 -184752 -134023
15746a34023L3826N3250J87355J66329j18552p3744l37963r8165K70562K20585
$$ -134023 -100197 -46947 140408 306737 188185 114441 -223522 -321687 -51125 169460
15736A69460J68010L7349j64848j7516K95846j1225r9290j86252K6138m5626m4973
$$ 169460 337470 374819 209971 192455 488301 477076 377786 191534 217672 172046 127073
15725A27073N7213Q8038Q9313M581L9604l47765j30774j2286M5930N6931J54680
$$ 127073 184286 272324 361637 366218 405822 58057 -72717 -85003 -39073 17858 172538
15714A72538K59096M8517k03414M6217n2392k57843r3830p6844O5692O6946j09423
$$ 172538 431634 480151 276737 322954 270562 12719 -81111 -157955 -92263 -25317 -134740
15703a34740o3580L284P3322J54724l2014j45932k118K64239N7974k3693j13128
$$ -134740 -198320 -195036 -121714 33010 996 -144936 -147054 117185 175159 151466 38338
15692C8338O7895J64165k4006j62911j43334J741n0646j03121j2432Q1888J31637
$$ 38338 106233 270398 246392 83481 -59853 -58112 -108758 -211879 -224311 -142423 -10786
15681a0786q3125o7997J45437L2139P3383j08565l7778j78374p05M9407P2991
$$ -10786 -93911 -161908 -16471 15668 89051 -19514 -57292 -235666 -236371 -186964 -113973
15670a13973K0585Q5966R6075J8665l036R536m0140L3309p7602n5060J03648j12092
$$ -113973 -93388 -7422 88653 107318 104282 113818 73678 106987 29385 -25675 77973 -34119
15658c4119k30793M4362J13969J03587J36554j54198j67222K69989R8746K4553
$$ -34119 -264912 -220550 -106581 -2994 133560 -20638 -187860 82129 180875 205428
15648B05428K9913j77907l23838o0443K82001K20672o4744r6086p4239j47561
$$ 205428 235341 57434 -266404 -326847 -44846 175826 111082 14996 -59243 -206804
15638b06804K955Q6467p7642J09671q8119k00221J28051J46571j5098J27332K06460
$$ -206804 -203849 -117382 -195024 -85353 -173472 -373693 -245642 -99071 -114169 13163 219623
15627B19623n0183q7410k00952n8717j00471O8924q2853q7682J9060J36491o3761
$$ 219623 169440 82030 -118922 -177639 -278110 -209186 -292039 -379721 -360661 -224170 -287931
15616b87931l3551J48305J57373P598L4740o7122K0299J14329j1218R1734j58351
$$ -287931 -321482 -173177 -15804 -8206 26534 -40588 -20289 94040 82822 174556 16205
15605A6205l7163J17805R8333J7545j893k27729k8796o906j40732m6160J19523
$$ 16205 -20958 96847 195180 212725 210832 -16897 -45693 -52599 -193331 -239491 -119968
15594a19968R5200P7687N8718J48034l3010j55873N0069j8476j56646l2968P72
$$ -119968 -24768 52919 111637 259671 226661 70788 120857 102381 -54265 -87233 -86461
15583h6461l6397k6445L9831N9562Q1784j84369N8865R3616J35106J1010k15803
$$ -86461 -122858 -149303 -109472 -49910 31874 -152495 -93630 -14 135092 146102 -69701
15572f9701Q750M5178n3693j849J54020j43445l117O5843l8268L5692R0964m2886
$$ -69701 -60951 -15773 -69466 -71315 82705 -60740 -63857 1986 -36282 -590 90374 47488
15560D7488m7048m6628q5425J19693K89249L6925j92318q0416J1310q21j20591
$$ 47488 440 -46188 -131613 -11920 277329 314254 121936 41520 52830 52009 -68582
15549f8582Q3107J78879j12348K941j7482J5086l7804K4886P6717J26516q6553
$$ -68582 14525 193404 81056 83997 66515 81601 43797 68683 145400 271916 185363
15538A85363k06298r2888m5710K9132J07761J04559j34259J2304m9790J18738
$$ 185363 -20935 -113823 -159533 -130401 -22640 81919 -52340 -40036 -89826 28912
15528B8912l7497j70492k44288j00719L46397J12783j73900p5537J25266J01423
$$ 28912 -8585 -179077 -423365 -524084 -177687 -64904 -238804 -314341 -189075 -87652
15518h7652J04037L3113k75319k1587J92473N8400p0114k5862m235N5183l17685
$$ -87652 16385 49498 -225821 -247408 -54935 3465 -66649 -92511 -96746 -41563 -359248
15507c59248n1238J70425P8021J38021R0311K3607J17061m5486J15765j1803k22613
$$ -359248 -410486 -240061 -162040 -24019 66292 89899 206960 161474 277239 265436 42823
15496D2823j23757R1808r7667Q2800J96327m4232P9420n1852j248r8252k16109
$$ 42823 -80934 10874 -86793 -3993 192334 148102 227522 175670 174422 76170 -139939
15485a39939K14619J66178m3177l2906n3240R1802o613N3885n1414j26001K31672
$$ -139939 74680 240858 197681 164775 111535 203337 196724 250609 199195 73194 304866
15474C04866J63671l40908k64859j0517J98580J56684k5505k8832k0901Q0387
$$ 304866 468537 127629 -137230 -147747 50833 207517 182012 153180 132279 212666
15464B12666k68806O7296n560J1361J34247N9501j2664J33441l4721L3621K3881
$$ 212666 -56140 11156 5596 16957 151204 210705 198041 331482 296761 330382 354263
15453C54263M8618L6677j43570j90647m4979Q9038J68326j63784l99205Q096J35433
$$ 354263 402881 439558 295988 105341 60362 149400 317726 153942 -245263 -237167 -101734
15442a01734R8495m7129J091K45623N5220j32785l14545n0214K10038J32625j91767
$$ -101734 -3239 -50368 -49277 196346 251566 118781 -195764 -245978 -35940 96685 -95082
15431i5082j3727L86808K18407j79439k94187K1660J15393j2697j91868M0071
$$ -95082 -108809 277999 496406 316967 22780 44440 159833 147136 -44732 -4661
15421d661J63624j0415k89693k56383J19894L6582J17631J82126J4553m6624M5492
$$ -4661 158963 148548 -141145 -397528 -277634 -241052 -123421 58705 73258 26634 72126
15410G2126J46561R169o9391q137J42425r235l47004k24959J50058P7674j5323
$$ 72126 218687 227856 158465 150328 292753 283518 -63486 -288445 -138387 -60713 -76036
15399g6036J16953J42021J0377j28099k36945j01924N9111K00895O5165J53782
$$ -76036 40917 182938 193315 65216 -171729 -273653 -214542 -13647 51518 205300
15389B05300J09724j04379k5129k33032k46206j00779r7375R5481K19788l383
$$ 205300 315024 210645 185516 -47516 -293722 -394501 -491876 -396395 -176607 -179990
15379a79990j58186J47362J30148O2846K1665r132j93329n3930q5682K40383L1176
$$ -179990 -338176 -190814 -60666 2180 23845 14713 -178616 -232546 -318228 -77845 -46669
15368d6669K15399j65959k1370M87101J6596m43168n4395Q0102j94414p6944Q1854
$$ -46669 168730 2771 -18599 468502 485098 41930 -12465 67637 -126777 -203721 -121867
15357a21867p764K7189J92161j254j41587j05143K7750J95724O0715N7021r3565
$$ -121867 -129631 -102442 89719 88465 -53122 -158265 -130515 65209 125924 182945 89380
15346H9380j34614M1153J03753r4346k6094J54201L8518k93677Q6298R1815m2066
$$ 89380 -45234 -4081 99672 5326 -20768 133433 171951 -121726 -35428 56387 14321
15335A4321j08488j3830k512J54718L46706J85251k015l64780j54446j79606J8554
$$ 14321 -94167 -107997 -110509 44209 390915 576166 574151 209371 54925 -124681 -106127
15324a06127L29407K10535l99553k45283j22816j6045K02760J08343Q6736P7796
$$ -106127 223280 433815 34262 -211021 -333837 -349882 -147122 -38779 47957 125753
15314A25753K68575K13136k31922l30643j13285J18948J00988K56450r9210j92502
$$ 125753 394328 607464 375542 44899 -68386 50562 151550 408000 308790 116288
15304A16288n9819k6765o5102K71916J27330n192k6518k08571j61275j28421N4578
$$ 116288 56469 29704 -35398 236518 363848 358656 332138 123567 -37708 -166129 -111551
15293a11551J6913J5623r045M6979j38871k27304J77259J87107J5496J06292J59322
$$ -111551 -94638 -79015 -88060 -41081 -179952 -407256 -229997 -42890 -27394 78898 238220
15282B38220O0608j46197j68235j43537K62133k7945k12619r0492Q4886P4338
$$ 238220 298828 152631 -15604 -159141 102992 75047 -137572 -228064 -143178 -68840
15272f8840M8352J25111K00010n2507l3783J21689J11331k7005k16275k03905
$$ -68840 -20488 104623 304633 252126 218343 340032 451363 424358 208083 4178
15262D178p8878L6439m0980k89044J40151J02160K15414p103o7119R6890l2719
$$ 4178 -74700 -38261 -79241 -368285 -228134 -125974 89440 82337 15218 112108 79389
15251G9389r386q7519r9114j3447J24909m5664Q2591O2494O5967J19159j11273
$$ 79389 70003 -17516 -116630 -130077 -5168 -50832 31759 94253 160220 279379 168106
15240A68106k68623j95425p0115J40274J39152P6585J3184N8188Q7235j15658
$$ 168106 -100517 -295942 -366057 -225783 -86631 -10046 3138 61326 148561 32903
15230C2903O57J50560R7403j82594r7414O6242J28536j39341P7063Q7771j65852
$$ 32903 33560 184120 281523 98929 1515 67757 196293 56952 134015 221786 55934
15219E5934J5648n39j3458k22183P8143M452J28300L2406k006J54183N4914j58530
$$ 55934 71582 71043 57585 -164598 -86455 -82003 46297 78703 76697 230880 285794 127264
15207A27264r2612n4893l3502J12866K2615j923r6499K2168k2058N6697j25749
$$ 127264 34652 -20241 -53743 59123 81738 79815 -16684 5484 -16574 40123 -85626
15196h5626k59436p9218K73366P084O7484M5752L1075P4484j2419j12567M8293
$$ -85626 -345062 -424280 -150914 -143830 -76346 -30594 481 74965 62546 -50021 -1728
15185a728n5345p5230j49799J39472J30307J4985m7963j00240l7765Q006J31210
$$ -1728 -57073 -132303 -282102 -142630 -12323 2662 -45301 -145541 -183306 -175300 -44090
15174d4090K72957j84704j59374j34545R8288j06662r094M9735K68796J51535
$$ -44090 228867 44163 -115211 -249756 -151468 -258130 -267224 -217489 51307 202842
15164B02842m0400r8572j08353m1947J86057O2264R4445R9823j4977k46867k24858
$$ 202842 162442 63870 -44483 -86430 99627 161891 256336 356159 341182 94315 -130543
15153a30543j04812N446P3591L41868J64733o577j48276l44180P071J91336K68712
$$ -130543 -235355 -229909 -156318 185550 350283 343706 195430 -148750 -141679 49657 318369
15142C18369p2856k47450m5789j283M9056M0174m5863n8052j45735j18228l5531
$$ 318369 245513 -1937 -47726 -49009 47 40221 -5642 -63694 -209429 -327657 -363188
15131c63188K9966L37943J25668k25477q9459m3549J9983O1749R0303Q0243Q6268
$$ -363188 -333222 4721 130389 -95088 -184547 -228096 -208113 -146364 -56061 24182 110450
15120A10450j53493j40909j4759J71392N2974J1015j17793j23873O165Q3224N0276
$$ 110450 -43043 -183952 -198711 -27319 25655 36670 -81123 -204996 -198831 -115607 -65331
15109f5331o1056J71558J21856J14429j39055j29812P2531J14048n0750K5026
$$ -65331 -126387 45171 167027 281456 142401 12589 85120 199168 148418 173444
15099A73444p4570n9499o8517j49293l9599q1669K79962J50271j15073O1343J70932
$$ 173444 98874 39375 -29142 -178435 -218034 -299703 -19741 130530 15457 76800 247732
15088B47732J69590M3828k59531j42896o7825o1236J1059L3354l5511J77239j2304
$$ 247732 417322 461150 201619 58723 -9102 -70338 -59279 -25925 -61436 115803 103499
15077A03499J6237J7657J0216J56641k4511j48836q1737j17124j28924Q8880K06958
$$ 103499 119736 137393 147609 304250 279739 130903 49166 -67958 -196882 -108002 98956
15066I8956k27653l2119k4127J354O0350K13103j28887R2333q6039j09994K7507
$$ 98956 -128697 -160816 -184943 -183589 -123239 89864 -39023 53310 -32729 -142723 -115216
15055a15216Q8613N3437R7009p9305k27442K151J64978o666n723J9786n9324l8008
$$ -115216 -26603 26834 123843 44538 -182904 -180753 -15775 -22441 -28164 -8378 -67702 -105710
15043a05710N7937R9119m0738k0528J67900P2576n1390j05672M47N8142O8598
$$ -105710 -47773 51346 10608 -9920 157980 230556 179166 73494 73941 132083 200681
15032B00681j17423m6501m4490K8309j45545j1386J64775J53727j21693J3326
$$ 200681 83258 36757 -7733 20576 -124969 -136355 28420 182147 60454 73780
15022G3780o6873j04172J33986j14236N058O2726q207o9771O2571J18482p0271
$$ 73780 6907 -97265 36721 -77515 -72457 -9731 -17938 -87709 -25138 93344 23073
15011B3073J73242J1167J47602k7416j57785j17215j8419L0835m1812m9784l0405
$$ 23073 196315 207482 355084 327668 169883 52668 34249 65084 23272 -26512 -56917
15000e6917J4857J6151J6298p3844J7662M2139n7256N6632J94394R7966O2671
$$ -56917 -42060 -25909 -9611 -83455 -65793 -23654 -80910 -24278 170116 268082 330753
14989C30753j8611o8687J2118p589k07123r6367J10385K5392q6012j18654J7028
$$ 330753 312142 243455 255573 247984 40861 -55506 54879 80271 -5741 -124395 -107367
14978a07367k2071J10497l08891m3254K67096k37274j01343K54483q9131P5680
$$ -107367 -129438 -18941 -327832 -371086 -103990 -341264 -442607 -188124 -277255 -201575
14968b01575P4800m2545k35371j2549O4861K17057K84965j09193K5990j67483
$$ -201575 -126775 -169320 -404691 -417240 -352379 -135322 149643 40450 66440 -101043
14958a01043l7473R4740K816o0328O1879J67715L36661N4740k11503L733j22053
$$ -101043 -138516 -43776 -40960 -101288 -39409 128306 464967 519707 308204 311937 189884
14947A89884j13247N1094q0195O7493L3005p593j37385k164K24046J56400q1921
$$ 189884 76637 127731 47536 115029 148034 140441 3056 892 224938 381338 299417
14936B99417p2238k26290j24543J85773j14393o6693q1959K26056J77947J05845
$$ 299417 227179 889 -123654 62119 -52274 -118967 -200926 25130 203077 308922
14926C08922q9997j34195J45845J09815j70489j64568K6607P1065l5176P3176
$$ 308922 218925 84730 230575 340390 169901 5333 31940 103005 67829 141005
14916A41005k1815k47749J23687L548p4750J91686K00754n4493k34577k32187
$$ 141005 119190 -128559 -4872 -1324 -76074 115612 316366 261873 27296 -204891
14906b04891J14871J68155O1948J30772M0090P5651j3355k91852j70487n3121
$$ -204891 -90020 78135 140083 270855 310945 386596 373241 81389 -89098 -142219
14896a42219J37835L5599r8190m9291J16768N5414N7323n750j1471o0913N2652
$$ -142219 -4384 31215 -66975 -116266 502 55916 113239 107489 96018 35105 87757
14885H7757k5869J36273k02272R6508p6645j94161p0598Q9843j20621J6235Q7405
$$ 87757 61888 198161 -4111 92397 15752 -178409 -249007 -159164 -279785 -263550 -176145
14874a76145M869r492r8599O1653J44073K37324K91524J09456J5908N479q2372
$$ -176145 -171276 -180768 -279367 -217714 -73641 163683 455207 564663 580571 586050 503678
14863E03678l23604j04186P4310n285Q1397J25112j59557n0672q5204j70716K8480
$$ 503678 180074 75888 150198 144913 226310 351422 191865 141193 55989 -114727 -86247
14852h6247R925j71883J6583J16793J37933J54441L4600M8840p8013o3854j21570
$$ -86247 -76322 -248205 -231622 -114829 23104 177545 212145 260985 182972 119118 -2452
14841b452j00181j66695k1296N2355R0785j58040k41920k2382K08117K29124R8067
$$ -2452 -102633 -269328 -290624 -238269 -147484 -305524 -547444 -569826 -361709 -132585 -34518
14830c4518k4240l2120j81587j61718o9422P5325j5595J26643J53183P9077J03712
$$ -34518 -58758 -90878 -272465 -434183 -503605 -428280 -443875 -317232 -164049 -84972 18740
14819A8740P6428J6821k3441R3252j14354R0974l5041J11739l4961j04216j75345
$$ 18740 95168 111989 88548 181800 67446 158420 123379 235118 200157 95941 -79404
14808g9404k3502K4034j34949r4841P3408K4510p4650L8083K70146j924J4656
$$ -79404 -102906 -78872 -213821 -308662 -235254 -210744 -285394 -247311 22835 20911 35567
14797C5567k21219j88556J28619K42129J11916j13786q1081J37465L1592j28604
$$ 35567 -185652 -374208 -245589 -3460 108456 -5330 -86411 51054 82646 -45958
14787d5958j31452k20597K27242J72660o8411J9107j30292J36682P0296j3802
$$ -45958 -177410 -398007 -170765 1895 -66516 -47409 -177701 -41019 29277 15475
14777A5475J2261j08461p8683N5012J13480J4695k19624J4186J75087J62626J03
$$ 15475 27736 -80725 -159408 -104396 9084 23779 -195845 -181659 -6572 156054 156157
14766A56157j03084P428J39290K12765m6761j20925l044L0030M3353j66266r7827
$$ 156157 53073 60501 199791 412556 365795 244870 241826 271856 315209 148943 51116
14755E1116J76866q201l0763l1318j73632n5032j34608j75430q2171l9726J96858
$$ 51116 227982 219781 189018 157700 -15932 -70964 -205572 -381002 -463173 -502899 -306041
14744c06041K3067r9763J33936K68263J36586J12485j0734N3311J12249j30992
$$ -306041 -282974 -382737 -248801 19462 156048 268533 257799 311110 423359 292367
14734B92367j07794j30369K0661k02979j42878J8010j10697J1477R7252K55273
$$ 292367 184573 54204 74865 -128114 -270992 -252982 -363679 -352202 -254950 323
14724C23M8841j58359r254l2229j79481p6411J21429Q1324J15885J57407P7612
$$ 323 49164 -109195 -118449 -150678 -330159 -406570 -285141 -203817 -87932 69475 147087
14713A47087j31062j59794O9231J55064r0207L3346o6420j05917M4095O5448m0119
$$ 147087 16025 -143769 -74538 80526 -9681 23665 -42755 -148672 -104577 -39129 -79248
14702g9248j37041J11309J07322m7042J4346K23393L1992j65055k02995J26929
$$ -79248 -216289 -104980 2342 -44700 -30354 193039 225031 59976 -143019 -16090
14692a6090L21045Q3679j18068j86481j64363Q3853J28704j65650k9662R8985
$$ -16090 304955 388634 270566 84085 -80278 3575 132279 -33371 -63033 35952
14682C5952m872L0166l7865R5304N9380M0578Q7897K3641L5818k96716N8605K8518
$$ 35952 31080 61246 23381 118685 178065 218643 306540 330181 365999 69283 127888 156406
14670A56406n2987J99720j33559k46673L4429j9928N126J06775K93123j7329J45091
$$ 156406 103419 303139 169580 -77093 -42664 -62592 -57466 49309 342432 325103 470194
14659D70194r6232k86767j49493l8615J9984m3008p1838K17721R5882q7523j43759
$$ 470194 373962 87195 -62298 -100913 -80929 -123937 -195775 21946 117828 30305 -113454
14648a13454j7681J8054L6329J14018J8884k4409r2250j1049P4901l9242P9601
$$ -113454 -131135 -113081 -76752 37266 56150 31741 -60509 -71558 3343 -35899 43702
14637D3702J89256l0713J0082o3346l4581j33024n2233k6587j63386O6523K03065
$$ 43702 232958 202245 212327 148981 114400 -18624 -70857 -97444 -260830 -194307 8758
14626H758J43273k5228q0998j5248P9278J01644o277K97285m2510m11601k50810
$$ 8758 152031 126803 45805 30557 109835 211479 205202 502487 459977 48376 -202434
14615b02434K22315J21396J08150j15436l9360K5642j41769O6608M1461k03864
$$ -202434 19881 141277 249427 133991 94631 120273 -21496 45112 86573 -117291
14605a17291j34065J13596J07660J44623L1874j15656o9434L9979k5933O5321
$$ -117291 -251356 -137760 -30100 114523 146397 30741 -38693 1286 -24647 40674
14595D0674K33480o1220j483J16287M778j47563q9641o9931O7915J58592J62450
$$ 40674 274154 212934 211451 327738 332516 184953 95312 25381 93296 251888 414338
14584D14338k12152k52538J1152K6363J20720j87744j57531K04092L6859K62181
$$ 414338 202186 -50352 -39200 -12837 107883 -79861 -237392 -33300 3559 265740
14574B65740o9403n7246J25492j69916k33824M4634J3741J49147q2901N3823K846
$$ 265740 196337 139091 264583 94667 -139157 -94523 -80782 68365 -14536 39287 42133
14563D2133J1460j30122L9689K18097J6353j02122k1828m7061J48193J13677M126
$$ 42133 53593 -76529 -36840 181257 197610 95488 73660 26599 174792 288469 292595
14552B92595r6082k2301o1155n6501j30237j39659j5075P4748m4000Q6831J13194
$$ 292595 196513 174212 113057 56556 -73681 -213340 -228415 -153667 -197667 -110836 2358
14541B358n2686M5542J15231K5993k4984J82317N1842k0546j12581m2145k4951
$$ 2358 -50328 -4786 110445 136438 111454 293771 345613 325067 212486 170341 145390
14530A45390k07505j01286j08280m7993m9652J31750K20036J67764m314j0736
$$ 145390 -62115 -163401 -271681 -319674 -369326 -237576 -17540 150224 145910 135174
14520A35174k57168P4899J79911N9375m6798j07372M0708J30196J68243K17194
$$ 135174 -121994 -47095 132816 192191 145393 38021 78729 208925 377168 594362
14510E94362M2120N5539P1006l3824K74511L05022P3695P667R7793p0834J7441
$$ 594362 636482 692021 763027 729203 1003714 1308736 1382431 1390098 1487891 1417057 1434498
14499A434498M02335O96293O91220Q18927J252066J785251K277090K281098J888192
$$ 1434498 1836833 2533126 3224346 4043273 5295339 7080590 9357680 11638778 13526970
14490A3526970P00487j354127k634990k165934j730388j287000p20232m88365
$$ 13526970 14227457 12873330 10238340 8072406 6342018 5055018 4334786 3846421
14482C846421n25941j64082k35404k43847o2874k87234l42425j96194j38663k26242
$$ 3846421 3320480 3156398 2920994 2677147 2614273 2327039 1984614 1788420 1649757 1423515
14472A423515j05347n6802j67784o0333l5731k43060l60862j05683j0668Q3174
$$ 1423515 1318168 1261366 1093582 1033249 997518 754458 393596 287913 277245 360419
14462C60419J99878N3584k04099o8577m8500N1242P9432n6622J7119l94m745q4615
$$ 360419 560297 613881 409782 341205 292705 343947 423379 366757 383876 383482 378737 294122
14450B94122O8526m910j29898m793j13090R447m3856j69354J48685K8722l029
$$ 294122 362648 357738 227840 223047 109957 119404 75548 -93806 54879 83601 80572
14439H0572O6220O3526j7432J36071l08421j63487Q1132M7265l0750m0665j03480
$$ 80572 146792 210318 192886 328957 20536 -142951 -61819 -14554 -45304 -85969 -189449
14428a89449N8755K09151R0778P132J87000p6569q2866j13668j69273J5078J31000
$$ -189449 -130694 78457 169235 176367 363367 286798 203932 90264 -79009 -63931 67069
14417F7069M5856r5888o2057J34936K03793R3175l38348k77377j9210j32104J4542
$$ 67069 112925 17037 -45020 89916 293709 386884 48536 -228841 -248051 -380155 -365613
14406c65613Q2447L13583R9596l9558L6193Q2422j80570o5759k576m8055P3101
$$ -365613 -283166 30417 130013 90455 126648 209070 28500 -37259 -39835 -87890 -14789
14395a4789Q7009j14824P5260P9658j416K13p747o2828j7498J2636N8791k1820
$$ -14789 72220 -42604 32656 112314 110898 111111 103364 40536 23038 35674 94465 72645
14383G2645L6036J08179K4998m830R5478j12104q5176j93327p1749L57048K25643
$$ 72645 108681 216860 241858 237028 332506 220402 135226 -58101 -129850 227198 452841
14372D52841P5320k36457o5717k1659k08j26945j26951j81535j50464j19179n4619
$$ 452841 528161 291704 225987 204328 204120 77175 -49776 -231311 -381775 -500954 -555573
14361e55573J95272K18692K03103J04512j33721J38502k596Q7043L08830L720
$$ -555573 -360301 -141609 61494 166006 32285 170787 168191 255234 564064 567784
14351E67784j52966J0138j35088j22925J51746j13714j23844R2745o0892P2749
$$ 567784 414818 424956 289868 166943 318689 204975 81131 173876 112984 185733
14341A85733o6083j45702j02173J68995J19735j50123j7585O0524J73608J55926
$$ 185733 119650 -26052 -128225 40770 160505 10382 -7203 53321 226929 382855
14331C82855j66035m6636M6132J5741k93365l25376J30626K85170j68803K0972
$$ 382855 216820 170184 216316 232057 -61308 -386684 -256058 29112 -139691 -118719
14321a18719K23104n786j75030J18844m8921J47856J94687j17200K6266o1602
$$ -118719 104385 98599 -76431 42413 -6508 141348 336035 218835 245101 183499
14311A83499k26523j27637J03631J73892o4360J054p7700k07197L910K11571n6477
$$ 183499 -43024 -170661 -67030 106862 42502 43556 -34144 -241341 -237431 -25860 -82337
14300h2337P2210J37384J37315k38728k10131N0544K04960J9340k07534m5091
$$ -82337 -10127 127257 264572 25844 -184287 -133743 71217 90557 -116977 -162068
14290a62068J76487J22677k63922j91261J60026Q7144o9795L8902J79101k70077
$$ -162068 14419 137096 -126826 -318087 -158061 -70917 -140712 -101810 77291 -192786
14280a92786l0454J49353J24663O2108q1788M632j76506K5228J94573J81458J89679
$$ -192786 -223240 -73887 50776 112884 31096 35728 -140778 -115550 79023 260481 450160
14269D50160L7431k24206k16584j9625J54884J04418k7137m2645M4228L379J44440
$$ 450160 487591 263385 46801 27176 182060 286478 259341 216696 260924 264303 408743
14258D08743Q3892q3215k9428K9241J0575k64430J20551j27881j58992j03896
$$ 408743 492635 409420 379992 409233 419808 155378 275929 148048 -10944 -114840
14248a14840q863J52826K38248p6944j55003J7629J76827k3906J08691o3253r966
$$ -114840 -123703 29123 267371 190427 35424 53053 229880 205974 314665 251412 241446
14237B41446L0005k05045k18820J56742M1839p1668J96624J43895o7298j32393
$$ 241446 271451 66406 -152414 4328 46167 -25501 171123 315018 247720 115327
14227A15327o5637q6753L6308J1820j66976N9402O0773N8706j59242l3285J57780
$$ 115327 49690 -37063 -755 11065 -155911 -96509 -35736 22970 -136272 -169557 -11777
14216a1777R5825N5631Q6967k6312j65059l8499J10351j70262k18294l0750J67832
$$ -11777 84048 139679 226646 200334 35275 -3224 107127 -63135 -281429 -312179 -144347
14205a44347m4823j07124l3922J18019k9577m9288j6120N6758N6541q0298r1280
$$ -144347 -189170 -296294 -330216 -212197 -241774 -291062 -307182 -250424 -193883 -274181 -365461
14194c65461J52759K12747j14903K23352L1947k6458n8719M7004J333o3338P7785
$$ -365461 -212702 45 -114858 108494 140441 113983 55264 102268 103601 40263 118048
14183A18048p8380l7453O1330J24138l7634j06618j82404p6559M9639M5803K47249
$$ 118048 39668 2215 63545 187683 150049 43431 -138973 -215532 -165893 -120090 127159
14172A27159K3719j72597j37375j51840j13821J17764L40512J53357J43400r8305
$$ 127159 150878 -21719 -159094 -310934 -424755 -306991 33521 186878 330278 231973
14162B31973k53839q4154o2683J50724m8951l9985K32349N4837j86633p7027J44803
$$ 231973 -21866 -106020 -168703 -17979 -66930 -106915 125434 180271 -6362 -83389 61414
14151F1414k5595J49451K8168j87114R0833m0954k31450k40460O9385K56791J81047
$$ 61414 35819 185270 213438 26324 117157 76203 -155247 -395707 -326322 -69531 111516
14140A11516O6591j04114n8685M8060J3978r5409j7481J66609o2703r3850L2449
$$ 111516 178107 73993 15308 63368 77346 -18063 -35544 131065 68362 -25488 6961
14129F961k69748j9146K79534j26495N8235J49321r9491p2863R0318j7385R1897
$$ 6961 -262787 -281933 -2399 -128894 -70659 78662 -20829 -93692 -3374 -20759 71138
14118G1138q959m8061j3232M3320n3087J62648K3092p721K5452q0657Q7199j0371
$$ 71138 62179 14118 886 44206 -8881 153767 176859 169138 194590 113933 201132 190761
14106A90761j77828K8294K14124J06985k52341k69140p3289k3672q2794J01742
$$ 190761 12933 41227 255351 362336 109995 -159145 -232434 -256106 -338900 -237158
14096b37158J34421L3890j0838K6213K16457l9126P0759N4991q6343j94217M4848
$$ -237158 -102737 -68847 -79685 -53472 162985 123859 194618 249609 163266 -30951 13897
14085A3897J40875j22024q0752P9841J07583o2635k60411K4240K03662J38860
$$ 13897 154772 32748 -48004 31837 139420 76785 -183626 -159386 44276 183136
14075A83136j04297L0515j271j91884o2291O1702J8901m9355O2013J03587N4443
$$ 183136 78839 109354 108083 -83801 -146092 -84390 -65489 -114844 -52831 50756 105199
14064A05199p9609J23034n275j19126J6260r7784j97959N3007l5863J67921K32990
$$ 105199 25590 148624 143349 24223 40483 -57301 -255260 -202253 -238116 -70195 162795
14053A62795P3368R239k2329p1932j55084p505p3300P3202R3138K4960k6964j91749
$$ 162795 236163 245402 223073 151141 -3943 -11448 -84748 -11546 81592 106552 79588 -112161
14041a12161j69102p7242j41216p5550J85157K08716j34086J9995J45742N8161
$$ -112161 -281263 -358505 -499721 -575271 -390114 -181398 -315484 -295489 -149747 -91586
14031i1586m8962J9929J11034j4067j30255N093p163n517R6699J2256q4347k06420
$$ -91586 -140548 -120619 -9585 -23652 -153907 -148814 -155977 -161494 -64795 -52539 -136886 -343306
14019c43306J51924K62167J09950R2339r6863J9703j98643k2382j17781r274N0970
$$ -343306 -191382 70785 180735 273074 176211 195914 -2729 -25111 -142892 -152166 -101196
14008a01196m0008k24337K83025L08260L6298j22014K03860O779l29025j12775
$$ -101196 -141204 -365541 -82516 225744 262042 140028 343888 350667 21642 -91133
13998i1133M4137Q6104K5507q1362j0964l4230R1926l7172J19111l4086j3002
$$ -91133 -46996 39108 64615 -16747 -27711 -61941 29985 -7187 111924 77838 64836
13987F4836j76614j99100j05876J11477R4343o6297N3128m2820J30943J43385
$$ 64836 -111778 -310878 -416754 -305277 -210934 -277231 -224103 -266923 -135980 7405
13977G405J21489l5068J0636n5280K4823r4334l2831M8638k4792N166J12046K055
$$ 7405 128894 93826 104462 49182 74005 -20329 -53160 -4522 -29314 -24148 87898 89953
13965H9953j05429j62255j41351q5960j67694Q7100J44831J71007M9536j03276
$$ 89953 -15476 -177731 -319082 -405042 -572736 -485636 -340805 -169798 -120262 -223538
13955b23538k8229k1136J49916R3285Q703n6687k8399Q1701j25169J27590l9110
$$ -223538 -251767 -272903 -122987 -29702 -20999 -77686 -106085 -24384 -149553 -21963 -61073
13944f1073J09401N1175j6881j68251R6560P9161l6506Q5026k0885j31234K0463
$$ -61073 48328 99503 82622 -85629 10931 90092 53586 138612 117727 -13507 6956
13933F956K87774l1462r0318N7210r3238j63763l0714J01591L4575k1313k95205
$$ 6956 294730 263268 172950 230160 136922 -26841 -57555 44036 78611 57298 -237907
13922b37907p3977K24979o749O8592n3994M11185K838j39530o4370j1447o6992
$$ -237907 -311884 -86905 -93654 -25062 -79056 332129 334967 195437 131067 119620 52628
13911E2628l9279k9924j60152k7186J77039l1448m3270j12777j311o2090o3003
$$ 52628 13349 -16575 -176727 -203913 -26874 -58322 -101592 -214369 -215680 -277770 -340773
13900c40773m9531K03114M420l1051K56659M9717k6092Q4420j47174j6915M6827
$$ -340773 -390304 -187190 -182770 -213821 42838 92555 66463 150883 3709 -13206 33621
13889C3621K858M6900J7902n9195m2355R0075J77108J84069k21289j57990j27770
$$ 33621 36479 83379 101281 42086 -269 89806 266914 450983 229694 71704 -56066
13878e6066m12314k63981K11096J92962L2005J62391o8622j17403j60719j59420
$$ -56066 -468380 -732361 -521265 -328303 -296298 -133907 -202529 -319932 -480651 -640071
13868f40071J05210Q0562J40122J66253L3351j96322j39501m9181M2815J07553
$$ -640071 -534861 -454299 -314177 -147924 -114573 -310895 -450396 -499577 -456762 -349209
13858c49209l6507J30212J94932k718j63363K2738K8936L7025o9392n7629J06864
$$ -349209 -385716 -255504 -60572 -63290 -226653 -203915 -174979 -137954 -207346 -264975 -158111
13847a58111K28650M3651j09969p9111n3768l7533J10897J16029Q968k01729l7826
$$ -158111 70539 114190 4221 -74890 -128658 -166191 -55294 60735 69703 -132026 -169852
13836a69852M2576K80256P350j03924J17256j18749j05485j42006j63755O0863
$$ -169852 -127276 152980 160330 56406 173662 54913 -50572 -192578 -356333 -295470
13826b95470j48956j39164j37790K29177J90996l7553M0669J16733Q4197m9958
$$ -295470 -444426 -583590 -721380 -492203 -301207 -338760 -298091 -181358 -97161 -147119
13816a47119j38809K92485P9386j24585n5938N0469J05281j8394j26938n1701
$$ -147119 -285928 6557 85943 -38642 -94580 -44111 61170 42776 -84162 -135863
13806a35863O1816J40593m0800p4813j07585m3282Q3406l1644k96059j6375k9459
$$ -135863 -74047 66546 25746 -49067 -156652 -199934 -116528 -148172 -444231 -460606 -490065
13795d90065k4036J85898N8836m505R9692J60017L87600j45304k47967P6780R0523
$$ -490065 -514101 -328203 -269367 -273872 -174180 -14163 373437 228133 -19834 56946 147469
13784A47469j3045J2553M3772J28029j466l3994j83852j41555k3833l2013J23266
$$ 147469 134424 146977 190749 318778 317312 283318 99466 -42089 -65922 -97935 25331
13773B5331K36569p9919n1652j2008j06346m7981k5475j06602k4583L9000O7946
$$ 25331 261900 181981 130329 118321 11975 -36006 -61481 -168083 -192666 -153666 -85720
13762h5720J16152J02478p2709m6391L3146j41199j15399k2633P3808L8892l224
$$ -85720 30432 132910 60201 13810 46956 -94243 -209642 -232275 -158467 -119575 -122799
13751a22799j13773k7946J19148K91812j23655j83176K6820l6934l7051J15163
$$ -122799 -236572 -264518 -145370 146442 22787 -160389 -133569 -170503 -207554 -92391
13741i2391J55587j06694J66347J50300K8341k91084j52125K5313j6066j04868
$$ -92391 63196 -43498 122849 273149 301490 10406 -141719 -116406 -132472 -237340
13731b37340j65323m3954K11384J0454j00638K6387k2109q480R5910k7938R3712
$$ -237340 -402663 -446617 -235233 -224779 -325417 -299030 -321139 -329619 -233709 -261647 -167935
13720a67935K8199j3729j36947l0546J58040K45152p1080j7989Q0401o2340n9055
$$ -167935 -139736 -153465 -290412 -320958 -162918 82234 11154 -6835 73566 11226 -47829
13709d7829K82130O9305j81440j61281L6073N3505J69830J1483N6877l2268k37427
$$ -47829 234301 303606 122166 -39115 -3042 50463 220293 231776 288653 256385 18958
13698A8958l4984j4058R2242r7376r8518J77679m8275N4564o3502q6796l107l5671
$$ 18958 -16026 -30084 62158 -35218 -133736 43943 -4332 50232 -13270 -100066 -103173 -138844
13686a38844N4347J38120j66283m9054l6738P9395q1990l0415J33046J0801J19652
$$ -138844 -84497 53623 -112660 -161714 -198452 -119057 -201047 -231462 -98416 -87615 32037
13675C2037J65467l3964j59594j4608q9649l90473j23711j06790N2503k4377L17078
$$ 32037 197504 163540 3946 -10662 -100311 -490784 -614495 -721285 -668782 -693159 -376081
13664c76081M47571N1452j248k8563n1911r6812k1136Q8504p5038j91149n3387
$$ -376081 71490 122942 121694 93131 41220 -55592 -76728 11776 -63262 -254411 -307798
13653c07798r3033L4620M3900P9268j75016N4217R0006J38390Q8740q7101j73229
$$ -307798 -400831 -366211 -322311 -243043 -418059 -363842 -273836 -135446 -46706 -133807 -307036
13642c07036m9655J36678J03361r731J06332Q497Q9288l430j64171L4512N1269
$$ -307036 -356691 -220013 -116652 -126383 -20051 -11554 77734 74304 -89867 -55355 -4086
13631d086J68756M3382k46603P785M1130K9784J60841J42827K8112l64906k15312
$$ -4086 164670 208052 -38551 -30766 10364 40148 200989 343816 371928 7022 -208290
13620b08290N3560J97132K2847j41107L458K06117j30648n7919p2817j50821n5818
$$ -208290 -154730 42402 65249 -75858 -72400 133717 3069 -54850 -127667 -278488 -334306
13609c34306o2929P4541M6360J39952J13363k9950o683o1525J64628n7675j44248
$$ -334306 -397235 -322694 -276334 -136382 -23019 -52969 -59652 -121177 43451 -14224 -158472
13598a58472J0233j63425q7920j06917K8318K52317J16677P5877j0463j8614j2119
$$ -158472 -148239 -311664 -399584 -506501 -478183 -225866 -109189 -33312 -43775 -62389 -74508
13587g4508j47373j67095N3890K56781l7588K12825J00124J21760k9283j72753
$$ -74508 -221881 -388976 -335086 -78305 -115893 96932 197056 318816 289533 116780
13577A16780j22803j77853j23414J81180Q7049r8169j61400M3306K18040M4651
$$ 116780 -6023 -183876 -307290 -126110 -39061 -137230 -298630 -255324 -37284 7367
13567G367J50582j6522p8368j38307j09227P8464L4765L5343J2292k30027j37810
$$ 7367 157949 141427 63059 -75248 -184475 -106011 -71246 -35903 -23611 -253638 -391448
13556c91448J08727M5503N9995K51275K26273q3586j82294k34571j8318J58154
$$ -391448 -282721 -237218 -177223 74052 300325 216739 34445 -200126 -218444 -60290
13546f0290Q2158J38776k7873k24181Q5271m4797P9632Q8207J20280l0913j20929
$$ -60290 21868 160644 132771 -91410 -6139 -50936 28696 116903 237183 206270 85341
13535H5341j78688R6319l7282J04634O3520J11017j06497p4413l8551k6212j34058
$$ 85341 -93347 2972 -34310 70324 133844 244861 138364 63951 25400 -812 -134870
13524a34870q6549l8813Q5568n7548J06099Q812m0530J28607N3281J19674j20797
$$ -134870 -221419 -260232 -174664 -232212 -126113 -117301 -157831 -29224 24057 143731 22934
13513B2934n2269j22323j60173q2003L1879K69592N2270k3292M9028Q8259J11271
$$ 22934 -29335 -151658 -311831 -393834 -361955 -92363 -40093 -63385 -14357 73902 185173
13502A85173j37597p782J47811j18834r7257M2020N8269k4967o7422K4206j7505
$$ 185173 47576 39794 187605 68771 -28486 13534 71803 46836 -20586 3620 -13885
13491a3885l14000R296J10341J34339J84974j26349k99922N845L58783J87413
$$ -13885 -327885 -318589 -208248 -73909 111065 -15284 -315206 -309361 49422 236835
13481B36835n7867j62206j50928j7858L0621J61594j08147J45980R9881j56528
$$ 236835 178968 16762 -134166 -152024 -121403 40191 -67956 78024 177905 21377
13471B1377p1435j62430J31667J77209j08976j17154N5681K27969O9097q2197
$$ 21377 -50058 -212488 -80821 96388 -12588 -129742 -74061 153908 223005 140808
13461A40808j56846J48695o1940n5808j55Q364n5076r4381K45941Q428j41203
$$ 140808 -16038 132657 70717 14909 14754 23118 -31958 -126339 119602 128030 -13173
13450a3173J31963J49634J97154N9158k61883j69825o0576j9411j78666J20603
$$ -13173 118790 268424 465578 524736 262853 93028 32452 13041 -165625 -45022
13440d5022L2229n463J84325L7797K1689r9104r0236k24228p6207j39148m0955
$$ -45022 -12793 -18256 166069 203866 225555 126451 36215 -188013 -264220 -403368 -444323
13429d44323M0741J53252J19033K18670K29294j49290k06830L3701J92035o4960
$$ -444323 -403582 -250330 -131297 87373 316667 167377 -39453 -5752 186283 121323
13419A21323j79258j22670R851N7140R599j35450J5666K50791J22027j39460k65646
$$ 121323 -57935 -180605 -170754 -113614 -104015 -239465 -223799 26992 149019 9559 -256087
13408b56087n8129J56060K89643j5336l089o343q6901K0744O594q8553n0718K3767
$$ -256087 -314216 -158156 131487 116151 113062 106719 19818 40562 47156 -41397 -92115 -68348
13396f8348J19929m6024p3226r8463J61054K12967R2895j2293j63857j13933P0977
$$ -68348 51581 5557 -67669 -166132 -5078 207889 300784 288491 124634 10701 81678
13385H1678j31170l4516P7442J9848N3818l7674j55622n5542J16266P534O5320
$$ 81678 -49492 -84008 -6566 13282 67100 29426 -126196 -181738 -65472 -57938 7382
13374G382J29679m2084q7869l3173Q1719M077j29777p4467J14196N7305N5006
$$ 7382 137061 94977 7108 -26065 55654 59731 -70046 -144513 -30317 26988 81994
13363H1994N5609L0616o8650l1548j1676m882n4375j03748J09273K5746m9910
$$ 81994 137603 168219 99569 68021 56345 51463 -2912 -106660 2613 28359 -21551
13352b1551M3471L4007P1676o1217j33448J2360j8396r7682r9727J85513L1483
$$ -21551 21920 55927 127603 66386 -67062 -54702 -73098 -170780 -270507 -84994 -53511
13341e3511M1197n8974k6928J56892N9166k1091j34967j9607j6932j1290n3057
$$ -53511 -12314 -71288 -98216 58676 117842 96751 -38216 -57823 -74755 -86045 -139102
13330a39102L3337J95312K35520k48151j02769J32066l4866j96952J2187L8271
$$ -139102 -105765 89547 325067 76916 -25853 106213 71347 -125605 -113418 -75147
13320g5147j3329n7036L5079n265k8683j12357Q695J34919p8901J08847k3115
$$ -75147 -88476 -145512 -110433 -115698 -144381 -256738 -248043 -113124 -192025 -83178 -106293
13309a06293k4139Q211l0694J85979J43108j02097r2529J24270k8845n3102p5005
$$ -106293 -130432 -122221 -152915 33064 176172 74075 -18454 105816 76971 23869 -51136
13298e1136j34270J60477R5850Q704o7362J4708J22286j9709j9476j69074j99408
$$ -51136 -185406 -24929 70921 79625 12263 26971 149257 129548 110072 -59002 -258410
13287b58410Q7265L723j30515j66413n1664L16991J05831p7465J48556M1124L7625
$$ -258410 -171145 -167422 -297937 -464350 -516014 -199023 -93192 -170657 -22101 19023 56648
13276E6648K24924R9040j37225k21844n0084o9441j10809N7571K96J7679O216
$$ 56648 281572 380612 243387 21543 -28541 -97982 -208791 -151220 -150924 -133245 -127029
13265a27029M093Q8756n7696J03729J43045J22482m4228j81310j24171k1440j38988
$$ -127029 -122936 -34180 -91876 11853 154898 277380 233152 51842 -72329 -93769 -232757
13254b32757N3900K42160K31373j05181j05988j6473o6610m5824k2132j24902
$$ -232757 -178857 63303 294676 189495 83507 67034 424 -45400 -67532 -192434
13244a92434O480j72595O9762Q8120J42397J31335P7223R1593j08652j42381p2762
$$ -192434 -185954 -358549 -288787 -200667 -58270 73065 150288 241881 133229 -9152 -81914
13233h1914N2699P6027n2570k6541R5044o872j50877L6802O0043J3434j57874
$$ -81914 -29215 46812 -5758 -32299 62745 55873 -95004 -58202 1841 15275 -142599
13222a42599j03419M0340K54000j54244N0858j40486m8367j47142P7108L33917
$$ -142599 -246018 -205678 48322 -105922 -55064 -195550 -243917 -391059 -313951 19966
13212A9966M3605j65706J03870K12497K12367P4385o766k11177j29970M8802R4743
$$ 19966 63571 -102135 1735 214232 426599 500984 494218 283041 153071 201873 296616
13201B96616q2998j69449k55245J26677O3100N0813J70984N7367j01549k65421
$$ 296616 213618 44169 -211076 -84399 -21299 29514 200498 257865 156316 -109105
13191a09105J4843J8614p0121L3908J10742j04521k00693l3319l7025J86400O8693
$$ -109105 -94262 -75648 -145769 -111861 -1119 -105640 -306333 -339652 -376677 -190277 -121584
13180a21584J3032o3078l9244J51218K16141K10949L6906k34277n7584P9609J9636
$$ -121584 -108552 -171630 -210874 -59656 156485 367434 404340 170063 112479 192088 211724
13169B11724m346J13451p0218q9658Q9276l1072M971j03452n0588K3142L65580
$$ 211724 207378 320829 250611 160953 250229 219157 224128 120676 70088 93230 458810
13158D58810M8102k31753j65204j67312N154k6318j19269K4950n1602q0701L9313
$$ 458810 506912 275159 109955 -57357 -52203 -78521 -197790 -172840 -224442 -305143 -265830
13147b65830J86707k4162j39972j5030J83152p2957j02462Q9526J02695j74862
$$ -265830 -79123 -103285 -243257 -258287 -75135 -148092 -250554 -161028 -58333 -233195
13137b33195l1589p2810P3931P1841j3285P3054O1734N2370k9003P5335R8844
$$ -233195 -264784 -337594 -263663 -191822 -205107 -132053 -70319 -17949 -46952 28383 127227
13126A27227J21579n5243o3308q9213J52242k9444j17734R8410L7121o8857j17407
$$ 127227 248806 193563 130255 41042 193284 163840 46106 144516 181637 112780 -4627
13115d627j13206Q2368l9472j03734J4851J99851J27133l8965j35643o6662M4462
$$ -4627 -117833 -35465 -74937 -178671 -163820 36031 163164 124199 -11444 -78106 -33644
13104c3644n8640j96263O6718J35056k4938m7423Q7625O1049j1915n4886O12K00287
$$ -33644 -92284 -288547 -221829 -86773 -111711 -159134 -71509 -10460 -22375 -77261 -76649 123638
13092A23638R3912k7411n3998J9072j58211j59228n5299L6849J83584k03983m697
$$ 123638 217550 190139 136141 155213 -2998 -162226 -217525 -180676 2908 -201075 -205772
13081b05772j0682J05150j16396m0248P1342J53108R5193Q1655k50758k47260
$$ -205772 -216454 -111304 -227700 -267948 -196606 -43498 51695 133350 -117408 -364668
13071c64668K1851R2234P5403K31098l8977P8475j55432k59868L930J55461J21621
$$ -364668 -342817 -250583 -175180 55918 16941 95416 -60016 -319884 -315954 -160493 -38872
13060c8872l1993K09427k8672l21770k04804k3062K58781J82867J78819J05623
$$ -38872 -70865 138562 109890 -211880 -416684 -439746 -180965 1902 180721 286344
13050B86344o0116p2551k9921j64054n2002q1004Q2366N1314K9717j20577k932
$$ 286344 226228 153677 123756 -40298 -92300 -173304 -90938 -39624 -9907 -130484 -133416
13039a33416J13087J28854J22371L8977J5135P0215L69k2105j24955P4925p6308
$$ -133416 -20329 108525 230896 269873 285008 355223 355592 333487 208532 283457 207149
13028B07149o1254j03563o9338k0419R2911N4277j36433J5158L6717r6290j21586
$$ 207149 145895 42332 -27006 -47425 45486 99763 -36670 -21512 15205 -81085 -202671
13017b02671P4518J8246n7835j05025m58P3375L5323Q1253J07629l9026N2074
$$ -202671 -128153 -109907 -167742 -272767 -273225 -199850 -164527 -83274 24355 -14671 37403
13006C7403M257M4641K6810j4509j07998n7779r7351m280K19225J64783l0648
$$ 37403 41660 86301 113111 98602 -9396 -67175 -164526 -168806 50419 215202 184554
12995A84554Q4173J663q1341j00701m5112j09349J39952l1306j06791K2472m3827
$$ 184554 268727 270390 189049 88348 43236 -66113 73839 42533 -64258 -41786 -85613
12984h5613q06j70057n6030J30216K3801l031Q8995O6236j5209J9026q9195j87559
$$ -85613 -86419 -256476 -312506 -182290 -158489 -161520 -72525 -6289 -21498 -2472 -91667 -279226
12972b79226R6599J09019m6572k1593K9537m2654q6805l1141j6362N5667q1200
$$ -279226 -182627 -73608 -120180 -141773 -112236 -154890 -241695 -272836 -289198 -233531 -314731
12961c14731q9710J87147K59593P9102M1570j8613k07574N6987R1092N5867k3371
$$ -314731 -404441 -217294 42299 121401 162971 144358 -63216 -6229 84863 140730 117359
12950A17359J34495p6119k6291r2907L5929j32722J2111J22204J96803Q3265k58771
$$ 117359 251854 175735 149444 56537 92466 -40256 -28145 94059 290862 374127 115356
12939A15356n2533K5768J00395q4059j1306p3241J12752M8258k2030j93832o9813
$$ 115356 62823 88591 188986 104927 93621 20380 133132 181390 159360 -34472 -104285
12928a04285J16509j8610j8804J44818M8980n9090O9483J42429r5628l37715j92013
$$ -104285 12224 -6386 -25190 119628 168608 109518 179001 321430 225802 -111913 -303926
12917c03926J2366K2136p0835j09767J8442m6513J80001J86583J75930K9696r5497
$$ -303926 -291560 -269424 -340259 -450026 -431584 -478097 -298096 -111513 64417 94113 -1384
$$ [...]
##END NTUPLES=NMR SPECTRUM
##END=
