##TITLE=Analysis number 316823
Compound Code cc 42308
Book Reference 461/23
Project Code adrs
Chemist Name toml
##JCAMPDX= 6.0         $$ Bruker NMR JCAMP-DX V2.0
##DATA TYPE= NMR SPECTRUM
##DATA CLASS= NTUPLES
##ORIGIN= Bruker BioSpin GmbH
##OWNER= nmr
$$ XWIN-NMR		Version 3.5
$$ Fri Jan 27 09:51:52 2006 GMT Standard Time (UT+0h)  MAYBRIDGE\nmr@NMR_250MHZ
##.OBSERVE FREQUENCY= 250.131544655141
##.OBSERVE NUCLEUS= ^1H
##.ACQUISITION MODE= SIMULTANEOUS (DQD)
##.ACQUISITION SCHEME= undefined
##.AVERAGES= 16
##.DIGITISER RES= 18
##SPECTROMETER/DATA SYSTEM= dpx250
##.PULSE SEQUENCE= zg30
##.SOLVENT NAME= CDCl3
##.SHIFT REFERENCE= (INTERNAL, CDCl3, 0, 16.522)
##AUDIT TRAIL= $$ (NUMBER, WHEN, WHO, WHERE, WHAT)
$$ ##TITLE= Audit trail, XWIN-NMR		Version 3.5
$$ ##JCAMPDX= 5.01
$$ ##ORIGIN= Bruker BioSpin GmbH
$$ ##OWNER= nmr
$$ C:\u/data/dgb/nmr/ADRS/15260/pdata/1/auditp.txt
$$ ##AUDIT TRAIL=  $$ (NUMBER, WHEN, WHO, WHERE, WHAT)
(   1,<2006-01-27 09:51:07.79 +000>,<MAYBRIDGE\nmr>,<NMR_250MHZ>,
      <created by zg, POWCHK disabled, PULCHK disabled
       configuration hash MD5:
       62 19 C7 07 E1 42 D1 B7 37 6C 3D D0 77 39 F9 E6
       data hash MD5: 64K
       C4 9A 58 48 4C 41 E9 3B 8A C5 D5 61 97 6D BF 79>)
(   2,<2006-01-27 09:51:28.68 +000>,<MAYBRIDGE\nmr>,<NMR_250MHZ>,
      <Start of raw data processing
       ef LB = 0.3 FT_mod = 6 PKNL = 1 SI = 32K 
       data hash MD5: 32K
       53 49 E5 DE AB D4 E8 9B 6A 36 56 89 86 44 0F 9A>)
(   3,<2006-01-27 09:51:33.54 +000>,<MAYBRIDGE\nmr>,<NMR_250MHZ>,
      <apk 
       data hash MD5: 32K
       C1 00 0A A2 2D C0 7F FD DC 01 C2 60 E6 1F E3 25>)
(   4,<2006-01-27 09:51:35.37 +000>,<MAYBRIDGE\nmr>,<NMR_250MHZ>,
      <abs ABSG = 5 
       data hash MD5: 32K
       F4 67 C6 14 A7 37 B8 A7 5A E3 A1 33 BA 0B 35 5F>)
$$ ##END=
$$ 
$$ hash MD5
$$ 1E 2B 45 C1 30 18 02 88 64 C7 0B 21 46 B4 CB 8D
##$RELAX= 
##$RELAX= 
##$RELAX= 
##$RELAX= 
##$RELAX= 
##$RELAX= 
##$RELAX= 
$$ Bruker specific parameters
$$ --------------------------
##$DU= <C:\u>
##$EXPNO= 15260
##$NAME= <ADRS>
##$PROCNO= 1
##$TYPE= <nmr>
##$USER= <dgb>
##$AMP= (0..31)
100 100 100 100 100 100 100 100 100 100 100 100 100 100 100 100 100 100 
100 100 100 100 100 100 100 100 100 100 100 100 100 100 
##$AQSEQ= 0
##$AQ_mod= 3
##$AUNM= <au_zg>
##$AUTOPOS= <43 >
##$BF1= 250.13
##$BF2= 250.13
##$BF3= 250.13
##$BF4= 250.13
##$BF5= 500.13
##$BF6= 500.13
##$BF7= 500.13
##$BF8= 500.13
##$BYTORDA= 1
##$CFDGTYP= 0
##$CFRGTYP= 5
##$CHEMSTR= <none>
##$CNST= (0..31)
1 1 145 1 1 1 1 1 1 1 1 1 1 1 1 1 1 1 1 1 1 1 1 1 1 1 1 1 1 1 1 1 
##$CPDPRG= <>
##$CPDPRG1= <>
##$CPDPRG2= <>
##$CPDPRG3= <>
##$CPDPRG4= <mlev>
##$CPDPRG5= <mlev>
##$CPDPRG6= <mlev>
##$CPDPRG7= <mlev>
##$CPDPRG8= <mlev>
##$CPDPRGB= <>
##$CPDPRGT= <>
##$D= (0..31)
0 1 0 0 0 0 0 0 0 0.06 0 0 0 0 0 0 0.0002 0 0 0 0 0 0 0 0 0 0 0 0 0 0 
0 
##$DATE= 1138355459
##$DBL= (0..7)
120 120 120 120 120 120 120 120 
##$DBP= (0..7)
150 150 150 150 150 150 150 150 
##$DBP07= 0
##$DBPNAM0= <>
##$DBPNAM1= <>
$$ [...]
##$SUBNAM7= <"">
##$SUBNAM8= <"">
##$SUBNAM9= <"">
##$SW= 20.6930455092707
##$SWIBOX= (0..15)
0 0 3 0 0 0 0 0 0 0 0 0 0 0 0 0 
##$SW_h= 5175.983436853
##$TD= 65536
##$TD0= 1
##$TE= 294.16
##$TE2= 300
##$TE3= 300
##$TEG= 300
##$TL= (0..7)
0 120 120 120 120 120 120 120 
##$TP= (0..7)
150 150 150 150 150 150 150 150 
##$TP07= 0
##$TPNAME0= <>
##$TPNAME1= <>
##$TPNAME2= <>
##$TPNAME3= <>
##$TPNAME4= <>
##$TPNAME5= <>
##$TPNAME6= <>
##$TPNAME7= <>
##$TPOAL= (0..7)
0.5 0.5 0.5 0.5 0.5 0.5 0.5 0.5 
##$TPOFFS= (0..7)
0 0 0 0 0 0 0 0 
##$TUNHIN= 0
##$TUNHOUT= 0
##$TUNXOUT= 0
##$USERA1= <user>
##$USERA2= <user>
##$USERA3= <user>
##$USERA4= <user>
##$USERA5= <user>
##$V9= 5
##$VALIST= <valist>
##$VCLIST= <CCCCCCCCCCCCCCC>
##$VD= 0
##$VDLIST= <DDDDDDDDDDDDDDD>
##$VPLIST= <PPPPPPPPPPPPPPP>
##$VTLIST= <TTTTTTTTTTTTTTT>
##$WBST= 1024
##$WBSW= 4
##$XGAIN= (0..3)
0 0 0 0 
##$XL= 0
##$YL= 0
##$YMAX_a= 541083
##$YMIN_a= -612470
##$ZGOPTNS= <>
##$ZL1= 120
##$ZL2= 120
##$ZL3= 120
##$ZL4= 120
##$ABSF1= 16.522
##$ABSF2= -4.171173
##$ABSG= 5
##$ABSL= 3
##$ALPHA= 0
##$AQORDER= 0
##$ASSFAC= 0
##$ASSFACI= 0
##$ASSFACX= 0
##$ASSWID= 0
##$AUNMP= <proc_1d>
##$AZFE= 0.1
##$AZFW= 0.1
##$BCFW= 0
##$BC_mod= 0
##$BYTORDP= 0
##$COROFFS= 0
##$CY= 12.5
##$DATMOD= 1
##$DC= 0
##$DFILT= <>
##$DTYPP= 0
##$F1P= 14.0000005364418
##$F2P= -0.99999901652339
##$FCOR= 0.5
##$FTSIZE= 32768
##$FT_mod= 6
##$GAMMA= 0
##$GB= 0
##$INTBC= 1
##$INTSCL= 1
##$ISEN= 128
##$LB= 0.3
##$LEV0= 0
##$LPBIN= 0
##$MAXI= 10000
##$MC2= 0
##$MEAN= 0
##$ME_mod= 0
##$MI= 0
##$NCOEF= 0
##$NC_proc= -3
##$NLEV= 6
##$NOISF1= 0
##$NOISF2= 0
##$NSP= 0
##$NTH_PI= 0
##$NZP= 0
##$OFFSET= 16.522
##$PC= 1
##$PHC0= 249.1434
##$PHC1= 8.436636
##$PH_mod= 1
##$PKNL= yes
##$PPARMOD= 0
##$PSCAL= 4
##$PSIGN= 0
##$REVERSE= no
##$SF= 250.13
##$SI= 32768
##$SIGF1= 0
##$SIGF2= 0
##$SINO= 400
##$SIOLD= 32768
##$SREGLST= <1H.CDCl3>
##$SSB= 0
##$STSI= 32768
##$STSR= 0
##$SW_p= 5175.98343685301
##$SYMM= 0
##$S_DEV= 0
##$TDeff= 65536
##$TDoff= 0
##$TI= <Analysis number 999999
Compound Code 99
Book Reference 9
Project Code 9>
##$TILT= no
##$TM1= 0
##$TM2= 0
##$TOPLEV= 0
##$USERP1= <user>
##$USERP2= <user>
##$USERP3= <user>
##$USERP4= <user>
##$USERP5= <user>
##$WDW= 1
##$XDIM= 32768
##$YMAX_p= 294003123
##$YMIN_p= -162788
$$ End of Bruker specific parameters
$$ ---------------------------------
##NTUPLES= NMR SPECTRUM
##VAR_NAME=  FREQUENCY,     SPECTRUM/REAL,   SPECTRUM/IMAG
##SYMBOL=    X,             R,               I
##VAR_TYPE=  INDEPENDENT,   DEPENDENT,       DEPENDENT
##VAR_FORM=  AFFN,          ASDF,            ASDF
##VAR_DIM=   32768,         32768,           32768
##UNITS=     HZ,            ARBITRARY UNITS, ARBITRARY UNITS
##FACTOR=    0.157963299565203, 1,           1
##FIRST=     4132.6476996994, 0,             0
##LAST=      -1043.33573715361, 0,           0
##MIN=       -1043.33573715361, -162788,     0
##MAX=       4132.6476996994, 294003123,     0
$$ Real data points
##PAGE= N=1
##DATA TABLE= (X++(R..R)), XYDATA
$$ [...]
24316 9218 3141 -11654 1938 4497 -9762 -32300 -35420 -44756 -32048 -2704 -12681 -27160 -35809
24303 -35809 -24428 -25922 -6703 41876 97629 108150 39244 -22821 -27858 -27194 -46649 -12899
24291 -12899 29007 12880 -8299 2588 5013 -6227 -2331 19254 -18506 -33314 -35738 -49505
24279 -49505 -24014 -24678 -55531 -54977 -29045 9687 51594 -18924 -4519 -11646 -44192 5142 23810
24266 23810 -36959 -60344 -39108 -33781 -31178 -70092 -20779 14518 51072 63764 20725 580
24254 580 40332 20120 6502 37854 28356 24009 -13764 -43875 -46553 -40552 -1685 26152 -2844
24241 -2844 -16910 -22962 -26632 -35253 -45043 -4853 42353 54432 24518 42327 20753 -1632 -11197
24228 -11197 -5982 12586 -9329 -50563 -25204 -50202 -44674 3293 3795 37407 85496 82009 101531
24215 101531 70831 48295 23303 -16795 -35014 -21122 -18465 8776 -14323 -24970 -3244 37027
24203 37027 40930 31439 -12159 -57961 -28760 7454 -8729 -5803 5700 5247 3605 -22881 -64449
24190 -64449 -51407 -23307 -42735 -16793 4769 22756 47753 51038 31775 26571 6571 14099
24178 14099 10221 12094 18692 47330 46837 71154 63050 56437 44473 51055 42766 51468 -14632 -68611
24164 -68611 -70337 -55462 -25616 38812 36154 10819 21684 44606 39432 53063 37097 55209
24152 55209 55778 42855 34307 -27303 -37802 -21443 10414 34182 -3413 -7999 -5869 -18656 35681
24139 35681 39657 14657 -30651 -22112 9499 -180 8439 7014 15956 30970 73417 86370 60162
24126 60162 27900 50786 50555 49940 14448 10020 -31171 -26758 -4623 11208 -11494 5576 10638
24113 10638 -2634 22251 29751 -6931 -36112 -11445 12083 25193 27655 6423 248 22192
24101 22192 17054 -12410 15945 53823 -1394 -11968 -3749 9465 45407 88208 88427 43579
24089 43579 23133 35207 48550 66329 56938 799 -67235 -86237 -75267 -28931 15007 -8539
24077 -8539 -53294 -36636 1046 -29224 -57973 -27180 -11482 -10763 -10303 -25517 -41311 -66503 -48241
24064 -48241 -32005 3958 -26657 -48706 -40481 -20367 -68284 -67037 -54171 -60478 9101 89560
24052 89560 89004 7601 6026 21921 -13224 -8919 9426 10060 -7567 33038 53036 41620 6757
24039 6757 13658 2515 -26922 -64871 -85996 -22431 60523 46676 15792 37548 46549 -15368
24027 -15368 -33688 -34777 -13629 -46716 908 27735 3500 -31290 -54729 -30823 -4043 -6751
24015 -6751 15945 27304 -34759 -51781 -60743 -72822 -77052 -57101 -68652 -49856 -50463 -83558 -69264
24002 -69264 -48581 -15403 -13963 -33593 -44560 -69684 -51677 13336 36472 7080 -40541 -33975
23990 -33975 -23244 8652 -22771 -7444 9982 39943 63028 57201 21070 -919 21872 7826
23978 7826 26299 62432 90131 109682 95746 27949 -42744 -69396 -17704 -7436 -20863 68
23966 68 -4610 20027 36696 49632 51341 37661 -7028 -9445 -14447 -28511 -67070 -76977 -47682
23953 -47682 -33975 -15727 -3860 -18780 28145 17078 2450 49912 75843 40408 -30655 -8913
23941 -8913 2040 -17214 -39324 -52688 -31649 -7554 -7982 -4113 -26798 -38364 -31839 -50387 -60413
23928 -60413 -76521 -65231 -26175 -68083 -50117 -10331 -6735 -993 17613 -21006 -56690 -50742
23916 -50742 -41569 -36287 -33880 -40007 -55486 -38733 -25059 -50782 -49769 -53410 -40196 -66371 -73386
23903 -73386 -64973 -76270 -80325 -22849 19060 -17241 -15968 45372 28339 -29122 -31559 -31564 -30319
23890 -30319 -10730 -19475 -15955 -66093 -54649 -6008 24915 61801 65196 22005 4419 20495
23878 20495 60952 66927 24448 1876 41900 60349 54812 54828 8983 -18156 -221 36380 52165
23865 52165 57241 10172 -8920 16167 16681 33030 26083 7523 1943 965 -15197 -8910 -5774
23852 -5774 -19104 -27584 -8333 -22827 -27501 8916 -12177 -27031 -34415 -57355 -41142 -11914
23840 -11914 -40321 -34809 -27897 -26719 -41532 -35379 -32838 -10074 -18637 -9993 -5069 -25736 -43099
23827 -43099 -77261 -30097 -8582 -27772 -50981 -52774 -67656 -60951 -61240 -73674 -51804 -23065
23815 -23065 3956 4922 7063 22634 47002 29731 -10923 -24962 -36204 -10785 682 -8989
23803 -8989 -23480 1319 -559 33144 56364 29713 6973 -39856 -26607 -44662 -25772 14015
23791 14015 -21586 -61297 -41765 -22505 17217 14495 10431 37226 44052 27582 32336 44577
23779 44577 46104 21062 16647 32798 -12793 -27315 -14924 -37289 -67729 -41716 -21910 -16044
23767 -16044 -30569 -64572 -58987 -11600 -31544 -65129 -39454 8269 23333 27143 12721 7594
23755 7594 19403 33997 -21028 -13197 331 -28686 -23572 3540 36168 56477 49809 63885
23743 63885 26045 5529 -6605 -28300 -40394 -19810 -14377 20730 1018 -31950 -13609 29323
23731 29323 38984 40106 33150 65200 90852 57493 -10149 -41910 -37412 8323 7805 -3557 4843
23718 4843 8894 93 6699 56231 67909 36751 36162 70080 84465 75826 47158 11196 43115
23705 43115 59539 58030 92319 100658 80017 38717 3889 -14617 5631 2862 14732 27123
23693 27123 15726 -1557 -42412 -38990 -59717 -54829 -42078 3371 -14944 -15096 11919 19795 12941
23680 12941 -17193 -39726 -10228 8750 25281 -4764 -39947 -82008 -52942 -21739 -12989 -10884
23668 -10884 -35502 -33677 -18496 9298 8227 -3333 -17069 11346 -3786 -47025 -49358 -19533
23656 -19533 -4963 -36050 -25461 -44660 -68451 -62572 -32604 14798 13582 -16999 -18415 34277
23644 34277 36187 23568 14536 -8133 34838 48138 70697 89975 70429 79658 66753 45077
23632 45077 14236 2255 21930 65866 92943 70862 83228 53239 42362 -21612 -47815 -50021
23620 -50021 -53085 4627 7779 4885 -698 -20672 8592 70176 71558 54492 -2771 -26473 20288
23607 20288 67334 48462 45563 7324 -3474 -22536 -2513 34891 24181 3216 21324 37132
23595 37132 15034 1383 -17078 -54963 -73809 -41351 -27715 -4235 -4643 -22219 -31933 -52804
23583 -52804 -35898 -31691 -34209 -12942 33634 33321 15844 -6675 25933 42769 16585 -31136
23571 -31136 -54820 -52048 -26639 -5002 15610 -4549 -2661 -3897 9368 22862 11630 19567
23559 19567 4451 -6987 -39121 -28904 -19130 -45526 -43531 -21937 -21577 -29176 -39985 -38270 -50136
23546 -50136 -72353 -84890 -87776 -79402 -76124 -49873 -14890 49019 52071 43658 -6419 -31308 -47091
23533 -47091 -65672 -29864 15949 43911 51096 69093 57784 24206 43221 65884 29728 11569
23521 11569 -11148 10590 565 -1678 2484 -18120 -45403 -9487 -14829 -14211 -23355 -55052 -101095
23508 -101095 -76345 -30108 -22268 -51005 -75927 -51763 -64883 -49736 -41376 -66071 -63185 -34589
23496 -34589 -1533 28114 34977 65144 71345 73650 92031 89078 61333 28536 31738 23776 -1571
23483 -1571 -3952 -10797 -40143 -7051 1109 -33947 -40064 -17605 -5738 -6901 -7936 9270 33195
23470 33195 71788 76401 14081 -919 -35431 -55387 -86321 -59600 -12070 6503 16550 -12617
23458 -12617 -26885 -26893 -22013 -49756 -113772 -64885 -37806 -80717 -95310 -44892 -19560 -3281 10756
23445 10756 39681 43605 42173 49887 69382 60730 41354 19843 -4616 -7497 -5498 11224 26075
23432 26075 -20589 -41604 -38229 -18679 -87 55346 52783 -17544 -36031 -2697 32090 -32553
23420 -32553 -45258 9882 30634 11295 29010 44673 3814 3927 532 44708 73050 46366
23408 46366 51581 45775 18050 -32855 -28439 -18750 -38716 -37933 -1231 48257 29519 9466 10602
23395 10602 52277 43911 32175 23970 28187 38238 4206 -26111 -33115 -17041 26747 66792
23383 66792 10981 -20208 11044 6078 -36401 2998 16855 16406 42263 67163 45073 -18613
23371 -18613 -27712 -41220 8740 28417 41944 40328 18556 -43271 -53168 -49655 -65625 -77931
23359 -77931 -51510 -73288 -40096 -21251 -21257 -29534 -48219 -66483 -67216 -48137 -33637 -55059 -15820
23346 -15820 30250 30299 52490 32048 29104 -14367 -48730 -21804 -26941 -43319 -41792 -6834 -43812
23333 -43812 -55714 -29120 37554 50138 47836 82425 114784 104442 111318 86313 44716 20512
23321 20512 -7384 -93910 -105887 -49958 14717 33845 21862 25385 17888 21658 3440 -55864
23309 -55864 -90078 -23649 -15180 -53428 -53819 -82472 -97778 -86501 -57784 -9445 24921 10091
23297 10091 -23582 -43951 -17548 24201 13662 20175 26453 4138 20354 33775 20979 38853
23285 38853 64653 25187 -42589 -56464 -28680 -36797 -50271 -14576 -16146 -38519 -27336 4902
23273 4902 19441 1674 -1955 -16525 -57294 -55446 -26806 -15203 26969 41231 14453 -62771
23261 -62771 -26844 28582 29451 -4455 -30016 20690 19066 -10819 -50741 -62517 -5278 34453
23249 34453 47510 42410 17753 55529 64797 28692 -24234 -38080 -45835 -42924 -79709 -79756 -51035
23236 -51035 -74678 -70219 -17119 -30816 -65597 -105274 -99595 -59539 -38450 -1506 6168 12852
23224 12852 39733 39881 -10069 -21480 -55268 -72536 1158 34516 59594 46227 14956 9449
23212 9449 2160 15196 21558 49185 3990 -27157 -1782 -18794 -24845 -54488 -52525 9415 37125
23199 37125 6810 31906 43030 34971 20225 -24857 -18695 -45715 -35979 -62317 -42834 -31094
23187 -31094 -13236 317 17554 60216 42365 46338 44546 41808 11187 5914 -10153 -34083
23175 -34083 -32931 -2080 37311 83715 102180 61326 29918 7139 22128 18863 8691 -15028
23163 -15028 -16202 11466 21443 26225 13904 -35975 -21437 -7978 7059 -5641 32656 93520
23151 93520 72615 58440 71708 107355 92657 49727 3851 6208 50626 42977 28775 46294
23139 46294 58729 -3365 -11647 -19041 -15628 83 16916 -6143 -27818 -27938 -46278 -67879 -42909
23126 -42909 -5690 -19754 -37361 -73657 -94015 -84943 -53477 -33737 -48582 -22729 -23432 -8240
23114 -8240 -14874 -52802 -57960 -13104 -4217 -37451 -23662 26572 39384 32262 6012 10216 -28586
23101 -28586 -27411 -36794 -81916 -56166 -34367 -8904 -14831 -31417 -29865 -27206 1056 -5212 -26484
23088 -26484 -15389 -31917 -37088 -50406 -54898 -19843 42163 -7116 -58772 -59960 -68686 -62917 -19568
23075 -19568 28781 53287 35869 16512 42134 64888 42816 20946 8608 6986 -28062 -58505
23063 -58505 -44218 -44829 -41233 -32203 -42348 -13292 928 -26840 -43680 -15068 -11615 -14963 -47809
23050 -47809 -32756 -27920 -65996 -115158 -114653 -120948 -37674 -25151 -12480 -21307 -20889 -8479 -18715
23037 -18715 -7557 -22436 -46334 -25941 12628 -10166 -38045 -39643 5297 552 8957 -42807
23025 -42807 -74598 -26598 28542 43349 18611 32286 17611 11869 9646 13100 7480 -4604
23013 -4604 40621 68861 37613 27178 5423 -63060 -65677 -92543 -77804 -55097 -33877 -34219
23001 -34219 -19275 -22896 -48297 -53246 -39866 -59075 -63456 -12017 34058 76890 47641 -8044
22989 -8044 2005 15903 13154 54278 82623 59283 60926 13715 -35065 -16454 -12552 -21411 18752
22976 18752 48693 74442 78166 50412 4648 -34510 -31814 13965 38324 -14149 -42539 -54591
22964 -54591 -43869 -40815 -17587 -19455 -22626 -11339 -22679 -2309 26820 38802 28852 -11869
22952 -11869 -30416 -25223 -45768 -54316 -41646 -39934 -22938 -9846 26373 45091 34789 -12656
22940 -12656 -20287 -32625 -48812 -32206 -22252 -34348 -20517 -39928 -70001 -61479 -54496 -33961
22928 -33961 -2118 30433 -2358 -37012 -41822 -61371 -51684 -43394 -33544 15575 11707 -31329 -6533
22915 -6533 -534 -14568 -3566 19241 31427 33198 49218 9571 -29466 -59075 -83634 -87240
22903 -87240 -33411 26627 60902 52330 32656 31379 12922 1559 50801 24994 31245 26487
22891 26487 11082 -10052 4891 -1135 -36056 -60269 -39799 -32236 -33150 -56044 -70950 -48259
22879 -48259 -28909 -24452 -12830 -32100 -45024 -68040 -23680 20853 -5516 -45348 -49733 -8313
22867 -8313 8946 19194 9296 25887 -21995 -37316 -3757 -10274 -19479 -12515 -26211 -39279 -36164
22854 -36164 896 12798 29487 6898 -11408 -17779 -56064 -32562 9490 19170 18107 28403
22842 28403 20129 -5688 12319 38243 51893 35183 35133 38945 3507 -29739 -29468 20519 77621
22829 77621 39728 2652 17241 -4528 11460 4495 -13882 -12198 27776 73453 62340 22262
22817 22262 -50218 -71618 -36152 -17496 -22464 -19354 -955 11423 -4388 -14516 -36867 -37865
22805 -37865 5148 21366 -13952 -57745 -69348 -58526 -72413 -69523 -63989 -47499 -22376 -33425
22793 -33425 -4434 27222 -31180 -65115 -31138 -43676 -35371 17184 7467 12822 4337 -51597
22781 -51597 -89390 -78074 -52454 -39139 -5579 9543 40655 66152 62824 19706 6416 46222
22769 46222 47072 2420 -8743 14888 -9852 7634 28754 32140 30011 -885 -46627 -55475 -76258
22756 -76258 -89349 -56339 -32824 17284 67173 52700 23371 2997 8056 22049 35982 35083
22744 35083 -11787 -24894 5393 14830 -10126 -18090 24397 42316 53220 21343 -9316 -25765
22732 -25765 -64403 -38442 1105 -32851 -40057 -27705 10936 27646 11211 53708 28646 -7928
22720 -7928 -8983 -2024 17348 -1842 -41145 -76066 -59519 -11983 -23813 -8313 22297 37829
22708 37829 30420 13818 43294 37386 19974 -27904 -24347 -36993 -43460 -91086 -101528 -95671 -110035
22695 -110035 -84639 -76294 -59707 -7826 12558 -22123 -41401 -83504 -66940 -30852 -43611 -19648
22683 -19648 -3509 -5823 -44119 2873 -8551 -7531 2780 -21292 -26079 15332 60091 26272
22671 26272 36865 37194 -22518 -19606 -1199 28690 22272 11592 -2668 -29084 -6014 9310
22659 9310 16024 -3329 -44058 -51708 -37260 -23770 -5813 -24337 -27982 -12806 -3047 -14729 13224
22646 13224 41217 -3253 -25198 -69838 -80543 -55319 -36354 -13386 -6463 -36306 -28877 4434
22634 4434 28757 18431 3302 -241 9600 33373 37677 37301 -10075 -36042 -21648 -55610 -80148
22621 -80148 -61836 -61390 -40764 -7141 3155 -35921 -35711 -3397 1940 42199 -2624 1799 14932
22608 14932 -4733 -6269 -31155 -42302 -61316 -44927 -16099 -13677 -50501 -37292 4142 23784
22596 23784 40619 48520 2622 -28066 -49534 -6159 23376 -22993 -30841 10975 -20651 -13803
22584 -13803 10838 37096 45447 63855 67848 36954 10780 21860 13758 7430 707 51098 62184
22571 62184 21955 38041 29283 35976 52761 25482 20894 -2846 -39784 4031 35673 30693
22559 30693 35071 50614 37947 24941 28737 40367 21405 6924 48920 64602 53351 41276
22547 41276 46949 60718 73179 93637 75195 70616 61402 51078 38530 -17350 -56705 -87097
22535 -87097 -65468 -38517 -53261 -51895 -49721 -3248 23361 -1220 -22743 -21817 -21144 -18566 -6160
22522 -6160 -17486 1208 19017 14078 -3910 -46517 -79030 -54604 -36467 18392 35801 42130
22510 42130 37068 34265 22545 5564 9861 8908 -26180 -78589 -54978 -24032 -28123 -24737 -12157
22497 -12157 -41529 -15234 -19717 -13159 -6609 -8130 -43309 -55259 -45151 -44605 -31156 372 8739
22484 8739 36896 58951 17287 -16000 -37027 -15943 -21679 -66417 -87186 -83863 -80334 -76717 -76164
22471 -76164 -49937 -41701 -25213 -5817 -20223 -35286 -16256 -4066 28388 75873 80652 34271
22459 34271 48491 45712 22041 5651 -14440 -39582 -7762 -4136 -13017 26091 73712 105615
22447 105615 117343 68052 13698 -17220 -53288 -44922 -57461 -49284 8621 2373 -38835 -54839
22435 -54839 -31380 -2348 43844 47087 8770 -16821 -35932 5266 -12129 -4734 -2168 -17402
22423 -17402 -67733 -38335 21825 23928 14859 -1115 -16579 -28015 -44269 -77502 -35140 -16140
22411 -16140 -33621 -85437 -64631 -36274 -12711 -39639 -35795 -50410 -81956 -61712 -48383 -19445
22399 -19445 -21627 -5993 -11164 -374 12380 -929 21263 32594 39519 11304 -13117 -30646
22387 -30646 -65314 -40583 -26476 -38885 -42912 -58499 -84277 -119478 -72755 -25518 -15996 -14627
22375 -14627 -33985 -13845 -39694 -68132 -83997 -61749 -53721 -43303 470 20241 26526 -22619
22363 -22619 -34532 13894 3447 1801 15765 -38589 -71018 -18113 -7298 -16655 -27562 -38180
22351 -38180 23005 5679 -11852 -36976 8676 12174 22065 8976 20773 13736 45711 77607
22339 77607 90926 68884 65609 69405 21936 25180 20344 24337 -25280 -23814 8848 57518 23621
22326 23621 -9019 -21540 17845 48335 40021 48539 81192 64314 65448 76948 59981 -30793
22314 -30793 -72722 -22921 16043 81932 74492 -8856 -32075 -84235 -62261 -26021 -18745 13058
22302 13058 5818 17085 -57093 -69375 -39978 -14492 -9172 56689 75454 53406 31749 54091
22290 54091 38750 -6854 -23628 -29015 -24585 -22432 -2036 14244 34738 20537 18390 -12778
22278 -12778 -78651 -31721 -15319 -34570 -5766 -39791 -39444 -33238 -28756 -35077 -3323 14212 -6597
22265 -6597 -35142 -75515 -58736 -26792 7530 -3144 11694 16072 30947 17947 -16548 -46311
22253 -46311 -16660 -1380 -2619 5749 21882 -6545 -48558 -74219 -68169 -24798 17120 -8425
22241 -8425 -3471 60916 90460 57825 34669 18995 -8151 20605 10159 34293 -17305 -63778
22229 -63778 -53991 -77962 -127201 -131107 -118260 -91410 -56700 -2566 14226 12500 -27584 -35673
22217 -35673 -30360 -91742 -71938 -45941 15174 49607 59612 76927 74318 97653 110175 106590
22205 106590 87963 73319 69347 27126 -23566 -28429 -26989 -20011 -15135 -33391 -63057 -77279
22193 -77279 -64570 -20384 -16886 -3660 47742 17314 1305 -125 -58370 -78283 -75860 -46821
22181 -46821 -11580 -12440 -25721 -51311 -36525 2708 6778 -30991 -28859 -17874 -65569 -48393
22169 -48393 -54833 -35361 7568 2592 -11046 -50479 -45004 -14595 11264 -29126 -47829 -10094
22157 -10094 15751 34966 -1379 -38941 -13697 26721 6896 13802 2261 -22893 -34597 -19245
22145 -19245 17334 40987 45758 47998 54405 46892 18580 -13179 -27371 6921 32905 40545 9176
22132 9176 -17168 -11780 -39364 -45661 -44002 -24613 -8372 -47584 -45095 -50479 -51177 -59632 -13713
22119 -13713 -23896 -31034 16006 26508 3674 17593 37683 24321 -28831 -49600 -62316 -69495
22107 -69495 -63475 -69639 -30455 -43533 -82219 -69708 -5842 17314 58857 36823 45087 82037
22095 82037 96713 40440 1653 8423 43768 17874 18530 64130 80158 97541 78230 35546
22083 35546 6453 -5644 -29416 -57383 -30327 11091 16789 -38165 -48475 -64181 -57410 -23800
22071 -23800 4940 13146 12506 6994 45212 60576 34051 38787 33691 15863 -19584 -7873 10861
22058 10861 36664 21406 -14468 -45864 -56858 -111359 -102561 -45899 -24888 1718 8175 45684
22046 45684 75083 50573 38832 50967 35756 29133 33023 52288 25907 -69 -12611 -1720
22034 -1720 9501 267 19035 42554 30118 -23770 -33036 -701 5689 -24555 -19333 -20483 9987
22021 9987 -1247 22815 18307 -20437 -28196 26390 52471 19032 73112 77875 23084 21019 34469
22008 34469 -5402 -41096 -45870 -62918 -42093 -61346 -82911 -91146 -64258 14587 9463 15059
21996 15059 -16084 -28872 -27294 38116 81109 20526 -18296 -44398 -45288 -15858 -2334 -19279
21984 -19279 -50417 -12516 64934 44478 85918 68799 4447 2510 -8460 -59615 -89033 -57504
21972 -57504 -13817 -22552 -18480 -13367 -38733 -57939 -68972 -49012 -21453 -1187 28564 26632
21960 26632 16011 14023 860 -21369 -31196 -16320 -59127 -71686 -62282 -34245 -9320 34417
21948 34417 69418 42307 -32663 -76551 -48539 -50395 -49218 -23518 -12707 -8281 -29182 -32020
21936 -32020 -47239 -56685 -27898 -10551 -45068 -69391 -69533 -87294 -56857 -14115 2169 -2139
21924 -2139 17807 45471 53697 54619 51352 37516 37957 26960 76537 30427 -45779 -23251 27772
21911 27772 60223 82812 74092 73954 81640 34086 -32043 -53555 -86626 -98458 -112454 -90863
21899 -90863 -102020 -74431 -34703 -23964 -54998 -24203 4516 -10236 -18765 44584 69119 93145
21887 93145 89219 69232 48100 9847 35377 73508 28102 -28501 -46837 -17111 -56153 -81123
21875 -81123 -54080 9537 55754 46253 46290 32454 35133 -8921 -32651 -71035 -21628 25562 34317
21862 34317 13682 -21975 -16189 8846 6160 1465 34590 64584 71073 13776 10065 2121 9654
21849 9654 1962 -47015 -59588 -93520 -78283 -21289 -34410 -9855 15467 2046 39654 48806
21837 48806 23602 -28009 -51993 -15296 3714 12282 24968 37949 28550 36019 26499 -31701
21825 -31701 -42974 -25647 2537 -36450 -64504 -19678 -13934 -42419 -29426 -92443 -86599 -65660
21813 -65660 -48085 -36809 -26773 -15414 6704 11834 19935 27775 44930 26278 34870 37824 25079
21800 25079 2925 7656 21287 -2503 -32033 -14552 17532 14511 20136 8735 10726 20262 13705
21787 13705 27692 21362 46396 36478 16725 8972 25752 58816 22900 28629 18203 19413 14101
21774 14101 -45003 -86305 -72489 -38708 -13378 35847 85035 68203 70660 57254 30572 16080
21762 16080 -276 336 12152 -38304 -72499 -9996 37723 62464 64434 14855 -56282 -99432
21750 -99432 -93735 -98904 -81689 -55300 -29488 -21441 3535 10165 17989 36310 31149 14997 6948
21737 6948 31545 -26206 -29028 -30570 -26772 25197 63299 72584 108489 82145 30406 38470 65561
21724 65561 50609 1741 -1584 7326 -21913 -37505 -54745 -38224 -3532 33411 38292 -10602
21712 -10602 19476 57269 40156 26422 29563 22043 20007 29177 -15710 -6960 12337 -16473 -31035
21699 -31035 27992 10055 -30079 -26494 6830 16671 21218 49527 43497 64203 110320 71923
21687 71923 21447 7062 51567 80093 81616 77570 32904 -25662 -41792 528 19794 13893
21675 13893 25590 48478 32682 19027 -5149 -27232 10905 26880 37131 24954 -22195 8929
21663 8929 52587 44374 28589 43136 55506 27390 -21996 -26533 -23045 -10845 28254 53514
21651 53514 32687 46795 18291 51318 83763 37883 72354 82638 53938 3833 -28517 -14953
21639 -14953 -1259 -18979 -40923 -46302 -85695 -78529 -79128 -24369 -10762 12509 11099 16122 8113
21626 8113 1888 33715 47879 51411 32243 -29912 -91677 -67663 -3217 10805 -13289 -44752
21614 -44752 -54692 -94053 -84354 -34045 19000 13613 -807 11430 20931 24925 11590 -45450 -54080
21601 -54080 -33902 -7127 -5428 11963 8736 -14384 -2123 -10040 -45540 -40669 -32652 11905 39973
21588 39973 57910 56966 9745 -32362 -68265 -88636 -18318 31881 38973 9065 2614 21816
21576 21816 -10110 2125 62032 43206 73866 81092 11565 1508 -30952 -37033 -19107 -17294
21564 -17294 -4150 -27077 -29449 -22417 -52605 -61468 -58816 -39086 -23319 6166 1738 13294 29289
21551 29289 56717 44750 73736 69857 45863 24286 36473 39744 27541 11094 -37163 -18066
21539 -18066 -12967 -47888 -64372 -52632 -12174 10339 -9007 -39798 -60016 -35136 -35546 -36760
21527 -36760 -46126 -58778 -87533 -62570 -32043 -27847 -1226 -59797 -109842 -98439 -51904 -30109
21515 -30109 -34706 -9786 18931 55079 55287 -763 -58220 -84468 -81898 -10275 3725 42843
21503 42843 58299 4053 7641 6211 -6631 -16609 -4965 -33199 -66237 -57541 -50214 -40237 -7028
21490 -7028 29171 39799 -17166 -56954 -17091 -9345 -2521 33637 16005 13324 17181 37742 59553
21477 59553 60166 45480 74393 28257 -46549 -40108 -53121 -607 2407 11415 13974 7072 -27870
21464 -27870 -58022 -69327 -24400 -7636 -14006 6689 15724 12861 33390 47162 24596 -2815
21452 -2815 -34679 -46080 -53486 -37681 -31054 -26070 -3325 15392 -13462 -72249 -102491 -67706
21440 -67706 -89744 -50102 -63790 -61043 -22005 -15770 -38824 -33490 -32575 -56414 -65086 -72379 -82904
21427 -82904 -19566 35234 2067 -503 1394 4812 -1790 -7959 9703 -19496 -48225 -39416 -27802
21414 -27802 -35036 -17344 -4389 -6279 -11851 9597 8877 43447 49995 50437 60123 68447 27952 19659
21400 19659 17169 33773 27675 53338 62117 21303 -43994 -6847 5045 26023 30152 8199
21388 8199 14570 32364 24560 -247 14888 11176 5570 -16648 -21588 -46480 -33623 -23249 -10533
21375 -10533 -27705 -32236 -29891 -32483 -24536 -45505 -25109 4630 8780 -529 16131 24255 29857
21362 29857 24536 1888 -11219 7093 20133 -6650 521 -6517 -14103 -50339 -33827 -37587 -23582
21349 -23582 -13861 -633 6930 21861 30186 -10759 -19639 12066 27954 4665 -37638 -57306
21337 -57306 -27171 56059 93903 47031 3757 -31681 -56831 -73323 -69048 -28381 -64414 -78527
21325 -78527 -111177 -111848 -94663 -35530 3574 22092 37992 16307 -22641 -33727 -57442 -51179
21313 -51179 -49273 -40003 -14474 -11420 33231 50336 63544 16656 -9995 -9613 13227 36819 62521
21300 62521 47320 7642 -30317 -46816 -31163 -10315 -40016 -70125 -36613 -14429 3829 -4404
21288 -4404 -22468 -19096 17874 28889 25049 17498 -32000 -29889 398 69131 100857 44070 433
21275 433 19373 -5611 -42777 -49980 21552 69939 58533 41994 64702 82349 46117 35351
21263 35351 18446 -35959 -21974 45757 51454 20782 3050 8811 12855 -10581 -30706 -57071
21251 -57071 4934 -7455 -34757 -24050 -6550 -35900 -24879 24449 26980 40961 15271 -13839
21239 -13839 -39144 -64526 -33115 9362 28346 54679 68766 91680 104101 24293 -5203 -18330
21227 -18330 -44678 -34327 6055 23845 22144 31566 13769 33929 57904 29396 36725 33619
21215 33619 43605 39447 -9291 -21049 -35517 -13669 8333 9094 -3094 5156 -13289 15251 -10917
21202 -10917 -12078 20447 29246 24761 52971 75269 50522 24819 -26141 -10343 -2350 -18146
21190 -18146 -7931 6715 -21246 -56282 -55045 -50274 -79264 -59561 -27661 -69434 -64181 -9362
21178 -9362 -9600 -30734 -41182 -69644 -60955 -44050 -37374 38330 25947 4944 27701 32067 -1032
21165 -1032 -22089 -24350 6644 53406 47782 51178 47960 73750 49773 -20347 -34526 22147 34252
21152 34252 47887 34436 854 2953 4830 -17313 -38749 -46354 -38144 -21787 -10800 -19069 -13980
21139 -13980 -54694 -50248 -32113 -56867 -61960 -27782 3538 17876 -14403 -66109 -105408 -59962
21127 -59962 -14606 -18816 -22954 -41872 -26537 2256 26909 60864 50362 22631 31793 13877
21115 13877 -5268 -4567 -3878 -3249 56 3650 7693 14728 35698 67005 103031 82684 48996 4325
21101 4325 -6798 -3251 24052 20478 24269 15130 -56896 -94798 -102268 -84029 -36634 3080 57888
21088 57888 78405 55964 67474 48202 29575 8118 656 11989 -30916 -85285 -88967 -63088
21076 -63088 -17350 44726 777 2175 6092 -5913 -25066 -44531 -68904 -84867 -39684 -25465
21064 -25465 -43012 -38105 -35587 -12294 41467 25820 -28288 -58539 2899 22812 38649 48338
21052 48338 37829 69382 77955 2814 -34127 -36104 -26284 4801 -38053 -56710 -48936 -52069 -18894
21039 -18894 12174 18672 6161 -9886 -5732 -24623 -37301 -24718 -12812 -39354 265 21941
21027 21941 -11890 -38446 -29060 4248 53671 44644 13949 -16302 -23078 -64215 -127216 -141873
21015 -141873 -85138 -54259 -50065 5458 49208 51655 32892 16248 -2915 11387 4400 -32640
21003 -32640 -31971 -19437 -11567 16667 -17556 -37659 202 36273 22582 -10312 -29683 -21313
20991 -21313 -4827 -6192 -3373 -39847 -36762 -50489 -7446 38679 89509 71798 7095 -54172
20979 -54172 -15458 40337 54425 28255 10804 -3610 23057 70971 70339 35328 9724 -29653
20967 -29653 -17859 13653 18066 -25672 -17607 10541 -5378 -13388 21997 21021 -549 -10410 807
20954 807 12795 5471 -7035 36982 18834 -9171 -10095 32924 12730 8178 -4119 -19710 24693
20941 24693 39163 34539 7430 -9595 793 5630 -50008 -37483 11199 24530 11185 -26891
20929 -26891 -32611 -19316 -22183 1503 37607 13861 4658 5886 -21586 -10502 -24279 -11539
20917 -11539 11405 41846 -5476 -53207 -20563 51803 93485 88526 56376 30895 -15048 -57014
20905 -57014 -12103 31229 46850 45239 28989 16869 4022 -40642 -63691 -42621 -34784 -7721
20893 -7721 8904 26162 57169 46523 22133 6403 12898 8532 -7029 19505 30120 50613
20881 50613 27714 27755 8043 36189 56955 47365 35595 9257 21057 -18932 -23752 28133 62618
20868 62618 63019 69551 6798 -32646 -46562 -59996 -40330 -3658 -23768 -13938 14486 40897
20856 40897 43389 33649 28987 25909 42785 32696 -45393 -48752 -44854 -7209 19904 30377 21667
20843 21667 14606 15206 17272 47992 66996 54513 24134 -3291 -51871 -43258 2983 340 1472
20830 1472 -2037 -1682 16248 -6768 -7375 -8518 -15262 -20560 -41003 -50455 -30161 -20276 7273 -6498
20816 -6498 23698 59675 80943 86022 17241 -39064 -11644 -24578 -57761 -34020 -46568 -43381
20804 -43381 -18785 -33781 -34776 -8960 26785 77457 66454 -6269 -48263 -9199 42287 64896
20792 64896 39754 7638 9472 9092 16797 50976 13399 27155 65823 79563 69200 55345
20780 55345 41024 11727 -9930 -17023 -10523 21152 41310 21522 -4243 -1217 -8560 -5046 12616
20767 12616 37287 15934 -18862 -42118 -56159 -31374 -27291 -7177 -21898 -19654 12766 25900
20755 25900 -9789 -67518 -74855 -33361 -8385 -35253 -27209 -14018 -19448 -4410 7861 4993
20743 4993 50715 48640 2475 -35530 -48494 8778 16127 41686 70769 43618 -56 1726
20731 1726 30000 17269 28098 21014 -15298 2143 -1447 54659 88002 91976 8482 -2797
20719 -2797 53687 79292 69225 40517 -8967 -44906 -28921 20414 45660 21962 -21622 19409
20707 19409 4307 17883 15319 40035 49861 45475 44404 52570 33693 22831 -34638 -24965 3192
20694 3192 -18457 -28487 -30537 -58301 -72600 -41720 7441 2210 13261 43599 101851 82504
20682 82504 50304 1137 -5366 6718 -23294 -43451 -40601 -28970 -44597 -58631 -23211 -38501
20670 -38501 -62492 -52940 -16261 -13146 -47946 -54780 -61294 -17960 -39572 -18744 12921 27491
20658 27491 8090 -15419 -57373 -61922 -39159 -11394 23164 11930 28819 32902 36264 39735
20646 39735 4263 -19775 -80316 -107298 -83096 -47672 -15699 13192 2456 -19397 36674 74090
20634 74090 99135 74446 15265 -41271 -80465 -56142 7738 -6591 -12448 -8540 54476 60348
20622 60348 52651 21436 22006 -7948 -5104 6943 -21946 -12705 7167 21495 42976 57736 77893
20609 77893 55215 -5518 16707 14102 -12841 6614 41741 43113 25633 14365 -43707 -6976
20597 -6976 23567 34884 16562 41775 44224 43771 38039 44315 42203 17579 -4287 -10020 3918
20584 3918 42589 44227 36135 12092 -11222 7892 50369 59383 31975 23563 42437 44364 1630
20571 1630 -26552 -71724 -72041 -33015 -22508 -44350 -66427 -81038 -37030 -5619 12802 54518
20559 54518 40264 4185 -6968 28589 44392 24200 -5427 -7541 -3275 -17043 -2036 -106
20547 -106 28130 -4361 -25057 2108 -4616 -30517 -44807 -9774 6464 -6616 26009 61099
20535 61099 86647 60148 48945 15699 7954 14044 11002 30034 26593 13413 10629 32061 45443
20522 45443 29354 10207 56438 55284 35663 14970 -33659 -9215 -12960 -28487 1474 -6661
20510 -6661 -7316 -7936 -11046 26609 48668 9575 -2614 40404 115314 133791 112833 62069 30875
20497 30875 25062 18178 -19363 -43567 -35571 -1410 23537 37761 41373 52764 56453 73410 74273
20484 74273 66440 63852 28513 8163 -18014 -22213 10140 23257 26860 27839 -3949 12797 39227
20471 39227 -1752 -11768 3138 31606 84851 104822 69354 44710 41055 52786 20546 52747
20459 52747 55355 64608 43685 40841 77688 89636 48024 -18363 -37553 -37212 -72859 -91881 -25928
20446 -25928 29009 11490 21724 46603 31740 -5788 -58754 -40774 -8974 10503 9106 39307
20434 39307 68142 75547 64054 41278 22728 10729 -612 1509 12807 -7581 9978 30775
20422 30775 12919 16866 -2899 -60836 -81267 -71491 -31557 33491 77564 69277 61414 39844
20410 39844 7321 -37811 -16896 18558 78558 97015 98668 105825 62427 28392 -7428 12906
20398 12906 20869 -28188 -45512 -9098 -2834 38507 58110 62619 69259 68003 63126 86788 66417
20385 66417 19853 11439 32004 -3660 -18446 24676 41711 47712 59785 70819 53948 61359
20373 61359 98106 80676 31743 8956 6795 48707 63847 61799 53981 32500 44495 58444
20361 58444 77511 45395 43733 55682 34206 -13140 -5281 39845 10084 -23030 -14382 18658
20349 18658 37676 38190 29738 11488 -8354 -50219 -31196 -7062 15354 -16435 -49138 -70061
20337 -70061 -76641 -53182 -50263 -52601 -24565 4977 40868 31890 32605 3680 3078 27387 30547
20324 30547 3280 -701 12122 14640 -5299 -23401 -29957 -3440 51352 47166 -16205 -22749 -2095
20311 -2095 16566 -12827 -4249 49099 83482 77848 46250 36256 13185 21576 -11223 -41698 -11882
20298 -11882 -11653 -47798 1848 14981 3035 24439 39222 50259 25183 -16874 -11651 13521
20286 13521 27617 30080 26390 -27389 -58225 -22067 6086 -44426 -44976 -15334 -3789 28711
20274 28711 30260 3429 -16902 -26701 -57481 -31498 9376 35139 43895 29980 22000 33294
20262 33294 47626 38216 12582 -4799 -13026 -27333 -5180 -27137 -30149 26757 57284 16457
20250 16457 -24968 -32446 -44536 -56038 -51263 -10300 6112 -2575 36505 36070 -18487 -10974 33004
20237 33004 70033 61783 43042 -5621 -42145 -12082 -7544 -4519 -11086 -23726 -5250 71567
20225 71567 103883 95248 29568 25873 55901 12078 -56053 -84397 -33849 9698 -25711 -41591
20213 -41591 -52937 -49585 -47191 -13123 -68766 -81850 -17654 4516 18788 46595 35766 27562
20201 27562 -15152 -51170 -23187 52934 54937 19906 41678 44928 41622 53774 51476 -6159
20189 -6159 386 2176 -32098 -47953 -33820 -11671 -3081 25763 64682 76211 83096 65449 35461
20176 35461 37884 33806 -29408 -11215 24085 7714 -20488 -5770 24687 45094 55852 26463
20164 26463 8634 -14063 -59898 -12428 9718 7383 31660 50573 -6278 -44088 4344 20228
20152 20228 11581 -9785 7564 -35800 -35094 5360 9277 14849 40514 63474 41748 29165 54998
20139 54998 73007 38254 7807 7443 452 -38417 -31926 -23974 10603 33171 25117 36981 13726
20126 13726 37400 466 -20457 -50805 -16472 7424 33200 82360 90269 60767 45028 51229
20114 51229 60213 61473 67383 27800 11136 28579 46171 18811 35935 43187 10016 -11607
20102 -11607 15684 519 -14918 -71118 -60318 -53099 -23055 9374 19744 34959 27192 14215
20090 14215 -14285 7950 57988 44215 34437 15026 -5083 -8879 8572 -538 -25908 -46284
20078 -46284 -65279 -42461 34292 65005 80555 63416 50507 17072 -11685 -871 23553 28304
20066 28304 5232 -1089 -1490 25870 10682 10749 18211 14073 32076 52024 46496 59668 21166
20053 21166 6811 -5271 20553 18355 -28474 -27812 27194 28614 -14935 -55528 -32986 -8408
20041 -8408 -10760 25594 34772 7442 3510 7680 37268 43335 28124 25229 31863 51341 44572
20028 44572 15815 12489 35629 63074 78510 41615 -47939 -70084 -30898 -7588 -22113 -37858
20016 -37858 -8563 11423 482 -8337 42563 20271 1806 -18480 3785 44479 50160 53648
20004 53648 34288 59224 77834 58991 37744 45389 83208 111463 95789 29968 -11666 -22926
19992 -22926 17016 5762 14919 54284 101624 71578 46080 -25444 -39995 -18865 13031 17523
19980 17523 9391 -12585 -27953 -3882 -1566 -2013 20898 19497 35522 45988 60281 51530 38802
19967 38802 13104 46091 70333 62222 67655 99522 84548 87768 101834 106884 98523 22010 -18492
19954 -18492 39295 83339 100027 93585 71417 71035 40124 36139 47985 -7428 29119 49704
19942 49704 26668 -33350 5826 65841 84575 54416 33308 29283 -16680 -21566 7290 1582
19930 1582 22170 15230 -2749 13761 21778 57202 52323 46097 39092 45322 24870 28075 72112
19917 72112 74974 81672 70480 24746 43476 48525 39256 -18380 -30800 11359 12752 19824 -25561
19904 -25561 -10091 25260 55006 67275 49091 26231 57107 53785 7025 25936 39635 63147
19892 63147 77757 102606 110970 116731 131023 142852 177737 228137 300572 352063 415237 410859
19880 410859 428215 410215 352798 315043 346369 377328 404666 451673 527590 645792 875269
19869 875269 1186758 1708896 2348814 2790134 3042961 3159929 3073110 2930240 2996215 3297691
19859 3297691 3785117 4090993 3923824 3568372 3085116 2625603 2370477 2246823 2177448 2230368
19849 2230368 2416423 2555683 2496649 2260040 1924631 1482716 1202985 1081819 927056 862832
19839 862832 876699 831516 738164 720114 656796 597550 648064 712837 784437 912935 1054102
19828 1054102 1184177 1242173 1246411 1158190 1041367 1050329 1111592 1227882 1478378 1863700 2396150
19817 2396150 2999454 3674729 4367101 4784735 4680214 4267117 3639908 3030483 2627175
19808 2627175 2505754 2759560 3321612 3830383 3943062 3871319 3617102 3128815 2680304 2355072
19798 2355072 2055119 1796593 1581944 1426347 1277549 1171330 1050960 957697 891091 800639
19788 800639 726531 672021 621300 598585 551273 497668 463941 455050 442579 391102 407801 398720
19776 398720 363497 362033 378528 436720 410671 361312 362776 385042 422822 398133 366221 352911
19764 352911 354551 370494 402848 382548 337794 340005 316972 292457 271769 258719 303753 276212
19752 276212 238132 269512 307358 312546 320700 292357 255402 274120 332531 298814 257702 234973
19740 234973 228302 259400 247981 212889 221172 231673 183551 151229 107819 87562 123606 118987
19728 118987 157144 163803 154814 153737 146137 109748 106986 70215 80622 162206 163405 140496 142200
19715 142200 131664 89786 53464 27145 20585 54749 77276 135425 114996 81679 106449 126578
19703 126578 132267 151332 155732 77108 84578 121102 117315 98206 51615 26335 4817 -1209
19691 -1209 -1183 -21198 -5994 35520 61063 42434 18285 -20764 -1805 35307 32136 57669 27318
19678 27318 -12390 10297 51019 68382 14861 16214 51928 48727 43569 59863 66515 85078
19666 85078 87453 136179 176784 150867 124438 105756 50668 36280 -6061 19347 56049 52800
19654 52800 28152 5106 25222 29194 17276 13759 10654 -19341 3372 53382 65784 56228
19642 56228 40418 14132 9213 14806 47113 13442 2672 26507 25893 30156 11430 46580 61929
19629 61929 65658 60299 53861 60696 91361 125104 136531 136618 107981 74923 56246 71082 69017
19616 69017 77941 70168 43810 77518 146371 150337 104971 105791 98085 110455 95369 84117 89694
19603 89694 115047 106863 78687 68913 76278 101467 94774 125617 115222 127714 120028 120816 145930
19590 145930 159164 172158 146375 142564 167794 182661 170394 139815 90728 58855 76579 95806
19578 95806 121429 96205 101483 129741 128672 155663 143312 150633 146799 127552 137428 202459 250118
19565 250118 233241 213447 234774 273242 264190 273342 305356 304695 312576 333724 346524 349461 367296
19552 367296 346966 301396 273455 274346 297676 309198 290758 248118 234245 217969 210247 268338
19540 268338 284386 260345 237833 216635 222326 211123 257226 286793 337244 431531 467949 441921
19528 441921 390877 397615 439485 450234 473408 480400 466326 414220 378528 399030 437249 491625
19516 491625 524390 521368 532713 498757 491146 454694 439410 417624 366790 374402 405201 451081
19504 451081 427099 399250 359979 295372 273309 321046 364470 320180 262306 272475 319978
19493 319978 307992 290439 274620 306928 363762 352494 327208 328363 352339 395821 386314 383675
19481 383675 379933 379790 379716 394705 396070 414808 413740 477818 530531 544273 550457 511048 476338
19468 476338 453865 398029 352407 308730 290123 275219 294789 318286 311936 272113 224572 194913
19456 194913 185963 142986 119136 178298 201823 212587 190219 220398 240549 262367 252567 260394
19444 260394 239591 189248 184784 210532 179328 197761 212709 225722 192562 187228 197351 206321
19432 206321 239146 262840 255120 297162 328544 310803 313940 342931 311244 276199 283557 277690
19420 277690 223487 216360 256949 252329 250064 263921 256145 218458 219447 220673 234132 226547 221884
19407 221884 219417 264707 260133 271035 245085 253094 302653 351797 360190 325952 321556 325393 288252
19394 288252 226231 216584 227850 257647 299292 314161 342394 322247 276380 263664 303021 317449
19382 317449 306708 283750 291021 272838 283091 306972 332694 334220 334968 349020 357994 365958 379206
19369 379206 378535 403392 410816 409985 412371 405401 422941 392906 377890 388139 408379 432181 457025
19356 457025 470656 467329 497575 526245 571504 625624 661625 626278 592858 649331 749618
19345 749618 838185 903878 924997 991560 1117670 1282527 1440081 1704385 2024712 2275094
19335 2275094 2509458 2703081 2971354 3248472 3448660 3609531 3749332 3897312 4257223
19326 4257223 4646993 4830584 4871044 4683630 4398226 4327711 4505178 4990313 5870817 7014744
19316 7014744 8007005 8495760 8514701 8166957 7773881 7750235 8409510 9777846 11334080
19307 11334080 12934616 14892344 17313924 20289580 24489238 31407039 40588844 46959774
19299 46959774 47905125 44920230 38101186 30297205 24878826 22426115 22704362 25601567
19291 25601567 29485004 31834580 33423719 34704608 35687642 37295374 39836004 43879391
19283 43879391 47599065 47302516 43925369 39108607 33163677 28310303 25894890 25949164
19275 25949164 28258738 32716236 37631080 39759891 38716789 35522938 31235224 28152474
19267 28152474 27931471 31080611 37073864 43241460 46752680 48581258 49904820 50265878
19259 50265878 49309000 47162372 43594990 39181358 35669700 34030986 33064256 31782434
19251 31782434 30527836 29616072 30292102 33111048 35124698 34747764 33394431 31342278
19243 31342278 30137682 31224697 35348114 43060693 50337362 51438974 48062362 41445736
19235 41445736 32688341 26178177 22763089 20659863 19195089 18102493 16624741 14631551
19227 14631551 12662246 10653741 8760012 7374772 6486376 5896162 5427221 5071178 4878909
19218 4878909 4846934 5050800 5601483 6372227 7067882 7545726 7682253 7157774 6272474 5337888
19208 5337888 4404083 3677087 3196692 2946831 2806217 2638776 2505894 2413028 2369293 2240541
19198 2240541 2036047 1797918 1576487 1376606 1181088 1042523 970318 933212 869431 792863
19188 792863 747905 709204 632161 571068 562397 537289 544792 531285 535115 548838 582229 592597
19176 592597 571471 523485 515707 473558 433863 410167 360901 377080 394789 427592 416596 401127
19164 401127 402341 389310 388603 402089 374143 404275 425869 456207 441453 411471 428076 434307
19152 434307 426569 410697 413368 411427 415678 474579 514901 477851 454428 481331 476246 442455
19140 442455 360926 314354 293869 255930 201183 188955 246849 256231 212808 159207 124328 141037
19128 141037 215688 204562 173667 178856 236611 243104 259799 243059 227851 207585 225538 272788
19116 272788 279969 280845 318944 378936 384417 331892 278066 243576 235579 257118 203410 236947
19104 236947 285471 293960 326386 354832 355414 369125 351193 379336 401786 409983 382551 381733 339721
19091 339721 266108 232507 260966 311395 316493 306182 306033 352460 373017 376786 391094 408247
19079 408247 423229 415940 397516 392002 356134 377192 445021 476508 490766 460312 460446 447040
19067 447040 404957 392890 428064 423974 446747 505864 531672 551154 613064 662341 712638 756388
19055 756388 805427 885666 951436 1028646 1114332 1158379 1276053 1440979 1604026 1718790 1802797
19044 1802797 1941218 2139825 2436906 2751021 3068562 3372628 3743306 4194885 4810348
19035 4810348 5638949 6901087 8803162 11600192 15393387 20487800 26729152 33450529
19027 33450529 41322518 47715212 48197201 45048501 39762331 33436714 29792400 30516110
19019 30516110 35359211 43563606 54427639 63798846 66700338 63860582 56528651 47282261
19011 47282261 38822040 31732428 26435659 22227567 18895882 17104475 16947374 18246501
19003 18246501 20114541 20812035 19988287 18013360 15190927 12527504 10644237 9511996
18995 9511996 8869876 8528687 8391814 8452014 8789399 9453670 10535605 12203766 14918223
18986 14918223 19307900 25938506 33007203 36993796 38711445 39087169 38442075 38618890
18978 38618890 39633134 41499211 45844163 55024244 67992743 75704519 78000979 77139644
18970 77139644 70576356 63569932 59890784 59884232 63636711 68513514 68155115 62056343 52557337
18961 52557337 40473524 29880349 22897591 18686380 16093142 14308632 12969705 11980645
18953 11980645 11284416 11049057 11320905 11651595 11303765 10432853 9174047 7744131 6596154
18944 6596154 5828049 5344328 5078452 5058168 5403716 5952497 6233179 6215235 6055234 5771567
18934 5771567 5605774 5636630 5827031 6223616 6911038 8022494 9011985 9305354 9225298 8640518
18924 8640518 7821327 7352668 7306611 7813570 8720489 9387982 9341960 8730423 7671335 6438939
18914 6438939 5501912 4920253 4606842 4370550 4143117 3953855 3754738 3654435 3560619 3473209
18904 3473209 3335097 3106994 2798036 2500570 2196157 1929802 1725070 1548234 1410904
18895 1410904 1305547 1237209 1185982 1201694 1181606 1081845 1011153 962385 958981 963435 925632
18884 925632 869190 892513 851657 794254 737468 729256 782639 811308 801075 793187 812149 873105
18872 873105 888811 868349 780920 713577 705557 686621 669548 669743 669440 650101 657195 707631 714080
18859 714080 699437 658732 620652 614166 602862 595427 569808 554116 552746 555304 563950 598146
18847 598146 642309 704723 753181 769346 753028 705380 735026 754625 808175 896724 994160
18836 994160 959322 893457 861161 746496 630348 579468 551720 594903 653273 643871 638682
18825 638682 622272 553013 512061 511545 475019 454371 444920 454445 462734 457901 447188 467690 520208
18812 520208 593881 651442 760299 850767 832358 788400 762271 715419 647153 579741 577570
18801 577570 613468 663384 784754 877951 952922 1071548 1177548 1304386 1511222 1744663
18791 1744663 2018753 2364083 2662335 2781773 2762340 2551669 2195009 1866941 1567942 1344900
18781 1344900 1233702 1148320 1043121 1042972 1040223 1078321 1217250 1405267 1477397 1467937 1416142
18770 1416142 1343828 1300857 1237818 1130683 1068841 1122963 1231076 1293673 1246098 1159819 1069244
18759 1069244 975006 941494 966844 1068377 1258742 1562911 1868023 2058844 2130364 2090653
18749 2090653 1971601 1898624 1959424 2195246 2672682 3155172 3347999 3340774 3148366 2769826
18739 2769826 2433705 2224015 2137666 2173946 2286045 2376400 2340540 2255530 2107808 1936161
18729 1936161 1792993 1711439 1702827 1751829 1843328 2039883 2255902 2405053 2501209 2590534 2640799
18718 2640799 2775169 2983526 3118884 3172574 3082093 2947430 2867660 2827867 2765559 2621265
18708 2621265 2493041 2349747 2232607 2320570 2569511 3001805 3533332 3922475 4202935 4491374
18698 4491374 4765190 4919411 4819723 4547675 3988382 3350592 2878564 2564646 2419162 2444455
18688 2444455 2562319 2553935 2426732 2173076 1860912 1636614 1451062 1319785 1258643 1245377
18678 1245377 1341367 1446021 1637481 1923167 2275611 2492802 2663309 2830585 3034977 3245678
18668 3245678 3431835 3559371 3610171 3601855 3658589 3844215 4133006 4264589 4247394 4066471
18658 4066471 3660134 3279314 3054894 2997261 3064153 3384087 3971072 4661475 5320766 5684967
18648 5684967 5662903 5501824 5174444 4689909 4134470 3579399 2993065 2524319 2158319 1894061
18638 1894061 1788104 1696011 1618492 1577465 1472247 1353861 1231611 1048768 935828 881455
18628 881455 842662 826880 806168 813689 845795 856338 875602 886396 925850 1040233 1164075
18617 1164075 1306972 1405274 1409627 1394576 1394081 1315138 1277004 1341758 1492919 1733570 2078672
18606 2078672 2464004 2698986 2785573 2766317 2619935 2433136 2346406 2266550 2236177 2280805
18596 2280805 2338171 2407875 2470083 2487879 2495977 2451356 2374899 2327066 2346318 2443635 2670035
18585 2670035 2996487 3443935 4184554 5432719 7429063 10317493 13735810 17293216 19601938
18576 19601938 19379633 17724736 15167887 12681980 11519079 11947385 14177469 18482994
18568 18482994 23520364 27744348 31369453 31900253 28725327 24474357 19501467 14875150
18560 14875150 11944140 10582950 10417333 11422430 13313202 15107283 15771545 15294813
18552 15294813 13691525 11356999 9270140 7683442 6758580 6320338 6168742 6245585 6477078
18543 6477078 6934360 7558686 8409590 9756191 11697097 13731935 15230445 16418893 17190361
18534 17190361 17279362 17535047 18547328 20603992 24835817 32317661 42191733 50152045
18526 50152045 55572709 60847429 67503497 76238037 81114191 78313450 70246611 57648207
18518 57648207 44923271 36960192 33881471 34271338 36822305 39554078 41796936 44169916
18510 44169916 43825001 39653252 34270134 27834162 21411955 16859390 14200098 12815002
18502 12815002 12159874 11860607 11522280 11259121 11061905 10833339 10666363 10550812 10641165
18493 10641165 10940509 11390867 11932414 12758189 14045145 16280334 19993132 25059133 29299350
18484 29299350 30967460 30817679 29487408 28311014 29563618 34736666 43493135 52329058
18476 52329058 58993058 61952784 60731016 58457634 55948603 51400893 45565306 39268102
18468 39268102 32416450 26969009 23971316 22682358 22509323 23129152 24697149 27163016
18460 27163016 28685559 28420955 27049059 24646460 21895647 19920760 19039082 19235313
18452 19235313 20477987 22993321 27386258 33586205 39651655 44582338 48569531 51660632
18444 51660632 54881888 57603568 59988265 63889962 71681408 84769913 100562283 119011780
18436 119011780 139165637 148477527 143280914 129641190 109737713 90270997 78777078
18429 78777078 74966086 75156327 77964651 79602046 77686464 75309192 73394739 72379216
18421 72379216 72439458 73501495 77194716 85163907 97683337 108625548 111598639 108349861
18413 108349861 100711097 91217521 83706356 78094834 73538698 70347426 67574142 64157237
18405 64157237 60863212 58244157 56721933 56311098 55962831 56671197 59727337 67274903
18397 67274903 80967359 97298470 114416393 130078118 134577764 125994675 110108412
18390 110108412 90264252 71067248 57250429 49019778 43683140 39098989 35413358
18383 35413358 32667333 30214284 28050788 26885747 26769789 26813200 26067833 25063920 23642306
18374 23642306 22035438 20808171 19498871 18155671 16861416 15678882 14712625 13803320
18366 13803320 12724260 11530481 10405285 9375075 8619776 8099292 7763717 7628203 7858987
18357 7858987 8593579 9302451 9361838 9000701 8376145 7639140 7267651 7450875 8374039 10035568
18347 10035568 11465414 11718673 11189525 9979507 8460446 7410082 6910084 6976403 7478258
18338 7478258 7894387 7871118 7631893 7112047 6402764 5705398 5170764 4757575 4453170 4219675
18328 4219675 4165867 4271037 4274608 4061672 3628201 3136878 2615659 2178335 1894050 1694562
18318 1694562 1535643 1413286 1346573 1315437 1321379 1344910 1332321 1311529 1268170 1226001 1142117
18307 1142117 1035804 958330 928090 951518 952880 897410 859069 817733 760128 675700 654580
18296 654580 662102 650329 625299 632048 659891 707101 736325 785327 912503 1069608 1107691
18285 1107691 1029514 935566 870232 824117 872705 985872 1118740 1153964 1096508 945382 795402
18274 795402 652707 521908 472137 468894 470018 449578 416919 329309 288564 286242 299074 275552
18262 275552 252534 244570 223876 230016 256340 322391 346399 324362 245802 191990 163949 139534
18250 139534 202694 207968 183222 163460 128630 115502 69545 58580 83545 128057 175648 217164
18238 217164 268943 275245 291282 298696 321729 282251 214696 158688 104170 94459 75438 52653
18226 52653 24835 -447 -21196 7193 29815 33682 22848 14724 5422 37616 69437 67106
18214 67106 73945 62170 78522 38897 34848 38303 59178 99894 83178 37289 2946 10265
18202 10265 28566 24620 21766 62540 89792 49421 -9567 -937 51842 73630 86228 107597
18190 107597 127771 147761 138602 150179 129898 96728 98763 83563 103882 92725 118376 113087
18178 113087 135844 111786 127695 98620 103545 115521 147566 128517 135105 156930 152310 129652
18166 129652 117790 137686 116953 157801 143836 136624 143045 136919 124652 82570 103734 144805
18154 144805 164768 176944 173650 158343 198543 217185 209781 160457 178155 175264 176953 146232
18142 146232 165929 192794 185025 170156 169616 192742 198695 230947 294302 326779 362228 376088
18130 376088 384458 444288 464340 471133 524922 616411 752397 831075 906017 990395 1127625
18119 1127625 1356737 1574770 1811407 2103401 2463461 3054261 3845127 4853178 6407496
18110 6407496 9002519 13429615 21487772 37257056 61502593 73930268 71326372 63704486
18102 63704486 45819163 27827947 17526346 11958127 8843720 6883644 5502985 4528232
18094 4528232 3844753 3298325 2806666 2435175 2126401 1845587 1675888 1519062 1365278
18085 1365278 1224296 1095127 975174 899914 901729 868316 842628 787906 691470 656446 665551
18074 665551 636068 582387 544699 534180 516475 468924 460421 461892 438393 372685 344780 303114
18062 303114 354075 375515 352119 369722 321505 308592 350244 383145 377208 404855 399324 374168
18050 374168 322571 275213 274595 246262 232618 226157 239426 221724 168244 153142 165104 148310
18038 148310 144785 140588 110064 88699 83767 106073 135144 176825 142571 91845 74926 97630
18026 97630 126734 174259 219026 189792 204190 211452 174077 166336 192166 263156 235972 197780
18014 197780 216056 246639 277960 299867 341892 358570 357488 364394 367461 373543 327441 276716
18002 276716 254860 256830 234050 220386 233218 251302 230329 240726 236070 193875 167545 161113
17990 161113 140237 123537 121069 62735 89900 137072 169569 183492 174967 159380 132863 121252
17978 121252 122928 91835 19284 -27577 -13054 60179 114890 113815 117754 149439 116397 152686
17966 152686 188905 217089 219590 221026 244845 260095 261333 231836 225491 243935 214730 242461
17954 242461 303000 382917 442155 496588 561775 541069 482773 422404 386151 405888 381942
17943 381942 338860 321915 284670 251392 275946 312214 320041 336524 337597 299215 255404 231726
17931 231726 262168 275355 252822 259314 257049 226933 211227 208382 209746 206382 188820 170081
17919 170081 157980 167056 170457 121240 111198 144846 190448 226071 204317 184513 221385 317835
17907 317835 392581 447185 503531 536380 583029 622653 594182 561360 591185 586902 548591 505585
17895 505585 449381 359329 313242 333162 349534 403308 424598 355340 326108 310859 288374
17884 288374 304191 333066 315060 276425 213232 153558 154814 177962 219046 215602 193613 179087
17872 179087 185324 152918 110499 126730 122374 107183 125083 151862 154234 150443 184680 226948
17860 226948 215831 251642 291628 268299 225474 170540 141369 148646 86266 84198 100161 146584
17848 146584 200468 226003 236422 276035 299142 246205 179466 166657 131685 109104 107517 109372
17836 109372 87278 104729 114037 55734 55557 120885 107128 62001 72757 66468 1119 8856
17824 8856 52532 85100 78048 74245 50800 26817 8003 -24340 5233 13272 5314 -2829 27860
17811 27860 53291 56523 32329 2029 -10212 6699 -14162 -17933 -23991 -52606 -32497 -32339 7112
17798 7112 23269 -2654 14371 24672 4119 -35005 -31150 -37437 -10335 33857 74434 61183
17786 61183 22791 20360 50445 67958 24192 20908 73530 107906 116784 83936 21013 9455
17774 9455 -6449 -4681 -5600 -8150 -23265 -31222 13647 57392 45959 50573 34536 -781 1790
17761 1790 6280 -22613 -1178 69744 89675 85717 48218 20022 8178 -1408 -37256 -14574
17749 -14574 28621 8191 17944 19100 44450 67158 42746 7377 40675 23855 -25968 -48975
17737 -48975 -61433 -55546 -33841 105 2052 13985 35139 83387 86852 63881 52707 45677
17725 45677 41830 22992 19407 30596 31137 37793 -11410 -40426 -63115 -78864 -57179 -20849 -5564
17712 -5564 -8845 6596 2219 -60018 -58635 -30770 -49656 -41680 -39369 -29906 -28665 -3688 11978
17699 11978 7245 2365 8087 -7987 -20829 12333 8927 13743 44577 35745 -8256 -34139 -20399
17686 -20399 3151 -33269 -41844 -11814 -33200 10788 31106 179 29529 -22604 -60592 -25803
17674 -25803 -1349 -18007 -49279 -71124 -70739 -71941 -67037 -31484 -21935 -27814 -37281 -25310 5257
17661 5257 25802 4664 -7816 3803 10204 6829 2017 -12681 -1286 -16236 -29185 -40065
17649 -40065 -81750 -35130 -20733 8370 18440 -28858 -27389 9555 -12399 -32627 -13442 3776
17637 3776 1254 -18280 -2611 21904 -6176 -19062 15570 17024 18345 7820 15170 33886 23965
17624 23965 8557 259 3733 -26016 -35156 -25697 -8867 -16793 -21093 -63217 -48815 -18313 -25931
17611 -25931 -32207 15922 52798 50352 30267 18298 34617 -1004 5741 26261 -1786 -17384
17599 -17384 9324 -14589 -41702 -40605 -31818 -27719 -6775 19036 2072 -53453 -68180 -29336
17587 -29336 1173 17213 57951 31121 11795 -695 -68163 -83246 -58628 -33224 -41637 -49114
17575 -49114 -23926 -12924 -13849 27531 64981 53681 63628 39007 -12906 -31661 -16929 -35436
17563 -35436 -38422 -25674 2836 -11352 -15609 19512 41540 17075 40467 45412 10188 14695
17551 14695 33318 -12164 -46600 12736 9772 888 23823 26117 -16206 -37127 -45532 -28549
17539 -28549 -18142 -2496 -11513 -23810 16765 1195 -31856 7332 -802 -45883 -51625 -20929
17527 -20929 -26581 -51294 -27261 -10081 3187 11824 1280 -9824 -14641 7094 7575 -6904 19566
17514 19566 37225 1329 30698 51787 27194 -4472 -29429 -2972 -427 28486 15805 22187
17502 22187 -48 -11763 -9062 -16671 -50181 -37680 -70932 -69116 -24214 3055 9073 2705 -18411
17489 -18411 -32273 -1617 45634 39364 7347 5371 27369 25886 28051 8554 -22913 -11213
17477 -11213 6575 -12998 -14639 52354 29806 -170 -9967 -28125 -6747 -7322 -39550 -45983 -47217
17464 -47217 -30162 4374 -7975 8655 -9029 -25318 -23347 -8603 -17053 -3879 19555 29551
17452 29551 34219 -3499 -23742 -48009 -21221 9998 75378 85296 -3721 3136 45765 137776
17440 137776 259906 371304 379339 349512 277087 196702 125184 43380 14829 -12854 12607
17429 12607 52924 65668 23700 24319 39680 22145 11104 10914 13216 16111 -16549 -24722 -27275
17416 -27275 -46114 -48919 -27821 -7472 1717 2941 1876 16582 -9708 -59964 -58476 -31323 -49046
17403 -49046 -63782 -11185 18314 18158 27827 21634 18990 6784 3303 8708 1584 -32658 -52962
17390 -52962 -89394 -64027 -27448 -19049 -10224 6700 -10942 -54879 -59015 -25042 -8052 -36112
17378 -36112 -5820 27732 34490 45180 6195 -27349 -31570 -25860 -27699 -10621 28773 16620
17366 16620 37838 67794 -11638 -87789 -86652 -66954 -42253 -3019 -40712 -26555 -14393 -12545
17354 -12545 57224 60043 -8825 -29293 -44057 -37734 -44540 -31594 20034 58115 24286 -19745
17342 -19745 -49504 -56842 -68051 -83343 -103942 -94550 -73849 -40670 -2176 10494 -20818 -63137
17330 -63137 -49630 -67103 -7794 58019 85841 41027 -16780 -40411 -74679 -75344 -73137 -46365
17318 -46365 -25713 -13121 -8179 29477 -9241 -21002 -34226 -31699 -3299 9512 -3904 630
17306 630 -14561 -26320 27775 57215 58425 47310 52497 32249 -447 13831 22052 42623 57515
17293 57515 19308 -35007 -52507 -26007 -43400 -48575 -32845 -12293 -15864 34721 73154 50636
17281 50636 1765 -30345 2346 13680 -1522 22984 41312 54097 19102 6272 775 -14641
17269 -14641 -21882 40071 53587 52904 85446 34466 -4682 14468 32079 12369 17557 -11148
17257 -11148 -19253 -6924 -42442 -39175 -30925 9514 30474 -1094 -35077 -39625 -43880 -5041 11259
17244 11259 -7243 15035 -39971 -107580 -67132 -12057 -20357 -64540 -76869 -30752 15296 41140
17232 41140 19775 -20238 -21598 -9899 -9384 -40238 -51233 -48670 -14731 -18366 -32108 -47069 -17190
17219 -17190 31838 65122 79267 21575 9061 -3803 -22462 -37247 9943 28550 -3323 -5822
17207 -5822 -22815 -7053 -127 -61219 -90550 -44151 -31339 -78761 -102293 -77905 -34842 2843
17195 2843 -14778 -35643 -69357 -85717 -105689 -77678 -24280 -19229 -50581 -46847 -63967 -74244
17183 -74244 -55310 -42541 -18812 14718 4279 3283 -19765 -24097 -59401 -63007 -36744 -11565
17171 -11565 -32985 -54830 -76139 -72654 -33357 -5080 8387 32909 50775 14771 -33263 -6556
17159 -6556 -22380 -39813 -50630 -37289 -13655 -46130 -74292 -53464 -43085 -52353 -43044 -800
17147 -800 60292 47968 38063 6598 -31935 -57285 -27841 -28831 -48550 -70150 -80195 -63505 -57214
17134 -57214 17075 44369 23009 6426 5745 -15117 -66535 -60857 -32615 3150 -3009 3936 15717
17121 15717 -18819 -74173 -59807 -34520 -32398 -23636 31953 25885 -21133 -2162 -15432 -46334
17109 -46334 -79823 -86146 -77292 -36252 -15018 -19255 7464 5594 -2272 -24965 -28208 -18393 -19113
17096 -19113 -57765 -91795 -78384 -69211 -62831 -14673 -10049 -60610 -45098 -40807 -59909 -61626 -69071
17083 -69071 -61596 -54107 -42625 -44515 -42434 9232 23573 -5320 -5164 -9776 -55034 -61870 -37178
17070 -37178 -37849 -67618 -79974 -75680 -49487 -65817 -97058 -81409 -77489 -65105 -41373 -10030
17058 -10030 -28852 -5245 80050 91184 30753 21418 64994 55521 72429 61004 40666 4103
17046 4103 -8345 -15042 18575 2458 -16110 -27519 -10825 -27654 -52197 -41312 8133 30057
17034 30057 26437 -25615 -34382 -57321 -61667 -81271 -53054 -14910 24893 50355 42109 19976
17022 19976 -14870 -39680 -48594 -32763 -31591 -31828 -22646 -32340 -50449 -43524 -53159 -15456 38236
17009 38236 69973 56227 49732 46932 13335 -3999 19939 17003 44972 67431 23526 9301
16997 9301 -16288 -19029 -60359 -70398 -29826 -32405 -47720 -11920 16530 -6170 -10696 -22364
16985 -22364 -20125 -49064 -74948 -62171 -45541 -40030 -12132 -3884 -27503 -25525 -13041 -19310 -4722
16972 -4722 -4049 -8911 -25342 -43421 -33590 -45756 -27833 16611 19742 -44654 -77347 -37097 4213
16959 4213 19542 47253 52816 11586 -19876 -34434 -50150 -40383 -42329 -13714 -27699 -1548
16947 -1548 49948 12760 -21931 -11780 -30113 -57445 -31068 8365 -17496 -22529 -6114 35057
16935 35057 38427 -282 12312 16466 -11145 -57977 -29459 -58092 -60393 -40121 -6830 -22045
16923 -22045 -53794 -29709 19701 41766 29979 35554 23779 33508 -7829 -31411 -33594 -58239
16911 -58239 -75127 -51849 -28146 -16662 7414 49335 48488 -5424 -5809 -23906 9090 16269 5053
16898 5053 836 -22728 -24550 25369 31335 -2259 -51676 -58151 -15833 -12479 -34100 -44363 -27923
16885 -27923 -42489 9558 53144 18936 38311 52916 24158 28811 18455 2726 -29649 -83010
16873 -83010 -64435 -20718 2747 23582 33137 47801 71822 99820 83550 37362 30320 37627
16861 37627 33757 24954 24751 5494 -2203 46733 36356 -50314 -107970 -97796 -57541 -19826 -24489
16848 -24489 852 40599 37312 28013 -27216 -77513 -56712 -7919 15288 8843 -8229 -823
16836 -823 -39563 -85918 -61005 -35806 -30282 8000 25586 46530 -1972 -34487 -5523 6825
16824 6825 -20391 -10670 34227 82750 60675 -2503 -39257 -30898 -44540 -20736 -9573 -21522
16812 -21522 -9613 12990 26616 35209 -11642 -40592 -41449 -32050 -7334 -6936 14200 -23045 -16008
16799 -16008 11260 20952 -1931 2951 21273 19166 42019 17750 -15929 7340 -49784 -108020
16787 -108020 -119185 -84152 -54971 -63817 -12693 -13863 2366 23940 26235 53922 27149 3367
16775 3367 -5820 -4372 25347 17076 42040 1759 -530 33563 36468 -14818 -37694 -54586 -31286
16762 -31286 4979 20944 48859 40686 18160 28733 38179 -12552 -10216 -10775 -502 7336 5113
16749 5113 -8753 33203 8332 -10069 6621 -23514 -43797 -37352 -36386 -16907 -54722 -66790
16737 -66790 -39757 -47449 -52552 -44840 -77465 -81202 -26280 -9663 -8401 29100 62661 37259 66216
16724 66216 46936 8569 -37860 -24452 -7701 18162 42345 5821 -17660 -24558 -24167 -972
16712 -972 -34166 -33306 -16655 -11223 16607 5839 -21452 -4456 220 -1069 -20829 -62883 -16976
16699 -16976 -2453 -7280 14806 19444 -13383 -15733 -4818 11016 24025 36350 31717 -5304
16687 -5304 -23717 -77982 -77867 -92775 -56040 -14035 -15985 -22842 -9173 24195 40450 93818 85604
16674 85604 23218 -11533 28388 9945 -47499 -91510 -74501 -19719 -6466 6603 -33597 -8432
16662 -8432 -1680 3624 -10759 -78173 -74571 -59749 -42671 -28030 -7474 24274 15591 17735 32965
16649 32965 -21172 -54996 -53234 -59297 -45756 -9193 -20757 -39504 -37956 -57544 -49493 -34382
16637 -34382 -17534 33290 83737 74859 61633 52930 42677 49061 38130 15912 11740 -4469
16625 -4469 -8365 -19641 -29625 -35451 -48757 -3978 -16941 2828 -29026 -27236 7944 34529 17542
16612 17542 -3664 3845 -27085 -26528 -8932 62 -3496 -5547 -39455 -31696 -47046 -46424 -79348
16599 -79348 -40010 6784 -32985 -38290 9387 18340 -2169 -15480 -33977 -54494 -72325 -104633
16587 -104633 -76750 -10273 -30961 -31020 30493 54091 75192 46107 -18900 -46535 -75176 -90827
16575 -90827 -81426 -59170 -50336 -15702 3448 -24893 -68556 -110081 -89352 -50784 -33518 -40494
16563 -40494 -560 -4583 -439 7124 -2896 -18478 -18570 -12636 48380 82939 88992 44955 9454
16550 9454 6008 17089 26594 28587 52805 50490 40674 27889 33404 -1615 -18163 -26011 -32828
16537 -32828 -22263 2516 7468 5644 8959 6159 915 36121 84538 16306 12798 18722 -16894
16524 -16894 -29673 -7414 -13756 -64776 -64910 -80381 -46607 -13838 -13871 -29155 -19012 6046 19266
16511 19266 -7736 22600 72490 117874 101730 88148 57028 12548 19073 35154 31709 -36266
16499 -36266 -49915 -32595 -35983 -11627 -18587 -70610 -77991 -87556 -48113 -4682 7345 -32770
16487 -32770 -78216 -75172 -45441 -21554 1019 16270 7638 -26946 -40181 -40660 -8187 -8427 -53212
16474 -53212 -23928 2618 31804 1073 27175 52263 27727 -19531 -49825 -46157 -18793 2732
16462 2732 -9674 -9612 30297 40104 2898 1378 20841 -13513 -35444 -66441 -54284 -30441 -30391
16449 -30391 -15723 -29784 -17910 3504 -5124 3572 36763 76685 68884 67800 98257 79945
16437 79945 25293 35196 -2030 6968 23562 -4707 -20165 -45059 -19095 -5279 26992 46929
16425 46929 6998 -40237 -13429 24143 61847 104520 104751 -11343 -47252 -19317 -5768 -19892
16413 -19892 -35181 -49063 -32215 -67394 -103395 -110269 -91287 -61776 -43585 -28834 11385 56837
16401 56837 26982 -2981 36806 53602 27771 26857 25822 195 9869 -1797 -13973 -37020
16389 -37020 -41927 6961 43457 11853 -30035 -30150 9531 15767 10398 -10970 -36650 -61157 -53282
16376 -53282 -49903 -50955 -63353 -96506 -44978 -8710 -11106 -20653 -49534 -625 25446 5202
16364 5202 6805 26205 48459 52553 47669 39538 25391 9791 13214 28829 19485 32947 64760
16351 64760 85210 42002 -51062 -54225 -4912 28237 75604 71207 4445 -28258 7189 3003
16339 3003 -15022 -9707 -43136 -23791 8660 14051 -34670 -49790 -37089 -54843 -54148 -2412 -12386
16326 -12386 -17101 -10891 -37351 -29301 -41139 -22875 -19321 11854 33004 36747 31465 -2779 -26389
16313 -26389 -17994 10153 24599 -10272 -15592 30640 18230 -21291 -64490 -85947 -51111 -25506
16301 -25506 -38300 -22634 -51197 -60452 -57788 -53472 948 47288 46094 26190 5945 15670 16077
16288 16077 59951 70008 99813 126070 80496 18891 -9039 14886 51313 41070 -9816 -16738
16276 -16738 -32985 -39834 -5732 -6547 19586 47133 72587 83357 19937 18289 6342 10271 29665
16263 29665 27657 20379 44330 46453 9383 -48253 -83829 -107332 -51358 245 -4516 16360
16251 16360 19021 40335 41168 39438 49149 54429 51604 13615 -14964 5411 -17204 -36059 -8722
16238 -8722 -3579 -23431 -11154 -3971 -11205 -30459 -43307 -35948 -19494 10193 11767 -22077 -26876
16225 -26876 -2266 -11571 -16555 -9172 104 1257 2004 -44429 -18447 -29940 -63510 -44072 -7192
16212 -7192 26023 -19045 -23303 -4933 17143 53387 36542 2467 22634 -941 12988 39678
16200 39678 6429 -892 -30131 -12962 26803 30934 13774 13618 30360 18994 15126 66663 66416
16187 66416 46133 19728 31568 65834 35992 1541 -25531 -3983 4482 -28058 -5318 53834
16175 53834 14504 -6174 -55170 -83153 -85183 -67484 -23773 -23000 -28481 -34334 -36019 -33031 -41525
16162 -41525 -30700 -588 24893 -40937 -91584 -52379 -43649 -22445 9608 -21095 -29746 -14530
16150 -14530 -55949 -56312 -44722 -38172 30978 19030 -6083 -27458 -4293 -9476 -50833 -66979
16138 -66979 -63416 -70364 -65161 -72751 -73771 -50727 -20396 -21025 7774 32378 18604 17775 37829
16125 37829 53398 13263 6023 -18328 19877 11718 -10726 7239 -39070 -58401 -30429 -11708
16113 -11708 -21107 -11417 12784 26710 43674 17161 -63529 -65315 -36301 -33443 -49067 -49231 -48816
16100 -48816 -41790 2397 10743 38592 52917 31836 9196 60958 59404 52642 60219 23760 3644
16087 3644 13255 29509 42106 23266 15528 -24678 -62165 -64563 -77854 -94346 -90842 -52330 -23432
16074 -23432 -9069 15048 -532 17832 -13538 -52906 -37809 -24245 -31168 -30511 -8498 -4272
16062 -4272 7530 5356 -44025 -40030 -32103 -20648 -23479 -70073 -72879 -76410 -74510 -55035 -26716
16049 -26716 -22552 -1969 -44039 -50588 -79691 -57852 -59603 -58472 -64059 -9003 2366 18176 35177
16036 35177 -9201 -70165 -88582 -86558 -12413 28958 831 -26648 -16482 13 -53430 -30115
16024 -30115 8007 9916 19813 -16930 -22764 -31221 -50 937 1622 12304 33175 36527 -9965
16011 -9965 -19425 4502 -4320 -14169 -37240 -2339 33208 4279 -10011 15857 33172 37277 56252
15998 56252 64063 36276 47748 71795 70933 32899 35151 9537 -3696 38190 44685 25531 10219
15985 10219 -57591 -43271 30200 57279 58569 81257 105589 60982 2987 -44077 -31201 -19617
15973 -19617 -26200 -41283 -77334 -55243 -53854 -20030 2871 -17615 -37179 -37111 -76359 -98559 -68446
15960 -68446 -78423 -43086 -39559 -62079 -48092 -51648 -15882 9639 10682 -18618 8873 38570
15948 38570 22506 27787 -2341 43752 82353 43184 10024 19694 2804 -25771 -54609 -39798
15936 -39798 -14998 13101 -8891 -81179 -126011 -67318 -17470 29273 -2084 -33284 11994 42716
15924 42716 35923 30301 21386 -1595 -6878 20746 31200 5079 15902 31744 23910 23105 12535
15911 12535 -39848 -44481 -13341 -58057 -42935 -57888 -72101 -57220 -42299 -8689 -31723 -54065
15899 -54065 -56751 -64240 -36065 -5507 9041 -17303 8306 26163 2740 -9474 -26048 -48941
15887 -48941 -68335 -63158 -44476 -34980 -34757 -91873 -75200 -71778 -95328 -108523 -100576 -67134 -45416
15874 -45416 -14899 -38327 -29537 15106 2171 -34992 -51004 -81378 -61213 12242 913 -1024
15862 -1024 18664 -11736 -28153 -31008 -20800 -68508 -83847 -33440 11890 15536 5722 -7448
15850 -7448 -18990 19504 8161 23586 -4528 3304 77506 123873 96357 29219 3970 -7458
15838 -7458 -36587 -10020 39915 90502 109045 74123 10342 -16237 3947 9270 -32587 -81061
15826 -81061 -73947 -37585 -31550 -35890 -22191 -50818 -88739 -59419 -70153 -65258 -77197 -57380
15814 -57380 -25394 -9136 27092 69677 87423 71579 46010 19532 -12394 -55961 -32122 -553
15802 -553 38975 56813 58386 12645 -29117 6389 3067 -21224 -15846 -6246 26825 22791 18044
15789 18044 19869 -21151 2042 -30302 -48019 -13752 15629 13337 25396 36710 23569 -19406
15777 -19406 -60919 -46664 -23250 12879 17050 -591 22370 18272 -32925 -34764 -24491 24665
15765 24665 23836 27019 19980 -19585 -26332 31670 68852 60471 10765 -63120 -76643 -52062 -69346
15752 -69346 -20918 30183 18511 37084 33443 653 -42986 -23219 9508 -137 1603 19791
15740 19791 26208 10223 3331 37817 6101 -20017 -36898 -62666 -63372 -54391 -59513 -18850 7305
15727 7305 13882 52044 43039 6512 -44958 -44263 -49370 -30721 -47077 -52463 -21115 42555 23723
15714 23723 -62969 -79541 -28397 -216 3167 6335 20220 24066 7922 -1161 -36058 -10709
15702 -10709 8627 14886 10906 9101 25745 36444 11102 -46459 -74634 -43637 -3410 33921
15690 33921 2455 10053 35939 -19617 -63727 -61038 701 68870 60223 18977 -7839 -11419
15678 -11419 15685 13890 9572 -6106 -17275 6001 12235 -18099 -26336 -14910 -62196 -74559
15666 -74559 -78292 -44096 -24440 -3110 4799 -24574 -42785 -42028 -32045 -20610 2552 24684 19895
15653 19895 12617 38676 49786 -35764 -63844 -53641 -13950 -40890 -17546 -19862 -39072 -29244
15641 -29244 -5498 -1049 -1923 1184 12484 26130 44254 12184 23998 35758 3141 -6367 44635
15628 44635 24525 10654 -16109 -44120 -34530 -18852 30022 22545 7546 -33729 -94740 -87255
15616 -87255 -66697 -18810 30182 17462 -29162 -69560 -62514 -32582 -24593 -987 10142 36330
15604 36330 32359 15533 -28299 -32836 -44626 -41711 -29203 -32122 -20310 1825 17617 40058
15592 40058 43056 9627 -15130 45078 39444 -14111 -36350 -32473 13177 31021 47957 23064
15580 23064 -2450 4340 12720 -15547 4548 52221 41628 32787 41813 51433 62106 102893 56862
15567 56862 1733 -21007 -22066 -49520 -47894 -72305 -30063 28143 24468 -18294 -70824 -87386
15555 -87386 -82748 -55588 -9246 -27689 -76307 -69419 -46942 -44744 -38772 -34190 -6435 1707 23487
15542 23487 50358 4723 -55734 -66566 -68068 -33160 -2714 9717 -9704 -38282 -49932 -31203
15530 -31203 -17783 -1041 -1384 -44858 -11629 -13654 -46444 -58007 -41416 -54638 -79072 -114781
15518 -114781 -108787 -56542 -42268 -47895 -46149 -16582 -32219 -793 8833 46127 45402 41253 83471
15505 83471 82758 75794 67014 49581 3765 -34198 -18824 -26473 -74016 -63343 -34354 -43110 -32935
15492 -32935 -8344 -49438 -37814 30899 48633 37013 43040 57932 22498 -5222 17838 24822
15480 24822 32860 24791 18680 -6606 -24532 1844 9861 -31474 -55291 -53801 -5325 -9775 -30692
15467 -30692 -4889 8119 16337 1690 -28297 -18580 -49956 -77277 -68263 14379 39850 9613
15455 9613 20687 39866 11972 -9183 11948 55468 47369 40250 31093 -7947 18510 45276
15443 45276 13016 -17536 3129 48640 37808 5771 14498 35838 22873 -19235 -42764 -36025
15431 -36025 6013 -21883 -39949 -61311 -25496 -16783 28447 -5904 -27853 -825 -9254 -69821
15419 -69821 -83714 -45190 4897 28109 7099 21755 14124 -8682 -41458 -71635 -80360 -83195
15407 -83195 -18933 -27907 -30522 -31229 -20920 -14867 142 -5301 32933 74499 80634 51884 36839
15394 36839 35704 3947 -15024 2338 1176 -1525 -24521 -49340 -53693 -37660 -11917 2192
15382 2192 -36048 -52302 -21361 -29343 -52519 -48327 -34794 -40888 -36164 -52147 -71280 -94514 -117688
15369 -117688 -125864 -85435 119 8418 -44611 -67029 -54590 -32791 -17991 -36619 -38366 -28941
15357 -28941 -24677 -15369 -19045 -10858 16822 9425 34289 38362 23666 12863 -1240 -6323 -40794
15344 -40794 -52341 -14768 29004 31427 39144 21029 19730 21878 36702 73933 61977 65611 23305
15331 23305 15744 34918 68518 56293 66431 34488 -20285 -62022 -30855 19059 45047 77221
15319 77221 64476 53215 42908 24855 40421 34711 30520 386 -35574 -20679 -21335 -44297
15307 -44297 -20998 5754 10347 13649 -12937 -25513 18579 25508 32082 59611 7092 -42675
15295 -42675 -1102 43315 -5731 -62114 -76159 -90666 -91164 -70108 -11582 39460 63059 59327
15283 59327 27148 6413 44562 16488 848 -41178 -18987 2118 -19218 -2202 3677 45436
15271 45436 87050 74466 43184 272 -18438 -14111 -17749 -25550 -48780 -59980 -18530 -30694
15259 -30694 -62694 -48235 -19203 -5972 19967 21319 6719 6101 -24370 -69699 -65301 -36667
15247 -36667 -61193 -77706 -28096 5943 30091 30668 34932 -12417 -51215 -112625 -124750 -93233
15235 -93233 -88185 -95987 -80759 -54366 -64725 -76975 -47309 -24451 -6720 -10421 -19532 -25288 -7694
15222 -7694 -3101 24427 62901 57604 13309 -21026 -23371 -27067 -62852 -83270 -33120 27642 -4125
15209 -4125 -7251 -7799 32362 28592 13502 43281 66377 22995 70878 96800 37860 33578 35745
15196 35745 13794 18207 17746 24071 56279 46279 -3512 -49012 -63206 -41685 -5408 34268
15184 34268 46104 43013 38902 35719 25778 10791 33056 26445 -12801 -11562 -2646 8887 381
15171 381 -15051 -63739 -69759 -58494 -45056 5656 -28632 -36475 7636 13999 46886 28505 -13304
15158 -13304 -8028 -56726 -77569 -90807 -64136 -66869 -61250 -20163 22244 59167 66040 43477
15146 43477 22931 19830 17678 19743 32495 22302 6999 -27497 -36665 28879 45650 22125
15134 22125 37626 42372 29461 22369 29173 18392 15200 13631 21905 60276 35719 -6199 223
15121 223 45069 76660 60228 42559 2473 20665 72021 121961 108546 83535 85882 21421
15109 21421 -11310 3861 37390 57342 50804 21113 -19252 -39655 -32713 -11354 10242 -9578
15097 -9578 -25384 -4778 3355 -4103 23448 61447 32708 -6069 -1136 -39262 -29357 -12210 7044
15084 7044 23337 1639 -79442 -54453 -35736 5229 648 -10140 -5638 6811 -7323 -11074
15072 -11074 25250 26833 -21448 -33660 -7999 12901 25310 90526 49773 -22875 -45786 -30105
15060 -30105 -16116 5103 1171 -2933 13881 -33914 -47230 -21231 -13533 -28237 -30975 -36117 -6209
15047 -6209 -25358 -54179 -37433 -21874 9669 -20805 -26157 15729 51733 43544 31799 28507
15035 28507 36520 63869 97901 55415 35767 15459 12715 38329 17263 4202 -17921 -45181
15023 -45181 -57665 -30680 -21083 -24963 -15730 -9799 -57698 -62426 -65653 -76935 -98412 -75679 -20890
15010 -20890 4794 3734 27498 22572 1547 6411 621 22006 48087 25609 -21187 15578
14998 15578 24821 16999 38310 45109 21000 2838 -35545 -17709 12116 17646 14574 -29412 -43513
14985 -43513 -16471 1692 18203 -23830 -31301 2090 45335 35152 15055 -14703 -57881 -63566
14973 -63566 -24675 -32798 4969 3141 -36276 -43672 -42688 3661 59923 51020 46228 7886 -5729
14960 -5729 -17051 7329 4488 15086 -2489 -26202 -25406 -36394 -35888 195 2128 -31971 -37655
14947 -37655 -9460 10251 14834 15587 23663 50147 83364 64074 49208 30304 67612 48316
14935 48316 49991 46296 7404 -9652 -15725 -22880 -9198 3662 -43298 -60048 -27630 -28715 -33972
14922 -33972 -3682 -37294 -50202 -13204 24016 -801 -10493 -50727 -37879 -12005 14027 17744
14910 17744 47502 42139 18993 24665 46516 41002 14286 3323 -23547 -40585 -61549 -65329
14898 -65329 -42983 -3206 9995 15407 23779 3465 4855 36512 23402 -18854 -13264 -17006 -67986
14885 -67986 -40961 -39396 -46606 -48586 -29507 -752 17482 49019 70508 110676 166748 168915
14873 168915 137184 108693 83904 73620 23193 2638 22786 79388 87468 51880 30626 39598
14861 39598 18858 22332 22699 15736 54486 87685 106635 66395 31622 31633 32668 32756 36449 28055
14847 28055 32773 28195 -11054 -28285 -37397 9632 36419 12510 5371 -14071 1624 -10292
14835 -10292 -16737 -33196 -29918 -29211 -42219 -18718 -11755 -841 29532 28339 -39177 -90191 -84732
14822 -84732 -65363 -48274 -18644 -1887 -26556 -16029 -25363 -40077 -27993 -21326 -8169 20620
14810 20620 20991 28282 37484 -3214 -46603 -26629 14897 -9832 -64083 -106808 -124384 -119242 -73720
14797 -73720 -25896 13533 12847 28452 93594 119074 115637 130530 184245 291804 426811 568949
14785 568949 723836 981900 1209245 1310149 1318825 1190431 949253 704453 504359 393825
14775 393825 309907 271095 251607 152902 100449 127086 126664 97813 52052 71724 65969 8025
14763 8025 -46788 -93731 -89003 -73644 -50002 -16311 -42939 -89736 -46634 29466 90372 110053
14751 110053 105515 118681 100954 120626 160234 167765 133509 72392 37027 27043 14837 -4432
14739 -4432 26337 59631 98962 93099 107131 74527 44357 62367 83322 77996 77690 111119 72701
14726 72701 48583 94462 111802 75932 54051 48972 70515 53776 14388 11652 42476 49389
14714 49389 53498 35619 27316 11753 37625 80790 75554 31407 28408 11983 -16500 -25981 -45119
14701 -45119 -8031 -16791 -26977 -2806 -4479 9745 5427 10598 42820 54721 -34650 -41790 -55028
14688 -55028 -75761 -51889 42458 84565 34012 -1891 18549 32475 23956 16662 5983 -15714
14676 -15714 -37508 -34162 -1289 14711 48218 53498 77187 92539 69747 38704 49867 57051
14664 57051 31081 30653 51663 25385 -14676 5502 9451 -12681 -5328 -9568 -8038 37847 36016
14651 36016 16164 5033 -25731 -3285 -5111 21443 16428 8153 31726 72132 108313 96330
14639 96330 71505 84406 111297 102337 41284 53746 75085 41956 50653 43526 22521 -15313
14627 -15313 -33914 -32451 27804 64915 73824 53269 25264 62772 56355 72224 78457 67732
14615 67732 15614 21667 30360 36142 37427 79791 113090 109261 89315 102185 111233 118625 125178
14602 125178 173804 187422 193612 220385 236581 212942 168581 180670 199825 273144 403440
14591 403440 537289 738604 1075719 1624636 2291889 2737794 2789439 2501737 2017698 1497450
14581 1497450 1039173 740940 614049 511088 446193 431569 398009 313189 265288 278291
14571 278291 214914 190901 203057 150060 114137 60744 23209 37402 108092 111933 96272 111495
14559 111495 124546 123841 107353 79858 71796 27287 49376 71192 72265 75218 121221 174361
14547 174361 207940 226531 191837 158265 108298 80836 136876 216854 198136 78941 51216
14536 51216 108711 123282 127306 127435 78137 61137 84470 145372 161996 171560 125377 103681
14524 103681 128851 99213 71271 16866 -12631 5219 78781 101912 76162 106328 137683
14513 137683 88321 88206 64462 54971 39610 26753 7433 -509 -31365 -64154 -29870 38877
14501 38877 58739 55124 30592 -4254 -17717 -20610 10095 -28036 -84949 -90429 -68532 -11635
14489 -11635 -21812 944 12067 25134 70659 106210 135825 132832 140472 197906 266758 322011
14477 322011 287554 252934 278163 254454 201334 205988 235440 250259 229594 197727 127600 133496
14465 133496 142524 162038 169161 202407 274644 314028 318571 327710 315029 277583 291974 319405
14453 319405 306481 311597 309563 327627 332803 296749 248722 142601 55008 59393 89398 158510
14441 158510 231236 286170 281928 245269 253553 261863 273001 304195 332876 361344 344943 339125
14429 339125 352032 329162 347191 414547 422803 406762 450750 549611 636006 743408 816834
14418 816834 815366 812788 753033 626265 527082 484516 448584 439979 494846 614183 723208
14407 723208 756162 863058 1037957 1248101 1470734 1658446 1829503 2060563 2312780 2762353
14397 2762353 3421388 4409709 5920573 8367215 12431535 18779658 26620786 31751882
14389 31751882 32130865 29099469 23074512 16330282 11303422 8125216 6207997 5047894
14381 5047894 4288852 3732617 3410888 3226439 3089294 2956529 2885051 2824464 2838861 3008463
14371 3008463 3427354 4172190 5426890 7441909 10470307 13963139 16321258 16617434 15147806
14362 15147806 12423997 9306445 6790865 5091066 3977868 3267515 2780884 2470640
14354 2470640 2225059 2062820 1971557 1883911 1795057 1609169 1458873 1348097 1255858 1187247
14344 1187247 1174198 1140342 1158874 1154284 1092705 1085501 1090619 1104309 1120968 1137946 1128039 1140239
14332 1140239 1163817 1194155 1163730 1156173 1191638 1194779 1245576 1349042 1422008 1489388 1590522
14321 1590522 1711184 1844268 1978844 2177331 2349291 2489952 2695615 2972903 3279352
14312 3279352 3590044 4027949 4479784 5009231 5662940 6451014 7420198 8655498 10255125
14303 10255125 12032099 14037566 16213519 18566197 21419361 25331458 30882529 39239607
14295 39239607 52404329 73365984 107173252 160407386 229666357 282671586 294003123
14288 294003123 272715215 223822514 162462364 112666976 79852649 59208081 45939583
14281 45939583 36989347 30718165 26352094 23324958 20863875 18687377 16549124 14390888
14273 14390888 12459270 10828879 9551758 8574998 7764910 7052065 6418822 5912336 5521292
14264 5521292 5134326 4809473 4489276 4172801 3842312 3607463 3370585 3214797 3116868 2982405
14254 2982405 2840031 2750660 2613708 2456849 2282985 2136125 1968799 1836751 1695202 1568703
14244 1568703 1467771 1368508 1295112 1230139 1155563 1085113 1014728 940991 919904 884744 867759
14233 867759 835652 773864 708458 683425 657178 668092 651829 626206 567460 610035 616134 584807
14221 584807 579744 577883 584923 597087 593109 549314 515260 482338 436407 461592 485271 451021
14209 451021 417858 403741 388872 414067 406500 376325 390339 402877 392871 373808 408569 394451
14197 394451 378004 383749 367139 350984 394480 391948 425495 440839 417914 372624 345520 331416
14185 331416 323545 295395 244194 235177 288775 325881 343954 317866 301490 302561 292750 272856
14173 272856 303779 322962 330210 346923 357305 379853 414989 379929 324852 263248 171162 55492
14161 55492 -74068 -131419 -158765 -140266 -108910 -63071 -65652 -75124 -15663 17716 11355 39305
14149 39305 58550 68144 57016 61393 103114 137935 108315 93404 158414 184218 147843 179980
14137 179980 255122 348898 443000 549075 561414 441263 308174 198474 132645 102380 98084
14126 98084 61996 52494 15775 -6949 39146 102831 126064 77323 43389 32526 48013 71535
14114 71535 51923 8905 -19676 -49235 -8668 39366 8869 -45031 -69880 -59470 -96244 -113540
14102 -113540 -111423 -135839 -128851 -72440 -62318 -41159 2382 18630 36801 48646 66081 109838
14090 109838 127218 132536 150514 149673 154227 150778 169366 163555 123051 111731 123806 95336 85771
14077 85771 93447 63525 29168 30674 27304 8181 -11023 -25246 99 13922 63782 104252
14065 104252 140976 206233 214832 209841 166700 170616 133884 101868 119442 123400 65088 88494
14053 88494 83423 60895 75456 37867 24403 52500 75445 55238 65479 99117 101256 94976
14041 94976 74686 72549 42473 37863 40000 71251 49984 6671 22617 32624 5383 -580
14029 -580 -10919 -11526 49568 77876 57604 27638 7729 13860 10718 32615 18691 23960 4162
14016 4162 6819 52391 45079 31377 30557 -1328 -17617 -29545 37855 68929 112045 109494 91785
14003 91785 66020 55183 78118 72404 97590 115747 91925 46647 17129 9686 49137 85062
13991 85062 99215 69430 14040 -10967 2439 46929 55783 27740 -39230 -113162 -136403 -119670
13979 -119670 -139976 -143095 -108722 -105098 -60575 -10230 36574 17366 1351 26110 33783 58502
13967 58502 76037 82159 100576 104728 89318 70528 28350 24486 -4924 -20815 -22117 -17179 -6373
13954 -6373 51162 16144 3079 -13549 -17103 21936 47893 51236 28105 43720 26768 15744
13942 15744 1597 -9722 -7902 19935 16813 14856 -23713 -93958 -65406 -10455 38104 52343
13930 52343 54228 80571 70905 20093 23470 40017 18647 18210 25070 6827 22979 66611 37423
13917 37423 -6627 14902 43528 17060 -10386 9215 56115 21607 -10908 -30149 -10528 786
13905 786 7358 16723 64715 113868 104946 131651 121121 141549 159514 192934 216527 194892 162143
13892 162143 145734 113830 116599 98699 64651 36812 47364 56323 48198 68171 50372 11828
13880 11828 15682 15591 6433 6015 18069 26543 8041 -17473 -31163 2857 56632 85715 115250
13867 115250 153428 145171 157276 177699 136606 70394 64180 74935 74309 49661 30387 2749
13855 2749 20115 26792 -12957 -30964 -2221 14691 1733 -7088 -37964 -47995 -36978 -19914
13843 -19914 13624 24144 -7794 -31473 -33747 -30169 -30493 -22604 17187 58195 104452 117536 133716
13830 133716 110113 59365 20489 7547 35879 59278 108352 159222 126106 120414 101661 79826
13818 79826 98626 111734 120317 144927 149957 124829 99618 88822 124763 141632 120437 131752
13806 131752 141084 118255 180110 251747 346228 474564 614304 772423 939868 1076696 1161017
13795 1161017 1175179 1181681 1258061 1365599 1501307 1610088 1605736 1477099 1270976 1012902
13785 1012902 818242 636016 477478 380942 344572 319102 261732 190192 153889 166480 210748
13774 210748 153769 110391 99302 111753 109389 109744 94376 87142 70193 44635 46929 68219
13762 68219 61601 53344 58020 84913 107688 69977 8111 -4135 -815 6304 12060 26393 23788
13749 23788 26970 31562 21805 27492 42147 55907 46806 25901 10581 3513 40146 95419 133659
13736 133659 178346 120728 68897 58299 64519 86995 52288 -4048 -12397 -7431 -3964 17077
13724 17077 37549 42724 26524 9213 9991 -4416 -26867 -6424 -5366 -55379 -71505 -81558
13712 -81558 -65445 -27503 -46131 -59410 -43945 10830 73056 89780 105586 104545 77812 43597
13700 43597 32347 40475 -6554 18863 39213 14650 23611 15401 23539 50574 38381 66527
13688 66527 69414 66365 42201 4191 -11427 -29872 -65150 -29478 -5683 23500 5791 -38657
13676 -38657 -73078 -51327 -5030 45224 88676 84931 37436 26129 63833 94888 80441 31554
13664 31554 45084 54142 44904 1344 -35459 -752 52253 44550 11649 -6665 -1132 20290
13652 20290 -22267 -35809 -23998 -6328 19951 2496 -36967 -26375 32730 64367 65073 55834
13640 55834 65133 63092 38036 37030 44661 62828 62446 79097 75019 33533 21013 43242 -12549
13627 -12549 -4300 -5819 -8029 -20880 -15587 63834 70287 52465 51879 41897 -13279 -16358 24299
13614 24299 40925 19850 22898 21427 -33026 -31609 93 -9470 -21028 -50728 -11692 7250
13602 7250 1512 4245 54403 40919 37710 66044 76265 52484 55713 46931 31589 46254 42330
13589 42330 20813 67597 53147 41636 37264 29950 22945 62549 50865 56079 24355 -2536
13577 -2536 10754 16721 35329 49639 63343 33588 350 -4691 9151 -18480 -8516 27791
13565 27791 50161 49097 94315 106554 76942 45834 49635 64742 39511 43401 60129 40979
13553 40979 23552 29412 9581 -10411 -21260 -49930 -37200 26812 34327 -220 -23907 -19648
13541 -19648 3892 29773 25164 -3232 -30692 -87289 -94797 -50047 18462 26193 237 -39459
13529 -39459 -48268 -62899 -63075 -35642 3857 -9680 2182 -29763 -46113 -16004 -13396 13221
13517 13221 26694 41382 61481 54998 81643 71247 35048 -14021 -55357 9517 69117 75491
13505 75491 101169 68071 57124 42414 41359 84072 50179 -8248 -50247 -41158 23067 41747
13493 41747 49911 42178 21722 52601 86499 42749 -1743 -51053 -31601 -46813 5708 29072
13481 29072 56820 64025 -18161 -35229 -15711 -3266 3381 -5821 -27646 -46475 6334 41676
13469 41676 63896 52266 69442 43220 -879 -18326 -8872 7653 12011 8642 46040 62408
13457 62408 63791 75794 37323 -1 4764 21788 7466 -18763 -14428 -31484 -20712 -44576
13445 -44576 -4824 6692 -23826 -6982 19406 11723 38887 57092 19563 -15841 -13180 -49951
13433 -49951 -93882 -50105 -47570 2327 18877 -10212 -22275 15989 39140 40325 67936 76028
13421 76028 61754 16771 -21342 -14384 -16750 -17920 -15235 22183 44702 34678 32292 23077 13149
13408 13149 -16637 -29823 -52673 -52695 -10760 9094 -2791 10531 20460 38287 61350 40420
13396 40420 -1910 24493 15292 15930 29886 31795 16708 2714 -19550 -63741 -74556 -53152
13384 -53152 -3326 -9824 -56678 -73730 -53093 -72750 -35839 -2095 -43561 -48216 -17455 26134
13372 26134 -35792 -73115 -11717 -269 -51569 -30445 -6163 -36098 -34022 -32769 13505 27550
13360 27550 -3455 22869 35821 33838 27380 2215 -26441 -25577 -28592 -3879 14110 11199 20512
13347 20512 19969 41805 12436 52108 103609 79589 27325 -5279 -17600 -40740 -48882 -21746
13335 -21746 2308 3250 -29032 -80947 -55766 -13687 11097 33325 12367 -5592 -17856 -45067
13323 -45067 -47563 -41954 -45726 -8026 10898 6224 38065 26396 -27980 2724 33213 19024
13311 19024 12986 48812 82168 96113 110144 102886 74718 62857 77513 28484 1511 58894
13299 58894 73496 68363 22708 12029 10810 13376 61198 88248 71410 30568 9904 -7939
13287 -7939 -14810 -36162 8452 16716 -21498 -2988 47966 50801 20160 -12827 -45509 -76575
13275 -76575 -72279 -55114 -47600 -68283 -61063 -34080 -24551 -50513 -59808 -20741 5182 1772 16397
13262 16397 4459 -10831 8299 6433 -7319 1984 -6407 32196 36488 43125 55162 53694 28561
13249 28561 13601 2503 27161 4470 -18645 13738 20715 21693 12012 8164 20978 56267 47821
13236 47821 30885 31871 2641 -10467 14983 26287 34948 41534 48756 54287 61585 56335 55905 61011
13222 61011 67793 58739 61411 25525 14092 59178 61250 20857 -27284 -3890 47387 76913
13210 76913 71405 91136 113818 121379 131147 119357 94709 53413 23619 -1856 -16607 602
13198 602 46352 36394 -13978 -41142 8315 6182 -22039 -22336 -36576 -61255 -66117 -57789 -5733
13185 -5733 37989 64256 50748 -21783 -46804 -17107 -2206 -19667 -30344 -26237 -30067 -63754
13173 -63754 -58228 -44565 -21013 19195 81478 127048 188336 288106 305727 305306 278792 262122
13161 262122 182461 90108 45168 15827 -8958 27946 28635 43754 91497 92310 67527 50508
13149 50508 33292 -13999 -48498 -29804 -13662 -41264 -58673 -82436 -82289 -40301 -21478 -28117
13137 -28117 -48186 -41006 -14169 17975 20865 -57344 -52688 -16794 18894 27637 29879 69198 122807
13124 122807 173875 221610 248748 274042 316883 389977 348953 318713 230227 169060 115126
13113 115126 42644 48198 67798 59852 70894 71357 90649 62095 43851 34762 37650 21033 13296
13100 13296 38125 38950 1119 6873 -3036 -59123 -62432 -34055 -29960 -31117 -51318 -67583 -48849
13087 -48849 -42618 -20978 14812 35558 36416 31718 37543 7285 -604 17507 6777 44741 102187
13074 102187 96723 132850 151753 105508 63965 48729 38885 33731 25764 -3221 2705 -10606
13062 -10606 -19406 -44098 -81140 -80559 -86337 -73953 -32021 -3857 -16778 -56814 -36072 3577
13050 3577 -26948 -59960 -39333 -34171 -7958 -25054 21118 85462 84260 64419 43945 4717
13038 4717 -23966 -27681 -79345 -106767 -62861 -23533 -19581 -4233 9742 -17969 -7507 -37322
13026 -37322 -18691 -17478 -8590 -10335 -10340 26324 16714 37452 64928 47576 45254 31802 6594
13013 6594 -4311 -17483 -11246 -11254 7901 49636 29201 24394 36000 1039 13808 9979 135
13000 135 3402 22467 65227 46324 5908 2865 -8380 -45438 -20832 -11294 10954 4659 3949
12987 3949 4929 -2071 -46167 -53581 -59165 9742 19596 19951 12413 -16743 -11066 11491 64052 34500
12973 34500 27475 59845 30390 8842 8228 32303 9066 -51026 -50224 -18841 18525 33682 70352
12960 70352 49551 5609 -14780 -13861 -28893 -15727 -35009 -80573 -138480 -123921 -103025 -51357
12948 -51357 -22418 -47548 -69069 -40761 -38313 19105 1809 -14290 -4777 -21683 -12574 -27243
12936 -27243 -48747 -67986 -25716 3840 19251 28364 15155 3683 7968 10553 25083 2383
12924 2383 22695 12162 -14760 -7356 -14209 -7879 13 31223 89527 128075 116049 73698 77009
12911 77009 101897 72990 68175 102484 87145 100809 153364 198044 215380 228711 282794 375173
12899 375173 392926 403399 364706 386714 496171 674107 958170 1267370 1475401 1531102
12889 1531102 1427231 1213389 924440 675803 505407 374326 285180 234185 195265 117789
12879 117789 100171 96623 113798 80363 71394 86161 114559 129578 105062 121514 118222 65690
12867 65690 41088 30995 52363 82149 96269 78739 43384 -3538 -6467 44258 37345 28088
12855 28088 47336 46983 35803 24740 2786 5092 -20200 -38340 -32269 -47911 -34701 17600
12843 17600 13933 21176 -1589 9926 10712 20543 14823 34423 61940 63934 35605 27055 36285
12830 36285 48760 -13448 -44996 -26420 -34229 2264 6094 4227 -4491 24621 8479 -35704
12818 -35704 -55398 75 12780 5566 38947 16170 11513 -2946 2288 6665 64247 91254
12806 91254 76093 41099 10297 6900 -4084 10090 31557 -8805 -5825 9836 26921 30016
12794 30016 67040 103055 92535 52374 33703 23807 -26569 -57070 -10230 18151 -11460 -15504
12782 -15504 -59265 -111170 -132099 -105623 -83698 -60377 -41862 -52500 -42149 -40530 -41015 -5629
12770 -5629 -33659 -28150 -19619 -23659 -9790 -8625 -21308 -14288 -33390 -50890 3404 -5726 -34995
12757 -34995 -67328 -70158 -48720 -7484 -6464 21716 22864 47805 48950 60299 59413 39922 43219
12744 43219 9710 -12339 -11267 -14574 20577 52255 2211 11793 60003 13057 -17209 -38753
12732 -38753 -66542 -28116 22889 39697 15360 4199 -15105 -32342 -64003 -19606 15617 4192
12720 4192 -2164 -4841 38763 97946 88044 38535 15523 39460 13855 44991 59280 57070 43220
12707 43220 14783 18933 50096 22006 -22882 5275 18498 -4653 -57120 -11904 37027 60077
12695 60077 55951 41168 38792 -7384 -42322 -51621 -27052 -27775 -4948 21017 39300 21531 4158
12682 4158 11870 8353 27079 9409 13171 12247 45474 33309 17100 46094 84109 64424 72595
12669 72595 103318 87977 65682 55904 52893 32526 -12360 -10165 -6749 -44633 -55780 -38839
12657 -38839 10726 19360 -13046 -45032 -36534 -21552 286 63420 72023 48797 2260 -40555
12645 -40555 -31054 29052 -9321 -5459 34248 29405 -18632 -54538 -43228 342 12752 15633
12633 15633 47749 17590 -7485 938 45628 51715 30544 -3522 -10723 -11636 -9951 13862 30431
12620 30431 25854 36843 36977 23691 56958 56571 15407 15941 4999 -27147 -22641 42068 36680
12607 36680 26034 47814 14488 -2155 -17333 -23040 -59574 -83317 -42855 -25573 -54238 -71698
12595 -71698 -55349 -39482 -46078 -67264 -26271 -7834 -31119 -14688 1633 9365 21183 47532
12583 47532 70171 47401 31313 31826 45152 57849 36582 15452 25340 21105 -3542 -21176
12571 -21176 3359 23548 240 646 -32179 -58543 -34084 11575 60171 69600 49353 427
12559 427 -20059 -32244 -7156 5080 12577 -25943 1780 25179 40898 25986 7447 22323
12547 22323 9934 3087 3579 25856 22600 -28925 -8117 17376 -28020 -33292 -24844 -15514 -85234
12534 -85234 -108133 -140401 -135110 -70042 -19253 9493 4679 -30048 -68650 -61414 -94475 -69066
12522 -69066 -27764 -31810 -12608 6190 -6483 -28914 -11570 11178 24737 28564 15267 -21392
12510 -21392 -26370 -17563 2448 4033 17280 29077 24112 25566 10039 6717 22167 49952 42786
12497 42786 -7613 -45829 -67368 -20582 26075 51563 16647 46722 19246 -9042 -18625 -42627
12485 -42627 -51468 -34848 -37882 -57919 -65292 -31665 -27917 -5462 23694 29601 -9931 -44001 -49284
12472 -49284 -65144 -50490 -90598 -89251 -49761 8544 9994 -7578 27061 20201 -22809 -20379
12460 -20379 -6163 -48318 -58948 -31532 -38109 -54609 -73308 -48933 -5912 -13817 -79603 -90358
12448 -90358 -71691 -10739 53135 60308 32378 -9228 -49928 -83397 -79901 -49146 -34375 -22559
12436 -22559 -31002 -22691 -41666 -46429 -6963 -19078 -39694 -10955 831 -32102 -28629 -68325
12424 -68325 -67008 -46886 10638 45181 17482 38672 54284 8211 -6438 13257 23999 8655
12412 8655 -23055 22220 69217 9043 -10775 -15528 -15816 -15813 -15303 21919 7490 -54962 -61107 -57459
12398 -57459 -52709 -28899 7505 -25965 24990 43061 28706 24308 -13650 -49268 -11560 46949
12386 46949 66088 49897 61605 54534 59171 20475 21964 41767 8102 -66947 -87139 -34900
12374 -34900 12122 15932 -9370 -39909 -54748 -50073 -33457 -25825 -42770 -14059 -4206 -46434
12362 -46434 -56230 -45200 -26820 1986 -13263 -36451 -15788 -18916 -42663 -26675 -28819 -44816
12350 -44816 -41724 -24512 -641 12619 19030 -12561 -38050 -46859 -19237 16094 -51508 -72045
12338 -72045 -53266 -17308 8497 33314 62443 66412 22127 13573 27482 35511 33684 52474
12326 52474 31731 32095 -18895 -23832 -800 5727 2765 -50024 -28595 -40784 -46552 -11153 -27190
12313 -27190 -18143 -19707 -29588 1531 62458 44268 33323 21370 5388 -52408 -7428 5121
12301 5121 -13808 -16125 -34905 -25694 -29383 -29701 -41654 -21740 -13163 -43323 -32065 -19827 -3000
12288 -3000 -24972 -26634 -47503 -74015 -48499 -17455 24536 53077 69656 57141 18858 -7171
12276 -7171 -9686 25246 30806 3831 -30365 -44562 -36559 -25198 -37616 -61181 -7817 15826
12264 15826 13493 2638 13595 40742 702 -13967 -16263 307 57 -9287 -38457 -31825 16221
12251 16221 46331 66490 36084 5597 7954 45164 41112 40096 83385 88110 81669 112018 78784
12238 78784 53702 62705 47405 14351 -16235 -15322 6278 46785 52173 36381 15355 -188
12226 -188 -8334 24376 39768 21195 3035 -13273 -12378 -5179 -12839 -10739 -33894 -26756 -19883 -30821
12212 -30821 -54450 -52996 -51084 -59115 -45895 -14402 -9119 -7092 27416 45188 49207 30171 38699
12199 38699 33454 34625 40112 50855 44180 29077 -56 -9838 8965 7899 -38328 -55165 -35209
12186 -35209 -10133 -17622 -36395 -43003 -29179 -43346 -34882 -5607 11492 696 -22101 -1744
12174 -1744 49326 33743 -9661 -27551 5567 34673 13909 23585 16564 6261 -4496 -31654
12162 -31654 -36450 -57585 -73463 -77528 -23336 -24736 -36913 -24771 -19135 -22822 -17424 1388 -30620
12149 -30620 -64490 -66162 -70086 -32057 -34708 -22069 3774 -526 3563 -16648 -14597 39465 44700
12136 44700 19570 38992 49680 34005 62874 41902 13709 21737 33640 29424 -14249 -52145
12124 -52145 -3656 18341 18486 9614 -543 20294 13180 -3682 7479 31366 4738 29489
12112 29489 65219 72101 15712 -26683 -51341 -44923 -46018 -36927 19695 62620 74491 60704
12100 60704 -8097 -23873 -37824 -41982 -45968 -73460 -75420 -67308 -61002 -32041 -14502 -40180 -69681
12087 -69681 -37315 -14738 -27719 -9157 -1601 1833 -2010 -277 -42373 -51825 -29903 -18364 -28079
12074 -28079 -17377 -27239 -52478 -35110 -23239 -24640 -47761 -49031 -58845 -18018 33038 50075
12062 50075 43097 26786 13536 25140 7529 -7245 -23774 -38785 -40451 -16397 3083 -4812
12050 -4812 11917 2577 -8043 -25148 -46965 -65829 -70618 -74251 -41431 -42591 -16640 -12178 -31675
12037 -31675 -8724 26896 41513 97161 119151 75577 33171 40422 75202 32906 -70646 -94495
12025 -94495 -97933 -17257 3426 -11485 5703 29428 -6066 -20420 -11940 721 -12469 -30811
12013 -30811 -13503 23690 40493 43683 44428 -19990 -54262 -74225 -80737 -58042 -35227 -59601
12001 -59601 -93113 -77815 -25632 -4660 25274 29202 4285 9614 -33641 -61620 -58131 -33602
11989 -33602 956 -3779 -59199 -74559 -38073 21468 31830 13964 6671 -2495 21776 28952
11977 28952 53650 68945 52922 12989 9863 648 -1549 -24076 -4560 -14514 -24286 26208 49132
11964 49132 19001 16473 17666 38167 56356 51631 50179 57260 72318 82401 73572 36591 -5423
11951 -5423 -28781 -41335 -38060 -35006 -42499 -30244 1534 26043 2903 12339 -22060 -46997 -21627
11938 -21627 -8256 -42063 -17002 -17614 -7948 -6596 -12481 -57230 -10694 65659 84605 70427 27994
11925 27994 14297 23119 17139 17924 18228 22103 18847 -1295 7550 21322 24546 5623 -11383 -37073
11911 -37073 -55395 -24488 -13568 38945 111946 90346 56618 31014 -8844 6549 14162 -31783
11899 -31783 -68807 -82866 -30822 -4780 -40558 -49783 -8004 15777 -8041 4593 3464 9468
11887 9468 31192 39667 3547 -43132 -55095 -36067 34725 48953 -582 -9779 -9145 23384 15624
11874 15624 -48534 -76730 -88910 -94343 -50204 -150 -5889 -10577 -25251 -12138 -50032 -65634
11862 -65634 -53997 -42388 -26419 -55787 -89491 -71799 -6185 -14453 -42463 -12088 -559 -20450
11850 -20450 -14825 8514 53387 42010 -3346 -25865 5417 29095 21151 -17700 -35218 -50328
11838 -50328 -15996 18567 16496 -17861 -9652 21541 79162 66690 21832 14942 12444 7219 -24123
11825 -24123 -30593 -23998 -17607 -38284 -40057 25255 49945 59991 -6006 -27986 -25488 -23800 -37411
11812 -37411 -45651 -56279 -53576 -17052 755 -3416 -46234 -94727 -53807 6061 -1625 17680
11800 17680 43788 13437 -15930 8995 45411 33161 -5357 -18550 26 6182 34759 38318
11788 38318 32840 3742 -5370 -23429 -56428 -84566 -31345 -13124 -27847 -44039 -14953 -17592
11776 -17592 -13471 10605 -6701 -21539 17894 25194 30388 2446 -42297 -30136 -36600 -36580 1936
11763 1936 3443 -6225 -44164 -64620 -75705 -68812 -64606 -53365 -265 31453 23369 27275 -17753
11750 -17753 -23911 -32603 -53766 -35811 -31807 -26544 -30144 -27064 -38767 -814 -9169 45416 64652
11737 64652 56307 15387 28419 22313 66409 75939 62193 13674 -34642 -60570 -95052 -98729
11725 -98729 -60922 -27055 -38710 -24680 -20014 42673 38184 21125 19883 47675 35382 9655
11713 9655 28355 30549 45544 38923 17391 -1619 -36443 -70689 -75102 -56167 -49095 -37252 -20431
11700 -20431 -6473 -10862 -29822 -14860 -47597 -28289 18787 10744 5195 -54834 -29430 -8745
11688 -8745 -10281 10492 -9017 -52805 -28634 -8305 -13460 -15367 -29983 1628 37782 32601 30398
11675 30398 32170 9241 24979 62961 91671 75878 -1087 -34601 -49079 -21203 3528 -14819
11663 -14819 -15204 4704 8881 41022 59417 33422 13550 40264 32030 -10977 -15027 50515 107925
11650 107925 92593 63436 44712 65785 88924 61795 -4633 13557 46357 45713 -13078 -21441
11638 -21441 -26608 -45694 -49474 -12777 -31873 -40510 -8403 -259 -18014 -49481 -33829 -40477 -7918
11625 -7918 -12522 9959 29278 25275 2981 -6626 24706 38693 44036 43254 9395 8250 10882
11612 10882 9427 10724 16755 -5919 -22500 19380 62807 75127 67351 36565 -11811 -18217 6783
11599 6783 29107 -3150 -21713 -8093 1359 3428 -20655 -63868 -95785 -80711 -59325 -56416
11587 -56416 -98723 -99636 -84110 -64322 -65480 -45917 -19574 -26797 -36134 -21617 -40361 -31360 -13132
11574 -13132 -35997 -6915 56353 28885 -29171 -12893 -5422 4539 -21827 -22400 -18872 12370 31366
11561 31366 17052 -17343 -25649 -86008 -91231 -59282 -58540 -86535 -92219 -37964 39114 3749 -37037
11548 -37037 -10200 -15684 -24324 -17045 -41333 -69472 -91708 -132287 -84580 -12190 -11164 -39193
11536 -39193 -19626 -31044 -30113 -20156 -1082 3662 2256 -18180 -17174 -28329 -59087 -58615 -69005
11523 -69005 -31083 13159 27532 3271 -14858 -17351 14010 14828 47578 70488 42839 15376
11511 15376 2511 -17022 -34430 -78850 -93478 -50819 -86966 -107895 -69982 -25343 8158 14121
11499 14121 -3187 -16748 -38022 -38296 -71821 -89690 -58743 -6121 -3630 -8318 -42681 -41875 -69263
11486 -69263 -93603 -33972 -1191 -32633 -15032 17095 -17938 -9111 -11071 -14159 -26626 -28063
11474 -28063 17348 44401 57352 21262 -1482 -3024 -49743 -76441 -94626 -86417 -53468 -31909
11462 -31909 -80395 -92995 -68654 -21921 -27782 -39325 -31741 -19 33845 15551 13047 21074
11450 21074 12528 -18148 -3299 39552 39316 73909 80719 98847 72035 30857 -11130 -12865 -15718
11437 -15718 -18802 17583 23115 21561 -21275 -25749 -16654 27108 53435 58972 44139 -8029 3191
11424 3191 28834 -11764 -65566 -43539 16640 8494 36183 70608 22192 -54651 -75692 -90858
11412 -90858 -71484 -52141 -19524 -49289 -64645 -26603 -7630 -19251 26475 48231 12852 14765
11400 14765 75074 86358 52454 441 -51275 -58814 -26991 -12536 15634 29265 55366 33469
11388 33469 -28986 -29162 -50267 -63450 -65237 -41382 -25887 -43175 -63404 -54483 -41039 -43928 8419
11375 8419 48011 -5209 -60795 -65645 -54268 -71493 -70948 -51120 -44853 -69002 -74761 -44683 -13223
11362 -13223 -24349 -41780 -52979 -27682 -17390 -28021 -21155 -19416 -38014 -72738 -62523 -76768
11350 -76768 -84804 -74534 -41254 -30521 -38384 -46944 -34430 -17970 40048 59891 7640 -27542
11338 -27542 -18262 13127 8666 17308 -13761 -37696 -36432 -47381 -71330 -69552 -24114 25276 78479
11325 78479 100953 67689 34400 16143 11565 -32475 -20083 -8370 -28323 -13681 10570 -4483
11313 -4483 -11169 27618 24587 32715 49435 17798 -1092 -1937 -3072 -971 -20858 -26707 8033
11300 8033 29435 7075 -18531 -49372 -28395 5894 23563 36951 59928 61391 -728 -11832
11288 -11832 27994 -2674 -44532 -49365 -71711 -60968 -20076 20868 59686 63147 53731 4560
11276 4560 -48197 -73116 -66031 -40332 -58670 -87809 -21115 -1915 5836 -27133 -33246 244
11264 244 47507 10704 -29353 -51457 -58752 -52902 -86729 -94341 -64128 -52271 -2708 -3173 -21568
11251 -21568 -31512 -30371 -63804 -76645 -91315 -118950 -98074 -69101 3603 26206 -6613 -60600
11239 -60600 -35678 10890 39508 45882 7683 -68895 -71330 -71716 -31126 32726 -7504 -13952 -6330
11226 -6330 -32538 -5334 19139 8270 -18905 -57977 -23875 -19159 -25586 -39120 -10479 -15762
11214 -15762 -42140 -63955 -36032 6211 -11759 -40779 -52381 -4044 14264 20928 -9297 13714
11202 13714 -15665 -33213 7099 14845 12083 4645 21458 10535 -5622 -9592 30410 51234
11190 51234 61336 63308 61980 12826 -35852 -51593 -29228 -54651 -81397 -59337 -4229 13644
11178 13644 7130 -26774 -62457 -68015 -21868 24762 3269 -41437 -21437 -36424 -85236 -81022
11166 -81022 -77559 -72651 -84063 -62553 -21502 -1038 17071 -2902 -14654 -20221 -29077 -39860
11154 -39860 -33154 -65386 -53977 -14215 16123 25656 6166 -46053 -49847 -31386 -43830 -57413
11142 -57413 -32541 -30026 -40881 5282 42087 85052 83181 74095 50264 23898 -32803 -91328
11130 -91328 -113806 -78742 -30932 -20084 -13934 10106 2330 -41518 -53597 -13023 18170 38051
11118 38051 6620 17104 37849 87398 74514 42699 24340 25459 -12640 -22222 26125 51674
11106 51674 27389 -9189 -33866 -11267 -33106 -5624 9330 -33939 -66064 -61436 -51518 -86375
11094 -86375 -78157 -71151 -72066 -43301 -18807 -10574 -35696 -66499 -74341 -20224 -14368 -60160 -84223
11081 -84223 -26095 6969 -64460 -55603 -31295 -55817 -76724 -47202 -15426 -22160 -5385 -17100
11069 -17100 -41287 -30711 -9604 20391 46329 -2190 -19527 3051 -3497 -7440 19132 -15589
11057 -15589 -53732 -42183 -37928 -6439 -17055 1975 -43722 -32543 -16323 -37886 -60350 -8324
11045 -8324 28405 2439 -66043 -96855 -93430 -91926 -93941 -99918 -50297 -57719 -62022 -24113 7736
11032 7736 14783 -15165 -11155 22302 37947 -8248 -14833 -30 -956 -28719 -58499 -18615 65111
11019 65111 51909 5856 13259 44804 7595 -26962 -19518 -37313 -90822 -114846 -78818 -21475
11007 -21475 -2293 34259 32101 -18459 -750 -10131 9709 8692 -16591 -32244 -61322 -92109
10995 -92109 -52834 -37715 -30740 -29383 -48534 -15463 -4697 7764 -25795 -62544 -59389 -54268
10983 -54268 -51330 -41190 -65614 -59976 -37110 -28783 -35471 -32607 8963 -426 422 4329 -52021
10970 -52021 -67155 -62958 -53696 -55416 -88033 -66409 -40215 4155 7747 26970 10750 -43718
10958 -43718 -59198 -35315 -13690 -3985 -35448 -72307 -80544 -71669 -85687 -13335 21226 30698
10946 30698 36559 50397 47738 36571 38763 26671 19049 -8568 -24564 -36373 -56090 24101
10934 24101 32160 4610 -10372 -15759 10506 14086 28429 41615 7490 -27804 -69907 -107367
10922 -107367 -88202 -18319 47637 29586 8336 11135 -10047 2391 45150 58786 42647 27978
10910 27978 11903 -822 36879 30671 60201 18635 15339 47904 41121 542 40566 -23967
10898 -23967 -53278 -31601 -40368 -28941 -40257 -91508 -41140 17354 -41975 -57105 -5767 9453
10886 9453 -22327 -48077 -42653 -54385 -36821 -12995 27652 37832 23131 17794 9304 -1869
10874 -1869 23453 18802 6192 -46656 -65335 -58532 -72411 -97400 -106671 -86015 -70276 -54705
10862 -54705 -66269 -36439 -87991 -83152 -32137 23332 28981 -8446 -42353 -40281 -19159 22830
10850 22830 -33721 -53943 -38062 -25805 46249 71264 95483 102124 75886 17567 -27166 -48535
10838 -48535 -78904 -46422 -46677 -5442 44299 53159 60643 68464 14228 -19123 -32214 -30234 -932
10825 -932 -851 9260 -19635 -38048 -59183 -66440 -90549 -55843 -45209 -33412 -59636 -106066 -84528
10812 -84528 -93059 -78216 -62149 -56166 -27686 3767 -6751 -35913 -39808 -50375 -61647 4940
10800 4940 35427 13553 15388 47097 66944 79771 144326 107667 33017 35584 34866 -5427 8732
10787 8732 1359 -26124 20074 68443 71043 85482 64278 26697 19107 48037 66132 43909
10775 43909 -37229 -40133 -27413 -21357 -20056 -12361 23593 49648 12767 11469 19662 588 -11034
10762 -11034 -24491 -14853 -26291 -8132 4121 -13133 -717 49705 57658 42903 18571 72792
10750 72792 25947 -17942 -6220 4825 -2595 -9339 -47759 -113475 -116919 -83500 -27378 1528
10738 1528 -5493 -3003 -10477 -29049 -58513 -69274 -84387 -77746 -47113 -26295 -41263 -48711 -5313
10725 -5313 -24736 -59249 -79780 -91556 -70581 -15025 17034 -19418 -17528 -24845 -9570 -26752
10713 -26752 -20923 34026 17013 3032 8145 14654 19447 38200 6132 4470 8042 6823 9089
10700 9089 10868 23413 48409 51394 32598 -21016 -42655 -58075 -24197 -12801 -28946 -70657
10688 -70657 -73423 -65352 -53689 -77662 -76579 -77230 -77727 -86915 -94688 -97545 -76626 -26916 22086 21861
10674 21861 11617 -4461 1548 -38066 -47766 -26607 -20521 -20010 -30533 -33866 2252 37946 24125
10661 24125 -11964 -50085 -44975 -40263 -50496 -15864 17117 -13624 -7619 38894 76199 52233
10649 52233 19717 -3836 10569 7964 -17694 -29469 -62875 -68515 -29535 -6142 -29133 -30858
10637 -30858 -10783 -43867 -11501 18578 24428 13021 -1548 -16786 -33479 -53025 -61181 -25327
10625 -25327 -10651 2933 -25408 -21695 -5045 -13921 -25660 -32831 -16368 905 -12017 14204
10613 14204 26377 -467 -34120 -5031 36197 21936 11438 12347 -142 7231 7842 12002 -19595
10600 -19595 -26156 9295 -11710 -38944 -41775 -43022 -32285 -50928 -23945 11986 18288 36853
10588 36853 48768 38522 12252 1832 8598 -23407 -59994 -51416 -37753 -30723 -56775 -52453
10576 -52453 -66184 -79473 -59289 -29517 -34254 -24983 -50443 -38397 1016 7717 10956 11474 -5961
10563 -5961 -13682 -24263 -23773 -45234 -66441 -50585 19307 33570 60114 43982 5541 27196
10551 27196 25322 13008 8308 5927 -50221 -76082 -34821 -68683 -51728 -32841 -42286 -56840
10539 -56840 -16512 -27085 -35413 -55098 -57939 833 39252 72473 82681 74636 32209 -20205
10527 -20205 -50011 -52185 -16212 -10593 31383 30959 -13064 -52472 -80954 -90674 -69006 -40333 -55917
10514 -55917 -27532 507 19561 30037 -13641 -81874 -73622 -74077 -31689 -22278 -23689 -2491 20146
10501 20146 38459 55396 34738 52678 45929 -821 -35545 -53526 -68380 -88979 -41462 -10808
10489 -10808 -18309 -7988 29777 39519 12122 3700 229 7104 16757 -39008 -76845 -23358 -51535
10476 -51535 -34454 -9738 1303 7370 8419 46408 45470 22522 -6548 5255 -4469 -19045 -22285
10463 -22285 -11354 1919 16106 30084 28402 57069 63950 66155 59419 32493 35502 47566 -6361
10450 -6361 -29965 -18161 -20517 5442 16320 42917 16028 -16187 29789 75307 101205 115093
10438 115093 111885 115205 67804 57351 28327 23458 6544 -7622 -9029 -16110 1762 29370
10426 29370 999 -16568 -44507 -50237 -34365 -37824 -36262 -72951 -44958 844 -2663 -34005
10414 -34005 -26289 -22093 -15320 -21832 -8856 5158 37704 63230 89221 77560 57604 30788
10402 30788 27923 46219 33193 19871 -22650 -11081 8112 -23145 -2226 20711 11853 -26584
10390 -26584 -27870 -44481 -36015 -12246 11919 -15250 7052 1783 -33915 -19410 -43959 -42730
10378 -42730 -39126 -15685 -24692 -21140 -28813 -16077 -4822 -18369 -53709 -34308 -7739 -19556
10366 -19556 -56659 -27880 -13201 23156 -8586 -44944 -16458 28335 36900 133 -40538 -28475
10354 -28475 16121 8013 -11983 -52204 -8383 -6964 4464 26277 15806 21241 103334 101606
10342 101606 60542 19318 11723 -10315 -26498 -8497 3721 -56447 -59845 -14894 -20029 -2921
10330 -2921 26212 -5617 -11772 -5338 -4285 29924 27021 40314 22538 6326 -958 380 5369
10317 5369 18304 11705 -32430 -54278 -55283 -44622 -35677 -14820 -29256 7035 19255 56791
10305 56791 58237 55504 44824 36273 4852 3943 -3636 35579 57231 32811 -137 -5104 -42343
10292 -42343 -29996 21797 41967 -46137 -73382 -49677 -15429 14322 29535 24784 12363 29815
10280 29815 59862 36813 -2777 -26852 -30637 -13085 -32028 -27963 25848 11342 956 -26486
10268 -26486 -13706 -28061 -36615 -45191 -22635 -30860 -27055 -14278 19525 46347 63450 28554
10256 28554 13343 -23946 1726 20557 6598 -6173 3214 -26880 -37627 -54991 -76888 -55972
10244 -55972 -58897 -55852 -38238 -7993 -11533 -24061 -37829 -17814 -9085 6011 15775 16758 13852
10231 13852 63732 74897 95243 93569 76489 56072 56350 40856 -15706 -9440 -8519 -37833 -63998
10218 -63998 -63560 -39633 -23587 -40375 -14558 103 12085 -6452 -93667 -91841 -45047 -32461
10206 -32461 -36479 -56388 -40308 35401 71452 24602 -22314 -39409 -31995 15671 32273 -17997
10194 -17997 -11130 9635 2154 36947 44070 27986 30715 25486 16811 42058 35171 -21490 -80687
10181 -80687 -38851 -29987 -6566 17415 -7454 -33842 9199 49593 43780 63866 58127 -11808
10169 -11808 -64553 -32054 27580 50451 87230 95544 62607 45002 36646 68172 43834 29049
10157 29049 -36346 -33776 -15854 37277 57365 20976 35124 35581 -35516 -4586 23453 78486
10145 78486 128641 89569 75267 86808 72103 50736 39608 21501 13931 27671 67662 84457
10133 84457 99518 73606 -3100 18369 23547 -12979 3301 17840 -11719 -29487 -17605 -3329
10121 -3329 3266 -12194 -18186 -4300 22072 28282 25800 15654 -26333 4264 53735 56287 80643
10108 80643 77366 64648 63523 31047 53187 62055 24894 28997 17958 -5503 -10785 -9852 -1729
10095 -1729 9506 21616 52548 52094 39001 63312 91412 97014 91585 103937 49317 66745 79995
10082 79995 69577 36157 16802 34414 51950 71248 76171 86449 72409 89189 155126 233576
10070 233576 291367 240797 206605 235369 246704 276199 342304 447150 508076 602652 778163
10059 778163 1017784 1485801 2314718 3884997 6841796 9613823 9720817 9043250 7235565
10050 7235565 4525188 2736712 1782180 1256171 990963 796778 669956 612229 522552
10041 522552 444797 393316 298538 270936 284636 347513 336817 287107 236319 201722 231492
10030 231492 206893 138938 104036 154102 161768 144290 109944 118576 150569 121782 101478 102189
10018 102189 141864 163834 163690 116342 76711 83087 90606 55233 46553 71873 55117 79334
10006 79334 111926 135512 90305 69896 62115 47418 46659 11643 -60408 -48883 -9420 34865
9994 34865 47548 84475 79655 48329 27115 25868 28054 57219 57334 81961 88682 68971 87553
9981 87553 80979 114130 159489 115647 91594 74381 66384 44550 50826 83098 52465 27505
9969 27505 48467 76807 109809 133980 114125 81373 34715 87742 136701 113196 53521 43814
9957 43814 88329 113733 78162 31791 32893 54096 36148 35604 29299 44501 54394 11665 -9721
9944 -9721 -11202 7111 34296 66004 84372 86412 32724 40544 74212 98987 111012 67323 40262
9931 40262 32715 17994 15060 4603 17796 29971 29661 6030 34030 81347 77679 49370 38562
9918 38562 13367 12756 60949 159356 257950 271467 212264 179113 155553 126756 136711 102883
9906 102883 70684 88834 93201 113469 99395 61992 92269 109903 103292 113066 69320 56923
9894 56923 45525 54526 95412 98122 73137 96337 112926 93594 79818 79910 103762 134655 137787
9881 137787 120236 111038 90561 104704 111340 99580 126255 99959 32662 -3223 53369 98912
9869 98912 129916 115056 153620 179457 162376 138952 156962 210104 326057 540701 824174
9858 824174 1176175 1540954 1670799 1516607 1191708 863216 599225 408958 321636 248607
9848 248607 172024 191722 218947 174587 165470 116141 104252 146207 159610 152662 125089 94850
9836 94850 46730 37616 79702 57307 70007 68417 52582 46332 49693 80033 104289 70354 42723
9823 42723 22973 22696 6392 14844 48829 97027 84083 66268 98387 90979 88859 73699 20280
9810 20280 27834 92892 143159 104569 78407 52054 17315 11952 27265 48742 65793 42494
9798 42494 49317 86956 104335 92472 71262 82879 94741 73832 74198 93481 65976 64334 45982
9785 45982 62786 53946 25947 16700 57028 111801 132484 111152 133810 137075 104359 99252 103805
9772 103805 103115 70088 45825 579 2916 32067 47957 58348 71956 83906 99293 81904
9760 81904 67342 87526 96528 105865 114933 126196 138251 85587 55115 55278 -3643 -25420 31910
9747 31910 78024 99634 61894 5299 44844 50976 30458 42029 68263 36796 47456 42703
9735 42703 94633 73769 60004 55905 60213 79839 121647 161633 169337 107481 70088 79665 79554
9722 79554 83181 150022 139392 124971 136817 127356 112576 54438 53613 111569 75677 66477 86700
9709 86700 71848 40303 41843 53413 53868 70477 69838 62622 53918 66430 57836 72062 89604
9696 89604 114604 137863 120933 75026 62060 63054 37305 77767 64446 34488 86021 98118
9684 98118 77183 98708 150005 201921 188149 168685 161494 118966 93359 142806 168711 158041
9672 158041 97884 62310 76759 114603 95003 114983 68660 29582 26302 37605 43457 97667
9660 97667 141740 145609 131207 111756 74763 83096 90004 165015 185663 100934 80066 95781
9648 95781 134395 130027 144527 134024 120434 126218 99785 100759 86894 58592 118600 170628 121866
9635 121866 80733 75358 41889 58091 118794 98549 66816 81723 56108 67521 70567 83079
9623 83079 85544 54709 57203 124750 155942 105154 65850 60083 72005 124063 161432 173907
9611 173907 131929 114688 131918 147559 143535 87477 110659 134841 121084 111085 136996 139360
9599 139360 124947 127075 160252 147963 84451 12375 -28120 -16150 -1427 14613 50379 64812
9587 64812 68891 37366 58129 92243 97008 127277 117282 132601 105096 134427 96901 124257
9575 124257 137752 115871 111824 108242 92879 101895 111518 70317 67351 96773 132638 88690 39795
9562 39795 84496 89374 75073 85855 77849 122425 113937 113162 162538 142706 123292 111850 109666
9549 109666 112927 92745 65754 60222 70322 104018 109996 102672 124170 99915 85929 96409
9537 96409 92787 89229 102709 99174 108527 126394 106258 108525 117628 85878 64291 71318 108359
9524 108359 108604 87836 78554 77298 84999 105074 106347 92514 98232 111486 117310 129794 168110
9511 168110 147826 112198 107357 141148 206316 206860 158182 137443 120657 105652 114457 118405 103137
9498 103137 119065 154094 138348 147193 156907 176755 180953 140274 103735 110833 139808 163914
9486 163914 177435 140682 103130 159247 136826 143526 164414 182856 177536 174315 163851 168797
9474 168797 171572 160981 145897 114919 147728 126496 116660 107180 145917 125424 146362 125408
9462 125408 119398 104706 95357 98227 127958 145875 118378 136598 174419 153859 105174 81766
9450 81766 94299 86870 64318 56844 90561 162440 223060 220787 170414 152921 179330 192177
9438 192177 178306 156146 147770 112289 72276 47201 73162 52819 54670 66388 68280 95886
9426 95886 111616 114521 92242 98927 104679 141005 124540 72347 62731 99312 90633 48714 104987
9413 104987 133662 131961 73983 114363 128205 115554 85472 57741 56433 117742 150281 145088
9401 145088 151416 135536 112446 125484 122785 95116 85158 95336 109265 97991 69852 77462
9389 77462 52851 76803 102505 120387 135801 89637 54732 88177 116193 147216 124507 156532
9377 156532 211882 167875 91804 95139 70850 58930 52211 15161 3141 50327 88541 83213
9365 83213 76809 67268 90334 82314 75464 57323 50111 56485 63706 83402 60090 120121 121122
9352 121122 105241 131324 128204 119977 127674 110812 141367 163336 124174 92025 66878 70877
9340 70877 64550 73127 86216 132558 144849 99934 73955 88405 92413 73878 65917 25220 14263
9327 14263 40218 23391 -1061 52662 54991 58537 73772 77050 81298 66992 39191 24602 26851
9314 26851 59368 116256 129314 116532 110538 130982 115669 102943 71195 37964 45720 31139
9302 31139 -3022 64331 77113 54074 55454 52650 33840 30968 44777 34830 72163 102747 139347
9289 139347 120092 76755 33583 24325 31608 -17246 -37878 -39183 13651 13748 16459 15548 22829 37082
9275 37082 46475 49354 46798 7344 17415 -3156 34071 75232 96263 81955 96255 75734
9263 75734 48227 48203 51225 64913 33061 17870 55359 89634 83225 107959 116504 82646 41355
9250 41355 85604 65726 15867 -4142 12876 72718 97087 101117 62644 96547 116280 65560
9238 65560 20966 29970 53721 112823 31998 48796 108487 143445 148405 136340 102680 94143
9226 94143 83252 70280 64364 84373 91102 77936 51063 50772 53244 54955 88397 68924 27289
9213 27289 27502 71446 50515 11694 5827 37287 53946 63050 60618 88151 64702 47489 83292
9200 83292 127898 121674 59070 15606 37016 37622 1596 39376 35142 73255 62166 26082 6113
9187 6113 21802 40754 55273 54204 40343 38388 54884 57263 68426 74012 27461 14857 19785
9174 19785 -2848 -11285 8954 21167 44038 104454 118053 107094 95498 44943 -15184 9343
9162 9343 28761 34885 17201 43887 83951 68986 23160 -847 19629 22240 17150 67803 71122
9149 71122 33649 1417 18086 -381 19866 32559 -9227 11090 5298 -19639 635 43465
9137 43465 29106 14368 50302 70895 41804 21365 55696 76365 97738 68860 22009 3807
9125 3807 11530 18445 17075 10448 32274 49752 38580 72347 82082 106099 125795 110114 90482
9112 90482 62549 92780 98923 114930 94570 68022 95703 106676 88222 112356 121147 132137
9100 132137 107789 86068 74701 29236 -5713 14717 31473 50301 24702 14344 16665 9250
9088 9250 14642 33276 32798 65997 61937 68144 41038 61616 66093 43493 68876 82662 85592
9075 85592 94553 83916 117252 103701 88195 86196 94275 67707 45627 79148 98338 98902 82105
9062 82105 70473 44177 73086 87111 37796 14189 18586 60485 30908 19226 41861 76591
9050 76591 62720 68132 57782 54117 71788 72988 63980 85932 64009 47714 32674 50476 52313
9037 52313 48992 53898 72141 72840 80759 65140 68506 52238 -5422 17266 31813 -19448 -8337
9024 -8337 38243 87231 90348 56670 29374 45206 36242 56284 43131 52481 19315 20359 20097
9011 20097 25560 26880 39770 31024 -2661 -39978 -24540 25234 45724 27293 15657 -13105
8999 -13105 -8209 38313 59619 30454 -25875 -30197 -2373 30730 1171 -21102 -27254 1480
8987 1480 40792 26412 37978 39912 26710 19280 51666 34668 26133 -1682 -3920 1125 7581
8974 7581 26837 11027 10187 39412 51875 54047 63914 25682 -12562 -82479 -108367 -58998 -23103
8961 -23103 -40231 -23529 -52765 -118534 -154197 -94605 -38806 -29151 -35225 -35751 -61416 -46047 -16964
8948 -16964 39816 70113 58418 72632 46294 29660 23750 -15181 -34789 -23816 -27872 -22063
8936 -22063 -27964 -45530 -53262 -42950 -7312 13685 33667 24543 32757 81649 86289 26480 -5640
8923 -5640 27870 88401 95136 82180 119313 94558 68498 28018 10830 21928 40315 43324
8911 43324 45321 20 -1022 21258 49370 87367 41322 -31043 -56845 -34125 -20545 -17153
8899 -17153 -10083 1871 12658 18790 8309 -14888 -32044 -18622 28387 69290 59935 72386
8887 72386 74530 61638 54835 3190 -17711 -9635 32749 71134 112109 110823 113436 143834 183274
8874 183274 203289 156131 135365 161681 117304 77072 95974 109269 70294 45764 70729 59236
8862 59236 -5041 -42573 520 14889 18709 30693 32112 19777 -4113 26683 38855 43373
8850 43373 25047 24333 10163 28674 27555 42363 36487 47800 33100 59213 108010 115153 109806
8837 109806 96695 44226 76282 97174 62297 72843 55245 62685 34834 -28402 -35814 -21947
8825 -21947 -43940 -4342 64266 46278 26800 30288 34798 41616 66534 21332 36699 37609 60569
8812 60569 57975 7868 -39566 -55940 -79826 -51106 7876 37886 38596 14446 36573 65474
8800 65474 63999 23425 -374 -14440 -22944 18481 49126 14574 16201 -12840 -21974 4833 23609
8787 23609 -25027 -45484 -56465 -53006 -13670 890 27369 36849 66196 70813 44335 50052 61153
8774 61153 41970 -10529 4065 25212 41644 31383 10337 33327 38450 -12486 -66829 -68768
8762 -68768 -49093 -29101 -42286 -51443 -22244 -6196 13939 51512 33062 29837 29105 3248 -15073
8749 -15073 -12997 -16804 -36688 -45190 -43960 -14214 41022 19995 -1448 1262 -2753 3131 2565 2779
8735 2779 -4873 -5290 40899 57694 54587 27604 -15536 8189 38151 38011 39206 46946 53012 41387
8721 41387 10851 -30742 721 24848 14601 12646 12360 29076 92336 96486 30687 18021 74626
8708 74626 73034 24021 26609 70151 84026 63768 1670 19268 35058 18454 -17853 -21476
8696 -21476 -49645 -33742 -23754 -9792 -12669 -2178 3240 1150 -11443 -35111 -59287 -43770 27036
8683 27036 43086 23067 -3202 -25232 -29069 -33549 -30737 -1010 22727 21464 51140 31618 52312
8670 52312 89848 89844 77389 78022 58579 25167 5554 20665 23743 56033 135238 190035 231203
8657 231203 239559 330965 434386 469886 434522 360023 250627 189225 149739 115578 94771
8646 94771 73633 76754 81366 66955 82156 111136 97359 101897 120187 114614 85324 87325 124484
8633 124484 135227 126560 135130 181023 220683 209924 236766 296914 275153 245403 258218 244200
8621 244200 273571 276238 256612 262604 280516 261516 275563 374641 460049 586635 821139 975863
8609 975863 979270 916966 765534 606756 496863 346189 267813 253020 199931 183200 187118
8598 187118 215889 199872 172980 178323 132384 69746 76351 72417 52638 100437 99776 110338 137209
8585 137209 70762 65473 133233 120796 125131 124514 101588 112302 98521 68317 100109 133693
8573 133693 106350 73634 10565 16254 21970 52736 145765 243334 332284 357414 379090 336607
8561 336607 287514 204204 89439 36140 40864 48478 47106 59229 44641 69992 78099 75762
8549 75762 66286 28158 -19671 -26203 -33250 -17511 -6234 -19167 -3271 23905 90396 102836
8537 102836 81272 55455 42649 14236 33530 92664 102179 120773 119996 82391 80887 63677
8525 63677 67990 37138 -16981 -27952 -26778 10846 9375 32946 47789 73786 103102 106549 52838
8512 52838 30580 46471 32625 258 -37430 -29931 7602 14963 35527 14253 -3530 6347
8500 6347 2742 9994 -3262 -19373 -17871 12644 25335 23670 39073 35008 37411 36631 40743 2970
8486 2970 -43954 -57636 -79178 -55150 13919 76087 81144 61972 33751 7983 8528 14642 21936
8473 21936 41170 61452 27446 29398 25930 32786 29398 47353 35221 34782 23494 1047 12004
8460 12004 7920 -3230 8329 34318 80397 110234 32767 22675 14867 -42554 -39798 19453
8448 19453 86620 69642 59611 64663 79761 62035 9123 493 27192 29347 5882 22601
8436 22601 41071 58260 23855 -16764 87 -15343 -50526 -44094 12263 44664 23800 37468
8424 37468 54073 21444 33008 52176 59496 60814 18087 22055 6486 -20302 1251 38886
8412 38886 46350 86552 96264 110741 73190 48938 12105 -19470 9470 -4677 -3580 -28317
8400 -28317 -34188 -40799 -27980 16983 26925 25848 64296 58299 44647 33871 46165 69553 56946
8387 56946 22542 -168 -10136 8632 15206 2670 -41601 -50628 -56264 -25762 20917 87327 88946
8374 88946 7297 -12120 -18188 -17859 -45742 -19504 19564 13297 -11034 -46115 -1414 77372 70922
8361 70922 32457 20370 61004 87241 36351 -27838 -17419 23272 -13006 -26322 -23599 -8158
8349 -8158 15170 11874 536 -26952 -18734 27406 34846 71810 56118 44472 51486 470 -43343
8336 -43343 -82824 -106555 -89274 -110518 -119830 -133198 -119795 -60615 -37512 -43878 -29898 -44106
8324 -44106 -34060 16257 46121 59343 8384 30791 29314 -23183 -52146 -54095 -51040 -39402
8312 -39402 -16350 -16137 -5907 22025 62176 61094 58581 34926 25809 30867 737 -19503 -17917
8299 -17917 -31320 -42079 -6461 30388 63308 48064 -26862 -47251 -14810 11751 30681 25147
8287 25147 26657 23364 -23393 -22225 13303 -7540 -6311 18062 56172 90604 71697 39827 34464
8274 34464 67370 55377 30991 -15948 11541 52911 27851 -22444 -56455 -42877 -54569 -33627
8262 -33627 -25576 -19408 -26233 -32509 -14945 3928 22923 45680 38965 9020 37115 44583 7880
8249 7880 -56068 -74621 -43941 -42144 -48313 -45343 -52832 -26288 15239 41319 53947 59429 85691
8236 85691 87269 61641 59596 44079 -12804 -43312 -50274 -56588 -54599 -47608 -78696 -64484 -62908
8223 -62908 -75515 -84730 -38927 -38502 -53364 -33499 -42277 -52116 -11023 30148 67459 42964 20410
8210 20410 7165 -19103 -53381 -43343 -8038 10348 31823 100764 109715 75842 17443 -2334
8198 -2334 6831 -9356 7053 -14838 -48919 -76196 -87389 -54483 -29276 -13159 22407 49240
8186 49240 34455 -29296 -11151 -18548 -28020 -18291 13336 39450 61801 78902 76179 62267 42309
8173 42309 25282 -2235 26601 37497 31980 51564 39349 4253 -22692 -39695 -62262 -28301
8161 -28301 24945 46319 27902 707 -730 -22374 -42931 -23359 -6643 -24284 -32262 -5578
8149 -5578 30942 21944 3478 -5715 -2796 -14154 -35143 -22840 41283 47641 2551 2051 16426
8136 16426 14981 6728 21072 5286 1682 23846 38631 68233 70212 4967 8966 44876 82428
8123 82428 31212 11964 24703 28567 7176 -26850 -41306 -79158 -91112 -78669 -99839 -53503
8111 -53503 -46830 -58442 -41152 -48335 -10937 14051 -9734 -603 -487 10732 -14025 -29772 -34869
8098 -34869 -19325 21695 43680 28564 27279 23059 38004 18420 35364 33841 -9474 -26655
8086 -26655 -28854 -56458 -79989 -53185 -52747 -88844 -54150 -66264 -58067 -44264 -13815 -5837 -1273
8073 -1273 -6693 8660 37403 41582 31998 13552 9209 24841 2790 7039 32196 46569 61026
8060 61026 75387 107712 131511 88910 102048 127456 140278 105574 42996 25020 -5384 24527
8048 24527 64783 105178 75496 54705 74561 78154 50527 3068 10041 -33087 13205 13503 -4318
8035 -4318 -21499 -6751 45170 52808 33134 35774 39092 60607 22730 13229 51909 24696 53448
8022 53448 65466 55298 59304 94635 137177 154586 245251 295742 282594 229717 159485 108912
8010 108912 105277 136969 144511 115322 135512 162995 209457 192002 159371 180226 193147 186783
7998 186783 126852 135234 113033 79955 48005 18389 38758 2457 16520 82601 103757 66053
7986 66053 69022 79476 66126 21776 8294 14901 13954 -1462 32921 122353 132899 89141 91016
7973 91016 84725 72277 175947 229790 211243 186150 152615 123217 85332 100555 132438 149773
7961 149773 143478 150783 163620 147837 123944 73325 42729 12888 12374 17160 -16124 12240 34876
7948 34876 29651 18724 13240 29638 14698 19885 -24476 -9148 18266 30633 43716 17327
7936 17327 15224 22365 51591 29615 33396 52721 98887 79854 90924 108020 116354 84622 37814
7923 37814 -7195 3282 -4741 2264 50082 60711 27636 15683 -16100 -35320 -34233 -6142
7911 -6142 14445 14713 9703 -28431 -14115 6502 25748 33846 38886 2451 -12316 -11760 9209
7898 9209 49936 35369 9508 13771 25317 40611 24871 -23689 -39256 -11448 -3429 -22608
7886 -22608 -7342 44212 41650 65858 40465 -44716 -84334 -66338 -40967 -23403 1359 12183
7874 12183 5339 52644 62363 32727 -1905 -2326 -22982 5877 9493 -38658 -69752 -60878 -18823
7861 -18823 1703 32044 13030 43730 77161 47234 61269 29318 -19160 -60763 -42191 -48543
7849 -48543 -22685 42421 57360 22129 6226 22155 47602 23923 8279 -6629 18007 35951
7837 35951 43221 12114 -20934 -23056 -38821 -41614 -39043 -33820 3194 42001 37178 3857 -25956
7824 -25956 -15783 -7069 19611 480 3687 49414 47939 -3824 -26495 -49293 -52008 -21085 7371
7811 7371 1045 -2120 -13995 -3419 -32608 -11961 42703 43794 -7814 -64398 -27758 32738 13152
7798 13152 -19834 -71276 -102834 -81458 -46177 -751 12081 25183 29351 12755 18580 29136
7786 29136 -16946 -6398 -3969 -12349 -26162 -65949 -66334 -32848 -55466 -64505 -100722 -99997 -30695
7773 -30695 13102 2418 10745 31415 32818 41964 30268 18900 17160 -23688 -35745 -61459 -34939
7760 -34939 18442 -6552 13197 28940 -25663 -37283 -1053 506 1210 -15049 -31996 -28869 -32050
7747 -32050 949 23811 9354 3649 -10377 -7457 -1100 15035 2359 10361 27158 38648 8637
7734 8637 -23675 -43450 -19447 -35027 -7669 -9383 12356 38473 64298 5181 -64692 -80270
7722 -80270 -74628 -45776 11484 38015 -4980 24457 38481 -28485 -39174 -19429 -64865 -119826
7710 -119826 -88969 -29190 -16781 1366 -29243 -38624 -19085 5930 20700 -14460 -25736 -35288
7698 -35288 -44555 -30870 11304 -11832 -71529 -34301 -8346 -18587 -46551 -33328 18263 -4663
7686 -4663 -33346 -46837 -29698 -24325 -2825 -17276 -52135 -45184 -51273 -77378 -73497 -112824 -85978
7673 -85978 -33090 -34884 -44443 -17851 -13971 16231 68963 22807 -29986 -61121 -41704 -38467 -73030
7660 -73030 -59151 -69166 -33928 -50820 -41016 -33066 -7563 -38695 -94384 -37609 -34499 -5034
7648 -5034 -7350 -28258 -63059 -32445 -27771 -85801 -69719 6553 7905 6342 -7018 -16987 -33252
7635 -33252 -15227 -2732 -41624 -71669 -62508 -56649 -33933 -47755 -26279 87 -4346 -10919 -2039
7622 -2039 2585 -5426 3796 -10766 27797 56638 17050 -30420 5536 23506 20322 65678 84028
7609 84028 106199 100716 55145 27458 2822 -28308 -47463 -32839 16990 13943 -30835 -102020
7597 -102020 -79340 -12423 37000 47354 58003 4306 -7736 -17197 2838 -8229 13393 42276
7585 42276 19485 2607 -17161 -15733 -15236 -36857 -25855 -2244 -12463 -18465 -15562 -21132 -15769
7572 -15769 643 -11055 -15669 -16470 -13238 20165 23247 7884 14245 7003 -24433 -8783 21432
7559 21432 23818 -306 30169 -6618 -54715 -53045 -60385 -44632 839 17562 21495 55679 63531
7546 63531 60257 14546 -25196 -46781 -41888 -13289 -41403 -40596 -75635 -119093 -124290 -104771 -73384
7533 -73384 -55044 -21736 -4082 -25619 -50991 -50992 -40099 -43677 -3814 -13871 -10721 -958 -9380
7520 -9380 16468 21562 62893 55849 33233 -1725 -33948 -38360 -47023 -22151 13281 13021 -17977
7507 -17977 9967 8235 16323 39201 7418 -3398 -12898 -37823 -44811 -46576 -52796 -22773 -19443
7494 -19443 -66286 -85947 -56675 13607 43449 159 -37875 -42707 -36370 -46723 -54600 -36729
7482 -36729 -43354 11242 18168 39247 -23199 -61811 -72297 -82626 -41081 27298 86943 82990
7470 82990 82321 63703 48980 7494 -90 -15061 -52753 -43665 -16861 -28048 21030 19636 1790
7457 1790 9940 67815 38326 8117 -65735 -89288 -81091 -63359 -80634 -38664 -6180 -9304 -45855
7444 -45855 -54353 -27028 4725 20521 44305 66960 78325 63322 55231 40940 -3532 -14581
7432 -14581 -39559 -31284 3792 23793 -7256 -11086 4156 3046 -33728 -31536 -34728 -25597 -31694
7419 -31694 -12507 10298 24035 36369 11057 13433 52314 39663 -30963 -100102 -95383 -67734
7407 -67734 -17213 5913 18543 6982 -10356 -32951 -20361 6591 20729 -9198 -24227 -8252
7395 -8252 53424 36004 -36411 -71887 -30620 27216 31210 -10720 -25393 -28845 -36295 -10239 24334
7382 24334 15243 -16944 -11019 -25649 -2481 29930 19949 9213 -3510 39734 52022 32673
7370 32673 3287 17457 20110 -12361 -9196 36064 51736 54363 24474 1295 13109 41350
7358 41350 102210 120779 111073 53353 -11319 -16795 15710 46340 32792 26322 26784 28898 16668
7345 16668 -23558 3031 30357 34088 -26813 -38010 -24321 -27429 -10895 -9675 -22002 -45786
7333 -45786 -49973 -6219 25134 13511 624 4748 7051 17820 -18071 -39059 -34187 -45543 -367
7320 -367 -9818 10219 46090 58327 28708 29058 4111 29830 53824 31631 -5799 -17196 -26961
7307 -26961 -34491 -35462 -7262 12976 19612 54606 34533 41587 58446 37333 -20944 -88103 -60596
7294 -60596 -75241 -65045 -51536 -45117 -16473 6214 -11762 -18022 -14310 -28828 1376 18782
7282 18782 1588 -42594 -44243 -52701 -12931 -10401 -21263 -19228 -4308 -32274 -12839 17948 3707
7269 3707 -20802 13715 -7629 -20788 -4640 14055 19869 2903 -51952 -23070 9538 -4709
7257 -4709 27455 58867 53278 36597 30238 28445 -26919 -33992 -8639 -25792 -32330 -14147 -22524
7244 -22524 -4293 41033 39707 -806 -15289 5536 -26753 -18838 3483 -21499 27886 68865
7232 68865 95063 99484 89447 73876 51982 31514 36225 66027 53883 18533 -2322 -17222
7220 -17222 -37273 -29913 -53710 -32169 -53355 -6424 9463 7838 -17549 -29504 -36104 -63883
7208 -63883 -51788 12584 48351 37019 8119 1651 -57898 -52988 -50219 -22197 22769 68954
7196 68954 40629 -22401 -71623 -62036 -16172 -9529 -21650 -5037 8907 -35833 -39127 -59463
7184 -59463 -57839 -15631 13199 28233 44834 49107 40894 35410 23809 3334 -5567 5379 14242
7171 14242 12672 -4234 -22941 828 46843 5929 -10719 11720 -29419 -58282 -42018 -2701
7159 -2701 -24970 -15575 6445 -21533 -55991 -46508 6174 20307 6813 -37455 -52722 -13961
7147 -13961 -17202 -21984 -7412 -8327 -19572 -29521 10118 13138 -30415 -16929 -7775 -52430 -28636
7134 -28636 23609 -9649 -57751 -68546 -49494 -37100 -35202 -25861 -16464 -25529 -3320 20686 -12043
7121 -12043 345 -17165 -24731 -29547 -21899 -61415 -42124 26019 62234 49169 62644 29804
7109 29804 -24007 -70845 -65419 -21966 -31092 -10438 -15925 -11173 -4690 -25340 -32490 -12741 -20771
7096 -20771 -43702 -34306 -30357 -21039 -29403 -66303 -92058 -54817 -90356 -116743 -76847 -54483 -25181
7083 -25181 -28870 -40630 -42655 -16308 22489 51426 49335 44342 46992 43221 47470 44097 -1219
7070 -1219 -19843 -3422 -5948 4924 34731 57696 17886 11617 -16091 -9830 14557 20855 -1310
7057 -1310 -28463 -9039 15199 2291 10358 -1960 -21099 -29506 -7386 689 18701 11655 15445
7044 15445 33539 7685 -16599 -20457 -12314 29178 78428 64918 18782 41674 64826 38283
7032 38283 25880 21390 12125 53326 46935 42965 18262 -15158 -20518 4558 10172 39074 48939
7019 48939 63460 47376 63879 41446 3869 -1136 -45908 -29940 24155 67284 42435 383
7007 383 -10479 -30707 -59872 -40637 -38199 -13298 33291 -7766 -63648 -49308 -48794 -46116 1669
6994 1669 29840 35105 52950 64890 40679 -1834 -19793 -60001 -9851 43719 25889 1768
6982 1768 -6247 -12767 -22456 -37813 -8804 -15352 -52398 -65521 -64718 -53092 -23785 33928 30143
6969 30143 -43806 -35805 -23987 -16879 -36095 -49579 -83876 -40585 -5433 -29984 -42322 -9815
6957 -9815 10561 8508 50341 64049 -9652 -70859 -94310 -80608 -75165 -69856 -26255 -8823 -44498
6944 -44498 -71485 -51622 -17199 30866 48832 22508 40964 44214 -4850 -9773 -21162 -30224
6932 -30224 -5388 8536 -9631 13360 6407 -23759 -15914 -2142 -14109 -47340 -60327 -24411
6920 -24411 -46492 -6933 -35853 -89500 -106843 -65441 -44195 -52251 -65106 -81683 -90895 -48710
6908 -48710 -13362 -50360 -50097 9298 8441 8295 17343 -5680 -43112 -63076 -23750 5845 57866
6895 57866 65827 21150 18158 19352 12766 30649 56490 39414 3182 -2837 -35418 -58396 -59207
6882 -59207 -47478 -47903 -18349 22199 18468 45137 51584 23842 -6348 -23364 3231 20843 -23786
6869 -23786 -48556 -24211 -31327 -49857 -21323 -9382 -39881 -33012 -32916 -2983 -3023 -51579 -19007
6856 -19007 9698 3567 -6837 3778 -10456 -12252 -33895 -58774 -65027 -88152 -66217 -42200
6844 -42200 -9669 1357 -22740 -64151 -116448 -86310 -6239 15195 -12642 28341 52290 26827
6832 26827 -31505 -31928 5386 765 20420 -11373 -34310 -19830 19732 36616 37430 32361 23324
6819 23324 36958 62607 66434 32714 21368 18024 41527 71213 64385 32764 -38755 -39285 -4740
6806 -4740 2470 -10894 -1267 -6564 -4242 1942 10183 38547 50920 21477 -3342 -33473 -37004
6793 -37004 -49900 -48632 -32948 -64272 -42450 -13638 4307 -2472 251 23322 -19401 -48439
6781 -48439 -29878 -12238 -4386 -1560 -41201 -42227 -31757 -52200 -44228 -11950 -19230 -66874 -98228
6768 -98228 -55425 -18492 -51498 -71437 -67530 -16999 38126 8062 3644 -18113 -23307 -44326
6756 -44326 -97962 -76420 -57247 -77291 -83890 -47348 -37821 -32492 -59197 -31569 -3868 17444
6744 17444 56353 43415 34582 8596 -31361 -54091 -62353 -65210 -32660 -13422 9364 39996
6732 39996 73887 49460 44519 45403 9120 16129 30688 27564 12631 -9842 -21631 -12583 -22195
6719 -22195 -1160 26494 47581 51057 35163 8923 -13658 -40560 -15997 -62635 -71446 -65750
6707 -65750 -76546 -83633 -73153 -42722 -3211 -38969 -31345 -31371 -3993 11731 -30293 -47769 -16916
6694 -16916 6174 16408 38228 17801 -14661 3617 29008 35031 30547 -9177 -43412 -46659
6682 -46659 -37347 5124 23869 -30665 -84628 -82387 -59495 -49741 -22168 -11705 -1942 30179 -3836
6669 -3836 -52521 -33728 -61108 -62589 -54836 -69366 -58668 -28085 8396 6819 35316 48268 -3063
6656 -3063 -28607 -83459 -66156 -29660 -11587 -40952 -72967 -70651 -67002 -51287 -15439 -20485 -57698
6643 -57698 -63050 -61223 -44222 -26079 -34899 -5318 -26096 -57770 -29492 -55624 -69990 -27758
6631 -27758 -42541 -66977 -76061 -34921 2383 29132 28492 11335 -1412 2265 20991 32043 55902
6618 55902 15297 15919 36378 -74 -75094 -73774 -17140 -12112 -8473 -55837 -36866 -24550 -27654
6605 -27654 -44289 -56994 -50800 -14215 -20169 -19505 -21528 -20638 -24498 -15611 9806 33332 13903 -17156
6591 -17156 20552 38160 24458 7623 -19647 -42298 -40251 -35811 -34831 -51020 -18881 -3012 -12158
6578 -12158 -15136 -14709 -12331 -47540 -60314 -119537 -85620 -30907 -94263 -70141 -37703 29888 53018
6565 53018 33087 50805 54135 58243 11111 -6676 -10579 16123 10958 -853 -7966 12048 1495
6552 1495 -29782 -55962 -74459 -71245 -78401 -54013 -6137 -2413 -54652 -20409 41602 50286 10525
6539 10525 -60439 -54633 -2700 -19067 -49043 -25394 4098 12063 23508 40816 45547 27546
6527 27546 32452 43369 38792 13018 -34998 -63374 -49468 6776 -1779 -16523 14044 -1249
6515 -1249 -3544 -3459 16726 42162 58583 83107 36807 -19349 -69739 -47724 -12952 -44543 -40957
6502 -40957 -6612 -17183 -9837 -4125 -2117 -58969 -31963 -34939 -23674 32292 1890 -16012 -19595
6489 -19595 -7471 -26951 2514 -7938 -12584 6321 11972 -33265 -71348 -31229 -14033 -2219
6477 -2219 8230 -19807 -40660 -47512 -33068 -39681 -22552 -50979 -37354 23705 47060 70054
6465 70054 67684 35753 17905 -23651 -57579 -97407 -49371 -14720 -35987 -63897 -71972 -75720
6453 -75720 -64159 -73857 -51414 -18072 -8646 -13635 -49391 -26217 -16513 -32614 -79690 -90834 -49232
6440 -49232 -14529 -44122 -61256 -66382 -66178 -8342 1269 21929 32080 5208 4355 7543 -25243
6427 -25243 -21653 -42214 -7184 27535 63352 70703 21704 -44025 -65297 -57621 -19324 -7876
6415 -7876 10193 11367 -44088 -48661 -14329 -11622 -46429 1851 8212 -25203 -20156 17342 -13315
6402 -13315 -54738 -56362 -88185 -79458 -75296 -74383 -82969 -60815 -53399 -80257 -82403 -56438 -25391
6389 -25391 353 24777 33211 54289 40608 -24926 -21131 35836 66023 49582 35005 10847
6377 10847 -6158 -41670 -37362 -9653 13526 37925 32750 16688 39927 49578 14786 -12960
6365 -12960 -13919 4320 -20990 -18843 23032 72738 54194 55709 30297 21625 28210 46018 61304
6352 61304 3132 -20625 -35489 -28757 -29319 10145 -7484 -22295 -14603 -43120 -117225 -139947 -111044
6339 -111044 -85768 -60073 -33882 11353 -18806 -29405 -13196 -19570 -36485 25954 42785 29201
6327 29201 27096 15780 33758 61168 71647 28284 -6352 5957 31846 62016 62332 49461
6315 49461 1512 -47322 -50407 -27114 -35215 -33980 -3641 16087 38972 38256 10101 -18684 -45057
6302 -45057 -89883 -89436 -57753 -40332 -66400 -39736 -7306 55382 74770 39524 4164 -273
6290 -273 32075 57649 31274 18222 26483 12887 5019 -23217 13301 50401 22600 -19769 -12241
6277 -12241 -21934 -40391 -9401 11218 -10267 -30571 -17014 22904 55247 78745 73373 67360
6265 67360 32906 -12667 -28637 -47677 -37876 2843 -260 -27937 -61324 -47978 929 -44228
6253 -44228 -68347 -47586 -45384 -59466 -49470 -37692 -41612 -32383 -24647 12273 6165 -12386 -16466
6240 -16466 5416 27570 40099 37716 25934 7065 35099 21368 4838 1398 21235 22672
6228 22672 11323 7520 40583 30640 33506 -9984 -68586 -69099 -35476 -23958 -32976 -50528 -64381
6215 -64381 -39006 -43172 -27953 3128 48227 26011 -18201 -949 21174 -373 -23282 -14573
6203 -14573 -11137 -25167 -8302 25677 11632 41511 41558 12361 18336 12491 64009 60750 39103
6190 39103 -296 -28304 -40095 -51230 -17483 7984 1003 24129 -7423 -62652 -77719 -81427
6178 -81427 -59244 -51631 -63999 -51215 -27742 -40906 -64551 -39929 -16624 3799 26187 -5449
6166 -5449 -34392 -24295 21893 15663 5909 22117 29684 10437 12410 3093 21476 52609 57058
6153 57058 58034 33603 18337 14298 10075 -4320 -28235 -50154 -8864 40647 28689 -16333 -55573
6140 -55573 -54659 -3716 -17740 -39587 -43121 425 3958 -18843 -37400 -12084 13635 -9761 -12453
6127 -12453 -21232 -30796 -30958 -53923 -54940 -32208 -8715 -13870 23432 24802 4226 42463 70965
6114 70965 70568 46470 32552 31755 -2332 -25567 -23227 -14832 -22066 -26242 -23586 -44163 -73122 -36930
6100 -36930 -16960 -35329 -34939 -8238 -38461 -7392 -27339 -19975 3465 -4065 -81058 -55843 -19683
6087 -19683 5100 4946 20479 18539 -9280 -64207 -63319 -83913 -44129 17226 45947 10321 -37684
6074 -37684 -44830 -18108 -10496 -18299 -5778 5415 32210 36104 39646 55458 -7002 -38082 -47658
6061 -47658 16004 31703 8564 -21290 -44981 -11470 47577 62061 55119 13954 -14857 -60740
6049 -60740 -69781 -46654 -22765 9084 -11100 -35681 -36964 -18872 -20880 -27335 -25839 -11380 -18169
6036 -18169 -42369 -19412 6844 22673 35396 48500 58389 50173 54540 20068 -24617 -31240 -19105
6023 -19105 7018 21407 -10834 -12160 5829 -7893 -22128 40673 39625 -29403 -62777 -92635
6011 -92635 -66809 -52441 -24361 12452 18069 -6349 10070 44722 22441 26696 25180 -40894
5999 -40894 -86802 -63260 -52566 -43693 -21760 -7117 -12103 -40063 -69522 -40795 15232 18539
5987 18539 -34210 -57559 -35579 -21112 -26211 -45564 -93239 -74120 -66477 -58090 -48515 -35314 -7
5974 -7 16310 15824 -29494 -67117 -48903 -29022 16813 62834 72828 60592 34488 -1213 -29890
5961 -29890 -35750 -30733 -64423 -60020 -65606 -57349 -3988 -125 -25433 -41668 -71192 -67696 -43298
5948 -43298 -19776 41113 37317 38084 -1138 -19370 27677 58857 36546 4154 50975 66294
5936 66294 13291 -57938 -56067 -22401 513 12530 4080 -34947 -35127 -65938 -77977 -80989 -95139
5923 -95139 -88827 -72872 -55278 -67152 -91136 -75223 -34743 -26971 16420 -8814 -56287 -60122
5911 -60122 -45386 6256 50291 8506 -8580 10249 53396 64235 45046 31857 49116 43614
5899 43614 14262 18942 13201 -28137 -10605 24917 58714 30145 -11203 -15494 -46138 -96297
5887 -96297 -90280 -40749 24151 25327 15481 8202 9065 -11513 -37025 -4822 16083 -1816 14154
5874 14154 37824 -5710 -34284 -36855 -7765 -12280 -20015 -31363 -44507 -11574 42739 11108
5862 11108 15067 87109 101002 80516 39253 18528 -15550 -63727 -71698 -101705 -104796 -58879
5850 -58879 -68811 -67267 -20518 -6145 -9579 13507 41113 58100 51079 8573 -33316 -47166 -22956
5837 -22956 3917 7019 36607 52435 19324 -16046 -21188 -34978 -39741 -36662 -25590 22975 59044
5824 59044 38407 -13136 -34418 -25690 -12718 -14444 24670 14534 15678 24250 31030 -2024 -38615
5811 -38615 -25751 -25634 -58854 -82673 -74527 -31529 -8859 -23756 -40701 -20248 -25596 -69541 -64384
5798 -64384 -43274 -73930 -111874 -128280 -133693 -82010 -30465 -18300 -44035 -70677 -52464 -41880
5786 -41880 -29116 -23681 -25736 -23234 -13876 44050 57187 34018 -1329 -1743 -12077 -218 9630
5773 9630 -1697 -25252 -13168 6324 7282 17638 41285 46167 67838 46318 22466 -30641 -66431
5760 -66431 -70835 -57557 1497 12472 14484 -2909 760 -33200 -10192 30051 13277 -3064
5748 -3064 -5992 -21275 -12909 4694 -25788 -47169 -57913 -39795 -39737 -45678 -42836 -64863 -75542
5735 -75542 -53245 -56883 -33756 -15863 -64601 -98575 -96306 -57733 -14108 25374 60271 53774
5723 53774 22271 -12333 -24344 -11248 1165 -13399 -30162 -33754 -58335 -110372 -126236 -103773
5711 -103773 -70391 -59820 -83266 -69844 -44965 -22306 -2158 -15403 -39853 -14202 972 12862
5699 12862 14040 51198 62388 45356 8863 -1576 -9977 -5997 -38510 -57922 -44142 -36113 -34686
5686 -34686 -69061 -83961 -63584 -52737 -50964 -31770 -15038 -41183 -21645 -31594 20470 9926
5674 9926 -52508 -59064 -21762 6461 2872 -51883 -72721 -48732 -23065 -8816 -11726 -21901 -5622
5661 -5622 13602 2175 3917 17468 23163 24602 21236 4490 -11068 -39069 -56106 -52752 -19486
5648 -19486 -40112 -61615 -20301 -8162 -18171 -53483 -88388 -61305 -14879 25399 -4250 -17599
5636 -17599 7117 33300 22487 8292 -22193 -21042 42014 53139 58790 29919 11222 6191
5624 6191 21770 -3122 -31361 -42013 -14443 11449 4602 -36460 -27815 -4932 26658 67569
5612 67569 63400 66969 40318 32660 38895 53236 17019 -62360 -75409 -48989 -56598 -48710 7181
5599 7181 49012 54483 43046 28314 29348 56313 14011 -33563 -39826 -30778 -23579 29816 50254
5586 50254 66710 22369 -8806 -34133 -45401 -48345 -54632 -69487 -46668 -53283 -64709 -31389
5574 -31389 -8407 -9039 13244 1405 -47053 -66120 -31718 -26868 2551 -7383 -36001 -44968 -47505
5561 -47505 -21417 -40414 -15141 -12833 5719 47059 38964 -3427 9576 19582 441 18966
5549 18966 2505 -16767 -24814 -45752 -6493 -1003 31128 46487 23465 42930 35486 17106
5537 17106 3094 -36913 -76185 -95849 -104259 -28885 7050 -22753 -35708 -13891 -19817 -74620
5525 -74620 -15583 446 -14823 -28684 392 31266 15592 9753 4234 -17986 15852 5621
5513 5621 1091 13044 47035 68889 77221 73292 83708 31809 11631 35038 42342 33393 49225
5500 49225 50528 58400 26386 5054 8051 -11318 -17255 -28793 -61027 -49511 -26478 -22978 10838
5487 10838 17652 -12790 -43315 -32083 -44942 -49049 -53577 -36732 -34644 -54802 -9468 15951 20460
5474 20460 29925 45192 16038 5898 22295 64730 45952 23687 -3224 5702 12419 11701 4417
5461 4417 -20683 -21696 1048 -3511 -16032 -17613 44153 93150 82581 47736 19524 -17141 22894
5448 22894 29255 9213 -8421 -6301 -10272 13759 19942 -4856 -33938 -47550 -19920 28533 43609
5435 43609 75708 119574 81979 10314 -19591 -14531 -7017 13674 -6982 -4252 -33644 -28121 -33128
5422 -33128 -44088 -1476 9537 49203 76102 66564 11846 -37735 -71254 -37982 22537 27221
5410 27221 15308 40022 1331 -15881 14051 -13348 -3048 -34164 -13747 9344 -17692 4942
5398 4942 33051 9114 9840 35945 29193 40594 45299 47796 68665 96010 85118 91812 93855
5385 93855 74080 31800 23908 19432 -29419 -28007 -26053 -58267 -64316 -40128 -33694 -23152 -45965
5372 -45965 -23084 11579 46862 51238 -2158 -52777 -71832 -46929 -33118 14405 30531 31600
5360 31600 7858 13945 36211 12623 -29585 -27295 -49100 -18051 -6617 1734 -5086 -38180 -75864
5347 -75864 -50857 -6751 -22418 5370 54768 41853 12640 27949 31031 16870 -23669 -43649
5335 -43649 -8999 1479 -25957 -44332 -46288 -78206 -77666 -31828 -23360 -27489 -54663 -46262 -7411
5322 -7411 2617 -788 -22294 -29562 -4699 13727 16598 32789 20140 -30074 -44311 -55138 -78501
5309 -78501 -43687 -5238 5497 -25311 -9473 -6303 -36714 7842 25915 12728 -19232 -48405
5297 -48405 -29039 -29375 -51426 -18432 -3111 -33468 -27905 36426 37279 64611 36342 18994 28136
5284 28136 19744 -9507 -24334 -6573 -17806 -19040 -20228 -52851 -37150 -40661 -27528 -31771 -57624
5271 -57624 -44910 -32969 -15276 37337 46330 13993 -2706 -43631 -96650 -114163 -89431 -54102
5259 -54102 -36508 -47234 -71942 -18555 -23734 -28657 -22988 -42630 -42435 -70968 -10391 904 718
5246 718 -20334 -17695 -46648 -2663 -6876 -6272 32459 -9417 -12454 10424 11293 26249 24852 -20205
5232 -20205 -27729 -2288 28914 21017 -22825 -68690 -39822 -27788 -6696 9517 1076 -1960 -32994
5219 -32994 -12178 40589 39350 73978 76344 43829 38075 30966 -39180 -61609 -54184 -12814 32970
5206 32970 13751 26699 30552 20045 -9775 -11600 15146 -10844 -77787 -111551 -63262 -37141
5194 -37141 -19393 795 645 -11609 30076 31358 3984 -61175 -86430 -54901 -57810 -66599 -37436
5181 -37436 -4359 -89 -10753 -27055 -45833 -55244 -22896 6308 17621 34630 30338 -21495
5169 -21495 14437 40242 43406 37219 58105 44007 9152 28868 13872 412 3366 18772
5157 18772 -25120 -79692 -62675 -47012 -48000 -41854 -16578 -2029 27307 3862 -55294 -89071
5145 -89071 -88999 -87687 -39345 -4497 16404 -22623 -72646 -39643 -25691 -53230 -52969 -19432 -9663
5132 -9663 -25928 -38337 -15090 5729 5750 -27284 -38876 -61994 -55910 -18224 -6129 -283 -14587
5119 -14587 -49982 -47180 -55791 -29941 -20873 -24840 -24163 -37239 -42796 -40418 -75595 -90715 -58970
5106 -58970 -7176 -59 -17016 8018 -25169 -62493 -79720 -73630 -34432 -5517 3067 164 -13854
5093 -13854 -1540 -13127 -42640 -25218 -12195 -43844 -28785 -21671 -30157 5173 47149 18041
5081 18041 -9538 15228 20926 39299 77513 78472 44064 -12101 -10519 14737 20110 -2869 11083
5068 11083 1261 -9235 -32679 -46974 -993 19330 28945 8297 -8012 1792 -13725 -10415 -4297
5055 -4297 24173 66012 60144 39867 -3747 -9517 11719 -40691 -54006 -18470 -16961 -4951 34341
5042 34341 41447 14641 -30757 -39133 -19508 -45013 -47536 -11776 6428 -20347 -16875 9552 7378
5029 7378 -27512 -64601 -18116 -11890 8758 7090 13249 -21395 -2962 29483 33831 41770 -4218
5016 -4218 24333 25899 -216 -1495 27853 30156 49150 28210 22390 38762 27109 1753 21490
5003 21490 48965 13789 -2662 -2047 4226 34489 35263 10336 -3778 -28653 -20667 2117 13328
4990 13328 23203 26071 6856 -28379 -60903 -1736 12874 52864 78367 43429 50877 22726
4978 22726 44486 31409 -4619 -35164 -28148 -17225 -9664 -13307 -29460 -38598 4200 28648 47568
4965 47568 30851 -15018 -11824 -272 17564 35149 16702 -25250 -13337 10752 -26123 -45205
4953 -45205 -25675 -23787 -11144 -50351 -59572 -40611 -33455 -156 -9602 -47701 -26398 -14824 4649
4940 4649 5390 9675 -11840 -75882 -97930 -91453 -91557 -13924 13673 -32464 -33510 -35980 -28341 55918
4926 55918 44262 -1107 -44430 -76241 -33944 -9691 -55446 -91209 -82158 -78777 -36531 -625
4914 -625 -9799 6768 10238 -17723 -40377 -57960 -78835 -27890 -27002 -41415 -43558 -7089 -6198 3742
4900 3742 22064 22073 39826 82724 90623 33439 -54584 -50367 -15261 -28006 8364 -5658 36626
4887 36626 90532 87216 36612 28553 22346 41275 37527 18928 3359 -2725 -6853 15844 -1908
4874 -1908 22291 20819 -24872 -89626 -99437 -37657 9054 -11369 -3327 21359 42799 12532 -16513
4861 -16513 -4029 -17020 -26200 -17942 41821 40443 29621 -9219 -35977 -17905 -1228 -2423 -22644
4848 -22644 -24732 -14997 -187 32774 40468 13264 -14886 -29882 -56862 -14351 6930 -1433 -21912
4835 -21912 -1935 9821 11726 -8961 -36003 -9756 11286 30797 38386 46818 71017 66394 53919
4822 53919 27292 -11446 -24239 -11976 -2922 -13570 -15618 24438 -11822 -36170 -59241 -47402
4810 -47402 -49086 -48244 -58048 -91588 -31417 23399 4551 -15703 -42997 -67439 -77858 -66858 -52783
4797 -52783 -60446 -34308 -69073 -48843 -33235 -14485 -11029 -30891 -40986 -25997 -34456 -26828 11348
4784 11348 13619 11395 931 4660 -18613 -40077 -74905 -81222 -53133 -8059 24447 16574 24416
4771 24416 9907 -19576 -44417 -84300 -103061 -69783 -59692 -46668 -19572 -13418 -16567 -7022
4759 -7022 19307 37212 49418 -19351 -47126 -41382 6278 54485 44839 85751 85757 56546 46914
4746 46914 51946 52674 43019 22168 18526 6810 31974 56104 100454 90125 39679 13304 12667
4733 12667 27582 44927 15832 -42417 -51990 -18628 -57726 -12787 27953 79015 91225 18553
4721 18553 14509 56866 63164 31301 26712 23423 -11468 -3221 1932 8271 5845 -30793 -72885
4708 -72885 -71477 -66718 -36943 -20405 -3547 -28618 -45444 -21544 -7837 -8791 -41308 -32619 -11518
4695 -11518 9204 43488 58117 47384 -5610 11604 -3198 -26222 15217 19476 -17951 3462
4683 3462 -4414 8616 39708 40989 55130 73680 40263 -6231 469 912 21162 9833 5039
4670 5039 -19181 -44028 -53041 -43674 -36325 -2178 4935 41250 66155 13093 -59703 488 45240
4657 45240 39242 14566 -8694 24068 78360 72251 45416 18668 -50767 -26759 6834 36366
4645 36366 53478 65201 50232 8050 -9348 -7347 -19137 -25613 -15660 43987 61671 46834
4633 46834 42080 44554 34965 13938 44397 39417 -11553 -613 6346 -20870 -20390 -8386 -42906
4620 -42906 -43128 -39821 -62683 -15937 7395 2872 1616 8841 25873 26447 26230 26240 51317 18970
4606 18970 -12916 -20011 8239 21226 -26865 -26877 -1369 24905 -9777 9850 33433 21284 -14637
4593 -14637 20379 44119 49966 -10870 -47878 -15247 4899 18366 23344 19236 13592 28759 25707
4580 25707 33776 7552 -26523 -26497 7782 41151 33432 -13248 -29397 -53076 -91277 -84306 -48568
4567 -48568 -98951 -91405 -52438 -29286 19356 70251 59559 6047 8758 25390 -1979 -16824
4555 -16824 -17665 -19552 -28912 -17506 11349 27045 -468 -34917 -27084 -20798 -60305 -79411 -51961
4542 -51961 2158 25560 -19495 -53186 -76581 -50272 -46269 -15398 31617 34024 -9905 -28160
4530 -28160 -25497 -457 2514 -20357 -70040 -80386 -62224 -26056 -16709 -8628 9938 -19083 -33110
4517 -33110 -29708 -44264 -14298 35979 54919 57013 58134 2753 -2597 13925 19872 -25291 -52855
4504 -52855 -31050 17039 55028 39464 15013 -43852 -58974 -17916 -16500 6053 12181 -15794
4492 -15794 -17711 9885 725 35701 37873 28844 40329 2766 -29011 -59242 -57643 -3774 -4317
4479 -4317 32053 73943 9597 -40734 -69209 -63831 -13525 -22566 -66482 -90840 -103228 -113864
4467 -113864 -134390 -100820 -67024 -62253 -29655 3851 6663 -12639 -18431 -28841 -15989 1277
4455 1277 56259 47956 47472 -2757 -49574 -47724 -72211 -42241 -2154 -10461 9327 30467 74535
4442 74535 37674 -9035 -34050 14102 29314 9891 2950 -21893 -36832 30587 38355 23896
4430 23896 17365 -18003 -1024 7767 -22637 -18613 -7855 38988 73317 -1581 -19416 7379
4418 7379 -14238 -16756 -8530 4041 16290 10028 23566 28135 19288 5063 -354 -41310 -50266
4405 -50266 19035 39120 58696 85024 39521 35876 48591 81247 55561 40343 15696 7124
4393 7124 27776 21405 17937 -6448 -24738 15668 46009 62598 71996 69064 51336 51462 46376
4380 46376 14028 -4524 13698 -7221 11440 43268 54936 59585 43886 34433 34166 27562 23605
4367 23605 65176 51439 -6727 7461 17680 6963 2074 16063 13136 19046 91019 90935 55562
4354 55562 40569 32190 6486 -24234 7487 38921 -27142 -70595 -35838 -7303 833 -16976
4342 -16976 -56406 -43352 -36169 11552 49531 56308 37828 23652 249 5865 -1248 -5412 18550
4329 18550 -14263 -31991 29576 30869 -1537 9938 -15389 -12739 42412 31803 -9467 2758
4317 2758 19458 33102 -4464 -22826 -16739 -12510 -41492 -47484 -36535 -14326 -9965 -6952 -4531
4304 -4531 9894 -53346 -79455 -46619 -32829 14374 64279 49206 27551 20325 -35433 -71457
4292 -71457 -33981 16111 41270 51694 59350 39291 18950 13054 -21160 -20749 -52640 -26594 -14825
4279 -14825 -49861 -41827 -22531 -31399 -28324 -13038 -11677 -28317 -39750 -66127 -73666 -73008 -9585
4266 -9585 12672 -2901 7027 -8230 -21571 -7312 -30125 -51294 15038 27059 -29055 -28768 -24402
4253 -24402 -44833 -36290 4863 7744 15506 16251 -3242 3968 11073 -1373 -46949 -41346 12646
4240 12646 44049 34239 53789 38267 30161 23076 41240 29017 -16165 -20796 -20787 -4073 -6578 -24381
4226 -24381 -45309 -60696 -46443 -36557 -17372 -28373 -39743 -22438 31375 25646 -8475 6601
4214 6601 2804 8457 37332 44304 40118 27503 32775 39557 48913 45469 6895 -15163 -46841 14053
4200 14053 54257 35137 5230 8747 -2094 -9790 38784 28145 29572 -13624 -56098 -11398
4188 -11398 -4903 -39379 -71384 -59374 -19320 14150 46333 22707 21216 36651 47435 1561
4176 1561 -34223 -48744 -57844 -31510 -38428 763 37381 39630 23196 18709 44044 73199 66414
4163 66414 22750 -11736 -42177 -53392 -26041 1416 -20441 -71809 -80250 -99752 -43104 4366
4151 4366 29100 50033 51350 27717 22292 19080 -19409 -27285 -12965 27054 9886 -8610 -8851
4138 -8851 -12670 -60777 -79725 -63767 -28601 4994 -3960 -13735 -21500 -29351 -8268 -5826 -15576
4125 -15576 -14953 -40723 -27808 6005 -12249 -42957 -46655 -77494 -104102 -88924 -80173 -124441 -125927
4112 -125927 -96879 -32612 -41469 -3549 25667 37361 47229 71139 49842 8787 -7889 589
4100 589 25870 28745 812 -6629 -27717 3031 -10783 -11955 29290 27108 43383 35812 4620
4087 4620 -7594 11074 11759 18486 42069 49808 24750 41301 46330 56461 47905 19129 19709 -13107
4073 -13107 -11915 -5045 -11603 16740 -7438 3430 11013 35110 19242 -35492 -22487 2928 36662
4060 36662 65395 73523 42192 27013 40441 57861 18285 -25464 -16250 -19214 19836 50331
4048 50331 37998 -2506 -23105 2941 29794 22995 4236 -6020 -6226 -26900 -47186 -46936 -49081
4035 -49081 -76124 -35950 -4903 -12490 1600 21810 54668 46812 51095 17280 1010 -7008 -22843
4022 -22843 -42779 -43040 -50775 -45870 -54988 -84106 -40049 16464 17896 34081 26376 -35760 -82163
4009 -82163 -32716 20212 46233 65769 91480 80305 32849 40690 51069 26731 20695 272
3997 272 -5581 -28132 -2738 -19857 -48173 -64535 -74652 -52063 -46027 -24243 -26870 5365 3547
3984 3547 17038 45245 4476 -26559 -19265 -3996 -27162 -27283 -11570 -50111 -80800 -68527 -36572
3971 -36572 -33587 -29432 -2512 35309 15324 21014 20406 -10278 -62311 -43329 -38396 -45940 -28950
3958 -28950 -29349 -44756 -44662 -23918 -5680 22410 30109 34487 76279 91613 62255 32838 61725
3945 61725 78142 61399 54925 -6393 -25086 -39652 -23480 5665 46550 41164 11290 -257
3933 -257 20402 40230 26801 20093 5735 -17607 30362 76064 56222 21584 39831 43537 26401
3920 26401 17670 51684 10518 10748 6391 -24546 -7422 -6659 -28875 -17075 24133 -36098 -62600
3907 -62600 -43956 -30935 -13020 -11816 4310 212 -29145 -6353 4349 1951 16692 -40845
3895 -40845 -49385 -37217 -69572 -98346 -50565 -15898 7107 22592 69819 59399 48334 58256
3883 58256 53399 10889 -25756 -31496 -39890 -6186 5188 -19870 -11260 22193 30110 2835 -30855
3870 -30855 -30543 -79799 -83911 -21618 -54595 -45689 14083 24828 6080 -12868 -3867 20847 -7394
3857 -7394 -9023 21398 46485 35749 2496 24681 47809 45343 61891 53235 42429 21122 -9731
3844 -9731 -2406 7960 27119 36783 21758 3652 40220 48918 42715 85225 53876 45877 21290
3831 21290 -6233 15606 17694 1443 871 -36682 -54728 -28876 -29998 -65652 -100079 -76693 -5850
3818 -5850 44602 38152 -16216 -63570 -38192 -24782 -27513 -29926 -1673 20283 -8424 -14485 -30271
3805 -30271 -20158 -32648 -34020 1717 20715 26824 76848 98517 68558 16159 16067 36807 19124
3792 19124 -13369 -5157 19995 3270 -43874 -56890 -50883 -9535 16071 53877 22737 -21893
3780 -21893 10257 43831 24828 -30424 -54597 -18942 16743 -12172 -25158 -30058 -32398 -41111
$$ [...]
##END NTUPLES=NMR SPECTRUM
##END=
