##TITLE=Analysis number 314795
Compound Code cc 42309
Book Reference 449/38
Project Code adrs
Chemist Name davee
##JCAMPDX= 6.0         $$ Bruker NMR JCAMP-DX V2.0
##DATA TYPE= NMR SPECTRUM
##DATA CLASS= NTUPLES
##ORIGIN= Bruker BioSpin GmbH
##OWNER= NMR
$$ XWIN-NMR		Version 3.5
$$ Thu Oct 27 11:46:13 2005 GMT Daylight Time (UT+1h)  MAYBRIDGE\NMR@NMR_250MHZ
##.OBSERVE FREQUENCY= 250.131544655141
##.OBSERVE NUCLEUS= ^1H
##.ACQUISITION MODE= SIMULTANEOUS (DQD)
##.ACQUISITION SCHEME= undefined
##.AVERAGES= 16
##.DIGITISER RES= 18
##SPECTROMETER/DATA SYSTEM= dpx250
##.PULSE SEQUENCE= zg30
##.SOLVENT NAME= CDCl3
##.SHIFT REFERENCE= (INTERNAL, CDCl3, 0, 16.522)
##AUDIT TRAIL= $$ (NUMBER, WHEN, WHO, WHERE, WHAT)
$$ ##TITLE= Audit trail, XWIN-NMR		Version 3.5
$$ ##JCAMPDX= 5.01
$$ ##ORIGIN= Bruker BioSpin GmbH
$$ ##OWNER= NMR
$$ C:\u/data/dgb/nmr/ADRS/11450/pdata/1/auditp.txt
$$ ##AUDIT TRAIL=  $$ (NUMBER, WHEN, WHO, WHERE, WHAT)
(   1,<2005-10-27 11:45:32.49 +100>,<MAYBRIDGE\NMR>,<NMR_250MHZ>,
      <created by zg, POWCHK disabled, PULCHK disabled
       configuration hash MD5:
       62 19 C7 07 E1 42 D1 B7 37 6C 3D D0 77 39 F9 E6
       data hash MD5: 64K
       55 F9 E9 FF 32 55 92 87 CF CB E9 3C CF E6 7F 96>)
(   2,<2005-10-27 11:45:47.24 +100>,<MAYBRIDGE\NMR>,<NMR_250MHZ>,
      <Start of raw data processing
       ef LB = 0.3 FT_mod = 6 PKNL = 1 SI = 32K 
       data hash MD5: 32K
       C0 CD BE D7 30 4B 2E 5F 9E AF 88 D0 98 D3 24 CC>)
(   3,<2005-10-27 11:45:52.28 +100>,<MAYBRIDGE\NMR>,<NMR_250MHZ>,
      <apk 
       data hash MD5: 32K
       63 65 90 25 E5 DE 50 0B 3B 24 96 23 B8 9E 40 B8>)
(   4,<2005-10-27 11:45:54.08 +100>,<MAYBRIDGE\NMR>,<NMR_250MHZ>,
      <abs ABSG = 5 
       data hash MD5: 32K
       04 58 3F 7C 50 D9 02 87 67 E4 D2 1F D3 86 45 51>)
$$ ##END=
$$ 
$$ hash MD5
$$ B0 4C B8 36 1F 5B 21 C3 0E 0F 82 A3 D1 8B 20 4C
##$RELAX= 
##$RELAX= 
##$RELAX= 
##$RELAX= 
##$RELAX= 
##$RELAX= 
##$RELAX= 
$$ Bruker specific parameters
$$ --------------------------
##$DU= <C:\u>
##$EXPNO= 11450
##$NAME= <ADRS>
##$PROCNO= 1
##$TYPE= <nmr>
##$USER= <dgb>
##$AMP= (0..31)
100 100 100 100 100 100 100 100 100 100 100 100 100 100 100 100 100 100 
100 100 100 100 100 100 100 100 100 100 100 100 100 100 
##$AQSEQ= 0
##$AQ_mod= 3
##$AUNM= <au_zg>
##$AUTOPOS= <38 >
##$BF1= 250.13
##$BF2= 250.13
##$BF3= 250.13
##$BF4= 250.13
##$BF5= 500.13
##$BF6= 500.13
##$BF7= 500.13
##$BF8= 500.13
##$BYTORDA= 1
##$CFDGTYP= 0
##$CFRGTYP= 5
##$CHEMSTR= <none>
##$CNST= (0..31)
1 1 145 1 1 1 1 1 1 1 1 1 1 1 1 1 1 1 1 1 1 1 1 1 1 1 1 1 1 1 1 1 
##$CPDPRG= <>
##$CPDPRG1= <>
##$CPDPRG2= <>
##$CPDPRG3= <>
##$CPDPRG4= <mlev>
##$CPDPRG5= <mlev>
##$CPDPRG6= <mlev>
##$CPDPRG7= <mlev>
##$CPDPRG8= <mlev>
##$CPDPRGB= <>
##$CPDPRGT= <>
##$D= (0..31)
0 1 0 0 0 0 0 0 0 0.06 0 0 0 0 0 0 0.0002 0 0 0 0 0 0 0 0 0 0 0 0 0 0 
0 
##$DATE= 1130409931
##$DBL= (0..7)
120 120 120 120 120 120 120 120 
##$DBP= (0..7)
150 150 150 150 150 150 150 150 
##$DBP07= 0
##$DBPNAM0= <>
##$DBPNAM1= <>
$$ [...]
##$SUBNAM7= <"">
##$SUBNAM8= <"">
##$SUBNAM9= <"">
##$SW= 20.6930455092707
##$SWIBOX= (0..15)
0 0 3 0 0 0 0 0 0 0 0 0 0 0 0 0 
##$SW_h= 5175.983436853
##$TD= 65536
##$TD0= 1
##$TE= 295.16
##$TE2= 300
##$TE3= 300
##$TEG= 300
##$TL= (0..7)
0 120 120 120 120 120 120 120 
##$TP= (0..7)
150 150 150 150 150 150 150 150 
##$TP07= 0
##$TPNAME0= <>
##$TPNAME1= <>
##$TPNAME2= <>
##$TPNAME3= <>
##$TPNAME4= <>
##$TPNAME5= <>
##$TPNAME6= <>
##$TPNAME7= <>
##$TPOAL= (0..7)
0.5 0.5 0.5 0.5 0.5 0.5 0.5 0.5 
##$TPOFFS= (0..7)
0 0 0 0 0 0 0 0 
##$TUNHIN= 0
##$TUNHOUT= 0
##$TUNXOUT= 0
##$USERA1= <user>
##$USERA2= <user>
##$USERA3= <user>
##$USERA4= <user>
##$USERA5= <user>
##$V9= 5
##$VALIST= <valist>
##$VCLIST= <CCCCCCCCCCCCCCC>
##$VD= 0
##$VDLIST= <DDDDDDDDDDDDDDD>
##$VPLIST= <PPPPPPPPPPPPPPP>
##$VTLIST= <TTTTTTTTTTTTTTT>
##$WBST= 1024
##$WBSW= 4
##$XGAIN= (0..3)
0 0 0 0 
##$XL= 0
##$YL= 0
##$YMAX_a= 402739
##$YMIN_a= -337124
##$ZGOPTNS= <>
##$ZL1= 120
##$ZL2= 120
##$ZL3= 120
##$ZL4= 120
##$ABSF1= 16.522
##$ABSF2= -4.171173
##$ABSG= 5
##$ABSL= 3
##$ALPHA= 0
##$AQORDER= 0
##$ASSFAC= 0
##$ASSFACI= 0
##$ASSFACX= 0
##$ASSWID= 0
##$AUNMP= <proc_1d>
##$AZFE= 0.1
##$AZFW= 0.1
##$BCFW= 0
##$BC_mod= 0
##$BYTORDP= 0
##$COROFFS= 0
##$CY= 12.5
##$DATMOD= 1
##$DC= 0
##$DFILT= <>
##$DTYPP= 0
##$F1P= 14.0000005364418
##$F2P= -0.99999901652339
##$FCOR= 0.5
##$FTSIZE= 32768
##$FT_mod= 6
##$GAMMA= 0
##$GB= 0
##$INTBC= 1
##$INTSCL= 1
##$ISEN= 128
##$LB= 0.3
##$LEV0= 0
##$LPBIN= 0
##$MAXI= 10000
##$MC2= 0
##$MEAN= 0
##$ME_mod= 0
##$MI= 0
##$NCOEF= 0
##$NC_proc= -5
##$NLEV= 6
##$NOISF1= 0
##$NOISF2= 0
##$NSP= 0
##$NTH_PI= 0
##$NZP= 0
##$OFFSET= 16.522
##$PC= 1
##$PHC0= 77.68611
##$PHC1= 7.47856
##$PH_mod= 1
##$PKNL= yes
##$PPARMOD= 0
##$PSCAL= 4
##$PSIGN= 0
##$REVERSE= no
##$SF= 250.13
##$SI= 32768
##$SIGF1= 0
##$SIGF2= 0
##$SINO= 400
##$SIOLD= 32768
##$SREGLST= <1H.CDCl3>
##$SSB= 0
##$STSI= 32768
##$STSR= 0
##$SW_p= 5175.98343685301
##$SYMM= 0
##$S_DEV= 0
##$TDeff= 65536
##$TDoff= 0
##$TI= <Analysis number 999999
Compound Code 99
Book Reference 9
Project Code 9>
##$TILT= no
##$TM1= 0
##$TM2= 0
##$TOPLEV= 0
##$USERP1= <user>
##$USERP2= <user>
##$USERP3= <user>
##$USERP4= <user>
##$USERP5= <user>
##$WDW= 1
##$XDIM= 32768
##$YMAX_p= 401095233
##$YMIN_p= -858595
$$ End of Bruker specific parameters
$$ ---------------------------------
##NTUPLES= NMR SPECTRUM
##VAR_NAME=  FREQUENCY,     SPECTRUM/REAL,   SPECTRUM/IMAG
##SYMBOL=    X,             R,               I
##VAR_TYPE=  INDEPENDENT,   DEPENDENT,       DEPENDENT
##VAR_FORM=  AFFN,          ASDF,            ASDF
##VAR_DIM=   32768,         32768,           32768
##UNITS=     HZ,            ARBITRARY UNITS, ARBITRARY UNITS
##FACTOR=    0.157963299565203, 1,           1
##FIRST=     4132.6476996994, 0,             0
##LAST=      -1043.33573715361, 0,           0
##MIN=       -1043.33573715361, -858595,     0
##MAX=       4132.6476996994, 401095233,     0
$$ Real data points
##PAGE= N=1
##DATA TABLE= (X++(R..R)), XYDATA
$$ [...]
27113 25617 20676 -78269 -61774 -15643 21411 -210080 -431149 -584407 -407917 -162702 -156607
27102 -156607 -89861 -218412 -153344 -221160 -222873 -97952 -262767 -224088 -120649 27280 -122018
27091 -122018 -70936 -150082 -138075 -102083 -42649 -41425 47896 252275 166450 -77874 -133149
27080 -133149 -129511 184297 198797 -47901 -104721 -239774 -304804 -111601 46077 63925 -77935
27069 -77935 -247256 -180017 -197654 -75884 192775 194735 249628 161023 -10490 -179686 -279650
27058 -279650 -534296 -312521 -161869 -44029 -21492 49498 -51919 -24004 282420 250956
27048 250956 167904 189940 252103 265138 63339 -71578 -69879 -44601 -20738 -12227 219924
27037 219924 58531 51599 118582 188759 89065 95894 -35610 -98860 -14794 204651 82008
27026 82008 -66131 -222602 -481193 -320563 -323362 -89861 -54261 -205585 -156068 14414
27016 14414 69579 -85106 -139319 -101614 -345195 -194656 41625 -107470 -286826 -181461
27006 -181461 41583 -29164 -151817 -168786 -57412 -113722 -117998 -66290 49971 149830 254894
26995 254894 79736 -192379 -161837 1980 99007 209986 301400 170973 53663 57887
26985 57887 245375 238327 304647 212013 54157 33338 123853 401384 292035 2442 -237002
26974 -237002 -248980 -303110 -441461 -304874 -92647 6194 -6579 147904 14674 23959 54061
26963 54061 -39300 76924 -165421 -495061 -415752 -524508 -281091 -161205 -220594 -199978
26953 -199978 -269133 -215534 -185016 -168826 -79068 15436 78448 73816 -66291 -100498 -23389
26942 -23389 -427674 -451635 -364032 -155931 77532 68479 -130544 -67082 136966 257532 192949
26931 192949 386851 391964 239044 157267 18847 14556 23987 40597 135847 137623 291093
26920 291093 146505 84604 45741 50231 160626 -124573 -251016 -188332 -220445 -281735 -277121
26909 -277121 -100375 -148409 -196879 49163 282178 142551 -125763 -422453 -406693 -216475
26899 -216475 8867 -1100 -43663 -87022 -282097 -80115 -55370 -185161 -204886 -7327 36225
26888 36225 -185129 -268400 -205975 -129227 -128881 -264644 88326 174397 -19788 -66937 -12469
26877 -12469 215646 175019 -894 -114295 -71326 -35518 -23545 -134026 -183448 -238572 -298279
26866 -298279 -77363 -7096 32307 -33351 5860 25682 -143525 -127349 135036 126341 131807
26855 131807 160808 48775 -146622 -319896 -105947 8001 227527 274271 299624 294913
26845 294913 224675 183772 150572 21187 104683 143148 195823 344278 533818 420022 180826
26834 180826 152896 107852 205265 116321 361021 542615 257048 -229590 -301067 39618
26824 39618 -38568 -40938 58685 238577 200030 329942 369285 176484 8451 64838 257887
26813 257887 398471 242237 310526 321095 325929 255337 82046 144715 82578 -7732 -70909
26802 -70909 -143042 15002 -42301 -84004 -136201 31535 252110 6812 -80708 -30170 -190122
26791 -190122 -167187 -84981 56067 40211 -107875 -292089 -276435 -65234 312908 330033
26781 330033 35000 -86725 -11211 41041 200163 191736 316262 290512 73063 -75657
26771 -75657 58408 175483 209615 7765 -33610 28616 -67516 -162985 -100545 243212 398009
26760 398009 507505 367632 85111 46585 305315 182045 66649 315819 305990 255450
26750 255450 319079 191322 114412 -13977 -233471 -246942 -53109 115623 197403 79609
26740 79609 93156 82735 312 -41144 -100057 16936 99637 216999 359615 292337 207482
26729 207482 76466 118085 275471 144888 -28759 -51952 30392 24523 195369 39359
26719 39359 -146148 41219 16090 -87592 23947 33075 -162750 -223432 -296922 -319908 -149365
26708 -149365 -246155 -173170 -22691 -14385 8740 84758 110999 222712 138773 -134905 -56901
26697 -56901 -9902 -183313 -212639 -109524 -178261 -175607 -214707 -332509 -402595 -300942 -103432
26686 -103432 203074 381999 436445 464294 548299 515716 458713 125393 77920 39672 35723
26675 35723 188704 227143 219089 -47457 -439418 -378404 -423872 -509480 -529384 -455968 -227040
26664 -227040 -122216 53398 128822 -48508 -138896 -35636 10628 196094 151936 116373
26654 116373 -21293 4727 -47642 -80883 -81839 314 -32332 -41144 -101617 -150670 -73874 -163920
26642 -163920 -179626 -180183 -250829 -183507 -203586 -256031 -250893 -311616 -147773 -155915 -202037 170215
26630 170215 199643 216749 30055 -291801 -405391 -188492 -184859 107268 345952 351121 192490
26619 192490 -103024 70445 222274 168188 -12915 -260506 -540553 -495579 -247002 -125847
26609 -125847 -68774 -265355 -182176 -177064 -157836 -87307 -153313 -281576 -159780 123659 134560
26598 134560 17211 148169 105265 30538 -216261 -159990 -100049 -188604 -271719 -165101 -106396
26587 -106396 -102966 -313953 -392823 -304124 -99749 -14896 -126474 -298674 -66943 -23109 -184999
26576 -184999 -149455 -213452 -152719 -19451 -194651 -269832 116402 233189 44010 -126554
26566 -126554 -47916 60856 -94392 -81487 78387 176538 146699 231769 356992 226405
26556 226405 347392 182012 21145 -113854 -199877 -255902 -10696 -366692 -413907 -236214
26546 -236214 -173102 -56915 298919 347030 69355 -182992 -343621 -317071 -164272 -289869
26536 -289869 -284955 -375835 -360139 -111393 16925 48727 24244 147791 112160 9019 -124329
26525 -124329 -139736 -308273 -241828 2973 -168758 -304384 29913 89151 25372 9647
26515 9647 -75179 -340749 -258837 -166863 -82726 -62341 -41937 -40737 -53280 -25101 90114 193691
26503 193691 88519 -68148 -97028 -52386 -19926 -62850 -129763 -285954 -184172 97315
26493 97315 61993 -61164 6851 66648 184090 431376 254946 304515 227428 178947 184664
26482 184664 126844 163762 187927 -82946 -238259 -319793 -186601 -193938 -10705 30975 15144
26471 15144 -45621 -131740 -221476 -59245 57846 -48421 -80710 -102725 -151057 40918 158981
26460 158981 102235 236664 512742 239264 44859 -59825 -82912 -37097 -50445 -121481
26450 -121481 -6701 172747 169261 30553 18784 -129448 -252528 -79523 -10259 -204550
26440 -204550 -232990 -114729 -25345 363312 381678 376426 165003 105278 16372 36999 150520
26429 150520 60532 -214280 -190315 -166768 -227243 7680 46541 108090 -122805 -113106 -206719
26418 -206719 -41487 -54218 -12396 -30162 -38600 -202026 -322950 -108825 -668 5182 -14303
26407 -14303 -98264 -1071 -134589 -196494 -199439 -245475 -260195 -231383 28645 240349 379924
26396 379924 419481 224240 218477 208528 237805 359742 230822 128338 -75993 -178040 -66374
26385 -66374 -212617 31667 268784 257235 65853 88365 275206 172521 43975 63752
26375 63752 -87307 -124671 -217369 -296458 -113871 111505 243321 122496 -17241 -196791
26365 -196791 -307674 -46290 -46149 29195 144445 68591 -109588 -335795 -452245 -244975
26355 -244975 -255558 -508327 -606288 -481588 -228071 111425 88360 -1742 -244373 -356489
26345 -356489 -423139 -316608 -39611 48914 -101285 -65950 2287 -128323 8185 151845
26335 151845 228936 188273 375389 422515 250786 91797 -122234 -145713 -216654 -386391
26325 -386391 -440357 -500400 -426420 -276719 -82609 -238259 -308836 -276463 -60173 -131308 226744
26314 226744 546002 440115 168165 140694 23770 61364 -223428 -422834 -367170 -127900
26304 -127900 134694 148362 -28449 -83802 160791 55137 -30785 132075 181554 -33716
26294 -33716 -150113 -14753 -163970 -128933 -29946 148172 317021 291694 285005 368236 171003
26283 171003 53962 -24013 -122287 -114811 -174507 -49532 -101692 -190191 -209203 -49087 -44788
26272 -44788 5353 -78649 207765 359995 372479 406198 287930 203718 27912 210584 152008
26261 152008 55466 49674 -179687 -246972 -213588 -235960 -168312 -166357 -218237 -218951 -267449 -154090
26249 -154090 7650 -18354 -62508 -142418 15455 -47343 -77327 11133 -8579 142754 51747
26238 51747 133267 28647 -9581 36332 -245682 -73806 94752 260361 62850 -141067
26228 -141067 -164264 -113987 16206 70692 -78620 -141874 -159662 -165576 -222617 -247669 -368532
26217 -368532 -501619 -468975 -400958 -384648 -309027 -314023 -347634 -268449 -96849 -151022 -92642
26206 -92642 -134183 -195588 -97099 -31949 -163865 -88761 52401 177240 -29031 -267612 -518566
26195 -518566 -466950 -195871 -137594 -470827 -329434 -274311 -354205 -321654 -128041 -13218
26185 -13218 54879 37470 -47596 118230 156071 151502 375088 156851 40010 376234 78273
26174 78273 -59887 -222445 131 75440 251303 108579 1988 -156189 -250103 -60639
26164 -60639 31883 -213745 -396825 -194485 -252664 -207507 75695 310836 263512 335082 484033
26153 484033 220901 -190331 -285974 -63173 189360 237735 236847 9944 -141676 69934
26143 69934 231366 169852 203553 98094 -127641 9599 -98808 -360952 -232647 -28957
26133 -28957 -72126 -185758 112426 162760 108128 37500 52837 126299 -21564 -48938 -98877
26122 -98877 42763 315919 486701 406629 196490 -8010 -311733 -265786 -226198 -3253
26112 -3253 84628 -25928 -148371 -203132 10746 -65422 -355224 -273362 25898 232232 114725
26101 114725 -98150 -126864 -177294 -258406 19989 -5405 -301813 -305387 -340259 -261485 -106062
26090 -106062 -88264 -82594 -182008 -243041 87333 115663 -48295 -150424 -149943 -177923 -559799
26079 -559799 -524314 -484661 -308554 -30624 -89636 -147786 -273267 -416364 -370476 -156427
26069 -156427 -100749 32611 142664 180978 -24804 -111273 -52210 -54599 -156530 -443243 -380462
26058 -380462 61627 316256 -29136 -245017 -195157 -78909 -44971 34104 20523 -117331
26048 -117331 -252468 -317637 -224287 -205866 -89440 -49017 -183805 -267880 3963 217032
26038 217032 98494 6241 325144 294118 72149 124253 184274 -117975 -102990 -273110
26028 -273110 -269754 -17634 -142059 -158326 -325128 -370954 -246289 -39046 123744 219122
26018 219122 163788 -195620 -364677 -297541 -318422 -405834 -312514 -282981 -140887 24470 216617
26007 216617 264413 105745 14588 56835 -14753 -51674 -25280 38443 127319 174654 248643
25996 248643 199938 45626 -77981 -214552 -112013 174136 -81871 -288210 -262649 -236135
25986 -236135 -280475 -25981 21971 -40168 -31197 -57684 -188827 -177247 -136778 -25180 126318
25975 126318 270987 79689 -228459 -428131 -222847 -128800 -216124 -83543 154650 24365
25965 24365 -34610 -54267 -120181 25268 198613 278373 473801 350151 -5841 -206865
25955 -206865 -149777 56320 51950 103164 105716 86784 33505 121530 93870 -74972 -140684
25944 -140684 -226743 103758 146678 228755 228285 -309448 -528984 -330474 -250314 -473282 -587102
25933 -587102 -494327 -273900 -147562 -153233 19127 92337 90758 -40389 -106574 -17170 -91996
25922 -91996 -117213 -97520 50103 98207 -42573 -53751 -339704 -572423 -512040 -387525 -229481
25911 -229481 -275233 -128278 -1826 -27705 -64501 116744 182038 -47122 -218286 -22870
25901 -22870 121505 -137058 37143 261087 -162831 -415835 -202529 -55811 -66888 18847
25891 18847 55309 54156 282637 356057 259011 278317 299416 112408 -42680 -124912 -366818
25880 -366818 -295889 52897 205139 180756 107141 98849 166748 400073 386910 153376 42517
25869 42517 146334 328725 414748 148201 -63962 112109 74856 33587 116804 -42945
25859 -42945 -168288 -269689 -96021 -80484 -168886 -61571 -75668 -152188 -228006 -210605 -144223
25848 -144223 -284867 -161263 -149250 -247484 -92825 -17528 63840 -129937 -201427 -190538 -47920
25837 -47920 -74818 -185648 -73743 -70566 44275 33865 83525 229622 130184 183281 329398
25826 329398 383716 76253 -58881 -49484 -24946 -105486 -278837 -296997 -313022 -204033 -145094
25815 -145094 -4908 207662 281613 231941 46554 -214882 -232261 -119901 -90507 -114485
25805 -114485 5025 -268252 -324263 -304720 -111465 -10603 47333 37723 128256 326176 435592
25794 435592 195990 97270 -97912 -163636 -8034 -43903 53157 132595 107451 187221 -15267
25783 -15267 -34982 65808 -235281 -422680 -472830 -236380 -123367 -31141 217624 262500
25773 262500 233154 116944 178553 224252 242090 -31782 -48405 10954 1931 -24536 83146
25762 83146 165263 -35159 -14305 57745 -97732 -160370 -35556 87122 120844 247879 120603
25751 120603 -45649 174638 139361 79411 262114 161586 156518 242329 236263 -141955 -194172
25740 -194172 -151100 -222309 -25155 197915 466284 453652 225917 -14400 -31359 38013
25730 38013 236158 526170 523225 199664 84084 42613 129249 144919 113069 258162 478874
25719 478874 316987 91566 107499 35069 -51479 -73151 80130 398430 440220 395871 28533
25708 28533 -201382 111318 308665 200166 182040 294399 407744 359153 427628 367491
25698 367491 126887 -24629 275 163203 204787 326669 469749 187650 103632 203122
25688 203122 147911 133790 118996 -47916 -248232 -156285 -71562 40727 147569 232782 57075
25677 57075 2891 -10926 -57457 40965 -228776 -186030 -177487 -223426 -40140 -130758 -47277
25666 -47277 -158614 -98102 13836 73658 185819 353287 283437 283831 160540 153170 143198
25655 143198 75905 -27757 -269770 -298627 -422623 -282079 -199553 -392648 -347134 30122
25645 30122 225750 305844 144894 67192 -36308 -134981 -128725 24297 121367 -83481 -306137
25634 -306137 -133910 -29119 20390 -1350 67550 -35158 -181992 12897 197809 93243
25624 93243 95461 -125203 -404209 -151276 90359 -15941 173962 239339 106028 -22146
25614 -22146 -140898 -84660 -131521 -114478 -39833 -40717 54888 12982 -46088 -228217 -158167 -45623
25602 -45623 59534 -37433 49649 265735 262671 154676 -58623 -34492 76944 169089 92956
25591 92956 -51544 -209178 -74972 -154800 -176439 -92915 247487 307880 295813 -24655 -188533
25580 -188533 -55504 149199 164507 -74122 -107026 -80093 -14293 -44810 62707 -28386 -16168
25569 -16168 69731 -71909 65495 154732 151668 178036 236122 221459 147401 86911 -40791
25558 -40791 -221871 -341448 -667246 -354943 20183 -29790 32123 59766 -113426 -210615
25548 -210615 -236825 -180314 -68548 74404 206068 166940 -45378 -79781 102533 376242
25538 376242 385837 300474 320559 247406 129243 194787 169660 25624 -5121 -184714 -82212
25527 -82212 -47613 -19974 22327 -81776 -219524 -270109 -182813 -51604 169847 -15093 -193118
25516 -193118 -111976 24633 59107 46236 -57318 121422 -53491 -63388 49764 181333
25506 181333 109530 233627 259044 95655 237659 241727 221938 35488 17308 -40653 -109007
25495 -109007 -11954 113555 -11824 -120926 74826 201664 291968 296181 268024 364350 509764
25484 509764 500606 305590 155975 -23295 54687 190981 327420 233548 230392 -2890 -247213
25473 -247213 -64620 58044 -131628 -81805 129469 198123 143821 14483 -136761 -379972
25463 -379972 -279976 -116246 -213213 -103697 -74025 -1085 11124 -283027 -51892 49396
25453 49396 176745 562790 506984 120677 87027 255986 176819 -62519 106312 160805
25443 160805 133209 485722 621227 389903 183975 -110202 -226018 72082 245975 390157
25433 390157 455719 362677 294099 162317 -148978 -315379 -430022 -375667 -135457 15751
25423 15751 122611 28484 -201654 -326208 -197210 -77094 -174778 -214543 -299491 -267464 15514
25412 15514 368638 477390 256371 200346 -82549 -279605 -338289 -210183 25958 -42839
25402 -42839 -111583 -86736 36198 94401 76484 -26823 72419 -135200 -163275 -47164 -207912
25391 -207912 -281395 -139143 53538 110768 222219 12727 -137789 13771 -26092 -158547
25381 -158547 -233843 -184698 -128430 -6516 119374 153181 15803 -27092 -62626 -79933 55712
25370 55712 267322 76192 -33771 137589 88462 38583 3450 -21061 -163665 -51920
25360 -51920 105618 88600 -73930 -14589 274097 116339 -132921 -108018 -151624 -113542 -150875
25349 -150875 5655 67290 42986 -4137 -5987 -204211 -262057 34018 -16920 -181367 -271565
25338 -271565 -205633 -77411 222800 84567 -155922 -351896 -598823 -648025 -310683 -98641
25328 -98641 -171461 -233083 -42753 -14351 -134714 -160544 -81939 -53770 -198306 -152996 -135612
25317 -135612 -257217 -439037 -146544 -27730 10100 -121651 -290757 -210310 -138493 -196415
25307 -196415 -6591 63083 59352 -83687 -67013 -89665 4694 132470 38841 85441 266412
25296 266412 241580 279585 220623 198160 109334 8633 49390 49686 166072 144618 92471
25285 92471 -116094 -93767 -6071 81723 -45861 25786 144256 465952 327593 210117
25275 210117 180861 134230 256937 360385 424034 538687 652351 594918 330547 211689
25265 211689 430191 393118 380298 431259 433234 446480 351672 408183 423411 345542 307260
25254 307260 209244 -21228 149574 298507 127320 190833 240461 104903 185823 13831
25244 13831 -95831 45063 45180 29578 200741 167947 -11475 -37893 -115332 -176596 -133229
25233 -133229 82940 181817 129693 -91272 20816 -19395 -102380 -287862 -27791 374404
25223 374404 596752 580298 405342 552319 470604 220237 62420 -60942 -156079 -28042
25213 -28042 -252367 -300026 -167151 79426 243259 169344 20584 175217 548567 636571
25203 636571 356565 124354 176945 49370 -121927 -257137 -163379 -120934 63731 188066
25193 188066 203497 254014 316726 241822 -67614 -29226 119785 -80355 -104739 -40798 -153825
25182 -153825 15337 196757 -73432 -160889 -147289 -18907 -102643 -156910 -119525 105371
25172 105371 194658 79422 -11538 86214 308853 288744 152982 352341 279771 161113
25162 161113 212561 97110 -11837 -17437 -158958 39329 194396 137329 -15958 51723
25152 51723 87502 -116894 -127759 -44883 -280069 -486501 -249557 -92548 -174290 -259727 -94938
25141 -94938 29019 5291 99715 124093 85914 34428 86964 176171 325307 263376 81334
25130 81334 72384 119445 12639 -18695 326355 377208 384841 256814 126252 129418 41530
25119 41530 150044 118911 179379 327286 237411 54817 -117229 -111801 78620 230254 134900
25108 134900 6470 -33011 -62667 18372 -171770 -277714 -337771 -402914 -536576 -348939
25098 -348939 -150277 114121 145183 117117 105878 103258 244760 199528 -80001 -64765 -207408
25087 -207408 -261467 -264248 -247119 -138245 -30964 49669 54877 -32075 -164888 -221717 -278522
25076 -278522 -265758 -172127 17443 37656 -15695 -80752 -98569 -146976 -84149 -51014 86259
25065 86259 58809 -71433 -65070 -201719 11567 204832 178377 15904 -46639 -18994 -119038
25054 -119038 73877 181686 196762 137972 191418 61649 -34765 -167155 -167494 -228331 -292813
25043 -292813 3248 -12310 -97409 232935 346447 154749 -74964 -296540 -307789 -441098
25033 -441098 -416103 -203330 -188083 -149818 -94401 -332133 -243575 -166251 -189991 -81723 186509
25022 186509 342355 181130 185930 57121 -237689 -455121 -372615 -243850 -178372 -122569
25012 -122569 -65796 54278 16917 -68494 -465 196096 -1057 -364642 -573283 -206270
25002 -206270 -24409 -44654 14964 38815 68959 -42646 -83072 -85119 -236805 -148136 -168389
24991 -168389 -238490 -147540 88111 89666 43436 34732 58178 -21672 60812 27426 -229293
24980 -229293 -376297 -124091 31506 -175519 -264176 -228675 -81570 -178834 -133915 -224228
24970 -224228 45512 38868 -3797 -73223 -27077 31972 49286 103455 128496 313345 275509
24959 275509 -124017 -200550 -230609 -297582 -106678 -50606 -72897 -116398 -121186 -116492 -18787
24948 -18787 65282 -94170 -20814 111362 132896 82021 -11244 2028 67534 -139011 -102158
24937 -102158 -62371 -165232 -13012 336847 510518 494058 57290 -143551 28155 -26806
24927 -26806 -190939 -99790 -76714 -111561 -36804 60131 -270086 -210352 146954 320664 262145
24916 262145 173065 -96228 -297239 -497919 -247478 -216319 -205295 -106082 158168 48551
24906 48551 -110126 8181 -92022 -324254 -298810 -449893 -592055 -644334 -443307 -341523
24896 -341523 -172523 -140648 -6130 -36553 -12704 2650 -148484 -352696 -139698 -99344
24886 -99344 7296 161108 168544 277635 310110 321554 387290 344653 388639 422350 130253
24875 130253 121180 35178 3350 -66933 -117515 -56561 -103592 -103612 -18075 90277 177559 196624
24863 196624 136259 36775 -11410 143316 118671 34821 178418 223078 183318 99762 45727
24852 45727 136830 8386 -211833 -127623 -148658 -180902 -146105 -113072 203070 358994 363806
24841 363806 498268 437239 162001 142615 221249 398024 425573 469381 329722 194332
24831 194332 203614 270546 309880 106885 -111593 -81624 40845 135178 16067 65306 286381
24820 286381 345160 395596 239164 89011 97229 -168914 -221337 -312117 -585470 -373462 -82617
24809 -82617 -6104 -224834 -217547 115163 182971 305931 556370 430150 168695 172172 111402
24798 111402 137586 252838 433977 382172 206823 -136530 -278774 -206583 -147398 -214842
24788 -214842 -182968 -83213 48470 112376 161398 22629 51549 61184 49101 208677 442249
24777 442249 572635 670516 513193 374605 157563 336900 365852 263966 328642 130289
24767 130289 67845 -33396 -156035 -119486 84848 54260 10533 366764 368741 266116 139675
24756 139675 82647 105216 -2058 -104636 163496 323873 112968 115701 109540 78785 257321
24745 257321 249774 218797 234783 117366 196679 169846 -22423 -8607 -29637 -27836 -43148
24734 -43148 -28480 -168414 -251341 -155346 -227125 -363336 146359 398300 438756 232362 -135312
24723 -135312 7062 -4954 28502 383771 763197 774682 531648 288295 262612 162198
24713 162198 190587 17549 -98962 -134911 -60765 91290 -20745 -36281 -27670 70694 -251408
24702 -251408 -307190 -258385 -133796 -57866 -43989 -36899 -16492 111554 174354 216431 201173
24691 201173 216645 188202 166091 14146 201508 208265 109110 -5248 -10351 86169 141154
24680 141154 86219 -56349 -148483 -72871 133450 155313 -73724 113732 180395 310295
24670 310295 346504 228267 62693 167323 336812 409012 396606 467415 422297 123398
24660 123398 -212554 -227129 -84502 59765 -45181 -105131 -15950 200159 396319 280239
24650 280239 238602 22682 -77064 -186217 -129441 28175 210492 135862 130973 42164 -295762
24639 -295762 -357047 -207158 -198810 -125989 -44304 -72523 -226268 -313617 -367643 -354832 -92688
24628 -92688 111036 -72516 -82742 17840 8582 144497 307300 356441 405398 213084 117728
24617 117728 106364 122096 89743 150072 57760 -5872 27410 -127865 -309147 -256926 -37606
24606 -37606 36497 -52322 -81445 -135223 -139236 -121046 149282 166921 117183 327313 206558
24595 206558 236355 414628 291946 299559 394458 446362 369597 236835 -164545 -111534 83820
24584 83820 287272 153596 7485 35628 -83205 -134273 195265 280660 118460 -9826
24574 -9826 105814 244868 395707 458204 472741 408298 364290 263434 130813 155037 226172
24563 226172 257824 -51001 -128887 -98286 -168815 -139849 -156765 70138 240007 210548 279771
24552 279771 133466 149493 203204 162122 189841 73465 8932 218461 60387 21225 -31638
24541 -31638 102876 135158 91384 40276 42056 13434 56622 -87309 -72237 -171231 -99407
24530 -99407 -108547 -218424 -452242 -490625 -466165 -388945 -210883 -202815 -200262 -13524 29628
24519 29628 37516 26859 -151244 -315150 -194643 -80287 253355 367790 287943 194425 101247
24508 101247 172955 181128 173511 175127 259368 253845 211829 299836 14295 -263449 -240170 -227348
24496 -227348 -85080 328500 439344 589256 557248 322723 274075 342502 311331 313720 57877
24485 57877 94605 120815 259469 -1485 -339563 -320159 -242204 9698 92633 110596 -4118
24474 -4118 82341 -40095 122435 356308 362801 266703 128857 71042 -64344 -151159 3404
24463 3404 18597 115725 285426 139508 56289 -196207 -376783 -188010 155300 142226 122004
24452 122004 93260 243219 268949 337152 544445 415936 285978 273785 156950 36172
24442 36172 -7870 -61418 -121487 -143776 -22230 -46544 -76865 125530 297887 241933 278388
24431 278388 172447 241032 209731 266667 173672 227452 142902 96387 210521 379290 398234
24420 398234 307030 -8192 -77886 110066 122645 149374 335071 379531 346214 377738 297801
24409 297801 -3989 5024 148551 272340 218841 185142 63320 65264 20756 -112574 -199899
24398 -199899 -384626 -442476 -273958 -245122 -74255 87168 -12564 -21899 -34677 -163845 -22082
24387 -22082 94544 107580 165448 233318 13686 349398 501592 189571 21399 -45934
24377 -45934 87470 243960 255376 507294 500381 484038 334791 65257 -64598 24510 -3363
24366 -3363 -71494 -67409 -197785 -295469 -153727 -123720 -179639 -134105 -224870 -4369 186690
24355 186690 197279 -74377 -267927 -96161 -102106 -114928 -42473 164194 278595 302689 257370
24344 257370 202059 -87261 -119082 75710 72065 -29609 -175225 -386437 -421367 -397106 -335496
24333 -335496 42124 168524 -190315 -271690 -173849 206457 304820 250147 209669 71836
24323 71836 -156565 -58749 -25606 -132469 -113027 -41545 -93183 -327653 -256714 19524 139897
24312 139897 -23377 23544 83390 154459 106335 -239796 -324317 -121919 -62152 -256383 -310508
24301 -310508 -168370 -72597 -90269 -334922 -192205 15227 -70314 -36584 -92411 -9470 271074
24290 271074 252754 195052 119833 -45256 -64086 28087 -248954 -105214 129677 155702 115594
24279 115594 68220 148185 106481 -108431 190715 443971 385587 425488 421898 230978 -15447
24268 -15447 -206802 -258794 -258969 -302637 -160230 -50095 -58520 56717 27036 12222 41982
24257 41982 160423 37368 -42249 -127509 -29788 228464 196430 293525 144917 -2645 -82832
24246 -82832 -174101 -73962 185451 144187 19943 103727 15161 -153800 -114879 -86127 128895
24235 128895 75716 -50867 -34776 -161117 -169891 -16905 1877 -29504 150938 211911 222778
24224 222778 324347 236447 114111 -182471 -363623 -282127 90927 217305 52448 -74727
24214 -74727 -86825 -56557 -7195 -198467 -292256 -405110 -338184 -98525 23635 177552 -32309
24203 -32309 -123024 -75079 -155645 -405602 -274348 -157264 -137896 -51612 -73294 -23814 7153
24192 7153 -63832 -65372 224584 218333 109375 35138 -153866 -194936 -61724 -351040 -457135
24181 -457135 -244719 -178233 8830 7806 -119580 62130 47522 -13927 67642 135184 274945
24170 274945 260565 438932 351949 186777 313364 282158 336038 386182 178901 117929 98780
24159 98780 106732 -36398 -158821 -102551 161539 294019 241012 -72628 -46218 42472 -213372
24148 -213372 -287972 -257372 -258711 -145062 -40129 207583 190657 208998 149709 202233 342126
24137 342126 186196 81122 135821 214950 225988 131858 -139432 7381 169316 100201
24127 100201 95973 54500 127707 172457 127 -329948 -208482 11937 150223 189527 90335
24116 90335 -14288 4833 9997 -36843 -139332 -221323 -308486 -380821 -277855 -9836 -36835
24105 -36835 -316203 -166884 -123049 -201247 16252 230001 411861 350297 372557 304205 80496
24094 80496 210825 288881 217761 -6785 189442 85242 -12367 53384 -98580 -21852 99667
24083 99667 174426 293945 214774 109932 362664 647908 721025 656891 454355 413306 194663
24072 194663 -112880 -30026 83412 221546 479473 410819 116027 -35945 -258433 -392357
24062 -392357 -267305 -265556 -261751 -272981 28406 174859 219342 347775 99067 100781 -7112
24051 -7112 267788 312551 229397 350185 477792 427364 142975 -10985 59064 77262 121718
24040 121718 266514 251909 205537 226839 136353 194780 172443 -54074 -85428 -271081 -490597
24029 -490597 -416646 -236913 -204447 -92935 14452 41235 -63044 -50606 -114230 -50291 59455
24018 59455 142819 146362 254603 286035 423588 338538 123177 -104953 -49156 13538 238893
24007 238893 348819 420617 281225 23365 106043 66543 -86589 -26178 55658 -73277
23997 -73277 -37696 105313 2386 1775 -63042 -250733 -299277 -80098 76713 180591 115517
23986 115517 65283 -72308 -43569 -45104 77015 -72149 -151107 55997 168592 135959 12465
23975 12465 18052 -145559 61324 167194 175721 126121 216430 179962 19692 -205374 192855
23964 192855 205849 301962 324085 122970 333309 445348 275061 15237 32526 282115
23954 282115 248788 119854 323136 551008 672588 678749 379190 269774 503316 462133
23944 462133 286383 93978 29738 156714 31030 -53421 -145664 228754 309486 203914
23934 203914 361935 230137 292743 378812 309727 202515 409187 508178 215517 189293
23924 189293 49248 -182605 -272889 -174923 80325 176703 113366 10 157423 54773
23914 54773 107081 135045 210726 283342 265996 297685 329187 517541 437033 341525 -41628
23903 -41628 -118344 -98915 -127371 -250764 -423574 -492034 -298591 -122781 -130891 -56223 -94448
23892 -94448 -12973 -93703 113199 354560 168380 50218 -143463 -153082 96333 437304
23882 437304 515821 591970 538845 260762 185169 -46831 -98069 111795 315269 461466
23872 461466 452583 529203 335457 312674 151110 189472 62391 -237561 -355575 -147745
23862 -147745 -353328 -111178 105462 263964 33041 -70114 -110143 -106359 98952 369
23852 369 -94333 -53496 -76491 -162566 -51948 166111 335349 97515 -120954 -201127 -185969
23841 -185969 -26773 84943 154776 176219 263352 282998 164428 2952 40284 84059 78110
23830 78110 -77108 -211647 -30514 -48580 175851 326616 88330 235 -115652 -119734
23820 -119734 -38449 103315 188595 136957 -167680 -292320 -205578 -236591 -252698 -68319 -41078
23809 -41078 -242098 -171930 -59558 -92508 -71749 90092 159904 17661 33392 204925 153289
23798 153289 220229 269756 104024 91437 135990 -114862 -228063 -368349 -375154 -242180 -104003
23787 -104003 48336 112740 -5806 -21132 -16565 -141947 -155717 -194649 -239436 -93880 195736
23776 195736 295873 223652 176162 -22786 -3604 104630 -130487 -227534 -338549 -554598
23766 -554598 -227501 107339 183573 231841 359097 272081 225670 94528 61021 171482
23756 171482 139939 31151 -208229 -142737 -72950 10936 157930 96264 -5351 -3089 -106524
23745 -106524 28042 194159 333266 364071 160312 -93219 47865 389894 341444 176044
23735 176044 29195 97317 125125 -131143 -209840 -79757 -28516 120975 231519 241001 105330
23724 105330 2230 -88613 -141750 -106617 -297548 -203398 -214821 -247734 -95481 137807 244909
23713 244909 36806 -14636 -196157 -357164 -186167 -260244 -254796 -291433 -81730 65634
23703 65634 91142 43508 -180363 -274022 -180467 -164490 -256123 -332469 -121389 -40103 175424
23692 175424 206164 -4888 -54524 -116716 282 17091 -50367 257446 281752 234692 157709
23681 157709 140410 79684 22984 42583 -131126 177324 209393 81658 12374 -75650 -33132
23670 -33132 72514 -115053 54976 121798 45268 33410 -194081 -362447 -240728 -133177
23660 -133177 -186406 -410583 -567407 -471528 -321650 -253964 -233510 -288519 -255051 -111681 577
23649 577 -98522 -165081 -399170 -269263 -41072 -109519 -290997 -190962 -128393 -195278 -160316
23638 -160316 -115972 -23745 -220017 -153917 -2772 169102 149170 -21940 -274968 -259967
23628 -259967 -22566 122257 82231 117971 114905 -15045 -286223 -386782 -258692 -62238
23618 -62238 -132202 -474771 -517634 -275335 -98593 111885 161193 19467 97576 288490
23608 288490 417105 167971 115988 217865 196979 169002 66391 133192 316546 548555
23598 548555 417404 308566 134744 128806 190296 305275 -6308 -137580 -91261 54443
23588 54443 -2589 -9525 -157868 -434659 -515105 -591744 -200632 31913 -80138 -76009 -284080
23577 -284080 -437048 -276585 -53434 150667 202458 420383 450596 335088 170012 129413
23567 129413 190752 -69165 -362726 -437521 -289090 -35760 -35501 -228688 -305628 -349382 -155941
23556 -155941 -272286 -223366 -55302 -35395 103778 240361 171143 253266 168340 -19358
23546 -19358 -62727 -121132 -188274 -76841 -9006 82879 211926 282662 4546 -223835 -154972
23535 -154972 36009 74595 98041 74602 20674 62565 10643 -109972 -348678 -326064 -160361
23524 -160361 -261461 -372160 -93791 40998 -2546 65846 -51253 -278807 -402379 -271719
23514 -271719 21429 365947 616342 398490 114233 127814 286323 116405 -66051 -165290
23504 -165290 -449264 -377899 -168090 5823 27490 -23616 26669 76358 189024 330823
23494 330823 441475 329236 300667 209064 201742 446117 723156 475062 162118 78905
23484 78905 -81409 -197413 -29930 -22493 -173041 -303690 -231500 86778 -41318 -145407
23474 -145407 -14751 -183333 -317945 -183991 -187312 -141717 -164814 -397861 -269287 246928
23464 246928 494488 335997 385195 304910 317776 451549 674918 746859 613312 465877
23454 465877 328804 1890 -41800 109053 -75601 -284404 -393402 -334944 -426092 -324781
23444 -324781 -319590 -182395 -264713 -283450 -88019 -76249 -95470 -239073 -381557 -182775 -86771
23433 -86771 999 -33410 -461533 -437054 -267363 -92514 -8377 243190 179223 124387 48089
23422 48089 5947 78425 288211 359695 76127 -126602 -123554 -55207 -32481 -11249 -238380
23411 -238380 -51664 204811 15001 58559 235314 216690 137296 109381 -58012 -117088
23401 -117088 105074 178521 7102 155746 126705 14025 -11859 84618 61153 -119603
23391 -119603 -77737 -173123 -109401 197805 532281 656621 526931 308142 305900 74522
23381 74522 135084 245214 156630 67514 99719 63610 137890 134831 124425 318194 -10027
23370 -10027 -153529 -91981 -113161 -1392 47945 -173766 4944 186796 1742 -327228
23360 -327228 -517924 -365172 -331177 -372476 -185448 -204995 -128210 -113519 -224729 -256109 -339275
23349 -339275 -337013 -185359 -121137 42524 -39094 70875 95690 -14613 -52884 -12564 -6547
23338 -6547 -26532 2824 38016 -22845 146577 310722 371382 152003 -113110 -82232 -80889
23327 -80889 -99428 -264790 -380201 -183098 41360 -25311 -121231 190978 135713 -14456
23317 -14456 -93981 -237666 -222770 -189313 -155596 -335482 -420797 -393111 -162372 4464 65710
23306 65710 20242 -116368 -86172 100446 227544 168530 -70955 -219199 -146286 -127133 -132334
23295 -132334 -52626 27321 25742 -142496 -357831 -310619 -112924 142170 -42484 -450321
23285 -450321 -423055 -274073 143930 112406 -12152 -179525 -265096 -42044 84116 52801
23275 52801 43996 189793 145223 81363 100319 -115747 -192233 -63134 -88538 -122893 -404952
23264 -404952 -374747 -413047 -340373 -138646 -170508 9728 22713 -33902 171844 307262 352746
23253 352746 376344 517638 643934 379291 204853 90475 139134 233156 -30753 -226213
23243 -226213 27489 31990 -172650 -290866 -154284 15763 42975 253873 386134 118998
23233 118998 139080 92 -283020 -64351 75980 50562 -103520 -554275 -505509 -438301
23223 -438301 -355300 -506116 -333017 -179764 -272769 -237238 -194143 -321905 -409159 -374707 -373804
23212 -373804 -208240 -199253 -207065 -162278 -146704 -158314 -178684 49960 262891 176120 96776
23201 96776 193291 312637 359334 1147 -26239 -4246 20208 39916 51457 120824 340975
23190 340975 171274 -67238 -240141 -336877 -97738 68387 29927 89411 57799 -295318
23180 -295318 -378313 -241991 -195308 -102822 102600 116997 -150720 -162672 238831 433772
23170 433772 339616 35082 -66215 205404 352682 314054 144115 56448 16492 86744
23160 86744 28284 12833 -57588 -121056 -246300 -262243 -262014 -135226 -186860 -88146 -75352 -204461
23148 -204461 -231107 -37885 -14319 4306 -88961 -36071 17291 -171226 -264939 21742 28499
23137 28499 -128852 -157275 24334 315694 70250 -200114 -112336 -13643 148460 222261
23127 222261 205852 123909 240731 -106537 -461571 -407277 -184092 -83921 -140434 -295893
23117 -295893 -113187 -1591 120285 320070 102807 125051 405533 372358 164978 2506
23107 2506 105398 76448 124126 128353 213008 353022 169003 -216454 -11981 19626 -95285
23096 -95285 -127496 -174305 -205849 -126666 -26466 212424 502811 488728 212349 -251512 -186704
23085 -186704 212595 484293 550495 398599 51979 -10671 54403 65010 -104947 -116030
23075 -116030 -122986 -172149 -116510 26749 153053 94497 14343 -18642 -190461 -350686 -415655
23064 -415655 -165050 -122952 -66255 -203966 -332100 -278470 -428125 -502142 -294827 132508
23054 132508 163652 211301 525246 448544 509378 562632 440554 30875 -118154 -38546 15267
23043 15267 -20619 14801 -108264 -147121 -273892 -446275 -399569 -275021 -214683 65140 140696
23032 140696 111915 15238 -162399 -172332 -8736 -24781 49700 108566 76344 80070 -36620
23021 -36620 34034 332726 275966 37070 130750 -53039 -4831 235545 180769 155439 -159808
23010 -159808 -164307 -109191 -139568 -270062 -395847 -615904 -576203 -446184 -110647 121828
23000 121828 44781 -5771 -19940 -78081 -143094 42323 225453 64223 -44596 -71036 -119239
22989 -119239 -277515 -74871 -62339 -28324 -15544 208510 453414 454407 292804 172790 158911
22978 158911 189890 295669 231889 188838 61100 -3558 -2554 111146 75645 -185842 -365084
22967 -365084 -462219 -343159 -225645 -71376 105297 113868 166051 -125701 -196384 -187649 -167746
22956 -167746 -318984 -272044 -70736 43741 -55023 -149543 -283080 -271150 -180508 -14033
22946 -14033 94330 -58314 27204 83184 -22535 -51955 74101 25570 -127000 39998
22936 39998 114023 -86955 -215363 -233495 -115868 45738 22324 3524 -27830 -150093 100992
22925 100992 208338 -112908 -543770 -634021 -561781 -316179 -154666 -50930 149843 95562
22915 95562 4192 110248 94163 99725 260977 232957 226532 259800 194961 348205 152525
22904 152525 -175836 -187091 -52693 -13946 -108024 -37872 115605 100800 103488 5477 -100803
22893 -100803 -178175 -277312 -441640 -359434 -286476 -382261 -524972 -357263 -280041 -362358 -261912
22882 -261912 -118446 22319 -252225 -168062 108478 62886 -135461 -266275 -113110 -68658
22872 -68658 -61498 -98237 -140940 -219485 -98868 -29403 320470 269646 90274 93791 46320
22861 46320 -96611 -48827 107649 -44619 -277898 -254584 -393471 -512564 -337305 -123770
22851 -123770 65642 322645 -111379 -256884 -95276 71582 -48706 -109077 1807 131444
22841 131444 -174776 -339420 -318526 -129165 106159 159834 151983 239301 188272 63375 -320336
22830 -320336 -394202 -383078 -233981 -168912 -330668 -287964 -183408 -114820 -111383 35282 8292
22819 8292 -160983 -157765 -108536 -156705 136415 446920 563570 416930 202508 250444 97197
22808 97197 -122139 -38493 34188 -127755 -420224 -458560 -349711 -566902 -610760 -707560 -655882
22797 -655882 -410470 -191914 -124378 -71654 471 -155376 -192324 75539 162232 164116 197785
22786 197785 112455 163731 285696 370875 265610 327796 223531 242284 62280 -107294
22776 -107294 -39126 43944 5093 -23362 -47869 35889 -198888 -320566 -309859 -119090 2
22765 2 -159290 -300070 -213084 -78816 -152892 -162037 24607 129516 241678 132012 -342468
22754 -342468 -452667 -282374 -263314 -255863 -221111 -226446 -171477 -283896 -178741 34876 -499
22743 -499 -127384 -208456 -214987 -235292 -262654 -205074 -127645 -29176 -2462 -45365 82673 139050
22731 139050 230656 164240 79550 9348 71080 131628 163829 169325 241994 290569 242487 220316
22719 220316 102436 -94723 -225412 -306976 -60454 169822 288154 302142 189259 196079
22709 196079 151003 43673 27310 -308253 -288996 -152068 -44101 72884 245089 178192
22699 178192 -21090 -24742 184616 317877 350658 340953 155435 143348 146651 60323 258653
22688 258653 340754 285699 286612 168092 -110852 -302289 -212914 -113942 -102159 -118473 -263943
22677 -263943 -452530 -415857 -464231 -319098 13835 208055 180965 99394 -47124 8826
22667 8826 -78961 -269491 -178935 -86857 30813 29581 -156229 -139691 -144873 106990 -34516
22656 -34516 -6887 96949 222611 259584 105635 -66634 -55626 56267 -94543 -209410
22646 -209410 -304684 -204704 -32315 -80534 -218864 -218515 -143549 -278253 -79038 -103154 12001
22635 12001 166381 290837 65922 49302 96887 106034 -86543 -110513 -58468 -159280 -10848
22624 -10848 332779 333328 -22194 35007 83706 -89477 -229540 -220543 -159549 -62288 150392
22613 150392 295305 283558 103815 -123931 -157496 -143350 -255799 -206205 -208314 -39601 236513
22602 236513 368250 378808 375105 334359 84160 53768 -2535 -5607 -46741 -136850 -125595
22591 -125595 -174286 -202746 -80484 82591 93961 -55917 -81362 39220 45439 -123816 -232242
22580 -232242 -67384 -41314 -59 -162496 -14931 -87365 -431510 -220386 263656 219059
22570 219059 145721 -56790 51530 187167 259745 226929 148294 260415 179268 88989 74658
22559 74658 19135 80496 114077 248767 416108 68019 -389466 -677030 -535873 -169918
22549 -169918 -112170 -103640 -128418 134919 305546 417490 306890 218270 239410 254836 307796
22538 307796 -62970 -101708 -308765 -245294 -83171 -76320 66141 186181 31248 -11102
22528 -11102 -32531 109626 -46401 -295536 -486631 -505923 -281428 -124311 -233338 -330107
22518 -330107 -454050 -174928 -198387 -485988 -464334 -494386 -513979 -164045 -23285 -77374
22508 -77374 -265 29963 114690 105658 -15444 52124 -9331 -124937 221011 390479 296454
22497 296454 246184 131922 -52053 38180 215229 174635 62660 91925 231324 277286
22487 277286 84977 -85343 -252430 -405561 -417810 -285219 14705 206821 544038 275412
22477 275412 -138265 -132155 136008 228944 -76788 -58974 53152 83564 204193 177614 232119
22466 232119 430337 337829 343420 152033 -109939 -270854 -260818 -247794 -55862 75380
22456 75380 74548 -23066 184745 37256 122835 176106 194572 112814 37439 126183 338111
22445 338111 279282 131095 149306 -225770 -20152 38007 106211 30416 14336 154749 274684
22434 274684 266536 186932 24892 239489 459493 458952 195064 -3555 4879 -2238 -95886
22423 -95886 -196964 38243 169761 56382 -73437 -366447 -248870 -187065 -194015 -260178
22413 -260178 -219162 -184614 -300001 -380512 -218185 -291056 -187381 -58388 -138115 -121111 187971
22402 187971 271323 258841 -202845 -231113 -118265 -62419 229904 338669 506499 357337
22392 357337 241470 299912 160192 122948 2504 -85568 -319510 -86916 -119138 -181006
22382 -181006 -219869 -65259 286042 209240 -97739 -153429 169 54688 32666 169398
22372 169398 115690 -34548 -141719 -157707 -67804 -190260 -271654 -237299 -376552 -246075
22362 -246075 39626 -188785 -380502 -432893 -243827 22352 190995 327125 364403 352413
22352 352413 352459 154418 -16030 -52334 -32184 -52444 8466 -112684 -129185 54656 344693
22341 344693 436439 284736 -9962 75082 184571 92770 63563 -4057 -59015 100160 86111
22330 86111 174816 -55904 -215011 -67949 84926 33237 84234 -85868 -50652 117626
22320 117626 261118 305457 309586 281589 304544 348786 47692 38407 106875 -29696 23787
22309 23787 63155 143273 225973 48455 -136073 -292282 -407684 -212454 -154934 -5033
22299 -5033 299938 226287 86280 -6181 49190 -36711 -150843 -171894 -25535 -101454 -125766
22288 -125766 -141881 -287807 -341011 -73515 62426 163749 204179 256888 151417 -53241
22278 -53241 -319593 -299743 -326658 -373748 -250168 -69940 -209469 -301939 -273660 -318498 -171174
22267 -171174 -108708 -144472 -120504 86407 186516 121435 32747 199682 326724 201468
22257 201468 -3601 54480 89475 133516 192513 124858 -23394 104482 -52764 -338496
22247 -338496 -288851 -211045 -310704 -243016 -284577 -198053 -262163 -312101 -330001 -403550 -193980
22236 -193980 -62068 -70308 -189986 -22150 355107 88645 -22967 -216691 -421089 -296858
22226 -296858 -111023 28838 101079 -12378 -103155 -290445 -409368 -308864 -175532 3305
22216 3305 -75599 114303 79477 -89303 -53444 -89974 -533767 -701970 -478397 -539365 -671817
22205 -671817 -490793 -451539 -538274 -332259 42392 105398 50747 87374 -118460 -175251 -283492
22194 -283492 -369918 -212790 -115558 -20612 127337 191226 42725 -325337 -368982 -330322 -474253
22183 -474253 -400695 -151944 44206 151222 -8056 49210 62662 12772 62930 159347 106454
22172 106454 -98045 -74223 -115606 -4453 -81783 -107068 -42256 80755 209935 47441
22162 47441 -139845 34065 29403 -140912 7678 329 -182518 37370 98093 106930 13578
22151 13578 33472 -203777 -277324 -212839 -344498 -221665 -74821 -183521 -260284 -431776
22141 -431776 -203631 -174074 -252892 114521 571267 331434 152173 66133 -167690 -187896
22131 -187896 -6165 233970 43037 -47077 -66108 -138111 -72865 33640 167822 -48107
22121 -48107 -74055 -178537 -346201 -267909 -47522 108987 -34146 19838 20652 39016 184093
22110 184093 154847 187899 341328 323836 170388 95581 -126915 -121093 -167794 -124594 -4387
22099 -4387 -306312 -182286 24559 -80920 -336676 -514099 -439219 -471009 -357490 -130784
22089 -130784 73074 164690 230577 99474 82964 90801 -10359 63494 38521 97019 -2324
22078 -2324 123228 231670 -42468 -15530 127604 52606 131956 -121557 -327693 -330307 -176744
22067 -176744 -91104 -63344 -127574 -147922 -158689 -43145 41939 -132506 -231189 -83697 -12538
22056 -12538 -84413 -221442 -188072 12265 2523 95017 244381 -140287 28413 304441 478495
22045 478495 334569 289949 33080 101363 38328 -216698 -242415 -162174 95482 285138
22035 285138 367581 537980 329413 -61612 -155020 3890 26691 37375 26280 -144449
22025 -144449 -230940 -126477 -150159 -154997 -30361 -27015 198635 313202 276590 70201 -183584
22014 -183584 -117751 163584 216598 318597 497616 525667 480390 366839 423431 345048 94708
22003 94708 58964 22300 239046 329520 30596 -21996 -8168 148215 112393 -20553 -54906
21992 -54906 -250525 -259389 -323982 -253094 -436948 -450779 -363105 -203944 13108 9247 -57876
21981 -57876 33264 168946 269156 442895 206791 108358 14274 23760 206538 422942 256419
21970 256419 -36893 -125139 -74682 89350 230559 222106 178570 -7172 154829 -36648
21960 -36648 -70058 100079 -42104 -273730 -1534 275914 6486 -178599 -236181 -512964
21950 -512964 -530133 -304757 -199287 -122218 -187952 -246482 93069 182144 -24787 -78235 -89881
21939 -89881 -99502 -230346 -265852 -321279 -274908 -196209 -52718 -73258 -274814 -156235 -406624
21928 -406624 -464321 -269109 -265937 -257451 -378153 -236874 25591 -13508 2510 -45690 -106633
21917 -106633 -107363 -72558 153584 243641 246238 19412 -146858 -194108 -105721 -46949 62835
21906 62835 337395 563383 447547 42924 -103695 -4006 -70374 -201224 -365695 -379569
21896 -379569 -467228 -581105 -266011 -128742 -91143 -238787 29362 248140 199107 356518
21886 356518 270873 -81027 -87423 -44096 -102131 57459 248 -56265 -76560 225344 77748
21875 77748 -129242 -146831 121965 -19748 -4877 -24367 33295 198396 150992 173175 238222
21864 238222 99907 -191111 -81317 183190 -81993 -212288 -163307 -194695 -72777 142949
21854 142949 -85248 -265219 -103875 219180 246015 -73908 -253885 -168817 -167608 -222303
21844 -222303 -242964 -27612 204447 112016 -1898 -228295 -233167 -284480 -309876 -203470 10579
21833 10579 40677 175749 176744 40552 167960 94754 -205647 -224090 -213699 -333176 -12774
21822 -12774 49485 -250611 -312125 -219868 -16781 79060 -8894 -65405 -109103 112502 197654
21811 197654 215997 25661 -16803 -82751 -218036 -126436 -53319 33305 39190 144249 74804
21800 74804 -268252 -562108 -574127 -559394 -454108 -144778 -8756 46747 95287 -82692
21790 -82692 -99973 111659 134686 134228 -75490 -150414 -37596 -80752 -50327 -114166 -73374
21779 -73374 -71909 -140531 -234917 -413388 -402247 -429986 -123740 -107223 -322629 -298014 -298296 -245187
21767 -245187 -142871 -67645 -50980 -65959 -43790 128776 -110288 -349322 -111214 148557
21757 148557 46542 -45134 -76869 -37563 161980 269374 207240 235328 349905 342160 90009
21746 90009 110530 60257 -88317 -40875 146100 325811 212663 78502 -10545 178122
21736 178122 237315 161541 -137923 -252211 -229535 -127296 -177680 -57880 150699 39032
21726 39032 197896 258122 67678 -159755 -143583 -167287 -233241 11210 195428 254141 232262
21715 232262 143124 222184 242544 195083 9613 23364 -17468 -191145 -162347 -123995 -124929
21704 -124929 -493591 -425073 -179381 -268854 -256389 -90062 135883 188984 97785 -13971
21694 -13971 -6061 -149296 -266177 -246135 -208825 -180327 -290009 -348130 -140570 15817 -176855
21683 -176855 -320605 -396561 -380862 -490528 -628697 -568756 -458011 -432225 -198153 164722
21673 164722 405694 535451 445562 343215 124461 -105511 -293331 -129775 -102782 -368449
21663 -368449 -450444 -213143 -114942 -34830 -39447 -131349 61238 359533 265384 17939 -102548
21652 -102548 -216366 -225187 -290751 -146733 -39837 177252 98465 5466 -213630 -145000 -181314
21641 -181314 -148086 43071 370188 333167 188450 165939 228912 308251 316714 291869 400220
21630 400220 466341 244542 45537 -29412 -95639 2062 51758 216690 381056 303915 451558
21619 451558 324751 82740 -127960 -176480 -256510 -201306 -36985 -114042 -138420 -92524 14950
21608 14950 73479 -24736 -77405 -214001 -360813 -258448 -385701 -467646 -156222 197248
21598 197248 29919 39012 -6087 -183166 -217928 -42127 14191 -73644 -136123 -166661 -200280
21587 -200280 -56384 22003 -24788 86937 54902 211200 226816 168059 170539 112535 40292
21576 40292 -72357 -37198 -126704 -253751 -263171 -139162 -18600 -66069 -142309 -136623 -149986
21565 -149986 -88427 -70912 -320585 -321852 -191270 116980 97735 -15797 -62065 172586 401288
21554 401288 460355 269729 76594 -21632 -10961 21891 190585 138919 70261 -3714 -93992
21543 -93992 -168035 19878 113757 113622 31545 46135 201660 85344 -185682 -74558 49545
21532 49545 -145165 -120209 -46565 -143496 -220275 -135152 -220975 -197800 -179862 -94695 38232
21521 38232 -99006 -81183 89132 -48000 -147833 -181527 -190807 -154301 -127964 87775 75270
21510 75270 -198811 -290932 -234040 -168915 -270885 -103466 -135403 -257413 -197663 76487 -129015
21499 -129015 -210335 -137554 178444 493382 565839 245578 75147 89212 88684 -59340 -31473
21488 -31473 -17992 52949 301807 117719 -57194 -128244 -6495 35392 135607 215507 -2743
21477 -2743 -48448 -265776 -261074 9309 256820 370628 351553 73919 51835 13260 -17154
21466 -17154 -10644 -188980 -159768 121400 326767 399010 230859 9420 -70825 -95981 -132823
21455 -132823 125169 8035 -258819 -289968 99102 165324 -20486 -84043 -38387 -46865 83544
21444 83544 78058 126273 64952 -196855 -278953 -198283 -54822 -10794 20593 -116418 -194045
21433 -194045 -117098 -232249 -322999 -44230 45996 52476 23701 -127562 -67208 -7919 34471
21422 34471 -5413 -169325 -411963 -424610 -261383 -3531 174661 163554 -141460 -215759
21412 -215759 83412 185694 69756 -34450 -24472 -117839 -17850 94865 -10015 166723
21402 166723 278457 64228 -189219 9739 -15118 -9293 -29692 29482 -46696 -308448 -238651
21391 -238651 -96544 -72269 -63555 -156361 73630 309022 151544 19821 -3757 -88601 -136759
21380 -136759 -43566 221393 93104 -15665 -29412 -37923 -81749 -242307 -206755 -99285 -232154
21369 -232154 -245041 -123443 54942 59268 273364 232923 113307 145398 -43513 -290894
21359 -290894 -324244 -185451 -103910 114396 -133817 -76109 87771 11747 -19595 -145609
21349 -145609 -26676 -66505 -431297 -306384 -201902 -142496 19150 16303 -13884 -142576
21339 -142576 -308225 -128712 68720 38098 44706 -38572 -89833 -65820 -100945 -134118 -218384
21328 -218384 -353638 -219499 -242005 -425643 -748104 -664383 -183730 -140966 -74892 -175858
21318 -175858 -119795 -72903 -437771 -387106 -118595 -83894 -23039 -178426 -6665 118060
21308 118060 22394 149670 -19384 -189545 -77675 134580 59987 -5074 -206181 -50649
21298 -50649 -93190 -193564 -83129 79014 88068 -11576 149698 226981 227341 -25010 -103327
21287 -103327 -51783 92923 363810 522956 341601 161093 -45775 -85144 91504 -42842
21277 -42842 -170947 -244529 -73898 29046 170664 -24777 -63897 -179225 -247993 -375701
21267 -375701 -235940 -235545 -251844 -248490 -269414 63112 50204 -253115 -384607 -451479 -343766
21256 -343766 -273316 -339996 -186700 106346 443437 140042 -219539 -315731 -205627 -119181
21246 -119181 -164202 -282341 -175727 129111 -40539 42795 -17724 27516 -178368 -301670
21236 -301670 -415472 -366822 -173120 71180 305651 254973 116362 152571 231316 188913
21226 188913 353973 410127 439099 289188 251984 206267 51504 243182 259640 92988
21216 92988 -67970 -236881 -405693 -450958 -356340 -174282 -125348 -263084 -256590 -273495 -167163
21205 -167163 -86603 -224911 -340932 -467842 -447974 -401557 -294870 -227063 -110327 -259885
21195 -259885 -308821 -277417 -240725 -267951 -307267 -278778 -16448 135574 -816 88625 -109036
21184 -109036 -202045 -222347 -117676 -208605 -379206 -296982 -163631 119115 476 -70824
21174 -70824 373 -21914 -32295 50217 305849 216043 191762 76689 122364 97342 -240395
21163 -240395 -117038 54676 46777 -58331 -155817 -113301 -70630 -11171 -123808 -184527 -20195
21152 -20195 -84659 91056 301701 344928 350686 -74027 -134177 -316 -34914 -227597 -631836
21141 -631836 -640945 -471181 -356236 -204269 -187503 -70831 -70036 22777 9684 -237353 -255577
21130 -255577 -20208 -110350 28581 169892 74585 137089 154137 -64030 -300235 -389992
21120 -389992 -317299 -177948 -13032 -2301 36073 112257 3609 -320247 -311350 -262906 -128889
21109 -128889 -29890 -119158 -201422 -206559 -175869 -152049 -72269 -140365 -243052 -81948 -136488
21098 -136488 -144891 54068 297790 425222 443905 336154 506106 395499 160706 -24475
21088 -24475 -377387 -539121 -295555 -206696 -249377 4282 107710 109491 -124280 -84850 -16055
21077 -16055 -74006 -112377 -235906 -118434 -171744 -317366 -140390 70349 351003 468039
21067 468039 270970 -13186 -134170 -250839 -38939 172059 209460 281440 251785 207064
21057 207064 158368 109999 197891 271131 243287 85372 109131 279635 395174 283070 -10078
21046 -10078 -193130 -153281 -415571 -678472 -525939 -285375 -317241 -319713 -182692 -50349
21036 -50349 41197 42451 -43462 -141166 -10693 -58892 8748 -55987 -254739 6150 46184
21025 46184 135708 397445 277759 283738 186984 71393 -27925 -102524 -226401 -459710 -506592
21014 -506592 -585101 -344121 -379490 -369703 -219103 -325563 -428871 -236298 59472 297359
21004 297359 221593 -17380 -113684 -60556 -238774 -245735 -70340 72500 86855 -257000 -459703
20993 -459703 -552062 -320613 -220603 -276693 31373 177368 128375 19751 3202 -20769
20983 -20769 104395 152915 49814 -5746 179997 423917 298710 263272 360284 280782 119691
20972 119691 81382 185661 241330 246263 494758 430089 286111 221594 481723 437361 296615
20961 296615 31811 -120545 -15065 219687 357650 317830 36458 -56353 71553 -28584
20951 -28584 -198883 -153729 -197561 -166328 -76683 -243246 -323049 -125505 13612 -14868 -102272
20940 -102272 -317651 -235765 -110190 -51159 -100033 -102881 -173350 -402121 -531131 -399600 -26234
20929 -26234 64158 133626 -113522 -19932 125799 -45541 -45075 202648 194314 -183821 -440375
20918 -440375 -113295 59252 161595 194681 205995 311436 170035 -95974 -333370 -380691
20908 -380691 -224406 -195726 -210691 -191807 4183 -31679 7217 6727 -9621 -161432 -220158
20897 -220158 -232758 -278570 47389 231441 114432 -96835 -338552 -477079 -613390 -454947
20887 -454947 -246062 -403658 -120935 288775 146014 218708 82860 161085 -108398 -358331
20877 -358331 -305302 -234614 -213387 -122622 -182646 -103152 -16902 -46032 -13049 163829 276067
20866 276067 445845 117299 -134486 -119116 -213321 -158816 -10699 -123686 -216675 -184830
20856 -184830 -60892 -49061 -105077 -75750 -163285 -563586 -656394 -418340 -188372 26845
20846 26845 14856 30728 211048 135059 -1703 -111308 -267740 -424208 -343476 -335466 -143380
20835 -143380 -10025 87118 77883 -81739 -77253 -128587 -84520 -35233 113101 -10747 -18431
20824 -18431 -76578 -228695 -479065 -256135 -194199 -264509 -345204 77941 153026 146110 111146
20813 111146 254177 91215 -169699 34061 187133 170911 301689 191835 -54115 -125779
20803 -125779 39814 123785 49371 -46085 -49642 11747 210 -212716 -339531 -85684 -95551
20792 -95551 -138256 -204023 -66047 134035 67369 -91561 -206820 -268192 -194593 -326120 -512934
20781 -512934 -406484 -317383 -167004 -107927 -346379 -538369 -522653 -463001 -402958 -256482
20771 -256482 -143230 -19576 -136926 -185035 -296323 -361033 -484435 -468648 -192152 -47685
20761 -47685 -144266 -28815 141686 -130516 -223466 -44090 -176164 -96151 -122884 -143044 -315717
20750 -315717 -342898 -229051 -15262 24831 -286071 -446940 -367794 -195553 -170847 -220212
20740 -220212 -234310 -261313 -446848 -514275 -540407 -509426 -318978 71215 213684 193597 142940
20729 142940 20324 -139633 -140984 -122597 115850 43984 -251582 -102655 115943 119305 154027
20718 154027 160012 446541 300737 292833 212790 143270 131998 88427 -70297 -97733 240447
20707 240447 457027 304981 113589 26184 45261 -95811 -98456 -213004 -220419 -131508 4220
20696 4220 -36106 150507 184904 98611 -124329 -299700 -395974 -611052 -689126 -705908 -395559
20685 -395559 -161417 -119335 -133668 -160018 -29588 287798 296263 179210 32900 -6340 -40492
20674 -40492 55390 41781 -88539 -285788 -127351 -151906 -17136 107738 214948 81302
20664 81302 -98978 -132779 -29007 -132011 -369248 -17117 87400 -152913 16032 191026
20654 191026 506863 520666 392572 234326 243183 284821 196848 36747 141813 239871 196712
20643 196712 102022 -80568 -246208 -193424 574 40137 20411 212154 75133 -267398
20633 -267398 -276768 -159813 109169 222365 340059 324871 240407 36544 286166 577971
20623 577971 255726 72981 -175688 -412707 -240621 21983 17553 98282 205995 200456
20613 200456 56395 -286856 -291014 -252843 -164927 -342051 -373474 31455 254500 121308
20603 121308 159440 -5554 -151687 84196 -121834 -51799 194395 165487 123013 156281
20593 156281 240433 308977 387733 82147 4314 112414 -67055 14174 138794 236338 99069
20582 99069 -108296 -164287 -151707 -77075 -66654 -110794 401 -28919 -79263 6129 160887
20571 160887 17502 -236813 -424826 -65203 212150 144079 79249 45536 -7619 -7912 48921
20560 48921 57923 -89468 -151330 -137625 59277 22680 -9708 88948 89688 14584 -49766 -366220
20548 -366220 -247240 -92550 -119048 -212229 -166602 -20769 184844 199834 127720 -45203
20538 -45203 -88676 -69869 -155847 40576 283213 246229 173862 90110 262822 447028 392662
20527 392662 92722 -19846 88210 109432 77842 -77154 -179838 -107483 -113936 -57151 43308
20516 43308 -104830 -157431 -456672 -278014 152147 165644 -89135 -314684 -151176 -166904
20506 -166904 -349685 -322661 -337971 -361542 -249444 -115930 77262 125738 -197004 -284154
20496 -284154 -120910 -41511 -18357 -185950 -427002 -206527 -146753 -183181 58139 -76568
20486 -76568 -155611 -139433 -108555 77066 86711 116425 -20876 -125417 -70956 -77534 70929
20475 70929 73934 -50805 -259184 -190440 -159639 -162119 -237738 -259033 -309064 -300567 -137062 133359
20463 133359 176525 43758 28733 -151279 -198970 -5407 28524 55413 240917 310913 465533
20452 465533 295209 150424 27416 -80455 -175478 -303111 -214567 -90426 68838 143131
20442 143131 65207 90580 20258 106751 198479 403145 180869 -138745 -277626 -170222
20432 -170222 -110850 260681 199076 -56043 -110173 -119064 15269 25833 159086 112516 -11822
20421 -11822 -258 4411 -237515 -81674 -41918 -41927 70135 135037 -13996 9960 124768 47685
20409 47685 766 -227136 -190885 -56154 146294 397378 314589 -113123 -229342 -36990
20399 -36990 148510 271415 179561 -236791 -182200 -254835 -147593 -32896 -59114 -189191
20389 -189191 -363611 -505918 -500700 -387377 -32610 242692 250711 154441 81556 91138 -244
20378 -244 -79020 76662 148558 267982 146794 -60366 -135142 -46974 -159474 -117688 -57504
20367 -57504 -242558 -113272 130160 196704 4861 -197739 -204682 -152121 -162030 -266125 -316031
20356 -316031 -357201 -166214 87099 -10948 -96118 87285 1506 55644 98524 -155204 -9549
20345 -9549 164053 240941 319161 245747 326991 219689 39517 11667 -197136 -71307 89673
20334 89673 -202607 -488900 -325872 -260863 -176088 -191224 -331436 -212084 -283821 -282485 -184731
20323 -184731 -50661 -91001 167969 103556 53621 88158 114091 174796 -58916 -114143 -212915
20312 -212915 -31897 158324 183782 104110 -31434 -17846 -164062 -80182 106324 294587
20302 294587 284725 90335 -216147 -418745 -359178 -69734 176136 270292 106470 103696 -111736
20291 -111736 -208572 -261605 -326770 -69294 -44558 -109087 -227118 -238955 -371392 -346381 -338361
20280 -338361 -223022 -77009 18662 -77584 -5536 -89467 -76208 -188718 -101799 7025 -127500
20269 -127500 -533900 -615152 -574702 -593745 -485165 -317678 214256 461359 295060 122225
20259 122225 -212021 -151245 -70179 -313780 -401050 -171593 122863 183191 131406 14227
20249 14227 14165 223299 200758 247469 276478 200336 290552 405135 382090 192041 39272
20238 39272 61247 -27054 -244313 -271110 -310809 91296 405321 481056 431519 369190 34801
20227 34801 -154702 -356279 -363619 -369410 -490234 -650557 -283707 69898 256651 223283 230448
20216 230448 117485 183847 191441 376444 407942 41240 -80292 -105060 127518 277829
20206 277829 119135 51348 39030 -10415 -111774 -95394 26040 -19365 -88842 192697 452884
20195 452884 171063 -125013 -182061 -112512 33704 216630 140682 175956 194394 -77408
20185 -77408 -110461 -16291 -127963 -31372 139888 31822 100231 437308 405377 454517 289419
20174 289419 214784 90002 -71840 -224169 -221524 -203867 -197894 -108332 62426 -70908 -187992
20163 -187992 -140527 -31550 158266 186511 122442 7880 -59648 71766 164568 248532 398675
20152 398675 535628 461256 222669 110451 2598 -140358 35979 334827 234652 82274
20142 82274 35128 112056 -150075 -210803 -448527 -351720 -311657 -327995 -364037 -275132 -66950
20131 -66950 -37285 -12595 -106635 -9092 -70267 -90541 -219589 -175564 -251556 -159022 -180149
20120 -180149 -271596 -45026 -32474 -89959 -128980 -340665 -256255 -82818 2466 -99569 -65658
20109 -65658 92074 122668 -99752 186641 361587 198351 152852 283079 158734 277892
20099 277892 412069 362667 398402 389953 346226 351454 144980 -137523 -132949 62584 -68293
20088 -68293 -135554 -68243 -101219 124922 227041 253784 250811 282812 288776 47843 -159685
20077 -159685 -350364 -451403 -435620 -594664 -327787 10977 23014 32554 255483 279072
20067 279072 124803 -14863 -49708 121647 347457 255788 223892 232777 -27543 -222091
20057 -222091 -224526 -312993 -255213 -381567 -389562 -396204 -155784 41533 132123 175232 342149
20046 342149 234241 -8492 -175091 -334493 -249930 66762 253860 -28544 -252911 -238953
20036 -238953 -105646 -52057 -140585 21933 246685 355789 470246 169396 -25344 14473
20026 14473 8989 8205 -44822 -82182 -69413 127841 -29905 -49569 -136961 -286584 -211628 -200014
20014 -200014 -127302 41440 -36087 -69952 -128335 -230708 49942 155681 161818 7541 -179305
20003 -179305 -93403 -39265 90675 216543 203311 519720 481937 196492 -17874 -139218
19993 -139218 -186249 -148894 -238973 -230675 141472 504019 565516 359802 234331 169514 81399
19982 81399 4231 151832 392782 449213 364592 124830 218973 -19272 -94196 -183221 -361192
19971 -361192 -283459 -240491 -356682 -376871 -186003 38593 306969 266194 194092 146495 64833
19960 64833 331158 436628 258429 180371 354024 284457 197222 367985 17730 433
19950 433 193995 158643 36111 178460 87963 33409 -125049 162220 379028 467700 421878
19939 421878 273475 192543 159374 67599 234279 515284 549568 388620 236849 197531
19929 197531 403322 605913 509941 333303 26368 -179784 -94385 6608 -60453 193832
19919 193832 238163 134865 96557 61238 367515 396044 176235 19908 -55617 47977
19909 47977 -26323 -53056 -39994 -204786 -144077 -175265 161748 294007 186639 274342 29496
19898 29496 -201553 -23630 34597 9627 159020 326919 292335 195445 226907 117589 105597
19887 105597 79822 6378 -115228 -142781 -56988 -133706 -152548 -55982 -191384 -345080 -200188
19876 -200188 -99753 -129175 -137117 -9882 36486 194626 169312 -202757 -431025 -235165
19866 -235165 -234846 -394589 -212972 106147 298937 413582 535872 539382 267061 166206
19856 166206 200318 141963 176657 158661 44302 42709 -218468 -400525 -369663 -393800 16358
19845 16358 259995 32824 -151534 -113755 -115064 -3568 1803 -5521 140583 190405 172438
19834 172438 149551 166107 151796 87053 239748 291952 195519 113672 322526 245514 72762
19823 72762 -110861 -299070 -56953 -5965 49922 229029 545171 606332 627113 760879
19813 760879 650653 541245 495998 474764 472316 466150 374510 462894 723743 670351 542131
19802 542131 659686 608741 738180 744274 447364 420931 451905 755870 850576 829220 862771
19791 862771 792897 657330 616397 553727 488020 385903 703158 832329 675022 480982
19781 480982 109083 -64868 86977 272724 294156 442926 616691 650104 643022 628092
19771 628092 708168 661813 674084 581827 295314 120911 353669 611032 792259 606373
19761 606373 399407 314546 244069 256211 333052 394824 623985 839984 861451 1010746 1062419
19750 1062419 837451 424610 412098 470376 648377 432831 246037 75720 524878 751118
19740 751118 798952 901852 750670 463935 319492 165428 59192 66554 152569 -19749
19730 -19749 -121200 -203502 -112320 203419 202128 73682 -61197 509 -2524 -36675 -117725
19719 -117725 -13520 -39409 -120694 33022 -130545 -428047 -464153 -432074 -282381 95087
19709 95087 37386 -58596 -14132 -257779 -335082 -431604 -376278 -308619 -285051 -118242 -45232
19698 -45232 89793 -84506 -290627 -110151 -3963 -59212 -23216 23799 191529 206073
19688 206073 89390 -56167 -74524 -99094 63505 349015 238180 108220 83925 -276302
19678 -276302 -373231 -264790 -126384 54537 77100 80712 113819 162559 69102 107619 194443
19667 194443 324267 124610 -128496 -109970 -41223 -250833 -374554 -300094 -180429 -313954
19657 -313954 -300793 -359249 -545445 -371788 -112418 45550 135830 190128 158091 35866
19647 35866 121135 1714 -88821 -21864 125721 273081 247614 407613 411943 250191 155745
19636 155745 147242 -20301 40173 129034 298538 136538 35162 65636 203216 339116
19626 339116 241216 39551 -29671 50418 145147 189428 301742 270394 248105 376225 395627
19615 395627 451527 171366 -20437 74685 167034 120068 262563 385951 485108 612328
19605 612328 367191 310393 139923 124788 375785 506317 506246 433718 318102 437348 587813
19594 587813 465376 275179 303986 379831 385445 481882 352388 140764 89016 391734 363090
19583 363090 277755 258207 138172 57184 105338 81969 -101832 -229231 -165279 115827 432417
19572 432417 566014 232217 86407 194097 255995 395279 332024 268743 361133 507533
19562 507533 530251 380321 268763 202327 125041 54828 92486 94164 322214 267784 250988
19551 250988 261611 331109 381984 336976 304818 537931 613629 567693 502371 326098 107557
19540 107557 172087 237325 311201 238575 -43237 -17825 340243 498996 576228 401521 268729
19529 268729 301546 292515 322541 542985 602423 655371 775521 674268 601716 774883 762150
19518 762150 714536 796325 720801 580181 512147 338463 349244 359217 367422 339703 44803
19507 44803 -10192 166386 300893 468713 512328 422253 252901 340051 138213 185594 280782
19496 280782 285446 612328 858408 683849 549727 506063 178020 -102035 118683 265542
19486 265542 305513 321589 526670 535548 240526 421114 735149 744672 566635 642157 592508
19475 592508 440862 427554 602232 590354 520110 428316 424378 236738 359622 435726 585686
19464 585686 528738 335522 350897 216986 12746 147914 142369 198834 275360 213945 209648
19453 209648 345754 463310 425169 366039 508406 506338 478615 315431 325018 357395 202787
19442 202787 280511 543460 700886 690974 862912 800165 652660 453618 201573 458973
19432 458973 652423 530966 591640 500264 347165 164048 64639 243621 346060 349718
19422 349718 503939 745583 748507 734044 875524 720106 372872 371661 450251 331941 265580
19411 265580 281250 370930 747600 719674 446253 479491 659149 658594 491067 482567 722838
19400 722838 963362 950855 1069148 976878 875124 1039326 1209330 1219079 1216634 1026380 1074682
19389 1074682 1270920 1314325 1378578 1435570 1496528 1152933 1000901 1020523 1012919 1101907 1269897
19378 1269897 1290605 1345618 1145996 972238 704474 528841 625637 873041 887357 831288
19368 831288 796370 751609 964117 1059511 1387788 1657103 1501290 1436077 1326207 1400379
19358 1400379 1374807 1418648 1344404 1524728 1905771 2329116 2690230 2970364 3343862 3548131
19348 3548131 3457626 3342774 3320051 3204333 3243544 3419731 3894377 4485010 5183209 5996989
19338 5996989 7089644 8115458 8793453 8691413 8115760 7433318 6843027 6024096 5730952
19329 5730952 6060808 6335688 6977898 7819750 8969792 10829073 12695965 14059545 14988233
19320 14988233 15667051 16190853 16915463 18934008 21614575 24348007 27358453 31333281
19312 31333281 36200717 42551741 50651805 60201557 73125203 91099958 108846715 117458263
19304 117458263 116521194 109901047 100020462 90672093 85576610 82495809 78472131 73149855
19296 73149855 66956936 61966759 60860309 64215608 69217015 72393987 72847099 71852759
19288 71852759 71547620 75121547 83909831 95038175 103279226 107421800 109381786 111501237
19280 111501237 114908987 121937227 131785300 137904653 136322042 126830663 111338922 92073671
19272 92073671 73653420 59420398 50030941 45266790 44266510 45274217 45997968 46303497
19264 46303497 47297654 50142379 56394706 68947351 89840069 116000209 138891672 151521082
19256 151521082 155336242 151857995 138916541 119203555 100071524 83941784 70622921
19249 70622921 62433401 61697406 70200856 88735935 113562864 133766861 142308335 139256186
19241 139256186 125151344 102392378 78178152 58439021 44412871 35614760 30097394
19234 30097394 26266237 23215622 20433989 17676317 15043272 13224193 12253164 11376946
19226 11376946 10905803 11104922 12300452 14100430 16082309 17655025 18250801 18087245 17105108
19217 17105108 15148399 12895933 10934347 9514720 8085654 6922836 6253954 5939583
19209 5939583 6071873 6054176 5831851 5454811 5040084 4628592 4316944 4276018 4091935 3748530
19199 3748530 3301218 3103169 2507541 2304717 2017073 1761859 1655761 1533613 1328669
19190 1328669 1267589 1260375 1331199 1279801 1225342 1096524 909246 1004562 1160136 1115348 991737
19179 991737 982423 1066621 1257137 1217180 1084289 934712 866691 983681 848685 842227 691136
19168 691136 621659 559365 678002 610946 778834 898935 905380 945382 1039842 1031081 981614
19157 981614 1002989 814554 568791 566913 724755 533543 716903 958762 911802 900358
19147 900358 797154 734523 495721 548993 475797 478730 312690 282131 354206 594006 819581
19136 819581 804050 571399 629268 902910 886403 800927 759505 739716 742298 630961 691451
19125 691451 917205 672591 478043 538753 650272 614132 505834 622585 728225 464889
19115 464889 470715 617614 423849 139261 -7495 -18768 91901 171751 429145 431394 556249
19104 556249 779223 904850 834357 748329 729717 462032 442693 580519 681735 469672
19094 469672 332850 294983 417791 526185 477224 681956 619875 599133 527226 406831
19084 406831 357226 180269 425762 350195 145749 256733 463051 424182 379218 225904
19074 225904 327998 317169 426191 449193 436205 463518 362174 384260 362356 506075 312905
19063 312905 107379 2663 -61470 -58572 -34736 -166695 -140058 -157203 74503 125432 224972
19052 224972 353498 324975 -19157 -61492 188043 185365 -11220 -151668 -13699 23706
19042 23706 189375 196476 207979 328869 232702 226082 279828 218878 333782 418530 373327
19031 373327 174662 227744 441073 556433 518308 571156 526676 320717 259376 479273
19021 479273 412359 312300 306473 124464 59581 49070 429412 522992 401875 599284 758971
19010 758971 819119 985701 844403 758995 497199 420441 580763 817507 715815 508642
19000 508642 659506 878279 669837 440543 389156 563441 614738 409301 287127 295713
18990 295713 114105 77740 382937 717915 852180 902016 932074 842778 741349 416058
18980 416058 460350 437303 814207 893611 843452 732086 1154425 1304238 1322855 1363028 1223751
18969 1223751 1228821 1274640 1165238 1146490 1397147 1728075 1819886 1731152 1599873 1465031
18959 1465031 1254787 1352208 1484760 1769433 2033697 2049251 1674257 1893128 1929243 1528545
18949 1528545 1377235 1404918 1332660 1308373 1506531 1497158 1640195 1596485 1344561 1318770 1487495
18938 1487495 1470338 1491468 1424914 1620813 1697075 1709631 1682834 1589684 1944451 2198920 2299932
18927 2299932 2187449 2205146 2122058 2187283 2400591 2602682 2935382 3347545 3613344 3734794
18917 3734794 3840721 4072705 4191615 4523071 5082521 5424723 6016522 6512885 6979997
18908 6979997 7346253 8084648 8800049 9642207 10433127 11263071 12621501 14374596 16682834
18899 16682834 20311256 25869369 33736225 44095384 57362751 73351725 91552174
18892 91552174 110383978 124544658 128256705 122865878 111929770 99217042 89743504
18885 89743504 89103567 98402963 116073996 139792807 161084522 171310873 168826165 156458033
18877 156458033 137527296 115348679 94484805 77195465 63883025 53734779 47386205
18870 47386205 45079742 46832291 50262815 52400636 51479431 47397533 41230257 34450090
18862 34450090 28582531 24267876 21437472 19890021 19436382 19967139 21131285 23060307
18854 23060307 26579889 31599412 39713280 52031533 68064575 82635894 91293529 94843102
18846 94843102 95765976 95861858 96661590 100667863 109605892 126124744 150750714 176957490
18838 176957490 192522826 196604337 191333846 178067920 161490927 150805024 151142054
18831 151142054 160531767 170660196 170644858 158452411 137396774 110412067 81824485
18824 81824485 58384117 42837920 33011993 26528957 22539239 20193143 19165641 19403885
18816 19403885 20731241 22612020 23371962 22284624 19890284 16844537 13501595 10899397
18808 10899397 9048066 7482930 6418578 5917131 5646034 5237812 4680562 4569100 4260449
18799 4260449 4188135 4072828 3799748 3474469 3203211 3003761 2741759 2723248 2750803 2580801
18789 2580801 2219179 2097752 2270743 2393455 2275876 2017594 1927046 2224957 2190660 1877613
18779 1877613 1651859 1508728 1405852 1556624 1539945 1582085 1756889 2028447 2260953 2166432
18769 2166432 2301704 2476672 2566351 2453349 2892432 3512672 3629445 3508882 3258563 2832319
18759 2832319 2595042 2060207 1579692 1512506 1678701 1647493 1810142 1744674 1676069 1764453
18749 1764453 1685365 1794091 1909853 1924897 1959791 1981255 1991757 1972588 1859119 1658151
18739 1658151 1511905 1686154 1723282 1396575 1198120 1127103 990947 1226868 1154107 1178717
18729 1178717 1352992 1535911 1487814 1295493 1394508 1263691 1376748 1327840 1181183 1004529
18719 1004529 753504 753880 726474 725630 652600 642243 744255 961769 1122655 1088378 975070
18708 975070 994746 1060475 1173305 1075057 1123239 1017141 963910 860378 676543 480806
18698 480806 653869 688389 578251 653091 608987 605146 717570 862228 912492 889079 948763
18687 948763 874124 1144881 1042899 865379 676561 625607 544550 532118 702991 541605
18677 541605 117369 65445 391208 535568 526826 475940 503557 536758 566394 498465 677214
18666 677214 737723 636902 513813 532652 491473 424974 639294 861999 876283 705562
18656 705562 699621 867235 1175024 1042226 638996 661308 631924 585124 410124 366558 315551
18645 315551 487182 684484 643329 550589 708301 830415 949792 710523 378398 440876
18635 440876 678407 913410 1102250 1205616 1067730 1046426 980211 883450 682273 528194
18625 528194 651670 810370 887888 841419 643656 544713 776544 852895 863598 653834
18615 653834 528753 469758 534734 626290 564155 329863 213985 385915 489486 573011
18605 573011 714355 795151 933142 585400 281789 293796 211704 333893 462524 253173
18595 253173 280440 430405 387447 416216 267106 416704 547343 687086 690038 753934 702964
18584 702964 672365 653007 637258 804649 784791 747633 887565 695153 755592 981713 935407
18573 935407 674065 718722 955177 1095111 1340464 1213602 980898 1094136 937090 852998
18563 852998 726906 490119 573302 794994 855108 774010 806032 966315 1086786 1223976
18553 1223976 1260605 1198848 1064428 820426 640522 791181 894455 1079446 1024667 957562
18543 957562 1103794 1224877 1489094 1556576 1532786 1297142 1327119 1332802 1214337 1087340
18533 1087340 1280175 1216284 1395969 1859108 2121956 2250692 2471817 2602747 2727344 2974883
18523 2974883 3048830 3288252 3494155 3827152 4026519 4275560 4659105 4820904 4936790 5282697
18513 5282697 5724804 6428756 7779822 9305013 11727312 15716616 21882048 29971813
18505 29971813 39135926 47896593 52516216 52235751 48317857 42047254 35974991 32590059
18497 32590059 33089035 38535999 47897663 58317877 67910299 76069900 79503586 75782941
18489 75782941 67016162 56748705 46252473 36729867 30712696 28638266 29873656 33779071
18481 33779071 39202492 42862813 43156548 40576203 36172998 30801281 26479120 24211680
18473 24211680 23066023 22105621 21787085 22282694 23329486 25075118 27309289 30818971
18465 30818971 35452061 39482597 42589760 45058902 46661116 47316980 48560113 52762942
18457 52762942 61433456 76616021 98491997 122182727 141650600 158277957 177243185
18450 177243185 200585458 222637168 233086475 228475551 212091801 187459288 161062596
18443 161062596 141078570 130092314 125978611 125747537 124988068 122019345 120125721 118634487
18435 118634487 114596783 108297303 100896273 92268586 82323758 73031833 66114090 62074166
18427 62074166 61369509 64453466 71157110 81853773 98501436 121837632 147658587 171429998
18419 171429998 190849333 199754015 196576960 187268495 180056968 180171879 190452165 207772747
18411 207772747 225651806 237539921 240610165 238995238 237805592 237256922 239308377 244750620
18403 244750620 248997526 248064511 240841588 230683761 220727658 210601895 198739325 190492569
18395 190492569 190149727 198954488 216941956 241899175 270622215 299577625 318699261
18388 318699261 320821115 308359224 282623656 246642596 209494264 180155463 161964475
18381 161964475 158708583 170988555 195073546 229465521 275794367 324872434 350795984
18374 350795984 349281299 331157323 303124711 271408044 246856000 227185412 204707141
18367 204707141 178951757 151397347 124267128 103744562 93653266 91904609 94977065
18360 94977065 98769603 97492714 90335206 79500626 67506610 56283868 49087800 45900099
18352 45900099 44982881 45005812 44486250 42682956 39873440 37035012 34770740 33455187 34647286
18343 34647286 37680863 40008832 40009358 37853656 34027438 28923095 24310055 21302247 19849769
18334 19849769 19764042 21251971 24148054 28963070 36672978 47576330 60427759 74463488
18326 74463488 88124792 98355934 101428396 97129612 87520022 74984364 61972393
18319 61972393 49740174 39866169 32322840 26354680 21542932 17632823 14513017 12562201
18311 12562201 11385068 10338868 9774688 9881192 10249158 11276919 13315861 15792299
18303 15792299 17447803 17636269 16425565 14577154 12112359 9701855 8001850 7165975
18295 7165975 6520911 6317718 6454568 6944436 7885626 9617286 12154320 14504454 16099779
18286 16099779 16536214 15970806 14573755 13322652 13245270 15019947 18531335 22379693 24390855
18277 24390855 24320043 22345555 19291309 15712070 12848871 11517288 11629095 12605434 12867481
18268 12867481 12301653 10892487 8851502 6724458 5107246 3997535 3133195 2411676
18260 2411676 2175776 2158389 2202404 2070017 1935880 1629263 1685759 1307457 1105179 1320394
18250 1320394 1623799 1861492 1697336 1304603 1182144 1128741 1084120 1125924 1035971 934078
18240 934078 1116424 1202845 1189356 1062700 1074713 1237999 1272311 973204 880066 661821
18230 661821 542280 506114 490801 241209 378429 558565 605809 665650 671093 770588 431067
18219 431067 323062 643333 720649 557928 647502 665674 361364 140466 212444 413673
18209 413673 314421 123920 198006 446010 259854 202441 -101999 -97774 -40389 27550 307666
18198 307666 450516 430673 561926 766901 769319 699170 710909 611804 576617 715161 864537
18187 864537 650092 420156 459936 534133 351635 359510 532632 763062 691903 544120
18177 544120 431665 144188 -33002 286898 363914 367367 439076 253816 456585 589283
18167 589283 623419 467670 446239 390088 347952 511156 621321 519910 466586 668863
18157 668863 730621 698866 705316 820344 997314 1164540 1001024 863238 923137 1081933
18147 1081933 1056377 940301 800753 811567 1038265 1414486 1596120 1677631 1595181 1374371
18137 1374371 1430585 1547932 1592678 1509599 1651756 2079516 2295907 2509052 2646187 2976425
18127 2976425 3227763 3436207 3841307 4162554 4627316 5289177 6329664 7416369 8335615
18118 8335615 9524632 11260398 13271763 16085238 19781557 25256479 33091346 44814729
18110 44814729 64006390 97020869 154483451 247223024 351309580 401095233 394366261
18103 394366261 351537548 279447914 187665708 115346544 74208031 51359629 37294981
18096 37294981 28019744 21858325 17539027 14535563 12132014 10272119 8620924 7429740
18088 7429740 6367062 5599108 4928495 4210848 3581347 3310935 3167224 2694040 2470511
18079 2470511 2650405 2774417 2720816 2489377 2210754 2049567 1819999 1771328 1539818 1400592
18069 1400592 1165145 1374072 1663739 1832218 1875482 1676946 1310845 1107460 1210490 1187849
18059 1187849 1120550 806247 717065 573576 526537 524244 560496 600779 695502 586368 406953
18048 406953 242813 161348 260690 508957 534769 376170 342923 492282 333782 189391
18038 189391 178103 70778 91704 100422 338984 318830 565236 607210 417558 357149 413750
18027 413750 376477 431107 552139 497519 174783 -21498 -12067 172416 199744 379421 426301
18016 426301 160634 191327 348077 463225 457051 615746 727859 489830 491624 633429
18006 633429 610499 528816 395024 540476 611872 348929 226456 240802 -19614 6446
17996 6446 149833 236503 356057 402832 591785 829009 1118722 1142339 994103 944865 816013
17985 816013 839881 842876 803940 889612 804479 739204 1060628 1036166 847005 1048884 888073
17974 888073 594865 403399 317847 324859 234013 128264 -43179 -454028 -308720 -232890
17964 -232890 -284491 -150569 -156958 -136247 7971 113456 63979 229550 362303 527685
17954 527685 501679 727969 787737 703596 744060 705731 620277 842409 900691 904037 899536
17943 899536 891258 865148 977019 1049081 1018195 811180 855021 1097171 1085577 919295 1034160
17932 1034160 973490 744594 746836 893344 895194 855979 945380 1340790 1506253 1439978 1244138
17921 1244138 1420961 1227329 926435 841062 731464 518899 481256 563601 426349 491769
17911 491769 606946 625183 533751 503970 462096 418411 461697 439517 515895 665825 687525
17900 687525 460893 313203 479305 644956 605603 668552 935438 1015243 938438 1002130
17890 1002130 890827 876286 928688 716295 330638 115135 344423 384703 424062 662520
17880 662520 736814 759037 656169 737767 986577 1205148 1056539 892020 935356 1148880
17870 1148880 1289842 1352514 1195304 1012274 1245997 1292600 1158676 988785 803486 738675
17860 738675 665375 486390 489570 823405 824540 514022 393872 425475 324556 251958 342115
17849 342115 311086 312044 368874 398709 376914 365779 450018 551318 487990 398746 325932 309100
17837 309100 369880 285731 441416 413090 513935 780742 730082 639156 542141 547519 493114
17826 493114 496363 445855 396153 620256 964620 995330 806815 743887 532493 251175 450105
17815 450105 424321 225035 173834 173980 313024 580594 764095 745067 841520 740382 601252
17804 601252 307628 135462 242615 142486 -73056 -137979 99619 110812 -36193 10914
17794 10914 -45274 90961 185871 88754 4188 -157040 -315377 -359591 -408849 -351719 -371536
17783 -371536 -79882 48724 48191 29432 176080 404662 282340 74455 100341 103290 68541
17772 68541 78328 111920 325303 389618 240666 81391 32181 -105394 -100054 -189104 -388741
17761 -388741 -446656 -207202 -69875 -146404 -272684 -383039 -705092 -429173 28630 -4701
17751 -4701 -221080 -169942 -193690 -250183 -344248 -455979 -324890 -205747 -336017 -487407 -512576
17740 -512576 -782474 -756726 -627623 -387067 -271135 -294680 -123363 -22333 157428 482243
17730 482243 627727 412355 -70353 -460853 -476771 -353922 -179114 117227 -59531 -258506
17720 -258506 -216602 -150926 -140437 -232540 -283738 -75813 30117 -237515 -98426 109294
17710 109294 109633 173853 346056 235447 98910 -35023 -104301 -87107 3274 -237971 -409202
17699 -409202 -317371 -363706 -99701 93961 36643 31647 183449 209303 217308 116989 125289
17688 125289 264838 216785 15028 40958 227246 326745 129928 -47654 197330 189196
17678 189196 193161 294732 459685 352925 120400 239382 142400 -172385 -268595 -88284
17668 -88284 76408 99524 46057 -141237 -50840 -102627 -116275 55048 -29104 -156799 -135517
17657 -135517 -215826 -123260 161595 167225 39999 -43880 23130 190671 77312 163705 145148
17646 145148 376647 174321 243404 223128 44136 92223 240256 206445 1352 -206990
17636 -206990 -277419 -490820 -684169 -364564 -158329 -147253 -220631 -114264 31742 -22709
17626 -22709 -5792 -24019 -53478 -163556 -173517 -293619 -299025 -59732 195329 268244 268056 272943
17614 272943 232037 62495 -218244 -374178 -453875 -480965 -187793 2895 105442 185517
17604 185517 128841 -20129 9653 -87898 -200108 -150056 62525 36837 -232183 -247746 -227890
17593 -227890 -288631 -113032 -120187 -37062 -123927 -1950 -7660 -65577 48808 71508 651
17582 651 -121294 -53666 -82037 -63458 -105370 -340180 -383237 -424588 -457567 -443573 -465967 -255184
17570 -255184 -140775 -219721 -92589 -143031 -27692 220998 30043 -126632 -52796 84896
17560 84896 151123 -142713 -226047 -221438 -155945 93472 149810 209020 67349 -80163 -271159
17549 -271159 -470511 -506532 -415214 -365432 -287901 -285881 -333826 -396837 -349017 -216247 23112
17538 23112 -43698 -89862 -151577 -62150 -74370 -102671 -104006 -50810 -114832 -177747 83410 304680
17526 304680 488004 306015 -135783 -297046 -165953 -46637 65563 299232 165318 160999
17516 160999 374880 274210 -46855 -46930 -93169 65436 213388 60949 55746 52184 83991
17505 83991 84067 49350 -260163 -291448 -373495 -428169 -487024 -222794 -68373 -225713 -451853
17494 -451853 -458003 -306282 -274751 -116513 -161499 -223837 -283209 -43967 170985 -200599 -291005
17483 -291005 -237583 -273541 -225874 -254881 -46688 -377858 -450414 -164835 -261578 -176023 -101174
17472 -101174 -318407 -557275 -451301 -226109 -49962 -16583 169690 411254 263661 243613
17462 243613 269797 192830 19395 18325 57347 -131026 -194090 -76209 59411 209964 270519
17451 270519 454375 365785 255407 342046 212461 430132 435707 576446 639753 841684
17441 841684 1422543 2118881 2259836 2065285 1776378 1304778 776566 440443 238298 434772
17431 434772 340906 267082 281116 56302 -97355 83153 115387 200389 80465 -61113
17421 -61113 -14637 376969 592579 455438 285897 -65601 -261167 -473617 -474637 -393819
17411 -393819 -219096 -89391 -87099 -182771 -53568 72124 -20215 -233749 -460281 -323988
17401 -323988 -336812 -254984 -75784 20042 99768 -55035 -193296 -200382 30772 -11737 -97823
17390 -97823 -216488 -348361 -576033 -428107 -161114 -220701 -199149 -298064 -306021 -364670 30708
17379 30708 379574 384665 91727 -33029 48716 446535 327821 -111819 -80839 -87338 125450
17368 125450 -10772 -328343 -210230 88003 7505 -74719 25834 -70402 -81318 -272438
17358 -272438 -420671 -188274 -79407 -317212 -287058 -235474 -168269 1598 -54889 37713
17348 37713 40655 67193 123387 26250 -8777 2278 -21506 -4040 -106661 -12787 -108865 -247711
17336 -247711 -281033 -164302 -200040 -180404 -287607 -505371 -537899 -348303 -85555 12428
17326 12428 93893 -73671 -105019 -149622 77976 237954 157503 55972 208070 179694 -56926
17315 -56926 -304086 -111522 39538 9744 -63817 -142476 -108599 -268353 -221618 -309840 -412497
17304 -412497 -182939 9719 167805 192646 134166 71859 -102478 -191227 -180894 -104558 57950
17293 57950 -222 -265881 -242628 -241398 -150802 -176820 -261378 -448548 -351417 -108641 -126534
17282 -126534 -353291 -476246 -493625 -398970 -279811 -231837 -169039 -189499 -441262 -533699 -315983
17271 -315983 -203675 -258724 -310167 -189933 -45905 78184 3502 -267314 -329168 -451701
17261 -451701 -314859 -176113 -243314 -224320 -200390 -382849 -455811 -79105 15586 -101147
17251 -101147 236592 221174 102625 238980 275753 211758 20391 63202 78536 80730 55162
17240 55162 -209634 -157075 -91438 234345 422947 251316 -46184 -171548 -275598 -201997
17230 -201997 -81113 93493 -76269 -551238 -672843 -486256 -358770 -108874 -18273 40879
17220 40879 -18639 -57662 -126937 -111503 -178985 -324404 -62930 130101 89366 184852 135317
17209 135317 -82989 -309024 -297425 -218758 -62171 21927 -3076 212858 220775 -128497 -396224
17198 -396224 -376881 22918 39905 107948 95255 247922 244743 306730 399783 121064 -181555
17187 -181555 -322754 -248025 -223456 -56805 37860 -9367 45449 239694 186444 494846 481141
17176 481141 350954 65321 -95151 -45970 65603 182157 191118 -103081 -186522 -261286
17166 -261286 -271688 14135 157928 187546 217099 275309 230145 159351 234752 224339 178179
17155 178179 79528 -3254 -200123 -255420 -47006 -41873 -188125 -162974 -57996 -142063 95473
17144 95473 -37545 -89370 -7315 13457 88705 33088 176503 238247 116656 20149 -8399
17133 -8399 -10869 -224535 -327742 21417 97720 -10872 -234273 -370449 -264145 -233101 -77053
17122 -77053 128654 135815 262885 240711 295517 299126 345177 175867 93672 262840 326545
17111 326545 43204 124155 366181 321350 223118 172963 208459 107332 -25149 -161153
17101 -161153 -61113 217616 200634 134260 -105258 -183805 -173036 -245732 -447710 -450798 -413005
17090 -413005 -430646 -286334 -122380 -138528 -148707 -68881 139044 -116955 -210932 -44688
17080 -44688 -47659 -106078 -158302 -103146 44230 -154062 -76222 80287 131324 -455 -173956
17069 -173956 16782 182905 57180 210973 65106 -223735 -382558 -335505 -311017 -258573
17059 -258573 -159665 84323 55576 -99719 -35977 -95329 134808 312393 451406 374073
17049 374073 233236 43423 44494 59262 -173694 -167756 -34170 -50034 -9212 46749 190695
17038 190695 283709 264660 307362 298700 105043 -142878 -251171 -247466 -331828 -236535 -149628
17027 -149628 -340001 -309877 -121652 -89166 21676 92807 27989 -174840 -516090 -440129
17017 -440129 -334678 -302633 -291620 -410039 -601064 -434937 -160404 79253 127720 180363
17007 180363 -115876 -195303 -20462 29111 86620 232280 127267 12500 -3440 -100232
16997 -100232 -48269 72369 152072 35165 84856 328550 570773 522025 399841 -28880
16987 -28880 -264909 -129610 15907 -141596 -157462 -198703 -376454 -547855 -693048 -429688
16977 -429688 -213456 -206166 -168876 21562 -65806 39009 -57482 -162866 -161462 -211246 -272316
16966 -272316 -366631 -78728 -56545 -153389 -182465 -163586 -249337 -140773 3377 243188 274796
16955 274796 196852 122619 249944 296286 152699 227129 372747 338113 -31103 -198847
16945 -198847 -421636 -426503 -370839 -462123 -294134 224141 599704 337689 56821 -174200
16935 -174200 35334 363686 389940 503411 369899 59322 -291019 -393303 -269919 -126457
16925 -126457 -49034 30533 -44334 -271639 -263858 -175497 -45359 -29366 -268507 -197195 45424
16914 45424 -49288 -286361 -150658 -56720 -54021 66154 -26953 -284546 -404385 -378297 -395787
16903 -395787 -338660 -300125 -151577 -70087 -134825 -326960 -245809 -300265 -338057 -209939 -85735
16892 -85735 -199557 -338349 -160800 -101407 4156 58212 34116 215085 284183 -62254
16882 -62254 -168413 -347237 -443440 -260934 -190820 -185648 -177927 -126540 -265206 -320132 -389592
16871 -389592 -599440 -536222 -528542 -420774 -208913 -41891 -91070 -257936 -334682 -150927
16861 -150927 -94579 -237861 -250597 -145693 -14407 305071 302954 327339 308026 3744 -122508
16850 -122508 27668 -35748 -54954 -83240 166902 240255 313114 297077 190348 162760 73435
16839 73435 74470 -42757 -149621 -123503 -50964 -70874 66419 118369 135978 38579 -86033
16828 -86033 -44926 -255506 -365709 -231677 58720 162829 5240 72934 45520 103920
16818 103920 189186 183505 162001 113346 144186 6737 -135939 -82627 204551 119610 97124
16807 97124 -79505 2431 127725 95499 -102169 -164443 -296018 -454490 -575576 -502068
16797 -502068 -623001 -497142 -340449 -138593 -19584 65366 27270 -37156 187827 197440
16787 197440 -154022 -116425 127822 201573 276302 192792 183873 177771 196676 79232 20860
16776 20860 194346 150763 -115004 -249252 105504 184899 106235 -136588 -293907 -597147
16766 -597147 -533718 -449162 -387833 -413042 -289920 -96586 78230 376 -123842 65850
16756 65850 -19120 -9031 172945 -13666 -96647 155121 483037 175813 -204753 -25831
16746 -25831 30159 -42606 137563 62158 -41567 215718 477156 385374 98327 184836 200122
16735 200122 -31429 -160685 -153961 194822 360653 269049 276172 295562 181853 -68639 -250035
16724 -250035 -270576 -194081 -291441 -483488 -421906 -203827 152430 356337 347448 68233 -44398
16713 -44398 8130 201380 369820 259969 79575 -63922 -80759 -289762 -222234 1547
16703 1547 311200 613926 556904 364693 313542 530429 329731 75959 -126462 231102
16693 231102 241378 -41393 -123376 -192251 -180748 -179504 -51163 -191893 -109910 72956 25046
16682 25046 16808 -94273 -302208 -214727 -178263 -34204 74397 -17468 -124138 -64323 -18984
16671 -18984 30817 -167614 -196572 -105829 -99207 106583 40442 113547 174687 260776 268383 343939
16659 343939 270626 139435 -4098 -87440 -117038 -3290 17085 55400 243736 65463
16649 65463 -263236 -331811 -147569 -44451 54731 -19849 -267417 -619127 -641364 -574460 -296075
16638 -296075 -208553 -182240 -249947 -236643 -220664 -236849 -258132 -149276 -199574 -126994 95076
16627 95076 51104 -125742 -133454 -92329 -169246 -38781 96914 -51970 -298138 -211744 -93260
16616 -93260 -59273 13803 87105 194231 201806 260698 309952 154292 11845 -44765 32882
16605 32882 6541 -181387 -113635 -29634 -2658 104644 198720 -82607 -90978 97306 -59176
16594 -59176 -46574 179305 295444 193883 16052 -47218 -124784 23018 84168 75558 15681
16583 15681 111842 -46565 -2362 162596 262030 195011 -31959 -279248 -150457 81912
16573 81912 173880 230340 194271 215012 268493 257194 388110 324310 223112 98273 99623
16562 99623 334367 451292 282024 29840 -321575 -256558 -125877 -150662 17602 -42061
16552 -42061 -439559 -454155 -179174 -137302 50537 196389 214187 -34864 -125612 -33049 64485
16541 64485 102032 4954 -142095 -196031 -18866 -139852 -336923 -93871 -203172 -119563
16531 -119563 159693 -15220 -246686 -314993 -174643 -187346 -469305 -363299 -23073 83949
16521 83949 144513 128269 77852 75307 199377 292353 163098 -56703 105908 -25581 -248545
16510 -248545 -160101 -298017 -311838 30866 174160 31789 -16363 185797 341951 336529
16500 336529 219754 121111 -32671 -101071 -223077 -234437 -149619 -265534 -406647 -200790
16490 -200790 -128503 -16662 -66196 98030 144422 4879 -237991 -421084 -278253 -219948
16480 -219948 -143571 -27491 -45298 -48387 -155936 -189770 52402 70145 3283 153070 329411
16469 329411 279580 50559 -16577 -282883 -262519 -497148 -408617 -336439 -319441 -385219 -204958
16458 -204958 10988 16121 -44205 -106727 -384974 -376971 -141082 7109 -8883 -27699 110273
16447 110273 247034 405317 185259 30640 -167708 -74832 152291 337474 54702 -80295
16437 -80295 -143774 -183513 -31631 16731 -215511 -478809 -385931 -220170 59274 59901 -70892
16426 -70892 -131668 -198730 -135640 24577 129258 236951 24882 -238719 -292803 -50866
16416 -50866 -91849 -171120 -147167 -182478 -214466 -244884 -234735 -112141 52457 163624 276177
16405 276177 220547 15992 140341 205398 18319 -241554 -308902 -148562 -307995 -351098
16395 -351098 -397516 -419116 -305228 -52923 199991 67856 27809 1685 114058 186222
16385 186222 254867 68240 -55107 87077 127244 -123562 -317215 -254009 -120342 79194
16375 79194 305580 328042 119485 -33621 23512 -118770 -118622 77404 76827 -123152 -276766
16364 -276766 -295116 -121635 -371757 -424516 -207027 -164485 -218907 -173804 -293926 -246280 -67755
16353 -67755 -45474 -187628 64304 -156674 -278803 -39619 181554 101151 -127444 -223913
16343 -223913 -122354 5706 258728 330697 414097 219671 139852 -23044 56695 -34822
16333 -34822 -99333 -44773 97418 -62376 -119309 -396899 -183679 164373 271330 350857
16323 350857 135254 -179142 -107579 -60116 80560 210347 -21818 -169870 -124259 -18839
16313 -18839 -118266 -270776 -82095 -44676 7725 -86119 -450785 -428105 -243640 -172516 -79137
16302 -79137 -159128 -93444 36434 85379 -58738 -70975 9927 319409 435062 301579 351054
16291 351054 257784 223480 261745 127608 36174 113056 129888 13898 -41260 -100289 -85089
16280 -85089 25713 -111244 -191272 -68241 287563 297821 84694 -34287 -46832 -160749
16270 -160749 -135432 15766 -92302 -161761 -239235 -333816 -318534 -272866 -270895 -1038 328781
16259 328781 447343 455288 490762 332498 170661 -125546 -611219 -551733 -310410 -173544
16249 -173544 -245384 -435524 -423423 -80414 48939 131810 180890 498479 609510 703724
16239 703724 789039 701500 779463 497291 110146 27315 -20076 20159 45475 -61371 -80981
16228 -80981 -216666 -335915 -403564 -152231 -43599 -38485 -48908 -129584 -348246 -414949 -212064
16217 -212064 -195348 -244056 -260567 -194325 -133497 -50243 -125109 -109153 -119313 -234495 85324
16206 85324 84799 -167947 -19550 124795 -45196 -149431 -61709 -75197 -40847 23571 134041
16195 134041 84519 -36171 -132164 -247297 -113473 -161093 -228105 -260241 34188 111707 111335
16184 111335 205340 205030 122681 -43831 26812 177226 185701 50788 87309 90480 3526 -151526
16172 -151526 -278007 -77036 75102 61398 -24954 -169878 -517243 -370622 -524043 -549992
16162 -549992 -253989 18080 74071 -16968 -72090 -147422 -241204 -197922 -240933 -390516 -299587
16151 -299587 -196478 -256375 -135714 -171925 -170513 -201658 -112758 -190219 -29401 299232 539787
16140 539787 499031 34904 -140987 -273342 -344947 -351105 -194288 -261661 -304164 -284152 -185795
16129 -185795 -281081 -359725 -108103 7118 -42570 53227 54376 6473 162630 304934 311668
16118 311668 388955 408843 268330 222408 231042 60741 -92836 -350086 -476032 -254210
16108 -254210 55826 266450 310418 282845 -99382 28623 18251 13769 -43847 -105728 -9817
16097 -9817 -67426 -113558 -362142 -345049 -236962 -149517 -246778 -116572 79742 287398 160651
16086 160651 -102389 -147992 -284744 -208845 -64435 96708 121315 250254 295882 194331
16076 194331 189549 195769 358691 399287 506545 361223 265795 399769 486276 383151 326897
16065 326897 91710 173258 6624 -94763 -113796 -75004 19671 -52632 -51841 -27800 -65826
16054 -65826 -88511 -97171 -208012 -80731 87193 -30749 -244113 -276568 -205196 -205179 -133667
16043 -133667 114407 395349 468146 251997 220728 135925 251555 174519 90502 -3273 -180013
16032 -180013 -92816 39726 128533 112860 -159246 -541971 -490806 -458893 -515074 -629095 -505658
16021 -505658 -361941 -26143 116107 309365 290615 157913 155315 214535 67001 -99802
16011 -99802 -45265 -140217 -109723 48718 192643 162370 48540 -37516 -185011 -168975 50957
16000 50957 269454 257106 142659 219269 224514 435884 498206 392905 416586 219596 -215022
15989 -215022 -155244 -85356 -70563 -10979 -162970 -175731 -104366 -142274 50592 125133 74030
15978 74030 216340 505877 626869 602920 550272 412183 313392 76012 -50807 184649
15968 184649 87933 139815 335109 218031 -61850 -280685 -300273 -134720 -98480 75076
15958 75076 26237 -250307 -297662 -62997 126044 87699 186786 272880 153101 50808 97204
15947 97204 33508 128475 259804 98496 109982 45844 23360 67661 162564 197233 254936
15936 254936 212505 192879 -31018 -156413 -383431 -331854 -247525 -126567 -193131 -173017 -331772
15925 -331772 -240631 -121783 -90770 -219581 -256059 -55378 -10197 -218591 67134 152285
15915 152285 142779 101595 3366 -116515 -4334 147123 212557 117199 -33253 22451 -383064
15904 -383064 -418733 -292490 -231829 -262571 -96087 114007 254419 308300 124828 -279585
15894 -279585 -214225 -135997 -279626 -393353 -190248 -205135 -101752 -27826 5095 126748
15884 126748 72641 151060 266980 69436 102183 60357 113645 125972 -148309 -238847 -217060
15873 -217060 -125322 113524 313527 108222 2781 20486 64231 -17824 -137453 -155620
15863 -155620 -128745 -25181 97745 -175415 -4993 47938 -177003 -230077 -119630 -283019
15853 -283019 -355647 -197433 104102 294431 283880 319183 143881 191409 424735 276034
15843 276034 138401 157453 -135249 -233637 -40277 330222 294373 112629 -151686 -11015
15833 -11015 -4483 -232475 -188136 -52080 258996 364822 185345 164195 34772 -7873 -101009
15822 -101009 9427 -110051 -115949 -27648 65088 278028 197525 -19388 -43344 9400 -37576
15811 -37576 -114002 86255 202544 204927 176380 70175 -92487 -219152 -324837 -277456 -206910
15800 -206910 -102134 -208899 -192285 -347809 -425665 -279789 -79133 -58655 -36363 135077
15790 135077 297998 271827 236700 174068 183470 212145 194897 133990 66558 242347 108154
15779 108154 -74689 -74788 -189161 -198620 -322257 -403316 -401233 -227578 -389632 -495839 -413369
15768 -413369 -314039 -92441 112710 141960 -42855 -120854 40501 65814 -67637 -166221
15758 -166221 -115311 83767 65405 -78754 -58991 6320 20005 87602 254862 484622 468171
15747 468171 382405 392267 330190 150101 46869 79993 163094 199576 91285 -12632 -144475
15736 -144475 -72098 64028 178610 313506 403272 260859 213906 60421 120483 125130 -159907
15725 -159907 -275159 -166596 -79691 269390 405390 361906 265848 174753 -54892 -66296
15715 -66296 25438 191524 208057 277986 483395 598244 427314 246151 292237 212136 167033
15704 167033 147007 186691 134604 310689 510493 488317 480177 202027 9052 -115972 -68278
15693 -68278 -63287 -80098 -49599 184815 279318 454462 511421 558371 412057 266595 210360
15682 210360 171089 125747 116723 129595 500505 582728 451279 120907 -32977 37104 113679
15671 113679 4464 -181582 -125357 -120246 20041 6837 -8348 178879 253230 147876 -20150
15660 -20150 171329 244708 -9442 -7540 -144962 -293606 -247193 -228615 -177703 -145267 60181
15649 60181 77598 -25801 -75865 -254250 -323139 -309044 -340471 -225876 -108355 -80320 54316
15638 54316 223980 321038 172438 284651 150636 -85564 -369686 -388218 -293025 -299946 -123362
15627 -123362 -85337 -30151 135821 -62326 -169137 -69856 -20909 -36397 47409 3565 161491
15616 161491 277051 54470 154325 299756 119402 196326 219994 204927 209400 34615 213804
15605 213804 203239 233046 327023 210416 29585 -104615 7731 40393 -169813 64544
15595 64544 186905 103617 -14383 -40756 80844 182617 268968 91061 2048 -12847 -161990
15584 -161990 -300025 -84389 83816 138031 -182069 -223536 -42082 89290 23913 15734
15574 15734 50671 75013 34797 -54927 -114633 -50676 -195398 -364230 -555021 -382967 -219658
15563 -219658 -219674 -424453 -319241 28787 145392 174202 192061 186442 38829 -114495 20917
15552 20917 53553 -181724 31873 87532 -24477 196716 285919 325559 73215 -76263
15542 -76263 -211714 -309363 -327081 -206449 -48358 91282 41739 -42072 -1553 36857 -156596
15531 -156596 -262037 -127415 -215111 -123843 94852 192183 42184 -112694 -225100 -256418
15521 -256418 -362255 -405490 -504073 -226999 42166 -145826 -192632 -105767 -56575 114917
15511 114917 272147 312223 276388 202609 193914 -82323 -145827 657 -32116 -121799 -118063
15500 -118063 183472 108424 -376551 -261958 -65282 8994 -83573 -2698 135841 194975
15490 194975 219049 175451 153388 264622 344376 180806 16460 204567 389105 398872 190394
15479 190394 58004 39632 220177 53307 -106681 -288479 -230658 28877 46989 200139
15469 200139 181174 28436 112425 27160 -81312 -13414 -101704 -181844 -178364 -179031 -223672 -155243
15457 -155243 -54820 -14882 108666 92257 57111 228961 499231 487139 295146 454383
15447 454383 422912 447463 169750 -22781 -126375 -254294 -273584 -233623 -113338 15691
15437 15691 30140 130723 169668 39759 25929 152856 113007 28015 35503 5347 60281
15426 60281 208809 52172 -137493 -93300 -60386 27020 -26935 -81367 9409 -43403 826
15415 826 -88306 -254917 -338835 -133474 102092 594 -530761 -706457 -468314 -182479
15405 -182479 -244959 -192537 -124512 -208077 -218749 16898 27751 -55329 -108712 -39243 -237452
15394 -237452 -276581 -117060 245589 525960 333693 285322 304679 319420 245292 -52030
15384 -52030 -166664 -193831 -105981 -115770 -29444 76270 -143864 -64532 193935 305752 179924
15373 179924 125386 282967 84933 -20666 177361 165671 187664 365986 41847 -23150
15363 -23150 -79267 -91251 -115704 -224838 -306450 -199674 -154785 183668 226031 -19216 -77778
15352 -77778 -2860 -96603 15814 68443 -82861 -54910 32268 34450 -210170 -65202 102925
15341 102925 157460 -111816 -46320 95588 72485 116402 410845 307429 87679 437218
15331 437218 512803 85789 -305810 -459846 -350859 -198532 147760 268582 204993 266569
15321 266569 463992 386427 150562 14156 -91319 2913 12100 -163661 -287582 -92605
15311 -92605 3600 -30801 -108541 -222859 -164933 47367 68253 101039 -198114 -513820 -264613
15300 -264613 -261805 -190606 140900 394772 279904 293268 284435 191878 92153 152187 181647
15289 181647 122038 -42519 63643 45891 -115295 -136624 -185265 -174212 -182741 51873 62640
15278 62640 -25131 -74765 27398 47306 -69553 -48507 79892 57903 105204 86310 4535
15267 4535 -6815 40716 64325 140253 192899 281648 236243 314827 353272 323754 321836 160567
15255 160567 -71804 -258880 -147402 -2883 286483 206994 82398 197374 333433 262247
15245 262247 266592 324512 399158 244485 84879 -14640 97010 49380 22449 277571 403226
15234 403226 281887 111719 184007 267336 14374 -217381 -218088 18776 -79707 -149155 15599
15223 15599 -23695 -11677 -71216 -76453 -125247 -247622 -332226 -381433 -402255 -440224 -323906
15212 -323906 -354560 -473087 -529371 -512881 -501764 -603235 -524203 -48597 3476 -95191 -205626
15201 -205626 -304748 -32870 -117351 -135925 59180 279154 411084 7407 43890 77412
15191 77412 -13470 -178737 -100640 -106471 -119836 9105 165925 220708 228722 23829 -312563
15180 -312563 -265681 -101694 -20366 61510 238267 239907 -20564 66921 110762 107645 -12017
15169 -12017 -377504 -172366 -9102 112668 441532 237450 -64691 -52662 168511 179627
15159 179627 132694 126959 175511 312884 11045 -325588 -337273 -49796 213791 225356 207684
15148 207684 273121 131336 -196771 -115482 25671 159471 124493 -26111 85677 68443
15138 68443 152350 218208 200130 452002 397147 291610 50994 -149522 -168771 -222756 42205
15127 42205 -68561 -67666 112250 112609 64847 141249 189885 118694 196052 114422 -43866 35826
15115 35826 221809 48222 -216109 -168228 3281 -97387 -92297 -78471 -6728 80564 91615
15104 91615 -6049 -57559 -79095 162261 483725 588394 531230 541813 337697 65769 141966
15093 141966 39842 -9690 163358 198299 348906 331911 307273 225718 208313 268537 422123
15082 422123 586396 487782 427576 360057 116044 187468 480633 377228 233085 149438
15072 149438 102025 93013 182978 255028 152362 -190002 -396303 -449503 -524457 -406077 -64138
15061 -64138 41462 -18795 -90480 -93792 -137979 -59307 127783 239495 76420 -63909 -11808
15050 -11808 -121766 -35159 18240 -54445 -122021 104376 34644 -59569 -685 -53703 193542
15039 193542 296018 234821 117424 148261 -33912 48408 19014 24830 41626 85199 26651
15028 26651 228572 553246 664299 481019 216944 209904 271941 35355 110061 102176 15558
15017 15558 -88599 -8391 125945 316694 147675 -21805 -85672 20176 -30906 -125733
15007 -125733 -33344 -2828 -354330 -326790 259 -9105 -92857 -50796 58272 167841 415059
14996 415059 303265 374124 286305 170383 299760 132077 -137748 -269997 -116436 53716
14986 53716 -94875 -116162 -2586 -31304 -78288 -308668 -351174 -229144 -55521 -114579 -383596
14975 -383596 -400724 -242985 -137358 -51365 -206155 -272754 -152087 171064 466938 312183
14965 312183 89225 -214122 -114373 69258 -25755 -18680 -72884 -83904 120269 16506 -252042
14954 -252042 -33255 142826 453971 633697 751758 686796 1019719 1629961 1993004 1851457
14944 1851457 1688895 1460061 1447307 1355316 855954 796777 631029 518083 50603 -101148
14934 -101148 -98078 215432 515346 420387 465516 361469 282201 361671 391156 343158 425884
14923 425884 439019 508537 512394 256331 277455 331761 271425 333628 724040 920561 993991
14912 993991 1275014 1813698 2246915 2518447 2369791 2022380 1435427 1220819 1145212 953015
14902 953015 698613 230739 66275 420636 346386 267253 69733 243413 342766 213094
14892 213094 370446 388308 302741 337177 305107 195830 36658 -17699 230187 393222
14882 393222 278007 228969 145364 334393 246184 216503 145935 224468 316359 222750 -31412
14871 -31412 40404 -56570 15455 -22531 -48354 145773 147864 135963 298834 166104 -262763
14860 -262763 -267875 -290021 -120835 149445 322294 351065 522697 652459 571992 286195
14850 286195 108824 18284 -96346 -170440 94562 316379 333999 279874 264324 128936
14840 128936 162805 110417 -134950 -124135 30727 208058 202992 13623 35964 -27288 -157744
14829 -157744 152551 324418 395621 434645 461242 696412 600063 234690 120188 -19981
14819 -19981 -236791 -251747 -163609 -155280 -228379 -273789 -248671 -9583 232856 221672 69558
14808 69558 -26238 72651 77951 -34747 6056 -221466 -219978 -136452 -144391 28228 213614
14797 213614 267299 393205 323393 191775 353810 407431 308146 195302 205873 247765 115912
14786 115912 213993 43787 -235250 44502 419321 594213 463503 214528 97009 85969
14776 85969 28221 -50736 -418342 -435291 -88629 152382 -18614 149845 165910 -189093
14766 -189093 -234495 58983 243337 193236 187559 90229 -103120 -45594 -122061 -254356 -88233
14755 -88233 371232 462433 349018 129106 -39367 184045 287280 177473 344887 362124
14745 362124 318631 496151 552541 472115 504529 649970 701000 441843 337360 372648 428507
14734 428507 327408 301927 92165 124879 125869 96000 -50611 -142637 183491 187532 122217
14723 122217 127241 237557 285732 241269 47679 -105122 -179758 -251062 -89692 154819 269302
14712 269302 192917 100220 176117 458474 623387 626441 307320 165249 73941 142042 154953
14701 154953 203042 113351 131935 118052 234203 250166 311481 380872 299575 138977 -86283
14690 -86283 -127740 69921 286734 264936 314876 227113 142933 223953 223328 255518 334588 388050
14678 388050 376738 293912 215264 163924 82008 -27451 -15311 291801 318107 68485 16608
14667 16608 2825 -38648 -70361 29887 209565 362775 416676 351098 431473 87098 -43520
14656 -43520 126277 494435 459551 415940 422538 355709 312702 63305 81261 168722 156408
14645 156408 202517 265463 181360 91968 -151014 -153513 147255 307964 332671 240935 211533
14634 211533 164990 197039 195591 82466 -36821 -155518 -88136 -187390 -269999 -236431 -119509
14623 -119509 -83993 51226 78384 249636 389275 424291 472432 551211 385147 190501
14613 190501 77947 62853 -22046 5632 247230 494466 526538 549553 533644 294168 278711
14602 278711 341872 185597 123947 211624 176221 385999 296643 112643 265229 554783
14592 554783 480335 350833 296982 178056 134586 195261 262767 247436 387167 600199 675897
14581 675897 636634 573741 348294 364554 522254 547241 467999 623747 640515 447637 391509
14570 391509 279490 360388 435628 411145 412826 533718 557313 484733 413458 576953 697684
14559 697684 663061 703910 593595 422539 395975 590848 482174 442549 518314 639888
14549 639888 862749 956865 1093315 1054256 798847 722171 726919 922294 972645 1204202 1249027
14538 1249027 1330477 1109565 1156487 1297322 1158119 1101776 1313740 1341429 1411826 1585151
14528 1585151 1765539 1800450 2029442 2291193 2198926 2198311 2128726 2148155 2109261 2327635 2539117
14517 2539117 2750688 2965266 3072079 3291348 3681263 3968474 4323519 5007244 5690220
14508 5690220 5962697 6406274 6773374 7676578 8669513 10099085 11289547 12941591 15182297
14499 15182297 17863204 21062469 24877310 28883906 33820467 40828450 50779056 65983244
14491 65983244 90188634 128585932 186748661 263381292 338903803 382821189 384517685
14484 384517685 350917071 291434617 219824281 156156231 110918700 81703272 63015932
14477 63015932 50868029 42937681 37634034 33849626 30607322 27426264 24828010 22916107
14469 22916107 21538173 20853248 20706420 21219217 22079535 23602898 25952301 28876030 32158236
14460 32158236 36436266 41852097 49458961 60699844 77788296 104551358 146516943
14453 146516943 208739624 287508746 358732868 393609825 386239031 344955844 279721254
14446 279721254 206244946 143982044 100918377 73301017 55926092 44490876 36854781
14439 36854781 31377897 27025281 23435013 20136083 17144911 14551671 12463599 10924578
14431 10924578 9760446 8819724 7795932 7244444 6545456 5870695 5444824 5240960 5032789
14422 5032789 4785271 4534111 4233387 4167619 3889106 3619833 3416644 3266659 3121323 2679911
14412 2679911 2446044 2487287 2472625 2488884 2454415 2505687 2197986 1930909 1925487 2016699 2102212
14401 2102212 1935447 1797901 1606226 1301165 1125269 1271941 1387961 1457587 1453876 1302665
14391 1302665 1157745 1209355 1211440 1195242 1116654 1135554 1273857 1222093 1254634 1306989 1057015
14380 1057015 691930 660147 815021 1107900 1051738 994748 1165704 1195806 1187328 1017483
14370 1017483 807885 967354 960140 692806 561979 802519 813743 634963 764422 789744
14360 789744 737666 997701 1206573 1086221 1004683 633553 681672 757372 884085 453752
14350 453752 360698 214651 164526 299223 578155 601751 480335 468519 491097 735156
14340 735156 767525 866854 769846 594852 430701 554358 745036 851131 741078 720395
14330 720395 593618 588925 584247 586106 482358 658002 661772 633014 295155 267891 413540
14319 413540 243939 -122617 -256180 -138325 87341 314144 327358 273164 333793 365690
14309 365690 185159 331413 393080 409292 436134 661299 468653 314161 384143 485400
14299 485400 374168 153470 83443 224723 53012 143502 318284 238733 265313 234877
14289 234877 317214 514882 620603 650470 585348 243989 52547 158221 102020 -96930
14279 -96930 -275873 -428744 -181245 6736 2927 -43052 262954 241612 222442 285211 316187
14268 316187 341292 538868 647096 488605 485943 502604 268094 132783 -540 20666
14258 20666 11954 -14441 -58356 122261 284272 282521 -143552 -201707 -97957 -185066 -177166
14247 -177166 -26484 105228 36833 33065 148964 35844 -83074 24047 -21497 -292880
14237 -292880 -211591 -90433 148773 158250 -35570 -192639 -204087 -45279 92117 195322
14227 195322 515874 701865 755710 640327 434511 11965 -68285 -1018 42713 91081
14217 91081 -14052 -28882 257350 377989 230243 -12481 -12459 -125516 35322 -62476 -85624
14206 -85624 -88407 56298 34373 -180687 -249414 -209319 -294191 -388429 -268051 127345 315114
14195 315114 348489 263489 311299 395042 464525 442158 309595 77607 28363 184809 8782
14184 8782 15402 50080 126560 108859 180299 148266 119021 56422 219660 351025 187209
14173 187209 -101849 -179303 -247393 35606 39403 -7893 112022 133075 72335 29991 -24910
14162 -24910 10311 -47910 -194373 -116283 22149 118320 107528 66547 115836 139999 273215
14151 273215 342862 45674 100785 155937 100926 67396 -119096 -216046 -160079 -243609 -224602
14140 -224602 -99880 224706 295333 108414 140806 300682 276788 119136 100681 173055
14130 173055 -84660 -232683 -74615 -9842 -96089 54241 16837 -269128 -133900 -10857
14120 -10857 164411 78374 161804 132056 -172301 -472017 -359418 -115292 8230 -30610
14110 -30610 -170203 -115414 -155794 -373286 -438834 -290969 -204004 -171854 -259262 -294794 -455039
14099 -455039 -551161 -446367 -142794 19377 -15643 58819 170151 178083 178945 362164 297337
14088 297337 178413 276306 183071 -13185 -88085 -16838 46894 -15380 -51109 7860 -121826
14077 -121826 -142255 77651 -13775 88038 138986 -119765 77743 373295 322954 168832
14067 168832 -81237 -309598 35707 401514 391373 322031 94099 152555 206454 21528
14057 21528 58185 75696 115811 11905 13775 45528 120098 173631 -57865 -119909 78287
14046 78287 224047 191687 84403 112199 224189 32166 -174143 -203531 -28569 -62433
14036 -62433 80039 262570 227384 70272 -41618 -94578 126370 258715 413368 360394
14026 360394 398834 268609 599436 1099547 1393460 1776086 1949706 1835798 1757606 1445196
14016 1445196 1007606 659995 423671 514621 597231 467660 399123 322586 226086 178121
14006 178121 118235 33440 216661 346314 508781 552076 5097 -224793 -44760 72968
13996 72968 40799 115655 -3393 -211832 -117443 225820 537105 662613 950713 1388581
13986 1388581 1659305 1700780 1722107 1734076 1579178 1012011 555895 392082 319401 180845
13976 180845 191800 95565 -160151 -375220 -183838 -248511 -115932 21546 149255 128782
13966 128782 30213 -142533 -194640 -272967 -16925 -180126 -413649 -364551 -32079 100942
13956 100942 131379 225304 215702 187092 65384 -171944 -268428 -417871 -180143 -22414 -195066
13945 -195066 -156991 146601 248679 -62737 42195 46221 -102007 184807 229907 76583
13935 76583 247987 378466 297665 123480 87123 116781 167594 -15395 -297452 -444419
13925 -444419 -440650 -135704 282740 494603 627810 566354 358899 112603 103065 334752
13915 334752 510896 361465 137065 47580 -69153 -72755 -81023 -155882 -118254 -20859 35284
13904 35284 72067 379511 632777 666700 553522 306206 79122 97263 66350 -12709 -73268
13893 -73268 53183 106468 -188914 -257764 -187128 65139 102602 25277 106424 277557 334092
13882 334092 243382 157258 264229 338249 265400 379788 324674 54510 114348 195315 178392
13871 178392 83640 53146 30526 121548 -86 73912 384865 520344 395539 190906
13861 190906 223672 238045 390572 367937 390533 159859 -196656 -325306 -38574 35991
13851 35991 23845 -170214 -289623 -216833 -187344 -66452 91449 -76815 -150502 -77643 -94838
13840 -94838 -12070 12089 -57935 62781 240969 191045 155720 184601 85526 -43707 84455
13829 84455 205582 44411 -104834 -191784 90207 204538 45975 98895 47544 -157117
13819 -157117 -277291 121906 384341 501517 631332 770968 651341 427790 281744 318083
13809 318083 54839 -86585 -128099 -210313 -176473 85166 63300 237975 347931 248456
13799 248456 121955 60489 -151136 -387621 -428300 -353730 -371222 -216404 46543 304009
13789 304009 259473 115372 -71622 -208631 -281627 -148989 241140 60093 -91213 -56884
13779 -56884 19281 -136132 -282927 -173871 77359 89813 195492 316342 396310 396121 303548
13768 303548 128976 -102326 -17897 111937 100543 -30492 -305256 -423683 -446159 -206821
13758 -206821 -120927 -75905 346107 299973 139442 194076 64078 -50232 -107434 -299170
13748 -299170 -166633 104683 507042 622893 653344 483081 517432 192451 -172032 -63908
13738 -63908 -221760 -396408 -229886 -252616 -191357 -260102 -302208 -316554 -305975 -210996 -86586
13727 -86586 -82897 -216240 -79955 -108527 -257126 -183266 35393 127077 178456 205420 182523
13716 182523 128927 121083 178737 261097 173042 68753 -170866 -275799 -370831 -410385 -337580
13705 -337580 -136423 -115638 49998 108662 18937 -31632 123385 197094 128061 -1034 -70841
13694 -70841 -18063 184119 126409 117787 83240 49188 -105831 -28483 -16683 -26172 65790 1386
13682 1386 32260 92471 168488 82023 111441 44672 -58223 -233819 -131575 -85714 186322
13671 186322 335277 344280 247770 109374 55013 65547 413940 504378 576388 669694 335896
13660 335896 -83477 -73489 10457 -63578 -381648 -490321 -423008 -329783 -247277 -226800 -213827
13649 -213827 -205512 -183102 -13211 -60037 -250639 -292943 -316852 -212579 -107494 -163801 -236288
13638 -236288 -380168 -297495 -21447 -145144 -289787 -168157 -52638 -130814 -208314 -143115
13628 -143115 92904 168501 208307 61741 -1747 -75517 -181105 -241172 -206618 -275573 -140356
13617 -140356 227092 332782 304874 124378 -10457 128690 -4650 -47247 -149894 -201606
13607 -201606 -159825 -68581 26053 365642 474599 301897 300670 22457 -300454 -407453
13597 -407453 -287949 -31243 319548 149100 7050 10806 -318792 -375775 -242403 -53467
13587 -53467 -387862 -302191 -324677 -406858 -456713 -270498 -51306 -30784 -151150 -305896 -146356
13576 -146356 43517 240722 309451 -160274 -173225 -49242 100098 37119 -243978 -371159
13566 -371159 -408053 -403910 -371131 -223020 22473 -98961 -295808 -59525 167879 380723
13556 380723 294171 212755 87218 42721 38859 -30794 91960 167032 128572 212866 315348
13545 315348 168385 16149 141599 238730 6089 -108553 -170852 -257645 -267468 -172331 -52515
13534 -52515 -14705 -136723 -106842 -241334 -621513 -527865 -283509 -239683 -96553 -115715 -372879
13523 -372879 -378559 -457771 -178884 -62974 -39812 -102241 19330 170067 382727 312025 111384
13512 111384 64952 -58294 -44623 59994 128795 107769 -138292 -171935 -34921 207351
13502 207351 254956 175146 105119 33958 -51575 -120325 -118153 59432 164079 92712 118730
13491 118730 -154986 -228290 -100852 -73648 115487 176966 142867 -149277 -107269 187326
13481 187326 289746 231041 129792 34184 -21732 27684 311593 85933 12926 -33349 -222788
13470 -222788 -266844 -63137 -25568 -82650 260460 423054 21171 -58362 -6728 -160278
13460 -160278 33403 118581 122803 181378 246798 90081 37797 157696 206857 347161 351279
13449 351279 426851 439055 195008 165251 129790 1000 -128967 -74230 107803 -743
13439 -743 -165072 -68250 24832 -256297 -209477 -170783 -192571 -58707 -103877 -160090 -40416
13428 -40416 24120 -23311 -24395 -165132 -258364 -250723 -279821 -59654 3789 -17444 -99136 -209037
13416 -209037 -175517 -119782 -106576 106688 194713 -85401 -218738 -277777 -45439 204528
13406 204528 201187 155162 35332 9313 -50851 133880 322168 171269 -77750 -60904 130427
13395 130427 -21062 -64054 -149093 149276 111553 165487 35878 57764 -135369 -259599
13385 -259599 -57517 90760 284732 301495 314394 132506 -209660 -61818 87673 -36003
13375 -36003 -105022 -67529 -36546 227336 370046 225647 97064 -5455 19300 213877
13365 213877 214026 20290 -60094 -114958 -92011 102123 188290 211463 166473 42167 15538
13354 15538 -34725 -73414 166615 289002 276766 42574 -270715 -437037 -577389 -697026
13344 -697026 -723691 -551085 -489207 -343324 -266642 -179236 24536 -49650 -208671 -284992 -101940
13333 -101940 1746 -123994 -129532 -10134 -136945 -257373 -222949 14947 -2566 -45282
13323 -45282 -3368 -116084 -146073 -95753 -193070 -164527 -219244 -174896 12939 140146 60821
13312 60821 -102342 251239 391901 285801 283649 263960 43488 18382 158892 89040 -17122
13301 -17122 33398 212403 26600 -230020 -318998 -417931 -158374 -270979 -209137 -211060 -179403
13290 -179403 -122197 27808 -45103 129747 -23242 -57945 -243187 -152163 -104076 -172890 -376937
13279 -376937 -263105 -52972 8587 -66843 -226335 -240295 -147600 -128320 -169853 -184219 -73084
13268 -73084 -137994 -135318 -67310 197566 132632 -79090 -192217 80710 52212 58801 46267
13257 46267 53138 63668 2704 30252 161444 111767 -118240 -72622 44587 -162463 -156670
13246 -156670 116068 -13916 -483392 -433836 -151079 -141312 -284001 -374339 -274305 -363589
13236 -363589 -383765 -113818 20001 47721 -93672 -360080 -144061 85931 -42680 72165
13226 72165 55505 -50993 -63234 -162605 -284685 -60469 -214482 -237875 -167734 36533 3918
13215 3918 -22515 190175 288918 188323 199333 194824 -71215 -321842 -184506 -175223 -262592
13204 -262592 -404934 -428150 -156157 -142981 -100515 112052 -9972 -113194 46170 158514
13194 158514 242378 21921 -76566 -220438 -316146 -73469 269918 348163 123197 -110306
13184 -110306 -49398 -227503 -362299 -101559 105538 -140661 -102824 5745 -94658 -154745
13174 -154745 -214262 -142342 -176692 -142473 -36531 -89760 -291216 -453443 -468615 -522154 -530561
13163 -530561 -443603 -254350 -115810 -118067 -267023 -506785 -158254 35770 -157038 -309009
13153 -309009 -413706 -352628 6764 148257 13000 -73532 -37917 -34155 -126222 -317770 -421268
13142 -421268 -358657 -518518 -415770 -334286 -147196 -257390 -510335 -355669 -71768 -228361
13132 -228361 -365681 -281577 -117968 -106047 -99951 -162553 -270204 -115145 -23849 68860 -5957
13121 -5957 61297 103371 64176 70648 21957 93130 235275 145729 85927 -89167 -86319 -9368
13109 -9368 -104625 -167506 -78632 8355 85307 388644 125889 39637 108839 222203 260638
13098 260638 109794 69879 -14756 -81644 -256349 -253994 -219165 -219692 278349 534853 192754
13087 192754 112685 267818 293892 301540 279858 218652 -55808 -85251 20852 -87299 -72538
13076 -72538 -163588 -316662 -153846 124603 249497 310396 338987 127916 -21634 -237616
13066 -237616 -361922 -370739 -324162 -61962 87909 116070 161584 31364 388747 373670 239959
13055 239959 223194 249533 387483 322756 292413 222193 42926 -94864 43503 70858 85432
13044 85432 214956 215643 -66963 -417329 -375170 -419787 -269757 94654 106371 17262 -70241
13033 -70241 -96042 -183348 -283195 -347479 -64802 -16897 -225689 -326824 -338668 -301606 -275917
13022 -275917 -269855 -50612 46033 158993 238693 67762 30895 -58466 -102597 42523 -61449
13011 -61449 -199568 -364487 -382882 -306141 -197758 -267700 -415844 -515703 -496748 -379424 -251004
13000 -251004 -270380 -326320 -385198 -187920 -74216 -140368 -296821 -448903 -424253 -399246 -329789
12989 -329789 -292801 -148293 -76318 -71579 -230700 -212268 39468 184581 194925 244763 -22067
12978 -22067 -259005 -400186 -351133 -298296 -195486 -181108 -337921 -427634 -15515 72208 14938
12967 14938 -941 -19854 47992 -16838 -10403 -57194 -110734 -20288 -28558 -56493 -148179 -95523
12955 -95523 12768 55199 159363 238458 16871 -85422 -85154 107092 -103686 -66849 270
12944 270 57640 50257 269975 222455 82688 70658 152498 171282 25383 -131156 -102823
12933 -102823 140142 210931 205092 3816 -226804 -7374 43843 -103691 -83474 -37432 182670
12922 182670 373245 318470 259299 -154254 -186446 -116845 -94302 240621 253035 -194400 -330535
12911 -330535 -440603 -316699 -250766 -276265 -390734 -266083 -53125 -83928 -40669 -15838
12901 -15838 -50137 -122165 -344737 -385016 -189921 -106554 -248547 15411 -42563 -105366 42773
12890 42773 69017 243161 217662 357165 394848 229201 61776 67682 86735 244150 -226395
12879 -226395 -457395 -469969 -387896 -393195 -275760 -14935 115694 52701 363309 240709
12869 240709 52254 169299 185342 182331 153769 -10590 161202 173735 96568 88086 128589
12858 128589 -67825 47334 77234 79928 -29817 -34332 110773 184686 199997 207646 260832
12847 260832 165151 180614 331475 348797 186360 -745 112660 44703 120989 122719 48686
12836 48686 -34599 99702 45008 171051 257990 389128 478351 142718 153770 144777 184192
12825 184192 253435 104874 276727 537666 547467 314945 105867 157391 64713 -285334
12815 -285334 -418716 -247126 -74030 34495 -184846 -58526 167559 67177 86803 176327
12805 176327 258423 251773 264485 239972 -14708 -31168 -2396 -164853 -230807 5180 96241
12794 96241 110164 218607 368532 512108 293391 46214 -268633 -304222 6936 131241
12784 131241 215076 259427 375676 402233 337473 213487 262686 296023 171136 -68872 -123573
12773 -123573 -12802 -60311 -34484 -108398 -139403 -83156 -48547 -37215 113860 202188 103286
12762 103286 -162618 -112703 -130751 -193790 -369892 -232024 -406441 -415835 -438869 -220322 -42469
12751 -42469 220779 277143 289219 183325 163547 -77661 -337804 -370013 -243189 -174625 -266388
12740 -266388 -274651 -374620 -195525 -218304 -353960 -374696 -278328 -232862 -241557 53591 -4048
12729 -4048 15789 98236 114306 200323 417261 571861 450473 176341 -33649 -122399 -59462
12718 -59462 158695 137029 69469 -71098 74228 144391 10344 -132157 64574 349807
12708 349807 154552 99105 -20360 61478 -9499 -243821 -270515 -78988 124279 61606
12698 61606 72789 44228 70273 91974 70078 -84473 -296803 -502203 -350666 -125827 250298
12687 250298 139546 59022 99978 -83269 139600 147365 -68378 -246830 -450815 -210905
12677 -210905 -64603 115127 -86099 -191320 -344383 -351973 -339903 -244558 -64361 30753
12667 30753 145298 -29826 -70077 58810 38449 156039 292394 258120 155463 190951
12657 190951 293274 201863 73854 98335 150949 15024 22004 -1593 -170269 -342147 -341921
12646 -341921 -13488 72466 94155 -22664 -155254 -149375 -230518 -167821 -133035 -112946 101515
12635 101515 82309 132829 95502 -36065 -193453 -151332 93458 -60872 -460610 -476664
12625 -476664 -401380 -473319 -564467 -699419 -441081 -311757 -226747 -180669 -186796 -20691 -140893
12614 -140893 -55404 177380 110983 -197494 -132415 -120450 -207183 -157911 -81367 129029 329637
12603 329637 151698 82464 178372 222468 14632 -16637 160720 164741 -170341 -103982 233598
12592 233598 181348 35327 124148 211651 277567 149321 187461 230184 50231 -35338 -128717
12581 -128717 -35720 -131854 -41194 105383 120942 305377 213383 41548 35056 59583 8453
12570 8453 -3207 166653 -90860 -134691 251207 165124 216139 564536 576754 395205 601721
12559 601721 550090 325142 201788 475870 413174 268026 444931 330112 183669 261581
12549 261581 29033 -167809 -123916 75102 113315 167378 243179 210583 163988 111373 41414
12538 41414 45468 -69823 -115468 -313262 -324548 -449495 -301890 -178326 47552 50785 210664
12527 210664 298801 113560 -56899 -116604 -191027 -234454 -385430 -361127 -146911 146754
12517 146754 396540 471849 325519 -59281 -46829 -171162 -342894 -247728 -64768 -86178
12507 -86178 18484 50576 139161 235412 241557 261731 95664 -146106 -118736 -49626 72834
12496 72834 368745 339394 129011 47694 -54423 -244054 -40883 -101749 -216527 -300741
12486 -300741 -306752 -30490 296322 442820 233377 -165737 -206676 -26696 -152089 -295456
12476 -295456 -139762 240036 105020 -190319 -18423 101779 191221 395400 280639 108460
12466 108460 76486 114191 89472 252770 138835 -39077 -184983 -219420 94207 248504
12456 248504 157103 110813 41549 62789 57707 144686 222321 226257 -130069 -259726 -295208
12445 -295208 127244 373848 211213 66739 248964 357669 214258 -9224 -81676 -84281
12435 -84281 -179081 13558 112846 -6565 -82949 -201823 -130997 -138960 -73889 -26674 -197917
12424 -197917 -152517 -223707 -188971 -192812 -377387 -311346 105707 190231 -84264 -190190 -263594
12413 -263594 -302343 -160317 -8374 32290 14580 -66915 -290903 -546091 -673210 -399151
12403 -399151 -204013 -210372 -368516 -286096 -137903 -230558 -187406 -265538 -325 214651 275157
12392 275157 405344 279626 163547 305733 330028 325798 286202 207940 183125 80324 346656
12381 346656 543416 286867 368337 414907 166312 79197 523680 510462 322387 79656
12371 79656 336615 512950 192309 112233 285434 397274 -14532 -114506 -51156 59601
12361 59601 226017 447924 524723 473306 353838 286171 292861 346067 201820 -34991 -322268
12350 -322268 -449082 -313619 -39812 24408 -1342 40645 144615 117833 282209 388243
12340 388243 57082 -201368 -148295 41852 -50920 188376 313839 144098 129904 151865
12330 151865 359118 685319 835340 694005 494828 212844 -6747 -49929 -224795 -136839
12320 -136839 -53046 78017 119831 53317 9314 -656 -53091 127988 206017 179124 175597
12309 175597 -16881 -75601 -187725 -149836 -7444 5227 -346496 -494970 -493838 -302598
12299 -302598 -149118 -31515 108634 111539 -105074 -321272 -305234 -139444 220790 208567
12289 208567 108427 -20379 -92472 -43145 -34441 -295306 -337810 -199648 -208361 -208488 -183039
12278 -183039 -74649 -296131 -145412 -182084 -83045 37315 -143426 -201539 -242395 -347532
12268 -347532 -370378 -345779 -362503 -380981 -377393 -217704 14154 75583 -118638 -377397 -89412
12257 -89412 251249 93475 94160 281884 207952 215703 233511 186645 249446 242612 215586 163075
12245 163075 42143 -150108 -172534 -161657 -199152 45319 39746 -117257 -271056 -308075 -299069
12234 -299069 -264546 -308986 -359204 -327209 -287624 -199406 -158081 -274054 -310812 -112495 -62622
12223 -62622 6691 -209770 -182678 -161832 -120919 -75446 -119909 -149894 -141932 -42212 -28047 -32759
12211 -32759 -64473 -73086 -187886 1447 234066 85754 -83963 -151070 -190263 -421349 -692318
12200 -692318 -525403 -296992 -150232 -119675 -251709 -108516 7953 233276 247470 270632
12190 270632 250613 114351 67287 169544 64882 107878 435281 535147 398639 309610
12180 309610 374545 424463 213012 -30350 -278574 -252213 -231352 -123724 148681 438757
12170 438757 365688 337124 535137 550450 391331 177972 148763 262881 256266 -50921 -142196
12159 -142196 -5520 158311 199054 60198 -92617 219402 506330 747875 783414 1050052
12149 1050052 1416918 2292372 3364612 4361472 4972143 5183893 5072970 4288809 3124234
12140 3124234 2162485 1449388 1011769 663388 629069 525552 467561 322849 385505 286791
12130 286791 436028 440556 245719 90872 337226 508764 592075 808584 808946 527106 451491
12119 451491 570044 970469 1226130 1071874 1144449 1707004 2336133 3140747 4324686 5043105
12109 5043105 5280837 5031596 4390711 3368581 2482247 1986188 1407808 1067174 1011825
12100 1011825 617884 261655 204687 254328 238005 207856 56047 149436 204802 217693 160369
12089 160369 238983 270901 202329 330851 421722 326907 260558 -61512 -188611 -370758 -469084
12078 -469084 -476896 -674228 -467500 -325914 -211986 27911 146327 286324 310893 67375
12068 67375 -55027 -17584 133319 98321 142192 216884 258447 110692 -77699 -212745 -300112
12057 -300112 -363381 -301748 -326982 -191925 80770 129086 92595 -12661 -147093 -198362 -98819
12046 -98819 -194140 -284008 -193516 -127563 -27965 7853 67917 119189 156004 -89170 -217575
12035 -217575 -4340 96902 131863 304928 487973 253166 59215 81217 -160572 -324604
12025 -324604 -261247 -197938 -39698 -173632 -51304 44846 196247 236241 70361 55068
12015 55068 30765 -242159 -235397 -84084 56850 173933 208718 46291 -27803 338899 401211
12004 401211 124501 -125937 -202299 -42784 31273 -135016 -275092 -234028 126485 345413
11994 345413 104527 91792 93926 -22134 -71895 -128562 -156993 -110469 -56081 -8375 -193564
11983 -193564 -66025 -64190 41320 88145 348049 435477 299449 132228 -33458 -60753
11973 -60753 -161037 -314758 -291976 -158122 -137825 -136746 -225490 -294588 -176549 -7009 -245987
11962 -245987 -84563 37613 32283 83964 -85388 -72129 -105162 -315519 -397881 -490094 -131194
11951 -131194 38603 13058 -8636 -22936 -1984 -103226 -248171 -451307 -530777 -337836
11941 -337836 -340362 -170220 40362 -24261 -99995 -98509 -45669 -199620 -240761 -14203 -133046
11930 -133046 -175302 -327206 -229613 102361 139945 24360 165296 443869 314650 -70887
11920 -70887 -191419 -104162 -73439 -267265 -602932 -524368 -372274 -369033 -317331 -374118 -248849
11909 -248849 -306502 -164957 -122404 -182990 -317510 -157319 165088 319048 385448 254317
11899 254317 212579 -22585 -98504 9631 115971 -95307 -328007 -253794 -254408 -189527 2228
11888 2228 84060 47048 84493 221588 240856 202365 244897 343664 168273 86104 3508
11877 3508 -31095 183284 181906 134531 38288 -66727 -57326 21080 -47236 -238085 -50766
11866 -50766 213796 52728 -353502 -456332 -264611 -188702 -127648 -199432 -521581 -295884
11856 -295884 131684 234762 292460 167148 118084 76548 24382 285800 389814 451953
11846 451953 113963 215199 334133 214544 68490 27870 -12083 17374 47194 88871
11836 88871 -15141 -119769 -298846 -180016 168565 327457 296294 376487 301002 372780
11826 372780 236745 -22442 -156934 -398685 -505832 -409901 -251363 -148339 -18579 55342
11816 55342 -163722 -190725 31578 84724 -79276 -22761 122142 83941 44124 33887 159030
11805 159030 -39370 -244719 -163768 47778 17196 -242834 -245468 -168489 -302378 -200445
11795 -200445 -210874 -38240 134019 -24698 65122 59225 117798 283961 234086 -130861 -159655
11784 -159655 -40226 -96432 -177935 -1305 -54802 100574 148130 193253 4765 -1057 298046
11773 298046 441847 499667 342970 285122 484047 398058 108331 191444 169616 10916
11763 10916 -132763 -356926 -316361 -268129 -241513 -93475 -89093 -68550 202084 -72467 -188450
11752 -188450 -209370 -83657 -56946 1607 -135685 -312431 -416537 -185335 -53045 -289364
11742 -289364 -246781 -233679 -241366 -279544 -78934 37986 51114 -69386 -27689 -83137 -152471
11731 -152471 69851 286331 145435 -107669 -198155 -6961 45558 158020 19167 -254
11721 -254 236264 159065 -136794 -397424 -379592 -549222 -312459 -255142 -147890 -131232 -19225
11710 -19225 -128718 -319391 -178072 -150299 -157533 2095 76927 -150272 -118747 -123588 -169127
11699 -169127 -125017 33150 185471 153509 -25044 159167 414763 227126 -106021 -88488
11689 -88488 -87553 132616 240097 -30495 -79649 -224747 -374698 -360753 -280159 -230841 -264124
11678 -264124 -162855 -127682 -171193 -161044 -10235 91469 54661 -19605 -130395 -28630
11668 -28630 172657 391637 401769 97444 -20411 -195090 -371736 -364563 41208 -5598
11658 -5598 59047 204034 95787 120894 196236 341874 482335 428349 89429 76741 80389
11647 80389 -52598 -128417 -418270 -545077 -428848 -34001 269734 202135 37721 -223706
11637 -223706 -409001 -47860 -76909 -177781 -101295 117544 13851 -18001 66642 -73948
11627 -73948 -195799 -254802 -176262 -16352 -111815 -162102 -51862 -136515 -357372 -462322 -351204
11616 -351204 -78102 -8768 -112017 -307739 -301656 -199963 -216295 -289351 -404459 -298726
11606 -298726 -16970 149286 -8428 -86084 -128551 137599 189497 239999 207163 177100 308646
11595 308646 390052 440949 448954 338579 121615 77839 256037 193102 151869 -62930 158978
11584 158978 389866 414661 159981 30554 118376 -57943 -167380 -110039 -212067 -61644
11574 -61644 80092 236779 250054 -159440 -269870 -107402 -470927 -483841 -275529 -266079
11564 -266079 -44694 -34525 -121904 -255207 -250278 90177 138016 95615 211232 203805 8386
11553 8386 -190205 -182031 -284502 -187669 -343992 -286946 -260101 -36248 -125249 -91725 39403
11542 39403 223863 219396 39049 13401 -3286 114260 -86136 -59682 -31035 28677 61321
11531 61321 -159665 -250176 -116658 -40999 -29690 59372 256968 322000 150565 101169 286592
11520 286592 412272 143738 298320 344394 180827 42822 3387 40927 138213 34799
11510 34799 -100624 80827 211044 116073 -3143 -25986 -41821 -183827 -413591 -545481
11500 -545481 -502602 -380849 -486769 -377596 -372602 -672637 -741234 -620415 -648166 -460057
11490 -460057 -335121 -455419 -386299 -344762 -143515 144326 119751 627 -89099 -124891
11480 -124891 55431 273947 354428 247545 227236 -87865 -543176 -385003 3136 -1642
11470 -1642 171243 62008 38492 -152596 -59576 -19520 30228 113239 100515 80471 -57542
11459 -57542 71247 74867 -214792 -176874 -50399 -112385 -169806 -109166 16846 66333 -84793
11448 -84793 -180039 -205319 -138667 -54262 -97599 -244898 -303474 -136866 -114181 -251034 -104028
11437 -104028 42761 135498 152704 53852 -144792 -273581 -368968 -250826 -273581 -105855
11427 -105855 -57028 -52903 37447 99837 -33818 -390374 -173893 181684 170512 -55713 -273196
11416 -273196 -153148 36577 48352 -76272 -243241 -411375 -52528 88910 -43799 -139194
11406 -139194 -278999 -130879 87773 235129 197126 157349 5536 -16453 35500 -67815
11396 -67815 -262021 33670 7638 -210119 -115439 172276 310023 252059 25234 -31940
11386 -31940 2512 73729 108759 89803 -11422 -234184 -227219 -139392 -174601 -102192 22781
11375 22781 -90748 -115656 -92209 -80490 116053 207702 156504 -62576 -249213 -510632 -437680
11364 -437680 -249308 -72587 51734 96877 -157671 -11091 -8412 -91482 91189 150545
11354 150545 370370 113468 14850 81137 -135690 -253134 -68076 142445 -144081 -298521
11344 -298521 -147451 21932 -39432 -168095 -172581 13001 -151805 -307901 -267487 -263065 -138639
11333 -138639 -229359 -113785 -85507 -23038 -80830 -124530 -145288 -191692 -194913 -169891 -197943
11322 -197943 -300377 -159486 81106 45326 21942 -69920 -80126 12097 177187 2446
11312 2446 22453 217715 137855 77432 160691 94637 178490 204679 -58546 -181397 -87858
11301 -87858 -152273 -319564 -180623 -40597 174997 451128 510027 401614 352746 420277
11291 420277 336872 393615 497279 335837 93099 55634 183318 192291 60467 63376 80865
11280 80865 -130095 -181174 -97346 190298 175103 93127 129405 110400 -185780 -307670 -94127
11269 -94127 8624 57308 90954 81930 -81205 -59521 -46501 -175284 -192741 -186457 -249310
11258 -249310 -383489 -381849 -156601 151632 106659 59065 2896 12880 94864 45767 55742
11247 55742 17038 93574 -42093 -94458 118043 115563 16395 278866 465571 240648 -95473
11236 -95473 -354995 -334198 -201341 -25432 113386 101197 318026 235492 4238 -120967
11226 -120967 54228 -39737 -116304 -302424 10193 335890 145454 139560 82533 253962
11216 253962 81601 178386 198980 52014 67869 236454 291545 396718 297487 379426 356366
11205 356366 376881 202878 184413 134977 -69775 -100932 -57849 -21445 41751 -175438 -388250
11194 -388250 -481955 -566065 -535984 -298857 -88152 11392 -112805 -104048 -47676 -216450 -124678
11183 -124678 120384 46412 -28361 -155329 -250251 -33412 102564 -134850 -256525 -273926
11173 -273926 -164174 -72925 -63755 -112767 75330 291941 543342 529912 355232 160123
11163 160123 44000 -81297 -108449 -87817 -13615 103701 39776 -4968 255710 348495 202787
11152 202787 3612 -239193 -124739 -194650 -188588 -69930 -204575 -109913 48073 26611
11142 26611 140922 124419 33886 67198 109214 230064 171987 -30020 -286386 -336637 -310680
11131 -310680 -152996 -223264 -98533 136212 126880 385392 479096 149827 -347394 -599755
11121 -599755 -364360 -354085 -259006 49357 176752 115274 11968 41931 -153996 -584560
11111 -584560 -456091 -180301 10125 47838 -95983 -99009 63376 62751 -106615 -125476 -236327
11100 -236327 -270201 -199504 -119616 -33684 -365036 -609098 -468192 -556590 -458914 -142725 -153906
11089 -153906 -210791 -129651 -107661 -245154 -185702 14823 191703 167983 120941 178988 -2933
11078 -2933 8900 161811 139691 251781 148601 1506 -97001 32414 -5975 -225626 -7830
11067 -7830 44502 -29783 -43449 -206335 10366 55981 175519 250590 66005 55107 171153
11056 171153 92451 -91385 -199220 -31145 -272271 -239508 -207125 -149902 -16084 178531
11046 178531 103191 574 -7112 114608 171325 65484 70332 232281 285301 250916 217347
11035 217347 -18652 -297187 -363561 -154449 -140179 -209371 -87633 28665 57833 -391083
11025 -391083 -328145 94135 8130 64117 287378 317171 234324 148589 110628 117128 208108
11014 208108 277778 59796 -251159 -547182 -411057 14208 244687 209944 169763 142492
11004 142492 190383 139629 103830 -5286 103768 337343 219294 70629 -48766 -198530
10994 -198530 -69035 -31524 11649 8565 5442 -170761 -137755 105258 176740 277232 238702
10983 238702 -72626 -144048 -189988 -74964 6038 -75473 -74370 -81341 -114186 -251621 -148087
10972 -148087 -253337 -269733 -276177 -239027 -16676 102283 329217 405001 379839 417844 241308
10961 241308 186896 362632 299730 228605 124434 103386 366338 478556 281899 170845
10951 170845 101082 131388 -58940 -231540 -38157 75137 -35271 -186731 -44898 41895
10941 41895 -14319 58297 102617 -87430 -267160 -430722 -356188 -58033 19628 41075 -47813
10930 -47813 -130393 -73545 71039 293523 478257 284150 150649 -179912 -343680 -379358
10920 -379358 -412624 -253981 26012 -106857 -348347 -261226 63205 284769 404745 162208
10910 162208 -109869 -53188 175052 62406 198037 129467 -21161 -51112 -92714 43080
10900 43080 280246 320747 200131 227364 204405 345793 336983 285599 373582 280007 139765
10889 139765 235362 179864 -50309 39239 78422 58528 97403 171567 189862 138822 39200
10878 39200 -10246 116063 94792 -75131 -8804 65079 202017 258526 237251 40051 -45407
10867 -45407 48245 136563 6092 -7970 125096 278381 349608 481049 256416 110565
10857 110565 231568 189238 237715 203278 216131 138221 125156 -82247 -71076 55082 416700
10846 416700 385492 456021 500691 347249 151777 266722 457814 375418 211646 293157
10836 293157 289832 219432 121367 90924 132539 -9045 -370762 -399609 -408115 -305788 154234
10825 154234 369697 269713 64805 -51118 -48613 -117900 95120 -21145 -31765 -110664 106470
10814 106470 349942 499850 375926 59744 -113157 68489 94127 287846 476677 513945
10804 513945 509695 272108 188444 54357 15307 -84426 -170177 -73042 40374 230100 84136
10793 84136 -103230 -240457 -86255 -180040 -197087 -157626 -55855 -18727 -329311 -607484
10783 -607484 -622710 -331914 2285 58967 9766 60141 -237308 -356289 -360325 -1820 304270
10772 304270 226885 182590 229744 159218 106900 79666 51956 103928 -112675 -180390 -71396
10761 -71396 -167790 -145165 -43757 59253 222894 349208 212988 -2251 -189736 -269940
10751 -269940 -352959 -379061 -301594 -291214 -322230 -168921 59324 -20869 -137318 -51175 -111713
10740 -111713 -180198 -109991 -367471 -155817 -138413 -196950 -27350 121426 362314 -12077
10730 -12077 -309407 -219550 -124488 -81053 -105889 -219564 -44810 26181 24508 114217 -35929
10719 -35929 -24832 -149324 -225437 -456355 -408124 -110235 -121398 -194416 -113546 -265273 -211056
10708 -211056 -44714 -135227 -122707 38201 127086 -2316 -148559 -135970 14258 57220
10698 57220 9748 32525 -64284 -86350 -169122 -152436 -208775 -112560 -33864 -20697 106208
10687 106208 380027 301632 180533 -20420 -174384 -129436 84668 106508 -12489 -2097
10677 -2097 206252 305762 178579 -161165 -108269 -87436 -172646 -292100 -44893 91229 2182
10666 2182 -106746 -293 20919 -33664 62783 102260 56703 99735 180473 189909 56589
10655 56589 261300 244358 -4474 181556 364460 265736 73868 52962 -46010 -112180 -387791
10644 -387791 -392294 -225198 3187 420913 398988 163795 -34615 -308128 -506728 -531866
10634 -531866 -319872 -192430 -83128 -42804 -32713 11774 232620 326222 256660 71650
10624 71650 103709 -97755 -86829 -33912 142641 170805 53423 -241755 -332389 -187669 -1046
10613 -1046 113343 153748 87900 -133104 -361292 -184249 -226485 -331106 -198651 -43374
10603 -43374 -249513 -420036 -308825 -88807 -77521 -20128 213208 332876 87182 70673
10593 70673 24828 -142634 -296280 -182840 119291 219301 209370 161086 147823 112311 11380
10582 11380 -76264 -173701 -191545 -165309 -253840 -241023 -18671 237879 125765 -40735 45933
10571 45933 68130 -210782 -304465 -92205 101284 266741 219094 287776 315781 265583 158025
10560 158025 -9170 -78564 48116 83782 15879 -7409 -151849 33887 308992 90419
10550 90419 -161597 -401003 -515876 -433534 -476092 -515234 -444833 -201273 130180 364274
10540 364274 325856 81897 -116814 -282789 -281078 -202642 -36223 192816 127953 75732 -23287
10529 -23287 -330551 -330280 39206 284885 224443 128749 16804 23734 186039 231731 181430
10518 181430 27193 23218 310718 137902 3119 -109395 -143841 -78363 -112730 -73657 -33569
10507 -33569 201251 369220 319682 167083 110587 282385 298653 101551 72169 -47940
10497 -47940 1745 68871 174291 251946 81087 67529 167904 87131 69555 58036 -99808
10486 -99808 -142000 -136282 -217388 -42658 81726 53483 -88729 -346238 -417912 -333534 -120613
10475 -120613 -84903 -128848 62332 197308 232262 212012 51595 60961 -149090 -424074 -316251
10464 -316251 -23310 329812 667363 365300 41308 -236783 -186925 -181156 -207342 -250529
10454 -250529 -295881 -119773 -85817 -220325 -274283 38448 -55178 -162290 -180508 -62187
10444 -62187 15302 -695 -132184 -236776 -112085 -80171 -50727 -292559 -387387 -372135 -357957
10433 -357957 -221663 -250857 -481918 -700515 -760701 -609583 -232504 -246337 -203358 -23312
10423 -23312 -103736 -82340 -77882 -174470 -285650 -328315 -341106 -310043 -111746 81545 97029
10412 97029 -43670 -192748 -316945 -241278 -92269 -157561 -193184 -242769 -224992 -313011 -373448
10401 -373448 -324400 -161842 194798 135190 -207732 -322550 -177745 -137165 -35188 41392
10391 41392 76017 98212 42568 -108683 -165176 -286481 -308688 -233957 -59849 -184620 -181009
10380 -181009 -231161 -230076 -304543 -262818 -419635 -598555 -672016 -476528 62569 233061 500479
10369 500479 625585 554274 398328 234511 23951 211817 306817 334476 390735 528496
10359 528496 556650 623017 460106 524198 470178 324339 286382 458179 515543 337659 120255
10348 120255 -7424 -98181 -103794 -16241 44551 -216571 -476554 -281924 -82163 -41530 -69456
10337 -69456 40492 121998 88521 60698 186038 339920 390508 146111 -21234 -33611 -221942
10326 -221942 -4010 62942 -49560 85711 56918 -51501 -254240 -150186 -182537 -282964
10316 -282964 -242211 -405216 -332381 -13054 48208 208446 -67 -40486 -28169 41054 149441
10305 149441 -38611 -392007 -604593 -536280 -173231 -60863 80564 61661 116113 296075
10295 296075 356656 235814 170869 248870 455315 342576 150282 135663 205703 300156 372235
10284 372235 134518 -11492 18891 -16339 70268 60884 222602 187709 130574 -46618 -158440
10273 -158440 -168632 -102198 12334 -105893 -46397 -144179 -11042 382741 343511 67028
10263 67028 -233225 -425588 -551359 -755141 -516384 -202075 -137562 -162174 -159624 -96400 -79902
10252 -79902 -89593 -54003 -399602 -454847 -269993 -23769 47063 14731 -138910 40198 133919
10241 133919 174666 299917 337330 455762 486711 249362 -134548 -34899 -318071 -425919
10231 -425919 -356055 -417197 -337235 -191563 -17609 -74651 60580 426730 261141 246231
10221 246231 341399 321422 142915 -22452 63317 -70436 -13109 109011 102141 -79927 -106433
10210 -106433 -72668 19865 148078 260945 220806 302480 212785 152061 342008 343736 -90612
10199 -90612 -259113 -310057 -384122 -133508 -134326 -188418 -195810 -76664 130805 291528 261298
10188 261298 257866 413395 581663 248240 23265 -57725 74279 232512 158906 20862
10178 20862 -176655 -555504 -548774 -394200 -243557 -280448 -341592 -312636 -59882 119311 3391
10167 3391 -151358 -167196 -46031 85683 85121 3140 -104343 -129856 78504 183113 26256
10156 26256 -29942 -112219 -254827 -391809 -322384 184750 291173 107436 132122 38089 797
10145 797 -43194 118264 195942 -17554 -235790 -405051 -92391 -11326 -91048 -196790 -253707
10134 -253707 -238429 -106515 31717 68302 -45860 -134100 -174614 13998 173000 -157784
10124 -157784 -3371 68426 110701 269406 368078 247747 -116687 -12917 207121 -79878
10114 -79878 -44896 109794 67938 177467 30374 60716 159155 305548 283628 -131518 -169461
10103 -169461 -10837 -60011 72509 151127 183117 58786 -63932 -149764 -156275 -180421 44361
10092 44361 240294 163778 20192 -106134 -337965 -445439 -308550 -196415 -113526 -17973
10082 -17973 -33225 -92515 -155168 6617 99731 90433 79208 -66686 4250 98183 109573
10071 109573 16535 90964 412739 529542 603730 502940 265875 256279 386687 442714 335126
10060 335126 275125 279786 281817 309688 236484 63985 -34904 -48072 -47142 168055 264193 79818
10048 79818 153441 57402 -102586 -56377 -123910 -102720 -174694 -35291 213994 157674 -165815
10037 -165815 -184349 -102853 68927 -84760 -41827 -416 -2577 -94483 -181379 80079 56452
10026 56452 290367 212327 -191053 -44969 359024 315907 189798 97276 -57304 135913
10016 135913 207141 320373 431878 185484 105902 154818 200169 298208 342655 433319 370727
10005 370727 14729 -40442 84005 158436 322689 272829 112486 70438 -43802 -41223 176353
9994 176353 225312 69533 131954 -88229 -235621 -51826 -64815 -54180 185438 285387 90857
9983 90857 92485 144280 87030 240467 315987 360390 515182 707338 815315 713952 297103
9972 297103 89208 154017 454646 668460 670762 461614 523801 710661 934610 1295888
9962 1295888 1495804 1564724 1389584 1306849 1359032 1386666 1784671 2026275 2128396 2402320
9952 2402320 2837978 3073480 3498015 3828606 4614548 5673502 6714914 7999521 10024152
9943 10024152 12650824 16198324 21414290 29873256 43121332 62040436 82542956 95726500
9935 95726500 97788224 90882879 77022900 59023468 42164952 30200580 22282267 17222996
9927 17222996 14016357 12260328 11283300 10169345 9268440 8551698 7913748 7405725 7090292
9918 7090292 7125025 7395343 7616580 8025902 8675603 9442600 10693059 12347157 14292338
9909 14292338 16716067 20239474 25235289 32568828 44162231 62681998 92280371 135254085
9901 135254085 179224061 202028938 200381091 180635883 147396532 106750341 72892251
9894 72892251 50959200 37345080 28725598 23078826 19189808 16409712 14171915 12653988
9886 12653988 11159555 9725743 8741314 7967199 7591708 7322026 7083042 6987430 7182204
9877 7182204 7782246 8348564 9087111 10181060 11366054 13054393 15683872 19522392 25896593
9868 25896593 35816044 50493829 69862636 87579000 95710923 93533793 83289763 66955011
9860 66955011 48847325 34142283 24308589 17939417 13778367 11262951 9432712 7998542
9852 7998542 7096957 6012203 4874561 4011530 3572142 3154986 2649699 2296946 1908042
9843 1908042 1615796 1583853 1512166 1324087 1400938 1324870 1182542 982520 840033 1018718
9833 1018718 1216707 1278662 895864 591354 526731 473482 588408 683169 664366 634416 650135
9822 650135 406957 326036 716822 638295 329206 106244 100407 137598 234969 398762 662326
9811 662326 744307 983818 917841 445952 81923 -71439 -15258 -56439 -27240 -3526 311446
9800 311446 527122 439122 429049 511874 373618 149190 191382 119735 237299 364019 355573
9789 355573 319744 -6525 -257269 -158590 -173141 138181 445032 524117 490002 359394 300180
9778 300180 341773 173852 -5665 35392 103623 195548 361269 582154 609132 326957 225107
9767 225107 102346 -110499 -380335 -243691 7449 -60232 47740 -136401 -119774 -1211
9757 -1211 39105 121375 222558 -99027 -166154 22193 -62009 -110329 -12066 -30280 220225
9746 220225 136854 -2085 287913 436035 450812 453140 366395 268301 243601 65438 130459
9735 130459 273297 203910 110227 84909 155705 238539 196045 266876 275920 226643 336270
9724 336270 266088 112924 139779 308971 185079 -31090 46103 146156 143486 100261 -126536
9713 -126536 -162978 30624 272580 369024 365499 277572 360319 299472 99474 -66617 -47590
9702 -47590 81587 472408 430226 245156 142568 25067 -77145 -81202 6225 -143521 -160092
9691 -160092 15059 17107 148362 349230 478402 509733 324001 301385 338650 452086 304827
9680 304827 4303 -60799 86093 -78508 -125110 -36519 123943 141880 -18872 -175374
9670 -175374 -167108 -70265 -194253 -176128 65859 146009 237247 220331 122815 -252386 -459843
9659 -459843 -357041 1791 49530 -8897 209487 355104 122967 -199525 -105422 95888
9649 95888 198473 256807 141524 -51558 -182822 -229711 -174936 -89235 -66865 -118062 -179864
9638 -179864 -242214 -214746 -130596 34277 152914 51634 -154106 -216936 -200942 -167723 -108176
9627 -108176 -203196 -163825 -96321 -245232 -273287 -128609 29026 -4637 -44163 -285616 -358378
9616 -358378 -142736 29109 148732 295386 215036 47066 -3828 -45296 65392 -94192
9606 -94192 -99922 -97213 -109245 -61794 -49152 96608 131663 105945 26690 151994 -10430 -311300
9594 -311300 -114907 -94709 -181600 -142112 -32652 16220 109011 32103 -244451 -351154 -144953
9583 -144953 -48811 -240306 -239011 -110159 134713 383822 220529 88530 -1153 -99902 -157435
9572 -157435 -213234 -214745 -304518 -421164 -383481 -348263 -269155 -262540 -212213 -289730 -101468 -19955
9560 -19955 -46846 -105181 -154565 66901 -36717 -40909 -152048 -30905 151426 165968 57864
9549 57864 -47435 175554 156571 -142525 -203811 -246282 -216742 -25653 109225 31784 -70704
9538 -70704 100701 172915 14254 33678 -78024 -86980 -47479 -64236 -18279 -22593 127201
9527 127201 147533 91601 77393 246886 302129 98487 60534 163388 263760 145267 11855
9516 11855 -244245 -396406 -288171 -160294 -9545 -67490 -181915 -201276 -86228 105944
9506 105944 243167 256522 264052 328899 253458 8214 54496 -41294 -314444 -374885 -194067
9495 -194067 8813 -107316 -196994 -348571 -27002 322529 369982 215809 57383 67340
9485 67340 123598 238153 687677 641762 318165 294669 443250 744581 663740 453227 155790
9474 155790 -250593 -288160 -268238 -175117 66306 230532 322417 -274685 -259107 -22653 49682
9463 49682 153416 70926 -3197 -130146 -396639 -332237 -61512 71186 -47921 -145992 -106041
9452 -106041 97115 -150416 -283256 -282999 -94633 71770 23248 4206 160301 313876 430176
9441 430176 374746 190630 110634 96495 75071 186304 245771 278557 105262 177785 236730
9430 236730 -42226 -228543 -220536 -209443 73405 306608 242304 -73052 -142503 -161091 -58289
9419 -58289 -173665 -240710 -88336 -84859 -22130 -192253 -54186 225882 395434 397933 522446
9408 522446 653629 371313 110768 61430 76670 -126961 -187692 61205 26012 -51075 74459
9397 74459 95852 35604 -140628 -210392 4739 79190 -130146 -221506 -309012 -203296 -148929
9386 -148929 -77505 150277 80656 38591 111875 235581 374683 345879 170733 -37740 42542
9375 42542 56638 88564 95919 -71504 9664 77577 -50078 19855 200046 95641 121261
9364 121261 131801 143031 187259 184410 321031 404494 570061 544400 373432 103289 -203521
9353 -203521 -306972 -101286 -87588 15099 86610 172636 28181 -231287 -58887 106511
9343 106511 50948 151784 130135 138845 162370 121720 91296 -20626 -153853 -336698 -228695
9332 -228695 123819 -135525 -151852 11213 111999 -57755 172753 526035 484995 656734
9322 656734 689890 599744 423991 344728 266989 334827 223669 188012 134964 194796 18162
9311 18162 -10044 -12043 -105415 -154087 -187922 -160926 -127474 -251573 -263177 -385098 -340173 -177130
9299 -177130 -204159 -163999 -120726 -30955 102145 173619 -18209 -137791 -134166 -13813 316927
9288 316927 320454 240758 112655 -27707 88798 170558 57325 -75752 -202220 -301847 -163910
9277 -163910 -128563 -143878 -76727 212670 284441 169151 104894 179081 25548 -58171 57055
9266 57055 114669 75134 169862 170915 -179133 -130632 -87409 -156144 -134894 -312424 30842
9255 30842 19421 -39142 155190 213721 148543 57595 97388 73551 97798 160315 169384 75210
9243 75210 282257 565750 597292 380286 253762 296142 178548 162345 201643 176124 195178
9232 195178 8718 44936 -68715 49647 -60447 -255297 -161048 45443 144618 45164
9222 45164 -96449 46476 168094 84689 -50510 39137 -56529 -295375 -523122 -407413
9212 -407413 -89862 100534 -255069 -501546 -255883 -44844 129329 199311 207530 44508
9202 44508 -46390 70667 45715 -175930 -74995 -115565 -169824 -106763 60508 354471 279173
9191 279173 214726 153692 34885 158967 401678 521144 373090 383923 414573 250785
9181 250785 142565 335814 270973 320452 331801 441526 421461 220598 177457 309948 444343
9170 444343 316951 21422 -38035 144899 242339 147989 52898 230549 400876 416889 321526
9159 321526 405279 409108 347828 191023 149639 270818 596822 701103 572494 624846 659058
9148 659058 738195 651225 420127 258467 276779 467465 781848 805155 758234 768787 764980
9137 764980 711154 621660 671884 767164 1005685 1042016 1123420 1175041 1160540 1344291 1521368
9126 1521368 1519584 1619370 1762647 2014821 2270422 2543335 2780848 3328178 3823097 4098238
9116 4098238 4550425 5180547 5815435 6275689 7231490 8256460 9619406 11446553 14005607
9107 14005607 17867629 22887623 29881496 40942511 59121687 90256438 141853448 214770526
9099 214770526 275228548 293774194 278068822 239180948 180863999 119786551 77730261
9092 77730261 52966316 37950180 28574713 22302240 17817285 14606801 12389414 10421827
9084 10421827 9087416 7893142 6778443 5953631 5292936 4652848 4121161 3772177 3459422
9075 3459422 3134389 2958281 2811730 2361126 2179525 2157063 2236827 2247288 2334887 2173302
9065 2173302 1845348 1801989 1632007 1317610 1115530 1288150 1510819 1493874 1518420 1321436
9055 1321436 1167083 1046712 805210 697809 823885 521772 416235 279076 329406 466110
9045 466110 707419 783360 789248 460259 162202 125492 161658 525208 723478 357192 174287
9034 174287 124618 407551 388528 236734 268907 171796 184150 371400 388386 324601 429807
9023 429807 389242 33395 12979 126132 102002 -21378 -7490 32516 6419 133604 354315
9012 354315 416466 364961 232742 346853 414614 290068 339255 422168 617192 540057 414761
9001 414761 318761 103870 92465 158436 197258 103940 181382 573684 549239 392929 319603
8990 319603 334185 546715 601027 463339 455427 453716 167578 -59885 119352 105447 -45340
8979 -45340 -70995 -163599 -74185 86478 90783 -61124 61807 416847 491256 580589 473319
8968 473319 179601 176950 106010 -181252 -341091 -231330 -27006 -165832 -57741 197162
$$ [...]
##END NTUPLES=NMR SPECTRUM
##END=
