##TITLE=Analysis number 313875
Compound Code cc 42310
Book Reference 449/32
Project Code adrs
Chemist Name davee
##JCAMPDX= 6.0         $$ Bruker NMR JCAMP-DX V2.0
##DATA TYPE= NMR SPECTRUM
##DATA CLASS= NTUPLES
##ORIGIN= Bruker BioSpin GmbH
##OWNER= NMR
$$ XWIN-NMR		Version 3.5
$$ Mon Sep 26 10:56:35 2005 GMT Daylight Time (UT+1h)  MAYBRIDGE\NMR@NMR_250MHZ
##.OBSERVE FREQUENCY= 250.131544655141
##.OBSERVE NUCLEUS= ^1H
##.ACQUISITION MODE= SIMULTANEOUS (DQD)
##.ACQUISITION SCHEME= undefined
##.AVERAGES= 16
##.DIGITISER RES= 18
##SPECTROMETER/DATA SYSTEM= dpx250
##.PULSE SEQUENCE= zg30
##.SOLVENT NAME= CDCl3
##.SHIFT REFERENCE= (INTERNAL, CDCl3, 0, 16.522)
##AUDIT TRAIL= $$ (NUMBER, WHEN, WHO, WHERE, WHAT)
$$ ##TITLE= Audit trail, XWIN-NMR		Version 3.5
$$ ##JCAMPDX= 5.01
$$ ##ORIGIN= Bruker BioSpin GmbH
$$ ##OWNER= NMR
$$ C:\u/data/dgb/nmr/ADRS/9960/pdata/1/auditp.txt
$$ ##AUDIT TRAIL=  $$ (NUMBER, WHEN, WHO, WHERE, WHAT)
(   1,<2005-09-26 10:56:05.92 +100>,<MAYBRIDGE\NMR>,<NMR_250MHZ>,
      <created by zg, POWCHK disabled, PULCHK disabled
       configuration hash MD5:
       62 19 C7 07 E1 42 D1 B7 37 6C 3D D0 77 39 F9 E6
       data hash MD5: 64K
       BC B0 0B D6 AE 2A C4 D4 BF 18 9B 80 00 A8 EB A2>)
(   2,<2005-09-26 10:56:24.94 +100>,<MAYBRIDGE\NMR>,<NMR_250MHZ>,
      <Start of raw data processing
       ef LB = 0.3 FT_mod = 6 PKNL = 1 SI = 32K 
       data hash MD5: 32K
       25 48 94 32 CB 07 9C 1D 58 1C FF 33 B9 82 A7 79>)
(   3,<2005-09-26 10:56:26.85 +100>,<MAYBRIDGE\NMR>,<NMR_250MHZ>,
      <apk 
       data hash MD5: 32K
       0D DA 22 68 8C EA E3 6C 6C 0F 5E 3F 39 6B F5 7C>)
(   4,<2005-09-26 10:56:27.58 +100>,<MAYBRIDGE\NMR>,<NMR_250MHZ>,
      <abs ABSG = 5 
       data hash MD5: 32K
       22 B2 9D 6E D0 7C F1 E0 72 41 9D 71 89 0F E6 74>)
$$ ##END=
$$ 
$$ hash MD5
$$ 65 95 9D D9 D4 1D 05 C8 D7 26 96 74 E6 7B 40 4F
##$RELAX= 
##$RELAX= 
##$RELAX= 
##$RELAX= 
##$RELAX= 
##$RELAX= 
##$RELAX= 
$$ Bruker specific parameters
$$ --------------------------
##$DU= <C:\u>
##$EXPNO= 9960
##$NAME= <ADRS>
##$PROCNO= 1
##$TYPE= <nmr>
##$USER= <dgb>
##$AMP= (0..31)
100 100 100 100 100 100 100 100 100 100 100 100 100 100 100 100 100 100 
100 100 100 100 100 100 100 100 100 100 100 100 100 100 
##$AQSEQ= 0
##$AQ_mod= 3
##$AUNM= <au_zg>
##$AUTOPOS= <11 >
##$BF1= 250.13
##$BF2= 250.13
##$BF3= 250.13
##$BF4= 250.13
##$BF5= 500.13
##$BF6= 500.13
##$BF7= 500.13
##$BF8= 500.13
##$BYTORDA= 1
##$CFDGTYP= 0
##$CFRGTYP= 5
##$CHEMSTR= <none>
##$CNST= (0..31)
1 1 145 1 1 1 1 1 1 1 1 1 1 1 1 1 1 1 1 1 1 1 1 1 1 1 1 1 1 1 1 1 
##$CPDPRG= <>
##$CPDPRG1= <>
##$CPDPRG2= <>
##$CPDPRG3= <>
##$CPDPRG4= <mlev>
##$CPDPRG5= <mlev>
##$CPDPRG6= <mlev>
##$CPDPRG7= <mlev>
##$CPDPRG8= <mlev>
##$CPDPRGB= <>
##$CPDPRGT= <>
##$D= (0..31)
0 1 0 0 0 0 0 0 0 0.06 0 0 0 0 0 0 0.0002 0 0 0 0 0 0 0 0 0 0 0 0 0 0 
0 
##$DATE= 1127728565
##$DBL= (0..7)
120 120 120 120 120 120 120 120 
##$DBP= (0..7)
150 150 150 150 150 150 150 150 
##$DBP07= 0
##$DBPNAM0= <>
##$DBPNAM1= <>
$$ [...]
##$SUBNAM6= <"">
##$SUBNAM7= <"">
##$SUBNAM8= <"">
##$SUBNAM9= <"">
##$SW= 20.6930455092707
##$SWIBOX= (0..15)
0 0 3 0 0 0 0 0 0 0 0 0 0 0 0 0 
##$SW_h= 5175.983436853
##$TD= 65536
##$TD0= 1
##$TE= 294.16
##$TE2= 300
##$TE3= 300
##$TEG= 300
##$TL= (0..7)
0 120 120 120 120 120 120 120 
##$TP= (0..7)
150 150 150 150 150 150 150 150 
##$TP07= 0
##$TPNAME0= <>
##$TPNAME1= <>
##$TPNAME2= <>
##$TPNAME3= <>
##$TPNAME4= <>
##$TPNAME5= <>
##$TPNAME6= <>
##$TPNAME7= <>
##$TPOAL= (0..7)
0.5 0.5 0.5 0.5 0.5 0.5 0.5 0.5 
##$TPOFFS= (0..7)
0 0 0 0 0 0 0 0 
##$TUNHIN= 0
##$TUNHOUT= 0
##$TUNXOUT= 0
##$USERA1= <user>
##$USERA2= <user>
##$USERA3= <user>
##$USERA4= <user>
##$USERA5= <user>
##$V9= 5
##$VALIST= <valist>
##$VCLIST= <CCCCCCCCCCCCCCC>
##$VD= 0
##$VDLIST= <DDDDDDDDDDDDDDD>
##$VPLIST= <PPPPPPPPPPPPPPP>
##$VTLIST= <TTTTTTTTTTTTTTT>
##$WBST= 1024
##$WBSW= 4
##$XGAIN= (0..3)
0 0 0 0 
##$XL= 0
##$YL= 0
##$YMAX_a= 354078
##$YMIN_a= -274392
##$ZGOPTNS= <>
##$ZL1= 120
##$ZL2= 120
##$ZL3= 120
##$ZL4= 120
##$ABSF1= 16.522
##$ABSF2= -4.171173
##$ABSG= 5
##$ABSL= 3
##$ALPHA= 0
##$AQORDER= 0
##$ASSFAC= 0
##$ASSFACI= 0
##$ASSFACX= 0
##$ASSWID= 0
##$AUNMP= <proc_1d>
##$AZFE= 0.1
##$AZFW= 0.1
##$BCFW= 0
##$BC_mod= 0
##$BYTORDP= 0
##$COROFFS= 0
##$CY= 12.5
##$DATMOD= 1
##$DC= 0
##$DFILT= <>
##$DTYPP= 0
##$F1P= 14.0000005364418
##$F2P= -0.99999901652339
##$FCOR= 0.5
##$FTSIZE= 32768
##$FT_mod= 6
##$GAMMA= 0
##$GB= 0
##$INTBC= 1
##$INTSCL= 1
##$ISEN= 128
##$LB= 0.3
##$LEV0= 0
##$LPBIN= 0
##$MAXI= 10000
##$MC2= 0
##$MEAN= 0
##$ME_mod= 0
##$MI= 0
##$NCOEF= 0
##$NC_proc= -5
##$NLEV= 6
##$NOISF1= 0
##$NOISF2= 0
##$NSP= 0
##$NTH_PI= 0
##$NZP= 0
##$OFFSET= 16.522
##$PC= 1
##$PHC0= -67.84718
##$PHC1= 0
##$PH_mod= 1
##$PKNL= yes
##$PPARMOD= 0
##$PSCAL= 4
##$PSIGN= 0
##$REVERSE= no
##$SF= 250.13
##$SI= 32768
##$SIGF1= 0
##$SIGF2= 0
##$SINO= 400
##$SIOLD= 32768
##$SREGLST= <1H.CDCl3>
##$SSB= 0
##$STSI= 32768
##$STSR= 0
##$SW_p= 5175.98343685301
##$SYMM= 0
##$S_DEV= 0
##$TDeff= 65536
##$TDoff= 0
##$TI= <Analysis number 999999
Compound Code 99
Book Reference 9
Project Code 9>
##$TILT= no
##$TM1= 0
##$TM2= 0
##$TOPLEV= 0
##$USERP1= <user>
##$USERP2= <user>
##$USERP3= <user>
##$USERP4= <user>
##$USERP5= <user>
##$WDW= 1
##$XDIM= 32768
##$YMAX_p= 469871732
##$YMIN_p= -610813
$$ End of Bruker specific parameters
$$ ---------------------------------
##NTUPLES= NMR SPECTRUM
##VAR_NAME=  FREQUENCY,     SPECTRUM/REAL,   SPECTRUM/IMAG
##SYMBOL=    X,             R,               I
##VAR_TYPE=  INDEPENDENT,   DEPENDENT,       DEPENDENT
##VAR_FORM=  AFFN,          ASDF,            ASDF
##VAR_DIM=   32768,         32768,           32768
##UNITS=     HZ,            ARBITRARY UNITS, ARBITRARY UNITS
##FACTOR=    0.157963299565203, 1,           1
##FIRST=     4132.6476996994, 0,             0
##LAST=      -1043.33573715361, 0,           0
##MIN=       -1043.33573715361, -610813,     0
##MAX=       4132.6476996994, 469871732,     0
$$ Real data points
##PAGE= N=1
##DATA TABLE= (X++(R..R)), XYDATA
$$ [...]
23542c290l8708k188O7598k06484j07532O8278n980j34287J13572J68426k3913
$$ -3290 -41998 -44186 23412 -183072 -290604 -222326 -228306 -362593 -249021 -80595 -104508
23531a04508q9108m51l0425j07879J33712Q9063Q0079o5525L4945K4825j17898
$$ -104508 -193616 -194067 -224492 -332371 -198659 -109596 -29517 -95042 -60097 -35272 -153170
23520a53170o9741O4364P1148J52427K0121K07645r3559j38714J5644j01272j31215
$$ -153170 -222911 -158547 -87399 65028 85149 292794 199235 60521 76165 -25107 -156322
23509a56322k4187k0855R1687j03242m2229J21938K56829p9910M1143r1960o9905
$$ -156322 -180509 -201364 -109677 -212919 -255148 -133210 123619 43709 84852 -7108 -77013
23498g7013n9471j17125j45970P5404J16769o8547Q0933k0404k07197j8483J63415
$$ -77013 -136484 -253609 -399579 -324175 -207406 -275953 -195020 -215424 -422621 -441104 -277689
23487b77689j2589R1160N8376l9j2562j04964N8124K4313L1301J60408K6038Q267
$$ -277689 -290278 -199118 -140742 -140781 -153343 -258307 -200183 -175870 -144569 15839 41877 50144
23475E0144q672m2561j85395K3628j2056K25689J55733q8989p5359j12345L5859
$$ 50144 41472 -1089 -186484 -162856 -174912 50777 206510 117521 42162 -70183 -34324
23464c4324l7751R0768M9070o81J7968k9834M0326Q7142q29O0089M5592J6793
$$ -34324 -72075 18693 67763 67082 85050 55216 95542 182684 181855 241944 287536 304329
23452C04329m9173l2767l2383K7535N4902J11653j13839p4506O4422L9359M5941
$$ 304329 255156 222389 190006 217541 272443 384096 270257 195751 260173 299532 345473
23441C45473j42795M4081L1330j77426j24787j67404j34781N7022Q9202j19950
$$ 345473 202678 246759 278089 100663 -24124 -191528 -326309 -269287 -180085 -300035
23431c00035r0570k6227J82340J91724k8153J03394M3908j00058j05237J29318
$$ -300035 -390605 -416832 -234492 -42768 -70921 32473 76381 -23677 -128914 404
23421D04l353l1705L9187K612l1695j16686N0380J27232M4344P921M959L0163
$$ 404 -2949 -34654 4533 7145 -24550 -141236 -90856 36376 80720 88641 93600 123763
23409A23763M5980R4842J2725k28381j56662R7921J33138M8714K0055J3096N3808
$$ 123763 169743 264585 277310 48929 -107733 -9812 123326 172040 192095 205191 258999
23398B58999j59511j27395P3902m3692l9491M2553Q5954p3613O6786P0553j28585
$$ 258999 99488 -27907 45995 2303 -37188 5365 91319 17706 84492 155045 26460
23387B6460q5812M6119J9662L414k6068J03175R9384r6014N8549Q7984k7625K2173
$$ 26460 -59352 -13233 6429 9843 -16225 86950 186334 90320 148869 236853 209228 231401
23375B31401L4690r6626j64014J82733m3795j7554k6931M2443J894k41726M5398
$$ 231401 266091 169465 5451 188184 144389 126835 99904 142347 144241 -97485 -52087
23364e2087J44855N4721Q1102K042N6347M5906M283R185O4788j62704j73088j59990
$$ -52087 92768 147489 228591 230633 286980 332886 337169 346354 411142 248438 75350 -84640
23352h4640J7796J48279p1958M5311q616j00946J47892J05012j24290R2947J5178
$$ -84640 -66844 81435 9477 54788 46172 -54774 93118 198130 73840 166787 181965
23341A81965j73510o101M2890j17293L1870j13430J34445L0095j26358j54363
$$ 181965 8455 2354 45244 -72049 -40179 -153609 -19164 10931 -115427 -269790
23331b69790O3931N7364R2428P6647r9415N4832J96891M9299j69885p1086j72387
$$ -269790 -205859 -148495 -56067 20580 -78835 -24003 172888 222187 52302 -18784 -191171
23320a91171J9128J39943R8914O0760j1558k8952P9756J94637O3501j17481o2652
$$ -191171 -172043 -32100 66814 127574 116016 87064 166820 361457 424958 307477 244825
23309B44825p4274r650r6048m6822J52387J06559j4530L7425m7672l8235k9929
$$ 244825 170551 160901 64853 18031 170418 276977 262447 299872 252200 213965 184036
23298A84036k2354R6303J32246j16042q5727l5198n9818K3149P8869J28750J09378
$$ 184036 161682 257985 390231 274189 188462 153264 93446 116595 195464 324214 433592
23287D33592j37482k18554O757R0230J87014q7263l30486j72786r0004Q5191K40796
$$ 433592 296110 77556 84313 174543 361557 274294 -56192 -228978 -318982 -233791 7005
23276G005M1091p5016o3379K8952K1529J28237M4192l21812j39406J14581K72341
$$ 7005 48096 -26920 -90299 -61347 -39818 88419 132611 -189201 -328607 -214026 58315
23265E8315p8080j96998J17201k208j19364O0155l2134J45797J44264q5273p5246
$$ 58315 -19765 -216763 -99562 -101770 -221134 -160979 -193113 -47316 96948 11675 -63571
23254f3571J31549j89853n0480m2169k7038o4934R1404R0505J52340J7611j14899
$$ -63571 67978 -121875 -172355 -214524 -241562 -306496 -215092 -124587 27753 45364 -69535
23243f9535j04961K8167J21676O0344q6520K4505p3042M9831K6349n7151J44283
$$ -69535 -174496 -146329 -24653 35691 -50829 -26324 -99366 -49535 -23186 -80337 63946
23232F3946J38402l7998j59573j99533j55830L603J86819Q4364q6950O8065J06815
$$ 63946 202348 164350 4777 -194756 -350586 -346983 -160164 -75800 -162750 -94685 12130
23221A2130k8862j01051N4965O5086m496O1260n7810k5678P6679n0018O622J74922
$$ 12130 -16732 -117783 -62818 2268 -2228 59032 1222 -24456 52223 2205 8827 183749
23209A83749N7035m0990j96090k3037J02071Q9451l6936j64850j55949j45711
$$ 183749 240784 199794 3704 -19333 82738 172189 135253 -29597 -185546 -331257
23199c31257q378J31587Q5548l7738K8485K11768J62858j41189j58479j18932
$$ -331257 -339635 -208048 -122500 -160238 -131753 80015 242873 101684 -56795 -175727
23189a75727r6874R4055J99401l9523M8672k1920J7879K6087j20027N5291o692
$$ -175727 -272601 -178546 20855 -18668 30004 8084 25963 52050 -67977 -12686 -19378
23178a9378L2308J37589N9395j41151j30759M2181p2413J12396n7391k8055q363
$$ -19378 12930 150519 209914 68763 -61996 -19815 -92228 20168 -37223 -65278 -73641
23167g3641k6836j92698M5946K99395J54739m9602m548K7803j23296j72149j79192
$$ -73641 -100477 -293175 -247229 52166 206905 157303 152755 180558 57262 -114887 -294079
23156b94079J57730K51435O7350P2971n4145K7152j9107k30510j91768K0428M4695
$$ -294079 -136349 115086 182436 255407 201262 228414 209307 -21203 -212971 -192543 -147848
23145a47848J35313K07334j19345q4134L1533R0913j74216m1441J3925J21001
$$ -147848 -12535 194799 75454 -8680 22853 113766 -60450 -101891 -87966 33035
23135C3035J06487M104R7833K2214j30489q6017r7115j25156J03012J56169J36827
$$ 33035 139522 143626 241459 263673 133184 47167 -49948 -175104 -72092 84077 220904
23124B20904N9194O8969J1351k1044M2111n4662j25620J16661P329J70080k9143
$$ 220904 280098 349067 360418 339374 381485 326823 201203 317864 325193 495273 466130
23113D66130j6017l0110j16773J5895j39145j39560L7060N8827q4063L6491m871
$$ 466130 450113 420003 303230 319125 179980 40420 77480 136307 52244 88735 83864
23102H3864j9749P008o5071j43365O7903K45023o5789r4663j30114o2323K6958
$$ 83864 64115 71123 6052 -137313 -69410 175613 109824 15161 -114953 -177276 -150318
23091a50318o5665j42952J3989J52991L7307K2287P8760k0412q3577Q75J03761
$$ -150318 -215983 -358935 -344946 -191955 -154648 -132361 -53601 -74013 -157590 -156715 -52954
23080e2954p0567j29974L2369L7022J4075Q0842k7840J8453J01979P7977q2270
$$ -52954 -123521 -253495 -221126 -184104 -170029 -89187 -117027 -98574 3405 81382 -888
23069h88P0128L3477M570j2611j57775k35475l7218M6642O7885K48848R9279r3307
$$ -888 69240 102717 107287 94676 -63099 -298574 -335792 -289150 -221265 27583 126862 33555
23057C3555k45749n4427K012K7063L1439J55442Q3453m8600M7475p6610j01562
$$ 33555 -212194 -266621 -264609 -237546 -206107 -50665 32788 -15812 31663 -44947 -146509
23046a46509j5857J97962R1297J39413N4270Q5799p9096j47453m4019j12985o8426
$$ -146509 -162366 35596 126893 266306 320576 406375 327279 179826 135807 22822 -45604
23035d5604J01244r8061k11645J13523K69235O8964j81511n9603J60507n4544
$$ -45604 55640 -42421 -254066 -140543 128692 197656 16145 -43458 117049 62505
23025F2505J0608J50325K7376L9496P412j26110j02271R1928N0222j02893J1536
$$ 62505 73113 223438 250814 290310 297722 171612 69341 161269 211491 108598 120134
23014A20134O283m681N3929j08745q4673p0946J03313N5484r6093L4212J46020
$$ 120134 126417 121736 175665 66920 -17753 -88699 14614 70098 -25995 8217 154237
23003A54237K0675p8968o78O349j17871q9058J0667j15397k54924n3756K18255
$$ 154237 174912 95944 95266 101615 -16256 -105314 -94647 -210044 -464968 -518724 -300469
22992c00469K85343N8183q6886K500o641R0643j37343j17265K6622O9643J3244
$$ -300469 -15126 43057 -43829 -41329 -47970 42673 -94670 -211935 -185313 -115670 -102426
22981a02426J14044P2951J3566R7800m1016r1167l7623j13206r2729O1961J7045
$$ -102426 11618 84569 98135 195935 154919 63752 26129 -87077 -179806 -117845 -100800
22970a00800j05231R2653J36744K00226J71333k1551k31211J7187P8971q1987
$$ -100800 -206031 -113378 23366 223592 394925 373374 142163 159350 238321 156334
22960A56334r2332P8641k01417k9615m0566j2594j3632J16853J00192J445q540
$$ 156334 64002 142643 -58774 -88389 -128955 -141549 -155181 -38328 61864 63309 54769
22949E4769m9306q3328j3042j5144N3328K4771N223p116r2407J19643M0203j04610
$$ 54769 5463 -77865 -90907 -106051 -52723 -27952 -22729 -29845 -122252 -2609 37594 -67016
22937f7016o2308Q4234K10586J05479p0239n2823r8144k6772j25877l0954J3672
$$ -67016 -129324 -45090 165496 270975 200736 147913 49769 22997 -102880 -133834 -120162
22926a20162q2198R3717J33221M179N9734k03895o7210J52074J23239N9774j2130
$$ -120162 -202360 -108643 24578 28757 88491 -115404 -182614 -30540 92699 152473 140343
22915A40343k51661j45789J61923J7721J83613K8914J9824o4123O0613p4747j55283
$$ 140343 -111318 -257107 -95184 -77463 106150 135064 154888 90765 151378 76631 -78652
22904g8652O693J6872k39093j79231n157J84627J48285k5392k6589M9371j63646
$$ -78652 -71959 -55087 -294180 -473411 -478568 -293941 -145656 -171048 -197637 -148266 -311912
22893c11912R047J95740R3253k535k01525m7063J39643m6758j40920M7131K1625
$$ -311912 -302865 -107125 -13872 -16407 -217932 -264995 -125352 -172110 -313030 -265899 -244274
22882b44274K2277K00039K9888L1925N2280N6577l7628M2789J04438k5740j40209
$$ -244274 -221997 -21958 7930 39855 92135 148712 111084 153873 258311 232571 92362
22871I2362J4272j29656q739J31151j00441k46277L3624K36730O5252J2979q7862
$$ 92362 106634 -23022 -31761 99390 -1051 -247328 -213704 23026 88278 101257 13395
22860A3395p0071j01800m7040j4558J2162K3700j05133j38043J19336P9768N7009
$$ 13395 -56676 -158476 -205516 -220074 -207912 -184212 -289345 -427388 -308052 -228284 -171275
22849a71275k1686N0235J03568j2007q3711j5004L5514l3615m473l5962l8361
$$ -171275 -192961 -142726 -39158 -51165 -134876 -149880 -114366 -147981 -152454 -188416 -226777
22838b26777J68104K38346L362r5643J6851n2583j39386k57911n9902J98328J98115
$$ -226777 -58673 179673 183035 87392 104243 51660 -87726 -345637 -405539 -207211 -9096
22827i096M8008O7646j8763m1948j54961k8155J16500N2712r790j88543j1295
$$ -9096 38912 106558 87795 45847 -109114 -137269 -20769 31943 22153 -166390 -177685
22816a77685M8717Q6799l9790k1264L1434K6496o3368k1931k463K7738P0764J06395
$$ -177685 -128968 -42169 -81959 -103223 -71789 -45293 -108661 -130592 -133055 -105317 -34553 71842
22804G1842j26410M2993l0514R0618n3119p1294Q0221O9331Q4058m7453N305R5426
$$ 71842 -54568 -11575 -42089 48529 -4590 -75884 4337 73668 157726 110273 115578 211004
22792B11004j77977j15121L1230M5594k9580O9759j5000N8656n6605j4578q6683
$$ 211004 33027 -82094 -50864 -5270 -34850 34909 19909 78565 21960 7382 -79301
22781g9301Q7590J13561j4360l3141j05088J01203M5860J8993J45296J31416j74596
$$ -79301 8289 121850 107490 74349 -30739 70464 116324 135317 280613 412029 237433
22770B37433j99336j01793J88719K05650r9404m4107j01915j51185j83231L5948
$$ 237433 38097 -63696 125023 330673 231269 187162 85247 -65938 -249169 -213221
22760b13221Q4197l845M6595j6209j26985K2950k0548L7829K88532J57889j35174
$$ -213221 -129024 -132869 -86274 -102483 -229468 -206518 -227066 -189237 99295 257184 122010
22749A22010q1550J5120K4829L0999k6463J13261j06000m9361j04774r9458N5839
$$ 122010 40460 55580 80409 111408 84945 198206 92206 42845 -61929 -161387 -105548
22738a05548J07747N3013m1655j24719J43579J18292j77980j62528M5692J22725
$$ -105548 2199 55212 13557 -111162 32417 150709 -27271 -189799 -144107 -21382
22728b1382P5541J6453K6382n0405r9350J530P7257j10095j59015m5091Q9514
$$ -21382 54159 70612 96994 46589 -52761 -51231 26026 -84069 -243084 -288175 -198661
22717a98661Q1211p3355N4713P0385J53455j29745n4163l819j96667j58200N6332
$$ -198661 -117450 -190805 -136092 -65707 87748 -41997 -96160 -99979 -296646 -454846 -398514
22706c98514K94741J79363l3646q0199K2816J25296j04462j68647k6635j10808
$$ -398514 -103773 75590 41944 -38255 -15439 109857 5395 -163252 -189887 -300695
22696c00695Q115J4126M1091N2051J9789J31310n7370j1192Q0961q3319N3170
$$ -300695 -292580 -278454 -237363 -185312 -165523 -34213 -91583 -102775 -21814 -105133 -51963
22685e1963L5138M9264o7406j68600Q0498J5379j93577p3784O1524J95933J50603
$$ -51963 -16825 32439 -34967 -203567 -123069 -107690 -301267 -375051 -313527 -117594 33009
22674C3009l5045K06975j11883j63454j33584o2238J68324O1197J0407N4974J33904
$$ 33009 -2036 204939 93056 -70398 -203982 -266220 -97896 -36699 -26292 28682 162586
22663A62586O5801R472j316p6295p8322q2096L7544N7500P9943p5317j36509j4301
$$ 162586 228387 237859 236543 160248 81926 -170 37374 94874 174817 99500 -37009 -51310
22651e1310j3046P3873O2980l8980N9350J00764j50893k30969o5271J91359J07887
$$ -51310 -64356 9517 72497 33517 92867 193631 42738 -188231 -253502 -62143 45744
22640D5744L1615O1409M4306q922L3482j0462j53838p7234k1204Q4059K03865
$$ 45744 77359 138768 183074 174152 207634 197172 43334 -33900 -55104 28955 232820
22629B32820J2269j70440k2286j9384P9292q684j36581J4319O2484n0276p9101
$$ 232820 245089 74649 52363 32979 112271 103587 -32994 -18675 43809 -6467 -85568
22618h5568J09183K9719k6630M9404J28263P0059m8496j63901r9462o9645j3723
$$ -85568 23615 53334 26704 76108 204371 274430 225934 62033 -37429 -107074 -120797
22607a20797O1875j0461m8263j09973p6551Q4223O5965Q2103p3434q7376j82973
$$ -120797 -58922 -69383 -117646 -227619 -304170 -219947 -153982 -71879 -145313 -232689 -415662
22596d15662m2416R5636j7131O7271l8376Q2183M2661J43488K9488m2964R6586
$$ -415662 -458078 -362442 -379573 -312302 -350678 -268495 -225834 -82346 -52858 -95822 764
22585G64J22337n4832r2670j86J5437m7440J13740O6164o1970O925N457p6604
$$ 764 123101 68269 -24401 -24587 -9150 -56590 57150 123314 61344 68269 73726 -2878
22573b878p8252L9278K03882Q7079k05057j46428l8213k52455J59159J67134j7782
$$ -2878 -81130 -41852 162030 249109 44052 -102376 -140589 -393044 -233885 -66751 -84533
22562h4533j38298j93902k6232K8884J41781J31600J68513j77358p6969O1201
$$ -84533 -222831 -416733 -442965 -414081 -272300 -140700 27813 -149545 -226514 -165313
22552a65313J19557Q5961n8440p8880M5088n9440j28469m0536K9615M1760r2473
$$ -165313 -45756 40205 -18235 -97115 -52027 -111467 -239936 -280472 -250857 -209097 -301570
22541c01570m4052J49606J38124O4639p9703l1333k2161j02311p8991L2451K15949
$$ -301570 -345622 -196016 -57892 6747 -72956 -104289 -126450 -228761 -307752 -275301 -59352
22530e9352K13840k5101P8856j33077j40876R8697N7127n1027q4664j68851q8228
$$ -59352 154488 129387 208243 75166 -65710 32987 90114 39087 -45577 -214428 -302656
22519c02656J67800J09826p6396O1314J39936K0273j24466J4957m7273j3138L2889
$$ -302656 -134856 -25030 -101426 -40112 99824 120097 -4369 10588 -36685 -49823 -16934
22508a6934l1850m4525k05k40130Q1265J06917k3097M8159r7148Q0812N1426k098
$$ -16934 -48784 -93309 -93514 -333644 -252379 -145462 -168559 -120400 -217548 -136736 -85310 -87408
22496h7408J85669M391j56197j59743N437J13663J0511r7459q4088J20113J9909
$$ -87408 98261 102652 -53545 -213288 -207851 -94188 -83677 -181136 -265224 -145111 -125202
22485a25202Q5832J03296q9716l3950K6439M3068k5077R2708q9922k3076K38313
$$ -125202 -39370 63926 -25790 -59740 -33301 9767 -15310 77398 -12524 -35600 202713
22474B02713K2260j15127j67047m2789R0544J0527J01503O0170n3343j50708m9084
$$ 202713 224973 109846 -57201 -99990 -9446 1081 102584 162754 109411 -41297 -90381
22463i0381J74869n203K9743o5046Q6974r2469J64324M3115r5363k07596n6044
$$ -90381 84488 79285 109028 43982 130956 38487 202811 245926 150563 -57033 -113077
22452a13077P2071K69194J88549o6657k00864j78980R8906J8086q0975o3573P7211
$$ -113077 -41006 228188 416737 350080 149216 -29764 69142 87228 6253 -57320 19891
22441A9891M9049J2626j74645k78130K3684K54056m8912n9223n3900n9358j3548
$$ 19891 68940 81566 -93079 -371209 -347525 -93469 -142381 -201604 -255504 -314862 -328410
22430c28410K68744J09220L9035j39229k31714J28563J53212J25474J16341k3985
$$ -328410 -59666 49554 88589 -50640 -282354 -153791 -579 124895 241236 217251
22420B17251N8693j80915k07935l8431k7009m7273J86901J24794J9620l6189j54895
$$ 217251 275944 95029 -112906 -151337 -178346 -225619 -38718 86076 105696 69507 -85388
22409h5388J26619Q04o2340k1897o0323J814J03378r939J32614j7576m247J30578
$$ -85388 41231 42035 -20305 -42202 -102525 -100711 2667 -7272 125342 107766 103519 234097
22397B34097O3031j16930p6538p7314M53p4486l5274P903J15423L0916L5845R2986
$$ 234097 297128 180198 103660 26346 26799 -47687 -82961 -75058 40365 71281 107126 200112
22385B00112m070J2505k86282j07261O8022l7231l6884r7855J08514J84472J7081
$$ 200112 196042 208547 -77735 -184996 -116974 -154205 -191089 -288944 -180430 4042 21123
22374B1123O0357r522j00937M1902L7700o7134n0364j92460J6251J9301Q2552
$$ 21123 81480 71958 -28979 12923 50623 -16511 -66875 -259335 -243084 -223783 -141231
22363a41231n1405L1718L2126J0135P1819K1234j14463o1218J09083l409p3529
$$ -141231 -192636 -160918 -128792 -118657 -46838 -25604 -140067 -201285 -92202 -95611 -169140
22352a69140K4346j99517j45449L03242J63966n4429J6543O3983r0302j76983
$$ -169140 -144794 -344311 -489760 -186518 -22552 -76981 -60438 3545 -86757 -263740
22342b63740J2376J10193R2564o7652P1876j46851P0933n124J13079J20511j22233
$$ -263740 -251364 -141171 -48607 -116259 -44383 -191234 -120301 -125425 -12346 108165 -14068
22331a4068k53032J46295K72000J06691L1797m4336k73944j30449J25752O8254
$$ -14068 -267100 -120805 151195 257886 289683 245347 -28597 -159046 -33294 34960
22321C4960Q4247q8355M9043j23500l03939R3978K41847k4497J43031J42423N8419
$$ 34960 119207 30852 79895 -43605 -347544 -253566 -11719 -36216 106815 249238 307657
22310C07657O1917j44230r2370p9885O911O4382J4473j67243j91590Q4182L7142
$$ 307657 369574 225344 132974 53089 60000 124382 138855 -28388 -219978 -135796 -98654
22299i8654p3104M8562J16691l8734j42460j00437m0964O3486K2298M9861J443
$$ -98654 -171758 -123196 -6505 -45239 -187699 -288136 -329100 -265614 -243316 -193455 -192012
22288a92012J62342K28701k5992o4477k1449J5113j0442m2032L4573Q5307j21516
$$ -192012 -29670 199031 173039 108562 87113 102226 91784 49752 84325 169632 48116
22277D8116o0087k708N3921p677N4261r0220o0007k0395P3028J22487j8561j49017
$$ 48116 -11971 -14679 39242 31565 85826 -4394 -64401 -84796 -11768 110719 92158 -56859
22265e6859k7148J751p4781n2026J88445q921N8743P8630o894J05458k33277p2244
$$ -56859 -84007 -82256 -157037 -209063 -20618 -29539 29204 107834 100940 206398 -26879 -99123
22253i9123l9404J538M4568J17665Q0206K3698J03682m0158j62945j4317J40878
$$ -99123 -138527 -136989 -92421 25244 105450 129148 232830 192672 29727 15410 156288
22242A56288J32828P9113n6745L7990q2354j02341J5757o8041l6424o4301J2208
$$ 156288 289116 368229 311484 349474 267120 164779 180536 112495 76071 11770 23978
22231B3978j33282k6679j8375M8077m3765P1426J48675j28786j96848J8248K05794
$$ 23978 -109304 -135983 -154358 -106281 -150046 -78620 70055 -58731 -255579 -237331 -31537
22220c1537N7039k4068J3476k4714j81600L3973K3291J97189N061N7970J5600
$$ -31537 25502 1434 14910 -9804 -191404 -157431 -134140 63049 68110 126080 141680
22209A41680l7733o5959o8879o5781l2198K3893J20942M826N0092m7073l0408
$$ 141680 103947 37988 -30891 -96672 -128870 -104977 15965 20791 70883 23810 -6598
22198f598j7496k9871m2294j813P8717o2105J47361l5405o3916l9679R6801L0050
$$ -6598 -24094 -53965 -96259 -98072 -19355 -81460 65901 30496 -33420 -73099 23702 53752
22186E3752R013P7258n3485q0702j10649P3381J33061j07895j36697J27261J45294
$$ 53752 62765 140023 86538 5836 -104813 -31432 101629 -6266 -142963 -15702 129592
22175A29592P665n7579M9966j05468j3018M5293p3912j27480r5632j57901j68158
$$ 129592 137257 79678 129644 24176 11158 56451 -17461 -144941 -240573 -398474 -566632
22164e66632J46501J65979O0503o6729m1978J66118J16760J24200K38204L7907
$$ -566632 -420131 -254152 -193649 -260378 -302356 -136238 -19478 104722 342926 380833
22154C80833k49514k30621j9336n6378m1594J39461l8244o6801J6942P6284q1955
$$ 380833 131319 -99302 -118638 -175016 -216610 -77149 -115393 -182194 -165252 -88968 -170923
22143a70923k4696K1963j00671N2530j4085j4677R1737J13122R6923k0269m7766
$$ -170923 -195619 -173656 -274327 -221797 -235882 -250559 -158822 -45700 51223 30954 -16812
22132a6812J069M557J4779N0968o6931r4187j25370J15946J81822r5597O6663
$$ -16812 -15743 -11186 3593 54561 -12370 -106557 -231927 -115981 65841 -29756 36907
22121C6907j4012j29139j11435P8888P3265m1956m5801K5857J28997j9738p8926
$$ 36907 22895 -106244 -217679 -138791 -65526 -107482 -153283 -127426 1571 -18167 -97093
22110i7093K10756P5308m7181R8603r3361J3585j0275q5386p3160n8177k1534
$$ -97093 113663 188971 141790 240393 147032 160617 150342 64956 -8204 -66381 -87915
22099h7915J86400o1532R336J14379p9383N659K5515j14915j05981j07994n8933
$$ -87915 98485 36953 46289 160668 81285 86944 112459 -2456 -108437 -216431 -275364
22088b75364O6263K00741n638J11218L9036l0687l2863N9270k8314j40276M9525
$$ -275364 -209101 -8360 -13998 97220 136256 105569 72706 131976 103662 -36614 12911
22077A2911L8170j68900K9591j0225k1737J4771k7286l8648J5768P7160J24857
$$ 12911 51081 -117819 -88228 -98453 -120190 -105419 -132705 -171353 -155585 -78425 46432
22066D6432R7729j66149m8303l4133Q0152j21364P4735J22338p1747Q6968n4269
$$ 46432 144161 -21988 -70291 -104424 -24272 -145636 -70901 51437 -20310 66658 12389
22055A2389M182P2173q0812k1646p3805M9106r4882j75953p8901p0759K16567
$$ 12389 16571 88744 7932 -13714 -87519 -38413 -133295 -309248 -388149 -458908 -242341
22044b42341J03203O652J818j10502N4059K07882O1372K9085J5955J57866m4304
$$ -242341 -139138 -132486 -130668 -241170 -187111 20771 82143 111228 127183 285049 240745
22033B40745j36434P5101m9597P6420N1721j3634j90384j81737Q3483J43011M1358
$$ 240745 104311 179412 129815 206235 257956 244322 53938 -127799 -44316 98695 140053
22022A40053j50986q3211o306Q6199P7780q0517O7363m784l8828k5704j3234r1616
$$ 140053 -10933 -94144 -100450 -14251 63529 -16988 50375 45591 6763 -18941 -32175 -123791
22010a23791L8529m0202L7233j8608n0550r6411Q8905L1397r216J37316M7154
$$ -123791 -85262 -125464 -88231 -106839 -157389 -253800 -164895 -133498 -142714 -5398 41756
21999D1756K3114j0056k0628j7073r8728n5568J05493R0908m9443K400n5387j29197
$$ 41756 64870 54814 34186 17113 -81615 -137183 -31690 59218 9775 12175 -43212 -172409
21987a72409n8407J9190j55640K7715J24192J19743q4700J10573J13231L6099
$$ -172409 -230816 -211626 -367266 -339551 -215359 -95616 -180316 -69743 43488 79587
21977G9587L726m636k290j83742j7751J17579k5668K032l862L5347J20133N0932
$$ 79587 83313 78677 76387 -107355 -125106 -7527 -33195 -31163 -35025 322 120455 171387
21965A71387O0096j60865j85166k07534j42069J23597J92312P8142r0870n5145
$$ 171387 231483 70618 -114548 -322082 -464151 -340554 -148242 -70100 -160970 -216115
21955b16115M4109r4076N4844J20284J5028q2207K112J70478p517L0767L940J7236
$$ -216115 -172006 -266082 -211238 -90954 -75926 -158133 -156021 14457 6940 37707 41647 58883
21943E8883J36027R4522j55067k00116q778K1421M2172R4165q5385p2784m2210
$$ 58883 194910 289432 134365 -65751 -74529 -53108 -10936 83229 -2156 -74940 -117150
21932a17150K00048k6223n212N6019K2810R5503p9583q0529j93771J54116J96254
$$ -117150 82898 56675 51463 107482 130292 225795 146212 65683 -128088 26028 222282
21921B22282Q0577p1539l1255q0572K8176J20581j05691k40359j15366j59747
$$ 222282 302859 231320 200065 119493 147669 268250 162559 -77800 -193166 -352913
21911c52913o3830O710J59651J30655N2422m758K2629j16857r1949J5129J11203
$$ -352913 -416743 -410033 -250382 -119727 -67305 -72063 -49434 -166291 -258240 -243111 -131908
21900a31908J30581l5673j9734K5225p0222p1212o07N7323L5783O6206k7698O7010
$$ -131908 -1327 -37000 -56734 -31509 -101731 -172943 -173550 -116227 -80444 -14238 -41936 25074
21888B5074n9479p3626q4390N8276J10735j7487K23217J07603j33241j28021Q6020
$$ 25074 -34405 -108031 -192421 -134145 -23410 -40897 182320 289923 156682 28661 114681
21877A14681P0074k0064m7769O3261J826q104k77045j31670O2636Q6838L2606
$$ 114681 184755 164691 116922 180183 182009 173905 -103140 -234810 -172174 -85336 -52730
21866e2730K1690P7455J4997j42599Q1698J21114j93930p7939J70880P3804j35906
$$ -52730 -31040 46415 61412 -81187 511 121625 -72305 -150244 20636 94440 -41466
21855d1466M6038k3409J0125O2472L0227J28506M6329m1987m0686o2964o8943
$$ -41466 4572 -18837 -8712 53760 83987 212493 258822 216835 176149 113185 44242
21844D4242J5697M8318q172J37821L4373j13792j20427J6852r7518l5512n4339
$$ 44242 59939 108257 100085 237906 272279 158487 38060 54912 -42606 -78118 -132457
21833a32457M77M5689l5510j5812K670J21750O1393J1900m0128m4910m7120j2653
$$ -132457 -131980 -86291 -121801 -137613 -134943 -13193 48200 60100 19972 -24938 -72058 -84711
21821h4711Q3194k7817l7819J5221j7059J12052Q4904j31739J30256Q1244j11993
$$ -84711 -1517 -29334 -67153 -51932 -68991 43061 127965 -3774 126482 207726 95733
21810I5733k75390r3117j3153R1793K17941K04010k57061j46319O556M5446J28974
$$ 95733 -179657 -272774 -285927 -194134 23807 227817 -29244 -175563 -169007 -123561 5413
21799E413L8252K4723O9125p2645J7888N3910J27488o2235p2261j76705j46092
$$ 5413 43665 68388 137513 64868 82756 136666 264154 201919 129658 -47047 -193139
21788a93139q2246p3802J02480Q0513j9461j01751J69754J23552K041N297j3627
$$ -193139 -275385 -349187 -246707 -166194 -185655 -287406 -117652 5900 7941 13238 -389
21777c89R2011J18829J05150j98541k75155M5988O4047j8594r4340n2883L3178
$$ -389 91622 210451 315601 117060 -158095 -112107 -48060 -66654 -160994 -213877 -180699
21766a80699O7395M413o0551j88071K8567K17700j6642l2170K7012Q3185M5650
$$ -180699 -113304 -108891 -169442 -357513 -328946 -111246 -127888 -160058 -133046 -49861 -4211
21755d211k187q1280q8611L9747K4532p1284K6479L9746J17158J25293P2112m2850
$$ -4211 -6398 -87678 -176289 -136542 -112010 -183294 -156815 -117069 89 125382 197494 154644
21743A54644o7133L846L8370o7572K5012J3363J25227k9859k3075o9613r8653
$$ 154644 87511 91357 129727 62155 87167 100530 225757 195898 172823 103210 4557
21732D557o1382p6299p3151k042j02908K1044L5895r793M7809K08189K2277j32037
$$ 4557 -56825 -133124 -206275 -208317 -311225 -290181 -254286 -264079 -216270 -8081 14196 -117841
21720a17841j95867j21597K49319K13321l2988j184j35205K6978K5534J16506
$$ -117841 -313708 -435305 -185986 27335 -5653 -6837 -142042 -115064 -89530 26976
21710B6976K342l5027J04892j06201o6947J24742m3488J079n0741N3012J59883
$$ 26976 29318 -5709 99183 -7018 -73965 50777 7289 8368 -42373 10639 170522
21699A70522q9351m1569L4207j06685o9394J30410J07908j3285o2920M5353O7914
$$ 170522 81171 39602 73809 -32876 -102270 28140 136048 122763 59843 105196 173110
21688A73110j00114j08943q3690J39390J36294n161r2953R9531P05j90425P7721
$$ 173110 72996 -35947 -119637 19753 156047 150886 57933 157464 158169 -32256 45465
21677D5465J92102P2008j05250n0270r5925N1363Q2374n796J13747p7614K0822
$$ 45465 237567 309575 204325 154055 58130 109493 191867 186071 299818 222204 243026
21666B43026m4601k75211j18730M5550J42597K23078J4005j17859M2105j7510
$$ 243026 198425 -76786 -195516 -149966 -7369 215709 229714 111855 153960 136450
21656A36450J11224J4676k11109r3721m2714M3324n6797m7895N4102J21072m6054
$$ 136450 247674 262350 51241 -42480 -85194 -41870 -98667 -146562 -92460 28612 -17442
21645a7442j14385p6550J53589J39151p7469J9650K7231n3781r9443j05654N5837
$$ -17442 -131827 -208377 -54788 84363 6894 26544 53775 -6 -99449 -205103 -149266
21634a49266M2140k699o1364L8449R1801J34664O6340j42045k54351j52496O7445
$$ -149266 -107126 -109825 -171189 -132740 -40939 93725 160065 18020 -236331 -388827 -321382
21623c21382K04581J25348o5450k8549j1847k3336j11665J4361J08092j24o6494
$$ -321382 -116801 8547 -56903 -85452 -97299 -120635 -232300 -217939 -109847 -109971 -176465
21612a76465O9067J23061N3473k37226j45768Q5026J31943M3463r8066K08268
$$ -176465 -107398 15663 69136 -168090 -313858 -228832 -96889 -53426 -151492 56776
21602E6776j11786M117P0029n9788j78266R6361J03308K0764l2396p2447L3571
$$ 56776 -55010 -50893 19136 -40652 -218918 -122557 -19249 1515 -30881 -103328 -69757
21591f9757N6028m8777N3063J8844l0905o4941j741K12124Q731r9813j27652l0629
$$ -69757 -13729 -62506 -9443 9401 -21504 -86445 -88186 123938 132669 32856 -94796 -125425
21579a25425J36236J23346N6367k3375q615k6564j40746p4175p199j00070q0372
$$ -125425 10811 134157 190524 167149 158534 131970 -8776 -82951 -90150 -190220 -270592
21568b70592L1684J28742J36637k09999j25106J57872J37624n6169n466o1718
$$ -270592 -238908 -110166 26471 -183528 -308634 -150762 -13138 -69307 -74773 -136491
21558a36491K9196n9908j4666J21105O1817O2964O9210O4076r4062J38012l9170
$$ -136491 -107295 -167203 -181869 -60764 1053 64017 133227 197303 103241 241253 202083
21547B02083j51896l5959r1253k8851J64470R0352N8486k0817n7415k210q5410
$$ 202083 50187 14228 -77025 -105876 58594 148946 207432 186615 129200 126990 41580
21536D1580j7318m9264N6915P9171J3251j30023j99814n1443K09276J37783l4398
$$ 41580 24262 -25002 31913 111084 124335 -5688 -205502 -256945 -47669 90114 55716
21525E5716k797k39236q2993J31014J36797j45764p4742O7101n014L7494J01684
$$ 55716 52919 -186317 -269310 -138296 -1499 -147263 -222005 -154904 -159918 -122424 -20740
21514b0740l2421L654Q274O4206Q8467q2912O299J33411Q151p0524K9459n5009
$$ -20740 -53161 -49507 -41233 22973 111440 28528 34827 168238 176389 105865 135324 80315
21502H0315n189p6052K6436j07346Q3969j57666r7056L36958M1872j94239J06667
$$ 80315 75126 -926 25510 -81836 2133 -155533 -252589 84369 126241 -67998 38669
21491C8669J90372p6438j02947n5302j4793L6600R4749q167k1189o9578O968k4333
$$ 38669 229041 152603 49656 -5646 -20439 16161 110910 102743 81554 11976 18944 -5389
21479e389l7956j36149J17551J19180J02281m7182n8351K8457o0916P3687J48946
$$ -5389 -43345 -179494 -61943 57237 159518 112336 53985 82442 21526 95213 244159
21468B44159J9683J02699j53254j66287q9281P6478Q5538O3640O8869j20174L2611
$$ 244159 263842 366541 213287 47000 -42281 34197 119735 183375 252244 132070 164681
21457A64681k1630l3611q3347L7263q411j87644R6697p1384N6403J46739J65979
$$ 164681 143051 109440 26093 63356 54945 -132699 -36002 -107386 -50983 95756 261735
21446B61735N5316r9878m2143L8660K5556q071j62224N8830K3397n9705k86073
$$ 261735 317051 217173 175030 213690 239246 231175 68951 127781 151178 91473 -194600
21435a94600N3565K08166P6382o9676L3864P5197M4619j16279j21835N4923P7363
$$ -194600 -141035 67131 143513 73837 107701 182898 227517 111238 -10597 44326 121689
21424A21689j13466M0943J10935j42482j51882J28076J35558n9532N0880J56575
$$ 121689 8223 49166 160101 17619 -134263 -6187 129371 69839 120719 277294
21414B77294n3770R5876K3292j64844j91412J02509j3423j2329r4998J3565P6801
$$ 277294 223524 319400 342692 177848 -13564 88945 75522 63193 -31805 -18240 58561
21403E8561J1311m5690O3453k2918j95324j68375K3291J72299L3977n9331R8540
$$ 58561 69872 24182 87635 64717 -130607 -298982 -275691 -103392 -69415 -128746 -30206
21392c0206j19332q2077J98090p6247k1988J22175J6454N9294L2424k5349p7718
$$ -30206 -149538 -231615 -33525 -109772 -131760 -9585 6869 66163 98587 73238 -4480
21381d480o5571o3580R7552m8964p2809K6748J10838j1376O5103K4274k9433L0092
$$ -4480 -70051 -133631 -36079 -85043 -157852 -131104 -20266 -31642 33461 57735 28302 58394
21369E8394m0399j39078J6592J00916q0787p0698J4092j890m8384p3297k5431
$$ 58394 17995 -121083 -104491 -3575 -84362 -155060 -140968 -142858 -191242 -264539 -289970
21358b89970M546R3896J23422N6988L8734J83773j52774j51743P052J23882j1243
$$ -289970 -285424 -191528 -68106 -11118 27616 211389 58615 -93128 -86076 37806 26563
21347B6563k0760j21040O0886j03977l8965N4068j1251n2874Q8500J46720J74491
$$ 26563 5803 -115237 -54351 -158328 -197293 -143225 -154476 -207350 -118850 27870 202361
21336B02361Q6452R215r239P2433J5734R512k73339j23701J5893K67133K7185
$$ 202361 288813 298028 288789 361222 376956 386468 113129 -10572 5321 272454 299639
21325B99639j76985M5308q6877J00579P0552q699j06224j50445l207K47395J41430
$$ 299639 122654 167962 81085 181664 252216 243517 137293 -13152 -16359 231036 372466
21314C72466j92402j60168m6448l4462o0178l0706k67L2049K9568P6005Q611k5533
$$ 372466 180064 19896 -26552 -61014 -121192 -151898 -152165 -120116 -90548 -14543 -5932 -31465
21302c1465n3558J9867L40099J864k20160p4567J22319j158j11717m4119l292
$$ -31465 -85023 -65156 274943 276807 56647 -17920 104399 103241 -8476 -52595 -55887
21291e5887J25062J10384m7253j03576o4438J11607J85853n360j42361l9551l2866
$$ -55887 69175 179559 132306 28730 -35708 75899 261752 256392 114031 74480 41614
21280D1614l3375n015r7099k562J29080j3385K6981q9429l3459q5645N1060q607
$$ 41614 8239 3224 -93875 -96437 32643 19258 46239 -43190 -76649 -162294 -111234 -119841
21268a19841J08237Q1223m4320l4117q2244L4868m1584J0048n7925J6421N3726
$$ -119841 -11604 69619 25299 -8818 -91062 -56194 -97778 -87730 -145655 -129234 -75508
21257g5508Q7473J86875M481j10767Q4399R52o3426j33318J6103r45m3402j17590
$$ -75508 11965 198840 203321 92554 176953 177905 114479 -18839 -2736 -3681 -47083 -164673
21245a64673P6215k6529O9798O2079K9210k4053j20794O4928J54907J89412l9222
$$ -164673 -88458 -114987 -45189 16890 46100 22047 -98747 -33819 121088 310500 271278
21234B71278k19964j95722m2759J27876O6980l9877K2359J28575J16035J29379
$$ 271278 51314 -144408 -187167 -59291 7689 -32188 -9829 118746 234781 364160
21224C64160n9113r4549r5932l4824j18906K1693J42826j8929j9925O9021Q0848
$$ 364160 305047 210498 114566 79742 -39164 -17471 125355 106426 86501 155522 236370
21213B36370j00433j22183r1395M3786n9560j6961L6029J23717j82223n2081R9988
$$ 236370 135937 13754 -77641 -33855 -93415 -110376 -74347 49370 -132853 -184934 -84946
21202h4946j62982m5003R3803K07208P7388j34513j3462p3777r3595J15539K13753
$$ -84946 -247928 -292931 -199128 8080 85468 -49045 -62507 -136284 -229879 -114340 99413
21191I9413K20594k25488k7074k0486J49028q4077q0445O6312j17295o0828J13417
$$ 99413 320007 94519 67445 46959 195987 111910 31465 97777 -19518 -80346 33071
21180C3071p844j30237o7048K8807L0143J64160K24338m9601j97079j01693M4814
$$ 33071 25227 -105010 -172058 -143251 -113108 51052 275390 225789 28710 -72983 -28169
21169b8169J23352J05334r6415j10143M2296r8059j12503L7727M2081P2758R265
$$ -28169 95183 200517 104102 -6041 36255 -61804 -174307 -136580 -94499 -21741 -12476
21158a2476o1339n7964j71l783N6135j7381N7530m3753p407N6761N9278M2816
$$ -12476 -73815 -131779 -131950 -135733 -79598 -96979 -39449 -83202 -90609 -33848 25430 68246
21146F8246R617m6149j16052P5907j683R7819j56499m3030K6657p1787m9299j00483
$$ 68246 77863 31714 -84338 -8431 -10114 87705 -68794 -111824 -85167 -156954 -206253 -306736
21134c06736j16676J81983M5554K8162Q1454L5202m3170j08373J45295J53349
$$ -306736 -423412 -241429 -195875 -167713 -86259 -51057 -94227 -202600 -57305 96044
21124I6044k9504m9159K886J9315o6688r0671P4708J85960m9637k22526n6510
$$ 96044 66540 17381 20267 39582 -27106 -117777 -43069 142891 93254 -129272 -185782
21113a85782J37093N3089Q3108k7767j92226j34110K3947K78769K25766k2001
$$ -185782 -48689 4400 87508 59741 -132485 -266595 -242648 36121 261887 239886
21103B39886L0805M0893j36433p0192r3221r1141M553K8324k3774j8907q0142
$$ 239886 270691 311584 175151 104959 11738 -79403 -74850 -46526 -70300 -89207 -169349
21092a69349M8501L1520J22316l1689l3893L3214k2477J54730j65461q008J13767
$$ -169349 -120848 -89328 32988 1299 -32594 620 -21857 132873 -32588 -40596 73171
21081G3171j41936j54110K5851R8993r664n4727J41130J32574p9345k88323Q459
$$ 73171 -68765 -222875 -197024 -98031 -107695 -162422 -21292 111282 31937 -256386 -247927
21070b47927J4731J4639L8045O1787m919k6608n6429P0884o641j33376k3228J34522
$$ -247927 -233196 -218557 -180512 -118725 -123644 -150252 -206681 -135797 -142438 -275814 -299042 -164520
21058a64520J19586j536j4720p189J22346o3169r1680K0957J83341m5531k33636
$$ -164520 -44934 -46470 -61190 -68379 53967 -9202 -100882 -79925 103416 57885 -175751
21047a75751j1269J0314J43047M6621R1659P2948j85235j35321J38405K9051j11450
$$ -175751 -187020 -176706 -33659 12962 104621 177569 -7666 -142987 -4582 24469 -86981
21036h6981j24250o063m138K5984K3606O8317l6175J7546J33869M5848o3393o5183
$$ -86981 -211231 -217294 -221432 -195448 -171842 -103525 -139700 -122154 11715 57563 -5830 -71013
21024g1013k6532P01J13280K8107J529J1900R3744j6313p2673j9640j23181j4475
$$ -71013 -97545 -96844 16436 44543 46072 57972 151716 135403 62730 43090 -80091 -94566
21012i4566k8393L695L8468J65528J436R9571l7751L6713M7273l6349m7540Q2475
$$ -94566 -122959 -119264 -80796 84732 86168 185739 147988 184701 231974 195625 148085 230560
21000B30560p5600j52829Q73n1915k4938J17306q3031k68078o8974K8967J29136
$$ 230560 154960 2131 3004 -48911 -73849 43457 -39574 -307652 -376626 -347659 -218523
20989b18523J34676p7708j74242J41683P3392J42436L138J9719j46021j53800
$$ -218523 -83847 -161555 -335797 -194114 -120722 21714 24852 44571 -101450 -255250
20979b55250j8732O9141K20806M2442j30838l3502q259j35226j883J80629O7942
$$ -255250 -273982 -204841 15965 58407 -72431 -105933 -114192 -249418 -251301 -70672 -2730
20968b730J08137o3835k07997j32736j7447J14059K746J09885n7393o5653Q6749
$$ -2730 105407 41572 -166425 -299161 -316608 -202549 -199803 -89918 -147311 -212964 -126215
20957a26215l4633N598j05826M5960J00114q4058o5690N1767l4160M9550L0020
$$ -126215 -160848 -155250 -261076 -215116 -115002 -199060 -264750 -212983 -247143 -197593 -167573
20946a67573O8924J81416M3011J6703j05739k57779J2659N5608J12679J2846r3426
$$ -167573 -98649 82767 125778 142481 36742 -221037 -208378 -152770 -40091 -27245 -120671
20935a20671k2253k7338q0654J23303j0116J6947L97m6438Q8596K1950j53090
$$ -120671 -142924 -170262 -250916 -127613 -137729 -120782 -120385 -166823 -78227 -56277 -209367
20924b09367m343P3768K225q5620j43693M3216Q9331K05815J43323l8402o0778
$$ -209367 -213710 -139942 -137717 -223337 -367030 -323814 -234483 -28668 114655 76253 15475
20913A5475j2722j5399l7248j75866L3367J03986J8094J20772J5503n9883q8689
$$ 15475 2753 -12646 -49894 -225760 -192393 -88407 -70313 50459 65962 6079 -82610
20902h2610M5305J07803J48440o7651r0140p9237l6020o7352j39477o544M5632
$$ -82610 -37305 70498 218938 151287 61147 -18090 -54110 -121462 -260939 -267483 -221851
20891b21851O1440O0377j1266L9660J15495J70510q4039j39781j13894N7766J9456
$$ -221851 -160411 -100034 -111300 -71640 43855 214365 130326 -9455 -123349 -65583 -46127
20880d6127j1772l2676k24417j32524k3591O6318J76297K40767n625k9308p1244
$$ -46127 -57899 -90575 -314992 -447516 -471107 -404789 -228492 12275 6650 -22658 -93902
20869i3902Q312J33712J18832j69974m9425J52217J4923M6714j89r0079q8422
$$ -93902 -85590 48122 166954 -3020 -52445 99772 114695 161409 161220 71141 -17281
20858a7281j72495p7536J99827J79545j0987j44643m1758L4126M2834J09993J48071
$$ -17281 -189776 -267312 -67485 112060 101073 -43570 -85328 -51202 -8368 101625 249696
20847B49696l6138k63541J6548K7235j4875j7192K09020R5402r1464r9230j11310
$$ 249696 213558 -49983 -33435 -6200 -21075 -38267 170753 266155 174691 75461 -35849
20836c5849P4247J73885l2787k36938K2768K14034l5270j98669p4491j25825J38434
$$ -35849 38398 212283 179496 -57442 -34674 179360 144090 -54579 -129070 -254895 -116461
20825a16461J80313r6586p5608L9621k4920j01952N2596J066J9714q2347M0087
$$ -116461 63852 -32734 -108342 -68721 -93641 -195593 -142997 -141931 -122217 -204564 -164477
20814a64477J62185J49421p1578j05809J22514O2529n1210k19325n2274K3463
$$ -164477 -2292 147129 75551 -30258 92256 154785 103575 -115750 -168024 -144561
20804a44561k6159J40674J58700l5510j91537j26110j3224j8017l8525J92005
$$ -144561 -170720 -30046 128654 93144 -98393 -224503 -237727 -255744 -294269 -102264
20794a02264K04819k8781J44314p755N579j54407j06116n0480m2168N2922j1852
$$ -102264 102555 73774 218088 210333 215912 61505 -44611 -95091 -137259 -84337 -96189
20783i6189j39207m15J70927k2378j46954L2736L5249o4472j02116Q7159J98189
$$ -96189 -235396 -235811 -64884 -87262 -234216 -201480 -166231 -230703 -332819 -245660 -47471
20772d7471R4408K6717j88537q6550K9904J43326O2767j06759j44183J92494L8091
$$ -47471 46937 73654 -114883 -201433 -171529 -28203 34564 -72195 -216378 -23884 14207
20761A4207J3848R040q3403O9625L5396Q0286O1348l6601j59581k9548O691P4658
$$ 14207 28055 37095 -46308 23317 58713 138999 200347 163746 4165 -25383 -18692 55966
20749E5966O9440j6873n6928m569j39123n320J1180j05225R035R6014N3136k3461
$$ 55966 125406 108533 51605 47036 -92087 -97407 -86227 -191452 -182417 -86403 -33267 -56728
20737e6728l1330n0419j19338K6400L9417J20439j13262J43452J55663m6354j3710
$$ -56728 -88058 -138477 -257815 -231415 -191998 -71559 -184821 -41369 114294 67940 54230
20726E4230j10037q1003J11748R0794P692j19986j45834K57338R5052j63520J6574
$$ 54230 -55807 -136810 -25062 65732 73424 -46562 -192396 64942 159994 -3526 13048
20715A3048O5857k358l3057r0664Q5121j9173j03664j08104K0055J04046J28737
$$ 13048 78905 76547 43490 -47174 37947 18774 -84890 -192994 -172939 -68893 59844
20704E9844q8210k0303M6241J65848K3850r9324K2269J63842j02135N0314J42028
$$ 59844 -28366 -48669 -2428 163420 187270 87946 110215 274057 171922 222236 364264
20693C64264j05302j09347L6165O6343k2536j0393j2169J15239j84131n4876j31588
$$ 364264 258962 149615 185780 252123 229587 219194 207025 322264 138133 83257 -48331
20682d8331r1843M1767m1117k8856J07557R490J8422m4620l7689l9493K9492J98002
$$ -48331 -140174 -98407 -139524 -168380 -60823 -51333 -32911 -77531 -115220 -154713 -125221 72781
20670G2781k1910k11413L732J66430J38383J71939k3137J7643q3501p1011m5277
$$ 72781 50871 -160542 -156810 9620 148003 319942 296805 314448 230947 159936 114659
20659A14659p2066n8945j41737L806L4012J44419N52l583K5799L455l3365j2015
$$ 114659 42593 -16352 -158089 -154283 -120271 24148 24700 21117 46916 50371 17006 4991
20647D991m6932J27152N040M8340k4520j0604k5641p358O3919p4352N3900j7178
$$ 4991 -41941 85211 90251 138591 114071 103467 77826 70468 134387 60035 113935 96757
20635I6757j72916R7260K46808O085j74379q3548m5114j60314J4032Q2156J25791
$$ 96757 -76159 21101 267909 273994 99615 16067 -29047 -189361 -175329 -93173 32618
20624C2618l7916r9835p664K1986K8946M9044o5020j31862n0556Q0976J86909
$$ 32618 -5298 -105133 -112797 -90811 -61865 -12821 -77841 -209703 -260259 -179283 7626
20613G626P393M3537Q4753j08953r5680p464Q0174l4465m2345K08185J40748K836
$$ 7626 15019 58556 143309 34356 -61324 -68788 11386 -23079 -65424 142761 283509 286345
20601B86345j49427l0979j35429k0019m842k2271j22938J20337L9981K5490J27929
$$ 286345 136918 105939 -29490 -49509 -54351 -76622 -199560 -79223 -39242 -13752 114177
20590A14177K2511k5218O1092o427Q0605m9978R0890J64345j3789j95116o0226
$$ 114177 136688 111470 172562 166135 246740 196762 287652 451997 438208 243092 182866
20579A82866Q054K0496J8628J33796J26301P8306L32679M68313N03490L06118
$$ 182866 190920 211416 230044 363840 490141 568447 901126 1369439 1872929 2179047
20569B179047j2435j59961k45406m13945r9421j8249J76949K37391M20360L15874
$$ 2179047 2166612 2006651 1761245 1347300 1247879 1229630 1406579 1643970 2064330 2380204
20559B380204J73829j92464k50941m76986l67029k28818j59277J59043J2211r2068
$$ 2380204 2554033 2361569 2110628 1633642 1266613 1037795 878518 1037561 1049772 957704
20549I57704J66582J01624n3731m5590n4655j65128J21286J73294p1736k36319
$$ 957704 1124286 1225910 1172179 1126589 1071934 906806 1028092 1201386 1129650 893331
20539H93331j87968J10735P3135k5345J25497J90334j27840j48683N6058M2084
$$ 893331 705363 816098 889233 863888 989385 1179719 1051879 903196 959254 1001338
20529A001338J14397L02865K34549J96342K25348j22489l0118R8628J2929j80078
$$ 1001338 1115735 1418600 1653149 1849491 2074839 1952350 1922232 2020860 2033789 1853711
20519A853711j76605j49366k42093q3919M402Q333m1529J04811L49501L71262
$$ 1853711 1677106 1527740 1285647 1201728 1206130 1214463 1172934 1277745 1627246 1998508
20509A998508L41223P5636k90710m83656m10685k63972p6198j21271p7289q6057
$$ 1998508 2339731 2415367 2124657 1641001 1230316 966344 890146 768875 691586 605529
20499F05529j36473k9354k411m2042j56188j05133p696M2985N4950L8532J18837
$$ 605529 469056 439702 437291 395249 239061 133928 126232 169217 224167 262699 381536
20488C81536p5740k08990n2704J1794J0984K1776q593n0917K38018p5673l00406
$$ 381536 305796 96806 44102 55896 66880 88656 80063 29146 267164 191491 -108915
20477a08915j75848p1258N4450J61227J97211j55968K8075R2554R9392K03985
$$ -108915 -284763 -356021 -301571 -140344 56867 -99101 -71026 21528 120920 324905
20467C24905n7158j37027j42016J0446M5854p965j43108j98900J6226P2942K935
$$ 324905 267747 130720 -11296 -850 45004 37039 -106069 -304969 -288743 -215801 -212866
20456b12866L6128K21591M4523l5949o2013J08211J22632j62466j03967J00663
$$ -212866 -176738 44853 89376 53427 -8586 99625 222257 59791 -44176 56487
20446E6487o362q9321J68369J05593j88444o4990J55524J24513j4730o9104J13
$$ 56487 50125 -39196 129173 234766 46322 -18668 136856 261369 246639 177535 177648
20435A77648J04405o9616N9928N0652J08909p1361j01480j8058r9051r4603j3762
$$ 177648 282053 212437 272365 323017 431926 360565 259085 241027 141976 47373 33611
20424C3611L1944j28815l6648Q0789q5877k5812J49164m2470N8423J00710p8663
$$ 33611 65555 -63260 -99908 -19119 -104996 -130808 18356 -24114 34309 135019 56356
20413E6356k46639n653O4825N665J00510j64808p9632P1851L3778J44332n2218
$$ 56356 -190283 -195936 -131111 -125446 -24936 -189744 -269376 -197525 -163747 -19415 -71633
20402g1633j37178J03984J84784P501k44012k9221r5947J48003J35630O5904j4131
$$ -71633 -208811 -104827 79957 87458 -156554 -185775 -281722 -133719 1911 67815 53684
20391E3684K0386q9746r7816N0430K20389M5222N0341m3303K9451r3907j01901
$$ 53684 74070 -15676 -113492 -63062 157327 202549 252890 209587 239038 145131 43230
20380D3230j57936o6686K3593M5854k15523N4173K34344J65308q1866J0621N0856
$$ 43230 -114706 -181392 -157799 -111945 -327468 -273295 -38951 126357 44491 55112 105968
20369A05968r703j84464j34517P7049J55046J37378j10671j67557P6081j1795
$$ 105968 96265 -88199 -222716 -145667 9379 146757 36086 -131471 -55390 -67185
20359f7185r6779M5471N366J20557k4313J34987q2763q5557n9815M5540K77332
$$ -67185 -163964 -118493 -113127 7430 -16883 118104 35341 -50216 -110031 -64491 212841
20348B12841J5184j78522j71868j10281J5923J4822o8926k353J69162R5333j35464
$$ 212841 228025 49503 -122365 -232646 -216723 -201901 -270827 -273180 -104018 -8685 -144149
20337a44149j9669l552L1265K10966L2677K5831J19169l8171l4106K24037j63593
$$ -144149 -163818 -167370 -136105 74861 107538 133369 252538 214367 180261 404298 240705
20326B40705j84871j48613N2037n474J27380L7927J10017m4944k07423j56385
$$ 240705 55834 -92779 -40742 -46216 81164 119091 229108 184164 -23259 -179644
20316a79644o9669R6499J11341K15242j10751j62980M7994M6318P3594N6189l8315
$$ -179644 -249313 -152814 -41473 173769 63018 -99962 -51968 -5650 67944 124133 85818
20305H5818l9861J4218j10610J2747k1732N6315l2640N8347O3390j15256J4887
$$ 85818 45957 60175 -50435 -37688 -59420 -3105 -35745 22602 85992 -29264 -14377
20294a4377j18649j00659l0119P3051K13049l6922j74920j05964r0682Q2555L4633
$$ -14377 -133026 -233685 -263804 -190753 22296 -14626 -189546 -295510 -386192 -303637 -269004
20283b69004K28851P0036k806p3801J16861j58606p2816n7859k0925K24080R4376
$$ -269004 -40153 29883 27077 -46724 70137 -88469 -161285 -219144 -240069 -15989 78387
20272G8387k6153R6790j00678j24890R4092J21217J94821J3710j79688k27044
$$ 78387 52234 149024 48346 -76544 17548 138765 333586 347296 167608 -59436
20262e9436l0142Q5550j11811j0955K6467L3441m4035k44277o0771P1565L43439
$$ -59436 -89578 -4028 -115839 -126794 -100327 -66886 -110921 -355198 -415969 -344404 -965
20251i65J36525N8737j72925j78518L2673R2993o250J28481k5083k6945m4077
$$ -965 135560 194297 21372 -157146 -124473 -31480 -37730 90751 65668 38723 -5354
20240e354q180J01287l1181j27290K07748M902K982Q2512j75355j65911J22525
$$ -5354 -13534 87753 56572 -70718 137030 141932 144914 227426 52071 -113840 8685
20229H685j11839J1679P5792M238n2736Q8536q3914p1262l9418j30877Q2155L25920
$$ 8685 -103154 -91475 -15683 -11445 -64181 24355 -59559 -130821 -170239 -301116 -218961 106959
20217A06959q103j08505r2869J40849K7504J18154q6420j52395j8271R9887L072
$$ 106959 98856 -9649 -102518 38331 65835 183989 97569 -54826 -73097 26790 29862
20206B9862K6535k0253J36484J04966r2964m9487o2283P7263J4384l6572p7136
$$ 29862 56397 36144 172628 277594 184630 135143 72860 150123 164507 127935 50799
20195E0799k6473J64351o6468r6933L5710o9772J30450O5769M1926J14186k3293
$$ 50799 24326 188677 122209 25276 60986 -8786 121664 187433 229359 343545 320252
20184C20252k15200j95599o2871q1070J30785K35203k7966k06685j61691O4951
$$ 320252 105052 -90547 -153418 -234488 -103703 131500 103534 -103151 -264842 -199891
20174a99891q069J83409l2621r24J43021J2859k1917J85360n1087j66283j83720
$$ -199891 -207960 -24551 -57172 -58096 84925 97784 75867 261227 210140 43857 -139863
20163a39863j37239J7453j2159K33423O722P855m2856J1385J33139r623k0348
$$ -139863 -277102 -259649 -271808 -38385 -31663 -23808 -66664 -55279 77860 68237 47889
20152D7889o7985j27933J3403P7399K1863O6930j11171j7063n4043k02560j1090
$$ 47889 -20096 -148029 -134626 -57227 -35364 31566 -79605 -96668 -150711 -353271 -364361
20141c64361K72952M3182M0955J48093r0754p5750R5024L5922M5005N4064j12065
$$ -364361 -91409 -48227 -7272 140821 50067 -25683 69341 105263 150268 204332 92267
20130I2267o7245Q181j20883Q5846j08425j16407q8512J52245l1645j1739J18790
$$ 92267 25022 33203 -87680 -1834 -110259 -226666 -315178 -162933 -194578 -206317 -87527
20119h7527j3419j37674J704N6799J46868m0896L0532J63063j51213j53634L3931
$$ -87527 -100946 -238620 -236916 -180117 -33249 -74145 -43613 119450 -31763 -185397 -151466
20108a51466k7308L1528J23926P5765j1316j11473L5105M9275Q6858k1918J7882
$$ -151466 -178774 -147246 -23320 52445 41129 -70344 -35239 14036 100894 78976 96858
20097I6858m7926j30954J6432j969L6084K5953l8560L2900L0169q2369r75j6641
$$ 96858 48932 -82022 -65590 -67559 -31475 -5522 -44082 -11182 18987 -63382 -64357 -80998
20085h0998q664J00195k6785o3002J15168J03755m1896m2277j47056Q6470J28043
$$ -80998 -89662 10533 -16252 -79254 35914 139669 97773 55496 -91560 -5090 122953
20074A22953n4j70460q975P0901J32875P3199j9682n8781j49697J274K088J04596
$$ 122953 122899 -47561 -56536 14365 147240 220439 200757 141976 -7721 -6447 -4359 100237
20062A00237M3315m9915q8647l8517p2889j7131p3861Q2883L6007K17114Q9797
$$ 100237 143552 93637 4990 -33527 -106416 -123547 -197408 -114525 -78518 138596 228393
20051B28393j7540j39974j48516J2910n7133K0388J51590K5509j33110K8259J63991
$$ 228393 210853 70879 -77637 -64727 -121860 -101472 50118 75627 -57483 -29224 134767
20040A34767N1116m9889m6550J02203M4381J67060J0945n2262j66696k25166K6790
$$ 134767 185883 135994 89444 191647 236028 403088 414033 361771 195075 -30091 -3301
20029c301k0265j62959o7621j47394p0327L78620K58937o7293j4206N1503r2608
$$ -3301 -23566 -186525 -254146 -401540 -471867 -93247 165690 98397 84191 135694 43086
20018D3086j13450j1304J25334K2641j24566K0477J17083J08040O303j25218J10863
$$ 43086 -70364 -81668 43666 66307 -58259 -37782 79301 187341 193644 68426 179289
20007A79289J05289r441M3564o0701m0489M2931k6284r0679j18642r3955p2827
$$ 179289 284578 275137 318701 258000 217511 260442 234158 143479 24837 -69118 -141945
19996a41945P0449J82337J7805J03775J31406j4478l8794j88548k08581j10021
$$ -141945 -71496 110841 128646 232421 363827 349349 310555 122007 -86574 -196595
19986a96595J26593L5356J47J27130n1051J1221K779n8809N5989Q3269k8830r5877
$$ -196595 -70002 -34646 -34499 92631 41580 52801 55580 -3229 52760 136029 107199 11322
19974A1322k62107M9004j08458o017N8107J50395q2207o8495n3511Q1190N9144
$$ 11322 -250785 -201781 -310239 -316256 -258149 -107754 -189961 -258456 -311967 -230777 -171633
19963a71633J03501J48227n5356K8024k3999R7130q3932j5409J31164o4110k8886
$$ -171633 -68132 80095 24739 52763 28764 125894 41962 26553 157717 93607 64721
19952F4721j22620j4256J05074n2067j31134q0674o0268J63417R9918L397p4600
$$ 64721 -57899 -72155 32919 -19148 -150282 -230956 -291224 -127807 -27889 -24492 -99092
19941i9092J6238r3738M1216p752r6945J2519l977K54566J89119l5952k59298
$$ -99092 -82854 -176592 -135376 -143128 -240073 -227554 -231531 23035 212154 176202 -83096
19930h3096l9218J47302J12216l8857q9989n3896p348p1135L2927J4236J55349
$$ -83096 -122314 24988 137204 98347 8358 -45538 -52886 -124021 -91094 -76858 78491
19919G8491J95496j8172j89589j94760o7395J15523N5034p0418L1277J32787Q5691
$$ 78491 273987 255815 66226 -128534 -195929 -80406 -25372 -95790 -64513 68274 153965
19908A53965O5906R7522J19398j54539j20403L7316M2798j88624J4564M2171J11674
$$ 153965 219871 317393 436791 282252 161849 199165 241963 53339 67903 110074 221748
19897B21748P0148n6896P6660j59002j264o1886j33180j59951R3477J93166K20885
$$ 221748 291896 235000 311660 152658 151394 89508 -43672 -203623 -110146 83020 303905
19886C03905j24573j59149J9792J08211j78225N198Q8351j22365j83160J93186
$$ 303905 179332 20183 39975 148186 -30039 -24841 63510 -58855 -242015 -48829
19876d8829J44424j97833m3402J2726J42889J52182o7801k38006J26141K38173
$$ -48829 95595 -102238 -145640 -132914 9975 162157 94356 -143650 -17509 220664
19866B20664k2903j65648m6371o0463J70263K44882j562R0103R2536J13846q3385
$$ 220664 197761 32113 -14258 -74721 95542 340424 338862 428965 521501 635347 551962
19855E51962N3961Q1014L3276r9222R1539L4311J05762J19296k69980k07955J405
$$ 551962 605923 686937 720213 620991 712530 746841 852603 971899 701919 493964 495369
19844D95369J31201l7656k16980K8647J42552J51609J62123j37812L0082o5643
$$ 495369 626570 588914 371934 400581 543133 694742 856865 719053 749135 683492
19834F83492j09589K8824j19906m8499o6204r0965j53828o0712J54029J05621
$$ 683492 573903 602727 482821 434322 368118 277153 123325 62613 216642 322263
19824C22263q9567m9621m0742j63096N4845R3936J14389j23378l4930J72896J00410
$$ 322263 232696 183075 142333 -20763 34082 128018 242407 119029 84099 256995 357405
19813C57405J06392N6875M5977J37246J3118q4465J47874J4336j19197j42874
$$ 357405 463797 520672 566649 703895 717013 632548 780422 794758 675561 532687
19803E32687J06711o4999N5616J69927j4298P8670J0511O4476J08668M2862j27312
$$ 532687 639398 574399 630015 799942 785644 864314 874825 939301 1047969 1090831 963519
19792I63519j78589k61444j37216j14195j15984N896J06592J08127J22409P965
$$ 963519 784930 523486 386270 272075 156091 161987 268579 376706 499115 507080
19782E07080M0008j8675j0985r5653o1599j02949K8503l820j62561J2426n1544
$$ 507080 547088 528413 517428 421775 360176 257227 285730 281910 119349 131775 80231
19771H0231j16583m5429K31240L3927m9824k1725j1591k3417l7919L4521J8477
$$ 80231 -36352 -81781 149459 183386 133562 111837 100246 76829 38910 73431 91908
19760I1908j6738J32053l7489j6816p1357K5018M0529O1265m4287j38121R5537
$$ 91908 75170 207223 169734 152918 81561 106579 147108 208373 164086 25965 121502
19749A21502N3158j57984L4629J33774k8778Q589k6666q9995j6197R978M6061
$$ 121502 174660 16676 51305 185079 156301 164890 138224 48229 32032 42010 88071
19738H8071P4620J8467O7457j0494J46910J07920K2310j43294j26822k57103K2713
$$ 88071 162691 181158 248615 238121 385031 492951 515261 371967 245145 -11958 10755
19727A0755K19766J68634N2233l6234J3301K0888J56530n5086k99732p3881J08594
$$ 10755 230521 399155 451388 415154 428455 449343 605873 550787 251055 177174 285768
19716B85768J246Q4298K00632J32018J80436m0163k85114k56403l8850R7023K6642
$$ 285768 287014 371312 571944 703962 884398 844235 559121 302718 263868 360891 387533
19705C87533n7389l0563J83726L16559J05930k63723k14637J89085L13935J2870
$$ 387533 330144 299581 483307 799866 905796 642073 427436 616521 930456 943326
19695I43326j24852p1748j11789l33736m534K64944L8797l1911k00617o1987N5911
$$ 943326 818474 746726 634937 301201 296667 561611 600408 568497 367880 305893 361804
19684C61804J46387Q5487r2783o3550R3913R2209J23573O5803R5987L9905l4666
$$ 361804 508191 593678 500895 437345 531258 623467 747040 812843 908830 948735 914069
19673I14069O8292j79506j66110j19604O073j80412j5892K54030J38900J14484
$$ 914069 982361 802855 636745 517141 523214 342802 326910 580940 719840 834324
19663H34324j84150j33035j7105R9281q8618k9252m197L9828j14571k80060p2223
$$ 834324 650174 517139 500034 599315 510697 481445 477248 517076 402505 122445 50222
19652E0222K07227R312K39899J27930N832q7095j11871j47077J39802m3949j10402
$$ 50222 257449 266761 506660 634590 640422 553327 441456 294379 434181 390232 279830
19641B79830q1629q2237k5910j43987M1938J26458q226n0734p7152j26672j33630
$$ 279830 198201 115964 90054 -53933 -11995 114463 106237 55503 -21649 -148321 -281951
19630b81951O8372J18012J67895L841p9992Q5104N6057J5446J09431q4517m1039
$$ -281951 -213579 -95567 72328 76169 -3823 81281 137338 152784 262215 177698 136659
19619A36659q1263J04837m4109Q960J49906J53918j11309j33131n5736p2798J08240
$$ 136659 55396 160233 116124 125084 274990 428908 317599 184468 128732 55934 164174
19608A64174M6017M0269q6393k6156K4002J56875K7703l7555j91677Q9246J22124
$$ 164174 210191 250460 164067 137911 161913 318788 346491 308936 117259 206505 328629
19597C28629j6908p5654P8526n3711k9180K1123J6081m8242J76927l6488j70137
$$ 328629 311721 236067 314593 260882 231702 252825 268906 220664 397591 361103 190966
19586A90966k5421K0997p9610r9448J10714l6246P0483J17125J43342p0156p8089
$$ 190966 165545 186542 106932 7484 118198 81952 152435 269560 412902 342746 264657
19575B64657M1583o4066k41455J4735Q2465J1357l8891j49j43703n0452K00299
$$ 264657 306240 242174 719 15454 97919 109276 70385 70236 -73467 -123919 76380
19564G6380J56361J445j9884j21719j69099p1186j60424J28038K48477K33051
$$ 76380 232741 234186 214302 92583 -76516 -147702 -308126 -180088 68389 301440
19554C01440K4379j00488o4153J14439m8717j22108j0457L6973j1673L666N4992
$$ 301440 325819 225331 161178 275617 226900 104792 94335 131308 119635 123301 178293
19543A78293J45999r072Q6608O7208j78545o5675M5859J40793o5266m2201n3503
$$ 178293 324292 315220 401828 469036 290491 224816 270675 411468 346202 304001 250498
19532B50498J40662J51206j19524L926K3676p7255j93154j93208J3590J20740
$$ 250498 391160 542366 422842 426768 450444 373189 180035 -13173 417 121157
19522A21157J29474J34731p4280p6282j8931o2347k9655k6333n3019j32989j29984
$$ 121157 250631 385362 311082 234800 215869 153522 123867 97534 44515 -88474 -218458
19511b18458J17191K77481K5183m9453L0194O8362J6838K385k34493K08142P5837
$$ -218458 -101267 176214 201397 151944 182138 250500 267338 269723 35230 243372 319209
19500C19209j08429L0545l49K23323n383n4911j29039j63907j74172J40013Q3031
$$ 319209 210780 241325 240976 464299 458916 404005 274966 111059 -63113 76900 159931
19489A59931L9720j03991J5500K8876q59L6396o6406n662O3344r6430K2228N9417
$$ 159931 199651 95660 111160 140036 139177 175573 109167 103505 166849 70419 92647 152064
19477A52064K08766Q0313O8039J01571j01153J6645k9736j31790j99604n6332
$$ 152064 360830 441143 509182 610753 509600 526245 496509 364719 165115 108783
19467A08783J91633K21712K0461J25530J40111j46275q4165j20645Q7540n3117
$$ 108783 300416 522128 542589 668119 808230 661955 577790 457145 544685 491568
19457D91568q8216m3647K7506J14388J18525k08395j04100L2706K16577q2237
$$ 491568 403352 359705 387211 501599 620124 411729 307629 340335 556912 474675
19447D74675l790l4342p0849o8794p5204J35370N3184r7171N8073P2386L3565
$$ 474675 470885 436543 365694 296900 221696 357066 410250 313079 371152 443538 477103
19436D77103j4525r3115m5205Q5819J81905O727J45659K85552n1204j71026j507
$$ 477103 462578 369463 324258 410077 591982 598709 744368 1029920 978716 807690 806183
19425H06183j08440J11166J39621q5712K1818N7701J48743l6019j87177p629m5578
$$ 806183 697743 808909 948530 862818 884636 942337 1091080 1055061 867884 860255 814677
19414H14677J15224K00488J95043J71466P1286j63251K1626P1930P6602k9784
$$ 814677 929901 1130389 1325432 1496898 1568184 1404933 1426559 1498489 1575091 1545307
19404A545307j74770j43714k142p3043k496L5442R4609J82362K6641k6973j68513
$$ 1545307 1370537 1226823 1224681 1151638 1149142 1184584 1279193 1461555 1488196 1461223 1292710
19393A292710R5870J05353Q4768K09903K48270J06229o5085M8714J09166R7829
$$ 1292710 1388580 1493933 1578701 1788604 2036874 2143103 2078018 2126732 2235898 2333727
19383B333727R8170k9889J18885J73733J65092K37183J66902J65373L16672M99843
$$ 2333727 2431897 2402008 2520893 2694626 2859718 3096901 3263803 3429176 3745848 4245691
19373D245691K69571K65984K08719K86675M29989K13905J60947O48602Q92710
$$ 4245691 4515262 4781246 4989965 5276640 5706629 5920534 6081481 6730083 7622793
19364G622793J027125J143735J226089J405288J649420J973258K310957L154332
$$ 7622793 8649918 9793653 11019742 12425030 14074450 16047708 18358665 21512997
19356B1512997M929497P368812J0214370J2931377J4976750J7278006K0814529
$$ 21512997 26442494 33811306 44025676 56957053 71933803 89211809 110026338
19349A10026338K4266693J9999926M276638j3487279k4502051k0593103q423484
$$ 110026338 134293031 154292957 158569595 145082316 120580265 99987162 91563678
19342I1563678L996156J3411043K0860996K7967013K7017641J3951390n419266
$$ 91563678 95559834 108970877 129831873 157798886 184816527 198767917 193348651
19335A93348651k3422611k8488790k4574086k0526418j7668473j5561152j1699410
$$ 193348651 169926040 141437250 116863164 96336746 78668273 63107121 51407711
19328E1407711o347635j390132L179174O013244N255497K65163n609072r255448
$$ 51407711 45060076 43669944 46849118 52862362 58117859 58383022 52773950 43518502
19320D3518502q782647o138322l676298j868801q61849j23782M97743J296651
$$ 43518502 34735855 28597533 24921235 23052434 22190585 22066803 22564546 23861197
19312B3861197K507337L709582N214609Q355776J3512365J9168445J8560185R824512
$$ 23861197 26368534 30078116 35292725 43648501 57160866 76329311 94889496 104714008
19304A04714008j337125p704642m555218L628523Q704472J0784018J4423736K3323235
$$ 104714008 103376883 95672241 91117023 94745546 103450018 114234036 128657772 151981007
19296A51981007L1924703K5250408N212119j7074401k8182322k2211812j0920156
$$ 151981007 183905710 209156118 214368237 197293836 169111514 146899702 135979546
19289A35979546J390245J3386471J9678411J0947495r880964l0227623l8817195
$$ 135979546 137369791 150756262 170434673 181382168 171501204 141273581 102456386
19282A02456386l2110052k0945991j2547175p873833n307625l438478k129093
$$ 102456386 70346334 49400343 36853168 28979335 23671710 20233232 18104139
19275A8104139q25161Q9192J134132K322426K281200P26002j475643l366291l953132
$$ 18104139 17278978 17368170 18502302 20824728 23105928 23831930 22356287 18989996 15036864
19266A5036864l141507j942561j371441r45416n84754m12638m69905l46729l60373
$$ 15036864 11895357 9952796 8581355 7635939 7051185 6638547 6168642 5821913 5461540
19257E461540k97106k47771J8588J05399L28558O25990K34563K5018N321J67916
$$ 5461540 5164434 4916663 4935251 5040650 5369208 5995198 6229761 6254779 6260100 6428016
19247F428016L44234K48416O7090J98952O96218J459251K095765K133181J748492
$$ 6428016 6772250 7020666 7087756 7286708 7982926 9442177 11537942 13671123 15419615
19238A5419615R56811K15218q76625j517235j611371j241701p84363k19253L73531
$$ 15419615 16376426 16591644 15715019 14197784 12586413 11344712 10560349 10341096 10714627
19229A0714627P54563J105316J297728J787310K857500M383122N460207N025260
$$ 10714627 11469190 12574506 13872234 15659544 18517044 22900166 28360373 33385633
19221C3385633L912528L520925L676931L572932L800522O117735J2782366K2425044
$$ 33385633 37298161 40819086 44496017 48068949 51869471 57987206 70769572 93194616
19213I3194616K5272600J3880543l582289j7427363j9932539j3961137p405657
$$ 93194616 118467216 132347759 128765470 111338107 91405568 77444431 70038774
19206G0038774j471943M456458N644672J800766l069913m090405L84701M494072
$$ 70038774 68566831 73023289 78667961 80468727 77398814 73308409 73693110 78187182
19198G8187182L834050m5308k588285k33709O833735J5074773J8758586J4961076
$$ 78187182 82021232 81975924 79387639 79153930 85987665 101062438 119821024 134782100
19190A34782100P527441K026797l210777r620426j6515429j9987100j5907614
$$ 134782100 142309541 144336338 141125561 131505135 114989706 95002606 79094992
19183G9094992p546838J304680R933968J5172655J1684741R72167j0724816j6517754
$$ 79094992 71548154 72852834 82786802 97959457 109644198 110616365 99891549 83373795
19175H3373795j3127279o089970J60432M711613J0086477J7453859K3038604J9542783
$$ 83373795 70246516 64156546 64316978 69028591 79115068 96568927 119607531 139150314
19167A39150314Q510584n408982j4965778j5762414j1233996l290796J800945
$$ 139150314 147660898 142251916 127286138 111523724 100289728 96998932 98799877
19160I8799877j129611p746704j2611033j0563675l344301N054941J4628005K5168507
$$ 98799877 97670266 89923562 77312529 66748854 63404553 68459494 83087499 108256006
19152A08256006L0971531K1057247p53758k1218415k9727265k4714624j7750127
$$ 108256006 139227537 160284784 159531026 138312611 108585346 83870722 66120595
19145F6120595j4112904j1867342r235690o193252l634503j975466n39484J045742
$$ 66120595 52007691 40140349 30904659 24711407 21076904 19101438 18561954 19607696
19137A9607696K444675K873562J708137q02348k890979l864363l253775j968371
$$ 19607696 22052371 24925933 26634070 25831722 22940743 19076380 15822605 13854234
19129A3854234n49745O54803J577809J500256J86341j190550k044653j526575
$$ 13854234 13304489 13959292 15537101 17037357 17223698 16033148 13988495 12461920
19121A2461920l61527j26782m55496r04024j108616j005772o85583p43501p72448
$$ 12461920 12100393 11973611 11518115 10614091 9505475 8499703 7814120 7070619 6298171
19112F298171r65766r98404p80286l98964k66575l17666k87284l46410l41575
$$ 6298171 5332405 4334001 3553715 3154751 2888176 2570510 2283226 1936816 1595241
19103A595241j66015j4598J03763Q982p0678o4241n8372p9808j14071J9997J00886
$$ 1595241 1429226 1414628 1518391 1527373 1456695 1392454 1334082 1254274 1140203 1160200 1261086
19092A261086J9723m9968n9752k77571j68659l5893J00231J74472M9934L5582
$$ 1261086 1280809 1230841 1171089 893518 724859 688966 789197 963669 1013603 1049185
19082A049185l1347L8324j79586k19928m0942J30473m6110J41573q9913j10133
$$ 1049185 1017838 1056162 876576 656648 615706 746179 700069 841642 751729 641596
19072F41596L872J15086J87995j21163r1142p760L2521q6329p205l2146M3572
$$ 641596 645468 760554 948549 827386 736244 728484 761005 674676 667471 635325 678897
19061F78897J45086Q2497p4407m2008m195K9117j23174Q9543K04606j54772j74552
$$ 678897 823983 906480 832073 790065 785870 814987 691813 781356 985962 831190 656638
19050F56638j09386N5086J03792O2678j60469q9874N2108o0810k75752j13237
$$ 656638 547252 602338 706130 768808 608339 518465 570573 509763 234011 120774
19040A20774J74314Q7354P7136j55293k9362J82371J24373J09974J3206j5573
$$ 120774 295088 382442 459578 304285 274923 457294 581667 691641 704847 689274
19030F89274m0314p520P1542O4835k27888l13622J3392J18585K53955J21697J49074
$$ 689274 648960 641440 712982 777817 549929 236307 249699 368284 622239 743936 893010
19019H93010L7589Q5008j03359j57540m026R0675p206J8972l9621l0743K14648
$$ 893010 930599 1015607 912248 754708 750682 841357 834151 853123 813502 782759 997407
19008I97407J87331j9518j30853j87659j38345q9691J26837P2878l4811R7294
$$ 997407 1184738 1165220 1034367 846708 708363 618672 745509 818387 783576 880870
18998H80870o4055l10277n455J14543j47437j95009l0215J6480R8333J47819K20816
$$ 880870 816815 506538 501083 615626 468189 273180 242965 259445 357778 505597 726413
18987G26413r6045p3304K5952k694K55134J32684j505j57317j483Q2179q575k43356
$$ 726413 630368 557064 583016 580322 835456 968140 966635 809318 807835 890014 881439 638083
18975F38083J92672L16069Q2284J83885K53762q7475j22294j34355j03104p2224
$$ 638083 830755 1146824 1229108 1412993 1666755 1579280 1456986 1322631 1219527 1147303
18965A147303J72058J01578M43359J32843j23165j17168j89926k01867p4363l2992
$$ 1147303 1319361 1420939 1864298 1997141 1873976 1756808 1566882 1365015 1290652 1257660
18955A257660J02550J4465j27862Q1799j81882k98687j80911L0945K7156O1340
$$ 1257660 1360210 1374675 1246813 1328612 1146730 848043 667132 698077 725233 786573
18945G86573J86972J53374J32542p8732m1894m0949O4638j02163k24989N1536
$$ 786573 973545 1126919 1259461 1180729 1138835 1097886 1162524 1060361 835372 886908
18935H86908K17813j08416j16218J17821M0060J53274J69727J97729K47744J43946
$$ 886908 1104721 996305 880087 997908 1037968 1191242 1360969 1558698 1806442 1950388
18925A950388l9664p8166O4944j6464j44251m3626k4871M6086J13497k9647j52656
$$ 1950388 1910724 1832558 1897502 1881038 1736787 1693161 1668290 1714376 1827873 1798226 1645570
18914A645570j58468n7428j6981k0062n7787K3614j74620j58639q9144R5700j77460
$$ 1645570 1487102 1429674 1412693 1392631 1334844 1358458 1183838 1025199 936055 1031755 854295
18903H54295j24151P7872M4820j02639R0050l298Q9120p493j93633r7013r7180
$$ 854295 730144 808016 852836 750197 840247 836949 926069 918576 724943 627930 530750
18892E30750R9074k9336p034R7046M7616o7505J8357p2670j24561R5404P6776
$$ 530750 629824 600488 593454 690500 738116 670611 688968 616298 491737 587141 663917
18881F63917J07586J08269J00864m5961j12538L7347R1102o1789j43758j22278
$$ 663917 771503 879772 980636 934675 822137 859484 950586 888797 745039 622761
18871F22761j70136J20899K18380M8696j64346l5615J5255m4735J27404R5414
$$ 622761 452625 573524 791904 840600 676254 640639 655894 611159 738563 833977
18861H33977k5761L5822j05017q7953j7608M6452o9994p8778L7539m2398L9265
$$ 833977 808216 844038 739021 651068 633460 679912 609918 531140 568679 526281 565546
18850E65546K0369p1349q0115j42847R0220M5539K5184L2215J25006J51858K0197
$$ 565546 585915 514566 434451 291604 381824 427363 452547 484762 609768 761626 781823
18839G81823K9283j17786j39198R3366Q9482J75057j6894p9208K0363p9878o0091
$$ 781823 811106 693320 554122 647488 736970 912027 895133 815925 836288 756410 696319
18828F96319R1123P3592K22516J28101j40586R1288J41627j66163k26415k76318
$$ 696319 787442 861034 1083550 1211651 1071065 1162353 1303980 1137817 911402 635084
18818F35084l2936J04775N8279j25219j7028n5031q1133q240R840l573K03434
$$ 635084 602148 706923 765202 639983 622955 567924 486791 478551 488391 484818 688252
18807F88252J16941j90691j02558j21371o3162P6487J2120l3674Q4804j18029
$$ 688252 805193 614502 511944 390573 327411 403898 416018 382344 467148 349119
18797C49119J01141K30952K98649r7054j4079J4889j11122O0974K12533O7361
$$ 349119 450260 681212 979861 882807 868728 883617 772495 833469 1046002 1113363
18787A113363k6336K6456l6777k8172k8717M5865l5501n4043n2970J57207l2954
$$ 1113363 1087027 1113483 1076706 1048534 1019817 1065682 1030181 976138 923168 1080375 1047421
18776A047421k09608j22002q1426O1481J60345R8166J47415K17230L32003M45992
$$ 1047421 837813 715811 634385 695866 856211 954377 1101792 1319022 1651025 2097017
18766B097017L36283J05495l16260n72789m53578k81298l11029j71385J24152
$$ 2097017 2433300 2538795 2222535 1649746 1196168 914870 603841 432456 556608
18757E56608j6168j86855R050K14136J0790j35501n5542j3929N034P033K0043
$$ 556608 540440 353585 362635 576771 587561 452060 396518 382589 387623 394656 414699
18746D14699J51513J4878k17070j65842J34072J79232L6710q2429j36341O7685
$$ 414699 566212 581090 364020 198178 332250 511482 548192 465763 329422 397107
18736C97107J43677O7405k9987r9624J39968k6739j21128j881Q4029j31030R0619
$$ 397107 540784 608189 578202 478578 618546 591807 470679 468798 552827 421797 512416
18725E12416j1015j74802M4721R3930K62Q2807j12519Q5419P4537J07795J9492
$$ 512416 501401 326599 371320 465250 465512 548319 435800 521219 595756 703551 723043
18714G23043j30805J7566R3758J18368J13471J15927k027K6535P8434K17569K85724
$$ 723043 592238 609804 703562 821930 935401 1051328 1049301 1075836 1154270 1371839 1657563
18703A657563j73513j66176j29647k09930j24987K11935K86648M4120l9299N041
$$ 1657563 1484050 1317874 1188227 978297 853310 1065245 1351893 1396013 1356714 1361755
18693A361755J3134M0703j8418P82O2753P0625O0581J45412k7526o9042k9996
$$ 1361755 1374889 1415592 1397174 1397956 1460709 1531334 1591915 1737327 1709801 1640759 1610763
18682A610763j01180J31562J62810K33455L19320K44895J83277K53366J99601
$$ 1610763 1509583 1641145 1803955 2037410 2356730 2601625 2784902 3038268 3237869
18673C237869l0233j74080N9134M10950N42373L98329L35018K47352j14207j07969
$$ 3237869 3207636 3033556 3092690 3503640 4046013 4444342 4779360 5026712 4912505 4804536
18663D804536O1749K24041M4233m28596m54768l93577l20034k60178k36105j78358
$$ 4804536 4866285 5090326 5134559 4705963 4251195 3857618 3537584 3277406 3041301 2862943
18653B862943N7719r2384o7926o3564K21714K82059J73430j42157k33469m55146
$$ 2862943 2920662 2828278 2760352 2696788 2918502 3200561 3373991 3231834 2998365 2543219
18643B543219m48201n63149k34548N953R9299m681L2279J54091J58437K53492
$$ 2543219 2095018 1531869 1297321 1303274 1402573 1397892 1430171 1584262 1742699 1996191
18633A996191R2934j748m0828O9122Q4989J0955O8437K8018p8474R9881J18794
$$ 1996191 2089125 2087377 2046549 2115671 2200660 2211615 2280052 2308070 2229596 2329477 2448271
18622B448271K33011J44829J12870j1516r865j70651l44493k31293k99751k28484
$$ 2448271 2681282 2826111 2938981 2927465 2917600 2746949 2402456 2171163 1871412 1642928
18612A642928k22791j69496k60398j57830J42356J83256j33147k89708o9863J7460
$$ 1642928 1420137 1250641 990243 832413 974769 1158025 1024878 735170 665307 682767
18602F82767J02799L04029J88159l2927l2696l8095P6194j20633K2929r2271q0831
$$ 682767 785566 1089595 1277754 1244827 1212131 1174036 1250230 1129597 1152526 1060255 979424
18591I79424P8165K6259N638R8717K88306L23123L2064M0563n3070l16961j68644
$$ 979424 1057589 1083848 1089486 1188203 1476509 1799632 1831696 1872259 1819189 1502228 1333584
18580A333584j9059j21184m808J70540J29617k79748j47023J94754J22773J29419
$$ 1333584 1314525 1193341 1188533 1359073 1488690 1208942 1061919 1256673 1379446 1508865
18570A508865p361j94254p8665K9317J18098K88836J13336Q3048k01058p2917
$$ 1508865 1501504 1307250 1228585 1257902 1376000 1664836 1778172 1861220 1660162 1587245
18560A587245j3608M1908J05451j2771o3968J28257J52021J9091j28870o929J22032
$$ 1587245 1573637 1615545 1720996 1708225 1644257 1772514 1924535 1943626 1814756 1807827 1929859
18549A929859R0935L6219K47303K22934L8379K27415L43738J31073J50544J96628
$$ 1929859 2020794 2057013 2304316 2527250 2565629 2793044 3136782 3267855 3418399 3615027
18539C615027J14961L3227K22686M20519N01594M73618N01716N04014M32149M85316
$$ 3615027 3729988 3763215 3985901 4406420 4908014 5381632 5883348 6387362 6819511 7304827
18529G304827R73210J413088J875570K789101M592600P048330R647295J0746557
$$ 7304827 8278037 9691125 11566695 14355796 18948396 25996726 35644021 46390578
18521D6390578Q184025J464591n055246r093828q236604m615672j180134K637278
$$ 46390578 54574603 56039194 50983948 41890120 33653516 29037844 27857710 30494988
18513C0494988O574113J0352558J1356977R264415O752265L907588j091968o800290
$$ 30494988 37069101 47421659 58778636 68043051 74795316 78702904 77610936 70810646
18505G0810646j1934472j3031051r939843o125337k605466M75430K995667N041663
$$ 70810646 58876174 45845123 35905280 29779943 27174477 27649907 30645574 35687237
18497C5687237M624949P78545l455926o149104n518199l528007k334794j117806
$$ 35687237 40312186 41090731 37634805 31485701 25967502 22439495 20104701 18986895
18489A8986895n96548J97015P68968J425641K547529L981224N773124O158380
$$ 18986895 18390347 18587362 19356330 20781971 23329500 27310724 33083848 39242228
18481C9242228M757003K740510J840547J777107K017980K954287N640549J0922446
$$ 39242228 43999231 46739741 48580288 50357395 52375375 55329662 60970211 71892657
18473G1892657J8803478K7086647K9538637K3037053J4189972J2540014K1126956
$$ 71892657 90696135 117782782 147321419 170358472 184548444 197088458 218215414
18466B18215414K7207874J5187743j1320024l5708284m3783600l4369408j7899328
$$ 218215414 245423288 260611031 249291007 213582723 169799123 135429715 117530387
18459A17530387k663140R388601J6352811J3265210L535506m284009n376595j921664
$$ 117530387 114867247 124255848 140608659 153873869 157409375 153125366 147748771 145827107
18451A45827107k551423p233333j0204624q645933n095552j251264M405038J5562776
$$ 145827107 143275684 136042351 125837727 117191794 112096242 110844978 115250016 130812792
18443A30812792L1779371M5671338M5758474K9226342N356237j4362725k5892763
$$ 130812792 162592163 208263501 254021975 283248317 288604554 274241829 248349066
18436B48349066k9212406k6202047j6101493k828862M629958O409549Q228838
$$ 248349066 219136660 192934613 176833120 174004258 178634216 185043765 193272603
18429A93272603J3035932J5873202J1053324R59892l963448K087856J6667166
$$ 193272603 206308535 222181737 233235061 234194953 230231505 232319361 248986527
18422B48986527L3569919M8000268N6241827N2424587L0648604k930036l1456432
$$ 248986527 282556446 330556714 386798541 439223128 469871732 466941696 435485264
18415D35485264m4648694m3366902l7088179l4646216l0833505k1666087j0756211
$$ 435485264 390836570 347469668 310381489 275735273 244901768 223235681 212479470
18408B12479470n452635q433888j3177205j2122304r36002J4932152K9503970
$$ 212479470 207026835 198592947 185415742 173293438 172357436 187289588 216793558
18401B16793558M2727815N5018313M7448336J0535566l3859934o4576977n9346305
$$ 216793558 259521373 314539686 361988022 372523588 338663654 274086677 214740372
18394B14740372l0521381r27K1227016K2503762M149808k0800610l7150929l7067092
$$ 214740372 184218991 184218064 205445080 227948842 232098650 211298040 174147111 137080019
18386A37080019k8112574j8304689q578810J119196P332975N627591k191472j1030645
$$ 137080019 108967445 90662756 82083946 83203142 90536117 96163708 93972236 82941591
18378H2941591j4938755j2262000p014486k407136o5479q50872k871287m645596
$$ 82941591 68002836 55740836 48726350 46319214 46253735 45402863 42531576 37885980
18370C7885980m330640k706978m41274K308375M878327N729950K721079k183378
$$ 37885980 33555340 30848362 30407088 32715463 37593790 43323740 46044819 43861441
18362D3861441o107274o720679m714474k377821r60734k66334O17478J694455
$$ 43861441 37754167 31033488 26319014 23941193 22980459 22714125 23331603 25026058
18354B5026058L263346N795299R508167J2985578J4374355J3492229R863038N913801
$$ 25026058 28289404 34084703 43592870 56578448 70952803 84445032 94308070 100221871
18346A00221871j4535p612481j3649232j5473690j2926306r041024p115311o432262
$$ 100221871 100207336 92594855 78945623 63471933 50545627 41504603 34389292 27957030
18338B7957030n814978m567525l220261j933511j064826q65966o33153n58344
$$ 27957030 22142052 17574527 14354266 12420755 11355929 10489963 9856810 9298466
18330I298466k13374K65193O64523J517242K398148K849565J734424n31216k604863
$$ 9298466 9085092 9350285 10014808 11532050 13930198 16779763 18514187 17982971 15378108
18321A5378108l040484k647936j477179q84276n67464j18273L28152O12945J080808
$$ 15378108 12337624 9689688 8212509 7328233 6760769 6642496 6970648 7583593 8664401
18312H664401K284390L344024L040719J480498p16563k235560k367112q61647
$$ 8664401 10948791 14292815 17333534 18814032 18097469 15861909 13494797 12633150
18304A2633150O97877K528262M817162M995403K378610j649721n003963n366410
$$ 12633150 13331027 15859289 20676451 25671854 28050464 26400743 21396780 16030370
18296A6030370l522709j750481j52474Q67873J252378M26072j120282k358897
$$ 16030370 12507661 10757180 10604706 11472579 12724957 13151029 12030747 9671850
18288I671850k518635j888439j239776o93386m38447l05082k33291j78826j06860
$$ 9671850 7153215 5264776 4025000 3331614 2893167 2588085 2354794 2175968 2069108
18279B069108k5534k24187n082j17200j32527j14186l7035j00121R6945O6756
$$ 2069108 2043574 1819387 1814305 1697105 1564578 1450392 1413357 1313236 1410181 1476937
18269A476937l35j60208j53763k0110j58874k03780M1828Q5764L18980J0529q3738
$$ 1476937 1476602 1316394 1162631 1142521 983647 779867 821695 907459 1226439 1236968 1153230
18258A153230k1732Q2266q6802j27478j03344N181Q3116l9374r3475L8575q5977
$$ 1153230 1131498 1213764 1126962 999484 896140 901321 984437 945063 851588 890163 804186
18247H04186m5864J17027R3693k7431R1747j0649k7118j00595n568J7877k1768
$$ 804186 758322 875349 969042 941611 1033358 1022709 995591 894996 889428 907305 885537
18236H85537m2283R4113P9139m4076j49979k76185M509J84175M0641j00335K2497
$$ 885537 843254 937367 1016506 972430 822451 546266 550775 734950 775591 675256 697753
18225F97753J3194P3554l4959k95258l6485J40464N0688K6729q9007k04864q1838
$$ 697753 710947 784501 749542 454284 417799 558263 608951 635680 546673 341809 259971
18214B59971O536K01633L5623J42541J3984N5756j9684O0855m7887q6667k10512
$$ 259971 266507 468140 503763 646304 660288 716044 696360 757215 709328 622661 412149
18203D12149j15900J94281K1734j70008k956K14120M9115J15258J495o8511n1367
$$ 412149 296249 490530 512264 342256 339300 553420 602535 717793 719288 650777 599410
18192E99410K3893m1664p7731j03329r935J31532J62927L3276k5735j15568j77676
$$ 599410 623303 581639 503908 400579 390644 522176 685103 718379 692644 577076 399400
18181C99400K4870L4453L0361P3410n3647N2516n504M6564M125l454k34652o8997
$$ 399400 424270 458723 489084 562494 508847 561363 555859 602423 606548 603094 368442 299445
18169B99445J7145J01770l7413K6179J20241K9899j16662L7070N7193O1926M1215
$$ 299445 316590 418360 380947 407126 527367 557266 440604 477674 534867 596793 638008
18158F38008j75366j40216M6704J47659K45430J23992J9875l238M2669O9832m7981
$$ 638008 462642 322426 369130 516789 762219 886211 906086 902848 945517 1015349 967368
18147I67368j10552M7859J54449l3596K9572J46732R6903m779O0177Q5365K14377
$$ 967368 856816 904675 1059124 1025528 1055100 1201832 1298735 1293956 1354133 1439498 1653875
18136A653875K67285K31513K24823n9703M9045L19294J69858M15297L81895M67545
$$ 1653875 1921160 2152673 2377496 2317793 2366838 2686132 2855990 3271287 3653182 4120727
18126D120727L69848M68645P21978P97611J020022J447843J951962K176855K398456
$$ 4120727 4490575 4959220 5681198 6478809 7498831 8946674 10898636 13075491 15473947
18117A5473947K650470L221921M534590O221075R282667J4730385K5583629M6959940
$$ 15473947 18124417 21346338 25880928 32102003 41384670 56115055 81698684 128658624
18109A28658624P8730264Q2459824L2805785l1568601q1885126p9999951n0668886
$$ 128658624 207388888 289848712 322654497 291085896 209200770 129200819 78531933
18102G8531933k8104515j6028780r730688o066654l983253k788183k258680j550622
$$ 78531933 50427418 34398638 24667950 18601296 14618043 11829860 9571180 8020558
18094H020558j018173r09174q21979p24744o05729l11374j34571j03310l38025
$$ 8020558 7002385 6093211 5271232 4546488 3940759 3629385 3494814 3391504 3053479
18085C053479l18877l42828k81502l63368j25276O8865l1713L1387L6076l04168
$$ 3053479 2734602 2391774 2110272 1746904 1621628 1690493 1658780 1690167 1726243 1422075
18075A422075k75493n797o6067n86j2496N7319r1516k6516l0895l1132o5769j16072
$$ 1422075 1146582 1140785 1074718 1074132 1061636 1118955 1027439 1000923 970028 938896 873127 757055
18063G57055m3678Q5754Q4086N8577p9462q2205j31216R0654O7203j0470O6545
$$ 757055 713377 799131 883217 941794 862332 780127 648911 739565 806768 796298 862843
18052H62843p2376m4612L5476j35404k32329j89269j91973l3343M3274M8449J71940
$$ 862843 790467 745855 781331 645927 413598 224329 32356 -987 42287 90736 262676
18041B62676k0773r9884q2188R5646N1397j29351P2104J53122o1804L0093j07152
$$ 262676 241903 142019 59831 155477 206874 77523 149627 302749 240945 271038 163886
18030A63886r7048O3135R2717k30811J35734J06329n9274R9310J04339j14653
$$ 163886 66838 129973 222690 -8121 127613 233942 174668 273978 378317 263664
18020B63664r4005J97060J03659K0112Q7770L1482p7203q5804j18621l5613O2140
$$ 263664 169659 366719 470378 490490 578260 609742 532539 446735 328114 292501 354641
18009C54641j07460n7876j3621J47153K88057K45612O5430k11935j96073m0485
$$ 354641 247181 189305 175684 322837 610894 856506 921936 710001 513928 473443
17999D73443n0050K5065J04575R3399J70224J45854r9230p7462P9507j42622k76757
$$ 473443 423393 448458 553033 646432 816656 962510 863280 785818 865325 722703 445946
17988D45946J4566o497n8510J190k31545m0049K56980Q0857O0056N0316p044P7703
$$ 445946 460512 454015 395505 396695 165150 125101 382081 462938 522994 573310 566266 643969
17976F43969m5329q7318j50114l4606K2250m3935m170J78046L0375q6754J34897
$$ 643969 598640 511322 361208 326602 348852 304917 300747 478793 509168 422414 557311
17965E57311J3844r724J38652l7751j5654J29010K50880L08431J32867l1212k351
$$ 557311 571155 561431 700083 662332 646678 775688 1026568 1334999 1467866 1436654 1434303
17954A434303L9238j04177L8077K40046K02189N5066k75902l18527j08264j0980
$$ 1434303 1473541 1369364 1407441 1647487 1849676 1904742 1628840 1310313 1202049 1191069
17944A191069j3460j37820j07736P6680J64092N5177J02855j33448l6539J28121
$$ 1191069 1177609 1039789 932053 1008733 1172825 1228002 1330857 1197409 1160870 1288991
17934A288991o2522j24867k13564j07737j18455j11511r0926j96286n7954K0846
$$ 1288991 1226469 1101602 888038 780301 661846 550335 459409 263123 205169 226015
17924B26015l92L8041J31920R91l9846R7000K54100K55051j05303o2156R4608
$$ 226015 225623 263664 395584 396575 356729 453729 707829 962880 857577 795421 890029
17913H90029K97690K31292J68117J71228O5404J3769j01650j41972o3145j76574
$$ 890029 1187719 1419011 1587128 1758356 1823760 1837529 1735879 1593907 1530762 1354188
17903A354188j17414l611Q6741m8999k1564R7193J9008J20147J39737J6428j79293
$$ 1354188 1236774 1233163 1319904 1270905 1249341 1346534 1365542 1485689 1625426 1641854 1462561
17892A462561k43314n1858k50558j08136m6798o6280j16135k1828j07606j35147
$$ 1462561 1219247 1167389 916831 808695 761897 695617 579482 557654 450048 314901
17882C14901j22780J77297K09260l2480j21925O8813L3305m3996J25045q5811
$$ 314901 192121 369418 578678 546198 424273 493086 526391 482395 607440 521629
17872E21629k78339r2100M9085q2397J32077q3098J50062K45385L3022O0254M1258
$$ 521629 243290 151190 200275 117878 249955 166857 316919 562304 595326 655580 696838
17861F96838q7962l9267j50816M4536K13202R8387J72539J48150L1210o3197J6949
$$ 696838 608876 569609 418793 463329 676531 774918 947457 1095607 1126817 1063620 1080569
17850A080569P3440K673j18532j38639N5185m6696j15822j22875j96616q3588
$$ 1080569 1154009 1156682 1038150 899511 954696 908000 792178 669303 472687 389099
17840C89099n5079j15258k4319j03947k41322N1650K49934K7330k12686j80872
$$ 389099 334020 218762 194443 90496 -150826 -99176 150758 178088 -34598 -215470
17830b15470K11306K51377R6871k5394r0289r7893M4475m2079p0206J24378K06250
$$ -215470 -4164 247213 344084 318690 228401 130508 174983 132904 62698 187076 393326
17819C93326L2977p1063o3659j84891p9323K3733p654L7537q3908o7419j07316
$$ 393326 426303 355240 291581 106690 27367 51100 43446 80983 -2925 -70344 -177660
17808a77660K33291K53279J5786j0695j02037p2507J46023K1508n4292j2024K2523
$$ -177660 55631 308910 324696 314001 211964 139457 285480 306988 252696 240672 263195
17797B63195j40504L8189P3015L141k7388o6568k38637P5424Q5040j14734l0087
$$ 263195 122691 160880 233895 237036 209648 143080 -95557 -20133 64907 -49827 -79914
17786g9914n0074N1400O343m7164q7747K9117j3535O8721L3148P9268M9859q2099
$$ -79914 -129988 -78588 -72245 -119409 -207156 -178039 -191574 -122853 -89705 -10437 39422 -42677
17774d2677Q417L9687K6482N2069J42065N1402j83733k37398j27306Q3682j9023
$$ -42677 -34260 5427 31909 83978 226043 277445 93712 -143686 -270992 -187310 -206333
17763b06333j07739K32673J58738j66264j45393N355m0113m6042N1959K23833
$$ -206333 -314072 -81399 77339 -88925 -234318 -228963 -269076 -315118 -263159 -39326
17753c9326K63112p5677j12878J5157Q3113N3427j894q049O495n1653l3765o3664
$$ -39326 223786 148109 35231 50388 133501 186928 185034 176985 183480 131827 98062 34398
17741C4398j76116K3865J13983M2357j09816l7041l7418M5198j5570q4084J57861
$$ 34398 -141718 -117853 -3870 38487 -71329 -108370 -145788 -100590 -116160 -200244 -42383
17730d2383K6465L304O6114J40770J14400j10648r8074J8620o4233P0776j10527
$$ -42383 -15918 -12614 53500 194270 308670 198022 99948 118568 54335 125111 14584
17719A4584j43283P947K3493J26182K6659o944j84542K3515J38772R6491J01863
$$ 14584 -128699 -120752 -97259 28923 55582 48638 -135904 -112389 26383 122874 224737
17708B24737m6805j95477l1664J46178K0099N4540m9524j3774k86577k5245J32352
$$ 224737 177932 -17545 -49209 96969 117068 171608 122084 108310 -178267 -203512 -71160
17697g1160J40315J83235L8412j14835j0509k2064q6720j20133J2341j12130J8657
$$ -71160 69155 252390 290802 175967 165458 143394 56674 -63459 -51118 -163248 -144591
17686a44591J97096O6174n4319j67836l0690l3827J06172J6528n4451m2958l9525
$$ -144591 52505 118679 64360 -103476 -134166 -167993 -61821 -45293 -99744 -142702 -182227
17675a82227j04973j03211R1496J5548J73742M7137j62742N164K05829j3290l9003
$$ -182227 -287200 -390411 -298915 -283367 -109625 -62488 -225230 -220066 -14237 -27527 -66530
17664f6530L3635O6577M0808M1613j5434j06851n3310l5774o07N277j37231m1067
$$ -66530 -32895 33682 74490 116103 100669 -6182 -59492 -95266 -95873 -90596 -227827 -268894
17652b68894n774l0247Q0010R4508J54252m9149n6535M3538J12882L9880q3337
$$ -268894 -274668 -304915 -224905 -130397 23855 -25294 -81829 -38291 74591 114471 31134
17641C1134J1859N9525O0267j02349m8969J36162j2314k1178j7756n6335l0481
$$ 31134 42993 102518 162785 60436 11467 147629 135315 114137 96381 40046 9565
17630I565q8282l1617L0290P5563p5102l3999J44556j25206o8698R4389K4885
$$ 9565 -78717 -110334 -80044 -4481 -79583 -113582 30974 -94232 -162930 -68541 -43656
17619d3656l3436J43959M5220j40359k03692q0653O6265K4814M3981R6860N7183
$$ -43656 -77092 66867 112087 -28272 -231964 -312617 -246352 -221538 -177557 -80697 -23514
17608b3514m9497j18955R9070J3918M1526N9917j5583K2628M9547O6165r7771
$$ -23514 -73011 -191966 -92896 -78978 -37452 22465 6882 29510 79057 145222 47451
17597D7451m9079m285l4679p3182n760K0574j22553L2560J22084r242k0034L2444
$$ 47451 -1628 -5913 -40592 -113774 -119534 -98960 -221513 -188953 -66869 -76111 -96145 -63701
17585f3701O5620p4151j2567k8698L1746J89813J51121j52070J8989Q0599j35967
$$ -63701 1919 -72232 -84799 -113497 -81751 108062 259183 107113 126102 206701 70734
17574G0734k37776l8983q9641l8779J08260R2155L3816l332O9347l1106o2919
$$ 70734 -167042 -206025 -295666 -334445 -226185 -134030 -100214 -103546 -34199 -65305 -128224
17563a28224J0862P9349Q0333J8550N6117n6893l32699K578L43259l4753n0712
$$ -128224 -117362 -38013 42320 60870 116987 60094 -272605 -270027 73232 38479 -12233
17552a2233N6296q5919q1238m6908P9898N7266L6604J84595K64j01386j27782
$$ -12233 44063 -41856 -123094 -170002 -90104 -32838 3766 188361 188625 87239 -40543
17541d0543P7459J30011k68999j2197J83653J20794p2736k4968R7524J04088R132
$$ -40543 36916 166927 -102072 -114269 69384 190178 117442 92474 189998 294086 303218
17530C03218N3730K0407o4330l2175o086m0655j1545m6123q1917j53847P1961
$$ 303218 356948 377355 313025 280850 274764 234109 222564 176441 94524 -59323 12638
17519A2638J4347m5759r5811j3316J50188M5681O8515R044p5206j06445q5244
$$ 12638 26985 -18774 -114585 -127901 22287 67968 136483 145527 70321 -36124 -121368
17508a21368J4610p6743P2727R587N5174M0510J53345K7906k8611r2218o6596
$$ -121368 -106758 -183501 -110774 -101187 -46013 -5503 147842 175748 147137 54919 -11677
17497a1677j77096j70977J3482P8679J75132q6831O7334N9593n6904P4253J25344
$$ -11677 -188773 -359750 -346268 -267589 -92457 -179288 -111954 -52361 -109265 -35012 90332
17486I0332K08051K6141M3155j51185j50525p4851m3638K9062M2619J70811m2425
$$ 90332 298383 324524 367679 216494 65969 -8882 -52520 -23458 19161 189972 147547
17475A47547j14881l7529o2856o0332m8742J22002O4058m0078l3177o0689J3381
$$ 147547 32666 -4863 -67719 -128051 -176793 -54791 9267 -30811 -63988 -124677 -111296
17464a11296j8414J54184P6748n6109O0607k18271j77603J38381J52550l7972
$$ -111296 -129710 24474 101222 45113 105720 -112551 -290154 -151773 777 -37195
17454c7195M9078k35452k7232K25196j9043q7467M0179L0100P2592K64182M04107
$$ -37195 11883 -223569 -250801 -25605 -44648 -132115 -91936 -61836 10756 274938 679045
17443F79045L85362L26970J97316k1066m15425m83637k68899j27255k77252J95932
$$ 679045 1064407 1391377 1588693 1567627 1152202 668565 399666 272411 -4841 191091
17433A91091K2121n3389j24198j23404J9382J45056L0900M0612J30100n8913k11757
$$ 191091 213212 159823 35625 -87779 -68397 76659 107559 148171 278271 219358 7601
17422G601k9272J6725N7814n4463J703r9547p9408j64466O2322J50338O4087o834
$$ 7601 -21671 -4946 52868 -1595 108 -99439 -178847 -343313 -280991 -130653 -66566 -73400
17410g3400j34100j02080l7032K50118K5561r4120m9252q4695R9310j0257Q4104
$$ -73400 -207500 -309580 -346612 -96494 -70933 -165053 -214305 -299000 -199690 -209947 -125843
17399a25843J31275k2518j53031J42242J65977l0751j06399K3667O1199R9795
$$ -125843 5432 -17086 -170117 -27875 138102 107351 952 24619 85818 185613
17389A85613M1819j43901o0820l7995m9110k7874P7037P2851r4011r3966j41553
$$ 185613 227432 83531 22711 -15284 -64394 -92268 -15231 57620 -36391 -130357 -271910
17378b71910L6782J02732P8031N8418j7402J60015J0119j6267N1755l4339j23170
$$ -271910 -235128 -132396 -54365 4053 -13349 146666 156785 140518 192273 157934 34764
17367C4764j1373m9175l2516j34725q0772L9007K61131R6051K722j3934J4040
$$ 34764 23391 -25784 -58300 -193025 -273797 -234790 26341 122392 125114 111180 125220
17356A25220O288L6643J14397r8841j49313m4013o8858o5872j2757J73424J17358
$$ 125220 131508 168151 282548 183707 34394 -9619 -78477 -144349 -157106 16318 133676
17345A33676o6598R0943Q418n3222k47453M2154J05395J14082N5161P561k6501
$$ 133676 67078 158021 166439 113217 -134236 -92082 13313 127395 182556 190117 163616
17334A63616O9596k9992p5770l7994p7546m226J4511O6129K3438k3627o7219r7396
$$ 163616 233212 203220 127450 89456 11910 7684 22195 88324 111762 88135 20916 -76480
17322g6480J60616J44956M9639J00202j49005o4807m5369O6078k3403O1499J18858
$$ -76480 84136 229092 278731 378933 229928 165121 119752 185830 162427 223926 342784
17311C42784n3130j59500k8711j85301m6445J32792J21971n6324n2975N009K9376
$$ 342784 289654 130154 101443 -83858 -130303 2489 124460 68136 15161 20170 49546
17300D9546L875j16182K1558J85521P067j23947q4499j16267N6393M4183L56J05358
$$ 49546 53421 -62761 -41203 144318 151385 27438 -57061 -173328 -116935 -72752 -72396 32962
17288C2962P3930J65028M9865L2295r2960k29310j12265k0745m4540n1344j1790
$$ 32962 106892 271920 321785 354080 261120 31810 -80455 -101200 -145740 -197084 -208874
17277b08874R9872l7938j95153j1814L5426J11818P9317M5994j19873J8920l6267
$$ -208874 -109002 -146940 -342093 -353907 -318481 -206663 -127346 -81352 -201225 -182305 -218572
17266b18572N4222l0959P8490J95470Q2862j19324j41273R2618N5304j46674o403
$$ -218572 -164350 -195309 -116819 78651 161513 42189 -99084 -6466 48838 -97836 -104239
17255a04239J28821M0167q6227k4679m6123J0332l7707r7615p2417J35410l0095
$$ -104239 24582 64749 -21478 -46157 -92280 -81948 -119655 -217270 -289687 -154277 -184372
17244a84372k22413J20345Q8178J49022J9803M1589n419l2059j21226o568J01961
$$ -184372 -406785 -286440 -198262 -49240 -29437 12152 6733 -25326 -146552 -153120 -51159
17233e1159K4473J37083J02058J2836P3536J22728j26714k00001n7918J1903j57987
$$ -51159 -26686 110397 212455 225291 298827 421555 294841 94840 36922 48825 -109162
17222a09162k6270m343o5084M2045M8443J10996J17182k4307K1J30986j3414l4064
$$ -109162 -135432 -139775 -204859 -162814 -114371 -3375 113807 89500 89521 220507 207093 173029
17210A73029J58746j32797j222j4963m1386m6259N785j18182r8591j46574o2964
$$ 173029 331775 198978 197756 182793 141407 95148 100933 -17249 -115840 -262414 -325378
17199c25378K3597J18397K36546Q2028J9046j58572j04114O954O1663O9262N9321
$$ -325378 -301781 -183384 53162 135190 154236 -4336 -108450 -101496 -39833 29429 88750
17188H8750R7360J2169N1699o8345k05346K322P688l5173J03650J1404r1395N0096
$$ 88750 186110 198279 249978 181633 -23713 -21391 -13703 -48876 54774 66178 -25217 24879
17176B4879n4288Q6235M1829N7456j0342O9265N2917r8340j495n1794l7775j05702
$$ 24879 -29409 56826 98655 156111 145769 215034 267951 169611 168116 116322 78547 -27155
17164b7155j67486K8399J76329L54336J38167r1435k03814j85297n5668j79953
$$ -27155 -194641 -166242 10087 364423 502590 411155 207341 22044 -33624 -213577
17154b13577q5967N8680M853L8836R2931Q5316j9025j6296M6213M0127n1585q3485
$$ -213577 -299544 -240864 -236011 -197175 -104244 -18928 -37953 -54249 -8036 32091 -19494 -102979
17142a02979j6992k3431J63217n1718j50133L0541J47088K3114J23053r8249m4120
$$ -102979 -119971 -143402 19815 -31903 -182036 -151495 -4407 18707 141760 43511 -609
17131f09j13873k54685l3170K48487O4995M1288k9179N481O4674P2968p6104j14023
$$ -609 -114482 -369167 -402337 -153850 -88855 -47567 -76746 -71265 -6591 66377 -9727 -123750
17119a23750P905K1108j0270K2824K67675m1557M8891P2876M450j05350m6595
$$ -123750 -115845 -94737 -105007 -82183 185492 143935 192826 265702 270152 164802 118207
17108A18207J28916J1212j71693j48631j14759n7152K05386j4123o4030K1538
$$ 118207 247123 258335 86642 -61989 -176748 -233900 -28514 -42637 -106667 -85129
17098h5129J4277n3173P137J70631R4110n434R8971o8618j02670L7081l9635k6615
$$ -85129 -70852 -124025 -116888 53743 147853 142419 241390 172772 70102 107183 67548 40933
17086D0933k5071r9826j3904j03461J18971J25238J22760k2615o6791R925R3237
$$ 40933 15862 -83964 -97868 -201329 -82358 42880 165640 143025 76234 86159 179396
17075A79396M9280M2431N2985j03019j00065L5526q6290r7033r1584o318J554
$$ 179396 228676 271107 324092 221073 121008 156534 70244 -26789 -118373 -124691 -123137
17064a23137J17204K6218l9938m981p5605l3790O6044Q8296Q732P6822P208O8711
$$ -123137 -5933 20285 -19653 -24634 -100239 -134029 -67985 20311 29043 105865 113073 181784
17052A81784o8462j23522K4845l3054j90640l6139o9884q1025M2701J22905R1222
$$ 181784 113322 -10200 14645 -18409 -209049 -245188 -315072 -396097 -353396 -230491 -139269
17041a39269R1831L6336j1667M4001j0860j56326q3199K20091P9609j31320P714
$$ -139269 -47438 -11102 -22769 21232 10372 -145954 -229153 -9062 70547 -60773 -53059
17030e3059J52646N8154n8390j7068k003p4933l6868j23456K32658O0139r8255
$$ -53059 99587 157741 99351 82283 80280 5347 -31521 -154977 77681 137820 39565
17019C9565m6833R7183P8783N4699j7075O858p0747j28605L0135K3541k1671j23748
$$ 39565 -7268 89915 168698 223397 206322 213180 142433 13828 43963 67504 45833 -77915
17007g7915O7496J27173Q2311J32544j28133k22091J54107P6363j40023J15464
$$ -77915 -10419 116754 199065 331609 203476 -18615 135492 211855 71832 187296
16997A87296q3431m305P130J263R0804p4458j69686j76448j14510O3356N4677
$$ 187296 103865 99560 106690 107953 198757 124299 -45387 -221835 -336345 -272989 -218312
16986b18312j15332R6034J4418j00555J37717J83169R5178P4458l3122k33006
$$ -218312 -333644 -237610 -223192 -323747 -186030 -2861 92317 166775 133653 -99353
16976i9353j4106M2614J96735r1431j76158o9152o3641m0309K6600J36110Q0326
$$ -99353 -113459 -70845 125890 34459 -141699 -210851 -274492 -314801 -288201 -152091 -71765
16965g1765n1500l0083Q6812N5567L1828N340j12749p6995O3327N6200o6541J49855
$$ -71765 -123265 -153348 -66536 -10969 20859 26199 -86550 -163545 -100218 -44018 -110559 39296
16953C9296l1348p8695j29033r0137K803Q4887Q6799J1355m4192J51086O8200
$$ 39296 7948 -70747 -199780 -289917 -287114 -202227 -115428 -104073 -148265 2821 71021
16942G1021K4893J53005j62215j14373P499r922L2293K9069k15261q9815O3438
$$ 71021 95914 248919 86704 -27669 -20170 -30092 2201 31270 -183991 -273806 -210368
16931b10368Q9140M3723J01376N9972p8945m9383p8377M7624O7010J12118R2659
$$ -210368 -121228 -77505 23871 83843 4898 -44485 -122862 -75238 -8228 103890 196549
16920A96549K9167k7650j14580k25468q934J47783M3776J24774J89482M4940k2997
$$ 196549 225716 198066 83486 -141982 -150916 -3133 40643 165417 354899 399839 376842
16909C76842k63588j57742j11177Q9301J09159O6290J6366p8097P5272j353m8168
$$ 376842 113254 -44488 -155665 -66364 42795 109085 125451 47354 122626 121273 73105
16898G3105N7100p319q4022n3920j5044l4862J43113j00394J14661O8450Q907
$$ 73105 130205 122886 38864 -15056 -30100 -64962 78151 -22243 92418 160868 169775
16887A69775n8433J42188k5301j10438j45030L0254M2719L8949J77112k05825
$$ 169775 111342 253530 228229 117791 -27239 3015 45734 84683 261795 55970
16877E5970j14203K62723M1058N7481M1693j93992k17569l6686l131p0940J493
$$ 55970 -58233 204490 245548 303029 344722 150730 -66839 -103525 -106656 -177596 -176103
16866a76103P6220K60308P0236q2767k13291k2731J19813q5184N2156J05098p1381
$$ -176103 -99883 160425 230661 147894 -65397 -88128 31685 -53499 -1343 103755 32374
16855C2374j02950p1267J6169J5949J14318M5440j1983L4292n317J5145K3436
$$ 32374 -70576 -141843 -125674 -109725 4593 50033 38050 72342 67025 82170 105606
16844A05606k5398k5762m7967k27170l1417R1541J50070N9085k35318l7506J14417
$$ 105606 80208 54446 6479 -220691 -252108 -160567 -10497 48588 -186730 -224236 -109819
16833a09819R1924m2664n1347K2571j2782k7195J17494J15742p8113l5619M9893
$$ -109819 -17895 -60559 -111906 -89335 -102117 -129312 -11818 103924 25811 -9808 40085
16822D0085J21911l8228n9165L6883j88295k01582J25647Q3501k0745k4476n1783
$$ 40085 161996 123768 64603 101486 -86809 -288391 -162744 -79243 -99988 -124464 -176247
16811a76247J36696K07190n3502J9565j16885j00991R3397L4734L1752J2505o7717
$$ -176247 -39551 167639 114137 133702 16817 -84174 9223 43957 75709 88214 20497
16800B0497l0074J37802j63609n9611J16011n9636P6146K31265J11665j11337
$$ 20497 -9577 128225 -35384 -94995 21016 -38620 37526 268791 380456 269119
16790B69119j45285j12702O784J13325J98958O3013j59352p3636j91994j38122
$$ 269119 123834 11132 17916 131241 330199 393212 233860 160224 -31770 -169892
16780a69892o18R3624J98708l075j05856n6072R722o2343l8458K3462K24154K33940
$$ -169892 -170510 -76886 121822 118747 12891 -43181 -33459 -95802 -134260 -110798 113356 347296
16768C47296j88407k19449p7099J513m2655j13374Q2214N3675K900P6439J44523
$$ 347296 158889 -60560 -137659 -136146 -178801 -292175 -209961 -156286 -153386 -76947 67576
16757F7576l9808N0761O5082q5540l9612K3368O6161q083P384O49o1105P457j5373
$$ 67576 27768 78529 143611 58071 18459 41827 107988 99905 107289 107938 46833 54290 38917
16744C8917M3616J2992m045J8507K8030j02943N4064j60398j08473j5508M0122
$$ 38917 82533 95525 91480 109987 138017 35074 89138 -71260 -179733 -195241 -155119
16733a55119N1152J05800Q3891r6484K867J5333N3524J83980n8374p794M9396
$$ -155119 -103967 1833 85724 -10760 -7893 7440 60964 244944 186570 178776 228172
16722B28172j07572q177M7397O7467L0066j16677q3635J11759K4841n1768M2858
$$ 228172 120600 112423 159820 227287 257353 140676 57041 168800 193641 141873 184731
16711A84731r4942j09650J7688j96852K5838L4155L335j27636j6696L2308L21563
$$ 184731 89789 -19861 -2173 -199025 -173187 -139032 -135697 -263333 -280029 -247721 73842
16700G3842K14678j26434l222J04866n0863M5506O4678r0462j36714l6230n0814
$$ 73842 288520 162086 158864 263730 212867 258373 323051 232589 95875 59645 8831
16689H831p818j13798J70082N1386k50326j719R3685R3320J30497J15223k67581
$$ 8831 1013 -112785 57297 108683 -141643 -143362 -49677 43643 174140 289363 21782
16678B1782j04891P2559J2171L0074R5235O985o8029M7221J81019j19329n8359
$$ 21782 -83109 -10550 1621 31695 126930 133915 65886 113107 294126 174797 116438
16667A16438N4631o3922k27316p3221L2305K42471M7237j29261k23110j3101J33557
$$ 116438 171069 107147 -120169 -193390 -161085 81386 128623 -638 -223748 -236849 -103292
16656a03292P5732O0779j14967j4126J9985m6873J25517O7934R42K57357N8981
$$ -103292 -27560 33219 -81748 -95874 -75889 -122762 2755 70689 71631 328988 387969
16645C87969j80647k09320m9831J18793J73367l817j22369r5900q7949k14141
$$ 387969 207322 -1998 -51829 66964 240331 236514 114145 18245 -69704 -283845
16635b83845o6973M4170R578K44146J51079M5313n9265j1363L8391O1299R7417
$$ -283845 -350818 -306648 -297070 -52924 98155 143468 84203 72840 111231 172530 269947
16624B69947p7408k67287j29810J46143J53121Q7344j33456j32439Q8599Q3552
$$ 269947 192539 -74748 -204558 -58415 94706 182050 48594 -83845 4754 88306
16614H8306O3498R4020l6068j10665j3576m5778q7503l6106J812J86604P4169
$$ 88306 151804 245824 209756 99091 85515 39737 -47766 -83872 -82060 104544 178713
16603A78713j12761j32420J89553q0689r5039p8592m6207r3371J68047J38759
$$ 178713 65952 -66468 123085 42396 -52643 -131235 -177442 -270813 -102766 35993
16593C5993j2339O0394O0776P6635P1041J5033r9441k9089p1272q7862j80134
$$ 35993 23654 84048 144824 221459 292500 307533 208092 179003 107731 19869 -160265
16582a60265j33794J84618O4867j05622j14749r5346o2561J48630J70107n6643
$$ -160265 -294059 -109441 -44574 -150196 -264945 -360291 -422852 -274222 -104115 -160758
16572a60758k6918Q2091r0420J39527N0194J11461j77816j92625J15444K39325
$$ -160758 -187676 -105585 -196005 -56478 -6284 105177 -72639 -265264 -149820 89505
16562H9505k8401k05462j03562J6479Q8364m039O1756k7037J13475O8503K389
$$ 89505 61104 -144358 -247920 -231441 -143077 -147116 -85360 -112397 1078 69581 71970
16551G1970L1166J4575O8461N790K5155j19089o5733K11766J23263j09219j92097
$$ 71970 103136 117711 186172 191962 217117 98028 32295 244061 367324 258105 66008
16540F6008j13399n7729r2963P1457J80060j877P4766m7263j05414J51111J8427
$$ 66008 -47391 -105120 -198083 -126626 53434 51557 126323 79060 -26354 124757 143184
16529A43184p1885j13244L0603J22712J1177q6007L2703o8471Q1768n8205L43
$$ 143184 71299 -41945 -11342 111370 122547 36540 69243 772 82540 24335 24678
16518B4678j01038k18300k6093J19871J36199P5716J0025j14949K02846J11423
$$ 24678 -76360 -294660 -320753 -200882 -64683 11033 21058 -93891 108955 220378
16508B20378K3764N0872q307n0609M0644L3616j53819j8226j65127j77682O4936
$$ 220378 244142 295014 286707 236098 276742 310358 156539 138313 -26814 -204496 -139560
16497a39560l6370O6522J32083j32533Q5855J07317P8453N4238K9401j25792q0365
$$ -139560 -175930 -109408 22675 -109858 -24003 83314 161767 216005 245406 119614 39249
16486C9249J4840k3239J3039k966m0672R4320K39643K482k10521j19939j47802
$$ 39249 54089 30850 43889 40923 251 94571 334214 336696 126175 6236 -141566
16475a41566Q103R1455j83568J1803J11606j20353J3803k5911q2962L2098L4016
$$ -141566 -133463 -42008 -225576 -213773 -102167 -222520 -208717 -234628 -317590 -285492 -251476
16464b51476n3105l5977Q0319J22657K4635J20659j00948j68820K8905M8140M1090
$$ -251476 -304581 -340558 -260239 -137582 -112947 7712 -93236 -262056 -233151 -185011 -143921
16453a43921Q8434q0025j5010J40883L3779K1175q4769k5413k1202P777q8949
$$ -143921 -55487 -135512 -150522 -9639 24140 45315 -39454 -64867 -86069 -78292 -167241
16442a67241p3736j3050o5513J17448J35957J33552J16821k6472k2103k0122O6403
$$ -167241 -240977 -254027 -319540 -202092 -66135 67417 184238 157766 135663 115541 181944
16431A81944O8586q808p504m2800p2717m8539o5474L7838p7518o5196J271M8890
$$ 181944 250530 241722 234218 191418 118701 70162 4688 42526 -34992 -100188 -98917 -50027
16419e0027J09528j8194l5799n9330m9838J20939N4556O9154N0957j11356k271
$$ -50027 59501 41307 5508 -53822 -103660 17279 71835 140989 191946 80590 78319
16408G8319J1818M5028j62227j17856m3651J73728J18165j4509m8202J00410j4692
$$ 78319 90137 135165 -27062 -144918 -188569 -14841 103324 88815 40613 141023 126331
16397A26331j21404P6323o809k02849k17077K5237Q6086K14343J22080J44381
$$ 126331 4927 81250 74441 -128408 -345485 -320248 -234162 -19819 102261 246642
16387B46642o3681M040o6723q9459j37298m566o9580r7109R1328M6119K31771
$$ 246642 182961 187001 120278 30819 -106479 -111045 -180625 -277734 -186406 -140287 91484
16376I1484J39964j55846j39346Q7672j2939j91421l261j3636K01768K2270N0147
$$ 91484 231448 75602 -63744 23928 10989 -180432 -183693 -197329 4439 26709 76856
16365G6856j72526j00735R967J16920J26114R1577j05847O2376j51270O5601K41138
$$ 76856 -95670 -196405 -186438 -69518 56596 148173 42326 104702 -46568 19033 260171
16354B60171J22929j02508j21822J33159q1496Q5216j2984j55O8993j39168n6231
$$ 260171 383100 280592 158770 291929 210433 295649 282665 282510 351503 212335 156104
16343A56104l7014J67963k1777k29580j16440J3017Q17n0372M2432L907K5404
$$ 156104 119090 287053 265276 35696 -80744 -67727 -66910 -117282 -74850 -70943 -45539
16332d5539K58066J04917j63467p1611j776n7057k0124o1445r9309N4601J26204
$$ -45539 212527 317444 153977 82366 80590 23533 3409 -58036 -157345 -102744 23460
16321B3460j9374j06475j69445M3985J20756J0823N4462r2063j14299J92764Q3151
$$ 23460 4086 -102389 -271834 -227849 -107093 -96270 -41808 -133871 -248170 -55406 27745
16310B7745p7208K3927K3615j08427J5293L6086n9571k6966Q6703p32J42463j9937
$$ 27745 -49463 -25536 -1921 -110348 -95055 -58969 -118540 -145506 -58803 -59535 82928 62991
16298F2991m7806L8491K7482K45855J7293J5885j99845j30506N9847K30227J60227
$$ 62991 15185 53676 81158 327013 344306 360191 160346 29840 89687 319914 480141
16287D80141k42650k73604M177J12460j45760m8660j6706M3257R0742R2673j51913
$$ 480141 237491 -36113 -31936 80524 -65236 -113896 -130602 -87345 3397 96070 -55843
16276e5843m2117k3501j21979J57099J88942k7414l0369M9134q9615j25627k0504
$$ -55843 -97960 -121461 -243440 -86341 102601 75187 44818 93952 4337 -121290 -141794
16265a41794J3464q1581J51152K35454J8848k18414m0249J13788J64724k9628
$$ -141794 -128330 -209911 -58759 176695 195543 -22871 -63120 50668 215392 185764
16255A85764j24891P6126n8005j03415J0626m0083J2272l9385N0736p7126N4907
$$ 185764 60873 136999 78994 -24421 -13795 -53878 -41606 -80991 -30255 -107381 -52474
16244e2474p3486P7956J43262k465p7224j6033O3579N6833o0392n7863r5336K0300
$$ -52474 -125960 -48004 95258 92793 15569 -464 63115 119948 59556 1693 -93643 -73343
16232g3343J25965J49179j7421L0292R5411j61137r4268l9033L6459M2135k25117
$$ -73343 52622 201801 184380 214672 310083 148946 54678 15645 52104 94239 -130878
16221a30878o6324j16130M1004J71828J79890M5322j02788J18755j32889j03057
$$ -130878 -197202 -313332 -272328 -100500 79390 124712 21924 140679 7790 -95267
16211i5267l8764J21118P3054m8847j66310j32511k6158K86172k9719k18184q5658
$$ -95267 -134031 -12913 60141 11294 -155016 -287527 -313685 -27513 -57232 -275416 -361074
16200c61074L4008p0102J64392K68236k6853L4078n1127Q3929M3171j31549r0400
$$ -361074 -327066 -397168 -232776 35460 8607 42685 -8442 75487 118658 -12891 -103291
16189a03291J23394p5541j41235M6992J06760R0134q0183k11019J65368L08964
$$ -103291 20103 -55438 -196673 -149681 -42921 47213 -32970 -243989 -78621 230343
16179B30343J78161o9539k48877j01313K4023L7359k7114L9114N3073Q4290J96252
$$ 230343 408504 338965 90088 -11225 12798 50157 23043 62157 115230 199520 395772
16168C95772k2404j90841K6698m5303M5992r5831m9454l9877M9157Q6987L0373
$$ 395772 373368 182527 209225 163922 209914 114083 64629 24752 73909 160896 191269
16157A91269o4253k15176J06249R7583o277L542r29R8534N9106p1747n5050n0100
$$ 191269 127016 -88160 18089 115672 109395 112937 112008 210542 269648 197901 142851 92751
16145I2751J21576j40171k57801j80573J30876K16822l7414K2070R2126N1540
$$ 92751 214327 74156 -183645 -364218 -233342 -16520 -53934 -31864 60262 111802
16135A11802m050K5758Q7102Q4991q9790j13807N401m687J41846J76846k861Q679
$$ 111802 107752 133510 220612 305603 215813 102006 107407 102720 244566 421412 418551 427230
16123D27230J0841l6538m3000j26017l6768J1138r9554q1634J55905k8951j3148
$$ 427230 438071 401533 358533 232516 195748 206886 107332 25698 181603 152652 139504
16112A39504j03645m3233K7892j66427l9117J33389p026J86885N0443j49943p0838
$$ 139504 35859 -7374 20518 -145909 -185026 -51637 -58663 128222 178665 28722 -42116
16101d2116J15215q9346K3543L8316R6431j20111J0370k7363L7527j01357q7856
$$ -42116 73099 -16247 7296 45612 142043 21932 32302 4939 42466 -58891 -146747
16090a46747J21897Q1796m2079O1620p367O3771n1796p4223Q2387N9898O80j66792
$$ -146747 -24850 56946 14867 76487 69120 132891 81095 6872 89259 149157 149837 -16955
16078a6955j66015j89297R6560J00145J70187L9714j20565P4879K46359l4348
$$ -16955 -182970 -372267 -275707 -175562 -5375 34339 -86226 -11347 235012 200664
16068B00664j36338k2812o9315N7545q5690P7218J31j04911k02254k5889R9866
$$ 200664 64326 41514 -27801 29744 -55946 21272 21403 -83508 -285762 -311651 -211785
16057b11785J06961K3412J51705K8446Q779j16140p6468j35475n3744N0270N4916
$$ -211785 -104824 -81412 70293 98739 107518 -8622 -85090 -220565 -274309 -224039 -169123
16046a69123J41247Q9195l6064Q1469k8016L293L3860N9292r3378n2792j34303
$$ -169123 -27876 61319 25255 106724 78708 82001 115861 175153 81775 28983 -105320
16035a05320j969J4281K78382j2726p7134J13176j92771J18887O1948J9405R2720
$$ -105320 -107289 -93008 185374 172648 95514 208690 15919 134806 196754 216159 308879
16024C08879p1972o7050J8972R1916J7469q3611o9562J16504O5999l8984M7235
$$ 308879 236907 169857 188829 280745 298214 214603 145041 261545 327544 288560 335795
16013C35795p0040j46142j71039N1945R1060P9909O1918J3253j7266K5352j66795
$$ 335795 265755 119613 -51426 519 91579 171488 233406 246659 229393 254745 87950
16002H7950j89173J46658N0289q4948J62784J6972l135q0300O0140j2978n6334
$$ 87950 -101223 45435 95724 10776 173560 190532 187397 107097 167237 154259 97925
15991I7925j13461k7059J04841Q4945O773j51638L7890L0972l0652n1276j04613
$$ 97925 -15536 -42595 62246 147191 153964 2326 40216 71188 40536 -10740 -115353
15980a15353o1451O7277n1624m2080J19798J80259K4462O7258N9371n9851M0072
$$ -115353 -176804 -109527 -161151 -203231 -83433 96826 121288 188546 247917 188066 228138
15969B28138R9163J1786j67710j11882j32174M0821k4650j41782j23499P8110
$$ 228138 327301 339087 171377 59495 -72679 -31858 -56508 -198290 -321789 -243679
15959b43679Q2544J90056J32533r9219l5145k8571n2262n845Q4400n6950P7375
$$ -243679 -161135 28921 161454 62235 27090 -1481 -53743 -59588 24812 -32138 45237
15948D5237q6008L0797R0446J46167j23269K4197R9779J15043M6653k2451j3784
$$ 45237 -40771 -9974 80472 226639 103370 127567 227346 342389 389042 366591 352807
15937C52807j86646q0213P9886Q7733q585l3868Q532L7598K9326k6799j6492M3033
$$ 352807 166161 85948 165834 253567 244982 211114 219646 257244 286570 259771 243279 286312
15925B86312n7968j30236m0180r5154j11322o8810N7504P1637K3501O2419K23943
$$ 286312 228344 98108 57928 -37226 -148548 -217358 -159854 -88217 -64716 -2297 221646
15914B21646P2444r9991j51025Q1167K4929j89648l1472O2459N7001m4414M9618
$$ 221646 294090 194099 43074 124241 149170 -40478 -71950 -9491 47510 3096 52714
15903E2714o1957j70996o4314L7316J99315K35903K13021J3100o0139j92997M76
$$ 52714 -9243 -180239 -244553 -207237 -7922 227981 441002 454102 393963 200966 201442
15892B01442k9215j62421M6105k6393j51898J08086N7797L745Q6318J3052P0736
$$ 201442 172227 9806 55911 29518 -122380 -14294 43503 47248 133566 146618 217354
15881B17354j1802o8882k13540j47204j15376K14079J41271O0403l8177j05922
$$ 217354 205552 136670 -76870 -224074 -339450 -125371 15900 76303 38126 -67796
15871f7796J093O0280J81225m2090J07023n7690j35488N609o3845N7232J76406
$$ -67796 -66703 -6423 174802 132712 239735 182045 46557 52166 -11679 45553 221959
15860B21959J6225j4766O0433K3293o8701o3186j04533L5713m1958j15589l5313
$$ 221959 238184 223418 283851 307144 238443 175257 70724 106437 64479 -51110 -86423
15849h6423k6827k4378J2797M4485K33724N4495j32038j66178k9761N5799k6988
$$ -86423 -113250 -137628 -124831 -80346 153378 207873 75835 -90343 -120104 -64305 -91293
15838i1293L657K9392m6227M3177m5167j2057o0292N0831J91480M0895q4230m5671
$$ -91293 -87636 -58244 -104471 -61294 -106461 -118518 -178810 -127979 63501 104396 20166 -25505
15826b5505P6776R1909N2265j67423k06523n1131J88627K29834j1127N5214O2007
$$ -25505 51271 143180 195445 28022 -178501 -229632 -41005 188829 177702 232916 294923
15815B94923J11267l1626k27372j21485M3809k2779q8931r0009K7711P0052j9649
$$ 294923 406190 374564 147192 25707 69516 46737 -42194 -132203 -104492 -34440 -54089
15804e4089m9577K6422L5523q4364K3226J90148j37474o2232J6188M932L9760
$$ -54089 -103666 -77244 -41721 -126085 -102859 87289 -50185 -112417 -96229 -91297 -51537
15793e1537m0696k7475J65669J09271o405K9741l9650K7756j03523L7150j08082
$$ -51537 -92233 -119708 45961 155232 148827 178568 138918 166674 63151 100301 -7781
15782g781m5199k9555O7856k1761j38700R785p5664l3192L6683N7389J24423R3992
$$ -7781 -52980 -82535 -14679 -36440 -175140 -165355 -241019 -274211 -237528 -180139 -55716 38276
15770C8276l8839J83123o9482j30020j56080J6908j3248J57797L5185o6648Q1331
$$ 38276 -563 182560 113078 -16942 -173022 -156114 -169362 -11565 23620 -43028 38303
15759C8303N2189J6453j9823q7597K0402K7196n8118q6416j42295N8863J04745
$$ 38303 90492 106945 87122 -475 19927 47123 -10995 -97411 -239706 -180843 -76098
15748g6098J61654r9628j4952J50398O2313k6602j23032l9813J00854O0636j68411
$$ -76098 85556 -14072 -29024 121374 183687 157085 34053 -5760 95094 155730 -12681
15737a2681j7395j5725o3440N9097J36364p4501j45611k5179J16598J72889R8938
$$ -12681 -30076 -45801 -109241 -50144 86220 11719 -133892 -159071 -42473 130416 229354
15726B29354q8058j76606m9050J09234P3393J28823k37848k25284k4956J20839
$$ 229354 141296 -35310 -84360 24874 98267 227090 -10758 -236042 -260998 -140159
15716a40159J74529m8241o6287J26923P1421j33496R4837N3186m6250L2547J80967
$$ -140159 34370 -13871 -80158 46765 118186 -15310 79527 132713 86463 119010 299977
15705B99977l7919m1288n1161k41758k6149J78324J14766n0840j11154K1377k7421
$$ 299977 262058 220770 169609 -72149 -98298 80026 194792 143952 32798 54175 26754
15694B6754k5683k7508L6166M1543j26130O9140J75978J04757j76696q7846N8456
$$ 26754 1071 -26437 9729 51272 -74858 -5718 170260 275017 98321 10475 68931
15683F8931N7217p0216m9458K1937l2682K9131J9010Q5852q4120k028J44088j4390
$$ 68931 126148 55932 6474 28411 -4271 24860 43870 129722 45602 43574 187662 173272
15671A73272j72535k6498L1841L3358q8597K23524n985j48517n1271j26786P3741
$$ 173272 737 -25761 6080 39438 -49159 174365 168380 19863 -31408 -158194 -84453
15660h4453J67032m9122Q1873j4511J3178j8577o3186j33876K6597j0013l5094
$$ -84453 82579 33457 115330 100819 113997 95420 32234 -101642 -75045 -85058 -120152
15649a20152M6683l7791l7842p474J02180q5461j76277J38194J83418J06336P7713
$$ -120152 -73469 -111260 -149102 -156576 -54396 -139857 -316134 -177940 5478 111814 189527
15638A89527O2302J9062o3671k31352j49812Q2903J04391M8847O292j1039L4714
$$ 189527 251829 270891 207220 -24132 -173944 -91041 13350 62197 68489 57450 92164
15627I2164q2486p9677m9525j16098r9175M9501J44048M4523k2100k4527P3724
$$ 92164 9678 -69999 -119524 -235622 -334797 -285296 -141248 -96725 -118825 -143352 -69628
15616f9628j04178j88080J25238J48509K0015L7816J36158K1830j2124n4431q3019
$$ -69628 -173806 -361886 -236648 -88139 -68124 -30308 105850 127680 115556 61125 -21894
15605b1894m3174m4532J19503L1949M98j23002P9550K8220j60736J62086J09162
$$ -21894 -65068 -109600 9903 41852 42350 -80652 -1102 27118 -133618 28468 137630
15594A37630j03716j25144J07185K28973m6710k18205p4173J40413L2697L4105
$$ 137630 33914 -91230 15955 244928 198218 -19987 -94160 46253 78950 113055
15584A13055q6328p8631Q9917J14254J69013p658j95597j29122n77N0062q4273
$$ 113055 26727 -51904 38013 152267 321280 313622 118025 -11097 -11674 38388 -45885
15573d5885j87968R2708P2654J04139n9877J09901Q7935K3958M4775j52724j72040
$$ -45885 -233853 -141145 -68491 35648 -24229 85672 173607 197565 242340 89616 -82424
15562h2424K3790J90350p6732n5721N4723R0347o5779K6438J03335j00864l285
$$ -82424 -58634 131716 54984 -737 53986 144333 78554 104992 208327 107463 104178
15551A04178m6113m2875J7884L3806J06099p1543L2934j4387N0924K0668k3595
$$ 104178 58065 15190 33074 66880 172979 101436 134370 119983 170907 191575 167980
15540A67980m7270J7861n1679j05582Q4940Q9508n3832K9046O7987K914P7105
$$ 167980 120710 138571 86892 -18690 66250 155758 101926 130972 198959 201873 278978
15529B78978r1679j40287p9405j55872o0525Q3882R2250O0739O4777Q0362l4351
$$ 278978 187299 47012 -32393 -188265 -248790 -164908 -72658 -11919 52858 133220 98869
15518I8869j18398Q9765p8421k4017j62569n7101o3950K4839r7338q676L34487
$$ 98869 -19529 70236 -8185 -32202 -194771 -251872 -315822 -290983 -388321 -396997 -62510
15507f2510P4170p7004K1353J03161j4349l9798R2737l5231p1948N2773m3031
$$ -62510 11660 -65344 -43991 59170 44821 5023 97760 62529 -9419 43354 323
15496C23n9969Q1706M5302k2129l1916o7583J66194Q0299N5570l259j45692J10085
$$ 323 -59646 22060 67362 45233 13317 -54266 111928 192227 247797 244538 98846 208931
15484B08931J24114l1129j34320j13740j3438J22033j04661M1263J41449j59329
$$ 208931 333045 301916 167596 53856 40418 162451 57790 99053 240502 81173
15474H1173Q4093Q547p1958l5891l4685O455K1107M9486j78343p894L1986Q6921
$$ 81173 165266 173813 101855 65964 31279 37734 58841 108327 -70016 -77910 -45924 40997
15462D0997M6317n6042q0364J00001J19523p9984j15960j29073j9925K4303M1827
$$ 40997 87314 31272 -49092 50909 170432 90448 -25512 -154585 -174510 -150207 -108380
15451a08380K0661K27266K45158j30734j5294j28316k25839n5779R7878Q2851
$$ -108380 -87719 139547 384705 253971 238677 110361 -115478 -171257 -73379 9472
15441I472J00773o9522k25769J72116K64402R3649j08138L60q5768r4951j19621
$$ 9472 110245 40723 -185046 -12930 251472 345121 236983 237343 151575 56624 -62997
15430f2997M6038N0328J89095J0667j65809J04178J33622n5798j26045q4193j38750
$$ -62997 -16959 33369 222464 233131 67322 171500 305122 249324 123279 39086 -99664
15419i9664p7920O7301O5932J28622j3771j54123J23317J110k13768O6167K3311
$$ -99664 -177584 -110283 -44351 84271 70500 -83623 39694 40804 -172964 -106797 -83486
15408h3486O2841J3283J39309k0188j41600L4180J26675j52714k8137q3903j19875
$$ -83486 -20645 -7362 131947 111759 -29841 4339 131014 -21700 -49837 -133740 -253615
15397b53615j2863N7784j0822k1772j2941J73197Q2357j19796k78188o1862J38884
$$ -253615 -266478 -208694 -219516 -241288 -254229 -81032 1325 -118471 -396659 -458521 -319637
15386c19637J77671R7118l2679j701l036k10865k41855K40899L13114K7516j06934
$$ -319637 -141966 -44848 -77527 -79228 -82264 -293129 -534984 -294085 19029 46545 -60389
15375f0389k5163O3916Q7163J01109j6119l8187j0536R8616J60243J57666l4586
$$ -60389 -85552 -21636 65527 166636 150517 112330 101794 200410 360653 518319 483733
15364D83733q1946j30116J8343j10480n2253l658j6587j92219j20218J22914L9412
$$ 483733 401787 271671 290014 179534 127281 123623 107036 -85183 -205401 -82487 -43075
15353d3075o88j04155m6481k9730K00419J73186k9952o5219j64673r124L3025
$$ -43075 -43763 -147918 -194399 -224129 -23710 149476 119524 54305 -110368 -119492 -86467
15342h6467m9255P7696N4206l0183Q8290Q543n4094l379o8473n5866N7148j15334
$$ -86467 -135722 -58026 -3820 -34003 54287 62830 8736 5357 -63116 -118982 -61834 -177168
15330a77168P8853p951J6833N277P437M5325l5349J34982L834J32971r4684n9455
$$ -177168 -98315 -106266 -89433 -84156 -76719 -31394 -66743 68239 72073 205044 110360 50905
15318E0905k7181Q8941J2578j39175j76261q6788K01034J02441j04717J44318
$$ 50905 23724 112665 125243 -13932 -190193 -276981 -75947 26494 -78223 66095
15308F6095n425K169J0595K7646M5129k3336k0430l1377n9738m5977L8269J07252
$$ 66095 60670 62839 73434 101080 146209 122873 102443 71066 11328 -34649 3620 110872
15296A10872Q312l3978p0202r0332O3754K9367J9462J48230J4003J741j7949j37797
$$ 110872 119184 85206 15004 -75328 -11574 17793 37255 185485 199488 201229 183280 45483
15284D5483j11963p3634m3598J21129k4047R8726L2441J57923K6813n7335j55377
$$ 45483 -66480 -140114 -183712 -62583 -86630 12096 44537 202460 229273 171938 16561
15273A6561l7843k4252M6788K15765O0143j03185j17436j50640j30166p143J1224
$$ 16561 -21282 -45534 1254 217019 277162 173977 56541 -94099 -224265 -231408 -220184
15262b20184K21791J13379n6462J12026L3528q7070j33303j16763N2588K5913
$$ -220184 1607 114986 58524 170550 204078 117008 -16295 -133058 -80470 -54557
15252e4557j01166L9113p8814L756N5952J48365J89543j23332j12529p228k2165
$$ -54557 -155723 -116610 -195424 -191668 -135716 12649 202192 78860 -33669 -40897 -63062
15241f3062j42192Q9988R5818j15140R9310O2337m4425j62026q8100J31678P7875
$$ -63062 -205254 -115266 -19448 -134588 -35278 27059 -17366 -179392 -267492 -135814 -57939
15230e7939O9896Q7003K04193j58532p7479L1848J0624p0008j6363L9366M9822
$$ -57939 11957 98960 303153 144621 67142 98990 109614 39606 23243 62609 112431
15219A12431k0848n7145N0695J09686j04180j18875j82088k8916J00173M844J05536
$$ 112431 91583 34438 85133 194819 90639 -28236 -210324 -239240 -139067 -134223 -28687
15208b8687J14198n4248j0325M2221j05380j32145N8220J42469J73007M860j37488
$$ -28687 85511 31263 20938 63159 -42221 -174366 -116146 26323 199330 204190 66702
15197F6702j52231p8043R9098m9121J67681J96580K666m3568j72641j14332m0424
$$ 66702 -85529 -163572 -64474 -113595 54086 250666 253332 209764 37123 -77209 -117633
15186a17633L1036O7034J18066j9826k02723L5380J05826L8630o415j34601n6004
$$ -117633 -86597 -19563 98503 78677 -124046 -88666 17160 55790 49375 -85226 -141230
15175a41230N5631l8363R6522Q9813J57344j19952l8466r3972J847j34581R000
$$ -141230 -85599 -123962 -27440 62373 219717 99765 61299 -32673 -30826 -165407 -156407
15164a56407J38248O8484o5204k6069q1813P492l0267J53561J32336J46247k43325
$$ -156407 -18159 50325 -14879 -40948 -122761 -115269 -145536 8025 140361 286608 43283
15153D3283j22915K9271j15165l0772L9241K3903l7305J68273N1192n8121L6433
$$ 43283 -79632 -50361 -165526 -196298 -157057 -133154 -170459 -2186 49006 -9115 27318
15142B7318J03036J7491k09876p5607K32500P6222K9733j26324p7523k532p8302
$$ 27318 130354 147845 -62031 -137638 94862 171084 200817 74493 -3030 -5562 -83864
15131h3864L692J41554j7967n7785o2958R2267J35353m3992j22575j21058m4946
$$ -83864 -80172 61382 43415 -14370 -77328 14939 150292 106300 -16275 -137333 -182279
15120a82279K0510J17818m147l169j16181J4087J49736l3201j8623R6554J1022
$$ -182279 -161769 -43951 -48098 -51267 -167448 -153361 -3625 -36826 -55449 41105 52127
15109E2127j68850j14305L2474M6705m8379j01088N2035k7722R5533J04705L6239
$$ 52127 -116723 -231028 -198554 -151849 -200228 -301316 -249281 -277003 -181470 -76765 -40526
15098d0526K6480J00028J14858o1416j35485j52273l1718N6110J8364J6853J7457
$$ -40526 -14046 85982 200840 139424 3939 -148334 -180052 -123942 -105578 -88725 -71268
15087g1268n4358r3850k611Q0118O4921j45392L8990N5438Q8934n732j44694K7502
$$ -71268 -125626 -219476 -222087 -141969 -77048 -222440 -183450 -128012 -39078 -44810 -189504 -162002
15075a62002K79778J10875j36797m1034N9218j03455j9491q791j80306j7457K48380
$$ -162002 117776 228651 91854 50820 110038 6583 -12908 -21699 -202005 -219462 28918
15064B8918J30763l4595J12242N052o4557j94052n3854j4087J61774J06188p274
$$ 28918 159681 125086 237328 242380 177823 -16229 -70083 -84170 77604 183792 176518
15053A76518M9767N1630o8092m8634j8954J2004J5352l2916j39613J06160J61262
$$ 176518 226285 277915 209823 161189 142235 154239 169591 136675 -2938 103222 264484
15042B64484k8098j81408q3199M841m5524l1371l7349l1422N5356j65474M0232
$$ 264484 236386 54978 -28221 -23380 -68904 -100275 -137624 -169046 -113690 -279164 -238932
15031b38932J98993M1035j04201L2900J9002P7904O7369J22199k3327K11431M0139
$$ -238932 -39939 1096 -103105 -70205 -51203 26701 94070 216269 192942 404373 444512
15020D44512j83840j00901j8573N0199N9940P6686o4486M2624o0606j5968k07565
$$ 444512 260672 159771 141198 191397 251337 328023 263537 306161 245555 229587 22022
15009B2022n6806J72026o52P7071K0030k74360m1788J8046j73K05330R4153R0512
$$ 22022 -34784 137242 136590 213661 233691 -40669 -82457 -64411 -64584 140746 234899 325411
14997C25411P7838q5837K7406J45361o4048j5541q6335j07903k7068j09071j03988
$$ 325411 403249 317412 344818 490179 426131 410590 324255 216352 189284 80213 -23775
14986b3775l1469O5771o4185j89419Q065J61217L5128R6260L6628k1913j13305
$$ -23775 -55244 10527 -53658 -243077 -235012 -73795 -38667 57593 94221 72308 -40997
14975d0997O7608k7867r4356j5878k2760J6327n014M2508q7959J9425O5588J5453
$$ -40997 26611 -1256 -95612 -111490 -134250 -117923 -122937 -80429 -168388 -148963 -83375 -67922
14963f7922P0577O305k79435q6682L0033M9001J46044J49946J60397k99065k76226
$$ -67922 2655 8960 -270475 -357157 -327124 -278123 -132079 17867 178264 -120801 -397027
14952c97027M037N6607J23403J92381l0723O5956q8835k9695J2941o7947K3185
$$ -397027 -392990 -336383 -212980 -20599 -51322 14634 -74201 -103896 -90955 -158902 -135717
14941a35717N1157p6231L6434J11256M8723j7936p9716j79404l507J56775M2715
$$ -135717 -84560 -160791 -124357 -13101 35622 17686 -62030 -241434 -244941 -88166 -45451
14930d5451J054O5593Q4299j09388j00746J94124J05821P2186L1025j39792r3782
$$ -45451 -44397 21196 105495 -3893 -104639 89485 195306 267492 298517 158725 64943
14919F4943j1463L7889m2589L053M2731l9111K1632l6555j93283o5566J9880m0412
$$ 64943 53480 91369 48780 51833 94564 55453 77085 40530 -152753 -218319 -198439 -238851
14907b38851P8773J22251q0023p8808J86311J398k1605k3427J9578l6061l7248
$$ -238851 -160078 -37827 -117850 -196658 -10347 -8949 -30554 -53981 -34403 -70464 -107712
14896a07712K7151l6150K2592J76657n8768J07238k0130j21737m6196l8236J27977
$$ -107712 -80561 -116711 -94119 82538 23770 131008 110878 -10859 -57055 -95291 32686
14885C2686J25147q7892r5235M585L0747P5476j0228j13436P1323N6254P4518
$$ 32686 157833 69941 -25294 -20709 10038 85514 75286 -38150 33173 89427 163945
14874A63945R2776P371k6416l0025q7924J0489Q0091l0292n2010j19940k7512
$$ 163945 256721 264092 237676 207651 119727 130216 210307 180015 128005 8065 -19447
14863a9447J6464L922j0930j51445N864J08715J95966K4812j39342j80780q8036
$$ -19447 -2983 939 -9991 -161436 -155572 -46857 149109 173921 34579 -146201 -234237
14852b34237o758l8010P9915K34598K023J1844J66095O5730M5757l3783j85328
$$ -234237 -240995 -279005 -199090 35508 37531 49375 215470 281200 326957 293174 107846
14841A07846j7513J51609L4860j30638R4547k863p4399r4488j0370M6569j4840
$$ 107846 90333 241942 276802 146164 240711 237848 163449 68961 58591 105160 90320
14830I0320j26628j44791L1951P6266j36721R5137K28706j06626k03513N0048
$$ 90320 -36308 -181099 -149148 -72882 -209603 -114466 114240 7614 -195899 -145851
14820a45851N9513L7425n2265m5415j08775l5072J02533O6690R3016j3187j03245
$$ -145851 -86338 -48913 -101178 -146593 -255368 -290440 -187907 -121217 -28201 -41388 -144633
14809a44633P1991R021p3605r8946O05j29587R5873K24700R9476m6893Q2565K17966
$$ -144633 -72642 -63621 -137226 -236172 -235567 -365154 -269281 -44581 54895 8002 90567 308533
14797C08533O3592j43162m6794L8494k3131p0567p0192j94180N4426J17870Q3062
$$ 308533 372125 228963 182169 220663 197532 126965 56773 -137407 -82981 34889 117951
14786A17951n6246M7721k14599p182J39595r482k4301r2927J68770J26108M6035
$$ 117951 61705 109426 -105173 -112355 27240 17758 -6543 -99470 69300 195408 241443
14775B41443l5033n2040R636j7723j64258k8747l5221O7046q1385K364J21401
$$ 241443 206410 154370 164006 146283 -17975 -46722 -81943 -14897 -96282 -93918 27483
14764B7483P4007j61693Q292j05629l879P0538K0217j12293J25031R4598j98540
$$ 27483 101490 -60203 -51911 -157540 -161419 -90881 -70664 -182957 -57926 36672 -161868
14753a61868o25L3973J74918p0546Q1274O524j45481m9594J47080J00756R5165
$$ -161868 -162493 -128520 46398 -24148 57126 63650 -81831 -131425 15655 116411 211576
14742B11576J03155j90993K2836P6994K7585M1374j09366q0146n2841O8908n1561
$$ 211576 314731 123738 146574 223568 251153 292527 183161 103015 50174 119082 67521
14731F7521M2955M3145O4022J5155O2786J06074p502j88322j11690l36q6810o0181
$$ 67521 110476 153621 217643 232798 295584 401658 394156 205834 94144 93808 6998 -53183
14719e3183o5764K59602j8445j88026N0749j51104r6242J9833J45965j83134n1706
$$ -53183 -118947 140655 122210 -65816 -15067 -166171 -262413 -242580 -96615 -279749 -331455
14708c31455Q8459J39059P7255L5664m9880j56637m1025M7119K01208j7683q7372
$$ -331455 -242996 -103937 -26682 8982 -40898 -197535 -238560 -191441 9767 -7916 -95288
14697i5288O9197P4261Q9779L3613l9945K1546j0171n9615J2936q892o7061k24392
$$ -95288 -26091 48170 137949 171562 131617 153163 142992 83377 96313 87421 20360 -204032
14685b04032j05n5144J39646Q2727j31246j09252J26739J63293J4912J24774l5879
$$ -204032 -204137 -259281 -119635 -36908 -168154 -277406 -150667 12626 27538 152312 116433
14674A16433M5370l1170j81803P5415J66757M780j4333j7833P3441j96736p5382
$$ 116433 161803 130633 -51170 24245 191002 195782 181449 163616 237057 40321 -35061
14663c5061M0736j26589o2687M881r063J16769P1922L2140j04514l1639O767N6936
$$ -35061 5675 -120914 -183601 -178720 -187783 -71014 908 33048 -71466 -103105 -96338 -39402
14651c9402j06408j13310j56965K25008L06607K39655R895k25236j11335N3072
$$ -39402 -145810 -259120 -416085 -191077 115530 355185 365080 139844 28509 81581
14641H1581n1598k27984J3541O0977J09344R9246m8983L3277j67651k1523K1828
$$ 81581 29983 -198001 -184460 -123483 -14139 85107 36124 69401 -98250 -119773 -97945
14630i7945q7989m5881O6196L6702j1021J45978N2550p0424q8405l2717K32535
$$ -97945 -185934 -231815 -165619 -128917 -139938 6040 58590 -11834 -100239 -132956 99579
14619I9579J11780q1813k33550J62048Q5058K5124K5583L1668m7561j14061j29161
$$ 99579 211359 129546 -104004 58044 143102 168226 193809 225477 177916 63855 -65306
14608f5306P7176Q3152Q6183j29859j8081Q2799R9180J35879R394j58551k23092
$$ -65306 11870 95022 181205 51346 33265 116064 215244 351123 360517 201966 -21126
14597b1126k18399R1707J43357n4090j2539Q0178L4936q322o4448M1398P3471
$$ -21126 -239525 -147818 -4461 -58551 -71090 9088 44024 35702 -28746 12652 86123
14586H6123k01653j94091K75672J28446K5245p1268J00264j85542j95610q5784
$$ 86123 -115530 -309621 -33949 94497 119742 48474 148738 -36804 -232414 -318198
14576c18198J81209K85399J08870o8883Q8128N0788m2547j15806k04435o3121
$$ -318198 -136989 148410 257280 188397 276525 327313 284766 168960 -35475 -98596
14566i8596N1311J37418j2809q9249n3655j6033k4754J71934O6385j66822O100
$$ -98596 -47285 90133 77324 -11925 -65580 -81613 -106367 65567 131952 -34870 -28770
14555b8770p1848O3950n1317k7094J13698q2473J42689m780l5993r8445L9975
$$ -28770 -100618 -36668 -87985 -115079 -1381 -83854 58835 54055 18062 -80383 -40408
14544d0408K8272m5908J28788l0241m5974M2384J10639m1949j29587j06309O4188
$$ -40408 -12136 -58044 70744 40503 -5471 36913 147552 105603 -23984 -130293 -66105
14533f6105o641P411L762k7297n7187K2525N5133J8902k0522k9627K7948J94902
$$ -66105 -72746 -65335 -61573 -88870 -146057 -123532 -68399 -49497 -70019 -99646 -71698 123204
14521A23204J44577r5188p6218k9637J22061L0447m2076M7482j78559M1802P8208
$$ 123204 267781 172593 96375 66738 188799 219246 177170 224652 46093 87895 166103
14510A66103Q8790L0664j37336n676j16429J2881M395n3990q4686L7923Q3058
$$ 166103 254893 285557 148221 142545 26116 38997 43392 -10598 -95284 -57361 25697
14499B5697Q3595N7656P2592J82608M2539j41394j33113k0304L7281j00002j8175
$$ 25697 109292 166948 239540 422148 464687 323293 190180 169876 207157 107155 88980
14488H8980J25621O3114r7140P037l045j16539l7721O5792Q5229k5577J7099K1163
$$ 88980 214601 277715 180575 187612 184567 68028 30307 96099 181328 155751 172850 194013
14476A94013J62552n1134p0052N7758q8649N6499n4588p8576j58247P5375p9597
$$ 194013 356565 305431 235379 293137 204488 260987 206399 127823 -30424 44951 -34646
14465c4646o5902J5566k9423M3683n0929o5960K6282o258K0384J67073J15245
$$ -34646 -100548 -84982 -114405 -70722 -121651 -187611 -161329 -167587 -147203 19870 135115
14454A35115K6529j75356l931r7726M2827J09416L0676J07400l1406j20623p1728
$$ 135115 161644 -13712 -17643 -115369 -72542 36874 67550 174950 143544 22921 -48807
14443d8807Q2663j26193j71096K90870P6635p4561r3748R1661j06940j01611n631
$$ -48807 33856 -92337 -263433 27437 104072 29511 -64237 27424 -79516 -181127 -186758
14432a86758K38118L2991o6267l7264k6380J61606j13292P2732L5258j12161k24678
$$ -186758 51360 84351 18084 -19180 -45560 116046 2754 75486 110744 -1417 -226095
14421b26095o0380J33136J71886p0898M4319j4114M2375P2388m8661j76569K930
$$ -226095 -286475 -153339 18547 -52351 -8032 -22146 20229 92617 43956 -132613 -129683
14410a29683j3246L5587L5796n1930j3592p0756J87160J43124Q3144j83143k15703
$$ -129683 -142929 -107342 -71546 -123476 -137068 -207824 -20664 122460 205604 22461 -193242
14399a93242j5947K16432M0286j77166j42592l7161J16328J7384K4962j6631N5616
$$ -193242 -209189 7243 47529 -129637 -272229 -309390 -193062 -175678 -150716 -167347 -111731
14388a11731J93909J44372Q6101p9098j90456J18740N8815r1771j65563j245O7073
$$ -111731 82178 226550 312651 233553 43097 161837 220652 128881 -36682 -37927 29146
14377B9146J42078Q078o5607m2463N3123K3895o5722k5960K0753N333O8253O2822
$$ 29146 171224 179302 113695 71232 124355 148250 82528 56568 77321 82654 150907 213729
14365B13729o5062q6549n6153J69869O2839o2903p1584r7330J8908Q852J7862
$$ 213729 148667 62118 5965 175834 238673 175770 104186 6856 25764 34616 52478
14354E2478j95925j10502L8734Q7649J0244r6539j85937P0391J99042K51466J555
$$ 52478 -143447 -253949 -215215 -127566 -117322 -213861 -399798 -329407 -130365 121101 122656
14343A22656J94825J19397j16414j15255p7565l9992K0679K10074N5447k57939
$$ 122656 317481 436878 320464 205209 127644 87652 108331 318405 373852 115913
14333A15913k24764M3341J4218J79886Q9821o9052j2506q9962p5468k3707N214
$$ 115913 -108851 -65510 -51292 128594 218415 149363 136857 46895 -28573 -52280 -47066
14322d7066j09466m3290R8769k4229j51242J01577Q7985j5902N5234J9676N5242
$$ -47066 -156532 -199822 -101053 -125282 -276524 -174947 -86962 -102864 -47630 -27954 27288
14311B7288J06219J03911r1847j91387j21444Q147K41785l5843l4202P3431o89
$$ 27288 133507 237418 145571 -45816 -167260 -159113 82672 46829 12627 86058 85369
14300H5369P379j64216P2088J07149J23360J26163j14617j51789J5408N204n3808
$$ 85369 92748 -71468 620 107769 231129 357292 242675 90886 106294 111498 57690
14289E7690J19022j32018p8552r219o2216m458J52094j39002Q0323J8083k0410
$$ 57690 176712 44694 -33858 -43077 -105293 -109751 42343 -96659 -16336 1747 -18663
14278a8663M9375j1128J41338M9737r8268o2501j3881J11206J67614p7526j56864
$$ -18663 30712 19584 160922 210659 112391 49890 36009 147215 314829 237303 80439
14267H0439j2812j1253J4726n1528j3789J85320P4674k00658j32869M4892J26605
$$ 80439 67627 56374 71100 19572 5783 191103 265777 65119 -67750 -22858 103747
14256A03747R3880k6382j01559p8837O589J56396P803j48475j0532r4211n9140
$$ 103747 197627 171245 69686 -9151 -2562 153834 161637 13162 2630 -91581 -150721
14245a50721o3252O82J16553N1134j16873P3145J52949J06066o3835P9434K4841
$$ -150721 -213973 -213291 -96738 -45604 -162477 -89332 63617 169683 105848 185282 210123
14234B10123J6941k44277J67715J19474j42959k44673j7328k9304K09744p2158
$$ 210123 227064 -17213 150502 269976 127017 -117656 -134984 -164288 45456 -26702
14224b6702K4845R6589r3418n128q5295P8100Q6856J06310Q3611j03425m5234
$$ -26702 -1857 94732 1314 -3814 -89109 -11009 75847 182157 265768 162343 117109
14213A17109j20840n5328K527J11037J28828j6921p1854R2109p8228n2870J96617
$$ 117109 -3731 -59059 -56532 54505 183333 166412 94558 186667 108439 55569 252186
14202B52186J02310j01742j47400j22670o4390o3540O6346m9743j43399J59826
$$ 252186 354496 252754 105354 -17316 -81706 -145246 -78900 -128643 -272042 -112216
14192a12216J18250o5251N3799J42275n2685j94609K936q2516j1019J58422J77299
$$ -112216 6034 -59217 -5418 136857 84172 -110437 -107501 -190017 -201036 -42614 134685
14181A34685O2602j34383r6759l7583J1968j2797j45062j20711J11468K26594
$$ 134685 197287 62904 -33855 -71438 -59470 -72267 -217329 -338040 -226572 22
14171B2o1036O9342k5644J87368q091P3010K01361N4474r6221l5647J4847M1335
$$ 22 -61014 8328 -17316 170052 161961 234971 436332 490806 394585 358938 373785 415120
14159D15120j32974o0098O0141j23555j13147j41281k29545m8453J07857J81402
$$ 415120 282146 222048 282189 158634 45487 -95794 -325339 -373792 -265935 -84533
14149h4533J51986r452J77487J75752j08587j42340j11057j08209j05845J31375
$$ -84533 67453 58001 235488 411240 302653 160313 49256 -58953 -164798 -33423
14139c3423N6055q347j3982j8446j60884J4662Q2759J35656K39437p3398o3831
$$ -33423 22632 14285 303 -18143 -179027 -164365 -81606 54050 293487 220089 156258
14128A56258K0774j6287n3325n0757j3691n7516O1774K8009m8417j4168L3650
$$ 156258 177032 160745 107420 56663 42972 -14544 47230 75239 26822 12654 46304
14117D6304J40137j6423P6726k6445o8181k5045N7245l8082j22769r331R3634
$$ 46304 186441 170018 246744 220299 152118 127073 184318 146236 23467 14136 107770
14106A07770j52063r2294N3469l1475M2098L7232P5277M3926P0856q2001r2307
$$ 107770 -44293 -136587 -83118 -114593 -72495 -35263 40014 83940 154796 72795 -19512
14095a9512P9845J36553p8371j45658j97046k24933J15271K50209J2596p1129
$$ -19512 60333 196886 118515 -27143 -224189 -449122 -333851 -83642 -71046 -142175
14085a42175P5746J49587k6869k37677j15721o894N5982Q9308R0310J9668k7103
$$ -142175 -66429 83158 56289 -181388 -297109 -304003 -248021 -158713 -68403 -48735 -75838
14074g5838J07382n2615m5912j22345j8210N2303K4332j17145M6481J69352Q2828
$$ -75838 31544 -21071 -66983 -189328 -207538 -155235 -130903 -248048 -201567 -32215 50613
14063E0613j4023r322o2064P3804n2014K7366m330L009j98686j30780J80599O9769
$$ 50613 36590 27268 -34796 39008 -13006 14360 10030 13039 -185647 -316427 -135828 -66059
14051f6059Q0542M2591l8450j51334n9934r6665J38313n0146l2875J03854Q6549
$$ -66059 14483 57074 18624 -132710 -192644 -289309 -150996 -201142 -234017 -130163 -43614
14040d3614J56636r8443l7331l9644j68409R4547O2728K6131l9993l1193j289
$$ -43614 113022 14579 -22752 -62396 -230805 -136258 -73530 -47399 -87392 -118585 -119874
14029a19874N6034l2575J74525N9377m7929j53091j2590J96129M9840o5416P8930
$$ -119874 -63840 -96415 78110 137487 89558 -63533 -76123 120006 169846 104430 183360
14018A83360p0860n5617l6783n7823J10338q112l9461P6208n3735j5449M1749
$$ 183360 112500 56883 20100 -37723 72615 64503 25042 101250 47515 32066 73815
14007G3815n7035n4266N7615J23719J22607j46232k10477m7211Q4593J44644R2597
$$ 73815 16780 -37486 20129 143848 266455 120223 -90254 -137465 -52872 91772 184369
13996A84369O2661j15094j51027k3341p6257N2882J99720l5105k7570o6768j39058
$$ 184369 247030 131936 -19091 -42432 -118689 -65807 133913 98808 71238 4470 -134588
13985a34588Q6930N6845k1755j22118j39401O9001J83441J0678n5259q8151j23310
$$ -134588 -47658 9187 -12568 -134686 -274087 -205086 -21645 -10967 -66226 -154377 -277687
13974b77687L9407J20322Q8038O833J7544J83569J1552l7900k306j96126j77423
$$ -277687 -238280 -117958 -29920 -23087 -5543 178026 189578 151678 149372 -46754 -224177
13963b24177P0197J31311J07169j55729N0763k6332J50853j5140j19890k41239
$$ -224177 -153980 -22669 84500 -71229 -20466 -46798 104055 88915 -30975 -272214
13953b72214J8702N8718q6422j9347J49851J90743J22454L1056j22054o9173O7849
$$ -272214 -253512 -194794 -281216 -300563 -150712 40031 162485 193541 71487 2314 70163
13942G0163L0589J96384j9645j96972r1810Q3113M5643o136j94893j88304j2826
$$ 70163 100752 297136 277491 80519 -11291 71822 117465 111329 -83564 -271868 -284694
13931b84694j233m030k4045J33552J61219k6358R2545j9678j08905j02723l2562
$$ -284694 -285927 -289957 -314002 -180450 -19231 -45589 46956 27278 -81627 -184350 -216912
13920b16912R7624R5607Q5025n2941j77400J20497K11953p8188L8164j0330q8338
$$ -216912 -119288 -23681 61344 8403 -168997 -48500 163453 85265 123429 113099 24761
13909B4761Q8240l2301j81924m6326J1753L0988J8322p1485J0239K14151R537
$$ 24761 113001 80700 -101224 -147550 -135797 -104809 -86487 -157972 -147733 66418 75955
13898G5955p0589j98297L5702J12212j9112J22819j8045J19782L1962j55802n1764
$$ 75955 5366 -192931 -157229 -45017 -64129 58690 40645 160427 192389 36587 -15177
13887a5177L6976j57855o9932P2963R9013j8704P854J61775r6455L7692p4399
$$ -15177 21799 -136056 -205988 -133025 -34012 -52716 -44862 116913 20458 58150 -16249
13876a6249r0081n0860J6236q2396L5744J03692l5108J40227n1643l1313j29633
$$ -16249 -106330 -157190 -140954 -223350 -187606 -83914 -119022 21205 -30438 -61751 -191384
13865a91384n1531J86041k142J85351L5451r810r7325L9609l7351l2848m4062
$$ -191384 -242915 -56874 -59016 126335 161786 151976 54651 94260 56909 24061 -20001
13854b0001p0946j04708J26257K96907O6727j14442j25931K768j09229n2252R819
$$ -20001 -90947 -195655 -69398 227509 294236 179794 53863 56631 -52598 -104850 -95031
13843i5031n4356j52736K8925J98675K27288n116l4517p765L8957q2570k9092
$$ -95031 -149387 -302123 -273198 -74523 152765 147649 113132 105367 144324 61754 32662
13832C2662J38838l1375p6308k7570q7906J1722P437k8485M4866R2117N4949j158
$$ 32662 171500 140125 63817 36247 -51659 -39937 -32500 -60985 -16119 75998 130947 129789
13820A29789j66384K1806M1531J6181J36992q4759j41760J9051l0306K9958Q8437
$$ 129789 -36595 -14789 26742 42923 179915 95156 -46604 -27553 -57859 -27901 60536
13809F0536P4505K0846j53986q0876p1197n862K7700L4275N7139q9063n2801M8134
$$ 60536 135041 155887 1901 -78975 -150172 -156034 -128334 -94059 -36920 -125983 -178784 -130650
13797a30650Q7875P1287M73j9998m1281N6054Q2105j9051j48924N3622K7455m884
$$ -130650 -42775 28512 28985 8987 -32294 23760 105865 86814 -62110 -8488 18967 14083
13785A4083N6913J34240j44104n7693P1246l7344j82513k1190J62156J19152m941
$$ 14083 70996 205236 61132 3439 74685 37341 -145172 -166362 -4206 114946 110005
13774A10005k6067K7098P6116p387j59349l972O3763l4624k9638p6905m3201j08255
$$ 110005 83938 111036 187152 179765 20416 16444 80207 45583 15945 -60960 -104161 -212416
13762b12416J5876Q6824l0342j65514k0277N1873L2484r4231J7680K28080J40434
$$ -212416 -196540 -109716 -140058 -305572 -325849 -273976 -241492 -335723 -318043 -89963 50471
13751E0471J8956n2361o7660m1975J09249O9985k4666j692n9210j8548l4784l7688
$$ 50471 69427 17066 -50594 -92569 16680 86665 61999 60307 1097 -17451 -52235 -89923
13739h9923j2329j3778K7317j1937K00417R2131K870j5625m7348J9467o001p068
$$ -89923 -102252 -116030 -88713 -100650 99767 191898 194768 179143 131795 151262 145261 138193
13727A38193j044j69743k5232J44838k3729P2296r2587j84135J36792N3516j18509
$$ 138193 137149 -32594 -57826 87012 63283 135579 42992 -141143 -4351 49165 -69344
13716f9344j70540L947J00173J39359o1175j4904j79733J28217L18555p1049r0164
$$ -69344 -239884 -235937 -135764 3595 -57580 -72484 -252217 -124000 194555 123506 33342
13705C3342n4813J560O750O1060j8496p3614J03746j9085p1008j62240q8780M2868
$$ 33342 -21471 -19911 -13161 47899 29403 -44211 59535 40450 -30558 -192798 -281578 -238710
13693b38710O2018O4398k217j3651j56710M3919J39869J64624m2546o555m3092
$$ -238710 -176692 -112294 -114511 -128162 -284872 -240953 -101084 63540 20994 14439 -28653
13682b8653Q2009P1396j01158r859K8336k4979J10184P3201k05341o677J05640
$$ -28653 53356 124752 23594 13735 42071 17092 127276 200477 -4864 -11541 94099
13671I4099J83343j9931j40019j01601q6844R4722J22841L2009n98M5861P5810
$$ 94099 277442 257511 117492 15891 -70953 23769 146610 178619 178021 223882 299692
13660B99692j50045N1835q1800j11914Q0082j06783P5715J0165j88020O5243m4385
$$ 299692 149647 201482 119682 7768 87850 -18933 56782 66947 -121073 -55830 -100215
13649a00215r0266J14442m17n0398R376R118j45428j30397O4280J27252R9305
$$ -100215 -190481 -76039 -76456 -126854 -117478 -108360 -253788 -384185 -319905 -192653 -93348
13638i3348Q6864J21111n4621o9161K3740K0644O1222q9106m885J21713L682q0614
$$ -93348 -6484 114627 60006 -9155 14585 35229 96451 7345 2460 124173 127855 47241
13626D7241j8695l4968q0842o5029L7768j21917J28185J12248o7382p0481L0814
$$ 47241 28546 -6422 -87264 -152293 -114525 -236442 -108257 3991 -63391 -133872 -103058
13615a03058L3829K4866m8945O1282J28712n9510j48318j42442J62658J60005
$$ -103058 -69229 -44363 -93308 -32026 96686 37176 -111142 -253584 -90926 69079
13605F9079P7190P0312j97681j77623k193p2768j73678P516L8908J45338O9987
$$ 69079 146269 216581 18900 -158723 -160916 -233684 -407362 -399846 -360938 -215600 -145613
13594a45613k1349M7832J54540j02082j9253Q3524k5273o1701M2614k069R1928
$$ -145613 -166962 -119130 35410 -66672 -85925 -2401 -27674 -89375 -46761 -48830 43098
13583D3098P3221j58286L5386j6455o7417J29942P8929m0364Q5158J4444K7983
$$ 43098 116319 -41967 -6581 -23036 -90453 39489 118418 78054 163212 177656 205639
13572B05639n3827l999O210L5742j45712m177j05206q0100J18705j3168n3740
$$ 205639 151812 147813 154023 189765 44053 39876 -65330 -145430 -26725 -39893 -93633
13561i3633J97001O1390p862L2892J07539k313k8390j01351j24432k9019k0242
$$ -93633 103368 164758 156896 189788 297327 295014 266624 165273 40841 11822 -8420
13550h420r1417K6202P6442N2904l7959n0619o0567O7146j8065L2114J9924M0272
$$ -8420 -99837 -73635 2807 55711 17752 -32867 -93434 -26288 -44353 -12239 7685 47957
13538D7957p0881j7697J13451J56802L257o2406k5256j3657j92145l5918j22651
$$ 47957 -22924 -40621 72830 229632 232889 170483 145227 131570 -60575 -96493 -219144
13527b19144j2332J69544J0074p0027J13795o4059L9716n2470J61880J38921r051
$$ -219144 -231476 -61932 -51858 -121885 -8090 -72149 -32433 -84903 76977 215898 206847
13516B06847M9928Q7110j00296k04225n6687K4798M146j70053J1412K13596N0504
$$ 206847 256775 343885 243589 39364 -17323 7475 11621 -158432 -147020 66576 117080
13505A17080K8027P1697k7010J8158j05569j3704J4182R366j32573N9319J37550
$$ 117080 145107 216804 189794 207952 102383 88679 102861 112227 -20346 38973 176523
13494A76523l6586n6122P7074J43976j88851j01172q9497J24725N6059K3741r9622
$$ 176523 139937 83815 160889 304865 116014 14842 -74655 50070 106129 129870 30248
13483C0248Q5944J63553J48574j24078j46097L6908n5046R1816L810n6732k09561
$$ 30248 116192 279745 428319 304241 158144 195052 140006 231822 235632 178900 -30661
13472c0661j18113M3173K6274l690j39795O5625N9996j4015J52097J18595j11578
$$ -30661 -148774 -105601 -79327 -83017 -222812 -157187 -97191 -111206 40891 159486 47908
13461D7908j45025L4154r906j5891R0570j24791n3800Q6152J21032M8952J27944
$$ 47908 -97117 -62963 -72869 -88760 1810 -122981 -176781 -90629 30403 79355 207299
13450B07299j01111n5475j24658q9392k1565K4041Q7106J04366J21193J66393
$$ 207299 106188 50713 -73945 -163337 -184902 -160861 -73755 30611 151804 318197
13440C18197q9676k3396m9142j77313j3111l9299R1541K2686N6076j5642o4294
$$ 318197 228521 205125 155983 -21330 -34441 -73740 17801 40487 96563 80921 16627
13429A6627o4974J47068J27243j12064j18100m0637J5069P6293J94577o518p7660
$$ 16627 -48347 98721 225964 113900 -4200 -44837 -29768 46525 241102 234584 156924
13418A56924o202n7192n0289p3831j48897J48819J45526j41198J09415K06514
$$ 156924 150722 93530 43241 -30590 -179487 -30668 114858 -26340 83075 289589
13408B89589K7225m3323j85172j51871J15710K3371j4630L8863J55242N8678p4262
$$ 289589 316814 273491 88319 -63552 52158 75529 60899 99762 255004 313682 239420
13397B39420k80513j00932P035J17592K06021Q1048q7692m8312L5930q630l9955
$$ 239420 -41093 -142025 -134990 -17398 188623 269671 181979 133667 169597 160967 121012
13386A21012q9523n3066P7280q1866m8450n9349R2343j08066M0707n7700M5264
$$ 121012 31489 -21577 55703 -26163 -74613 -133962 -41619 -149685 -108978 -166678 -121414
13375a21414j0793j06114O9266Q1156O8735n9147O5936Q3699j70772j67651j1865
$$ -121414 -132207 -238321 -169055 -87899 -19164 -78311 -12375 71324 -99448 -267099 -278964
13364b78964q3387M7680J34290R9947J4421j98058m4527J85390K7028q9323J0810
$$ -278964 -362351 -314671 -180381 -80434 -66013 -264071 -308598 -123208 -96180 -185503 -174693
13353a74693R4681J22697Q8563O5808k34402M7840m3324p4004O456n8493l6907
$$ -174693 -80012 42685 131248 197056 -37346 10494 -32830 -106834 -100378 -158871 -195778
13342a95778K50J30256N3901n4217j37243k6115L1760J4878L7893J62752N8631
$$ -195778 -195528 -65272 -11371 -65588 -202831 -228946 -197186 -182308 -144415 18337 76968
13331G6968r7722q576J76831Q471q1502j11389j56721J22336J24163n3885j28706
$$ 76968 -20754 -29330 147501 155972 74470 -36919 -193640 -71304 52859 -1026 -129732
13320a29732M200O7131K3825P6000M0010J02777P5560j00797j41773r2414j45677
$$ -129732 -125532 -58401 -34576 41424 81434 184211 259771 158974 17201 -75213 -220890
13309b20890P9668K43940P1661j10706O1376o107k11221M7849j01148K0454J87970
$$ -220890 -141222 102718 174379 63673 125049 118942 -92279 -44430 -145578 -125124 62846
13298F2846K264J0812p8454P9470J52323J65464n0952j67741j68799m3283R8871
$$ 62846 65110 75922 -2532 76938 229261 394725 343773 176032 7233 -36050 62821
13287F2821j84301K13007M8884m6131J5294o0354k3257l6139R9061K6506j04003
$$ 62821 -121480 91527 140411 94280 109574 49220 25963 -10176 88885 115391 11388
13276A1388J922l6346n1537o8380k1880o6295J63160K35128j377j72804j4600
$$ 11388 13310 -23036 -74573 -142953 -164833 -231128 -67968 167160 165783 -7021 -21621
13265b1621J16116P5631J6951j40006j05240p0113J8323P5551m5896j39097K8772
$$ -21621 94495 170126 187077 47071 -58169 -128282 -109959 -34408 -80304 -219401 -190629
13254a90629l3033q853O3172n2537j34717O4653J96093N325K9572l8339p3866
$$ -190629 -223662 -232515 -169343 -221880 -356597 -291944 -95851 -90526 -60954 -99293 -173159
13243a73159J1364O0486L8248J46424p6271p5310N0818P2806p2634j55413o1176
$$ -173159 -161795 -101309 -63061 83363 7092 -68218 -17400 55406 -17228 -172641 -233817
13232b33817M3639R9730m1940K4094J9151J04169K06035J79850p2552j6752J165
$$ -233817 -190178 -90448 -132388 -108294 -89143 15026 221061 400911 328359 311607 312772
13221C12772m5369p916p1812j8358k2593j46315j61845L4779m1437m0404j03682
$$ 312772 267403 259487 187675 169317 146724 409 -161436 -126657 -168094 -208498 -312180
13210c12180J3690M0556J42657P2140P0524j78273o612M5007P7264J16300K26027
$$ -312180 -298490 -257934 -115277 -43137 27387 -150886 -157498 -112491 -35227 81073 307100
13199C07100J0086l6362m0836j21463n2001J5654o0862r6130q0451K6858L05723
$$ 307100 317186 280824 239988 118525 66524 82178 21316 -74814 -155265 -128407 177316
13188A77316k8701j43356r5251k562r8250j67944J27502J92248J05782P5029j56611
$$ 177316 148615 5259 -89992 -92554 -190804 -358748 -231246 -38998 66784 141813 -14798
13177a4798M2788j24756j19334o3791J38956q438P3863J12152J74168N1406J0270
$$ -14798 27990 -96766 -216100 -279891 -140935 -149373 -75510 36642 210810 262216 272486
13166B72486j33332n0716O6228P9044L6014q7630j10101q3728J46414K1638k21750
$$ 272486 139154 88438 154666 233710 269724 182094 71993 -11735 134679 156317 -65433
13155f5433j26382O8790o353j02659N5522N4481J02520j83988p9829R6994O3164
$$ -65433 -191815 -123025 -129378 -232037 -176515 -122034 -19514 -203502 -283331 -186337 -123173
$$ [...]
##END NTUPLES=NMR SPECTRUM
##END=
