##TITLE=Analysis number 319057
Compound Code cc 42346
Book Reference 449/100
Project Code adrs
Chemist Name davee
##JCAMPDX= 6.0         $$ Bruker NMR JCAMP-DX V2.0
##DATA TYPE= NMR SPECTRUM
##DATA CLASS= NTUPLES
##ORIGIN= Bruker BioSpin GmbH
##OWNER= nmr
$$ XWIN-NMR		Version 3.5
$$ Fri Apr 28 11:17:34 2006 GMT Daylight Time (UT+1h)  MAYBRIDGE\nmr@NMR_250MHZ
##.OBSERVE FREQUENCY= 250.131544655141
##.OBSERVE NUCLEUS= ^1H
##.ACQUISITION MODE= SIMULTANEOUS (DQD)
##.ACQUISITION SCHEME= undefined
##.AVERAGES= 16
##.DIGITISER RES= 18
##SPECTROMETER/DATA SYSTEM= dpx250
##.PULSE SEQUENCE= zg30
##.SOLVENT NAME= CDCl3
##.SHIFT REFERENCE= (INTERNAL, CDCl3, 0, 16.522)
##AUDIT TRAIL= $$ (NUMBER, WHEN, WHO, WHERE, WHAT)
$$ ##TITLE= Audit trail, XWIN-NMR		Version 3.5
$$ ##JCAMPDX= 5.01
$$ ##ORIGIN= Bruker BioSpin GmbH
$$ ##OWNER= nmr
$$ C:\u/data/dgb/nmr/ADRS/3390/pdata/1/auditp.txt
$$ ##AUDIT TRAIL=  $$ (NUMBER, WHEN, WHO, WHERE, WHAT)
(   1,<2006-04-28 11:17:05.99 +100>,<MAYBRIDGE\nmr>,<NMR_250MHZ>,
      <created by zg, POWCHK disabled, PULCHK disabled
       configuration hash MD5:
       84 BC 41 DB A1 6E 1D 46 DA 25 12 A5 C1 ED C5 3A
       data hash MD5: 64K
       A5 F8 96 CA BE C8 1F AF 85 B8 CB 54 78 0D F7 B5>)
(   2,<2006-04-28 11:17:22.72 +100>,<MAYBRIDGE\nmr>,<NMR_250MHZ>,
      <Start of raw data processing
       ef LB = 0.3 FT_mod = 6 PKNL = 1 SI = 32K 
       data hash MD5: 32K
       11 80 5F 55 1B 02 FF 10 48 0A D7 46 95 4E FF AC>)
(   3,<2006-04-28 11:17:24.38 +100>,<MAYBRIDGE\nmr>,<NMR_250MHZ>,
      <apk 
       data hash MD5: 32K
       67 48 56 52 47 CB AA 9F 9C 0D 05 40 59 06 9D 55>)
(   4,<2006-04-28 11:17:25.33 +100>,<MAYBRIDGE\nmr>,<NMR_250MHZ>,
      <abs ABSG = 5 
       data hash MD5: 32K
       00 E6 CB D5 92 50 EB 46 21 D9 83 1B 10 50 D7 10>)
$$ ##END=
$$ 
$$ hash MD5
$$ B6 69 3E 5F 76 66 BF A5 2C F1 34 F0 6E 98 7E 14
##$RELAX= 
##$RELAX= 
##$RELAX= 
##$RELAX= 
##$RELAX= 
##$RELAX= 
##$RELAX= 
$$ Bruker specific parameters
$$ --------------------------
##$DU= <C:\u>
##$EXPNO= 3390
##$NAME= <ADRS>
##$PROCNO= 1
##$TYPE= <nmr>
##$USER= <dgb>
##$AMP= (0..31)
100 100 100 100 100 100 100 100 100 100 100 100 100 100 100 100 100 100 
100 100 100 100 100 100 100 100 100 100 100 100 100 100 
##$AQSEQ= 0
##$AQ_mod= 3
##$AUNM= <au_zg>
##$AUTOPOS= <20 >
##$BF1= 250.13
##$BF2= 250.13
##$BF3= 250.13
##$BF4= 250.13
##$BF5= 500.13
##$BF6= 500.13
##$BF7= 500.13
##$BF8= 500.13
##$BYTORDA= 1
##$CFDGTYP= 0
##$CFRGTYP= 5
##$CHEMSTR= <none>
##$CNST= (0..31)
1 1 145 1 1 1 1 1 1 1 1 1 1 1 1 1 1 1 1 1 1 1 1 1 1 1 1 1 1 1 1 1 
##$CPDPRG= <>
##$CPDPRG1= <>
##$CPDPRG2= <>
##$CPDPRG3= <>
##$CPDPRG4= <mlev>
##$CPDPRG5= <mlev>
##$CPDPRG6= <mlev>
##$CPDPRG7= <mlev>
##$CPDPRG8= <mlev>
##$CPDPRGB= <>
##$CPDPRGT= <>
##$D= (0..31)
0 1 0 0 0 0 0 0 0 0.06 0 0 0 0 0 0 0.0002 0 0 0 0 0 0 0 0 0 0 0 0 0 0 
0 
##$DATE= 1146219424
##$DBL= (0..7)
120 120 120 120 120 120 120 120 
##$DBP= (0..7)
150 150 150 150 150 150 150 150 
##$DBP07= 0
##$DBPNAM0= <>
##$DBPNAM1= <>
$$ [...]
##$SUBNAM7= <"">
##$SUBNAM8= <"">
##$SUBNAM9= <"">
##$SW= 20.6930455092707
##$SWIBOX= (0..15)
0 0 3 0 0 0 0 0 0 0 0 0 0 0 0 0 
##$SW_h= 5175.983436853
##$TD= 65536
##$TD0= 1
##$TE= 295.16
##$TE2= 300
##$TE3= 300
##$TEG= 300
##$TL= (0..7)
0 120 120 120 120 120 120 120 
##$TP= (0..7)
150 150 150 150 150 150 150 150 
##$TP07= 0
##$TPNAME0= <>
##$TPNAME1= <>
##$TPNAME2= <>
##$TPNAME3= <>
##$TPNAME4= <>
##$TPNAME5= <>
##$TPNAME6= <>
##$TPNAME7= <>
##$TPOAL= (0..7)
0.5 0.5 0.5 0.5 0.5 0.5 0.5 0.5 
##$TPOFFS= (0..7)
0 0 0 0 0 0 0 0 
##$TUNHIN= 0
##$TUNHOUT= 0
##$TUNXOUT= 0
##$USERA1= <user>
##$USERA2= <user>
##$USERA3= <user>
##$USERA4= <user>
##$USERA5= <user>
##$V9= 5
##$VALIST= <valist>
##$VCLIST= <CCCCCCCCCCCCCCC>
##$VD= 0
##$VDLIST= <DDDDDDDDDDDDDDD>
##$VPLIST= <PPPPPPPPPPPPPPP>
##$VTLIST= <TTTTTTTTTTTTTTT>
##$WBST= 1024
##$WBSW= 4
##$XGAIN= (0..3)
0 0 0 0 
##$XL= 0
##$YL= 0
##$YMAX_a= 386242
##$YMIN_a= -584588
##$ZGOPTNS= <>
##$ZL1= 120
##$ZL2= 120
##$ZL3= 120
##$ZL4= 120
##$ABSF1= 16.522
##$ABSF2= -4.171173
##$ABSG= 5
##$ABSL= 3
##$ALPHA= 0
##$AQORDER= 0
##$ASSFAC= 0
##$ASSFACI= 0
##$ASSFACX= 0
##$ASSWID= 0
##$AUNMP= <proc_1d>
##$AZFE= 0.1
##$AZFW= 0.1
##$BCFW= 0
##$BC_mod= 0
##$BYTORDP= 0
##$COROFFS= 0
##$CY= 12.5
##$DATMOD= 1
##$DC= 0
##$DFILT= <>
##$DTYPP= 0
##$F1P= 14.0000005364418
##$F2P= -0.99999901652339
##$FCOR= 0.5
##$FTSIZE= 32768
##$FT_mod= 6
##$GAMMA= 0
##$GB= 0
##$INTBC= 1
##$INTSCL= 1
##$ISEN= 128
##$LB= 0.3
##$LEV0= 0
##$LPBIN= 0
##$MAXI= 10000
##$MC2= 0
##$MEAN= 0
##$ME_mod= 0
##$MI= 0
##$NCOEF= 0
##$NC_proc= -4
##$NLEV= 6
##$NOISF1= 0
##$NOISF2= 0
##$NSP= 0
##$NTH_PI= 0
##$NZP= 0
##$OFFSET= 16.522
##$PC= 1
##$PHC0= 169.7834
##$PHC1= 4.222125
##$PH_mod= 1
##$PKNL= yes
##$PPARMOD= 0
##$PSCAL= 4
##$PSIGN= 0
##$REVERSE= no
##$SF= 250.13
##$SI= 32768
##$SIGF1= 0
##$SIGF2= 0
##$SINO= 400
##$SIOLD= 32768
##$SREGLST= <1H.CDCl3>
##$SSB= 0
##$STSI= 32768
##$STSR= 0
##$SW_p= 5175.98343685301
##$SYMM= 0
##$S_DEV= 0
##$TDeff= 65536
##$TDoff= 0
##$TI= <Analysis number 999999
Compound Code 99
Book Reference 9
Project Code 9>
##$TILT= no
##$TM1= 0
##$TM2= 0
##$TOPLEV= 0
##$USERP1= <user>
##$USERP2= <user>
##$USERP3= <user>
##$USERP4= <user>
##$USERP5= <user>
##$WDW= 1
##$XDIM= 32768
##$YMAX_p= 476661430
##$YMIN_p= -211711
$$ End of Bruker specific parameters
$$ ---------------------------------
##NTUPLES= NMR SPECTRUM
##VAR_NAME=  FREQUENCY,     SPECTRUM/REAL,   SPECTRUM/IMAG
##SYMBOL=    X,             R,               I
##VAR_TYPE=  INDEPENDENT,   DEPENDENT,       DEPENDENT
##VAR_FORM=  AFFN,          ASDF,            ASDF
##VAR_DIM=   32768,         32768,           32768
##UNITS=     HZ,            ARBITRARY UNITS, ARBITRARY UNITS
##FACTOR=    0.157963299565203, 1,           1
##FIRST=     4132.6476996994, 0,             0
##LAST=      -1043.33573715361, 0,           0
##MIN=       -1043.33573715361, -211711,     0
##MAX=       4132.6476996994, 476661430,     0
$$ Real data points
##PAGE= N=1
##DATA TABLE= (X++(R..R)), XYDATA
$$ [...]
$$ plain form
16336 43527 -896 -15382 -30905 -40420 -23220 10316 26 -15315 20122 60506 27742 -48852
16324 -48852 -78529 -46016 12423 14229 60994 126617 131125 88219 48696 59711 93952 91029
16312 91029 79441 61407 64992 83532 26525 -14222 -28386 6594 62076 62782 34708 9891
16300 9891 -44730 -43454 13758 46059 117575 90387 41186 54467 35184 18167 22789 10212
16288 10212 -47976 -18855 68548 73383 49392 24492 11729 38667 108919 108061 58905 -21327
16276 -21327 -61718 -61778 -104061 -111818 -59377 -5605 -55421 -78466 -90265 -74131 -62939 -45009
16264 -45009 -38163 -12058 1452 -19228 -34337 -2347 22432 54862 47375 26284 22726 -13734
16252 -13734 -28834 22648 40287 89190 93792 111098 137083 104546 52024 73 19229 24
$$ packed form
16336D3527m4423j4486j5523r515J7200L3536j0290j5341L5437M0384l2764p6594
16324d8852k9677L2513N8439J806M6765O5623M508m2906l9523J1015L4241k923
16312I1029j1588j8034L585J8540n7007m0747j4164L4980N5482P06k8074k4817
16300I891n4621J276N7212L2301P1516k7188m9201J3281j9283j7017M622j2577
16288A0212n8188K9121Q7403M835k3991k4900j2763K6938P0252q58m9156q0232
16276b1327m0391o0m2283p757N2441N3772m9816k3045j1799J6134J1192J7930
16264d5009O846K6105J3510k0680j5109L1990K4779L2430p487k1091l558l6460
16252a3734j5100N1482J7639M8903M602J7306K5985l2537n2522n1951J9156j9205
$$ plain form
16240 24 37587 45577 54115 41804 24370 17606 17863 18721 -11951 20433 23116 -29825 -34619 -53484
16226 -53484 -62641 -18358 -36570 -59463 -60102 -86314 -101695 -81929 -39195 -14538 5760 -14674
16214 -14674 -22514 14370 59167 74656 77348 56392 61113 13475 -42573 -54953 -23508 -4436
16202 -4436 -6530 -18461 6526 39245 39645 -22311 -51579 -39045 -26569 -14728 -10178 -26142 -28236
16189 -28236 -21507 -7929 -16180 -486 -12353 -11969 -26235 -36691 44637 87995 73948 42123
16177 42123 29942 -22245 -41964 -29356 704 34184 -22371 -39376 -59559 -103942 -93800 -90696
16165 -90696 -34279 13942 32118 -406 3151 -524 9508 11062 -24321 -62126 -94512 -61821
16153 -61821 -78620 -114460 -94270 -46136 -13548 43715 55566 3191 -134 33962 40315 -9051
$$ packed form
16240B4L7563P990Q538j2311j7434o764K57Q58l0672L2384K683n2941m794j8865
16226e3484r157M4283j8212k2893o39k6212j5381J9766M2734K4657K0298k0434
16214a4674p840L6884M4797J5489K692k0956M721m7638n6048j2380L1445J9072
16202d436k094j1931K4987L2719M00o1956k9268J2534J2476J1841M550j5964k094
16189b8236O729J3578q251J5694j1867L84j4266j0456Q1328M3358j4047l1825
16177D2123j2181n2187j9719J2608L0060L3480n6555j7005k0183m4383J0142L104
16165i0696N6417M8221J8176l2524L557l675J0032J554l5383l7805l2386L2691
16153f1821j6799l5840K0190M8134L2588N7263J1851n2375l325L4096O353m9366
$$ plain form
16141 -9051 15393 13712 -14273 -13707 2356 8242 816 -16503 -40166 -43999 -29947 -36097 -61464
16128 -61464 -35530 -43684 -12374 27913 41743 14453 -52402 -144552 -147396 -94178 -59153 -60660
16116 -60660 -64047 -71752 -5968 7586 -49795 -23553 815 7017 30143 30847 24442 -15259 -46359
16103 -46359 -14403 40925 9318 65900 97608 64751 54251 50875 74708 46961 68813 117446
16091 117446 135362 79370 12811 3396 1904 -8133 -22896 -25563 3896 10468 43815 82714
16079 82714 71319 26999 43419 97879 65412 -7316 -17214 -7754 -16501 -48166 -67023 -17570
16067 -17570 -26517 -30720 13729 26595 -8840 -27015 -21004 1859 29945 34496 3504 16580
16055 16580 28324 16754 6233 -13784 -8477 -1816 36612 13863 -32330 -6023 -1021 -26132
$$ packed form
16141i051K4444j681k7985N66J6063N886p426j7319k3663l833J4052o150k5367
16128f1464K5934q154L1310M0287J3830k7290o6855r2150k844N3218L5025j507
16116f0660l387p705O5784J3554n7381K6242K4368O202K3126P04o405l9701l1100
16103d6359L1956N5328l1607N6582L1708l2857j0500l376K3833k7747K1852M8633
16091A17446J7916n5992o6559r415j492j0037j4763k667K9459O572L3347L8899
16079H2714j1395m4320J6420N4460l2467p2728r898R460q747l1665j8857M9453
16067a7570q947m203M4449J2866l5435j8175O011K2863K8086M551l0992J3076
16055A6580J1744j1570j0521k0017N307O661L8428k2749m6193K6307N002k5111
$$ plain form
16043 -26132 -36245 -43749 -35198 -34992 -34402 -21128 -16171 11070 -10461 -34967 -30744 -38437 -40265 -18175
16029 -18175 10687 -4251 -25530 -58489 -87018 -117514 -127722 -107314 -67277 -36947 6948 17241
16017 17241 -33438 -87555 -108125 -114347 -95314 -43964 15753 549 -10495 -30961 -23853 13857
16005 13857 11652 22681 38030 69275 48778 29592 37347 12068 14456 37903 72602 68109
15993 68109 56373 62437 47054 -1260 -34203 1394 35230 -105 -22549 -35528 5969 41243
15981 41243 44392 26877 1165 16261 39755 22520 47647 52098 39795 22165 -8945 12878
15969 12878 3155 6144 -28227 1835 23148 96403 101030 85459 60648 80622 97513 113928
15957 113928 99270 29798 45123 77361 85927 67127 55608 34178 -7904 -18757 -34384 -24588
$$ packed form
16043b6132j0113p504Q551K06N90J3274M957K7241k1531k4506M223p693j828K2090
16029a8175K8862j4938k1279l2959k8529l0496j0208K0408M0037L0330M3895J0293
16017A7241n0679n4117k0570o222J9033N1350N9717j5204j1044k0466P108L7710
16005A3857k205J1029J5349L1245k0497j9186P755k5279K388K3447L4699m493
15993F8109j1736O064j5383m8314l2943L5597L3836l5335k2444j2979M1497L5274
15981D1243L149j7515k5712J5096K3494j7235K5127M451j2303j7630l1110K1823
15969A2878r723K989l4371L0062K1313P3255M627j5571k4811J9974J6891J6415
15957A13928j4658o9472J5325L2238Q566j8800j1519k1430m2082j0853j5627R796
$$ plain form
15945 -24588 47778 50356 19426 45243 42456 63364 76720 48473 10687 -61007 -57786 1533
15933 1533 -2375 -5674 -8085 27203 66033 46748 58177 80389 99250 50815 22435 12650 -5393
15920 -5393 -18805 17471 26807 -18922 -75397 -53729 -20540 22811 63150 35521 27072 1428
15908 1428 10900 15549 -5482 20017 15710 -1224 -32587 -84701 -38850 -39745 -20018 -48130 -21618
15895 -21618 5875 5278 1176 1518 -9650 9617 50351 56452 48812 62071 25071 8296 16562
15882 16562 25704 39868 70243 62755 53090 81250 43680 41060 52288 65540 65153 75942 44238
15869 44238 -4917 12400 2117 -41222 -29466 -36218 -56473 -54635 -67134 -76622 -46671 -51734
15857 -51734 -70453 -73648 -42497 -55380 -10387 25734 53176 28499 85 833 49518 68692
$$ packed form
15945b4588P2366K578l0930K5817k787K0908J3356k8247l7786p1694L221N9319
15933A533l908l299k411L5288L8830j9285J1429K2212J8861m8435k8380r785j8043
15920e393j3412L6276R336m5729n6475K1668L3189M3351M0339k7629q449k5644
15908A428R472M649k1031K5499m307j6934l1363n2114M5851q95J9727k8112K6512
15895b1618K7493n97m102L42j1168J9267M0734O101p640J3259l7000j6775Q266
15882A6562R142J4164L0375p488r665K8160l7570k620J1228J3252l87J0789l1704
15869D4238m9155J7317j0283m3339J1756o752k0255J838j2499r488K9951n063
15857e1734j8719l195L1151j2883M4993L6121K7442k4677k8414P48M8685J9174
$$ plain form
15845 68692 71099 -22625 -116297 -128568 -80040 -62000 -75712 -30739 -41557 -18456 3541 -16540
15833 -16540 -45002 -86063 -111143 -76196 -39429 -20079 -7182 38678 56739 33433 34741 43374
15821 43374 -38475 -27655 53574 84739 35585 -2163 -4713 -1852 434 13253 2394 -27358
15809 -27358 -22686 10307 -11012 -24928 -4329 -10265 -50606 -26304 -21987 36585 67836 49093
15797 49093 -26220 -64736 -36336 -36730 -18457 -8804 -42088 -38691 -38885 -79675 -64474 -27555 -19119
15784 -19119 -4256 -6984 -41363 -44842 -23166 1022 -20189 -44344 -41364 -58085 -68842 -60412
15772 -60412 -50642 -72867 -77578 -34380 -19198 -12466 -885 18917 39226 10444 10312 17330 81483
15759 81483 90950 37501 53509 92512 120696 36659 -29683 -44309 -42661 -31517 -32084 -59455
$$ packed form
15845F8692K407r3724r3672j2271M8528J8040j3712M4973j0818K3101K1997k0081
15833a6540k8462m1061k5080L4947L6767J9350J2897M5860J8061k3306J308Q633
15821D3374q1849J0820Q1229L1165m9154l7748k550K861K286J2819j0859k9752
15809b7358M672L2993k1319j3916K0599n936m0341K4302M317N8572L1251j8743
15797D9093p5313l8516K8400l94J8273R653l3284L397j94m0790J5201L6919Q436
15784a9119J4863k728l4379l479K1676K4188k1211k4155K980j6721j0757Q430
15772f0412R770k2225m711M3198J5182O732J1581J9802K0309k8782j32P018O4153
15759H1483R467n3449J6008L9003K8184q4037o6342j4626J648J1144n67k7371
$$ plain form
15747 -59455 -61865 -52049 -93545 -70873 -23236 31457 52830 54939 50446 61329 20283 -6993
15735 -6993 1353 -12132 -65828 -94710 -78913 -74527 -82441 -52809 -58353 -33444 -1081 52020 57015
15722 57015 44357 98579 142771 129176 27135 -57719 -38952 -41527 -82471 -80937 6122 9607
15710 9607 -41616 -15638 -14633 9530 29898 50002 40514 63795 28329 18799 27133 37674 4027
15697 4027 -5362 54844 21050 -7663 -19197 -26573 -17291 -9546 -36256 -8307 -27007 -57913 -40920
15684 -40920 -4406 -24605 -60507 -74584 -108813 -92598 -40032 -5350 14150 -3796 1425 23390
15672 23390 -8940 -17244 -14728 -2359 4323 -65643 -78703 -71301 -37226 331 -30181 -36547 -20370
15659 -20370 6281 23889 14594 664 1593 13707 -19105 -49829 -83820 -82233 -88862 -51618 -45796
$$ packed form
15747e9455k410R816m1496K2672M7637N4693K1373K109m493J0883m1046k7276
15735f993Q346j3485n3696k8882J5797M386p914K9632n544K4909L2363N3101M995
15722E7015j2658N4222M4192j3595j02041q4854J8767k575m0944J534Q7059L485
15710I607n1223K5978J005K4163K0368K0104r488K3281l5466r530Q334J0541l3647
15697D027r389O0206l3794k8713j1534p376R282P745k6710K7949j8700l0906J6993
15684d0920L6514k0199l5902j4077l4229J6215N2566L4682J9500j7946N221K1965
15672B3390l2330q304K516J2369O682o9966j3060P402L4075L7557l0512o366J6177
15659b0370K6651J7608r295j3930R29J2114l2812l0724l3991J587o629L7244N822
$$ plain form
15646 -45796 -83532 -88440 -42707 -49455 -47615 -51280 -49048 -81802 -88921 -46500 -13592 22465 15466
15633 15466 -45463 -29979 12694 50450 5181 -62682 -133071 -85506 -33779 -19412 -18598 -5612
15621 -5612 20577 9879 23572 35075 -11005 -26250 -24463 -18230 -17109 -14184 -56579 -75303 -71588
15608 -71588 -66791 -53787 1505 70349 61255 21695 38153 13098 -40986 -40361 -45731 -29161 3916
15595 3916 31902 -30318 -40193 -27964 -15236 -5968 35409 66639 42858 17775 9667 -45496
15583 -45496 -69019 -85459 -65197 -71614 -73264 -67691 -38291 -10611 -8614 -11917 5331 -43405 -85027
15570 -85027 -87079 -122306 -69942 -25156 11338 6056 18299 40641 28523 57275 51584 72200
15558 72200 55013 39635 37888 22879 -26768 -40175 4035 8532 -36058 -25700 30035 -4818
$$ packed form
15646d5796l7736m908M5733o748J840l665K232l2754p119M2421L2908L6057o999
15633A5466o0929J5484M2673L7756m5269o7863p0389M7565N1727J4367Q14J2986
15621e612K6189j0698J3693J1503m6080j5245J787O233J121K925m2395j8724L715
15608g1588M797J3004N5292O8844r094l9560J6458k5055n4084O25n370J6570L3077
15595C916K7986o2220r875J2229J2728R268M1377L1230k3781k5083q108n5163
15583d5496k3523j6440K0262o417j650N573K9400K7680J997l303J7248m8736m1622
15570h5027k052l5227N2364M4786L6494n282J2243K2342j2118K8752n691K0616
15558G2200j7187j5378j747j5009m9647j3407M4210M497m4590J0358N5735l4853
$$ plain form
15546 -4818 31256 50672 51189 12690 -43940 -77381 -75723 -86925 -80116 -38969 11924 31624 -14988
15533 -14988 -36768 -8208 -18959 -5293 27736 60888 73555 63616 23398 -39100 -29634 27555
15521 27555 25860 6340 39259 39074 18745 47378 51483 6876 22690 51173 96978 53476
15509 53476 10704 -12674 -95253 -127707 -61764 -29508 -31665 -32551 -453 18048 -12178 -2254
15497 -2254 37576 47706 43701 6640 5889 -2139 -12297 -10624 5064 5059 30589 37598 22019 14777
15483 14777 19105 -11462 -47676 -9524 -11357 9727 10365 4904 -11264 -24064 -61130 -73023 -98418
15470 -98418 -99617 -41931 31626 46056 -18224 -60869 -23101 11389 18789 31778 -9416 32449
15458 32449 75567 61527 62537 28513 19777 12350 31128 24900 -25146 -10242 21586 18290 -29392
$$ packed form
15546d818L6074J9416N17l8499n6630l3441J658j1202O809M1147N0893J9700m6612
15533a4988k1780K8560j0751J3666L3029L3152J2667r939m0218o2498R466N7189
15521B7555j695j9520L2919j85k0329K8633M105m4607J5814K8483M5805m3502
15509E3476m2772k3378q2579l2454O5943L2256k157q86L2098J8501l0226R924
15497b254L9830J0130m005l7061p51q028j0158J673J5688nK5530P009j5579p242
15483A4777M328l0567l6214L8152j833K1084O38n461j6168j2800l7066j1893k5395
15470i8418j199N7686P3557J4430o4280m2645L7768L4490P400J2989m1194M1865
15458C2449M3118j4040J010l4024q736p427J8778o228n0046J4904L1828l296m7682
$$ plain form
15445 -29392 -36244 14953 -15659 -23186 -27523 -25524 -40099 -7737 -12726 -20534 -10929 -34053 -24797
15432 -24797 -20950 -74760 -122524 -124602 -79023 -31144 18483 46640 39708 18156 11988 -3424
15420 -3424 -25423 -66529 -30709 -2439 23356 1340 -20677 -22469 -43420 -55061 -36668 -63575
15408 -63575 -90700 -87152 -52844 -8472 20739 54963 63754 58458 55224 38004 12285 -5962
15396 -5962 -33868 -46374 -33138 -61577 -8864 8379 -60868 -60220 -54724 -137639 -169313 -115776
15384 -115776 -71294 -27488 37260 48192 25808 -8141 -28063 -23801 -73732 -42677 -12546 -9555
15372 -9555 -16166 -19711 -32549 -44314 -98 39853 7278 -6806 27895 20619 6491 39844
15360 39844 98581 76851 75502 96602 76066 18847 2985 21810 -37143 -46597 -26196 -78911
$$ packed form
15445b9392o852N1197l0612p527m337J999j4575L2362m989p808R605k3124R256
15432b4797L847n3810m7764k078M5579M7879M9627K8157o932k1552o168j5412
15420c424k1999m1106L5820K8270K5795k2016k2017j792k0951j1641J8393k6907
15408f3575k7125L548L4308M4372K9211L4224Q791n296l234j7220k5719j8247
15396e962k7906j2506J3236k8439N2713J7243o9247O48N496q2915l1674N3537
15384a15776M4482M3806O4748J0932k2384l3949j9922M262m9931L1055L0131K991
15372i555o611l545j2838j1765M4216L9951l2575j4084L4701p276j4128L3353
15360C9844N8737k1730j349K1100k0536n7219j5862J8825n8953r454K0401n2715
$$ plain form
15348 -78911 -45967 18321 11252 -33609 -46618 -73366 -33123 -23089 6827 12745 61309 74954
15336 74954 13440 -56608 -69659 -89047 -96185 -84613 -4829 37109 20766 52940 68572 46418
15324 46418 -8241 37508 32158 12346 9537 -14308 -14630 -29639 -25352 27303 48664 -3244 -51434
15311 -51434 -32228 -51006 -82396 -86566 -6999 23300 -12107 -48997 -16523 40708 21415 12766
15299 12766 -35145 -67349 -100188 -80863 -79658 -51395 -15977 11332 46691 79323 60354 21350
15287 21350 29578 71160 97910 113471 99172 108877 82963 91709 58442 68994 73214 42321
15275 42321 -20005 -60220 -44330 -36030 -22545 -87695 -57528 -6231 -10969 5099 23276 8370
15263 8370 29088 -4269 -24304 17968 27900 10484 -48290 -64261 -43468 -31154 -12370 -13009
$$ packed form
15348g8911L2944O4288p069m4861j3009k6748M0243J0034K9916N918M8564J3645
15336G4954o1514p0048j3051j9388p138J1572P9784M1938j6343L2174J5632k2154
15324D6418n4659M5749n350j9812k809k3845l22j5009M287N2655K1361n1908m8190
15311e1434J9206j8778l1390m170P9567L0299l5407l6890L2474N7231j9293q649
15299A2766m7911l2204l2839J9325J205K8263L5418K7309L5359L2632j8969l9004
15287B1350Q228M1582K6750J5561j4299R705k5914Q746l3267J0552M220l0893
15275D2321o2326m0215J5890Q300J3485o5150L0167N1297m738J6068J8177j4906
15263H370K0718l3357k0035M2272R932j7416n8774j5971K0793J2314J8784o39
$$ plain form
15251 -13009 -16527 -32983 -24934 -23682 -48306 -32587 28582 6495 -42137 -34937 27245 72622
15239 72622 72595 98728 73166 28667 -27806 -64994 -46075 -3458 15069 -9252 -17293 -32903
15227 -32903 -34648 -13492 988 -15514 -17284 11986 14565 3492 -27929 -3473 11905 -23295
15215 -23295 -45524 7273 -1686 12204 20967 38100 752 -11118 600 -10703 -36844 -30922
15203 -30922 -38689 -8018 -26 -967 10458 53632 99631 71766 28709 -39210 -77462 -93396
15191 -93396 -26098 33275 52176 65113 52119 21123 -2517 11288 34015 38034 -15058 -58838
15179 -58838 -50426 -35325 -32982 -63422 -69729 -10375 43314 -476 8913 28208 31123 2560 758
15166 758 13577 -6267 -21667 -21703 45238 78905 61251 24647 -2987 -38719 -41457 -20718 -26872
$$ packed form
15251a3009l518j6456Q049J252k4624J5719O1169k2087m8632P200O2182M5377
15239G2622k7K6133k5562m4499n6473l7188J8919M2617J8527k4321q041j5610
15227c2903j745K1156J4480j6502j770K9270K579j1073l1421K4456J5378l5200
15215b3295k2229N2797q959J3890Q763J7133l7348j1870J1718j1303k6141N922
15203c0922p767L0671P992r41J1425M3174M5999k7865m3057o7919l8252j5934
15191i3396O7298N9373J8901J2937j2994l0996k3640J3805K2727M019n3092m3780
15179e8838Q412J5101K343l0440o307N9354N3689m3790R389J9295K915k8563j802
15166G58J2819j9844j5400l6O6941L3667j7654l6604k7634l5732k738K0739o154
$$ plain form
15153 -26872 -100311 -115485 -146896 -162068 -139086 -128270 -74034 -62754 -79461 -112798 -122927 -105093
15141 -105093 -63569 -35558 -51364 -91222 -114234 -106720 -75294 -38029 -36754 -64787 -1678 18078
15129 18078 -21297 -23980 16624 -12003 13696 1625 10134 14275 11172 36243 6932 1628 13716
15116 13716 47301 51070 17491 18367 39288 7309 -25849 -25447 20411 35575 35085 10388 -22296
15103 -22296 -99127 -129695 -112865 -79607 -26203 -24150 -28875 -50493 -30541 1660 4155 -27100
15091 -27100 -24402 4697 353 7798 51086 67315 14602 -10717 10920 -20826 9461 24199
15079 24199 39206 -13714 -57433 -43149 -87660 -49456 14321 -19109 -15411 -7634 -21992 -15588
15067 -15588 -27853 -43632 -20841 -19346 1149 17957 -9542 -21309 12261 26935 51371 34087
$$ packed form
15153b6872p3439j5174l1411j5172K2982J0816N4236J1280j6707l3337j0129J7834
15141a05093M1524K8011j5806l9858k3012P514L1426L7265J275k8033O3109J9756
15129A8078l9375k683M0604k8627K5699j2071Q509M141l103K5071k9311n304J2088
15116A3716L3585L769l3579Q76K0921l1979l3158M02M5858J5164m90k4697l2684
15103b2296p6831l0568J6830L3258N3404K053m725k1618J9952L2201K495l1255
15091b7100K698K9099m344P445M3288J6229n2713k5319K1637l1746L0287J4738
15079B4199J5007n2920m3719J4284m4511L8204O3777l3430L698P777j4358O404
15067a5588j2265j5779K2791J495K0495J6808k7499j1767L3570J4674K4436j7284
$$ plain form
15055 34087 10136 65337 63603 24193 16220 42635 31616 45924 31616 30997 -17656 -33848
15043 -33848 25905 14565 6191 3838 5807 38829 32142 -6630 -15182 -22480 -77674 -86628 -74527
15030 -74527 -68668 -63242 -32902 5925 15480 -3916 2130 -23088 -9180 -10291 -50343 -57382 -54379
15017 -54379 -44152 -38412 -33748 13539 46282 42225 23649 14729 -16291 -59223 -88733 -55579
15005 -55579 -55805 -8318 -3786 27996 77253 86617 54004 42571 33948 25072 -33720 -17427 -20321
14992 -20321 -18119 -30304 39715 93283 100217 69617 73232 52209 22826 28923 29152 6182 -34309
14979 -34309 -37148 -14717 -1018 -19758 -15379 -43459 -51838 -31144 -20605 -22386 -6336 -32570
14967 -32570 -28808 -15702 -37139 -54098 2573 -19375 -34971 -16432 4779 -12551 21580 26997
$$ packed form
15055C4087k3951N5201j734l9410p973K6415j1019J4308j4308o19m8653j6192
15043c3848N9753j1340q374k353J969L3022o687l8772q552p298n5194q954J2101
15030g4527N859N426L0340L8827R555j9396O046k5218J3908j111m0052p039L003
15017e4379J0227N740M664M7287L2743m057j8576q920l1020m2932k9510L3154
15005e5579k26M7487M532L1782M9257R364l2613j1433q623q876n8792J6293k894
14992b0321K202j2185P0019N3568O934l0600L615k1023k9383O097K29k2970m0491
14979c4309k839K2431J3699j8740M379k8080q379K0694J0539j781J6050k6234
14967c2570L762J3106k1437j6959N6671k1948j5596J8539K1211j7330L4131N417
$$ plain form
14955 26997 -14789 -52474 -29882 -45525 -61825 -46867 -37155 -3028 28990 57147 33521 34574
14943 34574 21966 21089 63479 43860 27733 41248 41615 28027 10505 -12251 8839 45655
14931 45655 49038 44659 67233 96185 121607 135358 114084 51065 69221 67944 29614 1295
14919 1295 -31875 -45963 -97344 -130038 -97641 -97714 -125741 -88876 -39989 -58231 2843 45023
14907 45023 57970 35641 -44087 -99328 -92103 -73788 -26892 25889 52707 50672 -17085 -54228
14895 -54228 -47163 1601 -32059 -92209 -79155 -15038 -20407 -52380 -17326 4236 -36714 -60763
14883 -60763 -60329 -79486 -51712 -53496 -60638 -44730 -49232 -19103 -11205 80 5434 28512 31914
14870 31914 46982 90233 121650 73498 40042 21492 8905 -43853 -68646 -93246 -83001 -88037
$$ packed form
14955B6997m1786l7685K2592j5643j6300J4958R712L4127L2018K8157k3626J053
14943C4574j2608q77M2390j9619j6127J3515L67j3588j7522k2756K1090L6816
14931D5655L383m379K2574K8952K5422J3751k1274o3019J8156j277l8330k8319
14919A295l3170j4088n1381l2694L2397p3k8027L6865M8887j8242O1074M2180
14907D5023J2947k2329p9728n5241P225J8315M6896N2781K6818k035o7757l7143
14895e4228P065M8764l3660o0150J3054O4117n369l1973L5054K1562m0950k4049
14883f0763M34j9157K7774j784p142J5908m502L0129P898J1285N354K3078L402
14870C1914J5068M3251L1417m8152l3456j8550j2587n2758k4793k4600J0245n036
$$ plain form
14858 -88037 -96198 -80387 -88250 -73467 -65988 -55596 -26721 26061 62192 48014 27908 32167
14846 32167 16480 11737 -26907 -48714 -33649 -46668 -76477 -82992 -52890 -76805 -92250 -89240
14834 -89240 -55071 -35782 -19106 -71036 -91182 -86534 -53611 -37793 -70405 -19896 12164 7177
14822 7177 25016 11914 -41517 -53435 -22329 -23798 -19884 -81684 -102658 -70452 -66678 -14627
14810 -14627 -3122 -46683 -34004 16632 65056 65661 39955 -992 -9445 28879 50179 -16398
14798 -16398 -33728 1682 -8228 -1002 14994 55029 13298 2433 -7389 -34653 -44512 -7942
14786 -7942 27045 33553 52838 27897 -11795 42127 32047 38877 49094 40674 24548 33542 31735
14773 31735 53502 73735 50711 57746 54766 80550 12857 -30171 -34917 -40144 -43599 -22990 -16293
$$ packed form
14858h8037q161J5811p863J4783P479J0392K8875N2782L6131j4178k0106M259
14846C2167j5687m743l8644k1807J5065j3019k9809o515L0102k3915j5445L010
14834h9240L4169J9289J6676n1930k0146M648L2923J5818l2612N0509L2060m987
14822G177J7839j3102n3431j1918L1106j469L914o1800k0974L2206L774N2051
14810a4627J1505m3561J2679N0636M8424O05k5706m0947q453L8324K1300o6577
14798a6398j7330L5410r910P226J5996M0035m1731j0865r822k7264r859L6570
14786g942L4987O508J9285k4941l9692N3922j0080O830J0217q420j6126Q994j807
14773C1735K1767K0233k3024P035k980K5784o7693m3028m746n227l455K0609O697
$$ plain form
14760 -16293 -34562 -48612 -59923 -32660 -50264 -83032 -82337 -73891 -15188 27756 41551 34220
14748 34220 70959 55451 -15459 -43610 -110910 -134850 -73341 18012 45920 67392 99428 99293
14736 99293 73438 59401 102732 68034 16369 13633 2172 -2610 -10431 -6063 4089 -16329
14724 -16329 303 -38934 -95526 -54344 -22079 28011 44512 41329 39089 65765 34046 -46761
14712 -46761 -59564 -23519 -14052 -33086 -43882 -65996 -40974 -21508 -31686 -22333 -48985 -43731
14700 -43731 -15887 -44475 -56039 -62071 -6207 -14161 -30393 -65822 -81714 -87958 -66472 -42373
14688 -42373 -36246 -42824 -49561 -2235 9163 30402 31448 -55842 -57348 -29461 -41411 -65770 -49718
14675 -49718 -20864 -20682 -20955 -4256 -30961 -4314 -14629 23562 40221 9765 -16272 -629
$$ packed form
14760a6293j8269j4050j1311K7263j7604l2768O95Q446N8703M2944J3795p331
14748C4220L6739j5508p0910k8151o7300k3940O1509R1353K7908K1472L2036j35
14736I9293k5855j4037M3331l4698n1665k736j1461m782p821M368J0152k0418
14724a6329J6632l9237n6592M1182L2265N0090J6501l183k240K6676l1719q0807
14712d6761j2803L6045R467j9034j0796k2114K5022J9466j0178R353k6652N254
14700d3731K7844k8588j1564o032N5864p954j6232l5429j5892o244K1486K4099
14688d2373O127o578o737M7326J1398K1239J046q7290j506K7887j1950k4359J6052
14675d9718K8854J82k73J6699k6705K6647j0315L8191J6659l0456k6037J5643
$$ plain form
14663 -629 16861 42758 52225 37436 34606 -22465 -63452 -45561 9631 12232 54305 59656 -17053
14650 -17053 -60654 -34549 -17975 8076 48033 60342 31408 9592 -43937 -78963 -50991 9559
14638 9559 44812 46171 6481 766 18314 36989 37239 33278 43099 61996 93295 35065 4400
14625 4400 3805 992 39931 35166 -5380 -20912 -55646 -52799 -25673 -6433 -2547 15945 -7808
14612 -7808 -36449 -7467 -20845 -8012 11890 1916 -2729 116 -43526 -37470 -27722 -7259 -2487
14599 -2487 8933 -8752 -57531 -58028 -30009 -29813 -27526 -296 -48537 -10545 29519 31345 14443
14586 14443 -38774 -48253 -47732 -31177 249 2995 -16710 -44814 -81963 -84270 -81876 -68337 -57498
14573 -57498 -51976 -8375 44730 63919 38581 33439 -4680 -10749 -14536 -31317 -37109 -14829 21520
$$ packed form
14663f29J7490K5897R467j4789k830n7071m0987J7891N5192K601M2073N351p6709
14650a7053m3601K6105J6574K6051L9957J2309k8934k1816n3529l5026K7972O0550
14638I559L5253J359l9690n715J7548J8675K50l961R821J8897L1299n8230l0665
14625D400n95k813L8939m765m0546j5532l4734K847K7126J9240L886J8492k3753
14612g808k8641K8982j3378J2833J9902r974m645K845m3642O056R748K0463M772
14599b487J1420j7685m8779m97K8019J96K287K7230m8241L7992M0064J826j6902
14586A4443n3217r479N21J6555L1426K746j9705k8104l7149k307K394J3539J0839
14573e7498N522M3601N3105J9189k5338n142l8119o069l787j6781n792K2280L6349
$$ plain form
14560 21520 -23964 -2589 42033 15101 33578 65512 69076 37977 31149 -16927 4436 11374
14548 11374 50949 25352 -31655 3350 74959 98147 64107 49888 31669 31490 -21628 -57040
14536 -57040 -114494 -98116 -37517 933 28009 -16903 -53853 -38106 -3050 -17398 -19225 -19077
14524 -19077 42968 21298 20680 16530 -407 16828 -6942 -18129 19953 -942 -55779 -13163
14512 -13163 27320 18251 9020 8929 -9373 -55689 -50038 -48034 -17137 -46163 -37983 -22844 -34959
14499 -34959 -35208 -16141 28320 52439 45498 40466 54338 -10033 -22867 -20135 3088 -13369 -8967
14486 -8967 9707 19474 23600 -44207 -99036 -89074 -77002 -80951 -32394 34031 38015 14825 -3300
14473 -3300 -1518 -10547 -13197 -884 3940 -6575 -25566 -55570 -35493 19502 772 11900 17827
$$ packed form
14560B1520m5484K1375M4622k6932J8477L1934L564l1099o828m8076K1363O938
14548A1374L9575k5597n7007L5005P1609K3188l4040j4219j8219j79n3118l5412
14536e7040n7454J6378O0599L8450K7076m4912l6950J5747L5056j4348j827J48
14524a9077O2045k1670o18m150j6937J7235k3770j1187L8082k0895n4837M2616
14512a3163M0483r069r231r1j8302m6316N651K004L0897k9026Q180J5139j2115
14499c4959k49J9067M4461K4119o941n032J3872o4371j2834K732K3223j6457M402
14486h967J8674R767M126o7807n4829R962J2072l949M8557O6425L984k3190j8125
14473c300J782r029k650J2313M824j0515j8991l0004K0077N4995j8730J1128N927
$$ plain form
14460 17827 14409 7539 11068 23147 44484 32675 4463 5332 11153 4203 -52615 -59576 -53170
14447 -53170 -65301 -92471 -91603 -47589 -8463 11226 42988 23763 7678 -2445 40619 40674 -987
14434 -987 14704 -22038 -33341 18349 43171 24149 -2938 -46947 -31924 34140 39786 75498
14422 75498 76875 19707 45247 46845 40833 28865 -3782 5180 25899 1504 -31369 -40335 -45483
14409 -45483 18777 28785 88078 119759 124615 135555 83884 24741 34683 98183 127904 89060
14397 89060 60060 115673 166349 187403 205154 136478 101811 74762 39760 19334 51867 89636
14385 89636 46690 15924 37280 4163 -27963 -35979 -21345 -24907 -67289 -43286 -30432 -29388
14373 -29388 -63244 -53832 -40219 -62607 -47860 -34341 -30356 -43390 -14396 -59594 -79991 -39141
$$ packed form
14460A7827l418o870L529J2079K1337j1809k8212Q69N821o950n6818o961O406
14447e3170j2131k7170Q68M4014L9126J9689L1762j9225j6085j0123M3064N5m1661
14434i87J5691l6742j1303N1690K4822j9022k7087m4009J5023O6064N646L5712
14422G5498J377n7168K5540J598o012j1968l2647Q962K0719k4395l2873q966n148
14409d5483O4260J0008N9293L1681M856J0940n1671n9143R942O3500K9721l8844
14397H9060k9000N5613N0676K1054J7751o8676l4667k7049l5002k0426L2533L7769
14385H9636m2946l0766K1356l3117l2126q016J4634l562m2382K4003J2854J044
14373b9388l3856R412J3613k2388J4747J3519L985j3034K8994m5198k0397M0850
$$ plain form
14361 -39141 18564 53349 63814 28030 9338 -793 17934 25280 27142 -34699 3876 6861
14349 6861 15540 58318 97312 68783 76119 72615 48726 14176 -39178 -69679 -44657 16993
14337 16993 36590 -13375 -46320 1545 32365 -7039 -56928 -59759 -61108 -29890 -36590 -28778
14325 -28778 16118 -9359 -56794 -69717 -11468 -25399 -43813 -1741 -39144 -8856 55551 11751
14313 11751 -55536 -54449 -11461 59116 100889 117886 118747 59630 19795 -29014 2578 54923
14301 54923 40323 -1803 12749 18951 22726 -11490 -37972 -31603 -55906 -99584 -111226 -101253
14289 -101253 -41239 -7432 -69159 -89407 -54956 -17349 11435 48688 59018 -8257 579 56613
14277 56613 12589 -26314 -37949 3511 -12528 -31480 -19414 -16411 -9470 38005 42026 44667
$$ packed form
14361c9141N7705L4785J0465l5784j8692j0131J8727P346J862o1841L8575K985
14349F861Q679M2778L8994k8529P336l504k3889l4550n3354l0501K5022O1650
14337A6993J9597m9965l2945M7865L0820l9404m9889k831j349L1218o700P812
14325b8778M4896k5477m7435j2923N8249j3931j8414M2072l7403L0288O4407m3800
14313A1751o7287J087M2988P0577M1773J6997Q61n9117l9835m8809L1592N2345
14301E4923j4600m2126J4552O202L775l4216k6482O369k4303m3678j1642R973
14289a01253O0014L3807o1727k0248L4451L7607K8784L7253J0330o7275Q836N6034
14277E6613m4024l8903j1635M1460j6039j8952J2066L003O941M7475M021K641
$$ plain form
14265 44667 18660 -6146 14532 14358 23560 28008 14810 55661 74150 77628 45860 4129 43776
14252 43776 54506 32686 18560 -2060 22210 70935 93147 89325 21332 18232 53961 45069
14240 45069 29004 4534 -18985 -17550 -21111 -15962 4262 28421 52265 44690 21113 73577
14228 73577 105720 90351 84998 93628 67040 20360 -21083 -42036 -24624 -19508 4183 29970
14216 29970 -16962 -29542 34093 85965 86816 100066 111569 116503 88592 90946 110006 108722 95346
14203 95346 80093 89571 81923 26279 8374 53172 103140 124353 68961 11848 -13297 -26402
14191 -26402 -68886 -9623 38361 40590 31608 25701 43692 54520 -10082 -11634 -18552 -8284 15150
14178 15150 6162 -3821 2387 -44562 -7967 38728 -13984 -25744 38314 60373 30475 -7955
$$ packed form
14265D4667k6007k4806K0678j74R202M448j3198M0851J8489L478l1768m1731L9647
14252D3776J0730k1820j4126k0620K4270M8725K2212l822o7993l100L5729q892
14240D5069j6065k4470k3519J435l561N149K0224K4159K3844p575k3577N2464
14228G3577L2143j5369n353Q630k6588m6680m1443k0953J7412N116K3691K5787
14216B9970m6932j2580O3635N1872Q51J3250J1503M934k7911K354J9060j284j3376
14203I5346j5253R478p648n5644j7905M4798M9968K1213n5392n7113k5145j3105
14191b6402m2484N9263M7984K229q982n907J7991J0828o4602j552o918J0268K3434
14178A5150q988r983O208m6949L6595M6695n2712j1760O4058K2059k9898l8430
$$ plain form
14166 -7955 -39536 -27727 -42703 -42960 -38877 -25742 -24054 -18255 -2066 35703 71678 63066 10135
14153 10135 942 -17382 2348 18055 50809 71632 65142 31760 -6153 797 12240 -3907
14141 -3907 -21421 -40560 -55147 -71077 -36528 -16737 -15807 -28029 -38750 -86634 -67755 -60864
14129 -60864 -90456 -85779 -72692 -73347 -62430 -30678 -46078 -37632 11360 6492 -61735 -45983 -29807
14116 -29807 -40569 -9824 12471 12436 30029 41227 75723 75977 53836 19340 -39470 -23916 9127
14103 9127 32797 28326 45424 49960 37891 15991 3765 50893 66457 20231 4351 -7506
14091 -7506 -32434 -29287 -34491 -32202 -61435 -47446 -16580 -41601 -94115 -70206 -96554 -94501 -36539
14078 -36539 -6641 1004 51502 67081 76760 94610 71582 72071 46723 -9308 -13243 -13806 -36728
$$ packed form
14166g955l1581J1809j4976k57M083J3135J688N799J6189L7769L5975q612n2931
14153A0135r193j8324J9730J5707L2754K0823o490l3382l7913O950J1443j6147
14141c907j7514j9139j4587j5930L4549J9791R30j2222j0721m7884J8879O891
14129f0864k9592M677J3087o55J0917L1752j5400Q446M8992m868o8227J5752J6176
14116b9807j0762L0745K2295l5J7593J1198L4496K54k2141l4496n8810J5554L3043
14103I127K3670m471J7098M536j2069k1900j2226M7128J5564m6226j5880j1857
14091g506k4928L147n204K289k9233J3989L0866k5021n2514K3909k6348K053N7962
14078c6539K9898P645N0498J5579R679J7850k3028M89k5348n6031l935n63k2922
$$ plain form
14065 -36728 -40622 -6201 63883 78537 82894 125777 147384 142402 116950 105448 71894 45479
14053 45479 65337 35338 735 -13193 17472 50278 15896 60831 80566 -6963 -38639 -9736
14041 -9736 -6242 6027 -17275 -32395 -53991 -35299 -5281 15668 21476 1981 -34665 -80785
14029 -80785 -77053 -30300 30731 39812 2284 -44699 -72314 -76789 7555 57459 24689 -10158
14017 -10158 -39166 19175 69180 37971 62017 34640 -7832 -27350 -15016 -14107 33875 11399
14005 11399 -10454 -13177 -31737 -28085 9062 17298 12958 17117 -21905 -2827 27127 52737 41337
13992 41337 59099 76929 80834 81615 37475 -4703 -37581 -30173 -18741 -26530 -14307 -12443 -21584
13979 -21584 -88130 -95573 -54936 -80800 -52941 -16194 -38760 -73842 -49832 -28498 7571 13607
$$ packed form
14065c6728l894L4421P0084J4654M357M2883K1607m982k5452j1502l3554k6415
14053D5479J9858k9999l4603j3928L0665L2806l4382M4935J9735q7529l1676K8903
14041i736L494J2269k3302j5120k1596J8692L0018K0949N808j9495l6646m6120
14029h0785L732M6753O1031R081l7528m6983k7615m475Q4344M9904l2770l4847
14017a0158k9008N8341N0005l1209K4046k7377m2472j9518J2334R09M7982k2476
14005A1399k1853k723j8560L652L7147Q236m340M159l9022J9078K9954K5610j1400
13992D1337J7762J7830L905P81m4140m2178l2878P408J1432p789J2223J864r141
13979b1584o6546p443M0637k5864K7859L6747k2566l5082K4010K1334L6069O036
$$ plain form
13967 13607 -32544 -27517 -67813 -104535 -66901 -17071 25374 39099 15205 -44435 12907 42445
13955 42445 -1045 26260 87769 122261 127128 88068 34696 45195 43411 26762 18533 -12633
13943 -12633 -44467 -40079 -13857 12402 34640 40859 37095 39879 26926 -5553 17898 33134
13931 33134 15110 62026 69893 22343 -51741 -125396 -110738 -67456 -43810 -22297 30861 12322
13919 12322 -5454 -99707 -118241 -68660 -38308 -27076 -4260 3248 -16666 -5567 56104 61009
13907 61009 27348 34787 28009 4107 9348 63055 98242 84909 69380 59647 70113 115298
13895 115298 40590 20411 36349 -3064 -32210 -34294 -19528 31181 20333 -9081 -27057 -29061
13883 -29061 -9154 -9989 3755 -7926 49901 39159 -25103 -46677 -45259 -33127 -57639 -39746
$$ packed form
13967A3607m6151N027m0296l6722L7634M9830M2445J3725k3894n9640N7342K9538
13955D2445m3490K7305O1509L4492M867l9060n3372J0499j784j6649q229l1166
13943a2633l1834M388K6222K6259K2238O219l764K784j2953l2479K3451J5236
13931C3134j8024M6916P867m7550p4084p3655J4658M3282K3646K1513N3158j8539
13919A2322j7776r4253j8534M9581L0352J1232K2816P508j9914J1099O1671M905
13907F1009l3661P439o778k3902N241N3707L5187j3333j5529r733J0466M5185
13895A15298p4708k0179J5938l9413k9146k084J4766N0709j0848k9414j7976k004
13883b9061J9907q35J3744j1681N7827j0742o4262k1574J418J2132k4512J7893
$$ plain form
13871 -39746 -17620 -24232 -13625 -16995 -35165 -61753 -55542 -2651 -33393 -13373 533 13241
13859 13241 22589 21487 13433 15641 19879 -8564 -50165 6054 -26523 -32798 42949 71054 75520
13846 75520 37373 37747 7544 -34855 -17219 -268 -14638 -78185 -68955 -8796 27004 18387
13834 18387 21216 -14247 -65377 -54060 -4894 31595 29695 47225 19670 14922 67051 34281
13822 34281 -1455 11354 3276 19952 47006 71290 50013 67043 67404 -4854 -23316 8143
13810 8143 -37737 -5832 71837 65649 41463 17255 9969 -25162 -49381 -28274 -4850 -70927
13798 -70927 -84009 -67056 -921 42946 36069 23798 37636 48724 31052 13597 14541 -16854
13786 -16854 -19314 27609 49447 -35531 -20191 20485 39695 64612 35646 14360 17015 35810
$$ packed form
13871c9746K2126o612J0607l370j8170k6588O211N2891l0742K0020J3906J2708
13859A3241R348j102q054K208M238k8443m1601N6219l2577o275P5747K8105M466
13846G5520l8147L74l0203m2399J7636J6951j4370o3547R230O0159L5800q617
13834A8387K829l5463n1130J1317M9166L6489j900J7530k7555m748N2129l2770
13822C4281l5736J2809q078J6676K7054K4284k1277J7030L61p2258j8462L1459
13810H143m5880L1905P7669o188k4186k4208p286l5131k4219K1107K3424o6077
13798g0927j3082J6953O6135M3867o877j2271J3838J1088j7672j7455R44l1395
13786a6854k460M6923K1838q4978J5340M0676J9210K4917k8966k1286K655J8795
$$ plain form
13774 35810 -19126 -51039 -19310 -17281 -13167 -44511 -71818 -45322 -35107 21428 21330 1394 36129
13761 36129 55741 18405 127 5349 6767 57327 23771 -19655 5293 -2405 4047 -4886 -35298
13748 -35298 -30648 -1210 18761 39104 18346 -1576 15154 26478 -38412 -71461 -50390 -50061
13736 -50061 -18252 -37933 -18714 -12985 -30083 10023 23464 -8416 -18597 -26333 10728 88580
13724 88580 45392 -33875 -40547 -4045 5586 28097 47462 30990 33143 40928 9600 -17152
13712 -17152 8455 -66116 -67417 -45950 -32749 -8037 -10229 -17934 -15526 -3234 17714 66509
13700 66509 38996 -5223 -15071 -28198 -30888 -8944 20332 28036 38761 42391 -16759 -33072
13688 -33072 732 -33750 -42393 35169 58289 37513 15849 41112 46354 -8618 -35360 -9590
$$ packed form
13774C5810n4936l1913L1729K029M114l1344k7307K6496J0215N6535r8j9936L4735
13761C6129J9612l7336j8278N222J418N0560l3556m3426K4948p698O452q933l0412
13748c5298M650K9438J9971K0343k0758j9922J6730J1324o4890l3049K1071L29
13736e0061L1809j9681J9219N729j7098M0106J3441l1880j0181p736L7061P7852
13724H8580m3188p9267o672L6502R631K2511J9365j6472K153P785l1328k6752
13712a7152K5607p4571j301K1467J3201K4712k192p705K408J2292K0948M8795
13700F6509k7513m4219r848j3127k690K1944K9276P704J0725L630n9150j6313
13688c3072L3804l4482q643P7562K3120k0776k1664K5263N242n4972k6742K5770
$$ plain form
13676 -9590 -9372 -38809 -15167 -273 -14806 -667 55476 42199 14295 -8823 -14583 -20692 18400
13663 18400 30875 -995 -47327 -58459 -49980 -38141 -52080 -12036 1303 6225 -12137 -21019
13651 -21019 -65281 -61492 -80586 -65688 -276 39555 26732 32354 15517 35163 12620 1525
13639 1525 39805 94188 75585 42886 43928 66711 49346 39616 72840 68588 65339 67205 43168
13626 43168 -7587 -33298 -49968 -18173 -50174 -42210 236 21070 62665 91340 117418 86306
13614 86306 37288 -9957 -41639 -13301 15178 26556 4809 42486 92726 61257 36332 30297
13602 30297 69410 104222 113281 82096 65145 49614 8623 -29825 -64199 -79497 -87576 -71794
13590 -71794 -44613 -32201 -38691 -22064 -37945 -28127 75731 47831 48498 82833 69353 45931
$$ packed form
13676i590K18k9437K3642J4894j4533J4139N6143j3277k7904k3118n760o109L9092
13663A8400J2475l1870m6332j1132Q479J1839j3939M0044J3339M922j8362q882
13651b1019m4262L789j9094J4898O5412L9831j2823N622j6837J9646k2543j1095
13639A525L8280N4383j8603l2699J042K2783j7365r730L3224m252l249J866k4037
13626D3168n0755k5711j6670L1795l2001P964M2446K0834M1595K8675K6078l1112
13614H6306m9018m7245l1682K8338K8479J1378k1747L7677N0240l1469k4925o035
13602C0297L9113L4812R059l1185j6951j5531m0991l8448l4374j5298q079J5782
13590g1794K7181J2412o490J6627j5881R818J03858k7900O67L4335j3480k3422
$$ plain form
13578 45931 52758 25448 14255 642 -14465 -179 -6474 -24642 21001 84772 115031 120692
13566 120692 59917 58880 83974 74351 44426 -5861 19546 36773 75913 70606 89336 109312
13554 109312 39370 -22853 -4440 28214 50228 43154 53884 91067 114064 112469 104130 113197
13542 113197 81339 46246 23414 26088 25408 38041 94090 60673 77655 75086 75697 87246 123214
13529 123214 152382 141422 143461 112346 101776 106419 83874 78196 137352 189305 204763 170001
13517 170001 171002 224695 306034 347860 411313 513040 675662 886793 1081345 1302281 1445786
13506 1445786 1481524 1423941 1291149 1125695 938036 770948 635671 522762 439760 451441
13496 451441 429221 387598 302617 263159 239607 248881 232578 211293 187282 151590 183049 227834
$$ packed form
13578D5931O827k7310j1193j3613j5107J4286o295j8168M5643O3771L0259N661
13566A20692o0775j037K5094r623k9925n0287K5407J7227L9140n307J8730J9976
13554A09312o9942o2223J8413L2654K2014p074J0730L7183K2997j595q339R067
13542A13197l1858l5093k2832K674o80J2633N6049l3417J6982k569O11J1549L5968
13529A23214K9168j0960K039l1115j0570M643k2545n678N9156N1953J5458l4762
13517A70001J001N3693Q1339M1826O3453J01727J62622K11131J94552K20936J43505
13506A445786L5738n7583j32792j65454j87659j67088j35277j12909q3002J1681
13496D51441k2220m1623q4981l9458k3552R274j6303k1285k4011l5692L1459M4785
$$ plain form
13484 227834 181109 152642 127324 123491 148663 162998 158890 92278 81791 95397 47741 9546
13472 9546 -17734 -24711 3528 4250 -4364 3658 26228 47718 39992 10020 44339 58878 59489
13459 59489 64852 45079 60667 114245 144287 145069 116665 96885 80688 87147 154615 140645
13447 140645 78859 86796 106466 111001 123803 181013 152099 124552 167242 180873 148693 153293
13435 153293 123672 98954 57724 63716 116823 112170 60157 94444 96582 112023 80677 42525
13423 42525 -3986 24319 42704 21705 15635 5184 39309 63987 117867 134552 121151 114771
13411 114771 66795 10687 24006 64248 76938 76836 35285 7252 -15221 -41056 3084 53840
13399 53840 80801 92473 89551 68913 34059 30647 1372 37529 34784 20930 34186 35791
$$ packed form
13484B27834m6725k8467k5318l833K5172J4335m108o6612j0487J3606m7656l8195
13472I546k7280o977K8239P22q614Q022K2570K1490p726k9972L4319J4539O11
13459E9489N363j9773J5588N3578L0042P82k8404j9780j6197O459O7468j3970
13447A40645o1786P937J9670M535J2802N7210k8914k7547M2690J3631l2180M600
13435A53293k9621k4718m1230N992N3107m653n2013L4287K138J5441l1346l8152
13423D2525m6511K8305J8385k0999o070j0451L4125K4678N3880J6685j3401o380
13411A14771m7976n6108J3319M0242J2690j02m1551k8033k2473k5835M4140N0756
13399E3840K6961J1672k922k0638l4854l412k9275L6157k745j3854J3256J605
$$ plain form
13387 35791 33232 47301 69100 86370 73982 74838 118170 103595 81464 90673 87828 65847 49193
13374 49193 68169 69912 17910 34361 95921 72436 55618 51032 38721 26915 57586 79662
13362 79662 83551 89471 141341 123671 93967 87552 56617 19252 36792 27077 784 38744
13350 38744 51619 37963 52232 59716 63488 60787 60955 36448 16435 -6695 31891 118363 177891
13337 177891 200492 209349 232284 216812 211010 176287 170464 164819 154431 192280 166456 101984
13325 101984 98341 122396 86831 89705 131039 116475 83637 54461 43341 68432 91367 84576
13313 84576 63047 80382 108211 153664 185001 171800 162428 155024 162587 160463 190957 205623
13301 205623 155014 97700 91038 114516 149022 177206 197231 248565 232150 187050 172247 170901
$$ packed form
13387C5791k559J4069K1799J7270j2388Q56M3332j4575k2131R209k845k1981j6654
13374D9193J8976J743n2002J6451O1560k3485j6818m586j2311j1806L0671K2076
13362G9662L889N920N1870j7670k9704o415l0935l7365J7540r715k6293L7960
13350C8744J2875j3656J4269P484L772k701J68k4507k0013k3130L8586Q6472N9528
13337A77891K2601Q857K2935j5472n802l4723n823n645j0388L7849k5824o4472
13325A01984l643K4055l5565K874M1334j4564l2838k9176j1120K5091K2935o791
13313H4576k1529J7335K7829M5453L1337j3201r372p404P563k124L0494J4666
13301B05623n0609n7314o662K3478L4506K8184K0025N1334j6415m5100j4803j346
$$ plain form
13289 170901 184649 168742 143815 128554 123934 167279 171973 140684 140068 160012 228159 239807
13277 239807 228818 226850 217607 234814 259781 309335 344873 354353 412578 460124 467731 441009
13265 441009 435745 397276 347841 313376 291708 244918 258297 223876 179826 186433 257136 282577
13253 282577 288431 247569 174477 177175 195054 206694 202819 212773 271703 269427 211779 145893
13241 145893 99569 98860 116688 147248 194591 204370 121055 147958 205924 236735 251390 267539
13229 267539 312405 348612 373816 381586 374893 373831 378897 367804 388659 434106 503921 550329
13217 550329 521177 521458 562390 597994 719448 827457 978183 1131131 1326007 1597491 1860811
13206 1860811 2104066 2260378 2380810 2470026 2367056 2252677 2082056 1863301 1639663 1405047
$$ packed form
13289A70901J3748j5907k4927j5261m620M3345M694l1289o16J9944O8147J1648
13277B39807j0989j968r243J7207K4967M9554L5538R480N8225M7546P607k6722
13265D41009n264l8469m9435l4465k1668m6790J3379l4421m4050O607P0703K5441
13253B82577N854m0862p3092K698J7879J1640l875R954N8930k276n7648o5886
13241A45893m6324p09J7828L0560M7343R779q3315K6903N7966L0811J4655J6149
13229B67539M4866L6207K5204P770o693j062N066j1093K0855M5447O9815M6408
13217E50329k9152K81M0932L5604J21454J08009J50726J52948J94876K71484K63320
13206A860811K43255J56312J20432Q9216j02970j14379j70621k18755k23638k34616
$$ plain form
13196 1405047 1197586 1048409 891091 851581 824733 790450 787548 764614 757445 763329 757021
13185 757021 734556 710185 677809 625103 620429 596669 596606 669912 693432 665859 645648 613535
13173 613535 607119 605867 630035 622060 634850 650278 656638 673148 694824 771531 808953 817925
13161 817925 779487 755436 767492 784083 832897 833851 773308 773168 769321 753894 823940 904944
13149 904944 884667 887462 923525 1028291 1092998 1107865 1113440 1169169 1210590 1199564 1255643 1254881
13137 1254881 1183228 1176924 1236994 1251706 1217757 1262880 1383047 1525027 1617749 1637729 1630078
13126 1630078 1667708 1760034 1833294 1889036 1942388 2008474 2067100 2144210 2291275 2416026 2564528
13115 2564528 2703049 2831212 2928906 3087421 3342617 3553267 3807792 4097162 4337120 4584633
$$ packed form
13196A405047k07461j49177j57318l9510k6848l4283k902k2934p169N884o308
13185G57021k2465k4371l2376n2706m674k3760o3P3306K3520k7573k0211l2113
13173F13535o416j252K4168p975J2790J5428O360J6510K1676P6707L7422Q972
13161H17925l8438k4051J2056J6591M8814R54o0543j40l847j5427P0046Q1004
13149I04944k0277K795L6063J04766O4707J4867N575N5729M1421j1026N6079p62
13137A254881p1653o304O0070J4712l3949M5123J20167J41980R2722J9980p651
13126A630078L7630R2326P3260N5742N3352O6086N8626P7110J47065J24751J48502
13115B564528J38521J28163R7694J58515K55196K10650K54525K89370K39958K47513
$$ plain form
13105 4584633 4885235 5293811 5757971 6284011 6932133 7605681 8319259 9205269 10365931
13096 10365931 11723824 13406764 15470806 17866053 20642181 23752226 27276891 31330487
13088 31330487 36235805 42576653 51091815 62939295 79565646 102795241 133728642
13081 133728642 171694226 213208327 252195592 282330817 297887776 293796298 268544990
13074 268544990 228761805 186057436 149223203 121076243 100645663 85976673 75339364
13067 75339364 67518779 61501138 56610680 52499449 48806211 45461923 42436099 39686779
13059 39686779 37234860 35067248 33097411 31258236 29679070 28241534 26926328 25716899
13051 25716899 24634924 23688179 22812741 21958931 21126961 20318436 19506320 18819267 18194035
$$ packed form
13105D584633L00602M08576M64160N26040O48122O73548P13578Q86010J160662
13096A0365931J357893J682940K064042K395247K776128L110045L524665M053596
13088C1330487M905318O340848Q515162J1847480J6626351K3229595L0933401
13081A33728642L7965584M1514101L8987265L0135225J5556959m091478k5251308
13074B68544990l9783185m2704369l6834233k8146960k0430580j4668990j0637309
13067G5339364p820585o017641m890458m111231l693238l344288l025824k749320
13059C9686779k451919k167612j969837j839175j579166j437536j315206j209429
13051B5716899j081975r46745q75438q53810q31970q08525q12116o87053o25232
$$ plain form
13042 18194035 17578348 17029641 16454280 15963428 15458145 14923759 14433926 14025297 13566854
13033 13566854 13091643 12680641 12297121 11888767 11573957 11244400 10901483 10634926 10417182
13024 10417182 10176939 9943677 9690335 9467604 9248523 9009647 8763757 8495631 8245736
13015 8245736 8010277 7784258 7561940 7370184 7144168 6938147 6740794 6556715 6382720
13006 6382720 6264664 6253431 6163838 5983180 5808658 5648661 5534032 5435644 5355916 5248090
12996 5248090 5139047 5040849 4949174 4835343 4773323 4696464 4567641 4496873 4441478 4325752
12986 4325752 4211347 4091484 4055557 3939870 3864385 3819546 3788812 3726982 3582929 3553196
12976 3553196 3524372 3413165 3362478 3345204 3290536 3247889 3226437 3142964 3093483 3092985 3131430
$$ packed form
13042A8194035o15687n48707n75361m90852n05283n34386m89833m08629m58443
13033A3566854m75211m11002l83520m08354l14810l29557l42917k66557k17744
13024A0417182k40243k33262k53342k22731k19081k38876k45890k68126k49895
13015H245736k35459k26019k22318j91756k26016k06021j97353j84079j73995
13006F382720j18056j1233q9593j80658j74522j59997j14629r8388p9728j07826
12996E248090j09043r8198r1675j13831o2020p6859j28823p0768n5395j15726
12986D325752j14405j19863l5927j15687p5485m4839l0734o1830j44053k9733
12976C553196k8824j11207n0687j7274n4668m2647k1452q3473m9481m98L8445
$$ plain form
12965 3131430 3138752 3145835 3130328 3120515 3141513 3163474 3217396 3311530 3421424 3590500 3761809
12954 3761809 3978135 4122858 4289374 4425490 4477336 4376086 4200587 4000254 3687949 3373405
12944 3373405 3112855 2936715 2796322 2654522 2545335 2444601 2309552 2210021 2133701 2085619
12934 2085619 2059827 2024739 1918779 1872822 1831165 1782928 1740984 1709559 1666415 1635757 1582352
12923 1582352 1520865 1522288 1511508 1483645 1469219 1497903 1427017 1381749 1358393 1339457 1313813
12912 1313813 1326202 1272483 1253331 1215401 1209892 1157417 1130746 1136185 1128253 1079816 1040021 1062876
12900 1062876 1035639 985475 939756 892902 897489 910951 847575 792084 754757 729320 686804
12889 686804 633889 548946 483460 439300 408432 448601 504107 564551 566694 575336 603233 618308
$$ packed form
12965C131430P322P083j5507r813K0998K1961N3922R4134J09894J69076J71309
12954C761809K16326J44723J66516J36116N1846j01250j75499k00333l12305l14544
12944C373405k60550j76140j40393j41800j09187j00734j35049r9531p6320m8082
12934B085619k5792l5088j05960m5957m1657m8237m1944l1425m3144l0658n3405
12923A582352o1487J423j0780k7863j4426K8684p0886m5268k3356j8936k5644
12912A313813J2389n3719j9152l7930n509n2475k6671N439p932m8437l9795K2855
12900A062876k7237n0164m5719m6854M587J3462o3376n5491l7327k5437m2516
12889F86804n2915q4943o5486m4160l0868M0169N5506O0444K143Q642K7897J5075
$$ plain form
12877 618308 631214 605498 584630 589716 590054 539748 507473 477972 475019 479574 495012 474102
12865 474102 485843 481518 527558 567408 488099 405852 439161 450711 378942 387868 398917 377575
12853 377575 382036 370679 310807 316787 388152 437027 403994 357680 372424 361275 391934 436749
12841 436749 427875 438917 425129 425684 422317 433448 403482 361176 353099 356903 350091 322641 307943
12828 307943 294113 282822 272666 266346 269636 285911 289417 267269 226613 225914 263604 298245
12816 298245 357921 354883 306272 279066 276046 289284 313948 282147 252930 257188 263774 284620
12804 284620 282952 243355 196443 191130 201599 245473 214904 196676 202559 175284 193554 208703
12792 208703 218046 286929 323826 228910 181531 173557 162460 138450 143997 133856 151201 165441
$$ packed form
12877F18308J2906k5716k0868N086L38n0306l2275k9501k953M555J5438k0910
12865D74102J1741m325M6040L9850p9309q2247L3309J1550p1769Q926J1049k1342
12853C77575M461j1357n9872N980P1365M8875l3033m6314J4744j1149L0659M4815
12841D36749q874J1042j3788N55l367J1131k9966m2306q077L804o812k7450j4698
12828C07943j3830j1291j0156o320L290J6275L506k2148m0656o99L7690L4641
12816B98245N9676l038m8611k7206l020J3238K4664l1801k9217M258O586K0846
12804B84620j668l9597m6912n313J0469M3874l0569j8228N883k7275J8270J5149
12792B08703R343O8883L6897r4916m7379p974j1097k4010N547j0141J7345J4240
$$ plain form
12780 165441 166235 122673 88408 129461 114393 92907 134254 180694 190224 148577 154066 141407
12768 141407 132370 133932 138825 159955 166680 143895 139121 154893 191587 164347 162538 185316 221114
12755 221114 181580 193441 221684 174164 123236 82021 86608 79194 81605 90749 93095 106806
12743 106806 134670 141979 203325 202380 177712 149961 88571 19325 32753 55128 66662 67332
12731 67332 81059 82266 76898 65904 96341 89159 112172 74554 78354 60189 16139 22267 55120
12718 55120 52812 86492 60665 37863 27172 46268 94688 156032 113326 76500 70398 38584
12706 38584 24979 31659 48550 49313 -3685 -20380 23338 54214 56392 69381 118779 93174
12694 93174 110349 37997 1957 -38974 -68393 -7130 24036 31184 72413 49465 60198 85755
$$ packed form
12780A65441P94m3562l4265M1053j5068k1486M1347M6440R530m1647N489j2659
12768A41407r037J562M893K1130O725k2785m774J5772L6694k7240j809K2778L5798
12755B21114l9534J1861K8243m7520n0928m1215M587p414K411R144K346J3711
12743A06806K7864P309O1346r45k4668k7751o1390o9246J3428K2375J1534O70
12731F7332J3727J207n368j0994L0437p182K3013l7618L800j8165m4050O128L2853
12718E5120k308L3680k5827k2802j0691J9096M8420O1344m2706l6826o102l1814
12706C8584j3605O680J6891P63n2998j6695M3718L0876K178J2989M9398k5605
12694I3174J7175p2352l6040m0931k9419O1263L1166P148M1229k2948J0733K5557
$$ plain form
12682 85755 107739 78728 25196 -17254 -7411 -5195 -11270 52253 80822 34607 22554 72489
12670 72489 75579 102082 94839 24122 -3475 21907 11887 14862 24335 31868 54372 108818 140883
12657 140883 139453 126571 101160 137536 90802 131144 253260 328221 337317 398472 539600
12646 539600 717419 954082 1149624 1286251 1406973 1470542 1435814 1318490 1164824 1006445
12636 1006445 842302 716465 613302 511561 417081 401206 366973 336183 279125 292675
12626 292675 268883 244096 200494 221921 178442 174643 155062 138719 139612 150293 207703 217786
12614 217786 176433 153179 167796 178038 176946 143723 55413 24215 39570 2782 -35713 17680
12602 17680 59210 45811 45528 57841 64079 58552 80353 75466 69419 24407 30020 77613 94296
$$ packed form
12682H5755K1984k9011n3532m2450R843K216o075O3523K8569m6215j2053M9935
12670G2489L090K6503p243p0717k7597K5382j0020K975R473P533K2504N4446L2065
12657A40883j430j2882k5411L6376m6734M0342J22116P4961R096O1155J41128
12646E39600J77819K36663J95542J36627J20722O3569l4728j17324j53666j58379
12636A006445j64143j25837j03163j01741r4480j5875l4233l0790n7058J3550
12626B92675k3792k4787m3602K1427m3479l799j9581j6343Q93J0681N7410J0083
12614B17786m1353k3254J4617J0242j092l3223q8310l1198J5355l6788l8495N3393
12602A7680M1530j3399k83J2313O238n527K1801m887o047m5012N613M7593J6683
$$ plain form
12589 94296 112120 97154 91274 53062 38114 42967 61492 56477 448 -16855 1909 -21687
12577 -21687 -54273 -77330 -37268 -23029 -27474 8567 60885 64124 64374 69559 69786 40436 16039
12564 16039 46037 44817 75554 86233 12789 -25648 -32555 -18537 1665 5205 27198 14870
12552 14870 6665 13447 74279 94301 73432 43394 17768 25167 65389 40226 5459 -9899
12540 -9899 -15233 -42058 29607 73198 19417 -35101 -49558 -53853 -1293 89044 81278 62869
12528 62869 69625 14705 -20340 -15485 -25766 5098 -4166 11670 7760 -48697 -63087 -36231
12516 -36231 -40183 -60384 -49000 -8132 -14204 -33345 -58568 -51175 -15046 -16273 -30671 -4203
12504 -4203 4314 -33058 -67393 -46729 -24640 10631 23209 31660 779 -21995 17541 63294
$$ packed form
12589I4296J7824j4966n880l8212j4948M853J8525n015n6029j7303J8764k3596
12577b1687l2586k3057M0062J4239m445L6041N2318L239K50N185K27k9350k4397
12564A6039K9998j220L0737J0679p3444l8437o907J4018K0202L540K1993j2328
12552A4870q205O782O0832K0022k0869l0038k5626P399M0222k5163l4767j5358
12540i899n334k6825P1665M3591n3781n4518j4457m295N2560R0337p766j8409
12528F2869O756n4920l5045M855j0281L0864r264J5836l910n6457j4390K6856
12516c6231l952k0201J1384M0868o072j9141k5223P393L6129j227j4398K6468
12504d203Q517l7372l4335K0664K2089L5271J2578Q451l0881k2774L9536M5753
$$ plain form
12492 63294 46762 41797 47432 37886 2203 33617 58350 24466 -19058 -28397 5079 -5745
12480 -5745 3605 41003 17433 11662 38900 21750 -31855 -18324 -22677 -52645 -23095 -17518 -73994
12467 -73994 -81689 -27565 38627 58040 -976 -48189 -34970 22738 63877 81005 48676 76273
12455 76273 53505 2038 -7096 -3635 20367 67022 57543 -6363 -64258 -104500 -105785 -60017
12443 -60017 17194 -1495 -19863 -32083 11007 55413 63823 48669 38937 31266 -20745 -60957
12431 -60957 -9855 39159 79589 34884 -4024 24389 13740 -27820 -3008 22780 11176 -36450
12419 -36450 -10783 27023 134 -23696 -8788 16802 46118 27818 17671 31976 5856 9248
12407 9248 23988 49058 93316 95424 82644 113748 88232 15234 -30321 -54100 -52862 -53188 -33690
$$ packed form
12492F3294j6532m965N635r546l5683L1414K4733l3884m3524r339L3476j0824
12480e745R350L7398k3570n771K7238j7150n3605J3531m353k9968K9550N577n6476
12467g3994p695N4124O6192J9413n9016m7213J3219N7708M1139J7128l2329K7597
12455G6273k2768n1467r134L461K4002M6655r479o3906n7895m0242j285M5768
12443f0017P7211j8689j8368j2220M3090M4406Q410j5154r732p671n2011m0212
12431f0957N1102M9014M0430m4705l8908K8413j0649m1560K4812K5788j1604m7626
12419c6450K5667L7806k6889k3830J4908K5590K9316j8300j0147J4305k6120L392
12407I248J4740K5070M4258K108j2780L1104k5516p2998m5555k3779J238l26J9498
$$ plain form
12394 -33690 -24794 -48540 -24062 19652 9964 58574 148469 157103 92920 -19307 -61693 -58316
12382 -58316 -35004 -15093 -11114 -4228 -5164 -30519 -85625 -80760 -7951 60172 67583 13593 17006
12369 17006 25982 -3064 5630 15991 4565 17340 28015 59599 32111 -22035 -29369 -28051
12357 -28051 -12931 -10128 -18745 -29320 -5455 -38965 13084 72245 43343 41027 42869 30785
12345 30785 21991 56840 45839 14539 13264 4368 -12434 13199 17442 59718 89520 94635 44529
12332 44529 30741 32372 -40197 -1905 76997 81032 77788 17725 -29598 -24315 -14825 -11681 -50109
12319 -50109 -95545 -68413 -16473 3433 9110 31218 2816 -7226 -21302 -51587 -20248 3715
12307 3715 41754 58543 72418 14131 -1056 -12101 -18871 -37898 -9388 19191 42884 -7725
$$ packed form
12394c3690Q896k3746K4478M3714r688M8610Q9895Q634o4183j12227m2386L377
12382e8316K3312J9911L979O886r36k5355n5106M865P2809O8123P411n3990L413
12369A7006Q976k9046Q694J0361j1426J2775J0675L1584k7488n4146p334J318
12357b8051J5120K803q617j0575K3865l3510N2049N9161k8902k316J842j2084
12345C0785q794L4849j1001l1300j275q896j6802K5633M243M2276K9802N115n0106
12332D4529j3788J631p2569L8292P8902M035l244o0063m7323N283R490L144l8428
12319e0109m5436K7132N1940J9906N677K2108k8402j0042j4076l0285L1339K3963
12307C715L8039J6789J3875n8287j5187j1045o770j9027K8510K8579K3693n0609
$$ plain form
12295 -7725 -29332 233 728 17451 16874 -2290 -43204 -72184 -39461 6119 15234 -2039 -9780
12282 -9780 -91329 -109871 -79850 -39463 -11708 -27072 8295 -14234 -72015 -74752 -39421 -35785
12270 -35785 -23827 -18315 -63609 -49092 -23921 8496 1402 -20170 -19450 -13946 -9747 -7711 -7592
12257 -7592 24274 31423 13735 -45446 -29567 -30582 -24914 -1277 15838 -17610 22938 39353
12245 39353 4264 -48854 -39417 -79739 -86535 -97985 -59244 -25115 -48383 -31297 18292 55540
12233 55540 3544 -5640 -24104 -8465 32685 26112 3346 -21976 -27290 445 14285 18461
12221 18461 15299 13140 28159 24166 44419 70369 63280 52937 11536 2693 24371 22605 24315
12208 24315 26160 15337 -21309 -18355 -40576 -62094 -37465 -33679 -24660 -49599 -54987 -41095 -53842
$$ packed form
12295g725k1607K9565M95J6723n77j9164m0914k8980L2723M5580R115j7273p741
12282i780q1549j8542L0021M0387K7755j5364L5367k2529n7781k737L5331L636
12270c5785J1958N512m5294J4517K5171L2417p094k1572P20N504M199K036J19
12257g592L1866P149j7688n9181J5879j015N668K3637J7115l3448M0548J6415
12245C9353l5089n3118R437m0322o796j1450L8741L4129k3268J7086M9589L7248
12233E5540n1996r184j8464J5639M1150o573k2766k5322n314K7735J3840M176
12221A8461l162k159J5019l993K0253K5950p089j0343m1401q843K1678j766J710
12208B4315J845j0823l6646K954k2221k1518K4629L786R019k4939n388J3892j2747
$$ plain form
12195 -53842 -48702 3329 38244 41218 103670 128840 123350 87667 89203 57022 62898 114520 76062
12182 76062 85392 113483 126187 108928 54078 27077 -56295 -107248 -66870 -6101 -14947 -41070
12170 -41070 -23092 -10187 2899 25829 8103 -7591 -3871 21669 44219 64374 70172 67171
12158 67171 60659 49057 49690 78419 95459 72918 18078 25030 88737 102981 106459 68143 49061
12145 49061 67643 76263 26089 -33868 -56270 -27864 22786 42552 57490 7668 3310 13035
12133 13035 37857 83061 91534 97122 66506 43308 33453 53785 95279 117696 117897 118686 75245
12120 75245 18120 23301 21005 60154 47801 -13875 -86263 -33680 25767 46650 84528 26744
12108 26744 -4964 -8622 -4722 6998 49346 44064 50821 60119 29268 -1449 20179 30545 49093
$$ packed form
12195e3842N140N2031L4915K974O2452K5170n490l5683J536l2181N876N1622l8458
12182G6062R330K8091J2704j7259n4850k7001q3372n0953M0378O0769q846k6123
12170d1070J7978J2905J3086K2930j7726j5694L720K5540K2550K0155N798l001
12158F7171o512j1602O33K8729J7040k2541n4840O952O3707J4244L478l8316j9082
12145D9061J8582Q620n0174n9957k2402K8406N0650J9766J4938m9822m358R725
12133A3035K4822M5204Q473N588l0616k3198r855K0332M1494K2417K01P89m3441
12120G5245n7125N181k296L9149j2353o1676p2388N2583N9447K0883L7878n7784
12108B6744l1708l658L900J1720M2348n282O757R298l0851l0717K1628J0366J8548
$$ plain form
12095 49093 28913 16036 22242 5392 -1405 -7194 42660 27792 24421 28377 10064 -8903 -55214
12082 -55214 -86194 -113174 -103546 -53165 -48498 -57887 -72116 -14189 8054 -16479 -15487 -4972 -17171
12069 -17171 -2294 30629 49458 90076 77555 43324 16592 -11652 -1066 10280 11440 -43272
12057 -43272 -99567 -95030 -87469 -74390 -63518 485 12180 1074 -6007 -38412 -76023 -60195
12045 -60195 -187 9194 -24819 -37888 -28447 -39957 -26394 -15949 -8113 -26297 -29650 -44598
12033 -44598 15218 31064 29650 49505 84578 30046 -9636 19565 59898 20948 -57746 -7344
12021 -7344 49367 57381 31344 -19061 -25916 -22860 -34179 -45212 -47918 -26852 -45650 -47726 -57161
12008 -57161 -53292 -82871 -74384 -56084 -78799 -60489 -32296 -21407 -22426 -6357 -7931 -40522
$$ packed form
12095D9093k0180j2877O206j6850o797n789M9854j4868l371L956j8313j8967m6311
12082e5214l0980k6980R628N0381M667r389j4229N7927K2243k4533R92J0515j2199
12069a7171J4877L2923J8829M0618j2521l4231k6732k8244J0586J1346J160n4712
12057d3272n6295M537P561J3079J0872O4003J1695j1106p081l2405l7611J5828
12045f0195O0008R381l4013j3069R441j1510J3563J0445P836j8184l353j4948
12033d4598N9816J5846j414J9855L5073n4532l9682K9201M0333l8950p8694N0402
12021g344N6711Q014k6037n0405o855L056j1319j1033k706K1066j8798k076r435
12008e7161L869k9579Q487J8300k2715J8310K8193J0889j019J6069j574l2591
$$ plain form
11996 -40522 -49773 6807 13444 -42552 -30652 -5851 -26493 -51900 -16708 41707 45909 92512
11984 92512 145917 92794 71675 29717 -2035 -20551 -22228 16925 7530 16933 -1823 24557
11972 24557 28203 61781 49745 -26171 -6666 11314 3006 31278 59985 59270 117416 81545
11960 81545 -15971 -22534 -20975 -12251 15120 4578 -25730 -19481 -2118 -13593 -7139 -13452 20196
11947 20196 78514 92560 45600 33884 -327 30946 73826 22303 -54338 -60248 -48609 -5701
11935 -5701 -40846 -37009 -8467 -49089 -37849 15426 48258 62721 45150 28881 10453 66705
11923 66705 75115 48709 13069 -4126 -36742 -85416 -68400 -63738 -31572 -6346 8858 4757
11911 4757 -9574 -38057 -70762 -73268 -7406 16040 -15879 4473 41885 59317 67520 45679
$$ packed form
11996d0522r251N6580O637n5996J1900K4801k0642k5407L5192N8415M202M6603
11984I2512N3405n3123k1119m1958l1752j8516j677L9153r395R403j8756K6380
11972B4557L646L3578j2036p5916J9505J7980q308K8272K8707p15N8146l5871
11960H1545r7516o563J559Q724K7371j0542l0308O249J7363j1475O454o313L3648
11947B0196N8318J4046m6960j1716l4211L1273M2880n1523p6641n910J1639M2908
11935e701l5145L837K8542m0622J1240N3275L2832J4463j7571j6269j8428N6252
11923F6705Q410k6406l5640j7195l2616m8674J7016M662L2166K5226J5204m101
11911D757j4331k8483l2705k506O5862K3446l1919K0352L7412J7432Q203k1841
$$ plain form
11899 45679 11374 -19168 -17362 -52018 -112170 -90707 -49728 -9497 54317 113938 122272 174676
11887 174676 156956 63784 20294 7935 -15785 -54782 -33110 13168 -2490 -46457 -25749
11876 -25749 -13598 -39076 26818 59172 60156 33575 42741 44936 22288 15831 6959 44360 72857
11863 72857 54001 29067 -10822 -5654 15384 17423 16046 3135 -2724 -12566 -59252 -79913 -120696
11850 -120696 -153357 -128288 -127879 -56771 12193 -24312 -56507 -48334 -31983 -26491 -12232 26018
11838 26018 10716 -35820 -55601 -45526 -28698 -54499 -54819 -68015 -89560 -116032 -136245 -114701
11826 -114701 -52863 -37285 -49377 -20375 47026 31338 -20940 20577 21645 -34085 -46678 -23547
11814 -23547 5815 -23971 -13249 -25189 -10042 16101 57633 41151 17001 42920 32885 37252
$$ packed form
11899D5679l4305l0542J806l4656o0152K1463M0979M0231O3814N9621Q334N2404
11887A74676j7720r3172m3490j2359k3720l8997K1672M6278j5658m3967K0708
11876b5749J2151k5478O5894L2354R84k6581R166K195k2648o457q872L7401K8497
11863G2857j8856k4934l9889N168K1038K039j377j2911n859r842m6686k0661m0783
11850a20696l2661K5069M09P1108O8964l6505l2195Q173J6351N492J4259L8250
11838B6018j5302m6536j9781J0075J6828k5801l20j3196k1545k6472k0213K1544
11826a14701O1838J5578j2092K9002O7401j5688n2278M1517J068n5730j2593K3131
11814b3547K9362k9786J0722j1940J5147K6143M1532j6482k4150K5919j0035M367
$$ plain form
11802 37252 63161 22547 -9920 -20504 -48613 -89575 -42912 -23911 -63235 -18154 -4913 -7806
11790 -7806 -3748 5268 13645 28154 32607 6645 -29065 -33223 -10631 6221 -29798 -41562 -10111
11777 -10111 -16980 -11336 -6370 31264 39038 53434 26175 -832 709 26501 44455 18988 10432
11764 10432 1539 -20582 -57132 -87508 -46740 -56632 -43203 17793 48779 18174 -28630 -85195
11752 -85195 -79584 -59689 -29843 -39928 -26419 28717 41213 38833 24512 21412 28009 -24260
11740 -24260 -66870 -33444 -13356 4650 -16266 -72363 -77489 -76902 -74212 -38625 12161 63064
11728 63064 58465 16996 4275 6204 19351 48487 19405 777 19989 7619 8925 21990
11716 21990 -16207 12461 44374 35905 48926 20789 17935 2995 -31087 -35806 -41502 -35861 -10989
$$ packed form
11802C7252K5909m0614l2467j0584k8109m0962M6663J9001l9324M5081J3241k893
11790g806M058R016Q377J4509M453k5962l5710m158K2592J6852l6019j1764L1451
11777a0111o869N644M966L7634P774J4396k7259k7007J541K5792J7954k5467q556
11764A0432q893k2121l6550l0376M0768r892J3429O0996L0986l0605m6804n6565
11752h5195N611J9895K9846j0085J3509N5136J2496k380j4321l100O597n2269
11740b4260m2610L3426K0088J8006k0916n6097n126N87K690L5587N0786N0903
11728F3064m599m1469j2721J929J3147K9136k9082j8628J9212j2370J306J3065
11716B1990l8197K8668L1913q469J3021k8137k854j4940l4082m719n696N641K4872
$$ plain form
11703 -10989 -45706 -55640 -99767 -143831 -151919 -128099 -102857 -93531 -33500 -4716 -19821 -26855
11691 -26855 18989 61236 -12413 -15953 6983 40969 47277 15044 55640 70585 65046 46843
11679 46843 15744 -47516 -77347 -58693 -13671 8244 -14800 -59053 -88293 -36569 3157 -15355
11667 -15355 -17143 -25804 -35719 -63014 -118218 -95550 -54192 -50312 -105211 -56749 -35299 -23442
11655 -23442 55835 68868 76261 48069 68758 39317 14469 -4318 7627 -16066 -34810 -32002
11643 -32002 -13527 1880 44542 37522 -28592 -74962 -21042 28820 38304 7084 22125 46837
11631 46837 -3282 -57563 -27572 25233 18934 -7073 5982 29278 13956 37732 33097 63294
11619 63294 71977 57057 18588 36004 17947 13733 25074 61111 52596 -3241 14114 17847
$$ packed form
11703a0989l4717r934m4127m4064q088K3820K5242R326O0031K8784j5105p034
11691b6855M5844M2247p3649l540K2936L3986O308l2233M0596J4945n539j8203
11679D6843l1099o3260k9831J8654M5022K1915k3044m4253k9240N1724L9726j8512
11667a5355j788q661r915k7295n5204K2668M1358L880n4899M8462K1450J1857
11655b3442P9277J3033P393k8192K0689k9441k4848j8787J1945k3693j8744K808
11643c2002J8475J5407M2662p020o6114m6370N3920M9862R484l1220J5041K4712
11631D6837n0119n4281K9991N2805o299k6007J3055K3296j5322K3776m635L0197
11619F3294Q683j4920l8469J7416j8057m214J1341L6037q515n5837J7355L733
$$ plain form
11607 17847 19260 43714 59243 111980 136812 170090 166281 132042 91162 66682 36010 33745
11595 33745 40154 73880 66735 63973 67460 49035 16015 440 -17074 -23756 -6566 6200 2849
11582 2849 -13116 -16438 -38848 -4044 17486 3220 -58932 -145111 -179159 -152976 -119869 -143767
11570 -143767 -102986 -34671 -9474 2443 -50884 -67075 -13577 22229 -18376 -62041 -63006 -44118
11558 -44118 -9949 -8993 38513 60168 84023 81901 57044 11960 19397 30944 9381 -8346
11546 -8346 51418 109659 47690 18281 54139 22997 17303 74216 53373 35718 4620 -706
11534 -706 4386 23011 25481 20262 16367 13665 -29431 26542 23543 -60312 -52746 -47398 -46990 -9632
11520 -9632 -55131 -30264 -51400 -100293 -127030 -85741 -63034 -60959 -30493 -20595 -20259 41772 33203
$$ packed form
11607A7847J413K4454J5529N2737K4832L3278l809l4239m0880k4480l0672k265
11595C3745O409L3726p145k762L487j8425l3020j5575j7514o682J7190J2766l351
11582B849j5965l322k2410L4804K1530j4266o2152q6179l4048K6183L3107k3898
11570a43767M0781O8315K5197J1917n3327j6191N3498L5806m0605m3665r65J8888
11558d4118L4169R56M7506K1655K3855k122k4857m5084P437J1547k1563j7727
11546h346N9764N8241o1969k9409L5858l1142n694N6913k0843j7655l1098n326
11534g06N092J8625K470n219l895k702m3096N5973k999q3855P566N348M08L7358
11520i632m5499K4867k1136m8893k6737M1289K2707K075L0466R898L36O2031q569
$$ plain form
11507 33203 -7798 -7518 16324 25622 37479 12902 -45408 -52822 -55400 -50887 -19645 -6472 -4794
11494 -4794 5513 26229 43233 35784 -13511 -25055 52307 41639 40677 31603 -15932 3787 -49213
11481 -49213 -56124 -40692 -41894 -52868 -32518 10972 25267 -10001 -20874 -7659 14111 45761
11469 45761 9192 -28611 -62105 -53374 -43378 -88234 -45292 7005 3582 -1240 -14847 1227
11457 1227 58428 76805 76318 81567 59211 43437 58270 28630 17984 28653 -10989 2544
11445 2544 9072 -9565 -19862 -23417 -10292 -31786 -24677 10173 -10373 -7689 -39629 -47600 -7598
11432 -7598 45681 36586 -683 -57457 -56882 -55539 -46071 -43829 478 13224 -9717 -15538 -8181
11419 -8181 -28101 -48381 -62697 -64242 -31140 12027 -8468 -31494 -78599 -75158 -7550 22120
$$ packed form
11507C3203m1001K80K3842R298J1857k4577n8310p414k578M513L1242J3173J678
11494d794J0307K0716J7004p449m9295j1544P7362j0668r62r074m7535J9719n3000
11481d9213o911J5432j202j0974K0350M3490J4295l5268j0873J3215K1770L1650
11469D5761l6569l7803l3494Q731R996m4856M2942N2297l423m822j3607J6074
11457A227N7201J8377m87N249k2356j5774J4833k9640j0646J0669l9642J3533
11445B544O528j8637j0297l555J3125k1494P109L4850k0546K684l1940p971M0002
11432g598N3279r095l7269n6774N75J343R468K242M4307J2746k2941n821P357
11419h181j9920k0280j4316j545L3102M3167k0495k3026m7105L441O7608K9670
$$ plain form
11407 22120 39992 52136 10480 7790 -21381 -20985 3952 48390 83765 42339 61342 51312
11395 51312 12070 -29173 -56050 -58727 -32730 -32947 -30236 -48964 -74199 -73795 -47063 -8739 11166
11382 11166 34384 45426 18483 35988 42780 9857 -19322 -16972 -30892 -51674 -45783 20340
11370 20340 11191 -10288 -13549 -24257 -28205 -35249 -540 17977 11468 -16102 17169 32576 29668
11357 29668 50269 67564 99248 105439 66831 73438 9547 2094 5455 -37802 -62040 -44634
11345 -44634 -16938 -12879 52473 112799 54522 -21222 5592 8421 -12898 -1857 -38775 -26970
11333 -26970 -2961 8133 19460 47551 32800 21659 7504 31622 8900 47177 62599 71455
11321 71455 41188 18778 -8286 2181 1079 -28082 25948 23412 36133 28278 29207 25630 12072
$$ packed form
11407B2120J7872J2144m1656k690k9171L96K4937M4438L5375m1426J9003j0030
11395E1312l9242m1243k6877k677K5997k17K711j8728k5235M04K6732L8324J9905
11382A1166K3218J1042k6943J7505O792l2923k9179K350j3920k0782N891O6123
11370B0340r149k1479l261j0708l948p044L4709J8517o509k7570L3271J5407k908
11357B9668K0601J7295L1684O191l8608O607o3891p453L361m3257k4238J7406
11345d4634K7696M059O5352O0326n8277p5744K6814K829k1319J1041l6918J1805
11333b6970K4009J1094J1327K8091j4751j1141j4155K4118k2722L8277J5422Q856
11321G1455l0267k2410k7064J0467j102k9161N4030k536J2721p855R29l577j3558
$$ plain form
11308 12072 -17021 1587 33317 42491 -8848 -52053 -14322 36726 53291 67717 53330 43178
11296 43178 36770 12779 14690 -14454 -15235 -60457 -65518 -34051 9777 16630 29949 75774 60959
11283 60959 8993 -40378 -71250 -49680 -19760 -6362 476 449 -6332 -26485 -26771 -27894 -47208
11270 -47208 -56593 -83853 -124339 -113909 -64806 -17222 54976 77664 94440 77808 34471 29423
11258 29423 76302 104373 145553 154035 124197 80653 99542 143031 141961 123920 85118 80998
11246 80998 46796 3334 14551 -662 8095 39955 79903 75784 42682 16147 -9354 -35063
11234 -35063 -8885 5782 -26465 -15369 2049 4165 -22244 -31790 -29678 -34537 -53340 -57067 -65503
11221 -65503 -35547 -1209 19878 33935 20210 -14416 23578 14843 -18945 15296 41104 26372
$$ packed form
11308A2072k9093J8608L1730R174n1339m3205L7731N1048J6565J4426j4387j0152
11296D3178o408k3991J911k9144p81m5222n061L1467M3828O853J3319M5825j4815
11283F0959n1966m9371l0872K1570K9920J3398O838k7o781k0153k86j123j9314
11270d7208r385k7260m0486J0430M9103M7584P2198K2688J6776j6632m3337n048
11258B9423M6879K8071M1180Q482k9838m3544J8889M3489j070j8041l8802m120
11246H0998l4202m3462J1217j5213Q757L1860L9948m119l3102k6535k5501k5709
11234c5063K6178J4667l2247J1096J7418K116k6409r546K112m859j8803l727q436
11221f5503K9956L4338K1087J4057j3725l4626L7994q735l3788L4241K5808j4732
$$ plain form
11209 26372 18313 20790 24190 17957 4843 -26839 -77709 -43184 3443 -2245 -527 4345 -781
11196 -781 -19874 -36700 -48962 -568 76793 93483 95222 79696 65497 111757 94745 30792
11184 30792 -13759 -72197 -60058 -26629 -991 -4784 8377 57527 77433 79269 43135 21232
11172 21232 13338 38601 39065 9711 -3298 -679 7444 -15987 10002 -7329 -22815 9783 27343
11159 27343 55162 86518 21799 14058 5350 29139 62500 34679 35584 55232 31288 48626
11147 48626 94292 70013 79763 65976 66424 67697 55590 71381 44718 56969 79879 43152
11135 43152 34913 40409 58460 53007 103395 129402 120584 144255 163458 167072 158864 134623 87556
11122 87556 15923 24884 84036 48151 5974 -23353 18288 39131 -6410 -48271 -34626 29164
$$ packed form
11209B6372q059K477L400o233j3114l1682n0870L4525M6627n688J718M872n126
11196g81j9093j6826j2262M8394P7361J6690J739j5526j4199M6260j7012o3953
11184C0792m4551n8438J2139L3429K5638l793J3161M9150J9906J836l6134k1903
11172B1232p894K5263M64k9354j3009K619Q123k3431K5989j7331j5486L2598J7560
11159B7343K7819L1356o4719p741q708K3789L3361k7821R05J9648k3944J7338
11147D8626M5666k4279R750j3787M48J273j2107J5791k6663J2251K2910l6727
11135D3152q239N496J8051n453N0388K6007q818K3671J9203L614q208k4241m7067
11122H7556p1633Q961N9152l5885m2177k9327M1641K0843m5541m1861J3645O3790
$$ plain form
11110 29164 55188 29417 27258 27017 57562 81479 73192 66273 12450 -17532 -8875 3380 58855
11097 58855 92684 74410 87859 111963 117571 111451 143277 138488 95591 76789 84214 115646
11085 115646 151121 155553 95086 20856 -36659 -53142 -13574 65505 58928 21353 17286 53696
11073 53696 46763 -19657 14279 63616 63585 52365 132467 119184 64166 62792 55834 12701 17985
11060 17985 7295 10843 75440 82387 78496 44893 87631 125808 73371 40675 74500 32020
11048 32020 8899 3844 13224 103802 107657 95161 106643 105831 91444 70079 64659 41747 17789
11035 17789 51690 63414 52240 78560 109099 79125 128109 161822 168574 211007 226743 243331
11023 243331 235283 242409 304244 343063 451264 537403 659819 803853 1049401 1362948 1715403
$$ packed form
11110B9164K6024k5771k159k41L0545K3917q287o919n3823k9982Q657J2255N5475
11097E8855L3829j8274J3449K4104N608o120L1826m789m2897j8802P425L1432
11085A15646L5475M432o0467p4230n7515j6483L9568P9079o577l7575m067L6410
11073E3696o933o6420L3936M9337l1j1220Q0102j3283n5018j374o958m3133N284
11060A7985j0690L548O4597O947l891l3603M2738L8177n2437l2696L3825m2480
11048C2020k3121n055R380R0578L855j2496J1482q12j4387k1365n420k2912k3958
11035A7789L3901J1724j1174K6320L0539k9974M8984L3713O752M2433J5736J6588
11023B43331q048P126O1835L8819J08201Q6139J22416J44034K45548L13547L52455
$$ plain form
11012 1715403 2086866 2329741 2474273 2471333 2312101 1975356 1605266 1269885 1050046 895065
11002 895065 754754 651233 552018 485736 417550 384448 320760 325582 322850 294786 275469
10991 275469 262969 238685 230729 209334 249442 329381 290474 261746 242886 246288 237837 250440
10979 250440 228139 194979 229687 246137 248956 178562 166634 179346 201133 175155 178632 179422
10967 179422 173801 214527 221115 161791 142025 217309 196756 192466 227265 223734 186673 198997
10955 198997 145738 136387 103400 103665 110321 114817 127708 106327 102354 94390 111727 95755 108434
10942 108434 89126 103010 149185 180246 142594 81258 65920 59092 48043 54365 44864 68153
10930 68153 91913 94620 96775 70828 44342 78135 122333 159455 174774 116588 77687 105757
$$ packed form
11012A715403L71463K42875J44532k940j59232l36745l70090l35381k19839j54981
11002H95065j40311j03521r9215o6282o8186l3102o3688M822k732k8064j9317
10991B75469j2500k4284p956k1395M0108P9939l8907k8728j8860L402q451J2603
10979B50440k2301l3160L4708J6450K819p0394j1928J2712K1787k5978L477P90
10967A79422n621M0726O588n9324j9766P5284k0553m290L4799l531l7061J2324
10955A98997n3259r351l2987K65O656M496J2891k1381l973p964J7337j5972J2679
10942A08434j9308J3884M6175L1061l7652o1336j5338o828j1049O322r501K3289
10930F8153K3760K707K155k5947k6486L3793M4198L7122J5319n8186l8901K8070
$$ plain form
10918 105757 84255 105240 162185 115861 71932 8859 35482 77347 80045 65544 11498 12551
10906 12551 3659 22963 46410 44931 61422 75517 116254 148591 136580 80854 103050 132768
10894 132768 104969 103832 150815 178807 172386 201031 211457 173001 176424 161469 103584 92644
10882 92644 82898 69770 38673 35247 103368 149553 140297 160198 207317 244614 192592 108210
10870 108210 34950 61295 116252 169877 195164 194083 147946 80938 96847 88773 87053 105440
10858 105440 88442 105590 150829 188477 228839 231393 266734 300500 332480 326966 331954 367877
10846 367877 381008 355563 320207 292908 332568 356861 391866 412846 350198 318887 303383
10835 303383 286994 255910 245598 251502 274850 287421 217337 138885 152395 245946 251109 209797
$$ packed form
10918A05757k1502K0985N6945m6324m3929o3073K6623M1865K698j4501n4046J053
10906A2551q892J9304K3447j479J6491J4095M0737L2337j2011n5726K2196K9718
10894A32768k7799j137M6983K7992o421K8645J0426l8456L423j4955n7885j0940
10882I2644r746j3128l1097l426O8121M6185r256J9901M7119L7297n2022q4382
10870A08210p3260K6345N4957N3625K5287j081m6137o7008J5909q074j720J8387
10858A05440j6998J7148M5239L7648M0362K554L5341L3766L1980n514M988L5923
10846C67877J3131k5445l5356k7299L9660K4293L5005K0980o2648l1311j5504
10835C03383j6389l1084j0312N904K3348J2571p0084p8452J3510R3551N163m1312
$$ plain form
10823 209797 192422 183455 214279 244288 220059 264952 282083 261812 245265 267051 278394 306052
10811 306052 298603 254449 210041 197127 200298 202923 222782 225185 265301 278763 317614 313150
10799 313150 370086 373015 323172 355201 386163 374943 337783 321322 324000 368966 390068 395692
10787 395692 420275 427817 477391 547532 604003 700519 792400 813517 762439 735139 679569 569679
10775 569679 506017 449523 391013 380372 330542 322312 341556 317831 299538 260231 217459 248043
10763 248043 282698 246752 235246 197285 199370 168023 187347 207029 254676 268598 258874 283506
10751 283506 273922 275101 278776 370072 395124 369960 321853 328943 359388 358697 378204 439718 491085
10738 491085 564320 599323 581588 599602 641334 650890 618619 632792 679433 725900 788794 854143
$$ packed form
10823B09797j7375q967L0824L0009k4229M4893J7131k0271j6547K1786J1343K7658
10811C06052p449m4154m4408j2914L171K625J9859K403M0116J3462L8851m464
10799C13150N6936K929m9843L2029L0962j1220l7160j6461K678M4966K1102N624
10787C95692K4583P542M9574P0141N6471R6516R1881K1117n1078k7300n5570j09890
10775E69679o3662n6494n8510j0641m9830q230J9244k3725j8293l9307m2772L0584
10763B48043L4655l5946j1506l7961K085l1347J9324J9682M7647J3922r724K4632
10751B83506r584J179L675R1296K5052k5164m8107P090L0445o91J9507O1514N1367
10738D91085P3235L5003j7735J8014M1732R556l2271J4173M6641M6467O2894O5349
$$ plain form
10726 854143 959157 1087087 1304113 1565467 1898977 2311700 2782543 3187047 3481203 3730724
10716 3730724 3903024 3984293 3831709 3488601 3056822 2668252 2252369 1858090 1632175 1484246
10706 1484246 1358898 1251875 1178577 1129019 1109687 1084079 1074004 1073266 1070565 1014035 985614
10695 985614 983891 1005938 988276 971446 946492 970620 963227 952238 968828 998006 1034062 1068765
10683 1068765 1058806 1016237 1007341 1003486 973990 950122 892020 931315 990687 1026436 1078224 1111254
10671 1111254 1141533 1147835 1168119 1179421 1193133 1218338 1212517 1275395 1315361 1349805 1423231 1471152
10659 1471152 1492589 1524832 1527630 1558244 1614255 1654395 1675530 1685467 1672008 1658487 1688371 1773595
10647 1773595 1776901 1799873 1900868 2044306 2196887 2323710 2425600 2523069 2600782 2677044
$$ packed form
10726H54143J05014J27930K17026K61354L33510M12723M70843M04504K94156K49521
10716C730724J72300Q1269j52584l43108m31779l88570m15883l94279k25915j47929
10706A484246j25348j07023p3298m9558j9332k5608j0075p38k701n6530k8421
10695I85614j723K2047j7662j6830k4954K4128p393j0989J6590K9178L6056L4703
10683A068765r959m2569q896l855k9496k3868n8102L9295N9372L5749N1788L3030
10671A111254L0279O302K0284J1302J3712K5205n821O2878L9966L4444P3426M7921
10659A471152K1437L2243K798L0614N6011M0140K1135R937j3459j3521K9884Q5224
10647A773595L306K2972J00995J43438J52581J26823J01890R7469P7713P6262
$$ plain form
10637 2677044 2689124 2731059 2808190 2867924 2938044 2983302 3118229 3276969 3450943 3672609
10627 3672609 3927027 4219004 4532593 4878261 5250337 5604129 5962443 6353619 6774467
10618 6774467 7222384 7803559 8466491 9192253 10098337 11187570 12457389 13902850 15476812
10609 15476812 17227895 19193551 21303940 23629106 26341519 29724332 33864153 39092605
10601 39092605 45900172 54873070 67036534 83891025 107564715 140986165 187238249
10594 187238249 247572338 317587486 386037621 440690681 474048375 476661430 437818904
10587 437818904 366108439 289501087 227083711 181686797 149599856 126787757 110135894
10580 110135894 97551098 87713720 79833265 73435783 68188173 63853022 60275303 57201900
$$ packed form
10637B677044J2080M1935P7131N9734P0120M5258J34927J58740J73974K21666
10627C672609K54418K91977L13589L45668L72076L53792L58314L91176M20848
10618F774467M47917N81175O62932P25762R06084J089233J269819J445461J573962
10609A5476812J751083J965656K110389K325166K712413L382813M139821N228452
10601C9092605O807567Q972898J2163464J6854491K3673690L3421450M6252084
10594A87238249O0334089P0015148O8450135N4653060L3357694K613055l8842526
10587D37818904p1710465p6607352o2417376m5396914l2086941k2812099j6651863
10580A10135894j2584796r837378p880455o397482n247610m335151l577719l073403
$$ plain form
10572 57201900 54543298 52123270 49778172 47427801 45053705 42792350 40672913 38724198
10564 38724198 36992098 35482185 34092250 32803177 31559349 30386327 29281502 28232495
10556 28232495 27260123 26334194 25443156 24633111 23918051 23208136 22455940 21668059 20947232
10547 20947232 20220267 19559418 18970110 18324293 17683634 17177537 16725458 16270520 15859713
10538 15859713 15454084 15104779 14826073 14486862 14128097 13772595 13421636 13079470 12692916
10529 12692916 12306026 11873460 11447970 11084818 10845153 10616244 10350850 10108966 9849191
10520 9849191 9650755 9474566 9290286 9101516 8920166 8714601 8512893 8304995 8108109
10511 8108109 7929685 7761972 7625106 7487077 7352742 7222729 7121372 7007192 6878895
$$ packed form
10572E7201900k658602k420028k345098k350371k374096k261355k119437j948715
10564C8724198j732100j509913j389935j289073j243828j173022j104825j049007
10556B8232495r72372r25929q91038q10045p15060p09915p52196p87881p20827
10547B0947232p26965o60849n89308o45817o40659n06097m52079m54938m10807
10538A5859713m05629l49305k78706l39211l58765l55502l50959l42166l86554
10529A2692916l86890m32566m25490l63152k39665k28909k65394k41884k59775
10520I849191j98436j76189j84280j88770j81350k05565k01708k07898j96886
10511H108109j78424j67713j36866j38029j34335j30013j01357j14180j28297
$$ plain form
10502 6878895 6732767 6574360 6397184 6225205 6086480 5889977 5711039 5603748 5492640
10493 5492640 5449782 5450259 5379526 5261184 5139346 5052973 4984076 4950416 4909750 4829321 4796140
10482 4796140 4736104 4682962 4671024 4649794 4607252 4575475 4602800 4612664 4662802 4750105 4846165
10471 4846165 4963507 5138100 5342884 5575525 5866865 6196422 6514631 6747909 6820032 6727675
10461 6727675 6434235 6024909 5582947 5152348 4762507 4426400 4127127 3891160 3715011
10452 3715011 3551159 3375637 3275490 3225382 3112484 3006759 2913665 2859837 2811549 2756447
10442 2756447 2722544 2627708 2555357 2482249 2454666 2456909 2405889 2352888 2304799 2285146 2263924
10431 2263924 2216531 2068575 2016567 1959085 1943270 1920164 1928634 1904566 1848469 1784408 1734699
$$ packed form
10502F878895j46128j58407j77176j71979j38725j96503j78938j07291j11108
10493E492640m2858M77p0733j18342j21838q6373o8897l3660m0666q0429l3181
10482D796140o0036n3142j1938k1230m2542l1777K7325R864N0138Q7303R6060
10471D846165J17342J74593K04784K32641K91340L29557L18209K33278P2123r2357
10461F727675k93440m09326m41962m30599l89841l36107k99273k35967j76149
10452C715011j63852j75522j00147n0108j12898j05725r3094n3828m8288n5102
10442B756447l3903r4836p2351p3108k7583K243n1020n3001m8089j9653k1222
10431B263924m7393j47956n2008n7482j5815k3106Q470k4068n6097o4061m9709
$$ plain form
10420 1734699 1684370 1686627 1674587 1658283 1619172 1572339 1536721 1457410 1380265 1395980 1419392
10409 1419392 1412074 1370494 1261648 1189613 1118690 1067438 976268 870723 728579 658105 634673
10398 634673 704129 726552 768316 825984 858880 873179 901176 864686 859591 880753 854894 806787
10386 806787 801755 788620 802114 815720 826764 795451 750615 729130 742854 744480 716830 677975
10374 677975 632827 603087 631161 648891 593778 567283 554638 532885 526840 515312 519656 562832
10362 562832 552934 552341 578839 573734 593280 611038 623101 602982 563571 555496 545025 557271
10350 557271 578927 597563 544242 504568 515258 492145 464966 446006 461582 490418 551150
10339 551150 582400 553659 539599 518835 540699 577778 576582 555507 490456 471151 454884 402017
$$ packed form
10420A734699n0329K257j2040j6304l9111m6833l5618p9311p7145J5715K3412
10409A419392p318m1580j08846p2035p0923n1252r1170j05545j42144p0474k3432
10398F34673O9456K2423M1764N7668L2896J4299K7997l6490n095K1162k5859m8107
10386H06787n032j3135J3494J3606J1044l1313m4836k1485J3724J626k7650l8855
10374F77975m5148k9740K8074J7730n5113k6495j2645k1753o045j1528M344M3176
10362E62832r898n93K6498n105J9546J7758J2063k0119l9411q075j0471J2246
10350E57271K1656J8636n3321l9674J0690k3113k7179j8960J5576K8836O0732
10339E51150L1250k8741j4060k0764K1864L7079j196k1075o5051j9305j6267n2867
$$ plain form
10327 402017 422119 421370 415612 470919 440477 414074 377687 360618 376813 349633 329928 384774
10315 384774 362066 373214 395734 325476 338884 370497 415341 389105 389990 361521 326781 292355
10303 292355 307606 335375 366239 383954 404954 374660 388442 320249 273685 289003 223768
10292 223768 195155 238656 267284 258846 253282 255861 226693 191450 207260 243824 174955 146960
10280 146960 137791 158898 184138 193664 192307 160744 99699 72153 64060 109740 128310 171457
10268 171457 203265 189566 138851 139804 157763 182602 255826 278748 237516 170606 175403 198837
10256 198837 205669 203488 188758 182891 212764 180417 133032 167085 208493 190840 182463 171157
10244 171157 161118 184656 252316 257302 244697 231935 179694 118911 85022 104024 136700 124199
$$ packed form
10327D02017K0102p49n758N5307l0442k6403l6387j7069J6195k7180j9705N4846
10315C84774k2708J1148K2520p0258J3408L1613M4844k6236Q85k8469l4740l4426
10303B92355J5251K7769L0864J7715K1000l0294J3782o8193m6564J5318o5235
10292B23768k8613M3501K8628q438n564K579k9168l5243J5810L6564o8869k7995
10280A46960r169K1107K5240R526j357l1563o1045k7546q093M5680J8570M3147
10268A71457L1808j3699n0715R53J7959K4839P3224K2922m1232o6910M797K3434
10256A98837O832k181j4730n867K9873l2347m7385L4053M1408j7653q377j1306
10244A71157j0039K3538O7660M986j2605j2762n2241o0783l3889J9002L2676j2501
$$ plain form
10232 124199 69693 74730 129548 117542 68343 37458 94913 103198 103963 97350 55323 21428
10220 21428 24767 23016 55469 46260 64720 128743 145744 118157 125773 145759 104431 90920
10208 90920 160439 174454 193945 149085 142273 127090 136520 145623 137408 143069 100749 113056 132794
10195 132794 95749 100279 93138 65311 107012 126377 142814 174396 184525 219391 237752 272634
10183 272634 212105 174689 224944 245907 225209 187569 228411 292037 315893 330911 398769
10172 398769 487044 598128 774192 982136 1328786 1691556 1953103 2214720 2425184 2477941
10162 2477941 2369899 2074097 1717787 1403545 1146160 988392 888327 792598 709757 641848
10152 641848 593316 510202 491075 500674 454610 417026 386584 339510 357944 386966 352153 294957
$$ packed form
10232A24199n4506N037N4818j2006m9199l0885N7455Q285P65o613m2027l3895
10220B1428L339j751L2453r209J8460O4023J7001k7587P616J9986m1328j3511
10208I0920O9519J4015J9491m4860o812j5183R430R103q215N661m2320J2307J9738
10195A32794l7045M530p141k7827M1701J9365J6437L1582J0129L4866J8361L4882
10183B72634o0529l7416N0255K0963k0698l7640M0842O3626K3856J5018O7858
10172C98769Q8275J11084J76064K07944L46650L62770K61547K61617K10464N2757
10162B477941j08042k95802l56310l14242k57385j57768j00065r5729q2841o7909
10152F41848m8532q3114j9127R599m6064l7584l0442m7074J8434K9022l4813n7196
$$ plain form
10140 294957 301888 342999 324658 325546 313305 287393 278684 229789 164252 160047 220890 245180
10128 245180 190010 148569 166763 112342 112223 79673 29450 45102 75678 24466 -6152 4761
10116 4761 12265 33909 77898 71926 70686 45944 68361 121981 146317 88391 65774 54448
10104 54448 40012 59844 82666 88303 86850 127548 98582 113967 109955 41661 9116 -2633
10092 -2633 -12796 -29538 -50070 -26187 -26095 -12437 16320 -814 41429 89657 112893 60870
10080 60870 25081 -6287 43243 69056 75493 62350 99467 102159 107380 71790 12875 -28272
10068 -28272 -15862 -34111 -15025 79566 126883 130341 183440 178067 159840 168491 146728 134809
10056 134809 128328 126981 153095 183395 275751 386706 643249 962320 1195484 1319033 1446173
$$ packed form
10140B94957O931M1111j8341Q88j2241k5912q709m8895o5537m205O0843K4290
10128B45180n5170m1441J8194n4421j19l2550n0223J5652L0576n1212l0618J0913
10116D761P504K1644M3989n972j240k4742K2417N3620K4336n7926k2617j1326
10104E4448j4436J9832K2822N637j453M0698k8966J5385m012o8294l2545j1749
10092b633j0163j6742k0532K3883R2J3658K8757j7134M2243M8228K3236n2023
10080F0870l5789l1368M9530K5813O437j3143L7117K692N221l5590n8915m1147
10068b8272J2410j8249J9086R4591M7317L458N3099n373j8227Q651k1763j1919
10056A34809o481j347K6114L0300R2356J10955K56543L19071K33164J23549J27140
$$ plain form
10045 1446173 1514034 1148352 740255 504595 357378 345926 318596 267084 218927 130083
10035 130083 100799 129946 136566 152985 149054 184578 182348 137538 103727 102283 121278 150682
10023 150682 160384 155932 78240 55652 58882 92727 119061 105479 120719 107786 128305 123936
10011 123936 109640 147400 107951 75650 105867 150512 178077 164739 111206 84300 78848 71867
9999 71867 64104 28538 46014 121582 156251 151994 129735 91169 76714 55436 30698 -5507
9987 -5507 -400 12243 84892 112235 112530 114729 105925 67166 109286 132789 127747 92949 90920
9974 90920 74335 63388 94101 108510 101347 104345 91103 50631 64195 72260 74347 70582 65668
9961 65668 5450 12427 10642 24695 23350 52548 66520 94760 99255 69583 46561 -31997 -40107
$$ packed form
10045A446173O7861l65682m08097k35660j47217j1452k7330n1512m8157q8844
10035A30083k9284K9147O620J6419l931L5524k230m4810l3811j444J8995K9404
10023A50682R702m452p7692k2588L230L3845K6334j3582J5240j2933K0519m369
10011A23936j4296L7760l9449l2301L0217M4645K7565j3338n3533k6906n452o981
9999G1867p763l5566J7476P5568L4669m257k2259l8566j4455k1278k4738l6205
9987e507N107J2643P2649K7343K95K199q804l8759M2120K3503n042l4798k029
9974I0920j6585j0947L0713J4409p163K998j3242m0472J3564Q065K087l765m914
9961F5668o0218O977j785J4053j345K9198J3972K8240M495k9672k3022p8558q110
$$ plain form
9948 -40107 24329 51308 45788 18229 23923 -21630 -49931 -12950 -1443 -2713 -28117 -55807
9936 -55807 -37641 24849 45227 37166 47867 52232 18734 27016 17855 -17367 -14565 -4545 39697
9923 39697 67328 43465 13999 53434 41996 21075 -33297 -48831 -37424 -35133 -38496 -577
9911 -577 37191 42417 50389 92079 35654 -12287 42566 78662 53074 37854 44495 33859 49047
9898 49047 27318 -653 9295 34982 5667 -10338 26666 86187 75901 39831 -11564 -54744
9886 -54744 -82930 -64402 23477 71284 78117 59569 66595 79259 81185 99762 72378 45001
9874 45001 23894 58555 72817 62579 88086 74491 91488 112173 132784 133636 97294 96928 135168
9861 135168 137550 170157 227565 270675 364936 447049 594330 732595 827325 878908 808620
$$ packed form
9948d0107O4436K6979n520k7559N694m5553k8301L6981J1507j270k5404k7690
9936e5807J8166O2490K0378q061J0701M365l3498Q282r161l5222K802J0020M4242
9923C9697K7631k3863k9466L9435j1438k0921n4372j5534J1407K291l363L7919
9911e77L7768N226P972M1690n6425m7941N4853L6096k5588j5220O641j0636J5188
9898D9047k1729k7971R948K5687k9315j6005L7004N9521j0286l6070n1395m3180
9886e4744k8186J8528Q7879M7807O833j8548P026J2664J926J8577k7384k7377
9874D5001k1107L4661J4262j0238K5507j3595J6997K0685K0611Q52l6342l66L8240
9861A35168K382L2607N7408M3110R4261Q2113J47281J38265R4730N1583p0288
$$ plain form
9850 808620 650018 440166 305309 252078 230147 218632 190417 169113 139440 132991 94569
9839 94569 98773 122319 109945 119720 94208 93646 95497 85696 77252 64739 36987 36906 34270 35727
9825 35727 80794 57931 27226 8941 72946 85570 83777 46688 77544 131871 128298 84498
9813 84498 63147 59346 28823 26698 36242 44700 45914 69848 11416 3938 8678 -30563 -32913
9800 -32913 3841 -19783 -48290 -22234 28389 63738 60334 56056 45620 10134 24417 68360
9788 68360 36907 42755 77201 28096 32430 45638 52662 99945 81727 54634 49118 29047 -14152
9775 -14152 -16118 -10837 -18348 -13603 -39048 -30083 -15785 23621 31569 -19290 -46340 -25247 18535
9762 18535 8951 10776 3963 -52507 -61535 -25823 -13964 -22388 -17915 -15915 35209 14756 1372
$$ packed form
9850H08620j58602k09852j34857n3231k1931j1515k8215k1304k9673o449l8422
9839I4569M204K3546j2374R775k5512n62J851r801q444j2513k7752q1k636J457
9825C5727M5067k2863l0705j8285O4005J2624j793l7089L0856N4327l573m3800
9813H4498k1351l801l0523k125R544Q458J214K3934n8432p478M740l9241k350
9800c2913L6754k3624k8507K6056N0623L5349l404m278j0436l5486J4283M3943
9788F8360l1453N848L4446m9105M334J3208P024M7283j8218k7093n516k0071m3199
9775a4152j966N281p511M745k5445Q965J4298L9406P948n0859k7050K1093M3782
9762A8535r584J825o813n6470r028L5712J1859q424M473K000N1124k0453j3384
$$ plain form
9749 1372 -4887 17873 2462 -3550 27476 35846 33873 14822 28869 41714 15783 55336 55548
9736 55548 69758 27642 -4474 469 42856 50208 87625 111060 44643 42184 9121 -22971
9724 -22971 11996 73783 130541 94029 50253 56065 58082 57085 61148 59260 67864 89933 69516
9711 69516 26901 1197 35467 -4272 -54699 -59515 -61583 -56397 -12369 35431 30981 1747 10477
9698 10477 8995 12732 -10452 -80018 -88320 -2261 71068 85932 95714 97586 103948 114509 102959
9685 102959 70920 132753 109795 65573 19176 8060 -3591 -14821 -31906 2603 43651 105759
9673 105759 112731 62174 50785 50465 76858 78965 102107 116055 118664 128137 132856 151989 108928
9660 108928 58154 9543 38257 74005 70843 70799 100746 110611 107792 96601 35618 2188 61980
$$ packed form
9749A372o259K2760j5411o012L1026Q370j973j9051J4047J2845k5931L9553K12
9736E5548J4210m2116l2116M943M2387P352L7417K3435o6417k459l3063l2092
9724b2971L4967O1787N6758l6512m3776N812K017r97M063j888Q604K2069k0417
9711F9516m2615k5704L4270l9739n0427m816k068N186M4028M7800m450k9234Q730
9698A0477j482L737k3184o9566q302Q6059P3329J4864R782J872O362J0561j1550
9685A02959l2039O1833k2958m4222m6397j1116j1651j1230j7085L4509M1048O2108
9673A05759O972n0557j1389l20K6393K107K3142J3948K609R473M719J9133m3061
9660A08928n0774m8611K8714L5748l162m4K9947R865k819j1191o0983l3430N9792
$$ plain form
9647 61980 129052 110525 27330 47192 90362 48808 37944 36376 57826 63848 80405 75815
9635 75815 59550 72206 46135 688 36159 37963 30535 70394 36602 -5812 10080 45583
9623 45583 7971 -55249 -79250 -58815 -10496 -13104 -11190 21637 61270 41336 20762 -10817
9611 -10817 -3123 33079 82203 85832 88397 119013 123092 118130 95732 45569 -1481 -3734 51883
9598 51883 81881 119516 62185 21774 36555 30214 62417 77585 70943 51776 40273 39462 50214
9585 50214 107604 75724 73412 62970 69433 46506 12024 61269 99009 137440 130890 90922
9573 90922 73089 78875 84744 101781 132815 116440 63615 41611 31326 48116 99587 141151
9561 141151 95338 110539 104380 98006 71644 9514 -60721 -66381 -69504 8518 50488 21427
$$ packed form
9647F1980O7072j8527q3195J9862M3170m1554j0864j568K1450O022J6557m590
9635G5815j6265J2656k6071m5447L5471J804p428L9859l3792m2414J5892L5503
9623D5583l7612o3220k4001K0435M8319k608J914L2827L9633j9934k0574l1579
9611a0817P694L6202M9124L629K565L0616M079m962k2398n0163m7050k253N5617
9598E1883K9998L7635n7331m0411J4781o341L2203J5168o642j9167j1503q11J0752
9585E0214N7390l1880k312j0442O463k2927l4482M9245L7740L8431o550l9968
9573I0922j7833N786N869J7037L1034j6375n2825k2004j0285J6790N1471M1564
9561A41151m5813J5201o159o374k6362o2130p0235n660l123P8022M1970k9061
$$ plain form
9549 21427 7929 23744 79260 124777 133005 156773 106015 57957 80795 71717 65993 64902 75058
9536 75058 65578 67327 60200 77349 67774 90026 90113 71506 55350 93613 69523 82238 77771
9523 77771 81514 94382 42897 20450 60414 81041 89350 57693 74202 147617 136022 36693
9511 36693 12708 67692 94687 77990 105515 113490 132057 94459 31012 6716 -14001 -34856
9499 -34856 28028 96370 104246 94191 119330 101459 120145 115436 100686 111759 116959 142062
9487 142062 104890 64733 75546 83854 65514 63294 62646 27185 48271 111431 106291 111165 165891
9474 165891 184516 211894 184037 115761 122419 114593 112430 102308 103647 115513 127354 118506 98959
9461 98959 109876 91591 51661 107301 112148 79880 45791 54421 71360 76245 103941 120976
$$ packed form
9549B1427j3498J5815N5516M5517Q228K3768n0758m8058K2838r078n724j091J0156
9536G5058r480J749p127J7149r575K2252Q7j8607j6156L8263k4090J2715m467
9523G7771L743J2868n1485k2447L9964K0627Q309l1657J6509P3415j1595r9329
9511C6693k3985N4984K6995j6697K7525P975J8567l7598o3447k4296k0717k0855
9499c4856O2884O8342P876j0055K5139j7871J8686m709j4750J1073N200K5103
9487A42062l7172m0157J0813Q308j8340k220o48l5461K1086O3160n140M874N4726
9474A65891J8625K7378k7857o8276O658p826k163j0122J339J1866J1841q848j9547
9461I8959J0917j8285l9930N5640M847l2268l4089Q630J6939M885K7696J7035
$$ plain form
9449 120976 96650 76414 106272 86404 73867 122780 101231 148691 128106 78198 130631 179200
9437 179200 183792 141725 145921 121257 118913 120427 57330 34957 71052 132570 133943 116916 97487
9424 97487 66248 26726 41853 41285 46184 88624 104332 135438 82251 76672 94488 108622 136440
9411 136440 114494 123528 163647 199964 189610 192963 163844 96610 63078 87097 67835 65496
9399 65496 80551 97145 106231 94858 74246 118907 164643 207486 217839 176523 135016 64056
9387 64056 86957 137503 167605 122494 84926 95331 150959 146466 141355 132207 127670 99776 69454
9374 69454 91451 112501 119822 163075 226155 214330 167170 153475 115305 121445 153904 195616
9362 195616 168941 126893 110729 154930 161812 97422 118531 173390 217285 249948 221257 207403
$$ packed form
9449A20976k4326k0236K9858j9868j2537M8913k1549M7460k0585m9908N2433M8569
9437A79200M592m2067M196k4664k344J514o3097k2373L6095O1518J373j7027j9429
9424I7487l1239l9522J5127n68M899M2440J5708L1106n3187n579J7816J4134K7818
9411A36440k1946R034M0119L6317j0354L353k9119o7234l3532K4019j9262k339
9399F5496J5055J6594R086j1373k0612M4661M5736M2843J0353m1316m1507p0960
9387F4056K2901N0546L0102m5111l7568J0405N5628m493n111r148m537k7894l0322
9374F9454K1997K1050P321M3253O3080j1825m7160j3695l8170O140L2459M1712
9362A95616k6675m2048j6164M4201O882o4390K1109N4859M3895L2663k8691j3854
$$ plain form
9350 207403 155596 101860 74218 91842 131350 196025 187001 175521 177571 217802 212018 229392
9338 229392 258913 271995 237562 194911 198796 193377 142684 145409 153271 177546 175579 142914 119659
9325 119659 106980 89996 110266 82433 149775 193250 214796 190760 166787 166182 179749 184030
9313 184030 191342 156985 158048 175630 178489 209028 227121 208954 147461 130875 149887 151878
9301 151878 171874 189961 275706 330022 284025 236629 197457 217520 198162 260308 232766 231668
9289 231668 204015 163141 207411 258832 294311 249680 209259 208036 238069 238787 229229 190868
9277 190868 181023 193321 191748 166608 176551 228444 261021 282031 294501 320808 345140 311038
9265 311038 256874 238882 275090 232456 192108 253319 302028 342232 343900 311679 289506 257401
$$ packed form
9350B07403n1807n3736k7642J7624L9508O4675r024j1480K050M0231n784J7374
9338B29392K9521J3082l4433m2651L885n419n0693K725P862K4275j967l2665k3255
9325A19659j2679j6984K0270k7833O7342M3475K1546k4036k3973o05J3567M281
9313A84030P312l4357J063J7582K859L0539J8093j8167o1493j6586J9012J991
9301A51878J9996J8087Q5745N4316m5997m7396l9172K0063j9358O2146k7542j098
9289B31668k7653m0874M4270N1421L5479m4631m0421j223L0033P18r558l8361
9277A90868r845J2298j573k5140R943N1893L2577K1010J2470K6307K4332l4102
9265C11038n4164j7992L6208m2634m0348O1211M8709M0204J668l2221k2173l2105
$$ plain form
9253 257401 255403 260738 255213 239311 235362 230475 253770 266655 261783 265305 275181 301010 329340
9240 329340 342792 369532 360496 341405 342423 344890 360495 398696 392432 390298 380248 424731 449293
9227 449293 449619 386117 320308 342546 408210 376794 375136 372619 330080 336097 322627 353360 349277
9214 349277 311724 342107 381462 384838 355922 349981 355930 319771 277256 314706 372169 403540
9202 403540 444106 461143 451365 405328 393909 428585 424160 434473 465179 470635 484649 476431
9190 476431 449852 495121 525551 527603 471833 468194 494865 510731 549104 574603 544136 506106
9178 506106 514988 506788 490417 490315 503981 562726 579230 535428 528266 556562 565807 527736 486107
9165 486107 512173 512160 542942 571783 555981 542570 501865 516307 571468 569335 588274 616806
$$ packed form
9253B57401j998N335n525j5902l949m887K3295J2885m872L522R876K5829K8330
9240C29340J3452K6740r036j9091J018K467J5605L8201o264k134j0050M4483K4562
9227D49293L26o3502o5809K2238O5664l1416j658k517m2539O017j3470L0733m083
9214C49277l7553L0383L9355L376k8916n941N949l6159m2515L7450N7463L1371
9202D03540M0566J7037r778m6037j1419L4676m425J0313L0706N456J4014q218
9190D76431k6579M5269L0430K052n5770l639K6671J5866L8373K5499l0467l8030
9178E06106Q882q200j6371j02J3666N8745J6504m3802p162K8296R245l8071m1629
9165D86107K6066j3L0782K8841j5802j3411m0705J4442N5161k133J8939K8532
$$ plain form
9153 616806 604758 599932 598978 590155 612400 643010 641910 638334 676414 702144 676169 648517 659418
9140 659418 625242 626847 640871 677786 716441 723732 748672 784506 760512 758119 763076 787040
9128 787040 773528 741870 740135 769307 818182 841520 856355 837240 835098 851147 851010 882938
9116 882938 873809 832420 838868 900203 937974 919698 904080 878903 897224 920689 938104 981183
9104 981183 1028334 1031856 1069122 1058453 1018231 1042967 1067207 1046486 1030505 1057888 1068188 1074207
9092 1074207 1061229 1117433 1154782 1182889 1210432 1224125 1258451 1292491 1292321 1246940 1259614 1271226
9080 1271226 1290782 1331974 1380176 1415036 1385866 1383223 1381680 1371063 1418824 1428084 1375420 1413495
9068 1413495 1488119 1546774 1580796 1593944 1574867 1584042 1671431 1729545 1779069 1806304 1750005 1770200
$$ packed form
9153F16806j2048m826r54q823K2245L0610j100l576L8080K5730k5975k7652J0901
9140F59418l4176J605J4024L6915L8655P291K4940L5834k3994k393M957K3964
9128G87040j3512l1658j735K9172M8875K3338J4835j9115k142J6049j37L1928
9116H82938r129m1389O448O1335L7771j8276j5618k5177J8321K3465J7415M3079
9104I81183M7151L522L7266j0669m0222K4736K4240k0721j5981K7383J0300O019
9092A074207j2978N6204L7349K8107K7543J3693L4326L4040j70m5381J2674J1612
9080A271226J9556M1192M8202L4860k9170k643j543j0617M7761R260n2664L8075
9068A413495P4624N8655L4022J3148j9077R175Q7389N8114M9524K7235n6299K0195
$$ plain form
9056 1770200 1774249 1767096 1800007 1870134 1889879 1872973 1952590 2027975 2013082 2041763 2063466 2070641
9044 2070641 2042500 2080147 2148321 2202089 2224108 2203707 2200140 2259676 2314457 2344440 2429712 2489036
9032 2489036 2515904 2533524 2517096 2505141 2564076 2630464 2636664 2652673 2668320 2757058 2803847 2796152
9020 2796152 2842743 2928095 2975749 2991250 3031483 3106738 3143630 3219629 3240190 3301130 3356831
9009 3356831 3437509 3500180 3612218 3725399 3798479 3855264 3879654 3965999 4110161 4244052 4308666
8998 4308666 4366260 4427607 4573371 4651557 4746328 4855787 4921119 5039137 5201535 5298132 5429254
8987 5429254 5563129 5708632 5829801 5996231 6150670 6313614 6453736 6616480 6821305 7072343
8977 7072343 7292688 7466986 7652057 7882007 8132267 8376111 8630771 8909981 9158467 9417127
$$ packed form
9056A770200M049p153L2911P0127J9745j6906P9617P5385j4893K8681K1703P175
9044B070641k8141L7647O8174N3768K2019k0401l567N9536N4781K9983Q5272N9324
9032B489036K6868J7620j6428j1955N8935O6388O200J6009J5647Q8738M6789p695
9020B796152M6591Q5352M7654J5501M0233P5255L6892P5999K0561O0940N5701
9009C356831Q0678O2671J12038J13181P3080N6785K4390Q6345J44162J33891O4614
8998D308666N7594O1347J45764P8186R4771J09459O5332J18018J62398R6597J31122
8987E429254J33875J45503J21169J66430J54439J62944J40122J62744K04825K51038
8977G072343K20345J74298J85071K29950K50260K43844K54660K79210K48486K58660
$$ plain form
8967 9417127 9706454 10064759 10372934 10687171 11025523 11400341 11758429 12141277 12508671 12882591
8957 12882591 13216018 13648141 14137795 14604958 15082581 15616814 16173416 16681724 17219334
8948 17219334 17781615 18294289 18784982 19302105 19876969 20488984 21101731 21666140 22216965
8939 22216965 22700862 23209910 23735014 24254981 24689485 25104548 25501027 25862723 26148860
8930 26148860 26374791 26579659 26792218 26896218 27030562 27085687 27035365 26930967 26809236 26677523
8920 26677523 26487663 26172959 25853344 25550613 25160739 24765892 24373156 23953693 23511576
8911 23511576 23070058 22663569 22185265 21747244 21289292 20831254 20375534 19870049 19343040
8902 19343040 18874086 18468988 18025099 17554900 17112373 16662063 16237120 15852228 15432662
$$ packed form
8967I417127K89327L58305L08175L14237L38352L74818L58088L82848L67394L73920
8957A2882591L33427M32123M89654M67163M77623N34233N56602N08308N37610
8948A7219334N62281N12674M90693N17123N74864O12015O12747N64409N50825
8939B2216965M83897N09048N25104N19967M34504M15063L96479L61696K86137
8930B6148860K25931K04868K12559J04000J34344N5125n0322j04398j21731j31713
8920B6677523j89860l14704l19615l02731l89874l94847l92736m19463m42117
8911B3511576m41518m06489m78304m38021m57952m58038m55720n05485n27009
8902A9343040m68954m05098m43889m70199m42527m50310m24943l84892m19566
$$ plain form
8893 15432662 15009877 14653267 14390541 14018899 13663506 13324679 12973039 12676794 12375758
8884 12375758 12093886 11806865 11554200 11339711 11074796 10775783 10507097 10253906 9992110
8875 9992110 9818549 9629360 9413579 9156680 8942518 8729349 8496779 8345165 8206333 8026628
8865 8026628 7833867 7709473 7578852 7408304 7251022 7110366 6911311 6723832 6630538 6490617
8855 6490617 6380867 6287944 6150868 6024924 5928051 5824240 5632844 5516729 5444438 5379541
8845 5379541 5321132 5231139 5167923 5110458 4964937 4836561 4801388 4719681 4622970 4539733 4427423
8834 4427423 4379031 4281128 4171829 4080020 4050132 3994630 3972218 3884981 3823636 3804712 3776666
8823 3776666 3753468 3734294 3673546 3641684 3573577 3484909 3395335 3367681 3302529 3236991 3192538
$$ packed form
8893A5432662m22785l56610k62726l71642l55393l38827l51640k96245l01036
8884A2375758k81872k87021k52665k14489k64915k99013k68686k53191k61796
8875I992110j73561j89189k15781k56899k14162k13169k32570j51614j38832j79705
8865H026628j92761j24394j30621j70548j57282j40656j99055j87479r3294j39921
8855F490617j09750r2923j37076j25944r6873j03811j91396j16115p2291o4897
8845E379541n8409q9993o3216n7465j45521j28376l5173q1707r6711q3237j12310
8834D427423m8392r7903j09299r1809k9888n5502k2412q7237o1345j8924k8046
8823C776666k3198j9174o0748l1862o8107q8668q9574k7654o5152o5538m4453
$$ plain form
8812 3192538 3141832 3113501 3089251 3079510 3029924 2963325 2933658 2894655 2864543 2780468 2660838
8801 2660838 2685871 2757226 2730544 2667662 2552866 2487892 2434666 2431160 2435369 2454009 2408985 2307697
8789 2307697 2210582 2150394 2128870 2153637 2148596 2093973 2090532 2064828 2016943 1968267 1953271 1921795
8777 1921795 1856273 1833463 1833715 1838754 1817455 1826422 1853562 1849663 1813352 1773608 1705554 1655642
8765 1655642 1610615 1588331 1578166 1549092 1511064 1505747 1504104 1471330 1434636 1431428 1402868 1392944
8753 1392944 1354188 1301417 1260317 1262497 1263737 1291242 1289790 1305317 1280244 1254869 1246322 1230293
8741 1230293 1198004 1129712 1106510 1082774 1049045 1051797 1017874 986737 1009853 1019309 1039070 1005102
8729 1005102 935384 910265 894728 883322 880186 889155 871974 872437 832632 790231 791164 827147 819104
$$ packed form
8812C192538n0706k8331k4250r741m9586o6599k9667l9003l0112q4075j19630
8801B660838K5033P1355k6682o2882j14796o4974n3226l506M209J8640m5024j01288
8789B307697r7115o0188k1524K4767n041n4623l441k5704m7885m8676j4996l1476
8777A921795o5522k2810K52N039k1299Q967K7140l899l6311l9744o8054m9912
8765A655642m5027k2284j0165k9074l8028n317j643l2774l6694l208k8560r924
8753A392944l8756n2771m1100K180J240K7505j452J5527k5073k5375q547j6029
8741A230293l2289o8292k3202k3736l3729K752l3923l1137K3116R456J9761l3968
8729A005102o9718k5119j5537j1406l136Q969j7181M63l9805m2401R33L5983q043
$$ plain form
8716 819104 795043 762366 712978 752986 741482 719000 694298 681655 657133 711823 714967 663921
8704 663921 635775 683758 726847 756899 756160 748364 744925 699366 655381 558664 563463 635177 617915
8691 617915 563368 518078 524065 573685 592441 611698 629961 610317 634714 611680 568877 569360
8679 569360 545129 517606 467479 440452 447213 470975 500052 526324 520680 564301 562168 530713
8667 530713 524849 495352 462858 464126 477387 455413 485840 465664 435260 444313 432159 482678
8655 482678 522372 546024 550712 576743 606475 619415 602471 552649 516631 480973 424119 411487
8643 411487 404308 426507 439157 377270 314711 303605 318432 365898 367935 402400 410914 386550
8631 386550 372303 360819 337578 367291 361909 364718 390865 386116 392147 390254 423250 443325 398483
$$ packed form
8716H19104k4061l2677m9388M0008j1504k2482k4702j2643k4522N4690L144n1046
8704F63921k8146M7983M3089L0052p39p796l439m5559m3985r6717M799P1714j7262
8691F17915n4547m5290N987M9620J8756J9257J8263j9644K4397k3034m2803M83
8679E69360k4231k7523n0127k7027O761K3762K9077K6272n644M3621k133l1455
8667E30713n864k9497l2494J268J3261k1974L0427k0176l0404R053j2154N0519
8655D82678L9694K3652M688K6031K9732J2940j6944m9822l6018l5658n6854j2632
8643D11487p179K2199J2650o1887o2559j1106J4827M7466K037L4465Q514k4364
8631C86550j4247j1484k3241K9713n382K809K6147m749O031j893L2996K0075m4842
$$ plain form
8618 398483 410251 410531 365985 363139 392155 444257 488180 529460 586583 600900 618465 653141
8606 653141 641523 558677 457235 415274 377116 331466 333883 358275 335383 303702 294505 288318
8594 288318 298238 343470 360117 322309 292175 273275 262688 288945 280741 273493 284014 267256
8582 267256 260517 305939 312192 278999 248653 216024 202610 232744 278347 286342 208530 161839
8570 161839 189467 227297 249586 253923 241793 293413 394074 424204 463065 467196 421745 333848
8558 333848 261703 231557 211366 186417 220307 172888 165774 204125 204351 179408 203966 189894
8546 189894 175641 212867 213293 207133 183391 174175 161064 155069 146972 176948 180837 206849 195919
8533 195919 132368 127213 152221 199717 211164 198321 182790 172240 180303 175190 211807 250246
$$ packed form
8618C98483J1768K80m4546k846K9016N2102M3923M1280N7123J4317J7565L4676
8606F53141j1618q2846j01442m1961l8158m5650K417K4392k2892l1681r197o187
8594B88318R920M5232J6647l7808l0134j8900j0587K6257q204p248J0521j6758
8582B67256o739M5422O253l3193l0346l2629j3414L0134M5603P995p7812m6691
8570A61839K7628L7830K2289M337j2130N1620J00661L0130L8861M131m5451q7897
8558C33848p2145l0146k0191k4949L3890m7419p114L8351K26k4943K4558j4072
8546A89894j4253L7226M26o160k3742r216j3111n995q097K9976L889K6012j0930
8533A95919o3551n155K5008M7496J1447j2843j5531j0550Q063n113L6617L8439
$$ plain form
8521 250246 241074 169742 161878 170887 161100 216149 200849 218388 202930 133481 90667 112891
8509 112891 145230 122229 122095 189277 188183 135024 110845 120750 162716 171129 249979 253495 185949
8496 185949 143030 126256 183994 167648 125189 117764 153415 162574 87661 106159 132793 153905
8484 153905 110323 62322 77719 137742 160726 141013 93460 62910 70895 112124 127259 109550
8472 109550 107599 131019 91826 106394 105503 108137 139761 117720 89258 108446 105829 107000 156551
8459 156551 207766 172971 115993 98507 129895 97883 84244 116396 90533 71246 71700 74385
8447 74385 99931 106759 102074 97383 124191 123782 145287 121422 41639 24276 48030 37944 19189
8434 19189 80791 127538 150911 177529 145413 124138 80689 52937 40971 26981 16045 22863
$$ packed form
8521B50246r172p1332p864R009r787N5049j5300J7539j5458o9449m2814K2224
8509A12891L2339k3001j34O7182j094n3159k4179R905M1966Q413P8850L516o7546
8496A85949m2919j6774N7738j6346m2459p425L5651R159p4913J8498K6634K1112
8484A53905m3582m8001J5397O0023K2984j9713m7553l0550P985M1229J5135j7709
8472A09550j951K3420l9193J4568q91K634L1624k2041k8462J9188k617J171M9551
8459A56551N1215l4795n6978j7486L1388l2012j3639L2152k5863j9287M54K685
8447G4385K5546O828m685m691K6808m09K1505k3865p9783j7363K3754j0086j8755
8434A9189O1602M6747K3373K6618l2116k1275m3449k7752j1966j3990j0936O818
$$ plain form
8422 22863 73864 127323 142726 116909 104184 41766 11752 9526 1731 23747 59522 8528
8410 8528 -6969 21970 18749 22858 57224 84456 63525 38229 55731 44655 76499 64983
8398 64983 59545 48735 56578 58550 52691 108876 129270 97507 84288 93671 105819 149592 184178
8385 184178 130807 70874 53979 85168 131101 156792 108333 82432 60308 56775 52283 106738
8373 106738 88495 45253 8780 -34413 -21514 12157 -3165 -29921 -9883 -2647 -5231 -11180
8361 -11180 -6 1164 14875 46064 25577 21494 26491 38280 60413 33539 74122 52346
8349 52346 28855 22907 12586 54816 94513 70887 61217 89166 94459 49490 39253 53160
8337 53160 94438 132360 112913 103424 85528 71070 46131 52676 83269 54815 30046 35466
$$ packed form
8422B2863N1001N3459J5403k5817j2725o2418l0014k226p795K2016L5775n0994
8410H528j5497K8939l221M109L4366K7232k0931k5296J7502j1076L1844j1516
8398F4983n438j0810P843J972n859N6185K0394l1763j3219R383J2148M3773L4586
8385A84178n3371n9933j6895L1189M5933K5691m8459k5901k2124l533m492N4455
8373A06738j8243m3242l6473m3193J2899L3671j5322k6756K0038P236k584n949
8361a1180J1174J170J3711L1189k0487m083M997J1789K2133k6874M0583k1776
8349E2346k3491n948j0321M2230L9697k3626r670K7949N293m4969j0237J3907
8337E3160M1278L7922j9447r489j7896j4458k4939O545L0593k8454k4769N420
$$ plain form
8325 35466 58138 67099 81242 104831 37965 4688 25584 68214 80294 97372 89285 35945
8313 35945 17633 50092 19618 8936 35673 103099 99078 38696 -334 915 47265 52306
8301 52306 31838 24847 78822 104683 85342 53733 64019 77932 60905 4675 2805 -14811
8289 -14811 22291 90455 114468 87397 113136 137529 99405 68429 102408 76666 82017 100325
8277 100325 73972 96509 63301 40090 10619 -30077 9967 30387 3909 34142 10878 18420
8265 18420 -13809 4327 61340 91399 62316 32606 33634 82304 60781 29365 -61951 -41209
8253 -41209 2061 36155 20225 -1548 -59248 -52434 -24260 -25363 -37183 -60932 -77685 -35239
8241 -35239 -12052 -2629 -27850 -31932 -17140 1608 38171 48165 81384 112041 110699 89667 115177
$$ packed form
8325C5466K2672Q961J4143K3589o6866l3277K0896M2630J2080J7078q087n3340
8313C5945j8312L2459l0474j0682K6737O7426m021o0382l9030J249M6350N041
8301E2306k0468o991N3975K5861j9341l1609J0286J3913j7027n6230j870j7616
8289a4811L7102O8164K4013k7071K5739K4393l8124l0976L3979k5742N351J8308
8277A00325k6353K2537l3208k3211k9471m0696M0044K0420k6478L0233k3264P542
8265A8420l2229J8136N7013L0059k9083k9710J028M8670k1523l1416r1316K0742
8253d1209M3270L4094j5930k1773n7700O814K8174j103j1820k3749j6753M2446
8241c5239K3187R423k5221m082J4792J8748L6563R994L3219L0657j342k1032K5510
$$ plain form
8228 115177 103438 23088 -32839 -83868 -96409 -60553 -35420 -14720 -87308 -88983 -37230 -67986
8216 -67986 -90513 -96700 -89736 -110265 -88090 -60158 -27251 -31650 -56199 -40262 -4398 42475
8204 42475 43130 480 -4331 44459 77351 80266 29008 -12119 -23047 -61785 -46937 -5179 -6841
8191 -6841 -49711 -42894 -13176 -472 -6518 -26479 -41235 -32442 17617 76389 46290 33152 78796
8178 78796 95229 66926 30774 12014 1796 4583 29302 13820 32649 83022 56038 19864
8166 19864 22673 -28889 -8973 3991 -12802 -65707 -103020 -110105 -65172 -11872 21395 84951
8154 84951 122106 50121 19021 -10876 11073 -1920 6486 36900 68408 29913 11190 -7489
8142 -7489 -7236 15527 -214 -4369 17552 13371 -36583 -33516 -24647 -19838 -20238 -17769 -73873 -86110
$$ packed form
8228A15177j1739q0350n5927n1029j2541L5856K5133K0700p2588j675N1753l0756
8216f7986k2527o187O964k0529K2175K7932L2907m399k4549J5937L5864M6873
8204D2475O55m2650m811M8790L2892K915n1258m1127j0928l8738J4848M1758j662
8191f841m2870O817K9718J2704o046j9961j4756Q793N0059N8772l0099j3138M5644
8178G8796J6433k8303l6152j8760j0218K787K4719j5482J8829N0373k6984l6174
8166A9864K809n1562J9916J2964j6793n2905l7313p085M4933N3300L3267O3556
8154H4951L7155p1985l1100k9897K1949j2993Q406L0414L1508l8495j8723j8679
8142g489K53K2763j5741m155K1921m181m9954L067Q869M809m00K469n6104j2237
$$ plain form
8128 -86110 -52105 -431 1887 5312 27707 2709 -6656 -1934 -19082 -52704 -48732 -43197 -34647
8115 -34647 -18204 -14145 43387 85443 125085 109133 46374 -524 -3229 27016 131811 145307
8103 145307 110731 75542 44036 10265 1792 14114 -19065 -37823 -44837 -35143 -39129 -23113
8091 -23113 -33472 -55496 -52155 -65966 -69733 -58096 -86881 -107982 -67498 -8569 22494 33978
8079 33978 36453 47344 25791 44691 51425 18630 -13824 -31109 2402 -16482 -91799 -53996
8067 -53996 -43935 -37691 4182 34767 31208 27590 -3879 -42062 -25316 -20175 5229 37104 38215
8054 38215 792 -9665 47811 37476 18540 924 -18135 -42309 -41874 -19345 24219 53996
8042 53996 78061 21275 -17935 -7095 19306 64209 121852 130003 120080 65805 24414 5929
$$ packed form
8128h6110L4005N1674K318L425K2395k4998r365M722j7148l3622L972N535Q550
8115c4647J6443M059N7532M2056L9642j5952o2759m6898k705L0245J04795J3496
8103A45307l4576l5189l1506l3771q473J2322l3179j8758p014R694l986J6016
8091b3113j0359k2024L341j3811l767J1637k8785k1101M0484N8929L1063J1484
8079C3978K475J0891k1553J8900O734l2795l2454j7285L3511j8884p5317L7803
8067e3996J0061O244M1873L0585l559l618l1469l8183J6746N141K5404L1875J111
8054C8215l7423j0457N7476j0335j8936j7616j9059k4174M35K2529M3564K9777
8042E3996K4065n6786l9210J0840K6401M4903N7643Q151r923n4275m1391j8485
$$ plain form
8030 5929 -8556 14211 9643 19641 51667 18620 -12920 -25880 -47822 -18473 32176 39595 55159
8017 55159 78495 72460 86811 116481 75583 62221 27951 -580 -508 20178 34376 61778 74265
8004 74265 72073 53623 58710 72710 83383 53434 35270 26960 12408 -32296 7251 102350
7992 102350 104193 44933 -3543 -16944 36074 75259 98618 116421 107373 54418 1913 -12618
7980 -12618 11977 62176 71521 51486 16090 3214 25377 88877 130864 139827 95122 54759
7968 54759 30788 68296 115237 95891 73963 51823 10641 -7611 6937 43240 30504 57894
7956 57894 54005 67752 48705 53053 57864 75552 117787 103014 34074 8854 -22423 -31100 -55745
7943 -55745 -71082 -17669 9983 46530 20029 16762 29244 -7013 -28245 -38872 -23045 -45217
$$ packed form
8030E929j4485K2767m568R998L2026l3047l1540j2960k1942K9349N0649P419J5564
8017E5159K3336o035J4351K9670m0898j3362l4270k8531P2K0686J4198K7402J2487
8004G4265k192j8450N087J4000J0673k9949j8164q310j4552m4704L9547R5099
7992A02350J843n9260m8476j3401N3018L9185K3359J7803r048n2955n2505j4531
7980a2618K4595N0199R345k0035l5396j2876K2163O3500M1987Q963m4705m0363
7968E4759k3971L7508M6941j9346k1928k2140m1182j8252J4548L6303j2736K7390
7956E7894l889J3747j9047M348M811J7688M2235j4773o8940k5220l1277q677k4645
7943e5745j5337N3413K7652L6547k6501l267J2482l6257k1232j0627J5827k2172
$$ plain form
7931 -45217 3134 54062 80492 48983 -13283 -54175 -15877 2288 -15253 -43841 -36661 -20012
7919 -20012 -63862 -48359 -60302 -39011 -15352 -6046 -44785 -74549 -38047 -4772 -663 1215
7907 1215 -14803 -24971 -24284 -27638 -7953 -21153 -31777 -22240 -18424 1104 7784 24371 41276
7894 41276 23821 52502 57027 40048 64718 28666 453 18304 70992 99218 108393 101855
7882 101855 95832 57981 17683 25033 15128 24451 -29102 -31724 -37733 20969 14284 4387 22130
7869 22130 39501 -3431 -39575 -35276 -25132 56293 54784 70285 89595 25730 22958 36900
7857 36900 7081 31795 25085 49796 112573 145841 123938 49087 1518 9419 -19288 -69912
7845 -69912 -128409 -153911 -74717 8653 36206 13630 8248 32567 44615 44834 33257 7747
$$ packed form
7931d5217M8351N0928K6430l1509o2266m0892L8298J8165j7541k8588P180J6649
7919b0012m3850J5503j1943K1291K3659R306l8739k9764L6502L3275M109J878
7907A215j6018j0168O87l354J9685j3200j0624R537L816J9528O680J6587J6905
7894D1276j7455K8681M525j6979K4670l6052k8213J7851N2688K8226R175o538
7882A01855o023l7851m0298P350r905R323n3553k622o009N8702o685r897J7743
7869B2130J7371m2932l6144M299J0144Q1425j509J5501J9310o3865k772J3942
7857C6900k9819K4714o710K4711O2777L3268k1903p4851m7569P901k8707n0624
7845f9912n8497k5502P9194Q3370K7553k2576n382K4319J2048K19j1577k5510
$$ plain form
7833 7747 4584 -26696 -32465 -12864 33368 32408 12341 -33162 -68787 -51362 14968 60196 50136
7820 50136 46643 55143 9581 -14495 -65481 -53388 -38453 -46162 -1726 20110 11808 15148 50000
7807 50000 8072 4651 8292 10418 -16883 -5174 3809 8616 20100 16859 20207 58718 61477
7794 61477 35185 17657 37401 59975 24182 -34787 -39241 1878 20383 8663 25270 2645
7782 2645 -53711 -65125 -80284 -75518 -58377 -40954 -12412 24717 -3696 -65102 -51787 -47291
7770 -47291 -70401 -102627 -103008 -70598 -57349 -80625 -44915 -11358 -41213 -51261 -48819 -94379
7758 -94379 -82003 -61347 -50453 -52945 -43028 -23777 -47235 -34560 -21878 -29547 -18155 -15711 -8206
7745 -8206 13288 -887 11493 -18766 -74442 -62690 -58426 -73241 -87780 -118188 -111964 -87328
$$ packed form
7833G747l163l1280n769J9601M6232r60k0067m5503l5625J7425O6330M5228j0060
7820E0136l493Q500m5562k4076n0986J2093J4935p709M4436K1836q302L340L4852
7807E0000m1928l421L641K126k7301J1709Q983M807J1484l241L348L8511K759
7794F1477k6292j7528J9744K2574l5793n8969m454M1119J8505j1720J6607k2625
7782B645n6356j1414j5159M766J7141J7423K8542L7129k8413o1406J3315M496
7770d7291k3110l2226l81L2410J3249k3276L5710L3557k9855j0048K442m5560
7758i4379J2376K0656J0894k492R917J9251k3458J2675J2682p669J1392K444P505
7745h206K1494j4175J2380l0259n5676J1752M264j4815j4539l0408O224K4636
$$ plain form
7733 -87328 -33189 -28996 1033 -11258 11386 59773 43836 -14516 -56859 -60525 -67844 -66424 -102553
7720 -102553 -101043 -87809 -25951 -50767 -58709 -40848 -17404 -38390 -40550 -54511 -59088 -41055
7708 -41055 -78712 -66510 -59354 -13909 -19892 -2426 -24520 17991 34683 20805 36773 55039
7696 55039 54397 9995 -47925 -82117 -93543 -160444 -146874 -80611 -83330 -112078 -98467 -40029
7684 -40029 -28373 -24380 7270 24409 -5733 -20662 30428 39091 8432 -45446 -71211 -43260
7672 -43260 -21025 -35979 -18525 -58006 -13977 21961 24961 34810 67957 48735 11762 -33830
7660 -33830 -52976 -34951 -13406 -2780 4036 17376 190 8606 -2270 10130 4289 -47113
7648 -47113 -45062 697 17686 1642 -47394 -73138 -68514 -99103 -97302 -106949 -72894 -58848 -34401
$$ packed form
7733h7328N4139M193L0029j2291K2644M8387j5937n8352m2343l666p319J420l6129
7720a02553J510J3234O1858k4816p942J7861K3444k0986k160j3961m577J8033
7708d1055l7657J2202P156M5445n983J7466k2094M2511J6692j3878J5968J8266
7696E5039o42m4402n7920l4192j1426o6901J3570O6263k719k8748J3611N8438
7684d0029J1656L993L1650J7139l0142j4929N1090Q663l0659n3878k5765K7951
7672d3260K2235j4954J7454l9481M4029L5938L000R849L3147j9222l6973m5592
7660c3830j9146J8025K1545J0626O816J3340j7186Q416j0876J2400n841n1402
7648d7113K051M5759J6989j6044m9036k5744M624l0589J801r647L4055J4046K4447
$$ plain form
7635 -34401 -39061 -97357 -106722 -57207 -18145 -13659 -3344 -5503 -28575 13700 51583 69634 12918
7622 12918 -25954 -56787 -18166 6350 1402 22855 47158 67368 51495 10301 45123 43703
7610 43703 29501 50972 5659 -39914 -96335 -80106 -88594 -120695 -211711 -209254 -161044 -160783 -129657
7597 -129657 -116081 -107719 -69017 10108 36385 29668 29078 -6081 -30347 -28133 -36652 -19664 -45698
7584 -45698 -41174 -23319 -10225 25865 14230 38871 21754 -8346 6986 6382 13359 5945 16617
7571 16617 -19617 -29303 -16253 -78013 -79737 -85815 -79467 444 -1384 -18674 -12355 -18756 -6139
7558 -6139 -44559 -36385 10032 -20715 -59345 -40560 -50431 -69451 -65546 -124121 -108800 -90616 -95285
7545 -95285 -54160 -20001 3196 41626 -8366 -33276 -88107 -94083 -14311 25944 22189 18822
$$ packed form
7635c4401m660n8296r365M9515L9062M486J0315k159k3072M2275L7883J8051n6716
7622A2918l8872l0833L8621K4516m948K1453K4303K0210j5873m1194L4822j420
7610D3703j4202K1471m5313m5573n6421J6229q488l2101r1016K457M8210K61L1126
7597a29657J3576Q362L8702P9125K6277o717n90l5159k4266K214q519J6988k6034
7584d5698M524J7855J3094L6090j1635K4641j7117l0100J5332o04O977p414J0672
7571A6617l6234r686J3050o1760j724o078O348P9911j828j7290O319o401J2617
7558f139l8420Q174M6417l0747l8630J8785r871j9020L905n8575J5321J8184m669
7545i5285M1125L4159K3197L8430m9992k4910n4831n976P9772M0255l755l367
$$ plain form
7533 18822 28167 29139 20195 36607 19882 29307 26296 43594 47057 27953 13345 -21753 -38825
7520 -38825 -17022 1290 -16860 -14323 -6823 16470 19602 52466 83663 50282 36801 -9200
7508 -9200 -36167 -12543 -1367 3507 36156 74505 38986 -45715 -81341 -44283 5607 48613
7496 48613 40447 41975 68560 24957 -38719 -57518 -68901 -44292 -27152 -64464 1202 48203
7484 48203 29890 18861 10734 29688 34224 59340 8449 16173 -2276 -30940 -17607 -19107 -34502
7471 -34502 -5810 2431 -20161 -55547 -41899 2533 2381 -53955 -60499 -55381 -73841 -79353 -34823
7458 -34823 -1601 15362 10864 -5882 14354 1186 -46685 -47371 -14202 10364 20997 -2596
7446 -2596 -41734 -26432 10122 22040 -14712 -44639 -22592 -8253 -35532 -80819 -81497 -70897
$$ packed form
7533A8822R345R72q944J6412j6725R425l011J7298L463j9104j4608l5098j7072
7520c8825K1803J8312j8150K537P500K3293L132L2864L1197l3381j3481m6001
7508i200k6967K3624J1176M874L2649L8349l5519q4701l5626L7058M9890M3006
7496D8613q166J528K6585m3603o3676j8799j1383K4609J7140l7312O5666M7001
7484D8203j8313j1029q127J8954M536K5116n0891P724j8449k8664J3333j500j5395
7471c4502K8692Q241k2592l5386J3648M4432j52n6336o544N118j8460n512M4530
7458c4823L3222J6963m498j6746K0236j3168m7871o86L3169K4566J0633k3593
7446b596l9138J5302L6554J1918l6752k9927K2047J4339k7279m5287o78J0600
$$ plain form
7434 -70897 -37712 -16667 -33729 -32951 -16121 -27096 -39949 -11729 -67144 -92988 -72722 -84355
7422 -84355 -68753 -37394 -30747 -34904 12254 18351 -23573 -65991 -87147 -94402 -127582 -114067 -79404
7409 -79404 -33598 -58766 -62940 -36440 -1307 -10385 -19274 9533 30872 17790 38813 10238
7397 10238 -7103 -56430 -76110 -59750 -64362 -57680 -17160 2321 4921 -7527 -2146 45026 59192
7384 59192 37482 53213 83500 10587 -10481 -218 -6232 11501 39177 51823 65013 23588
7372 23588 16119 3726 -9091 -49570 -4639 31992 64387 47307 13172 21005 2274 -23090
7360 -23090 -21370 18373 13034 -9557 -49654 -66001 -11705 14437 -6911 3172 37633 20256
7348 20256 33633 3747 -59026 -43041 -39270 -40421 -37320 3344 13381 3243 -20849 -44960
$$ packed form
7434g0897L3185K1045j7062P78J6830j0975j2853K8220n5415k5844K0266j1633
7422h4355J5602L1359O647m157M7158O097m1924m2418k1156p255l3180J3515L4663
7409g9404M5806k5168m174K6500L5133r078q889K8807K1339j3082K1023k8575
7397A0238j7341m9327j9680J6360m612O682M0520J9481K600j2448N381M7172J4166
7384E9192k1710J5731L0287p2913k1068J0263o014J7733K7676J2646J3190m1425
7372B3588p469j2393j2817m0479M4931L6631L2395j7080l4135P833j8731k5364
7360b3090J720L9743n339k2591m0097j6347N4296K6142k1348J0083L4461j7377
7348B0256J3377k9886o2773J5985L771j151L101M0664J0037j0138k4092k4111
$$ plain form
7336 -44960 -17189 -29975 -22930 -45737 -33949 17000 43202 -3778 -1356 5709 6469 -42522 -108303
7323 -108303 -108916 -93264 -63714 -13314 7579 29990 462 -49895 -52379 -44580 -74787 -46006
7311 -46006 7811 25222 15076 950 45166 41794 16815 19010 -18667 -70811 -47148 2562
7299 2562 -14850 -6515 18232 59270 43397 48113 7158 -39184 -64217 -53198 -29714 17514
7287 17514 -19499 -34060 -5889 43351 39396 -45729 -47888 -24083 13461 -51 6632 11222 12440
7274 12440 33877 23810 -3479 -13703 -3427 -15939 -20403 -25870 -43595 123 6852 -9544
7262 -9544 -30268 -56189 -11006 -1700 11566 10316 18890 53635 25922 7340 -37829 -61314 -48702
7249 -48702 -50725 -71266 -52611 -67430 -48679 -40808 -46456 -16973 17506 58145 74889 25635
$$ packed form
7336d4960K7771j2786P045k2807J1788N0949K6202m6980K422P065P60m8991o5781
7323a08303o13J5652K9550N0400K0893K2411k9528n0357k484P799l0207K8781
7311d6006N3817J7411j0146j4126M4216l372k4979K195l7677n2144K3663M9710
7299B562j7412Q335K4747M1038j5873M716m0955m6342k5033J1019K3484M7228
7287A7514l7013j4561K8171M9240l955q5125k159K3805L7544j3512O683M590J218
7274A2440K1437j0067k7289j0224J0276j2512m464n467j7725M3718O729j6396
7262i544k0724k5921M5183R306J3266j250Q574L4745k7713j8582m5169k3485J2612
7249d8702k023k0541J8655j4819J8751P871n648K9483L4479M0639J6744m9254
$$ plain form
7237 25635 -18365 -38514 -42138 19785 50194 1710 -58806 -66269 -43946 11250 30997 -19652
7225 -19652 -70435 -59545 -34476 -5685 -4727 -11985 -14905 -12873 -21249 20860 31640 -18743 -62827
7212 -62827 -63833 -71145 -50616 -74245 -92995 -73624 -86428 -35939 -27761 -39860 -18226 -31892
7200 -31892 -68947 -46192 -38898 -26936 -28394 -42414 -42800 -67150 -64646 -33156 -58159 -78578 -73265
7187 -73265 -75012 -78947 -71515 -80719 -74095 -42069 -8102 -61391 -63544 -58452 -35497 -33512 -34625 15941
7173 15941 30157 38015 1695 -90629 -98876 -43083 -64995 -89477 -34125 1205 18902 15178
7161 15178 -8359 -14021 -4777 12465 464 34422 50768 16982 -19284 -48142 -34397 -46939
7149 -46939 -907 -7154 -49465 -36697 13243 14334 -7507 -9141 -14393 -6384 30595 -11685 -53452
$$ packed form
7237B5635m4000k0149l624O1923L0409m8484o0516p463K2323N5196J9747n0649
7225a9652n0783J0890K5069K8791R58p258k920K032q376M2109J0780n0383m4084
7212f2827j006p312K0529k3629j8750J9371j2804N0489Q178j2099K1634j3666
7200c1892l7055K2755P294J1962j458j4020l86k4350K504L1490k5003k0419N313
7187g3265j747l935P432r204O624L2026L3967n3289k153N092K2955J985j113N0566
7173A5941J4216P858l6320r2324q247N5793k1912k4482N5352L5330J7697l724
7161A5178k3537n662R244J7242j2001L3958J6346l3786l6266k8858J3745j2542
7149d6939M6032o247m2311J2768M9940J091k1841j634n252Q009L6979m2280m1767
$$ plain form
7136 -53452 -51576 -62521 -68121 -72066 -72896 -11274 31989 34867 48996 58235 40177 33802 56130
7123 56130 33447 74053 51021 6599 -28462 -18149 24177 63430 51738 10260 19331 -22211
7111 -22211 -32671 -51550 -57427 -5209 -27373 -54747 -73040 -54466 -40100 -33392 -51329 -36275
7099 -36275 -44514 -73223 -54680 -60577 -7057 -2373 1746 40404 20247 -62325 -96667 -69106 -37550
7086 -37550 -31847 7549 21932 43858 15564 15546 58434 15265 766 23937 16125 -9565 -38699
7073 -38699 -11719 35108 61084 70483 66884 -14538 -84054 -89919 -126115 -106699 -73191 -65039 -99662
7060 -99662 -74728 -28833 -45100 -64898 -56586 -76986 -46945 -45922 -15134 -42053 -34811 -27127 -55917
7047 -55917 -6865 50671 80158 48461 1754 11101 22722 18773 -6736 -30846 -33259 -2044
$$ packed form
7136e3452J876j0945n600l945q30O1622M3263K878J4129R239j8058o375K2328
7123E6130k2683M0606k3032m4422l5061J0313M2326L9253j1692m1478R071m1542
7111b2211j0460j8879n877N2218k2164k7374j8293J8574J4366O708j7937J5054
7099c6275q239k8709J8543n897N3520M684M119L8658k0157q2572l4342K7561L1556
7086c7550N703L9396J4383K1926k8294j8M2888m3169j4499K3171p812k5690k9134
7073c8699K6980M6827K5976R399l599q1422o9516n865l6196J9416L3508Q152l4623
7060i9662K4934M5895j6267j9798Q312k0400L0041J023L0788k6919P242P684k8790
7047e5917M9052N7536K9487l1697m6707R347J1621l949k5509k4110k413L1215
$$ plain form
7035 -2044 -17815 -49860 -56900 -55906 -68929 -53925 -17449 -21809 -45841 -50351 -33834 -35238 -38424
7022 -38424 -34394 -45052 -24317 -66555 -94900 -66506 -66362 -91886 -109061 -93194 -59339 -32674
7010 -32674 -13403 -471 20583 11773 687 -19387 125 22565 27444 46963 38867 30715 -12806
6997 -12806 -50731 -77482 -46934 3194 5143 -3845 13849 33130 33999 -29478 -81918 -61128 -24482
6984 -24482 -8051 1364 18860 38018 59772 16987 -23090 -34615 -16918 -54470 -91634 -67792
6972 -67792 -53961 -19334 -37237 -58699 -43670 -7528 9941 10682 -5401 -23040 -56963 -82450
6960 -82450 -55754 -45131 -82250 -101019 -66605 -17321 -2141 -43955 -86701 -28477 17163 12007
6948 12007 9295 -4155 45868 52870 -21685 -31187 17776 40294 81934 85887 85542 71024 61408
$$ packed form
7035b044j5771l2045p040R94j3023J5004L6476m360k4032m510J6517j404l186
7022c8424M030j0658K0735m2238k8345K8394J44k5524j7175J5867L3855K6665
7010c2674J9271J2932K1054q810j1086k0074J9512K2440M879J9519q096q152m3521
6997a2806l7925k6751L0548N0128J949q988J7694J9281Q69o3477n2440K0790L6646
6984b4482J6431R415J7496J9158K1754m2785m0077j1525J7697l7552l7164K3842
6972f7792J3831L4627j7903k1462J5029L6142J7469P41j6083j7639l3923k5487
6960h2450K6696J0623l7119j8769L4414M9284J5180m1814m2746N8224M5640n156
6948A2007k712j3450N0023P002p4555r502M8963K2518M1640L953l45j4518r616
$$ plain form
6935 61408 63113 3438 -17220 12797 21654 28479 12545 20659 40737 32441 17637 19227 44692
6922 44692 34416 -25638 -74180 -73978 -36164 -69392 -108274 -99167 -21166 16700 25854 6986 -11927
6909 -11927 2504 22765 44930 10996 -10752 -31336 -68425 -89773 -50892 -18898 1718 36687
6897 36687 55762 33385 -43095 -85761 -79505 -42975 -18785 -32941 -63951 -88315 -111521 -124801
6885 -124801 -127463 -54838 -11351 -14618 -8857 -38227 4897 42104 33485 48063 35365 27079 -8034
6872 -8034 33283 12550 -3233 -8705 -2020 1302 21344 39367 26099 -28993 -75406 -62046 -20081
6859 -20081 36557 53988 47801 -17417 -48464 -46667 -53124 -55090 -26459 -23148 -5433 34069 42793
6846 42793 9454 6939 13230 17421 -32461 -44663 -50981 -54761 -31216 9367 29717 30430 25963
$$ packed form
6935F1408J705n9675k0658L0017Q857O825j5934Q114K0078q296j4804J590K5465
6922D4692j0276o0054m8542K02L7814l3228l8882R107P8001L7866R154j8868j8913
6909a1927J4431K0261K2165l3934k1748k0584l7089k1348L8881L1994K0616L4969
6897C6687J9075k2377p6480m2666O256L6530K4190j4156l1010k4364k3206j3280
6885a24801k662P2625M3487l267N761k9370M3124L7207q619J4578j2698q286l5113
6872h034M1317k0733j5783n472O685L322K0042J8023j3268n5092m6413J3360M1965
6859b0081N6638J7431o187o5218l1047J797o457j966K8631L311J7715L9502Q724
6846D2793l3339k515O291M191m9882j2202o318l780K3545M0583K0350P13m467
$$ plain form
6833 25963 38291 -8841 -21113 -48800 -52674 11796 -10526 -15341 -14544 -11208 -23188 -15855 16010
6820 16010 18566 5378 -62301 -66038 -53763 -56837 -40758 -29826 -65382 -111079 -69216 -46516
6808 -46516 -40956 -32448 -32444 -58772 -80268 -121862 -116358 -56942 -24410 -25142 -14392 -301 9016 -13947
6794 -13947 297 76600 91645 3577 -81911 -82376 -655 1385 -4073 -5244 2125 15038 38349
6781 38349 48956 -38456 -60994 -17358 -38904 -79976 -60873 -30057 -25038 -12815 -12214 -46924
6769 -46924 21837 47822 53389 23291 -19557 -42267 -31286 25729 43932 47456 100734 56715
6757 56715 20635 -38155 -8963 7696 59631 18593 13113 -8282 -2673 7620 44876 25745
6745 25745 17798 48506 30461 37252 109845 152214 154258 157166 231326 249070 203229 162423 106098
$$ packed form
6833B5963J2328m7132j2272k7687l874O4470k2322m815P97L336j1980P333L1865
6820A6010K556j3188o7679l737J2275l074J6079J0932l5556m5697M1863K2700
6808d6516N560Q508Mk6328k1496m1594N504N9416L2532p32J0750J4091R317k2963
6794a3947J4244P6303J5045q8068q5488m65Q1721K040n458j171P369J2913K3311
6781C8349J0607q7412k2538M3636k1546m1072J9103L0816N019J2223O01l4710
6769d6924O8761K5985N567l0098m2848k2710J0981N7015J8203L524N3278m4019
6757E6715l6080n8790K9192J6659N1935m1038n480k1395N609J0293L7256j9131
6745B5745p947L0708j8045O791P2593M2369K044K908P4160J7744m5841m0806n6325
$$ plain form
6732 106098 48729 20192 272 -30118 -53399 -36821 -28802 -13225 19970 -10353 -21060 -17514
6720 -17514 9094 22417 4602 -24161 -26077 12348 -7683 -43902 -60360 -63958 -30760 -33202
6708 -33202 -51283 -52259 3273 44271 70990 61630 61431 38994 28920 -6026 -34034 -70049 200
6695 200 20826 -11850 -18575 19741 45549 25459 28392 2555 -24949 -46556 -40150 -74757 -60061
6682 -60061 -11425 47043 25305 2178 24531 14477 3131 -33265 -81295 -74971 -94266 -83843
6670 -83843 -68722 -61102 -8580 27870 45428 57172 49429 57180 11457 -5840 -41085 10171
6658 10171 47137 37847 20215 48426 33668 -20513 -25188 -12057 -24028 -36653 23201 -17245
6646 -17245 -32688 2769 559 5576 22084 720 10824 -2317 2736 33846 39040 15319 30427
$$ packed form
6732A06098n7369k8537j9920l0390k3281J6578Q019J5577L3195l0323j0707L546
6720a7514K6608J3323j7815k8763j916L8425k0031l6219j6458l598L3198k442
6708c3202j8081r76N5532M0998K6719r360j99k2437j0074l4946k8008l6015P0249
6695B00K0626l2676o725L8316K5808k0090K933k5837k7504k1607O406l4607J4696
6682f0061M8636N8468k1738k3127K2353j0054j1346l6396m8030O324j9295J0423
6670h3843J5121P620N2522L6450J7558J1744p743P751m5723j7297l5245N1256
6658A0171L6966r290j7632K8211j4758n4181m675J3131j1971j2625N9854m0446
6646a7245j5443L5457k210N017J6508k1364J0104j3141N053L1110N194k3721J5108
$$ plain form
6633 30427 -2578 -64028 -19031 4657 -32706 6324 35993 -4426 24726 30067 28311 28480 -18707
6620 -18707 -27197 -25026 -59216 -100957 -34918 -15650 -14134 -18992 -27037 -18529 29457 35824 7198
6607 7198 -25272 -1531 -5348 11242 54187 15154 -18020 4880 35649 9308 -27144 -30983
6595 -30983 -12163 -471 34875 65081 47905 74919 72047 67753 48910 44179 64208 25077
6583 25077 19559 3638 -6100 2151 29556 -8219 -63242 -62932 -43852 -54862 -92671 -104291 -78381
6570 -78381 -51350 -25491 -44101 -41757 -6917 22993 38245 -30221 -67696 -8281 -5720 -36984
6558 -36984 -74671 -144961 -175755 -186306 -120122 -58458 -30017 -33358 16716 29376 27355 16317
6546 16317 -40435 -69453 -90579 -100738 -100035 -104307 -71951 -35165 -38575 -48164 -76586 -50796 -35917
$$ packed form
6633C0427l3005o1450M4997K3688l7363L9030K9669m0419K9152N341j756J69m7187
6620a8707q490K171l4190m1741O6039J9268J516m858q045Q508M7986O367k8626
6607G198l2470K3741l817J6590M2945l9033l3174K2900L0769k6341l6452l839
6595c0983J8820J1692L5346L0206j7176K7014k872m294j8843m731K0029l9131
6583B5077n518j5921r738Q251K7405l7775n5023L10J9080j1010l7809j1620K5910
6570g8381K7031K5859j8610K344L4840K9910J5252o8466l7475N9415K561l1264
6558c6984l7687p0290l0794j0551O6184O1664K8441l341N0074J2660k021j1038
6546A6317n6752k9018k1126j0159P03m272L2356L6786l410r589k8422K5790J4879
$$ plain form
6533 -35917 -3604 22454 44199 9606 -13480 -37411 -66608 -59870 -17464 15445 20151 8982
6521 8982 -7471 -22109 -17160 -39739 -46290 -39227 -50790 -69826 -52135 -48881 -39489 -12856 -39977
6508 -39977 -65056 10049 11258 -75044 -85264 -70408 -56192 -76256 -33737 -14174 16355 37858
6496 37858 11670 -40927 -52359 -42742 -33871 -2941 699 32157 43869 -7379 -19580 3116
6484 3116 26640 58254 59741 48360 -4151 -5364 30485 8918 -5261 18469 778 -30988
6472 -30988 -42757 -10357 -23000 -32038 8835 425 -6270 -40138 -10517 35983 13830 37404
6460 37404 32301 -719 -41917 -44948 9268 45166 -14435 -18879 1054 -30541 -69524 -46178
6448 -46178 -32874 -34368 -76563 -56166 -53097 -58028 -29544 -41425 -5743 -36237 -47648 -55699 -46198
$$ packed form
6533c5917L2313K6058K1745l4593k3086k3931k9197O738M2406L2909M706j1169
6521H982j6453j4638M949k2579o551P063j1563j9036J7691L254R392K6633k7121
6508c9977k5079P5105J209q6302j0220J4856J4216k0064M2519J9563L0529K1503
6496C7858k6188n2597j1432R617Q871L0930L640L1458J1712n1248j2201K2696
6484C116K3524L1614J487j1381n2511j213L5849k1567j4179K3730j7691l1766
6472c0988j1769L2400j2643r038M0873q410o695l3868K9621M6500k2153K3574
6460C7404n103l3020m1198l031N4216L5898n9601m444J9933l1595l8983K3346
6448d6178J3304j494m2195K0397L069m931K8484j1881L5682l0494j1411q051R501
$$ plain form
6435 -46198 -34623 -40385 -13574 -23626 -9425 11364 -34958 -80347 -59800 -36144 -21919 -17785
6423 -17785 -24343 -6135 -4657 -38704 -34028 -8284 -17675 5151 38386 34672 21316 -14155 12099
6410 12099 -933 22211 69315 41416 29506 35039 9508 -64287 -74583 -5570 4022 -28431
6398 -28431 -34510 -55255 -38766 -44170 -32574 15402 -4074 -122 31376 13385 -39260 -57151
6386 -57151 -49415 -88475 -85067 -46780 -22651 -35874 -3311 -8732 -27814 14047 25896 -20525
6374 -20525 -34978 -44669 -72077 -67473 -50583 -39067 -22231 4497 -10078 -34138 -24801 15892
6362 15892 5224 -23498 -25249 -34290 -27848 32435 43751 24536 -17214 -33767 -43851 -6666
6350 -6666 22622 9610 -10621 -37807 -5691 -10140 -54461 -34534 14996 17589 -33430 -78717
$$ packed form
6435d6198J1575n762K6811j0052J4201K0789m6322m5389K0547K3656J4225M134
6423a7785o558J8208J478l4047M676K5744r391K2826L3235l714j3356l5471K6254
6410A2099j3032K3144M7104k7899j1910N533k5531p3795j0296O9013R592l2453
6398b8431o079k0745J6489n404J1596M7976j9476L952L1498j7991n2645j7891
6386e7151P736l9060L408L8287K4129j3223L2563n421j9082M1861J1849m6421
6374b0525j4453r691k7408M604J6890J1516J6836K6728j4575k4060R337M0693
6362A5892j0668k8722j751r041O442O0283J1316j9215m1750j6553j0084L7185
6350f666K9288j3012k0231k7186L2116m449m4321J9927M9530K593n1019m5287
$$ plain form
6338 -78717 -34215 12742 18736 -10591 -6560 -28588 -38937 -24670 15519 -867 -11631 20659
6326 20659 29626 10227 6642 8979 10593 21987 45988 -8179 -96071 -104127 -65380 11630 45821
6313 45821 12703 12373 -4438 -20178 -1141 -16929 -18665 5451 -6238 -28803 -50864 -47687 -5693
6300 -5693 -30671 -76295 -100788 -90973 -69948 -45360 -35821 4368 -37705 -16111 -42182 -33633 -12922
6287 -12922 -32143 -5099 15893 -16846 -72277 -89049 -44268 -13006 43720 38098 -3299 -15355
6275 -15355 -37069 -64137 -74223 -77183 -74874 -51084 41227 35530 15613 11915 -14455 -48777 -54769
6262 -54769 -57546 -46982 -34711 -24901 -18702 -28869 -14734 44177 104561 66570 23821 -35599
6250 -35599 -70486 -77449 -76036 -13534 26325 12177 -8679 -5652 24134 43290 68828 93089
$$ packed form
6338g8717M4502M6957N994k9327M031k2028j0349J4267M0189j6386j0764L2290
6326B0659Q967j9399l585K337J614J1394K4001n4167q7892q056L8747P7010L4191
6313D5821l3118l30j6811j5740J9037j5788j736K4116j1689k2565k2061L177M1994
6300e693k4978m5624k4493R815K1025K4588R539M0189m2073K1594k6071Q549K0711
6287a2922j9221K7044K0992l2739n5431j6772M4781L1262N6726n622m1397j2056
6275a5355k1714k7068j0086k960K309K3790R2311n697j9917l698k6370l4322n992
6262e4769k777J0564J2271R810O199j0167J4135N8911O0384l7991m2749n9420
6250c5599l4887o963J413O2502L9859j4148k0856L027K9786J9156K5538K4261
$$ plain form
6238 93089 54540 19864 54565 51035 33186 34719 38327 43569 10233 10135 -4751 -54511 -27825
6225 -27825 34683 41719 87972 39122 -53470 -76282 -30915 10434 32639 6961 15754 30310
6213 30310 14797 12913 56529 14399 -69530 -27907 -31107 -58151 -89450 -75420 -60199 -54168
6201 -54168 -87076 -74588 -18218 55511 82142 28749 -28208 -59466 -119707 -90016 17944 59103
6189 59103 64132 16261 887 -12578 -51512 -64679 -48873 13179 20583 -9105 -55858 -38322
6177 -38322 -18652 -29736 -23636 -44950 -31483 30676 40494 9845 -43478 -128707 -143214 -123939
6165 -123939 -64346 -76284 -85894 -100449 -104882 -109909 -108274 -90516 -106326 -120934 -93159 -79123
6153 -79123 -86899 -95284 -87204 -77563 -105899 -112470 -74717 -50275 -23222 4024 27936 28413 -23525
$$ packed form
6238I3089l8549l4676L4701l530j7849J533L608N242l3336r8j4886m9760K6686
6225b7825O2508P036M6253m8850r2592k2812M5367M1349K2205k5678Q793J4556
6213C0310j5513j884M3616m2130q3929M1623l200k7044l1299J4030J5221O031
6201e4168l2908J2488N6370P3729K6631n3393n6957l1258o0241K9691J07960M1159
6189E9103N029m7871j5374j3465l8934j3167J5806O2052P404k9688m6753J7536
6177c8322J9670j1084O100k1314J3467O2159R818l0649n3323q5229j4507J9275
6165a23939N9593j1938r610j4555m433n027J635J7758j5810j4608K7775J4036
6153g9123p776q385Q080R641k8336o571L7753K4442K7053K7246K3912M77n1938
$$ plain form
6140 -23525 -97830 -82308 -56330 -33755 -9931 -13466 -18571 -27986 31341 -6672 -24606 -7089
6128 -7089 -26663 -75441 -60543 -35512 -51036 -72398 -118811 -98526 -67580 -66982 -49179 -54241 -71470
6115 -71470 -57755 -74006 -36957 -56365 -46362 -45488 -73585 -1653 21706 -14041 -23430 -19573 -61909
6102 -61909 -65732 -43341 -60205 -54297 -40893 -47862 -36339 -45259 26047 61483 61934 46522 10280
6089 10280 -10369 -16724 -54837 -55637 -41749 -72047 -10934 48574 28200 41183 13429 -25932
6077 -25932 -37666 -41496 -107086 -92000 -49885 -27488 54780 51046 -28121 -32575 -15718 9004
6065 9004 -26091 -53057 -38546 -7476 4096 13366 21897 13719 -17221 -58480 -96476 -87992 -95190
6052 -95190 -126435 -110069 -58486 -31143 -45264 -90830 -108971 -88439 -69000 -50792 -41720 -24144
$$ packed form
6140b3525p4305J5522K5978K2575K3824l535n105r415N9327l8013j7934J7517
6128g089j9574m8778J4898K5031j5524k1362m6413K0285L0946N98J7803n062j7229
6115g1470J3715j6251L7049j9408J0003Q74k8097P1932K3359l5747r389L857m2336
6102f1909l823K2391j6864N908J3404o969J1523q920P1306L5436M51j5412l6242
6089A0280k0649o355l8113q00J3888l0298O1113N9508k0374J2983k7754l9361
6077b5932j1734l830o5590J5086M2115K2397Q2268l734p9167m454J6857K4722
6065I004l5095k6966J4511L1070J1572R270Q531q178l0940m1259l7996Q484p198
6052i5190l1245J6366N1583K7343j4121m5566j8141K0532J9439J8208R072J7576
$$ plain form
6040 -24144 -32629 -58546 -29550 -14057 -54979 -42082 -49150 -28740 -20726 -45874 -106213 -111728 -108331
6027 -108331 -94465 -80658 -48410 -34904 -21628 10081 -2018 19958 33359 52549 16506 -20629
6015 -20629 -12277 13765 -20783 25900 89428 55996 32081 55545 50622 43049 9892 -26440
6003 -26440 -18227 -23185 -5310 -40051 -22234 10857 -6609 11333 13289 10667 33718 3308 3755
5990 3755 16009 -40675 3322 24533 5107 -10168 -27548 -531 9690 3245 -26489 -35030
5978 -35030 -37809 -18019 -3185 -15445 -26077 -10412 40785 68293 36232 6212 7908 -18872
5966 -18872 -54172 -44527 -34579 -36683 -41094 -47578 -33018 -16423 -2732 17234 61798 18038 -16336
5953 -16336 -11075 -63403 -70192 -85733 -101407 -121055 -109833 -86126 -77865 -42511 -3853 -7662 -10486
$$ packed form
6040b4144q485k5917K8996J5493m0922J2897p068K0410Q014k5148o0339n515L397
6027a08331J3866J3807L2248J3506J3276L1709j2099K1976J3401J9190l6043l7135
6015b0629Q352K6042l4548M6683O3528l3432k3915K3464m923p573l3157l6332
6003b6440Q213m958J7875l4741J7817L3091j7466J7942J956k622K3051l0410M47
5990C755J2254n6684M3997K1211j9426j5275j7380K7017J0221o445k9734q541
5978c5030k779J9790J4834j2260j0632J5665N1197K7508l2061l0020J696k6780
5966a8872l5300R645R948k104m411o484J4560J6595J3691J9966M4564m3760l4374
5953a6336N261n2328o789j5541j5674j9648J1222K3707Q261L5354L8658l809k824
$$ plain form
5940 -10486 -25773 4566 43974 56736 28508 1853 12511 3534 -91650 -52714 -5434 15300
5928 15300 19337 2842 -7364 28605 52878 16661 22999 78465 100120 67148 -10546 -9053
5916 -9053 22087 75134 66880 641 -33539 -18912 -83419 -92244 -7279 -4128 -43281 -18024 -6562
5903 -6562 -11596 19029 -18264 -60719 -97855 -102648 -34439 -9853 -25561 -55234 -41779 -64622
5891 -64622 -51677 -45323 -67356 -105512 -88900 -36254 -10537 -5088 -23550 -15635 -48930 -42320 31747
5878 31747 26210 -27760 -92306 -88411 -77525 -92927 -108443 -59932 -16550 -31816 -31208 -6538 -53695
5865 -53695 -79887 -44791 -28827 45546 84883 26705 44910 12724 -14911 -26198 -16414 -7552
5853 -7552 -3104 17955 8737 10568 58881 52255 71501 79345 66439 27634 -20112 -46545 -17749
$$ packed form
5940a0486j5287L0339L9408J2762k8228k6655J0658q977r5184L8936M7280K0734
5928A5300M037j6495j0206L5969K4273l6217O338N5466K1655l2972p7694J493
5916i053L1140N3047q254o6239l4180J4627o4507q825Q4965L151l9153K5257J1462
5903f562n034L0625l7293m2455l7136m793O8209K4586j5708k9673J3455k2843
5891f4622J2945O354k2033l8156J6612N2646K5717N449j8462P915l3295O610P4067
5878C1747n537n3970o4546L895J0886j5402j5516M8511M3382j5266O08K4670m7157
5865e3695k6192L5096J5964P4373L9337n8178J8205l2186k7635j1287R784Q862
5853g552M448K1059r218J831M8313o626J9246P844j2906l8805m7746k6433K8796
$$ plain form
5840 -17749 -2141 -5307 2284 -21137 1840 49433 20631 30326 34320 22641 -19664 -33464 -27301
5827 -27301 -42270 -27455 -22274 -28768 -60124 -52078 -56820 -42026 -27898 -65772 -40636 4335 45493
5814 45493 17301 3834 -7229 11315 14530 -30227 -58885 -67073 -53603 -13552 10899 18667
5802 18667 17192 -5175 -37828 -65134 -56771 -34356 -56938 -63816 -28353 35393 63648 56393 56047
5789 56047 36386 37519 -4617 -14516 6511 9273 -3160 -14465 -59780 -56568 -14232 53314 41160
5776 41160 5169 -17330 -3823 -23514 -643 19171 4813 -44951 -40821 -35785 20975 3702
5764 3702 -10138 12466 12443 26277 16097 27333 69028 95610 41920 62590 76978 61707 42339
5751 42339 12086 50913 93354 79902 30495 20934 -14495 -8358 -28149 -17266 23812 26546
$$ packed form
5840a7749J5608l166P591k3421K2977M7593k8802R695L994j1679m2305j3800O163
5827b7301j4969J4815N181o494l1356Q046m742J4794J4128l7874K5136M4971M1158
5814D5493k8192j3467j1063J8544L215m4757k8658q188J3470M0051K4451P768
5802A8667j475k2367l2653k7306Q363K2415k2582o878L5463O3746K8255p255l46
5789E6047j9661J133m2136r899K1027K762j2433j1305m5315L212M2336O7546j2154
5776D1160l5991k2499J3507j9691K2871J9814j4358m9764M130N036N6760j7273
5764C702j3840K2604k3J3834j0180J1236M1695K6582n3690K0670J4388j5271j9368
5751D2339l0253L8827M2441j3452m9407r561l5429O137j9791J0883M1078K734
$$ plain form
5739 26546 -3992 -109441 -165291 -116365 -93819 -86547 -72658 -33670 -13307 12166 46402 12987
5727 12987 -30140 -10285 5640 56210 43163 39100 -9351 -26149 -23696 -66659 -76067 39
5715 39 32695 11868 31733 21291 -8997 -36536 869 -5365 -44372 -53654 -53822 -45450 -46943 -68498
5701 -68498 -35262 -19294 -63853 -36305 -73066 -94202 -80592 -12631 -17092 -1225 -17448 -6105
5689 -6105 -8164 -5922 33835 27050 6304 -26291 -36156 -23575 -46151 -56392 -20584 1766 4063
5676 4063 -36839 19938 43422 61147 42702 -14624 341 17802 17861 -34273 -84558 -70881 -90281
5663 -90281 -67738 -25700 -20720 733 7523 48258 40679 -24966 -70743 -69846 -64341 -38674 -39368
5650 -39368 -32891 -22128 7942 50237 57711 47378 19997 -22971 -58992 -100421 -125433 -88689
$$ packed form
5739B6546l0538j05449n5850M8926K2546P272J3889L8988K0363K5473L4236l3415
5727A2987m3127J9855J5925N0570j3047m063m8451j6798K453m2963r408P6106
5715C9L2656k0827J9865j0442l0288k7539L7405o234l9007r282j68Q372j493k1555
5701f8498L3236J5968m4559K7548l6761k1136J3610O7961m461J5867j6223J1343
5689f105k059K242L9757o785k0746l2595r865J2581k2576j0241L5808K2350K297
5676D063m0902N6777K3484J7725j8445n7326J4965J7461N9n2134n0285J3677j9400
5663i0281K2543M2038M980K1453O790M0735p579o5645m5777Q97N505K5667o94
5650c9368O477J0763L0070M2295P474j0333k7381m2968l6021m1429k5012L6744
$$ plain form
5638 -88689 -19042 -14275 -20799 746 20176 28125 -33034 -8776 -7978 -36010 -68684 -48229 20816
5625 20816 50512 59227 62195 36893 -6419 14037 -10875 -24289 -23303 10053 33054 27465 3195
5612 3195 11753 45165 51899 17586 16957 49989 6792 9242 55083 64688 31504 -16377 -9124
5599 -9124 -4040 -15511 13921 -16672 -36059 -14128 28380 -62 -51581 -17649 33206 36917
5587 36917 32750 18373 30610 19919 15719 23971 14439 -10528 -7507 -24438 -33649 -46459 4076
5574 4076 -11413 -34472 -1867 3388 -3944 -22639 -80643 -45770 22070 31329 -30562 -50026 -43587
5561 -43587 -17152 -59736 -45583 8972 45559 47048 70112 96307 96042 92223 75403 88893 99480
5548 99480 64097 54037 35407 14502 7738 -15055 -49908 -34893 -10885 -3092 -19187 -242
$$ packed form
5638h8689O9647M767o524K1545J9430P949o1159K4258P98k8032l2674K0455O9045
5625B0816K9696Q715K968k5302m3312K0456k4912j3414R86L3356K3001n589k4270
5612C195Q558L3412O734l4313o29L3032m3197K450M5841R605l3184m7881P253
5599i124N084j1471K9432l0593j9387K1931M2508k8442n1519L3932N0855L711
5587C6917m167j4377J2237j0691m200Q252r532k4967L021j6931r211j2810N0535
5574D076j5489k3059L2605N255p332j8695n8004L4873O7840R259o1891j9464O439
5561d3587K6435m2584J4153N4555L6587J489K3064K6195k65l819j6820J3490J0587
5548I9480l5383j0060j8630k0905o764k2793l4853J5015K4008P793j6095J8945
$$ plain form
5536 -242 -7879 -6068 1124 -34464 13706 35975 9808 -10937 4740 -34907 -73200 -96090 -99324
5523 -99324 -77622 -20484 -17059 -5864 -45630 -81058 -80465 -68980 -54299 -90440 -107961 -31833
5511 -31833 34641 73195 63661 42411 29134 25069 31743 20328 -5705 -8376 -32686 -11510 39564
5498 39564 34432 -48359 -41203 -48749 -48205 -30449 -21521 -29718 -14217 -25188 23199 80294 80131 251
5484 251 -1326 -5380 30483 19658 8800 -22056 -42951 -41964 -21462 15174 -54704 -36141 10521
5471 10521 6791 51645 69131 44126 13570 -20238 -32263 -21436 6259 -24184 -29640 -31875
5459 -31875 -9253 15369 23387 23492 18234 16335 -14548 -36823 -42274 15792 60148 55889 36100
5446 36100 -1106 -2855 10651 8776 -3484 19275 39370 20978 4798 -21499 -45942 -67347
$$ packed form
5536b42p637J811P192l5588M8170K2269k6167k0745J5677l9647l8293k2890l234
5523i9324K1702N7138L425J1195l9766l5428N93J1485J4681l6141j7521P6128
5511c1833O6474L8554r534k1250j3277m065O674j1415k6033k671k4310K1176N1074
5498C9564n132q2791P156p546N44J7756Q928q197J5501j0971M8387N7095j63p9880
5484B51j577m054L5863j0825j0858l0856k0895R87K0502L6636o9878J8563M6662
5471A0521l730M4854J7486k5005l0556l3808j2025J0827K7695l0443n456k235
5459c1875K2622K4622Q018J05n258j899l0883k2275n451N8066M4356m259j9789
5446C6100l7206j749J3506j875j2260K2759K0095j8392j6180k6297k4443k1405
$$ plain form
5434 -67347 -28134 51856 79560 58828 26348 92816 112784 82585 106950 78861 16658 -3861
5422 -3861 -34611 -48143 11035 61569 70942 72179 50901 65020 21660 26061 46760 42431 -12853
5409 -12853 3937 10558 -36619 -14758 -22688 -3339 15413 14216 33762 58068 40136 81769
5397 81769 94002 24653 -54874 -83626 -48181 -49370 -54928 2297 75834 106958 43910 -24832
5385 -24832 -41695 -25797 32036 -4674 -10505 -17226 -15011 -7099 12132 -14199 -34788 -39296 14013
5372 14013 19494 32883 32227 21304 -247 37938 41254 34863 22843 17986 61835 69029 59979
5359 59979 59434 516 -31178 -25189 -31664 -16849 29352 -28725 -81190 -47114 -5251 -47553 -44770
5346 -44770 18278 25812 22447 7451 29133 42632 63 -3566 63042 55378 -7636 14255 46831
$$ packed form
5434f7347L9213P9990K7704k0732l2480O6468J9968l0199K4365k8089o2203k0519
5422c861l0750j3532N9178N0534R373J237k1278J4119m3360M401K0699m329n5284
5409a2853J6790O621m7177K1861p930J9349J8752j197J9546K4306j7932M1633
5397H1769J2233o9349p9527k8752L5445j189n558N7225P3537L1124o3048o8742
5385b4832j6863J5898N7833l6710n831o721K215P912J9231k6331k0589m508N3309
5372A4013N481J3389o56j0923k1551L8185L316o391j2020m857M3849P194r050
5359E9979n45n8918l1694N989o475J4815M6201n8077n2465L4076M1863m2302K783
5346d4770O3048P534l365j4996K1682J3499m2569l629O6608p664o3014K1891L2576
$$ plain form
5333 46831 -2355 9670 64098 65169 15530 -25634 -9012 4975 27610 33965 46970 61785
5321 61785 20883 5084 -9816 -32238 -16574 3195 37374 17228 9049 60951 59424 21612
5309 21612 12233 61908 102559 123477 98259 60293 49233 18149 28748 53474 43566 13454
5297 13454 -11761 -59021 -86370 -86585 -87585 -94962 -89471 -80497 -88543 -94941 -51164 -8963 -32304
5284 -32304 -38939 -75232 -32204 -12623 -14616 8269 28607 10146 11762 -7984 37541 63560
5272 63560 1971 -18809 10598 -13980 1268 24894 46669 25646 8177 18452 5784 12072
5260 12072 -17911 -18816 -7792 -18511 -15763 -48632 -68820 -58628 32092 81812 14628 -41148
5248 -41148 -78508 -44485 -37329 -15753 -538 9121 -3490 -9253 20708 12263 15814 52192 24976
$$ packed form
5333D6831m9186J2025N4428J071m9639m1164J6622J3987K2635O355J3005J4815
5321F1785m0902j5799j4900k2422J5664J9769L4179k0146q179N1902j527l7812
5309B1612r379M9675M0651K0918k5218l7966j1060l1084J0599K4726r908l0112
5297A3454k5215m7260k7349k15j000p377N491Q974q046o398M3777M2201k3341
5284c2304o635l6293M3028J9581j993K2885K0338j8461J616j9746M5525K6019
5272F3560o1589k0780K9407k4578J5248K3626K1775k1023j7469J0275j2668O288
5260A2072k9983r05J1024j0719K748l2869k0188J0192R0720M9720o7184n5776
5248d1148l7360L4023P156K1576J5215R659j2611n763K9961q445L551L6378k7216
$$ plain form
5235 24976 30271 -18141 -12673 32929 30538 1159 13910 10696 -16025 -101892 -57501 -64355 -67496
5222 -67496 -32412 1206 -18942 -24374 -38959 -24195 -36611 -46956 -49056 -21893 -23013 -30879 -37833
5209 -37833 -24846 -5562 -60 -10880 -19666 -26148 -47437 -37498 -22343 -26686 -18176 -13173 3581
5196 3581 23846 -4115 -57175 -49858 12827 16739 -19950 -64868 -49561 22715 75231 96430
5184 96430 35336 12860 32557 24154 2014 -21975 -30387 -7025 -15573 -1581 -5204 -18964 -11926
5171 -11926 16360 17526 14029 28168 40872 5169 -13418 -44005 -1703 -17111 4340 -8008
5159 -8008 -49914 -77570 -107614 -121625 -123095 -111795 -109892 -87873 -83721 -60746 33374 51542 36146
5146 36146 31790 -6974 -10596 23085 27435 37108 17599 26827 4103 1161 22235 43730 30937
$$ packed form
5235B4976N295m8412N468M5602k391k9379J2751l214k6721q5867M4391o854l141
5222f7496L5084L3618k0148n432j4585J4764j2416j0345k100K7163j120p866o954
5209c7833J2987J9284N502j0820q786o482k1289R939J5155m343Q510N003J6754
5196C581K0265k7961n3060P317O2685L912l6689m4918J5307P2276N2516K1199
5184I6430o1094k2476J9697q403k2140k3989q412K3362q548J3992l623j3760P038
5171a1926K8286J166l497J4139J2704l5703j8587l0587M2302j5408K1451j2348
5159h008m1906k7656l0044j4011j470J1300J903K2019M152K2975R4120J8168j5396
5146C6146m356l8764l622L3681M350R673j9509R228k2724k942K1074K1495j2793
$$ plain form
5133 30937 -16531 -5302 -5332 -38214 -62298 -70307 -53865 -6456 34597 14952 -4845 -3291 5488
5120 5488 -29433 -63727 -71037 -47457 -18458 27167 49998 7645 -65508 -59969 -39090 3173
5108 3173 -4553 -20876 -57479 -28472 -7798 -19046 -21778 18167 378 -5346 26729 43436 -10968
5095 -10968 -64854 -24919 -16729 -2778 17213 7601 2982 -26268 -10487 -29755 -39142 -39377 -58331
5082 -58331 -54517 -50215 -25816 -54728 -30204 1876 -13768 -42802 -36197 -53391 -63172 -105614 -102587
5069 -102587 -20978 -16012 -68187 -69935 -57767 -52016 -52299 -8069 39765 69910 56480 24099 9089
5056 9089 75798 91162 70012 15119 -59192 -51635 -55606 -19164 -9942 -28350 -51012 -18425 -33912
5043 -33912 -61945 -24941 -8613 -8724 38979 47223 49534 28393 -28270 -36928 -36177 -49152 -77204
$$ packed form
5133C0937m7468J1229l0l2882k4084q009J6442M7409M1053j9645j9797J554Q779
5120E488l4921l4294p310K3580K8999M5625K2831m2353p3153N539K0879M2263
5108C173p726j6323l6603K9007K0674j1248k732L9945j7789n724L2075J6707n4404
5095a0968n3886L9935Q190J3951J9991r612m619k9250J5781j9268r387k35j8954
5082e8331L814M302K4399k8912K4524L2080j5644k9034O605j7194r781m2442L027
5069a02587Q1609M966n2175j748J2168N751k83M4230M7834L0145j3430l2381j5010
5056I089O6709J5364k1150n4893p4311P557l971L6442R222j8408k2662L2587j5487
5043c3912k8033L7004J6328j11M7703Q244K311k1141n6663q658P51j2975k8052
$$ plain form
5030 -77204 -48151 -38467 -22989 -2564 36198 5307 37438 33572 -38122 -45705 -19593 -2948
5018 -2948 19520 15649 -568 15780 544 -6234 -370 10756 46465 46469 35925 42009 4408 60810
5004 60810 96155 125518 115579 55455 -9600 49115 75115 109237 95216 51424 12981 40908
4992 40908 61655 44297 24240 24082 -11397 -26815 -46300 -18716 -5885 -5232 21817 68820 27112
4979 27112 -47838 -23539 -18514 -51626 -13627 -18182 -33824 -36371 -43897 22031 27117 -38901 -57267
4966 -57267 37819 99202 81873 53065 21674 16831 33683 45065 31531 25227 78463 26437
4954 26437 -51283 -36362 -23589 6825 -7693 5060 12254 38500 54204 46920 28553 -5119
4942 -5119 -10367 -2098 -16800 -48389 -48741 91 3311 -35251 -97183 -54289 18087 26421 41714
$$ packed form
5030g7204K9053R684J5478K0425L8762l0891L2131l866p1694p583K6112J6645
5018b948K2468l871j6217J6348j5236o778N864J1126L5709Mj0544O084l7601N6402
5004F0810L5345K9363r939o0124o5055N8715K6000L4122j4021m3792l8443K7927
4992D0908K0747j7358k0057j58l5479j5418j9485K7584J2831O53K7049M7003m1708
4979B7112p4950K4299N025l3112L7999m555j5642k547p526O5928N086o6018j8366
4966e7267R5086O1383j7329k8808l1391m843J6852J1382j3534o304N3236n2026
4954B6437p7720J4921J2773L0414j4518J2753P194K6246J5704p284j8367l3672
4942e119n248Q269j4702l1589l52M8832L220l8562o1932M2894P2376Q334J5293
$$ plain form
4929 41714 12207 -21962 42984 39809 10717 36428 56974 9986 -29488 -30108 -28791 -91125 -84398
4916 -84398 -54267 13774 48756 17092 -2362 -47861 -51059 -60673 -71891 -1477 26042 -19188
4904 -19188 -74810 -84500 -31008 -2119 -13194 -6103 -41821 -44511 -17937 -48222 -61094 -13298
4892 -13298 -59145 -45801 -20903 -3237 20471 29371 -16294 -22625 9035 37740 55618 85220
4880 85220 85995 101571 55552 37555 19992 -5265 22898 29992 -15798 -15862 27984 14290 31079
4867 31079 16580 -14778 -45373 -61706 -33387 -31398 -31703 -8785 26893 28117 -3588 40445 70918
4854 70918 46856 59438 80867 41944 81229 54178 19663 -3271 -19509 -45011 -41031 -29996
4842 -29996 -35129 -22725 -48823 -47240 -36772 -21521 19019 40707 9312 -30695 -54386 -35995
$$ packed form
4929D1714k9507l4169O4946l175k9092K5711K0546m6988l9474o20J317o2334O727
4916h4398L0131O8041L4982l1664j9454m5499l198r614j1218P0414K7519m5230
4904a9188n5622r690N3492K8889j1075P091l5718k690K6574l0285j2872M7796
4892a3298m5847J3344K4898J7666K3708Q900m5665o331L1660K8705J7878K9602
4880H5220P75J5576m6019j7997j7563k5257K8163P094m5790o4M3846j3694J6789
4867C1079j4499l1358l0595j6333K8319J989l05K2918L5678J224l1705M4033L0473
4854G0918k4062J2582K1429l8923L9285k7051l4515k2934j6238k5502L980J1035
4842b9996n133J2404k6098J583J0468J5251M0540K1688l1395m0007k3691J8391
$$ plain form
4830 -35995 -26005 24832 15232 -42208 -75451 -39404 -51965 -8148 -23655 -44736 -31410 2199
4818 2199 -7370 -33353 -6033 -15471 -20668 -46775 -65830 -34068 6078 -2091 -12410 -8562 -7980
4805 -7980 -36932 -69820 -87214 -63954 -57215 -51687 -35718 -37242 -33548 -57235 -40245 -2727 -41699
4792 -41699 -94986 -83093 -50187 -53324 -25080 -7872 -26229 -58609 -30089 7885 -18539 -9208
4780 -9208 -24418 -16967 -30321 -16655 -13607 -8246 -3870 19203 -23052 -64317 -48193 20370 6596
$$ packed form
4830c5995R990N0837r600n7440l3243L6047j2561M3817j5507k1081J3326L3609
4818B199r569k5983K7320r438n197k6107j9055L1762M0146q169j0319L848N82
4805g980k8952l2888j7394K3260O739N528J5969j524L694k3687J6990L7518l8972
4792d1699n3287J1893L2906l137K8244J7208j8357l2380K8520L7974k6424R331
4780i208j5210P451j3354J3666L048N361M376K3073m2255m1265J6124O8563j3774
$$ [...]
##END NTUPLES=NMR SPECTRUM
##END=
