##TITLE=Analysis number 315407
Compound Code cc 42809
Book Reference 439/79/38
Project Code adrs
Chemist Name ronp
##JCAMPDX= 6.0         $$ Bruker NMR JCAMP-DX V2.0
##DATA TYPE= NMR SPECTRUM
##DATA CLASS= NTUPLES
##ORIGIN= Bruker BioSpin GmbH
##OWNER= NMR
$$ XWIN-NMR		Version 3.5
$$ Thu Nov 17 15:47:09 2005 GMT Standard Time (UT+0h)  MAYBRIDGE\NMR@NMR_250MHZ
##.OBSERVE FREQUENCY= 250.131544655141
##.OBSERVE NUCLEUS= ^1H
##.ACQUISITION MODE= SIMULTANEOUS (DQD)
##.ACQUISITION SCHEME= undefined
##.AVERAGES= 16
##.DIGITISER RES= 18
##SPECTROMETER/DATA SYSTEM= dpx250
##.PULSE SEQUENCE= zg30
##.SOLVENT NAME= CDCl3
##.SHIFT REFERENCE= (INTERNAL, CDCl3, 0, 16.522)
##AUDIT TRAIL= $$ (NUMBER, WHEN, WHO, WHERE, WHAT)
$$ ##TITLE= Audit trail, XWIN-NMR		Version 3.5
$$ ##JCAMPDX= 5.01
$$ ##ORIGIN= Bruker BioSpin GmbH
$$ ##OWNER= NMR
$$ C:\u/data/dgb/nmr/ADRS/12630/pdata/1/auditp.txt
$$ ##AUDIT TRAIL=  $$ (NUMBER, WHEN, WHO, WHERE, WHAT)
(   1,<2005-11-17 15:46:28.50 +000>,<MAYBRIDGE\NMR>,<NMR_250MHZ>,
      <created by zg, POWCHK disabled, PULCHK disabled
       configuration hash MD5:
       62 19 C7 07 E1 42 D1 B7 37 6C 3D D0 77 39 F9 E6
       data hash MD5: 64K
       91 25 F4 C0 77 6E 2A 5D 4C E9 84 0B 98 A8 DC D5>)
(   2,<2005-11-17 15:46:48.84 +000>,<MAYBRIDGE\NMR>,<NMR_250MHZ>,
      <Start of raw data processing
       ef LB = 0.3 FT_mod = 6 PKNL = 1 SI = 32K 
       data hash MD5: 32K
       B3 2C D0 38 BC 64 60 7F F5 22 05 2C 60 23 72 D4>)
(   3,<2005-11-17 15:46:54.14 +000>,<MAYBRIDGE\NMR>,<NMR_250MHZ>,
      <apk 
       data hash MD5: 32K
       8F 6E AE 26 76 74 28 E4 19 7C E1 6E 18 A9 6E 0D>)
(   4,<2005-11-17 15:46:55.81 +000>,<MAYBRIDGE\NMR>,<NMR_250MHZ>,
      <abs ABSG = 5 
       data hash MD5: 32K
       4F 40 8A 74 8B 4C C5 F1 CF D7 E9 83 0B C0 46 D7>)
$$ ##END=
$$ 
$$ hash MD5
$$ 3F 2F 0F FC A9 77 CE 6B DA B6 D0 A9 BD 71 12 FA
##$RELAX= 
##$RELAX= 
##$RELAX= 
##$RELAX= 
##$RELAX= 
##$RELAX= 
##$RELAX= 
$$ Bruker specific parameters
$$ --------------------------
##$DU= <C:\u>
##$EXPNO= 12630
##$NAME= <ADRS>
##$PROCNO= 1
##$TYPE= <nmr>
##$USER= <dgb>
##$AMP= (0..31)
100 100 100 100 100 100 100 100 100 100 100 100 100 100 100 100 100 100 
100 100 100 100 100 100 100 100 100 100 100 100 100 100 
##$AQSEQ= 0
##$AQ_mod= 3
##$AUNM= <au_zg>
##$AUTOPOS= <47 >
##$BF1= 250.13
##$BF2= 250.13
##$BF3= 250.13
##$BF4= 250.13
##$BF5= 500.13
##$BF6= 500.13
##$BF7= 500.13
##$BF8= 500.13
##$BYTORDA= 1
##$CFDGTYP= 0
##$CFRGTYP= 5
##$CHEMSTR= <none>
##$CNST= (0..31)
1 1 145 1 1 1 1 1 1 1 1 1 1 1 1 1 1 1 1 1 1 1 1 1 1 1 1 1 1 1 1 1 
##$CPDPRG= <>
##$CPDPRG1= <>
##$CPDPRG2= <>
##$CPDPRG3= <>
##$CPDPRG4= <mlev>
##$CPDPRG5= <mlev>
##$CPDPRG6= <mlev>
##$CPDPRG7= <mlev>
##$CPDPRG8= <mlev>
##$CPDPRGB= <>
##$CPDPRGT= <>
##$D= (0..31)
0 1 0 0 0 0 0 0 0 0.06 0 0 0 0 0 0 0.0002 0 0 0 0 0 0 0 0 0 0 0 0 0 0 
0 
##$DATE= 1132242386
##$DBL= (0..7)
120 120 120 120 120 120 120 120 
##$DBP= (0..7)
150 150 150 150 150 150 150 150 
##$DBP07= 0
##$DBPNAM0= <>
##$DBPNAM1= <>
$$ [...]
##$SUBNAM6= <"">
##$SUBNAM7= <"">
##$SUBNAM8= <"">
##$SUBNAM9= <"">
##$SW= 20.6930455092707
##$SWIBOX= (0..15)
0 0 3 0 0 0 0 0 0 0 0 0 0 0 0 0 
##$SW_h= 5175.983436853
##$TD= 65536
##$TD0= 1
##$TE= 294.16
##$TE2= 300
##$TE3= 300
##$TEG= 300
##$TL= (0..7)
0 120 120 120 120 120 120 120 
##$TP= (0..7)
150 150 150 150 150 150 150 150 
##$TP07= 0
##$TPNAME0= <>
##$TPNAME1= <>
##$TPNAME2= <>
##$TPNAME3= <>
##$TPNAME4= <>
##$TPNAME5= <>
##$TPNAME6= <>
##$TPNAME7= <>
##$TPOAL= (0..7)
0.5 0.5 0.5 0.5 0.5 0.5 0.5 0.5 
##$TPOFFS= (0..7)
0 0 0 0 0 0 0 0 
##$TUNHIN= 0
##$TUNHOUT= 0
##$TUNXOUT= 0
##$USERA1= <user>
##$USERA2= <user>
##$USERA3= <user>
##$USERA4= <user>
##$USERA5= <user>
##$V9= 5
##$VALIST= <valist>
##$VCLIST= <CCCCCCCCCCCCCCC>
##$VD= 0
##$VDLIST= <DDDDDDDDDDDDDDD>
##$VPLIST= <PPPPPPPPPPPPPPP>
##$VTLIST= <TTTTTTTTTTTTTTT>
##$WBST= 1024
##$WBSW= 4
##$XGAIN= (0..3)
0 0 0 0 
##$XL= 0
##$YL= 0
##$YMAX_a= 784379
##$YMIN_a= -551910
##$ZGOPTNS= <>
##$ZL1= 120
##$ZL2= 120
##$ZL3= 120
##$ZL4= 120
##$ABSF1= 16.522
##$ABSF2= -4.171173
##$ABSG= 5
##$ABSL= 3
##$ALPHA= 0
##$AQORDER= 0
##$ASSFAC= 0
##$ASSFACI= 0
##$ASSFACX= 0
##$ASSWID= 0
##$AUNMP= <proc_1d>
##$AZFE= 0.1
##$AZFW= 0.1
##$BCFW= 0
##$BC_mod= 0
##$BYTORDP= 0
##$COROFFS= 0
##$CY= 12.5
##$DATMOD= 1
##$DC= 0
##$DFILT= <>
##$DTYPP= 0
##$F1P= 14.0000005364418
##$F2P= -0.99999901652339
##$FCOR= 0.5
##$FTSIZE= 32768
##$FT_mod= 6
##$GAMMA= 0
##$GB= 0
##$INTBC= 1
##$INTSCL= 1
##$ISEN= 128
##$LB= 0.3
##$LEV0= 0
##$LPBIN= 0
##$MAXI= 10000
##$MC2= 0
##$MEAN= 0
##$ME_mod= 0
##$MI= 0
##$NCOEF= 0
##$NC_proc= -3
##$NLEV= 6
##$NOISF1= 0
##$NOISF2= 0
##$NSP= 0
##$NTH_PI= 0
##$NZP= 0
##$OFFSET= 16.522
##$PC= 1
##$PHC0= 80.36392
##$PHC1= 4.6668
##$PH_mod= 1
##$PKNL= yes
##$PPARMOD= 0
##$PSCAL= 4
##$PSIGN= 0
##$REVERSE= no
##$SF= 250.13
##$SI= 32768
##$SIGF1= 0
##$SIGF2= 0
##$SINO= 400
##$SIOLD= 32768
##$SREGLST= <1H.CDCl3>
##$SSB= 0
##$STSI= 32768
##$STSR= 0
##$SW_p= 5175.98343685301
##$SYMM= 0
##$S_DEV= 0
##$TDeff= 65536
##$TDoff= 0
##$TI= <Analysis number 999999
Compound Code 99
Book Reference 9
Project Code 9>
##$TILT= no
##$TM1= 0
##$TM2= 0
##$TOPLEV= 0
##$USERP1= <user>
##$USERP2= <user>
##$USERP3= <user>
##$USERP4= <user>
##$USERP5= <user>
##$WDW= 1
##$XDIM= 32768
##$YMAX_p= 366167278
##$YMIN_p= -143246
$$ End of Bruker specific parameters
$$ ---------------------------------
##NTUPLES= NMR SPECTRUM
##VAR_NAME=  FREQUENCY,     SPECTRUM/REAL,   SPECTRUM/IMAG
##SYMBOL=    X,             R,               I
##VAR_TYPE=  INDEPENDENT,   DEPENDENT,       DEPENDENT
##VAR_FORM=  AFFN,          ASDF,            ASDF
##VAR_DIM=   32768,         32768,           32768
##UNITS=     HZ,            ARBITRARY UNITS, ARBITRARY UNITS
##FACTOR=    0.157963299565203, 1,           1
##FIRST=     4132.6476996994, 0,             0
##LAST=      -1043.33573715361, 0,           0
##MIN=       -1043.33573715361, -143246,     0
##MAX=       4132.6476996994, 366167278,     0
$$ Real data points
##PAGE= N=1
##DATA TABLE= (X++(R..R)), XYDATA
$$ [...]
19441C0179K199O027O585l427P635M256j0746q139J2093J5763m879j8817q323
19428C0406l590R117K699q259M011J0297p940k267R514O280N036j3396k511n259
19414C4138n293J0222J1911P97j9035p261R118Q127j892q751M218J5954j449j4964
19400C5840l256J2735n810j3425J0172Q501N956N796k45j0466J1687Q458k499
19387F3444m430J545k236j530J2606l052j6522m965R530j6336J467J5877O666
19374F2064j1997o05k703m33q773n772P80j370j3n157j296j504M46L133O750J8782
19358E2332J640j16K182Q966k983r118j0840L364J2723l311K973P882n64K284
19344F7414J709r857j1680K700k543L861K0678k306j4496m762P810Q203Q187l232
$$ plain form
19441 30179 32378 38405 44990 41563 49198 53454 42708 34569 46662 62425 57546 38729 30406
19428 30406 26816 35933 38632 30373 34384 44681 36741 34474 43988 50268 55304 41908 39397 34138
19414 34138 28845 39067 50978 51775 32740 25479 34597 42724 40832 32081 36299 52253 50804 35840
19400 35840 32584 45319 39509 26084 36256 44757 50713 56509 56264 45798 57485 65943 63444
19387 63444 59014 60559 58323 56793 69399 66347 49825 44860 54390 38054 39521 55398 62064
19374 62064 50067 49462 46759 46326 37553 31781 32561 31191 31178 26021 24725 23221 23667 26800 33550 52332
19358 52332 53972 53856 56038 65004 62021 52903 42063 45427 58150 54839 57812 65694 65130 67414
19344 67414 69123 59266 47586 50286 47743 51604 72282 69976 55480 50718 58528 66731 74918 71686
19330G1686N801J286j2202j4709r26o519p294N373J6791M752j4013j685j023m660
19316D2658n255J712l571l834J4000O968l897r517J841J2189q14J595P898J4285
19302G6258k862o813L82l055K611J622o008p900m575Q258l968J877q451N272P806
19287F0454l838K341N037n440j3762K11k21j8001N561K1089J4541J321o166j0735
19273E2392P744j586j5492k950n220r958J5860J7035J1703n735J679R958k426
19260G3004j1254j3511j1151q385o120r203Q734J8065J2100K885N371n347j3801
19247D1387n798k710q68R751o825k032M493J91J4617J2987O051j4472l049p173
19233D6550j2391O742O93m561Q57j160P378R753M112n265n444j0258K1084Q099
$$ plain form
19330 71686 77487 78773 66571 51862 50936 44417 37123 42496 59287 64039 50026 48341 47318 42658
19316 42658 37403 39115 35544 31710 45710 52678 48781 39264 41105 53294 52480 54075 61973 76258
19302 76258 73396 66583 66965 63910 66521 68143 62135 54235 49660 57918 53950 55827 47376 52648 60454
19287 60454 56616 58957 63994 58554 44792 45003 44782 26781 32342 53431 67972 69293 63127 52392
19273 52392 60136 58550 43058 40108 34888 24930 40790 57825 69528 63793 65472 75430 73004
19260 73004 61750 48239 37088 28703 22583 13380 22114 40179 52279 55164 60535 55188 41387
19247 41387 35589 32879 32011 41762 34937 32905 37398 37589 52206 65193 71244 56772 53723 46550
19233 46550 34159 40901 41594 37033 37890 36730 44108 53861 57973 52708 47264 37006 58090 66189
19219F6189m246K378Q653l911j5940m608j667K051J9299j740K780n765j650P984
19205F9807N387m47k445n167K785J3075l909k0452L901m261n314J300Q937K804
19191F6001N204r146J670L301o012l450L230j4565J364N247M505j0407L205P849
19177E7996m506j840j820j892R60o635O237J8724M762R0N635K185p035j4645o797
19162E1419R494J249q172P575P686l195o407j2395p335J3102J1472R845Q394J268
19148H4000J0072j1474j1463M792J1866p156K461q378j812j0688J0600L824j439
19135G5205R851q594K986j0590q372n518M667n120o84R35o44J3566M460j5925
19121E6223N8N142J961m784n269L329m827n498P013o080R931J997m121J850O368
$$ plain form
19219 66189 61943 64321 72974 69063 53123 48515 46848 48899 68198 66458 69238 63473 61823 69807
19205 69807 75194 74747 72302 67135 69920 82995 79086 58634 62535 58274 52960 54260 63197 66001
19191 66001 71205 62059 63729 67030 61018 57568 60798 46233 47597 52844 57349 46942 50147 57996
19177 57996 53490 51650 49830 47938 48898 42263 48500 67224 71986 72076 77711 79896 72861 58216 51419
19162 51419 60913 62162 53990 61565 69251 66056 59649 47254 39919 53021 64493 74338 82732 84000
19148 84000 94072 82598 71135 75927 87793 80637 83098 74720 72908 62220 72820 76644 75205
19135 75205 85056 76462 79448 68858 60486 54968 59635 54515 53831 54766 54122 67688 72148 56223
19121 56223 56281 61423 63384 58600 53331 56660 51833 46335 53348 47268 57199 59196 55075 56925 63293
19106F3293Q030J3643k485m413J6233j2069l518k902J854n366n304m275N57K969
19092F6247M982P35r130k4219L958K9108K12j1314N053J1023j35j1255O747q842
19078F3170J0324J6590k160o979q714J044o16m722l12M002r760k835j46n692J9910
19063G3104J0793k294O60N01j21j0072m901J0943N215n769l013L598q55l760j0151
19048F3878p805O514K070k778M624L852k572n082R100M906R739o499n509J327
19034G5765M101M04q463r035O899J1335O391l771k043m476k978O044Q381q978
19020G9576j1516o49J658Q686N215R625k386j1546O711N925k371j7787r78q34
19006F9329n709n42P662J0325n351P430L532N207j7013n064R309J1751n345M829
$$ plain form
19106 63293 71323 84966 82481 78068 94301 82232 78714 75812 77666 72300 66996 62721 63278 66247
19092 66247 71229 71964 62834 38615 42573 71681 71893 60579 65632 76655 76520 65265 72012 63170
19078 63170 73494 90084 87924 80945 72231 73275 72659 67937 67625 71627 61867 59032 58886 53194 73104
19063 73104 83897 81603 82263 82764 82643 72571 67670 78613 83828 78059 75046 78644 77789 74029 63878
19048 63878 56073 62587 64657 61879 66503 70355 67783 62701 71801 76707 86446 79947 74438 75765
19034 75765 79866 80270 71807 62772 69671 81006 87397 83626 81583 77107 74129 80173 88554 79576
19020 79576 68060 67411 69069 77755 82970 92595 90209 78663 85374 91299 88928 71141 70163 69329
19006 69329 63620 63078 70740 81065 75714 83144 86676 91883 74870 69806 79115 90866 85521 90350
18992I0350Q622M96p306K245n025j2069M028M055O959K266J723M750M387J4260
18978A19741k88q360r046n405K722Q01o636j6473J507k490m655J1235R516k312
18964H9857N524L728l897m601j8690K21N619j796k871P158O560K25M796n054k125
18949H4654j225J1412j492n589j433q70J0263J0436J6165j341j5683j3405J4394
18936A06286P15O605j970p74L774k773r867j2736O66k067l880r850M485j477K787
18921G9924j440q391o680Q536J1445L324k526K353P316K111j068j3395L124J1899
18907I6532R201j931j2255r057l698r991O392J1077L198p650R888K129j0L125
18893I6950k828M052o308j1199O791m586L093p579l811J0309n578m454J1177k08
$$ plain form
18992 90350 98972 99468 92162 94407 89382 77313 81341 85396 92355 94621 96344 101094 105481 119741
18978 119741 119453 111093 102047 96642 99364 100165 93529 77056 78563 76073 71418 82653 92169 89857
18964 89857 95381 99109 95212 90611 71921 72142 77761 75965 73094 80252 86812 87037 91833 86779 84654
18949 84654 83429 94841 93349 87760 86327 85457 95720 106156 122321 120980 105297 91892 106286
18936 106286 107001 113606 111636 110862 114636 111863 101996 89260 89926 87859 83979 74129 78614 77137 79924
18921 79924 78484 70093 63413 71949 83394 86718 84192 86545 93861 95972 94904 81509 84633 96532
18907 96532 105733 103802 91547 82490 78792 68801 75193 86270 89468 81818 91706 93835 93825 96950
18893 96950 94122 98174 91866 80667 87458 82872 85965 78386 74575 84884 79306 74852 86029 85821
18879H5821q258o700J2404R897k209j2881N80J6338K3295j308j1707j4289j0658
18866H0325P351J4477Q228r28n334k557m448P699r9o20n847J676q967K124K576
18851I5656P502K502p221o189n492O836J1288P363O270j458o792j5671K718j6612
18837H0700m124J7936L1551J3399q165k7484j1092K294p283k537L229O534Q766
18824A03724J7994r146Q384L489j0289L369J1702j59n882j804q151q765p19K11
18810A03958n829o01M992P354J4417j310j148k057J531P005J30J202R784k450
18796A36978j1492r522J71J1588J3118J8415K2980K5104N95j1672M103J8090K5253
18783B43709J2018L6071L0934M016j0338Q16j0694k0229l615R068J2362M4330
$$ plain form
18879 85821 77563 70863 83267 93164 90955 78074 78654 94992 118287 116979 105272 90983 80325
18866 80325 87676 102153 110381 109453 104119 101562 97114 104813 104714 104094 98247 99923 90956 93080 95656
18851 95656 103158 105660 98439 92250 86758 93594 104882 112245 118515 117057 110265 94594 97312 80700
18837 80700 76576 94512 126063 139462 131297 103813 92721 95015 87732 85195 88424 94958 103724
18824 103724 121718 112572 120956 124445 114156 117525 129227 129068 123186 121382 113231 104466 103747 103958
18810 103958 98129 97528 102520 109874 124291 122981 121833 119776 121307 128312 128442 129644 139428 136978
18796 136978 125486 115964 116135 127723 140841 159256 182236 207340 207935 196263 200366 218456 243709
18783 243709 255727 291798 322732 326748 316410 317226 306532 286303 282688 291756 304118 348448
18771C48448N4128L1537j380j9428j4956k4272j6958N309J7639j4566L710N949
18759C75160j0992l5429l5375l4075l3303n565j3574j6490M36n496K030K219k357
18746A87189N844j909Q309K0299K1410L3967K4821K0981L0907M0684K0305J8241
18734D31048K8567J871j6564K414j1588r28L9069Q0012P8100Q0378O2785K878
18722G78042n5507o6849n3573o4760n4957l0824K1896N8732J9734k4449l4707
18711D92778m1341m7080l2370k7946k3015k5747k3669k2124j4703l025l2272j4604
18699A84882J319J1542K826L664R491J119p80J0781J9420L3084K1747N58k3796
18686B75857j1888p169n463K2541L4203L2654M9519O2012K9203N083k2620k6950
$$ plain form
18771 348448 402576 434113 432733 413305 398349 374077 357119 362428 380067 365501 369211 375160
18759 375160 364168 328739 293364 259289 225986 220421 206847 190357 190793 185297 187327 189546 187189
18746 187189 193033 191124 199433 219732 241142 275109 299930 320911 351818 392502 412807 431048
18734 431048 459615 461486 444922 447336 435748 434820 473889 553901 632001 712379 775164 778042
18722 778042 722535 655686 602113 537353 482396 451572 473468 532200 551934 527485 492778
18711 492778 451437 404357 371987 344041 321026 295279 271610 249486 234783 231758 199486 184882
18699 184882 186201 197743 200569 204233 213724 214843 214063 224844 244264 277348 299095 299653 275857
18686 275857 263969 256800 251337 273878 308081 340735 390254 452266 481469 486552 463932 436982
18674D36982j8469j5472k5948k1253R217L2844K5694j4535m4084j7441j9743k6493
18662C01299j5850j7608o820J415j5779j4498j3343k0363j5799o188n311j641
18650A69514o191q335O982P41n536j6180M797M800R833N153R576j3609r768o390
18636A45387p584P42r01K435k463R000L647J0023l59k219R449j7038j6232J2359
18622A46246N265K913j0566o980J1820J7251k201J875L612J2819j78j937J328
18609A81267o25L20N619J98N584l916j107j4885r334J5200K488Q560J0008J419
18595B00796j9104l648L06m065P702J1699N464M145R348K845L430J2587J0178
18582B41683k4128k4724j725P301J502n764J235J961J2546l620j1995q176O729
$$ plain form
18674 436982 418513 403041 377093 355840 365057 397901 423595 409060 364976 347535 327792 301299
18662 301299 285449 267841 261021 262436 246657 232159 218816 198453 182654 176466 171155 169514
18650 169514 163323 154988 161970 162711 157175 140995 145792 150592 160425 165578 175154 161545 151777 145387
18636 145387 137803 138545 137644 140079 137616 146616 150263 160286 159927 157708 167157 150119 133887 146246
18622 146246 151511 154424 143858 136878 148698 165949 163748 165623 169235 182054 181876 179939 181267
18609 181267 180642 180962 186581 186779 192363 188447 187340 172455 163121 178321 180809 189369 199377 200796
18595 200796 181692 178044 178350 174285 181987 193686 199150 203295 212643 215488 218918 231505 241683
18582 241683 217555 192831 191106 198407 199909 194145 195380 197341 209887 206267 194272 186096 192825
18569A92825Q767n726j7877J289P782N299m271k383j036L967J1028N471r147j0090
18555A85898j456J1268J5962J6089m910P82M52j1289m988q834M805N754J3627
18542B23160O448j1717q944q412R603m307L152r80l339J7153N048N361k319J4731
18528B44638J0436O281M58j6214r530P944M748M410m107P357l219O693N717j3129
18514B52483q875n847O530J3523k812q921j950J0365L667J689k509l71L926r21
18500B59977p764K675M089K906J3737L639p649j1631J750j208j2808k25K1101
18487B68589O765Q677J6999J80J2953J3457P937J1432r891K201J633J3861Q446
18474C63239L451m048j7256o365J2514O671j4241k3362j7232j8599N498P278Q848
$$ plain form
18569 192825 201592 195866 177989 179278 187060 192359 188088 185705 184669 188636 199664 205135 195988 185898
18555 185898 184442 195710 211672 227761 222851 223633 224085 212796 207808 198974 203779 209533 223160
18542 223160 229608 217891 208947 200535 210138 205831 208983 208003 204664 221817 226865 232226 229907 244638
18528 244638 255074 261355 261813 245599 236069 244013 248761 253171 249064 256421 253202 259895 265612 252483
18514 252483 243608 237761 244291 257814 255002 246081 244131 254496 258163 259852 257343 256972 260898 259977
18500 259977 252213 254888 258977 261883 275620 279259 271610 259979 261729 260521 247713 247488 268589
18487 268589 275354 284031 301030 301210 314163 327620 335557 346989 337098 339299 340932 354793 363239
18474 363239 366690 362642 345386 339021 351535 358206 343965 320603 303371 284772 290270 297548 306396
18461C06396M397J3069P879M973K948M019O607P822K1804J3966L516N600O158
18448D09154k974r909m723Q7K52k239k1894L181J130N955M932j3507m839n266
18434C59340J3261M5r949L155l758J408J3321K1933M287O937k105l936R657J0785
18420D24381J6844r199j355O260J1600j0349o801j146N894J5813M6307N5898O6421
18407F20568P3945O2689L9225J2449n613l1659m5743n6469m6118l3983k9478l4573
18395E25240j1867J8872K1807J513k0136r531j2592o785j2588j0682o766L687
18383D80172Q218k3882l342Q275M681L045o468n646J1040J131N144J1735K9393
18370E23496L2803L6220L9590L7199J3134J0618P031J8310K8172O3208P3610K8647
$$ plain form
18461 306396 310793 323862 331741 336714 339662 343681 350288 358110 379914 393880 397396 402996 409154
18448 409154 406180 396271 391548 391635 391887 389648 367754 370935 372065 378020 382952 369445 364606 359340
18434 359340 372601 372646 362697 365852 362094 363502 376823 398756 403043 409980 407875 403939 413596 424381
18420 424381 441225 432026 430671 436931 448531 438182 431381 430235 436129 451942 498249 554147 620568
18407 620568 694513 757202 796427 808876 803263 771604 725861 669392 623274 589291 559813 525240
18395 525240 513373 532245 554052 555565 535429 525898 513306 506521 493933 483251 476485 480172
18383 480172 488390 464508 461166 469441 474122 477167 470699 465053 476093 477224 482368 494103 523496
18370 523496 556299 592519 632109 669308 682442 693060 700091 718401 746573 809781 883391 912038
18358I12038m81j7613j0160j8267j0489M3K8665J203k2123k9103l0673k2847j2364
18345G67829j5551j6459j5429m104P045R380P999l228k743L4210J7685R285J1385
18332H07304J5724J6814M0153K6892k922j6105O573O132L890J9924L4034N0027
18320A008440M0959L9815L1594K6662K9679K4033K8076M0995L5883K2739L1110
18309A359985N2061P8627P8324J10733J01069R2544Q7552N5375M0426L0387M0154
18298B127237O3203R5826J25094J65750J96354K19788L23228M59535P03089J095441
18288E574545J702048J839575Q48951K3203j67557j06240l03340j96442L91743
18279I606486J119823K104319L671823O305302R261619Q659728O161627M838038
$$ plain form
18358 912038 911557 893944 883784 865517 855028 855071 883736 884939 862816 833713 803040 780193 767829
18345 767829 752278 735819 720390 716286 723331 732711 740710 737482 734739 768949 786634 795919 807304
18332 807304 823028 839842 879995 906887 903965 887860 894433 900565 904455 924379 958413 1008440
18320 1008440 1049399 1089214 1120808 1147470 1177149 1201182 1229258 1270253 1306136 1328875 1359985
18309 1359985 1412046 1490673 1568997 1679730 1780799 1873343 1960895 2016270 2056696 2087083 2127237
18298 2127237 2190440 2286266 2411360 2577110 2773464 2993252 3316480 3776015 4479104 5574545
18288 5574545 7276593 9116168 9965119 9988322 9820765 9714525 9411185 9214743 9606486
18279 9606486 10726309 12830628 16502451 22807753 32069372 40729100 46890727 51728765
18271E1728765N092242J018951l771437m027332k547413m831131p093948n890194
18263B9678503l801655l065709j833512P62867L178099K516982n86767k420653
18255B4428155k438688k607370l378757k991263j923087j121205o72947l71107
18247H923731j60282N7812L56050P89462J446611K045494J533992M47935J1401
18238A5452206K74810M41075P02893J851450L781690O036900O328656M094134
18230C8963814L284543N640942J0497625J5055561J5399682J1869680N172704
18223A05884551K158117q6671J589N89475k031854m175324k059376J276317j952771
18214I9604053o551761p744940r620550j1805474j2046338r882895q280058o293435
$$ plain form
18271 51728765 56821007 57839958 54068521 50041189 47493776 42662645 35568697 29678503
18263 29678503 25876848 22811139 20977627 21740494 24918593 27435575 26848808 24428155
18255 24428155 21989467 19382097 16003340 13012077 11088990 9967785 9294838 8923731
18247 8923731 8763449 8821261 9177311 9966773 11413384 13458878 14992870 15440805 15452206
18238 15452206 15727016 16168091 16870984 18722434 22504124 28541024 34869680 38963814
18230 38963814 42248357 47889299 58386924 73442485 88842167 100711847 105884551
18223 105884551 108042668 107955997 107957586 108547061 106515207 102339883 100280507 101556824 99604053
18214 99604053 93052292 85307352 75686802 63881328 51834990 41952095 33672037 27378602
18206B7378602l709739j288461M09620l4018j482407k082229j882897j969916
18198A5338555k149275j671337j008062n34303k38900o2150N4450J99176M40858
18189A0369012Q12177J343938K169209L636066N994516P960654N528952Q27106
18181C8641630j439808j070533o95854K39799L930985O672686O017899P848874
18173F0145678J3136116J4242357Q865705M384745J86889q231789j4453514j4928484
18165F3347703j3127241j2410244r963881o458926l947806k446937j431059n16678
18157A3044931N71083J705968J449400m20465j590392j621243j637993k132223
18149I369066j961924j347516r01416o39941m65637l54354k89431k16916j35913
$$ plain form
18206 27378602 23668863 22380402 22790022 22756004 21273597 19191368 17308471 15338555
18198 15338555 13189280 11517943 10509881 9975578 9736678 9674528 9728978 9928154 10369012
18189 10369012 11181189 12525127 14694336 18330402 24324918 32285572 37814524 38641630
18181 38641630 37201822 36131289 35435435 35675234 39606219 46278905 52296804 60145678
18173 60145678 73281794 87524151 96389856 100774601 100961490 92729701 78276187 63347703
18165 63347703 50220462 37810218 27846337 21387411 17439605 14992668 13561609 13044931
18157 13044931 13616014 15321982 16771382 16350917 14760525 13139282 11501289 9369066
18149 9369066 7407142 6059626 5158210 4518269 4052632 3698278 3408847 3191931 3056018
18140C056018j09285q3625o6925j18613j72215j71379j57232j73082j81298j62376
18130A659988j39969j15557p3125n2843l7798q986j5826k0393k8863k6734J5710
18119A155604L5263M9725P6519J17081J37494J55132K08473L07697M45416O64641
18109C353045J041108J775978L336390O066382O057634O49327k622436k684817
18101A6972611k269204l895214l732109k248719j249175p52368m74359l26114
18093B025349k55097k01743j78342j21100j04073j01760j00983p1077l9854m1161
18083H10159n4015n1579k2039k3302m8269m0608k2830r172j3075q099j2865k2344
18071D81962Q11O541R005J0249k1434R709O120j7110K660n810j4901j0296l087
$$ plain form
18140 3056018 2946733 2863108 2796183 2677570 2505355 2333976 2176744 2003662 1822364 1659988
18130 1659988 1520019 1404462 1331337 1278494 1240696 1231710 1215884 1195491 1166628 1139894 1155604
18119 1155604 1190867 1240592 1317111 1434192 1571686 1726818 1935291 2242988 2688404 3353045
18109 3353045 4394153 6170131 9506521 15572903 21630537 22279864 19657428 16972611
18101 16972611 14703407 10808193 7076084 4827365 3578190 2825822 2351463 2025349
18093 2025349 1770252 1568509 1390167 1269067 1164994 1063234 962251 891174 851320 810159
18083 810159 756144 704565 682526 659224 610955 570347 547517 538345 525270 517171 504306 481962
18071 481962 482773 489314 498319 508568 487134 496843 502963 485853 488513 482703 467802 457506 454419
18058D54419J2853K3012P443j3446k8358k3537j4142J5065J908p123K486n482
18046D25098q941j408j4021k6882o491m724j5596j3793q766K768M227K2010J0981
18033C64462R625J6430K5054J5518r235J0682Q978P601j385J761J6688O914p99
18020D72294N883J7387P457J3371O671j3061j6617j9402k671J2209n874j0470
18008D67177n998m99o72J685m132M28N106J4168J0226Q709k978k3077m406J702
17994D67439J4970J9281J5001P490P298K4233K9551M0053L2988J0283Q009Q745
17982F85341K6141L3125L2482J9819L7313j006L645K1745K5789L4197K2363M3464
17970I84418R1688Q8740P6795M9248M2075L1959M5770O4331J05955J25962J09580
$$ plain form
18058 454419 467272 490284 497727 484281 455923 432386 418244 433309 435217 428094 430580 425098
18046 425098 416157 414749 400728 373846 367355 362631 347035 333242 324476 327244 331471 353481 364462
18033 364462 374087 390517 415571 431089 421854 432536 441514 449115 447730 449491 466179 473093 472294
18020 472294 478177 495564 503021 516392 523063 510002 493385 473983 471312 483521 477647 467177
18008 467177 461179 460680 460008 461693 457561 457989 463095 477263 487489 496198 493220 470143 465737 467439
17994 467439 482409 501690 516691 524181 531479 555712 585263 625316 658304 668587 676596 685341
17982 685341 711482 744607 777089 796908 834221 833215 836860 858605 884394 918591 940954 984418
17970 984418 1076106 1164846 1241641 1290889 1332964 1364923 1410693 1475024 1580979 1706941 1816521
17959A816521R8858J23426J48150J29874J26025J64258K06466K66186M01747N88795
17949D070306Q14786J030657J387759K080097L466520N247389M828682J866092
17941B4792288K04859O52511J830877L473180P209303Q426867K684854k811265
17933D6463474l942988l082091l378702j661070J297264n02946l479957m291095
17925B7421889l665198m337657m713018l427865k095803j325074q90931o24907
17917F341436m59620l45025k30031j11882l4968M778P0976O8918N0983J13257
17907E468822K22438L67994N75665Q79772J341724K144394L482667M664724L157480
17898B2305680Q99985M08933J613632K875076M312287N562330P143822R719237
$$ plain form
17959 1816521 1915379 2038805 2186955 2316829 2442854 2607112 2813578 3079764 3481511 4070306
17949 4070306 4885092 5915749 7303508 9383605 12850125 18097514 22926196 24792288
17941 24792288 24997147 25649658 27480535 30953715 38163018 46589885 49274739 46463474
17933 46463474 42520486 39438395 36059693 34398623 35695887 35192941 31712984 27421889
17925 27421889 23756691 19419034 14706016 11278151 9182348 7857274 6966343 6341436
17917 6341436 5881816 5536791 5306760 5194878 5159910 5164688 5235664 5304582 5355565 5468822
17907 5468822 5691260 6059254 6634919 7514691 8856415 11000809 14483476 19148200 22305680
17898 22305680 23205665 23614598 25228230 28103306 32415593 37977923 45121745 54840982
17890E4840982J0315456P589026K208181j169761l214267o910316j0032436j0030651
17882D3596214p473619n295643k944884m1492N9658k004694l073234k851945k914112
17873A7056249l374976k875432j975248j259718q17395n79601m56962l30646j88493
17864E197778j29045j24106j11119p1226m9509n1269j6134J06713K62986M59472
17854E474541O52550R58640J599917K739760L628260K153939K81912k01098N05911
17845A7794332J165343K754760N254398L556332o88076k589712k022020j947436
17837B3277921k067378j20002N40769r81824j884490j678991j649036k145965
17829A3291004j767174r15494j75955M27554J068891J936892L332325M507260
$$ plain form
17890 54840982 65156438 72745464 74953645 73783884 70569617 63659301 53626865 43596214
17882 43596214 36122595 30826952 27882068 27840576 27900234 25895540 22822306 19970361 17056249
17873 17056249 13681273 10805841 8830593 7570875 6753480 6173879 5716917 5386271 5197778
17864 5197778 5068733 4944627 4833508 4762282 4712773 4661504 4645370 4752083 5015069 5474541
17854 5474541 6127091 7085731 8685648 11425408 15053668 17207607 17489519 17288421 17794332
17845 17794332 18959675 21714435 26968833 30525165 29837089 27247377 25225357 23277921
17837 23277921 21210543 21090541 21631310 20649486 18764996 17086005 15436969 13291004
17829 13291004 11523830 10608336 10432381 10859935 11928826 13865718 17198043 21705303
17821B1705303L645077K462155J654735O44466k72289j9622J744357M326954Q588438
17812D4479574J3606087J8212494K0764225J1328012j379347o798057m555587
17805I5657401j863518M566691J7208812J6450024K140022o282969m260014n201991
17797A18414458j4186400j8535535j5711992j1754195r893797q405126n237488
17790C4689925j379930J898341K448401n34390l042922l655540l639724m302269
17782B2481892m028115k779265j660501r86382o62099m58926k24227m1208J06838
17773A1748007L62679P30703J236557K082818L633548N911450O960321M511460
17765C7177543K369596L156769O220729P660877M207244o41494k183652l81445
$$ plain form
17821 21705303 25350380 27812535 29467270 30111736 29839447 29819825 31564182 35891136 44479574
17812 44479574 58085661 76298155 97062380 108390392 107011045 100212988 95657401
17805 95657401 93793883 98360574 115569386 132019410 134159432 127876463 123616449 118414458
17797 118414458 104228058 85692523 69980531 58226336 48332539 39927413 34689925
17790 34689925 33309995 35208336 37656737 37122347 34079425 30423885 26784161 22481892
17782 22481892 18453777 15674512 14014011 13027629 12365530 11906604 11682377 11641169 11748007
17773 11748007 12110686 12841389 14077946 16160764 19794312 25705762 32666083 37177543
17765 37177543 39547139 42703908 48924637 56585514 60792758 60151264 57967612 57586167
17757E7586167K302364P549200J4961537J1619359M214276Q48859l74515k045433
17749I6661814j315331L176121p91718r462599j2164447j0278122r447764j1383716
17741D4994238j0274033p218358m704640l559742l096380k335006j570892j033766
17733A1201421n60470O6558P56087P16120l65033j133172j228120j127706j315608
17724G010077j266512r53931o94628n11600m11208l40744k85009k37670k20169
17715B088606j95574j43566j10832p3910o7013n4702k6146j2292k8611p2685j04090
17704A199185j05448q0929r4330o9712l8644k0292n052J2593L7415M5227K8427
17693I08440J2894O040O656j1332R032M4671O4013O8218J28014J47168J55760
$$ plain form
17757 57586167 59888531 67437731 82399268 94018627 98232903 99081762 98707247 96661814
17749 96661814 95346483 98522604 97730886 88268287 76103840 65825718 56377954 44994238
17741 44994238 34720205 27501847 22797207 19237465 16141085 13806079 12235187 11201421
17733 11201421 10640951 10707509 11463596 12179716 11814683 10681511 9453391 8325685 7010077
17724 7010077 5743565 4789634 4095006 3583406 3172198 2831454 2546445 2308775 2088606
17715 2088606 1893032 1749466 1638634 1564724 1497711 1443009 1416863 1404571 1375960 1303275 1199185
17704 1199185 1093737 1012808 918478 848766 810122 789830 784778 797371 834786 880013 908440
17693 908440 921334 927374 934030 922698 931730 976401 1040414 1108632 1236646 1383814 1539574
17682A539574J60585J16462N5787L8454N4517K0296q3344j55118j64937j68755
17672A413521k11443k23445j84299j45269j23922r0598o2094n4996l0433l7850
17662B49172n2199l1182j8311k6441k5298j8343n959k370J4517M951J1731L1264
17650A31532K8859J5271j0023j0277k3615k9670j0075j4897L255J1218j4052l9890
17638C7636k4925p764O568j3226j6111o712K397J5918L765l511K460J85j899k9184
17624c4403j8691l6609M580n841P688J9301p097j7092m294M637J5030L927J455
17611f7409J164l585r349n776L241J276N742J0219Q605P052K1787P934j4764j4335
17597d8198L116L834j2971j176j0265j2875r92j544j0389n754K385r779J953N546
$$ plain form
17682 1539574 1700159 1816621 1872408 1910862 1965379 1985675 1902331 1747213 1582276 1413521
17672 1413521 1202078 978633 794334 649065 525143 434545 372451 317455 287022 249172
17662 249172 196973 165791 147480 121039 95741 77398 71439 69069 83586 88537 100268 131532
17650 131532 160391 175662 165639 155362 131747 102077 92002 77105 80360 91578 77526 37636
17638 37636 12711 4947 11515 -1711 -17822 -24534 -22137 -6219 -2454 -5965 -3505 -3320 -5219 -34403
17624 -34403 -53094 -89703 -85123 -90964 -83276 -63975 -71072 -88164 -92458 -87821 -72791 -68864 -67409
17611 -67409 -66245 -69830 -79179 -84955 -81714 -80438 -74696 -64477 -55872 -48820 -27033 -19099 -33863 -48198
17597 -48198 -45082 -41248 -54219 -55395 -65660 -78535 -79527 -81071 -91460 -97214 -94829 -104608 -102655 -97109
17583i7109M382O956N44j893K833O984j231N539k24j695q463J005R362j3647M571
17568h2086J065j655J7632R56J0565J1873O845l498j2264L743K103j872L252p771
17554e1112m897m726j134m885K546J9855J3585J6565P903m510J302j0288k2475
17541d2271j2877n767M955J6519K7029K2808J0013p29j3351j6536o23j3410j0731
17528c4971O738n334k865J2096J1098K653j1660j0151j1952j0523j2182j1864
17516g8917P214M681L583Q21l61j2708r861J4805j4110r409M238n770j3258j344
17502a10396L033J777m256M441N102R434N453j2067j1350j3586J4284j537M044
17489a05624K1359J0688j2367j4541p52J2345L417L887N913J621p289l816p443
$$ plain form
17583 -97109 -92727 -85771 -85227 -87120 -84287 -77303 -78534 -72995 -73219 -74914 -83377 -82372 -73010 -86657 -82086
17568 -82086 -81021 -82676 -65044 -64088 -53523 -41650 -34805 -38303 -50567 -46824 -44721 -46593 -43341 -51112
17554 -51112 -56009 -60735 -61869 -66754 -64208 -44353 -30768 -14203 -6300 -10810 -9508 -19796 -42271
17541 -42271 -55148 -60915 -55960 -39441 -12412 10396 20409 19680 6329 -10207 -10830 -24240 -34971
17528 -34971 -28233 -33567 -36432 -24336 -13238 -10585 -22245 -32396 -44348 -54871 -67053 -78917
17516 -78917 -71703 -67022 -63439 -62618 -62979 -75687 -85548 -70743 -84853 -94262 -90024 -95794 -109052 -110396
17502 -110396 -107363 -105586 -109842 -105401 -100299 -90865 -85412 -97479 -108829 -122415 -108131 -109668 -105624
17489 -105624 -84265 -73577 -85944 -100485 -101237 -88892 -85475 -81588 -75675 -74054 -81343 -85159 -92602
17476i2602q980M85Q046O44r265r841K319l612m58p02M257Q097N012q494R877
17461i5217K4607k963J618J1113p138M679j2730r629k913Q422O830o482o399J582
17447h4620J5168R764P588L815J522j635j045K3155L3153N1039J7753k3832n27
17434E1298K0513L517J1555J5698R362o349K509K9703J9131P272J4129K085j9674
17421A60749j4273r930j7873j3380j7060j6595k6215j0972j8199j240k0230j4135
17409a9353N806p1o469j7365j5299j2341K440M274P035o554O050P307M337k662
17395d2865J0426M183j5576J5724J6354l157j068K1006M8936L7119L6564L1379
17383A59025K2743L747J3784J6136L8155N7854L5044j4540k6622k1183k8577k0104
$$ plain form
17476 -92602 -101582 -101097 -93051 -92407 -101672 -111513 -109194 -112806 -113264 -113966 -109709 -101612 -96600 -105094 -95217
17461 -95217 -70610 -73573 -71955 -60842 -67980 -63301 -76031 -85660 -88573 -80151 -73321 -79803 -86202 -84620
17447 -84620 -69452 -59688 -52100 -48285 -46763 -48398 -49443 -26288 6865 57904 75657 51825 51298
17434 51298 71811 75328 86883 102581 111943 105594 108103 137806 156937 164209 178338 180423 160749
17421 160749 146476 136546 118673 105293 88233 71638 45423 34451 16252 15012 -5218 -19353
17409 -19353 -13547 -13618 -20087 -37452 -52751 -65092 -62652 -58378 -51343 -57897 -51847 -44540 -40203 -42865
17395 -42865 -32439 -28256 -43832 -28108 -11754 -14911 -15979 5027 53963 91082 127646 159025
17383 159025 181768 185515 199299 215435 253590 311444 346488 331948 305326 284143 255566 235462
17371B35462k8478l7326j0133j0525l5064n8068m2693l1928n569R407M731k840
17359a3024j1218J498o277j1839m444O64j2446O452N459o56o286l975R901J2662
17345c3529P267l987J477L973P792L469J3863K2502Q471l62N474k63j797K8226
17331F2576L2573P058j4296P279K768j2484j8020k643m072j5882q091K325j1131
17318B7960k7170q48J5488m488j720j3340J843R050P959K0494L3904L3592J4092
17305A16816N5948N3122M5572L1949M3025K3928o095M089j0007l6194l0826l453
17293B87874Q212q80j7813L533K3553M3479M0602K810n280r448l398j1410j6129
17280C45705k3661l7352l8679l7070n4925o1954m6590r780o642L057o197k118
$$ plain form
17371 235462 206984 169658 159525 149000 113936 55868 13175 -18753 -24322 -14915 -10184 -13024
17359 -13024 -24242 -22744 -29021 -40860 -45304 -44640 -57086 -50634 -45175 -45831 -52117 -56092 -46191 -33529
17345 -33529 -26262 -30249 -28772 -24799 -17007 -13538 325 22827 31298 30936 36410 36147 34350 62576
17331 62576 95149 102207 87911 95190 97958 85474 67454 64811 60739 44857 36766 39091 27960
17318 27960 790 -58 15430 10942 9222 -4118 -2275 6775 14734 35228 69132 102724 116816
17305 116816 172764 225886 271458 303407 346432 370360 364265 368354 358347 322153 291327 287874
17293 287874 296086 295206 277393 280926 304479 347958 388560 391370 386090 376642 373244 361834 345705
17280 345705 322044 284692 246013 208943 154018 92064 45474 35694 29052 32109 25912 23794
17268B3794Q874O426Q73J585M482N345l019j3348L410N923p832K500J5631L7465
17254I2109N5536O5776M3495L8609M8541K6565J585j9013k0183m473p035N900
17242C27412J011k1704m4988m3041k9608k7307m026L6992O6956N2035N825j1366
17230C08191j3691k4227k5803j0422N321J0629N587k4491l4497m0492l9664l9258
17218G7183l4202k0154k6594j7056q708j62N674J715j2583k2760M501Q388n25
17205d5283p003m818L838P322N441L380n057j894J228j1478j9185J1042o123l186
17191g1776q28M928K1162m149n748J0147m675j4938O622O245J4072J0449p945
17178c6434j7356N537J6714k449L543J1643L745j0012l319l760j3622j2046N029
$$ plain form
17268 23794 32668 39094 39967 41552 46034 51379 48360 35012 38422 44345 36513 39013 54644 92109
17254 92109 147645 213421 256916 295525 344066 370631 372216 353203 333020 328547 321512 327412
17242 327412 328423 306719 261731 218690 189082 161775 157749 194741 261697 313732 319557 308191
17230 308191 294500 270273 244470 234048 239369 249998 255585 231094 196597 156105 116441 77183
17218 77183 42981 22827 -3767 -20823 -29531 -29693 -24019 -22304 -34887 -57647 -53146 -44758 -45283
17205 -45283 -52286 -57104 -53266 -45944 -40503 -37123 -42180 -44074 -42846 -54324 -73509 -62467 -68590 -71776
17191 -71776 -72604 -67676 -46514 -50663 -56411 -46264 -50939 -65877 -59255 -53010 -38938 -28489 -36434
17178 -36434 -53790 -48253 -31539 -33988 -30445 -18802 -15057 -25069 -28388 -32148 -45770 -57816 -52787
17165e2787N430J3630j416j694j4404n611O55k431L056Q566m262m471P821p405
17151e5323r428j3266k936m270Q81O919k357J1965k580N853K1599J7307K97j499
17137b6838j0783p386j0154N028K323j7624n592m63O751L636k1247Q646J6596
17124e7107K752j645N207j0350K799J1748j708j3149r40J3627J3431k1299q361
17111f4995J321J4962M385j191K191M239j504k649J0769K446j2797l790m842J2482
17097c8973j488J141P544R720p037j5919Q733J9883J796p040j021j4117k692K1924
17083a7546L1689N299k3021j7309J940K4563J2110j9027Q336O795J1570r22L541
17070B8018l75N370K4310M1458M9996O3131N1177N6194P5302O9328J1645k9480
$$ plain form
17165 -52787 -47357 -33727 -35143 -36837 -51241 -56852 -56197 -58628 -55572 -47006 -51268 -55739 -47918 -55323
17151 -55323 -64751 -78017 -80953 -85223 -84342 -77423 -79780 -67815 -70395 -64542 -42943 -25636 -25339 -26838
17137 -26838 -37621 -45007 -55161 -50133 -47810 -65434 -71026 -71489 -64738 -61102 -82349 -73703 -57107
17124 -57107 -54355 -56000 -50793 -61143 -58344 -46596 -48304 -61453 -62393 -48766 -35335 -56634 -64995
17111 -64995 -63674 -48712 -44327 -45518 -43327 -39088 -40592 -43241 -32472 -30026 -42823 -46613 -51455 -38973
17097 -38973 -40461 -39320 -31776 -22056 -29093 -45012 -36279 -16396 -14600 -21640 -22661 -36778 -39470 -17546
17083 -17546 14143 19442 -3579 -20888 -18948 5615 17725 -1302 7034 13829 25399 24477 28018
17070 28018 27643 33013 57323 98781 148777 211908 263085 319279 394581 463909 475554 446074
17058D46074k7926k2805n1087p0619n8627m4201k6899l5665j5326j791J4003K0381
17046A25512M3592M0807N1096M6123P0813P8633M1545r695j9307o642m3278o6411
17034C52788q8998o9281o3819l5306k8382k7580k1668n024p732j3871R654N826
17022F607j3906j3695j5664N4o20j610N768q609J2650l330j6062R50J0194K3727
17008a3546K460j3313q402M508J383j238j3442n763K858R565m835k219K0324J3620
16994h040j4144j9746l918m263J2448J9144m995K275M70j170M913o718q977j450
16980c4171P414k687k007K232R766r616r157n186J26k932N428J157j559J1768
16966b9424O696O565P74n700p061p400L718n099l464L872k44j747Q615k376n30
$$ plain form
17058 446074 418148 395343 344256 273637 215010 170809 143910 108245 92919 91128 105131 125512
17046 125512 169104 209911 261007 307130 377943 456576 498121 488426 469119 462477 419199 352788
17034 352788 263790 194509 130690 95384 67002 39422 17754 12730 4998 -8873 781 6607
17022 6607 -7299 -20994 -36658 -36604 -37224 -38834 -33066 -41675 -29025 -32355 -48417 -47467 -37273 -13546
17008 -13546 -11086 -24399 -32801 -28293 -26910 -28148 -41590 -47353 -44495 -34930 -39765 -41984 -21660 -8040
16994 -8040 -22184 -41930 -45848 -50111 -37663 -18519 -23514 -21239 -20769 -21939 -17026 -23744 -32721 -34171
16980 -34171 -26757 -29444 -31451 -29219 -19453 -29069 -38226 -43412 -43286 -46218 -40790 -39633 -41192 -29424
16966 -29424 -22728 -16163 -15389 -21089 -28150 -35550 -31832 -36931 -40395 -36523 -36767 -38514 -29899 -32275 -32805
16951c2805J0518R084q228K658k305L150J0844m851Q319L596K3374J8348J6673
16938E8375j4843k4648j5209j2889j0402l226J6707J028q940r38j503o300m596
16925b7384Q387M418l873K350l389j311l749j739P974J1584P34o835q577M025
16911a7385N770k08o563l117J092L338O886K240n336j1436j3773j3568M039K898
16897d5123J6550R951N684P829L890O68K3118J3817J5283k521j2689j262J0167
16884D5362p975j0076j3978j0236j5003l797R877N335o066j1101K71K442j4339
16871b9284q770j0262M584J7013J1272L045N190r895j1694l946J0109J4398n324
16858a3564j561m70p166m499O335R703M819K295q507j8454m415R883L475N676
$$ plain form
16951 -32805 -22287 -13203 -21431 -18773 -21078 -17928 -7084 -11935 -3616 -20 23354 41702 58375
16938 58375 43532 18884 3675 -9214 -19616 -22842 -6135 -5107 -14047 -14985 -16488 -22788 -27384
16925 -27384 -18997 -14579 -18452 -16102 -19491 -20802 -24551 -26290 -18316 -6732 -5998 -12833 -21410 -17385
16911 -17385 -11615 -11823 -18386 -21503 -20411 -17073 -10187 -7947 -13283 -24719 -38492 -52060 -48021 -45123
16897 -45123 -28573 -18622 -12938 -5109 -1219 -551 22567 36384 51667 49146 36457 35195 45362
16884 45362 37387 27311 13333 3097 -11906 -15703 -5826 -491 -6557 -17658 -17387 -14945 -29284
16871 -29284 -38054 -48316 -43732 -26719 -15447 -12402 -7212 -17107 -28801 -32747 -22638 -8240 -13564
16858 -13564 -15125 -15595 -22761 -27260 -20925 -11222 -6403 -4108 -12615 -31069 -35484 -25601 -22126 -16450
16844a6450O357o572r046M571J473M685M43M801j209k204l806J1727M701L736
16830C207o549j130Q067k712j4338n772m269J4635J2145n845j951o613J1671R813
16816A0359N628o627L647J3892O895Q077m652q256L910K502j3584r882K483k725
16802A1667r829k182J5119K60l513J3032n977k543j120J4624J9499M708q387J1404
16788E6762n317J0762m174j2028N817O62j3827N770J3964L685l158j571J2793
16775G0140J6474O615J2511P777K620j96K841N873q455j1039m184r362r239j8426
16761F3950j1865m112L967r614j3889J1018J5750O673m962r674P489K530R819
16748F7080Q423K284R016M831j294o796j0279L575N699j2463j8996j562J4138
$$ plain form
16844 -16450 -10093 -16665 -25711 -21140 -19667 -14982 -14539 -9738 -10947 -13151 -16957 -5230 -529 3207
16830 3207 -3342 -4472 3595 883 -13455 -19227 -23496 -8861 3284 -2561 -4512 -11125 546 10359
16816 10359 15987 9360 13007 26899 33794 41871 37219 28963 32873 35375 21791 11909 14392 11667
16802 11667 1838 -344 14775 15035 11522 24554 18577 16034 14914 29538 49037 53745 45358 56762
16788 56762 51445 62207 58033 46005 51822 52484 38657 44427 58391 62076 58918 57347 70140
16775 70140 86614 93229 105740 113517 116137 115941 118782 124655 116200 105161 100977 91615 82376 63950
16761 63950 52085 47973 51940 42326 28437 39455 55205 61878 56916 47242 54731 57261 67080
16748 67080 75503 77787 86803 91634 90340 83544 73265 76840 82539 70076 51080 49518 63656
16735F3656m605j3421o78Q114J179L610j0835N406l987J2941j1976l838n276p116
16721C3174L757J3483M88K36O914p23j0525J857J2753J4394l405K91p205n100
16707F0389j2579j724r253P47J274L230K275M603J1001J5145k349o76J3920O892
16693I2895Q363m365P003R314n94J464m617p760j5501r431j6686p182P434J7506
16679G7843J1475N21l679j0114K3568O193L556m316j35P933Q161N54p658J4040
16665A27942Q417j163n587Q79j8182j0678K4110P054m160M830L852J6311R844
16652A63469l887m164J8777R641o05J564l476Q834J4345J8347j112l76N239J794
16638B28390j1632j8855j7426o396M921p542m541j0269L641J7397o985p454J347
$$ plain form
16735 63656 59051 45630 44952 53066 54245 57855 47020 52426 48439 61380 49404 45566 40290 33174
16721 33174 36931 50414 50902 51138 58052 57329 46804 48661 61414 75808 72403 72694 65489 60389
16707 60389 47810 46086 36833 37580 38854 42084 44359 48962 59963 75108 72759 72083 86003 92895
16693 92895 101258 96893 103896 113210 112616 114080 109463 101703 86202 76771 60085 52903 60337 77843
16679 77843 89318 89839 86160 76046 99614 105807 109363 105047 104912 112845 121006 121560 113902 127942
16665 127942 136359 135196 129609 130488 112306 101628 125738 132792 128632 133462 137314 153625 163469
16652 163469 159582 155418 174195 183836 183231 184795 181319 190153 204498 222845 221733 221357 226596 228390
16638 228390 216758 197903 180477 174081 179002 171460 166919 156650 160291 177688 170703 163249 164596
16625A64596J4176L2166P830J3088P743J2002L879q160j7646o944k1664j9391
16613A81675j3753p648K208M440K864J3439q657r725M104K805J0544J2211J1166
16600B05673J8546J3100o690n813K559N204Q338N622M940R004J8162Q213K578
16587B89436J0520K257P287Q311R980K0691L487j5378O93P166J1001J5068J8095
16574C88614K0832m885K820L206K413K3966K0742p28K9946L7762L771Q630J9258
16561E56347J0918P843L2872M1599L8838L7348K5898K1542M5035N2333M6144M6801
16549I63518O4429P7151J02260J05242J00049J31102J79563J60090J21583J05385
16539B110372J03043J27387J23794O5476M1744Q6276J22230J01964J34120K13831
$$ plain form
16625 164596 178772 210938 218768 231856 239599 251601 255480 247320 229674 222730 201066 181675
16613 181675 167922 160274 162482 166922 169786 183225 174568 164843 168947 171752 182296 194507 205673
16600 205673 224219 237319 230629 224816 227375 232579 240917 246539 251479 260483 278645 286858 289436
16587 289436 299956 302213 309500 317811 327791 348482 351969 336591 337284 344450 355451 370519 388614
16574 388614 409446 404561 407381 410587 413000 436966 457708 456980 486926 524688 528459 537089 556347
16561 556347 567265 575108 607980 649579 688417 725765 751663 773205 818240 870573 916717 963518
16549 963518 1027947 1105098 1207358 1312600 1412649 1543751 1723314 1883404 2004987 2110372
16539 2110372 2213415 2340802 2464596 2530072 2571816 2658092 2780322 2882286 3016406 3230237
16529C230237L00641L80568M95386O03045P02516Q45650J055477J304326J645660
16520A0563506K268437L332148N198662Q459303J1999466J0992998Q762722J1688848
16512G3266090J6732916Q340648l595986n376924j755083p171583j4420692j3281620
16504E2737766r073303p561029o799330m275877j577107O55511K969754O228727
16496C3305112J0490213J1517881Q640306R665848J5600136J2603775j297695
16489A00525576o717041l312215n080798j4006992j5539619j1434083q881349
16482C5553479q540803o747328m418031k849959j940335j456504j203145j020524
16474G376850q40628p27927o75844n77292m64493l95474l37542k44263j54044
$$ plain form
16529 3230237 3530878 3911446 4406832 5009877 5712393 6558043 7613520 8917846 10563506
16520 10563506 12831943 16164091 21362753 29822056 41821522 52814520 61577242 73266090
16512 73266090 89999006 98339654 94743668 89366744 87611661 80440078 66019386 52737766
16504 52737766 43664463 36103434 29304104 25028227 23451120 24106631 27076385 33305112
16496 33305112 43795325 55313206 63953512 73619360 89219496 101823271 100525576
16489 100525576 93808535 90496320 85415522 71408530 55868911 44434828 35553479
16482 35553479 27012676 20265348 15847317 12997358 11057023 9600519 8397374 7376850
16474 7376850 6536222 5808295 5132451 4555159 4090666 3695192 3357650 3113387 2959343
16465B959343j24173j09137p2138j4197j5370o6774j42045j53454j67261j96625
16455A898169k44499k21683j89220j47494j32056r3780p8037o6745n5624m6907
16445F22124n4019m2630j6322l8877m5784m1102j5838j1951k3360k6270N135q182
16433C02924l2286j4754q259k9577l0417j3582K778j1233j5547m111J91k0678
16421A25449k2647q791L741k3272j902p251p847Q661n800o519j2509R19R764P496
16407E9492j0328n439r731M836p77k981M848r817r155k679j410Q252m90p818k916
16392A3887Q998K196J7549M300J327J9481K2564J5503k153J960J4625P240O208
16379A33685p092j3689J464q359j8070r581n134j8126J963L697m85J3319R387
$$ plain form
16465 2959343 2835170 2726033 2653895 2639698 2624328 2557554 2415509 2262055 2094794 1898169
16455 1898169 1653670 1431987 1242767 1095273 963217 869437 791400 724655 669031 622124
16445 622124 568105 525475 509153 470276 424492 383390 367552 355601 332241 305971 311106 302924
16433 302924 270638 255884 247625 218048 187631 174049 176827 165594 150047 145936 146127 125449
16421 125449 102802 94011 97752 74480 72578 65327 57480 66141 60341 53822 41313 42232 51996 59492
16407 59492 49164 43725 33994 38830 38053 35072 39920 30103 20948 18269 16859 25111 24621 16803 13887
16392 13887 22885 25081 42630 46930 48257 67738 90302 105805 103652 105612 120237 127477 133685
16379 133685 126593 112904 114368 106009 87939 78358 73224 55098 57061 60758 60273 73592 82979
16366H2979K557K3029J6137k968J1549J8827J2818m908k9031j8467k5260k2255
16354F5007k3327l7674l8519k2346l105j4085j2896Q199J4042J3056J2421k687
16342d1914L33J2080K647m774Q721O37l687j4931k1830J808m444j1866l369l027
16328h3616J442M157j390q269j475N556p677J5361J5956J7410J4222j1156k7392
16315f6871p184K513p267J692L108n844p990J0469J7654O909J5945N292j2270
16302d3844j381J2400M912L140p208p535k529q858k029L85J1016K1957j248j3681
16288c4503j1175j284M712m785N08N230j1428R028M413P083j0681r263O924O149
16274c9072o932K795Q529R82J869M383n732j490J824N358r13j3018l544J815L004
$$ plain form
16366 82979 85536 108565 124702 121734 133283 152110 164928 160020 130989 112522 87262 65007
16354 65007 41680 4006 -34513 -56859 -59964 -74049 -86945 -78746 -64704 -51648 -39227 -41914
16342 -41914 -41581 -29501 -26854 -31628 -22907 -22270 -25957 -40888 -62718 -60910 -65354 -77220 -80589 -83616
16328 -83616 -82174 -78017 -79407 -87676 -89151 -83595 -91272 -75911 -59955 -42545 -28323 -39479 -66871
16315 -66871 -74055 -71542 -78809 -77117 -74009 -79853 -87843 -77374 -59720 -52811 -36866 -31574 -43844
16302 -43844 -45225 -32825 -27913 -24773 -31981 -39516 -42045 -50903 -52932 -52547 -41531 -19574 -20822 -34503
16288 -34503 -45678 -46962 -42250 -47035 -46527 -41297 -52725 -43697 -39284 -32201 -42882 -52145 -45221 -39072
16274 -39072 -46004 -43209 -34680 -33698 -31829 -27446 -33178 -34668 -32844 -27486 -28399 -41417 -44961 -43146 -40142
16259d0142k2163P361J7271J3209J936m181p839j2078n143j7180q486Q009J5317
16246e4109j576P346o235m287j2914J221k602P198j284K100K902l003J7638O97
16232d6908j5560k714k453j72O327p228j651j1367j2214j598L400J2159N540N948
16218f8491J2106J3476J892j6362j2462o095m671J857n531o152Q442K7157J7819
16205c7015J20r499m684L916k34r570J1376Q242O323M24J651P518k702j3707J430
16190c6411n753j8401j1050R0R647m436k673J3169K173K737l994l960J13j433
16176f0182q278R890K994N1J2783J2715J5257p37j4095N2j274K917P62j3427p198
16161d7770J7053k447m158N834M188n26o227j880l917K634n036P208O993O761
$$ plain form
16259 -40142 -62305 -54944 -37673 -24464 -22528 -26709 -34548 -46626 -51769 -68949 -77435 -69426 -54109
16246 -54109 -55685 -48339 -54574 -58861 -71775 -70554 -73156 -65958 -67242 -65142 -62240 -65243 -47605 -46908
16232 -46908 -62468 -65182 -67635 -67807 -61480 -68708 -70359 -81726 -93940 -95538 -92138 -79979 -74439 -68491
16218 -68491 -56385 -42909 -41017 -57379 -69841 -75936 -80607 -78750 -84281 -90433 -81991 -54834 -37015
16205 -37015 -36895 -46394 -51078 -47162 -47396 -56966 -45590 -37348 -31025 -30601 -28950 -21432 -24134 -37841 -36411
16190 -36411 -42164 -60565 -71615 -71525 -61878 -66314 -68987 -55818 -53645 -50908 -54902 -58862 -58749 -60182
16176 -60182 -68460 -58570 -55576 -55525 -42742 -30027 -14770 -15507 -29602 -29550 -30824 -27907 -27145 -40572 -47770
16161 -47770 -30717 -33164 -37322 -31488 -27300 -27826 -34053 -35933 -39850 -37216 -42252 -35044 -28051 -21290
16147b1290l721J314M283r293K174O94p703j7419j872n52r181k142J3926O762
16133d4020O604j6300q313n561J5630j4899j646J396K0769J3603N188n691p692
16120d0932L409m374o10l38R973n866N050L725j0848k535p052n650P768L628M991
16105c9661o398j7387k938L744J0752K048o912k074K077j974l858R866R010l29
16091d4034J5855J543m082M336r442m105K977j493j5106q955k910Q436O737N968
16077d4275R142N725o078k124k977q602N339N305O733l962q54M761J6825O552
16063h490L36k0729o684P845k058n712N159M539j7982mJ4061j0047n961O533J0461
16048b8733L857P98K208o904j8232q086N992P829K331m163l227r976j652j555
$$ plain form
16147 -21290 -25011 -23697 -19414 -28707 -26533 -25839 -33542 -50961 -52833 -53385 -62566 -64708 -50782 -44020
16133 -44020 -37416 -53716 -62029 -67590 -51960 -66859 -68505 -67109 -46340 -32737 -27549 -33240 -40932
16120 -40932 -37523 -41897 -42507 -42845 -32872 -38738 -33688 -29963 -40811 -43346 -50398 -56048 -48280 -44652 -39661
16105 -39661 -46059 -63446 -66384 -62640 -51888 -49840 -56752 -58826 -56749 -58723 -62581 -52715 -43705 -44034
16091 -44034 -28179 -26636 -30718 -26382 -35824 -39929 -36952 -38445 -53551 -62506 -65416 -56980 -50243 -44275
16077 -44275 -35133 -29408 -35486 -37610 -40587 -49189 -43850 -38545 -31812 -35774 -36628 -31867 -15042 -8490
16063 -8490 -8154 -28883 -35567 -27722 -29780 -35492 -30333 -25794 -43776 -43780 -29719 -39766 -45727 -39194 -28733
16048 -28733 -24876 -24078 -21870 -28774 -47006 -55092 -49100 -41271 -38940 -43103 -46330 -56306 -57958 -59513
16034e9513O248Q861J5362L861n221j0003O854M082J3010O887j1698n260R77q495
16020c4048r557j2335n843J1485J4775R944L988K78L12P397q005j1294q306m223
16006d5432k938L382J2327N506j3562k887J995N928m606m403J933k417Q508q717
15992d5383q464l03P917J7886L164l276P445j4261m900J2518k412n815k766j369
15978d0019L235r577P405P037L987L422M007O201M569o37K373k327R759K0422
15964A9857K3072K4819K8051L7731N8946N7280N7121N4553P0571M7834o026k5033
15952D48776k762l2112o5769o3315m0836m4159m8615l2195k1287k930J2769M0917
15940A48482N6839M9255N9854N7790Q8691O9490O068k9504q990r850p4357q1565
$$ plain form
16034 -59513 -53265 -44404 -29042 -25181 -30402 -40405 -33551 -29469 -16459 -9572 -21270 -26530 -25553 -34048
16020 -34048 -43605 -55940 -61783 -50298 -35523 -25579 -21591 -21313 -21001 -13604 -21609 -32903 -41209 -45432
16006 -45432 -48370 -44988 -32661 -27155 -40717 -43604 -41609 -35681 -40287 -44690 -42757 -45174 -36666 -45383
15992 -45383 -53847 -54150 -46233 -28347 -25183 -28459 -21014 -35275 -40175 -27657 -30069 -35884 -38650 -40019
15978 -40019 -36784 -46361 -38956 -31919 -27932 -24510 -20503 -14302 -9733 -10370 -7997 -10324 -565 19857
15964 19857 42929 67748 95799 133530 192476 249756 306877 361430 432001 479835 473809 448776
15952 448776 446014 413902 348133 284818 243982 199823 151208 119013 97726 94796 107565 148482
15940 148482 205321 254576 314430 372220 460911 530401 536469 506965 497975 488125 413768 332203
15928C32203p8653o0473m6321m5777k6529r700j0559Q014L586r351L370J0608
15916G0418J1351j51J250J0376M6849P3544Q7817J20351J39160R3019K7296k8223
15904F53057o3826r1437j09391r5818p3763o0801l5771j6802Q704l690j0372J9030
15892A19120K7587M1619P2424R5452J19258J01095O0300j9386o9661q7956r9074
15881C60778r1411p3376p1071l5110o234l829o216j0163j0581r496j7151m263
15869B1877j1452j3753M552N403L443K341m032j51P061L287o592M288j1132k9231
15855b4091J395K85J541J3653m114K371K1573q63j0136o812o115j5360p81L088
15841b4366m654L517J0041k747m098p479p230l843Q997N345Q503P816P887M964
$$ plain form
15928 332203 253550 193077 146756 100979 74450 64750 54191 62205 65791 56440 59810 70418
15916 70418 81769 81618 82868 93244 140093 213637 301454 421805 560965 653984 681280 653057
15904 653057 589231 497794 388403 292585 218822 158021 122250 105448 114152 110462 100090 119120
15892 119120 146707 188326 260750 356202 475460 576555 636855 617469 547808 459852 360778
15881 360778 269367 195991 124920 89810 83576 79747 73531 63368 52787 43291 26140 21877
15869 21877 10425 -3328 1224 6627 10070 12411 8379 8228 15289 18576 11984 16272 5140 -24091
15855 -24091 -22696 -22411 -20870 -7217 -11331 -8960 12613 11750 1614 -5198 -11313 -26673 -27454 -24366
15841 -24366 -29020 -25503 -15462 -18209 -22307 -29786 -37016 -40859 -31862 -26517 -18014 -10198 -2311 2653
15827B653k469n140J489Q49J277j0495O218n817m773K963J927j5869k560J4582
15813a5165L379K562k98K280J856M64j474Q594q615Q626M62l434j4896o889O152
15798a6396J7522R578Q530j5091j9540j110K62N504L242R231j753j3602o214N26
15784a9311J608Q891l571P459r808j7457n743J9322J2605k541j0971l71K18p53
15770b0423j3193m531K089K039J4418J9168M616j3223J809j4605n73O498m219
15757b0130k163j2277r53K1307J3712p121K432M025n282j1818n752O441l037M148
15743a6468p85r183N229R038j1081m842k330J2504J8463j257K767n003p221M850
15729e319K042l093O176M026o89j636K641L653J3148j522n144K662J580J1484
$$ plain form
15827 2653 184 -4956 -3467 -2618 -1341 -11836 -5618 -11435 -16208 -13245 -11318 -27187 -29747 -15165
15813 -15165 -11786 -9224 -9522 -7242 -5386 -4922 -6396 2198 -6417 2209 2671 -763 -15659 -22548 -16396
15798 -16396 1126 10704 19234 4143 -15397 -16507 -16245 -10741 -7499 1732 -21 -13623 -19837 -19311
15784 -19311 -17703 -8812 -12383 -4924 -14732 -32189 -37932 -18610 -6005 -8546 -19517 -19888 -19670 -20423
15770 -20423 -33616 -38147 -36058 -34019 -19601 -433 4183 -9040 -7231 -21836 -22409 -15911 -20130
15757 -20130 -22293 -34570 -35523 -14216 -504 -7625 -5193 -1168 -6450 -18268 -24020 -17579 -20616 -16468
15743 -16468 -17253 -26436 -21207 -12169 -23250 -28092 -30422 -17918 545 -712 2055 -2948 -10169 -5319
15729 -5319 -3277 -6370 -194 3832 3143 1507 4148 7801 20949 19427 14283 16945 18525 30009
15715C0009p850j4923J0403j716k3041M73J2195K418n282J4176P102J12k4831
15702g55j8109J640j2j2799j0603L224J1122J3404J9554k829j6333o629J0627
15689h498J2012m821K041k040N029J2594P634k464q845o266r205j4177j0983J0681
15675a7308J3918L063M03J115J3878j920M18K784n758M237L509k0063k879J2365
15661G762M158J8848O028o465j0122j0157q470L684N296J515N725L13r118J075
15647A0072l578J0340r15j1899J514J0545J5924J0353j6236j3398J3350J9645
15635D5717M186l902p001j01p502o907r69P818J2482K947Q792K3168Q488J729
15621H8945O688L682j968k0438j3978P43P377j9701j81p35N791j2965j6220N205
$$ plain form
15715 30009 22159 7236 17639 15923 -7118 -6645 5550 7968 2686 16862 23964 24076 -755
15702 -755 -18864 -17224 -17236 -30035 -40638 -37414 -26292 -12888 6666 3837 -12496 -19125 -8498
15689 -8498 3514 -1307 734 -1306 3723 16317 23951 21487 12642 6376 -2829 -17006 -27989 -17308
15675 -17308 -3390 -327 76 1191 15069 13149 13567 16351 10593 14830 18339 -1724 -4603 7762
15661 7762 11920 30768 36796 30331 20209 10052 1582 5266 10562 12077 17802 18115 8997 10072
15647 10072 6494 16834 15919 4020 5534 16079 32003 42356 26120 12722 26072 45717
15635 45717 49903 46001 39000 38899 31397 24490 23521 31339 43821 46768 55560 78728 87216 88945
15621 88945 95633 99315 97347 76909 62931 63674 71051 51350 51169 50434 56225 43260 27040 32245
15607C2245J0319O021j568J0866J6481K2090J1385k805J3432n86j2075L264r809
15594I9260p257j1536M750J1078N438r022k526k335j2765J118K1094J5958J25
15581A13380j0311N000J4835l444l650j2326p459n103j3443J566J887P56k0999
15568F0689p571o15K199j4478q412r496J1724K259j158O615j935P965P675K579
15554E8040K328J1742p557j4156j366J663J0215l287q448Q30J921M646R007J250
15540F6828j7484m393P112Q364p523O917J0719J236k030N785r34n801N92J746
15526G1134Q238J6807O823m902j2036L61P642k742j2115o674J0776J104L644l659
15512H4401n46J0678J9249J2612M485j469J0640O94q097J719k320L155p086q396
$$ plain form
15607 32245 42564 48585 47017 57883 74364 96454 107839 105034 118466 117880 105805 109069 99260
15594 99260 92003 80467 85217 96295 101733 92711 90185 87850 75085 76203 97297 113255 113380
15581 113380 103069 108069 122904 119460 115810 103484 96025 90922 77479 79045 80932 81688 60689
15568 60689 53118 52503 54702 40224 31812 22316 34040 36299 35141 41756 39821 47786 55461 58040
15554 58040 60368 72110 64553 50397 49031 50694 60909 57622 49174 50004 51925 56571 65578 66828
15540 66828 49344 44951 52063 60427 52904 59821 70540 71776 69746 75531 74597 68796 69388 71134
15526 71134 79372 96179 103002 98100 86064 86425 94067 91325 79210 72536 83312 84416 88060 84401
15512 84401 83855 94533 113782 126394 130879 129410 140050 140744 132647 134366 132046 135201 128115 119719
15498A19719l320K478J1486j0024j2845l75M378J2165K0746J2216M852J179J8334
15485A80989J0820l57m505j255K983L872k2467Q709J2359J5609J4452J1080N394
15472B37683r322r917N280k692j4908j8419r888M42O492L937P003O184J379n11
15458B02743O369J1044R764J0299J1089J8315J0749J1746o134k9337m1934k2753
15446A91960j0265K761K377p930N090P470L004Q647K037Q395J743j61M242L58
15432B19728n514O112K0652O166L869M071p746o345J0370J3126R537J8785J9063
15419C11874K0134P772l252R136N188o09J0710m57J1280K0630R021j1568M216
15406C94075K343O073J6768K0185J8415M275P3K778N831K9064K9630K5398L485
$$ plain form
15498 119719 116399 118877 130363 120339 107494 107119 111497 123662 144408 156624 161476 162655 180989
15485 180989 191809 191452 186947 185692 188675 192547 170080 178789 191148 206757 221209 232289 237683
15472 237683 228361 218444 223724 221032 206124 187705 177817 178259 184751 188688 195691 201875 203254 202743
15458 202743 209112 220156 229920 240219 251308 269623 280372 292118 285984 256647 214713 191960
15446 191960 181695 184456 186833 178903 183993 191463 194467 203114 205151 213546 215289 215128 219370 219728
15432 219728 214214 220326 240978 247144 251013 255084 247338 240993 251363 264489 274026 292811 311874
15419 311874 332008 339780 336528 345664 350852 350243 360953 360496 371776 392406 401427 389859 394075
15406 394075 396418 402491 419259 439444 457859 462134 462207 464985 470816 499880 529510 554908 558393
15393E58393K2078K5868L6084L1818L4895K7311L0522L1793K3274K5322L5386
15382H82744M9765M0229K4478M6041O6015O5844P3365Q3469P7727Q3596J27711
15371A620984K01901K38761K52098K17959J52756J00994J09314J24831J37526
15362C157124K08811L27971M64215N40931N76650O64058P86927R05734J077343
15353H709764J342135J785293K569375L824558N878143R534774J5770151K2727810
15345G2142003K5946775K1420842P725809m811295j3710159j7377447j9594129
15338G1742399j8185128j4383714r488601n356040k801931j263807j72333Q24705
15330B0915550K036947L833726O910209J2257232J9485618K4085699K2972499
$$ plain form
15393 558393 580471 606339 642423 674241 709136 736447 766969 798762 822036 847358 882744
15382 882744 932509 972738 997216 1043257 1109272 1175116 1248481 1331950 1409677 1493273 1620984
15371 1620984 1822885 2061646 2313744 2531703 2684459 2785453 2894767 3019598 3157124
15362 3157124 3365935 3693906 4158121 4699052 5275702 5939760 6726687 7632421 8709764
15353 8709764 10051899 11837192 14406567 18231125 24109268 33644042 49414193 72142003
15345 72142003 98088778 119509620 127235429 122424134 108713975 91336528 71742399
15338 71742399 53557271 39173557 29684956 24328916 21526985 20263178 20090845 20915550
15330 20915550 22952497 26786223 33696432 45953664 65439282 89524981 112497480
15323A12497480J1142491j449568j1791458j6502604j9344572j9201322j6027058
15316C9323389j1598459p307824m451857k829891j942055j443311j167403r82924
15308G599665q29274o85260n37817m20778l48257k80715k45718k40039k32437
15299C779370k85376l37389l36852l34657l09526k67118k27123j68115j39702
15290A373512j22901r3787r0980q3621p4950p4104o3145o0355n4305n5521n8471
15279E41372l7355l5511l8580l4439j8739q582j9353k4978j8739k4301k6142q354
15267B46299k1331j8744j1530j0199j2688j5486j654k3390j6239p943N637m982
15255A07750j3191o577k497q201p955l567k9162k4514p785l80K165K048l804n395
$$ plain form
15323 112497480 123639971 122190403 110398945 93896341 74551769 55350447 39323389
15316 39323389 27724930 20417106 15965249 13135358 11193303 9749992 8582589 7599665
15308 7599665 6770391 6085131 5547314 5126536 4778279 4497564 4251846 4011807 3779370
15299 3779370 3493994 3156605 2819753 2485096 2175570 1908452 1681329 1513214 1373512
15290 1373512 1250611 1156824 1065844 982223 907273 833169 770024 709669 655364 599843 541372
15279 541372 504017 468506 429926 395487 376748 368166 348813 323835 305096 280795 254653 246299
15267 246299 224968 206224 194694 184495 171807 156321 154667 131277 115038 107095 112732 107750
15255 107750 94559 87982 85485 77284 69329 65762 36600 12086 4301 3921 6086 8134 4330 -1065
15241a065J5299O966n188p24q72K379M660J0678m258k150k096j5900o462N66J1872
15226A3705M542O951o493k198J6002J8093N341J2287p35j4590k2066k9344l0375
15213b8880j7576j961K349J4839l688O625J3196n650n240O314R59L456J67R134
15199e956K3525N68J997j0303r378k4804k6812r70m477k993j0864j1635j785L961
15185g9926o703k426j165Q051J1920r088m249l966j2938m235J1878O132K1513
15172f5202K0355p20j0519P92j842j0157N185j1711j1176l726L939N130L482p08
15158g6878N625Q558R687N755k40l029p320o351P593l276o287M75O703J0493o135
15143e4627n754N235m811R272p916P077p289o269J5120M19K768O154J404k409
$$ plain form
15241 -1065 14234 21200 16012 15288 14416 16795 21455 32133 27875 25725 23629 7729 1267 1833 13705
15226 13705 18247 25198 18705 16507 32509 50602 55943 68230 67495 52905 30839 1495 -28880
15213 -28880 -46456 -48417 -46068 -31229 -34917 -28292 -15096 -20746 -25986 -19672 -18713 -15257 -15090 -5956
15199 -5956 17569 18137 20134 9831 453 -24351 -51163 -52133 -56610 -59603 -70467 -82102 -83887 -79926
15185 -79926 -86629 -89055 -90220 -82169 -70249 -79337 -83586 -87552 -100490 -104725 -92847 -86715 -65202
15172 -65202 -44847 -45567 -56086 -55294 -57136 -67293 -62108 -73819 -84995 -88721 -84782 -79652 -76170 -76878
15158 -76878 -71253 -62695 -53008 -47253 -47493 -50522 -57842 -64193 -56600 -59876 -66163 -65688 -58985 -48492 -54627
15143 -54627 -60381 -55146 -59957 -50685 -58601 -51524 -58813 -65082 -49962 -49543 -46775 -40621 -39217 -41626
15129d1626n568j011P263R595l024j696J689j4947o26Q577Q777L879L122l135
15115b8731j4675j9782r891r262J0209J3717N607O188l554O599P334j0112q32
15102d7185R033j64k806J883J0468r491J176Q374j5491j3356M000O092M876J2186
15088c0405M662j0637j0998R162L429m744J353m08q943K853J5798L021o701j1569
15074d4127q332n949q589n617J2399J1456M810n97n460p788m347j0464K149R371
15060f1085N364L478M651J0363R948j4395j9064j4651N344R687j8940j8108j708
15047i9116J1638Q159J185k780q64Q415J7067m4O546M77P494Q319l235Q829r162
15032c7072l566K816k3595n097K2641O053K118q620j0498O93M728o71J0815Q851
$$ plain form
15129 -41626 -47194 -48205 -40942 -31347 -34371 -36067 -34378 -49325 -49951 -41374 -32597 -28718 -25596 -28731
15115 -28731 -43406 -63188 -73079 -82341 -72132 -58415 -52808 -46620 -50174 -43575 -36241 -46353 -47185
15102 -47185 -38152 -38316 -41122 -39239 -28771 -38262 -37086 -28712 -44203 -57559 -53559 -47467 -42591 -30405
15088 -30405 -25743 -36380 -47378 -38216 -34787 -39531 -38178 -38586 -47529 -44676 -28878 -25857 -32558 -44127
15074 -44127 -52459 -58408 -66997 -72614 -60215 -48759 -43949 -44546 -50006 -57794 -62141 -72605 -70456 -61085
15060 -61085 -55721 -52243 -47592 -37229 -27281 -41676 -60740 -75391 -70047 -60360 -79300 -97408 -99116
15047 -99116 -87478 -79319 -78134 -80914 -81778 -73363 -56296 -56340 -49794 -49317 -41823 -33504 -36739 -27910 -37072
15032 -37072 -40638 -37822 -61417 -66514 -43873 -37820 -35702 -44322 -54820 -54127 -49399 -50070 -39255 -30404
15018c0404J2124k212r238j215M63j5899L621J4473k895j3698j257q83J1826Q730
15004b6464P984J2N40q695n402R519o046p535M098q030j577O060J139l191j5403
14989e2991k717P067N35m519M832O434N832j0099R39p50r612l465R672J374J18
14974d7350k448j966M837o20m003j2487m733M255K959J96M644J5833K688j7411
14960e5606N154N462p433r672L034R253J68L595j385m296j0350J3697Q751K238
14946c7390n369m00K397q538q7r899n790p69J0130M865l97j552L000M517r703
14931e4985P73J7982J3616o779O42p518j333O711k377o082R95q853k793J407p068
14916e5662j4043p809O195J6728Q916L058N74P603N455j478q154J94k905n463
$$ plain form
15018 -30404 -18280 -20492 -29730 -30945 -30482 -46381 -42760 -28287 -31182 -44880 -46137 -47020 -35194 -26464
15004 -26464 -18480 -18468 -17928 -26623 -32025 -22506 -28552 -36087 -31989 -40019 -41596 -35536 -34397 -37588 -52991
14989 -52991 -55708 -48641 -48106 -52625 -47793 -41359 -35527 -45626 -44687 -45437 -55049 -58514 -48842 -47468 -47350
14974 -47350 -49798 -51764 -46927 -47547 -51550 -64037 -68770 -64515 -61556 -61360 -56716 -40883 -38195 -55606
14960 -55606 -50452 -44990 -52423 -62095 -59061 -49808 -49640 -46045 -47430 -51726 -62076 -48379 -39628 -37390
14946 -37390 -42759 -43159 -40762 -49300 -49387 -59286 -65076 -65845 -55715 -50850 -51247 -52799 -49799 -45282 -54985
14931 -54985 -54212 -36230 -22614 -29393 -28751 -36269 -37602 -30891 -33268 -39350 -38355 -47208 -50001 -48594 -55662
14916 -55662 -69705 -77514 -71319 -54591 -45675 -42617 -42043 -34440 -28985 -30463 -38617 -38423 -41328 -46791
14902d6791j2707o578J3725M067j118P187m864n794O231Q861J0904J4059K051
14889a0767k2517j7802k79J0044N822m563m265l194m13r87n887l076m788k026
14875f4698J7438L201m575O159l963N188j436r643K296J3314P396J4399j4783
14862b9707j9200o339K943n609M113O714J7189K3627l032l0278k572j0928j2951
14849f6030M207M068L826N570M935l879j0859L603l607K621N720o272l608N876
14835e3829R821J6253n01j605k271n178j0906m723M035J579O79P583l832P60J254
14820d0881J0660J363J0681J416N082J1389J1908j6586n580K580Q215m07k1161
14807b1321O041M184l909Q553M871M987R242O545m023m626K25m96J378J577J8729
$$ plain form
14902 -46791 -59498 -66076 -52351 -48284 -49402 -42215 -47079 -52873 -46642 -37781 -26877 -12818 -10767
14889 -10767 -33284 -51086 -51365 -41321 -35499 -40062 -44327 -47521 -47934 -48921 -54808 -57884 -62672 -64698
14875 -64698 -47260 -44059 -48634 -42475 -46438 -41250 -42686 -52329 -50033 -36719 -29323 -14924 -29707
14862 -29707 -48907 -55246 -52303 -57912 -53799 -47085 -29896 -6269 -9301 -39579 -42151 -53079 -66030
14849 -66030 -61823 -57755 -53929 -48359 -43424 -47303 -58162 -54559 -58166 -55545 -49825 -56097 -59705 -53829
14835 -53829 -44008 -27755 -28256 -29861 -32132 -37310 -48216 -52939 -48904 -47325 -46646 -39063 -42895 -42135 -40881
14820 -40881 -30221 -28858 -18177 -16761 -11679 -290 11618 -4968 -10548 -7968 247 -160 -21321
14807 -21321 -15280 -11096 -15005 -6452 -1581 3406 12648 19193 15170 10544 10769 10273 11651 13228 31957
14792C1957O355K943j4706k863M4m985m509L330J2915K0365K2169K6520M0265
14779A39800P6811R8629J24038J32574P9481r532o6276q0799r6204q9158q4055
14768B25309o1066l3059k1957n371p653j3317J2742K1629K8831M4842Q4697J21687
14756C97314J21880R3216J9804l9691p0443r8482j06085j00280p0581m0292l8979
14745F7381k5281k436m732k0474j4400n811O317k229l116J844J1712O435j3136
14732B074m148J149r628q94l142k0488q838L553J2977Q649j2j56Q724R534N650
14717E004J0793k2616j3650N671j3650j1178N337J8344Q634r668J850j0247j7453
14704d2829J1885J9572r114o471J0371n933k5265P190J3754M534M198o693p776
$$ plain form
14792 31957 38312 41255 26549 23686 23730 18745 14236 17566 30481 50846 73015 99535 139800
14779 139800 216611 315240 439278 571852 651333 641801 575525 494726 398522 309364 225309
14768 225309 164243 131184 109227 103856 96203 82886 95628 117257 146088 190930 275627 397314
14756 397314 519194 612410 632214 592523 522080 423598 317513 217233 146652 106360 67381
14745 67381 42100 39664 34932 14458 58 -5753 564 -1665 -4781 -2937 8775 15210 2074
14732 2074 -2074 -925 -10553 -11447 -14589 -35077 -43915 -40362 -27385 -18736 -18748 -18904 -10180 -646 5004
14717 5004 15797 -6819 -20469 -14798 -28448 -39626 -34289 -15945 -7311 -16979 -15129 -25376 -42829
14704 -42829 -30944 -11372 -20486 -26957 -16586 -22519 -47784 -40594 -26840 -22306 -18108 -24801 -32577
14691c2577k634r311O805J3433J2107K469R001Q229O999p742j0188J899L955l840
14677a395o390o684l071Q165J1023J7067O275n17Q678n179n968J9068J8923K2993
14663H2988K5653M7698M2677K3560j0209l0303l9135l4490m1059l9598j3177r170
14651E435j1269m681R060J1577N532Q952K1424J8814L9817M6215K8870Q371m227
14638A83890j9439l7474l4624l1532l2834j2272r277K611j2310n95k523j4596
14626b0975Q812J5976k590m524j4051O70J6085J3346o82O231M808p169q01q146
14612F990m181m183J6974j4377k836P052j3768q14O295Q029J2695N304J1136K871
14598C7187j135N607J7140J7306n076O917J4024J6673K0101L0048L5720M8586
$$ plain form
14691 -32577 -35211 -44522 -37717 -24284 -12177 -9708 -707 7522 14521 6779 -3409 -1510 2445 -1395
14677 -1395 -7785 -14469 -17540 -9375 1648 18715 24990 24473 33151 27972 22004 41072 59995 82988
14663 82988 108641 156339 199016 222576 212367 182064 142929 108439 67380 27782 14605 5435
14651 5435 -5834 -10515 -1455 10122 15654 24606 46030 64844 104661 150876 179746 188117 183890
14638 183890 164451 126977 92353 60821 27987 15715 6438 9049 -3261 -3856 -6379 -20975
14626 -20975 -12163 3813 1223 -3301 -17352 -16682 -597 12749 12067 18298 23106 15937 15136 6990
14612 6990 2809 -1374 15600 1223 -1613 5439 -8329 -9143 -2848 5181 17876 23180 34316 37187
14598 37187 36052 41659 58799 76105 71029 77946 91970 108643 128744 158792 194512 243098
14586B43098N5920P6465J19573J31893J25135J03541P5872K6836n8737r5978j10127
14575F93491j15954j12277r8337p8191o6189m2593k6235j0275k1984j6067j1498
14564I3891j5698j4559o801l195j640o008j4777M902J521q560p710m892o689L950
14550A3735N516O677O615m427k1544j4526k649K1514M156M597O397n517r498j3262
14536b216N061P825J0951L137r46l229k4833Q77L921p163q897K590K943P014l694
14521f659r425J1256O311o719m746j622P446M911J2000k461l925K023j0036n240
14507f886o929O940J3677K548R883j3441j2723o351J503O734J1436l257r571N466
14493i71Q762N443p900j2363j4327q995J0205M906Q88O131j289j649J6661R312
$$ plain form
14586 243098 299018 375483 495056 626949 752084 855625 931497 958333 899596 803618 693491
14575 693491 577537 465260 366923 288732 222543 179950 153715 143440 121456 105389 93891
14564 93891 78193 63634 56833 53638 51998 45990 31213 36115 37636 29076 21366 16474 9785 13735
14550 13735 19251 25928 32543 28116 6572 -7954 -10603 10911 15067 19664 26061 20544 11046 -2216
14536 -2216 2845 10670 21621 24758 23812 20583 -4250 -3373 548 -6615 -15512 -12922 -9979 -2965 -6659
14521 -6659 -16084 -4828 1483 -5236 -9982 -11604 -4158 753 12753 10292 6367 8390 -1646 -6886
14507 -6886 -13815 -6875 6802 9350 19233 5792 -6931 -13282 -11779 -5045 6391 3134 -6437 -971
14493 -971 7791 13234 5334 -7029 -21356 -30351 -20146 -15240 -14352 -8221 -9510 -11159 5502 14814
14479A4814o1n216n685M618J802o234j5654p827J3209J2499j374l196k981R492
14465H206k152O300p937m185K828J8813J0794j8655o520k447l252k257l289M326
14451E73J0170J118r711N52j7831O72m15M21p85J5649J952j4600r235O232J672
14436a3566l538J0342J6393K663j0881M387O026j2785N372J5693n758j8861l883
14423h396L768m160M748o66k884O525M517n56Q814M208l845k751l489r023o234
14408i424J0075j238k658Q73j730n360J1050O687j5875q063J0231J5360J0412
14395B0340N436J1175P074l785j9021j5732n168o470J3229j0597J1893Q625J3379
14382C0378R765p418r043p834j0071k952P105l274L6o389j720N216n67J435m892
$$ plain form
14479 14814 14753 9537 3852 8470 10272 4038 -11616 -19443 -6234 6265 4891 1695 -1286 8206
14465 8206 6054 12354 4417 232 3060 21873 32667 14012 7492 5045 1793 -464 -3753 573
14451 573 10743 11861 2150 2702 -15129 -14457 -14872 -14451 -15236 413 2365 -12235 -21470 -15238 -13566
14436 -13566 -17104 -6762 9631 12294 1413 5800 11826 -959 4413 20106 14348 -4513 -8396
14423 -8396 -4628 -8788 -4040 -4706 -7590 -1065 3452 2896 11710 15918 12073 9322 5833 -3190 -9424
14408 -9424 651 -587 -3245 -2372 -4102 -9462 1588 8275 -7600 -15663 -5432 9928 20340
14395 20340 25776 36951 44025 40240 21219 5487 319 -6151 7078 -3519 8374 16999 30378
14382 30378 40143 32725 23682 15848 5777 2825 9930 6656 6692 303 -1417 3799 3232 4667 -225
14367b25K868J9957K424k135l221l048j4661L403J8565N056j3147K969N607M78
14353B4890K18r269K16L628J6438J248p762R09J900K149O14J1891j2612r267N687
14338C0878j523L054o417o585J51r80q576L861J1590M606K397n466j8463N986
14324A4513n023k17J5515Q346j4524p142j1287J197R734r845j2985J0952J2374
14311A1608l462j912J8394J604m525j461o726J0997M879J38K83O59J8767O930
14297E6173q38r61L861j636j8291j4342P797O653J4282k756j0848l960k927l586
14283B8621Q081J8380K539o23p811j1372L787k945o80P754N27q458j3308J904
14269B6396R857K816j5003n074k690O461Q371J099N396M430R450j796l149r985
$$ plain form
14367 -225 2643 22600 25024 22889 19668 16620 1959 5362 23927 28983 15836 18805 24412 24890
14353 24890 25108 15839 16055 19683 36121 37369 29607 30516 32416 34565 35179 47070 34458 25191 30878
14338 30878 29355 32409 25992 19407 19558 18578 10002 13863 25453 30059 32456 26990 8527 14513
14324 14513 9490 9273 24788 33134 18610 11468 181 1378 11112 1267 -11718 -766 11608
14311 11608 8146 6234 24628 26232 21707 20246 13520 24517 29396 29534 29817 30476 49243 56173
14297 56173 55335 54374 58235 56599 38308 23966 31763 38416 52698 49942 39094 35134 32207 28621
14283 28621 36702 55082 57621 56998 49187 37815 41602 38657 37977 45731 46258 37800 24492 26396
14269 26396 36253 39069 24066 18992 16302 22763 31134 32233 37629 42059 51509 49713 46564 36579
14255C6579N898j174j98j2317m571J2245j826k893Q938R834l566N298J4833M206
14241G1286k979k1716P55m435Q854J0850Q052l803n621p43J3460M850l035K610
14227G8385Q340k824j0414O338O656m654J5778J1276j728j2021q314Q170K0365
14214A15353J9609P855J0260J0564N508n749J0289K0041L6718J8728J6148K9927
14202B95251M6943M9730O6231J06970J65348K09729K58410K71610K36546J82374
14192A889142J14501L5420o8037j84005k36316k34679k35967k21700k00396j29939
14182E28024r1784p1172m2683l6039l1406j5214j8860j4403k72k9517k6082k033
14170A48559j90p707j3184j8364j2685Q414P100l414j1554j3957j522k389N401
$$ plain form
14255 36579 42477 41303 41105 28788 24217 36462 34636 31743 40681 50515 46949 52247 67080 71286
14241 71286 68307 46591 47346 42911 51765 62615 70667 66864 61243 60500 73960 78810 75775 78385
14227 78385 86725 83901 73487 79825 86481 81827 97605 108881 107153 95132 86818 94988 115353
14214 115353 134962 142817 153077 163641 169149 163400 173689 193730 230448 249176 265324 295251
14202 295251 342194 391924 458155 565125 730473 940202 1198612 1470222 1706768 1889142
14192 1889142 2003643 2039063 1971026 1787021 1550705 1316026 1080059 858359 657963 528024
14182 528024 436240 365068 322385 286346 254940 239726 220866 206463 206191 176674 150592 148559
14170 148559 148369 140662 127478 109114 96429 104843 111943 108529 96975 83018 81496 79107 84508
14157H4508N01o78p247k880L997J0917J2919r527j0336j190P9j206P18J728m632
14142G7671l122K589M783Q507P19m699L860J684m54R097P399n479K48j908q032
14127I2863N194P469q146j746M63j116O847L471m398N29j856o039j808O4j734
14112I0057l328K9484K530n215q079Q805J0635n049j263p721j2707Q170K4158
14099A30477j1307m248J7757o023m85J0601K6968K5024L174j0674j3138j9369
14087A48757k7249k4618k0272K309J0596M695j1165N690J6264J390J0316O885
14075A23598j0224j1116O330k799o993M127j8457j7707o12J6908r643j4659Q157
14062F6910Q531r03o78R678J0701m681j4463j2216N110M223P388Q13r54J5497
$$ plain form
14157 84508 85009 84331 77084 74204 78201 89118 102037 92510 82174 80984 81063 79857 80575 82303 77671
14142 77671 74549 77138 81921 90428 91147 86448 90308 91992 91538 100635 108034 102555 102803 100895 92863
14127 92863 98057 105526 97380 95634 96097 94981 101828 105299 100901 101430 99574 93535 91727 91791 90057
14112 90057 86729 116213 118743 113528 105449 114254 124889 119840 118577 110856 98149 106319 130477
14099 130477 119170 114922 132679 126656 126171 136772 163740 188764 191938 181264 168126 148757
14087 148757 121508 96890 76618 78927 89523 94218 83053 88743 105007 106397 116713 123598
14075 123598 113374 102258 108588 105789 98796 102923 84466 66759 66147 83055 73412 58753 66910
14062 66910 75441 74538 73860 83538 94239 89558 75095 62879 67989 72212 79600 80413 79459 94956
14048I4956O097M906J7292P534L94J591J0318J2181J7769L69N911J2976J5943
14035B08237P225j5586r091p414j7673m390o108O134L795m95o389l85L724J1761
14021A73345J6373j900O35j298j5906j618R671P133k425K512Q106k695K843L437
14007A98213J9913K2840J1448K910J4810J9295O791K0743L1955K3202Q342J8990
13995C99452L742j4091j3511k2323k2008q132j2259r105j7586j3784j3554k8944
13983B27897j6757k400J228k8288r434J377K343j0246K735K2053J3463m032O789
13970B06728J640p039j2744p962Q549O390L756J374k1814Q643O479k000o924P169
13956A92245M188O542N064O497J500q470R34l36n346j2280P471K1243N747j333
$$ plain form
14048 94956 101053 105959 123251 130785 131179 132770 143088 155269 173038 173407 179318 192294 208237
14035 208237 215462 199876 190785 183371 165698 161308 155200 161334 165129 164634 158245 157860 161584 173345
14021 173345 189718 187818 188453 187155 171249 169631 179302 186435 184010 186522 194628 191933 194776 198213
14007 198213 218126 240966 252414 255324 270134 289429 296220 316963 348918 372120 380462 399452
13995 399452 403194 389103 375592 353269 331261 323129 310870 301765 284179 270395 256841 227897
13983 227897 211140 208740 209968 181680 172246 173623 175966 165720 168455 190508 203971 199939 206728
13970 206728 208368 201329 188585 180623 189172 195562 199318 200692 178878 187521 194000 192000 185076 192245
13956 192245 196433 202975 208039 214536 216036 207566 208500 208164 202818 190538 198009 219252 224999 223666
13942B23666k925L470J0305j0898j6940j2646r841n105q155M391Q317R999J4005
13929B07643O388K1933J9594K3709J7682J937P215K5298J9402J1325J1666J3090
13917C86882J0675q625j6541K022q739k0870l378m921Q51O128K0555J3366Q678
13904C86083R093J7561J3119J6945N153r901j8062k1442j4261j1849m011n599
13892C62829n017m092O120J5593M2594L1440K9606K6963J9870K1971K3462K1131
13880E92470J3207J6946J6719J8802J8185K7187K9195J4414J0044P208L39n722
13868G58994j5330j6840l1907m1188l3704l3352m7552m0546j4171p155N460K815
13856D85524J8706J0005K096Q215J5974K1541K8519K9738M9062M0656J7756n65
$$ plain form
13942 223666 220741 224211 234516 223618 206678 194032 184191 179086 170931 175322 183639 193638 207643
13929 207643 214031 235964 255558 279267 296949 298886 306101 331399 350801 362126 373792 386882
13917 386882 397557 388932 372391 374413 365674 344804 341426 336505 337356 343484 364039 377405 386083
13904 386083 395176 412737 425856 442801 447954 438053 419991 398549 384288 372439 368428 362829
13892 362829 357812 353720 359840 375433 418027 449467 479073 506036 525906 547877 571339 592470
13880 592470 605677 622623 639342 658144 676329 703516 732711 747125 757169 764377 764716 758994
13868 758994 743664 726824 694917 653729 620025 586673 539121 498575 484404 477249 482709 485524
13856 485524 504230 514235 516331 524546 540520 562061 590580 620318 669380 710036 727792 727227
13844G27227n917j1785m418K211K0835M0992L3132J3915J7204L2642J9535J0849
13832H96422J1396q503j0094n958j6873j6839j2218j0249R499J6070K4834K2274
13820H99761L0160K2618N797J7402K0297K1179K9262L7940K7488L4584K5140K9415
13808A201043M3563N4283N9703N8527M6349M0858M9791N8093M2885M2646J5560
13797A713301J9972K0828M1088M9767M6589O0182O6057P8316Q9014R4069Q8544
13786B367727R2460J13602J15962J15599J23281J28815J47476J62797J53005J75033
13776C695757K02939K13102K36442K43436K60067K80183L03735L43674L76435
13767F155770L96054M68813N09878N68109O47438P35505Q48588R53402J123222
$$ plain form
13844 727227 721310 709525 705107 707318 728153 769145 802277 816192 833396 866038 885573 896422
13832 896422 907818 899315 889221 883263 866390 849551 837333 827084 836583 852653 877487 899761
13820 899761 929921 952539 958336 975738 996035 1017214 1046476 1084416 1111904 1146488 1171628 1201043
13808 1201043 1244606 1298889 1358592 1417119 1463468 1504326 1554117 1612210 1655095 1697741 1713301
13797 1713301 1733273 1754101 1795189 1844956 1891545 1951727 2017784 2096100 2185114 2279183 2367727
13786 2367727 2460187 2573789 2689751 2805350 2928631 3057446 3204922 3367719 3520724 3695757
13776 3695757 3898696 4111798 4348240 4591676 4851743 5131926 5435661 5779335 6155770
13767 6155770 6551824 7020637 7530515 8098624 8746062 9481567 10330155 11283557 12406779
13758A2406779J331866J618850J989933K464263L019398L590973M249095N110407
13750C5781564O305202P981044J0438797J4194608K0147820K9348493M1363626
13743A65561154N0642465N0102801M1948011L1261686K0922433N728728j3755878
13736C52411400l3396575m4460253m6606596m4130099l9826271l2944417k4270362
13729H6776827j6916687j1908626q739450o725561n433975m578450l921488l370112
13721B5182478k916834k499004k163649j864516j606369j386439j201227j072456
13713A0471984r43418q31150p43690o63465o02390n33814m79773m28225l92647
13704D853412l55163l16698k85959k50103k44412k17991j91606j88717j64255
$$ plain form
13758 12406779 13738645 15357495 17347428 19811691 22831089 26422062 30671157 35781564
13750 35781564 42086766 50067810 60506607 74701215 94849035 124197528 165561154
13743 165561154 216203619 266306420 308254431 339516117 360438550 366167278 352411400
13736 352411400 319014825 274554572 227947976 183817877 143991606 111047189 86776827
13729 86776827 69860140 57951514 49212064 42486503 37052528 32474078 28552590 25182478
13721 25182478 22265644 19766640 17602991 15738475 14132106 12745667 11544440 10471984
13713 10471984 9528566 8697416 7953726 7290261 6687871 6154057 5674284 5246059 4853412
13704 4853412 4498249 4181551 3895592 3645489 3401077 3183086 2991480 2802763 2638508
13695B638508j32719j25271j30619j17908j28345j21248r2456q1927q3231p3789
13685A550995o3862n5359p6191o8258o3673r3925q0283p1355p0744n4734m5736
13674H06875l7669j8025n046J681q57J260J3019J3676M4057O5400P8995N9312
13662A022678L5841L0363J713l0955o9719p8097r3585j04737p8044p2185n8699
13651E04574m3548l9844l6260l3525k7361k4329k9890l1004l3964j8934l566j540
13639A80809M332J7919n99k0098j6504r253r242j5558n817k630J0622J0910J3831
13626A58722J9813J1094J3809J8633M462Q271O575J5396J9706J5385k350p61j0827
13613B77928j8590k2368m3651o0957p1054n9290m6723j6481n913r203M318p69
$$ plain form
13695 2638508 2505789 2380518 2249899 2131991 2003646 1882398 1789942 1708015 1624784 1550995
13685 1550995 1487133 1431774 1355583 1287325 1223652 1129727 1049444 978089 907345 852611 806875
13674 806875 769206 751181 746135 747816 746959 748219 761238 774914 818971 884371 963366 1022678
13662 1022678 1058519 1088882 1090595 1059640 989921 911824 818239 713502 635458 563273 504574
13651 504574 461026 421182 384922 351397 324036 299707 269817 238813 204849 185915 182349 180809
13639 180809 185141 203060 202461 182363 165859 156606 147364 131806 125989 123359 133981 144891 158722
13626 158722 178535 189629 203438 222071 226533 234804 241379 256775 276481 291866 289516 288755 277928
13613 277928 259338 236970 193319 132362 61308 2018 -44705 -61186 -67099 -76302 -71984 -72753
13601g2753k1293j1939Q879Q604L588J3153L249M806j456L130J581l23J7029L2514
13587a1231J8784J0155K015o350j4418k4324k4026k1675j8479j4760j4443n095
13575a23847j0162q951k86J0233K846O951j4J0835J1148m299j1031j6994k858
13562a36429l380P187J2922k398m398N889J5123J8496N962R658J3289J5596J1392
13549c1091J1780Q094P880J4708q00q363r034q837o311j128n979L41j2090M997
13535c5833J4762R519j4727q008Q192o496o526P109P615k642J0577J0059k3917
13522c0316j8212J1860K171m784n386J1212R472r152j3764K817R49q513j0843
13509f2489k704J0008N656k988J0118L025l797L473M281O943j4420o971O857J1460
$$ plain form
13601 -72753 -94046 -105985 -97106 -88502 -84914 -71761 -68512 -63706 -65162 -62032 -60451 -60774 -43745 -11231
13587 -11231 7553 17708 19723 13373 -1045 -25369 -49395 -71070 -89549 -104309 -118752 -123847
13575 -123847 -134009 -142960 -143246 -133013 -130167 -123216 -123230 -112395 -101247 -105546 -116577 -133571 -136429
13562 -136429 -139809 -132622 -119700 -122098 -126496 -120607 -105484 -86988 -81026 -71368 -58079 -42483 -31091
13549 -31091 -19311 -11217 -3337 11371 10571 2208 -6826 -15663 -21974 -23102 -29081 -28740 -40830 -35833
13535 -35833 -21071 -11552 -26279 -34287 -26095 -32591 -39117 -32008 -24393 -27035 -16458 -6399 -30316
13522 -30316 -48528 -36668 -34497 -39281 -44667 -33455 -23983 -33135 -46899 -44082 -43133 -51646 -62489
13509 -62489 -65193 -55185 -49529 -52517 -42399 -39374 -43171 -39698 -35417 -28474 -42894 -49865 -43008 -31548
13495c1548L966j5734j6226J127L456j0251p290J6743R251j427r492j1621J672
13482f7374L598K394p013n639O449n210l420O534m947j3977o318N522o894L238
13468i3057O708k736j1724p646m015N107K99J1029M304R600J0348l953k2918j1395
13454a10049J0667Q212Q048j2537j5940j5896J5514K1155r516r847O601J779K263
13441i9546K538q076p58Q095P616K439M688N058J255J49J5597Q714l888n064P538
13426e3645p143l036k12q32N605R249M902Q800j051J9571L921l813q722l812Q324
13411b1894M079k422J562j3923j158P949Q468j730J0701Q951R867J0901M547j2638
13397A3260m038k191j494j8924p725P443K263Q414q880j4929O118J5260K374K485
$$ plain form
13495 -31548 -27582 -43316 -59542 -58415 -54959 -65210 -72500 -55757 -46506 -47933 -57425 -69046 -67374
13482 -67374 -63776 -61382 -68395 -74034 -67585 -72795 -76215 -69681 -74628 -88605 -94923 -89401 -96295 -93057
13468 -93057 -86349 -89085 -100809 -108455 -112470 -107363 -107064 -96035 -91731 -82131 -71783 -75736 -98654 -110049
13454 -110049 -99382 -91170 -83122 -95659 -111599 -127495 -111981 -90826 -100342 -110189 -103588 -101809 -99546
13441 -99546 -97008 -105084 -105842 -97747 -90131 -87692 -83004 -77946 -76691 -76542 -60945 -52231 -56119 -61183 -53645
13426 -53645 -60788 -63824 -64036 -64868 -59263 -50014 -45112 -36312 -37363 -17792 -13871 -17684 -26406 -30218 -21894
13411 -21894 -17815 -20237 -18675 -32598 -33756 -25807 -17339 -19069 -8368 583 10450 21351 25898 13260
13397 13260 9222 7031 5537 -13387 -21112 -13669 -11406 -2992 -11872 -26801 -20683 -5423 -3049 -564
13383e64j0668k4929J2589M571m103K2619o359q563L682Q492K035L638M927P809
13369A5176j420r527m899k105j1401p019K008j4560j5507M909l310p929n428Q941
13355e2071O173j1475R03l254k127J608n124P584K8093O277l464J3108K2268M236
13341A2735j309M255j2298j2697l0747r838L20J2779J5974P57j1691p73n693j1959
13327e0185K677J01N021J1926L774r589m272P302j4540J487N578j257J0602j246
13313c2621j543N79K576n919j1870k322Q047P468Q347q357j1660J3288J3458R865
13299a0664R784J0448j639J0005K1098K6011Q474L0462L6228L8162L3064M9552
13287B60985Q0571J13143J57197K18202K57857K63843K38595J71623J22154M2683
$$ plain form
13383 -564 -11232 -36161 -23572 -19001 -23104 -485 -6844 -15407 -11725 -3233 -1198 2440 7367 15176
13369 15176 13756 4229 -670 -2775 -14176 -21195 -19187 -33747 -49254 -44345 -47655 -55584 -61012 -52071
13355 -52071 -45898 -57373 -56470 -59724 -61851 -60243 -65367 -57783 -29690 -23413 -26877 -13769 8499 12735
13341 12735 11426 15681 3383 -9314 -40061 -49899 -49579 -36800 -20826 -20069 -31760 -32533 -38226 -50185
13327 -50185 -47508 -47407 -42386 -30460 -26686 -36275 -40547 -33245 -47785 -46298 -40720 -41977 -31375 -32621
13313 -32621 -34164 -33585 -31009 -36928 -48798 -51120 -43073 -35605 -27258 -35615 -47275 -33987 -20529 -10664
13299 -10664 -880 9568 7929 17934 39032 65043 73517 103979 140207 178369 211433 260985
13287 260985 341556 454699 611896 830098 1087955 1351798 1590393 1762016 1884170 1926853
13277A926853n7994j77759k28828k51691k51840k16700j82911j51211j04249q2668
13267B21002n1404m5348p367o010k5303k7790k3616p646n557j3579j2109P331
13255B604L676K392m008M47j330k1885j1282p784P546l33j3328k0327k822j006
13241f7440l54o91l909P50o529R17J1594J7503m54j5838J317O554M795J0922M795
13226c6068j614n306J8152n611j4331j6601j1524k883J1676m23j5116r525L475
13213h5699J4928r715K687J720r305J0274J1820M716n923l852j924J2117P97j1630
13199f8989l596M202R932l821j4453j6473N391O204J0339N570J347k274L098j4107
13185g7630O899O530K093L896j1810L404o318L659Q001P51N207J019j5116j3678
$$ plain form
13277 1926853 1868859 1691100 1462272 1210581 958741 742041 559130 407919 303670 221002
13267 221002 169598 124250 116883 110873 85570 57780 34164 26518 20961 7382 -4727 2604
13255 2604 6280 8672 4664 5111 3781 -18104 -29386 -37170 -29624 -29957 -43285 -63612 -66434 -67440
13241 -67440 -67794 -68485 -72394 -71644 -78173 -77256 -65662 -48159 -48613 -64451 -63134 -56580 -51785 -40863 -36068
13226 -36068 -37682 -42988 -24836 -30447 -44778 -61379 -72903 -75786 -64110 -64533 -79649 -89174 -85699
13213 -85699 -70771 -80486 -77799 -76079 -85384 -75110 -63290 -58574 -64497 -68349 -70273 -58156 -57359 -68989
13199 -68989 -72585 -68383 -58451 -62272 -76725 -93198 -87807 -81603 -71264 -65694 -64347 -66621 -63523 -77630
13185 -77630 -70731 -64201 -62108 -58212 -70022 -66618 -72936 -69277 -61276 -60525 -55318 -54299 -69415 -83093
13171h3093J6346k384J647K0305j4280k7533K245J4074J3087J1255L508K612J0214
13158c1997k336j39r496j6928j4968m836N105M506n341j4283Q791J2981O251n928
13144f8618j2372q140J4535P208M983k24n520J689L073o770l11J3471j672K637
13130e6031J2535r26o535M443j3646M987j3058O048J0945m114j3265n825k342
13117g6784m380M855J929p177K728O816J8723j935O55R591m350j7846j9519J4028
13103g2666J7200K520j3492j7777p262R339R663Q094P678k836R027j570J804k3904
13089g4182q973J2514N816p602J788J9979J4868K702k27k1789p632J8702P985
13076c6051l621j0253p867N987J0826j509O06m433M801r507j5145j1796R712P521
$$ plain form
13171 -83093 -66747 -69131 -67484 -47179 -61459 -88992 -86747 -72673 -59586 -48331 -44823 -42211 -31997
13158 -31997 -34333 -34472 -43968 -60896 -75864 -80700 -75595 -71089 -76430 -90713 -81922 -68941 -62690 -68618
13144 -68618 -80990 -89130 -74595 -67387 -62404 -62628 -68148 -66459 -63386 -70156 -70467 -56996 -58668 -56031
13130 -56031 -43496 -44422 -50957 -46514 -60160 -55173 -68231 -62183 -51238 -55352 -68617 -74442 -76784
13117 -76784 -81164 -76309 -74380 -81557 -78829 -72013 -53290 -55225 -54570 -44979 -49329 -67175 -86694 -72666
13103 -72666 -55466 -52946 -66438 -84215 -91477 -82138 -72475 -64381 -56703 -59539 -50512 -52082 -50278 -74182
13089 -74182 -83155 -70641 -64825 -72427 -70639 -50660 -35792 -33090 -33317 -55106 -62738 -44036 -36051
13076 -36051 -39672 -49925 -57792 -51805 -40979 -42488 -41882 -46315 -41514 -51021 -66166 -77962 -68250 -60729
13062f0729m162j2338n121P326J201q02q15n788l693J0794R751n743j3841o653
13048i0613Q0R948o909p909j2348P634J2094Q500J0440J4148J2176j1594j7459
13035g1812q727M625M88J5234P360J026j1109l581l19J915k630q079j1828K729
13021h4708k543j552J4354J2354L602J5828n458p469Q368L123m013l134j703k408
13007e5359P992J5531m486k0515l220O571m968J7661r401k735m748o737m479O46
12993f8247J2434Q436J870l531j716O926m308L812r875l328Q304m122j2503P896
12979e7952J0603l454L614p422k140k659K948N311k0982M65J0495J5684l660j583
12965e0732p569o594q834K827L429P817O181m692L06J274r155l828n956P882K2347
$$ plain form
13062 -60729 -64891 -77229 -82350 -75024 -73823 -74625 -75440 -81228 -84921 -74127 -64376 -70119 -83960 -90613
13048 -90613 -90533 -80585 -87494 -95403 -107751 -100117 -88023 -79523 -69083 -54935 -42759 -54353 -71812
13035 -71812 -80539 -75914 -75426 -60192 -52832 -51806 -62915 -66496 -66815 -64900 -67530 -75609 -87437 -84708
13021 -84708 -87251 -88803 -74449 -62095 -58493 -42665 -48123 -55592 -47224 -44101 -48114 -51248 -52951 -55359
13007 -55359 -47367 -31836 -36322 -56837 -60057 -53486 -58454 -40793 -50194 -52929 -57677 -64414 -68893 -68247
12993 -68247 -55813 -47377 -45507 -49038 -50754 -43828 -48136 -44324 -54199 -57527 -49223 -53345 -65848 -57952
12979 -57952 -47349 -50803 -47189 -54611 -56751 -59410 -56462 -51151 -72133 -71668 -61173 -45489 -49149 -50732
12965 -50732 -58301 -64895 -73729 -70902 -67473 -59656 -53475 -58167 -57861 -56587 -65742 -69570 -75526 -67644 -45297
12950d5297J1250K965j4556k11n63l193J2883P321r377j3028q144q069N09j649
12936f9159L107J8968j536n440l760j2586Q00P167L255M892P67O79J0324J995
12922d0527Q212J1842j0413l284R578Q191R178p689j3324j0588p315j2035Q168
12909e0006J6050j3405k924k08J974j604p357r886o061K095K128M641J983R993
12895e2587l349M67K691j0746l171J3107j304q75L024L695N867j1647j2849O913
12881f0764o17L667p0J7392M337j1242k012p785N876J7J4118O889J3647M409r973
12866b2111p892p312P719j672k087O971J9367R511P128O830R492j0035k4685o439
12852a5215o30L300m93k4187k846K0813J3674n050p942j1910j869J2056P333J1654
$$ plain form
12950 -45297 -34047 -31082 -45638 -45849 -46412 -49605 -36722 -29401 -38778 -51806 -59950 -68019 -67510 -69159
12936 -69159 -66052 -47084 -48620 -54060 -57820 -70406 -69606 -62439 -59184 -54292 -53525 -52846 -42522 -40527
12922 -40527 -32315 -20473 -30886 -34170 -24592 -16401 -7223 -14912 -28236 -38824 -46139 -58174 -50006
12909 -50006 -33956 -47361 -50285 -50493 -48519 -50123 -57480 -67366 -73427 -71332 -69204 -64563 -62580 -52587
12895 -52587 -55936 -55469 -52778 -63524 -66695 -53588 -54892 -55767 -52743 -49048 -43181 -54828 -67677 -60764
12881 -60764 -61381 -57714 -57784 -40392 -36055 -47297 -49309 -57094 -51218 -51201 -37083 -30194 -16547 -12138 -22111
12866 -22111 -30003 -37315 -29596 -31268 -33355 -26384 -7017 2494 9622 16452 25944 15909 -8776 -15215
12852 -15215 -15845 -12545 -13038 -37225 -40071 -19258 -5584 -10634 -18576 -30486 -32355 -20299 -12966 -1312
12838a312J7502l05J2742N140J0260k009l286q187j1182l427j3179o528n448k665
12824a1884P001j679L918m353J7894L800r62k466k368o034Q200J3615K057J8703
12810D5442K584Q623M61o34K413k5017k3470J1016K0156L476k910K348M288P181
12796E5957N809J0085N074Q1p332J672q195K572j1726j3008k616R08K2175J7104
12782G8560j0470J612n728p719q503L786r489j3991j387Q869N801J376M222O119
12768E3058k860O537j0612m344k536l863j3747q599O69k381J5919M820L780M952
12754D0793j4588j1927j1407j547r976N99j5550J4677J7982L2158L9271J3062
12742I3547n642J407p38k152j3324j403j4679j4215p749j731J0665J2177K1939
$$ plain form
12838 -1312 16190 15885 28627 33767 44027 42018 38732 30545 19363 15936 2757 -3771 -9219 -11884
12824 -11884 -4883 -6562 -2644 -6997 10897 14697 13735 11269 8901 2867 11067 24682 26739 45442
12810 45442 48026 56649 57110 56476 58889 33872 10402 21418 41574 45050 42140 44488 48776 55957
12796 55957 61766 71851 76925 77006 69674 71346 63151 65723 53997 40989 38373 39281 61456 78560
12782 78560 68090 69702 63974 56255 47752 51538 42049 28058 26671 35540 41341 42717 46939 53058
12768 53058 50198 56735 46123 41779 39243 35380 21633 13034 13703 11322 27241 32061 35841 40793
12754 40793 26205 14278 2871 1324 -8652 -8053 -23603 -8926 9056 41214 80485 93547
12742 93547 87905 89312 88574 86422 73098 71695 57016 42801 35052 33321 43986 56163 78102
12729G8102Q112J9836M5323N9168M8344J712l9044l2135k4575m5905l6057j5551
12717F7330J961n932j5442q889J100L994k373N51M087j3106j3956j0929j0243
12704a847p855P339O627P64j4718o62p75m939n62R594J1433j225q054n028K9704
12689A9796K6484K1577M3893L4069j470R703J8387M526J6051K7633N5867J10274
12677C86790K03067L54561M24144J30449j31000j89012j60746k37038k79462j87243
12667C14510q3898n1917m2831k3413k4307j3312j545r119k4551m255L0703K7869
12655I3934J7128K275J0579K3401J6450P040l093k615q984l92n942j9123j8272
12642A12386o065J3435K0674J5100j9474k6639j3616l1879k3336l873Q274P977
$$ plain form
12729 78102 86214 106050 151373 210541 258885 260597 221553 189418 164843 118938 82881 67330
12717 67330 69291 63359 47917 39028 40128 44122 41749 42300 46387 33281 19325 8396 -1847
12704 -1847 -9702 -2363 4264 5028 -9690 -10352 -11127 -16066 -16628 -7034 4399 3174 -4880 -9908 19796
12689 19796 46280 67857 111750 145819 144349 154052 172439 176965 193016 220649 276516 386790
12677 386790 589857 944418 1368562 1499011 1368011 1178999 1018253 781215 501753 314510
12667 314510 230612 178695 135864 112451 88144 74832 73287 64168 39617 35362 66065 93934
12655 93934 111062 113337 123916 147317 163767 170807 167714 165099 156115 155723 149781 130658 112386
12642 112386 106321 119756 140430 155530 136056 109417 95801 63922 40586 36713 44987 52964
12630E2964O537j2901j2913m427k477K255l732k9621n516L170K431M224J5325
12617A5319L4122L8039J8367P4j1259j2493l134q679j4429j3995J0186p153p01
12604D4264P721N656r10j8656q986l642J8027J1338Q313O3J4919J9924J2127p279
12590A02879j0627K632J4354j864j6550o07P003J1697K4254K1194K3819J9826
12578A98010L2052J0186J3536M0125M5759Q6678J44422J59084P6497o740j7856
12567G81753N190j3494m9594o9479n0351m5748k7841m1170m2158N999L3448N4320
12555E40875N7219J6352p644r343n42J1703J403J2519K4412M8365M9676L6633
12543G81628Q884P751j0572j9062o424K7002M1254M5134O8041R2908R7749R1585
$$ plain form
12630 52964 59501 46600 33687 29260 26783 29038 25306 -4315 -9831 -6661 -4230 -6 15319
12617 15319 49441 87480 105847 105921 94662 82169 79035 70356 55927 41932 52118 44965 44264
12604 44264 51985 57641 56731 38075 29089 25447 43474 54812 63125 63188 78107 98031 110158 102879
12590 102879 92252 94884 109238 107374 90824 90217 97220 108917 133171 154365 178184 198010
12578 198010 230062 240248 253784 293909 339668 426346 570768 729852 806349 799609 781753
12567 781753 786943 773449 723855 654376 604025 558277 530436 489266 447108 453107 486555 540875
12555 540875 598094 614446 606802 597459 596917 608620 610023 622542 646954 695319 744995 781628
12543 781628 790512 798263 787691 768629 762205 789207 830461 875595 943636 1036544 1134293 1225878
12531A225878J58217K75174L57286K21226j6942j46075j38099j44111k03740j91684
12521A397130j57680j02127r8239q7554p4874l9447R483L0950K8192N867m6251
12510H65450n1286n8401m3229n1043l7554p293J9862J5269j021j8018l0273l9663
12498E62800k0229k2362l0846L114K7101M3137N2331L6203K0495K7338O9112J10690
12486H78884P4851l6187r2085j08726r4213j16223r5925o3845m7803j8766l224
12475B76738q851l2975l5004j1758j7611o589k0460r381R071j0237j2252j1384
12463A09307J0602j848L245m221j7643j4549q766j4049k283O652P239J6732n784
12450H4634N34Q824j2146j2928n904L174J0025J029K11K206J6276R147ol949J669
$$ plain form
12531 1225878 1384095 1659269 2016555 2237781 2220839 2074764 1936665 1792554 1588814 1397130
12521 1397130 1239450 1137323 1039084 951530 876656 837209 846692 877642 905834 911701 865450
12510 865450 814164 755763 712534 661491 623937 616644 636506 651775 650754 632736 602463 562800
12498 562800 542571 520209 489363 492477 519578 562715 615046 651249 671744 699082 768194 878884
12486 878884 953735 917548 825463 716737 622524 506301 410376 346531 298728 279962 276738
12475 276738 267887 234912 199908 188150 170539 163950 143490 134109 143180 132943 120691 109307
12463 109307 119909 118061 121306 117085 99442 84893 76127 62078 59795 66447 73686 90418 84634
12450 84634 85168 93992 81846 68918 63014 66188 76213 77242 77453 79659 95935 105082 105076 101127 102796
12435A02796m036R612J4185M829J3438L0415L9695N0844O3474M0261J5756l413
12423C77856j7372m411l3875l4314j9191j2998j9145j2552l034J6628K491j1618
12411B28465n948K574J234J4408R393K0882K988J956m310j5373q97q683K929J929
12397B51547P321J4529K4155L2946L7279O6157Q8323Q2095O7583K2008p751m5212
12385F40980n7694o1935o7004n8136m8262j5374j819J4814M542O454J1852k014
12373C66404l507O914J8831J3217l62r813j1662k5577l3023k9875k6074j4270
12361B51203r921j0991p510k367Q899J5996J4274L8051L6396L2375l318k7079
12349C36008k1784j1588J501m784j0058J0578J435k4314l6740l5359j8234k2305
$$ plain form
12435 102796 98760 108372 122557 127386 140824 171239 210934 261778 325252 365513 381269 377856
12423 377856 360484 356073 322198 287884 268693 255695 236550 223998 220964 237592 240083 228465
12411 228465 222517 225091 226325 240733 250126 271008 273996 275952 271642 256269 255372 246689 249618 251547
12397 251547 258868 273397 297552 330498 367777 433934 522257 604352 671935 693943 686192 640980
12385 640980 583286 521351 454347 396211 347949 332575 330756 345570 350112 356566 368418 366404
12373 366404 362897 369811 388642 401859 401497 391684 380022 354445 321422 291547 265473 251203
12361 251203 241282 230291 222781 220414 229313 245309 259583 297634 334030 366405 363087 336008
12349 336008 314224 302636 304137 299353 289295 299873 301308 276994 240254 204895 186661 164356
12337A64356l0910k9533j2119j6360p025R355n148p958J2198k041j1654M685R151
12324G6997k604o307O3O589J4363Q439j6320j4857j4728m34m896O481n80M205
12310E6411P757j574o453n282q68K176O610P126L5274L6610M3989M7490M6398
12297B75664J0368j773k3734m4333m6127m0369l6601p704M470m87q572N767l546
12284H3023j3124L21R250J2708Q879k539J0289J075L8214O5799O3061M5855K0427
12271C43238Q841j2452k8364l3245m0249n3976m4442j3629j8604k4125k0883R695
12259G1805L99j0701m76J5792l509Q17J5171J5799J6874J8497J2070M631j1390
12246A45779k2145j5024j6930l957j1474j7028q520l509o435p031n464j653R343
$$ plain form
12337 164356 133446 103913 91794 75434 68409 77764 72616 64658 76856 74815 63161 67846 76997
12324 76997 74393 68086 68149 74738 89101 97540 81220 66363 51635 51201 46305 52786 52206 56411
12310 56411 64168 62594 56141 50859 49991 52167 58777 65903 101177 137787 181776 229266 275664
12297 275664 286032 284259 260525 216192 170065 129696 93095 85391 89861 89374 80802 86569 83023
12284 83023 69899 70220 79470 92178 101057 98518 108807 109882 148096 213895 276956 322811 343238
12271 343238 352079 339627 311263 278018 237769 183793 139351 125722 107118 82993 62110 71805
12259 71805 72204 61503 61027 76819 73310 74127 89298 105097 121971 140468 152538 157169 145779
12246 145779 123634 108610 91680 87723 76249 59221 50701 47192 40757 33726 28262 26609 35952
12233C5952J5960N258j9860p3j164J3596K304k442O731J276O689Q806L79j5261
12219E8151N658Q224J9500J0038L22O110K7000K6875K1278K148k480o339j6061
12206A60424k0816k5683k1802j2923M7L805j2073j8914l243K086L852l901j3514
12193C7345J364P061J516o509j4706j3911M58K9013K978m659j72k667O572J0064
12179E3747M410r092J3201K1634J0061J7268L1110J3653j3661l4814k2976k0388
12167F4153j0823j3235j1914j3664j2910M98J8916q043o820Q78M763o016k522
12154C261J698r629K040K180K998K956p830n017l630N413j7598J4150J6624J1139
12140A8755J1284J9459J8699J1523j940j3234p009j3806j3077j1741j1362n891
$$ plain form
12233 35952 51912 57170 37310 37237 36073 49669 51973 49531 56262 57538 64227 73033 73412 58151
12219 58151 63809 72033 91533 101571 101893 108003 135003 161878 183156 185304 182824 176485 160424
12206 160424 139608 113925 92123 79200 79247 83052 70979 52065 48822 50908 54760 50859 37345
12193 37345 38709 45770 47286 40777 26071 12160 12618 41631 44609 39950 39778 37111 43683 53747
12179 53747 58157 49065 62266 83900 93961 111229 142339 155992 142331 107517 84541 64153
12167 64153 53330 40095 28181 14517 1607 2105 21021 12978 6158 7036 11799 5783 3261
12154 3261 4959 -4670 -2630 -450 2548 5504 -2326 -7343 -10973 -5560 -23158 -9008 7616 18755
12140 18755 30039 49498 68197 79720 77780 64546 57537 43731 30654 18913 7551 1660
12128A660q209o883J2362J5318N552j1728j0701J2783L457J1250J738j194k953
12115B2452L228K960l702k813J0908J4324R630L3389M0328L6551N4208K9911j2473
12102B38901j4729j0192l5426m6608k4208j7176j6595j7531k222j459j7901k739
12090C2115j7289q723j053J0408j395q23J334P893J1993P215l349K757j4558J291
12076B7816J4714J863o669J1129J028J2277J3273K2366J9778J7173N5117L3460
12064B23325O705j4624l8404l2330j4246k5326l0715j8653l674L926M913k0350
12052D0547j5678j1419j5711m016J4884J3539K100o114L428J9399J2786p454K41
12039D6532j1073J6042J1715K5482L1171K4984K3589L39k4812k7029l0515l1443
$$ plain form
12128 1660 -6549 -13432 -1070 14248 19800 8072 -2629 10154 13611 24861 26599 25405 22452
12115 22452 25680 28640 24938 22125 33033 47357 56987 90376 130704 167255 221463 251374 238901
12102 238901 224172 213980 178554 131946 107738 90562 73967 56436 54214 52755 34854 32115
12090 32115 14826 6103 5050 15458 14063 13240 14574 22467 34460 41675 38326 41083 26525 27816
12076 27816 42530 44393 37724 48853 49881 62158 75431 97797 117575 134748 189865 223325
12064 223325 230030 215406 177002 144672 130426 105100 74385 55732 52058 55984 60897 40547
12052 40547 24869 13450 -2261 -6277 8607 22146 24246 18132 21560 40959 53745 46291 46532
12039 46532 35459 51501 63216 88698 119869 144853 168442 168781 143969 116940 86425 54982
12027E4982j2977j4023j1225J4846m976k1268q941k387P744J1056J5298n271j2233
12014A0625N38n233R977k886J7561L066o244q192n026q671Q971N193k369j6472
12000H38o92M946J3047L8716J6490J4697J2849q56q089J236K693k1693l3457j6336
11986B4389k228n373M43j2239j6531k147m540p786j726J3932J758o766M697q551
11972b2668M268J234K788m790K371n122J4930N033o47J3384L362j5661j8694j144
11958b1356J4865R397m517n246p207j2351j2128o29l17L128k866J0874r226J583
11944c5996J3564q954O551R425o821J931j717m101N905K000M688J5401J841j3284
11930i567o371L751J918O94o85q617j6396L038J3970M508l725L714J1935N266
$$ plain form
12027 54982 42005 27982 16757 31603 26627 5359 -3582 -5969 1775 12831 28129 22858 10625
12014 10625 11163 5930 15907 13021 30582 33648 27404 19212 14186 5515 14486 19679 17310 838
12000 838 146 5092 18139 56855 73345 88042 100891 100035 91946 93182 95875 74182 40725 24389
11986 24389 22161 16788 17231 4992 -11539 -13686 -18226 -26012 -27738 -13806 -12048 -18814 -14117 -22668
11972 -22668 -18400 -17166 -14378 -19168 -16797 -21919 -6989 -1956 -2603 10781 14143 -1518 -20212 -21356
11958 -21356 -6491 2906 -1611 -6857 -14064 -26415 -38543 -39172 -39489 -36361 -39227 -28353 -37579 -35996
11944 -35996 -22432 -31386 -24835 -15410 -22231 -20300 -22017 -26118 -20213 -18213 -13525 1876 3717 -9567
11930 -9567 -15938 -12187 -10269 -9575 -10260 -18877 -35273 -32235 -18265 -13757 -17482 -13768 -1833 3433
11916C433j3960p748J3279N081m426q987j3719M80R049J2041l179j0397j2632
11903c1685L438j4753j0615K0394J5031J0581l110J218P080L00k6850Q32L740
11890b4399j0783P042K0115J3882j9552m100O452j7736m374J2P600K722J752j671
11876b3038j2409j949K827O884J0197K59k39n175p954n266o570J4765J2842j362
11862a6188l24J5327l475j9340p184L153J2196K835l247L764j3705M745J1847
11849i596k092K472N692J641j187j636m325m13L185J3732q578j6345l515L889
11835a7076n501p051P72J0934R728M606j940r844k821L86q045k452j876J2152
11821a8028P494R543L158j5454L011J104N654q522p055O728R804K491j8J000J1481
$$ plain form
11916 3433 -10527 -18275 -4996 85 -4341 -13328 -27047 -26567 -17518 -5477 -8656 -19053 -31685
11903 -31685 -28247 -43000 -53615 -33221 -18190 -7609 -10719 -9501 -2421 -2121 -28971 -28139 -24399
11890 -24399 -35182 -28140 -8025 5857 -13695 -17795 -11343 -29079 -33453 -33441 -25841 -23119 -21367 -23038
11876 -23038 -35447 -37396 -34569 -27685 -17488 -17229 -17468 -22643 -30597 -35863 -42433 -27668 -14826 -16188
11862 -16188 -16512 -1185 -4660 -24000 -31184 -28031 -15835 -13000 -16247 -12483 -26188 -21443 -9596
11849 -9596 -11688 -9216 -3524 -1883 -3070 -4706 -9031 -9444 -6259 7473 -1105 -17450 -20965 -17076
11835 -17076 -22577 -29628 -28856 -17922 -8194 -3588 -5528 -15372 -18193 -17807 -25852 -28304 -30180 -18028
11821 -18028 -10534 -991 2167 -13287 -10276 -9172 -3518 -12040 -19095 -12367 -2563 -72 -90 910 12391
11806A2391p68j0599n849p362k332j8004N873L023L207p214l552o104M021R795
11792b3474o850J124P695o232J1363J1770O201J1366j3208j3764J0536J8414n236
11779I705o427l416l836N310O903l927j3318m093P874M674j1848j0653N097P752
11765a0203J3342K437O423k826j1227m602P150M016n573L217P81n758O08r58l673
11750f846o68P793J7895J5863J7465L671n348j0611k842p760j5436k0780L910
11737c694J1443J947R74N063k3k284K97j1416o438L982R774N891J4766l60L512
11722C3434J3100K330j1167j516Q809K592J714O548j4284n305J091R544o789p314
11708C2787j4742R126o222j2226R296o037j5640n05j722J4790K724k277m731K515
$$ plain form
11806 12391 11623 1024 -4825 -12187 -14519 -32523 -26650 -23627 -20420 -27634 -31186 -37290 -33269 -23474
11792 -23474 -30324 -29200 -21505 -27737 -16374 -4604 1597 12963 -245 -14009 -3473 14941 9705
11779 9705 3278 -138 -3974 1336 8239 4312 -9006 -13099 -5225 -551 -12399 -23052 -17955 -10203
11765 -10203 3139 5576 11999 9173 -2054 -6656 494 4510 -1063 2154 2935 -2823 -2215 -3173 -6846
11750 -6846 -7514 279 18174 34037 51502 55173 49825 39214 36372 28612 13176 -7604 -3694
11737 -3694 7749 9696 10670 15733 15710 13426 13723 2307 -4131 -149 9625 15516 30282 29922 33434
11722 33434 46534 48864 37697 36181 44990 47582 49296 55844 41560 36255 37346 46890 40101 32787
11708 32787 18045 27171 20949 8723 18019 11982 -3658 -4163 -5885 8905 11629 9352 4621 7136
11694G136n063l302J4720J0759m09O386J4598o930o480j802j1653j6482l762M639
11680B355Q66j0685j0973J1105R317k867Q839j2324m185j725L822R645P142m217
11666F115p37q844j0668j7259L880R546j6580k140J3730J1700L001j56Q109N90
11652B87k534J956m158m616k105j673m095m200P647J2815j1784o433k792K479
11638a9206n895o288R150J1702r349o064L495L92J88J3128N376j801N856q743
11624h059j3185N443J3026L801n547p647l04L047J262n241Q434O434j0250j041
11610i827O699k511l369Q331m915K235j2386p861k050R664J0765N264l889j8173
11596b2023j2848L755O043l532k729O133L992j640n935l808n861j901K708R65
$$ plain form
11694 7136 2073 -1229 13491 24250 23841 30227 44825 37895 31415 29613 17960 1478 -2284 2355
11680 2355 3221 -7464 -18437 -7332 1985 -882 7957 -4367 -8552 -10277 -6455 3190 10332 6115
11666 6115 5378 -3466 -14134 -31393 -27513 -17967 -34547 -36687 -22957 -11257 -8256 -8412 -303 287
11652 287 -2247 -291 -4449 -9065 -11170 -12843 -16938 -21138 -13491 -676 -12460 -18893 -21685 -19206
11638 -19206 -25101 -31389 -22239 -10537 -19886 -25950 -22455 -22063 -21875 -8747 -3371 -5172 684 -8059
11624 -8059 -21244 -15801 -2775 1026 -4521 -12168 -12472 -9425 -8163 -13404 -4970 1464 -8786 -9827
11610 -9827 -3128 -5639 -9008 -677 -5592 -3357 -15743 -23604 -25654 -15990 -5225 39 -3850 -22023
11596 -22023 -34871 -31116 -25073 -28605 -31334 -25201 -21209 -22849 -28784 -32592 -38453 -40354 -37646 -36681
11582c6681J2884J6195L515N349r14o243j5305o592M34K0305p831N898j2300K30
11568b1056P62m498p234m010m393J0833J7009q795J3226M064l946N01Q014J3494
11554A3971L04L940r575p964r418p173N375K239j847P220J1200M654p597o591
11540a262j5261j928N948P211J1192j1974k217L175j1792Q491L383j0547j1302
11527b6883L958k294j2755J7913N332O431l140n910R989N003l167J47l780r532
11513a8688R299o493o6j276K891p435J970k340m692N927O539j7303k2613O402
11499d7878J3205J3571m190r860L545J8059J404m470j4485j0892m912J2283Q086
11486b6534M819o247P3j2904m902J9214O783N082Q045Q033l404j6057o425J0711
$$ plain form
11582 -36681 -23797 -7602 -4087 1262 348 -5895 -21200 -27792 -27358 -7053 -14884 -8986 -21286 -21056
11568 -21056 -20294 -24792 -32026 -36036 -40429 -29596 -12587 -21382 -8156 -4092 -8038 -7537 477 13971
11554 13971 14275 18215 8640 676 -8742 -15915 -10540 -8301 -10148 -2928 8272 12926 5329 -1262
11540 -1262 -16523 -18451 -12503 -5292 5900 -6074 -8291 -5116 -16908 -8417 -5034 -15581 -26883
11527 -26883 -22925 -25219 -37974 -20061 -14729 -8298 -11438 -17348 -7359 -2356 -5523 -5376 -9156 -18688
11513 -18688 -9389 -15882 -15948 -17224 -14333 -21768 -19798 -22138 -26830 -20903 -14364 -31667 -54280 -47878
11499 -47878 -34673 -21102 -25292 -35152 -31607 -13548 -12144 -16614 -31099 -41991 -46903 -34620 -26534
11486 -26534 -21715 -27962 -27889 -40793 -45695 -26481 -19698 -14616 -6571 1462 -1942 -17999 -24424 -13713
11472a3713n209l160L732J488l776Q981R028k3o205O264k85k963J796K759o23
11457a909l824J586K018l464J19k906l467l292k594k867K087P39n918J1595O498
11442e599p935l381J139j7449q345K3149J1187N215J994j1742J1008K947r204
11429g016R725K759j951j4960j270p104J997J5843n84j1264k958l308R04K1757
11415B570J2359q744q950M160n380j4965j2557l437J2495O914o069j2547r809
11402d3960j1932M860J8028P884n634n489O419J0851P020K1508J93j4291j8442
11389b2985k763J3568M857j4979K929R305N837K238K835q083r801J905K290j623
11375a4470r097K186J0415r222J75K3128j937j3195O81j1003j466j939J671J1595
$$ plain form
11472 -13713 -18922 -22082 -18350 -16862 -20638 -11657 -2629 -2652 -8857 -2593 -2878 -5841 -4045 -1286 -1909
11457 -1909 -5733 -4147 -2129 -5593 -5474 -8380 -11847 -15139 -17733 -20600 -18513 -17774 -23692 -12097 -5599
11442 -5599 -13534 -16915 -15776 -33225 -41570 -18421 -7234 -2019 -25 -11767 -759 2188 -7016
11429 -7016 2709 5468 3517 -11443 -12713 -19817 -17820 -1977 -2561 -13825 -16783 -20091 -19187 2570
11415 2570 14929 6185 -2765 1395 -3985 -18950 -31507 -34944 -22449 -15535 -21604 -34151 -43960
11402 -43960 -55892 -51032 -33004 -25120 -30754 -36243 -29824 -18973 -11953 9555 9748 -4543 -22985
11389 -22985 -25748 -12180 -7323 -22302 -19373 -10068 -4231 -1993 842 -7241 -17042 -15137 -12847 -14470
11375 -14470 -23567 -21381 -10966 -20188 -20013 3115 1178 -12017 -11336 -22339 -23805 -25744 -24073 -12478
11361a2478P201n064q738J812P903Q479k820R03r538r658M050R796J1618O600
11347A0066m229Q530p177p698L665l79j1238n956Q606M498K366L081J3153n041
11333A2247n350l785R783M656j8786j1709L892J398n566m822j735J0677J5066
11320E966j543N854j1996j1929L861J1545L004j1728n996j719l653j1104J9429
11307a0009l987q620j314k764j189l415M074p526J4737K5760M324r230k70L791
11293D362P658J0068q412r791m902p697M953J0994m035m995J1305J1303J086n922
11279A5975j8328j7314Q87J5986J6170M28j5496p443r58o501q243j0318q386P413
11265c6128K470J3881K4305k715J179Q00p892J8694n878j6841O016P147P617q78
$$ plain form
11361 -12478 -5277 -10341 -19079 -17267 -9364 -885 -3705 -2802 -12340 -21998 -17948 -8152 3466 10066
11347 10066 5837 14367 7190 -508 3157 2778 -8460 -14416 -5810 -1312 1054 4135 17288 12247
11333 12247 6897 3112 12895 17551 -1235 -12944 -9052 -7654 -13220 -18042 -19777 -9100 5966
11320 5966 4423 10277 -1719 -13648 -9787 1758 4762 -6966 -12962 -14681 -18334 -29438 -10009
11307 -10009 -13996 -22616 -23930 -26694 -27883 -31298 -27224 -34750 -20013 5747 10071 841 571 4362
11293 4362 12020 22088 13676 3885 -1017 -8714 -3761 7233 3198 -1797 9508 20811 21897 15975
11279 15975 -2353 -19667 -18780 -2794 13376 13804 -1692 -9135 -10093 -16594 -24837 -35155 -43541 -36128
11265 -36128 -33658 -19777 4528 1813 2992 3792 -4100 14594 8716 -8125 -2109 5038 12655 11777
11251A1777l702N287q106p275N651r989O528l227j3441O588J346O094N357K16
11237C104J2667l524l551j4267L409Q733J4827k737p401O0j0173P952L997m279
11223H817p714j1428J6996N790p076O56n898p525J8848j012j862N813J2491j0013
11209A6883j2715n013m540J230r822o87O757O791k243K270J2195R825K791r056
11195A4666o006J842j704M78n262n826j930R854O05N325o12j3787r510l853P557
11180h163J4861M627J264N917Q211J364L365k115k545J0704q288n054l307j0097
11166A0744J1046j904J1170J4235K1462L1695K3553K8139K1774j3352n69j4126
11154A43867k7196j9382k8647k3664j5102O07k743J0275J901j5739j8609j190
$$ plain form
11251 11777 8075 13362 5256 -2019 3632 -6357 171 -3056 -16497 -9909 -8563 -2469 2888 3104
11237 3104 15771 12247 8696 -5571 -2162 6571 21398 18661 11260 11320 1147 9099 13096 8817
11223 8817 1103 -10325 6671 12461 5385 6041 143 -7382 11466 10454 8592 14405 26896 16883
11209 16883 4168 -845 -5385 -4155 -13977 -14664 -7907 -1116 -3359 -1089 11106 20931 23722 14666
11195 14666 8660 10502 8798 9276 4014 -1812 -3742 6112 6717 12042 11430 -2357 -11867 -15720 -8163
11180 -8163 6698 11325 12589 18506 26717 28081 31446 29331 26786 37490 29202 24148 20841 10744
11166 10744 21790 19886 31056 45291 66753 98448 122001 150140 171914 158562 157993 143867
11154 143867 116671 97289 68642 44978 29876 30483 27740 38015 39916 24177 5568 4378
11142D378j2487K974N054N532P89J1748L573o18J307l728K741O959k0647n480
11128B095l278j2735l828J5850J6497J3709Q024k211J6725J1443J4836J6473L1266
11115A24866M8354R4612J06763Q2843J7494l3277m8874o4427p6138p2285n2563
11104A27368m2096k9999q021Q1m453j0883J1791k581J685J0696M24n740q675m987
11090C4610j33o505L692N306J0058r221j2844j1653l428J2676J5878o084j0402
11077B1950n504r980M004R261R816J190r946m32j917n472q125O129J5767L672
11063C0413J476q170k5691K777P40m537p294k562M129J372p502L114J4648M293
11049G206j0231K158O386r288j1690J114R79J7454J0930K163J3665K133j188N677
$$ plain form
11142 4378 -8109 -5135 -81 5451 6240 17988 21561 20943 22250 18522 21263 28222 7575 2095
11128 2095 -1183 -13918 -17746 -1896 14601 28310 36334 34123 50848 62291 77127 93600 124866
11115 124866 173220 267832 374595 457438 474932 441655 392781 328354 252216 179931 127368
11104 127368 85272 55273 47252 47333 42880 31997 43788 41207 42892 53588 54012 48272 39597 34610
11090 34610 34477 27972 31664 36970 47028 37807 24963 13310 9882 22558 38436 32352 21950
11077 21950 16446 6466 10470 19731 29547 30737 20791 20359 18442 12970 4845 10974 26741 30413
11063 30413 31889 23719 -1972 805 1545 -2992 -10286 -12848 -8719 -7347 -14849 -11735 2913 7206
11049 7206 -3025 -867 5519 -3769 -15459 -14345 -13366 4088 15018 17181 30846 32979 31791 37468
11035C7468l603q349K669q292j4454j0991M869M770j13o819J540N351o608P348
11021D786J322l992N84K764N66K630K435J5620Q363r397k0084j0233O24L528j54
11006f38M267J3827q62k2767j943L154K880l65k636J2449M564j862j3045n314
10992h291P593P870M81M794N746k792m91Q012j0651j2024m81o045j071o346j93
10977a3889K0036r32J700O541J467J0289L543L341q738n189O568M094l28k0141
10963H362j8680j1594M459J2654J368J189L609J3783N639j0843J984l642q936
10950f48R67l103M121J726P09l162J0182K5530M256j5837m68n663M640O125m780
10935B4595l127M738N852R184j643j5593q733O782L657K974R71o49j3323m82J704
$$ plain form
11035 37468 33865 25516 28185 19893 5439 -5552 -683 4087 3974 -2845 -1305 4046 -2562 4786
11021 4786 6108 2116 2700 5464 6030 8660 11095 26715 35078 25681 5597 -4636 -4012 -484 -638
11006 -638 3629 17456 16594 -6173 -8116 -4962 -2082 -2447 -5083 7366 11930 10068 -2977 -8291
10992 -8291 -698 7172 7653 12447 18193 15401 14910 22922 12271 247 -234 -6279 -7350 -13696 -13889
10977 -13889 6147 5215 6915 13456 14923 25212 28755 32096 23358 18169 24737 28831 28503 8362
10963 8362 -10318 -21912 -17453 -4799 -3431 -2242 1367 15150 20789 9946 11930 8288 -648
10950 -648 319 -2784 1337 3063 3772 610 10792 36322 40578 24741 24273 18610 23250 29375 24595
10935 24595 21468 26206 32058 41242 39599 24006 15273 22055 25712 28686 29657 29008 15685 15203 16907
10920A6907N415m36q084P570K122j593j1996q885m33K726L890R346k882j4280
10906f13J2774N985k801L855L850J3509J165j2714J577p000l120k21M283Q281
10892B8810q363K314j1871q927M393J9108K249m030n238Q05k945N103J156M13
10878B2977J4618l108l344J39m961n970L519M436n00m795M28P006j1618R895O043
10863C4765n674j4228n657J1316J064j4596q473J1861J685J963M410k640j817
10850A3979M331n054R875N797Q486j6520O420P128O01r475J661k924M45n525L047
10835B2272m131j3423j260P227J0685j8139j7423J2435o19R395J1351j4083j89
10822D098m799L179K217M307J4373j3325J568o378J1974J8027j3064q168M188
$$ plain form
10920 16907 22322 21886 13802 21372 23494 21901 9905 1020 587 3313 7203 16549 13667 -613
10906 -613 12161 18146 15345 19200 23050 36559 37724 25010 26587 19587 16467 16246 20529 28810
10892 28810 20447 22761 10890 1963 6356 25464 27713 23683 18445 19250 16305 21408 22564 22977
10878 22977 37595 34487 31143 31282 26321 20351 23870 28306 27806 23011 23439 30445 18827 28722 34765
10863 34765 29091 14863 9206 20522 21586 6990 -1483 10378 12063 14026 18436 15796 13979
10850 13979 18310 13256 23131 28928 37414 20894 27314 34442 35043 25568 27229 24305 24750 19225 22272
10835 22272 18141 4718 3458 10685 21370 3231 -14192 -1757 -2376 7019 18370 4287 4098
10822 4098 -701 2478 4695 9002 23375 10050 11618 5240 17214 35241 22177 14009 18197
10809A8197M896J0108o8M469O548o149j1944k954j510Q796Q48m447p77m032N163
10794B7144J689M847J055M249N528j429o484M777n761j8134m104R528o208m831
10780A1866k39N072l700M51M210Q776K519p554P026k310l368J2880l718M627N649
10765D2187J950O615o927m590K947K864L181j167k163l740p631J4726J2124Q279
10751F8655P337l388o243k0448l333J307P53j760M11j846R51Q463L768L373L649
10736F1649j6233r569j3099J4771J3595J1596j1316r943P210j412j1127j2358
10724B3764q092M865J9641R570j2896P72Q406N798p051L629o156k461k209j325
10710C6255N01N001P197p052q689J57J3292o8O008k666n506P035Q920o258p963
$$ plain form
10809 18197 23093 33201 33133 37602 44150 38001 26057 23103 21593 30389 31237 26790 26013 21981 27144
10794 27144 28833 33680 34735 38984 44512 43083 36599 41376 35615 17481 13377 22905 16697 11866
10780 11866 11627 16699 12999 13450 17660 26436 28955 21401 28427 26117 22749 35629 31911 36538 42187
10765 42187 44137 50752 43825 39235 42182 45046 48227 47060 44897 41157 33526 48252 60376 68655
10751 68655 75992 72604 66361 45913 42580 43887 44640 42880 43291 41445 42396 50859 54627 58000 61649
10736 61649 45416 35847 22748 37519 51114 62710 51394 41451 48661 47249 36122 23764
10724 23764 15672 20537 40178 49748 36852 37624 46030 51828 44777 48406 42250 39789 37580 36255
10710 36255 36756 41757 48954 41902 33213 33370 46662 46594 52602 49936 44430 51465 60385 54127 46164
10695D6164l61k398K805J1908P35o597Q044Q092j0371k740J2613J3167L143j1213
10681G2991j0226p062j401J2201o275j86M161m083k01Q579m107j6149o803j705
10667C9734m951L233M563K190k747J2171N572pj5986r170j1204M583J0220Q2J4668
10652E2951J2546p035Q78j758p694r030l194N667R574P445M78r589k112j151J036
10637D9012n89l486R200M496j189q398p988K656K228J0565r98K747K497J0209
10623G0962J3176r982q740M050O99J9427J2837L894j1533j3078k0583p061l508
10610E0560J49J5645N936P09j0186m388J4380P358P009p051Q510J4222o697k3152
10596G3004r054Q559p102Q719M829l081n456J2213J1022j1408M718j0062j1797
$$ plain form
10695 46164 45803 43405 46210 58118 58853 52256 60300 68392 58021 55281 67894 81061 84204 72991
10681 72991 62765 55703 54302 66503 60228 60042 64203 60120 59919 68498 64391 48242 41439 39734
10667 39734 34783 38016 42579 44769 42022 54193 59765 59758 43772 34602 23398 27981 38201 38283 52951
10652 52951 65497 58462 59340 57582 49888 40858 37664 43331 52905 60350 60828 51239 49127 47976 49012
10637 49012 48423 44937 54137 58633 57444 49046 41058 43714 45942 56507 55509 58256 60753 70962
10623 70962 84138 74156 65416 69466 70165 89592 102429 106323 94790 81712 61129 54068 50560
10610 50560 50709 66354 72290 72999 62813 58425 72805 80163 87172 80121 88631 102853 96156 73004
10596 73004 63950 72509 65407 74126 78955 75874 70418 82631 93653 82245 86963 76901 65104
10583F5104M075J6028k658m799N424L982J6448K597M937m635j5192n122O939K740
10569I5868j051o130n047m123k278k762O768m770M297J2035P103P948J4074m132
10555A17800j4355n817k1580o917J776k248K529J7360P198k132j0664q251q675
10542F6024m472J2595O685J967m440K546Q525J3793L395j2285j4303R436J4041
10529A03507j242j3257k208M399j1244l609L145P194J0767q299J007l978m785
10516H1397j1479m067J6206P338M94J525K158m946m3L944p901j0639O76N347O162
10501H6172J7072M973L556l55J2748K4598K3391L294j8940n109j2978q886K722
10488A32258q092k1231k418P764M253l180O98O73J0829j9866n854n33o390J1316
$$ plain form
10583 65104 69179 85207 82549 77750 83174 87156 103604 106201 111138 106503 91311 86189 93128 95868
10569 95868 94817 88687 83640 79517 77239 74477 81245 76475 80772 92807 99910 107858 121932 117800
10555 117800 103445 97628 76048 69131 70907 68659 71188 88548 95746 93614 82950 74699 66024
10542 66024 61552 74147 80832 82799 78359 80905 89430 103223 106618 94333 80030 89466 103507
10529 103507 102265 89008 86800 91199 79955 76346 79491 86685 97452 89153 90160 86182 81397
10516 81397 69918 65851 82057 89395 89889 91414 93572 88626 88583 92527 84626 73987 74663 80010 86172
10501 86172 103244 108217 111773 111418 124166 148764 172155 175449 156509 151400 138422 129536 132258
10488 132258 124166 102935 100517 108281 112534 109354 110052 110725 121554 101688 95834 95301 88911 100227
10474A00227J1837Q651J4942k470j4956p911J106L919R279J3854j4205j3586o30
10461A10057L555l7l897R756l211m767o007j830k259N242R907j5919m859K731
10447I8462O005J5295L021j708l80j766L222n558L918O740M188R688p09n498j0485
10432A24435o621J225N900J7075J7482J2441q882J040n647J4915K4022M1640N6071
10419B95096R8166N5715j0405m4819k7983l2927n3513n4200k9392j1308P910J2042
10407B04382q873j3623p160n024j7774r034L009M644m472l918J144j1569m173
10394A27559m013r496N687O508N884K0764p73j627J859m339M652J1748K007Q382
10380A74802q946k771M746N328P231j317j4754m935k223j760M11r826K814r88
$$ plain form
10474 100227 112064 120715 135657 133187 118231 110320 111426 115345 124624 138478 124273 110687 110057
10461 110057 113612 113575 109678 119434 116223 111456 105449 103619 101360 106602 116509 100590 95731 98462
10447 98462 104467 119762 122783 121075 120695 118929 122151 116593 120511 127251 131439 141127 140418 134920 124435
10432 124435 117814 119039 124939 142014 159496 171937 163055 164095 158448 173363 197385 239025 295096
10419 295096 393262 448977 438572 393753 365770 332843 279330 225130 195738 184430 192340 204382
10407 204382 195509 181886 174726 169702 151928 142894 145903 150547 146075 142157 143301 131732 127559
10394 127559 123546 114050 119737 126245 132129 152893 152120 150493 152352 148013 152665 164413 166420 174802
10380 174802 165856 163085 167831 173159 180390 179073 164319 159384 157161 155401 155812 145986 148800 147812
10366A47812J873R226Q798Q520K50j2191k1396N451N136n236O27O544R803r43
10352A64274Q127O471r764l604n770J0918J6752M331r858j0287O136L522p315
10339A73933o159J666J6307n113j0214J72M544n63Q766j339n432o74K223N292
10325A83409Q145O25N176K688j1397m424M119p99j4565O151J6260j830j793K659
10311A94424J4314j6718q163K0476J2393K627p743p233P722q248Q208J3548J2191
10298B37798r317P354J1902n945r484P974o148n11N511J003J1937J1463j8111
10285B45426J953J4658j1329r681P307J1490J172N786l903r056M781J6582k314
10272B72872j0461m207J5293o870j647O848N081O552p458j0529j948K45K3391
$$ plain form
10366 147812 149685 158911 167709 176229 176479 164288 142892 148343 153479 148243 148870 155414 165217 164274
10352 164274 172401 178872 169108 165504 159734 170652 187404 191735 181877 171590 177726 181248 173933
10339 173933 167774 169440 185747 180634 170420 170592 175136 174573 183339 182000 176568 175894 178117 183409
10325 183409 191554 192179 197355 200043 188646 184222 188341 187542 172977 179128 195388 193558 191765 194424
10311 194424 208738 192020 183857 204333 216726 219353 211610 204377 212099 203851 212059 225607 237798
10298 237798 228481 235835 247737 241792 232308 240282 234134 233623 239134 240137 252074 263537 245426
10285 245426 247379 262037 250708 241027 248334 259824 260996 266782 262879 253823 258604 275186 272872
10272 272872 262411 258204 273497 266627 264980 271828 276909 283461 276003 265474 263526 263771 287162
10259B87162P701O147M377L984k394l519m321K843j056L513J4183R515P803J4787
10245C50725J6299J3849J4679J1323M654k442J9942K8617J0352J8096J0084R496
10233E05674M8152M1216L3445N3095P0800J23609J75792K71817L42385L36949
10223B002934K79372L11735M04562K98240r94j38067r9159j18888l34585m20845
10213B184305l78223l02428k54100k06205j43039j07239o5548k6591j9718k7689
10203F53525l3055l4522j2610j4030j3950m05r915j1531k3415m338j184k386K806
10190D94990O134p970j2871J2010J0396R80j448J0776j34r567r114K273j6078
10177D80377J3990J5863j0159R649j64N215J29j515n479j4846M399L731p44J5706
$$ plain form
10259 287162 294863 301010 305387 309371 306977 303458 299137 301980 300924 304437 318620 328135 335938 350725
10245 350725 367024 380873 395552 406875 411529 409087 429029 457646 467998 486094 496178 505674
10233 505674 553826 595042 628487 681582 752382 875991 1051783 1323600 1665985 2002934
10223 2002934 2282306 2594041 2998603 3296843 3295849 3157782 3058623 2939735 2605150 2184305
10213 2184305 1806082 1503654 1249554 1043349 900310 793071 727523 700932 681214 653525
10203 653525 620470 585948 573338 559308 545358 544953 535038 523507 500092 495754 494570 492184 494990
10190 494990 501124 493154 480283 492293 502689 503669 502221 512997 512863 503296 494182 496455 480377
10177 480377 494367 510230 500071 509720 509556 514771 514900 513385 507906 493060 497459 501190 500446 516152
10163E16152R534J1340J2421J0746Q399J2593M902m555j6293k29R639R203R782
10150E93634j969p631J4317J9753P143J036L197J915n85r98J0368J5252J8479
10137F73911l18P49J671P062J8242K533J73m40K1479K7031K6095L3443J8704O323
10123H36658l275K785M158n434j6746j7168J6316K7990J5010j613J1491J2747
10111H82919J8294J3836r99P196J4275K3816J7776J3120J371j857K3449j361J5763
10098A027598K3396N769Q788J2450K6009K9805K919N361J6136K2759L635P575
10086A192200J6766O688J5790K7363L3027J5500J7268K3976J6657K3497K5041
10075A413773q695J2318L3402K7972J8291K1552K0664K6514J6558L0383L2793
$$ plain form
10163 516152 525686 537026 549447 560193 568592 581185 586087 581532 565239 565010 574649 583852 593634
10150 593634 591665 584034 598351 618104 625247 626283 629480 631395 630810 629812 640180 655432 673911
10137 673911 673593 674342 676013 683075 701317 703850 704023 703583 725062 752093 778188 811631 830335 836658
10123 836658 833383 836168 840326 834892 818146 800978 817294 845284 860294 858681 870172 882919
10111 882919 901213 915049 914050 921246 935521 959337 977113 990233 991604 989747 1013196 1011835 1027598
10098 1027598 1050994 1056763 1065551 1078001 1104010 1133815 1136734 1142095 1158231 1180990 1184625 1192200
10086 1192200 1208966 1215654 1231444 1258807 1291834 1307334 1324602 1348578 1365235 1388732 1413773
10075 1413773 1405078 1417396 1450798 1478770 1497061 1518613 1539277 1565791 1582349 1612732 1645525
10064A645525K9435K3430J9439M2180L3251K5284K0646K7073M4526M5180K5833
10053A981802K1565L4123L4505M3485M2116N2551N9827L8007L0110M8472L5471
10042B422034L2101O1653P1623N7191O3856N5329O5670O4447N4164N5501O0899
10031C064468M6141N6807P4714P1257P6046Q2967Q5474Q5969Q1807Q2950J03308
10020C911908J01395J11252J17871J05587R7850R7699J23410J36552J27245J30612
10010E061381J28118J48662J52795J55733J67509J70541J79213J84920J97720
10001F546592K04937K20032K30730K46438K65946K53765K66137K90343K93525
9992H818445L02866L14458L39193L58026L58947L83533M17217M21071M47917M82278
$$ plain form
10064 1645525 1674960 1698390 1717829 1760009 1793260 1818544 1839190 1866263 1910789 1955969 1981802
10053 1981802 2003367 2037490 2071995 2115480 2157596 2210147 2269974 2307981 2338091 2386563 2422034
10042 2422034 2454135 2515788 2587411 2644602 2708458 2763787 2829457 2893904 2948068 3003569 3064468
10031 3064468 3110609 3167416 3242130 3313387 3389433 3472400 3557874 3643843 3725650 3808600 3911908
10020 3911908 4013303 4124555 4242426 4348013 4445863 4543562 4666972 4803524 4930769 5061381
10010 5061381 5189499 5338161 5490956 5646689 5814198 5984739 6163952 6348872 6546592
10001 6546592 6751529 6971561 7202291 7448729 7714675 7968440 8234577 8524920 8818445
9992 8818445 9121311 9435769 9774962 10132988 10491935 10875468 11292685 11713756 12161673 12643951
9982A2643951M97407N10327N42174N62177N90041O16309O54143O92162P20969
9973A8029660P59968P86484Q24332Q42821Q61025Q86055R11085R27562R41446
9964B5770438R38729R45289R47003R39480R45100R14285Q48177P84230P22794
9955C3755525O33269N67297M79534L70541K50426J44638K4667q8921j80002k95726
9945C5661248m28395n29106o09799o94631p54762q13492q63417q88060r01371
9936B9178215r27684r35318r35257r29542r07931q99177q81816q78503q56159
9927B1026828q26433q04558p54580p37074p21784o73785o48290o40099o03811
9918A4616414n74067n39100n06025m90296m74359m59002m38771m05145l89933
$$ plain form
9982 12643951 13141358 13651685 14193859 14756036 15346077 15962386 16616529 17308691 18029660
9973 18029660 18789628 19576112 20400444 21243265 22104290 22990345 23901430 24828992 25770438
9964 25770438 26709167 27654456 28601459 29540939 30486039 31400324 32248501 33032731 33755525
9955 33755525 34388794 34956091 35435625 35806166 36056592 36201230 36225897 36136976 35956974 35661248
9945 35661248 35232853 34703747 34093948 33399317 32644555 31831063 30967646 30079586 29178215
9936 29178215 28250531 27315213 26379956 25450414 24542483 23643306 22761490 21882987 21026828
9927 21026828 20200395 19395837 18641257 17904183 17182399 16508614 15860324 15220225 14616414
9918 14616414 14042347 13503247 12997222 12506926 12032567 11573565 11134794 10729649 10339716
9909A0339716l69247l50795l34672l21052k97545k95836k91943k70310k60582
9900G547734k47446k47282k26156k23754k02251j95951j88213j85499j87968j89966
9890E453248j64298j47391j42526j41046j36076j37094j17277j01668j23616j34275
9880D107981j18764j06174r1086r2010q2159q1994q3201p5143q4087r1628p8119
9869C123616q2438q2540o7253n5510o3101n5073n8964m4004m8721p3965n6684
9858B435363m3731m4561n7453n3672k6472l4657k8163l8163l9659m1659m0351
9847A986822m5905m4056m6526k8078k6381l6025m2803m1152l0192k3980k4668
9836A597056k9559j4980j1685j8626k8507k5344k8622k6584l0615k8182k7829
$$ plain form
9909 10339716 9970469 9619674 9285002 8963950 8666405 8370569 8078626 7808316 7547734
9900 7547734 7300288 7053006 6826850 6603096 6400845 6204894 6016681 5831182 5643214 5453248
9890 5453248 5288950 5141559 4999033 4857987 4721911 4584817 4467540 4365872 4242256 4107981
9880 4107981 3989217 3883043 3791957 3699947 3617788 3535794 3452593 3377450 3293363 3201735 3123616
9869 3123616 3041178 2958638 2891385 2835875 2772774 2717701 2658737 2614733 2566012 2492047 2435363
9858 2435363 2391632 2347071 2289618 2235946 2209474 2174817 2146654 2108491 2068832 2027173 1986822
9847 1986822 1940917 1896861 1850335 1822257 1795876 1759851 1717048 1675896 1645704 1621724 1597056
9836 1597056 1567497 1552517 1540832 1522206 1493699 1468355 1439733 1413149 1382534 1354352 1326523
9825A326523j6496j5014j0864k9257k9522j5063j2775j3281k7622j5106j1305
9814A130218r731q502p701j8299l8306k3271j5478k5627k971q077k2027j8974
9802I31254j2778K89n588j4832j4231j1541j6218j6533r928k1540j4263n138r691
9789G79262o379o106k859k0219q956j829j2090j3827k1475j3468n042k0373k249
9776F44390P921O356k587L072n80j2811j9069j7346j915n474l193j1390q412k233
9762E76729J4407j302p367N497n994j112L640r64k434p008k24N726o67n678q407
9747E64842p490j1069q511j5622k3590p121q642j261m858m933j3871q41j0706
9734D46327R11j592j0492J597l17j0001j014R37q65j9572j8090Q245r80l548J4132
$$ plain form
9825 1326523 1310027 1295013 1284149 1254892 1225370 1210307 1197532 1184251 1156629 1141523 1130218
9814 1130218 1120487 1111985 1104284 1085985 1047679 1024408 1008930 983303 980332 972255 950228 931254
9802 931254 918476 918765 913177 898345 884114 872573 856355 839822 829894 808354 794091 788953 779262
9789 779262 772883 766777 763918 743699 734743 732914 720824 706997 685522 672054 667012 646639 644390
9776 644390 652311 658667 656080 659152 658572 645761 626692 609346 607431 601957 598764 587374 578962 576729
9762 576729 591136 589834 582467 587964 581970 580858 584498 583534 581100 574092 573868 579594 578927 573249 564842
9747 564842 557352 546283 537772 522150 498560 491439 482797 481536 476678 471745 457874 457033 446327
9734 446327 447238 445646 435154 436751 436434 426433 425419 426356 425491 405919 387829 396074 395094 391546 405678
9719D05678J2665k3680l3488j9033j0498K628J5190N997M166q689L300Q398j869
9706C60765r455q644j332O296L634J35o337p281j4017K769J0690J5845J139j807
9692C52400N589J2285o987k8117j9304j1053Q121L197j1901p746O460p423j3559
9679B81962K091j459K802N274o069J060r213j0041O043J0289M334J1593K8582
9666C27248Q587j1222k8598q278j4232o304j4060j0704J518J5148j26j3360p000
9653B38617J968P177j964Q196q883j1240K994P097n151k917J7821Q847P762J7553
9639B87877o77j1720J0255K014p163k093p974j2327K482J293j2432q160j1751
9626B29624m533l386J719p252o593m850M397L3892K0945N688J6946J5305m217
$$ plain form
9719 405678 418343 394663 361175 342142 331644 334272 349462 355459 359625 350936 354236 362634 360765
9706 360765 351310 342666 341334 347630 351264 351399 345062 337781 323764 326533 337223 353068 354207 352400
9692 352400 357989 370274 363287 335170 315866 304813 312934 316131 304230 296484 302944 295521 281962
9679 281962 284053 282594 285396 290670 284601 285661 276448 266407 272450 282739 287073 298666 327248
9666 327248 335835 324613 296015 287737 273505 267201 253141 242437 243955 259103 258977 245617 238617
9653 238617 240585 247762 245798 253994 245111 233871 236865 243962 238811 235894 253715 262562 270324 287877
9639 287877 287200 275480 285735 287749 280586 278493 270519 258192 260674 261967 249535 241375 229624
9626 229624 225091 221705 223424 216172 209579 204729 209126 243018 263963 269651 286597 301902 297685
9613B97685Q97M302n50o150l388j7374j9969p58j3183j5774P277J5362q25J262
9599B48814j7737R25J4036p743n257j5204J161K3896J279n387O083p275m320N613
9585B38884J956K2317K4959M9014K4001Q534K3343L3587J9375J9782J0350K7278
9573E03380O0474R6356J56560J62760O0545j8653k6172k4180q5699j00008q8244
9562F97119p4097p0279m2164j5095M419K7333N0806P6148Q3515Q6317J05589J24527
9550A054138Q2437L3804K8850J4308L186j985j1850j5037k6207l4912m3239m8550
9538A034943n0717l9885l2975j2004L4554Q5485J33091J96816L19916M47897M39155
9527B556276J64000q4390j98998k36313l01445l26062k77494j81892j18272n8097
$$ plain form
9613 297685 298582 302884 302334 296184 292796 275422 255453 254695 241512 225738 233015 248377 247552 248814
9599 248814 231077 232002 246038 238295 233038 217834 218995 242891 244170 238783 244866 237591 233271 238884
9585 238884 240840 263157 288116 337130 361131 369665 393008 426595 445970 465752 476102 503380
9573 503380 563854 660210 816770 979530 1040075 1021422 995250 971070 885371 785363 697119
9562 697119 623022 552743 510579 495484 499903 527236 578042 654190 737705 824022 929611 1054138
9550 1054138 1136575 1170379 1199229 1213537 1216723 1214738 1202888 1187851 1161644 1126732 1083493 1034943
9538 1034943 984226 944341 911366 899362 933916 1019401 1152492 1349308 1669224 2117121 2556276
9527 2556276 2720276 2635886 2436888 2200575 1899130 1573068 1295574 1113682 995410 937313
9517I37313m0541j2210N055k815l199K0435K8618M9389M8004M6563O8948O8742
9505A214302N8555j605m2357l5279o3709j18781j08429r0032n3494m5306m3625
9494F70240j6961J7642M8953Q3231J17698J16889R9437R1284R6574q034j19675
9483A197278j50917j44912j38361j36405r1038n7939m6620k4892j0493j1892j6223
9472C67586k1574k3308j9897m566k1035l3177j3472j3892q497M570P299O732p616
9459B19153m447j0121J0712J2420O822J0097K1131M1553N7350N8340L6841n950
9447D53901k4200l3624j8287m0656m4769k3873k0482j5217j3925k7743j9585j9506
9435A52034m165O377J9034L0473J2265J0618O301o052J592r80j1183k0509j1702
$$ plain form
9517 937313 896772 884562 889617 886802 883603 904038 932656 982045 1030049 1076612 1145560 1214302
9505 1214302 1272857 1271252 1228895 1193616 1129907 1011126 902697 812665 759171 713865 670240
9494 670240 653279 670921 719874 803105 920803 1037692 1137129 1228413 1324987 1316953 1197278
9483 1197278 1046361 901449 763088 626683 535645 477706 431086 406194 395701 383809 367586
9472 367586 346012 322704 302807 298241 277206 244029 230557 216665 208168 212738 220037 226769 219153
9459 219153 214706 204585 215297 227717 234539 244636 265767 307320 364670 423010 459851 453901
9447 453901 429701 396077 377790 337134 292365 268492 248010 232793 218868 191125 171540 152034
9435 152034 147869 154246 173280 203753 216018 226636 232937 226885 228477 227497 216314 195805 184103
9422A84103j5570j3901k1276Q462K827P10oL469N167J4035L300K275j2501j4639
9408A46455Q238K6088K3881J5594J9754K2320N226j6274l4666l2121k3743n929
9396A54823j4959l967P825j515q876j4218j0696P55Q794l21J748M348j1243j1955
9382A00543q436J1775K4955p08J3431o953m804q175j2955j5410j0301J779l196
9369H1545m950k3261j8856J6764j210j634K4285K5056L636j5535j7937j739L507
9356F9671j0416j2704j385o30M143L30o952J830P94k090j986N013O13o656K1828
9341F1403J8534P212j4559n743j1736j0801k426k128P908j686K562p670n919J0600
9327D5551J2708J0936m703k665p761o684K41R316m074L098o822r796O265J4475
$$ plain form
9422 184103 168533 154632 133356 141818 144645 145355 145349 148818 153985 168020 171320 173595 161094 146455
9408 146455 154693 180781 204662 220256 240010 262330 267556 251282 216616 184495 160752 154823
9396 154823 139864 135897 143722 142207 133331 119113 108417 109172 117966 117645 119393 123741 112498 100543
9382 100543 92107 103882 128837 128129 141560 134607 129803 121628 108673 93263 82962 84741 81545
9369 81545 76595 53334 34478 51242 50032 48398 72683 97739 101375 85840 67903 66164 69671
9356 69671 59255 46551 45166 44536 48679 49009 42057 43887 44681 42591 40605 45618 46231 39575 61403
9341 61403 79937 87149 72590 66847 55111 44310 41884 39756 47664 45978 48540 40870 34951 45551
9327 45551 58259 69195 64492 61827 54066 47382 47623 56939 52865 55963 49141 39345 45610 60085
9313F0085O881K858j3470J1714M817M524r393n429J406j164P23j1278O413J6074
9299G4761m510L816N595K675J1419k049p743m529j148j885Q478k632K77J3338
9285I5863K4601J9648K1627o055j5602n724q066m211p511j1031l206o447r859
9272H4027n991j3443O728J0779J6684O251j7401K618J5115K0596Q317L077O536
9259A43893L0904M4326N5406O8486M5942J5257k3913m7348n1676l8115l6946j6932
9247A89284m453j2629Q150J3860J6899K4055L5921M0696K2620J6794J1371J799
9235C64367j5941j9606q014k3396j3115O32r991j2174k637j666O696J9826M7350
9222C32331P0588R4154J10558J07690P8467J2984m8938q6239p4783p6278p3116
$$ plain form
9313 60085 66966 69824 56354 68068 72885 77409 68016 62587 63993 62829 63552 52274 58687 74761
9299 74761 70251 74067 79662 82337 93756 91707 83964 79435 78287 76402 84880 82248 82525 95863
9285 95863 120464 140112 161739 155684 140082 134358 126292 122081 114570 103539 100333 93886 84027
9272 84027 78036 64593 71321 82100 98784 105035 87634 90252 105367 125963 134280 137357 143893
9259 143893 174797 219123 274529 343015 388957 404214 380301 332953 281277 243162 206216 189284
9247 189284 184831 172202 180352 194212 211111 235166 271087 311783 334403 351197 362568 364367
9235 364367 348426 328820 320806 297410 284295 284927 274936 262762 260125 258459 265155 284981 332331
9222 332331 402919 497073 607631 715321 793788 806772 757834 671595 596812 520534 447418
9211D47418p6568n0223j5001r070m618o365j4573Q993J4597K9202J5752J2019
9199C51563Q434M757o22j9125k3446l4036m0224k1435l2611k8018J600j1128j149
9186A54560J2220L0163M1380M4739M1072J7494j0994j9294k9895l6041l9693l8765
9174A66946k1924j9757r124j9946q393J274p325K068J682M893K586k368K889j2758
9160H0743j8734j4987l977O171Q889J6483l521m65j0844l970j0561O041M970o058
9146E0180j324J3026J1999Q535j3290k0927J2062J5901j2067j7042K221l758q789
9133C6727K34k462Q294r042J2029K0596K907n640j60L507l201M38R10j1244L0
9118E3923J5168J850L080M669K956j608j6431l545O722l61p580j9187M986K1051
$$ plain form
9211 447418 370850 320627 305626 296556 291938 285573 271000 279993 294590 323792 339544 351563
9199 351563 359997 364754 364132 345007 321561 287525 247301 225866 193255 165237 166837 155709 154560
9186 154560 166780 196943 238323 283062 324134 341628 330634 311340 281445 245404 205711 166946
9174 166946 145022 125265 116141 96195 87802 89076 81751 83819 85501 90394 92980 90612 93501 80743
9160 80743 62009 47022 43045 49216 58105 74588 71067 70602 59758 55788 45227 51268 56238 50180
9146 50180 48856 61882 73881 82416 69126 48199 60261 76162 64095 47053 49274 45516 36727
9133 36727 36961 34499 42793 33751 45780 66376 69283 63643 63483 66990 63789 64227 65137 53893 53923
9118 53923 69091 70941 74021 78690 81646 80038 63607 60062 66784 66423 58843 39656 44642 65693
9104F5693M337j6720k629q933R27J46L822J9059J249l490m829K185l494l606r826
9089D3891p11j538o331N072k986j055M176l784p077J430K868P026P092N944n027
9074D8990P220R595M15o929p209m266l544R294R901k631n161L457k543m245j758
9059E0586o274J7041j5719l03M606M543M987j789m551O410J6011l642l348q045
9045F0513j2949j3210j010J0050J0155O733J637l820j2240J162L487j748J9373
9032F8133J6520n414m936j0313p621N95J0943J5256o475j737N264q977p014N058
9018F9282O743J0439p770l518j607j1623r556r279J584M192n00J009R823J0123
9004F9342j3959M428K2773L8214J9837J5851J7313K5453K3852O887j3846j4092
$$ plain form
9104 65693 70030 53310 50681 41748 42675 42821 46643 65702 66951 63461 58632 60817 57323 53717 43891
9089 43891 43180 41642 35311 40383 37397 36342 40518 36734 29657 31087 33955 40981 48073 54017 48990
9074 48990 56210 65805 66220 59291 52082 47816 44272 53566 63467 60836 55675 59132 56589 52344 50586
9059 50586 44312 61353 45634 45331 49937 54480 59467 57678 53127 59537 75548 71906 68558 60513
9045 60513 47564 34354 33344 43394 53549 60282 61919 58099 45859 47021 50508 48760 68133
9032 68133 84653 79239 74303 63990 56369 56964 67907 83163 76688 74951 80215 71238 64224 69282
9018 69282 76025 86464 78694 75176 73569 61946 52390 43111 44695 48887 48387 49396 59219 69342
9004 69342 55383 59811 82584 120798 140635 156486 173799 199252 223104 229991 216145 202053
8992B02053j4559l2635l2416j3400K959j827p4J4672j778j228j0617j2440M043
8979A02753j746J6194J5549R177K7092K7576L3444O305j0462j2415p177J106l1273
8966A76123m5047j8159k1453j9856k020Q477J9495P827m010P805J0818j0414j0169
8953I9417q769P296J2288M751J1864J592J297j0704j3040k860O492j080J636j216
8939A08964L878J737J9168J0143J432J337O628N151R907j159P786K844J4859L834
8925A96509M648r303J7832J8144O539J2118J3882K1968K2660K3939N585K3770
8913C58291L3033K3156K8031K9643L9352N3615P8532R0967R0902J18388J28260
8902A072170J27597J44787J95876K23705K10700K49614L33460M96937O93895J020439
$$ plain form
8992 202053 187494 154859 122443 109043 112002 110175 110101 124773 122995 121767 111150 98710 102753
8979 102753 101007 117201 132750 141927 169019 196595 230039 236344 225882 213467 206290 207396 176123
8966 176123 131076 112917 91464 71608 69588 78065 97560 105387 101377 109182 120000 109586 99417
8953 99417 90648 97944 110232 114983 126847 128439 129736 119032 105992 103132 109624 108544 110180 108964
8939 108964 112842 114579 133747 143890 145322 146659 153287 158438 168345 167186 174972 177816 192675 196509
8925 196509 201157 191854 209686 227830 234369 246487 260369 282337 304997 328936 334521 358291
8913 358291 391324 414480 442511 472154 511506 565121 643653 734620 825522 943910 1072170
8902 1072170 1199767 1344554 1540430 1764135 1974835 2224449 2557909 3054846 3748741 4769180
8892D769180J564392K478210L920216N327032M402005R12232j776943k569513
8884A9026811k927033l700085l544117k523606j594956r88158o53761m35246l09361
8875B350488k44008k13577j84234j57893j52450j42412j43738j45288j19913j05140
8865G41835j00658n9273m9569m9981l8344k6960k1394l2536l7126k5525l1013
8854B69456k6499j1274p214k6915k6767k006P750k201o562k160j0859j5853r681
8841A29215n791o48K275j4032n060o530j7444k761o88j0786j5133L505Q090l90
8827F3822J984O64J090m360r740k948Q974N227j7691q287J719J2903o392L109
8813E0074M550j4725l041L357p969l305k830K635o904n246J9317Q123m15j419
$$ plain form
8892 4769180 6333572 8811782 12731998 18059030 22461035 23373267 21596324 19026811
8884 19026811 16099778 12399693 8855576 6331970 4737014 3748856 3095095 2659849 2350488
8875 2350488 2106480 1892903 1708669 1550776 1398326 1255914 1112176 966888 846975 741835
8865 741835 641177 581904 532335 482354 444010 417050 395656 363120 325994 300469 269456
8854 269456 242957 231683 224469 197554 170787 168781 176531 174330 167768 165608 154749 138896 129215
8841 129215 123424 122776 125051 111019 105959 99429 81985 79224 78536 67750 52617 56122 64212 63822
8827 63822 65806 66470 67560 63200 53460 50512 59486 64713 47022 38735 40454 53357 46965 50074
8813 50074 54624 39899 36858 40215 32246 28941 26111 28746 21842 16596 35913 44036 43621 42202
8799D2202j5175j3896J8545K1944J2440M347j5347k0914j2169L368J4640m662
8787C5323j956L958L427L780J5842P174m091j0164p402L083J6925J7032J884L702
8773H8517M500J1972q721l922L581q205l23Q378r816k1772M994P553L546K456
8759H2738J591m753j1527m194j0001K660J4791k904o07O23l046N571M694Q054
8745H3690K4053J6673J1675K326L055P216L273P774K6359L7914N1777O7339N0113
8732C93237L7351J867k9991m4422n3416m9391m7870k5798j7921m169m740k8497
8720A26240o908J4400M45J415P485K3297K4527M1367N5308M3567L1428K7859J598
8707C92028l6785l3551m5050m5636m3422k4831r260M336Q40l767o225j5307j0519
$$ plain form
8799 42202 27027 13131 31676 53620 66060 70407 55060 34146 21977 25345 39985 35323
8787 35323 33367 37325 40752 44532 60374 67548 63457 53293 45891 48974 65899 82931 84815 88517
8773 88517 93017 104989 96268 92346 95927 87722 87399 95777 85961 64189 69183 76736 80282 82738
8759 82738 84329 79576 68049 63855 53854 56514 71305 68401 67794 68417 65371 70942 75636 83690
8745 83690 107743 124416 136091 138417 141472 148688 151961 159735 186094 224008 275785 343124 393237
8732 393237 430588 432455 402464 358042 304626 255235 207365 181567 163646 159477 154737 126240
8720 126240 119332 133732 134177 135592 143077 166374 190901 232268 287576 331143 362571 390430 392028
8707 392028 355243 321692 276642 231006 187584 162753 153493 157829 158669 154902 148677 133370 122851
8694A22851j6232j4185o882J275N816j186J2490R760m234R71j2283M021J7899
8681A20081n068j6670r073Q457K972M187K406M321J755o675o284P470l315p143
8667I7421O084O97J1083J4188J0430n735P889L671l388m99Q289J4528J4923J3514
8653A93095O655m110K498L558r28j2171m808k33K1719j135l66o951J1151R521
8639B17495J2775J1047j8932k3230k0252J610K5448J3838L922R614J2457J3644
8627B59436J4683L4781K4975J5713K2966K1401K7862J1285J3268K6505L5623L5062
8615E43560M3890M8396L6022K9213Q885j1148k4696o0113p6172o2194n9024l8638
8603C77981m3290m4909l0975k9003k4657l3497k8846r179K002p367j5258o919
$$ plain form
8694 122851 106619 92434 85552 86827 92643 91457 103947 113707 109473 110444 98161 102182 120081
8681 120081 115013 98343 89270 97727 100699 104886 107292 111613 113368 106693 100409 107879 104564 97421
8667 97421 103505 104202 115285 129473 139903 134168 142057 145728 142340 141841 150130 164658 179581 193095
8653 193095 199750 195640 198138 201696 200768 188597 183789 183556 205275 204140 203774 196823 207974 217495
8639 217495 230270 241317 222385 199155 178903 180513 205961 219799 223721 233335 245792 259436
8627 259436 274119 308900 333875 349588 372554 393955 421817 433102 446370 472875 508498 543560
8615 543560 587450 635846 671868 701081 709966 698818 674122 614009 537837 475643 416619 377981
8603 377981 334691 289782 258807 229804 205147 171650 142804 133625 135627 128260 113002 106083
8591A06083J125l794j9926q877P178m820o89Q147P529l828q541Q140j958P147
8577I2916N443P437J8115J2962J4152L7091J7505L227m498o813j1033o321j9137
8564A61046k1820j5100k3863j4045o847j9378k1014P941J64k069j824j757l906
8551C7528O541q945l621K972L334k246L954l618N953l090k343K266L792L070O42
8536D6189L412k21K0107J2517L715L391J316P153j2567l3497j1062j276P918M170
8522E1265K096j494M849J1737J6692J8156L227m315k404n23j3419j3516j2245
8509F0106k012j3703m948r37l638n971L900n265n27m852N756Q300L98j149O374
8494D1832P328J0039L817J4005J8129J1127J8633R343k224j0496j124J0416J9207
$$ plain form
8591 106083 107208 103414 83488 74611 81789 76969 76280 84427 91956 88128 79587 87727 85769 92916
8577 92916 98359 105796 123911 136873 151025 188116 205621 208848 204350 197537 186504 180183 161046
8564 161046 139226 124126 100263 86218 79371 59993 38979 46920 47084 45015 43191 41434 37528
8551 37528 44069 35124 31503 34475 37809 35563 39517 35899 41852 38762 36419 38685 42477 45547 46189
8536 46189 49601 49380 69487 82004 85719 89110 90426 97579 85012 51515 40453 39177 47095 51265
8522 51265 53361 51867 56716 68453 85145 103301 106528 102213 99809 99286 85867 72351 60106
8509 60106 58094 44391 39443 38506 34868 28897 32797 27532 27005 22153 27909 36209 36607 35458 41832
8494 41832 49160 59199 63016 77021 95150 106277 124910 134253 132029 121533 120409 130825 150032
8481A50032J2484J1034N614J303p093k4509k0147m623j1923j5904p604j6241j4070
8468E8353q358q495l238j212l548J050n814m137O808q346k1352Q574J4563j5038
8454I810L033m504j0348M343O768K581K1252o382k1667K473j0772J5939J2348
8441B4874l940l318r972o117j0438n055K1531J199O985p725o288n396J0201K6871
8427C3412O810L86J3915J5850R488k834j2449j6539j914o342j4907l30p365M67
8413A7648J2551n142k646j0377l211n805M293l630j000m354r792N79N048N760
8399g8qj0566M585K213M871P725P82l231r739Q451l760J4648k173k387R686J530
8383B2549m770p901j181k370O116P580m167J0736j3947r574n509p470Q719j963
$$ plain form
8481 150032 162516 173550 179164 180467 173374 148865 128718 124095 112172 96268 88664 72423 58353
8468 58353 49995 41500 38262 37050 33502 34552 28738 24601 31409 23063 1711 10285 24848 9810
8454 9810 12843 8339 -2009 2334 9102 11683 32935 26553 4886 7359 -3413 12526 24874
8441 24874 20934 17616 7644 1527 -8911 -13966 7565 8764 15749 8024 1736 -3660 6541 33412
8427 33412 40222 40608 54523 70373 79861 77027 64578 48039 46125 39783 24876 24546 17181 17648
8413 17648 30199 25057 22411 12034 8823 3018 7311 3681 2681 -1673 -11465 -10886 -5838 -78
8399 -78 -86 -10652 -6067 -3854 1017 8742 9524 6293 -3446 5005 1245 15893 13720 11333 21019 22549
8383 22549 17779 9878 8697 6327 12443 20023 15856 26592 12645 3071 -2438 -9908 -1189 -3152
8369c152j3745K27L289J1940M529o947q029P378Q204J0468l994j7907j8591Q207
8355a8123J7624J0941K516j5161l16Q885m786p473k3099M216J5785m60l102M34
8341a2119m97N474L941l562j2620K147R802n729p317P153P859j5601J403m846
8327b4512o07P442K8972M166N615k94n070n078R976O744n808q292j0116J85k444
8312H79k628R775J3160L101k0398j7239m571p739P44J4446L446j3918q201M525
8298b4618j883O805J6554P893o424o242M550j526O136n239j9834K335m091p077
8284c2661o718J5240J6327N730k585j3100P383k509R165K936J801o703R294J4721
8270A8321r722j3701k733j383L622R02N859q508j4938r12J1652L614j119Q519
$$ plain form
8369 -3152 -16897 -16670 -13381 -1441 3088 -3859 -11888 -4510 3694 14162 10168 -7739 -26330 -18123
8355 -18123 -499 10442 12958 -2203 -2519 6366 1580 -5893 -28992 -24776 -8991 -9451 -12553 -12119
8341 -12119 -12616 -7142 -3201 -6763 -19383 -17236 -7434 -13163 -20480 -13327 -5468 -21069 -19666 -24512
8327 -24512 -25119 -17677 11295 15461 21076 20782 15712 10634 20610 27354 21546 13254 3138 3323 879
8312 879 -1749 8026 21186 24287 3889 -13350 -17921 -25660 -24916 -10470 -7024 -20942 -29143 -24618
8298 -24618 -26501 -19696 -3142 4751 -1673 -7915 -3365 -4891 1245 -3994 -23828 -21493 -25584 -32661
8284 -32661 -39379 -24139 -7812 -2082 -4667 -17767 -10384 -12893 -3728 -792 1009 -5694 3600 18321
8270 18321 8599 -5102 -7835 -9218 -5596 -4694 1165 -7343 -22281 -23193 -11541 -7927 -9046 -527
8256e27M226L632j2265q687J0691J0219r042j7241J0609Q116j335j6651L939J2264
8242b052n706q201j3808Q686J0097K09J1366O39K452j1281o068Q387N779P095
8228G594n100M486O76j3896l564j041k978j2332R26M841J2109P434j289R842j3035
8213e327o937R333k08k380j233l717J507m949r314L556L196P097J0440L766N35
8198E365M430l668J1666l92j1217q249m775J7752O244k003m093r243J564J6640
8184B0021J295j8409k27q94m137J0086j1304J124Q865r514o980l605j0442j2769
8170c6890R321O530K2590M652q842N417J3059M223N577M80j9794j8148l291J0044
8156e072P837J7105N85R797p394j624m100J419L104j3212q015r465m621j118J0018
$$ plain form
8256 -527 3699 7331 -4934 -13621 -2930 7289 -1753 -18994 -8385 -269 -1604 -18255 -14316 -2052
8242 -2052 -7758 -15959 -29767 -21081 -10984 -10775 591 1230 3682 -7599 -13667 -5280 499 7594
8228 7594 2494 6980 7656 -6240 -9804 -10845 -13823 -26155 -25229 -20388 -8279 -845 -2134 7708 -5327
8213 -5327 -12264 -2931 -3139 -5519 -6752 -10469 -8962 -13911 -23225 -19669 -16473 -9376 1064 4830 5365
8198 5365 9795 6127 17793 17401 6184 -2065 -6840 10912 17156 15153 11060 1817 3381 20021
8184 20021 21316 2907 2680 1786 -2351 7735 -3569 -2445 6420 -3094 -10074 -13679 -24121 -36890
8170 -36890 -27569 -21039 1551 6203 -2639 2778 15837 20060 25637 26117 6323 -11825 -15116 -5072
8156 -5072 2765 19870 20455 30252 22858 21234 17134 18553 21657 8445 430 -9035 -13656 -14774 -4756
8141d756R251P41J946k263j8066J0788R966Q977J0099n562N694L771m757M639
8127C0468j883M658l2015q487J1824q861n587j327o32l789J0125n820M177K289
8113d860j909j491L223J2144k036K049J338q839k628K092J618N583J189q229M744
8098C988r16J880M252K028j1707r828K475m831J2517J1721Q667o91j4225l828
8084A502N821K2415J4427Q26K376j635o317p194K751q92R557J46n042O70J1648
8069E1059N244q05Q226M853J744P44P353j7624j6528R278J2549n705L278l293
8055F0373o470O944j2791N878K521l36l999J580j1307j0380K3223K1973L07R661
8041H7177P232J2925J947N67r993j3325L288N802j9764j8975R093O506j0459Q125
$$ plain form
8141 -4756 4495 5236 7182 4919 -13147 -2359 7607 16584 26683 21121 26815 30586 25829 30468
8127 30468 28585 33243 1228 -7259 4565 -4296 -9883 -11210 -11842 -15631 -5506 -11326 -7149 -4860
8113 -4860 -6769 -8260 -5037 7107 5071 7120 8458 -381 -3009 -917 701 6284 7473 -756 3988
8098 3988 3072 4952 9204 11232 -475 -10303 -7828 -12659 -142 11579 20246 19555 5330 1502
8084 1502 7323 29738 44165 44991 47367 45732 39415 32221 34972 34080 43637 43783 38741 39411 51059
8069 51059 56303 55498 63724 68577 70321 71065 78418 60794 44266 53544 66093 60388 63666 60373
8055 60373 53903 60847 48056 53934 56455 56119 52120 53700 42393 32013 55236 77209 77516 87177
8041 87177 94409 107334 109281 109848 99855 86530 89818 95620 75856 56881 65974 72480 62021 70146
8027G0146Q146L016J9265P223P825r014J635P163K373M90J4763k020j1745j8836
8013A00430q521q961m177M524k166j3105l805n590j68o066j520k47l662r540O411
7998D3837m172j6837J1838J0695R114K208L812J2192L826j3726o034K97J3306
7985G0356K621K557m156p586O42N664n495p476K2708P03j300L896R453k119r152
7970H1316O97j5515j3858l60o149j3837P175O910N084l235m019j3177L388n752
7956B8668o000N091j0382J3702J213R340k135k261r299j6729J170j2564Q645J4989
7942B3448J3044L771R154n756q061L032k643p394R035J6014K216n83j5366j7662
7928B2249j7361m128J8169R972q116J03Q794p860m882K904n155k686M698m976
$$ plain form
8027 70146 78292 81308 100573 107796 115621 106607 108242 115405 117778 118268 133031 131011 119266 100430
8013 100430 91909 82948 78771 83295 81129 68024 64219 58629 58461 52395 50875 50628 46966 37426 43837
7998 43837 39665 22828 34666 45361 54475 56683 60495 72687 76513 62787 56753 57050 70356
7985 70356 72977 75534 71378 63792 64434 70098 64603 57127 79835 80538 79238 83134 92587 90468 81316
7970 81316 82013 66498 52640 52280 46131 32294 39469 46379 51463 48228 44209 31032 34420 28668
7956 28668 22668 27759 17377 31079 32292 41632 39497 37236 27937 11208 12378 -186 8459 23448
7942 23448 36492 40263 49417 43661 35600 38632 35989 28595 37630 53644 55860 55277 39911 22249
7928 22249 4888 760 18929 28901 20785 20888 29682 21822 16940 19844 14689 12003 16701 11725
7914A1725r346J18q962j424K2223L282p869k278L819j1805q120J1952J2023n365
7900I973j0431j437K638n807J420k464L168j401M130o96r389l982N960R593j6654
7885a5379j1605L8235J8901j2517j5725j1224L278P470l100P123J6765l431o514
7872A2277J0003j4553q202q707j3014M725J110O411L926J213O088N03q993R628
7858B415M15k583n701M8K496o452n340P124P623n874p092p23J709j929n817l94
7842b0075Q732K967n092k0601k400J496R180R468p134j0352O670P374P784O255
7828e728j4259j0326J8183J2270m90m237M392j766q473J463k855m80k991j0949
7814b6246Q182m953J1446o113j3712K797R19k1525n874J1734J0516P324L067j0173
$$ plain form
7914 11725 2379 2497 -6465 -7889 14334 17616 9747 7469 11288 -517 -8637 3315 15338 9973
7900 9973 -458 -1895 743 -5064 -3644 -6108 -2940 -4341 -211 -907 -10296 -14278 -8318 1275 -15379
7885 -15379 -26984 11251 30152 17635 1910 -9314 -6036 1434 -1666 5457 22222 18791 12277
7872 12277 22280 7727 -475 -9182 -22196 -17471 -16361 -9950 -6024 -4811 1277 1780 -7213 2415
7858 2415 2830 247 -5454 -5406 -2910 -9362 -14702 -7578 45 -5829 -12921 -13644 -11935 -13864 -19681 -20075
7842 -20075 -11343 -8376 -13468 -34069 -36469 -34973 -25793 -16325 -23459 -33811 -27141 -19767 -11983 -5728
7828 -5728 -19987 -30313 -12130 140 -350 -4587 -195 -1961 -10434 -8971 -11826 -12306 -15297 -26246
7814 -26246 -18064 -23017 -11571 -17684 -31396 -28599 -27680 -49205 -55079 -43345 -32829 -25505 -22438 -32611
7800c2611L634J8627j299L25N691k940j6131P434P327J0174Q182m504k4858k846
7786b3795J0364L220l909J401k632J567O288K0278P823L984m962p896K716j1470
7772B977j7564o464q829N727Q038n140q5k274l709o60N93p621m166J0607P099
7757b1471o202k179k76l373Q68N076Q314N496J0017j0959n816M999L398q687L647
7742a7148l248p80j1326k464Q997J5324L742L876n929j5724L883Q87q38n910j2230
7727c8888m964j414J7703R316j1860j7811m661R957K5468Q251n585p145k931k643
7713b7207n577J4899M85r768o82K1275k006l611J0964L13j3503n619Q851K94j0542
7698b1434R284L639o874j7745J0521J5554j2632j7201J3126m224k127O096j2853
$$ plain form
7800 -32611 -28977 -10350 -11649 -11324 -5633 -8573 -24704 -17270 -9943 231 8413 3909 -20949 -23795
7786 -23795 -13431 -10211 -14120 -12719 -15351 -13784 -7496 12782 20605 24589 19627 11731 14447 2977
7772 2977 -14587 -21051 -29880 -24153 -16115 -21255 -21340 -23614 -27323 -27983 -27390 -35011 -39177 -28570 -21471
7757 -21471 -27673 -29852 -30128 -33501 -32633 -27557 -19243 -13747 -3730 -14689 -20505 -15506 -12108 -20795 -17148
7742 -17148 -20396 -21176 -32502 -34966 -25969 -10645 -6903 -3027 -8956 -24680 -20797 -19910 -20748 -26658 -38888
7727 -38888 -43852 -45266 -27563 -18247 -30107 -47918 -52579 -42622 -17154 -8903 -14488 -21633 -24564 -27207
7713 -27207 -32784 -17885 -17400 -27168 -27850 -6575 -8581 -12192 -1228 -915 -14418 -20037 -11186 -10892 -21434
7698 -21434 -12150 -8511 -15385 -33130 -22609 -7055 -19687 -36888 -23762 -27986 -30113 -24017 -36870
$$ [...]
##END NTUPLES=NMR SPECTRUM
##END=
