##TITLE=Analysis number 314743
Compound Code cc 43101
Book Reference 414/140/3
Project Code adrs
Chemist Name mattw
##JCAMPDX= 6.0         $$ Bruker NMR JCAMP-DX V2.0
##DATA TYPE= NMR SPECTRUM
##DATA CLASS= NTUPLES
##ORIGIN= Bruker BioSpin GmbH
##OWNER= NMR
$$ XWIN-NMR		Version 3.5
$$ Tue Nov  1 11:37:23 2005 GMT Standard Time (UT+0h)  MAYBRIDGE\NMR@NMR_250MHZ
##.OBSERVE FREQUENCY= 250.131544655141
##.OBSERVE NUCLEUS= ^1H
##.ACQUISITION MODE= SIMULTANEOUS (DQD)
##.ACQUISITION SCHEME= undefined
##.AVERAGES= 16
##.DIGITISER RES= 18
##SPECTROMETER/DATA SYSTEM= dpx250
##.PULSE SEQUENCE= zg30
##.SOLVENT NAME= DMSO
##.SHIFT REFERENCE= (INTERNAL, DMSO, 0, 16.522)
##AUDIT TRAIL= $$ (NUMBER, WHEN, WHO, WHERE, WHAT)
$$ ##TITLE= Audit trail, XWIN-NMR		Version 3.5
$$ ##JCAMPDX= 5.01
$$ ##ORIGIN= Bruker BioSpin GmbH
$$ ##OWNER= NMR
$$ C:\u/data/dgb/nmr/ADRS/11710/pdata/1/auditp.txt
$$ ##AUDIT TRAIL=  $$ (NUMBER, WHEN, WHO, WHERE, WHAT)
(   1,<2005-11-01 11:37:05.66 +000>,<MAYBRIDGE\NMR>,<NMR_250MHZ>,
      <created by zg, POWCHK disabled, PULCHK disabled
       configuration hash MD5:
       62 19 C7 07 E1 42 D1 B7 37 6C 3D D0 77 39 F9 E6
       data hash MD5: 64K
       91 13 AB B3 D3 FD B1 D3 AB 48 ED 8E 88 BB E0 CC>)
(   2,<2005-11-01 11:37:16.39 +000>,<MAYBRIDGE\NMR>,<NMR_250MHZ>,
      <Start of raw data processing
       ef LB = 0.3 FT_mod = 6 PKNL = 1 SI = 32K 
       data hash MD5: 32K
       A4 A4 D6 FE 98 CD 58 CE 43 38 66 3F D8 C9 6A F2>)
(   3,<2005-11-01 11:37:18.21 +000>,<MAYBRIDGE\NMR>,<NMR_250MHZ>,
      <apk 
       data hash MD5: 32K
       8C 59 1C 7E 73 45 EE F2 33 0D 1B FD 41 53 89 E9>)
(   4,<2005-11-01 11:37:18.91 +000>,<MAYBRIDGE\NMR>,<NMR_250MHZ>,
      <abs ABSG = 5 
       data hash MD5: 32K
       91 EA 50 EF 7E 29 BB 1F 5A 4B 53 72 24 7C 3C 47>)
$$ ##END=
$$ 
$$ hash MD5
$$ 05 05 7D 8F DC 7C F5 69 B1 4A 32 C4 D6 DF 76 6C
##$RELAX= 
##$RELAX= 
##$RELAX= 
##$RELAX= 
##$RELAX= 
##$RELAX= 
##$RELAX= 
$$ Bruker specific parameters
$$ --------------------------
##$DU= <C:\u>
##$EXPNO= 11710
##$NAME= <ADRS>
##$PROCNO= 1
##$TYPE= <nmr>
##$USER= <dgb>
##$AMP= (0..31)
100 100 100 100 100 100 100 100 100 100 100 100 100 100 100 100 100 100 
100 100 100 100 100 100 100 100 100 100 100 100 100 100 
##$AQSEQ= 0
##$AQ_mod= 3
##$AUNM= <au_zg>
##$AUTOPOS= <9 >
##$BF1= 250.13
##$BF2= 250.13
##$BF3= 250.13
##$BF4= 250.13
##$BF5= 500.13
##$BF6= 500.13
##$BF7= 500.13
##$BF8= 500.13
##$BYTORDA= 1
##$CFDGTYP= 0
##$CFRGTYP= 5
##$CHEMSTR= <none>
##$CNST= (0..31)
1 1 145 1 1 1 1 1 1 1 1 1 1 1 1 1 1 1 1 1 1 1 1 1 1 1 1 1 1 1 1 1 
##$CPDPRG= <>
##$CPDPRG1= <>
##$CPDPRG2= <>
##$CPDPRG3= <>
##$CPDPRG4= <mlev>
##$CPDPRG5= <mlev>
##$CPDPRG6= <mlev>
##$CPDPRG7= <mlev>
##$CPDPRG8= <mlev>
##$CPDPRGB= <>
##$CPDPRGT= <>
##$D= (0..31)
0 1 0 0 0 0 0 0 0 0.06 0 0 0 0 0 0 0.0002 0 0 0 0 0 0 0 0 0 0 0 0 0 0 
0 
##$DATE= 1130845024
##$DBL= (0..7)
120 120 120 120 120 120 120 120 
##$DBP= (0..7)
150 150 150 150 150 150 150 150 
##$DBP07= 0
##$DBPNAM0= <>
##$DBPNAM1= <>
$$ [...]
##$SUBNAM7= <"">
##$SUBNAM8= <"">
##$SUBNAM9= <"">
##$SW= 20.6930455092707
##$SWIBOX= (0..15)
0 0 3 0 0 0 0 0 0 0 0 0 0 0 0 0 
##$SW_h= 5175.983436853
##$TD= 65536
##$TD0= 1
##$TE= 295.16
##$TE2= 300
##$TE3= 300
##$TEG= 300
##$TL= (0..7)
0 120 120 120 120 120 120 120 
##$TP= (0..7)
150 150 150 150 150 150 150 150 
##$TP07= 0
##$TPNAME0= <>
##$TPNAME1= <>
##$TPNAME2= <>
##$TPNAME3= <>
##$TPNAME4= <>
##$TPNAME5= <>
##$TPNAME6= <>
##$TPNAME7= <>
##$TPOAL= (0..7)
0.5 0.5 0.5 0.5 0.5 0.5 0.5 0.5 
##$TPOFFS= (0..7)
0 0 0 0 0 0 0 0 
##$TUNHIN= 0
##$TUNHOUT= 0
##$TUNXOUT= 0
##$USERA1= <user>
##$USERA2= <user>
##$USERA3= <user>
##$USERA4= <user>
##$USERA5= <user>
##$V9= 5
##$VALIST= <valist>
##$VCLIST= <CCCCCCCCCCCCCCC>
##$VD= 0
##$VDLIST= <DDDDDDDDDDDDDDD>
##$VPLIST= <PPPPPPPPPPPPPPP>
##$VTLIST= <TTTTTTTTTTTTTTT>
##$WBST= 1024
##$WBSW= 4
##$XGAIN= (0..3)
0 0 0 0 
##$XL= 0
##$YL= 0
##$YMAX_a= 523279
##$YMIN_a= -440998
##$ZGOPTNS= <>
##$ZL1= 120
##$ZL2= 120
##$ZL3= 120
##$ZL4= 120
##$ABSF1= 16.522
##$ABSF2= -4.171173
##$ABSG= 5
##$ABSL= 3
##$ALPHA= 0
##$AQORDER= 0
##$ASSFAC= 0
##$ASSFACI= 0
##$ASSFACX= 0
##$ASSWID= 0
##$AUNMP= <proc_1d>
##$AZFE= 0.1
##$AZFW= 0.1
##$BCFW= 0
##$BC_mod= 0
##$BYTORDP= 0
##$COROFFS= 0
##$CY= 12.5
##$DATMOD= 1
##$DC= 0
##$DFILT= <>
##$DTYPP= 0
##$F1P= 14.0000005364418
##$F2P= -0.99999901652339
##$FCOR= 0.5
##$FTSIZE= 32768
##$FT_mod= 6
##$GAMMA= 0
##$GB= 0
##$INTBC= 1
##$INTSCL= 1
##$ISEN= 128
##$LB= 0.3
##$LEV0= 0
##$LPBIN= 0
##$MAXI= 10000
##$MC2= 0
##$MEAN= 0
##$ME_mod= 0
##$MI= 0
##$NCOEF= 0
##$NC_proc= -5
##$NLEV= 6
##$NOISF1= 0
##$NOISF2= 0
##$NSP= 0
##$NTH_PI= 0
##$NZP= 0
##$OFFSET= 16.522
##$PC= 1
##$PHC0= 66.01816
##$PHC1= 4.111855
##$PH_mod= 1
##$PKNL= yes
##$PPARMOD= 0
##$PSCAL= 4
##$PSIGN= 0
##$REVERSE= no
##$SF= 250.13
##$SI= 32768
##$SIGF1= 0
##$SIGF2= 0
##$SINO= 400
##$SIOLD= 32768
##$SREGLST= <1H.DMSO>
##$SSB= 0
##$STSI= 32768
##$STSR= 0
##$SW_p= 5175.98343685301
##$SYMM= 0
##$S_DEV= 0
##$TDeff= 65536
##$TDoff= 0
##$TI= <Analysis number 999999
Compound Code 99
Book Reference 9
Project Code 9>
##$TILT= no
##$TM1= 0
##$TM2= 0
##$TOPLEV= 0
##$USERP1= <user>
##$USERP2= <user>
##$USERP3= <user>
##$USERP4= <user>
##$USERP5= <user>
##$WDW= 1
##$XDIM= 32768
##$YMAX_p= 438215431
##$YMIN_p= -442408
$$ End of Bruker specific parameters
$$ ---------------------------------
##NTUPLES= NMR SPECTRUM
##VAR_NAME=  FREQUENCY,     SPECTRUM/REAL,   SPECTRUM/IMAG
##SYMBOL=    X,             R,               I
##VAR_TYPE=  INDEPENDENT,   DEPENDENT,       DEPENDENT
##VAR_FORM=  AFFN,          ASDF,            ASDF
##VAR_DIM=   32768,         32768,           32768
##UNITS=     HZ,            ARBITRARY UNITS, ARBITRARY UNITS
##FACTOR=    0.157963299565203, 1,           1
##FIRST=     4132.6476996994, 0,             0
##LAST=      -1043.33573715361, 0,           0
##MIN=       -1043.33573715361, -442408,     0
##MAX=       4132.6476996994, 438215431,     0
$$ Real data points
##PAGE= N=1
##DATA TABLE= (X++(R..R)), XYDATA
$$ [...]
$$ plain form
17851 175729908 180495282 169729927 153549820 141293930 139668304 149575776 165144001
17844 165144001 173340852 163832930 139703441 110186314 82620138 61356674 46720480
17837 46720480 37142000 30934751 26767760 24151635 22672422 22022709 22039643 22615986 23627965
17828 23627965 25512130 28859559 34306341 43184448 57529505 79339053 109844925 144065435
17820 144065435 168714088 173810821 163746304 148250662 136457652 134956316 144999398
17813 144999398 161312500 170600927 161699828 137561766 107754693 79560306 57555196
17806 57555196 42290382 32042115 25371665 20666091 17198818 14701374 12770304 11249341
17798 11249341 9995505 8758509 7787080 6957125 6297394 5577306 4928989 4467627 4006130
$$ packed form
17851A75729908M765374j0765355j6180107j2255890j625626R907472J5568225
17844A65144001Q196851r507922k4129489k9517127k7566176k1263464j4636194
17837D6720480r578480o207249m166991k616125j479213o49713J6934N76343J011979
17828B3627965J884165L347429N446782Q878107J4345057K1809548L0505872L4220510
17820A44065435K4648653N096733j0064517j5495642j1793010j501336J0043082
17813A44999398J6313102R288427q901099k4138062k9807073k8194387k2005110
17806E7555196j5264814j0248267o670450m705574l467273k497444j931070j520963
17798A1249341j253836j236996r71429q29955o59731p20088o48317m61362m61497
$$ plain form
17789 4006130 3543701 3207963 2940858 2663334 2475603 2356202 2279972 2213084 2225945 2095449
17779 2095449 1993110 1781514 1634337 1513144 1442143 1337313 1279559 1196062 1189306 1165249
17769 1165249 1046482 1040407 1142829 1182061 1196391 980837 807854 813471 886353 945696 955672
17758 955672 955485 787359 705202 660535 737421 742791 691865 592175 545430 542855 550249 574706
17746 574706 602588 608160 483872 550782 601693 644880 579218 521592 528665 523799 570676 526355
17734 526355 486881 452336 493145 480530 500000 487307 494419 401474 356519 406764 473647 557713
17722 557713 679782 544489 481207 549233 575252 465192 358548 324159 252648 284243 345123
17711 345123 393460 463744 562759 465907 410067 333307 351074 414314 478526 415719 322238
$$ packed form
17789D006130m62429l35738k67105k77524j87731j19401p6230o6888J2861j30496
17779B095449j02339k11596j47177j21193p1001j04830n7754q3497o756k4057
17769A165249j18767o075J02422L9232J4330k15554j72983N617P2882N9343R976
17758I55672j87j68126q2157m4667P6886N370n0926r9690m6745k575P394K4457
17746E74706K7882N572j24288O6910N0911M3187o5662n7626P073m866M6877m4321
17734E26355l9474l4545M0809j2615J9470j2693P112r2945m4955N0245O6883Q4066
17722E57713J22069j35293o3282O8026K6019j10060j06644l4389p1511L1595O0880
17711C45123M8337P0284R9015r6852n5840p6760J7767O3240O4212o2807r3481
$$ plain form
17700 322238 277716 312082 356410 281319 344246 438806 486809 516439 506967 544830 317777
17689 317777 164923 189801 200525 319812 367291 338501 240933 228860 280560 210366 157983
17678 157983 124072 163553 126155 -22437 -57833 -53223 53442 9739 -30424 122253 228154
17667 228154 169359 148014 31834 10275 79156 108154 -59787 -67460 -82681 -21552 96447
17656 96447 81928 -857 -19170 -55354 55112 112960 193854 113267 -65606 -83972 -8034
17645 -8034 29352 2233 41360 19220 -40036 -29962 10034 -44533 68684 61286 99207 81109
17633 81109 80446 38149 64336 78328 50457 62367 71760 77641 54099 -12359 32288 71259
17621 71259 -31963 -50388 -30146 -69932 -100220 -146969 -141585 -12615 46639 177616 275897
$$ packed form
17700C22238m4522L4366M4328p5091O2927R4560M8003K9630r472L7863k27053
17689C17777j52854K4878J0724J19287M7479k8790r7568j2073N1700p0194n2383
17678A57983l3911L9481l7398j48592l5396M610J06665m3703m0163J52677J05901
17667B28154n8795k1345j16180k1559O8881K8998j67941p673j5221O1129J17999
17656I6447j4519q2785j8313l6184J10466N7848Q0894q0587j78873j8366P5938
17645h034L7386k7119L9127k2140n9256J0074L9996n4567J13217p398L7921j8098
17633H1109o63m2297K6187J3992k7871J1910R393N881k3542o6458M4647L8971
17621G1259j03222j8425K0242l9786l0288m6749N384J28970N9254J30977R8281
$$ plain form
17610 275897 252330 263113 287482 350148 232701 157757 88572 -36659 -53571 28129 130089
17599 130089 76474 63846 147096 246656 148748 -31477 -33071 -25006 -87600 -74058 33868
17588 33868 -21549 -107203 -172690 -128384 -56137 -166474 -83607 -245 -19265 -74657 -77790 -53113
17576 -53113 -63167 -130607 -127687 17155 117162 106158 63963 98124 121462 121629 74823 45397
17564 45397 59255 12751 -117265 -292013 -205006 -30057 8442 -7479 6412 -5215 72478
17553 72478 46531 -63339 -127562 -67984 -49013 -160845 -104982 -72507 -148242 -238276 -231692
17542 -231692 -141519 -112002 -215217 -157383 -174833 -54645 157394 203620 211786 253935 292032
17531 292032 303593 217806 187894 119851 158716 217043 96066 65176 88940 163425 289151
$$ packed form
17610B75897k3567J0783K4369O2666j17447p4944o9185j25231j6912Q1700J01960
17599A30089n3615j2628Q3250R9560r7908j80225j594Q065o2594J3542J07926
17588C3868n5417q5654o5487M4306P2247j10337Q2867Q3362j9020n5392l133K4677
17576e3113j0054o7440K920J44842J00007j1004m2195L4161K3338J67m6806k9426
17564D5397J3858m6504j30016j74748Q7007J74949L8499j5921J3891j1627P7693
17553G2478k5947j09870o4223N9578J8971j11832N5863L2475p5735r0034O584
17542b31692R0173K9517j03215N7834j7450J20188K12039M6226Q166M2149L8097
17531B92032J1561q5787k9912o8043L8865N8327j20977l0890K3764P4485J25726
$$ plain form
17520 289151 413991 545957 586960 729116 844399 970120 1138484 1310302 1332006 1319580
17510 1319580 1304867 1295553 1348830 1367145 1329147 1231665 1223386 1276551 1177231 871472 721467
17499 721467 712617 751938 664098 514162 432008 323053 357804 362389 212616 147192 109153
17488 109153 151915 92738 -54980 -50260 3965 -15674 -22010 -152905 -143103 -51374 -37952 22317
17476 22317 -3174 -199423 -195567 -29654 31018 64020 -3457 20531 -22422 -29951 139317
17465 139317 103956 29863 131784 92624 90126 23560 -23109 -29397 4304 66671 -34120
17454 -34120 -119613 -49432 -77548 -119428 -43955 21290 82346 176654 145255 53975 43756 102218
17442 102218 9980 -77834 -116867 -68365 57052 145947 86704 -70917 -69958 43713 79514
$$ packed form
17520B89151J24840J31966M1003J42156J15283J25721J68364J71818K1704j2426
17510A319580j4713r314N3277J8315l7998r7482q279N3165r9320l05759j50005
17499G21467q850L9321q7840j49936q2154j08955L4751M585j49773o5424l8039
17488A09153M2762n9177j47718M720N4225j9639o336j30895R802R1729J3422O0269
17476B2317k5491j96249L856J65913O0672L3002o7477K3988m2953p529J69268
17465A39317l5361p4093J01921l9160k498o6566m6669o288L3701O2367j00791
17454c4120q5493P0181k8116m1880P5473O5245O1056R4308l1399r1280j0219N8462
17442A02218r2238q7814l9033M8502J25417Q8895n9243j57621R59J13671L5801
$$ plain form
17431 79514 56296 100281 134504 147036 104445 111129 31925 -16835 -33702 138582 184162 42355
17419 42355 7266 -38537 -37864 -6756 28564 42626 50223 65973 35583 49226 -58675 -30797
17407 -30797 65518 93480 99361 70582 -3755 4130 13947 3832 -57227 -30309 98279 111328
17395 111328 125167 98321 50125 35418 4682 -87461 -183657 -130076 -58223 -72349 -35038
17384 -35038 -4105 25751 -49204 -54863 95352 165103 243901 92521 26674 58793 19679
17373 19679 71180 102688 20409 -42528 61420 121478 136529 102794 -101768 -167157 -125095
17362 -125095 -60278 -9298 40531 5966 -76056 -43269 -7216 -74717 5886 11986 -18443 -88027
17350 -88027 -195436 -268574 -224687 -143576 -12756 37538 27149 9957 -25691 -33091 -51067
$$ packed form
17431G9514k3218M3985L4223J2532m2591O684p9204m8760j6867J72284M5580j41807
17419D2355l5089m5803O73L1108L5320J4062P597J5750l0390J3643j07901K7878
17407c0797R6315K7962N881k8779p4337P885R817j0115o1059K6918J28588J3049
17395A11328J3839k6846m8196j4707l0736r2143r6196N3581P1853j4126L7311
17384c5038L0933K9856p4955n659J50215O9751P8798j51380o5847L2119l9114
17373A9679N1501L1508q2279o2937J03948O0058J5051l3735k04562o5389M2062
17362a25095O4817N0980M9829l4565q2022L2787L6053o7501Q0603O100l0429o9584
17350h8027j07409p3138M3887Q1111J30820N0294j0389j7192l5648p400j7976
$$ plain form
17339 -51067 -50346 -32922 -39998 -2009 19369 37174 48914 130301 111380 54715 17209 9727
17327 9727 -12488 101599 190528 303979 322385 295436 253409 242738 373465 538999 637875
17316 637875 678484 723491 680963 668035 745488 796532 826717 902298 864588 680917 591916
17305 591916 663089 497185 288587 158075 158548 103774 28977 33467 54654 -3057 -12028 57160
17293 57160 81244 173970 304163 331972 424631 500284 513537 609929 769640 822998 898508
17282 898508 839063 705711 692143 868343 953376 940879 901850 707208 604932 568852 457106
17271 457106 381658 315635 379238 309606 105521 5774 -10004 25047 -15203 -37593 -71596
17260 -71596 -127966 -40832 122583 116871 226446 269834 236606 115101 2509 54008 147171
$$ packed form
17339e1067P21J7424p076L7989K1378J7805J1740Q1387j8921n6665l7506p482
17327I727k2215J14087Q8929J13451J8406k6949m2027j0671J30727J65534R8876
17316F37875M0609M5007m2528j2928P7453N1044L0185P5581l7710j83671q9001
17305E91916P1173j65904k08598j30512M73n4774p4797M490K1187n7711q971O9188
17293E7160K4084R2726J30193K7809R2659P5653J3253R6392J59711N3358P5510
17282H98508n9445j33352j3568J76200Q5033j2497l9029j94642j02276l6080j11746
17271D57106p5448o6023O3603o9632k04085r9747j5778L5051m0250k2390l4003
17260g1596n6370Q7134J63415n712J09575M3388l3228j21505j12592N1499R3163
$$ plain form
17249 147171 219889 254048 195791 179056 235744 151315 37019 -33310 39178 -2575 7663
17238 7663 -22 -41955 23183 5573 -47098 -86698 32291 138388 78151 -61423 -202229
17227 -202229 -237615 -204075 -179788 -154460 -123401 -166922 -244458 -245752 -203384 -117350 85092
17216 85092 186426 160764 191434 174880 116115 52536 -77743 17948 133896 66865 7030
17205 7030 -42032 -110861 -83212 -125745 -121317 -88622 -7426 36016 76388 -19970 -139953 -102694
17193 -102694 -44650 -102811 -141630 -49499 -22811 -83608 -82262 -146204 -226350 -169246 -79524 -102908
17181 -102908 1498 168747 100772 -54221 -33547 -66790 31668 26798 -2425 -13747 3410
17170 3410 -3584 64437 29769 -9413 -66083 14328 26084 -94068 -17603 -20256 -131880 -131549
$$ packed form
17249A47171P2718L4159n8257j6735N6688q4429j14296p0329P2488m1753J0238
17238G663p685m1933O5138j7610n2671l9600J18989J06097o0237j39574j40806
17227b02229l5386L3540K4287K5328L1059m3521p7536j294M2368Q6034K02442
17216H5092J01334k5662L0670j6554n8765o3579j30279R5691J15948o7031n9835
17205G030m9062o8829K7649m2533M428L2695Q1196M3442M0372r6358j19983L7259
17193a02694N8044n8161l8819R2131K6688o0797J346o3942q0146N7104Q9722k3384
17181a02908J04406J67249o7975j54993K0674l3243R8458m870k9223j1322J7157
17170C410o994O8021l4668l9182n6670Q0411J1756j20152P6465k653j11624L31
$$ plain form
17158 -131549 -81573 -134186 -238759 -98239 33189 68096 -5516 111946 149302 138024 133341
17147 133341 76492 -7121 7893 15334 -113985 -112705 4992 14576 -43544 -18951 -58069 -161267
17135 -161267 -81693 -100997 -149508 -143812 -62978 -30837 -6750 -50988 -113831 -160964 -187294 -146848
17123 -146848 -47021 -20656 -46349 -187889 -220028 -219672 -221489 -41939 -64234 -53014 27915 138144
17111 138144 119226 40523 -87863 -84068 -18195 -86289 -19717 -20611 -33908 -50324 -118255 -186396
17099 -186396 -221129 -179058 -122693 -121572 -102284 -25885 59094 19248 -24819 -67876 -121855 -142779
17087 -142779 6247 99038 44221 3879 -113402 -272996 -348994 -235026 -95689 -59282
17077 -59282 -94233 -112607 -78830 -70922 -198708 -299088 -253421 -128357 -117066 -25602 -1834
$$ packed form
17158a31549M9976n2613j04573J40520J31428L4907p3612J17462L7356j1278m683
17147A33341n6849q3613J5014P441j29319J280J17697R584n8120K4593l9118j03198
17135a61267P9574j9304m8511N696Q0834L2141K4087m4238o2843m7133k6330M0446
17123a46848R9827K6365k5693j41540l2139L56j817J79550k2295J1220Q0929J10229
17111A38144j8918p8703j28386L795O5873o8094O6572q94j3297j6416o7931o8141
17099a86396l4733M2071N6365J121J9288P6399Q4979l9846m4067m3057n3979k0924
17087a42779J49026R2791n4817m0342j17281j59594p5998J13968J39337L6407
17077e9282l4951j8374L3777P908j27786j00380M5667J25064J1291R1464K3768
$$ plain form
17066 -1834 29257 -64289 -81400 -129707 -138102 -114474 -108060 -36754 -36656 -71410 -110158 -118557 -2287
17053 -2287 -8290 -141599 -95446 -11115 70097 -53760 25547 145836 152000 36177 -76290
17042 -76290 -124135 -15079 -679 11332 21130 19805 20253 10905 -69294 -38028 -50003 -19275
17030 -19275 -57295 -124994 -60832 -31945 -58946 -63780 -102305 -113507 -39385 -50893 -45402 -37488
17018 -37488 -106179 -82736 -113497 -156548 -212664 -164081 -204134 -301085 -270599 -194830 -48688
17007 -48688 82163 164916 138493 118475 100977 93015 73717 27885 29397 85172 10140 -113448
16995 -113448 -92497 -43249 32091 28748 12461 -56779 -18350 -7050 -67605 -107397 -110609 8365
16983 8365 199955 213672 64619 -9013 -2061 17073 -49019 -80791 -31450 61199 139408 66972
$$ packed form
17066a834L1091r3546j7111m8307q395K3628O414P1306R8l4754l8748q399J16270
17053b287o003j33309M6153Q4331Q1212j23857P9307J20289O164j15823j12467
17042g6290m7845J09056J4400J2011R798j325M48r348q0199L1266j1975L0728
17030a9275l8020o7699O4162K8887k7001m834l8525j1202P4122j1508N491P914
17018c7488o8691K3443l0761m3051n6116M8583m0053r6951L0486P5769J46142
17007d8688J30851Q2753k6423k0018j7498p962j9298m5832J512N5775p5032j23588
16995a13448K0951M9248P5340l343j6287o9240L8429J1300o0555l9792l212J18974
16983H365J91590J3717j49053p3632O952J9134o6092l1772M9341R2649P8209p2436
$$ plain form
16971 66972 -2512 -82692 -36056 -13591 10520 83613 77828 151297 212790 177290 88502 -40
16959 -40 55587 -8638 -97438 34224 102898 -51627 -58474 28102 60015 44206 47503 -49258
16947 -49258 -93178 -49864 -22257 35834 4753 -17175 6873 -23956 -94990 -95597 43764 68221
16935 68221 7133 -85981 -106368 -139641 -149480 -152702 -132590 -117582 -202535 -207300 -147421 -151903
16923 -151903 -155352 -220260 -220251 -138535 -36473 -69145 -129355 -146987 -144026 -68027 -51248 938
16911 938 -77482 -143485 8264 -21706 -91313 -198118 -93320 -9491 20243 -33720 -71475
16900 -71475 -89804 -45366 59931 58567 78926 68210 -46963 -129675 -60462 -38277 -21596
16889 -21596 3306 33178 -95981 -164038 -149935 -109829 -60542 -60474 -16460 -25647 -71750 -101219
$$ packed form
16971F6972o9484q0180M6636K2465K4111P3093n785P3469O1493l5500q8788q8542
16959d0N5627o4225q8800J31662O8674j54525o847Q6576L1913j5809L297r6761
16947d9258m3920M3314K7607N8091l1081k1928K4048l0829p1034o07J39361K4457
16935F8221o1088r3114k0387l3273r839l222K0112J5008q4953m765N9879m482
16923a51903l449o4908RQ1716J02062l2672o0210j7632K961P5999J6779N2186
16911I38p8420o6003J51749k9970o9607j06805J04798Q3829K9734n3963l7755
16900g1475j8329M4438J05297j364K0359j0716j15173q2712O9213K2185J6681
16889b1596K4902K9872j29159o8057J4103M0106M9287O8M4014r187m6103k9469
$$ plain form
16877 -101219 -68850 -97950 -88221 -61662 -103109 -153451 -60458 -22619 -8110 -8988 -53819 -141608
16865 -141608 -195402 -91298 23810 66661 39253 33493 124061 46065 -81290 -152866 -127423
16854 -127423 -112686 -133891 -85563 -36276 32186 81040 49820 -154484 -167111 -118743 47853
16843 47853 31368 23376 -8160 66880 170348 256573 135128 36427 23680 -39864 -99722
16832 -99722 -139307 -87922 -4727 -70711 -80189 -106802 -224358 -237643 -286178 -236564 -234012 -196715
16820 -196715 -168868 -150012 -37140 53347 96302 175155 213550 92151 6771 -117591 -90293
16809 -90293 34614 52592 -43924 -76903 -158443 -128761 -70039 -184762 -118661 -20100 85623
16798 85623 32228 4555 117065 178087 18674 -85154 -161041 -145225 -147654 -123274 -121726
$$ packed form
16877a01219L2369k9100R729K6559m1447n0342R2993L7839J4509q78m4831q7789
16865a41608n3794J04104J15108M2851k7408n760R0568p7996j27355p1576K5443
16854a27423J4737k1205M8328M9287O8462M8854l1220k04304j2627M8368J66596
16843D7853j6485p992l1536P5040J03468Q6225j21445r8701j2747o3544n9858
16832i9722l9585N1385Q3195o5984r478k6613j17556j3285m8535M9614K552L7297
16820a96715K7847J8856J12872R0487M2955P8853L8395j21399q5380j24362K7298
16809i0293J24907J7978r6516l2979q1540K9682N8722j14723O6101R8561J05723
16798H5623n3395k7673J12510O1022j59413j03828p5887J5816k429K4380J548
$$ plain form
16787 -121726 -59586 60871 40760 -42525 -142630 -118543 -123905 -55187 3658 -37917 -98439
16776 -98439 -81788 3130 42079 4461 -38442 -33536 -12159 -4841 -26473 -34122 121454 182335
16764 182335 189388 83827 -63570 -54807 10943 99319 243629 141660 -22701 -52913 -86728
16753 -86728 -52323 -27283 -10958 68280 36643 93506 86506 67464 50480 32371 24638 -52309
16741 -52309 -112027 -69429 -14278 1441 25882 41264 78394 56453 -85751 -116378 -46051
16730 -46051 19752 90228 48889 -45718 -15544 -14284 -5600 -10482 45910 90453 -4301 -80470
16718 -80470 -83486 7844 -13717 10281 56848 50744 2254 78461 76913 94801 53052 61403
16706 61403 -2031 -90056 -139395 -68233 -44688 -67899 -112089 -49392 -91444 -156618 -227132 -246574
$$ packed form
16787a21726O2140J20457k0111q3285j00105K4087n362O8718N8845m1575o0522
16776i8439J6651Q4918L8949l7618m2903M906K1377P318k1632p649J55576O0881
16764A82335P053j05561j47397Q763O5750Q8376J44310j01969j64361l0212l3815
16753h6728L4405K5040J6325P9238l1637N6863p000j9042j6984j8109p733p6947
16741e2309n9718M2598N5151J5719K4441J5382L7130k1941j42204l0627P0327
16730d6051O5803P0476m1339r4607L0174J260Q684m882N6392M4543r4754p6169
16718h0470l016R1330k1561K3998M6567o104m8490P6207j548J7888m1749Q351
16706F1403o3434q8025m9339P1162K3545k3211m4190O2697m2052o5174p0514j9442
$$ plain form
16694 -246574 -239989 -51701 -19796 -157872 -204116 -124420 -85580 -34807 -64952 -76993 -54662
16683 -54662 -171942 -257921 -238256 -150869 -73653 -68716 -137844 -59429 -14601 -91995 -112980 -71195
16671 -71195 -143368 -176241 -127209 -31402 -89710 -116884 -83634 47051 146832 135188 96262
16660 96262 47329 29236 -74647 -115704 54211 205162 160532 100813 41469 -40781 -87204
16649 -87204 -37078 -54114 -53773 -61895 45939 77850 107380 84086 84199 50344 -41340 47480
16637 47480 62502 11873 -107864 -24562 100431 15780 30135 20515 -87364 -163122 -46420
16626 -46420 57092 -9103 -97599 -263496 -391925 -310720 -114508 -87560 -148706 -59320 -103143
16615 -103143 -108698 -80108 -160071 -87673 -51812 -60727 -5537 74317 91914 67451 77867 6094
$$ packed form
16694b46574O585J88288L1905j38076m6244P9696L8840N0773l0145j2041K2331
16683e4662j17280q5979J9665Q7387P7216M937o9128P8415M4828p7394k0985M1785
16671g1195p2173l2873M9032R5807n8308k7174L3250J30685R9781j1644l8926
16660I6262m8933j8093j03883m1057J69915J50951m4630n9719n9344q2250m6423
16649h7204N0126j7036L41q122J07834L1911K9530k3294J13l3855r1684Q8820
16637D7480J5022n0629j19737Q3302J24993q4651J4355r620j07879p5758J16702
16626d6420J03512o6195q8496j65897j28429Q1205J96212K6948o1146Q9386m3823
16615a03143n555K8590p9963P2398L5861q915N5190P9854J7597k4463J0416p1773
$$ plain form
16603 6094 -80733 -11935 -77921 -144630 -130197 -171574 -115440 -70834 -86272 -54904 -39465 -63027
16591 -63027 -13304 -69957 -150468 -10071 158565 128748 4927 18405 75909 39800 -24935
16580 -24935 -74893 -82618 -34942 5324 64041 62438 22638 -37590 -40022 67584 168130 112806
16568 112806 80254 -9386 -133616 -94822 -35035 -117158 -292334 -154068 -82629 -137813 -183301
16557 -183301 -93980 76884 147116 95529 -40143 -157012 -163998 -195555 -163083 -218436 -306614
16546 -306614 -233375 -177039 -43495 104691 133909 41037 6636 76592 144452 156186 26243
16535 26243 -20968 69310 185344 304461 190024 -45623 -209232 -197782 -626 62625
16525 62625 31937 67121 21620 -81241 -95941 -43107 -38811 -122229 -64776 -172335 -163556 -53102
$$ packed form
16603F094q6827O8798o5986o6709J4433m1377N6134M4606j5438L1368J5439k3562
16591f3027M9723n6653q0511J40397J68636k9817j23821J3478N7504l6109o4735
16580b4935m9958p725M7676M0266N8717j603l9800o0228k432J07606J00546n5324
16568A12806l2552q9640j24230L8794N9787q2123j75176J38266P1439n5184m5488
16557a83301Q9321J70864P0232n1587j35672j16869o986l1557L2472n5353q8178
16546c06614P3239N6336J33544J48186K9218r2872l4401O9956O7860J1734j29943
16535B6243m7211R0278J16034J19117j14437k35647j63609J1450J97156O3251
16525F2625l0688L5184m5501j02861j4700N2834M296q3418N7453j07559Q779J10454
$$ plain form
16513 -53102 -49908 -113753 -66004 -146803 -145263 -191467 -113944 -9850 52297 93800 102931 -43482
16501 -43482 -22610 -73184 -53713 12966 24865 6144 -30426 -23983 -17588 37092 -32138 -195049
16489 -195049 -242994 -167974 -101592 -128689 -282937 -248206 -113503 19730 -5758 6696 -55815
16478 -55815 -41035 48108 -15400 -34129 -38327 -41674 -13411 66889 57839 72987 15121 6223
16466 6223 25176 -88137 -69909 -104775 -108501 -74971 45520 198147 146594 126367 98546
16455 98546 87910 68289 6230 -80426 11459 45882 88049 105745 103576 6333 -18525 -8440
16443 -8440 114537 206069 128567 24889 28978 -144538 -124688 -113318 -155878 -181447 -43993
16432 -43993 -7898 23135 67684 121672 91166 93203 117366 51771 78632 105275 60454 56082
$$ packed form
16513e3102L194o3845M7749q0799J540m6204P7523J04094O2147M1503R131j46413
16501d3482K0872n0574J9471O6679J1899j8721l6570O443O395N4680o9230j62911
16489a95049m7945P5020O6382k7097j54248L4731J34703J33233k5488J2454o2511
16478e5815J4780Q9143o3508j8729m198l347K8263Q0300r050J5148n7866q898
16466F223J8953j13313J8228l4866l726L3530J20491J52627n1553k0227k7821
16455I8546j0636j9621o2059q6656R1885L4423M2167J7696k169r7243k4858J0085
16443h440J22977R1532p7502j03678M089j73516J9850J1370m2560k5569J37454
16432d3993L6095L1033M4549N3988l0506K037K4163o5595K6861K6643m4821m372
$$ plain form
16420 56082 34357 -26896 -45573 -228232 -201229 -186745 -214004 -236438 -172955 17394 119790
16409 119790 143898 122452 55830 67038 -28932 -31259 -50099 -52608 38985 -58377 -141815 -118499
16397 -118499 -61573 15657 -105638 -23618 86614 148004 226316 134866 79824 -1644 31392
16386 31392 6293 65086 53156 54162 112786 127436 145373 122343 138180 104953 -71408 -165476
16374 -165476 -80127 -71468 -26557 -60593 -26030 -25672 -31244 -92395 -82121 -90064 -122016 -54561
16362 -54561 -34245 -30996 3604 49887 22434 -42077 -44998 -87664 1546 -9166 -17047 188927
16350 188927 249129 192961 112766 -76503 -174753 -83161 -75977 -181752 -129812 -95671 -53652
16339 -53652 -72480 -249516 -254230 -167790 -129962 -47801 -54673 -128669 -143501 -154229 -190043 -34570
$$ packed form
16420E6082k1725o1253j8677j82659K7003J4484k7259k2434O3483J90349J02396
16409A19790K4108k1446o6622J1208r5970k327j8840k509R1593r7362q3438K3316
16397a18499N6926P7230j21295Q2020J10232O1390P8312r1450n5042q1468L3036
16386C1392k5099N8793j1930J006N8624J4650J7937k3030J5837l3227j76361r4068
16374a65476Q5349Q659M4911l4036L4563L58n572o1151J0274p943l1952O7455
16362e4561K0316L249L4600M6283k7453o4511k921m2666Q9210j0712p881K05974
16350A88927O0202n6168q0195j89269r8250R1592P184j05775N1940L4141M2019
16339e3652j8828j77036m714Q6440L7828Q2161o872p3996j4832j0728l5814J55473
$$ plain form
16327 -34570 -5108 26892 50836 15647 -17757 40879 64784 25939 29979 -54984 -43928 -23087
16315 -23087 32983 100005 60794 82107 55333 -3992 -31750 -76599 -91431 44962 60278
16304 60278 -23152 -102041 -1259 129747 4742 -121567 -181756 -22937 104149 5360
16294 5360 -16480 65885 -17935 -70357 79415 50012 -54845 -70791 -101758 -151473 -91756
16283 -91756 -22442 -33214 7108 49610 -2849 60983 40735 -80692 -89009 -86858 -18817 110948
16271 110948 -12760 -137108 -147601 -106692 -165590 -166191 -98232 -2274 17495 -135822 -229931
16260 -229931 -16604 186764 201092 88335 -45014 -84659 -103955 -116221 -13733 91840
16250 91840 165211 211479 170267 115911 -64654 -84077 38080 -61061 -60020 -28376 -42311
$$ packed form
16327c4570K9462L2000K3944l5189l3404N8636K3905l8845M040q4963J1056K0841
16315b3087N6070O7022l9211K1313k6774n9325k7758m4849j4832J36393J5316
16304F0278q3430p8889J00782J31006j25005j26309o0189J58819J27086r8789
16294E360k1840Q2365q3820n2422J49772k9403j04857j5946l0967m9715N9717
16283i1756O9314j0772M0322M2502n2459O3832k0248j21427q317K151O8041J29765
16271A10948j23708j24348j0493M0909n8898o01O7959R5958J9769j53317r4109
16260b29931K13327K03368J4328j12757j33349l9645j9296j2266J02488J05573
16250I1840P3371M6268m1212n4356j80565j9423J22157r9141J041L1644j3935
$$ plain form
16239 -42311 -17196 -30307 28404 64258 79054 -51009 -111404 -146356 -140041 -173357 -230884 -172559
16227 -172559 -122653 -128965 -111832 -87513 -24027 15954 -23785 59708 95671 12724 -75758 -66825
16215 -66825 -45938 9793 20231 -119389 -187161 -186479 -171609 -129206 -127634 -43828 -24755 -26244
16203 -26244 -2644 -14538 86793 132550 94520 -30951 61185 28612 -8593 27143 35507
16192 35507 104514 69112 10849 -132267 -77613 -11120 -77376 -184064 -154799 -44368 77995
16181 77995 122735 1814 -242760 -299774 -219152 -67819 -65285 6267 72235 75779 49706
16170 49706 60524 -30064 -46582 -9545 -41998 -39503 -119877 -128749 -201522 -157771 -131521 -89316
16158 -89316 23164 -19345 -145839 -152442 -133156 -130470 -174005 -189207 -94845 696 -39662 35939
$$ packed form
16239d2311K5115j3111N8711L5854J4796j30063o0395l4952O315l3316n7527N8325
16227a72559M9906o312J7133K4319O3486L9981l9739Q3493L5963q2947q8482Q933
16215f6825K0887N5731J0438j39620o7772O82J4870M2403J572Q3806J9073j489
16203b6244K3600j1894J01331M5757l8030j25471R2136l2573l7205L5736Q364
16192C5507O9007l5402n8263j43116N4654O6493o6256j06688K9265J10431J22363
16181G7995M4740j20921k44574n7014Q0622J51333K534P1552O5968L544k6073
16170D9706J0818r0588j6518L7037l2453K495q0374q872p2773M3751K6250M2205
16158h9316J12480m2509j26494o603J9286K686m3535j5202R4362R5541m0358P5601
$$ plain form
16146 35939 68587 -83442 -105781 -81958 -80267 -121710 -133577 -62714 -127646 -112285 -70273 -102642
16134 -102642 -173040 -145177 -86275 -85803 -63441 -24162 -48343 -43884 -95417 -135060 -93681 -72505
16122 -72505 7827 42989 -6937 -126479 -205869 -217913 -197480 -95561 -28783 -112750 -200780
16111 -200780 -138234 -296250 -244325 -145883 -88892 -68553 -10968 28733 103031 82536 105706
16100 105706 73394 111393 55061 63189 12404 -99280 -70696 -151433 -227167 -167518 -109983
16089 -109983 -183399 -261369 -41632 -182 -10513 121217 228567 135608 -67765 -59478 -31181
16078 -31181 75000 133992 5684 100987 62613 -59882 27622 204032 311891 431000
16068 431000 368958 370440 216937 49664 -32155 2190 26701 -49191 -169367 -128882 -85671
$$ packed form
16146C5939L2648j52029k2339K3823J691m1443j1867P0863o4932J5361M2012l2369
16134a02642p0398K7863N8902M72K2362L9279k4181M459n1533l9643M1379K1176
16122g2505Q0332L5162m9926j19542p9390j2044K0433J01919O6778q3967q8030
16111b00780O2546j58016N1925R8442N6991K0339N7585L9701P4298k0495K3170
16100A05706l2312L7999n6332Q128n0785j11684K8584q0737p5734N9649N7535
16089a09983p3416p7970K19737M1450j0331J31730J07350r2959k03373Q287K8297
16078c1181J06181N8992j28308R5303l8374j22495Q7504J76410J07859J19109
16068D31000o2042J482j53503j67273q1819L4345K4511p5892j20176M0485M3211
$$ plain form
16057 -85671 -109144 -36055 35285 96583 156601 83748 48935 155357 184784 47488 -90209
16046 -90209 -137185 -108122 -129459 -49275 -3582 -174904 -249956 -159217 -85879 -43816 47858
16035 47858 -15329 -73150 -100966 -103415 -148546 -153580 -182062 -162686 -95054 -59338 -112985 -107247
16023 -107247 39132 153531 24965 -50888 -67575 -83841 -32517 -81327 -175553 -193600 -191821
16012 -191821 -160212 -127350 -196614 -123263 -3719 -104226 -119109 -92826 -105504 -134169 -60380
16001 -60380 15665 -50359 -206132 -187163 -78474 -168247 -164422 -152465 -132016 -160110 -129147
15990 -129147 -93393 -162636 -139242 -18 15384 22769 -6265 -28439 12000 38168 2977
15979 2977 30719 -9683 -102518 -85446 -53770 -83013 -40182 5749 -63799 -147182 -55387 -63798
$$ packed form
16057h5671k3473P3089P1340O1298O0018p2853l4813J06422K9427j37296j37697
16046i0209m6976K9063k1337Q0184M5693j71322p5052R0739P3338M2063R1674
16035D7858o3187n7821k7816k449m5131n034k8482J9376O7632L5716n3647N738
16023a07247J46379J14399j28566p5853j6687j6266N1324m8810r4226j8047J779
16012a91821L1609L2862o9264P3351J19544j00507j4883K6283j2678k8665P3789
16001f0380P6045o6024j55773J8969J08689q9773L825J1957K0449k8094L0963
15990a29147L5754o9243K3394J39224J5402P385k9034k2174M0439K6168l5191
15979B977K7742m0402r2835J7072L1676k9243M2831M5931o9548q3383R1795q411
$$ plain form
15967 -63798 -238622 -282025 -251210 -145675 -1450 152044 170047 41564 5538 -23807 21498
15956 21498 -72685 -213394 -167711 -136398 -127829 -78248 -12255 -13092 -34436 -74096 -96184 -67311
15944 -67311 -170119 -70008 99804 102537 93546 28327 -44389 -144687 -131401 23697 80969
15933 80969 -21008 -31305 -31654 -58647 -86492 -74018 21636 68666 -2244 -91309 -48215 -110987
15921 -110987 -200970 -163926 -61928 -13563 -12647 -7872 -67998 5129 -53275 -254451 -212376 -190339
15909 -190339 -90786 -20507 46926 99230 13072 46690 188385 290571 214581 77603 41239
15898 41239 34619 31880 55140 45639 -109684 -167479 -130628 -68363 -77200 -93343 42146 87463
15886 87463 -60494 -187791 -240601 -141838 -23429 92661 166263 154869 140954 296010 240997
$$ packed form
15967f3798j74824m3403L0815J05535J44225J53494J8003j28483l6026k9345M5305
15956B1498r4183j40709M5683L1313Q569M9581O5993q37k1344l9660k2088K8873
15944f7311j02808J00111J69812K733q991o5219p2716j00298J3286J55098N7272
15933H0969j01977j0297l49k6993k7845J2474R5654M7030p0910q9065M3094o2772
15921a10987q9983L7044J01998M8365R16M775o0126P3127n8404k01176M2075K2037
15909a90339R9553P0279O7433N2304q6158L3618J41695J02186p5990j36978l6364
15898D1239o620k739K3260r501j55323n7795L6851O2265q837j6143J35489M5317
15886H7463j47957j27297n2810R8763J18409J16090P3602j1394j3915J55056n5013
$$ plain form
15875 240997 199367 190910 72676 -88258 -75366 -5566 -63868 -104218 -64550 -90622 -126828
15864 -126828 -68612 -23260 -115846 -202557 -183685 -129268 -39851 168478 222594 145029 53837
15853 53837 -102194 -132001 -123622 -142332 -115942 -95730 -43913 84819 221067 201970 210464
15842 210464 172587 120919 14554 -6957 32410 18754 -53982 -91267 -214746 -138330 4628
15831 4628 38023 -42414 -201716 -197864 -125640 -115856 -60376 -31775 -148849 -115168 -72050 -223895
15819 -223895 -204937 -160348 -113313 -105902 -137090 -111505 -135187 -117138 -100581 -39538 88030
15808 88030 151003 131585 74834 44300 888 -14015 -164002 -292223 -366156 -274054 -217466
15797 -217466 -205995 -229049 -247813 -298232 -324506 -229360 -249534 -232814 -211339 -150848 -203248
$$ packed form
15875B40997m1630q457j18234j60934J2892O9800n8302m0350L9668k6072l6206
15864a26828N8216M5352r2586q6711J8872N4417Q9417K08329N4116p7565r1192
15853E3837j56031k9807Q379j8710K6390K0212N1817J28732J36248j9097Q494
15842B10464l7877n1668j06365k1511L9367j3656p2736l7285j23479P6416J42958
15831D628L3395q0437j59302L852P2224R784N5480K8601j17074L3681M3118j51845
15819b23895J8958M4589M7035P411l1188K5585k3682J8049J6557O1043J27568
15808H8030O2973j9418n6751l0534m3412j4903j49987j28221p3933R2102N6588
15797b17466J1471k3054j8764n0419k6274R5146k0174J6720K1475O0491n2400
$$ plain form
15786 -203248 -163348 -10748 114100 121273 97127 94827 95358 91785 -5670 -84383 -9843 -88246
15774 -88246 -106887 -125761 -72454 3707 59153 94157 73704 10521 -53885 -74180 -97842 -85008
15762 -85008 75760 92808 -19274 -87293 -198502 -149553 25781 158029 124133 76142 -43011
15751 -43011 -56385 -65743 -123194 -61411 -9227 -77514 -202875 -244251 -186528 2097 47549
15740 47549 8497 19485 131130 101292 124999 143888 70786 144750 119469 180898 104313
15729 104313 -58256 -88888 3326 62884 183056 164618 70014 170346 188224 162568 157222
15718 157222 122604 58222 -297 -58659 -44352 -140960 -34553 141045 59315 -48886 104841
15707 104841 126519 10791 -36665 50612 54149 50069 84826 73542 89343 122631 62379 -17294
$$ packed form
15786b03248L9900J52600J24848P173k4146k300N31l573r7455p8713P4540p8403
15774h8246j8641j8874N3307P6161N5446L5004k0453o3183o4406k0295k3662J2834
15762h5008J60768J7048j12082o8019j11209M8949J75334J32248l3896m7991j19153
15751d3011j3374r358n7451O1783N2184o8287j25361m1376N7723J88625M5452
15740D7549l9052J0988J11645k9838K3707J8889p3102P3964k5281O1429p6585
15729A04313j62569l0632R2214N9558J20172j8438r4604J00332J7878k5656n346
15718A57222l4618o4382n8519n8362J4307r6608J06407J75598q1730j08201J53727
15707A04841K1678j15728m7456Q7277L537m080L4757j1284J5801L3288o0252p9673
$$ plain form
15695 -17294 7940 3695 -6644 -70505 -38898 -84486 -67261 -129561 -28709 92051 127009
15684 127009 190892 217708 218379 70070 -34973 -47328 -64260 12220 134722 108641 100152
15673 100152 46746 43260 76712 183348 71892 -1988 -15243 -63800 -36074 -50273 -134666
15662 -134666 -21207 31746 57893 107696 12913 -71198 -45568 138398 225267 193172 7571
15651 7571 -212980 -227706 -72371 -69742 -199136 -268704 -167340 -108067 -15628 -2481 119476
15640 119476 224517 315897 320169 155743 -48821 -30179 -3459 44410 94180 92496 83800
15629 83800 169828 173708 260013 178444 110296 132592 129349 6718 5916 54680 13583 -27648
15617 -27648 -64256 -63571 -166875 -254654 -167610 -88671 -78280 -117177 -100979 -45216 -69312 -56581
$$ packed form
15695a7294K5234m245j0339o3861L1607m5588J7225o2300J00852J20760L4958
15684A27009O3883K6816O71j48309j05043j2355j6932P6480J22502k6081q489
15673A00152n3406l486L3452J06636j11456p3880j3255m8557K7726j4199q4393
15662a34666J13459N2953K6147M9803r4783q4111K5630J83966Q6869l2095j85601
15651G571k20551j4726J55335K629j29394o9568J01364N9273R2439J3147J21957
15640A19476J05041R1380M272j64426k04564J8642K6720M7869M9770j684q696
15629H3800Q6028L880Q6305q1569o8148K2296l243j22631q02M8764m1097m1231
15617b7648l6608O85j03304q7779Q7044P8939J0391l8897J6198N5763k4096J2731
$$ plain form
15605 -56581 -193535 -158948 -107967 -90691 73548 109088 123423 53498 2794 41475 117239
15594 117239 145432 26971 -115407 -71857 16822 72857 21394 -167018 -179150 -18042 -39245
15583 -39245 -70925 -150465 -159374 6525 -32879 42510 46774 61437 -67440 -145973 -108724 6185
15571 6185 164819 132981 150306 176179 139527 105619 1400 -34065 1171 -77257 -162263
15560 -162263 -236748 -163396 -92717 -59812 -58968 -14842 38392 30518 33518 5968 -79551 -68003
15548 -68003 -20603 30330 117841 120795 -47349 -39424 35219 155528 121485 40426 -70319
15537 -70319 -63773 -40635 -39414 -68075 -35950 -38130 -61397 -104726 -25611 46542 -3830 -2855 -32261
15524 -32261 23922 11358 30303 40863 46532 58649 63354 153120 122304 117335 128475 75079
$$ packed form
15605e6581j36954L4587N0981J7276J64239L5540J4335o9925n0704L8681P5764
15594A17239K8193j18461j42378M3550Q8679N6035n1463j88412j2132J61108k1203
15583c9245l1680p9540q909J65899l9404P5389M264J4663j28877p8533L7249J14909
15571F185J58634l1838J7325K5873l6652l3908j04219l5465L5236p8428q5006
15560a62263p4485P3352P0679L2905Q44M4126N3234p874L000k7550q5519J1548
15548f8003M7400N0933Q7511K954j68144P925P4643J20309l4043q1059j10745
15537g0319O546K3138J221k8661L2125k180k3267m3329P9115P2153n0372R75k9406
15524c2261N6183j2564J8945J0560N669J2117M705Q9766l0816m969J1140n3396
$$ plain form
15512 75079 13179 -46905 -3478 20957 -22920 -87236 -74585 -7448 -30902 46561 107845 114119
15500 114119 48565 42456 66071 64155 20902 -26848 -97448 -13096 27844 90521 82018 -54242
15488 -54242 -43527 -135991 -284007 -210854 -119944 -107996 -151786 -129598 -106423 -106945 -121549 -34764
15476 -34764 -126171 -71257 56652 -79157 55229 92222 24349 -1953 -25658 -5095 59044
15465 59044 90218 113754 89155 -75 -130960 -25139 -32271 -31042 -41409 -30918 -12315 48456
15453 48456 133594 176323 122094 12586 38541 90853 91526 55130 8335 -32189 -7000 -69818
15441 -69818 -150216 -56324 116482 73035 -63440 -9872 89432 123032 78864 76192 47934
15430 47934 7375 -35636 -18245 59455 61050 -11961 -6150 44232 13059 -81685 -54661 -1549
$$ packed form
15512G5079o1900o0084M3427K4435m3877o4316J2651O7137k3454P7463O1284O274
15500A14119o5554o109K3615j916m3253m7750p0600Q4352M0940O2677q503j36260
15488e4242J0715r2464j48016P3153R0910J1948m3790K2188K3175n22j4604Q6785
15476c4764r1407N4914J27909j35809J34386L6993o7873k6302k3705K0563O4139
15465E9044L1174K3536k4599q9230j30885J05821p132J229j0367J0491J8603O0771
15453D8456Q5138M2729n4229j09508K5955N2312O73l6396m6795m0524K5189o2818
15441f9818q0398R3892J72806m3447j36475N3568R9304L3600m4168k672k8258
15430D7934m0559m3011J7391P7700J595p3011N811N0382l1173r4744K7024N3112
$$ plain form
15418 -1549 79525 110638 102409 110842 67681 -27428 -42675 31116 12901 15057 -12191 -36162
15406 -36162 44098 37497 16912 -31888 -115019 -24152 49012 54927 13354 -53566 -6986 -107123
15394 -107123 -160468 -175176 -70289 15603 139038 224436 127209 -36181 58691 62643 -34320
15383 -34320 -19590 -65634 -93841 -82694 -127095 -18282 7779 -3230 31279 68192 77173 -26647
15371 -26647 -82161 -70535 21061 44161 53455 44460 26807 25154 41501 44827 37346 5988 77787
15358 77787 150863 126498 68903 -29037 -90320 -136684 -107721 -157336 -104436 -176819 -202980 -213214
15346 -213214 -234673 -105933 -18748 -44499 -20279 -13511 52129 79381 44412 22915 21636 57821
15334 57821 46331 188850 282863 208653 153458 62119 -17806 -90570 -288 95199 95610 -13017
$$ packed form
15418a549Q1074L1113q229Q433m3161r5109j5247P3791j8215K156k7248k3971
15406c6162Q0260o601k0585m8800q3131R0867P3164N915m1573o6920M6580j00137
15394a07123n3345j4708J04887Q5892J23435Q5398r7227j63390R4872L952r6963
15383c4320J4730m6044k8207J1147m4401J08813K6061j1009L4509L6913Q981j03820
15371b6647n5514J1626R1596K3100R294q995j7653j653J6347L326p481l1358P1799
15358G7787P3076k4365n7595r7940o1283m6364K8963m9615N2900p2383k6161j0234
15346b13214k1459J28740Q7185k5751K4220O768O5640K7252l4969k1497j279L6185
15334E7821j1490J42519R4013p4210n5195r1339p9925p2764R0282R5487M11j08627
$$ plain form
15322 -13017 -41694 -52887 -5866 -28245 58622 104597 120900 102356 -46853 -92049 -159882
15311 -159882 -83614 79997 205447 194384 148546 52545 -23077 25582 14627 16182 31997
15300 31997 -31665 -56013 -52633 -134657 -68446 -31098 -61410 -26812 -44679 -9046 -4183 -33672
15288 -33672 -53513 30772 95564 125451 8452 -39859 11817 -1289 -18353 17271 29185
15277 29185 5302 76 20665 -4270 37974 4910 -47819 423 5402 -32120 -79254 -111388
15265 -111388 -120706 -45806 -39292 -117939 -114871 -45790 -14631 31186 146395 204212 152454 108461
15253 108461 15300 -83039 -108969 -55408 -38439 -25198 -61604 -41486 -48291 28339 17403 84234
15241 84234 103569 28527 40458 79871 109664 129817 147508 82288 38165 8183 51501 173855
$$ packed form
15322a3017k8677j1193M7021k2379Q6867M5975J6303j8544j49209m5196o7833
15311a59882P6268J63611J25450j1063m5838r6001p5622M8659j0955J555J5815
15300C1997o3662k4348L380q2024O6211L7348l0312L4598j7867L5633M863k9489
15288c3672j9841Q4285O4792K9887j16999m8311N1676j3106j7064L5624J1914
15277B9185k3883n226K0589k4935M2244l3064n2729M8242M979l7522m7134l2134
15265a11388r318P4900O514p8647L068O9081L1159M5817J15209N7817n1758m3993
15253A08461r3161r8339k5930N3561J6969J3241l6406K0118o805P6630j0936O6831
15241H4234J9335p5042J1931L9413K9793K0153J7691o5220m4123k9982M3318J22354
$$ plain form
15229 173855 40212 13196 72106 41792 -26143 -64150 -123759 -80933 -143941 -4887 122480
15218 122480 92621 189166 238329 169687 82446 100286 46507 -99790 -173625 -114512 -18680
15207 -18680 -48172 -48961 -75841 -33850 -67036 -28513 35497 -13125 -57121 -84557 -30660 72582
15195 72582 49744 -19508 -64274 -41996 -67963 -5523 -40753 -64583 12326 127261 115872
15184 115872 36625 11580 -106277 -108724 -201034 -244842 -266937 -169415 15566 150295 -39837
15173 -39837 -131955 -236231 -100005 56091 -47546 -93740 -65163 -160393 -181662 -150457 -73379
15162 -73379 -52174 -106514 -84045 28176 4078 16244 68602 27528 37125 61295 43806 -30767
15150 -30767 7573 16468 76768 55370 43744 106267 29182 7188 80088 164353 158440 77539
$$ packed form
15229A73855j33643k7016N8910l0314o7935l8007n9609M2826o3008J39054J27367
15218A22480k9859R6545M9163o8642q7241J7840n3779j46297p3835N9113R5832
15207a8680k9492p89k6880M1991l3186L8523O4010m8622m3996k7436N3897J03242
15195G2582k2838o9252m4766K2278k5967O2440l5230k3830P6909J14935j1389
15184A15872p9247k5045j17857k447r2310m3808k2095R7522J84981J34729j90132
15173c9837r2118j04276J36226J56096j03637m6194K8577r5230k1269L1205P7078
15162g3379K1205n4340K2469J12221k4098J2166N2358m1074R597K4170j7489p4573
15150c0767L8340Q895O0300k1398j1626O2523p7085k1994P2900Q4265n913q0901
$$ plain form
15138 77539 -4673 22772 21219 -61746 -171270 -157005 -65747 33774 49649 47026 28189 36617
15126 36617 -88660 -192838 -164961 12105 44130 -52874 -42407 -77015 -187193 -263319 -176032
15115 -176032 -108033 -55801 -79010 -29611 -159995 -261652 -203919 -105325 -48815 -70148 -114890
15104 -114890 -51452 -39958 30730 142920 152953 198058 272191 329918 264207 99251 52384
15093 52384 137492 60982 860 -92471 -91379 -195816 -126382 85988 88529 53973 103606 66681
15081 66681 -20690 -110495 -162902 -133609 -66015 54330 157912 217228 153883 -16405 -50418
15070 -50418 37989 112191 136165 218693 220783 177805 121039 140402 144168 112221 74862 132364
15058 132364 69073 88450 101090 43367 -4468 91419 160860 146711 61208 49622 -40531
$$ packed form
15138G7539q2212K7445j553q2965j09524J4265R1258R9521J5875k623j8837Q428
15126C6617j25277j04178K7877J77066L2025r7004J0467l4608j10178p6126Q7287
15115a76032O7999N2232k3209M9399j30384j01657N7733R8594N6510k1333m4742
15104a14890O3438J1494P0688J12190J0033M5105P4133N7727o5711j64956m6867
15093E2384Q5108p6510o0122r3331J092j04437O9434K12370K541l4556M9633l6925
15081F6681q7371q9805n2407K9293O7594J20345J03582N9316o3345j70288l4013
15070e0418Q8407P4202K3974Q2528K090m2978n6766J9363L766l1947l7359N7502
15058A32364o3291J9377J2640n7723m7835R5887O9441j4149q5503j1586r0153
$$ plain form
15047 -40531 -103629 -72145 60074 59492 36743 -19256 -30865 18408 46947 35617 -298 -4040
15035 -4040 -53797 -86401 -166213 -106097 -103904 -110676 -138883 -31309 123022 33838 -16599 -16833
15023 -16833 -20384 -54928 -2670 -1747 -41502 -81851 -98174 -12659 85645 119782 117530 88098
15011 88098 18750 -8070 84223 117462 89606 80282 172238 125634 56364 105863 2587 -104704
14999 -104704 -17073 143162 95891 -51466 -48614 -24171 -7251 28852 -286 -116492 -96901
14988 -96901 -4732 47950 11506 1662 60849 8064 -96449 -53784 12957 -16850 -17197 41434
14976 41434 70412 23886 3430 34479 -4279 -111848 -130487 -91135 -74599 -21251 18875
14965 18875 -40327 -43321 -83419 -143997 -49007 -76642 -70532 -4811 30031 -85482 -171262 -156720
$$ packed form
15047d0531o3098L1484J32219n82k2749n5999j1609M9273K8539j1330l5915l742
15035d040m9757l2604p9812O0116K193o772k8207J07574J54331q9184n0437k34
15023a6833l551l4544N2258R23l9755m0349j6323Q5515R8304L4137k252k9432
15011H8098o9348k6820R2293L3239k7856r324R1956m6604o9270M9499j03276j07291
14999a04704Q7631J60235m7271j47357K852K4443J6920L6103k9138j16206J9591
14988i6901R2169N2682l6444r844N9187n2785j04513M2665O6741k9807l47N8631
14976D1434K8978m6526k0456L1049l8758j07569j8639L9352J6536N3348M0126
14965A8875n9202k994m0098o0578R4990k7635O110O5721L4842j15513q5780J4542
$$ plain form
14953 -156720 43817 65212 -35873 20965 -55714 -115493 4653 45544 -38327 -70627 -28561
14942 -28561 -6544 34001 45930 130701 156750 40606 35180 -22646 -32711 59022 120514 64912
14930 64912 56000 124615 163137 163488 137514 140758 22573 -60341 75921 81390 -9805 75796
14918 75796 122199 246880 306458 288641 248922 259275 246734 207548 122820 -3136 -35240
14907 -35240 9171 -7714 56527 96589 107264 40518 82600 57016 75375 111574 101436 -84877
14895 -84877 -165152 4268 -41968 -30448 30517 121036 160057 71208 -50572 -29399 59067
14884 59067 119079 38624 61715 59825 6550 -8384 -25554 -72161 43297 102351 46044 -52258
14872 -52258 -123780 -83890 -71145 -63469 2532 -5455 -11260 112271 37545 -110832 -184139 -53886
$$ packed form
14953a56720K00537K1395j01085N6838p6679n9779J20146M0891q3871l2300M2066
14942b8561K2017M0545J1929Q4771K6049j16144n426n7826j0065R1733O1492n5602
14930F4912q912O8615L8522L51k5974L244j18185q2914J36262N469r1195Q5601
14918G5796M6403J24681N9578j7817l9719J0353j2541l9186q4728j25956l2104
14907c5240M4411j6885O4241M0062J0675o6746M2082k5584J8359L6199j0138j86313
14895h4877q0275J69420m6236J1520O0965R0519L9021q8849j21780K1173Q8466
14884E9067O0012q0455K3091j890n3275j4934j7170m6607J15458N9054n6307r8302
14872e2258p1522L9890J2745P676O6001p987n805J23531p4726j48377p3307J30253
$$ plain form
14860 -53886 67201 3954 -73300 -103083 -1465 165620 240284 327530 233581 110576 44924
14849 44924 -29471 -38299 -84195 -64911 -17990 35059 15531 -94269 -96321 -21494 14382 22309
14837 22309 -25867 44783 147229 77943 56008 80682 57356 70108 53915 -19765 41484
14826 41484 165411 185701 88675 -26659 21317 69163 142378 86781 7784 -15520 8875
14815 8875 99999 64346 42895 -10828 -35221 -71440 -59003 -131467 -57154 -140332 -82857 -13227
14803 -13227 -10612 -7944 -9735 4799 -39453 -83988 -75809 -48823 18197 56045 5307 -89254
14791 -89254 -189179 -72867 -44220 -108882 -109508 -87268 -185056 -225258 -127256 -36235 -16749 18909
14779 18909 111849 84859 48301 -63509 -131017 -196997 -193057 -220512 -208661 -269138 -243696 -72616
$$ packed form
14860e3886J21087o3247p7254k9783J01618J67085P4664Q7246r3949j23005o5652
14849D4924p4395q828m5896J9284M6921N3049j9528j09800k052P4827L5876P927
14837B2309m8176P0650J02446o9286k1935K4674k3326J2752j6193p3680O1249
14826D1484J23927K0290r7026j15334M7976M7846P3215n5597p8997k3304K4395
14815H875R1124l5653k1451n3723k4393l6219J2437p2464P4313q3178N7475O9630
14803a3227K615K668j791J4534m4252m4535Q179K6986O7020L7848n0738r4561
14791h9254r9925J16312K8647o4662o26K2240r7788m0202R8002R1021J9486L5658
14779A8909R2940k6990l6558j11810o7508o5980L940k7455J1851o0477K5442J71080
$$ plain form
14767 -72616 34264 75283 121444 251917 270404 239980 330267 244451 175695 68426 -9105
14756 -9105 61576 131265 198875 101403 -5009 9915 -68122 -29237 -52693 9739 43001 -49639
14744 -49639 -174053 -143487 -93001 -116954 897 131119 201636 224702 193590 154299 21785
14733 21785 49768 87467 88858 -4248 -73264 -140283 -119092 -49110 -20420 -82254 -101781 -70575
14721 -70575 -15517 -18402 -13851 -90228 3166 34743 24120 56472 82063 19263 -46864 -95357
14709 -95357 -97257 -72489 -56041 -3811 -36911 29674 68820 102619 61154 45332 145656 149383
14697 149383 154190 110649 47795 98247 91874 46677 5498 61350 53211 14380 62977 -85549
14685 -85549 -226113 -111719 -62118 -37824 21238 136458 213386 224043 88239 30935 -55332
$$ packed form
14767g2616J06880M1019M6161J30473J8487l0424R0287q5816o8756j07269p7531
14756i105P0681O9689O7610r7472j06412J4924p8037L8885k3456O2432L3262r2640
14744d9639j24414L0566N0486k3953J17851J30222P0517K3066l1112l9291j32514
14733B1785K7983L7699J391r3106o9016o7019K1191O9982K8690o1834j9527L1206
14721g0575N5058k885M551p6377R3394L1577j0623L2352K5591o2800o6127m8493
14709i5357j900K4768J6448N2230l3100O6585L9146L3799m1465j5822J00324L727
14697A49383M807m3541o2854N0452o373m5197m1179N5852q139l8831M8597j48526
14685h5549j40564J14394M9601K4294N9062J15220P6928J0657j35804n7304q6267
$$ plain form
14674 -55332 -8328 89322 75549 -20477 -75032 4350 23659 8077 95412 34970 59282 140631
14662 140631 56028 -31027 -110400 -43088 63655 69131 22241 35789 75589 35163 47779
14651 47779 -117588 -125334 1197 46485 60103 -24161 -10009 5726 -90052 -222868 -185958
14640 -185958 -55091 -57258 15034 23451 -61537 -142930 -49871 59877 10462 -38678 -87949
14629 -87949 -41843 -89686 -116466 -54388 -6617 -40354 -149583 -110861 -5480 72804 68607
14618 68607 86521 62097 25598 117666 100477 82963 68810 46339 8159 -32085 -3860 -47803
14606 -47803 -54928 -70651 4516 -55952 6476 67745 7851 -60945 -76058 -5065 102604 123878
14594 123878 28794 156399 210646 160980 114769 110288 52377 -18125 -47923 -31450 -38745 -20465
$$ packed form
14674e5332M7004R7650j3773r6026n4555P9382J9309j5582Q7335o0442K4312Q1349
14662A40631q4603q7055p9373O7312J06743N476m6890J3548L9800m0426J2616
14651D7779j65367p746J26531M5288J3618q4264J4152J5735r5778j32816L6910
14640a85958J30867k167P2292Q417q4988q1393R3059J09748m9415m9140m9271
14629h7949M6106m7843k6780O2078M7771l3737j09229L8722J05381P8284m197
14618F8607J7914k4424l6499R2068j7189j7514j4153k2471l8180m0244K8225m3943
14606d7803p125j5723P5167o0468O2428O1269n9894o8796j5113P0993J07669K1274
14594A23878r5084J27605N4247m9666m6211m481n7911p0502k9798J6473p295J8280
$$ plain form
14582 -20465 84689 75486 33416 -2079 -41144 -56113 -66717 -53406 56786 93454 152791
14571 152791 193223 148716 106908 147833 255727 248612 177288 81010 -35491 -56407 -8089
14560 -8089 128584 103615 118228 139065 71765 10728 -43585 12865 -102057 -149883 -15673
14549 -15673 33961 6025 66887 109909 89612 144100 114907 52461 -82176 -27599 113111
14538 113111 124662 125921 151002 187528 77010 34284 89086 -9102 21205 -3030 64467
14527 64467 177105 174575 110040 159914 168725 133071 -23589 -136380 -99658 -36152 -9433
14516 -9433 60481 15948 -59300 -14610 52938 126120 316440 141778 -54582 13941 63531
14505 63531 -3109 -24626 33583 93590 -47093 -127256 -26016 80794 70388 105506 168381
$$ packed form
14582b0465J05154r203m2070l5495l9065j4969j0604J3311J10192L6668N9337
14571A52791M0432m4507m1808M0925J07894p115p1324r6278j16501k0916M8318
14560h089J36673k4969J4613K0837o7300o1037n4313N6450j14922m7826J34210
14549a5673M9634k7936O0862M3022k0297N4488k9193o2446j34637N4577J40710
14538A13111J1551J259K5081L6526j10518m2726N4802r8188L0307k4235O7497
14527F4467J12638k530o4535M9874Q811l5654j56660j12791L6722O3506K6719
14516i433O9914m4533p5248M4690O7548P3182J90320j74662j96360O8523M9590
14505F3531o6640k1517N8209O0007j40683q0163J01240J06810j0406L5118O2875
$$ plain form
14494 168381 178533 85837 -68806 7337 173758 391339 371051 239169 169947 137947 226291
14483 226291 370965 358090 427535 267104 48966 71366 49755 -20074 -62743 38018 169439
14472 169439 164736 218039 268813 355681 282569 181294 222540 198775 234256 250190 214900
14461 214900 184817 158499 165093 155907 -14613 -11873 119114 150785 141729 -53018 -87423 -64235
14449 -64235 31890 120005 139286 119114 104304 46263 24830 -38524 -66876 -7294 128394
14438 128394 350690 287598 177802 80614 85590 52538 69190 -30914 -45879 -88624 -71274
14427 -71274 60402 101211 152015 -23845 -141968 -18393 -8574 -8250 50829 24974 -31115
14416 -31115 146751 335077 321136 249995 185664 170191 140400 166939 94453 48396 116403
$$ packed form
14494A68381J0152r2696j54643P6143J66421K17581k0288j31882o9222l2000Q8344
14483B26291J44674j2875O9445j60431k18138K2400k1611o9829m2669J00761J31421
14472A69439m703N3303N0774Q6868p3112j01275M1246k3765L5481J5934l5290
14461B14900l0083k6318O594r186j70520K740J30987L1671r056j94747l4405K3188
14449f4235R6125Q8115J9281k0172j4810n8041k1433o3354k8352N9582J35688
14438A28394K22296o3092j09796r7188M976l3052J6652j00104j4965m2745J7350
14427g1274J31676M0809N0804j75860j18123J23575R819L24N9079k5855n6089
14416c1115J77866J88326j3941p1141o4331j5473k9791K6539p2486m6057O8007
$$ plain form
14405 116403 202973 205231 128789 87138 -13975 -114879 -37475 -6089 -56545 -66975 -47020
14394 -47020 -18519 78412 180695 103497 10443 623 2115 6290 -2087 1594 -67715 20783
14382 20783 116731 124605 72301 76042 21134 122767 73796 22840 11241 -6402 4316 -45879
14370 -45879 -39084 38195 11054 94731 143055 99437 59591 61145 32867 67381 164785 131590
14358 131590 77011 -19724 -83852 -41284 40302 42635 27362 -1069 84580 138096 134094 80344
14346 80344 100090 94137 135903 140998 149852 184562 159354 155870 214245 158835 64226 4840
14334 4840 105029 75258 57197 -47076 -79731 -30055 45806 130405 156602 131429 -47233
14323 -47233 -108490 -153538 -24499 -12993 30001 -9111 -128811 -221688 -141725 -75650 -172365
$$ packed form
14405A16403Q6570K258p6442m1651j01113j00904P7404L1386n0456j0430J9955
14394d7020K8501R6931J02283p7198r3054r820J492M175q377L681o9309Q8498
14382B0783R5948P874n2304L741n4908J01633m8971n0956j1599j7643J0718n0195
14370d5879O795P7279k7141Q3677M8324m3618l9846J554k8278L4514R7404l3195
14358A31590n4579r6735o4128M2568Q1586K333j5273k8431Q5649N3516m002n3750
14346H0344J9746n953M1766N095Q854L4710k5208l484N8375n5410r4609n9386
14334D840J00189k9771j8061j04273l2655M9676P5861Q4599K6197k5173j78662
14323d7233o1257m5048J29039J1506M2994l9112j19700r2877P9963O6075r6715
$$ plain form
14312 -172365 -116401 41763 73763 53141 183756 131058 41812 -9538 59568 81418 27763
14301 27763 -16757 14560 46508 157237 29381 -63513 9721 36660 75488 116822 27978
14290 27978 47448 62244 -35479 -146369 -159240 -131196 -140154 -71654 106833 100823 83279 191825
14278 191825 406446 394770 255648 174187 105302 71210 7667 47598 68241 62569 -14207
14267 -14207 80622 57873 11397 10656 71430 100810 26877 114156 172270 171524 138420 146456 113366
14254 113366 84954 98398 94906 85663 174651 244183 224053 219207 195819 88185 -85534 -48157
14242 -48157 78444 51495 41003 119851 151391 106665 157903 210141 136320 62358 41836
14231 41836 -20021 32112 163309 202258 126162 74629 95381 157575 226608 218492 157260 144300
$$ packed form
14312a72365N5964J58164L2000k0622J30615n2698q9246n1350O9106K1850n3655
14301B7763m4520L1317L1948J10729j27856r2894P3234K6939L8828M1334q8844
14290B7978J9470J4796r7723j10890j2871K8044q958O8500J78487o010j7544J08546
14278A91825K14621j1676j39122q1461o8885l4092o3543L9931K0643n672p6776
14267a4207R4829k2749m6476p41O0774K9380p3933Q7279N8114p46l3104Q036l3090
14254A13366k8412J3444l492r243Q8988O9532k0130m846k3388j07634j73719L7377
14242d8157J26601k6949j0492P8848L1540m4726N1238N2238p3821p3962k0522
14231D1836o1857N2133J31197L8949p6096n1533K0752O2194O9033q116o1232j2960
$$ plain form
14219 144300 180821 190512 94969 101850 45818 179534 230181 207512 123556 87469 38564 -43949
14207 -43949 -12604 79604 137849 1521 -27333 56698 247699 178422 -16025 28823 131422
14196 131422 35576 143662 231141 226908 220711 209036 169971 81977 103681 150285 107588 90657
14184 90657 77529 100940 193846 105071 188429 267082 229159 211773 104298 138771 136961 35699
14172 35699 -51799 -77424 -39064 18838 12894 -40938 25226 7617 25136 126957 163957 201713
14160 201713 126583 51795 73737 102373 103781 101651 118542 115949 222691 283240 263720 147394
14148 147394 162636 222154 176304 134667 155238 210238 155567 128870 69770 179982 191853
14137 191853 86505 775 -15556 34532 23542 17047 -82521 9960 63709 79496 94672
$$ packed form
14219A44300L6521R691r5543O881n6032J33716N0647k2669q3956l6087m8905q2513
14207d3949L1345R2208N8245j36328k8854Q4031J91001o9277j94447M4848J02599
14196A31422r5846J08086Q7479m233o197j1675l9065q7994K1704M6604m2697j6931
14184I0657j3128K3411R2906q8775Q3358P8653l7923j7386j07475L4473j810j01262
14172C5699q7498k5625L8360N7902n944n3832O6164j7609J7519J01821L7000L7756
14160B01713p5130p4788K1942K8636J408k130J6891k593J06742O0549j9520j16326
14148A47394J5242N9518m5850m1637K0571N5000n4671k6697n9100J10212J1871
14137A91853j05348q5730j6331N0088j0990o495r9568R2481N3749J5787J5176
$$ plain form
14126 94672 138540 238367 372438 290916 227601 196932 216405 102883 155472 211929 302522
14115 302522 278081 244415 166102 112770 102528 64943 20722 -21482 27300 222861 342700
14104 342700 321372 307106 226752 167963 97434 83840 55834 1699 -48305 -113231 -4899
14093 -4899 127298 169027 219036 199192 56508 103120 120769 122017 31083 73983 150689 52775
14081 52775 -628 13612 75500 14532 68249 67473 17844 104878 168564 106829 -82522 -97825
14069 -97825 51729 175412 247482 268514 320083 195181 94051 24105 116441 181542 147752
14058 147752 171189 139913 99920 121574 67739 74265 63350 -15479 39601 208967 165185
14047 165185 106769 -46053 54489 54695 39063 4095 11376 25385 75171 74178 212044 169695
$$ packed form
14126I4672M3868R9827J34071q1522o3315l0669J9473j13522N2589N6457R0593
14115C02522k4441l3666p8313n3332j0242l7585m4221m2204M8782J95561J19839
14104C42700k1328j4266q0354n8789p0529j3594k8006n4135n0004o4926J08332
14093d899J32197M1729N0009j9844j42684M6612J7649J248r0934M2900P6706r7914
14081E2775n3403J4240O1888o0968N3717p76m9629Q7034O3686o1735j89351j5303
14069i7825J49554J23683P2070K1032N1569j24902j01130o9946R2336O5101l3790
14058A47752K3437l1276l9993K1654n3835O526j0915p8829N5080J69366m3782
14047A65185n8416j52822J00542K06j5632l4968P281J4009M9786r93J37866m2349
$$ plain form
14035 169695 58239 54994 97657 155819 112030 170723 125573 90296 94455 154013 172844 73742
14023 73742 -22510 141845 127612 123202 75229 90344 145254 121079 3895 58165 201897
14012 201897 184855 174230 146588 145215 101217 25845 74492 144105 154560 96510 104764 121012
14000 121012 144048 252513 271255 158287 162142 136064 31188 37050 134576 104991 97181
13989 97181 85541 93245 55064 113508 187691 155104 41688 -21254 20518 160258 159616 113574
13977 113574 -14252 -135212 -114975 -42979 -31411 -44098 40472 124248 98034 -104 -29694
13966 -29694 33126 42021 54031 91556 126770 99329 158962 254535 212613 146263 170907 259532
13954 259532 224643 216529 209783 290587 285725 295408 197502 79638 130774 124397 134149 115033
$$ packed form
14035A69695j11456l245M2663N8162m3789N8693m5150l5277M159N9558J8831r9102
14023G3742r6252J64355j4233m410m7973J5115N4910k4175j17184N4270J43732
14012B01897j7042j0625k7642j373m3998p5372M8647O9613J0455n8050Q254J6248
14000A21012K3036J08465J8742j12968L855k6078j04876N862R7526k9585p810
13989I7181j1640P704l8181N8444P4183l2587j13416o2942M1772J39740o42m6042
13977A13574j27826j20960K0237P1996J1568j2687Q4570Q3776k6214r8138k9590
13966b9694O2820Q895J2010L7525L5214k7441N9633R5573m1922o6350K4644Q8625
13954B59532l4889q114o746Q0804m862R683r7906j17864N1136o377R752j9116
$$ plain form
13942 115033 -27517 124462 324730 254345 230608 235874 239418 284411 140370 61253 110610
13931 110610 10410 58342 127549 117734 78485 100925 102789 170805 214956 190048 155361 132957
13919 132957 132482 78457 43108 -42753 -90624 -70717 -141654 -96854 -35581 -73080 -79703 35470
13907 35470 179167 154382 84723 31375 42187 -91314 -61763 18849 66624 71523 38486
13896 38486 3363 27373 37932 45818 134797 102095 97358 144831 201372 251692 280382 305380
13884 305380 217831 33378 88977 214004 151526 161916 160233 148980 247379 232979 193469
13873 193469 155305 205481 105586 6969 -23700 -63676 -30001 51408 55463 22617 135144
13862 135144 153425 -28674 -34173 23341 -54922 79641 143146 25975 40152 43700 -38118
$$ packed form
13942A15033j42550J51979K00268p0385k3737N266L544M4993j44041p9117M9357
13931A10610j00200M7932O9207r815l9249K2440J864O8016M4151k4908l4687k2404
13919A32957m75n4025l5349q5861m7871J9907p0937M4800O1273l7499o623J15173
13907C5470J43697k4785o9659n3348J0812j33501K9551Q0612M7775M899l3037
13896C8486l5123K4010J0559P886Q8979l2702m737M7473N6541N0320K8690K4998
13884C05380q7549j84453N5599J25027o2478J0390j683j1253R8399j4400l9510
13873A93469l8164N0176r9895r8617l0669l9976L3675Q1409M055l2846J12527
13862A35144J8281j82099n499N7514p8263J34563O3505j17171J4177L548q1818
$$ plain form
13851 -38118 -66328 50254 216889 214113 287204 232527 137099 157806 68205 -17096 -7594 90489
13839 90489 201895 159313 222723 261045 185109 126047 118936 106095 144133 297690 387552
13828 387552 336916 305853 205963 63650 52282 144080 105348 1958 11219 -10287 4031
13817 4031 63030 43813 81938 216371 279328 304888 207383 202742 257639 169702 75580 232831
13805 232831 354849 423355 479261 491173 375839 302007 292517 215148 273383 306225 276471
13794 276471 150992 244197 323021 232712 229599 181992 67768 202594 210266 215262 171957
13783 171957 179272 118398 45830 134035 96467 49153 90072 103300 129740 171326 176548 163873
13771 163873 63072 150777 92469 12114 -20109 -73411 -110633 -106886 -16093 95578 147434
$$ packed form
13851c8118k8210J16582J66635k776P3091n4677r5428K0707q9601q5301R502R8083
13839I0489J11406m2582O3410L8322p5936n9062p111j2841L8038J53557Q9862
13828C87552n0636l1063r9890j42313j1368R1798l8732j03390R261k1506J4318
13817D031N8999j9217L8125J34433O2957K5560r7505m641N4897q7937r4122J57251
13805B32831J22018O8506N5906J1912j15334p3832r490p7369N8235L2842k9754
13794B76471j25479R3205P8824r0309l113m7607j14224J34826P672M996m3305
13783A71957P315o0874p2568Q8205l7568m7314M0919J3228K6440M1586N222j2675
13771A63873j00801Q7705n8308q0355l2223n3302l7222L747R0793J11671N1856
$$ plain form
13760 147434 98521 86987 75246 52696 135035 58111 94174 116133 191648 209609 183629
13749 183629 154310 164707 149474 154450 72379 168492 169755 84455 46773 -30328 71816 66163
13737 66163 114674 190675 184396 181923 224451 251741 190216 71151 50160 43791 -31048 -89857
13725 -89857 -49288 -26155 -21932 -75893 -110115 81792 143389 199002 213303 242456 202696 229039
13713 229039 269860 315217 328174 249399 192466 173426 216381 227990 198187 160536 176471
13702 176471 178647 144030 151541 177998 112754 182154 170925 134075 176832 159222 194930 219052
13690 219052 172418 157484 273342 376980 284098 295184 258219 219582 335462 332918 256148
13679 256148 213763 212260 279574 315235 203857 217687 266634 181851 129177 140292 203742
$$ packed form
13760A47434m8913j1534j1741k2550Q2339p6924L6063K1959P5515J7961k5980
13749A83629k9319J0397j5233M976q2071R6113J263q5300l7682p7101J02144n653
13737F6163M8511P6001o279k473M2528K7290o1525j19065k0991o369p4839n8809
13725h9857M0569K3133M223n3961l4222J91907O1597N5613J4301K9153l9760K6343
13713B29039M0821M5357J2957p8775n6933j9040M2955J1609k9803l7651J5935
13702A76471K176l4617P511K6457o5244O9400j1229l6850M2757j7610L5708K4122
13690B19052m6634j4934J15858J03638r2882J1086l6965l8637J15880k544p6770
13679B56148m2385j503O7314L5661j11378J3830M8947q4783n2674J1115O3450
$$ plain form
13668 203742 104180 46627 40136 -8606 -29921 74760 156041 279844 205275 137572 133723
13657 133723 132013 56406 38327 84545 210314 416619 384970 218346 123841 106883 77944
13646 77944 130698 136331 132488 171354 186605 171460 110900 5422 -51483 -22466 29746 44292
13634 44292 64312 34220 52638 78056 147212 153423 78250 116630 154311 183159 199173 177601
13622 177601 215091 170016 190489 281346 242469 194992 178415 180132 164987 229657 195048 207095
13610 207095 234615 268029 241859 318591 383167 414781 290177 241747 339863 330558 344684
13599 344684 333788 304052 191682 139833 32267 99281 134562 165547 125767 130027 215424
13588 215424 292732 358326 372461 302750 315008 411855 382696 323212 278606 250829 291969
$$ packed form
13668B03742r9562n7553o491m8742k1315J04681Q1281J23803p4569o7703l849
13657A33723j710p5607j8079M6218J25769K06305l1649j66624r4505j6958k8939
13646G7944N2754N633l843L8866J5251j5145o0560j05478n6905K9017N2212J4546
13634D4292K0020l0092J8418K5418O9156O211p5173L8380L7681K8848J6014k1572
13622A77601L7490m5075K0473R0857l8877m7477j6577J717j5145O4670l4609J2047
13610B07095K7520L3414k6170P6732O4576L1614j24604m8430R8116r305J4126
13599C44684j0896k9736j12370n1849j07566O7014L5281L0985l9780M260Q5397
13588B15424P7308O5594J4135o9711J2258R6847k9159n9484m4606k7777M1140
$$ plain form
13577 291969 320375 225754 371253 412700 298673 266821 287434 345786 441042 447695 238082
13566 238082 97095 85549 127967 209514 111770 68206 93437 185317 290668 362598 412494
13555 412494 423695 359670 373109 429349 329285 192160 60430 91526 156552 282237 329816
13544 329816 260523 106646 134442 226454 213958 155410 112536 171856 103839 61410 69243
13533 69243 126992 107995 121226 68113 67605 115300 136193 11291 -78996 46021 59493 29194
13521 29194 58043 241341 257117 75538 -49955 64055 137805 105753 220589 262339 275555
13510 275555 288730 286785 255251 158641 155868 154839 159147 47521 148342 245655 61162 -8170
13498 -8170 71944 122308 72518 76679 62900 111242 214589 353547 387896 309733 225349 187691
$$ packed form
13577B91969K8406r4621J45499M1447j14027l1852K0613N8352R5256O653k09613
13566B38082j40987j1546M2418Q1547r7744m3564K5231R1880J05351P1930M9896
13555D12494J1201o4025J3439N6240j00064j37125j31730L1096O5026J25685M7579
13544C29816o9293j53877K7796R2012j2496n8548m2874N9320o8017m2429P833
13533F9243N7749j8997J3231n3113n08M7695K0893j24902r0287J25017J3472l0299
13521B9194K8849J83298J5776j81579j25493J14010P3750l2052J14836M1750J3216
13510B75555J3175j945l1534r6610k773j029M308j11626J00821R7313j84493o9332
13498h170Q0114N0364m9790M161j3779M8342J03347J38958L4349p8163q4384l7658
$$ plain form
13486 187691 84833 72129 214871 295195 348948 360644 258112 381676 346497 268924 323519
13475 323519 373052 368651 267089 294456 310471 321733 292566 369767 344245 322016 357613
13464 357613 313036 162993 193714 238836 269268 254323 208036 284806 382632 261809 126119
13453 126119 -8633 156058 327013 231680 181453 134793 176703 203574 187376 294611 303465
13442 303465 310190 228770 212620 168523 260320 335518 349210 444512 411764 355604 361744 324678
13430 324678 362437 246229 147304 107052 -21825 87296 223797 331209 401168 341219
13420 341219 233100 261223 232858 92223 20285 62193 84525 70883 187842 217644 231101
13409 231101 208463 247492 247737 251827 355522 526825 491572 496538 399740 240764 298759 446353
$$ packed form
13486A87691j02858j2704J42742Q0324N3753J1696j02532J23564l5179p7573N4595
13475C23519M9533m401j01562K7367J6015J1262k9167P7201k5522k2229L5597
13464C57613m4577j50043L0721M5122L0432j4945m6287P6770R7826j20823j35690
13453A26119j34752J64691J70955r5333n0227m6660M1910K6871j6198J07235Q854
13442C03465O725q1420j6150m4097R1797P5198J3692R5302l2748n6160O140l7066
13430C24678L7759j16208r8925m0252j28877J09121J36501J07412O9959n9949
13420C41219j08119K8123k8365j40635p1938M1908K2332j3642J16959K9802J3457
13409B31101k2638L9029K45M090J03695J71303l5253M966r6798j58976N7995J47594
$$ plain form
13397 446353 354853 194826 268463 395325 354441 232409 197497 253138 244893 172098 129579
13386 129579 -23028 -20436 72684 186388 226881 156253 276545 279559 253992 347266 487976
13375 487976 462433 440815 247337 254317 251654 291724 303070 284747 256359 120360 -37163
13364 -37163 -35325 -501 26005 231066 255053 221850 210095 177849 225758 250235 133495
13353 133495 125453 103509 148328 170179 240144 255981 242668 232022 170011 222242 215228 227184
13341 227184 283749 286940 179935 193506 236077 287048 310456 291673 199103 102189 91152
13330 91152 242955 230146 239386 144133 127772 116481 168987 291177 253424 116394 122005
13319 122005 181027 230090 156594 182103 294205 236088 124563 55636 222939 397776 360490
$$ packed form
13397D46353r1500j60027P3637J26862m0884j22032l4912N5641q245p2795m2519
13386A29579j52607K592R3120J13704M0493p0628J20292L014k5567R3274J40710
13375D87976k5543k1618j93478O980k663M0070J1346j8323k8388j35999j57523
13364c7163J838L4824K6506K05061K3987l3203j1755l2246M7909K4477j16740
13353A33495q042k1944M4819K1851O9965J5837j3313j0646o2011N2231p014J1956
13341B27184N6565L191j07005J3571M2571N0971K3408j8783r2570r6914j1037
13330I1152J51803j2809R240r5253j6361j1291N2506J22190l7753j37030N611
13319A22005N9022M9063p3496K5509J12102n8117j11525o8927J67303J74837l7286
$$ plain form
13308 360490 313796 327105 361101 403245 371596 340394 293841 238240 196020 152911 269486
13297 269486 301994 368619 361662 286432 275052 333001 323270 390324 307578 320311 376585 291476
13285 291476 330617 394501 420238 320809 194317 237474 234609 241112 232177 295088 411360 477120
13273 477120 509678 557316 585284 458779 473665 339126 304716 269826 279177 296450 237251
13262 237251 185068 292488 357698 352694 283272 236900 165505 315738 433478 410126 315854
13251 315854 336925 296592 327531 386584 358484 265930 213173 324328 419703 384695 352087
13240 352087 288327 298679 158902 244716 225388 239103 348711 401014 462295 462387 483672 483880
13228 483880 424341 356577 304844 305466 220325 133623 192455 301772 272856 316721 293624 362484
$$ packed form
13308C60490m6694J3309L3996M2144l1649l1202m6553n5601m2220m3109J16575
13297B69486L2508O6625o957p5230j1380N7949r731O7054q2746J2733N6274q5109
13285B91476L9141O3884K5737r9429j26492M3157k865O503q935O2911J16272O5760
13273D77120L2558M7638K7968j26505J4886j34539l4410l4890R351J7273n9199
13262B37251n2183J07420O5210n004o9422m6372p1395J50233J17740k3352r4272
13251C15854K1071m0333L0939N9053k8100r2554n2757J11155R5375l5008l2608
13240C52087o3760J0352j39777Q5814j9328J3715J09608N2303O1281R2K1285K08
13228D83880n9539o7764n1733O22q5141q6702N8832J09317k8916M3865k3097O8860
$$ plain form
13216 362484 404017 380509 460167 386269 329259 361595 427369 327778 339607 411297 470925
13205 470925 489515 486766 543615 434312 324275 160005 139138 269686 428363 441051 427347
13194 427347 455466 361161 474388 481211 356380 279416 349454 412863 421184 402040 425912
13183 425912 440155 472222 427004 434360 444789 425245 501459 527630 547145 432013 414274
13172 414274 497010 482347 407282 336644 279716 367321 403082 305477 339325 407467 464921
13161 464921 413482 488450 502149 542506 516507 474127 298890 253897 246380 170035 197724
13150 197724 222967 258411 247590 328639 308369 415191 394635 345266 422763 453284 469778
13139 469778 462416 426001 466547 418623 373474 285978 379581 497506 415749 422437 541948
$$ packed form
13216C62484M1533k3508P9658p3898n7010L2336O5774r9591J1829P1690N9628
13205D70925J8590k749N6849j09303j10037j64270k0867J30548J58677J2688j3704
13194D27347K8119r4305J13227O823j24831p6964P0038O3409Q321j9144K3872
13183D25912J4243L2067m5218P356J0429j9544P6214K6171J9515j15132j7739
13172D14274Q2736j4663p5065p0638n6928Q7605L5761r7605L3848O8142N7454
13161D64921n1439P4968J3699M0357k5999m2380j75237m4993p517p6345K7689
13150A97724K5243L5444j0821Q1049k0270J06822k0556m9369P7497L0521J6494
13139D69778p362l6415M0546m7924m5149q7496R3603J17925q1757O688J19511
$$ plain form
13128 541948 574594 500535 532103 369724 218957 183855 382114 502586 443950 504762 603470
13117 603470 586816 570728 509501 537277 566837 540325 604040 677396 782797 750649 701295
13106 701295 637648 532041 550811 480503 422686 385114 356118 328815 304990 210763 234807
13095 234807 355237 485909 549325 525470 596825 566104 560298 532695 483510 439324 475804
13084 475804 530491 513642 517526 603156 762965 713820 633448 590296 550408 622044 657883
13073 657883 549478 523106 475573 485131 431120 383915 477926 517353 502424 426587 414223
13062 414223 562710 665890 572093 508496 537580 630626 569030 562326 549876 565549 651516
13051 651516 577071 531858 594154 666111 735933 740473 750670 583748 466514 422254 412583
$$ packed form
13128E41948L2646p4059L1568j62379j50767l5102J98259J20472n8636O0812R8708
13117F03470j6654j6088o1227K7776K9560k6512O3715P3356J05401l2148m9354
13106G01295o3647j05607J8770p0308n7817l7572k8996k7303k3825r4227K4044
13095B34807J20430J30672O3416k3855P1355l0721n806k7603m9185m4186L6480
13084D75804N4687j6849L884Q5630J59809m9145q0372m3152l9888P1636L5839
13073F57883j08405k6372m7533R558n4011m7205R4011L9427j4929p5837j2364
13062D14223J48487J03180r3797o3597K9084R3046o1596o704j2450J5673Q5967
13051F51516p4445m5213O2296P1957O9822M540J0197j66922j17234m4260r671
$$ plain form
13040 412583 420103 456486 539674 562604 589428 597150 546331 600368 513779 512736 645692 695332
13028 695332 723552 803297 841927 714572 593061 634404 695733 626037 648798 618957 627523
13017 627523 575233 617499 589326 529033 663482 731968 738836 683587 554087 566180 598368
13006 598368 676221 691860 739634 650439 618140 528962 414523 345382 415844 487646 434629
12995 434629 382951 415596 519664 483048 557695 645099 645999 752599 734845 604001 567776
12984 567776 577255 616360 556903 598255 621884 686985 684078 597655 544061 506675 565653 681487
12972 681487 819382 787342 860709 1004491 1140912 1224236 1195196 1284212 1397010 1622710
12962 1622710 1663545 1685217 1780307 1835786 1912591 1827111 1729230 1664213 1543111 1447556 1396049
$$ packed form
13040D12583P520L6383Q3188K2930K6824P722n0819N4037q6589j043J32956M9640
13028F95332K8220P9745L8630j27355j21511M1343O1329o9696K2761k9841Q566
13017F27523n2290M2266k8173o0293J34449O8486O868n5249j29500J2093L2188
13006E98368P7853J5639M7774q9195l2299q9178j14439o9141P0462P1802n3017
12995D34629n1678L2645J04068l6616P4647Q7404R00J06600j7754j30844l6225
12984E67776R479L9105n9457M1352K3629O5101k907q6423n3594l7386N8978J15834
12972F81487J37895l2040P3367J43782J36421Q3324k9040Q9016J12798K25700
12962A622710M0835K1672R5090N5479P6805q5480r7881o5017j21102r5555n1507
$$ plain form
12951 1396049 1432118 1550541 1646654 1609967 1527428 1468739 1604301 1552943 1453558 1335580 1341301
12940 1341301 1513381 1704989 1913794 1921132 1983557 2161068 2307569 2510925 2591518 2620830
12930 2620830 2659119 2587516 2621179 2711616 2770234 2770624 2672529 2559328 2390156 2246031 2273958
12919 2273958 2286034 2124488 1943293 1807047 1780768 1808406 1685341 1663974 1630983 1751743
12909 1751743 1729888 1580647 1422359 1500584 1769663 1915091 2026997 2088045 2081724 2054812
12899 2054812 2055607 2043745 2235106 2213031 2205221 2199237 2143820 2031498 1923568 1713246 1547638
12888 1547638 1382876 1355448 1337532 1250801 1155031 990743 932926 828561 792523 842125 812243
12877 812243 767446 794775 788662 846511 816114 802834 809721 705827 741856 749860 745077 752957
$$ packed form
12951A396049L6069J18423R6113l6687q2539n8689J35562n1358r9385j17978N721
12940A341301J72080J91608K08805P338O2425J77511J46501K03356Q0593K9312
12930B620830L8289p1603L3663R0437N8618L90r8095j13201j69172j44125K7927
12919B273958J2076j61546j81195j36246k6279K7638j23065k1367l2991J20760
12909A751743k1855j49241j58288P8225K69079J45428J11906O1048o321k6912
12899B054812P95j1862J91361k2075p810n984n5417j12322j07930k10322j65608
12888A547638j64762k7428j7916q6731r5770j64288n7817j04365l6038M9602k9882
12877H12243m4797K7329o113N7849l0397j3280O887j03894L6029Q004m783P880
$$ plain form
12865 752957 785730 784935 722300 693977 715241 801389 904765 912267 873994 818790 731739 757550
12853 757550 803649 735411 794346 815585 797703 844453 807065 740657 781190 730549 591453
12842 591453 592167 716347 730099 798744 812273 730488 769213 914134 958585 860205 749711
12831 749711 799650 781592 797564 705099 666820 539668 578291 633283 626820 742810 852808
12820 852808 741471 788947 918729 910864 814992 761338 707458 692486 660569 783649 838630
12809 838630 855086 821388 766956 692724 671376 699509 648942 732964 832260 852452 912400
12798 912400 854814 853745 872424 837359 783818 758480 907338 1034549 1125817 1173559 1190837
12787 1190837 1174310 1284785 1141868 1145963 1194633 1148508 1019164 999957 937971 935677 1052722
$$ packed form
12865G52957L2773p95o2635k8323K1264Q6148J03376P502l8273n5204q7051K5811
12853G57550M6099o8238N8935K1239j7882M6750l7388o6408M0533n0641j39096
12842E91453P14J24180J3752O8645J3529q1785L8725J44921M4451r8380j10494
12831G49711M9939j8058J5972r2465l8279j27152L8623N4992o463J15990J09998
12820H52808j11337M7476J29782p865r5872n3654n3880j4972l1917J23080N4981
12809H38630J6456l3698n4432p4232k1348K8133n0567Q4022R9296K0192N9948
12798I12400n7586j069J8679l5065n3541k5338J48858J27211R1268M7742J7278
12787A190837j6527J10475j42917M095M8670m6125j29344j9207o1986k294J17045
$$ plain form
12776 1052722 1203911 1220474 1069001 1002200 1005684 1085976 1067351 1100201 1105669 1164356 1163948 1153310
12764 1153310 1142366 1113270 1228954 1295822 1246339 1247444 1343980 1303783 1326444 1262876 1206666
12753 1206666 1101556 1109377 1108319 1145183 1133019 1203563 1364357 1370758 1284267 1368348 1441498
12742 1441498 1468851 1537019 1628230 1711705 1802027 1782936 1675412 1573147 1547224 1570041 1515263
12731 1515263 1582417 1521525 1515876 1559799 1547926 1553859 1575175 1437780 1279296 1274707 1374151
12720 1374151 1552481 1520452 1472876 1489313 1454222 1346729 1275852 1345311 1429646 1464464 1598852
12709 1598852 1668037 1635253 1557877 1560586 1610694 1541344 1528813 1641040 1591592 1577612 1591711
12698 1591711 1624477 1622695 1594131 1556625 1513741 1499228 1578515 1553174 1597167 1582939 1694332
$$ packed form
12776A052722J51189J6563j51473o6801L484Q0292j8625L2850N468N8687m08j0638
12764A153310j0944k9096J15684O6868m9483J105R6536m0197K2661o3568n6210
12753A206666j05110P821j058L6864j2164P0544J60794O401q6491Q4081P3150
12742A441498K7353O8168R1211Q3475R0322j9091j07524j02265k5923K2817n4778
12731A515263O7154o0892n649M3923j1873N933K1316j37395j58484m589R9444
12720A374151J78330l2029m7576J6437l5091j07493p0877O9459Q4335L4818J34388
12709A598852O9185l2784p7376K709N0108o9350j2531J12227m9448j3980J4099
12698A591711L2766j782k8564l7506m2884j4513P9287k5341M3993j4228J11393
$$ plain form
12687 1694332 1693420 1626678 1539742 1609652 1681023 1669239 1646276 1715003 1782700 1784462 1689083 1665571
12675 1665571 1708820 1726552 1804018 1933374 1980132 1887364 1888390 1898471 1883130 1840699 1823659
12664 1823659 1942041 1979576 1877422 1745599 1763015 1837146 2077672 2085700 1985620 2011627
12654 2011627 2013833 1981165 2006053 1903065 1850010 1883607 1934804 1968947 2048443 2003308 1954099
12643 1954099 2054492 2078475 2164349 2193570 2364765 2474856 2546582 2576589 2623096 2700699 2745214
12632 2745214 2724117 2630623 2523879 2427180 2427984 2445318 2396929 2409706 2365911 2440750 2412290
12621 2412290 2460251 2517034 2569380 2691128 2718256 2763304 2833267 2662772 2746855 2882976 2904909
12610 2904909 2905450 2976666 3006889 2995508 2857772 2842884 3031651 3070976 3063606 3147432 3193847
$$ packed form
12687A694332r12o6742q6936O9910P1371j1784k2963O8727O7697J762r5379k3512
12675A665571M3249J7732P7466J29356M6758r2768J026J0081j5341m2431j7040
12664A823659J18382L7535j02154j31823J7416P4131K40526Q028j00080K6007
12654B011627K206l2668K4888j02988n3055L3597N1197L4143P9496m5135m9209
12643A954099J00393K3983Q5874K9221J71195J10091P1726L0007M6507P7603M4515
12632B745214k1097r3494j06744r6699Q04J7334m8389J2777m3795P4839k8460
12621B412290M7961N6783N2346J21748K7128M5048O9963j70495Q4083J36121K1933
12610B904909N41P1216L0223j1381j37736j4888J88767L9325p370Q3826M6415
$$ plain form
12599 3193847 3211113 3192960 3318791 3432484 3482365 3636662 3695878 3776049 3836747 3839446 3862827
12588 3862827 3974847 4029912 4094590 4347443 4448936 4573339 4664335 4722710 4843835 4945808
12578 4945808 5040640 5169600 5318311 5403051 5468613 5611634 5753969 5968945 5924274 5874377
12568 5874377 6069791 6302208 6458344 6395657 6492254 6771668 6927592 7018688 7175716 7306761
12558 7306761 7423261 7613226 7764730 7889743 8165152 8386511 8662442 8878552 9054590
12549 9054590 9536611 10035894 10472851 10833456 11279880 11821252 12368567 12931761 13413862
12540 13413862 13942407 14462238 15072759 15559793 16084814 16886579 17628903 18440445 19497192
12531 19497192 20661426 22071844 23607760 25428665 27477948 29900201 32559423 35870906
$$ packed form
12599C193847J7266j8153J25831J13693M9881J54297N9216Q0171O0698K699K3381
12588C862827J12020N5065O4678K52853J01493J24403R0996N8375J21125J01973
12578D945808R4832J28960J48711Q4740O5562J43021J42335K14976m4671m9897
12568E874377J95414K32417J56136o2687R6597K79414J55924R1096J57028J31045
12558G306761J16500J89965J51504J25013K75409K21359K75931K16110J76038
12549I054590M82021M99283M36957L60605M46424N41372N47315N63194M82101
12540A3413862N28545N19831O10521M87034N25021Q01765P42324Q11542J056747
12531A9497192J164234J410418J535916J820905K049283K422253K659222L311483
$$ plain form
12523 35870906 39777851 44456688 50036040 56767327 65134639 75646638 88681604 104815178
12515 104815178 124814119 148656591 175948018 205285920 233702220 257442756 273456126
12508 273456126 279863174 276228359 264186310 246421017 226032026 205875440 187703960
12501 187703960 172684056 161465126 154127459 150508481 150428691 153272113 158599604 165647225
12493 165647225 173474213 181496389 190100751 200462861 214172165 233118755 258011936
12486 258011936 288172386 321475791 354727237 384961596 410056937 428078231 437666348
12479 437666348 438215431 429596326 412829546 390937855 367446842 345611630 327831326
12472 327831326 315072450 306394540 299933583 292916446 283254958 270202947 254521211
$$ packed form
12523C5870906L906945M678837N579352O731287Q367312J0511999J3034966J6133574
12515A04815178J9998941K3842472K7291427K9337902K8416300K3740536J6013370
12508B73456126O407048l634815j2042049j7765293k0388991k0156586j8171480
12501A87703960j5019904j1218930p337667l618978p9790K843422N327491P047621
12493A65647225P826988Q022176Q604362J0362110J3709304J8946590K4893181
12486B58011936L0160450L3303405L3251446L0234359K5095341J8021294R588117
12479D37666348N49083q619105j6766780k1891691k3491013k1835212j7780304
12472C27831326j2758876q677910o460957p017137r661488j3052011j5681736
$$ plain form
12465 254521211 238405715 224329166 213796184 207045728 203428009 201399938 199943194
12458 199943194 199004100 199405879 202310140 209283412 221360235 239415651 263696101 293815234
12450 293815234 327846481 361521121 388965909 404389687 403764269 386620669 355907995
12443 355907995 316844924 274995346 234459261 198129476 166888495 140708853 119355453
12436 119355453 102070005 88033586 76681632 67259021 59447039 52942993 47434409
12429 47434409 42725600 38673675 35208792 32171169 29510833 27142114 25005586 23167093
12421 23167093 21593991 20129112 18771604 17582265 16522079 15638156 14843648 14103578
12413 14103578 13456155 12819708 12164343 11689079 11247187 10762320 10306327 9976198 9686810
$$ packed form
12465B54521211j6115496j4076549j0532982o750456l617719k028071j456744
12458A99943194r39094M01779K904261O973272J2076823J8055416K4280450L0119133
12450B93815234L4031247L3674640K7444788J5423778o25418j7143600l0712674
12443C55907995l9063071m1849578m0536085l6329785l1240981k6179642k1353400
12436A19355453j7285448j4036419j1351954r422611p811982o504046n508584
12429D7434409m708809m051925l464883l037623k660336k368719k136528j838493
12421B3167093j573102j464879j357508j189339j060186q83923p94508p40070
12413A4103578o47423o36447o55365m75264m41892m84867m55993l30129k89388
$$ plain form
12404 9686810 9277205 8925365 8695893 8412487 8065113 7726722 7399285 7267812 7086791
12395 7086791 6943375 6952602 6853758 6582185 6374880 6242837 6155092 6007132 5926204 5800500
12385 5800500 5670082 5619819 5498355 5312336 5127750 5037214 5010997 4972997 4953590 4821356
12375 4821356 4572243 4391586 4372315 4371507 4386768 4270519 4160494 4097954 4028012 4011781 3960747
12364 3960747 3926308 3888534 3792073 3836145 3921224 4078124 4228856 4300750 4377553 4252980 4254460
12353 4254460 4278642 4325722 4300091 4155003 4000699 3914632 3929020 3876266 3804147 3776321 3781230
12342 3781230 3843019 3776501 3676657 3590406 3547314 3651217 3688877 3732671 3893284 4066386 4132450
12331 4132450 4239986 4459888 4787546 5254362 5657153 6046637 6482682 6639071 6519613
$$ packed form
12404I686810m09605l51840k29472k83406l47374l38391l27437j31473j81021
12395G086791j43416R227r8844k71573k07305j32043q7745j47960q0928j25704
12385E800500j30418n0263j21464j86019j84586r0536k6217l8000j9407j32234
12375D821356k49113j80657j9271q08J5261j16249j10025o2540o9942j6231n1034
12364C960747l4439l7774r6461M4072Q5079J56900J50732P1894P6803j24573J480
12353D254460K4182M7080k5631j45088j54304q6067J4388n2754p2119k7826M909
12342C781230O1789o6518r9844q6251m3092J03903L7660M3794J60613J73102O6064
12331D132450J07536K19902L27658M66816M02791L89484M36045J56389j19458
$$ plain form
12322 6519613 6298049 5999405 5665476 5377285 4964859 4547228 4286542 4096522 3895908
12313 3895908 3732483 3647174 3599900 3574918 3490761 3316986 3214791 3220122 3293439 3338256 3251832
12302 3251832 3112454 3070490 3143299 3347121 3481132 3647191 3705955 3880854 3864544 3879749
12292 3879749 4092056 4466894 4681661 4998280 5361629 5637223 5929485 6022598 5946557 5824093
12282 5824093 5613891 5321503 5012711 4678946 4364887 4242870 4138651 4000736 3926914 3914626
12272 3914626 3750597 3619716 3523075 3465882 3441952 3385428 3424658 3422713 3317569 3339983 3345669
12261 3345669 3378609 3477442 3568444 3510094 3576515 3577176 3565454 3546733 3561709 3622195 3735292
12250 3735292 3786410 3693727 3688505 3936098 4116408 4233642 4309055 4428913 4418360 4570476
$$ packed form
12322F519613k21564k98644l33929k88191m12426m17631k60686j90020k00614
12313C895908j63425q5309m7274k4982q4157j73775j02195N331P3317M4817q6424
12302C251832j39378m1964P2809K03822J34011J66059N8764J74899j6310J5205
12292C879749K12307L74838K14767L16619L63349K75594K92262R3113p6041j22464
12282E824093k10202k92388l08792l33765l14059j22017j04219j37915p3822j2288
12272C914626j64029j30881r6641n7193k3930n6524L9230j945j05144K2414N686
12261C345669L2940R8833R1002n8350O6421O61j1722j8721J4976O0486J13097
12250C735292N1118r2683n222K47593J80310J17234P5413J19858j0553J52116
$$ plain form
12240 4570476 4609310 4634162 4578785 4513794 4547973 4622720 4801771 4977735 5144723 5325208
12230 5325208 5447949 5514759 5529426 5536013 5567459 5623230 5694250 5765084 5966339 6062947 6178729
12219 6178729 6422619 6672586 6754453 6872422 6947980 7077471 7371338 7658291 7821621 7877742
12209 7877742 8059390 8275284 8558643 9007172 9388031 9705757 10019045 10388312 10830209
12200 10830209 11396268 11798277 12231171 12874653 13531952 14262720 15030989 15710228 16585486
12191 16585486 17556505 18528668 19646161 20954312 22330930 23882374 25504866 27516201
12183 27516201 29811190 32326972 35269250 38711395 42774171 47423355 52854860 59481505
12175 59481505 67411301 76871902 88406221 102636314 120271590 142089996 168757370
$$ packed form
12240D570476L8834K4852n5377o4991L4179P4747J79051J75964J66988J80485
12230E325208J22741O6810J4667O587L1446N5771P1020P0834K01255R6608J15782
12219F178729K43890K49967Q1867J17969P5558J29491K93867K86953J63330N6121
12209G877742J81648K15894K83359M48529L80859L17726L13288L69267M41897
12200A0830209N66059M02009M32894O43482O57299P30768P68269O79239Q75258
12191A6585486R71019R72163J117493J308151J376618J551444J622492K011335
12183B7516201K294989K515782K942278L442145M062776M649184N431505O626645
12175E9481505P929796R460601J1534319J4230093J7635276K1818406K6667374
$$ plain form
12168 168757370 200854068 238120596 279045420 320558706 358062327 386032704 400009396
12161 400009396 398071665 381587346 354708048 322898940 291123417 262835761 240086581
12154 240086581 223543845 212868048 207362261 205162424 204404961 203993544 203650165 204003628
12146 204003628 206587251 212577733 222525146 236101867 251927848 267513937 280668913
12139 280668913 290621937 298077768 305405156 315313298 329413215 348030582 369673721
12132 369673721 391896866 411643463 426145348 433507455 432730789 423468779 406185671
12125 406185671 381926875 352614152 320717646 289404149 261166639 237795581 219553133
12118 219553133 205912917 195347313 186258081 177657725 169072960 161243517 154787532 151103471
$$ packed form
12168A68757370L2096698L7266528M0924824M1513286L7503621K7970377J3976692
12161D00009396j937731j6484319k6879298l1809108l1775523k8287656k2749180
12154B40086581j6542736j0675797n505787k199837p57463m11417l43379L53463
12146B04003628K583623N990482R947413J3576721J5825981J5586089J3154976
12139B80668913R953024P455831P327388R908142J4099917J8617367K1643139
12132C69673721K2223145J9746597J4501885P362107p76666r262010j7283108
12125D06185671k4258796k9312723l1896506l1313497k8237510k3371058j8242448
12118B19553133j3640216j0565604r089232q600356q584765p829443o455985l684061
$$ plain form
12110 151103471 150772067 154092499 161096382 171887613 186360166 203823239 223150025
12103 223150025 242610667 259738584 271612339 275451208 269893546 255137924 233359470
12096 233359470 207431809 180470382 154773524 131977385 112579078 96387590 82877276
12089 82877276 71742453 62606212 55108801 48966408 43800655 39275839 35381728 32131499
12081 32131499 29551571 27287124 25371622 23750600 22196157 20785612 19697118 18729532
12073 18729532 17739102 16782012 15940069 15396142 14836966 14248823 13743062 13178873 12839828
12064 12839828 12532675 12188577 11948658 11650087 11375237 11180034 11026344 10924435 10770911
12055 10770911 10603652 10503711 10374400 10314001 10335935 10416147 10458794 10544398 10576346 10602499 10533489
$$ packed form
12110A51103471l31404L320432P003883J0791231J4472553J7463073J9326786
12103B23150025J9460642J7127917J1873755L838869n557662j4755622k1778454
12096B33359470k5927661k6961427k5696858k2796139j9398307j6191488j3510314
12089H2877276j1134823r136241p497411o142393n165753m524816l894111l250229
12081C2131499k579928k264447j915502j621022j554443j410545j088494r67586
12073A8729532r90430r57090q41943n43927n59176n88143n05761n64189l39045
12064A2839828l07153l44098k39919k98571k74850j95203j53690j01909j53524
12055A0770911j67259r9941j29311o0399K1934Q0212M2647Q5604L1948K6153o9010
$$ plain form
12044 10533489 10493679 10470516 10389618 10263459 10110761 9914928 9782336 9736865 9537766 9364406
12034 9364406 9326441 9365294 9277368 9111998 9039131 8907692 8841399 8948439 9003697 8992065 9057515
12023 9057515 9036342 8851467 8811221 8894238 9000467 9031426 8946512 8933519 8976090 9060229 9179163
12012 9179163 9264254 9316253 9317320 9290917 9251442 9225930 9256443 9217743 9188823 9280267 9282871 9144588
12000 9144588 9092830 9003237 8944997 8890149 8894183 8879565 8790052 8793090 8861428 8980219 9119948
11989 9119948 9156154 9133278 9122115 9162103 9093281 9054773 9216844 9362374 9452456 9501949 9545391
11978 9545391 9503228 9440243 9371728 9327377 9301724 9168250 9073087 8969996 8997880 9090334 9135712
11967 9135712 9173116 9188995 9074735 9050654 9034483 9022738 8991348 9039696 9220845 9313334 9146289
$$ packed form
12044A0533489l9810k3163q0898j26159j52698j95833j32592m5471j99099j73360
12034I364406l7965L8853q7926j65370p2867j31439o6293J07040N5258j1632O5450
12023I057515k1173j84875m0246Q3017J06229L0959q4914j2993M2571Q4139J18934
12012I179163Q5091N1999J067k6403l9475k5512L0513l8700k8920R1444K604j38283
12000I144588n1758q9593n8240n4848M034j4618q9513L038O8338J18791J39729
11989I119948L6206k2876j1163L9988o8822l8508J62071J45530R0082M9493M3442
11978I545391m2163o2985o8515m4351k5653j33474r5163j03091K7884R2454M5378
11967I135712L7404J5879j14260k4081j6171j1745l1390M8348J81149R2489j67045
$$ plain form
11956 9146289 9072184 9011269 9111271 9243718 9169333 9145781 9215462 9299360 9337156 9308899 9221939
11945 9221939 9330312 9473720 9601730 9614938 9647379 9669957 9658538 9598962 9670599 9751702 9768877
11934 9768877 9661330 9714358 9763108 9722916 9714037 9745403 9827952 9812917 9799052 9853428 9850081
11923 9850081 9885193 9856423 9825109 9891603 9931429 9931724 9935982 9967000 9904177 9821123 9720742 9621172
11911 9621172 9640216 9806892 9832557 9879671 9859765 9704930 9657129 9492373 9451298 9544627 9585221
11900 9585221 9550664 9529798 9508304 9430814 9371645 9337186 9353864 9304679 9240332 9185944 9106439
11889 9106439 9041198 9033823 8999975 8938465 8963295 8918840 8842001 8782277 8663603 8540388 8493515
11878 8493515 8450664 8340205 8248420 8160210 8144632 8141987 8060340 7844379 7778370 7675620 7598543
$$ packed form
11956I146289p4105o0915J00002J32447p4385k3552O9681Q3898L7796k8257q6960
11945I221939J08373J43408J28010J3208L2441K2578j1419n9576P1637Q1103J7175
11934I768877j07547N3028M8750m0192q879L1366Q2549j5035j3865N4376l347
11923I850081L5112k8770l1314O6494L9826K95M258L1018o2823q3054j00381r9570
11911I621172J9044J66676K5665M7114j9906j54835m7801j64756m1075R3329M0594
11900I585221l4557k0866k1494p7490n9169l4459J6678m9185o4347n4388p9505
11889I106439o5241p375l3848o1510K4830m4455p6839n9724j18674j23215m6873
11878H493515m2851j10459r1785q8210j5578k645q1647k15961o6009j02750p7077
$$ plain form
11867 7598543 7558046 7703429 7814840 7674299 7514541 7430769 7460082 7510347 7367534 7153243
11857 7153243 6996598 6999546 6951557 6975126 7011836 6957180 6827534 6784820 6739666 6720984 6680136
11846 6680136 6652513 6644008 6569953 6548516 6477842 6447907 6375178 6315850 6271518 6086669 5934644
11835 5934644 5838232 5861375 5796668 5679165 5706285 5839476 5801508 5653277 5421572 5395676
11825 5395676 5373186 5324577 5255173 5251466 5300855 5280637 5128447 5018394 4913550 4989353 4996883
11814 4996883 4888168 4767885 4762087 4803036 4780317 4631968 4538519 4530644 4512541 4437317 4512339
11803 4512339 4464804 4265973 4238109 4091947 3974249 4038047 4079248 4094657 4156492 4180697 4122459
11792 4122459 4112349 3988994 3964259 3965773 3828853 3810522 3774006 3837656 3749453 3667041 3692818
$$ packed form
11867G598543m0497J45383J11411j40541j59758q3772K9313N0265j42813k14291
11857G153243j56645K948m7989K3569L6710n4656j29646m2714m5154j8682m0848
11846F680136k7623q505p4055k1437p0674k9935p2729n9328m4332j84849j52025
11835E934644r6412K3143o4707j17503K7120J33191l7968j48231k31705k5896
11825E395676k2490m8609o9404l707M9389k0218j52190j10053j04844P5803P530
11814D996883j08715j20283n798M0949k2719j48349r3449p875j8103p5224P5022
11803D512339m7535j98831k7864j46162j17698O3798M1201J5409O1835K4205n8238
11792D122459j0110j23355k4735J514j36920j8331l6516O3650q8203q2412K5777
$$ plain form
11781 3692818 3653857 3523858 3480924 3580204 3636885 3627043 3509154 3479160 3347338 3325150 3418678
11770 3418678 3399538 3396480 3436975 3354381 3235091 3175432 3159018 3219940 3187392 3057311 3028947
11759 3028947 2995418 2904820 2888459 2846453 2833679 2919860 2860141 2872993 2812350 2708968 2700793
11748 2700793 2771106 2767932 2770672 2835323 2984527 3007900 2882164 2807010 2848080 2860229 2874010
11737 2874010 2842863 2879567 2923263 2897185 2993439 3023182 3168832 3348998 3503663 3624103
11727 3624103 3740462 3864919 3967724 3911179 3783699 3713239 3683838 3513331 3476887 3389052
11717 3389052 3220734 3169043 3179862 3153204 3100268 3045393 2916097 2879249 3003185 3053042 3130641
11706 3130641 3239395 3283054 3265271 3348048 3350101 3378847 3414747 3488238 3475782 3508694 3555408
$$ packed form
11781C692818l8961j29999m2934R9280N6681r842j17889k9994j31822k2188R3528
11770C418678j9140l058M0495q2594j19290n9659j6414O0922l2548j30081k8364
11759C028947l3529r0598j6361m2006j2774Q6181n9719J2852o0643j03382q175
11748B700793P0313l174K740O4651J49204K3373j25736p5154M1070J2149J3781
11737B874010l1147L6704M3696k6078R6254K9743J45650J80166J54665J20440
11727C624103J16359J24457J02805n6545j27480p0460k9401j70507l6444q7835
11717C389052j68318n1691J0819k6658n2936n4875j29296l6848J23936M9857P7599
11706C130641J08754M3659j7783Q2777K053K8746L5900P3491j2456L2912M6714
$$ plain form
11695 3555408 3600226 3728887 3811140 3678812 3620488 3524534 3402539 3266056 3265084 3158239 3048746
11684 3048746 2918234 2793042 2700562 2554936 2444506 2521417 2590983 2612031 2576725 2514305
11674 2514305 2462141 2410440 2491876 2570619 2579224 2540291 2496700 2591469 2710136 2800670 2841453
11663 2841453 2906066 2963889 2818461 2755488 2572271 2336396 2230233 2155313 2116660 2104110
11653 2104110 2109046 2111865 2063077 2065206 2084062 1970708 1973009 2089201 2360154 2560830 2824816
11642 2824816 3220313 3799732 4519341 5627551 6891559 7836798 7985827 7368295 6361345
11633 6361345 5272058 4291072 3477153 3006156 2645044 2345610 2115602 1871763 1892710
11624 1892710 1829129 1631315 1383834 1218370 1141942 1158288 1099749 1126661 1142730 1184288 1218260
$$ packed form
11695C555408M4818J28661Q2253j32328n8324r5954j21995j36483r72j06845j09493
11684C048746j30512j25192r2480j45626j10430P6911O9566K1048l5306o2420
11674B514305n2164n1701Q1436P8743Q605l8933m3591R4769J18667R0534M0783
11663B841453O4613N7823j45428o2973j83217k35875j06163p4920l8653j2550
11653B104110M936K819m8788K129J8856j13354K301J16192K70953K00676K63986
11642B824816L95497N79419P19609J108210J264008R45239J49029o17532j006950
11633F361345j089287r80986q13919m70997l61112k99434k30008k43839K0947
11624A892710o3581j97814k47481j65464p6428J6346n8539K6912J6069M1558L3972
$$ plain form
11613 1218260 1186220 984219 1090484 1145226 1076249 1052177 911202 847384 943274 987089 1029613
11602 1029613 1066006 1074731 1083830 948495 817596 808895 835797 902086 862105 846079 847358 797406
11590 797406 793187 759912 736935 758532 711610 746402 851423 891065 896346 997950 957130
11579 957130 877826 902435 844902 694638 613302 603696 617557 681847 656496 607235 537135
11568 537135 599443 738566 802755 906355 840870 822987 923071 988465 917052 839347 836894
11557 836894 833872 735965 643461 588318 562370 538529 593485 669507 581649 552799 466506 495996
11545 495996 594211 703016 671513 633934 577772 627349 760753 751980 633613 601882 781239
11534 781239 797773 652351 673388 659802 579000 639819 639748 576850 590137 597744 627494 551291
$$ packed form
11613A218260l2040k02001J06265N4742o8977k4072j40975o3818R5890M3815M2524
11602A029613L6393Q725R099j35335j30899q701K6902O6289l9981j6026J279m9952
11590G97406m219l3275k2977K1597m6922L4792J05021L9642N281J01604m0820
11579I57130p9304K4609n7533j50264q1336r606J3861O4290k5351m9261p0100
11568E37135O2308J39123O4189J03600o5485j7883J00084O5394p1413p7705k453
11557H36894l022r7907r2504n5143k5948k3841N4956P6022q7858k8850q6293K9490
11545D95996R8215J08805l1503l7579n6162M9577J33404q773j18367l1731J79357
11534G81239J6534j45422K1037j3586q0802O0819p1o2898J3287P607K9750p6203
$$ plain form
11522 551291 524615 582630 619278 700347 824025 833124 654351 597061 591317 609445 616400 599343
11510 599343 461200 433884 606366 731566 671975 603281 585096 641667 662101 608086 482633
11499 482633 433806 438617 384273 375325 351688 379954 376653 431705 347851 485624 518484 495540
11487 495540 387296 346883 332822 192384 138109 335845 453956 531891 508580 525172 534257
11476 534257 475054 370417 351411 403288 422715 393742 409078 431914 452965 526932 604234
11465 604234 597139 552677 418772 385581 418989 506826 436528 363646 487299 521426 510496
11454 510496 448326 431966 417679 398524 364687 345891 294233 292670 318154 359849 446957 442228
11442 442228 444282 357089 316653 285361 220147 205647 180951 109727 108912 128977 75698 143934
$$ packed form
11522E51291k6676N8015L6648Q1069J23678R099j78773n7290n744J8128O955j7057
11510E99343j38143k7316J72482J25200n9591o8694j8185N6571K0434n4015j25453
11499D82633m8827M811n4344q948k3637K8266l301N5052q3854J37773L2860k2944
11487D95540j08244m0413j4061j40438n4275J97736J18111P7935k3311J6592R085
11476E34257n9203j04637j9006N1877J9427k8973J5336K2836K1051P3967P7302
11465F04234p095m4462j33905l3191L3408Q7837p0298p2882J23653L4127j0930
11454E10496o2170j6360j4287j9155l3837j8796n1658j563K5484M1695Q7108m729
11442D42228K054q7193m0436l1292o5214j4500k4696p1224q15K0065n3279O8236
$$ plain form
11430 143934 203385 213426 329528 395888 402959 354837 150432 150891 347241 335405 300401
11419 300401 340941 404066 468908 491628 408566 426814 287151 190264 140142 313067 248789
11408 248789 280476 409674 381338 372470 397425 463873 520653 516505 511347 399739 328683 369017
11396 369017 379591 419038 399872 397908 473155 527054 483860 433349 378323 295087 316310 331619
11384 331619 316547 261048 201523 76845 74071 124815 168738 270720 347619 229066 63629
11373 63629 52914 186710 298260 304904 212920 149904 147168 170032 170806 143705 153083 247248
11361 247248 347395 423525 383884 327012 315111 371636 435034 365301 319626 293237 268780
11350 268780 155824 166347 149140 175831 252285 335084 418892 346051 195430 213351 139353
$$ packed form
11430A43934N9451J0041J16102O6360P071m8122k04405M59J96350j1836l5004
11419C00401M0540O3125O4842K2720q3062J8248j39663r6887n0122J72925o4278
11408B48789L1687J29198k8336q868K4955O6448N6780m148n158j11608p1056M0334
11396C69017J0574L9447j9166j964P5247N3899m3194n0511n5026q3236K1223J5309
11384C31619j5072n5499n9525j24678k774N0744M3923J01982P6899j18553j65437
11373F3629j0715J33796J11550O644r1984o3016k736K2864P74k7101R378R4165
11361B47248J00147P6130l9641n6872j1901N6525O3398o9733m5675k6389k4457
11350B68780j12956J0523j7207K6691P6454Q2799Q3808p2841j50621J7921p3998
$$ plain form
11339 139353 239590 357385 438430 439130 348585 277050 169992 115866 105285 187944 169809
11328 169809 10734 46828 129523 215581 244932 289461 306289 300618 317076 222589 188527
11317 188527 188743 207494 214582 215963 138434 176276 176267 292812 375423 322524 256080 220073 348399
11304 348399 367044 351669 345678 266787 174354 131320 213154 202781 313732 330836 333963 332319
11292 332319 354489 274723 235292 274201 253070 167594 149750 151700 237579 244816 246675 272458
11280 272458 195060 116867 212688 266201 290793 378289 242999 99929 181500 245341 211941
11269 211941 97522 145357 211064 299756 288008 344417 361968 287228 264077 314446 249106
11258 249106 231796 254550 115304 32849 121755 107863 69725 125800 195991 220157 201209
$$ packed form
11339A39353J00237J17795Q1045P00r0545p1535j07058n4126j0581Q2659j8135
11328A69809j59075L6094Q2695Q6058K9351M4529J6828n671J6458r4487l4062
11317A88527K16J8751P088J381p7529L7842rJ16545Q2611n2899o6444l6007J28326
11304C48399J8645j5375n991p8891r2433m3034Q1834j0373J10951J7104L127j644
11292C32319K2170p9766l9431L8909k1131q5476j7844J950Q5879P237J859K5783
11280B72458p7398p8193R5821N3513K4592Q7496j35290j43070Q1571O3841l3400
11269B11941j14419M7835O5707Q8692j1748N6409J7551p4740k3151N0369o5340
11258B49106j7310K2754j39246q2455Q8906j3892l8138N6075P0191K4166j8948
$$ plain form
11247 201209 239363 340879 379631 282299 176551 64678 -12470 -7325 33087 158508 140800
11236 140800 114708 186889 196644 201055 218178 188957 216224 193553 156834 261684 267015 207826
11224 207826 246118 384368 388232 282765 245669 226686 234908 170397 126264 164870 180657
11213 180657 262046 286701 129590 -43431 -15163 117211 163936 207440 316556 331848 234362
11202 234362 238743 311777 403982 372192 262513 144075 -9929 12739 120824 114064 138900
11191 138900 113680 52798 31202 -1691 -15797 64 34082 82271 257381 330659 200886
11180 200886 154415 114258 158800 158767 104244 150185 89567 128534 97333 130775 222065 279270
11168 279270 329844 337751 397205 379263 167356 126978 201799 198169 128112 45553 41837 17074
$$ packed form
11247B01209L8154J01516L8752r7332j05748j11873p7148N145M0412J25421j7708
11236A40800k6092P2181R755M411J7123k9221K7267k2671l6719J04850N331n9189
11224B07826L8292J38250L864j05467l7096j8983Q222o4511m4133L8606J5787
11213A80657Q1389K4655j57111j73021K8268J32374M6725M3504J09116J5292r7486
11202B34362M381P3034R2205l1790j09679j18438j54004K2668J08085o760K4836
11191A38900k5220o0882k1596l2893j4106J5861L4018M8189J75110P3278j29773
11180B00886m6471m0157M4542l3n4523M5941o0618L8967l1201L3442R1290N7205
11168B79270N0574P907N9454j7942k11907m0378P4821l630p0057q2559l716k4763
$$ plain form
11156 17074 22510 20378 97041 99752 69061 158589 222165 279126 386737 431212 464311 295307
11144 295307 139510 23345 -2086 -23397 -13108 76055 60018 67207 123448 178465 253413
11133 253413 180669 118260 132968 129363 179127 194543 147932 182051 131476 14947 82320
11122 82320 117774 85474 99339 134319 210494 191801 74655 134466 186719 229884 116622
11111 116622 73851 97885 122441 72969 8849 -23792 70914 -60681 -8333 134465 170205
11100 170205 120135 183826 154879 105310 89115 122709 7878 -145085 -52001 109973 66158
11089 66158 13099 68466 169797 101202 48519 43287 -5189 -14298 -57767 66444 236681
11078 236681 308828 180655 25627 57786 110531 181111 115013 106003 296860 369416 326143
$$ packed form
11156A7074N436k132P6663K711l0691Q9528O3576N6961J07611M4475L3099j69004
11144B95307j55797j16165k5431k1311J0289Q9163j6037P189N6241N5017P4948
11133B53413p2744o2409J4708l605M9764J5416m6611L4119n0575j16529O7373
11122H2320L5454l2300J3865L4980P6175j8693j17146N9811N2253M3165j13262
11111A16622m2771K4034K4556m9472o4120l2641R4706j31595N2348J42798L5740
11100A70205n0070O3691k8947m9569j6195L3594j14831j52963R3084J61974m3815
11089F6158n3059N5367J01331o8595n2683n232m8476r109m3469J24211J70237
11078B36681P2147j28173j55028L2159N2745P0580o6098r010J90857P2556m3273
$$ plain form
11067 326143 240458 234722 195089 138896 95317 179311 110687 -14592 85343 128485 82434
11056 82434 18029 44773 128942 114846 70470 58834 83102 128331 142014 122690 94267 16139
11044 16139 17003 39312 21568 48467 207602 146186 175313 202259 197894 236913 188157 266710
11032 266710 352157 287001 340321 359255 460854 579878 628111 709027 749613 586251 510049
11021 510049 448940 420787 450149 504351 653626 775818 932892 977974 972449 925836 792090
11010 792090 720912 561355 462834 509087 620602 641504 685414 716626 737923 621676 579539
10999 579539 462491 431343 464588 307495 217783 257982 263969 286740 291723 442782 420748
10988 420748 351712 322093 208332 182453 212202 287374 282223 275016 230142 113514 80892
$$ packed form
11067C26143q5685n736l9633n6193m3579Q3994o8624j25279R9935M3142m6051
11056H2434o4405K6744Q4169j4096m4376j1636K4268M5229J3683j9324k8423p8128
11044A6139Q64K2309j7744K6899J59135o1416K9127K6946m365L9019m8756P8553
11032B66710Q5447o5156N3320J8934J01599J19024M8233Q0916M0586j63362p6202
11021E10049o1109k8153K9362N4202J49275J22192J57074M5082n525m6613j33746
11010G92090p1178j59557r8521M6253J11515K0902M3910L1212K1297j16247m2137
10999E79539j17048l1148L3245j57093q9712M0199N987K2771M983J51059k2034
10988D20748o9036k9619j13761k5879K9749P5172n151p207m4874j16628l2622
$$ plain form
10977 80892 166177 60510 -17592 -4620 75638 73682 148037 155718 84046 67178 89511 129137
10965 129137 233745 307795 330289 271418 209776 189950 162224 189605 261927 203118 19555
10954 19555 -107734 -103171 -14650 141479 147686 228090 296389 276183 223849 151800 53022 54369
10942 54369 52271 78554 83580 -57101 -74409 -94816 -155382 -55892 93347 113586 111949 77607
10930 77607 64120 23230 48828 88938 19936 16010 64678 33972 -15619 -21667 -31283 72591
10918 72591 175448 170877 76166 22929 -3315 57272 145298 96877 187037 244133 193259 80132
10906 80132 88974 214684 290943 310978 315987 421819 486263 406732 268080 126556 -27180
10895 -27180 -43979 -74168 -105634 3710 72144 52846 34204 99689 98289 154748 207611 283778
$$ packed form
10977H0892Q5285j05667p8102J2972Q0258j956P4355P681p1672j6868K2333L9626
10965A29137J04608P4050K2494n8871o1642j9826k7726K7381P2322n8809j83563
10954A9555j27289M563Q8521J56129O207Q0404O8299k0206n2334p2049r8778J347
10942E4369k098K6283N026j40681j7308k0407o0566R9490J49239K0239j637l4342
10930G7607j3487m0890K5598M0110o9002l926M8668l0706m9591o048r616J03874
10918G2591J02857m571r4711n3237k6244O0587Q8026m8421R0160N7096n0874j13127
10906H0132Q842J25710P6259K0035N009J05832O4444p9531j38652j41524j53736
10895b7180j6799l0189l1466J09344O8434j9298j8642O5485j400N6459N2863P6167
$$ plain form
10883 283778 239908 163887 101569 126475 140118 125082 112472 119155 175921 294855 309830
10872 309830 201659 86125 156987 259423 285149 235417 169257 251862 315415 242674 126367
10861 126367 163217 240481 234591 201110 215210 223651 202604 105643 55375 134117 106802 51004
10849 51004 102685 152891 136575 127871 143662 212153 157481 68283 150836 228726 113581 181314
10837 181314 213668 338635 406795 460937 410410 377224 442238 489921 475962 395202 325190
10826 325190 277294 244531 259397 240303 273566 369174 321397 177240 141823 257809 236190
10815 236190 261654 244212 285047 402063 429484 382169 329287 231376 229350 202370 190402
10804 190402 185300 236505 144891 84748 132473 109445 128258 160487 143445 72554 38827 25271
$$ packed form
10883B83778m3870p6021o2318K4906J3643j5036j2610O683N6766J18934J4975
10872C09830j08171j15534P0862J02436K5726m9732o6160Q2605O3553p2741j16307
10861A26367L6850P7264n890l3481J4100Q441k1047r6961n0268P8742k7315n5798
10849E1004N1681N0206j6316q704J5791O8491n4672q9198Q2553P7890j15145O7733
10837A81314L2354J24967O8160N4142n0527l3186O5014M7683j3959q0760p0012
10826C25190m7896l2763J4866j9094L3263R5608m7777j44157l5417J15986k1619
10815B36190K5464j7442M0835J17016K7421m7315n2882r7911k026k6980j1968
10804A90402n102N1205r1614o0143M7725k3028J8813L2229j7042p0891l3727j3556
$$ plain form
10792 25271 2438 19724 109107 198561 80293 -56702 -41247 77579 197383 281803 360309
10781 360309 379425 289912 212157 151555 135700 172231 171375 253479 254373 289536 265859 333822
10769 333822 369339 381357 258718 308010 326293 128121 11136 36516 179341 315622
10759 315622 358132 374651 347740 352290 264574 128416 73877 104757 80343 55345 147993
10748 147993 176403 261547 324402 397369 258653 176597 165035 220727 367575 312227 299927
10737 299927 173880 10501 101911 224605 298044 265879 239525 197748 209935 221364 219317
10726 219317 153886 30766 4145 110725 197613 124630 32966 67382 14742 106152 123304
10715 123304 54525 82664 167726 222167 174510 108662 3585 -56841 38259 170297 126681
$$ packed form
10792B5271k2833J7286Q9383Q9454j18268j36995J5455J18826J19804Q4420P8506
10781C60309J9116q9513p7755o0602j5855L6531q56Q2104Q94L5163k3677O7963
10769C33822L5517J2018j22639M9292J8283j98172j16985K5380J42825J36281
10759C15622M2510J6519k6911M550q7716j36158n4539L0880k4414k4998R2648
10748A47993K8410Q5144O2855P2967j38716q2056j1562N5692J46848n5348j2300
10737B99927j26047j63379R1410J22694P3439l2165k6354m1777J2187J1429k047
10726B19317o5431j23120k6621J06580Q6888p2983r1664L4416n2640R1410J7152
10715A23304o8779K8139Q5062N4441m7657o5848j05077o0426R5100J32038m3616
$$ plain form
10704 126681 61587 125823 310412 315746 306266 394659 480376 298889 141921 158986 75347
10693 75347 141873 165192 158553 185201 289932 272549 247105 283609 310367 384280 279443
10682 279443 250802 336626 389822 395423 475951 514974 596135 570681 511523 474379 465512 480555
10670 480555 441958 350886 351987 371465 440361 365565 460661 470503 441738 493111 610877 758904
10658 758904 686459 696270 584439 477060 552261 661419 780515 812432 803555 718826 883686
10647 883686 1099283 1176960 1118260 1070157 1066445 1026506 1018672 1031572 1083175 1163814 1184807 1074492
10635 1074492 1145201 1367551 1515824 1632889 1796535 1869681 1970373 2131811 2411166 2803529
10625 2803529 3121322 3400548 3658463 3918372 4194662 4520525 5050085 5586294 6356288
$$ packed form
10704A26681o5094O4236J84589N334r480Q8393Q5717j81487j56968J7065q3639
10693G5347O6526K3319o639K6648J04731j7383k5444L6504K6758P3913j04837
10682B79443k8641Q5824N3196N601Q0528L9023Q1161k5454n9158l7144q867J5043
10670D80555l8597r1072J101J9478O8896p4796R5096R842k8765N1373J17766J48027
10658G58904p2445R811j11831j07379P5201J09158J19096L1917q877q4729J64860
10647H83686K15597P7677n8700m8103l712l9939p834J2900N1603Q0639K0993j10315
10635A074492P0709K22350J48273J17065J63646P3146J00692J61438K79355L92363
10625B803529L17793K79226K57915K59909K76290L25863N29560N36209P69994
$$ plain form
10616 6356288 7526067 9118045 11265420 14111525 17822116 22899304 29458052 37455924
10608 37455924 45611955 51878646 54959310 54849807 52679492 50253420 49079864 50310227
10600 50310227 54823518 63159811 75703781 91698185 107911799 118835091 120888326
10593 120888326 115080515 105364815 95748360 89399930 87985004 92057553 102072511 118220225
10585 118220225 138681383 158110276 168348745 164996617 150848763 131782364 113372349
10578 113372349 99353631 91083138 88596576 91534134 99219690 109905595 119157629 121778276
10570 121778276 115189825 101850695 85992650 71650434 60807489 53851347 50335481
10563 50335481 49802697 51534126 54153274 55828312 54566477 49829834 42612315 34635075
$$ packed form
10616F356288J169779J591978K147375K846105L710591N077188O558748P997872
10608C7455924Q156031O266691L080664j09503k170315k426072j173556J230363
10600E0310227M513291Q336293J2543970J5994404J6213614J0923292K053235
10593A20888326n807811r715700r616455o348430j414926M072549J0014958J6147714
10585A18220225K0461158J9428893J0238469l352128j4147854j9066399j8410015
10578A13372349j4018718q270493k486562K937558P685556J0685905R252034K620647
10570A21778276o588451j3339130j5858045j4342216j0842945o956142l515866
10563E0335481n32784J731429K619148J675038j261835m736643p217519p977240
$$ plain form
10555 34635075 27243421 21069409 16292723 12790855 10392276 8643779 7225011 6137925
10547 6137925 5326471 4756077 4197487 3582473 3078321 2729387 2570119 2382139 2279532
10538 2279532 2085938 1924357 1728553 1746449 1728349 1582198 1363285 1243209 1149701 1086833
10528 1086833 1020354 968668 948131 833474 755778 750728 734513 615642 691294 751166 681929
10517 681929 486111 392802 503415 576272 496876 514626 557943 535978 412055 359086 275263
10506 275263 84840 93988 226872 237433 222225 87661 163311 266948 272656 213159 100077
10495 100077 -19384 8368 93159 66473 161605 110257 23049 91044 143964 167344 75050
10484 75050 6741 91127 186867 256314 278078 255341 240101 240038 259498 185272 130313 250083
$$ packed form
10555C4635075p391654o174012m776686l501868k398579j748497j418768j087086
10547F137925q11454n70394n58590o15014n04152l48934j59268j87980j02607
10538B279532j93594j61581j95804J7896j8100j46151k18913j20076r3508o2868
10528A086833o6479n1686k0537j14657p7696n050j6215j18871P5652N9872o9237
10517F81929j95818r3309J10613P2857p9396J7750M3317k1965j23923n2969q3823
10506B75263j90423R148J32884J0561j5208j34564P5650J03637N708n9497j13082
10495A00077j19461K7752Q4791k6686R5132n1348q7208O7995N2920K3380r2294
10484G5050o8309Q4386R5740O9447K1764k2737j5240o3J9460p4226n4959J19770
$$ plain form
10472 250083 431293 424386 350264 200752 69381 -20898 18231 112238 202197 230265 243104
10461 243104 281544 210542 217605 215938 167473 127092 99725 79322 29638 47356 76016 147504
10449 147504 163321 242751 173325 104477 67343 16824 25252 56299 8555 15690 -42680 -91962
10437 -91962 -126246 -179191 -110645 -53851 -20621 22638 17282 -9586 -26918 46274 19515 -74201
10425 -74201 16005 51908 -11945 1633 -21429 -44192 -52536 -21877 8532 8060 -77645 -88248
10413 -88248 -47921 -58495 12161 -33224 -112743 -111802 -79942 -100078 -166615 -187540 -165846 -109066
10401 -109066 -7611 46683 5651 -87294 -80615 -103277 -135186 -175925 -110434 -82362 -138066
10390 -138066 -130120 -45645 -34988 101621 261384 228005 144811 94497 274 5181 691 -36201
$$ packed form
10472B50083J81210o907p4122j49512j31371r0279L9129R4007Q9959K8068J2839
10461B43104L8440p1002P063j667m8465m0381k7367k0403m9684J7718K8660P1488
10449A47504J5817P9430o9426o8848l7134n0519Q428L1047m7744P135n8370m9282
10437i1962l4284n2945O8546N6794L3230M3259n356k6868j7332P3192k6759r3716
10425g4201R0206L5903o3853J3578k3062k2763q344L0659L0409m72q5705j0603
10413h8248M0327j0574P0656m5385p9519R41L1860k0136o6537k0925K1694N6780
10401a09066J01455N4294m1032r2945O679k2662l1909m0739O5491K8072n5704
10390a38066P946Q4475J0657J36609J59763l3379q3194n0314r4223M907m490l6892
$$ plain form
10378 -36201 -35196 -32897 -25361 -30582 -36473 -96932 -91554 -61812 -37113 -27056 -135206 -234455 -172971
10365 -172971 -106372 -87707 13353 -8046 -115146 -235819 -193092 -183862 -302507 -287163 -205833
10354 -205833 -162626 -222973 -285650 -230338 -149835 -24891 -4002 -132964 -134697 49044 110362
10343 110362 7684 -36250 73203 -2719 -57339 -135211 -256388 -152669 -65754 -136771 -168815
10332 -168815 -137266 -50986 -20383 -7732 -44103 -117559 -72570 -63373 -139226 -44259 -4325 -148211
10320 -148211 -182117 -6398 93978 82903 110214 99706 44959 -79528 -164981 -125760 -128429
10309 -128429 -175396 -219366 -195695 -196967 -231387 -229483 -238625 -246190 -255349 -277996 -369953 -266417
10297 -266417 -132097 -93674 -234343 -277991 -311780 -325891 -234592 -201681 -33357 30009 13829
$$ packed form
10378c6201J005K299P536n221n891o0459N378K9742K4699J0057j08150r9249O1484
10365a72971O6599J8665J01060k1399j07100j20673M2727R230j18645J5344Q1330
10354b05833M3207o0347o2677N5312Q0503J24944K0889j28962j733J83741O1318
10343A10362j02678m3934J09453p5922n4620p7872j21177J03719Q6915p1017l2044
10332a68815L1549Q6280L0603J2651l6371p3456M4989R197p5853R4967L9934j43886
10320a48211l3906J75719J00376j1075K7311j0508n4747j24487q5453L9221k669
10309a28429m6967m3970K3671j272l4420J904r142p565r159k2647r1957J03536
10297b66417J34320L8423j40669m3648l3789j4111R1299L2911J68324O3366j6180
$$ plain form
10286 13829 -11824 -15554 -55309 -61217 -106361 -101530 -35359 -34454 -119500 -87363 -122605 -148883 -63083
10273 -63083 72985 228035 294171 164147 32882 -91446 -122914 -66160 47455 199240
10263 199240 273003 298583 227619 76282 68786 33258 -39841 -52146 -24507 -26942 -35863 -2957
10251 -2957 94441 130343 100465 77448 97546 119908 3251 92685 83542 -858 -85804 -147682
10239 -147682 -186633 -119098 -129513 -28935 83633 80078 144757 161926 163558 92872 -20650
10228 -20650 -127999 -94994 30394 -11421 -49329 -676 -46539 -41520 -120568 -175465 -136394
10217 -136394 27668 32000 86026 110006 174744 170359 146421 69391 -63297 -170866 -179079
10206 -179079 -166917 -172637 -210423 -227033 -197602 -199464 -162597 -172258 -68076 -18887 -65122 -30127
$$ packed form
10286A3829k5653l730l9755n908m5144M831O6171R05q5046L2137l5242k6278Q5800
10273f3083J36068J55050O6136j30024j31265j24328l1468N6754J13615J51785
10263A99240P3763K5580p0964j51337p496l5528p3099j2305K7639k435q921L2906
10251b957R7398L5902k9878k3017K0098K2362j16657Q9434r143q4400q4946o1878
10239a47682l8951O7535j0415J00578J12568l555O4679J7169J632p0686j13522
10228b0650j07349L3005J25388m1815l7908M8653m5863N019p9048n4897L9071
10217a36394J64062M332N4026K3980O4738m385k3938p7030j32688j07569q213
10206a79079J2162n720l7786j6610K9431j862L6867r661J04182M9189m6235L4995
$$ plain form
10194 -30127 -81705 -6707 -4047 -118234 -138202 -66653 -53429 -150687 -163952 -150062 -50839 -4850
10182 -4850 -92019 -180247 -282649 -247321 -120476 4263 -47906 -85654 97591 204916 79739
10171 79739 99118 237268 269028 224151 169813 239636 231595 245931 320441 464037 478269
10160 478269 437756 407300 586819 658090 520552 375306 361750 366042 521113 576049 468638
10149 468638 576328 627719 742088 829411 958339 887658 727845 586025 532346 533884 431943
10138 431943 443493 645392 751339 778458 806578 676947 538297 366781 227862 192623
10128 192623 195119 276443 206224 250317 384737 495922 410121 266835 127515 128507 20730
10117 20730 -94571 -158391 -115411 -13953 -13425 -76851 -79351 -88606 -65763 -132779 -65098 -11059
$$ packed form
10194c0127n1578P4998K660j14187j9968P1549J3224r7258j3265J3890R9223M5989
10182d850q7169q8228j02402L5328J26845J24739n2169l7748J83245J07325j25177
10171G9739J9379J38150L1760m4877n4338O9823q041J4336P4510J43596J4232
10160D78269m0513l0456J79519P1271j37538j45246j3556M292J55071N4936j07411
10149D68638J07690N1391J14369Q7323J28928p0681j59813j41820n3679J538j01941
10138D31943J1550K01899J05947K7119K8120j29631j38650j71516j38919l5239
10128A92623K496Q1324p0219M4093J34420J11185q5801j43286j39320R92j07777
10117B0730j15301o3820M2980J01458N28o3426k500r255K2843o7016O7681N4039
$$ plain form
10105 -11059 -60111 -81966 -7622 146898 150582 19293 9850 -33334 -52557 -32465 -47925 -35531
10093 -35531 -24841 -28877 -40893 -19184 -86453 -172965 -165678 -238692 -270610 -145928 -77141 -146195
10081 -146195 -201191 -185433 -108892 -110486 -61685 -74995 -101279 -50644 49056 98370 24538 -41038
10069 -41038 -76389 -21454 -36557 -122380 -179656 -133575 -45148 48210 93616 -26459 -77049
10058 -77049 41560 61525 163116 284118 149741 -63783 -28861 27803 68592 175498
10048 175498 194917 81282 74549 49076 -101412 -67724 -30434 -19335 -31 -30514 -46895
10037 -46895 -73011 -75806 -56488 -94532 -155006 -64842 60262 -131373 -98251 -111786 -109808 21094
10025 21094 62177 -10931 -49457 338 41272 35205 59036 -13248 14562 132356 101321 69498
$$ packed form
10105a1059m9052k1855P4344J54520L684j31289r443m3184j9223K0092j5460J2394
10093c5531J0690m036j2016K1709o7269q6512P287p3014l1918J24682O8787o9054
10081a46195n4996J5758P6541j594M8801j3310k6284N0635R9700M9314p3832o5576
10069d1038l5351N4935j5103q5823n7276M6081Q8427R3358M5406j20075n0590
10058g7049J18609J9965J01591J21002j34377k13524L4922N6664M0789J06906
10048A75498J9419j13635o733k5473j50488L3688L7290J1099J9304l0483j6381
10037d6895k6116k795J9318l8044o0474R0164J25104j91635L3122j3535J978J30902
10025B1094M1083p3108l8526M9795M0934o067K3831p2284K7810J17794l1035l1823
$$ plain form
10013 69498 100166 89299 -5746 -118172 -164763 -219861 -282548 -287023 -254579 -160309 -85778 -101014
10001 -101014 -143570 -40143 53108 -10288 -71056 -97734 -147377 -197214 -213501 -259690 -266489
9990 -266489 -247454 -74906 28180 1625 -60346 -124554 -106960 -148342 -124390 -166924 -204376
9979 -204376 -177469 -95515 -43868 -56226 -184199 -173107 -94110 -60365 -146609 27038 142207
9968 142207 76370 116463 58836 1791 -56984 -75228 -34151 -22315 -78008 -34425 -26144 -29940
9956 -29940 -2865 43194 76765 83606 60631 3481 -107675 -119257 -91893 -166908 -203314 -30627
9944 -30627 58195 -111054 -134951 -117425 -223405 -255036 -214103 -186284 -202613 -155213 -95787
9933 -95787 -223478 -193209 -83409 -75379 -35266 -12717 -62894 -90063 -68901 -130309 -167592 -186844
$$ packed form
10013F9498L0668j0867r5045j12426m6591n5098o2687m475L2444R4270P4531j5236
10001a01014m2556J03427R3251o3396o0768k6678m9643m9837j6287m6189o799
9990b66489J9035J72548J03086k6555o1971o4208J7594m1382K3952m2534l7452
9979b04376K6907Q1954N1647j2358j27973J1092P8997L3745q6244J73647J15169
9968A42207o5837M0093n7627n7045n8775j8244M1077J1836n5693M3583Q281l796
9956b9940K7075M6059L3571O841k2975n7150j11156j1582K7364p5015l6406J72687
9944c0627Q8822j69249k3897J7526j05980l1631M0933K7819j6329M7400N9426
9933i5787j27691L0269J09800Q030M0113K2549n0177k7169K1162o1408l7283j9252
$$ plain form
9921 -186844 -168161 -112026 -169430 -199957 -143018 -221645 -233330 -62146 -16179 14040 -20396
9910 -20396 -156429 -211201 -168002 -278548 -346714 -289452 -265926 -105085 16218 24281 67196
9899 67196 81313 -4715 -28190 -57923 -22073 128474 197705 147226 -37044 -194109 -148055
9888 -148055 -16200 49776 -17856 -61817 -83756 -54555 -69206 -146183 23765 80330 -10666
9877 -10666 -85089 -160671 -159802 -38220 75136 73768 -9247 -51774 39642 136007 87859 -43670
9865 -43670 -36258 149665 181406 -36136 -196762 -136829 -57180 -102780 -104118 -69020 40729
9854 40729 94893 105563 43500 28931 91848 83738 -20948 -109093 -14291 96298 45190 -7569
9842 -7569 -27229 51809 28425 -41686 -172703 -194077 -99115 -20698 -62024 -34534 76265 55382
$$ packed form
9921a86844J8683N6135n7404l0527N6939p8627j1685J71184M5967L0219l4436
9910b0396j36033n4772M3199j10546o8166N7262K3526J60841J21303Q063M2915
9899F7196J4117q6028k3475k9733L5850J50547O9231n0479j84270j57065M6054
9888a48055J31855O5976o7632m3961k1939K9201j4651p6977J69948N6565r0996
9877a0666p4423p5582Q69J21582J13356j368q3015m2527R1416R6365m8148j31529
9865d3670P412J85923L1741k17542j60626N9933P9649m5600j338L5098J09749
9854D0729N4164J0670o2063j4569O2917q110j04686q8145R4802J10589n1108n2759
9842g569j9660P9038k3384p0111j31017k1374R4962P8417m1326K7490J10799k0883
$$ plain form
9830 55382 -95082 -116406 -64737 -66714 -37314 42136 -40540 -76463 -149717 -154316 -218326 -100102
9818 -100102 89391 133958 80626 44926 63898 28994 5189 72792 101718 88678 24046
9807 24046 41965 66540 -4552 -680 47970 -8120 -94109 -179788 -150898 -97891 -172162 -141086
9795 -141086 28404 37711 -15064 -130010 -153570 -90513 -96227 -90165 -117944 -146899 -198305 -130840
9783 -130840 -36286 48108 37942 45907 8181 -57723 -172504 -153855 -80430 -49031 76381
9772 76381 34615 -116783 -180580 -114009 -85277 -116350 -121967 -114862 -186327 -291211 -227345 -136347
9760 -136347 -160035 -137522 -38734 59189 21443 -42280 43204 122145 129811 -39310 -92859 -38603
9748 -38603 51403 -92351 -112456 -115087 -61847 -31575 -38473 -62666 -45642 -25643 3175 27096
$$ packed form
9830E5382j50464k1324N1669j977K9400P9450q2676l5923p3254m599o4010J18224
9818a00102J89493M4567n3332l5700J8972l4904k3805O7603K8926j3040o4632
9807B4046J7919K4575p1092L872M8650n6090q5989q5679K8890N3007p4271L1076
9795a41086J69490R307n2775j14946k3560O3057n714O062k7779k8955n1406O7465
9783a30840R4554Q4394j0166P965l7726o5904j14781J8649P3425L1399J25412
9772G6381m1766j51398o3797O6571K8732l1073n617P105p1465j04884O3866R0998
9760a36347k3688K2513R8788R7923l7746o3723Q5484P8941P666j69121n3549N4256
9748c8603R0006j43754k0105k631N3240L0272o898k4193J7024J9999K8818K3921
$$ plain form
9736 27096 59611 78808 -21820 23178 8458 -33206 -20146 76615 133404 152018 134757 109195
9724 109195 207762 172420 164911 124227 16215 -17533 60085 110631 -20415 -40848 130456
9713 130456 206102 149002 22836 -32329 47055 60241 62025 11546 -63186 -58202 -37165 -73716
9701 -73716 -174617 -187101 -97835 -90222 -87126 -38644 -41806 -42788 28297 77237 43517 -129796
9689 -129796 -161979 -131880 -101839 -108220 -170079 -252248 -212909 -275496 -170882 -54609 -48799 -67599
9677 -67599 23882 -1803 49070 42145 -30953 -82410 -28277 58690 -60855 -209499 -179658 -111395
9665 -111395 -76456 -159907 -210206 -93955 14135 40244 -14874 9647 -99039 -191698 -136072
9654 -136072 -83210 -85597 -40119 -47083 -15502 35130 106804 336257 563853 879179 1181709
$$ packed form
9736B7096L2515J9197j00628M4998j4720m1664J3060R6761N6789J8614j7261k5562
9724A09195R8567l5342p509m0684j08012l3748P7618N0546j31046k0433J71304
9713A30456P5646n7100j26166n5165P9384J3186J784n0479p4732M984K1037l6551
9701g3716j00901j2484Q9266P613L096M8482l162r82P1085M8940l3720j73313
9689a29796l2183L0099L0041o381o1859q2169L9339o2587J04614J16273N810j8800
9677f7599R1481k5685N0873o925p3098n1457N4133Q6967j19545j48644K9841O8263
9665a11395L4939q3451n0299J16251J08090K6109n5118K4521j08686r2659N5626
9654a36072N2862k387M5478o964L1581N0632P1674K29453K27596L15326L02530
$$ plain form
9643 1181709 1368274 1298574 1039422 710000 418650 289337 232345 147522 107391 105245 81000
9632 81000 9499 -16030 -84302 1214 119973 67266 -72224 -79005 -53359 -136805 -152269 -64654
9620 -64654 80329 98522 54473 -14104 -18073 101922 90420 50541 18651 -51273 -23849 12263
9608 12263 145374 155052 107946 77910 15484 65502 43777 -82772 3126 -53979 15618 27681
9596 27681 46677 106162 68449 -68802 -111182 -86650 -133354 10042 140598 143513 -29929
9585 -29929 -160505 -149825 -198890 -229234 -225965 -175226 -86192 -17588 52653 89472 84240 27318
9573 27318 23406 -33164 -180674 -238349 -252755 -161412 4608 94599 124957 43077 -38810 -76498
9561 -76498 -173827 -102672 -114426 -163903 -141732 -54251 -56116 -63957 -15431 58614 -37596 -107381
$$ packed form
9643A181709J86565o9700k59152l29422k91350j29313n6992q4823m0131k146k4245
9632H1000p1501k5529o8272Q5516J18759n2707j39490o781K5646q3446j5464Q7615
9620f4654J44983J8193m4049o8577l969J19995j1502l9879l1890o9924K7424L6112
9608A2263J33111R678m7106l0036o2426N0018k1725j26549Q5898n7105O9597J2063
9596B7681J8996N9485l7713j37251m2380K4532m6704J43396J30556K915j73442
9585b9929j30576J0680m9065l0344L269N0739Q9034O8604P0241L6819n232n6922
9573B7318l912n6570j47510n7675j4406R1343J66020Q9991L0358q1880q1887l7688
9561g6498r7329P1155j1754m9477K2171Q7481j865p841M8526P4045r6210o9785
$$ plain form
9549 -107381 -19228 -106247 -126278 -65134 -83266 -183695 -202481 -91996 42460 -12073 22776
9538 22776 115188 77049 4765 9652 67302 44370 -74028 -67998 -83867 -63139 -71680 -126265
9526 -126265 -162414 -110433 -62830 -59617 -85586 -148364 -200404 -117301 -44896 -83079 -68175 -37789
9514 -37789 -55408 -51181 -57760 -15853 -3482 -15442 -144122 -226108 -149609 35372 26602 69668
9502 69668 12192 -33278 -54847 -126458 -91743 111706 237535 355819 375947 269650 216863
9491 216863 149312 150112 191702 225394 152528 102303 276854 339286 196780 13421 -14324
9480 -14324 72615 14138 18586 -107264 -118503 -95783 -5673 24749 14103 73637 31136 -69811
9468 -69811 -183161 -55279 107973 107492 22599 -98399 -110576 -43672 -74085 -121219 -90311
$$ packed form
9549a07381Q8153q7019k0031O1144j8132j00429j8786J10485J34456n4533L4849
9538B2776R2412l8139p2284M887N7650k2932j18398O030j5869K0728q541n4585
9526a26265l6149N1981M7603L213k5969o2778n2040Q3103P2405l8183J4904L0386
9514c7789j7619M227o579M1907J2371j1960j28680q1986P6499J84981q770M3066
9502F9668n7476m5470k1569p1611L4715K03449J25829J18284K0128j06297n2787
9491B16863o7551Q00M1590L3692p2866n0225J74551O2432j42506j83359k7745
9480a4324Q6939n8477M448j25850j1239K2720R0110L0422j0646N9534m2501j00947
9468f9811j13350J27882J63252m81q4893j20998j2177O6904l0413m7134L0908
$$ plain form
9457 -90311 -75111 602 45018 61640 14201 -54609 -53553 20397 -204 44209 126045 94402
9445 94402 45511 -34933 -18801 -43175 -107413 -122674 -218121 -204589 -130877 -104121 -169065 -56978
9433 -56978 -64351 -132229 -152579 -113165 -69734 -53862 -58485 -52060 -71606 -6520 47511 40253 60597
9420 60597 104688 85768 73130 173921 125727 81686 193911 193744 173154 129656 145411 98261
9408 98261 -74678 -190024 -107626 -112778 -35185 -18789 -110879 -105079 -118822 -121513 -126994 -275651
9396 -275651 -289278 -170863 -56393 -41202 -49571 -94681 6799 45903 -1088 -52967 59357
9385 59357 66739 51084 100918 124464 133845 84362 123145 101720 -24200 -99067 -72128 -71300
9373 -71300 -109007 -194200 -102600 -30602 32272 11464 -76322 -228451 -346874 -274442 -99544
$$ packed form
9457i0311J5200P5713M4416J6622m7439o8810J056P3950k0601M4413Q1836l1643
9445I4402m8891q0444J6132k4374o4238j5261r5447J3532P3712K6756o4944J12087
9433e6978p373o7878k0350L9414M3431J5872m623O425j9546O5086N4031p258K0344
9420F0597M4091j8920j2638J00791m8194m4041J12225j67k0590m3498J5755m7150
9408I8261j72939j15346Q2398n152P7593J6396r2090N800j3743k691n481j48657
9396b75651j3627J18415J14470J5191q369m5110J01480L9104m6991n1879J12324
9385E9357P382j5655M9834K3546R381m9483L8783k1425j25920p4867K6939Q28
9373g1300l7707q5193R1600P1998O2874k0808q7786j52129j18423P2432J74898
$$ plain form
9362 -99544 -35360 -121234 -169121 -259719 -290649 -144322 -103824 -155174 -110654 -69060 -76488 -226738
9350 -226738 -333541 -185508 90761 98486 9312 47933 48971 30436 -37435 -130018 -183126
9339 -183126 -229310 -97091 -55100 -42317 20080 40669 117884 90594 47657 -62941 -80321
9328 -80321 -163956 -121255 -25966 -37279 -14670 -11178 4731 867 -33540 531 12630 34464
9316 34464 86885 67049 -40896 -7595 14725 23261 -12342 -63259 -34049 -6616 31807 43868
9304 43868 33484 54003 -69692 -176426 -191949 -164655 -73860 -55844 -134751 -201489 -278386
9293 -278386 -319863 -273122 -241914 -148501 -85910 -39004 -39197 -77688 -78397 -95799 -139805 -157472
9281 -157472 -23138 23946 -104453 -159288 -58940 -62561 -51615 -126271 -140147 11770 13241
$$ packed form
9362i9544O4184q5874m7887r0598l0930J46327M0498n1350M4520M1594p428j50250
9350b26738j06803J48033K76269P725q9174L8621J038j8535o7871r2583n3108
9339a83126m6184J32219M1991J2783O2397K0589P7215k7290m2937j10598j7380
9328h0321q3635M2701R5289j1313K2609L492J5909l864l4407L4071J2099K1834
9316C4464N2421j9836j07945L3301K2320Q536l5603n0917K9210K7433L8423J2061
9304D3868j0384K0519j23695j06734j5523K7294R0795J8016p8907o6738p6897
9293b78386m1477M6741L1208R3413O2591M6906j93l8491p09j7402m4006j7667
9281a57472J34334M7084j28399n4835J00348l621J0946p4656j3876J51917J471
$$ plain form
9270 13241 -22974 -78323 -126617 -71788 -62388 -56271 16829 83019 27676 -89933 -157850 -131869
9258 -131869 -116587 -215718 -243354 -145873 -29469 27056 44257 28851 -38951 -124631 -98935
9247 -98935 -68780 -63671 -66629 56067 66667 10686 -18704 -58649 -64136 -205266 -193845 -101814
9235 -101814 -130029 -113645 -73909 -79280 -23872 -102844 -194360 -191572 -33658 91709 3535 -78439
9223 -78439 -42264 -25046 -84763 -56932 49075 49737 -57 -7718 -4252 -16459 45506 -14758
9211 -14758 -76783 -139547 10699 81231 64820 43950 61366 82706 108459 133867 129412 131103
9199 131103 138154 170005 159059 189941 137860 -6639 -125215 -227274 -97643 -105867 -194672
9188 -194672 -222173 -134731 -85337 -151452 -136085 -59233 -42475 33014 -81839 -195685 -185837
$$ packed form
9270A3241l6215n5349m8294N4829R400O117P3100O6190n5343j17609o7917K5981
9258a31869J5282r9131k7636R7481J16404N6525J7201j5406o7802q5680K5696
9247i8935L0155N109k958J22696J0600n5981k9390l9945n487j41130J1421R2031
9235a01814k8215J6384L9736n371N5408p8972r1516K788J57914J25367q8174q1974
9223g8439L6175J7218n9717K7831J06007O62m9794p661L466j2207O1965o0264
9211a4758o2025o2764J50246P0532j6411k0870J7416K1340K5753K5408m455J691
9199A31103P051L1851j0946L0882n2081j44499j18576j02059J29631q224q8805
9188a94672k7501Q7442M9394o6115J5367P6852J6758P5489j14853j13846R848
$$ plain form
9177 -185837 -210485 -189166 -154833 -98791 -149154 -61283 106556 180600 206545 189163 21412
9166 21412 -78899 -83245 -180570 -208281 -166618 -84450 -28961 29567 14788 -140086 -216946 -165320
9154 -165320 -117305 -69417 -78479 -113298 -296817 -306077 -215235 -161311 -104920 -75860 -139614 -42823
9142 -42823 71448 65938 -64826 -95984 15659 15357 -15919 -41149 -41907 -131922 -253398 -255906
9130 -255906 -261742 -161336 -32557 -62044 -97400 -105068 -41872 115179 162614 52529 -10916
9119 -10916 -39435 60521 35461 -55649 -119447 -150590 -61968 -109309 -174859 -88766 25616 29765
9107 29765 76566 88324 73547 -31279 -104661 -106298 -154365 -140103 -43576 -1535 -53927 15068
9095 15068 28156 -35880 -14944 -39839 -31798 11015 56125 61496 -9114 -89396 -116494 -33852
$$ packed form
9177a85837k4648K1319L4333N6042n0363Q7871J67839P4044K5945j7382j67751
9166B1412j00311m346r7325k7711M1663Q2168N5489N8528j4779j54874p6860N1626
9154a65320M8015M7888r062l4819j83519r260R0842N3924N6391K9060o3754R6791
9142d2823J14271n510j30764l1158J11643l02l1276k5230p58r0015j21476k508
9130b55906n836J00406J28779k9487l5356p668O3196J57051M7435j10085o3445
9119a0916k8519R9956k5060r1110o3798l1143Q8622m7341o5550Q6093J14382M149
9107B9765M6801J1758j4777j04826p3382j637m8067J4262R6527M2041n2392O8995
9095A5068J3088o4036K0936k4895Q041M2813M5110N371p0610q0282k7098Q2642
$$ plain form
9083 -33852 -75903 -215544 -279023 -156856 -113471 -45250 -77417 -104067 -80140 13549 30929
9072 30929 10959 -110706 -99799 -119492 -115435 -91962 9513 92355 125148 101181 -36687
9061 -36687 -29801 27524 86187 -64868 -189320 -161539 -83935 -107466 -38018 30901 19820 38144
9049 38144 81255 -68040 28162 193380 178306 125891 150957 13596 -128748 -141153 -158973
9038 -158973 -58807 -26747 -11097 -45935 -62590 40969 12263 -100956 -87011 -120190 -102976
9027 -102976 18738 -69682 -85123 42452 -33460 -77333 -29395 -89038 -138057 -105807 -14635
9016 -14635 9937 36589 -5107 -47190 -114080 -129964 -108205 -47170 -124198 -55595 63086 32152
9004 32152 27079 14164 348 -113841 -97773 10109 32370 -82273 -130392 -107088 -129318
$$ packed form
9083c3852m2051j39641o3479J22167M3385O8221l2167k6650K3927R3689J7380
9072C0929j9970j21665J0907j9693M057K3473J01475Q2842L2793k3967j37868
9061c6687O886N7325N8663j51055j24452K7781P7604k3531O9448O8919j1081J8324
9049C8144M3111j49295R6202J65218j5074n2415K5066j37361j42344j2405j7820
9038a58973J00166L2060J5650l4838j6655J03559k8706j13219J3945l3179J7214
9027a02976J21714q8420j5441J27575p5912m3873M7938n9643m9019L2250R1172
9016a4635K4572K6652m1696m2083o6890j5884K1759O1035p7028O8603J18681l0934
9004C2152n073j2915j3816j14189J6068J07882K2261j14643m8119K3304k2230
$$ plain form
8993 -129318 -83416 30094 64731 -19227 -100211 -24772 16801 -98541 -140101 -91203 -133810
8982 -133810 -136807 -92457 -50714 43487 71376 80886 81562 26836 -42629 -25688 -2725 -11028 10723
8969 10723 22878 101547 86413 -11510 -90710 -22369 66402 124462 48800 -91363 -121673 -78745
8957 -78745 -39556 -46103 -118190 -140170 -81829 -2671 -54057 -171792 -140684 -65860 -102924 -146596
8945 -146596 -320465 -292209 -164127 -164322 -96107 -82046 -67453 -158948 -124472 -166984 -175799 -32191
8933 -32191 -42824 -23948 31753 -13690 -18784 7972 35069 27377 -113718 -226952 -250728 -143853
8921 -143853 -42671 53977 -8541 7918 75468 105684 173004 60276 147073 169045 158164
8910 158164 31197 -102835 -157587 -80043 -8782 126388 149221 21831 -78755 -87864 5006
$$ packed form
8993a29318M5902J13510L4637q3958q0984P5439M1573j15342m1560M8898m2607
8982a33810k997M4350M1743R4201K7889R510O76n4726o9465J6941K2963q303K1751
8969A0723J2155P8669j5134r7923p9200O8341Q8771N8060p5662j40163l0310M2928
8957g8745L9189o547p2087k1980N8341P9158n1386j17735L1108P4824l7064m3672
8945a46596j73869K8256J28082j95O8215J4061J4593r1495L4476m2512q815J43608
8933c2191j0633J8876N5701m5443n094K6756K7097p692j41095j13234k3776J06875
8921a43853J01182R6648o2518J6459O7550L0216O7320j12728Q6797K1972j0881
8910A58164j26967j34032n4752P7544P1261J35170K2833j27390j00586r109R2870
$$ plain form
8899 5006 95243 93798 110107 119193 143344 52268 -91262 -150833 -134056 -121826 -152535 -127684
8887 -127684 -93181 -112839 -194194 -170929 -175388 -148594 -193042 -180264 -289072 -259301 -223972 -305573
8875 -305573 -173704 -79873 -75280 -127507 -76701 -45663 -8661 98930 133011 66147 61311 143193
8863 143193 185336 53963 50484 8269 -17969 -97047 -179843 -304053 -319397 -127569 -49941
8852 -49941 16046 109597 91432 62080 33756 38056 87302 52515 -81186 -137102 -69229 -154572
8840 -154572 -149273 -43774 -64934 -39360 11855 325 18322 48229 77149 105307 -16535
8829 -16535 -142632 -171444 -204862 -180412 43982 123089 -18267 -155078 -190660 -108789 -676
8818 -676 119279 201903 192359 274226 200938 52000 45758 -61343 -22188 -23741 -109621 -137076
$$ packed form
8899E006R0237j445J6309R086K4151r1076j43530n9571J6777J2230l0709K4851
8887a27684L4503j9658q1355K3265m459K6794m4448J2778j08808K9771L5329q1601
8875c05573J31869R3831M593n2227N0806L1038L7002J07591L4081o6864m836Q1882
8863A43193M2143j31373l479m2215k6238p9078q2796j24210j5344J91828P7628
8852d9941O5987R3551j8165k9352k8324M300M9246l4787j33701n5916O7873q5343
8840a54572N299J05499k1160K5574N1215j1530J7997K9907K8920K8158j21842
8829a6535j26097k8812l3418K4450K24394P9107j41356j36811l5582Q1871J08113
8818f76J19955Q2624r544Q1867p3288j48938o242j07101L9155j553q5880k7455
$$ plain form
8806 -137076 -102828 -105474 -81849 -63835 -111477 -89635 57724 130344 95384 4247 -82073 -66941
8794 -66941 -35406 -23925 -49724 39754 60467 -49756 -25217 -29376 -85840 -28930 36327 35594
8782 35594 -152 -37428 -41602 13215 34390 -75227 -121991 22751 67669 74577 38963 -36220
8770 -36220 45540 154319 154775 7612 -86190 1569 25129 69324 86882 -21685 -54082 -112248
8758 -112248 -214617 -334413 -240428 -147695 -28593 80406 191033 180446 88636 132006 174514
8747 174514 180393 88210 67510 88137 229973 196735 61886 -56788 -83652 -33368 -43142
8736 -43142 -136651 -171878 -118338 -83823 -5819 -37006 -83835 -74788 -97648 -110067 -110222 -195709
8724 -195709 -87194 401 29274 -986 45141 19218 -12619 25605 -8065 51546 74565
$$ packed form
8806a37076L4248k646K3625J8014m7642K1842J47359P2620l4960r1137q6320J5132
8794f6941L1535J1481k5799Q9478K0713j10223K4539m159n6464N6910O5257p33
8782C5594l5746l7276m174N4817K1175j09617m6764J44742M4918O908l5614p5183
8770c6220Q1760J08779M56j47163r3802Q7759K3560M4195J7558j08567l2397n8166
8758a12248j02369j19796R3985R2733J19102J08999J10627j0587r1810M3370M2508
8747A74514N879r2183k0700K0627J41836l3238j34849j18674k6864N0284r774
8736d3142r3509l5227N3540L4515P8004l1187m6829R047k2860j2419j55q5487
8724a95709J08515Q7595K8873l0260M6127k5923l1837L8224l3670N9611K3019
$$ plain form
8713 74565 69737 -3312 -102991 -50208 -33429 -48547 -777 18999 -37080 -17488 53055 94667
8701 94667 111107 46225 -31506 99789 40066 8677 -53466 -278861 -339082 -249194 -69723
8690 -69723 -70403 -98345 -40321 -30326 -102007 -8155 75398 36278 -41252 -33909 -5298 35534 41521
8677 41521 87007 80110 64712 157601 286278 238288 191428 131317 25666 -20726 16781 -34148
8665 -34148 -75571 -46508 -145399 -216025 -204732 -175889 -19471 -68720 -106398 -174935 -134333 25096
8653 25096 -20005 -74016 -135451 -177147 -41966 -72106 -88494 -167432 -203587 -208921 -202087 -142779
8641 -142779 -60064 31201 5619 -97655 -56759 66022 58066 10240 -51001 -21320 50474
8630 50474 63874 19223 -40040 -68472 40719 139396 16418 -75732 -15708 -70765 -52745
$$ packed form
8713G4565m828p3049r9679N2783J6779j5118M7770J9776n6079J9592P0543M1612
8701I4667J6440o4882p7731J31295n9723l1389o2143k25395o0221Q9888J79471
8690f9723o80k7942N8024R995p1681R3852Q3553l9120p7530P343K8611M0832N987
8677D1521M5486o897j5398R2889J28677m7990m6860o0111j05651m6392L7507n0929
8665c4148m1423K9063r8891p0626J1293K8843J56418m9249l7678o8537M0602J59429
8653B5096m5101n4011o1435m1696J35181l0140j6388p8938l6155n334O834N9308
8641a42779Q2715R1265k5582j03274M0896J22781p956m7826o1241K9681P1794
8630E0474J3400m4651n9263k8432J09191R8677j22978r2150O0024n5057J8020
$$ plain form
8619 -52745 -177630 -156366 -162563 -129683 -163812 -136286 29806 112118 51716 169496 208079
8608 208079 53148 35790 110279 142489 117945 153815 152327 126378 139997 257397 339958
8597 339958 247562 65651 -85518 -158880 -25443 -27361 -44116 44351 -9875 -78829 -74133
8586 -74133 -58806 -36398 -79258 -21583 65532 118199 75629 121893 195783 151295 104779 419
8574 419 -155800 -184548 -131435 20645 -29177 -39742 30925 -39948 -130053 -195141 -235362 -166103
8562 -166103 1239 86194 113865 -5606 19410 125133 110041 -6835 35967 151304 269884
8551 269884 291101 283595 155238 24836 -18629 -33155 5341 135469 256535 94112 -81944
8540 -81944 -31800 20049 -57055 33793 124770 86400 116570 91092 26738 -107510 -77753 -83843
$$ packed form
8619e2745j24885K1264o197L2880l4129K7526J66092Q2312o0402J17780L8583
8608B08079j54931j7358P4489L2210k4544L5870j488k5949J3619J17400Q2561
8597C39958r2396j81911j51169p3362J33437j918j6755Q8467n4226o8954M696
8586g4133J5327K2408m2860N7675Q7115N2667m2570M6264P3890m4488m6516j04360
8574D19j56219k8748N3113J52080m9822j0565P0667p0873r0105o5088m0221O9259
8562a66103J67342Q4955K7671j19471K5016J05723j5092j16876M2802J15337J18580
8551B69884K1217p506j28357j30402m3465j4526L8496J30128J21066j62423j76056
8540h1944N0144N1849p7104R0848R0977l8370L0170k5478o4354j34248K9757o090
$$ plain form
8528 -83843 -96183 -122163 -89713 9478 -167230 -385516 -263387 -81530 15475 -72345 -69305
8517 -69305 124975 212655 134513 115849 103070 -42964 -150330 -77339 -74520 -82372 -113477 -82568
8505 -82568 -67519 -78938 -29275 9718 -100059 -219207 -180375 -55256 22249 39561 61403
8494 61403 32776 97503 51718 -88331 -214604 -127454 -11809 123378 9800 -13957 -6545
8483 -6545 -6897 73023 -27976 -66504 -78335 -140425 -192111 -72003 -26653 -109599 -62561 45744
8471 45744 34180 58951 63672 36797 21282 34628 -25360 -110558 -103123 -209541 -259008 -239586
8459 -239586 -299775 -228350 -193763 -161314 -74308 -53235 -120914 -105582 71286 147694 148195 123351
8447 123351 99426 -796 -12462 -128352 -68286 -36710 -70547 -18247 116196 163987 159190
$$ packed form
8528h3843j2340k5980L2450R9191j76708k18286J22129J81857R7005q7820L040
8517f9305J94280Q7680p8142j8664j2779j46034j07366P2991K819p852l1105L0909
8505h2568J5049j1419M9663L8993j09777j19148L8832J25119P7505J7312K1842
8494F1403k8627O4727m5785j40049j26273Q7150J15645J35187j13578k3757P412
8483f545l52P9920j00999l8528j1831o2090n1686J20108M5350q2946M7038J08305
8471D5744j1564K4771M721k6875j5515J3346n9988q5198P435j06418m9467J9422
8459b39586o0189P1425L4587L2449Q7006K1073o7679J5332J76868P6408N01k4844
8447A23351k3925j00222j1666j15890O0066L1576l3837N2300J34443M7791m797
$$ plain form
8436 159190 167366 35204 128980 215394 274966 260255 163529 70661 13592 -40253 -243369
8425 -243369 -319922 -222629 -38915 59655 91284 13242 -54766 71027 143056 -13616 -4978
8414 -4978 -35731 44057 193510 136435 -61385 -15431 65698 9809 -75528 -121770 -163967 -214281
8402 -214281 -182986 -85559 -14507 10404 45344 86459 -33542 -53362 -128294 -86725 43095
8391 43095 87864 45233 -66725 -80836 -160278 -147530 -124738 -33791 8817 82654 87202 23818
8379 23818 42887 85115 23717 -10863 6987 -9217 -59489 13494 38819 -32996 -161839 -193198
8367 -193198 -217523 -156699 -118359 -168203 -178815 -102785 -86482 -31417 -72554 -75809 -47553 -27914
8355 -27914 -30284 -1923 -58791 -241 161386 75417 80009 70133 71899 141697 45204 30819
$$ packed form
8436A59190Q176j32162R3776Q6414N9572j4711r6726r2868n7069n3845k03116
8425b43369p6553R7293J83714R8570L1629p8042o8008J25793P2029j56672Q638
8414d978l0753P9788J49453n7075j97820M5954Q1129n5889q5337m6242m2197n0314
8402b14281L1295R7427P1052K4911L4940M1115j20001j9820p4932M1569J29820
8391D3095M4769m2631j11958j4111p9442J2748K2792R0947M2608P3837M548o3384
8379B3818J9069M2228o1398l4580J7850j6204n0272P2983K5325p1815j28843l1359
8367a93198k4325O0824L8340m9844j0612P6030J6303N5065m1137l255K8256J9639
8355b7914k370K8361n6868N8550J61627q5969M592r876J766O9798r6493j4385
$$ plain form
8343 30819 -9566 14365 86618 79531 53425 71865 -1589 -21013 -34633 -54070 -43143 -83491
8331 -83491 -262821 -284557 -285969 -153688 -47309 -13846 -14117 -169446 -202910 -106655 -17276 -19636
8319 -19636 -48281 25345 14041 -105676 -199854 -226195 -178416 -137611 -96628 -129455 -174771 -178725
8307 -178725 -307518 -269335 -150542 -245844 -230770 -135867 -98876 -96396 786 109423 145499
8296 145499 170072 152364 102776 -5988 -12979 -48731 -65421 -143267 -149836 -45715 -17681 1761
8284 1761 10979 61676 132189 86178 15883 6292 14496 31288 -24635 -43667 -95850 -143271 -74821
8271 -74821 -8392 120841 194332 67036 -43787 41151 170669 137327 46548 -99090 -129780
8260 -129780 -8481 60687 -14434 -39445 -32323 44056 5250 26439 121426 143403 171937 184211
$$ packed form
8343C0819m0385K3931P2253p087k6106J8440p3454j9424j3620j9437J0927m0348
8331h3491j79330k1736j412J32281J06379L3463k71j55329l3464R6255Q9379k360
8319a9636k8645P3626j1304j19717r4178k6341M7779M0805M0983l2827m5316l954
8307a78725j28793L8183J18793r5302J5074R4903L6991K480R7182J08637L6076
8296A45499K4573j7708m9588j08764o991l5752j6690p7846o569J04121K8034J9442
8284A761R218N0697P0513m6011p0295r591Q204J6792n5923j9032n2183m7421O8450
8271g4821O6429J29233P3491j27296j10823Q4938J29518l3342r0779j45638l0690
8260a29780J21299O9168p5121k5011P122P6379l8806K1189R4987K1977K8534J2274
$$ plain form
8248 184211 -1276 -69987 -42889 50940 -10181 -23844 -36226 -1806 -45745 15202 89179
8237 89179 61180 143625 175267 229269 194752 48315 -5037 -23275 -96432 -117721 -156357 -85602
8225 -85602 70043 103951 35428 -107795 -148172 32755 55187 -98837 -35138 -62610 -85402
8214 -85402 -151540 -253050 -214109 -111315 -1000 57936 -12600 20603 23377 6867 42341
8203 42341 69907 108525 150955 90053 6276 42006 135306 151761 120019 53025 89666 134720
8191 134720 4648 -129403 -115556 -112649 -48378 66191 80266 -5894 4212 141246 161858
8180 161858 128343 60877 122032 55479 38583 36983 -28300 -64291 -91272 -62883 30075 62082
8168 62082 39128 -59227 85709 138161 -34560 -79059 60493 78734 27733 82335 79046
$$ packed form
8248A84211j85487o8711K7098R3829o1121j3663j2382L4420m3939O0947P3977
8237H9179k7999Q2445L1642N4002l4517j46437n3352j8238p3157k1289l8636P0755
8225h5602J55645L3908o8523j43223m0377J80927K2432j54024O3699k7472k2792
8214h5402o6138j01510L8941J02794J10315N8936p0536L3203K774j6510L5474
8203D2341K7566L8618M2430o0902q3777L5730R3300J6455l1742o6994L6641M5054
8191A34720j30072j34051J3847K907O4271J14569J4075q6160J0106J37034K0612
8180A61858l3515o7466O1155o6553j6896j600o5283l5991k6981K8389R2958L2007
8168F2082k2954r8355J44936N2452j72721m4499J39552J8241n1001N4602l289
$$ plain form
8157 79046 -19200 50394 16448 -88799 -93800 -57049 59515 119255 -11504 -20129 -7134 -94444
8145 -94444 -133441 -109316 16032 57245 11078 -29294 -145859 -227393 -240777 -10994 133164
8134 133164 79851 107730 201587 258517 106566 -46676 -115370 -239955 -260104 -229508 -138244
8123 -138244 -16405 -98000 -121100 -91162 -145859 -155886 -71798 -1328 -21840 -39430 -84396
8112 -84396 -92220 -83685 -80412 -125695 -154743 35729 149972 124196 -25898 -64548 -191869 -144273
8100 -144273 -210500 -237824 -170480 -201757 -279132 -294885 -289001 -337161 -227632 -178729 -177028 -204532
8088 -204532 -186039 -124555 -70674 -53568 -44009 -75097 -161535 -275655 -199994 -49614 -54558 -97531
8076 -97531 -105662 -25913 -87848 -148807 -158085 -149629 -159691 -171319 -208045 -188741 -162937 -203708
$$ packed form
8157G9046r8246O9594l3946j05247n001L6751J16564N9740j30759q625J2995q7310
8145i4444l8997K4125J25348M1213m6167m0372j16565q1534j3384K29783J44158
8134A33164n3313K7879R3857N6930j51951j53242o8694j24585k0149L0596R1264
8123a38244J21839q1595k3100K9938n4697j0027Q4088P0470k0512j7590m4966
8112h4396p824Q535L273m5283k9048J90472J14243k5776j50094l8650j27321M7596
8100a44273o6227k7324O7344l1277p7375j5753N884m8160J09529M8903J701k7504
8088b04532J8493O1484N3881J7106R559l1088q6438j14120P5661J50380m944m2973
8076i7531q131P9749o1935o0959r278Q456j0062j1628l6726J9304K5804m0771
$$ plain form
8064 -203708 -184688 -82027 -15957 -8831 -40036 -106253 -114858 -140638 -52832 -56134 -97586 25513
8052 25513 76568 62403 214794 175655 137136 6566 -42963 10516 -58553 -197560 -139430
8041 -139430 -1725 172270 216600 177878 176428 132926 -64704 -73250 -68805 -137926 -66820 59511
8029 59511 176867 140834 30339 -47660 -111861 -91717 -12207 24245 -45829 -40317 10170 31925
8017 31925 127899 51863 -28943 -62008 -70415 19625 29776 11936 -34316 64804 104857 132045
8005 132045 64524 9320 -55639 -129345 -94811 -89408 -76376 -32673 -24045 -55768 -71773 -165099
7993 -165099 -295228 -124029 -66475 -165496 -143916 -65248 -44532 -353 -58499 -49425 -89101
7982 -89101 -68850 -29168 65228 53975 -46722 -103122 42363 20356 25519 -46449 22699 73055
$$ packed form
8064b03708J9020J02661O6070P126l1205o6217q605k5780Q7806l302m1452J23099
8052B5513N1055j4165J52391l9139l8519j30570m9529N3479o9069j39007N8130
8041a39430J37705J73995M4330l8722j450m3502j97630q546M445o9121P1106J26331
8029E9511J17356l6033j10495p7999o4201K0144P9510L6452p0074N512N0487K1755
8017C1925R5974p6036q0806l3065q407R0040J0151j7840m6252R9120M0053K7188
8005A32045o7521n5204o4959p3706L4534N403J3032M3703Q628l1723j6005r3326
7993a65099j30129J71199N7554r9021K1580P8668K0716M4179n8146R074l9676
7982h9101K0251L9682R4396j1253j00697n6400J45485k2007N163p1968O9148N0356
$$ plain form
7970 73055 14325 -2309 49964 6499 -38175 -3817 -25707 -33721 -1782 4048 94107 74441
7958 74441 -31 -27764 -8310 -32189 -139902 -227919 -182534 -150018 -65883 -55519 -96382 34498
7946 34498 6632 -47535 -26483 1595 84355 119611 151524 148954 95792 50943 -42404 -18456
7934 -18456 -28369 -137457 -191134 -231030 -248648 -110673 -49581 -181218 -205341 -109129 -57676
7923 -57676 22850 40736 4320 11682 104577 221176 188816 143567 152492 153634 98586 -29528
7911 -29528 -23234 51748 120303 170194 91170 114603 67432 -196714 -346200 -203862 -125213
7900 -125213 -134227 -69923 13409 188795 148432 68539 89691 4400 -122570 -230246 -206985
7889 -206985 -121935 -145026 -141110 -117808 -146645 -219133 -225446 -166561 -80030 -73378 107771 54682
$$ packed form
7970G3055n8730j6634N2273m3465m4674L4358k1890q014L1939N830R0059j9666
7958G4441p4472k7733J9454k3879j07713q8017M5385L2516Q4135J0364m0863J30880
7946C4498k7866n4167K1052K8078Q2760L5256L1913k570n3162m4849r3347K3948
7934a8456r913j09088n3677l9896j7618J37975O1092j31637k4123R6212N1453
7923e7676Q0526J7886l6416P362R2895J16599l2360m5249Q925J142n5048j28114
7911b9528O294P4982O8555M9891p9024K3433m7171k64146j49486J42338P8649
7900a25213r014O4304Q3332J75386m0363p9893K1152q5291j26970j07676K3261
7889b06985Q5050k3091L916K3302k8837p2488o313N8885Q6531O652J81149n3089
$$ plain form
7877 54682 -1655 110360 142111 153084 66163 -14604 -125277 -67319 -19278 -97388 -163996
7866 -163996 -88478 -153731 -155981 -132182 -93022 -53314 -172322 -208072 -168698 -64236 -133266
7855 -133266 -260603 -274147 -239565 -106908 14233 131404 161546 81930 134446 222370 249824
7844 249824 275597 141459 111620 136201 101305 -5966 5482 61866 -19112 -30568 -53688
7833 -53688 -2563 50742 130813 41655 86930 88155 78909 112184 86142 -63561 -100885 -35139
7821 -35139 -79088 -14522 111676 132175 86270 141742 124291 200914 86878 -54893 -98141
7810 -98141 9687 131350 66564 -14007 4543 72125 89941 37998 50048 70953 106603
7799 106603 138304 6622 44227 131288 44361 -99629 -86798 -82766 -60677 2301 -78050
$$ packed form
7877E4682n6337J12015L1751J0973q6921q0767j10673N7958M8041p8110o6608
7866a63996P5518o5253k250K3799L9160L9708j19008l5750L9374J04462o9030
7855a33266j27337j3544L4582J32657J21141J17171L0142p9616N2516Q7924K7454
7844B49824K5773j34138k9839K4581l4896j07271J1448N6384q0978j1456k3120
7833e3688N1125N3305Q0071q9158M5275J225r246L3275k6042j49703l7324O5746
7821c5139m3949O4566J26198K0499m5905N5472j7451P6623j14036j41771m3248
7810i8141J07828J21663o4786q0571J8550O7582J7816n1943J2050K0905L5650
7799A06603L1701j31682L7605Q7061q6927j43990J2831M032K2089O2978q0351
$$ plain form
7788 -78050 -17469 105142 33571 40921 24526 36011 69179 -21188 -77172 -112395 -141635 -133431
7776 -133431 -155307 -105328 73490 208843 201877 124024 59501 -51485 -69702 -128170 -59095
7765 -59095 -8643 -17001 -19941 -30290 -79629 -108388 -101422 23741 75993 -5542 -64580 -204213
7753 -204213 -154695 -57884 -68594 -127943 -171342 -219871 -173922 -149503 -68954 74797 164203
7742 164203 70460 9468 6105 -42473 -63678 -142054 -189274 -103050 -73450 -183764 -106602 -83663
7730 -83663 -69194 17236 90047 87296 107873 96270 117980 91679 22141 -44572 -45831 -54191
7718 -54191 -89742 -79583 8254 4553 20441 -10792 36697 137428 191527 148624 80816 46670
7706 46670 44209 -33988 -33084 -58221 -74710 -200655 -151607 -9665 101171 148556 228872 239978
$$ packed form
7788g8050O0581J22611p1571P350j6395J1485L3168r0367n5984l5223k9240Q204
7776a33431k1876M9979J78818J35353o966p7853o4523j10986j8217n8468O9075
7765e9095N0452q358k940j0349m9339k8759O966J25163N2252q1535n9038j39633
7753b04213M9518R6811j0710n9349m3399m8529M5949K4419Q0549J43751Q9406
7742A64203r3743o0992l363m8578k1205p8376m7220Q6224K9600j10314P7162K2939
7730h3663J4469Q6430P2811k751K0577j1603K1710k6301o9538o6713j259q360
7718e4191l5551J0159Q7837l701J5888l1233M7489J00731N4099m2903o7808l4146
7706D6670k461p8197R04k5137j6489j25945M9048J41942J10836M7385Q0316J1106
$$ plain form
7694 239978 127831 24978 12058 -19084 43787 155176 198322 171094 223699 210056 116176
7683 116176 87509 -10813 -101667 -77616 -77845 -88844 -47122 -106522 -55298 -11340 8467 90409
7671 90409 151999 105769 34831 -43244 -182712 -163067 -71875 4673 72295 175221 118407
7660 118407 7986 37515 111373 75542 -31463 -20935 29546 -33185 -74705 -75923 -16165
7649 -16165 -47788 -43526 -44946 -74042 -38606 -81737 -151541 -40764 -10192 110558 51306 83238
7637 83238 57919 -40609 -68160 -107167 -79042 -23707 8037 51114 53899 74893 38816 -8515
7625 -8515 17802 -13872 -93233 -55391 79751 41211 30414 -34057 -22897 -5255 107713 105891
7613 105891 128882 137187 153247 124091 58082 -14754 14944 39671 66429 176747 145074 -18478
$$ packed form
7694B39978j12147j02853j2920l1142O2871J11389M3146k7228N2605j3643r3880
7683A16176k8667r8322r0854K4051k29j0999M1722n9400N1224M3958J9807Q1942
7671I0409O1590m6230p0938p8075j39468J9645R1192P6548O7622J02926n6814
7660A18407j10421K9529P3858l5831j07005J0528N0481o2731m1520j218N9758
7649a6165l1623M262j420k9096L5436m3131o9804J10777L0572J20750n9252L1932
7637H3238k5319r8528k7551l9007K8125N5335L1744M3077K785K0994l6077m7331
7625h515K6317l1674p9361L7842J35142l8540j0797o4471J1160J7642J12968j822
7613A05891K2991Q305J6060k9156o6009p2836K9698K4727K6758J10318l1673j63552
$$ plain form
7601 -18478 -77577 -71279 -122955 -40948 43173 8253 70215 53619 17101 -85032 -52522 2886
7589 2886 144621 114044 -12107 -116117 -82140 -72591 -16234 6281 40856 -33135 -103525 -193344
7577 -193344 -351113 -371912 -254296 -183948 -133390 -61773 -80706 -107259 -252147 -308392 -165677
7566 -165677 -18299 60765 122540 148649 24473 -58312 11053 6065 -65011 -69296 -61728 -77040
7554 -77040 -78177 -4650 -54489 -62045 -29843 10382 57791 200693 85047 14598 137500 123332
7542 123332 57601 142841 165467 43061 10982 -25058 -43839 -63953 -30862 -62505 -104096
7531 -104096 -126999 -134396 -109478 -96748 -23256 31603 58822 39613 82434 22386 74873 152004
7519 152004 160629 28274 20355 -35453 -142177 -57984 -33833 -65888 -120124 -103179 -26255 67950
$$ packed form
7601a8478n9099O298n1676Q2007Q4121l4920O1962j6596l6518j02133L2510N5408
7589B886J41735l0577j26151j04010L3977R549N6357K2515L4575p3991p0390q9819
7577a93344j57769k0799J17616P0348N0558P1617j8933k6553j44888n6245J42715
7566a65677J47378P9064O1775K6109j24176q2785O9365m988p1076m285P568j5312
7554g7040j137P3527m9839p556L2202M0225M7409J42902j15646p0449J22902j4168
7542A23332o5731Q5240K2626j22406l2079l6040j8781k0114L3091l1643m1591
7531a04096k2903p397K4918J2730P3492N4859K7219j9209M2821o0048N2487P7131
7519A52004Q625j32355p919n5808j06724Q4193K4151l2055n4236J6945P6924R4205
$$ plain form
7507 67950 100677 121186 16114 11831 102151 99515 129324 184485 155486 119465 -35862 -49876
7495 -49876 36630 51176 -67731 -120382 -152112 -89082 -99851 -10488 -53619 -124006 -103001 -130245
7483 -130245 -172013 -50776 -35506 -107532 15365 128961 -40505 -18216 17892 10858 29922
7472 29922 114238 154733 179874 170568 154152 79468 -43578 -158802 -209298 -198787 -136503 -226254
7460 -226254 -200074 -17482 1627 8535 34935 29282 -44262 -174191 -201467 -177390 -195461 -37218
7448 -37218 -68458 -165203 -139287 -146225 -97558 -109974 -80902 -132011 -82380 -74537 -48667 -28933
7436 -28933 -114986 -155939 -154283 12986 -18969 -159686 -87868 -6631 50185 72643 -21829 -83462
7424 -83462 -96422 -192860 -247093 -150742 34526 35287 33237 26489 -34414 -10955 20116 -91318
$$ packed form
7507F7950L2727K0509j05072m283R0320k636K9809N5161k8999l6021j55327j4014
7495d9876Q6506J4546j18907n2651l1730O3030j0769Q9363m3131p0387K1005k7244
7483a30245m1768J21237J5270p2026J22897J13596j69466K2289L6108p034J9064
7472B9922Q4316M0495K5141r306j6416p4684j23046j15224n0496J0511O2284q9751
7460b26254K6180J82592J9109O908K6400n653p3544j29929k7276K4077j8071J58243
7448c7218l1240r6745K5916o938M8667j2416K9072n1109M9631P843K5870J9734
7436b8933q6053m0953J656J67269l1955j40717P1818Q1237N6816K2458r4472o1633
7424h3462j2960r6438n4233R6351J85268P61k050o748o0903K3459L1071j11434
$$ plain form
7412 -91318 -196127 -126401 -45538 9815 -70895 -100172 -136854 -33522 113037 111544 -20207
7401 -20207 -70905 -58124 -19343 75154 61554 13617 88144 137135 147634 166800 37296 -36740
7389 -36740 -134047 -86295 -41065 -45027 145206 189693 132887 70021 66211 61623 44073 -155
7377 -155 116011 144457 164804 126533 93142 76421 -5900 23614 17418 23156 143664 181513
7365 181513 133538 119171 -23518 -150634 -129771 -177222 -210386 -138165 -110682 -49097 38672
7354 38672 -9130 -139980 -218285 -141630 -32636 55304 -6519 -22138 -20702 -3225 11015 171432
7342 171432 161800 129183 91206 73754 -8284 59500 23628 27088 -45611 -67229 -103611 -122327
7330 -122327 -59551 -74875 -95476 -82437 27134 21937 -9717 1572 -87808 22882 87515
$$ packed form
7412i1318j04809O9726Q0863N5353q0710k9277l6682J03332J46559j493j31751
7401b0207n0698J2781L8781R4497j3600m7937P4527M8991J0499J9166j29504p4036
7389c6740r7307M7752M5230l962J90233M4487n6806o2866l810m588j7550m4228
7377a55J16166K8446K0347l8271l3391j6721q2321K9514o196N738J20508L7849
7365A81513m7975j4367j42689j27116K0863m7451l3164P2221K7483O1585Q7769
7354C8672m7802j30850p8305P6655J08994Q7940o1823j5619J436J7477J4240J60417
7342A71432r632l2617l7977j7452q2038O7784l5872L460p2699k1618l6382j8716
7330a22327O2776j5324k0601J3039J09571n197l1654J1289q9380J10690O4633
$$ plain form
7319 87515 5251 -94421 -175725 -94039 -2306 33963 75720 104515 114862 45997 79869 142170
7307 142170 67554 228580 288863 43464 -68161 -112132 -102669 -35513 -18578 46733 156377
7296 156377 144232 121823 121474 18019 7248 75933 19022 -12194 -68570 -89764 -56060 -205718
7284 -205718 -134591 65783 3428 -142489 -138347 -42342 6029 7507 26506 -42399 -139451 -38551
7272 -38551 -13990 -79837 -98455 -112745 -145005 -161524 -187011 -101637 -50704 -23883 -18215 -35534
7260 -35534 -8432 -45447 -55196 91396 25567 27705 198783 279174 149414 85445 127473 174419
7248 174419 252873 286646 225625 230030 300352 206058 88961 1438 -81662 -28405 49909 25213
7236 25213 20061 58282 106012 98983 -90146 -117989 -65233 12122 170927 142731 61779 -8945
$$ packed form
7319H7515q2264r9672q1304Q1686R1733L6269M1757K8795J0347o8865L3872O2301
7307A42170p4616J61026O0283k45399j11625m3971R463O7156J6935O5311J09644
7296A56377j2145k2409l49j03455j0771O8685n6911l1216n6376k1194L3704j49658
7284b05718P1127K00374o2355j45917M142R6005M8371J478J8999o8905r7052J00900
7272c8551K4561o5847j8618j4290l2260j6519k5487Q5374N0933K6821N668j7319
7260c5534K7102l7015r749J46592o5829K138J71078Q0391j29760o3969M2028M6946
7248A74419P8454L3773o1021M405P0322r4294j17097q7523q3100N3257P8314k4696
7236B5213n152L8221M7730p029j89129k7843N2756P7355J58805k8196q0952p0724
$$ plain form
7224 -8945 -47174 57132 45907 64821 81169 -16706 -135178 -87723 -26784 80926 36991
7213 36991 2365 64351 141389 259320 167311 155805 229057 224299 169658 113156 54573 11443
7201 11443 -115764 -184130 -130961 -71499 4970 45565 95142 159096 142806 95365 14621 22859
7189 22859 -12290 -47723 -159208 -29739 74621 41681 72745 34491 -36980 25451 129958
7178 129958 85060 55400 44206 64696 84257 -28110 -115841 -230167 -271585 -159933 -102762
$$ packed form
7224h945l8229J04306j1225J8914J6348r7875j18472M7455O0939J07710m3935
7213C6991l4626O1986P7038J17931r2009j1506P3252m758n4641n6502n8583m3130
7201A1443j27207o8366N3169N9462P6469M0595M9577O3954j6290m7441q0744Q238
7189B2859l5149l5433j11485J29469J04360l2940L1064l8254p1471O2431J04507
7178A29958m4898k9660j1194K0490J9561j12367q7731j14326m1418J11652N7171
$$ [...]
##END NTUPLES=NMR SPECTRUM
##END=
