##TITLE=Analysis number 314483
Compound Code cc 43104
Book Reference 414/138/2
Project Code adrs
Chemist Name mattw
##JCAMPDX= 6.0         $$ Bruker NMR JCAMP-DX V2.0
##DATA TYPE= NMR SPECTRUM
##DATA CLASS= NTUPLES
##ORIGIN= Bruker BioSpin GmbH
##OWNER= NMR
$$ XWIN-NMR		Version 3.5
$$ Tue Oct 18 11:51:17 2005 GMT Daylight Time (UT+1h)  MAYBRIDGE\NMR@NMR_250MHZ
##.OBSERVE FREQUENCY= 250.131544655141
##.OBSERVE NUCLEUS= ^1H
##.ACQUISITION MODE= SIMULTANEOUS (DQD)
##.ACQUISITION SCHEME= undefined
##.AVERAGES= 16
##.DIGITISER RES= 18
##SPECTROMETER/DATA SYSTEM= dpx250
##.PULSE SEQUENCE= zg30
##.SOLVENT NAME= CDCl3
##.SHIFT REFERENCE= (INTERNAL, CDCl3, 0, 16.4566)
##AUDIT TRAIL= $$ (NUMBER, WHEN, WHO, WHERE, WHAT)
$$ ##TITLE= Audit trail, XWIN-NMR		Version 3.5
$$ ##JCAMPDX= 5.01
$$ ##ORIGIN= Bruker BioSpin GmbH
$$ ##OWNER= NMR
$$ C:\u/data/dgb/nmr/ADRS/10950/pdata/1/auditp.txt
$$ ##AUDIT TRAIL=  $$ (NUMBER, WHEN, WHO, WHERE, WHAT)
(   1,<2005-10-18 11:50:42.88 +100>,<MAYBRIDGE\NMR>,<NMR_250MHZ>,
      <created by zg, POWCHK disabled, PULCHK disabled
       configuration hash MD5:
       62 19 C7 07 E1 42 D1 B7 37 6C 3D D0 77 39 F9 E6
       data hash MD5: 64K
       25 F7 67 16 AF E6 47 A0 94 56 96 61 FB 62 99 CA>)
(   2,<2005-10-18 11:50:58.60 +100>,<MAYBRIDGE\NMR>,<NMR_250MHZ>,
      <Start of raw data processing
       ef LB = 0.3 FT_mod = 6 PKNL = 1 SI = 32K 
       data hash MD5: 32K
       7A 8C BD BF 01 A4 B7 82 D0 1C E9 A6 17 37 B4 90>)
(   3,<2005-10-18 11:51:03.57 +100>,<MAYBRIDGE\NMR>,<NMR_250MHZ>,
      <apk 
       data hash MD5: 32K
       90 AC 0D 9B 84 81 3A FF 81 7B 9B E6 F2 7D B4 59>)
(   4,<2005-10-18 11:51:05.22 +100>,<MAYBRIDGE\NMR>,<NMR_250MHZ>,
      <abs ABSG = 5 
       data hash MD5: 32K
       D6 EC 74 B4 D8 CC 61 1D EC B2 37 65 F6 54 9B 61>)
$$ ##END=
$$ 
$$ hash MD5
$$ 57 C3 64 E8 5B F1 20 5A 0E 11 3D C8 A6 32 0C 43
##$RELAX= 
##$RELAX= 
##$RELAX= 
##$RELAX= 
##$RELAX= 
##$RELAX= 
##$RELAX= 
$$ Bruker specific parameters
$$ --------------------------
##$DU= <C:\u>
##$EXPNO= 10950
##$NAME= <ADRS>
##$PROCNO= 1
##$TYPE= <nmr>
##$USER= <dgb>
##$AMP= (0..31)
100 100 100 100 100 100 100 100 100 100 100 100 100 100 100 100 100 100 
100 100 100 100 100 100 100 100 100 100 100 100 100 100 
##$AQSEQ= 0
##$AQ_mod= 3
##$AUNM= <au_zg>
##$AUTOPOS= <16 >
##$BF1= 250.13
##$BF2= 250.13
##$BF3= 250.13
##$BF4= 250.13
##$BF5= 500.13
##$BF6= 500.13
##$BF7= 500.13
##$BF8= 500.13
##$BYTORDA= 1
##$CFDGTYP= 0
##$CFRGTYP= 5
##$CHEMSTR= <none>
##$CNST= (0..31)
1 1 145 1 1 1 1 1 1 1 1 1 1 1 1 1 1 1 1 1 1 1 1 1 1 1 1 1 1 1 1 1 
##$CPDPRG= <>
##$CPDPRG1= <>
##$CPDPRG2= <>
##$CPDPRG3= <>
##$CPDPRG4= <mlev>
##$CPDPRG5= <mlev>
##$CPDPRG6= <mlev>
##$CPDPRG7= <mlev>
##$CPDPRG8= <mlev>
##$CPDPRGB= <>
##$CPDPRGT= <>
##$D= (0..31)
0 1 0 0 0 0 0 0 0 0.06 0 0 0 0 0 0 0.0002 0 0 0 0 0 0 0 0 0 0 0 0 0 0 
0 
##$DATE= 1129632641
##$DBL= (0..7)
120 120 120 120 120 120 120 120 
##$DBP= (0..7)
150 150 150 150 150 150 150 150 
##$DBP07= 0
##$DBPNAM0= <>
##$DBPNAM1= <>
$$ [...]
##$SUBNAM7= <"">
##$SUBNAM8= <"">
##$SUBNAM9= <"">
##$SW= 20.6930455092707
##$SWIBOX= (0..15)
0 0 3 0 0 0 0 0 0 0 0 0 0 0 0 0 
##$SW_h= 5175.983436853
##$TD= 65536
##$TD0= 1
##$TE= 294.16
##$TE2= 300
##$TE3= 300
##$TEG= 300
##$TL= (0..7)
0 120 120 120 120 120 120 120 
##$TP= (0..7)
150 150 150 150 150 150 150 150 
##$TP07= 0
##$TPNAME0= <>
##$TPNAME1= <>
##$TPNAME2= <>
##$TPNAME3= <>
##$TPNAME4= <>
##$TPNAME5= <>
##$TPNAME6= <>
##$TPNAME7= <>
##$TPOAL= (0..7)
0.5 0.5 0.5 0.5 0.5 0.5 0.5 0.5 
##$TPOFFS= (0..7)
0 0 0 0 0 0 0 0 
##$TUNHIN= 0
##$TUNHOUT= 0
##$TUNXOUT= 0
##$USERA1= <user>
##$USERA2= <user>
##$USERA3= <user>
##$USERA4= <user>
##$USERA5= <user>
##$V9= 5
##$VALIST= <valist>
##$VCLIST= <CCCCCCCCCCCCCCC>
##$VD= 0
##$VDLIST= <DDDDDDDDDDDDDDD>
##$VPLIST= <PPPPPPPPPPPPPPP>
##$VTLIST= <TTTTTTTTTTTTTTT>
##$WBST= 1024
##$WBSW= 4
##$XGAIN= (0..3)
0 0 0 0 
##$XL= 0
##$YL= 0
##$YMAX_a= 416550
##$YMIN_a= -415920
##$ZGOPTNS= <>
##$ZL1= 120
##$ZL2= 120
##$ZL3= 120
##$ZL4= 120
##$ABSF1= 16.45664
##$ABSF2= -4.236532
##$ABSG= 5
##$ABSL= 3
##$ALPHA= 0
##$AQORDER= 0
##$ASSFAC= 0
##$ASSFACI= 0
##$ASSFACX= 0
##$ASSWID= 0
##$AUNMP= <proc_1d>
##$AZFE= 0.1
##$AZFW= 0.1
##$BCFW= 0
##$BC_mod= 0
##$BYTORDP= 0
##$COROFFS= 0
##$CY= 12.5
##$DATMOD= 1
##$DC= 0
##$DFILT= <>
##$DTYPP= 0
##$F1P= 14.0000005364418
##$F2P= -0.99999901652339
##$FCOR= 0.5
##$FTSIZE= 32768
##$FT_mod= 6
##$GAMMA= 0
##$GB= 0
##$INTBC= 1
##$INTSCL= 1
##$ISEN= 128
##$LB= 0.3
##$LEV0= 0
##$LPBIN= 0
##$MAXI= 10000
##$MC2= 0
##$MEAN= 0
##$ME_mod= 0
##$MI= 0
##$NCOEF= 0
##$NC_proc= -5
##$NLEV= 6
##$NOISF1= 0
##$NOISF2= 0
##$NSP= 0
##$NTH_PI= 0
##$NZP= 0
##$OFFSET= 16.45664
##$PC= 1
##$PHC0= -67.72338
##$PHC1= 5.966539
##$PH_mod= 1
##$PKNL= yes
##$PPARMOD= 0
##$PSCAL= 4
##$PSIGN= 0
##$REVERSE= no
##$SF= 250.130016346275
##$SI= 32768
##$SIGF1= 0
##$SIGF2= 0
##$SINO= 400
##$SIOLD= 32768
##$SREGLST= <1H.CDCl3>
##$SSB= 0
##$STSI= 32768
##$STSR= 0
##$SW_p= 5175.98343685301
##$SYMM= 0
##$S_DEV= 0
##$TDeff= 65536
##$TDoff= 0
##$TI= <Analysis number 999999
Compound Code 99
Book Reference 9
Project Code 9>
##$TILT= no
##$TM1= 0
##$TM2= 0
##$TOPLEV= 0
##$USERP1= <user>
##$USERP2= <user>
##$USERP3= <user>
##$USERP4= <user>
##$USERP5= <user>
##$WDW= 1
##$XDIM= 32768
##$YMAX_p= 539506909
##$YMIN_p= -421230
$$ End of Bruker specific parameters
$$ ---------------------------------
##NTUPLES= NMR SPECTRUM
##VAR_NAME=  FREQUENCY,     SPECTRUM/REAL,   SPECTRUM/IMAG
##SYMBOL=    X,             R,               I
##VAR_TYPE=  INDEPENDENT,   DEPENDENT,       DEPENDENT
##VAR_FORM=  AFFN,          ASDF,            ASDF
##VAR_DIM=   32768,         32768,           32768
##UNITS=     HZ,            ARBITRARY UNITS, ARBITRARY UNITS
##FACTOR=    0.157963299565203, 1,           1
##FIRST=     4116.29969311899, 0,            0
##LAST=      -1059.68374373402, 0,           0
##MIN=       -1059.68374373402, -421230,     0
##MAX=       4116.29969311899, 539506909,    0
$$ Real data points
##PAGE= N=1
##DATA TABLE= (X++(R..R)), XYDATA
$$ [...]
22023 -19275 -105180 -165020 -114579 -95020 -141980 -73583 -69274 -19029 -49122 -51524 13235 -23645
22011 -23645 -103104 -189947 -251475 -175125 -100364 3714 102902 106117 108727 128808 67663 123751
21999 123751 125474 170333 195249 170975 -8311 -158331 -96947 -92521 -19580 67232 -67860
21988 -67860 -175636 -92083 20854 8426 -7138 73088 52132 35057 -66471 -86783 12209
21977 12209 -72144 -21127 81818 60109 102355 22561 -96764 -35785 -112505 -159859 -137447
21966 -137447 -163720 -59627 42953 -15567 -48214 99527 157738 213570 202443 121655 64988
21955 64988 34413 96821 -25130 -134968 -149515 -215104 -150632 -51788 -85863 -170586 -137379
21944 -137379 33417 117363 119340 117976 77074 50138 6716 56992 101862 106288 81387 -24784
21932 -24784 -97761 -42131 44272 12414 61541 88026 20987 -55069 51156 228999 172690
21921 172690 181683 64041 25366 45770 115052 -55584 -174089 -56348 41870 22872 -19111
21910 -19111 683 101937 174896 55569 -78895 -206152 -298432 -155623 -49466 -85952
21900 -85952 -189072 -91538 40567 9873 -53661 -121807 -165319 -143404 -137289 -66218 22615
21889 22615 5593 -41448 -13064 -19353 76010 16218 -120954 -100504 63996 16111 6603 47600
21877 47600 44341 4378 -29225 -9387 -350 84277 62361 70046 54479 118257 90488 134388
21865 134388 185973 166867 123363 213544 160024 133656 189168 209832 114690 114728 83270 37113
21853 37113 49937 48683 26421 27462 131353 76336 366 -52241 47674 185548 195535 151617
21841 151617 96439 115386 84701 -71798 -79628 44374 149328 336155 608048 1044605
21831 1044605 1598097 2227488 2734017 2947880 2841991 2424725 1850376 1429823 1179453
21822 1179453 997742 880619 693527 519447 519264 457026 339637 382171 456534 469183 499863
21811 499863 418964 238380 192050 246706 234421 157629 172366 195573 134192 178308 164799
21800 164799 53293 29580 3983 54608 73064 47960 -23083 59523 97044 35104 8277
21789 8277 -65152 -101880 -111570 -101708 36740 9777 -44499 -102177 -180568 -231946 -279728 -265239
21777 -265239 -257772 -312571 -296360 -305320 -117523 -24999 62395 83148 4991 -1579 28067 50367
21765 50367 168904 201322 191321 188216 218975 208727 162242 85301 -5049 -88885 4300 73636
21753 73636 27395 -51713 -55701 33681 13401 -48482 -106674 -33472 -30035 2034 129595 153868
21741 153868 253218 69569 -147930 -208089 -211811 -174424 -105334 -7227 -18117 -6845 145106
21730 145106 121675 17355 28819 60976 30641 -39160 -44651 69615 101890 194823 124544
21719 124544 51985 78453 149852 102914 84447 -104399 -121524 -69983 43850 108237 123484
21708 123484 97288 46365 -5375 -136618 -169938 -69689 18761 62425 53191 66339 97178
21697 97178 52734 -2463 12369 35890 26945 -36932 -50066 61090 84253 38743 77998 -15298
21685 -15298 -162529 -165331 -127172 -121746 -94098 -125703 -111165 -22480 -16469 -37856 -4852 12339
21673 12339 -13483 67649 100935 26044 19072 78201 80752 64781 -26337 -44547 -51980 -65297
21661 -65297 24713 75294 85213 -6975 -71361 -53988 -15424 59039 78008 12841 -225081 -249159
21649 -249159 -154157 -126705 -199795 -64661 16282 -7939 31503 132244 108269 74706 91879
21638 91879 144712 168119 -13166 14705 35740 63784 211328 270048 192602 161235 137421
21627 137421 140461 99950 68725 -28028 -138603 -163875 44861 104112 49154 79963 75885
21616 75885 33354 45590 4766 13959 45779 93056 59478 -37039 20067 81163 101639 75886
21604 75886 77775 40187 94120 143214 96525 -3632 -48594 -113400 -162276 -122889 -91607 -98290
21592 -98290 -144597 -280329 -221972 -212003 -239475 -129481 -70554 -155975 -62728 -23086 -10003
21581 -10003 24587 58519 105130 61378 8310 5821 79314 113563 133296 127553 246211 199052
21569 199052 172317 224994 162461 111588 -19329 -78660 -7448 -60341 -119256 -167348 -151980
21558 -151980 -126739 -25603 28691 -45820 -134992 -53170 16253 13598 40781 -21019 -106428
21547 -106428 -41508 -61252 -148018 -74355 -41837 -116173 -119677 -72362 -66599 13768 108305 72606
21535 72606 157815 41726 -74278 -385 125221 97206 28873 27131 64683 -23662 -42054
21524 -42054 -28217 -131892 -131947 -130619 -152700 -200654 -204770 -150017 -139237 -146409 -95382 -65027 -99202
21511 -99202 -124084 -51097 53801 20256 2447 -106026 -41748 -54216 -79509 -117262 -119409
21500 -119409 -140682 -140661 -44589 -15625 -138552 -208270 -105306 47520 57433 34621 59777 -21612
21488 -21612 -88136 -46106 -36004 22120 42224 71863 18678 5006 -42281 -108542 -1388
21477 -1388 96510 138891 67013 23448 -19414 -53670 -14112 4470 -33077 -82706 -180693 -246907
21465 -246907 -13323 77751 -31669 -188358 -242876 -225711 -239300 -80464 -17076 66472 92724
21454 92724 50887 -52861 -163058 -216829 -118293 -84299 -39534 -32844 -76918 -28858 -32780 11938
21442 11938 -12459 -67263 -96129 -50114 -7813 -20751 -58062 -154355 -280502 -288043 -232945 -111022
21430 -111022 -32863 -27971 -44400 60380 -11762 -137154 -39721 -25919 -161089 -213988 -194325
21419 -194325 -209176 -5736 83717 72834 -16941 -14776 -35081 -35700 -23381 -115141 -194258 -148247
21407 -148247 -35981 -21681 21482 25226 -7359 -52693 -26774 25076 24406 -93398 -122697 -56275
21395 -56275 -41937 -130677 -240493 -229696 -173350 -251154 -167152 -157194 -179198 -62675 -19681
21384 -19681 -121543 -85161 -36047 -47351 -103862 -146816 -98961 282 17368 -6691 64095
21373 64095 48816 -27020 -117785 -47377 -83730 -22608 37707 16336 -17841 -21244 -94058 -212511
21361 -212511 -161037 -105088 -211840 -271623 -173412 -9408 -8132 -88561 -103726 2114 -12604
21350 -12604 -108044 -127805 -52186 6353 28032 119080 211683 153037 -120542 -78973 -20456
21339 -20456 -97212 -83523 -51509 -57568 -19448 31185 53546 17549 46602 140840 91194 -38027
21327 -38027 -87435 -89748 -14417 -109736 -191948 -36759 -19601 -83692 6098 89028 -42267
21316 -42267 -74438 -53077 -5502 29088 17108 69747 84020 13133 -39459 -176040 -124264
21305 -124264 -51233 -162996 -229843 -226904 -347727 -343085 -225491 -167888 -62973 7947 -31707
21294 -31707 -127603 -152324 -73831 -27102 -14241 101335 125215 185310 105480 186527 339227
21283 339227 238232 141372 4753 41780 1077 -14480 85872 70061 78789 185449 219080
21272 219080 250847 217705 157916 114955 186840 143932 112690 114025 147655 109841 31480 -73310
21260 -73310 -29886 2608 -75961 -134200 -199707 -187146 -74451 21015 126491 46310 -23503
21249 -23503 6652 52329 120787 50339 -2542 -9765 -10840 36989 67388 -3872 -25266 57244
21237 57244 129752 183896 153111 100293 15873 2748 50620 87124 24683 -5668 -50139 -17420
21225 -17420 -104407 -32944 144115 141977 124319 39979 19507 -9982 -21035 76519 107864 98847
21213 98847 -18220 -91773 -34192 82996 76292 5554 -157362 -157531 -72759 -19190 -86584 -212066
21201 -212066 -226826 -161082 -158439 -250331 -234584 -118100 -161965 -221657 -101947 21761 -26467
21190 -26467 -62606 18367 -61857 -143507 -45187 15902 46595 35195 -135075 -193899 -119754
21179 -119754 33363 -87264 -151811 -150387 -170130 -193604 -189805 -255630 -158296 -103546 -41158
21168 -41158 81616 224152 189096 56305 85375 70299 -73375 -40270 22100 9612 104628
21157 104628 173740 238574 204846 70213 37765 -35932 -2512 43234 -28511 20060 107886
21146 107886 61843 -2821 55808 117338 19992 -65584 45265 2691 -79402 -32109 -134264
21135 -134264 -154463 -63087 -67534 -68286 -44842 -44148 -113024 -124726 -120938 -158468 -110066 -108124 -318655
21122 -318655 -331322 -182172 -127207 -107885 -49208 -17327 -85551 -139252 -174688 -202079 -94381
21111 -94381 -46396 -29358 -102932 -13829 46427 -11823 -30726 -13372 -54780 -23723 25902 18196
21099 18196 97333 157617 154437 55674 32034 51538 -36321 -147583 -140890 -136432 -103184 2228
21087 2228 66960 -832 -2175 147176 187329 93918 56105 77053 71475 -26887 -33933 -65593
21075 -65593 -45694 76414 98983 66721 -66157 -9471 -31117 -36679 -50868 -25398 -157466
21064 -157466 -185665 -167299 -55831 12982 688 23608 -72261 -12792 -42868 -93713 -200081
21053 -200081 -272249 -266878 -146543 -21532 77994 97213 159877 180709 192512 154188 30287
21042 30287 5294 103698 124362 60149 46408 -12147 -32836 -115107 -21181 26254 -123315
21031 -123315 -192613 -83303 54682 15330 26816 -66113 -109471 -73653 -20505 59095 123576
21020 123576 214828 141327 113792 62525 89382 61744 -40723 -139171 -62626 -28119 -107042
21009 -107042 -238480 -229406 -44097 52463 46751 42291 47276 107547 154637 163183 146798 164180
20997 164180 124141 130382 83181 76630 -33238 -16623 -19591 113056 164157 18490 34673
20986 34673 153692 126060 84992 39702 96463 137920 114022 158977 202178 151273 139274
20975 139274 63346 -91287 -64938 9385 20318 -11756 -88246 -203383 -318742 -256727 -164532
20964 -164532 -93605 -117468 -146310 -129162 -145822 -45372 -3662 -38097 -79918 -45183 16142
20953 16142 -98369 -132308 -84726 -25491 37945 52548 146387 219796 212592 95802 7097
20942 7097 -123775 -121154 -126587 -42840 -21433 -99093 -181506 -87071 93372 115335 68774 24592
20930 24592 -57663 -22008 -129329 -133838 -132250 -76234 40446 153585 131788 -579 -43119
20919 -43119 -230625 -189805 -86597 -132944 -172968 -91185 26684 -3129 -110066 -136867 -165806
20908 -165806 -226522 -201707 -234347 -116091 -28837 -36944 -62596 -114052 -148809 -39849 17672
20897 17672 -13160 -11077 -5092 51523 147671 73685 -14566 32274 114950 130192 146106 165946
20885 165946 174465 59238 -4499 13405 105170 100637 37693 62895 63963 68402 -20066 -1739
20873 -1739 58478 -11500 -95469 -77668 -174842 -165399 -53617 15520 11798 -58028 -101110 -180280
20861 -180280 -61182 -94378 -156664 -76986 -15655 11864 41729 26532 6943 69584 100604
20850 100604 141005 30774 4660 -8007 -109404 -33068 86464 164939 29274 -99197
20840 -99197 -65780 3948 44521 -63607 -103084 -69489 56609 224876 170045 19546 -8997
20829 -8997 64141 122857 152604 86523 166788 268210 177909 -83367 -168889 -110623 -11508
20818 -11508 56020 107482 32777 -33968 -96438 -79400 -145235 -157879 -81978 3294 36097 28401
20806 28401 1043 56194 138613 193348 257416 39191 -38031 -42401 14108 -30881 -159267
20795 -159267 -52297 50542 26547 48063 27553 23295 11863 7998 -29131 -74988 -131011
20784 -131011 -188118 -36370 -89203 -130118 -79545 -1389 -34057 -6917 -84494 -70582 -103934
20773 -103934 -145976 -239118 -272146 -261022 -212496 -165120 -237569 -313146 -285974 -276440 -186352 -119029
20761 -119029 -45795 38836 33020 -63797 -144919 -202982 -226749 -307716 -266074 -151698 75797
20750 75797 69360 29883 52188 24161 85731 13490 4601 -14694 -141816 -244135 -301330 -303798
20738 -303798 -308762 -266402 -180007 -158753 -189022 -265861 -421230 -298739 -89936 82224 44763
20727 44763 26997 32341 25508 -25921 -88456 -77393 -3112 -7435 -163128 -255408 -135800 -48578
20715 -48578 1379 6305 14810 57759 1989 -97795 -169239 -101979 -157185 -182755 -113611 -27706
20703 -27706 -18442 -6248 149288 128591 122993 139483 150331 210079 235357 76643 -132536
20692 -132536 -186794 -106557 -77164 -99695 -74139 -45445 -63396 -84032 -139161 -135074 -113147 -146986
20680 -146986 -137255 -123143 -98137 -42060 -79804 -37814 21393 117375 109602 40997 -1821 75089
20668 75089 55884 -9213 -53206 -111105 -88533 -40343 -1748 13502 65902 32868 56230 17243
20656 17243 28205 -87177 -30985 35397 -26031 -6825 -74480 -29640 -5195 -63302 -64498 -98547
20644 -98547 -61545 38065 51853 -61079 -53111 20642 153294 127929 87726 -1368 -10943 -10563
20632 -10563 -14107 13295 100340 39625 -27355 -14839 99529 11457 10174 117209 148327 86200
20620 86200 125290 62220 125489 114427 -26270 -51222 8940 61992 76320 86211 87351 26834
20608 26834 -31051 -17591 35595 17254 -76493 -106525 10179 -26547 -89297 -59103 -35741
20597 -35741 -9209 -16173 -62110 -94042 -94557 -185734 -178957 -49830 6136 15912 53947 90680
20585 90680 -49402 -168785 -133966 -32156 -133010 -154474 -109285 -108859 -94255 -42447 117034
20574 117034 81304 18114 -54474 -102957 -80387 -55113 -41868 -68864 -65014 -10039 -62505 -6777
20562 -6777 35823 -115259 -119158 -119045 -226418 -182795 -156512 -192189 -193965 -228847 -220617 -171893
20550 -171893 -78322 -26873 -8211 -36006 -138461 -82626 -83743 -141665 -172583 -76042 -42541
20539 -42541 56316 -5403 -108748 19148 15087 -31224 34302 -35074 -205569 -261870 -178364
20528 -178364 -120439 -61580 -69360 -111177 -161031 -150932 -132607 -124743 -43969 7101 14440 -57953
20516 -57953 -143494 -131253 -162661 -112408 -154912 -225641 -333081 -214597 52233 40483 11833
20505 11833 -10324 -30963 -87986 -167780 -114959 -29098 12036 41157 5315 5172 55527 143445
20493 143445 172043 208863 207530 317776 537543 621906 753553 862462 775272 778130 879485
20482 879485 926837 806147 751054 731508 591893 370057 264776 203379 61408 32909
20472 32909 120969 255065 278521 219334 223761 296606 314358 290629 379685 460862 441904 514442
20460 514442 562114 635679 689639 676294 813725 869028 858324 870760 865712 799239 709167
20449 709167 694039 564132 451208 375268 299698 241208 230155 302101 292061 179739 126767
20438 126767 194381 289178 272289 247611 241483 293353 164112 82525 -28870 -44814 41757
20427 41757 38612 31562 -20579 -59134 -187691 -153808 -83814 -3214 -32525 -84907 38826 87940
20415 87940 39919 25629 -124921 -161698 -91662 -117316 -124393 -81890 -195362 -300376 -341927
20404 -341927 -105467 -91798 -103833 6327 -12346 -115110 -180632 -230180 -160538 -13452 -24996
20393 -24996 -23232 31172 158899 183202 92157 51132 101244 188189 200833 211213 143154 8980
20381 8980 -121029 -154154 -137308 -69752 -14484 64886 63744 61194 103439 30500 69362 166371
20369 166371 180380 82115 99238 65741 119170 60662 31967 9643 -5404 -82149 -18377
20358 -18377 -121688 -176703 -197796 -110616 -67146 -50074 -45404 -74300 -119730 2936 3297 67379
20346 67379 3396 -22184 -72589 -25493 -39762 -62033 -206687 -189301 -100169 -1282 -94958
20335 -94958 -96294 -67500 -65592 -108331 -163979 -162275 -151423 -94171 27768 96067 77329 70352
20323 70352 46790 -32701 -31796 -69310 -122874 -57155 13204 -50649 -105875 -116644 -16823 -21686
20311 -21686 -13546 -77024 -30819 8257 27687 65737 30916 -115653 -263371 -274014 -86287
20300 -86287 22744 -4901 -33087 10637 74725 7529 24490 95388 82855 36874 473
20289 473 45150 21945 38052 35361 -47938 -150799 -73157 -107337 -103256 -37866 -102259 -202929
20277 -202929 -172594 -175951 -206666 -164396 -100932 -120136 -218931 -180412 -127235 -227337 -119621
20266 -119621 110310 152829 98463 -120 -1241 44009 -12090 -69757 18948 103765 10647
20255 10647 -82614 20271 116591 167425 148167 230863 304871 282658 266886 228856 261472
20244 261472 159297 7688 -154948 -149778 -149459 -46803 67195 124261 55114 66789 126525
20233 126525 19799 -59618 -40066 -40857 -23581 -81325 -19726 129353 109249 117750 83097 35852
20221 35852 117040 312029 271360 218599 235783 85064 67025 40016 22447 132753 137680
20210 137680 178099 183187 65570 -31567 -77442 -82304 -68676 119568 314591 292193 145939
20199 145939 -13263 18573 54627 88115 156947 110233 180270 210704 178714 85137 15461
20188 15461 -28640 -102866 -30878 -58371 -41880 30994 -34200 -12167 70450 54729 124285 134989
20176 134989 71121 32844 -40430 103104 159542 82931 110919 136008 27686 11584 70394
20165 70394 18912 36555 1596 44661 44216 -3392 -60242 3841 39946 13636 56545 67496
20153 67496 49869 36484 128953 99214 119385 254632 321640 417481 276016 182245 127002
20142 127002 84165 68002 11051 119378 242444 195998 129321 110055 138087 -4079 -38280
20131 -38280 -2897 12719 -15670 -54186 -33346 55011 140884 169567 152048 120497 36097 -13679
20119 -13679 1814 -99324 -112818 61032 268442 202530 192775 208188 99780 69817 -3058
20108 -3058 -5808 -70658 -38741 159242 254043 215591 160347 207839 187733 294737 264827 135610
20096 135610 146298 131390 131102 178465 95559 -17837 -167478 -151090 -109781 -174538 -133371
20085 -133371 -107669 -170624 -157833 -122942 20037 103012 76935 49246 131488 187294 94989
20074 94989 136340 144270 182165 223989 245428 153384 58898 -26485 -14312 14589 59933 150534
20062 150534 58981 -3265 129808 246425 300371 191725 229157 230758 211203 252187 227990
20051 227990 189927 73180 392 39786 65447 85293 77323 76026 147298 209293 288458 386787
20039 386787 475243 533581 533525 411350 251477 218848 201019 146445 231039 452786 512207
20028 512207 478280 418919 380035 338941 352284 318047 400267 476552 467164 587197 531367
20017 531367 418861 387778 354444 439701 469139 450714 513067 599902 654557 590847 580467
20006 580467 512057 499812 449368 449478 553275 636483 547660 440499 422380 385763 327515
19995 327515 312106 362131 429014 489529 619490 806721 792501 691337 563011 466727 498331
19984 498331 553592 610626 714260 828212 898392 837283 828979 749768 726481 831250 887330
19973 887330 953082 978757 970847 862114 957087 1043242 1159950 1366091 1676631 1951997 2188755
19962 2188755 2280749 2352675 2291081 2407396 2599515 2707613 2848935 2960830 3122195 3290294
19952 3290294 3452927 3438771 3580693 3953680 4345480 4603008 4809362 5037154 5299707 5612281
19942 5612281 5964891 6465633 6942633 7753924 8897993 10267380 12299637 15105804 19008320
19933 19008320 24708183 32697506 43480172 57925570 77310243 100733188 122310914
19926 122310914 136530388 142583949 140134871 134834464 134251880 139355130 144432823 143960788
19918 143960788 136005598 120357520 101483166 84421808 70888310 60636828 53001032
19911 53001032 47323449 43147299 39894502 37541773 36071354 35522299 35578890 36297290 38046930
19902 38046930 41596911 47819603 58221079 73952558 94695866 115885129 131475491
19895 131475491 140021266 141183779 138432351 139684487 148062046 158019665 162003392 157712199
19887 157712199 144019187 123648901 103280120 86385539 72791222 61799193 53155927
19880 53155927 46373211 40982449 36783816 33424754 30634088 28295870 25990632 23707342
19872 23707342 21593067 19798094 18177030 16685618 15308044 13972681 12890766 11885902
19864 11885902 10916192 10087511 9326583 8691365 7994604 7462704 7018426 6682739 6345376
19855 6345376 5920347 5549358 5265791 5013326 4745499 4405088 4014971 3758798 3410843
19846 3410843 3069151 2800162 2577545 2421266 2251153 2106625 1903895 1757999 1657526
19837 1657526 1520836 1315640 1150272 1074181 1078595 1006032 870394 756685 672757 763018
19827 763018 732939 764827 686684 696867 646682 615345 616712 631850 626263 612353 590409 509566
19815 509566 512026 534619 601585 560528 605645 634776 522062 478824 520272 425645 428614 534811
19803 534811 587338 523775 484399 551303 551862 595590 635835 609238 529133 434948 447578 436758
19791 436758 456249 400238 406733 418028 488906 488299 505402 460225 319518 359046 443226 357660
19779 357660 394734 543699 580129 573379 478945 425973 519396 526725 395346 421512 463485
19768 463485 350077 350411 396381 379763 386295 278832 186706 103350 -18160 119814 223149
19757 223149 151083 125156 132580 169670 147172 152334 163390 248507 266335 297371 246077 160610
19745 160610 164088 91092 170297 334837 447615 363738 171981 173816 130130 112866 204926
19734 204926 154718 167224 256813 328150 339588 285142 257880 231092 94196 38956 43534
19723 43534 106364 187512 286883 394700 506637 521198 426956 352634 292174 113286 109482
19712 109482 175102 168547 79440 -20437 -82430 -147871 -163434 -79322 50766 61957 33885
19701 33885 -61582 -41725 72855 85976 140351 212375 186033 99550 187571 103883 -7034
19690 -7034 -91067 -56222 12830 52453 6971 -12932 -44637 75796 222195 85473 -73251
19679 -73251 -117136 -133218 -107059 -40479 110988 270623 133418 -25301 -58824 27018 220942
19668 220942 289627 211991 89022 42230 159636 199474 191244 111026 46999 80365 125677
19657 125677 54315 -70486 -171729 -134319 -108474 -32307 -22543 -91148 -84103 -67650 -19764
19646 -19764 81189 60780 59229 183502 204529 58515 48156 -22068 -105143 24530 135773
19635 135773 149659 49559 -124850 -129109 -120204 -74831 30049 84325 4778 -55465 -40775
19624 -40775 107353 212475 150539 147777 78123 109451 181788 98002 71075 34995 36716 44954
19612 44954 108615 156291 230442 118111 13731 -12591 -26076 20685 33498 -32127 117839
19601 117839 288000 215570 109781 138929 152424 170665 221309 162270 122448 180865 94490
19590 94490 -29308 -13692 104717 72523 207 97972 49064 79103 -4266 -79857 -39539
19579 -39539 -71436 -178252 -144935 -58247 -10534 38301 -62851 -65216 6366 1942 -70523 -67899
19567 -67899 -123324 -69062 -49157 -10762 -10735 26022 67980 31042 63578 144912 30786 -127237
19555 -127237 -127775 -150652 -136694 23960 -19856 -96580 -81634 -10737 77965 117449 41039 3739
19543 3739 -56857 -62484 38704 69820 64938 -53392 -98716 6341 29972 -29124 -89913 -92379
19531 -92379 36472 106068 -5973 21365 104128 8925 62096 28883 -56823 -82582 -86814
19520 -86814 -34649 18655 21741 45411 56721 141763 140111 87832 43368 -12905 60127 96921
19508 96921 103075 265648 359132 323823 275338 291216 237354 118439 98540 200205 171838
19497 171838 143725 24918 -90988 -64666 -73092 -71089 -123835 -183019 -136264 -159350 -114231
19486 -114231 -143944 -129826 3140 -33073 20938 81572 73196 37873 91059 68912 -51381
19475 -51381 -121585 -151896 -122393 -92698 21287 66196 32231 32841 29962 48506 112649 133585
19463 133585 62945 120933 34515 -42076 -72249 6436 132680 70334 57677 -7759 -98738
19452 -98738 -133889 -133243 -22103 31512 -25218 8053 71869 121211 68317 103247 195678 184552
19440 184552 144883 163506 217754 230453 186954 128710 120689 12594 23940 91511 42199
19429 42199 75324 44430 23611 112469 89668 -55955 -119487 -107554 -133866 -184854 -75964
19418 -75964 -20305 -9632 -19497 -120813 -135156 -181741 -125879 -94463 -112981 -69811 61140
19407 61140 138602 101162 85753 25737 -39573 66152 92784 -16631 -77257 -33775 -49268
19396 -49268 3650 47957 119020 205767 182012 121271 106664 186863 95956 1833 81731 155392
19384 155392 59471 83294 82591 97659 44646 21253 101710 96109 -3937 14858 87932 87094
19372 87094 107450 212788 163230 156722 84794 70806 187827 202787 93534 70319 96893
19361 96893 176560 310271 533210 720628 931534 992213 984825 959403 881376 829660 652900
19350 652900 471543 415236 420609 628281 532756 534087 537664 530637 460508 335665 423240 430092
19338 430092 438804 318951 226495 180977 170409 207301 276545 379762 420911 413371 506609
19327 506609 517082 472065 543477 597554 606362 803935 936155 987028 1009832 835229 739239
19316 739239 676734 548908 403823 227832 173942 77769 65764 122171 225287 202300 198272
19305 198272 191857 160890 195013 158690 231112 149111 162424 191642 210956 159038 241144 284982
19293 284982 310854 225893 209146 122105 119461 63904 -30221 -41655 -31867 -40425 -12033 -22494
19281 -22494 -58465 -61529 -38997 -77766 63558 41389 -69740 -95580 -50575 -26805 8718
19270 8718 137038 165662 136092 70713 88578 -40977 -107538 -78763 -7312 -6957 -138347 -164060
19258 -164060 -204579 -164575 -72752 -12131 -28930 15603 58987 26652 -62314 -206136 -186899
19247 -186899 40938 184263 156466 140996 213596 242324 251681 137151 8174 -145333 -32957
19236 -32957 81453 37794 -13530 -7288 172889 156796 112997 139647 166739 246199 183894
19225 183894 99753 -57458 -128213 -45990 -84816 -39975 -55004 -97006 -148381 -188735 -134928
19214 -134928 -29774 -43264 37200 41232 -14606 -84573 -73441 -158450 -266719 -161558 -84627
19203 -84627 -136297 -159003 -163047 -176640 -123647 -115772 -130528 -52786 -55110 -68437 -21274 -131229
19191 -131229 -147416 -109746 -142775 -159357 -297610 -277131 -164333 -128072 -53692 -48042 -110638
19180 -110638 -136668 -64874 -57549 -76748 -182886 -186670 -83862 5168 -76839 -47772 24493
19169 24493 78880 -40435 -42599 85289 33226 -125843 -173844 -132112 -88559 6454 99905
19158 99905 104385 109595 160025 232751 151343 86254 101820 130586 32639 -35031 20532 60816
19146 60816 136681 114621 -5730 -78953 -136560 -109340 -34088 -43033 -54879 -57642 -120915 79974
19134 79974 147654 82386 67124 14113 -4475 14634 37664 -27897 -172345 -153365 -6394
19123 -6394 69433 -21369 -32376 2509 -6056 -19266 6719 -122794 -188888 -29913 43903 14303
19111 14303 14867 -28655 -132835 -100659 6652 -47082 -119055 -119964 -58439 13517 177959 257512
19099 257512 226042 228732 180179 73244 -24096 -167931 -259789 -261563 -128469 -21648 -43225
19088 -43225 -83165 -27702 13541 -56860 -63734 -60530 -144994 -183886 -161788 -16687 42817 159075
19076 159075 173513 183371 307183 265403 202380 147242 54714 -30195 -61489 -20951 -102205
19065 -102205 -22871 101517 117765 -3968 44611 43078 -81060 -81944 17567 -55386 -77904
19054 -77904 -88270 -53162 -78820 -47742 35477 41002 68734 -3421 -76578 -8771 -53334 -169851
19042 -169851 -99956 -188983 -242175 -205963 -133556 2604 126290 146715 -7496 -50460 25712
19031 25712 24223 9029 79452 94911 -17128 -98297 -57933 -69234 16692 89589 53320 25770
19019 25770 42913 97736 79078 20436 -109896 -29369 84710 98190 -15007 -76382 -14553
19008 -14553 128848 63866 2920 86119 116868 17871 22413 85420 136456 308662 267171
18997 267171 183042 176965 161940 133416 72758 76387 41654 22587 61840 187095 288523
18986 288523 201904 124758 -41664 -34172 -48824 -139989 -212090 -215900 -328253 -314855 -160324
18975 -160324 -131797 -109328 40903 143034 189469 94758 25328 122024 201654 89161 70055
18964 70055 12735 8710 -68613 -179397 -53197 -1688 -14043 -28432 27808 13672 -3377
18953 -3377 2493 -25243 90668 143043 147162 -6803 -52481 10540 38687 69649 129562 153730
18941 153730 -8147 -51820 -57312 16754 90598 3193 78172 93438 63953 -40492 -140288
18930 -140288 -170504 -136811 -172706 -113424 -39 53786 -7889 -41428 -29295 -5638 -40689
18919 -40689 -43396 -40654 47361 4064 -56119 -53690 -43364 -10532 -31476 -61656 -98787 -151838
18907 -151838 -69443 -47016 -2063 25696 57705 103266 86199 -52240 -16772 4988 -17952
18896 -17952 -106895 -147703 -92316 -88444 -171839 -163602 -74947 -115922 14074 96096 14403 -13184
18884 -13184 64920 80420 10794 -146551 -181411 -201717 -114758 -74232 -43192 7697 -21096
18873 -21096 8973 -36392 33598 38848 -58407 -14384 -47954 -96684 -128022 -187763 -175497 -145311
18861 -145311 -20032 38952 -62506 -108540 -114949 -123866 -117924 -11495 -104755 -124589 -92175
18850 -92175 38516 144060 103725 -51814 -83331 -2779 21332 -1246 -55648 -35067 8076
18839 8076 31366 -75101 -103064 -51948 -106696 -135984 -150261 -311161 -240680 35659 117945
18828 117945 52204 -124972 -111100 -92411 -29365 -59732 -154125 -70361 -14702 46516 63331
18817 63331 55274 85234 61917 -95241 -86450 -125453 -76887 -7326 95709 194782 59942
18806 59942 570 149541 181638 25592 -100259 -59668 -72654 -68475 -36501 -124198 -121832
18795 -121832 -41597 75396 62063 -26827 -98621 -23503 -88952 -14952 18678 -95153 -49726
18784 -49726 -13771 22471 75897 106759 47491 13635 9598 38797 -53789 -67364 -46136 58341
18772 58341 -4286 -70796 -19747 -81019 7633 201721 389345 728247 1099065 1191571 1058339
18761 1058339 757413 535723 327363 250020 92014 111569 25362 -133465 -167393 -207025
18751 -207025 -214308 -87891 21755 -10938 -135081 -152965 -142053 -75875 23890 69761 17146
18740 17146 -37423 73141 127838 74606 -6772 19925 31452 -14719 67851 38791 -19975
18729 -19975 -3729 113840 150145 188536 120718 64935 111984 217302 145851 27157 -113551
18718 -113551 -107718 -1430 -46001 21814 71324 32546 15818 -14006 64286 76972 71871 55044
18706 55044 52055 -15616 -33635 -59512 -147548 -193831 -142919 17286 63819 53740 -35518 -135066
18694 -135066 -106267 -29294 63050 40627 14101 -45244 -59980 -117064 -30086 -13960 -106048
18683 -106048 -246255 -280637 -293680 -297195 -234617 -311534 -273285 -189712 -68852 -134871 -173866
18672 -173866 -125694 -60373 30054 73929 67298 4075 -28829 -61819 -202673 -276500 -259110
18661 -259110 -189511 -188057 -74652 115949 29261 -75489 -59756 -48064 -56896 -109937 -40931
18650 -40931 -148930 -189589 -198286 -212932 -144674 -139639 -89347 -212885 -259752 -113035 -3649
18639 -3649 87558 93594 177139 77936 55016 125214 59401 -196 -124576 -200183 -175757 -270096
18627 -270096 -335651 -260537 -133155 -139999 -138869 -51098 -157760 -155520 -29850 13981 105449
18616 105449 68614 104460 47995 9410 6926 56225 81325 12053 53300 -19162 -17654 -24375
18604 -24375 53063 15520 -63410 -137292 -50240 -19749 -41499 -55158 83257 713 -170976
18593 -170976 -254757 -275458 -238591 -215728 -178229 -66273 -110881 -40213 -99446 -82375 -51357
18582 -51357 -59887 -92802 -98840 -51163 -93875 5106 62399 105808 71464 -107215 -15829 -62084
18570 -62084 -140440 -164435 -180701 -200358 -39592 -10364 24426 103376 128552 51914 -46489
18559 -46489 4366 150035 192562 144138 183780 187302 226797 167470 -1620 -115288 -44910
18548 -44910 -122770 2079 56724 22787 198643 230178 75510 38267 63035 98764 133684
18537 133684 25104 -85083 -82334 -93217 -163154 -204117 -207020 -215683 -184368 -72000 -48207
18526 -48207 36497 58512 -58973 -9784 -29578 -128977 -184511 -131883 -109371 -102106 -149246 -172692
18514 -172692 -242530 -256417 -301107 -384278 -379839 -290181 -209619 -144807 -147093 -71877 -62914 22552
18502 22552 110746 122837 -42501 -107813 -151665 -192838 -150748 -160283 -126077 -213903 -295305 -220677
18490 -220677 -61296 -120769 -39007 27916 130273 71478 10885 -151530 -136558 -83211 -138837
18479 -138837 -103738 -40512 52371 696 65672 86522 -22520 74134 134940 51415 122380
18468 122380 6372 -39805 -41439 -73097 -84479 -74490 -26204 1616 118875 75227 -1174
18457 -1174 -121924 -285676 -291401 -198091 -50823 -32636 -2605 -20802 16642 23774 75140 62000
18445 62000 -14182 -44179 -41501 27765 81269 54138 -60282 -69538 15338 -89421 -152091 -125483
18433 -125483 -91469 -50646 -2239 34899 -115173 -182522 -117805 -95704 -48119 36322 110574
18422 110574 -37734 -2007 52553 -14137 -133326 -152779 -156181 -100445 -15864 -7083 117230
18411 117230 126170 191633 238467 181831 148146 41377 -59053 -97549 -83334 -135961 -118415
18400 -118415 -57372 -186777 -211015 -120108 -79344 -41600 -39486 20790 140836 193267 114322
18389 114322 -25083 -177298 -182734 -82865 120 56076 40406 62041 32263 -39148 -37049
18378 -37049 -53557 -42956 -15185 -93188 -159461 -171840 -97982 -17792 -110500 -194115 -167987 -152745
18366 -152745 -66924 67175 45341 56701 145247 126884 76650 95986 160717 197526 136665
18355 136665 231491 279525 238281 220820 164425 188807 241555 216082 119151 122131 168758 77230
18343 77230 16068 36600 -30931 -119092 31200 16627 -84185 -23674 68859 3098 -45200
18332 -45200 -145381 -260452 -151474 -13645 17316 -35055 -10487 -12723 56003 63700 -94759
18321 -94759 -183376 -69096 -121036 -53366 2291 138781 159790 161186 276194 268539 220000
18310 220000 151647 146675 129595 172207 121635 108662 -43676 -106273 -188410 -142550 -74326
18299 -74326 -50699 -143442 -123088 23320 138891 250456 439720 646599 873545 1005007
18289 1005007 984694 863326 709914 691663 779306 813701 821272 876209 917106 690638 551787
18278 551787 484177 440642 346600 384780 487099 421908 311730 387128 292829 225376 277116
18267 277116 296528 265598 239465 218956 289329 387358 541428 726623 803417 901239 896065
18256 896065 850116 804106 781240 742448 789541 948157 1032613 1095913 983153 804371 755693
18245 755693 740063 848725 1006546 1201055 1234004 1151911 1189753 1433771 1574462 1776863
18235 1776863 1874379 1964223 1927209 1825017 1759676 1596215 1530884 1425894 1175838 977427
18225 977427 825797 558721 655442 699250 604705 448453 345641 368529 501951 522578
18215 522578 452213 411592 366982 283645 168877 96415 140249 121382 158731 192259 317899
18204 317899 317693 256168 234259 160805 142620 88945 62916 116773 184337 31111 -18699 60335
18192 60335 108456 218735 206532 110297 127321 204445 69013 -1198 -11818 52838 173213
18181 173213 224166 207983 226795 101417 58656 125007 199942 181581 178871 155049 191190
18170 191190 162638 127189 166017 170917 158011 170222 199037 147720 157739 115008 201009 257734
18158 257734 395410 441730 384405 282477 158081 113062 231356 338126 326798 312640
18148 312640 311001 339953 246611 203010 231389 250767 292253 436056 427239 311598 342523
18137 342523 530513 726390 825813 769720 898071 935145 786534 830780 835650 835603 948448
18126 948448 1127825 1378018 1731482 2056972 2246309 2370944 2608782 3133152 3714008 4440514
18116 4440514 5314314 6500682 8312814 10976404 14883227 20950663 30871417 47158538
18108 47158538 74384271 119167244 175963591 201713732 172734316 130017306 96662347
18101 96662347 72401585 55113336 43360097 35317121 29815771 25990829 23419480 21806045
18093 21806045 20789851 20040173 19321961 18034055 16117938 14272210 12512928 10997134
18085 10997134 9749007 8714685 7938304 7171956 6483259 5820507 5289781 4688523 4184692
18076 4184692 3816906 3567802 3393588 3035095 2719448 2491871 2302150 2170729 2016473
18067 2016473 1885590 1740153 1634364 1515974 1455030 1338782 1290077 1230281 1177926 1024465
18057 1024465 1012139 1002413 958016 851414 779056 778620 703080 565169 481199 461230 565765
18046 565765 529215 514582 488325 458177 357622 221287 155411 211946 273745 308543 297710
18035 297710 230391 148685 147228 215633 266523 169378 33609 49441 -54942 78455 196263
18024 196263 111910 82604 155152 166645 101234 53397 171938 280287 222492 136075 57450
18013 57450 123550 220821 218499 205595 140665 76541 31800 -31802 -49665 -56856 -2483 39287
18001 39287 -13633 21199 104563 151892 229667 322075 268650 240262 297354 338109 418890 373587
17989 373587 246829 306499 437723 625272 728683 800310 809112 881062 908113 973571 844376
17978 844376 660806 563879 491414 497324 593581 629769 516309 424119 353217 389256 374767
17967 374767 366366 351787 267747 163777 155291 143006 201381 285634 207429 246054 381026
17956 381026 254210 212931 261884 237652 272267 254735 200598 298352 332134 446679 560639
17945 560639 479535 481017 551186 447231 247704 153785 117759 67366 36847 156887 152373
17934 152373 65113 100795 187179 131970 72080 83843 181695 214018 223890 257410 261476 141339
17922 141339 84178 113405 236371 213274 176826 173792 243359 276227 353446 341268 263869
17911 263869 275434 296511 370289 438529 423783 419060 453196 384427 298838 285678 263457 223408
17899 223408 91314 80290 204233 353085 298713 312450 255674 120663 122489 60575 22328
17888 22328 5498 58123 56743 163031 265254 200952 106196 162786 169401 251666 377277
17877 377277 402580 377504 383471 295368 271722 355495 292043 168014 249424 330432 481058
17866 481058 557047 643670 622251 556075 531081 529245 581973 713424 807251 761585 750007
17855 750007 819259 803952 730151 815839 906683 1003392 1069808 1048178 914795 836148 922833
17844 922833 777931 589043 664520 699080 710336 852170 928509 890163 840681 816905 953966
17833 953966 937927 923468 904907 988901 993189 889099 889844 999536 1115954 1089291 1044197
17822 1044197 1093966 1170076 1228614 1200482 1121992 1189695 1289634 1375932 1363930 1463231 1413649
17811 1413649 1379200 1375703 1398346 1456755 1347118 1293132 1340747 1404235 1512638 1622769 1625157
17800 1625157 1769157 1831514 1893776 1874898 1938102 1956186 2109704 2298474 2411423 2536966
17790 2536966 2593577 2776587 2791437 2972629 3205521 3416062 3733273 4332182 4837694 5249827
17780 5249827 5644915 6220877 6800731 7622326 8747637 10124485 11931982 14101704 17199195
17771 17199195 21629519 28394723 39028634 55322434 77990780 103173756 121143899
17764 121143899 125149166 119580529 114220377 116456405 130145991 154421600 181028780
17757 181028780 193897097 183237654 156629082 127568151 103214598 84814454 72041016
17750 72041016 63032328 56568286 52149962 49317409 47659070 47229945 47765868 48953311
17742 48953311 50452393 52071877 54745364 59766528 68464893 82515632 102435644 127638681
17734 127638681 157939174 195720262 241066052 287392317 328947342 371474552 422777568
17727 422777568 476073704 516623525 537763383 534378142 497968444 433231719 359966245
17720 359966245 295788832 247349963 214081391 191799862 174533746 157641589 140748949
17713 140748949 125586290 112823233 102195593 92736265 84178682 76182818 68644139
17706 68644139 61612394 55121737 49413345 44597934 40324833 36473345 33063279 29973129
17698 29973129 27289093 24763136 22475769 20483949 18789058 17216640 15708753 14483632
17690 14483632 13376912 12322765 11177960 10160669 9498147 8925142 8248975 7527146 6989706
17681 6989706 6470768 6105539 5732356 5235074 4621898 4111671 3756515 3539589 3213045
17672 3213045 2920334 2786283 2615599 2432629 2252738 2055176 1978630 1938748 1874068 1874272
17662 1874272 1810219 1771905 1706675 1612806 1513176 1432576 1334174 1220596 1171762 1200219 1303015
17651 1303015 1335527 1300434 1292276 1295710 1263950 1363123 1292180 1132864 1151353 1108147 1096897
17640 1096897 1095629 994985 855713 738087 773292 759191 794152 800706 837378 809583 825132
17629 825132 727750 566821 618297 686536 686618 912332 1007080 1049246 940389 885500 773008
17618 773008 603885 604956 607166 715943 634794 542780 589399 676923 718019 769491 723205
17607 723205 736459 853991 816252 813248 805781 846864 843727 744992 584299 582038 576501 549193
17595 549193 511880 675393 750039 596006 546511 489858 513449 454047 326568 405897 435983
17584 435983 383938 285952 250689 157313 81064 70446 162261 337852 441552 395718 352016
17573 352016 384003 469201 360161 287489 330775 355329 366190 479766 628796 660973 613030
17562 613030 567087 508679 502421 469447 410540 420597 531969 495073 346967 255668 207962
17551 207962 192220 231137 216261 180236 144955 271733 341079 213557 115808 98498 137558
17540 137558 180735 94923 -13367 -59213 -13310 75754 141904 206965 226831 124639 103881
17529 103881 91427 91782 82880 147198 78834 171139 330001 383366 446834 345325 359019 359658
17517 359658 297108 316127 265706 240734 324594 320974 329079 314544 438314 529241 442476 415745
17505 415745 379275 370365 454236 463956 348138 217777 214815 243945 252573 124682 80513 222405
17493 222405 342055 354591 322991 163262 157517 132110 198548 225529 197278 199330 247119
17482 247119 259391 119185 218492 230930 308170 265172 217451 156447 221094 273760 302689
17471 302689 264534 207084 245908 162212 39662 91636 229739 182480 153895 226627 200997
17460 200997 195551 210393 104897 152927 340274 273820 102418 87149 269477 231875 194173
17449 194173 303324 394247 437094 459610 480523 547885 529597 659760 909421 1156377 1229206
17438 1229206 1232622 1078158 789233 521962 416131 386963 386513 304854 179857 132462 42025
17427 42025 141505 262616 246435 59217 74831 125638 251281 319523 301827 238583 183848
17416 183848 -37364 -142984 56936 260170 350111 447256 352854 287775 175925 137282
17406 137282 99321 105273 255976 351802 338549 296565 322409 304282 239288 125773 71611
17395 71611 131621 192271 152507 109730 100666 41696 38064 114059 191990 283677 152186 183964
17383 183964 267545 219665 177401 182465 79361 58129 99029 95667 21232 29457 121192 179119
17371 179119 216273 147987 155782 80044 58451 69815 195465 215735 157778 93211 104858
17360 104858 23612 -29005 -97914 30347 118893 25691 -35890 -15358 88816 -66296 -106026
17349 -106026 4998 79444 47456 99217 112077 116167 209096 207124 229872 126891 71038
17338 71038 69119 133324 100984 44629 72787 174260 248871 196394 197264 249393 200302 78959
17326 78959 14296 82221 150718 178457 131415 25624 -80820 -56010 60102 99979 29232
17315 29232 -2769 -24633 -32261 68138 119310 82895 79810 36107 12242 35891 74006 109730
17303 109730 119557 170432 174731 155056 72408 -3175 58967 124982 183714 192487 131456 130593
17291 130593 93133 84874 77458 111809 75859 47352 33070 77321 -85836 -161490 -209741 -146217
17279 -146217 -144266 -81421 89635 145827 163832 133287 96327 45085 -53373 -53522 78680 119079
17267 119079 196042 244720 276770 284620 160815 49942 -40888 -100300 -174825 -197360 -39692
17256 -39692 143959 110414 -30711 -84352 -5710 50902 -91916 -137395 -157956 -114585 -45906
17245 -45906 -18851 9871 44820 93261 218744 204561 182454 218061 302536 372854 509415
17234 509415 690843 850144 839538 791860 741694 730976 807149 963754 967029 904980 821264
17223 821264 708890 620606 624426 714711 732090 772363 903347 1051361 1090529 1173287 1156346
17212 1156346 1233482 1311725 1497623 1743312 1838733 1889628 1763094 1737044 1698310 1762738 1836707
17201 1836707 1836405 1736488 1591566 1446843 1323686 1254585 1167435 1237948 1407639 1297560 954868
17190 954868 749243 600107 401408 327734 181605 174878 174295 138450 20423 7353 118107
17179 118107 258554 213958 302617 312028 213543 242410 272819 216273 176679 89539 143118
17168 143118 81141 38298 164519 294666 283807 294837 269440 237603 303989 330836 239798
17157 239798 224733 134543 54498 23260 4747 1270 -57721 -108821 -250852 -236678 -8608
17146 -8608 -79629 -116357 -133736 -163929 -96126 -32681 -107097 -199651 -210321 -56077 16970 -46319
17134 -46319 -12377 -90424 -167694 -134330 -45652 28793 81335 10073 -106585 -119228 26205
17123 26205 7203 65726 85707 42719 125538 160815 143067 117275 142058 156287 -878
17112 -878 -33469 85276 142143 1787 23285 164313 85108 86764 -22849 39372 12408
17101 12408 -124477 -233959 -68963 41607 8637 27694 210091 184697 94773 63335 66966
17090 66966 85469 100297 73515 -41435 -58330 -46704 -6248 71647 105083 -38660 31271
17079 31271 69044 58845 -19897 -73114 88171 126108 249568 284056 183617 107979 72200
17068 72200 23031 41436 156156 201436 180654 147262 183805 30725 -176215 -161059 -75883
17057 -75883 37231 30275 -85839 -35928 -18106 412 13822 -49449 -89799 -90550 -20644 186639
17045 186639 192797 125281 105977 -656 -57530 50505 100957 68307 126401 271289 252585
17034 252585 156888 111108 127807 75209 52655 46786 34273 60262 64827 -107225 -120633 -51486
17022 -51486 36957 42878 118970 987 -4718 26560 16440 -47944 -50929 -98720 -141481 -174057
17010 -174057 -271960 -200458 -115221 -10388 32944 32433 93612 65975 61083 121231 117934 62299
16998 62299 -9997 8835 20679 2525 29656 86156 104291 34553 -36728 -82308 -113379 -103878
16986 -103878 -88714 -61915 102330 142323 154006 11049 -60745 71549 143011 105832 33238
16975 33238 -28647 -53645 -21427 438 -16722 9460 -4049 52345 178687 39230 3473
16964 3473 -4855 94025 120513 88404 52567 33390 -65355 -136595 -178361 -98126 -180391 -275864
16952 -275864 -236980 -185330 -92864 -153454 -214914 -161143 -89714 -66772 -47004 -139007 -82989
16941 -82989 44655 180571 142603 -32209 9461 50688 28950 1379 115461 80110 68052
16930 68052 55068 86710 84378 86089 15489 10045 -86409 -110231 -115697 -109243 -153143 -269413
16918 -269413 -211116 -66195 -52494 -32353 1941 71917 74928 107881 18990 -46646 -6316
16907 -6316 -23330 -65724 29583 18679 -56189 39302 44467 -12464 -48921 -9663 33795 176089
16895 176089 234864 327675 342506 262651 263817 212937 56453 1010 106940 165453 196130
16884 196130 147409 104697 11881 -45036 -121409 -140733 -228482 -180548 -235417 -252317 -98203
16873 -98203 -53626 -109683 -7183 33033 -25098 -25607 -66857 -59225 -97572 -64219 -63193 -61348
16861 -61348 -98339 -149786 -97379 -42515 -111402 -60755 -30734 59359 59456 16957 12924 36805
16849 36805 116753 80050 22383 70796 99397 99863 94222 125047 104009 28496 6811 -90130
16837 -90130 -142640 -111492 5430 3721 -122580 -157694 -170395 -84661 -76741 -99190 -35872 72359
16825 72359 84612 -13773 12883 24777 -80770 -64888 -13652 -103514 -173389 -146197 23296
16814 23296 76604 9371 -50283 -21227 53856 -21203 -110769 -134983 -85458 15052 16522 57664
16802 57664 -38260 -10771 8189 -118013 -93797 -83389 -57120 95434 226391 160067 141240
16791 141240 111462 66037 -10416 103519 6380 -111833 -109688 34397 44329 -17423 -193151
16780 -193151 -180442 -117950 -109020 -107977 -82457 -75604 -155062 -69737 85221 159410 231572 274949
16768 274949 155876 150804 106433 34282 11488 8519 -4543 -70110 -71624 -39901 -129815 -265560
16756 -265560 -226167 -129696 -42930 -32609 -58500 -78045 -60091 -144071 -156501 -190718 -188840 -126591
16744 -126591 -7783 56309 -7926 -77729 18841 59191 125297 96385 114241 113203 225138
16733 225138 394380 423635 381359 389705 376666 256484 205317 213188 224526 290748 384296
16722 384296 350483 329953 345520 263035 217558 123274 31831 12363 4224 -23658 -53168 -60609
16710 -60609 -57865 100015 80220 156676 124272 39758 77185 50877 17315 -1848 -44536 -111257
16698 -111257 -124979 -21670 -32545 -133246 -89617 -49823 -721 -145743 -107841 25449 56426
16687 56426 61401 116352 -957 -110597 -61211 -65713 7386 -13110 48941 67141 2461 -146090
16675 -146090 -226699 -289610 -249450 -220341 -210959 -239330 -257427 -155247 49569 109454 -22938
16664 -22938 -69855 -105550 -127048 -70199 36437 -8370 5550 41038 -29723 -25321 -116945 -85249
16652 -85249 36712 107283 61674 -61261 -21840 -70660 -230272 -353706 -377172 -200121 -49666
16641 -49666 -42685 -48946 -191572 -280937 -267779 -251504 -349972 -208530 -160449 -210360 -127839 -96924
16629 -96924 -156091 -172539 -194828 -172874 -231511 -276459 -198342 -93612 -132151 -181085 -261357
16618 -261357 -323708 -138368 -107450 -245279 -246241 -140434 -6178 107085 173035 103704 100953
16607 100953 -50196 5443 160924 130499 -2199 4864 -78247 -131050 29084 57701 -55485
16596 -55485 -101132 -41271 -10934 -59071 -84564 -304481 -244906 -116753 -83428 -109608 -107942
16585 -107942 -118451 -80287 30171 -39243 -152648 -135043 -120894 -164787 -85056 -18011 -14272
16574 -14272 -15463 -30153 75912 120413 155322 184542 142825 -7733 -28643 57518 35560
16563 35560 13525 97212 11726 -162006 -211294 -220590 -101940 -88456 -26826 83793 157291
16552 157291 160257 202347 75010 -81531 -120146 -152852 -172785 -231149 -177089 42225 -43653
16541 -43653 12487 115055 53406 -46644 114780 124499 104890 427 46494 85953 15258
16530 15258 5015 -24330 -64766 -18750 -103702 -243837 -279034 -166202 -174708 -160967 -111250
16519 -111250 -119083 -70005 -150149 -222472 -267766 -298752 -285185 -216396 -221259 -223207 -76305 -62507
16507 -62507 -119127 -41375 771 87188 79927 559 32978 72880 -1768 -20204 -95296 -97295
16495 -97295 -31830 -127038 -174856 -44125 105223 2585 -113862 -85239 -77395 -43680 91423
16484 91423 133565 212038 193124 78132 -2297 -42349 -65169 -54067 -200417 -109034 85922
16473 85922 73979 -15862 35844 -3170 -131319 -142044 -35659 -82117 -124795 -174314 -279445
16462 -279445 -188759 -137452 -93756 19661 -8585 -118343 -44122 8274 40810 -85852 -165133
16451 -165133 -153124 -72724 -64895 -120997 -95778 -28975 -57699 -114257 -237643 -258974 -169979
16440 -169979 -42070 12696 -32996 -133414 -125067 -67168 -16120 1337 -3806 -11641 93018
16429 93018 113277 70886 93377 60597 88312 99460 160344 103134 36418 25884 15778 -67657
16417 -67657 -60322 -46748 -108153 -131606 -29753 19747 -85710 -109968 -100215 -42366 -57739 -18718
16405 -18718 -45026 -23623 -24663 -114700 -123755 -69745 -108086 -146678 -113898 -163866 -136026 -158810
16393 -158810 -214580 -320961 -351285 -323628 -183749 -60369 -30191 13406 11243 -10734 41779
16382 41779 117716 128789 210516 259604 185969 116890 125701 93144 1406 -25592 -92190 -172925
16370 -172925 -215204 -166623 -88906 39360 -133049 -212036 -135823 -21574 -54587 -104137 -37397
16359 -37397 43182 -104463 -231954 -138078 -120614 -88632 -46316 53058 4657 -120478 -191430
16348 -191430 -95357 20893 28790 1130 -80339 -89154 -109303 -81876 22083 32272 37645 -72944
16336 -72944 -99546 -110922 -96931 -174781 -178354 -8870 157073 165329 68147 164759 204689 64241
16324 64241 27042 35328 -83768 -83503 -128422 -146433 -50721 -6701 -38019 33215 168 -11685
16312 -11685 -81912 -204226 -231171 -22476 98938 68983 56030 78366 45515 -71958 -65545
16301 -65545 43916 34075 48068 117351 79987 67484 14054 -124278 -216767 -66804 27585
16290 27585 -21403 -5451 10117 -98230 -133482 -45454 111806 215851 298862 243489 115289
16279 115289 35634 118695 123553 91454 169378 68664 -146364 -24635 72347 95940 101875
16268 101875 56203 67290 74406 118910 183551 238758 256805 170111 204827 201071 131501 -46444
16256 -46444 -38830 15926 -29250 -997 74263 150701 167025 69227 -3334 -55089 2365 74372
16244 74372 48599 -8374 -54013 -34179 -121664 -103840 -112770 -151061 -147910 -172018 -203459 -157768
16232 -157768 -49444 -54381 -36952 -21862 183579 144254 62159 69820 94598 66029 -45383
16221 -45383 -81580 22666 151644 154285 34118 -25702 -104636 -127665 68779 163151 90642
16210 90642 31698 -113570 -144487 -91296 -86311 -118785 -126525 -41292 -44293 -87621 -110174 -117461
16198 -117461 -89501 -107065 -44611 37211 85485 -22922 -26323 -3116 29601 3620 4183 -76517
16186 -76517 -211855 -305245 -288177 -257611 -178841 -142640 -50819 -90359 -107936 -37818 -80256
16175 -80256 -23657 17319 -121743 -272866 -362166 -274304 -264414 -240916 -107246 14970 -81983
16164 -81983 -160055 -133124 -79112 -64697 -60070 72191 32357 -145296 -134716 -154576 -170472
16153 -170472 -108269 -171120 -204366 -3393 183055 269894 214339 73181 -41185 -12586 11810
16142 11810 79885 67227 -37961 -131233 -143212 -119588 -87427 -88208 -110702 22542 187585
16131 187585 356425 332684 226661 201242 269684 342785 246436 88973 2699 -59640 -116801
16120 -116801 -220624 -252822 -251001 -75025 21700 -12270 -20000 -52432 -62162 -30009 -5569 -43151
16108 -43151 44132 114177 100413 -21250 -70581 -29095 38568 36480 89797 -5407 -68917 -174879
16096 -174879 -292351 -241443 -256201 -150332 -160135 -197695 -266964 -219182 -169166 -160547 -127290
16085 -127290 13142 111183 126056 101524 9663 -84500 -76442 -68431 -39548 -133783 -175410 -205651
16073 -205651 -295428 -253029 -258915 -303314 -226282 -48906 -29671 40780 60174 -38446 33833
16062 33833 59956 31584 26188 25595 30863 5901 47867 -46023 -121352 -158532 -172653 -202104
16050 -202104 -94238 -75563 -142474 14082 47372 25255 -6474 -47454 -86488 -150843 -129293
16039 -129293 -57929 -130460 -45569 46886 32747 64778 4894 -137739 -155148 -79778 71185
16028 71185 179859 247358 172019 24084 -44854 -28031 52316 -30407 -70688 -16019 -21159
16017 -21159 -96541 -70107 -64301 17222 -37 35398 -31724 -128711 -165157 -69315 2481 -1390
16005 -1390 95938 165976 91528 102613 106669 155616 138769 146356 8236 8341 -69851 -146297
15993 -146297 22278 -25536 -64660 27855 136113 124725 81836 35944 115974 154442 77480
15982 77480 63898 -14206 -19827 -171689 -235077 -179173 -134773 -112905 -112525 -55804 -38945 -130171
15970 -130171 -138357 -129926 -48208 -136944 -137038 -175807 -51296 -116627 -200346 -286162 -183067 -117341
15958 -117341 -180608 -272368 -172073 13108 114337 -42387 -209346 -216087 -176580 -120021 -157092
15947 -157092 -69034 -13435 111875 84853 23365 36333 49794 51834 53186 9801 -36665 -12840
15935 -12840 -58871 -39485 -41418 -33348 -12525 -27662 -119115 -252640 -161686 10302 26850 -17487
15923 -17487 -24965 105105 118762 23395 -40789 -57696 70505 97539 -24000 -2586 -2515 -100780
15911 -100780 -113168 -85337 -69539 -83960 -110173 -112871 -92368 -110716 -75172 57558 31067
15900 31067 -27065 -41547 26257 70205 -56588 1286 -162782 -170371 43684 68329 -64101
15889 -64101 -140616 -33523 32379 62207 60613 -69199 -162106 -94427 -57238 -72874 -125848
15878 -125848 -152856 -88303 -78419 -120291 -147526 -249360 -147408 -94285 -70747 -33533 -97953
15867 -97953 -158766 -211183 -213597 -249583 -160567 -30158 63406 184097 236287 185540 9013
15856 9013 -154485 -133470 -179584 -151811 -381 17055 -131871 -189779 -141301 -143409 -104389
15845 -104389 -59036 -58312 -106465 -169850 -154219 -112628 -98323 -22500 102603 146205 -13394
15834 -13394 -21293 64829 190268 196418 214716 266339 97430 -127184 -141650 -41420 -11769
15823 -11769 9845 65401 3890 -1026 96937 77660 65792 -38038 -178214 -11242 78888
15812 78888 105169 11184 60667 78247 68214 12390 -40371 -93011 -201300 -154756 37983
15801 37983 16930 -50331 76054 125299 211335 201175 84189 -83969 -113477 -31988 -5785
15790 -5785 -26207 -70896 -151859 -131995 -24030 -71000 -217581 -284535 -241517 -78359 2149
15779 2149 -6159 -18080 -42010 -35761 -55067 -101411 -69270 -32999 -1048 106103 144598 71296
15767 71296 -14276 -7942 17333 -9391 -113420 -55028 -9777 -1009 -7736 51571 3555 -62233
15755 -62233 -135755 -114362 -187738 -272992 -151862 30698 44216 38429 34053 -35445 40586 74217
15743 74217 14749 -24428 17391 -31409 -117901 -133269 -134036 -159951 -95711 -16300 111182 40416
15731 40416 -78153 -146538 -189454 -171097 -94743 -63592 -91412 -19830 25217 84523 907
15720 907 -60617 90078 76570 -43295 -111720 -161035 -131674 -33211 87316 161013 227432
15709 227432 120884 -50854 -108745 -53370 53321 113397 63047 127356 163536 96253 -4117
15698 -4117 -47838 -85699 -32276 11784 -117652 -130781 -86687 -137770 -149823 -101306 -162591 -114902
15686 -114902 -162764 -279432 -244725 -228272 -176392 -110226 -122720 -88465 -39522 -68714 -92899
15675 -92899 -48545 148369 223687 139547 152733 28257 -46664 -160237 -120724 -5441 1121
15664 1121 -184059 -182213 3856 157219 154635 76328 -27526 -70300 -128118 -146175 -155297 -56927
15652 -56927 -38507 -81354 -94052 -127565 -68690 44523 4143 -158250 -169412 -139663 -128010
15641 -128010 25974 46585 28546 -24179 -116748 -63409 13901 8392 -33348 -68941 -85977
15630 -85977 -29918 -124740 -340237 -325660 -218764 -146008 -153906 -120744 -166513 -185805 -108013
15619 -108013 -23374 -73669 -151224 -150042 -169543 -106512 -26155 -27666 -24774 33209 16745 147
15607 147 46057 208754 241673 116558 -61739 -141762 -152251 -173985 -175596 -136822 -143343 46098
15595 46098 66622 29002 -36750 -73131 -92338 -40892 6595 23750 -140190 -143218 -91072 2637
15583 2637 -26375 -58116 -132687 -296494 -200203 -117046 -83243 -121672 -145182 -89078 -86776 -113245
15571 -113245 -78005 -89351 -43449 140109 74995 29216 -9738 -34593 -53132 102796 57498
15560 57498 -34337 -67632 -99146 -57065 824 -66078 -62100 -23096 -48288 -75822 -115898 -125848
15548 -125848 -207180 -135544 -126046 -209245 -172908 -172086 -196323 -204142 -213164 -192611 -13779 -17126
15536 -17126 35753 -21696 -182511 -211421 -72931 4732 11459 11674 90110 219743 188739 56435
15524 56435 -39665 76194 81384 36542 -9403 -70044 -24577 -158278 -223149 -215453 -164392 -207618
15512 -207618 -247763 -249537 -195887 -119893 -84252 -53642 -60814 25902 -15337 -9850 17650 98209
15500 98209 205711 167303 116666 -7077 -32957 -18151 -42709 -155093 -137907 -149948 -107666
15489 -107666 56398 104194 62950 -21909 48861 53096 -136968 -227778 -140828 -38112 76508
15478 76508 148747 198222 213737 177459 -17771 -63252 -11180 29264 -90116 -64761 -78676
15467 -78676 -100587 -39439 -77182 18578 44183 9568 64136 37380 69468 105067 28722 -85611
15455 -85611 -78805 -60014 -109096 -14924 78002 73125 53655 -38017 -31828 -49782 -130669 -115575
15443 -115575 60853 73261 100572 -57945 -197361 -250930 -293647 -334328 -238015 -89208 58377
15432 58377 50535 12672 38095 -9021 -110097 -125713 -158442 -137934 -49170 131575 78389
15421 78389 -77133 -106196 -129494 -105223 -47353 -51911 33682 110390 230706 136696 54977
15410 54977 -1354 28874 -84106 -73396 -144696 -231871 -229758 -252504 -142692 -29800 84417
15399 84417 106944 133556 146165 225515 206949 131511 92696 54508 117332 136 -102507
15388 -102507 -214306 -271475 -357354 -248825 -59873 -38109 -89136 -136153 -57267 -164967 -173795
15377 -173795 -237890 -219204 -62134 34137 63293 84409 -32060 -197170 -209742 -110305 -69285
15366 -69285 -131865 -79152 -43791 79570 94735 -54625 -49330 -163989 -130969 -183416 -137638
15355 -137638 -162602 -166054 -167417 -22464 119361 74862 76520 94336 -23385 -33891 103119
15344 103119 167047 167651 45827 -40653 10542 92470 24798 -193746 -245869 -120744 -81867
15333 -81867 -223480 -287029 -233486 -83012 3251 17712 -15365 -55987 41375 147142 45658
15322 45658 -92922 -48284 -55793 -37343 -78202 -68063 -55179 -48718 -80404 -122937 -222523 -198094
15310 -198094 -198986 -67057 -28169 -98614 -96778 -174642 -91136 60803 165533 243337 177897
15299 177897 21831 -87509 19881 66129 88729 132985 199143 182033 208133 163839 353
15288 353 -164300 -93928 -26899 82983 8737 -32244 15006 -28739 -36168 -51089 -55093 19905
15276 19905 75905 17845 2710 -55938 -49696 -13979 -43385 19967 -21503 -150333 -70186 -17761
15264 -17761 51560 61996 -29098 -164531 -237998 -217892 -148932 -62248 -89468 -51943 25870
15253 25870 29486 -96985 -133382 -43971 49644 15109 43479 7797 -86344 -168031 -238061 -154537
15241 -154537 -104387 -81553 -141775 -223164 -237890 -237123 -166950 -137910 -231105 -266735 -286691 -151206
15229 -151206 -140086 -91774 -46183 -85138 -200402 -293308 -310022 -183451 -118586 -75568 -78099
15218 -78099 -51733 -67346 -31041 2451 -87672 -134682 -150311 -91788 -49804 -64239 -12850 20759
15206 20759 -103201 -182183 -191386 -185883 -110668 -17352 40434 1261 -84205 -73698 -191458 -179581
15194 -179581 -183159 -125878 -122077 -125471 -14033 41335 17188 12974 8790 -44219 -61378 -37596
15182 -37596 -56923 -145412 -213141 -357945 -334706 -189538 -170265 -164009 10740 95631 46638
15171 46638 -12628 6010 37963 8031 -90588 -106066 2711 10407 -67269 -48860 -80434 -138205
15159 -138205 -146971 -159881 -166807 -101161 -33732 -56338 -126783 -69226 54420 123342 100724 77415
15147 77415 74077 65902 17087 -35089 -99250 -154610 -43211 75158 138520 89776 -19257
15136 -19257 -7364 -45080 -80710 -76521 -121741 -39299 12677 -1948 -92829 -173083 -148893 -131111
15124 -131111 -248658 -187816 5063 28029 44264 -3975 -83462 -75486 -29939 -27431 120199
15113 120199 50066 -17505 95253 110630 79609 -10176 -42834 34682 54018 -24391 -52096
15102 -52096 -10543 30498 80735 113064 55213 158370 228677 177142 25018 -56283 47198
15091 47198 19246 60611 651 -97206 -127462 -52739 12680 52685 -2578 -47744 -86863 -44603
15079 -44603 -28327 78572 64894 135874 229101 209416 54027 -7386 104840 95674 -16345
15068 -16345 -114178 -135221 16786 34468 59095 27088 41797 -45964 -101359 20654 94170
15057 94170 133320 48748 45258 34132 1816 87763 107675 137909 79212 71592 103696 203210
15045 203210 194134 118931 -3587 -78176 -93649 -194648 -256783 -235762 -223442 -209567 -185853
15034 -185853 -93292 -207599 -123387 4680 -15603 -136272 -232082 -164695 15258 61008 -47804
15023 -47804 -60285 -76579 -229533 -260718 -338947 -355070 -256026 -151743 -75473 -150616 -94743
15012 -94743 -21594 -85309 -78445 -94324 -132954 -36558 72633 45139 -38414 -119590 -191435 -161715
15000 -161715 -104447 -83315 -88532 -153191 -184572 -48188 15997 -78041 -142557 -132721 21058
14989 21058 15632 -67694 -90515 -37250 71753 111929 -9875 -22419 35123 61615 5064
14978 5064 -32441 -38460 -107487 -76003 -41386 3210 130923 158221 68162 -54848 -142247 -149176
14966 -149176 -180262 -127519 -111569 -129222 -156972 -78488 -47668 88135 132188 66151 121312
14955 121312 20446 30605 52494 20540 -10224 -142845 -181518 -56011 -93595 -139435 12712
14944 12712 -7418 36171 72027 174230 202541 21092 -96244 -32894 -92741 -188113 -96228
14933 -96228 -52636 -44264 149303 181731 154201 37759 -36471 -76330 -79126 -17054 20676 89344
14921 89344 48494 -20944 130770 97941 -18538 3388 -2600 85417 89589 82103 46782 80547
14909 80547 50021 -74746 -111533 -83507 -84982 -67142 -13285 64671 11459 -93825 -50465
14898 -50465 -5721 -4917 34133 196606 222411 108602 37885 4065 -145974 -258690 -195278
14887 -195278 -66967 -13564 20293 -42486 -90831 -128432 -107582 -85662 -67874 -24489 70511
14876 70511 77404 -14052 75035 207496 153763 209313 157896 33757 6046 46103 135529
14865 135529 242249 232745 239085 105551 32638 47664 5600 472 -60855 -181832 -197034
14854 -197034 -190752 -47493 36723 -26849 -148242 -117856 -119423 49928 159197 44178 -4633
14843 -4633 -28380 -68994 -103342 -150554 -179097 -99879 -37633 -95914 20588 51961 -3797 -74911
14831 -74911 -46109 30404 75837 153712 132618 107618 150975 55371 -88249 -87659 -164579 -150195
14819 -150195 -246134 -302020 -136576 -85500 -202034 -330534 -280664 -314413 -227740 -153167 -126515
14808 -126515 -122196 -89253 -139807 -341121 -295643 -149405 -29962 -22286 -118910 -113643 50450
14797 50450 160984 96251 73812 13027 -137081 -164973 -199527 -247597 -116300 -24872 74131
14786 74131 222025 222816 21016 -62230 -72895 -82602 -96470 -197911 -286565 -231510 -188913 -129073
14774 -129073 -161002 -106241 15755 62397 -2574 -16169 -37573 -119487 -78917 -75493 -33440
14763 -33440 39489 28715 43206 122165 -10779 -93022 -12115 45503 -66569 -82161 -160551
14752 -160551 -151043 -54408 6889 -23399 -3311 -58353 -120479 -289387 -253584 -143026 -90550
14741 -90550 -23 121706 59578 60739 27450 25505 34472 61948 117387 134376 89842 25157
14729 25157 -28268 -21244 -22799 -28720 3192 109116 25772 16673 78446 -56695 -49426 -55824
14717 -55824 6782 73627 90386 75532 80910 116378 20540 14181 15823 46312 84054 46729
14705 46729 9425 -134476 -190555 -73502 8214 13518 108451 67587 -16337 -62470 -69091 6960
14693 6960 -22527 -49118 -83074 -73629 -43495 6358 3602 17188 132971 125538 31732 29859
14681 29859 -29194 -146624 -150386 -193946 -165224 -127367 30338 28840 68730 -5932 -57708 -50907
14669 -50907 54809 91387 98107 161266 56541 16085 120090 58983 11201 76374 210977
14658 210977 43705 -79811 -108489 -85744 -91596 -122930 1812 61303 -42213 -24207 -78056
14647 -78056 -88214 -20848 -51902 54063 69494 37713 -97791 -140585 -108266 -108554 -94357 -110631
14635 -110631 -79882 -116469 -111447 -90460 -167660 -123555 -77523 -98959 -111574 -90265 -81888 -38559
14623 -38559 -13273 -65668 -170463 -227334 -90923 -62961 -39172 23363 -30240 -71744 -56178
14612 -56178 -60303 -78644 -35154 50366 87197 33936 -99287 -59974 -45824 650 149352
14601 149352 176130 48586 4383 14044 1149 -11240 64450 56375 104043 -344 -4281 19090
14589 19090 27435 -34289 -99263 -57184 146740 203534 163074 124218 11327 -71944 16515
14578 16515 90270 104505 45810 48479 -26191 -2844 50410 9131 58903 -12608 -68620 -81838
14566 -81838 -72883 -128994 -93407 -47731 -56924 19813 4151 -17620 -9513 -48660 24805 108804
14554 108804 120441 160972 107979 56228 -1890 -61377 -100219 -117438 -301452 -230839 -43923
14543 -43923 71408 122540 50012 60173 130115 68544 117978 95192 -15473 -38574 -15488
14532 -15488 101681 38619 -115617 -113780 -10796 -72256 -107856 -15763 -119893 -204321 -374442
14521 -374442 -359333 -241769 -205141 -138425 -105799 -133892 -59592 -26033 -38190 35820 111450
14510 111450 107613 22891 17182 -90335 -41912 -49732 -19454 29669 113556 20767 -2779 -110724
14498 -110724 -84350 52904 80106 -19528 -4580 57329 -11433 -98600 -177628 -133319 -84831
14487 -84831 22120 161720 178992 91470 122068 133451 -49729 -201308 -205707 -91327 13358
14476 13358 -29366 39104 190363 301345 381946 294805 191034 136282 58172 53166 50598
14465 50598 113397 63896 -738 -37655 -106251 -30642 -41192 -6966 95797 151910 164514
14454 164514 12626 -122506 6505 90490 105070 42774 120153 120605 81389 75433 79608 14285
14442 14285 -29908 29518 -106609 -84366 -56784 -102286 -182980 -167525 -174667 -80991 8214 6687
14430 6687 -17601 -95377 -67127 16346 83238 5598 -29457 71569 106851 32577 46564 73733
14418 73733 13756 -85960 -107273 -42923 95355 35794 -47641 -115381 -144589 -158496 -107130
14407 -107130 -206292 -231567 -157951 -98047 -69747 -140229 -177027 -197342 -272739 -225510 -168879
14396 -168879 -218536 -219095 -58511 34998 117156 65932 -101102 -58507 -78096 -80404 -31058 -1629
14384 -1629 106879 136077 61094 -107982 -181360 -107249 -105433 -134659 -132635 -191318 -168042 -28445
14372 -28445 -2280 -3103 23642 -42782 -177395 -250267 -161274 -116675 -48015 -113182 -50130 -25045
14360 -25045 -4625 76756 79411 85417 108347 14973 -66955 12753 35807 100530 62611 28706
14348 28706 -98820 -122917 -20142 -27138 -21009 -71100 -51499 21655 62816 20641 -9106 -14264
14336 -14264 -22344 -14869 48393 -69647 1210 13332 5871 -344 -14652 6258 -69685 -125910
14324 -125910 -100699 -21624 -62547 -79524 -24284 -51744 -134567 -108997 -106525 -182427 -159173 -77432
14312 -77432 -36737 5550 -53015 -108140 -48795 -35833 -179978 -177072 -161388 -84874 17986
14301 17986 71691 -4211 17930 81230 -44078 -37922 -99566 -34471 82646 163429 90687
14290 90687 28206 51339 81001 57231 21571 -2988 -84862 29200 36882 -13854 -57790 -112845
14278 -112845 -147623 -200173 -146705 -44079 209297 228377 34806 -80387 -84777 -77582 -140118
14267 -140118 -218476 -118671 -100571 -110048 -110957 -13911 -70513 -66613 -92695 -74831 -51488 -49461
14255 -49461 -58988 -43337 62474 119918 133072 63856 -23903 -69790 -112459 -130721 -108097 -119147
14243 -119147 -108195 -179538 -179250 -52883 4220 21956 48553 -1937 -68973 -116357 -24176 -2561
14231 -2561 -76212 -82836 -41830 -58305 -63116 -19106 35462 -106047 -96470 -84440 -44592 55373
14219 55373 48236 -46690 -163861 -201409 -99174 -71137 -8516 14786 50732 88084 1920
14208 1920 -141227 -132310 -14995 -21080 -136211 -118565 -111672 -187609 -68731 10359 -57722 7777
14196 7777 47253 -58211 -28563 -79688 -66566 -70412 -66126 45727 155208 161471 180455 79603
14184 79603 17707 26214 124010 122496 171452 116725 150072 159412 68974 -21122 -173710 -182268
14172 -182268 -182759 -108281 -118244 -129408 -26995 98958 136918 94480 -72376 -269129 -280943
14161 -280943 -208573 16332 36154 30490 47618 -4311 -29454 -11039 25731 6931 29035
14150 29035 9340 -64264 -28328 63116 126677 129968 167723 66091 76877 136399 118574 -20346
14138 -20346 13484 28569 107526 19255 4278 -81737 -150671 -70749 -106846 -147352 -155783 -191971
14126 -191971 -64628 -72929 -62462 -190223 -143866 52722 5667 -43417 -58798 -78413 -95998
14115 -95998 -105777 -146324 11545 88728 71989 46645 10825 -31572 51167 89517 77184 130492
14103 130492 116639 -1473 -79926 5192 10484 -67370 -136334 -156213 -100602 -99098 -85149 -36163
14091 -36163 14550 -177195 -142955 -66800 -5312 -58786 -145592 -229165 -191165 -84747 -54595
14080 -54595 -85249 -116464 -129095 -119962 16096 106267 168010 97360 -4850 25695 65631
14069 65631 32142 -53727 -126836 -296889 -268414 -120808 -157304 -240806 -169987 -201176 -263721
14058 -263721 -130091 -92203 -114878 -140895 20451 1013 -35795 -89602 -127272 -90736 -141531
14047 -141531 -181852 -199951 -156986 -245394 -182447 -133419 -126994 -46607 -3361 -93507 -90090 -128277
14035 -128277 -97918 -175571 -19728 122679 24444 6268 16230 -45773 -135189 -118524 -34283
14024 -34283 -123575 -114549 -89533 -100702 -32099 47789 -22085 -76867 -111044 -89513 -33090 -22164
14012 -22164 14285 -25061 60619 9208 67210 -72223 -125717 -71095 24399 -38765 11298
14001 11298 -12320 -158862 -211537 -177634 -85625 -83291 -102898 -177495 -88913 -51352 -74217 -118118
13989 -118118 -125365 -95769 -132988 -193303 -182713 -190412 -210586 -200081 -84050 -103050 -58531 -159000
13977 -159000 -322226 -286878 -248138 -84679 14380 30185 -80113 -46823 132515 144283 20220
13966 20220 -87856 -7808 11247 67452 -27308 -74046 -93948 -20787 13382 -12139 -89228
13955 -89228 -144914 -152056 -26974 -117640 -164445 -91529 -39772 -109576 -65948 -53984 45362 57970
13943 57970 50530 134441 175823 140461 55425 -43814 11143 62737 11964 -12487 -26218 -84059
13931 -84059 -157935 -115873 -22301 34953 9788 2338 -46417 -104008 -67082 -118981 -200650 -90640
13919 -90640 10714 135527 86966 -12023 -71966 -121204 -98381 -88353 -28162 34399 78508
13908 78508 -11887 4455 8950 147245 166144 85301 88907 215829 179562 54529 42025
13897 42025 -29235 -155215 -170584 -222645 -174955 -191449 -254741 -325956 -272927 -229556 -160366
13886 -160366 -61011 -66704 -12885 12370 -71820 -77554 -57669 -112203 700 -12560 -69554 73038
13874 73038 164142 143159 114497 173558 242161 188745 144544 148853 132283 200242 309948 208730
13862 208730 126525 20949 33722 155911 179601 32726 -2310 69328 100501 142963 70789
13851 70789 52789 56653 100294 -30647 -46882 41668 34918 -49622 -47197 42266 30057 -53749
13839 -53749 -133326 -254145 -213156 -61391 -87125 -93591 -33421 -42945 -138964 -226976 -142195 -92583
13827 -92583 -62259 -88983 -132520 -91396 -89819 -27489 -49215 -92638 15085 -22892 65315 46021
13815 46021 -127052 -221622 -108084 -17733 -90060 -173295 -201288 -295276 -217707 -99487 -63398
13804 -63398 -68282 23009 28177 -72542 -205006 -306224 -195855 -21291 82819 73112 2642
13793 2642 20976 94138 93366 32471 -100385 -171805 -238440 -261661 -154763 -29613 77881
13782 77881 151771 120941 40499 -107483 -169862 -54750 -22851 -27730 -1409 67588 57707 -34970
13770 -34970 -75976 -34442 -36246 -61491 -43821 -23497 -94339 -218590 -88190 -1003 -6988 -127950
13758 -127950 -256426 -203430 -203312 -187208 -317651 -340210 -178127 -74610 -7920 -28786 -29916
13747 -29916 -86309 -113000 -113257 -129896 -101755 -20562 -59577 -91960 -113241 -32426 34182 23359
13735 23359 -81404 -211978 -268041 -202829 -138218 -68213 -109059 -62990 -90988 -25267 44310
13724 44310 14229 -20497 52662 -9064 -172487 -237743 -171195 -167684 -284409 -257264 -119984
13713 -119984 -41983 -56615 -10658 -31538 -77514 -76118 -124095 -136072 -121655 25233 -111877
13702 -111877 -178430 -19438 80901 99374 124760 84786 99047 49536 -8567 -12873 26475
13691 26475 768 101860 165766 79348 25021 -75644 -106023 -148804 -206217 -190827 -200061
13680 -200061 -175017 8559 64601 -16397 118783 218046 250613 197435 62869 19015 7569
13669 7569 22539 50869 -20601 -10553 58320 43222 -29101 -134791 -140397 -120969 -152693 -73342
13657 -73342 102504 92381 -23359 -140476 -60483 56582 116703 120133 -15349 -69107 -65900
13646 -65900 -71771 -1519 1171 -5767 -5098 41789 -18958 -175911 -145696 -226705 -171079 -150476
13634 -150476 -174803 -141702 -165067 -43654 27891 154797 167847 82158 -59096 -152989 -75452
13623 -75452 -15094 -105711 -136490 -40644 58428 -91001 -204333 -175247 -33920 22487 28858
13612 28858 -47188 -229675 -256829 -89651 66519 165202 170058 -11282 -80912 27188 13361
13601 13361 85130 9431 65754 93870 33992 -43794 -4717 -18818 18852 44171 85224 37769
13589 37769 -21334 53805 239451 252344 260238 181364 126902 167894 210951 273849 105756
13578 105756 62350 64204 44427 -11801 -18816 -44597 -138054 -214011 -150386 -75620 6598 7487
13566 7487 -2502 -73023 -250696 -233086 -160718 -146742 -42093 -30976 39185 121456 14199
13555 14199 -30226 104791 96192 34225 -31747 -108442 -140225 -47606 3569 51305 50952 -4965
13543 -4965 -11582 33877 -42769 -145340 -156085 -260825 -255679 -156108 -144033 -95850 22430 -84619
13531 -84619 -95587 -29784 238317 127723 -49937 -53926 23960 -8103 -113122 -197531 -99971
13520 -99971 75780 67239 -40197 15762 26754 -28913 19614 16834 -6269 -56792 -113464 -110675
13508 -110675 -18532 39904 -28404 -92575 -168344 -218288 -165817 -72513 -35455 -61388 -101102
13497 -101102 14577 57787 59135 -22103 -77979 -22988 -114757 -180964 -200924 -123384 -27459
13486 -27459 -29283 11876 46786 31054 -139056 -82481 -42813 -2460 30801 71641 114719 13970
13474 13970 -71642 -97655 -108173 -115796 -182703 -142989 -131665 -78272 -38505 11849 54575 4538
13462 4538 -93896 -178993 -58946 -35909 -22025 -23425 37458 7404 -26904 -27320 -11988 111279
13450 111279 97735 73529 -8279 -120379 -122732 -55947 6236 -5907 -65930 -17077 67782
13439 67782 -14324 -59213 -161506 -222089 -136359 -16764 -110890 -172050 -73785 -74585 -145473 -175693
13427 -175693 -161436 -112132 -50148 -27821 -50486 -68869 -165678 -215143 -145517 -173959 -59899
13416 -59899 -19206 -21736 75544 -5862 -66184 20603 31490 -46245 -2421 -32726 -138736 -187533
13404 -187533 -108351 -131987 -125830 -56303 -69330 -11111 -49328 -54643 27498 3779 -71079 -125838
13392 -125838 -136672 -172003 -150846 45021 208603 182399 81046 98578 184865 126212 99068
13381 99068 55304 30254 14528 -41489 -22768 -114157 -144717 -109518 -21812 -101315 -143575 -211622
13369 -211622 -183716 -301291 -149332 7736 42455 57646 16328 9489 97934 40098 -59252
13358 -59252 -151019 -63717 -13197 -33148 -87684 -98934 2090 23086 -81266 -17880 37855
13347 37855 92336 64804 49206 -4934 -58289 36134 34860 -67840 -44811 51983 159399
13336 159399 307639 259648 102181 -20521 25965 94912 247680 212605 14764 -113909
13326 -113909 -94650 -62363 -48322 -70312 -162749 -215063 -57079 56392 104204 24747 75831
13315 75831 82880 87273 -60334 -89514 -56587 -107395 -52254 53213 183177 30345 -17084
13304 -17084 6324 -66640 -153999 -59293 -29327 18914 -13742 -123300 -139865 -67475 -43583
13293 -43583 58336 53021 -53348 -58856 -80344 -50974 22817 60202 -4060 -122193 -185824
13282 -185824 -225613 -190746 -84282 -19963 50447 54304 42817 123085 160460 35475 -18430
13271 -18430 4460 -81439 20347 125243 78273 -794 -159098 -191915 -115015 -109143 -73982
13260 -73982 -23375 108999 145696 152921 123020 84788 8303 42232 59582 107226 125058 102944
13248 102944 -46499 6048 69952 174707 94917 34957 23718 82702 66729 141686 150487
13237 150487 133538 70969 92494 131823 81138 86883 109676 142668 170717 124149 2091
13226 2091 -73973 -124612 -87788 -121025 -65930 -56865 -74078 77446 60702 166011 208162 152855
13214 152855 31914 -50599 -18148 -8825 63141 22951 14876 -34658 -31597 -96764 -78341 -73187
13202 -73187 -14493 141797 202333 128905 125132 24036 -63115 -139022 -92368 25247 -15569
13191 -15569 -45445 38254 188364 253118 236279 178796 104451 44445 99267 162398 88980
13180 88980 98572 160121 161136 241281 260878 247647 332000 368923 438360 542990 625675 653496
13168 653496 752164 944106 1388848 1785243 1991369 1999419 1993297 1800772 1579358 1359409
13158 1359409 1266640 1104594 995679 985570 867520 763133 817484 813248 872456 944239 984590
13147 984590 1069816 1102488 1002545 990303 1076807 1250695 1380729 1500675 1676566 1856107
13137 1856107 1967046 2055026 2253517 2371583 2529907 2578226 2597750 2388309 2025593 1852298
13127 1852298 1828651 1885231 1941323 1813673 1578754 1440252 1481579 1418758 1413778 1464312 1385269
13116 1385269 1233447 1008317 965807 955843 901945 862955 812426 826436 785559 988095 1208967
13105 1208967 1395780 1762581 2242181 2580131 2825710 2734580 2435266 2114453 1811245 1590888
13095 1590888 1474514 1372282 1073896 822921 836685 708503 461612 409067 436308 355200
13085 355200 351952 566212 542939 396583 309347 152550 112048 221498 123449 108783 72063
13074 72063 114363 92826 12179 55541 129216 199885 212652 220343 79903 30252 103103 163029
13062 163029 208691 184652 135500 242765 378445 282239 157507 100204 155837 175654 217624
13051 217624 218192 191610 230947 151945 43097 -16591 9599 60437 106088 38316 -53663 -56780
13039 -56780 -3159 19960 72016 63437 89237 11459 34130 230020 195830 117045 100239 89118
13027 89118 94567 66253 68273 20352 102429 81974 8859 15108 -78479 -48279 105091 159880
13015 159880 137695 133329 15544 -109834 -164588 -182627 -159245 -98925 -23564 -67621 -173565
13004 -173565 -112156 -107469 -78479 -103482 -102496 -40936 56495 134255 116914 44737 -53146 -105075
12992 -105075 -207359 -157609 -25088 -39680 124345 173353 168925 258904 312478 317865 164669
12981 164669 -8188 -81989 -95206 30258 121769 35924 14490 -7510 -30660 15759 50572
12970 50572 23445 61148 190557 207143 225303 226052 335682 305176 163900 112897 57706
12959 57706 81538 53457 113960 146574 254728 334412 344555 265136 338306 351013 346782 456544
12947 456544 483616 366067 271697 198387 262546 352405 407519 392824 423902 450342 402702
12936 402702 539181 536074 464431 459441 382398 322927 310970 301178 267072 352402 490927 571893
12924 571893 393260 310040 372122 340739 295616 231797 289924 314685 304933 226172 115848
12913 115848 149254 138401 191482 236209 236366 291132 294000 341374 375450 386107 505528 598612
12901 598612 577696 537965 432835 320844 267967 227556 200396 186572 180768 146535 208573
12890 208573 242917 245846 176343 306080 411456 429244 421025 399615 338274 455734 500786
12879 500786 335121 265394 230842 163471 138631 330023 448148 373122 324644 349019 317947
12868 317947 363613 401903 357138 258686 232429 340514 358086 335326 435380 578480 614183
12857 614183 502343 400483 334821 338671 390952 482073 590085 503551 440986 511265 549605
12846 549605 548559 518002 590685 662727 816566 976119 1132351 1476255 1625595 1575918 1420653
12835 1420653 1265363 1184964 1176049 1120594 1036849 1004104 968641 1006753 1041205 1104253 1219251
12824 1219251 1260760 1238945 1199056 1149009 1053735 1064261 1069634 1182666 1218642 1149839 1115291
12813 1115291 1176468 1221389 1364152 1411180 1386251 1320956 1486764 1591617 1608501 1605372 1595237
12802 1595237 1571818 1556221 1639760 1585969 1540955 1598250 1678893 1691690 1649509 1540194 1500059
12791 1500059 1602916 1696660 1746443 1803607 1835721 1807720 1767354 1754451 1805232 1935845 1999330
12780 1999330 2097797 2196755 2370512 2420413 2545430 2673866 2664275 2673729 2752581 2777281 2773234
12769 2773234 2829520 2867213 2874380 2823491 2880120 2989755 3061946 3018564 2988201 3012671 3218348
12758 3218348 3336513 3506474 3576129 3740124 3815455 4029488 4259001 4425969 4652522 4656981
12748 4656981 4844462 5162128 5335445 5486193 5670978 5749388 6013285 6414917 6643488 6999321
12738 6999321 7559590 8000032 8479655 9117265 9985462 10947324 12038159 13252946 14765357
12729 14765357 16455795 18297115 20340506 22877247 26017677 30258685 35903715 43487570
12721 43487570 53878324 68718375 89506125 118433130 157334576 206772785 262865606
12714 262865606 315409247 351333636 361200951 344601435 310054009 268955098 229677928
12707 229677928 196468861 170593183 151784504 139453338 132404508 129747835 130944171
12700 130944171 135329181 142374717 150975264 159337651 165820757 170273797 175052094 183760464
12692 183760464 199417631 223165139 254138014 289746823 327180165 365874602 406835894
12685 406835894 450166478 491029106 517203055 516070927 487472713 444357148 400552455
12678 400552455 364304041 338094645 321268016 311695288 306392852 301992222 295283906
12671 295283906 283844996 267485944 249556741 234000920 222928748 215613099 209796057
12664 209796057 202371119 192694662 182907570 175309923 171172733 171494329 178126355 193660956
12656 193660956 221133567 263212798 321031061 390531560 460347511 513202569 531494621
12649 531494621 507896200 452266957 384604110 320076816 264814825 220250463 185626827
12642 185626827 159421186 139718941 125020994 113843672 105003986 97478445 90643260
12635 90643260 83870364 76983654 70040776 63298442 56890941 51187007 46124038 41697266
12627 41697266 37843247 34417145 31438480 28730181 26387771 24270652 22397091 20706826
12619 20706826 19172486 17753425 16403702 15191374 14118454 13179720 12380170 11773408
12611 11773408 11196234 10536360 9862303 9232815 8673956 8147633 7568264 7112288 6655774
12602 6655774 6357297 6048242 5650233 5277268 4880960 4514735 4215142 3962017 3842625
12593 3842625 3688832 3596854 3596488 3595278 3557252 3424911 3379521 3267503 3022392 2944934 2874616
12582 2874616 2724246 2662223 2726966 2684007 2690316 2701488 2504487 2367422 2339488 2427553 2561462
12571 2561462 2530526 2421100 2393911 2302082 2208389 2190601 2140412 1968171 1909691 1993454 2049684
12560 2049684 2126290 2118457 2106313 2050881 2013999 1887349 1945058 2109437 2210768 2153604 2186861
12549 2186861 2175624 2086666 2073257 2023612 2124670 2041354 1953347 1940384 2011910 2072831 2027468
12538 2027468 2208505 2297916 2267613 2334227 2526929 2701931 3048837 3468154 3781994 4189989
12528 4189989 4599401 4662393 4430569 3990973 3367726 2854720 2568327 2362530 2290367 2353445
12518 2353445 2333062 2331963 2344120 2323564 2126988 2019482 2070443 1890656 1820414 1830589 1821701
12507 1821701 1692384 1608322 1692825 1648924 1546464 1512939 1394807 1342331 1238426 1181605
12497 1181605 1276385 1292512 1204524 1277708 1288410 1243220 1105982 1045127 1121350 1260843 1276931
12486 1276931 1107490 1087790 1171942 1153719 1144240 913828 875717 941875 1005729 1062174 1019972
12475 1019972 1034870 977751 995671 1038733 1124603 1103462 1111140 1148564 1252977 1237548 1175183
12464 1175183 1123122 1098828 1054662 1198390 1360986 1363591 1500560 1514320 1453536 1351730 1293457
12453 1293457 1351192 1508763 1628736 1633897 1710365 1875586 2052307 2305624 2648643 3094411
12443 3094411 3526467 3839505 4132939 4224956 4012591 3688519 3384525 3219531 2931830 2671725
12433 2671725 2467237 2536785 2560757 2363343 2166941 2008686 1960855 2060757 2132225 2045556
12423 2045556 1972177 1816053 1717962 1708796 1901701 1970802 1883348 1798996 1975630 2046054 2058773
12412 2058773 2011056 2024712 2220230 2359429 2402067 2426051 2383174 2385144 2397741 2308546 2327750
12401 2327750 2377749 2295729 2293818 2267496 2196704 2206005 2274951 2268090 2289667 2423089 2536975
12390 2536975 2536563 2410107 2350750 2515225 2665729 2746564 2783789 2749385 2780294 2905305 2935956
12379 2935956 2922762 2863202 2944339 3144888 3277662 3387037 3385177 3301391 3346597 3355044 3476952
12368 3476952 3588384 3712448 3782522 3807558 3948758 4007683 3966261 4077410 4200597 4353230
12358 4353230 4384952 4533197 4691880 4916617 5083722 5362016 5707744 5878641 6144834 6350861
12348 6350861 6547305 6915140 7258633 7626391 8198590 8919026 9705537 10413901 11108867
12339 11108867 12112300 13218059 14355343 15664476 17393643 19582228 22255144 25515146
12331 25515146 29705505 34747678 41164400 49494366 60679153 76012625 97239225 126749575
12323 126749575 167968582 223277592 292216174 367835678 435742854 478921722 486422111
12316 486422111 459686162 410464147 353487380 300048334 256049059 223120121 200853872
12309 200853872 187794914 182440830 182945341 186956225 191184099 192919723 191943547 190346248
12301 190346248 191210195 196639006 207667314 224242332 243633259 261078423 272244564
12294 272244564 276252770 276659400 279986747 292681078 317633092 354460197 399063695
12287 399063695 444034053 480099941 499894138 501708181 488996967 466361585 436715722
12280 436715722 402139091 364822715 327537117 293429730 265042709 243264709 227884746
12273 227884746 217569936 209583385 200943201 189831982 176816976 163991059 153214355
12266 153214355 145521362 141916489 143046575 149022715 161192007 181158177 209739574
12259 209739574 246947308 290378169 333835534 366489795 376982153 361523187 326089287
12252 326089287 281754353 238094801 200066617 168959540 144598108 125893784 111661901
12245 111661901 100741679 91750119 84355548 77903371 71918641 66083600 60312264 54626748
12237 54626748 49416101 44654090 40560600 36863369 33467012 30463472 27955090 25744894
12229 25744894 23738662 21918334 20335489 18888863 17623334 16541154 15457298 14585984
12221 14585984 13950486 13194089 12423717 11675757 11022222 10478117 9975890 9332159 8894272
12212 8894272 8437600 7968025 7540389 7099704 6715409 6388126 6158918 5834398 5667307
12203 5667307 5564061 5397643 5251767 5059967 4963029 4904782 4889305 4851480 4723315 4597413
12193 4597413 4519513 4394676 4203569 4026987 3898486 3832120 3638074 3661209 3678606 3610355
12183 3610355 3477323 3390354 3337405 3402110 3413187 3299488 3097454 3079832 3130807 2976666
12173 2976666 2717978 2567846 2497962 2461975 2427209 2334596 2300433 2232566 2201756 2227748 2416730
12162 2416730 2544442 2550038 2538894 2389322 2343380 2229818 2071951 2096312 2073417 1945221
12152 1945221 1885644 1990774 1996727 1914766 1774326 1774836 1702964 1544120 1422342 1252984 1178482
12141 1178482 1335109 1474845 1523394 1555932 1476869 1360772 1459463 1664606 1775940 1835037
12131 1835037 1890168 1830974 1696179 1554625 1531443 1515750 1503413 1542034 1593921 1599350 1557909
12120 1557909 1618853 1595499 1503779 1462530 1488540 1437008 1366431 1190551 1025904 1044229 1082295
12109 1082295 1089847 1147053 1115256 1045760 1044639 1083891 1082090 1085948 991393 867970 894681 890087
12097 890087 930051 999556 1095862 1116791 1069483 1022410 974999 891855 880775 888193 889665 886402
12085 886402 698841 812890 993291 1003177 840808 849357 941146 910934 788653 673904 678640
12074 678640 584246 593047 782234 740503 705024 697180 700096 671467 678925 611595 595354 633751
12062 633751 658890 705880 761477 758227 807652 808516 743202 702012 685689 611955 598236 623468
12050 623468 732811 657564 557264 569510 567313 543081 462626 463788 416561 461247 528604
12039 528604 461714 462895 554220 611376 587363 579760 488712 423497 438000 388462 496251 723629
12027 723629 713405 710807 586553 607776 556077 621414 619438 746542 778015 728865 738279 715998
12015 715998 683783 614530 603711 708573 619184 492852 530040 520483 587637 686587 794210
12004 794210 853157 785618 699945 687937 582052 604790 588346 597123 546975 614568 613418 554694
11992 554694 551157 482282 353377 325598 431795 430586 506064 678515 578985 523590 504747
11981 504747 482699 520082 556445 520299 550113 546755 552314 610557 618158 726211 647173 583879
11969 583879 596198 480023 410239 371784 342858 337619 360537 388207 303185 299791 298014 299356
11957 299356 374104 379784 553979 596198 506852 389746 307417 272280 250882 211265 275957
11946 275957 305518 437424 442088 314404 327419 398536 431871 341632 337801 389312 496825
11935 496825 427698 363651 251570 195437 267299 347803 372574 310102 283353 290432 302272
11924 302272 385407 435282 474314 474254 368574 309189 247026 254973 297621 311688 288205 225019
11912 225019 315631 296765 208658 54794 132693 235324 248102 223279 206652 178550 148361
11901 148361 146000 80162 113119 341267 475178 567824 415692 361001 361863 427683 614449
11890 614449 758325 760604 880120 983783 1117329 1321070 1606217 2107763 2423985 2554359
11880 2554359 2422539 2223694 2179640 1911819 1758491 1645945 1531140 1494663 1410876 1305463
11870 1305463 1317234 1318530 1382996 1422127 1409569 1482956 1478060 1505557 1551040 1610002 1644466 1693396
11858 1693396 1752698 1925828 2107716 2094587 2172905 2363186 2527687 2590709 2624711 2852039
11848 2852039 2976431 2990307 2880209 2682298 2491272 2204048 1911715 1786902 1668867 1653784
11838 1653784 1605389 1580413 1375413 1367508 1468295 1475262 1308904 1178724 1201055 1108933 1043253
11827 1043253 972866 926662 1005305 1173039 1392854 1645355 1893022 1975487 2026113 2149343
11817 2149343 2240951 2175327 1929153 1579774 1371400 1181301 1044747 1010796 1051233 1043936
11807 1043936 812097 518003 414473 372982 381465 464315 561278 533788 551645 539036 450695
11796 450695 386880 409853 243011 236028 393579 332777 315190 389018 508201 526237 431433
11785 431433 325444 271631 317457 334086 317982 289174 301753 301720 361357 378714 325264 192810
11773 192810 102258 89850 151037 174137 171123 188276 149207 84754 46048 74627 161128 138434
11761 138434 34702 99725 54663 18894 -53972 -49018 97711 167496 120961 164896 175020
11750 175020 212628 211519 135790 101724 139859 107128 221907 257358 184746 113087 104767 89060
11738 89060 123853 34831 48827 171204 284065 212745 243071 155624 60113 71310 166235
11727 166235 278267 298135 271022 202186 222475 182652 67999 34012 92474 110633 157227
11716 157227 147921 128845 219715 180104 87211 80075 9185 -36110 135998 182826 31328
11705 31328 -29059 16728 -9611 -19209 56648 144540 119768 63463 23750 -30573 5935 78462
11693 78462 179643 182910 38528 47765 82083 44835 234507 328426 261466 170821 54541
11682 54541 206339 304741 238219 100070 40598 94487 -110396 -250785 -112191 4724
11672 4724 67312 153526 231799 258990 334452 271137 113557 80051 182893 122801 32142
11661 32142 14022 122163 258764 207398 132930 2928 137113 238411 271375 242222 227427
11650 227427 214715 38700 33645 70926 -44248 -63576 21846 75853 71331 69679 23727 -18424
11638 -18424 47009 96818 45625 -42521 56129 148639 95419 15178 -32580 98216 157823
11627 157823 121963 14260 -10740 112116 34672 -15665 5627 -12009 -39681 99996 158177
11616 158177 146961 79731 92909 22597 2669 -15204 -81494 -128443 -6142 46023 -30717
11605 -30717 17883 55386 -98109 -138984 -84265 -76349 54733 138993 78015 129868 71750
11594 71750 -27795 41595 -25785 -20691 1481 70280 263651 212206 74101 74018 107164 138235
11582 138235 46345 13145 40270 -6043 24680 70984 -43492 -80747 -66879 -60767 -8052
11571 -8052 -27961 117707 183787 194506 202246 220664 147043 139895 92079 -2877 61911 63594
11559 63594 61319 75783 121542 105463 63551 3957 21666 -60907 -97089 -94475 -115009 -100906
11547 -100906 639 209925 201228 148984 74835 87008 64194 4973 -127824 -145381 -5785
11536 -5785 -1197 -8898 99462 81478 155897 113253 -7132 -10517 112705 163912 103709 104710
11524 104710 157058 252361 252113 238745 252738 269921 177061 215123 278231 247206 170505 236201
11512 236201 232687 209750 44949 -60988 -95100 -60835 26706 120551 47538 33999 57528
11501 57528 214057 199185 37367 68826 133126 267929 280918 186232 58056 -34275 -142693
11490 -142693 -134636 -128923 -27581 -33535 -115604 -111650 -118385 -44362 8553 111850 203622 117234
11478 117234 5456 1690 54919 137403 98732 108926 219461 236005 135375 104442 135515
11467 135515 163610 258852 272333 300370 281181 177523 -11607 -3437 44562 30430 121904
11456 121904 156785 141077 60834 -59521 -86034 87786 154175 156002 192889 182245 56698
11445 56698 145896 202524 75463 48820 157138 125881 223764 322845 283084 198445 195834
11434 195834 170266 124630 267107 275913 158676 164220 149165 204467 213610 255105 164289 108938
11422 108938 203906 97399 20258 111824 116887 36681 4530 89842 210043 86826 -39266
11411 -39266 49035 103742 134010 193560 138143 195406 122393 95138 134747 90478 36590 45845
11399 45845 -22241 120726 47581 -37998 67235 42617 53304 143804 179916 140540 121963
11388 121963 88500 -23948 62216 80219 186092 167961 87242 -499 12887 44444 12779
11377 12779 29344 -6505 -39419 79407 72465 77213 61081 -45097 -4581 -43948 44383 104072
11365 104072 107028 49985 20009 57762 157304 62469 26692 33646 -12151 -50270 79222 254649
11353 254649 275150 245446 208527 195319 238588 193672 107240 40098 194670 290764 345109
11342 345109 274160 136250 68465 8258 33112 76374 51495 -86679 -48462 122706 217135
11331 217135 164515 121077 56231 88156 -5817 -134500 -83885 -25557 -38911 -65823 19095
11320 19095 117489 168023 92332 59409 141625 55812 -2188 18043 -8815 -16166 28822 -17968
11308 -17968 -73633 -67883 -110818 -88005 -5298 74291 81698 -24957 -121248 -139823 3437 24326
11296 24326 54768 42587 80259 126602 176170 70272 69934 88568 151785 119822 48767 29262
11284 29262 185456 241493 223825 179146 269614 386756 214269 32280 11601 90997 129550
11273 129550 52157 -59796 -340 26580 -49792 -199478 -229885 -90985 98563 130514 74846
11262 74846 16048 -41014 -101292 -69616 -7074 19897 37886 60517 86396 91623 189837 260306
11250 260306 192034 133433 58980 43955 62229 134902 49300 -38323 -14723 20359 -50406
11239 -50406 -18020 -50557 -50632 -73945 -60303 -44267 40764 107154 235032 290878 195659 103309
11227 103309 158116 165246 200774 169842 170783 17369 10561 -615 -46565 -36540 2568 67236
11215 67236 20140 -77418 -4433 41225 25796 -49019 56830 163581 210741 128087 112069
11204 112069 28156 26510 4572 54925 151736 80697 -11246 24951 86429 186141 334311
11193 334311 385432 281271 121016 22152 69876 122955 202156 200996 106842 16333 -107228
11182 -107228 -88405 -55653 -43232 5321 35190 105750 171841 120101 95318 42103 -4917
11171 -4917 17853 109415 132026 199092 247487 152572 25574 107784 118036 54440 52942 -37999
11159 -37999 -4205 22365 118423 33897 -123642 -174479 -108300 27870 18434 -14595 -20644 -16278
11147 -16278 46496 123338 97627 82730 13411 -40458 37714 120637 86754 126071 158988 121245
11135 121245 -28466 102770 108331 -57797 -1376 73048 32558 135264 169253 -95311 -252390
11124 -252390 -250905 -81943 82692 276253 332118 263951 236733 107875 -25368 -17608 56453
11113 56453 57311 -31703 -160927 -160898 -81240 -9738 90307 64707 16254 86570 160996 72549
11101 72549 2388 92426 174287 180350 233835 171402 34615 -124411 -18717 60293 135671
11090 135671 91018 163127 216674 72033 -56720 -54781 -108045 -199125 -167222 -238104 -132782
11079 -132782 12705 18974 -53901 -58392 60523 -16006 -168944 -160337 681 14501 -26387
11068 -26387 25714 60718 54909 8882 25314 45640 -35875 -112592 -135910 -162150 -14203 98288
11056 98288 149756 85376 151408 51518 46559 55695 30319 -52906 -109598 -84841 13060 68773
11044 68773 117787 163132 195967 170182 111548 -949 -147862 -108173 -22145 66217 -6971
11033 -6971 -30 58077 57948 -1026 -49888 -27981 -158508 -232931 -202528 -33829 -99964 -96253
11021 -96253 -29020 101299 81416 70252 121697 219305 290368 189491 55444 11437 -113230
11010 -113230 -35663 -6657 -6414 25003 147581 188470 137026 434 -109966 -16375 116290
10999 116290 112361 46118 8037 14503 -26390 90380 103679 60135 32075 55555 41262 23570
10987 23570 8566 87836 167834 150496 -21941 -92413 -75835 51006 160473 167667 114784
10976 114784 3321 -148853 -154254 -59029 59739 32096 71154 46139 90014 142220 187877
10965 187877 162679 -9153 79285 112997 88078 61750 39205 37933 89570 88519 34536 -43678
10953 -43678 16190 19399 124346 172680 215673 169294 62829 28594 -29383 -15670 -14380 85283
10941 85283 131138 -51320 -124046 -2372 813 87041 178293 172321 130621 99470 58833 -55538
10929 -55538 -72580 -90859 -72032 -153312 -208404 -45775 86571 113390 62651 3964 -41748
10918 -41748 -22206 69732 74191 43662 129034 161009 130870 10732 24966 76263 71393 138900
10906 138900 180101 127800 96851 26184 69602 218605 293358 291706 260662 230778 240463 147752
10894 147752 195630 236381 120611 90481 83225 39501 17094 -179863 -186597 -149907 -127338
10883 -127338 -34458 42889 200772 83316 -6759 -9308 15503 70388 37190 -52409 -146275
10872 -146275 -84805 -51706 -101900 -130397 -87440 9586 125001 125800 97604 64387 94153 67861
10860 67861 -96832 -146861 -120761 41735 155111 107669 -25893 -172468 -163269 -195497 -221865
10849 -221865 -151490 -58555 36002 -102970 -108211 -118150 -52183 -48261 -126038 -120536 -67598 47432
10837 47432 64801 -57491 -142316 -117764 -157906 -129014 -83797 -11256 -15985 -34256 11143 -42969
10825 -42969 -119799 -79423 -19815 89793 91697 9344 -81412 -117974 -135271 -133362 -97527 -59237
10813 -59237 -72190 4976 50868 89203 -6558 -93858 -105874 51826 6376 -109707 -153179
10802 -153179 -165033 -195170 -213282 -225290 -208032 -115674 -174626 -141468 -226174 -233892 -281945 -279294
10790 -279294 -290241 -190520 -31399 79141 125923 -12574 -119102 -11082 39288 52497
10780 52497 71211 9295 73567 63035 144420 252849 167635 143504 238594 258015 133940
10769 133940 181363 116906 4681 -9477 -73309 -179451 -142383 -197180 -190209 -180651 -168857
10758 -168857 -24407 63362 -17139 -114318 -54983 41568 93533 92025 -24236 -73878 -10770
10747 -10770 -7429 -13206 92157 110318 64967 177083 153842 26019 -11545 -17354 -25671 -71688
10735 -71688 -26819 -43891 -64470 -47714 9720 1694 -43530 -67203 -40179 -78667 -88919 -68997
10723 -68997 -85675 54951 96960 106735 66991 -94418 -77815 -50604 -36766 51597 127236
10712 127236 108298 46441 75181 -41691 -180655 -218683 -118610 -26299 -58430 -107227 -96837
10701 -96837 -65148 -48385 -65163 -47798 9455 -36382 -26470 -73529 -95356 21370 4056 140678
10689 140678 266144 233887 174225 174592 179979 203795 215516 91249 -44854 -48661 -15615 -25908
10677 -25908 -107995 -25996 59814 35792 36799 50706 114437 232619 255122 251893 197893 149760
10665 149760 240992 167289 -4344 18229 -44129 -93596 -61418 -11508 25304 -38526 18490
10654 18490 15628 66297 -35953 -91107 -61288 -175661 -202306 -207330 -195785 -80097 33046
10643 33046 17414 -61134 -69346 -39518 -14185 -17161 34585 148727 113744 100928 91458 14838
10631 14838 71063 71835 47562 80690 202172 176465 122470 168050 195691 154123 168171 180535
10619 180535 201248 57220 -44220 -27168 116947 25354 -5486 131989 10532 -105330
10609 -105330 -73072 -148108 -148214 -17471 -55410 -80777 -28657 -190843 -271516 -280065 -166166
10598 -166166 -55142 -57394 -115933 -146262 -97832 -43781 1669 38117 116134 254114 244028
10587 244028 217646 234420 184914 150490 -12947 -116666 30397 106252 111415 18508 31160
10576 31160 58201 40461 -52329 36562 72994 5822 -46943 -54182 55349 118457 236023
10565 236023 250279 58032 -4028 38070 137767 98521 90268 22215 -130351 -132391 -99756
10554 -99756 -148732 -86773 -97499 -139394 -159141 -84746 -39601 -84222 -39974 192748 292191
10543 292191 160861 108446 21884 -60791 -18227 25658 69433 122388 -23837 -27316 3988
10532 3988 -53178 51234 98912 43445 22228 73834 46696 -16726 24253 49742 52293 29327
10520 29327 100685 149372 131034 181915 111551 68102 13123 -40960 -59981 -67843 -61408 -100052
10508 -100052 11296 89569 27660 55261 161199 123308 73798 156343 200587 233127 193388
10497 193388 93717 9015 53228 108409 135159 57169 42937 147205 150979 41612 -126324
10486 -126324 -194753 -146448 -199143 -110464 -33400 -52889 -35947 86467 161405 164622 218342
10475 218342 261280 187657 143054 91658 -13305 -64231 -48018 -111360 14060 129089 66658
10464 66658 116364 42189 21007 99011 58301 -52627 -111114 -79292 -65963 -16360 14763
10453 14763 -133821 -66777 54057 99220 168245 149779 85075 171842 153151 31057 123636
10442 123636 86620 -40115 -43089 631 -66326 -93321 -62045 -2009 84611 63883 -2897
10431 -2897 116853 233853 204234 231858 139248 127774 117569 187321 134377 -147642 -291707
10420 -291707 -265212 -249230 -206451 -69717 17587 2859 3030 93522 174802 156135 79490 100114
10408 100114 226128 292295 278674 153280 -23990 -129771 -13249 87114 15775 -32566
10398 -32566 -42951 -39195 -40659 37793 2602 20743 84388 122552 119404 133881 115841 95810
10386 95810 17957 -73746 -118163 -143563 -114954 -149967 -44463 119670 187890 100678 77131
10375 77131 162022 213524 104737 23827 -103153 -124979 -54691 109584 202936 151883 46294
10364 46294 23603 123912 37023 -79593 13869 102830 134918 245981 411862 374191 161103
10353 161103 80168 75385 19438 -106610 -131728 35603 61768 102122 109178 77287 -36632
10342 -36632 -51162 57785 78054 42850 2862 94052 27969 111871 193376 199688 232047 237512
10330 237512 303333 290027 281070 374245 472506 551907 471010 420649 387310 363357 276892 248326
10318 248326 195094 136951 195381 183818 192788 246597 203447 50111 -58855 -80307 -90515
10307 -90515 -22297 64479 144521 132726 81204 5402 -54284 -180010 -239279 -137746 -15270
10296 -15270 42800 22931 -38429 -35261 23577 -49238 -79357 -58790 -80620 -10535 24899 -8383
10284 -8383 -87402 -167101 -137042 -152862 -166080 -124342 -10434 -18153 85183 157867 186649 145090
10272 145090 287699 345695 311192 162302 -19382 22956 29670 35198 -10592 -70532 -46922
10261 -46922 74376 130648 151571 177415 165375 78178 9201 -39063 -119722 -94934 -61541
10250 -61541 -25178 -32410 -24070 90489 115123 144107 106406 40766 -60027 -206823 -207610 -121131
10238 -121131 -64115 -8180 129102 161620 86557 30221 94685 61851 48674 7601 -24454
10227 -24454 -33000 -62640 -33252 46764 5606 26867 119348 155929 71679 69423 253680 204953
10215 204953 170635 75752 74132 120143 49936 -99544 -140589 -183670 -304213 -235178 -97018
10204 -97018 36506 451 -61182 -160617 -161847 -191345 -121395 -11197 -2198 32319 53050 -2280
10192 -2280 24219 -82377 -36567 55568 170354 296451 93547 -79567 -49775 48534 77362
10181 77362 116553 63041 -30793 -9466 -46824 -36914 192077 259792 232323 167002 59345
10170 59345 74486 -12110 -85768 2832 164636 231141 146692 72125 54141 15759 -12886
10159 -12886 -724 70016 1322 -53898 20336 48413 1849 9984 -872 113211 149580 159200
10147 159200 189382 175713 98476 1842 146950 263681 156569 -22038 -1756 -68736 -129327
10136 -129327 -63533 29542 14611 -5136 66947 -32000 -113660 -32670 17046 -10181 -24036
10125 -24036 -41536 7657 -63494 -177941 -253267 -238396 -172243 -90937 -3716 83930 87560 45719
10113 45719 5934 -24611 -84199 -120871 -71752 -47474 41040 17361 -50482 63876 69801 -2924
10101 -2924 39967 119625 139578 137848 126542 125354 12460 -3107 -6994 33758 1512 61659
10089 61659 130140 168087 162766 19344 28730 17200 -162474 -145205 20705 48296 47698 66033
10077 66033 112895 189228 178864 109988 -149546 -250929 -213320 -251755 -133642 -130529 -211486
10066 -211486 -209031 -242604 -261262 -190732 -105332 -114905 -142920 -135907 -134180 -90573 -32795 79016
10054 79016 122607 105029 2782 -130121 -147247 -233400 -142714 19996 123314 75822 74814
10043 74814 -18761 -35159 48176 49202 73278 29512 43541 149757 145466 150144 246883 267759
10031 267759 162274 65618 -85795 -176204 -219319 -287720 -304186 -206338 -89518 -45119 38499
10020 38499 26916 -35472 -28400 51632 131840 105133 148309 220128 279907 179841 148543 6242
10008 6242 -62400 59074 163018 226161 151687 -35504 -94497 -162408 -201691 -135830 -13895
9997 -13895 67411 51290 -5 27805 88864 95305 162116 196659 146688 158332 129819 80957
9985 80957 71945 -11063 -88917 -197328 -143802 26079 73337 114222 166281 56264 45202
9974 45202 123706 102129 8669 -111633 -222514 -248930 -324781 -164536 -22804 -72803 -95137
9963 -95137 39854 -2548 -41085 -86631 3303 -55952 -7111 -32790 -39297 -1158 -90979 -66603
9951 -66603 -26076 37057 -20187 -78569 -56967 -38821 11983 4468 -18120 21008 -3902 -43399
9939 -43399 -157771 -206405 -212501 -27484 115077 117719 101756 33553 57990 154742 199234 50497
9927 50497 38934 24728 62889 4268 -118303 -113400 -78909 14762 67529 143913 271911 297654
9915 297654 82271 66398 65992 125434 83650 122153 163185 145890 13772 36862 158578
9904 158578 322217 194270 143713 194642 212043 97595 131509 219988 135773 187463 140969
9893 140969 43031 -31065 -73934 5193 -70809 -113195 6240 117506 135920 165189 56858
9882 56858 119964 161309 154864 147082 156178 69944 103351 70173 -50989 -47050 -83433 -59614
9870 -59614 -84124 -102788 -94670 -94938 -156254 -161361 -112820 9349 118083 129719 74668 8482
9858 8482 -64121 12696 65891 80146 -39574 13869 66046 166690 195732 180758 232861 299987
9846 299987 348408 257208 134266 1807 -121804 -44114 69441 84123 117728 159806 183156
9835 183156 124834 -39169 -90374 -14436 48880 51901 107701 172322 309341 364642 190179
9824 190179 17565 -53657 -49418 39624 -38223 -111807 -17748 65363 -16553 34804 75348 72531
9812 72531 18330 -20804 -56466 -31156 -75319 -191098 -176959 -79474 23728 122761 86260
9801 86260 15657 34297 29591 -58585 -74422 -41953 -549 10514 83455 49176 14913 -43218
9789 -43218 9192 -17769 -43019 -62661 -96297 41041 179755 202829 102845 88182 63113
9778 63113 28996 -4497 -7514 -42111 -64038 -84748 -21180 7817 20956 -15370 -9636 4685
9766 4685 -50325 17183 40781 42315 57656 1695 16395 133552 191618 265822 248978 125040
9754 125040 59231 -15364 -79858 -155609 -162329 -126415 -20075 35831 -40142 -56312 -10672 -70880
9742 -70880 77116 155535 134844 17753 -5569 -14916 -92444 -38716 -78863 -55335 15561 23541
9730 23541 -28771 17388 82422 52116 -86969 -132912 -110393 -26306 -9332 78682 150630 106062
9718 106062 -11589 4575 8009 -40491 60383 125516 32875 -56036 -142624 -138146 -21813
9707 -21813 -25616 4466 18 43499 82142 74264 74392 9910 28722 13957 12488 109221 129487
9694 129487 128584 47591 -27429 41221 40160 48684 1580 93202 214807 128344 29918 13540
9682 13540 25962 150997 204601 272425 268367 202380 137491 4295 -63855 9387 110597
9671 110597 83499 63334 72883 169819 191564 55002 -33706 -81836 -99125 -71014 39783
9660 39783 54470 -17494 -40264 50286 72703 23653 21800 35895 53785 173278 55438 -99706
9648 -99706 -108715 -112418 -106893 -82656 -115748 24482 111040 88389 100659 43213 52109 99389
9636 99389 174751 134019 -16406 404 160165 241020 172882 111535 9001 37804 53981
9625 53981 -47109 -17621 134743 133323 2779 92822 1006 15215 -23466 -57163 -33604
9614 -33604 -61973 -49131 -38310 -53593 61389 179598 169339 112649 67307 -63684 -85335
9603 -85335 94598 156911 149823 263318 238617 137414 80118 38362 174032 201527 173746
9592 173746 62507 29234 -12935 -74081 39661 131796 159956 172394 132905 118937 68772
9581 68772 8730 -11082 8397 161686 268278 265131 344207 324986 323916 199440 192523 81299
9569 81299 -61525 -39618 8896 44124 9200 -127743 -103728 -66105 61397 238519 302845
9558 302845 217038 167681 108930 139831 185468 155335 157898 205533 37902 -59105 -63436 -54398
9546 -54398 73608 116517 34639 32856 157180 295996 297216 196603 81270 210708 180116
9535 180116 102853 231498 194161 243166 319435 274137 399068 319390 130405 195803 244152
9524 244152 288847 213559 66248 -17512 -94216 14065 137547 113536 105889 162161 31763
9513 31763 -67048 -86406 -12244 114841 153312 184385 72821 -28038 -367 -50981 -36165
9502 -36165 37061 125518 217127 219095 208106 234325 221194 163702 176098 106558 81598 106141
9490 106141 179747 163370 129315 156782 159999 175694 191266 93032 -2088 -20319 86882 78363
9478 78363 -48230 5896 56834 -12507 42703 183795 240383 335979 333495 258446 70886
9467 70886 -69302 -40642 34588 155560 167489 190872 162892 189141 251910 205786 149196
9456 149196 220018 407811 383462 277870 289765 155745 125404 80266 54239 131388 163448
9445 163448 173046 201472 256781 379727 471339 468361 385334 372535 360178 388709 419699 361326
9433 361326 225420 161898 114115 151033 92175 97644 139274 135826 170020 244874 259548 236744
9421 236744 225137 157295 178061 342353 337438 158166 90285 180423 294360 457949 375064
9410 375064 191042 70694 225974 395196 424995 455525 494363 515364 513669 426303 276457
9399 276457 275480 351885 344185 287748 355809 424954 424402 503837 448234 485974 527486 485446 482722
9386 482722 512168 533784 418025 431232 475292 411779 423508 412175 460950 526459 517996 385217
9374 385217 456862 558267 578914 548721 559514 598385 693098 641166 543772 474614 462418
9363 462418 656707 809660 791132 636281 520468 566640 684582 752118 804421 688809
9353 688809 519967 600004 733592 800681 792800 702770 627409 670577 704809 554985 614293
9342 614293 685548 701748 711744 726204 811511 873916 863330 829757 718680 764163 889475
9331 889475 897203 942787 864636 823212 762558 761386 771277 789006 802800 870848 994320 1094886
9319 1094886 1128968 1143864 1143778 1083997 1170607 1018977 927983 909760 971113 1140728 1292634
9308 1292634 1356818 1346225 1320002 1278667 1265813 1422639 1474229 1419462 1435688 1376302 1317685
9297 1317685 1326539 1454907 1614580 1659952 1623157 1530937 1447002 1473797 1528722 1553327 1569736
9286 1569736 1652278 1700731 1837226 1825388 1943876 2015291 2014956 2083387 2149739 2124594 2104158
9275 2104158 2148405 2175095 2233322 2346069 2316430 2341625 2464175 2606719 2574243 2487482 2487679
9264 2487679 2511022 2643909 2675011 2662039 2735339 2943129 2991743 3060686 3026923 3011371 3152270
9253 3152270 3414506 3590360 3722094 3694561 3734979 3723490 3722445 3854461 3921468 3947120 3976269
9242 3976269 3924737 4017059 4173902 4271622 4289861 4365305 4370183 4337536 4454165 4518051 4601553
9231 4601553 4689569 4720270 4692822 4815307 4940577 4941464 4906165 4998682 4913586 4955675 5021927
9220 5021927 5020104 4994829 5006452 4992499 5035543 5192069 5240635 5243888 5222741 5094601 4969620
9209 4969620 4944136 4969781 5063143 5135990 5180074 5131886 5005502 4989385 4900839 4853216 4810273
9198 4810273 4764666 4571707 4395539 4397673 4408482 4313805 4297766 4241372 4223742 4151381 4096702
9187 4096702 4121821 4112935 4024570 3874628 3735182 3633775 3540956 3596463 3612603 3575341 3561984
9176 3561984 3562931 3484772 3354788 3365412 3330389 3218856 3137033 3022315 2821937 2773328 2810018
9165 2810018 2772127 2685602 2645950 2474948 2379135 2350615 2348040 2409942 2417854 2446793 2381614 2375271
9153 2375271 2366698 2322752 2288497 2155122 2034301 1922521 1887148 1892686 1858632 1803249 1713921
9142 1713921 1701230 1624709 1608982 1564563 1524988 1549319 1490102 1496429 1512425 1450672 1485704 1529530
9130 1529530 1546223 1451343 1425041 1363414 1296651 1279295 1285712 1257262 1120701 1003680 1052627
9119 1052627 1020465 1045810 1127388 1083553 989278 1059031 1091652 1161849 1165752 1176689 1089637 1017726
9107 1017726 1082460 1111256 1147142 1239013 1207397 1110631 1008360 959112 977761 983913 1052231
9096 1052231 1091475 1072382 893607 845681 820244 849553 931938 858822 821503 852710 828165
9085 828165 679318 685725 722625 586282 570438 618648 522022 578856 645041 618709 592282
9074 592282 621442 709282 766058 768446 772060 815457 718687 624560 584491 521182 587531 696292
9062 696292 637090 653735 585995 506459 539741 575255 581517 517765 564447 595836 495159 459111
9050 459111 382627 396938 388676 436383 396518 329629 327274 365678 432044 473070 406290 410617
9038 410617 336802 275753 238012 280481 348578 418890 463255 308216 195605 331260 332436
9027 332436 363104 386937 503371 627416 641902 621886 578316 414891 279044 279644 312373
9016 312373 287618 374300 295688 262177 232092 267989 263644 331912 361476 384940 383719 432161
9004 432161 443527 411436 355606 294100 417342 382719 314783 224640 284985 308242 341328
8993 341328 400256 364261 415884 368431 349212 375586 331992 291244 335407 347789 243525
8982 243525 156941 159895 136299 181276 265757 223196 141595 148785 216614 208609 132783 122723
8970 122723 218459 226000 175303 265064 423346 362081 250073 164610 129256 174828 238602
8959 238602 201722 162005 232180 222802 249916 246811 304571 205943 187188 241054 153808 80821
8947 80821 101327 150588 74592 -18271 -71334 24459 66837 -14639 -84793 -49630 -27557 26658
8935 26658 116728 76962 -2929 100478 115590 145663 110565 27639 -23964 -22523 -63919 -15365
8923 -15365 76839 167699 151373 39819 126118 334070 403811 339847 361593 359627 338131 248930
8911 248930 132374 137936 56620 89413 148515 -102904 -163178 -94612 39637 57776 95135
8900 95135 170659 233086 153426 90675 101062 34333 20720 106007 80253 158870 286858 254447
8888 254447 236928 183405 140497 161440 158852 140656 110085 146177 167526 271881 363100 256366
8876 256366 190730 139757 145764 139172 184474 49719 -60308 -58701 52312 137383 267535
8865 267535 177011 93053 75089 57426 14895 9604 61641 139340 140147 240786 249250 246788
8853 246788 194172 198543 174261 209920 255326 173273 141905 81777 12299 -33720 -69717 41744
8841 41744 143099 258920 328970 331623 165862 116174 130377 24931 3833 -5392 7883
8830 7883 81278 137023 199377 148625 131062 67438 5272 133039 286922 298278 174491
8819 174491 100773 60503 124449 64845 66367 -31061 -91090 25222 38851 112896 205203 180203
8807 180203 108854 114918 87203 99595 114663 140587 220203 160900 81881 97853 11856 -80250
8795 -80250 -46687 28199 -31658 44169 124050 47308 -59640 -101381 -82438 -120191 -201813 -157054
8783 -157054 -110094 17404 118441 -45301 -56180 -15305 -38024 -58710 -97753 -17799 -9406
8772 -9406 35229 132965 115257 137231 208233 272165 263132 88887 -386 1660 28195 -43340
8760 -43340 -48924 18501 144531 162550 167843 108660 78579 -36302 -105785 -51309 -94863 -58364
8748 -58364 61952 101639 225008 288692 271713 263697 224059 145807 59013 40905 58180 70613
8736 70613 -26548 -30060 4657 19015 -97136 -162826 -227339 -208943 -176522 -171117 -63146 -79599
8724 -79599 48590 192617 74404 24679 73993 82169 -45415 -102191 -41863 38454 -25472
8713 -25472 9062 67639 77137 154253 203996 273361 311319 243203 250908 241773 125060 -700
8701 -700 5212 21648 74368 21570 42450 -3314 -7515 -74106 -96589 -71847 -85249 -18971 66318
8688 66318 90629 54174 144359 188314 61978 45448 106212 78509 149416 110979 79492 128304
8676 128304 210075 230019 161322 119633 13288 -22701 -55083 -53073 34049 160576 139296
8665 139296 120676 180201 265328 178805 30369 83085 163431 71939 189948 218199 94404
8654 94404 150276 238527 292199 289480 329100 329802 313339 359959 319671 348265 320306 255166
8642 255166 262315 164269 90226 158179 234380 219782 149791 161708 243705 179340 81115 38199
8630 38199 103105 96677 148711 195983 212605 155288 152644 294960 418706 339069 246268 121617
8618 121617 175478 258090 136265 137146 216942 171239 202072 271489 284661 213106 254054 441714
8606 441714 522842 508498 514153 531890 554329 651817 632841 590410 533632 442251 502459 518179
8594 518179 545070 588371 662233 742613 755382 766563 770025 853822 934958 899863 886307 837017
8582 837017 807600 696934 624273 461265 482226 426966 413832 482957 440507 340645 350578
8571 350578 300173 333941 336150 344964 353596 276244 301413 405752 367243 289837 224589 212124
8559 212124 183872 188864 195452 172708 257821 294575 238584 314912 299372 232977 187372 148032
8547 148032 177248 228984 291950 220256 270437 313356 414377 523419 487925 388041 237519
8536 237519 145115 151139 49886 76455 17071 -1931 133736 237523 267012 228375 272225
8525 272225 219206 120083 37998 35146 102036 65741 102904 198538 240805 150512 131001 218996
8513 218996 227990 196657 202569 182923 126418 102976 58518 74442 103506 83503 64002 56524
8501 56524 145459 92037 109320 143196 85673 34650 95066 73215 103730 92851 113386 45509
8489 45509 26239 26179 113698 -1176 36323 109983 86651 -16883 12159 -69367 -131606 -154231
8477 -154231 -38614 -18128 -103785 -75787 -121867 -79717 28822 135955 237348 200042 177718
8466 177718 43234 60474 31430 -27239 -47641 5475 -15238 -12620 14961 27473 34691 -160701
8454 -160701 -102294 -10639 -94593 -97415 -70340 -122275 -203275 -93795 -8438 101683 109883 115954
8442 115954 141271 46001 3081 123810 130328 65524 169960 214463 175314 233644 101963
8431 101963 -8075 10766 -38232 51855 146328 98278 69148 -32254 28980 168260 184311
8420 184311 103656 73941 138538 196103 160644 -38642 -92199 -31644 112071 276446 243044
8409 243044 175905 76705 48976 128146 225997 155539 20442 -49530 13774 132789 145321
8398 145321 140287 107460 146159 49895 -15544 1978 31618 78587 11036 38361 35085 81391
8386 81391 213000 276470 196464 40893 42608 164719 262328 272957 194373 56267 -2982
8375 -2982 -26053 -102628 -147730 -85548 64998 70938 84250 30735 -93905 -91942 -74946 -141008
8363 -141008 -99535 -30522 -104565 -158904 -174398 -39259 99297 45488 -18707 -147548 -73830
8352 -73830 -19042 -10834 -35238 26915 36635 -19885 -907 60921 78706 126795 187467 161260
8340 161260 76956 -42986 -167805 -126192 -34483 -20894 -8057 -34728 -43158 -28932 40153
8329 40153 44450 22896 112272 27018 -195187 -148111 85857 108669 94087 124234 163775 303443
8317 303443 314770 152546 134064 155325 217104 177427 173512 165686 119632 72683 2954 130159
8305 130159 182748 86355 94552 76606 60044 48796 -39098 11825 -22424 -74186 -95995 -61935
8293 -61935 -95899 -41027 58141 165489 104694 59118 -128637 -156404 -78417 8214 39333
8282 39333 82328 -4465 -60746 -59212 83672 9635 -88899 -65713 -4947 105440 32072 -65497
8270 -65497 -93478 -178252 -231764 -127948 47394 -37888 -46970 -41419 -77511 -196080 -309608
8259 -309608 -242817 -223311 -218398 -146942 -53048 -84657 -118744 -82786 39050 137857 163970 91068
8247 91068 58929 88868 155422 113951 150418 163183 207431 158101 163474 123158 -33855 -5481
8235 -5481 3727 -48935 -51657 -54337 -10547 70429 -40076 -69268 55456 129210 131227 132445 70565
8222 70565 -65033 -209210 -98482 18475 69008 196154 140817 116815 65779 133866 217246
8211 217246 218932 35583 -63210 -149700 -187572 -69224 -49204 -18606 84682 36052 -43368
8200 -43368 -57456 18031 67117 -72212 -144839 -75303 -71437 21890 47872 107182 86845 44395
8188 44395 121002 -19457 -26186 -40323 -19061 18102 86810 164646 194352 12466 -75023 -93395
8176 -93395 -33962 -24673 -69883 -31549 91645 83873 111674 75083 -31414 -17677 14256 78751
8164 78751 69923 52896 32612 9651 72359 134535 79170 44055 68201 95906 39780 959
8152 959 -111557 -73902 -39971 -64505 36985 94641 -25550 -101644 -88254 -22297 70596 70600
8140 70600 -45884 80568 199249 68911 9744 -24574 51824 -2888 -59254 -42896 37600
8129 37600 137164 188594 187559 58378 -119291 -112477 -126656 -76793 42874 81693 143165 148941
8117 148941 24748 -70549 -21987 46645 68275 109348 -26448 -110879 -58073 17900 30052
8106 30052 -3446 13823 153949 266703 195539 165987 112094 139503 93881 215823 279154
8095 279154 161518 144848 177730 287327 373248 413698 417234 358038 289788 197413 215812
8084 215812 159988 37053 -98152 25913 -26961 -68236 -18906 -9252 -49928 -97820 -165063
8073 -165063 -200663 -176335 -119146 -70779 -18704 19619 49910 67837 72039 73145 35780 77808
8061 77808 118348 65483 21309 38152 32393 3813 9818 61453 99681 160851 131816 52965
8049 52965 73406 38211 -41573 -24420 28610 6970 36224 146034 188146 147696 139020 172333
8037 172333 125725 186093 208280 168731 48058 78039 155596 114934 7892 -47945 88285
8026 88285 213741 251970 239494 180967 108738 159133 199995 209911 204223 195887 147491 135407
8014 135407 82050 251196 387040 388288 478182 380322 336122 211534 116541 76889 97842
8003 97842 158637 163478 107186 191977 255741 259913 171013 205466 404101 598638 672345 725032
7991 725032 724077 591080 421095 340773 248996 212273 225314 237095 265312 343943 320427 314357
7979 314357 345840 239391 117661 -65306 -103629 813 187175 162601 149284 234107 261751
7968 261751 352541 263733 117437 164833 270166 290521 524807 568260 360878 268241 270492
7957 270492 318473 247745 388824 352990 306404 168596 100301 72938 60266 102745 221059
7946 221059 393277 465123 473050 373165 345222 341046 332763 392166 426347 335149 267436 339457
7934 339457 383898 352847 454458 447213 393867 466856 399683 301139 288453 296534 252376 193292
7922 193292 139455 104494 149675 124186 210180 287240 200595 182028 202470 137826 201746 145646
7910 145646 145083 178307 225793 327187 274203 192659 103203 54077 18334 -88227 -24100 49342
7898 49342 100593 149768 191554 124958 -18906 -118742 57810 151043 234198 246243 265705
7887 265705 336507 376954 387261 243998 245518 266284 300292 218410 262005 168122 191108 275338
7875 275338 279048 138026 141254 98285 60888 136765 170040 197190 69970 57485 72391 87681
7863 87681 37241 4632 -55099 -72024 30108 120750 249036 228222 164178 151770 74231
7852 74231 44127 142276 71314 -26395 -32842 -92778 -23623 198385 256430 235955 10121 -128690
7840 -128690 25683 78374 96664 71308 119361 42164 -36278 -70354 -32364 -73281 -56190
7829 -56190 -26318 -31499 10379 12943 104958 210710 197863 100994 110698 97411 97566 172742 238191
7816 238191 165430 -32482 -48483 -106972 -80195 -46782 -68995 11808 26592 57603 59668 -123143
7804 -123143 -233291 -212006 -127846 -41564 -10999 71848 1518 -180376 -182088 -183930 -219554 -281920
7792 -281920 -218219 -241060 -269251 -241846 -229543 -109781 33148 73789 938 -8411 3823
7781 3823 -8641 -24679 -29554 40087 -27279 -36106 -57544 -60784 -107386 -131747 -140471 -208957 -223805
7768 -223805 -282323 -223626 -107755 -62719 -43683 -224415 -236844 -184565 -112764 -19591 42699
7757 42699 40388 -124450 -154403 -72096 -55388 23967 48794 -17303 8482 153894 145523 -64013
7745 -64013 -215760 -190121 -106059 -72674 8240 -3359 -4701 427 124909 190513 105458 149426
7733 149426 27716 -81186 -45242 -50009 -127267 -96865 -72624 -178960 -188956 -87282 4179
7722 4179 -90340 -86463 -68224 -47108 40761 63311 4422 64681 50651 -45583 -68262 -72574
7710 -72574 -19833 33333 31648 -59627 -66181 -59083 -74072 37395 157167 215974 182201 126333
7698 126333 72585 -27946 -104970 -888 -24826 24198 64574 84607 178208 91859 4491
7687 4491 -57810 3591 -33745 -60886 -53528 -50654 -38490 39322 124608 180248 160871 89304
7675 89304 155892 193971 19909 -98038 -134623 -172978 -126669 -126371 -173040 -205958 -217483 -286293
7663 -286293 -238635 -122220 -8125 61353 170453 141399 126510 121828 115575 87922 97148 126430
7651 126430 74702 113118 160418 123736 6453 -25532 -35050 -66082 -64665 -87367 -158032 -108914
7639 -108914 -21811 170316 232923 129569 6675 -38294 -24345 37086 64527 101187 36043
7628 36043 -96125 -216080 -278333 -170426 43835 77313 -4720 -71756 -117392 -73491 -102141
7617 -102141 -177959 -181629 -211894 -157517 -189727 -357010 -241819 -30970 56869 117642 131120
7606 131120 183339 157498 -10549 -98244 -55410 56281 97311 5770 -125768 -107179 -15306
7595 -15306 -10167 -14161 28964 -19562 -6387 -76649 -125287 -124527 -4736 53246 23285 -28277
7583 -28277 -84223 -60456 20642 -2852 -12185 30197 104898 126389 70067 -25040 6872 -14400
7571 -14400 -92742 -171085 -101334 9081 59693 -18800 36670 43137 15637 124836 170475 69455
7559 69455 76494 67393 -55548 -65176 -86123 -60703 15739 11849 48406 52049 27218 -13229 28775
7546 28775 -43257 -65800 -10544 3830 -50476 -21602 85656 104819 77613 22588 -12965 -55658
7534 -55658 36675 35512 -37821 -7951 81719 57397 44766 58101 43968 11901 18146 39845
7522 39845 96989 133748 88533 7258 -6611 31624 -8399 -70018 -129939 -101627 -40088 14984
7510 14984 -19895 -44113 -20413 -23313 -62706 -48181 -10159 -82569 -257754 -246046 -332088 -393014
7498 -393014 -296886 -175824 30462 167772 186757 108454 188738 68744 -129595 -162792 -197219
7487 -197219 -198485 -178679 -17603 -33692 -56923 5244 27033 6879 -87532 -135971 -150161 -117651
7475 -117651 -150964 -129018 -2037 16017 -11311 -90724 -255437 -251089 -263332 -156589 -116848
7464 -116848 -109264 -62445 -129920 -149152 -125329 -70435 -97959 -178946 -217066 -23097 -1411 -43100
7452 -43100 -83302 -106447 -129543 -109269 -103555 -83862 -47990 100047 172636 115833 -30765 -2251
7440 -2251 131733 -95506 -208811 -93945 -30796 35623 50536 -41803 -63863 -78634 -31695
7429 -31695 97424 -5373 -150969 -54870 -38926 6015 16492 4612 -35259 -145109 -182497
7418 -182497 -188944 -894 93952 173117 154543 9280 -69866 -153563 -104274 -26961 -30631 16303
7406 16303 73043 -29254 -168345 -216236 -61582 -97252 -157850 -141909 -80782 -145332 -213582
7395 -213582 -252018 -192825 -49646 7096 2060 -22139 -126170 -233286 -291391 -232801 -114878
7384 -114878 -51259 -71968 -21778 60369 27970 -40013 -63142 12360 85129 165639 161833 81864
7372 81864 72712 183326 151497 122650 128491 56529 -48648 -77422 -136459 -141905 -91696 -117442
7360 -117442 -143442 -14270 105139 47033 -121087 -158562 -153142 -104172 -111497 -81853 -59205
7349 -59205 -30311 -30360 -61402 -35364 26822 16289 69908 85819 43954 -46376 -177572 -186007
7337 -186007 -95944 -96111 -105334 -104208 -106635 -102475 -156121 -183777 -133867 -63097 16074 152130 291349
7324 291349 235427 197116 140983 34633 -137466 -215834 -113355 7162 79038 -7161 -101896
7313 -101896 -170324 -185009 -141752 51833 -16469 -77532 -109296 -204638 -323619 -197003 -176556
7302 -176556 -192364 -131004 53879 75022 22274 -110341 -94200 -23034 -61850 7221 64035
7291 64035 57223 45113 -61949 -111047 -121159 -308411 -299385 -266444 -123830 -49790 -116207 -115337
7279 -115337 -235875 -84120 99216 110108 12893 -34025 -18312 30789 -78854 -104756 -53008
7268 -53008 -70332 -86330 -71362 -29009 -42528 -24802 -64865 -44016 53186 29312 -23653 -3270
7256 -3270 -128969 -229438 -267070 -128596 -148772 -145303 -90684 9268 124106 71452 -52034
7245 -52034 -157683 -158276 -46946 21502 121144 141052 111441 123790 176030 126693 -40608 -96521
7233 -96521 -162354 -83168 -7632 -26055 -161596 -232078 -204269 -242499 -154226 -3902 2117 -98398
7221 -98398 -186123 -232393 -233069 -171550 -53293 -71888 -76974 28434 46665 -3156 -57178 -16501
7209 -16501 51753 41659 63082 58030 78517 204988 82477 -3537 84355 105796 185949 158661
7197 158661 126293 106918 157653 124337 32909 -10659 3970 -68075 -45306 70424 169061
7186 169061 36442 -6122 89333 141233 57964 103471 60131 81241 137389 149942 130275
7175 130275 78165 104284 70374 -49502 -133420 -191024 -102613 -144706 -206825 -214258 -169417 -194485
7163 -194485 -218961 -195310 -78577 53389 25902 29972 98613 217630 150137 115534 202404
7152 202404 167241 140124 52191 -21314 -53324 -89581 -56400 -54312 -78968 -136284 -159454 -175414
7140 -175414 -122240 -152412 -268088 -279688 -181622 -197611 -213435 -173155 8400 38019 34915
7129 34915 52182 37032 -24671 -26715 8896 -117678 -80060 23563 46838 76286 54111 9636
7117 9636 64614 134405 121 16803 -52071 -97184 9123 2018 -144494 -191917 -196257 -200589
7105 -200589 -212178 -199560 -139825 -16149 84767 38296 7421 23090 102408 91211 80362
7094 80362 39775 -96728 -68410 -84293 -76707 -88636 -153898 -215190 -131397 46869 58163 -57009
7082 -57009 -68355 -81673 35597 45051 9844 19429 -26521 27685 -171300 -222650 -60343 69489
7070 69489 138580 151440 162045 224553 220592 267583 155445 -31693 21067 152404 276305
7059 276305 213637 40960 -86780 -87573 -40520 -37898 -56137 -87532 -126480 -100367 83470 -15137
7047 -15137 -150796 -122929 -42776 -61272 -122211 -86614 30827 57789 -41206 -68712 -27751
7036 -27751 9717 19845 26815 48566 5977 -5502 -51749 19692 45359 -935 49223 113604
7024 113604 155619 53531 -97880 -143158 -84159 -23646 -90366 -49508 35669 50081 -96648
7013 -96648 -76310 73209 172642 146434 34258 -20452 42750 53702 96384 124043 114152 89750
7001 89750 48939 29474 33218 86297 68567 57 -26198 -45899 -102008 -85973 -59729 -67946
6989 -67946 -17178 27087 62009 210032 289915 298589 314644 288866 263158 265339 121639 -35615
6977 -35615 13543 -22313 -97209 -198858 -187576 -116710 -38353 68531 67531 220693 155266
6966 155266 158808 200734 114398 11032 52161 42930 -2201 -136956 -206280 -161516 -95320 -83727
6954 -83727 -49976 -50082 -68410 -152676 -92301 -124803 -44911 85513 69758 134099 97299 163485
6942 163485 211530 200442 124531 106401 130866 -49961 -138859 -214687 -142293 -129858 10206
6931 10206 47671 -31312 -81022 -56345 -64611 6330 89225 36462 13808 53740 -19950 -54768
6919 -54768 25577 85957 72235 64201 132643 94178 74736 68531 13407 -22555 -60141 66903
6907 66903 68686 21214 44861 49085 -2759 -61617 43958 140027 115988 108291 33477 123130
6895 123130 155713 84541 146535 252941 145017 90142 182137 219013 9977 -77671 57226
6884 57226 213102 167789 -25185 -88708 -17696 -97168 -76428 -56216 -59113 -3556 27557 -61262
6872 -61262 -150222 -147484 -200898 -163877 -33153 -39706 -88706 -83153 -122186 -227511 -274104 -212858
6860 -212858 -140506 -135880 -92110 -50435 -28860 -31453 -57236 -52956 66806 129285 -97245 -180726
6848 -180726 -107210 -162217 -222449 -230969 -171762 -146409 -237331 -235412 -174760 -111982 -232668 -215834
6836 -215834 -116371 -116627 -165828 -134548 -195345 -145806 -104152 -58089 -45541 -44196 60274 100500
6824 100500 79585 116882 66463 -69563 -79223 -51846 -85643 -134019 -173829 -154667 -66405 7310
6812 7310 18258 -5815 -6301 77587 239939 143174 63029 -53845 -176460 -206945 -63727 65672
6800 65672 -26640 -105102 -107001 78986 203902 183677 230289 158116 -7651 -170128 -170421 -55693
6788 -55693 -44492 -37665 -65982 -11535 150189 128170 -5927 -40209 79810 -2057 -77746
6777 -77746 -43611 -14257 30061 71430 36118 77512 106557 12467 6572 -62356 -79293 -41795
6765 -41795 -174174 -120742 -50338 -39046 -54089 -52984 -7976 71842 143107 267094 235463 229752
6753 229752 56159 -73041 -133210 -222168 -256788 -157465 -119565 -240116 -255492 -110088 62683
6742 62683 123363 -8613 -48040 -22319 -82970 -130350 45667 148000 136039 80147 -19622
6731 -19622 -249959 -236092 -81136 -17856 54348 100099 84169 -25337 -142154 -93465 -88879
6720 -88879 19860 113614 191653 36457 26205 143368 157227 290725 570203 827620 1101924
6709 1101924 1242837 1224073 1172499 1017176 785618 472731 312586 231271 184453 70251
6699 70251 94612 152712 233620 196462 216340 177379 123883 112420 98140 118839 140434 207414
6687 207414 150608 187117 150642 103596 37620 66302 145643 57029 128348 223133 154172 111786
6675 111786 68774 -53573 -140501 -161912 -40848 83067 101938 -37381 -11377 26081 21203
6664 21203 -91648 -119036 -181649 -143322 31138 35184 63522 23190 -77442 -87285 -47928 19035
6652 19035 -32707 -65962 -48675 -99289 -40060 -42139 -220279 -300331 -138697 -1274 42094
6641 42094 10547 -29896 -70355 -147843 -197442 -196564 -144061 -76134 -70304 -9531 -93145 -95559 2460
6628 2460 38551 10164 -19088 30282 177364 168644 160260 109624 -96286 -9255 23895 -67163
6616 -67163 17914 57743 59993 81271 100191 17681 35300 91267 161545 220172 289558 320040
6604 320040 332882 309124 181808 230648 195098 80644 48323 -41975 -76006 -136685 -23366
6593 -23366 -58446 -103566 12675 -5829 36951 62281 -69959 -37016 2432 -11931 -138460
6582 -138460 -148357 -183355 -35005 74388 79180 -47631 -67496 -15201 31997 -27844 -141739
6571 -141739 -180822 -118797 -2399 84627 83618 -13447 14456 93040 65657 69397 28472 -29964
6559 -29964 -57347 -133296 -155740 -118126 -98436 75874 228394 163941 103516 163661 94837
6548 94837 -55378 2992 97174 102438 47735 89242 -850 -44526 -29857 -81192 -114341 -14613
6536 -14613 11850 38973 110542 40722 18222 88855 188467 160958 93993 -116003 -88186 64946
6524 64946 32131 94484 169341 287478 119301 1345 -23659 -136791 -194809 -165192 -96461
6513 -96461 -104647 -160142 -155661 -100910 -2371 48268 29584 28561 1681 -122355 -144261 -194735
6501 -194735 -58941 57331 6941 15431 -5612 -16044 -22200 32590 148923 148228 72350 101463
6489 101463 46784 78706 118484 140366 136414 82956 111425 15701 -86988 -29835 101271
6478 101271 120303 81698 -33601 -212034 -237414 -158831 -38341 -37590 -59308 -130200 -148613
6467 -148613 -180854 -121421 -159682 -189439 -241926 -160357 -83814 -54872 12161 -68007 -153094 -130919
6455 -130919 -120736 -37134 28566 -18251 -141082 -138136 -172961 -236051 -292655 -148717 -25081
6444 -25081 -26783 -56952 -126574 -269197 -359507 -408452 -340728 -257839 -101068 -63085 -184018
6433 -184018 -275129 -324506 -153304 -78001 -70926 -67771 -126181 -41187 -14905 621 -38219 -9249
6421 -9249 -27328 -846 100142 129604 17557 -53725 -134434 -156707 -104480 -3405 45688
6410 45688 21841 29924 -2590 106893 105151 -116948 -234994 -126802 -161011 -98248 -93452 -206638
6398 -206638 -179711 19671 49237 -9963 -89129 -57783 -28146 -72900 -85392 -80793 -89403 -103108
6386 -103108 -81416 21930 58571 39756 -122829 -221231 -172955 -149330 -120088 6964 60620
6375 60620 -11196 66661 -3696 23703 -20905 -73238 -36685 -87581 -143792 -142367 -201901 -150848
6363 -150848 10993 149331 69869 -114855 -142932 -291506 -270328 -94315 -22452 -64845 56167
6352 56167 121840 -272 -16559 -63627 -42026 -13497 30461 71326 -17903 -16813 77407 100485
6340 100485 105389 39370 -105975 -127706 -26471 38329 -21482 -140210 -136323 -40817 -6965
6329 -6965 -74036 -118614 -113220 -147678 -98848 -3755 20945 -36997 -54463 -135899 -93713 -24043
6317 -24043 962 -128387 -240343 -193642 -109229 -141263 -84555 -93429 -76799 -15310 -61021 -27197
6305 -27197 -10091 50359 -6645 -22193 -47667 -213373 -175019 -54277 -104319 -45928 52973
6294 52973 93195 111878 40587 51553 66540 13188 -68785 -114230 -17259 -70564 -94626 -34003
6282 -34003 -159390 -128939 49699 127037 91531 18 18539 -75534 -8861 -15677 68215 108211
6270 108211 128128 73311 38914 60351 57192 96592 88761 19051 -59913 -122089 -40072 2471
6258 2471 -74752 -89338 -79449 -51341 -76981 -23768 -12996 24943 -9323 -114657 -111686 -121176
6246 -121176 -52601 -63361 -28591 57302 142385 258573 252729 285627 162773 104283 92046
6235 92046 59319 31501 45571 53920 -46031 92739 154578 44268 -40528 -144491 -47311
6224 -47311 89209 160981 181712 213298 144416 112716 80368 140501 295776 287908 145146
6213 145146 -36109 -104887 -92831 -196938 -280988 -215242 -41459 36703 13691 29473 11197
6202 11197 -33208 -54470 -141300 -273349 -171364 -130699 -255221 -173175 -112776 -166711 -203391
6191 -203391 -182321 -88284 -41505 -102280 -157583 -137973 -112978 -82703 -191277 -296744 -359034
6180 -359034 -267420 -237689 -104940 -185886 -134976 -19762 16835 -6440 -96498 -96450 -130911 -131290
6168 -131290 24277 -15623 -177889 -175415 -122561 -76079 -82701 -107939 -5386 73800 -13889
6157 -13889 -56201 -53380 -127750 -218537 -248497 -237236 -130119 44023 29751 19229 -124486
6146 -124486 -264187 -248226 -239134 -178241 -120053 -63340 8048 -46060 -134686 -133074 -137946 -169241
6134 -169241 -85066 47766 119519 50778 -33347 -58591 50270 -67470 -77747 54721 161898
6123 161898 256191 128953 119059 97489 8327 -42142 -2477 -4847 5931 -62595 -156971 -147368
6111 -147368 -195199 -160237 -90603 -105499 -177289 -169083 -148399 -142399 -94902 -83199 -59491 35509
6099 35509 89561 173240 143776 62952 33041 41672 126981 93326 104012 95078 84565 138925
6087 138925 152803 97470 38891 -6890 71384 13312 -24054 -153971 22527 140976 199712
6076 199712 84602 -51160 36848 -20276 -69735 -97242 -106196 -125719 -156632 -122488 -58568
6065 -58568 -127849 -351805 -337639 -138604 68700 48450 -17148 -161507 -91933 54242 -11529
6054 -11529 -70081 -1260 171651 174482 115945 139213 118325 67206 -75609 -127029 -89308 -75441
6042 -75441 -103834 -90206 -23341 -15737 -43270 -32802 -109774 -54816 124969 120607 17881 -74485
6030 -74485 -119313 -77823 -11114 -25607 -14899 -64944 -50776 51879 67619 21694 -47163 -7601
6018 -7601 -10091 -8523 53929 132992 172094 169460 159998 280334 302264 159624 43490 37679
6006 37679 92832 82757 98220 55673 -14711 -88803 47501 141562 -31026 -74384 -37884
5995 -37884 -93822 -109507 4584 20776 -26332 -9664 90144 157333 54812 97568 64336
5984 64336 99814 135347 95637 27275 48238 -67732 -45534 72205 167614 107525 4073
5973 4073 -130889 -133476 -34238 114690 134153 2020 -163731 -289320 -234414 -277743 -218059
5962 -218059 -73369 80331 15893 -78773 6222 23754 -15544 8321 40092 -9175 -17677
5951 -17677 -238267 -174618 -119450 -136422 -75745 -98587 -150877 -224116 -222207 -235204 -169373 -142821
5939 -142821 -36652 26672 -2912 -68804 -122791 -61636 -18662 -64855 -80986 -114535 57886
5928 57886 102300 114342 187928 92659 111119 8921 -78766 10491 24302 4037 -63886 -160833
5916 -160833 -131751 -190538 -207036 -155924 -190792 -153971 -84299 -100294 -61479 -98050 -86226 -63658
5904 -63658 -56336 -72105 -75459 1674 -27975 -108215 9256 66633 53038 20482 -86834 -200764
5892 -200764 -115044 10734 65205 113918 52280 87703 174650 241029 190846 107917 -4078
5881 -4078 -24546 44156 -58363 -97685 -13880 -58633 -77876 -107859 -118380 -149105 -90880 -35361
5869 -35361 -133635 -185550 -133387 -102505 -64329 -76203 -82009 -130339 -273513 -181037 -23654 127713
5857 127713 110179 31740 -34772 -56351 -55668 -16375 -15011 -32765 60097 143086 146309 154872 49402
5844 49402 -18987 -9577 -87346 -109648 -124793 -147383 -138701 -101074 -93324 126698 274068 184139
5832 184139 169872 119867 101997 281717 174270 126296 115768 -62775 93495 112869 -34318
5821 -34318 -135913 -193411 -195238 -168161 -162572 -35057 -950 -116803 -99882 12394 43069
5810 43069 -105683 -161293 -89663 -44757 -138186 -260001 -178614 -101464 -88784 -118324 -195562
5799 -195562 -219784 -41965 -4199 -42614 29727 34448 57876 95403 128140 122998 127413 177252
5787 177252 226493 194458 161284 27650 -70444 -37055 -119812 -51541 33447 18601 -77664
5776 -77664 -18648 76960 32814 5932 46366 117780 -33482 -45312 -100306 -55092 -35278 37381
5764 37381 116474 69166 -16838 -611 3624 -6617 -23204 -83708 -147610 -100429 -4339 125833
5752 125833 207597 197592 137033 205055 125166 -116648 -259261 -183046 -211807 -61717 49468
5741 49468 92131 88543 -7409 -41856 54508 7566 7711 33312 40168 -17385 -7847 34482 79888
5728 79888 75502 -39939 -67115 34123 -68481 -107057 -26553 -6902 -97364 -111248 18619
5717 18619 142147 194305 69249 28053 102069 183331 173992 72661 71382 104315 196939 144088
5705 144088 102935 14789 -33963 -64938 15720 100297 22339 -26797 103385 40900 23828
5694 23828 72509 -35670 14550 -26968 36766 11929 -115708 -268681 -279724 -160245 -35545
5683 -35545 -99716 -167779 -132946 43312 21489 -39237 -66892 -94458 -108068 -86218 41033
5672 41033 117636 103241 22490 -95615 -54164 718 -1469 15645 3658 117098 175556 127660
5660 127660 -60279 -124648 42769 61035 3382 -10171 7766 -8689 -4890 -34838 35666
5649 35666 49511 25873 -57511 -30252 -17033 -135330 -343641 -301608 -136974 127011 212859
5638 212859 130576 -83498 -149934 -153730 -177562 -88131 -13134 8178 54879 157950 160437 144811
5626 144811 167574 212863 182974 154661 193264 149660 68427 -37397 -61848 -119998 -143398
5615 -143398 -187799 -137891 -203114 -171943 -118211 -121871 -141189 -145066 -176639 -85566 63385 83434
5603 83434 66110 75724 5063 -7170 -72902 -123355 -116905 -221056 -186129 -143254 -273869 -311380
5591 -311380 -214948 -150660 -220656 -207809 -140800 -67967 -71465 -30096 -101588 -24388 -56222 -182785
5579 -182785 -85218 -38718 -166599 -200098 -104935 -132279 -308247 -272494 -160481 -97993 15499
5568 15499 -108234 -39977 149618 189035 114788 21663 -26763 -117706 -86595 -38614 -119520
5557 -119520 -110070 -77998 -5733 -86292 -194593 -173159 -225344 -188794 -216825 -121276 8061
5546 8061 97834 156226 146552 18997 -48022 -40067 70015 86799 141996 142274 10023 -79046
5534 -79046 -158866 -157630 -177361 -184924 -114079 -138984 -100394 -4574 -20035 -22180 -94972 -89705 -120006
5521 -120006 -138475 3301 -52326 -34533 43865 43984 -73308 -96467 -6565 -71811 16012 191228
5509 191228 152680 185944 162403 33858 -83574 -57342 -74108 -41032 -113618 -162283 -128407
5498 -128407 -179396 -156425 -78188 -74836 -140023 -151389 -99798 -85272 -113290 -194785 -267903 -236381
5486 -236381 -213506 -168793 -68746 -55244 -201137 -331907 -287912 -221905 -158461 -151164 -125936
5475 -125936 -79809 -69265 -78443 -70617 -40223 -79584 -44481 62693 -78242 -113050 -97545 -63921
5463 -63921 -4991 -9942 -32508 -3630 108240 119866 16090 -18933 -47457 -151343 -238117
5452 -238117 -238554 -38256 74935 44895 3030 1765 70019 106059 152639 152636 41630 -103081
5440 -103081 -115941 -190566 -215602 -140376 -152111 -114414 -186192 -73368 38984 113836 42545
5429 42545 -95352 -181113 -108222 -109891 -129476 -119053 -165831 -181127 -88755 -124530 -54325 65167
5417 65167 22966 33440 116152 28187 37823 33022 66701 -78473 -158891 -143774 -98789 -129698
5405 -129698 -129004 -44591 102596 221117 323931 295869 193803 33775 -29474 -149268 -269831
5394 -269831 -191355 -71402 -21463 -39555 -97992 -78273 -66985 -65594 10551 52634 56094 -84410
5382 -84410 -71635 -6795 8357 -101136 5124 -15247 -114605 -69164 -12894 -40979 -563
5371 -563 69408 141181 136228 120355 209070 186487 -65920 -225790 -268527 -164989 -2710 -31110
5359 -31110 38734 10752 -71831 -75711 -17700 -99560 -103113 -71107 -68876 -179889 -200151 -78612
5347 -78612 -300 10350 10251 -55479 -83942 -27861 17764 -11303 -72506 -59268 13725 33453
5335 33453 -10292 -78783 45423 -19913 -94542 -112052 -148629 -75193 1718 -47332 739 75955
5323 75955 41369 -89744 -26197 -11818 96952 -23664 -60777 -135020 -176417 -48435 -6231
5312 -6231 -65221 -83272 -26352 -73458 -75006 -93221 -149257 -227000 -199732 -148912 -67475 -125368
5300 -125368 -190669 -211921 -142511 -86772 -112383 -76052 -15694 -24749 76306 209046 187078
5289 187078 90137 -11829 -94969 33 -8813 -28349 16431 76036 109779 137093 67617 98582
5277 98582 117400 78018 81708 -28204 -42654 -90159 -152371 -197863 -176879 -159808 -63317 49996
5265 49996 -52167 -93764 -177454 -100866 3036 7110 -66585 -42822 -66811 -64181 16279 113572
5253 113572 115206 70610 137192 44099 -21136 -2554 13684 -172040 -87414 40727 -16436
5242 -16436 10971 152236 119580 87388 10185 10446 105754 46819 -75040 -106930 -132522 -144124
5230 -144124 -80385 -68670 -172499 -236476 -123271 -131301 -122561 -97813 -16150 52699 50618 9499
5218 9499 -93599 -86475 32856 106318 206375 122196 63913 629 -11545 -4266 49399 -2050
5206 -2050 14961 -10510 -65200 -105544 -156858 -83149 -69370 -179961 -153498 -68025 -34377 -112883
5194 -112883 -86592 -54577 -49975 24243 144188 169122 4690 24327 -39166 14700 127888
5183 127888 108734 -16630 -103634 -225561 -244387 -55291 102504 -69275 -124478 -22909
5173 -22909 -34256 -57150 14331 3341 492 -11857 69068 185318 219466 218680 78057 53212
5161 53212 94419 113523 3551 -6143 28860 -13591 -66576 -46319 -81863 -63857 2674 23500
5149 23500 -19773 -104874 -120704 -224199 -126597 -34442 10174 -170026 -156407 -135943 -145853 -196491
5137 -196491 -130339 58552 78491 85571 -32969 -211924 -165005 -166084 -183252 -127603 -58405
5126 -58405 -43093 -46612 -105231 -83596 -52615 -33871 -93506 9553 168950 93612 -13959
5115 -13959 -91269 -69133 -57721 -102861 -194096 -172876 -151730 -95130 -57277 7496 31324 136398
5103 136398 141945 -2756 -3958 17358 46131 168293 204102 151042 62538 -229 -77679 -80993
5091 -80993 -26651 -73731 -97178 -39879 8469 1427 6448 36587 16410 19522 31275 -36336
5079 -36336 6752 -88569 -96530 138921 144240 91519 49498 15060 -71721 29605 -4416 -17262
5067 -17262 52771 129724 24698 50221 47777 -38812 -35780 -24890 -93905 -143913 -29295 85972
5055 85972 26877 35208 1511 76746 97461 191826 66252 12390 70564 73089 -31023 -15674
5043 -15674 8650 61601 21952 -52174 -92572 -77686 -59431 118054 96358 33760 -59696 -55621
5031 -55621 -100391 -171325 -195785 -110217 -140263 -172162 -19955 23532 73919 -54926 -118201
5020 -118201 -140561 -177799 -192914 -116504 -110146 -74140 -44507 22215 35852 -28514 -44590 -11408
5008 -11408 -31637 44866 109459 163670 253787 168090 82948 75728 -25762 -121080 -229743 -165422
4996 -165422 -115894 -25196 -67861 -122574 -208289 -199116 -112481 -141772 -129295 -13010 140754
4985 140754 168955 118848 -9538 -20501 96289 95581 169200 125159 126536 50667 -56833 -836
4973 -836 66377 66113 91069 63269 165119 196154 102524 34031 -85042 -122064 -124701 -278273
4961 -278273 -411158 -379599 -283743 -268907 -179601 -44123 153803 81472 34960 -116222 -165767
4950 -165767 -65708 33152 -51411 -139703 -72347 64433 114261 152438 165487 81682 182608
4939 182608 79527 58502 -40764 -19393 -108342 -159882 -260730 -244953 -133928 -103429 -81662
4928 -81662 -61378 -31263 -109921 -51444 62866 84366 74136 112057 52838 -7496 -52248 -56210
4916 -56210 117881 115412 79062 23891 -6495 84614 203953 55558 43775 45293 105033 167446
4904 167446 139085 128535 154438 152380 125178 55781 -55792 -128078 -200787 -103729 -104311 -52109
4892 -52109 -9120 4409 104648 99421 50239 149161 85142 -34809 -101750 -22395 122041
4881 122041 -24422 -175913 -205077 -113977 -146407 -157926 -149909 -95695 -140536 -100989 10994
4870 10994 144327 147540 44581 10817 11905 -15538 17317 -35573 -47754 -93145 -107051 -45763
4858 -45763 -73109 -149150 -218196 -121146 -84065 -117330 -141182 -186606 -85270 -87765 -186137 -148110
4846 -148110 -124076 -138682 -158311 -50220 115957 74490 -45317 -48407 -127171 -240640 -242195
4835 -242195 -80555 -20578 -11865 -143154 -235237 -183361 -168938 -115504 -95048 -136930 -137548 -84146
4823 -84146 49237 114718 94102 187488 285870 171590 88006 -22689 59944 114343 58280
4812 58280 34599 109873 75207 71395 -74592 -99755 -98624 -116740 -160437 -137912 -90798 -171629
4800 -171629 -242271 -225453 -94081 186481 122884 24202 -114223 -176719 -140919 -163581 -172992
4789 -172992 -153151 -93410 -75723 -44428 -66498 32540 45606 125279 36743 106666 143117 33318
4777 33318 3984 -5652 -6327 -42482 -129685 -202375 -111452 -72755 -76154 -13455 34559 112870 177511
4764 177511 207654 64472 67346 151840 180133 213073 157889 129306 141089 100042 49303 7321
4752 7321 12626 61522 100950 49062 42649 9586 -6264 -29550 11788 -77227 -53079 -82050
4740 -82050 -119410 -285082 -304374 -191411 -199718 -244288 -155396 -110430 -137695 -133474 -222214 -393003
4728 -393003 -390645 -251594 -1255 106789 76211 19806 -7298 52095 111193 -20126 -135567
4717 -135567 -140955 -110236 -60713 17929 -25151 -78678 -5852 -12448 -36186 -11460 -27137 -12676
4705 -12676 70155 67190 -83598 -170756 -140933 -105094 -82666 -12836 76638 34767 -74327 -37561
4693 -37561 2877 27271 -15032 -49721 -118636 -86647 -24387 -47541 -179624 -195941 -132002 -97096
4681 -97096 -149327 -32578 14642 -70491 -92506 -213153 -216052 -94096 -24083 -15975 -121868
4670 -121868 -209689 -193013 -84184 -76372 -91314 -28222 -76067 -189948 -220146 -167289 -139954
4659 -139954 -84691 -211384 -173960 -7001 19401 21454 6778 -1669 37723 -5527 28147 150691
4647 150691 99063 -42317 4046 126252 111744 29647 -87005 -55752 -6105 45102 121084
4636 121084 55346 73130 55637 -4061 15763 177249 161117 62455 27485 -19302 16402
4625 16402 -10240 25208 68293 2171 -23060 -140692 -232041 -188487 -110949 -79920 -44552 38115
4613 38115 45024 52982 52823 172723 281082 310471 263502 253339 174829 104601 97849 66964
4601 66964 -12229 -137886 -114293 -19801 -129002 -129173 -35393 27095 33615 -27917 -110843 -153896
4589 -153896 -239969 -229628 -167947 -97778 -86013 -47822 -23438 -64790 -71135 -25047 33667 38717
4577 38717 101850 -49246 -140786 -116498 -167609 -93548 10783 58788 56584 137225 166570 25086
4565 25086 -52916 -23653 150556 188272 5734 -52633 -34335 18364 -43273 -125861 -101234
4554 -101234 -95666 -62630 30363 110152 62639 -27867 -28810 -98395 -100414 -101584 -72614 -128759 -91998
4541 -91998 12713 3032 39410 18109 -59113 -22991 17416 60445 -14812 25103 91036 157724
4529 157724 240095 186356 154396 171545 49617 114025 73430 -112338 -105371 -29356 -46963
4518 -46963 96503 142894 102439 -32435 -140891 -82498 -121918 -52958 70204 143719 105711
4507 105711 59969 59957 31096 100452 90499 31879 -71718 -103087 -14911 6684 82589 184576
4495 184576 209253 84645 -155511 -207632 -101199 -91547 -132990 -99010 16181 22059 4406
4484 4406 -42257 -44154 -48560 18039 71862 102120 8966 -53295 -167140 -239435 -127834 -72266
4472 -72266 29443 11354 -50889 -37467 70459 130381 95808 29338 80293 195202 209525
4461 209525 128844 48417 73161 -27316 -223311 -239859 -154261 -185116 -242192 -195746 -197551
4450 -197551 -131715 -90804 -45718 -81582 -126328 -157829 -153736 -96255 -103300 -46036 -56324 -64546
4438 -64546 -85665 -148848 -145594 -5282 -3646 72727 90011 26545 -19054 -40999 -79767 -116341
4426 -116341 -181810 -162049 -115998 -130516 -214533 -272181 -157746 959 -100823 -41880 -17022
4415 -17022 -20944 1624 -54070 -10852 62298 37378 58916 92293 49846 -91257 -23963 5757
4403 5757 -52552 -61812 -41343 72155 -71462 -213546 -152319 -73355 37893 131766 110266
4392 110266 99856 22223 -87328 5785 103095 96387 92119 40261 -90442 -134700 -168121 -197551
4380 -197551 -212157 -217295 -118583 -82971 -31116 38556 101106 84826 -35640 -130273 -139590 -79673
4368 -79673 -16549 17869 97950 7641 -48278 -27668 -36947 59527 -807 690 -16274 43075
4356 43075 143469 63388 -34361 -51237 -153719 -241727 -145998 9541 -20844 -113761 -65741
4345 -65741 30108 9112 -49813 -44952 -35196 8118 59712 163579 77538 32394 116272 128084
4333 128084 21358 -7674 -62741 -75460 -33887 -27654 6465 96618 66512 6953 17582 9345
4321 9345 71539 63601 110010 81905 -30109 -78007 -131267 27135 187319 -46266 -148919
4310 -148919 -151728 -97595 -25444 -11317 24048 -51300 -40222 -175050 -222162 -124071 -62385 -74265
4298 -74265 -232957 -283726 -279478 -251728 -124509 -31654 55628 -42938 -115392 -113416 -52654 5437
4286 5437 8792 -12853 -16169 -18027 -74813 -80831 1354 -102859 -96224 11360 83636 45611 -63785
4273 -63785 -42051 -7570 74675 136322 92628 -62341 -52679 -61196 -18608 81237 146684 103370
4261 103370 17702 -3626 -8140 -35268 -107219 -68229 42013 7128 3693 -59777 -33350 17815
4249 17815 735 42288 31453 -7594 -99454 -87506 -89733 -195357 -87251 -27031 -62435 -35926
4237 -35926 -32061 -101579 -156851 -174627 -165602 -215152 -224011 -43593 7757 -5870 -87244 -52043
4225 -52043 106926 40569 -75129 21796 61601 39832 76577 135975 190229 107615 9791
4214 9791 -1276 61141 120607 99742 51778 52819 10340 24677 81685 87027 -33423 -149013
4202 -149013 -91843 -97998 -119139 -79940 -155154 -201205 -73766 -21426 -75184 -81486 -78894 -3937
4190 -3937 35564 29846 60480 106046 -41143 -14753 -39875 -39010 74468 -5305 -172895 -144028
4178 -144028 -107923 -105473 -104185 -7258 -20770 48893 55596 1764 11869 -72956 -142469 -134023
4166 -134023 -111659 -103232 -116982 -150671 -252440 -175554 -1682 -56782 -123163 -53211 -41933
4155 -41933 -76535 -69130 -7798 61928 75270 33795 -16648 -48038 -125977 -164305 -128227 -109344
4143 -109344 -73886 -121514 -156718 -119793 -4309 50904 85536 76544 10434 35914 -4560 85567
4131 85567 48547 15721 -99452 -167689 -117488 -82025 -68839 -132911 -151676 -136568 -51254 62838
4119 62838 22330 -61512 33186 140395 80335 -108098 -152129 -119822 -36223 -992 -69272
4108 -69272 -59444 41101 1206 -28248 3351 177282 184130 25718 11974 86875 134976 169186
4096 169186 294406 265969 52571 -24019 -3069 97622 141459 231655 145397 -5160 -100313
4085 -100313 -41908 -40281 -87068 -132540 -202641 -196135 -60638 -60033 -110975 -71036 -88690 -182589
4073 -182589 -181992 -110532 30679 95214 99680 64756 104298 103333 76945 128192 90735 6760
4061 6760 -14814 -25753 -158051 -145171 -71588 -73831 -15185 58135 33372 11103 54347 57356
4049 57356 -23974 19238 120635 48057 26829 78028 -1801 6487 -53767 -119466 -228582 -210697
4037 -210697 -169397 -147433 -184332 -138925 -182321 -222799 -210250 -166484 -82456 -52136 -11657 -67117
4025 -67117 -71144 -130748 -113179 -104371 35242 161711 53808 -30141 -21652 -50691 -46286 -131742
4013 -131742 -35545 91550 125635 32146 10389 154661 102916 21981 -1341 76130 67233
4002 67233 47769 -19463 -15024 84407 -14624 -74062 12177 -20725 -214526 -306411 -259116 -141541
3990 -141541 -142353 -149157 -73769 -112122 -119751 -101618 14006 129440 23435 108188 140947 96096
3978 96096 91671 34715 -12236 -54337 -88788 -30208 70941 24846 -2449 -34466 80594 444
3966 444 -17999 889 -26140 -73971 -66410 -72272 38354 3548 -32466 -982 -125500 -214148
3954 -214148 -245287 -182796 -175378 -179356 -62940 -29359 -37760 -132764 -68454 22115 -17048 -22180
3942 -22180 -4393 -89500 -165615 -126838 -168520 -86620 -69126 -115996 -81378 -36894 18161 44091
3930 44091 44882 -8819 13951 10351 19159 99514 217785 290671 157114 101862 100742 63664
3918 63664 41704 8891 -26201 -23400 -114319 -68489 -132072 -188507 -42159 -61557 -137081 -96308
3906 -96308 -102771 -69658 40370 96168 84002 17380 -25771 -31825 -15087 -25419 -4173 51833
3894 51833 118945 206584 90932 -41435 -85939 -34435 -48813 -179992 -70129 51077 64026
3883 64026 37847 7724 -39673 -124765 -99609 -30339 -159192 -227915 -129855 21442 116854
3872 116854 114791 82772 28505 23830 81469 166939 102628 33152 52341 -71795 -65832 132852
3860 132852 166614 200604 156468 52640 49410 18521 40131 58236 -19821 -151922 -107018
3849 -107018 -10408 79537 100796 43967 -3441 42978 22572 90349 -37671 -45883 30364 8346
3837 8346 -22303 -38829 -94790 -63544 32363 37309 24166 -42951 -135557 -170112 -176044 -119566
3825 -119566 -49382 40312 8593 -86097 -133354 -178790 -112963 -70223 11874 104554 230433
3814 230433 206633 86192 -11675 -79857 -42621 -23715 -415 -45981 22041 35592 28795 69743
3802 69743 -33952 -174538 -150252 43232 169351 136527 108261 137506 105891 -7678 -157450
3791 -157450 -217278 -108119 -111699 -156150 -206275 -149105 -120959 -84190 -93648 -74937 6270 37424
3779 37424 -18539 86128 131949 61872 14185 59628 112481 40770 -59399 -48763 -66647
3768 -66647 -70081 -42039 -109114 -220253 -189435 -95680 -24195 -24191 56444 23357 -46182 -109500 -18797
3755 -18797 116591 104180 24739 -24974 60342 70889 92384 104090 124727 68395 97878 68071
3743 68071 7447 -2238 -50173 -133182 -119615 -59925 90506 11747 -85639 -87566 -25782 -35443
3731 -35443 -106496 -105014 -121629 -219665 -158262 -160251 -115225 -57001 -36195 -27054 -100131 -114054
3719 -114054 -37125 -42435 -43973 82692 80493 80823 102715 111939 110320 143204 149088 94588 32016
3706 32016 119287 79752 -4653 44367 98994 64753 -14423 -54817 -121398 -120298 -83670 -108151
3694 -108151 -181022 -129910 59372 -5952 -115036 -140758 -186612 -40992 21309 -23565 -54776
3683 -54776 -86799 -140383 -219084 -235533 -173331 -66258 -30035 -240457 -354643 -249266 -196029
3672 -196029 -213230 -211617 -238634 -321642 -383793 -325676 -200469 -90813 -62582 -88541 -135449
3661 -135449 -136961 -70727 -4727 -38952 -767 283 -28546 -33265 98724 201375 188689 45950
3649 45950 34076 91432 81896 23433 -42225 -96281 -181662 -64936 9114 -17150 -37518 -7753
3637 -7753 58516 59342 88847 36197 21793 158703 127937 -48566 -11237 3810 -108518 -83590
3625 -83590 -22992 -16040 -29080 60209 32588 21177 -106899 -104771 17387 65259 -52944 -231437
3613 -231437 -235110 -120138 -78452 -92566 -27999 11890 -16340 -75934 67208 107401 -100917
3602 -100917 -106896 14965 97850 110478 22393 -28487 -28958 -35362 103404 129594 -4415 -15565
3590 -15565 -155730 -70459 -35114 -46703 -15950 -35405 -26367 -20700 102924 103964 -4494 103409
3578 103409 118317 -9012 11444 85868 8270 -21262 -59477 -147847 -275599 -182813 -50391
3567 -50391 -5725 -17248 -62615 6290 77435 103182 110246 88324 102444 190374 171064 72963
3555 72963 43803 51059 -141816 -150194 -84064 -20322 -124243 -163023 -109712 -145467 -187025 -73925
3543 -73925 38386 112874 172788 151480 203411 143171 72827 39362 167354 152646 81502
3532 81502 -87541 -109278 -49038 -29589 -87057 -40971 -44481 -67296 -121662 -95451 -118050 30045
3520 30045 26441 -18200 -108348 -270080 -231441 -159110 -81726 14561 169838 27981 -62200
3509 -62200 67130 153860 244271 272815 135791 80521 76869 50282 52751 54049 -6633 12502
3497 12502 145132 125047 117117 178455 177175 131683 188103 188260 182254 43148 -71263 -9990
3485 -9990 2439 141458 138105 3149 -71724 -84914 -68917 42565 17998 -73332 -42002 49701
3473 49701 1810 -133191 -157329 -59485 -62082 -25939 71944 44532 -3720 -67864 -40703 54762
3461 54762 184073 146348 17448 -93082 -129923 -160650 -53504 -140343 -95017 77702 36330
3450 36330 -286 -3204 19184 77848 97960 160352 191986 60794 -41316 -17812 42422 -107838
3438 -107838 -201418 -72452 -66842 -120774 -110497 -9751 -32126 -158057 -181936 -110993 -134804
3427 -134804 -38185 121743 126777 78429 6730 -147415 -263520 -301424 -237991 -155680 -33325
3416 -33325 40064 -48490 -132499 -141135 -108601 -25082 37464 3256 -260984 -228571 -91730 -49068
3404 -49068 -76211 -155175 -139163 86198 28621 435 16607 24475 72640 26419 92591 135184
3392 135184 116995 123404 60173 89217 54319 -15969 -167316 -229301 -135347 65215 59899 -138837
3380 -138837 -251671 -140327 -163691 -212043 -73990 20129 148867 81853 18002 37356 105063
3369 105063 49160 -29790 -46170 -164343 -273391 -199880 -188682 -159584 -218335 -207550 -231678
3358 -231678 -215386 -134267 -13028 -66855 -74702 -65250 22585 16755 -54476 -17430 -104804 -57772
3346 -57772 74594 19330 -30710 -10482 -57646 -29001 100017 182932 90916 28554 141186
3335 141186 251488 154449 117037 132289 130055 179523 60501 54463 83514 96081 20548 85619
3323 85619 204010 201599 174710 115506 153899 122836 53958 69623 140207 140280 143246 195199 83928
3310 83928 57665 210700 191248 66105 -167847 -301695 -246161 -140227 -46538 7747 55064
3299 55064 -45311 -112894 -59279 -78930 -17710 -56984 77696 92979 15879 -170996 -218321
3288 -218321 -156726 -133711 14934 210103 207308 183672 268222 279287 136284 -25480 -109581
3277 -109581 14479 30404 -45465 -149578 -119565 -90653 -10852 19402 -45837 67250 84723
3266 84723 -11963 -1967 -4268 55082 160148 90591 117546 92234 68643 74231 -36834 -9090
3254 -9090 37777 4710 -63068 -80591 -72327 -95413 -60985 59024 83592 54927 -39037 -72718
3242 -72718 -77511 -186356 -155306 -101232 -150431 -107888 -73433 -150208 -76905 -48040 -94426 -37137
3230 -37137 -133324 -174199 7655 83995 68271 68467 33428 -58525 42183 118477 107676 40641
3218 40641 -832 34044 18505 -34366 -68781 -23602 -42222 -123212 -166376 -106101 -74896 -177675
3206 -177675 -99824 -71052 -31590 -22739 45287 137975 126944 60222 11475 -26994 -51164 -177942
3194 -177942 -179500 -176562 -95348 -27307 22801 -17912 1548 14446 126438 202998 71642 24619
3182 24619 1771 9033 -54295 -124103 -102063 59711 66697 28155 -81590 -168033 -88175 -15556
3170 -15556 40403 41425 59693 185161 241198 67559 2840 50814 47250 101560 37704 46428
3158 46428 83886 95754 179438 325511 232939 51900 -15153 -56600 120553 181704 114337
3147 114337 63686 170296 274564 433902 417808 312159 133539 57883 211119 359700
3137 359700 275235 265856 324826 193533 167390 250638 185707 54943 18426 -15396 80067
3126 80067 123982 -7520 -31882 -68761 -166707 -221459 -199299 -208523 -88826 -89430 -94768 -2323
3114 -2323 127095 233797 174302 99139 54368 -2038 31699 29356 85133 137997 -35847 -97128
3102 -97128 -110945 -39136 32674 24714 -19788 -103095 -228910 -321452 -115188 41730 7296
3091 7296 -39554 -22172 -123298 -102597 -52428 -33441 -70804 -179831 -188594 -260307 -166517 76239
3079 76239 262948 103863 -12226 -225820 -302858 -226523 -196114 -171524 -93841 4724 -33705
3068 -33705 -92624 -35591 -52270 -124297 -29474 26377 -84133 -102154 -104652 -136856 -33233 176
3056 176 -39272 -52450 -84088 -66016 31843 -3534 -201659 -233161 -250704 -252397 -39892 -17563
$$ [...]
##END NTUPLES=NMR SPECTRUM
##END=
