##TITLE=Analysis number 315636
Compound Code cc 43109
Book Reference 414/150
Project Code adrs
Chemist Name mattw
##JCAMPDX= 6.0         $$ Bruker NMR JCAMP-DX V2.0
##DATA TYPE= NMR SPECTRUM
##DATA CLASS= NTUPLES
##ORIGIN= Bruker BioSpin GmbH
##OWNER= NMR
$$ XWIN-NMR		Version 3.5
$$ Fri Nov 25 10:27:26 2005 GMT Standard Time (UT+0h)  MAYBRIDGE\NMR@NMR_250MHZ
##.OBSERVE FREQUENCY= 250.131544655141
##.OBSERVE NUCLEUS= ^1H
##.ACQUISITION MODE= SIMULTANEOUS (DQD)
##.ACQUISITION SCHEME= undefined
##.AVERAGES= 16
##.DIGITISER RES= 18
##SPECTROMETER/DATA SYSTEM= dpx250
##.PULSE SEQUENCE= zg30
##.SOLVENT NAME= CDCl3
##.SHIFT REFERENCE= (INTERNAL, CDCl3, 0, 16.522)
##AUDIT TRAIL= $$ (NUMBER, WHEN, WHO, WHERE, WHAT)
$$ ##TITLE= Audit trail, XWIN-NMR		Version 3.5
$$ ##JCAMPDX= 5.01
$$ ##ORIGIN= Bruker BioSpin GmbH
$$ ##OWNER= NMR
$$ C:\u/data/dgb/nmr/ADRS/13060/pdata/1/auditp.txt
$$ ##AUDIT TRAIL=  $$ (NUMBER, WHEN, WHO, WHERE, WHAT)
(   1,<2005-11-25 10:27:03.13 +000>,<MAYBRIDGE\NMR>,<NMR_250MHZ>,
      <created by zg, POWCHK disabled, PULCHK disabled
       configuration hash MD5:
       62 19 C7 07 E1 42 D1 B7 37 6C 3D D0 77 39 F9 E6
       data hash MD5: 64K
       7F 8B 1A E3 B2 66 4E AA 73 5A E2 C8 14 73 6C B0>)
(   2,<2005-11-25 10:27:15.81 +000>,<MAYBRIDGE\NMR>,<NMR_250MHZ>,
      <Start of raw data processing
       ef LB = 0.3 FT_mod = 6 PKNL = 1 SI = 32K 
       data hash MD5: 32K
       89 59 0C 3F 7B 82 8B 2A 8F 66 49 94 0D E2 51 8A>)
(   3,<2005-11-25 10:27:17.59 +000>,<MAYBRIDGE\NMR>,<NMR_250MHZ>,
      <apk 
       data hash MD5: 32K
       C5 E0 79 DC 40 51 D0 C2 C3 BF 60 60 50 CF 13 C6>)
(   4,<2005-11-25 10:27:18.32 +000>,<MAYBRIDGE\NMR>,<NMR_250MHZ>,
      <abs ABSG = 5 
       data hash MD5: 32K
       8D CB 6D EB 6B 33 8D 74 52 16 26 0B 0C 75 6D 24>)
$$ ##END=
$$ 
$$ hash MD5
$$ A0 CB A7 4E 17 14 7E 38 3A 39 8C C6 3E 3A F9 54
##$RELAX= 
##$RELAX= 
##$RELAX= 
##$RELAX= 
##$RELAX= 
##$RELAX= 
##$RELAX= 
$$ Bruker specific parameters
$$ --------------------------
##$DU= <C:\u>
##$EXPNO= 13060
##$NAME= <ADRS>
##$PROCNO= 1
##$TYPE= <nmr>
##$USER= <dgb>
##$AMP= (0..31)
100 100 100 100 100 100 100 100 100 100 100 100 100 100 100 100 100 100 
100 100 100 100 100 100 100 100 100 100 100 100 100 100 
##$AQSEQ= 0
##$AQ_mod= 3
##$AUNM= <au_zg>
##$AUTOPOS= <3 >
##$BF1= 250.13
##$BF2= 250.13
##$BF3= 250.13
##$BF4= 250.13
##$BF5= 500.13
##$BF6= 500.13
##$BF7= 500.13
##$BF8= 500.13
##$BYTORDA= 1
##$CFDGTYP= 0
##$CFRGTYP= 5
##$CHEMSTR= <none>
##$CNST= (0..31)
1 1 145 1 1 1 1 1 1 1 1 1 1 1 1 1 1 1 1 1 1 1 1 1 1 1 1 1 1 1 1 1 
##$CPDPRG= <>
##$CPDPRG1= <>
##$CPDPRG2= <>
##$CPDPRG3= <>
##$CPDPRG4= <mlev>
##$CPDPRG5= <mlev>
##$CPDPRG6= <mlev>
##$CPDPRG7= <mlev>
##$CPDPRG8= <mlev>
##$CPDPRGB= <>
##$CPDPRGT= <>
##$D= (0..31)
0 1 0 0 0 0 0 0 0 0.06 0 0 0 0 0 0 0.0002 0 0 0 0 0 0 0 0 0 0 0 0 0 0 
0 
##$DATE= 1132914422
##$DBL= (0..7)
120 120 120 120 120 120 120 120 
##$DBP= (0..7)
150 150 150 150 150 150 150 150 
##$DBP07= 0
##$DBPNAM0= <>
##$DBPNAM1= <>
$$ [...]
##$SUBNAM7= <"">
##$SUBNAM8= <"">
##$SUBNAM9= <"">
##$SW= 20.6930455092707
##$SWIBOX= (0..15)
0 0 3 0 0 0 0 0 0 0 0 0 0 0 0 0 
##$SW_h= 5175.983436853
##$TD= 65536
##$TD0= 1
##$TE= 294.16
##$TE2= 300
##$TE3= 300
##$TEG= 300
##$TL= (0..7)
0 120 120 120 120 120 120 120 
##$TP= (0..7)
150 150 150 150 150 150 150 150 
##$TP07= 0
##$TPNAME0= <>
##$TPNAME1= <>
##$TPNAME2= <>
##$TPNAME3= <>
##$TPNAME4= <>
##$TPNAME5= <>
##$TPNAME6= <>
##$TPNAME7= <>
##$TPOAL= (0..7)
0.5 0.5 0.5 0.5 0.5 0.5 0.5 0.5 
##$TPOFFS= (0..7)
0 0 0 0 0 0 0 0 
##$TUNHIN= 0
##$TUNHOUT= 0
##$TUNXOUT= 0
##$USERA1= <user>
##$USERA2= <user>
##$USERA3= <user>
##$USERA4= <user>
##$USERA5= <user>
##$V9= 5
##$VALIST= <valist>
##$VCLIST= <CCCCCCCCCCCCCCC>
##$VD= 0
##$VDLIST= <DDDDDDDDDDDDDDD>
##$VPLIST= <PPPPPPPPPPPPPPP>
##$VTLIST= <TTTTTTTTTTTTTTT>
##$WBST= 1024
##$WBSW= 4
##$XGAIN= (0..3)
0 0 0 0 
##$XL= 0
##$YL= 0
##$YMAX_a= 623335
##$YMIN_a= -388457
##$ZGOPTNS= <>
##$ZL1= 120
##$ZL2= 120
##$ZL3= 120
##$ZL4= 120
##$ABSF1= 16.522
##$ABSF2= -4.171173
##$ABSG= 5
##$ABSL= 3
##$ALPHA= 0
##$AQORDER= 0
##$ASSFAC= 0
##$ASSFACI= 0
##$ASSFACX= 0
##$ASSWID= 0
##$AUNMP= <proc_1d>
##$AZFE= 0.1
##$AZFW= 0.1
##$BCFW= 0
##$BC_mod= 0
##$BYTORDP= 0
##$COROFFS= 0
##$CY= 12.5
##$DATMOD= 1
##$DC= 0
##$DFILT= <>
##$DTYPP= 0
##$F1P= 14.0000005364418
##$F2P= -0.99999901652339
##$FCOR= 0.5
##$FTSIZE= 32768
##$FT_mod= 6
##$GAMMA= 0
##$GB= 0
##$INTBC= 1
##$INTSCL= 1
##$ISEN= 128
##$LB= 0.3
##$LEV0= 0
##$LPBIN= 0
##$MAXI= 10000
##$MC2= 0
##$MEAN= 0
##$ME_mod= 0
##$MI= 0
##$NCOEF= 0
##$NC_proc= -4
##$NLEV= 6
##$NOISF1= 0
##$NOISF2= 0
##$NSP= 0
##$NTH_PI= 0
##$NZP= 0
##$OFFSET= 16.522
##$PC= 1
##$PHC0= 82.76075
##$PHC1= 3.714273
##$PH_mod= 1
##$PKNL= yes
##$PPARMOD= 0
##$PSCAL= 4
##$PSIGN= 0
##$REVERSE= no
##$SF= 250.13
##$SI= 32768
##$SIGF1= 0
##$SIGF2= 0
##$SINO= 400
##$SIOLD= 32768
##$SREGLST= <1H.CDCl3>
##$SSB= 0
##$STSI= 32768
##$STSR= 0
##$SW_p= 5175.98343685301
##$SYMM= 0
##$S_DEV= 0
##$TDeff= 65536
##$TDoff= 0
##$TI= <Analysis number 999999
Compound Code 99
Book Reference 9
Project Code 9>
##$TILT= no
##$TM1= 0
##$TM2= 0
##$TOPLEV= 0
##$USERP1= <user>
##$USERP2= <user>
##$USERP3= <user>
##$USERP4= <user>
##$USERP5= <user>
##$WDW= 1
##$XDIM= 32768
##$YMAX_p= 330294768
##$YMIN_p= -155628
$$ End of Bruker specific parameters
$$ ---------------------------------
##NTUPLES= NMR SPECTRUM
##VAR_NAME=  FREQUENCY,     SPECTRUM/REAL,   SPECTRUM/IMAG
##SYMBOL=    X,             R,               I
##VAR_TYPE=  INDEPENDENT,   DEPENDENT,       DEPENDENT
##VAR_FORM=  AFFN,          ASDF,            ASDF
##VAR_DIM=   32768,         32768,           32768
##UNITS=     HZ,            ARBITRARY UNITS, ARBITRARY UNITS
##FACTOR=    0.157963299565203, 1,           1
##FIRST=     4132.6476996994, 0,             0
##LAST=      -1043.33573715361, 0,           0
##MIN=       -1043.33573715361, -155628,     0
##MAX=       4132.6476996994, 330294768,     0
$$ Real data points
##PAGE= N=1
##DATA TABLE= (X++(R..R)), XYDATA
$$ [...]
24099 -10605 -19168 -33122 -63182 -35941 -23966 -46770 -37252 -30738 395 17989 13541 -19509
24087 -19509 -44735 -49279 -33071 1496 -32515 -48474 -56044 -45172 18521 39711 -3904 -5114
24075 -5114 -29269 -53462 -78531 -66726 -30569 25047 -5977 -32454 -26013 -48979 -30074 -22111
24063 -22111 -10369 -9895 -890 4687 -27099 -26878 -3153 22135 52272 58034 50036 26989 20761
24050 20761 14817 14733 13396 -7398 3525 13015 -19397 -11770 42383 57373 13018 -923 -8020
24037 -8020 17957 31109 -11170 -29490 -17801 -4021 -13021 -12056 -22366 -33654 -11566 -37528
24025 -37528 -49053 -44261 -7854 22286 -8222 4624 27757 35929 14041 17746 16645 38178
24013 38178 49059 50001 26907 -12867 25810 58085 49518 50365 22108 -30233 -21568 -12377 -3321
24000 -3321 -20949 -16851 -14676 13495 68215 68027 7739 -13090 -61981 -117326 -90491 -77831 -43952
23987 -43952 -67076 -77445 -50100 -16349 -2011 -8761 -21980 -15669 -6127 -29547 -30044 11052 14976
23974 14976 24309 36453 18441 19737 70254 74945 34292 22133 7083 -25744 -46489 -37608
23962 -37608 -23954 -2571 -13268 -28428 -13285 15431 20755 25793 44615 36288 39626 17337
23950 17337 -8435 446 2469 2029 16847 44266 33511 -28736 -110 12160 -24593 -70309
23938 -70309 -86500 -93297 -87020 -49653 -15088 -11293 -847 -26619 -44045 -20710 -17655 -27041 -76988
23925 -76988 -109540 -83398 -69023 -36557 -30790 -33520 -7043 -12851 34914 64712 8901 -23305
23913 -23305 -20656 -34575 -48869 -15458 -7754 -31516 -49335 -33754 -58158 -53558 -38266 -57886
23901 -57886 -58827 -33247 -13233 33239 24732 15333 2185 23254 50919 51770 19850 12838 -32739
23888 -32739 -47439 -15384 -13646 -13391 -18313 8843 -32021 -76906 -70624 -39049 -34308 -36671 -48903
23875 -48903 -51597 -19060 -23040 -931 -3460 14501 21324 25611 18388 -10975 -31287 -52303 -75509
23862 -75509 -47377 -53951 -52174 -23963 -12786 -26065 15466 46818 58074 30323 28590 48767
23850 48767 53960 43133 20040 14533 2855 -13269 796 21761 40749 32311 10609 -16466
23838 -16466 -10762 -16161 -42648 -16051 -3282 -3227 -3973 -20374 -53342 -35140 -39596 -25456 9032
23825 9032 5340 6283 26876 19201 -4536 -38642 -58409 -77121 -49678 -46670 -23519 20707 -2547
23812 -2547 -42900 -41357 -56141 -58671 -67982 -61930 -29907 1300 -9244 -39476 -28069 -15186 10556
23799 10556 17401 -109 -9682 -31720 -49780 -41717 -68386 -66434 -71000 -105294 -92218 -79459 -45589
23786 -45589 -6177 34699 9937 -15561 -21070 -14549 543 -10604 -26464 3401 -2352 3634
23774 3634 11531 -12888 -590 25959 48271 -8228 -29194 1761 2970 -46098 -54718 -29388
23762 -29388 -26328 -42190 -56277 -52402 -13577 -18220 1819 40519 65633 46390 39819 51580
23750 51580 36167 -2869 -10303 -4142 -32917 -30028 -23050 -28711 -18049 -10360 -20117 -22019 -4899
23737 -4899 3377 1139 13327 -4673 -20097 -23864 590 2060 3013 8023 28697 -17655 -36670
23724 -36670 -50191 -39813 -34618 -63973 -54075 -42930 -31985 -23929 -33437 20356 36683 25605
23712 25605 -22965 -33285 -40798 -15472 -12284 -41307 -47921 -34065 -17788 -34282 -39552 -42325 -61566
23699 -61566 -97158 -82249 -56631 -5572 21439 14651 236 21734 10038 34750 33882 1966
23687 1966 -7043 20043 41717 19024 16460 28152 5989 -21539 -16855 -11256 7045 37748 39714
23674 39714 4281 -32885 -52550 -31363 -40651 -11914 -3173 6392 -9980 22765 46565 48654
23662 48654 12410 11887 18198 20764 -1629 -14610 -59879 -56057 -63402 -89092 -57103 23107 36232
23649 36232 -19655 -44225 -47072 -54487 -21008 -2962 -10413 -7427 -428 -5206 -39644 -39054 -5992
23636 -5992 10387 -8416 -12730 41844 43718 12781 1196 7501 -4368 -1497 24431 48590 57570
23623 57570 52209 63225 47900 33174 19365 17629 4957 -6698 -23276 17995 13237 -20389
23611 -20389 -530 -8258 -39625 -43523 -52788 -76773 -32885 4492 -33592 -27808 -22485 -63964 -59831
23598 -59831 -38894 -47357 -64374 -44336 -41133 -39579 -45998 -21475 5558 -89 -41630 -34549 -85449
23585 -85449 -123811 -75303 -56525 -62423 -43466 -12104 16808 -8302 -18230 -1862 -28343 -16844
23573 -16844 9727 959 -19890 -33042 -34115 -27353 -9792 -14697 -37565 -15763 -9631 -35449 -47466
23560 -47466 -11574 44006 38344 12348 -28079 -54285 -54237 -61187 -78223 -51564 -52763 -27818 16296
23547 16296 39037 63978 43974 13874 -4190 -12603 -4028 -15805 -38801 -16965 -45018 -42924
23535 -42924 -3513 -3126 -16660 -36046 -4718 36818 12146 -33735 -51398 -49263 -54056 -79352
23523 -79352 -100365 -121186 -62695 -30987 -17867 17044 28192 23936 18298 40684 67994 59793
23511 59793 45092 33555 50557 22207 13777 27629 32448 36867 40674 64764 73589 14312 -32583
23498 -32583 -92357 -53864 -24686 -51180 -23614 -12598 21156 28271 32727 36965 8606 -6207
23486 -6207 5138 -10021 -22946 -25458 -5029 -5511 -25243 -49054 -76236 -38387 -8038 17930
23474 17930 9590 -12885 -16627 -23934 -9355 20285 302 -24921 -55283 -84294 -68223 -54548
23462 -54548 -36877 -6136 -22038 -47467 -54660 -46331 -40115 -42338 -10258 -3361 -60687 -91768 -65559
23449 -65559 -78018 -81650 -78699 -80522 -59183 -50626 177 18769 16442 22240 19447 13675 10109
23436 10109 342 -7358 -42676 -38214 -32581 -59127 -62734 -67306 -51858 -46375 -44485 -59214 -37560
23423 -37560 8545 17049 -33752 -46720 -78736 -64572 -54545 -55670 -14286 3862 -20776 -23409
23411 -23409 -10717 14488 -9011 -36396 -14168 -317 -459 -4182 -28305 -26618 4431 13658 -25669
23398 -25669 -42708 -72397 -66740 -30970 -41803 -29560 20461 52394 57803 21825 -35817 -83968
23386 -83968 -75090 -32193 -9803 -32213 -9319 -3402 -9611 10108 33 18595 11695 12172 18215
23373 18215 17081 14863 -3802 1062 24265 -12307 -27080 -10473 16623 31593 33899 22321
23361 22321 41911 67824 65080 39283 -9761 -25529 -55793 -79114 -86130 -54126 -15137 -46921
23349 -46921 -43145 8485 20815 -10529 -27167 9 -33833 -31453 -32923 -68402 -63680 -46484
23337 -46484 -32219 -40993 -48453 -85639 -53434 -49917 -79043 -109038 -71252 -60213 -40482 13955
23325 13955 42420 23037 4282 18785 23878 21468 6050 -11393 -31922 -43343 -74928 -81426
23313 -81426 -74470 -69831 -55050 -22453 -15173 -16301 -35041 -25128 -31606 -40968 -40842 -47072 -33610 19796
23299 19796 56576 14100 24225 61010 38594 -36552 -49552 -39327 -31572 -47985 -35246 -9387
23287 -9387 -13062 -8509 -6399 -17952 433 2404 10369 12800 24360 15147 19645 35466 57480
23274 57480 35175 -26814 -41523 -59027 -53902 -30821 -28630 -15519 16683 44804 1158 -61519
23262 -61519 -55821 -77989 -111866 -83752 -54565 -37682 -4585 25319 24389 14211 19907 -27657
23250 -27657 -29173 -73125 -101480 -28877 28659 17260 25239 -9536 -55949 -51742 -27499 -2167
23238 -2167 -11687 12956 14151 29353 30876 20829 25979 44231 42990 10589 -48494 -37515 4546
23225 4546 42240 50679 24675 -3404 4072 -8958 -8693 -5091 -419 -8452 34010 58909 71876
23212 71876 31814 37093 69097 54195 24991 12213 20615 43372 62934 59839 67131 54697
23200 54697 10029 -51602 -107074 -112105 -108785 -101765 -26728 17742 13956 12015 43333 49210 79107
23187 79107 111252 100315 87541 89538 48823 37388 20342 26381 66262 80083 85461 74568
23175 74568 28018 4152 16643 56486 56617 25015 3887 25851 57400 62286 50060 24204
23163 24204 30154 -3881 -10923 14835 41326 49556 2153 -43200 -64624 -27701 -6405 -28798
23151 -28798 -40615 -17662 -26412 -51958 -60949 -7648 -21992 -43209 -109298 -147907 -96223 -54796
23139 -54796 -40286 -32426 -26291 -6837 -7790 -47210 -39914 -34251 -55715 -67724 42 16863 -8659
23126 -8659 -9791 -9379 -16436 -6451 -26788 -31649 -13076 976 835 -11193 -36727 -71111 -72570 -88464
23112 -88464 -74144 -67659 -34604 -4654 17392 7828 -14376 -18572 -422 3592 18963 -16887
23100 -16887 -22448 -6767 -15558 -30104 -52558 -30052 -32282 -4893 8585 8270 19943 12685 -18525
23087 -18525 -13149 -29777 -37570 -17690 4988 -2760 -16706 -24459 -18436 3258 12122 -14152 -32932
23074 -32932 -54096 -13135 -3518 -13107 -18659 5382 -3964 -11532 19321 13030 -40010 -60377 -36905
23061 -36905 -4864 2645 31025 13578 -17244 -35275 -50576 -69459 -51581 -25219 -8168 -29834
23049 -29834 -14705 13830 26822 -8240 -9607 26540 43935 18742 -1534 -8018 9920 46497
23037 46497 28575 15567 6367 38150 67310 73575 43464 -208 -13933 1738 18998 2454
23025 2454 -20813 -51387 -38221 -7880 1024 4040 29692 6017 9584 38637 50664 59377 65426
23012 65426 67422 64442 22289 21388 45246 -14089 -60434 -44136 -47355 -56728 -22038 12750 13203
22999 13203 -25077 1111 19874 24252 19986 -1772 -1988 -6973 3107 -25431 -29827 3152 24400
22986 24400 12644 8623 -21446 -37855 -23770 -20166 -4479 -16371 -22125 -46615 -47751 -14571
22974 -14571 -8769 -9906 25267 36835 27674 20254 -4425 8923 -18522 -52556 -44018 -123 1890
22961 1890 -9631 -34861 -65149 -40600 -2524 14402 1956 2193 12042 -31277 -17450 16220
22949 16220 22803 14469 -2875 -22823 -46893 -33890 -9823 31841 69005 26065 10421 25547
22937 25547 -16166 -28351 -26631 -20624 -20854 3822 9534 -7043 -10414 12617 34880 43728 1010
22924 1010 9331 20605 23199 7560 9004 566 5921 -262 -14853 -29589 -9332 6002 7473
22911 7473 -12580 -19168 -25512 -18486 -26240 -19335 34778 50262 732 -19200 -48636 -10145 10056
22898 10056 -21601 -35322 -53189 -48397 -4573 -11809 -24579 -7851 -9497 -32415 -17826 13909
22886 13909 50801 80317 36480 -3410 -5515 -56058 -54051 -31497 -27411 -19324 1113 35135
22874 35135 25537 691 -4885 -11435 -37663 -42799 -13050 -2774 2585 -6416 -23658 -8917 2920
22861 2920 22617 38612 87979 61806 55852 39386 -33480 -67999 -81098 -77076 -45372 -14610
22849 -14610 11254 11308 24551 47643 35318 27438 32670 29737 25721 10467 8030 -4562 -32227
22836 -32227 -64762 -57880 -52725 -89500 -128068 -106384 -62310 -60350 -35606 -36946 4635 24918
22824 24918 -3063 -2399 11573 -1055 3535 18270 19579 -2077 3032 10901 2189 -26724 -23645
22811 -23645 -19350 -3371 -5314 -27462 -62806 -84826 -78288 -43151 -43408 -34252 -16758 20624 43271
22798 43271 7608 -430 9103 12256 2200 19738 5092 97 25862 33755 22714 9415 -3751
22785 -3751 -33208 -64797 -52931 -4343 -15316 10400 -825 -5473 39325 43470 43459 59061 52811
22772 52811 47569 36156 18644 -12745 -14380 9443 13235 3751 -17761 3504 -10366 -10844 8339
22759 8339 -6711 -888 7909 34356 49059 56662 21596 18942 6557 -2107 5743 20355 34726
22746 34726 21217 -46944 -62983 -62741 -73560 -60250 307 12618 6681 -18891 -67838 -95305
22734 -95305 -50330 -25903 -23496 -52254 -45207 -54889 -80952 -88786 -83328 -100900 -70966 -57953 -62389
22721 -62389 -48250 -34010 -4290 10749 7165 2553 -17477 -5516 10908 6693 11715 39237
22709 39237 35142 32932 52757 37091 22034 4805 -29136 -62882 -59052 -11759 45712 29243
22697 29243 20851 10252 3312 -19061 8608 22872 12465 -14870 -49970 -81143 -70644 -56063
22685 -56063 -57852 -59311 -52297 -34979 -3910 34974 63090 75139 58806 43606 21933 29676
22673 29676 34692 8377 -230 -1167 17088 18312 23538 3605 35646 83155 54393 15690 -30281
22660 -30281 -33916 -43866 -40410 -28261 -46526 -58736 -37742 -7279 -39027 -49137 -29540 6499
22648 6499 13555 -9871 -31010 13717 39219 22212 -19071 -34918 -44556 -31081 -35437 -52614
22636 -52614 -36471 5704 8584 9294 9038 15744 20661 -15095 11718 35210 14015 -30977 -49757
22623 -49757 -45718 -28164 -4187 -13307 -27308 -40373 -68097 -89788 -51903 -23607 -21354 -26402
22611 -26402 -82795 -106251 -96119 -49601 -19952 -63033 -27972 -21742 -3338 24953 13114 -23282
22599 -23282 -31546 -45378 -51681 -56751 -14319 -2891 22023 35113 36491 17374 -6836 4787
22587 4787 -2353 -33443 -66289 -71481 -48580 -48883 -47524 -40918 -50142 -58871 -84736 -58177 -42278
22574 -42278 -23096 -18204 -44040 -50570 -3715 43685 8191 3492 -11458 -20736 -33317 10258
22562 10258 21810 36055 27396 -2702 -11249 -32988 -69197 -48391 -4053 -3859 -34075 -71967
22550 -71967 -48573 -56006 -44608 -27584 -31558 -34889 -24996 -17544 -18760 -17862 -9103 35577 1072
22537 1072 -22730 -31390 -35990 -30796 -737 12048 -10014 -20479 -52321 -62289 -67911 -58967 -77516
22524 -77516 -84022 -47802 2817 4834 -4499 2607 1704 -3889 -27895 -99619 -131610 -112564 -61466
22511 -61466 -12663 12516 22680 16355 9274 -5862 -8284 8595 9296 30103 29340 25838 -10705
22498 -10705 514 -4697 -3922 29494 51181 23174 -4499 19703 -17168 -38387 -39336 -15312 -14993
22485 -14993 5848 9154 51636 67383 56650 45786 29386 12134 4405 -21133 -63247 -78069
22473 -78069 -70963 -62646 -39644 -16493 -35081 -53076 -24055 23981 28823 2259 9469 12296 -12813
22460 -12813 30 5077 -15972 -1669 20967 34008 16870 -957 -61982 -78219 -29752 -24122
22448 -24122 -38781 -80184 -65599 -32424 -15615 -28747 -37145 -30286 -46156 -44944 -1921 14941
22436 14941 5335 27989 18630 43299 8302 -28264 -47918 -56278 -62133 -47700 -48528 -36749 -19277
22423 -19277 6608 10927 7419 50041 41433 38408 57562 63883 58157 26441 19317 24515 27440
22410 27440 39397 11619 -37288 -54042 -40950 -49914 -11762 -12655 -7744 -20711 -65446 -78190
22398 -78190 -50662 -31375 -11589 -19701 -8125 58249 55464 9361 -52287 -75071 -91187 -61649
22386 -61649 -27011 -9386 -23290 -23316 -27978 -18941 1577 -21081 20631 26175 19817 -18421 -38567
22373 -38567 -61571 -94827 -37112 -38047 -50827 -26786 -17652 -15896 -29587 -19362 -17708 -6161 15755
22360 15755 24857 41393 38350 23974 38070 64865 76209 39427 37688 -6278 9726 -7553
22348 -7553 -20088 -17225 24254 14294 -9763 18078 54567 47853 27897 14741 -14215 -2419
22336 -2419 -4869 -12254 6738 12101 -28394 -32744 -13976 16481 -3837 18240 56130 31025 19358
22323 19358 -19798 -76411 -66736 -24686 -146 22507 11276 15515 -8731 -8694 -13039 8407 34573
22310 34573 55460 38689 717 -5239 -7718 -5577 -28898 -38106 -17647 -44261 -58751 -44292
22298 -44292 -47694 -79285 -66730 -28414 -25951 -57344 -41130 -11812 -29266 -81599 -65635 -2874
22286 -2874 19739 37280 11550 -33388 -53229 -34175 3686 5870 -9358 6911 51107 27068
22274 27068 33796 261 -13257 -22244 -61054 -47819 -18638 -13752 -18794 -39111 -52867 -50348 -39272
22261 -39272 -52501 -29481 -45191 -71465 -71358 -53064 2846 42604 37648 30975 6934 -11873
22249 -11873 -12416 -47297 -49062 -46049 12859 19306 -12039 -25271 -14848 11782 7230 -9013 -40465
22236 -40465 -94509 -45617 4609 -6475 -31266 1664 12874 877 20252 -6344 -35660 12949
22224 12949 28012 1314 3470 36230 927 27011 35975 991 -15205 -12292 -40198 -88911
22212 -88911 -96900 -66848 -68196 -78050 -55411 -24675 -332 -17853 -49539 -60660 -54448 -43410
22200 -43410 -45998 -51716 -49534 -34070 21252 29597 -11321 -24279 -37927 -49009 -85248 -66802
22188 -66802 -25304 -36494 -40487 -18723 -3674 -20156 -14012 38096 7808 -47424 -89539 -59925
22176 -59925 -31284 8004 1981 -4454 -11170 -26391 -63869 -60934 -51500 4736 24828 35752 20323
22163 20323 -40403 -52520 6148 9813 7246 35738 27947 -16609 -50393 -56565 -83104 -63175
22151 -63175 -80383 -104245 -109510 -80403 -47712 -12882 11523 10717 8693 -8586 100 -11194 -33417
22138 -33417 -33372 -32037 -22445 -3286 -24890 -51379 -29469 -16472 -33457 -39593 -38913 -46203 -36167
22125 -36167 2523 15195 -15745 -24294 -9761 -13834 -58262 -61130 -78270 -68127 -71556 -47095
22113 -47095 -8142 13326 -30411 -47377 -16970 -42348 -59308 -17857 -98 5481 -378 -54903
22101 -54903 -36063 4304 23236 -24342 -26120 -158 -18777 -35752 -69826 -49749 -56728 -77178
22089 -77178 -24328 9548 18660 27877 23651 1993 9943 38609 31321 413 -4827 -29578 -46088
22076 -46088 -53972 -3113 32943 51175 12378 35068 42689 30997 38292 19779 10771 16968 42460
22063 42460 20189 18408 61075 51154 -14645 -35479 -17827 -15767 -46918 -53399 -32343 -6160
22051 -6160 -28806 -72618 -85504 -59777 -37401 -56844 -45314 -17629 -13022 6091 -39093 -47422
22039 -47422 -34808 -37593 -31329 -11927 -5557 -3803 -874 -39136 -22884 -35730 -9009 11332 -23933
22026 -23933 -55245 -35779 -65884 -47182 -16087 -35260 -39966 -41342 -45540 -38838 -34711 -10037 -12246
22013 -12246 -31233 -50637 -62027 -76213 -71786 -65081 -30187 -5555 -48082 -43016 159 19027
22001 19027 25635 19156 12126 2812 -4745 -16145 5472 -5949 -44143 -57622 -37423 -41203 -28811
21988 -28811 12459 45901 50350 10725 -22342 -1062 32957 25824 -474 -38298 -70019 -59724
21976 -59724 -55010 -70672 -82629 -78798 -76140 -40034 -6129 -27063 -39260 -22931 -40919 -62852
21964 -62852 -75138 -46460 -42634 -44889 -10600 -30543 -57312 -28457 12972 11883 29284 63144
21952 63144 48603 -330 -29408 -6598 11694 14551 17320 -841 -35487 -65845 -16951 -8832
21940 -8832 -13886 -16953 -9745 -9882 -20934 -34080 -49874 -38711 -70484 -60730 -20888 -34666 -50757
21927 -50757 -29198 8209 -25754 -67738 -91431 -58558 -268 49112 62232 29426 2433 -20955
21915 -20955 -58954 -69800 -30178 -21135 13362 2494 1185 -34770 -42463 -4238 34968 38608
21903 38608 -2740 -33348 -64819 -40433 -11331 -11283 401 1273 -39965 -73303 -82961 -99801 -77032
21890 -77032 -51148 -37464 -43362 -24935 13179 -647 -15394 -25850 -21934 -18011 -40303 -48840
21878 -48840 -56536 -34035 -28650 -67980 -24535 21521 19949 1623 -22229 -19154 -31423 -29514 -2639
21865 -2639 -3496 3572 -1855 -12059 37418 83509 84663 54985 46311 64396 83033 111971 106374
21852 106374 76685 81060 19608 24131 56805 36373 19104 19741 13149 31694 14328 -2903
21840 -2903 -33461 -53437 -33965 -20853 -27506 -7290 8278 32225 49209 62095 69911 37107
21828 37107 10608 37756 12213 -12826 -23520 -26968 24758 44792 5601 4647 -7518 -6592 18929
21815 18929 25618 25703 -14171 -25135 -7483 21160 48260 43474 25571 23447 53974 52105 29705
21802 29705 13235 7067 -8165 -1526 13919 33160 47307 66546 68841 58752 45962 50789
21790 50789 4089 -17110 14442 27875 10194 -20982 -14811 2613 -295 -9149 -34624 -7326
21778 -7326 -4041 -58043 -46125 -27810 -33811 -51570 -58174 -67167 -53938 -62274 -68769 -63223 -76587
21765 -76587 -105139 -112516 -68579 -37457 -14097 -60020 -97642 -46770 -2248 -30134 -50707 -61015
21753 -61015 -44159 -11050 -31080 -24670 -30857 7859 17869 -3266 2991 11507 -4356 -26455
21741 -26455 -11341 -2213 11858 -3151 8238 -15526 -9471 -14487 -26422 -1563 19746 9138
21729 9138 -1938 -27928 -56460 -55891 1748 37910 35474 28674 38450 25960 -8506 -20218 -13285
21716 -13285 -27125 -28788 -35280 -31049 18317 8428 -25607 -39895 6474 2374 11373 -23085 -62798
21703 -62798 -64630 -24494 -4639 13954 44704 -12816 -58933 -28060 -3463 -17455 -34849 -28129
21691 -28129 -22232 -6219 -359 -266 -9266 -10708 -27496 -17890 -17496 23939 44133 22977 -14491 1569
21677 1569 -6875 -23020 -45710 -70912 -57675 -69581 -43984 6262 2322 -7150 -47976 -59469
21665 -59469 -29595 29782 50723 22046 30547 6021 -14141 -34785 -56524 -66108 -86421 -68350
21653 -68350 -39498 -1194 27673 24686 -17553 -34143 -39833 -39729 -53332 -28421 -15155 -34658
21641 -34658 -13434 -20226 -14935 -13677 -21172 -22925 -31575 -58970 -72737 -82694 -39740 24820 -3124
21628 -3124 -40940 -38404 -50997 -72988 -38340 -2791 -22466 -12621 47758 60668 48900 37859
21616 37859 15782 15600 31314 17808 10753 14302 -10537 -32522 -27021 -26927 13126 74688 71797
21603 71797 1514 -68617 -72932 -23205 14778 -6693 -33110 -32137 -38726 -18629 -6189 -19213
21591 -19213 -46788 -53479 -41130 -28609 2548 3814 6048 -3434 -36999 -23607 -29738 -50941 -65581
21578 -65581 -32604 -18571 2230 -9614 -19011 -13035 22285 121 77 -18933 -30166 -41420 -16869
21565 -16869 -42965 -90812 -115640 -76968 -45241 -54922 -17565 33089 48694 40074 53954 73201
21553 73201 50112 17367 -22633 -77842 -93867 -87140 -47819 -15918 -7836 -11756 -19599 -42275
21541 -42275 -17782 15613 -23365 -41756 -52026 -44623 -31123 -25143 -26086 -19245 -8444 -16165 -17924
21528 -17924 12584 45177 67080 66110 -7594 -41298 -33185 -26850 -18379 -22026 -12958 7679 32576
21515 32576 44482 -17610 -52921 -55679 -98285 -79491 -50137 -65634 -61332 -23512 -21243 -48147
21503 -48147 -73269 -28707 3962 14341 38081 40435 -1109 -64125 -75725 -47756 -27639 -42239
21491 -42239 -34873 -24455 -19134 31160 43818 -24192 -42175 -31305 -48901 -55367 -42714 -47811
21479 -47811 -35229 -6310 24543 -24779 -77661 -71241 -35156 -33040 -33184 -12539 5703 48524
21467 48524 33198 -19549 -44294 -76073 -53284 -79074 -53636 -48737 -49647 -40258 -27905 -26732 -58849
21454 -58849 -42440 -6749 -32827 -40180 -33594 -40247 -39754 -52315 -34609 -42661 -49560 -19594 -17554
21441 -17554 -30664 -25372 -15258 -32244 -24753 -70522 -75968 -32605 27283 77117 19024 -10344
21429 -10344 -24071 -54672 -57699 -39133 -20248 2982 26329 4077 -16029 -18463 -34470 -13039
21417 -13039 30045 40263 923 -27743 -32029 -34270 -53141 -54410 -16431 -8416 -19421 -16994 -1767
21404 -1767 49965 46175 25634 38611 4357 -21314 -1523 16792 -29933 -53511 -56989 -78615
21392 -78615 -74045 -66647 -76436 -35976 -29443 -15978 15133 13335 -25280 7037 26888 23978 5491
21379 5491 -28861 -49266 -64983 -47662 -30964 -42930 -26027 -50335 -51960 -39159 -41636 -56992
21367 -56992 -47479 -17495 -21069 -38774 -41790 -6867 19795 -30622 -51277 -9239 27508 45116
21355 45116 25616 7525 27645 62345 54456 31081 10058 5484 -14430 -14912 -16839 -52126 -77547
21342 -77547 -78178 -85209 -67851 -38619 -16745 -35755 -48662 -92395 -96138 -45679 -33968 -62016
21330 -62016 -56746 -55015 -38138 -1730 20749 47109 54274 47081 44340 1169 -11879 -27029 -43587
21317 -43587 -34738 -26001 -6310 -8115 -28834 -22143 -29257 -33890 -5648 32072 50905 76069 56046
21304 56046 27981 8272 36869 15632 -7597 -29527 -63785 -33284 -39759 -58454 -54611 -57897
21292 -57897 -67032 -47101 3582 33809 27917 1576 -13675 -27266 -24507 -30490 -16210 -56242
21280 -56242 -50499 -13456 -16513 -13726 -33426 -28150 -43095 -26766 -18281 -17569 -8758 -38508 -75528
21267 -75528 -84055 -53669 -44925 -28661 -10182 -11291 -51794 -55163 -29284 -2424 -885 17847 23386
21254 23386 49455 53968 66295 70734 47401 16262 21393 12666 4962 26561 18155 12876 -2640
21241 -2640 -22368 -29942 -21440 5830 1646 -2522 -5642 -7373 -6655 11278 8290 -11395 -27523 -35955
21227 -35955 -47306 -33651 -43362 -42864 -39166 -510 -14322 -45262 -43443 -54806 -20476 16097 2955
21214 2955 -10376 -17173 -25752 -13890 4735 8138 -22383 -35321 -44571 -75457 -80355 -50404 -28621
21201 -28621 -15040 -39017 -24581 43683 40242 -1469 -14405 -30514 -20007 -47400 -30500 11519
21189 11519 17519 -21070 -46159 -59329 -49213 -16105 -5186 -22883 -43761 -47722 -37219 -60329
21177 -60329 -17689 33699 28881 -28153 -18000 -13245 -2455 13334 5476 -52381 -82769 -34557
21165 -34557 -649 -29947 -14182 -11297 -10561 -17062 -29957 -30525 -17082 -10826 11151 8678 -15768
21152 -15768 -33528 -31972 21771 28807 -15692 -96025 -133458 -99917 -65647 -71045 -47362 -2314
21140 -2314 -2868 23489 57493 27717 -870 -20081 -23362 -33017 -23390 16870 29834 -16389 -54756
21127 -54756 -52518 -17870 852 -21252 -37601 -40800 -32384 -19118 31721 17727 21365 28823 38315
21114 38315 22097 17181 7846 8836 36691 16730 -12414 -40080 -59626 -41105 -27101 -24506 -8482
21101 -8482 -25580 -38059 -32644 -36630 -43202 -30381 -13752 6314 15318 15930 -7494 -16469 -55976
21088 -55976 -89326 -88798 -66519 -98953 -110356 -89972 -45636 -40302 -66805 -75212 -84451 -72642 -43694
21075 -43694 -41061 -52278 -45194 -41590 -75545 -51343 -19245 -43666 -32639 -54886 -40488 -37602
21063 -37602 -68671 -59367 -50063 -49954 -36931 -93991 -95773 -28292 -14340 -22074 -64657 -75730 -57386
21050 -57386 -38896 -33760 -28051 -36065 -27728 -29757 -46080 -21387 -5361 -25232 -23700 -10589 -66726
21037 -66726 -97823 -90676 -69302 -26566 -24287 -32676 -18285 9300 32592 34154 44889 47428 30696
21024 30696 12623 6263 -55264 -42760 -30960 -44233 -38696 -45012 -12322 -22010 -54687 -56225 -38217
21011 -38217 1793 17951 -1118 -8593 -7010 10998 8784 -14468 -27251 -26110 -178 11502
20999 11502 2023 8507 25611 16504 21723 31473 21614 -18595 -38837 -64517 -48723 -15592 -33081
20986 -33081 -54847 -44690 -32567 -31530 2175 9708 23761 -13149 -50525 -55116 -30327 -7604
20974 -7604 -25570 -54193 -69406 -41256 -41960 -27306 -24420 -25263 -37229 -29492 13400 29807 18167
20961 18167 23726 5660 -35016 -57966 -41453 -35475 -45377 5290 18916 21455 18529 -22045 -48596
20948 -48596 354 16316 -14704 -2028 56053 20972 -3048 -27881 -17464 -8284 -10748 -34807
20936 -34807 -20793 -3849 1361 18676 28552 -1771 -24626 -9333 6180 3043 -10088 -42201
20924 -42201 -61849 -52241 -18594 25755 54728 39813 20283 -23272 -30186 -25644 -6896 3847
20912 3847 -2926 2973 36101 16063 -32214 -48459 -14713 15715 25257 25202 12427 -4364 19690
20899 19690 3839 -27205 -28615 -60041 -90666 -59957 -39853 -53121 -48982 -68332 -75598 -68430
20887 -68430 -82775 -39946 23167 18159 10496 -797 -30690 -30474 -41968 -35920 -42969 -30636 -56116
20874 -56116 -45937 -27070 -37413 -60079 -54387 -22361 -694 -30025 -68431 -42482 -51595 -63600
20862 -63600 -49056 -6707 -18931 -28502 1773 7722 32983 66515 69880 33732 9199 20094
20850 20094 28699 21594 53546 104383 99990 124693 104322 44818 -32706 -56240 -42691 -68915
20838 -68915 -32036 2698 -8339 -18576 -38550 -9383 -3202 -262 -5728 -18353 -45090 5319
20826 5319 39928 75834 62023 49202 38062 57249 26030 35891 55281 64092 72588 49215
20814 49215 10433 22815 -2141 -5515 24514 49742 77531 81578 28849 39860 63560 59211
20802 59211 84111 48801 266 7379 1648 -8348 7788 2220 15859 -11524 16321 51318
20790 51318 18740 -8548 -41428 -30013 23196 49276 46324 4126 -3586 28470 34864 39160
20778 39160 25434 983 -19129 -28787 -23772 -17416 12609 41747 31350 -13819 -69620 -63500
20766 -63500 -89165 -82194 -53484 -33640 -52169 -50693 -49488 -31826 -12273 8209 7484 -10417 18450
20753 18450 -1010 3536 9852 -5467 -19914 -65090 -45850 -47339 -34172 -5171 30680 46646
20741 46646 56902 22079 -21313 1121 3509 -54613 -91888 -93325 -58706 -52546 -29643 -13564
20729 -13564 5843 1531 -13336 7101 -9285 -73165 -93142 -85566 -95933 -53057 -398 -6573
20717 -6573 -3830 -31941 -37215 3647 35331 18284 12431 4391 -11983 -14868 -44741 -5352 -3771
20704 -3771 -14246 -9702 -28187 -14378 4887 -14059 -44397 -66541 -16169 23932 49875 59755
20692 59755 36313 16823 16827 36166 8027 -3199 2084 -29433 -25026 -37618 -48690 -46626 -68591
20679 -68591 -60697 -71086 -63187 -73911 -85776 -88991 -96124 -59103 -61325 -52395 -41406 -12367 -27937
20666 -27937 -51289 -40903 -43747 -55013 -27961 -6332 -27479 -23391 17007 46445 -1862 -17583
20654 -17583 -14304 -28764 -25403 16901 9702 -17125 -59094 -54207 -37322 -26263 -56425 -89785
20642 -89785 -103962 -110722 -84189 -19928 -19812 8926 30555 27768 21601 8114 19041 9899 7181
20629 7181 26669 813 -7105 -15486 -8700 -22524 -42393 -20240 -2971 28376 36724 16952 -27095
20616 -27095 -37215 -45336 -46123 -21249 -38779 -52465 -67174 -31131 3162 10094 -4591 -21469
20604 -21469 -48788 -77436 -86846 -64065 283 16776 8238 -8716 -12330 -31640 -54773 -71365
20592 -71365 -39921 -40939 -20354 27583 43555 29925 -1087 15242 17997 21467 -6942 -8181
20580 -8181 38805 67837 80304 17124 -22123 -59423 -46644 -67150 -119421 -88034 -62840 -52904
20568 -52904 -56497 -61464 -53170 -15434 -14402 -56491 -65040 -74809 -77385 -41941 -14437 -8520 -12084
20555 -12084 -22037 -39462 -57078 -57940 -26083 -9820 -10400 -33941 -50805 -43472 -18353 1580 -18095
20542 -18095 -68196 -73825 -62071 -34902 -27080 -39077 -44202 -30636 -30257 -24498 -25545 -43136 -45702
20529 -45702 -27466 -1338 -13210 -32992 -56046 -68372 -79175 -44624 -59295 -48187 -29224 -7252
20517 -7252 -1029 -9317 -6680 11076 35063 37159 7933 -18530 -5626 -11421 -9447 -14754 -42693
20504 -42693 -70137 -106488 -77530 -46892 -58573 -52506 -11220 -18070 -28867 -43295 -60518 -28349
20492 -28349 -23882 -37500 -58970 -52283 -24500 -11480 -23031 -14822 7587 12398 -24079 -64969
20480 -64969 -23975 3322 -17120 -22006 -14648 -41798 -50360 -44044 -68944 -70982 -51647 -45154 -44921
20467 -44921 -16672 -13664 -56979 -73622 -63281 -83775 -88390 -66040 -52657 -83356 -107242 -82491
20455 -82491 -18621 -18060 -50763 -58034 -60300 -48313 -43561 -29682 -47993 -29437 -12125 -56112 -78614
20442 -78614 -18697 22976 -4471 -29062 -25363 -31466 -37803 -51334 -94801 -77705 -41539 7892
20430 7892 10065 -34405 -49002 -49939 -16962 11549 14210 -20755 -35613 -36069 -31873 -56688 -81125
20417 -81125 -44229 11331 61577 55146 19120 12104 6925 -25796 -72466 -48847 -29008 -12633
20405 -12633 34095 41553 11799 411 51843 73497 71817 49533 -2909 6300 32566 35457
20393 35457 34136 25367 39285 23256 42094 72072 63268 14464 -44915 -69688 -45886 6750
20381 6750 -24724 -53169 -58273 -40946 -7159 49699 111829 109724 71164 78766 59886 28375
20369 28375 -6679 -44869 -63288 -66685 -32786 -16425 -30336 -9901 21979 51946 11277 -26073
20357 -26073 -35279 -54406 -45682 -16892 6041 8201 39613 23077 4169 -49597 -86405 -93510
20345 -93510 -22414 40304 7364 -19591 -42038 -22456 -1530 16027 30584 39902 13994 -2274
20333 -2274 6376 2600 14995 29480 11703 -22567 -31733 -26646 -31512 -37958 -37099 -40391 11125 -13018
20319 -13018 -12251 24956 17489 6015 -7820 -24107 -18184 -17538 16063 21988 17136 -5922 -50543
20306 -50543 -31215 656 5349 -5060 -13122 -33031 -35917 -15698 -6840 -27515 -20610 -28512 -46291
20293 -46291 -43035 -71491 -59684 -27731 -21857 17675 34301 57962 84057 63541 39009 37176
20281 37176 69342 95368 50564 28627 11905 3852 23698 32338 23329 4127 7255 37218
20269 37218 2318 -42211 -34050 -5233 -5794 -47936 -51891 -16459 -29636 -52656 -67581 -84075
20257 -84075 -35211 3231 3007 3613 53367 82950 88440 69555 81368 50139 59727 57900 63191
20244 63191 25210 -28285 -59652 -21775 -22783 -23309 3383 37851 69166 66355 21844 20318 10893
20231 10893 -22290 -63931 -30250 -42000 -47684 -21996 -27331 -46259 -56208 -57741 -34186 -6319
20219 -6319 -13523 -25375 1795 -3037 -16497 3485 15388 -9338 -12769 -34817 -51446 -53502 -43624
20206 -43624 -5249 -2217 -10909 -12996 12604 45228 22163 -15895 -36257 -46261 -58356 -62149
20194 -62149 -86467 -109548 -112440 -58281 -16991 -32605 -4178 4808 20711 43487 82882 69403
20182 69403 64657 74233 37925 3682 40719 43152 2345 -34770 -32009 -45935 -47983 -41650 -61607
20169 -61607 -77166 -47830 -35252 -39319 -38563 -23842 -25410 7156 -2399 -2042 9505 -13785 -67960
20156 -67960 -36988 -7317 -9795 -5232 7530 2131 5961 17975 3713 -11421 -22297 -46613
20144 -46613 -67860 -58470 -21291 -13256 -5405 5282 5563 -5854 10997 -5838 -3853 -5386 -25389
20131 -25389 -26445 -16615 -57244 -80592 -53792 -57261 -36330 -43964 -19389 6426 41822 44623 -697
20118 -697 -6401 -16909 -55094 -53332 -23215 -29912 -14275 26857 39500 17268 -9497 2207 23894
20105 23894 57973 89101 84759 31488 7165 38447 27199 -20905 -34455 -3580 12567 16928
20093 16928 22572 33593 28189 7928 16290 34648 32569 10004 18884 28098 35904 42272 60953
20080 60953 72615 75988 76474 53576 23324 6886 33109 19522 11218 -26381 -44411 -8551
20068 -8551 19020 37873 31216 -4298 -2138 28397 11769 -33223 -55045 -52582 -717 -11400
20056 -11400 16922 50412 10393 17650 6972 21888 31224 -5639 9644 49526 125962 185190
20044 185190 320609 421107 466124 481281 454663 462930 487209 472599 467738 428805 370176
20033 370176 310694 217281 145480 85003 38720 57777 73539 47973 50858 82772 73695 38529
20021 38529 -11160 -26635 -11197 10238 23250 40693 60933 133553 225743 270711 263511 298956
20009 298956 416446 482061 509289 551969 555320 555265 502567 421617 366076 261313 178715 105661
19997 105661 54078 47244 67264 22089 5801 -2541 -4312 15205 24406 14690 7786 25295 47374
19984 47374 30165 20253 64409 72260 -1588 -48342 -34193 2827 1838 -43750 -13580 2156
19972 2156 1722 3260 14391 -9106 -26627 4605 13645 17057 36806 51311 69750 35918 30231
19959 30231 31265 -8828 5532 15605 20607 -36937 -9158 45090 18639 -7203 -7449 12514
19947 12514 25474 35360 23815 6801 -30317 -72628 -72350 -28100 -34026 -53427 -27015 18820
19935 18820 22278 33497 69854 59455 55166 65427 28907 19024 3950 -8967 -1227 6578 -1977
19922 -1977 6768 43431 65902 57453 3845 -25717 19913 7048 -24412 -48197 -33720 -3199
19910 -3199 10862 13856 19265 5227 -27246 -57748 -82545 -72513 -54150 -38125 -34910 -16919
19898 -16919 -23204 -68187 -51184 -4730 -9808 -29959 -52141 -46502 -39937 -4528 31097 3553
19886 3553 -46720 -72163 -73305 -58108 -17354 10936 23230 8634 -34931 -57183 -51656 -55856
19874 -55856 -24275 -57130 -49493 -13653 12693 52154 29444 34981 1973 -21102 -18505 -62349
19862 -62349 -46836 -2465 -7889 -28856 -15143 8669 50154 16924 3588 39924 46665 20816
19850 20816 11086 5232 -47530 -22599 37072 58854 59600 49971 27902 38020 51244 48443 31890
19837 31890 11970 33735 32171 39280 27584 17090 27952 -6565 -9434 11902 17363 19942 38732
19824 38732 26015 47963 53114 46847 -9032 -9157 1988 7681 43465 23675 -20611 -7149 -1188
19811 -1188 -14499 -10094 28048 47442 4731 -20617 -24847 -43682 -42784 -23052 -16998 -24896 -33042
19798 -33042 -52682 -70038 -88645 -50281 -31312 -46245 -48978 -27320 -6468 17052 34580 10408
19786 10408 12657 49300 60538 66311 48619 17591 20939 49259 67664 85220 56734 26961
19774 26961 35323 35241 28910 47454 49114 46819 65756 34554 3596 35061 31611 28152 23650 -36783
19760 -36783 -20569 8062 6879 2532 -16496 -21491 -15286 -11226 16804 17181 15433 24746 24191 39860
19746 39860 87621 88696 30410 14573 49420 53783 81060 104893 116564 103508 95401 73328
19734 73328 42510 52493 63922 40715 26521 20313 18179 35103 48659 56835 36664 2942
19722 2942 -38512 -1364 23373 -8633 -28401 -21697 10805 36451 53816 85235 96814 102875
19710 102875 113128 121713 116378 87888 85211 91850 105867 75005 55778 83527 92408 87638 49374
19697 49374 88425 65191 70366 42189 14492 -13020 -14431 4594 8259 33281 57491 36105
19685 36105 56041 48887 64031 74531 66670 61183 63613 74262 126577 169120 162673 149742 97086
19672 97086 98367 118707 111116 99771 120431 114101 89805 121447 160777 131573 121391 118187
19660 118187 112263 78626 61663 81981 93856 131105 137579 97839 94624 122508 133317 130190
19648 130190 149132 143053 115026 101248 79756 85256 69034 66436 53034 52228 54356 96753 123419
19635 123419 107038 65797 63798 71664 46529 33822 44151 27466 32812 84477 119894 89783
19623 89783 53512 21278 34395 36914 34527 83763 112210 114912 122709 134800 137463 154066 159271
19610 159271 163347 137930 131264 138477 113173 100831 58449 25937 55280 56001 120224 129842 101801
19597 101801 87803 57416 64081 73492 69132 71926 85957 55636 41194 60592 76788 56776
19585 56776 56723 101160 135419 188187 196939 175109 178554 155220 184536 194508 174484 164394 152734
19572 152734 152076 152355 148041 138438 153508 181164 182954 170288 136367 110690 112831 148749 159115
19559 159115 194764 211941 216783 229549 265622 320544 308658 273126 289912 328613 376344 349949
19547 349949 339511 315941 340848 349944 331872 329605 375961 414776 451544 465018 474884 536431
19535 536431 557099 578227 662738 704984 726747 788505 824151 939084 1077212 1219468 1371092
19524 1371092 1509383 1491947 1513515 1580780 1660247 1723309 1741800 1738952 1756053 1786427 1886718
19513 1886718 2050588 2257909 2486760 2658107 2845905 3011913 3140824 3304904 3498962
19504 3498962 3666712 3851420 4128834 4501983 4966366 5652220 6578525 7804690 9541205
19495 9541205 11981138 15456412 20638750 28501255 40096029 55679276 72572878 85641200
19487 85641200 91639034 93165921 94188968 95685328 94191060 86066879 72484632 57056402
19479 57056402 43153167 32457492 25043997 20155003 16870244 14565334 12898270 11695321
19471 11695321 10836101 10212013 9849641 9770996 9956495 10391513 11137232 12315602 14109879
19462 14109879 16814699 20875631 27103188 36709055 50569545 67536470 83233490 92650567
19454 92650567 95625447 96420918 97935821 98470561 93407099 81459364 65674933 49902625
19446 49902625 36974835 27544901 21017151 16573421 13460777 11194548 9554437 8275122
19438 8275122 7316650 6561861 5961902 5535342 5134281 4820632 4513465 4247432 4021610
19429 4021610 3826603 3552839 3286263 3027195 2831174 2642607 2448181 2277794 2190966 2116184
19419 2116184 2063106 2019567 1954541 1916557 1864576 1842492 1765749 1643538 1480126 1330456 1208804
19408 1208804 1079040 957258 902876 839356 775852 743287 715232 685553 628353 575559 534639
19397 534639 482559 490639 516348 494152 434649 375731 366273 378538 391403 380325 355248 325088
19385 325088 323581 317532 307179 296779 275942 258949 238400 266753 285926 283296 246556 207360
19373 207360 223456 216997 274754 250144 244435 259116 230015 215494 240873 228108 191502 211834
19361 211834 212290 225040 242397 274432 284391 231231 190056 175102 160989 170249 164370 182621
19349 182621 171271 146218 158629 129706 95354 77581 95864 126201 152801 162994 150482
19338 150482 160155 154768 122128 116887 141967 185339 189591 194156 190861 145624 140546 130516 127394
19325 127394 97555 72172 57616 65400 69163 54192 70349 82229 98602 92959 74878 65640
19313 65640 34513 60760 50633 34178 33428 19451 59859 124304 163653 136741 146285 169126
19301 169126 151368 137382 100748 79368 69342 82251 125241 71270 47990 40242 15188 -31414
19289 -31414 -44878 -35381 -51802 -22040 -7833 -20150 -5514 -7451 -12083 -408 -3141 9430
19277 9430 46129 56634 66382 32119 -17313 5447 24584 -7376 -4440 -10639 -13920 -2219 -606
19264 -606 -1013 33097 39597 10918 20907 43702 20137 -13678 -21389 -17568 -35797 -38777 7319
19251 7319 15296 37769 79499 102776 62152 46195 8806 10811 37090 45915 76822 84287 73603
19238 73603 49877 54617 55117 41052 38419 -868 -31850 -19291 2850 14432 26252 6005
19226 6005 2273 21144 60149 54388 85960 54059 33114 40227 88050 92530 70472 84993 73804
19213 73804 88098 123663 124519 129603 141405 150484 169060 209977 224863 206746 137791 108708
19201 108708 92821 74173 56736 63777 90754 82239 68600 74532 99317 101178 68858 36192
19189 36192 45489 64580 44507 29001 32430 83851 93534 87186 103720 96459 66180 11691 9301
19176 9301 -20110 -50473 -8502 32650 -6650 -18121 -1950 -21419 -22389 -43225 -28305 -11871
19164 -11871 6047 64048 61995 9657 3057 -12654 -2556 -6849 4330 43433 71752 88824
19152 88824 75929 25939 15201 6077 40898 32873 27726 72376 81093 47608 27555 -4873
19140 -4873 -10955 5098 -3272 -36182 -18219 11200 -793 -22236 -71280 -76637 -32204 20
19128 20 -15788 -36607 -43374 -71443 -73243 -58378 -63706 -90605 -44466 -23046 -42097 -66171 -26390
19115 -26390 11757 16809 28555 49518 18723 -10819 -12185 11930 7644 5461 31189 51055
19103 51055 36004 18973 52592 33387 17743 15504 27901 5676 -20244 -44786 -84244 -83319
19091 -83319 -74422 -64392 -59014 -41684 -58722 -41069 -10816 3177 -4984 35584 21239 -29610
19079 -29610 -37766 -42001 4720 37831 28066 30756 1671 -24440 -26795 -50526 6466 34768 37764
19066 37764 33234 3696 -18020 -6288 22040 28659 18254 26201 16090 24904 51651 12869
19054 12869 5151 -26363 -75106 -79967 -60033 -30837 4527 5433 -11247 3146 5120 29334 54114
19041 54114 8489 -20099 23575 31538 12736 -24040 -26703 -40953 -38847 -52413 -35280 1872
19029 1872 9115 -11867 -6381 -23201 -8318 -39213 -20794 -45473 -31484 -29758 -32339 -12 23973
19016 23973 11597 -40046 -47987 -27780 -35737 -40235 -36393 -22169 -8148 -8411 -27469 -42379 -43266
19003 -43266 -21078 5281 25845 23958 27708 21843 31765 4007 -7673 -35484 -73157 -50561
18991 -50561 -57686 -36434 -9721 29601 37298 51990 26003 -15174 -13569 8613 31168 55192
18979 55192 41458 26920 24899 -7898 -30417 -29085 -29204 -32244 -18756 -22771 -41338 -81466 -56696
18966 -56696 -9314 -7512 -26110 -19633 -16146 -15245 -47318 -45367 -7368 47788 73396 41091 10657
18953 10657 34598 41704 11320 -39261 -5220 26275 10937 -896 12144 -1904 -15645 4814
18941 4814 44204 37905 2133 9032 23604 12541 3019 16637 108282 190441 224043 269029
18929 269029 303868 345639 429578 461600 468941 457450 465456 496373 448810 348962 228220 136681
18917 136681 85174 78150 47116 73765 104751 110199 105839 37812 -10941 19989 44428 62116
18905 62116 63902 40475 23542 34331 45378 68374 69445 147279 276530 402534 495312 535740
18893 535740 523573 489249 477397 476695 465026 379669 286829 180449 119025 105705 85295 74189
18881 74189 49168 2194 -18710 6820 23602 26449 17885 49304 49427 61015 49355 53973 30907
18868 30907 23591 40992 3600 -12840 11822 -20948 -23726 33804 96895 126978 109713 24783
18856 24783 -50306 -81154 -68252 -33008 -30556 -18142 -26406 -6183 23777 10104 -181 -20936
18844 -20936 -39768 -19023 8854 19392 -2594 16296 1471 -33864 -75078 -77763 -47942 -5453
18832 -5453 33260 -1672 -19362 -21816 -38416 -41244 -38796 -30860 24351 38628 -11223 -31784 -51028
18819 -51028 -45639 -33723 -23045 -58398 -76409 -45206 -47330 -46729 -6985 6108 -10892 -23531
18807 -23531 1281 -16521 -2939 -17715 -3759 6021 -2477 -9023 21217 48883 49002 33456 22562
18794 22562 35108 9082 -38912 -66092 -72669 -50827 -23866 -16020 -16265 -2003 8326 -1447 -3060
18781 -3060 -14177 -28051 -16346 2843 -11302 -27867 -39190 -40127 -10335 10432 1322 4591 -5800
18768 -5800 -2749 23116 89230 165629 292197 378477 312657 222108 121632 96427 51470 3560
18756 3560 3250 24755 41209 71803 82353 82286 79679 51413 6202 18342 36210 -20282 -40778
18743 -40778 -14994 6278 -12395 -16140 18908 21576 4267 28895 9808 -48338 -68645 -69667
18731 -69667 -46219 -37851 -38315 -29028 -27012 -32223 -34897 -24813 -35180 -19591 958 -30236 -42845
18718 -42845 -42239 -32073 -20850 2595 19418 -13197 -36134 -18734 -45748 -37405 -23899 -35235
18706 -35235 -56688 -25444 9968 11066 4085 6793 10072 36799 22230 7459 12293 -32437 -52562
18693 -52562 -55603 -33027 -21197 -5046 11101 8575 14754 40351 23323 -19389 -3132 21738
18681 21738 14978 22656 26734 18846 -46260 -66812 -49071 -33029 -24381 -40938 -44196 -15648 3833
18668 3833 37378 77402 68633 31484 27063 42329 4951 -5694 13844 8361 -21908 8380
18656 8380 472 -17009 -43577 -57077 -10540 4245 -24401 -47139 -42261 3217 -10290 -23544
18644 -23544 -22555 -19810 7778 19477 7803 -32206 -63585 -34086 7143 -2318 969 43254 20782
18631 20782 -19346 -8381 -57826 -61784 -40125 -4138 -13326 8776 25621 27625 26198 14462
18619 14462 17301 22749 -6430 -32414 -64943 -48590 -34131 -56776 -58393 -26120 13942 -10465
18607 -10465 -40855 11113 40802 21497 37318 53484 57931 38605 -5028 -30146 -79109 -93390
18595 -93390 -45317 -6268 -4837 -32358 -13205 11911 934 3400 -7305 16614 59201 82306
18583 82306 93082 71062 45617 37258 14359 16753 6881 31553 21194 20267 41435 32323 25868
18570 25868 45661 42026 -36599 -79531 -76835 -59152 -2267 54271 31489 13038 -2947 32575
18558 32575 521 -29569 -35677 -33693 649 3440 -16467 -20326 -42483 -9065 19873 15714 -1176
18545 -1176 20808 25057 9074 773 689 -13135 -40342 -37270 -23140 -47836 -75702 -82709 -55288
18532 -55288 -23176 -35672 -31746 -12618 -26812 -32195 -30497 -16590 -7535 2878 14102 11493 -38055
18519 -38055 -60593 -52119 -44390 -46825 -57697 -24507 -22365 -9297 16595 38774 28354 16763
18507 16763 8216 11091 -13685 -26305 -40382 -29685 4259 28177 1048 -39395 -35535 -21174
18495 -21174 -35978 -6336 -33828 -48277 -36303 2765 19546 15979 10136 -17726 -29296 -29016
18483 -29016 -9359 6693 13189 15288 26610 37553 14233 -844 5157 13963 -6434 5115
18471 5115 22183 -8412 -17365 -35323 -28864 -19230 -46120 -62600 -36309 4722 -3722 -43832 -48622
18458 -48622 -11458 -2831 -15344 -7945 930 27562 27404 -9751 -26801 -1443 20342 46358 41967
18445 41967 61418 58447 40544 16677 6523 35597 28509 27109 40232 6614 -26010 -38296
18433 -38296 -56461 -54803 -58451 -61230 -59331 -53222 -42534 -47916 -30097 16997 42603 36679 7715
18420 7715 44 -13315 -21522 9328 35641 39241 16171 -30990 -34284 18484 25962 -4022 30735
18407 30735 30201 9992 30858 41741 34625 12222 6673 33658 44094 19397 -11511 -60408
18395 -60408 -50209 3660 41460 105912 130285 144823 155262 172574 145873 99624 41963 21414
18383 21414 24291 15074 26698 33469 32401 33449 9448 -13989 -42115 -54603 -52621 8296 35042
18370 35042 1886 10316 2372 21197 36138 21603 -12367 -41417 6815 74724 77470 79130
18358 79130 91397 88013 104179 68872 51322 35303 34672 17199 67726 109398 100805 80388
18346 80388 96486 65960 59206 21582 -27227 -23502 20207 34587 59861 46713 23508 -1228
18334 -1228 15384 28430 25358 50892 74757 53493 55505 18373 6413 6849 9372 -3933 -47051
18321 -47051 -24526 2270 -25262 -36675 2570 36796 44123 10484 -45650 -64584 -34233 -35466
18309 -35466 -43967 -40838 -24753 -20794 5879 6017 -1182 -10904 -21919 -15157 13261 25806 33439
18296 33439 10752 5636 18612 40421 22736 -4904 -4353 39532 38054 48533 42731 43137 34973
18283 34973 23341 38060 33296 20366 38373 36718 -8208 231 -13079 -16294 6574 53908
18271 53908 84727 76123 44967 31267 45614 68619 64066 56964 52363 80391 99565 60583
18259 60583 50340 43702 35840 -43289 -81668 -91955 -73315 -32854 8938 21562 14491 33833
18247 33833 48275 43178 49646 74664 55902 39361 46701 77330 76715 74364 96437 104131 126774
18234 126774 125203 100460 81171 94745 95851 82383 107837 104071 87250 59251 47356 40239
18222 40239 49179 69688 75277 75450 72921 59124 54430 59654 59741 53193 48985 17049 -7750 12898
18208 12898 36333 49694 55931 36747 27428 48261 70649 57449 36304 46032 60183 63511
18196 63511 39944 9337 26294 50661 88230 96124 68692 29005 26237 67476 80201 60161
18184 60161 36894 22159 46234 61192 79490 78700 94214 114992 76565 36816 22098 18730
18172 18730 39632 34366 45501 72986 58751 82488 92286 110683 105237 104412 79715 81188 60846
18159 60846 65617 77466 71438 75190 76989 79914 97882 114946 117396 137489 127518 167915 198283
18146 198283 156298 97426 91460 129056 140080 193022 216995 212106 215474 220856 238472 302938
18134 302938 357399 392083 392087 394734 418370 418956 435413 479979 525554 571977 660202 774437 842345
18121 842345 914278 1034567 1202294 1400989 1647205 1904655 2231659 2727733 3357411 4227703
18111 4227703 5585309 7709921 11369815 17695625 29052595 49393203 71442383 70320394
18103 70320394 55170202 39835198 25289531 15849544 10845662 7996756 6178116 4960687
18095 4960687 4136677 3539380 3030096 2616934 2300064 2025245 1809497 1634357 1461456
18086 1461456 1294703 1133250 1028741 907616 822442 766484 730874 689667 621447 556223
18076 556223 500952 459487 419706 378208 343785 338291 297200 266322 270637 269988 272663 255663
18064 255663 224384 191771 196300 172147 176293 152781 145123 125696 121401 124335 143932 131909
18052 131909 63769 49468 58865 67216 73418 51833 39846 25755 -8260 20843 51342 104844
18040 104844 91240 58878 102141 105349 105830 93548 41228 38620 77600 84241 70076 68505 100406
18027 100406 94460 63281 60032 87109 112405 98058 74695 17301 33164 42198 12493 7487
18015 7487 15321 50190 62918 63541 46366 45746 62252 50060 28830 59630 87962 76438 23983
18002 23983 1260 15802 -14672 11247 40785 12859 -14349 -14362 -47683 -59843 -57904 -68234
17990 -68234 -45793 -39113 -35401 -3356 -1577 -11307 6705 3981 9686 6851 13244 -28077 -1916
17977 -1916 -7656 -10754 -8687 -6068 20174 29715 24061 5956 992 14852 38768 11360 -34990
17964 -34990 -19378 -41979 -31074 -44373 -18788 9617 34698 50924 80802 34770 13800 11648
17952 11648 8058 10924 34001 61417 34161 16623 56291 51075 43633 30759 17435 16536 21406
17939 21406 17059 -3874 -17191 -15929 3858 9966 43663 45662 47918 49735 11977 40566 44339
17926 44339 788 -20650 5891 46765 81542 30600 8331 -33245 -55445 -39508 -24488 -3540
17914 -3540 -18259 -22546 -2258 12381 -17892 -19742 -6268 48093 44056 35511 -2003 -32268 -37375
17901 -37375 -38951 -66392 -48929 -41014 -33202 -50177 -52852 -21833 1010 -11111 13 33839
17889 33839 74588 47199 7154 7003 -4735 -4652 -29316 -23160 11950 47423 54202 54125 14325 -3466
17875 -3466 -36736 -25466 -44432 -19249 -6863 -3499 13137 4668 28270 10954 19508 29934
17863 29934 15103 -4946 -8421 13497 8990 -1421 -17616 -21900 -33896 -24921 -21104 -45743 -31435
17850 -31435 -22833 -26931 17553 56330 41690 32955 25382 6277 -3816 -6167 13341 30626 -20131
17837 -20131 -12255 -4103 14886 18380 40967 52938 33126 32386 13716 4941 -20480 7025 47204
17824 47204 35386 65597 65772 71973 49446 13276 -2047 23217 67445 70649 48335 48202 22646
17811 22646 -726 -5556 -20231 -17882 5550 25306 25968 15870 8383 -22457 -12534 62413 99804
17798 99804 105438 86241 62030 -4790 -27759 37886 78016 45672 22264 30817 25178 37168
17786 37168 65539 57290 23410 -8147 -25926 -11592 12726 -10221 -20050 8717 39143 42388
17774 42388 38689 -457 20637 35508 52963 46978 81833 96404 68692 56231 20067 -30243
17762 -30243 -19132 -14176 4465 7429 13295 21372 -35566 -49693 -21730 4774 -12327 -60083
17750 -60083 -74086 -39026 -38673 -17495 -28855 -10223 34342 -4786 -46518 -60616 -78754 -43314
17738 -43314 -57914 -65272 -33956 -32791 10195 38233 47112 45145 33815 41005 23987 42914 6364
17725 6364 7013 22652 58240 74551 38905 65005 52494 57601 51635 37620 25710 29491 93612
17712 93612 97060 36768 5432 9047 39576 46797 64947 66091 48556 27029 31796 -13989 -4024
17699 -4024 33118 59963 53585 49993 34894 37638 67811 57553 11501 7174 -13562 7411 27369
17686 27369 36521 45196 71361 70212 85422 92385 98702 103073 90354 51246 66172 133946 147744
17673 147744 172072 189804 252851 331449 361340 436255 511924 560289 588737 610893 635605
17662 635605 657324 677802 695271 703255 689812 630281 584464 576961 566225 560440 506176 454907
17650 454907 404126 329463 284169 276809 292460 250988 253193 212088 156849 157606 132610 97908
17638 97908 96430 110134 118581 101513 91012 78198 67814 77874 125214 136928 104928 75681
17626 75681 52915 83523 85361 78137 76794 77658 75916 76183 83047 114405 144764 147173 166021 197112
17612 197112 219669 236084 235809 270723 308457 329463 380617 401909 370593 374090 382470 369250
17600 369250 347441 331618 319541 318191 315487 302096 272454 239588 174117 136376 103152 89122
17588 89122 102337 118090 101743 84898 115786 107449 81228 128468 162889 182389 199993 234444
17576 234444 282757 328552 346479 395484 422189 425101 432533 412786 384718 351559 352217 343850
17564 343850 305709 266573 245639 232093 203687 205034 183306 201737 180748 153381 117571 95666
17552 95666 127644 124461 82955 30962 -17622 -9702 -13796 -20866 1861 53586 91549 99099 96351
17539 96351 103854 96834 101369 77094 35412 44894 49978 69397 77985 59515 61628 76766 57909
17526 57909 -16006 -61142 -58081 -16485 17874 32884 32287 45394 49663 91036 117333 83664
17514 83664 50481 33569 37384 10457 -16504 9023 19485 42127 49579 38061 45117 65641
17502 65641 68201 58195 37633 37262 38395 2287 -18292 -13425 2429 -13517 -31418 13750 39406
17489 39406 25567 13313 -10274 -482 28776 45385 60262 52313 80024 91448 89752 67037
17477 67037 79432 60685 42912 30385 9188 9331 13038 20564 19720 31180 34910 54815 117536
17464 117536 127648 111607 109537 127678 124202 117945 91002 43020 19775 26238 25260 35328 49950
17451 49950 35240 46631 69873 82657 84777 92453 101546 85375 114863 128365 168830 295833
17439 295833 438452 526417 471057 401292 340917 269677 181341 128537 105559 109567 96603
17428 96603 45145 63681 121206 114131 71009 58300 103325 132758 136622 134272 174996 207198
17416 207198 161985 132624 160812 188868 200725 166943 160948 179259 195227 187432 202486 185559
17404 185559 139592 86512 123263 149957 130312 131747 115913 117630 128208 158612 140927 125137
17392 125137 96378 111588 125980 117341 112223 106129 105463 112341 115200 143245 123497 117139 136959
17379 136959 139583 168443 171778 137848 139951 145292 160599 144387 172043 154528 113568 94804
17367 94804 112894 174155 202452 173633 170515 177805 146551 121573 117805 137438 167280 174698
17355 174698 161712 142205 143616 174182 169627 182196 214231 262500 241988 237937 226836 232587
17343 232587 245508 245156 247777 237278 236716 242264 190891 200113 218175 221049 206046 187257 197545
17330 197545 184473 168793 171457 171020 193689 192140 178262 193113 201382 244944 252588 245664 229918
17317 229918 223674 212434 207817 194385 172683 177583 184447 172786 163718 169441 135363 131783 93353
17304 93353 62690 107817 94258 86861 124910 120731 144500 142036 185009 175258 141308 111079
17292 111079 124555 133481 162534 154292 181007 211330 222819 214235 266389 277445 245608 263869
17280 263869 281769 293242 316314 296380 262422 243146 248303 228010 255755 223056 256770 251849
17268 251849 281893 297336 281361 280526 307383 294654 277899 285370 273510 266331 277648 285566
17256 285566 296444 296857 295212 298829 303371 335465 361006 345721 325696 323735 332985 315867 330942
17243 330942 337037 303650 316494 339414 340344 359569 345925 359064 398166 422354 440603 446472
17231 446472 435983 448689 434175 460603 498807 544549 538837 517781 554623 565694 585872 619545
17219 619545 672930 682710 692704 704405 731317 755007 750293 770651 745410 803121 882716 914457
17207 914457 980779 995172 980896 1004477 1044711 1091740 1147993 1242019 1311878 1367298 1420550
17196 1420550 1479914 1585106 1724430 1800102 1867224 2010120 2185312 2381469 2585909 2776023
17186 2776023 3021358 3324475 3634629 3992695 4428821 4900589 5462937 6144289 6952009
17177 6952009 8009846 9384746 11268538 13869916 17515076 22306906 27856460 33422118
17169 33422118 38934714 45439079 54275701 65522160 77032306 86189038 92850343 98899712
17161 98899712 105841894 113545733 120559442 125923745 128994558 128398987 123925244 117939718
17153 117939718 112912471 109288366 104653851 96292199 84632507 72546301 62211008
17146 62211008 53961216 46778478 39732734 32914667 26792435 21743650 17844566 14953322
17138 14953322 12793472 11149270 9915404 8880621 7994116 7195679 6512887 5911160 5452852
17129 5452852 5033979 4679715 4349458 4055789 3762795 3541150 3377892 3242007 3097603
17120 3097603 3009947 2992635 2967332 2970032 3037802 3092851 3172096 3274328 3436281 3645798 3871808
17109 3871808 4094919 4420145 4798260 5281460 5884833 6628168 7602043 9015240 11085651
17100 11085651 14191517 18968996 25745354 33647995 40862814 47562030 55755588 64616563
17092 64616563 69890689 70622108 70681065 71590121 71421247 69097214 66871479 66210783 64925434
17083 64925434 60407082 54096617 48190231 42507957 36337168 30005941 24374807 19867057
17075 19867057 16663412 14601018 13354506 12764166 12701778 13113325 14081018 15946308 19194753
17066 19194753 24245053 30950934 37853905 43954696 50590321 58808146 65859406 68349784
17058 68349784 68381466 69020099 69805038 68667427 66230133 65027829 64691287 61964742 56123260
17049 56123260 49761875 43869067 37718834 31036426 24645613 19180150 14932278 11918747
17041 11918747 9879865 8404086 7336971 6479851 5779463 5124702 4576634 4150100 3793636
17032 3793636 3430070 3085039 2789179 2537990 2327043 2151918 1965932 1765923 1645512
17023 1645512 1569621 1444580 1363280 1285843 1147993 1057466 985764 949114 907368 846024 812267
17012 812267 798899 742350 695132 692591 678379 710164 718142 682801 595565 532327 505518 480926
17000 480926 479797 466941 410148 384086 400420 368778 331113 348358 328908 324630 291988 261440
16988 261440 274341 310306 317768 287604 275379 221785 213366 205743 204759 229605 190652 152385
16976 152385 163093 158895 146837 175380 174672 133974 131014 94839 120887 96460 113436 139950
16964 139950 164234 162295 208608 224074 176107 168640 147884 119807 151043 193223 198214 146463
16952 146463 131352 147390 199370 191284 147673 107565 108662 128316 139488 147121 181874 193868
16940 193868 197991 200843 187165 176021 149512 110780 66341 44407 67978 115423 86484 50774
16928 50774 88102 103215 90398 105080 75168 28252 41346 93332 84656 54671 52610 48045
16916 48045 32711 70569 103861 94478 84576 107024 142800 138054 90254 92766 125414 125124 121563
16903 121563 102688 87087 84195 80047 76651 95773 82829 48129 82966 97007 98125 100599
16891 100599 78000 88146 53589 7931 23343 34419 46131 29662 33808 52444 88027 82891
16879 82891 35669 48691 22003 -18973 -12640 -6717 -6282 3217 -19762 -29758 -4939 -12362 -22535
16866 -22535 -14746 -14591 -36608 -31497 34790 81532 69937 63178 79980 94921 95599 66689 51225
16853 51225 56425 62505 42973 75377 84639 89558 72702 18544 26473 52191 63393 59277 52894
16840 52894 81431 72958 34203 32961 53922 66864 62315 30536 49419 73449 87821 56218
16828 56218 30862 -4422 -2788 -21354 -42051 -32503 -16186 24360 26385 38148 52268 75365
16816 75365 127894 154748 89873 31875 28015 37414 23099 -7835 5323 4663 -10713 -19829 -30391
16803 -30391 -58418 -78410 -49025 -30041 5688 60354 12298 -6661 -11949 -19782 246 32
16791 32 3195 9399 17278 26466 16542 19929 -9447 5646 -17293 10731 48168 50070 66700 46186
16777 46186 46545 18648 -5571 14162 10043 30780 16879 8827 11073 34525 17266 19123 -30799
16764 -30799 -93144 -135462 -97537 -46738 -37980 6296 23788 29439 46763 19873 -33477 -41177
16752 -41177 -30666 -2416 21228 44333 9632 4540 4890 -10832 5246 22575 22788 4431 16084
16739 16084 -19388 -14378 35877 39304 56555 39042 14513 27927 39586 55145 63104 58717
16727 58717 54887 60952 45157 46195 44407 23588 14832 -13581 -39430 -21869 -29403 -36692 -9483
16714 -9483 1705 12232 18606 19231 4971 27192 43234 26046 6030 -26503 -36853 -65555
16702 -65555 -77833 -58715 -55258 -49805 -9062 37956 25208 1506 -8531 -13347 -24749 7073
16690 7073 32253 33570 2017 -42054 -51507 -47378 -19985 -23537 -25086 -7322 -27588 -39932 -25435
16677 -25435 4913 3489 30922 43217 16657 8969 34584 50037 75938 38337 39951 81702
16665 81702 116086 144213 149137 138854 177283 242483 319908 412389 508936 542738 552261 557021
16653 557021 576441 597981 632474 631521 594877 570681 585097 567101 525469 518935 455544 352460
16641 352460 344056 338792 262413 198460 196333 170204 146212 165216 184912 201857 190635 147882
16629 147882 110077 71986 23391 31052 33254 43405 45152 2767 -50140 -33085 16447 10058
16617 10058 34505 33741 12580 4243 337 15702 14439 21557 1536 -6810 6191 -25071 -19129
16604 -19129 -1932 -39005 -24324 -18123 -11332 -2924 -23461 18183 31619 5512 3562 20169
16592 20169 -2802 18004 38981 44326 66000 93205 112493 102641 95684 59027 34140 18632
16580 18632 11236 70326 130084 132996 141948 158848 188277 202350 199309 235425 287624 342478
16568 342478 336942 340306 328369 336036 354605 325510 289091 246081 164116 115683 123699 123955 131262
16555 131262 129669 123395 88359 91617 92551 115655 68931 34910 63359 121871 143583 175692
16543 175692 200485 245436 285316 278488 309256 327412 315420 300175 266097 280663 263330 255382
16531 255382 254071 225942 199544 210797 222008 168562 102284 95379 53943 18897 20788 -3839
16519 -3839 9129 32313 22095 31164 27449 17168 -17821 10172 19124 -10389 -11443 -2416 17237
16506 17237 -16091 -20883 31696 52218 25111 -24530 -55351 -58792 -32583 -7026 31321 4297
16494 4297 -18316 45756 10792 -49380 -47923 8955 16479 511 30745 82843 83210 71571 50354
16481 50354 34500 12402 -2028 -2908 -24373 -9408 -15150 -71593 -59288 -7330 -2878 -42390
16469 -42390 -40868 -40775 -58100 -38671 -14951 -20419 7073 3416 3200 -7295 -13835 -10735 -1649 -2958
16455 -2958 -34129 -45216 -39172 -64314 -42947 -43647 -46981 -8431 23606 -20734 -48027 -24235 -38780
16442 -38780 -27885 -46235 -46003 -42961 -31844 -12143 -4398 -20465 -55875 -61879 -69073 -60524 -8712
16429 -8712 -8051 632 -285 -15632 -21289 -26096 -21345 -22712 -25097 -12062 16667 65424 53482 38190
16415 38190 39672 37765 65208 24789 -3424 8645 -20529 -33259 -29525 -13447 -21089 4714
16403 4714 -66097 -86120 -46873 -35883 -31530 -31297 -11608 -10060 11613 42882 26542 38673 57989
16390 57989 41096 35268 55695 82851 57489 35646 19606 60641 64092 10260 5595 -285
16378 -285 -6452 2991 -21333 -35371 -31631 11967 25104 8359 -315 212 -25300 -49300 -74356
16365 -74356 -61495 -8949 -3768 -12534 -10177 15280 10502 -18604 1533 22633 -349 -53012
16353 -53012 -58750 -31084 7701 38138 20578 11038 32047 35800 22077 -4902 -3231 -32234
16341 -32234 -40041 -45492 -59212 -54747 -27531 -23684 -18116 -30927 -30399 -19455 28449 40390 -3214
16328 -3214 -11120 -22621 16596 11357 -4627 -9773 -31528 -27389 -4609 2544 -21299 -41982 -59153
16315 -59153 -52495 -14253 -31153 -46118 -67802 -41453 -6076 -5068 -15139 15150 -2693 -20186
16303 -20186 -75396 -87064 -77091 -80915 -77633 -62725 -40586 -9729 -9480 -56673 -43758 960 -2932
16290 -2932 -25506 18918 17893 25598 47404 44851 -1930 -23695 -41262 -45857 -30187 -56436 -57556
16277 -57556 -91109 -73769 -45063 -24928 -25 -5773 11137 8668 -11139 -8801 -26171 -58966
16265 -58966 -46797 -45852 -54344 -88356 -73007 -31776 -68492 -66052 -17850 27272 -1975 -13277
16253 -13277 11048 -12554 -45315 -24019 -62225 -37086 -30924 -13262 12909 12933 8547 13449 -6390
16240 -6390 6774 5709 31356 -16416 -47812 -50519 -38524 -45705 -46181 -39911 -50659 -37177 -17793
16227 -17793 -18502 -82129 -55718 -65518 -75095 -57305 -6428 -21012 -22562 21257 51368 22306 -565
16214 -565 -9849 -6851 5675 -9421 -20251 -13760 -21574 -719 -11055 -8081 -17018 -31058 -33862
16201 -33862 -31012 -17516 -17550 -29146 -42573 -9094 6284 -17508 -58456 -45494 -3619 21985
16189 21985 35807 39200 -4658 -42443 -62937 -64136 -34579 -14065 -5517 7970 44068 23972
16177 23972 34377 19513 3114 -7553 -44493 -38949 -35006 -44218 -1469 -19055 -28493 -7768
16165 -7768 6064 15509 11876 -24434 -58764 -53996 -50874 -23400 18521 40442 41161 19177 120
16152 120 -17821 -3970 -14189 -22501 -5715 -31449 -15019 26314 1490 5993 -23273 -57706
16140 -57706 -65277 -23280 10557 9522 47318 38310 43121 61081 58698 81338 56729 11581 6498
16127 6498 159 12162 -26865 -28550 -33595 -23835 1753 -5875 -14880 -52678 -51896 -2646 30983
16114 30983 52813 47381 12834 -29093 -49514 -55049 1143 57055 43768 -8178 -9219 -20318
16102 -20318 -29047 -37461 -22054 -17741 -26204 -31995 -40655 -76674 -84810 -90725 -64364 -43724 -37218
16089 -37218 -73385 -97947 -75984 -43742 -33922 -12855 4232 -6738 -5714 -7747 3354 4941
16077 4941 -19783 -59761 -87505 -66448 -26761 -15933 -40509 -37298 -62456 -41573 -10019 -31249
16065 -31249 -50354 -53324 -51008 -49994 -46185 -36128 -34254 -32004 -41960 -36016 -51873 -86074 -80331
16052 -80331 -90292 -84809 -60260 -54420 -55006 -78002 -87283 -79752 -18200 21254 60980 58397 57227
16039 57227 82078 90699 34154 -21235 -59324 -39614 -2723 34737 32874 16055 -1396 17827
16027 17827 -4729 -53052 -27661 -53865 -17849 -38175 19903 47699 31921 15896 -34874 -4706
16015 -4706 1598 -16268 -28142 -35714 -89932 -110299 -114234 -94208 -72652 -69896 -46835 -39826 -34628
16002 -34628 4327 10057 -2123 -7096 -12610 16159 45130 21071 -15628 -13906 1406 -23144
15990 -23144 -77760 -50288 -14215 -9620 -39839 -40688 -54578 -57165 -39957 -76158 -88434 -47929
15978 -47929 -55599 -28958 -13784 -59413 -99334 -67919 -53358 -53480 -33889 -40882 -79996 -74039 -40963
15965 -40963 -19664 -13763 -53505 -92962 -74904 -25487 -33155 -13796 10492 22775 -13891 -9835
15953 -9835 -6391 -41708 -14078 -30668 -69884 -96814 -51892 -26561 5016 4226 -43760 -53042 -43534
15940 -43534 -35612 -25225 -22024 -20315 -6541 936 -10065 -29040 -8521 1007 -8231 -13199 -5762
15927 -5762 13206 -35880 -51999 -33680 -27469 -7263 4057 -895 12657 -48022 -68537 -31127
15915 -31127 20232 19335 16408 36300 19268 -8443 -2617 -28454 -37814 -38664 -3153 -14254 -71103
15902 -71103 -48953 -14196 7087 -21370 -24921 -37641 -68895 -63554 -40730 -14366 -15011 -48581
15890 -48581 -66532 -48337 -35222 -40477 4146 1895 -29858 -25086 -49218 -39281 -42753 -58823 -89154
15877 -89154 -110269 -80237 -49379 -59289 -79780 -84719 -70951 -42899 -36264 -18117 -39100 -53970
15865 -53970 -58200 -83568 -101941 -80092 -42705 -1650 -15452 -50784 -33283 -17020 -45554 -33958
15853 -33958 -13242 -10708 3552 5287 1453 -6755 -40724 -79484 -108865 -94323 -38996 -16399
15841 -16399 -13058 -53675 -59109 -24881 8657 -12524 -46305 -40969 -15117 35470 57225 49784
15829 49784 18828 21968 -478 -24070 -64121 -81361 -16543 23053 10976 25337 26793 25677
15817 25677 1627 12936 27464 35434 49930 28340 -27732 -83211 -75897 -22730 5805 -32548
15805 -32548 -40248 -44285 -28479 -14811 5181 28455 24325 -2032 -14193 8095 -8503 -40257
15793 -40257 -66450 -86951 -99362 -64259 -67629 -68267 -58931 -68092 -93933 -55200 -23331 6686 -1921
15780 -1921 -41982 -56118 -76829 -93136 -97456 -39410 4212 16682 56038 11359 -26350 -54138
15768 -54138 -37110 -34549 -16367 22321 -441 -38548 -72134 -44931 -53378 -18074 25125 43974
15756 43974 28280 1051 8235 19315 16989 -9639 18495 22842 -5177 -22461 -30859 -10623
15744 -10623 -67654 -111675 -105405 -96403 -71682 -49361 -54048 -64135 -36311 -7241 4833 -6781
15732 -6781 730 28117 27728 29386 32069 6060 4536 35847 85744 76281 36291 41708 81226
15719 81226 39817 8434 10740 -22600 -26272 -10897 -6716 -35805 -78633 -66899 -30590 10852
15707 10852 37979 35015 53614 65261 14235 -32721 -12385 -9693 22147 60246 52095 22168
15695 22168 -15899 -12667 -24592 4112 5598 7671 10265 -760 -36152 -31435 -38091 -75928 -86993
15682 -86993 -78240 -45461 -66781 -104950 -114168 -56223 -33392 -32359 -10033 31179 -5258 -18973
15670 -18973 -27380 -18017 -18194 -50407 -20755 -23494 -38730 -35905 -55763 -52991 -45244 -33781 -152
15657 -152 24323 7825 -5134 -11900 -57082 -48215 -36077 -53410 -63647 -12611 2114 8216 5390
15644 5390 7921 43767 60036 54273 60210 61363 66311 28370 -4586 -33557 -33190 -61581 -33547
15631 -33547 -12480 -24489 -2330 16712 20900 22894 23648 40338 52792 42746 52579 74659 45811
15618 45811 -2884 -19843 -30195 -45387 -53305 -33654 -39508 -19061 -18897 -18046 -11712 -992 33634
15605 33634 57305 45212 -12743 -19829 -2266 16732 -56864 -103446 -65765 -33005 -18102 3536
15593 3536 -2883 9404 13807 15690 65824 32060 6436 19217 -9811 -9837 27653 20089 -1752
15580 -1752 8090 13737 28594 12163 9783 37981 34397 18163 24062 6172 -3434 30089 13691
15567 13691 -19469 -50650 -44538 -1830 13979 -1076 24846 35503 22569 40831 51514 44675
15555 44675 30605 32371 16298 36351 74887 89216 55879 44626 4909 -9810 17350 50128
15543 50128 46171 46298 29432 33325 26262 8655 32859 73701 83536 89565 56443 35769 46662
15530 46662 58904 49532 26089 19673 675 12880 36822 56032 23254 -5243 18546 42886
15518 42886 22949 -11502 -39315 -45109 -53731 -53661 -46958 -2643 42250 72409 72422 643 -22245
15505 -22245 19156 22690 29859 65734 80724 53677 40529 60175 79651 51838 -3189 16455
15493 16455 43615 -546 -9084 22647 19480 914 -3242 23854 24259 -1147 -6123 24749 10964
15480 10964 -10365 14255 17147 47094 38265 5859 -2494 -4175 20612 35413 1001 -10826
15468 -10826 24584 43025 38422 16798 32528 39795 55216 36823 57971 68918 12887 -10334
15456 -10334 2358 25515 -16179 -387 11039 -22615 6840 33183 45242 33303 -12416 2343
15444 2343 37270 71565 75629 42212 -15542 -23451 -2852 -9549 -30482 -68421 -73323 -26550 -13167
15431 -13167 -3660 -20002 -10226 8729 -2565 28075 47576 30997 11925 -35025 -79002 -83871
15419 -83871 -27502 7699 36282 29333 11163 -7115 -47774 -61665 -37551 -3001 -15129 -17770
15407 -17770 -17569 -49627 -43086 -33260 -27760 -27769 -30729 -58067 -71622 -58344 -9908 2968 -23747 -23871
15393 -23871 -24086 -41278 -46272 -45274 7819 69456 98227 91859 98244 96978 31693 -123 1624
15380 1624 25727 17745 34756 19105 -13431 605 8950 -4077 -37869 -45550 -39799 -6859 -2754
15367 -2754 -27254 -41357 -35995 -20262 -15976 -12151 31722 27736 764 -13436 -24925 -49606 -49021
15354 -49021 14801 57386 44528 50207 34258 1823 25630 29857 25756 45094 -2589 -26082
15342 -26082 -8800 871 -14080 31736 8392 -31985 -27410 -44259 -45709 5011 38456 39854
15330 39854 53149 23460 32732 27771 10988 15830 -18779 -35003 -49839 -48920 -8953 16785 -11702
15317 -11702 -15048 6833 -14069 -43041 -13509 53737 35968 21623 29289 -12230 -19064 7610
15305 7610 -1389 35213 53159 6984 13823 44095 20158 2411 -18726 22094 53523 14189
15293 14189 -21930 -51236 -64269 -61541 -22159 -1793 5668 5984 5125 55255 68570 63032 48697
15280 48697 34096 28570 39850 18814 16201 58364 45198 11023 -14947 -22031 -14714 -15610 24715
15267 24715 29595 11304 -20466 -36361 -20225 29249 61969 39850 23456 -1463 19581 29220
15255 29220 12036 22413 -11550 -12549 -25280 -41102 -40018 -31804 14592 43010 36907 18077 -31007
15242 -31007 -50834 -55234 -49962 -47989 -28686 5817 75732 81314 48689 71836 78933 71298 34109
15229 34109 42637 24577 23819 8285 5040 -23081 -21582 3303 -1294 19299 35414 27687 55996
15216 55996 67156 85290 74779 75271 52188 43960 50795 39091 40532 56101 50134 48229 38723
15203 38723 -7438 -24621 -20905 30400 10214 13481 30521 51250 47718 35629 23158 3903
15191 3903 41222 78696 87683 52865 13528 4730 6177 36905 52339 35675 21852 39197
15179 39197 57244 30051 -6434 -22303 5152 42846 65774 44645 2711 -2432 26244 47001
15167 47001 34601 20997 27451 45236 41042 72454 41004 30217 47490 62853 55699 18305
15155 18305 11908 -15387 -21733 -3624 -22456 -40846 -456 48359 46648 48220 69743 50102
15143 50102 62586 52455 57341 58667 51764 43738 46740 23421 -13210 -14332 5364 27166 12303
15130 12303 -24137 -11966 -8995 -11143 -11853 25086 18295 48018 56087 70709 58930 21211 18268
15117 18268 33421 29610 43166 31291 46788 18210 -23597 -15842 23370 37589 23682 26441
15105 26441 33199 11331 30790 59960 47399 25349 24728 78564 88091 82707 48852 32191 9204
15092 9204 -48560 -60984 -42583 -23525 14628 6862 -31375 -30767 -35393 -22737 -16605 20722 4201
15079 4201 -59934 -79384 -38191 -29545 15392 46244 20676 -5185 -17783 11582 44299 41957
15067 41957 42137 -1943 -10155 -7263 4940 -9208 -3477 -13078 10920 19241 28195 54269 74472
15054 74472 55350 16803 16354 74338 120427 112265 86669 58492 80440 77369 52727 45113 43090
15041 43090 54071 42525 47190 50197 59820 34142 31030 39252 44030 49176 72898 96741 97113
15028 97113 70939 51953 47414 28411 36017 13726 28845 35962 7949 -4780 13867 11660
15016 11660 28440 77912 101719 73931 80556 98765 68918 37455 46963 52157 69113 57461
15004 57461 56296 82650 68032 75074 58943 61435 86382 125863 144004 137074 167262 199313
14992 199313 223149 279496 391017 621980 1023328 1714414 2578551 2764247 2246501 1629870
14982 1629870 1021476 601269 393518 273509 217563 206067 188660 156031 149453 131144 82796
14971 82796 25460 19942 -12462 17913 32200 14993 25947 65701 69187 54360 17173 15686
14959 15686 40024 70905 49812 30767 38884 37591 66804 83269 63689 28288 52352 37773
14947 37773 23729 36222 44767 36600 62532 53044 27281 2015 -20347 -20769 -15765 -5185 41446
14934 41446 56667 61425 57253 3772 25014 34644 27178 23073 11590 2615 43782 44092 17818
14921 17818 27111 44315 60695 32251 8078 -26136 -1485 40463 50041 26138 22124 60916
14909 60916 135425 166565 125825 62654 49204 25710 -6192 1495 -6169 -19189 -72709 -58711
14897 -58711 17203 61446 73976 41843 28084 38597 18333 57136 43478 46812 42013 23597
14885 23597 33904 18391 36093 17383 4826 -2178 8322 22133 22173 22964 17074 -27621 -30007
14872 -30007 -1923 28757 44252 32309 45871 55904 62483 90768 86917 43344 -285 8458
14860 8458 22417 36572 61283 60698 28119 52610 40556 73568 70624 61489 43378 15908 589
14847 589 26885 94807 140908 115328 37082 -5380 -42515 -49638 139 21258 278 13553
14835 13553 45140 26596 -6958 12832 11636 13251 911 -10490 24658 17122 13555 37791
14823 37791 48964 57947 73568 57856 27430 -11914 -22291 -817 7738 54335 55158 54591 51064
14810 51064 55271 58760 15080 11814 36839 34244 16322 31114 54810 49237 21617 24924 17587
14797 17587 15584 73425 107921 107956 72042 41362 23556 -9283 12880 21274 17742 33141 47141
14784 47141 57220 23021 22140 63506 98200 75709 52897 67301 64600 43179 32419 53763
14772 53763 42717 45068 59221 38868 51220 59855 66331 52398 1375 -14147 -19575 15348
14760 15348 52250 42585 64502 84510 74147 72652 102281 107569 97767 62975 63060 76812 107918
14747 107918 112709 82257 75828 65061 54963 82142 101094 73635 22225 1669 13746 27711
14735 27711 16280 57348 722 10253 54322 45332 65204 87115 68992 30110 25052 7511
14723 7511 -14439 -27500 -8105 14961 21326 43770 66128 84320 132959 115245 115955 113672 83300
14710 83300 44864 20963 -19248 -33369 -9123 13512 12720 31474 44799 51978 67186 71936
14698 71936 62620 65687 55330 27815 15247 8799 527 22482 82018 84606 39528 12844 23939
14685 23939 15567 -6274 -28101 -17750 6804 7619 10637 26871 48966 70323 89019 82070 50838
14672 50838 71463 76411 95928 76395 76297 84453 59888 66212 46141 8254 -26128 -15956 19102
14659 19102 48237 26372 18241 18924 17277 -15017 -12278 3838 33715 32512 356 -6266 22840
14646 22840 1177 -6050 -26389 -25722 23690 28206 36721 52310 52820 53056 9805 9962 30958 47710
14632 47710 55858 44750 50370 79472 52606 24585 -4529 -43344 417 43028 8344 -26421
14620 -26421 -5313 30260 32206 11326 18101 -9015 -21183 19144 43673 44836 69191 55145
14608 55145 51155 41979 36630 35784 30351 25859 69743 77847 46994 3851 -5620 38355 37181 58692
14594 58692 36587 -7665 -13317 41969 116646 117533 84768 36298 -11751 -863 11840 53925
14582 53925 75314 68942 59028 45025 45274 51779 47278 43116 55929 68169 116833 129974 123822
14569 123822 126542 94037 90099 53983 75350 123083 122450 93763 54344 44576 25216 61253
14557 61253 100617 89720 59333 65744 51158 20786 28526 33833 56748 83070 123527 141757
14545 141757 102542 77303 100945 121995 86292 44800 35235 44507 79508 89832 75741 72486
14533 72486 98700 99416 79913 51483 30683 18739 54332 78485 60700 60491 55480 36366 -6491
14520 -6491 52732 82738 82597 50946 54078 61720 53165 74733 91399 75709 53603 49605 76515
14507 76515 97453 79126 64655 78645 82109 90196 69405 91235 102968 71845 60070 112609
14495 112609 149255 101273 56035 35026 77164 87261 72596 82773 58130 60351 40144 13012
14483 13012 -15138 -17264 -8750 30384 41392 47954 71869 67945 67163 71999 57139 47729 68165
14470 68165 40036 26120 55363 87604 107867 120444 117919 88843 88719 52303 32005 68737
14458 68737 97046 86377 92983 95721 68081 42961 73407 94208 117585 140793 104267 84457
14446 84457 103837 127542 136863 115852 63401 45197 35561 57504 73878 108678 112455 105223
14434 105223 133374 148823 138025 113886 86652 97837 150733 149743 153105 195847 242816 279858
14422 279858 284516 246570 234488 202188 213220 184843 185580 223084 288140 308160 320360 358210
14410 358210 402503 453566 533295 653525 878785 1065933 1238200 1367963 1500633 1606102
14400 1606102 1715239 1787231 1793883 1723009 1619435 1473877 1303531 1170087 1012296 853675
14390 853675 732342 613287 498090 440171 406327 370885 345280 328639 292786 256119 237053
14379 237053 235178 220240 203568 159052 157161 185241 174959 161630 154669 136621 120311 102794
14367 102794 105204 110667 104774 154216 161296 115413 90716 75234 61314 54162 96324 129278
14355 129278 108234 68944 96778 109854 91112 104862 126656 117523 120779 80557 77374 106180
14343 106180 120253 118733 121475 104918 98968 82136 133262 132389 102952 109736 102424 113369 147383
14330 147383 151747 188842 187071 166783 99323 68734 79544 76772 99218 100970 68946 61839
14318 61839 90457 104126 84212 97510 102738 101129 68930 72217 104286 102761 95465 96376 96986
14305 96986 75191 57508 80283 97442 108152 104231 95777 105748 99346 126592 140974 133946 134621
14292 134621 131760 134412 143743 139933 156252 174479 202448 183021 169357 170182 131210 98834 119951
14279 119951 167313 160840 164171 177078 193329 203032 180999 181800 175812 162598 139561 123530 120480
14266 120480 97066 77634 81050 74603 81843 83171 74622 65699 71841 109780 127894 75468 53203
14253 53203 70579 78253 97737 102806 116896 157872 175701 218085 213556 178913 137238 139487
14241 139487 132024 136723 139452 168563 214420 223765 213352 221417 213958 219493 207068 197969 177330
14228 177330 159288 158142 152152 167569 182723 163639 168745 191449 197317 185007 217721 232553
14216 232553 269903 315891 323101 292706 265745 255627 285979 317464 354915 391799 423214 439175
14204 439175 425043 380089 343010 332261 314404 287235 264314 259143 225235 237267 291660 271132
14192 271132 207201 191811 197749 190975 206192 181064 178125 194705 200380 186785 183996 168174
14180 168174 143054 177220 196313 240299 215426 200127 201081 244273 240802 211595 141560 159089
14168 159089 201706 215946 235759 223207 188352 183343 213481 220468 222350 214721 203640 191127
14156 191127 199625 228965 199808 192683 225420 238067 204763 225773 270539 272515 228932 260574
14144 260574 300543 324857 321393 332115 346688 341355 356673 391213 402409 380118 402913 424272
14132 424272 425400 439756 454821 464193 481464 466094 457427 424387 425335 383583 337710 378444
14120 378444 424964 419614 415619 423997 443167 423514 452595 412534 372189 351058 318837 320798
14108 320798 271518 248202 283306 249380 183854 154874 152569 174329 196263 192795 218366 228729
14096 228729 233474 233991 247050 250529 303828 307585 320208 346470 370391 403568 465176 510024
14084 510024 517616 526819 547172 556570 561798 601722 621013 631541 673357 689044 652082 597508
14072 597508 588803 581949 570350 578166 562149 519326 501262 490709 504851 519080 516036 512012
14060 512012 517234 546759 563242 573103 588192 591597 581259 585212 639698 640884 653015 672838
14048 672838 657774 696446 721211 690137 658091 673750 738632 777291 816408 847893 856284 852946
14036 852946 866592 879479 905684 904552 890517 898055 910848 947773 983885 1020523 1037177 1057436
14024 1057436 1081785 1171033 1196917 1272591 1290236 1293112 1313064 1385964 1424718 1475366 1501867
14013 1501867 1572418 1632778 1683715 1707656 1765365 1816586 1862446 1858670 1910004 1984815 2048942
14002 2048942 2152209 2263150 2363266 2464318 2615264 2759959 2887417 3040225 3153556
13993 3153556 3280138 3420594 3543985 3696119 3828344 4033552 4268459 4524225 4807449
13984 4807449 5092677 5429660 5728986 6083907 6471619 6879363 7383418 8011053 8678235
13975 8678235 9397760 10287099 11349189 12538174 13967272 15730625 17906129 20479209
13967 20479209 23490404 27042971 31333399 36694703 43577247 52651927 64979930 82214176
13959 82214176 106194072 137644170 173798785 208965791 239454696 266652207 293281050
13952 293281050 316918045 330294768 328304720 313458805 292491111 269210150 242307346
13945 242307346 210126883 174616015 140524236 111404890 88638383 71823104 59529913
13938 59529913 50333181 43190664 37476980 32789023 28833522 25429579 22442703 19873961
13930 19873961 17679011 15825707 14237047 12905158 11727780 10703535 9850841 9080139
13922 9080139 8355834 7719112 7153093 6628505 6129785 5683630 5284661 4908617 4555323
13913 4555323 4216563 3943014 3703665 3463187 3275952 3099834 2934426 2790584 2631086
13904 2631086 2496841 2376670 2286156 2175574 2084712 2013473 1919526 1827954 1728115 1643506 1581980
13893 1581980 1521152 1473320 1468998 1444618 1430408 1380594 1315149 1266500 1230763 1222870 1157570 1077311
13881 1077311 1039593 999493 957539 938699 946783 924200 861338 839897 810219 782414 782883 744170
13869 744170 678644 665992 671206 648890 628506 603028 569730 570915 553393 529578 554646 584888
13857 584888 550338 494696 479837 483564 497829 503183 527849 527601 503344 483624 467379 466946 456714
13844 456714 420227 415043 410359 421344 404768 426392 464795 477199 466815 487812 492248 488049
13832 488049 483675 496727 505550 464596 430654 446824 433411 448228 492847 458440 439882 436001
13820 436001 414299 382148 389504 409866 412159 413752 391179 332500 321026 346393 359293 334397
13808 334397 312722 361265 414749 433504 411853 402493 412187 421135 416135 385024 342577 338562
13796 338562 326883 282134 239054 188999 175942 164832 85393 31388 20004 -4727 9044
13785 9044 19889 37371 57518 69871 75205 75929 79737 56706 64081 79371 91084 95086 45731
13772 45731 9444 52992 50841 -5297 -2704 61730 70830 54930 59562 44974 40161 70412 97629
13759 97629 101235 76141 44318 68114 131884 165604 184170 197791 139384 100468 110407 131120
13747 131120 126255 160730 180502 169495 120795 113822 136332 146982 177455 159005 109505 130084
13735 130084 150070 126079 89207 54268 48835 61902 83488 129750 96764 52615 82113 100372
13723 100372 68167 49673 57644 115637 105891 96062 114647 119255 146797 167379 132053 97341
13711 97341 111711 130250 130116 129423 133396 117819 121550 133959 105222 101797 142132 170640 167662
13698 167662 171805 193169 166227 134049 83131 85087 115876 126688 102579 89489 79418 103265
13686 103265 105653 90232 81481 87546 94130 105859 121637 137984 108682 88510 93736 74601
13674 74601 52146 52930 46097 44796 48882 31370 67472 81354 100545 100171 55776 32857 60133
13661 60133 92757 95806 79622 75402 76813 65318 51848 45591 31985 42303 62112 71302 102586
13648 102586 116718 165265 216190 198928 207589 196589 194653 177456 141596 154881 135318 113501
13636 113501 127138 107805 107693 101917 96440 97674 127174 136244 100168 65948 112763 153345 131060
13623 131060 81767 70933 56836 69590 71547 53645 34916 44653 79475 88666 94258 79444
13611 79444 62040 73129 116078 103113 81712 51090 84560 71953 94824 110352 86566 65352
13599 65352 57934 43109 46780 56303 66653 95361 104618 107363 96539 45540 60660 93432 96216
13586 96216 74744 86170 76573 43120 28942 25682 25887 29942 42657 74015 102277 96698 76338
13573 76338 79957 82915 85337 49632 48842 107328 135640 132434 106208 72967 111366 105874 85674
13560 85674 74128 75251 100078 101928 98107 116146 114688 82736 13329 -34288 -8770 12277
13548 12277 25265 84981 114823 103658 79510 59111 63063 73446 90577 131172 177444 185010
13536 185010 151457 118611 96665 101434 109508 71522 41444 68839 57211 56712 48877 24505
13524 24505 30566 80137 138297 207820 198716 203342 200279 200841 202096 165799 155484 207897 262052
13511 262052 273812 288808 307721 329040 381878 418621 522713 688545 885472 1097043 1276216
13500 1276216 1434281 1566293 1680219 1773224 1824240 1798778 1693776 1567591 1462723 1299910
13490 1299910 1105863 971607 851490 716356 575227 420341 341927 275865 251036 263590
13480 263590 253803 221112 200379 132455 140894 158252 139754 130654 98493 78157 76212 85620
13468 85620 83434 82445 99093 78452 65344 50491 47944 30932 51519 62521 51246 80693
13456 80693 86660 102495 122988 146854 145703 155555 162495 138893 85082 60213 44236 47465 77932
13443 77932 97901 104855 116845 133650 147021 143140 83676 58181 77273 70656 78686 96004
13431 96004 120247 115769 86462 52105 87143 114102 86902 74618 86307 57446 31195 43788
13419 43788 76124 90537 126327 120252 130299 124663 86874 59106 25848 68776 87524 83397
13407 83397 91877 104036 74889 62619 65626 61636 42143 10668 4314 -1218 -13418 7163 28682
13394 28682 39025 37615 9557 7616 30590 87872 70901 79853 80692 67565 70447 79442 78581
13381 78581 87063 175417 167177 146064 101180 91193 98097 116285 124501 135010 117238 132254 181615
13368 181615 167307 108490 78954 70190 88824 120263 76816 57521 51290 67165 97149 121805
13356 121805 98187 105913 127048 110042 65767 35230 29942 63880 60074 71311 74426 77680
13344 77680 94265 120321 120926 110807 94382 104375 77665 44641 86851 113550 153373 177016
13332 177016 175417 151774 153678 166901 183597 194335 167752 153418 176767 185690 151445 116056
13320 116056 96558 127496 88078 54082 67852 88138 117340 82292 60837 111925 140942
13309 140942 131617 120841 103119 89508 108601 102036 122541 111275 106509 138973 136728 144780
13297 144780 173326 179622 177977 159453 151984 153619 136002 143706 150401 137054 136143 139697 128817
13284 128817 125720 130177 166168 195857 156284 111149 81713 80980 70099 79104 110430 112641 110078
13271 110078 82841 87358 73038 71865 122050 102362 84694 100655 114490 126316 121654 124449
13259 124449 81867 92612 122967 155454 153953 160023 154718 129528 140614 148652 142926 100288
13247 100288 105128 114429 99847 133248 147626 124993 129896 139076 106017 109227 106611 111971 147162
13234 147162 132196 126064 127272 156248 165513 143831 144933 162574 165838 126064 135945 131940 164000
13221 164000 169748 163319 174054 207310 192751 153165 131577 113090 120014 114746 130425 182564
13209 182564 189217 182579 183809 182903 151271 158270 172649 162370 191995 175494 144947 177778 171998
13196 171998 144104 141216 128554 114424 118469 145132 164729 207878 224474 242364 209036 211849
13184 211849 181842 139693 134937 158754 186682 191159 214124 202342 188669 225454 212972 172024
13172 172024 167693 180107 203222 208872 214836 171317 146455 189266 206487 170220 164839 208471
13160 208471 188204 181558 206149 183974 166871 163500 169903 201609 192099 183276 154976 150348 148035
13147 148035 163312 195088 206539 199765 190078 193886 192338 193896 203665 198341 156371 142130 182395
13134 182395 185656 224551 242803 217850 254476 272846 268170 275446 283968 306788 305009 269953
13122 269953 240368 228096 226766 262522 292679 353735 382854 432383 509034 544337 675844
13111 675844 842075 1039344 1207429 1281259 1289411 1256469 1160187 1005593 848847 754876 665063
13100 665063 600408 571882 541364 521589 502162 518703 611497 671539 673531 705927 690128 730239
13088 730239 747287 732075 790528 880235 988352 1058090 1087738 1173767 1276703 1377341 1477277
13077 1477277 1519485 1474922 1412358 1282770 1182264 1084701 1014628 991451 963936 931402 853452
13066 853452 805577 756169 705555 689544 721694 736707 714530 665958 673463 678875 653893 647329
13054 647329 684832 696710 699915 713352 809802 960595 1142306 1277975 1398675 1452023 1365214
13043 1365214 1194597 1030839 884727 770955 650637 548867 485344 440563 382681 345622
13033 345622 333160 303284 309139 305346 315637 278183 262794 289610 303670 337978 311316 238427
13021 238427 204873 189765 196716 232321 255115 244871 247907 275108 286014 262374 265416 276370
13009 276370 217768 238281 248869 263081 242692 221182 188009 171824 156609 213085 258485
12998 258485 276671 306015 305453 278671 271048 258685 256749 263720 248094 241326 251907 263851 253745
12985 253745 247087 248744 280688 288857 256813 249298 275890 277892 259399 250016 223082 226335 230712
12972 230712 227776 246130 235814 186619 158783 164340 200449 214228 237503 249454 225562 211874
12960 211874 190045 178833 208229 225477 216324 240926 262457 277939 307939 327206 298666 286165
12948 286165 252651 228711 203721 245589 248908 243846 263230 298939 305919 286238 282831 281829
12936 281829 274493 284430 274924 229704 211725 191923 195751 211079 227885 236817 260766 268138 258503
12923 258503 273885 287015 294412 282824 343512 380266 378335 380163 386572 393877 407674 387050
12911 387050 420513 431789 407888 360976 338527 308696 277401 277599 292839 300957 326657 349030
12899 349030 357337 381857 401462 408458 395649 394228 395534 397916 421103 415357 423911 470109 498211
12886 498211 469365 462298 506760 494809 476801 498150 506508 507280 485102 425126 416081 403434
12874 403434 433830 469980 471786 457348 452257 460201 511286 502575 457392 474799 484445 452282
12862 452282 435075 447986 473985 500232 514292 546265 556711 566410 583910 583431 538525 523355
12850 523355 547738 575738 598258 663349 710035 656680 609652 648179 658850 642692 587603
12839 587603 555117 562573 607355 605161 603588 581017 544729 519611 509774 534341 543299 568500
12827 568500 576801 596041 611758 602584 605843 586114 591776 661217 711550 686429 675350 679464
12815 679464 689552 688234 633105 615671 561415 528469 535403 565903 582010 589148 565438 603655
12803 603655 648136 644946 632376 650846 670225 664191 672512 687987 700250 721719 762370 785361
12791 785361 827935 843828 830487 831095 883845 938358 1014536 1037032 1063136 1092265 1128787 1105457
12779 1105457 1043672 988611 936472 907951 902020 847673 807159 812641 828745 838233 795386 791915
12767 791915 829578 851603 832663 842090 894613 926008 968837 978057 985912 1013130 997324 988087
12755 988087 1023219 1065054 1080284 1028714 979984 934593 894226 885042 893729 987731 1008846 979563
12743 979563 991174 1026664 1023976 1018676 1007342 1055007 1103676 1120820 1172611 1219450 1229393 1202490
12731 1202490 1206243 1214024 1245459 1291127 1347311 1386060 1409277 1476250 1573420 1687041 1712451
12720 1712451 1762449 1798993 1806228 1809560 1795338 1789344 1781070 1797792 1844747 1870601 1887856 1936035
12708 1936035 1977202 2020883 2090439 2165451 2256999 2341641 2469253 2573231 2638970 2717609 2813361
12697 2813361 2869309 2935497 3044163 3157651 3276562 3434624 3617726 3807778 3977050 4126996
12687 4126996 4263851 4439927 4671690 4952806 5249074 5593672 5997905 6472522 7024101
12678 7024101 7610548 8313631 9117333 10043050 11106382 12275044 13590151 15147089 16992411
12669 16992411 19239269 22148085 26051681 31379202 38717243 48916421 63188803 82822363
12661 82822363 108661511 140074633 172690678 197815761 206895278 197826401 175630481
12654 175630481 147844758 120888746 98436053 81554458 69771720 62190558 57940634
12647 57940634 56334588 56916197 59364645 63481781 68813585 74270923 78723045 82037961
12639 82037961 85343158 90596309 99405285 112238612 128196278 145507135 162737007
12632 162737007 179857488 198189685 218962049 241066682 258796833 263999024 253235704
12625 253235704 230824939 204456253 180458374 162289887 150567475 144045821 140679410
12618 140679410 138166556 134345655 127845927 118757901 108778388 100122066 94268368 91144916
12610 91144916 89209405 86556598 82590785 78287809 74886837 73154265 73807557 77745257
12602 77745257 86031526 100070172 121510443 151270516 187968448 226322508 257023838
12595 257023838 269217051 257244805 225956420 186299151 147341291 114225598 88675690
12588 88675690 69916690 56387617 46685655 39690242 34460458 30391199 27113175 24429473
12580 24429473 22164283 20136089 18283489 16513529 14864696 13413796 12102720 10971324
12572 10971324 10019490 9180984 8439440 7817804 7311659 6876119 6476970 6073718 5695232
12563 5695232 5359631 5105293 4865105 4588180 4343438 4058917 3795802 3587679 3365405
12554 3365405 3178396 3038510 2911482 2839738 2761738 2662009 2536946 2415657 2308450 2226821
12544 2226821 2133865 2064542 2030221 1971922 1872178 1803469 1741111 1692820 1695650 1750596 1751317 1704502
12532 1704502 1646326 1607562 1524752 1436433 1356586 1288429 1236149 1213633 1208855 1165437 1119141
12521 1119141 1090299 1093778 1131458 1108013 1117187 1129049 1080081 1025240 971188 951588 963122 944333
12509 944333 906222 869008 860968 856778 875297 872200 872986 845948 787894 752373 704512 704902 699586
12496 699586 691538 735995 739220 719117 710519 716648 701223 679465 676993 683929 701471 699578 711214
12483 711214 715845 765168 781414 804265 888759 1067754 1224219 1371684 1489332 1618802 1690502
12472 1690502 1651369 1525686 1341549 1169545 972778 819889 727110 662606 610856 558003
12462 558003 500571 429499 425389 428375 428874 395188 374165 383107 392190 352142 353727 409570 397483
12449 397483 400986 368919 354138 363252 365605 366290 371357 364967 332074 322877 324260 289977 254066
12436 254066 231579 163638 162977 172385 185783 214460 241888 261214 284275 312019 289627 255476
12424 255476 296975 313931 309681 289552 286086 290720 300514 303715 338757 376934 409481 411564 381684
12411 381684 368836 344755 298466 287579 260992 236305 230346 255879 278893 307311 327482 308513
12399 308513 303823 325281 329777 345881 384937 395775 387513 449800 490452 502514 514967 535877
12387 535877 562970 541559 536988 552506 583053 574113 525560 537572 553751 506038 500284 497008
12375 497008 477313 456607 414850 390586 376444 370008 367278 401349 412734 380191 361206 383155
12363 383155 401450 428383 474597 495891 527901 552559 566845 576696 551199 572973 623458 647507
12351 647507 657016 674477 674392 633447 626855 637599 648786 632121 586378 547491 522307 546216
12339 546216 551969 564893 575002 566683 535559 552101 538506 566229 559194 522553 528014 573449
12327 573449 621594 633771 602020 613807 640501 650390 642913 657292 642825 608428 613956 585447
12315 585447 547203 529107 531894 557643 568601 563592 555429 559809 565832 562416 570180 585728 609639
12302 609639 627013 612528 586024 568198 626004 710254 725166 731547 756205 793979 847591 888648
12290 888648 953433 1096775 1219175 1365293 1528542 1688967 1821179 1878792 1870110 1803795
12280 1803795 1655933 1501722 1333444 1188592 1104655 1052328 983447 942836 948569 908816 875203
12269 875203 842134 818216 853585 882665 839664 862746 950221 989878 951558 953851 948676 925159
12257 925159 953637 1009658 1059046 1060179 1002300 949277 965930 983915 990916 963903 936453 932974
12245 932974 949957 970691 994214 1005972 1035247 1057875 1084720 1114736 1153723 1145190 1118099 1153868
12233 1153868 1212219 1287831 1312995 1355340 1420428 1443647 1520021 1611929 1633129 1665038 1712533
12222 1712533 1753540 1774467 1794823 1854808 1877722 1874102 1845098 1859771 1932620 2031608 2101442
12211 2101442 2145131 2181444 2224258 2282815 2366625 2499481 2661065 2803823 2876984 2957476 3060322
12200 3060322 3177119 3319852 3480317 3675893 3813989 3945280 4103986 4281014 4473661
12191 4473661 4716299 4959720 5213214 5505355 5864175 6233884 6609729 7094505 7656930
12182 7656930 8248239 8926799 9688393 10576603 11582388 12816723 14272805 16001524 18141406
12173 18141406 20831934 24126462 28224514 33499458 40534915 50215297 63792316 82798987
12165 82798987 108859392 142617058 182253783 221798997 251295952 261794304 251192057
12158 251192057 224703345 190744324 157265904 129171239 108165955 93900304 85222049
12151 85222049 80933114 80075513 81708581 84443679 86540820 87113099 86824035 87128861 89581199
12142 89581199 95161809 104080648 115381410 126646550 135156855 139379582 140192006 140858552
12134 140858552 145393748 156653263 175289212 199336160 224387355 244286446 253854494
12127 253854494 251559764 240290895 224521497 207413942 189861016 171803883 153210627
12120 153210627 134809907 118112812 104518971 94609395 88240148 84440509 81477927
12113 81477927 77694617 72474670 66560195 61226038 57514550 56107117 57170813 60898897
12105 60898897 67810511 78682138 94261563 115011573 140526843 168115551 191494669
12098 191494669 202400810 196162958 175293386 146797372 117615926 92168411 72128052
12091 72128052 57199175 46291041 38326524 32357448 27716749 23927497 20757548 18108511
12083 18108511 15841687 13980697 12465127 11202071 10113109 9184237 8372443 7683538
12075 7683538 7062486 6510629 6048181 5607623 5167043 4784915 4474331 4190396 3902951
12066 3902951 3653462 3446954 3275635 3096943 2903062 2759263 2638447 2489261 2326631
12057 2326631 2229804 2093859 1972300 1870776 1771094 1718728 1661603 1637255 1626223 1542731 1471363
12046 1471363 1388516 1317118 1272848 1223987 1191272 1161333 1124590 1094537 1076483 1081076 1031242
12035 1031242 1016665 992577 992145 995642 941590 911286 860214 803795 772256 810139 805165 768902
12023 768902 707252 682987 633980 610953 599473 592772 605585 618426 649158 636782 646592 609899
12011 609899 538748 546379 624619 665777 651613 617740 577664 519237 471775 474667 444514 405527
11999 405527 395412 413791 399484 412680 409818 358363 359487 363439 307947 299939 316892 326504
11987 326504 337495 352289 359080 337137 314058 354803 394163 418788 454764 498080 580158 600754
11975 600754 617760 619469 578565 500674 433960 381444 338670 298579 291020 250601 234200 181133
11963 181133 107106 73858 58829 64130 91082 60282 62941 44992 6992 29559 68950 78493
11951 78493 50404 31555 2779 -2433 9363 25635 79543 89700 35369 -2599 -43653 -66162
11939 -66162 -64473 -48360 -35556 -39532 -76015 -104865 -139169 -113511 -93382 -54456 -26800 -26849 -58062
11926 -58062 -92828 -98332 -84455 -59255 -70544 -92078 -63997 -60904 -43071 -4318 30025 -15577
11914 -15577 -31416 -19607 -30748 -20202 8067 10999 2156 -8607 -1456 28868 39900 20406
11902 20406 -19669 -27773 -5714 -22665 -50538 -71813 -30452 -14703 -1004 -31491 13988 62314
11890 62314 74809 94477 90535 69793 32631 -1566 4084 15974 29672 34140 23318 -699
11878 -699 -39303 -75126 -81751 -39939 -22159 -35748 -28090 -37488 -39634 -13811 -37290 -62710 -64836
11865 -64836 -79239 -26838 -4571 7874 30046 6886 -5457 4529 61603 86847 81807 86003
11853 86003 36014 40020 60667 83611 45977 21923 20401 654 10369 26228 39463 26121
11841 26121 -33015 -45295 -42747 -31963 -60887 -77483 -6492 29771 49846 29643 14706 -22338
11829 -22338 -60660 -51750 -36872 -55774 -42623 7420 56242 85197 74361 61285 53166 38048
11817 38048 41123 22434 11106 16328 20976 -21032 -35777 -2247 -25422 -3668 43284 56820
11805 56820 65528 12052 -17380 -10642 -18890 -21732 -72237 -53226 -24742 -30716 -28545 -22546 -8962
11792 -8962 -20044 -22701 -33170 -35650 -20296 -26456 -47748 -67676 -63071 -68029 -97332 -85305 -68360
11779 -68360 -69708 -79156 -60604 -30801 -42196 -46786 -35225 -64747 -85998 -67340 -37650 -9428
11767 -9428 -9033 -27885 -77386 -73843 -30553 11294 13543 -20076 -58365 -93555 -81448 -35614 -42360
11754 -42360 -64278 -55958 -28850 -42528 -33090 -18960 -4853 5014 7426 -17020 -37622 -19364
11742 -19364 11653 49668 74855 83944 74561 78879 38204 29456 53191 151287 251959 298158
11730 298158 381613 529618 712160 889706 995513 1120760 1163706 1112937 965949 791459
11720 791459 639950 520503 477897 408192 306563 260760 276140 313896 315631 371884 380727
11709 380727 398427 412556 434626 439140 488549 566879 622966 644252 686667 721426 755838 803077
11697 803077 848153 909307 1034293 1147495 1175860 1143528 1111228 1060556 987024 851855 756198
11686 756198 690550 618675 543762 508430 489630 441181 405173 416670 400311 382005 371043
11675 371043 322382 247518 225793 234585 234763 250853 321720 400355 491715 579167 726176 894905
11663 894905 1000966 1001488 951665 840541 687035 526309 418561 317052 233976 169006 119093
11652 119093 71194 27123 16134 22852 31310 -5193 9129 8342 21192 3218 -8047 633
11640 633 6921 -24056 -81842 -118791 -96079 -54476 -51147 -42348 -22983 -18710 -15459 -47206 -60690
11627 -60690 -91578 -76837 -50117 -45895 -73880 -72034 -66503 -95019 -124766 -100922 -70437 -57512
11615 -57512 -101763 -133482 -131998 -93682 -95956 -99826 -74962 -47526 -30664 -47002 -87991 -98040
11603 -98040 -67403 -65592 -56673 -18081 -27837 -36383 -23105 -49060 -44433 -47314 -79667 -117633 -115034
11590 -115034 -78534 -74375 -127769 -120792 -94716 -134438 -119782 -110299 -78661 -49287 -23754 3717
11578 3717 -5374 -16129 -24157 -25801 -29119 -46603 -66872 -67730 -42668 -33835 -17569 -15270 -28688
11565 -28688 -16814 -19927 -30114 -14753 -31396 -49978 -94944 -107336 -121954 -52654 14177 17038
11553 17038 -1748 -19941 -32027 -22527 -25543 -54634 -45487 12128 9953 -28844 -78735 -91535
11541 -91535 -116335 -112244 -115528 -131070 -121009 -73532 -41052 -42498 -45797 -60235 -65213 -66775 -55558
11528 -55558 -38364 -49700 -62975 -68607 -71641 -55983 -83948 -128096 -141163 -116812 -112021 -105944
11516 -105944 -101004 -111893 -108187 -101246 -95043 -35754 -20910 -77431 -121037 -112240 -64980 -33644
11504 -33644 -57199 -68433 -68828 -79143 -106577 -102181 -88928 -70900 -58041 -39756 -66541 -46067
11492 -46067 -53485 -22004 -23492 -38503 -25070 -31673 -14206 -16773 -18671 -18643 -29767 -75790 -86982
11479 -86982 -57425 -41704 -30697 -75464 -99819 -87353 -18881 24671 -10293 -50135 -72157 -85759
11467 -85759 -63476 -21181 -18199 -5838 -17293 2826 33363 -19614 -47953 -25832 -19520 -39494
11455 -39494 -66070 -23054 -37923 -80623 -134124 -155628 -121918 -84516 -77725 -56815 -34585 -36231
11443 -36231 -35618 -38142 -31766 -30326 -62876 -76827 -80302 -55720 -75783 -74405 -23905 -8748 15988
11430 15988 -16822 -56381 -81318 -47601 -35476 -60068 -84610 -86051 -86383 -86224 -78111 -50144 -70056
11417 -70056 -48831 -27280 -47006 -72686 -62191 -50505 -72926 -92972 -63671 -29619 -3526 1301
11405 1301 10966 2332 1028 -6631 -23287 -18131 3072 2503 -26978 -27455 -38126 -67987 -71846 -84525
11391 -84525 -71220 -50010 -84268 -76837 -77732 -88068 -73761 -54468 -61547 -71620 -94410 -102531 -119125
11378 -119125 -120935 -87961 -40097 -53139 -46448 -12742 -13670 -53670 -93937 -87996 -62957 -64320 -78549
11365 -78549 -84448 -88222 -69880 -75556 -114904 -105166 -108902 -69215 -72821 -100253 -111189 -99899 -111890
11352 -111890 -115759 -98291 -85798 -119347 -111317 -121819 -126346 -124148 -120147 -80272 -54409 -41498
11340 -41498 -17554 -54164 -68750 -62255 -32878 -73294 -73857 -55589 -58518 -69444 -76625 -49689 -29102
11327 -29102 -479 -15331 -33649 -22739 -24899 -23706 -50096 -93614 -98321 -65651 -56753 -38864
11315 -38864 16571 19531 11365 23099 21201 -22439 -50802 -34365 -27215 -60540 -65026 -76699 -77666
11302 -77666 -92037 -66446 -29240 -30618 -24221 -45891 -77062 -87195 -80729 -34224 -55818 -58708
11290 -58708 -41952 -41062 -76920 -91603 -92650 -43910 -24922 -28547 -7909 -8116 -23504 -47347 -51963
11277 -51963 -67822 -79727 -67805 -58576 -50061 -74617 -90031 -107605 -99394 -70477 -41049 -13219
11265 -13219 -57949 -69178 -52772 -16601 -18044 -48700 -55478 -33484 8494 16937 -5694 -56039
11253 -56039 -96318 -78990 -84530 -92146 -83368 -45146 21639 25988 -11403 -27144 8469 18960
11241 18960 24617 -2627 -40678 -72317 -85473 -70981 -55256 -13213 2108 315 -21475 -50732
11229 -50732 -46734 -66851 -89280 -120433 -122068 -50936 -11821 -14596 -11044 -20437 -42425 -50396 -72587
11216 -72587 -110610 -107929 -86603 -71894 -89119 -81309 -93710 -105431 -73536 -90706 -88442 -61574
11204 -61574 -10902 7334 24732 -6303 -36581 -19019 -13497 -9357 -32943 -54519 -83443 -85661
11192 -85661 -65391 -59987 -70534 -50070 -53339 -65599 -58526 -58243 -69445 -61283 -65024 -94273 -69569
11179 -69569 -48041 -55736 -55065 -51363 -62618 -21748 542 23896 55518 5626 -27587 -23107 -17050
11166 -17050 -31136 -21621 1132 1938 -13475 -11105 -32624 -49223 -25481 -26966 -66039 -71654 -25820
11153 -25820 -23938 -22669 -17447 -19281 -21568 -18901 4160 -38434 -30662 -16417 -23676 -5116 19422
11140 19422 5576 -2216 -4423 13636 4767 -10711 13042 15663 22506 22564 -11983 -39256 -41276
11127 -41276 -46386 -60106 -60957 -6338 14334 -4417 3910 40003 17948 -59131 -83962 -46888
11115 -46888 -72717 -99007 -101964 -71576 -69195 -34468 -19976 -25108 -13243 -14584 -18661 8945 33331
11102 33331 1444 33666 5801 -27242 -49724 -68510 -25629 3117 5841 -26732 -46543 -42484
11090 -42484 -58688 -25961 -6308 -22289 -24560 -4807 -5461 -14338 -41254 -47049 -31519 -4891 -42459
11077 -42459 -68216 -75727 -86451 -134763 -141475 -78018 -61393 -58972 -59823 -12066 13704 -1690 -7380
11064 -7380 25497 -1680 -25847 -20695 -14432 -10515 3283 15004 -23387 -5533 10402 909 5476
11051 5476 -16745 -22442 12430 2643 -9086 -2407 -7227 -16364 1542 -20953 -36094 -31658 -17696
11038 -17696 -9292 33412 38155 49142 60539 60356 24778 -3842 1814 407 27327 40170 6666
11025 6666 -14583 -3674 5656 13365 6201 -26361 -26603 -2220 46949 65461 57191 32430 57580
11012 57580 73118 139140 211265 259997 342504 476905 587859 569666 469234 341632 218352
11001 218352 163194 79238 34661 47104 23222 21423 58622 64601 26663 23785 12118 23509
10989 23509 57841 52802 1665 -9728 2827 -10285 -17789 -28293 -19954 6316 44820 44814 57895
10976 57895 64090 36561 13404 26473 9836 -17119 -35103 -23046 -8017 13639 5928 930
10964 930 -29333 -26362 -27405 -24953 -50403 -48730 -50915 -31497 -20751 -42138 -56596 -13834 10893
10951 10893 29905 39634 -5439 -16434 -1342 -13374 30861 50464 40846 44392 44413 34522 35926
10938 35926 30272 38527 2443 14827 27514 29309 28379 52123 45144 21398 19728 10390 -1635
10925 -1635 2949 23656 29786 13312 9465 17595 25231 21811 -4468 8320 45257 58716 76380
10912 76380 76577 95436 90272 53661 49446 10531 -9036 -1791 -12720 -7384 7430 33027 45494
10899 45494 40868 54317 51437 40100 26676 40076 23995 -24501 -9407 26171 96762 144975
10887 144975 118361 61104 4092 -25492 6939 5279 13092 69970 71766 49529 40231 23636
10875 23636 44836 33436 5404 11810 27157 40747 6111 -3073 19435 34675 39012 23018
10863 23018 6247 -4077 8021 -9096 -25249 24690 93635 92342 71972 86301 71427 82802
10851 82802 88545 96064 100284 112792 108679 80949 94975 110179 90604 89715 99269 92913 100851
10838 100851 88090 78036 105455 122133 135156 113440 109825 122752 96470 69962 111531 152280
10826 152280 125030 108674 60130 35140 60904 124277 153993 134520 107805 73380 67841 103016
10814 103016 89870 84926 59323 74282 131313 177977 220932 213537 191542 178051 170179 181809
10802 181809 140536 104659 88002 81496 114632 155729 132561 74548 82197 132081 123713 156476
10790 156476 194265 198706 173397 142255 165983 120007 110151 142710 132851 126204 147658 203909
10778 203909 217271 182985 178413 159863 150031 175182 222072 253282 249231 219049 211573 184977
10766 184977 149722 130147 149691 140470 149146 181359 174871 172034 173255 209255 243965 209019
10754 209019 210600 216982 239855 238972 245454 252387 252723 239190 252005 264375 265344 261147 254045 239086
10740 239086 218783 262980 259919 226628 202052 193649 217886 263764 271711 235874 207128 227470
10728 227470 238367 245534 237959 224774 256935 294928 299078 265053 218784 213603 217731 215346 212895
10715 212895 212019 224829 235671 243957 232084 260890 256709 240653 262357 295284 318082 281970
10703 281970 235778 235657 269438 331001 362032 395682 409495 409990 422364 425374 403450 366369
10691 366369 333949 323936 312703 331415 369041 385099 393721 422119 443705 442728 430326 410208
10679 410208 427647 421812 463263 509706 517208 473477 454012 465115 494030 502577 489317 526378
10667 526378 548741 566597 566327 600632 593506 557976 578344 605962 597593 601618 574583 591273
10655 591273 617440 618209 628003 622928 594392 600852 631244 635472 618236 625852 654463 670865 687774
10642 687774 715411 720264 742060 726180 751792 748012 725922 726297 748463 751744 724379 754990
10630 754990 800220 797818 800408 833189 899707 946581 971301 983517 957110 951190 948628 978685
10618 978685 1023068 1021540 1045168 1097474 1084610 1075839 1094308 1113838 1136068 1196723 1244882 1260519
10606 1260519 1295220 1288219 1263049 1251073 1297394 1324251 1329538 1366351 1430419 1496100 1493221 1486286
10594 1486286 1470900 1494175 1565526 1558537 1556058 1585216 1654460 1716409 1776764 1816340 1878373 1934650
10582 1934650 1977183 1991579 2033300 2091033 2119212 2186519 2246335 2303901 2343155 2416354 2496082
10571 2496082 2535658 2580585 2649970 2714896 2798001 2864605 2904757 2984085 3071099 3155366 3207086
10560 3207086 3299231 3428586 3538587 3643741 3733959 3844059 3974075 4134464 4272722 4400223
10550 4400223 4520403 4636734 4749854 4891038 5039079 5206562 5390983 5598501 5822902
10541 5822902 6052265 6273151 6433609 6648813 6936518 7229082 7476405 7714164 8037168
10532 8037168 8385643 8717680 9093211 9455875 9857869 10271442 10705534 11149254 11672670
10523 11672670 12254192 12822186 13396315 13993361 14618952 15315623 16075642 16874188 17696095
10514 17696095 18601825 19568552 20552089 21567757 22654250 23832376 25001869 26224344
10506 26224344 27510814 28809444 30152696 31465469 32759551 34077244 35379434 36709077
10498 36709077 37912106 39075711 40140707 41027565 41784873 42390297 42820611 43064023 43097762
10489 43097762 42949476 42619151 42132453 41447519 40611808 39660482 38616644 37495893 36282161
10480 36282161 35025511 33743651 32483384 31198153 29932810 28671793 27431375 26223191
10472 26223191 25039162 23915477 22873084 21819124 20886029 19987066 19106669 18285855 17510428
10463 17510428 16720270 15984832 15290739 14647466 13998519 13434356 12930972 12404351 11855834
10454 11855834 11386648 10944930 10534556 10132802 9751255 9388054 9014191 8688042 8433623
10445 8433623 8128624 7834742 7569433 7310311 7102972 6859964 6642126 6422443 6208383
10436 6208383 6054167 5856159 5695572 5543784 5346782 5157591 4999854 4886015 4727756
10427 4727756 4550945 4440447 4340131 4204535 4112034 4021378 3883068 3817384 3737693 3633260
10417 3633260 3562863 3485398 3385736 3308285 3225857 3149083 3055463 2958928 2875232 2813311 2768332
10406 2768332 2734126 2690942 2625188 2562351 2497728 2421628 2374408 2386597 2391407 2341807 2280664
10395 2280664 2203583 2162017 2128944 2061949 2005785 1955193 1957204 1961094 1951289 1918076 1848811 1815105
10383 1815105 1795744 1746703 1680177 1689665 1669044 1630991 1596965 1582218 1571142 1520154 1466777
10372 1466777 1459687 1439452 1424626 1388560 1363224 1347556 1327071 1307256 1285124 1255378 1259683 1247941
10360 1247941 1245663 1242778 1239534 1211718 1182701 1178887 1151269 1105045 1088191 1057749 1068893 1075839
10348 1075839 1029150 1007554 988652 986283 981458 980987 959025 942786 959501 961073 910628 882641
10336 882641 913823 897347 872592 851738 833400 824738 785847 786395 779071 742883 725184 703101
10324 703101 709500 748924 729929 707190 671869 657665 679489 712557 723002 675060 612573 600346
10312 600346 662342 703772 691722 694469 665826 658989 655966 624153 587262 564027 582788 576180
10300 576180 579821 586271 621533 614003 565369 538922 542634 594293 631826 640607 600676 558303
10288 558303 570951 569280 548724 564144 550408 514167 496657 520043 550876 515961 547437 547859
10276 547859 537932 487889 480584 475635 474151 451331 458555 486317 509412 486283 456670 444857
10264 444857 425250 417678 448469 435305 407147 371510 396408 380615 356388 377632 394867 419575
10252 419575 399772 398568 426106 466893 451439 444316 417006 436091 469279 472936 480577 460906
10240 460906 408190 359387 327434 326813 324359 318106 314678 317979 357386 386720 403760 426074 388739
10227 388739 302452 258112 282011 318324 321962 307507 359783 344585 321855 328507 339479 324689
10215 324689 323599 304230 303709 282105 260611 273833 306462 333224 331501 337486 344448 373578 363625
10202 363625 388295 362671 354733 333967 283056 276278 286002 318900 337114 317948 293370 280231
10190 280231 292789 272166 275672 280315 293298 343832 316642 282059 269351 258979 237210 247878
10178 247878 255670 263437 238806 241840 248800 224555 220917 229762 286881 300993 275385 289032 276388
10165 276388 233667 269227 255093 268991 248892 209982 225512 241749 298142 330326 287794
10154 287794 253506 275376 318167 343049 275203 241128 260420 275950 282385 265619 247376 216724
10142 216724 213920 190023 204883 217025 215266 168596 182676 208651 233080 260698 237942 215218
10130 215218 224993 237178 221486 193736 217047 240605 268033 278907 256222 253807 247262 212622
10118 212622 222219 239600 257507 242154 194224 212640 205513 178914 147764 173091 212754 240022
10106 240022 214364 182910 180441 171375 222257 272551 268590 228908 187924 132738 96413 82815
10094 82815 132387 175232 186892 187847 200575 173897 153600 203450 230668 247002 230803 233252
10082 233252 235792 199088 195035 198385 221107 245029 235996 220009 184743 164257 170361 176263 174773
10069 174773 158576 165045 148631 135033 150892 158611 174058 177990 144277 129180 161314 164552
10057 164552 149761 175940 160754 183001 205333 150290 156943 183950 169571 193536 169490 127494
10045 127494 106986 115535 130010 106082 148900 162446 145550 136566 149205 145571 110633 109338
10033 109338 134028 130393 181222 214743 178967 153983 122082 115163 101748 132732 137456 124202
10021 124202 110320 85054 56353 82005 114699 112616 134541 129584 141034 152552 121379 130748
10009 130748 128332 93005 90303 105559 124700 144601 156526 173491 151217 141805 162377 170948
9997 170948 196348 169307 153907 152266 137681 116613 99796 118546 110270 164190 196746 229011
9985 229011 199515 184009 145943 150529 145873 129272 100604 99563 85443 138051 155366 156026 149522
9972 149522 167430 149939 141659 182124 204098 221890 209053 176378 139766 123187 124808 163337
9960 163337 174638 148224 132088 97700 125524 150752 147546 134737 81880 73093 48174 51983
9948 51983 92093 107002 93021 109137 142297 165629 192704 204354 190132 198770 209984 204420
9936 204420 168797 138356 131468 119841 129287 169211 181117 214970 208451 173779 142010 142843 107137
9923 107137 58298 44734 72647 86893 120572 137808 103060 125573 143138 147667 148957 151812
9911 151812 136662 115186 123395 115689 102800 78386 104586 112397 105817 103333 141534 154449 135017
9898 135017 105404 94662 113828 154419 202771 235113 245927 205131 161867 144970 99379 90308
9886 90308 99141 108630 159361 151589 101268 127185 184200 193575 184186 236391 236263 195512 185057
9873 185057 182938 142290 137846 134743 167873 154913 126110 116587 119138 127671 150533 180926 187955
9860 187955 166537 189409 158130 168174 182811 200260 216830 213147 191847 133822 97179 137241
9848 137241 185119 168417 127499 110802 112750 107439 120132 120479 96116 122884 125893 101438 72604
9835 72604 87258 104200 100849 104347 106031 108895 93612 78441 110598 118382 139417 166967 154590
9822 154590 156571 138349 116948 137087 155096 178241 158849 127259 117191 130814 152548 129860
9810 129860 129073 99423 100498 109054 101510 60709 9302 46621 75865 98715 112835 114355 125137
9797 125137 111680 120049 115463 115861 107875 95116 112377 127006 113074 78697 66971 70995 85442
9784 85442 153763 156875 139159 86582 79669 78265 122432 132355 122491 124152 126197 142139 145768
9771 145768 117432 111937 98953 96119 103764 150089 182088 203383 187985 186423 186624 193249 215074
9758 215074 227766 217011 148025 116861 155201 156150 157560 134090 104943 95058 122642 181625
9746 181625 196653 192295 195936 161231 122715 106828 113187 146757 144123 112248 150815 206096
9734 206096 193025 178060 198028 191991 157211 128486 101621 122729 192135 193479 166885 136023
9722 136023 126009 114807 111068 113722 106795 115906 117386 127277 110637 149671 190771 208658 198237
9709 198237 150532 127290 152011 132525 165723 184020 190847 165740 154342 139536 141088 137047
9697 137047 136474 138019 162849 169302 180862 177137 172017 165162 159257 130308 127147 170773 186433
9684 186433 208528 213514 218167 201735 172371 145359 155155 207479 231272 203081 196134 190983 183667
9671 183667 176050 185835 182755 192445 220564 232054 245579 220833 183700 171154 167056 167992 193625
9658 193625 194682 177968 201044 206727 213622 242945 237306 212375 178642 130626 117067 127283
9646 127283 172648 230815 243671 249822 242953 230776 202080 150145 160156 149015 150010 150624 154402
9633 154402 146285 154628 187086 199353 210791 224804 180461 169937 161151 146686 133294 133973 169875
9620 169875 195342 178225 185146 182798 180063 195192 208035 183428 110074 80695 125803 137770
9608 137770 143739 135851 142298 148011 153850 133354 117395 126981 166236 187490 196358 181460 236688
9595 236688 227516 173046 164679 175201 130954 132834 151758 135718 132314 142499 157693 166827 159967
9582 159967 160632 172431 182907 191319 212881 251842 230077 204332 214259 227992 229490 193955 175382
9569 175382 172349 216257 197620 177218 179118 190787 168192 153360 184829 220625 233391 260949
9557 260949 242526 206286 175042 144655 149966 146175 161277 205843 228369 224295 234626 263044
9545 263044 210546 146132 132402 152257 186394 209909 209031 160034 149542 190278 197262 229824
9533 229824 266288 274041 254114 224039 213073 220650 227657 232931 226713 212374 179218 146457 127582
9520 127582 148470 168117 168432 168852 174828 142529 146652 170561 213432 200202 162907 120265 99267
9507 99267 124072 154272 153098 178090 166745 162174 180136 203210 216543 216804 217879 200545 176829
9494 176829 173353 187314 189770 181854 167971 182194 172187 149074 141483 123459 153281 133219
9482 133219 83034 100275 109685 122763 152446 150259 163955 167887 184866 195450 185234 211888
9470 211888 180717 186336 209963 196353 213845 228302 204146 161267 149176 169452 157837 152697
9458 152697 187444 192650 152046 142020 138104 157928 128204 111800 95750 134325 157034 149712
9446 149712 194306 212200 216952 186738 143411 156454 137603 121227 147682 158806 183647 179119
9434 179119 178734 205705 204862 170828 207395 183723 142639 151398 146829 157144 146223 111620 87176
9421 87176 115791 114056 134049 141740 123129 128835 163854 169747 144554 124671 103514 84371 91263
9408 91263 113912 146691 172117 167944 154987 174254 189162 199557 141087 126232 114873 118315
9396 118315 151661 163851 139172 140869 124980 111911 92669 96052 77448 89089 104071 141849
9384 141849 165038 137131 112330 109943 113005 131895 106712 91571 98607 103174 78797 73941 44212
9371 44212 38187 57644 52091 76875 123620 148482 149913 160977 127740 78610 29085 26704 36686
9358 36686 29551 36764 43639 35449 19452 43861 78241 63149 40075 50321 63475 67803 65287
9345 65287 90939 103982 116083 127679 147340 131929 106716 85805 95281 113403 118994 110862
9333 110862 135813 160242 137442 109494 111561 93230 119004 116869 120743 143745 175281 190293
9321 190293 151940 131903 133541 142178 138609 133294 119682 87693 46228 52170 51279 49301 79003
9308 79003 74070 118388 125630 99369 82378 98502 99360 71356 49492 78598 57121 50448 46484
9295 46484 68131 90954 53112 49901 44373 32057 44835 75970 90219 84951 59212 49737 38577
9282 38577 32515 25410 15652 6572 13300 35914 37901 11627 8164 29134 38675 63734 84635
9269 84635 94515 45272 18648 79307 87793 87776 115443 77978 19936 41796 54247 36344 42331
9256 42331 43906 68217 98696 82313 38059 26058 53427 66320 56056 1093 -27806 20639
9244 20639 129038 167954 113546 62914 37087 27986 36023 39560 47665 46758 54159 50946 36331
9231 36331 41348 73800 52226 58358 53285 71244 53652 11620 36110 13018 39201 38596 77060
9218 77060 124266 128187 75425 23451 19746 14872 54618 69602 55791 46431 65489 107349 114039
9205 114039 78693 37925 14610 29401 65986 57370 7654 15230 19396 -852 257 3069 37178
9192 37178 42468 38717 66156 79905 101264 79272 28925 16710 33979 21895 46706 65394
9180 65394 71333 79648 72588 53872 54170 56416 43679 23427 21665 40461 69280 80147 76908
9167 76908 87200 63359 75519 84661 68527 49092 12948 12454 2888 15246 6755 -18982 -38525
9154 -38525 -47633 -18596 -7360 -14977 -11952 -22578 -28237 -1587 72616 76746 52748 58466 91399
9141 91399 67563 39397 7505 7611 18234 665 19500 29226 3336 -11828 -2206 26292 46324
9128 46324 48758 49361 9989 25593 29999 22706 9529 -2386 12235 20245 -23909 -28346 -37071
9115 -37071 -36664 -18621 -9855 -1058 -4379 -46 4796 -11301 70 27553 33460 39899 46499 55278
9101 55278 64738 81984 61391 36221 54793 75071 45542 -28518 -42316 5000 14178 8219
9089 8219 -3059 1844 -15058 -29824 -14472 12691 17482 23796 9935 -37188 -51568 -20033 -2428
9076 -2428 928 12983 27881 -1374 -73836 -47473 6771 -7805 -11154 15162 18445 16649 -7973
9063 -7973 15745 33849 45531 19683 11118 15176 -8351 -4242 23589 31388 15284 7549 25650
9050 25650 33616 4343 -14267 13426 -2585 -8087 31700 20569 9330 57514 84771 54623
9038 54623 16381 -19680 18077 66633 55430 53498 19370 -26935 -28904 -45215 -55497 -33590
9026 -33590 -29169 -23675 -12213 6608 10152 11880 20075 13398 14145 -4812 -6249 -16263 -43768 -48782
9012 -48782 -60408 -18145 38177 63421 56039 70808 62659 31635 1676 25952 26460 62007 64661
8999 64661 68412 67211 53109 40072 30801 9908 -11928 -16069 26404 44845 29695 25895 14158
8986 14158 -17942 -9801 -1216 -42764 -60319 -38215 -27783 -29300 -46019 -27213 -5881 -12428 6258
8973 6258 -6293 -16676 -25182 -10951 -3526 19383 41840 53005 39511 78434 90778 74327
8961 74327 62283 70918 71768 70193 44072 32614 36636 1215 -16099 -14073 -15221 -16694 -773
8948 -773 3736 -25581 -8584 36802 28605 7668 -35946 -43818 -25084 -56959 -54982 -23808 -38511
8935 -38511 -62079 -69171 -42534 11252 1162 -4503 -7160 -2902 1135 11940 290 -39615 -54002
8922 -54002 -66997 -57519 -27098 21542 23815 13068 18704 47504 24774 20816 33267 8887 -34906
8909 -34906 -53864 -25346 -46009 -63505 -56649 8468 33040 56128 84933 92837 73130 49127
8897 49127 53095 44522 91879 85439 54009 47483 67304 76050 59836 25171 52128 55251 35294
8884 35294 23555 48828 72860 28047 -24356 -6068 14485 -18287 1549 31790 54342 58347
8872 58347 21450 881 -11923 -12610 33140 26280 3412 6781 23677 -14133 -38733 -43745 -22406
8859 -22406 -32597 -43590 -56479 -56429 -51382 -31968 -26908 -35368 -17428 5172 25959 41046 92083
8846 92083 90116 59585 38551 35903 11377 -10484 -20011 15099 73868 45966 16376 -8687
8834 -8687 42585 43090 27433 28226 19134 -7580 -7803 23550 23055 12593 6545 -13295 -5497 53582
8820 53582 71115 34313 -4962 -16238 -7763 52037 81379 58398 51735 35446 41828 45015 58563
8807 58563 17199 -23660 -57697 -58794 -55990 -83713 -96267 -78500 -62672 -45362 -29488 -34710
8795 -34710 -21949 -45755 -36926 -14269 1620 -8144 5961 26888 14951 24851 12992 5153 33262
8782 33262 49490 62348 38950 23540 10267 9517 -9692 -46477 -61111 -37057 -4328 22309
8770 22309 30840 30912 53134 30675 -35073 -72776 -14430 22326 24275 4695 -29619 -44762 -10164
8757 -10164 9362 -22767 -52161 -62379 -46349 -41572 -22396 -27044 -16141 7634 53705 36792
8745 36792 4491 -4054 35573 50587 11398 -38532 -14370 21289 130 -6170 -11835 -35316
8733 -35316 -29559 -20653 13097 15705 11143 18031 20253 58681 78256 28776 -12957 -21781 -5711
8720 -5711 7537 -26135 -42243 4891 14961 27364 32196 48652 24471 -15581 10513 10531 6339
8707 6339 31447 50692 50156 32136 -1857 845 8346 2240 33446 34886 63001 99631 125012
8694 125012 114451 98534 39343 4011 -11242 -31591 -49104 -84629 -60061 -13260 -3393 5638
8682 5638 53132 52361 56292 34572 19117 5388 24151 55295 63456 48995 35599 29411 21097
8669 21097 10234 -27555 10487 15137 4247 18804 3426 -30240 -38756 -5647 48422 54090
8657 54090 4172 17307 40228 46070 26326 19254 16360 2992 -3451 -7802 42817 56824 46359
8644 46359 23076 2573 17736 36028 10191 9211 20763 31708 31455 41845 14515 -12525 -13518
8631 -13518 -41068 -33539 7518 58034 52727 23928 58671 84499 91291 81144 46330 -3868
8619 -3868 -18236 -44464 -34041 11428 82127 79457 54208 45943 28668 11007 12599 -1386 10220
8606 10220 41296 68766 93691 97256 71538 107327 135613 134327 158380 167043 225372 217834 197950
8593 197950 198798 213396 231404 254131 256742 266866 235510 256054 276075 255172 253468 256303 242158
8580 242158 255196 247904 254714 309111 311944 306958 318784 295353 225555 192716 169407 165579 153520
8567 153520 149469 126869 76980 54811 31552 53492 48135 51642 25976 -4179 -1869 33151
8555 33151 48573 41035 41947 6974 30570 27830 35606 36393 12349 14945 46608 54661 47669 60046
8541 60046 59439 43136 38469 37445 40566 40498 44175 43293 -8428 -26754 7628 16662 34435 51051
8527 51051 22224 48123 22712 12949 4532 -27263 -27471 4236 49523 71002 21576 -10836 -16508
8514 -16508 -326 29046 234 -24986 -3562 24484 16356 17225 6552 -27831 -63573 -16543
8502 -16543 15143 13067 35854 70082 82488 61509 53263 43987 14065 -19288 -10108 -33371 -45124
8489 -45124 4003 10848 36977 46368 -1620 -4707 -646 41987 24901 -856 -646 1330 -23055
8476 -23055 -10679 36829 29335 29901 17417 2638 -20303 -37327 -21943 14422 -18716 -13944 -20226
8463 -20226 -66922 -69464 -80212 -100771 -96139 -31559 -51092 -25995 -12120 -13506 -46464 -55008 -12223
8450 -12223 -18368 -42635 -21869 -160 28665 19918 -2838 4574 -18700 -2815 14207 12357 4504
8437 4504 9309 4856 -3027 -46809 -59592 -51727 -9965 14290 15691 -1677 18537 -7137 -34998
8424 -34998 -23901 -10179 41048 40574 16696 8222 20815 38721 67637 65288 33261 22443 -3624
8411 -3624 -1172 7092 7018 -10161 -19667 -55033 -42989 -181 -5144 -36919 -7322 -1151 -475 -22118
8397 -22118 -15795 -5748 33822 19682 -11179 -36185 -15862 -30023 -64659 -45894 -43450 -19561
8385 -19561 -24512 -50325 -60912 -4869 22400 30637 31438 5727 -11839 -20906 -28029 -32043 -25518
8372 -25518 -16114 -10732 1602 24756 69044 45053 41442 12901 -10864 -45321 -48633 -60817 -55829
8359 -55829 -53156 -43384 14845 15438 -4304 9994 19224 14941 10048 17798 11515 -2046 -54316 -77470
8345 -77470 -27413 32605 44202 67312 63988 30857 23746 -7523 -49357 -42138 -22372 -30825 -12762
8332 -12762 -11969 -8437 21369 36585 14716 -31951 -42573 -10265 -16992 -27606 -38092 8522 68930
8319 68930 65339 24585 -23259 -44707 -33691 -12478 2781 -36576 -68430 -60548 -41803 -2432
8307 -2432 84 -8129 4154 -23937 -25657 6939 25135 8656 -20232 -70982 -30448 4964 29987
8294 29987 14646 -33614 -24600 -48638 -55731 -41497 -40358 -14634 -2855 -53168 -33669 -28170 -12988
8281 -12988 17920 -4081 397 4195 11853 13732 -11472 -27706 -51211 -40411 -20203 -3090 11347
8268 11347 -29855 -28329 3481 2065 14318 38216 1686 -16198 -24373 -33459 -16922 -6195 -576
8255 -576 11521 10195 35090 8705 -22379 -31243 -217 13071 41989 44062 16190 -52125 -41288
8242 -41288 -3738 14567 11525 12548 15524 -3726 -11961 24751 11164 364 4843 -35660 -33714
8229 -33714 19248 32434 23138 -5206 -30816 -61645 -72958 -50108 -23992 -16941 -25834 -19024 -38537
8216 -38537 -43618 -22728 -13116 -21999 -7035 -32245 -30718 -23094 -8585 -19207 -8408 28942 74728
8203 74728 52039 67746 60404 20418 8898 10928 27995 -24891 -78949 -43282 -31621 -16096
8191 -16096 17540 41883 3845 -33137 -63488 -42129 -28063 -16037 -14235 -2959 -43090 -73631
8179 -73631 -85330 -97729 -67791 -29328 6251 -27772 -35179 -29889 -37805 -24951 16509 13517 19085
8166 19085 -5352 -34631 -36075 19143 25909 22471 15759 8768 -37102 -22113 -8100 9574 41336
8153 41336 33781 27890 -1138 -23562 -51418 -64417 -34743 574 11517 -2010 -16235 -25240
8141 -25240 -39673 -18389 -47620 -33394 -13302 31301 54017 13515 30263 65971 49170 -107
8129 -107 -44875 -47749 -34247 -16362 -30901 -99802 -87802 -42596 -12695 -1651 15836 1788
8117 1788 -26457 -40535 -2573 28068 33245 39080 39295 53084 38927 36353 45821 27363 2667
8104 2667 -38059 -10536 8313 52084 104014 101982 57659 42165 27455 -10904 -12600 10970
8092 10970 37441 25055 6849 45320 59674 44592 21924 14591 17648 -2455 -14179 -20755
8080 -20755 -22809 -15262 -38247 -8185 8686 815 10491 8357 7891 65457 63474 89424 113271
8067 113271 146286 170957 186073 149598 111711 89341 54142 -2681 31419 72129 56743 34357
8055 34357 3569 -1773 3117 -7101 -5196 -7618 -1712 -34625 -9303 -2346 1188 19867 39664
8042 39664 14460 -5528 7451 10834 -20906 -45840 -14266 -14099 -37247 -39302 -53633 -16102 29257
8029 29257 10160 -20383 23256 33711 58007 66065 66560 25692 3087 31381 55520 43701
8017 43701 -5690 -31916 -3680 15635 12609 7544 -174 18113 63516 48778 7328 -11812
8005 -11812 -16573 -12943 12320 27415 -19716 -2595 24652 40291 90826 89466 88760 85712 83499
7992 83499 79974 102882 82105 100083 96720 91169 96072 109608 109271 55131 24814 16972 16077 792
7978 792 16846 54768 89684 85941 96569 102903 156854 138768 39716 20091 25441 17808 5299
7965 5299 -28462 -42228 19083 71384 95821 97344 96307 118072 116913 112714 67743 53778 77273
7952 77273 75213 52510 25912 -3028 8627 24767 40617 31235 9351 14081 53797 58802 91963
7939 91963 82358 88039 71816 58289 70524 52540 53813 55986 53173 55592 52256 53288 39467
7926 39467 89997 102395 52907 38924 60158 59443 59518 100827 114612 40996 -14098 -1359 43507
7913 43507 61629 65596 79951 80938 85399 49519 33184 14440 12213 39590 20821 49811 99570
7900 99570 107471 92935 79590 58670 4627 3378 15965 11154 50747 77593 64825 69974 75293
7887 75293 90898 93288 114063 111915 94361 83083 65779 42467 18128 36643 5266 18105
7875 18105 63304 31505 14805 51837 69565 93947 61673 39803 66162 50624 22488 -13406
7863 -13406 -6066 20760 48657 74009 67885 60667 33422 40983 38646 12283 -36334 -67799 -69688
7850 -69688 -35016 -1033 21579 3844 -29186 -1801 -15503 -32106 -52232 -23983 158 11552
7838 11552 21774 74434 102064 43447 24456 58717 44624 6223 -3960 -38180 -57563 -29986
7826 -29986 8315 -4474 -34074 -58736 -61731 -68248 -32090 7825 48826 78499 86306 57655
7814 57655 9073 25816 28805 18474 -4541 -20674 -18991 -22270 -36984 -47662 -30666 33137
7802 33137 18397 -6019 -41056 -34672 -37144 -67082 -33038 -20135 16205 46935 29228 -4397
7790 -4397 -9109 -41968 -57081 -62855 -70089 -67922 -32502 -10438 -27827 -6478 14560 -5444 -29806
7777 -29806 -42032 -31936 7687 3756 -5681 1043 8302 17612 4115 -10723 -11255 -11614 7027 25055
7763 25055 15602 10572 -7323 -54521 -48894 -37310 -29494 -29227 -49480 -26696 -3385 4347 3492 40052
7749 40052 37113 6080 -5739 -22735 -37460 1500 8149 16323 22408 -4500 -14935 -29958 -43829
7736 -43829 -39862 -19058 -18792 -20537 -53724 -37901 -35474 -31596 -29793 -43119 -51106 -60599 -57960 -6672
7722 -6672 18111 29482 17497 15711 -2815 -19438 -51159 -43384 -46126 -25515 -7803 -21035 -3183
7709 -3183 -17864 -20648 -20437 1132 51495 59711 61771 21669 11678 -42593 -56426 -59610 -77593
7696 -77593 -117536 -83014 -49798 -58496 -46773 -42557 -40671 -20461 -7971 34103 20811 20223 23988
7683 23988 44386 37458 26559 -5114 -24365 -27278 -5826 -27857 -12922 2973 8597 -23703
7671 -23703 -27780 -18429 -14855 -26647 -25073 -30558 -28635 -12761 -2285 4615 -2476 -28549 -24729 1680
7657 1680 -35967 -73691 -70430 -96933 -94377 -66588 1147 36645 18906 -36046 -10993 5151
7645 5151 -8585 -633 -23651 -55421 -60808 -60571 -44274 -10312 -42109 -96443 -95170 -63545 -73598
7632 -73598 -37158 -13640 -24789 -23781 -24754 -6023 10366 8394 23348 27288 20503 20615 19044 19236
7618 19236 2762 -10954 -10000 -11732 -12904 -13595 -41767 -87748 -70771 -43020 -26845 -21761 -35041
7605 -35041 -29023 -52874 -80214 -76249 -79866 -75580 -55978 -30424 -40493 -31047 -16690 -38969 -68832
7592 -68832 -44938 -9100 -22169 -37717 -79726 -63852 -48567 -34831 -36388 -50228 -63738 -42257
7580 -42257 -17906 1400 8152 29401 43903 26842 9473 13232 4957 29479 33655 7526 -7487
7567 -7487 -16313 -7657 -10099 -11852 5261 37814 57564 59106 45269 13446 -7937 7439 6760
7554 6760 -7312 -18114 -32433 2294 21754 41645 27406 28773 50810 39702 19626 31195
7542 31195 25934 -6173 -38945 -26640 -16393 -21728 -27182 -70031 -84584 -80661 -59564 -58986 -46497
7529 -46497 -42919 -26249 -10014 -11134 24887 -8549 -28963 -18343 -8242 -33254 -37740 -26961
7517 -26961 -34449 -38432 -49261 -78467 -111342 -98770 -92459 -83295 -76086 -43704 -28769 -21841 -29464
7504 -29464 -25209 -800 2114 14264 6956 -2709 -12876 -5566 -4250 -5754 -489 21701 32573
7491 32573 46643 47319 8940 -93 -31161 -18263 -7382 -1109 22294 38679 48515 36669 5871
7478 5871 8269 -12009 -21349 -4070 -5288 -22323 -22303 12020 1453 -25106 -17035 14878 1019
7465 1019 -20165 -14136 -62681 -99334 -79718 -77897 -67372 -35683 -5594 8170 -9284 -17250 -17898
7452 -17898 20279 40101 48846 52020 59354 95079 69160 38687 61588 14568 -35335 -66083
7440 -66083 -49062 -35166 -19561 2437 -12298 -21676 -10560 7261 9691 -22277 -49860 -32511
7428 -32511 -2851 -38040 -24991 -421 8418 1963 -3267 -19345 6760 21467 893 -27679
7416 -27679 -43374 -26713 -8719 15901 33178 23464 -2752 11976 8042 26001 59663 -1899
7404 -1899 -27781 31638 48279 13384 8870 2383 -47923 -35072 -19097 -38049 -64056 -59505 -39643
7391 -39643 -18692 24400 65952 12637 -32207 -45916 -79039 -79323 -65403 -48565 -24471 -20123
7379 -20123 22192 37915 36626 8542 1184 -25480 -60572 -74957 -35322 -28930 -19363 -24202 -44711
7366 -44711 -39079 -1161 47584 73101 34420 -1852 -5362 6898 13839 -44313 -50811 -12946 42866
7353 42866 44724 43968 30651 -21601 -18666 -6357 -28713 -47659 -34912 -29957 -28281 -32331 -53966
7340 -53966 -37198 -30469 -33637 -44505 -80210 -84168 -78537 -78477 -55052 -52972 -18237 10919 -30396
7327 -30396 -35967 -28114 -56469 -61715 -94356 -104533 -26634 40713 39764 37325 41317 47511 52793 17959
7313 17959 8348 -18063 -24739 -31896 -18440 -67336 -40634 37268 31059 4156 -34733 -26187 -25970
7300 -25970 -1742 13027 5118 25415 42115 70861 69445 53962 43659 10742 -3883 1363
7288 1363 -8094 -24219 -1044 17858 3381 -3076 -28883 -7160 23026 35357 23301 17341 21395
7275 21395 -6628 -22169 -32628 -21641 -27751 -62479 -61731 -29331 -20930 -20420 -37725 -56959 -53808
7262 -53808 -46979 -43330 -19503 -51011 -80840 -49532 -45934 -30872 -23369 7769 16795 -13965 -25196
7249 -25196 -27910 -29745 -22371 -39799 -40851 -56307 -84506 -84752 -66865 -59217 -36992 5092 -6636
7236 -6636 -41384 -63533 -88221 -93764 -80642 -64824 -9120 -7776 -53595 -76637 -77216 -50888 -37520
7223 -37520 -68051 -95058 -90439 -46809 -2967 10393 -15255 -38778 1545 31633 1299 -5019
7211 -5019 24427 45106 11066 -8174 -44599 -63362 -82074 -96966 -95805 -85068 -54580 -26736
7199 -26736 -32834 -18365 14633 3879 -13449 -33337 -35909 -15570 -5446 17588 28374 38517
7187 38517 35687 -40284 -55426 -46089 -74264 -67460 -71254 -71626 -89750 -51662 -47025 -58614 -42331
7174 -42331 -44919 -71764 -67202 -35152 -52436 -61949 -73508 -80949 -82904 -76422 -75334 -58624 -33674
7161 -33674 -46138 -42117 -29356 -54866 -62550 -48058 -26500 -2323 -25516 -22175 -4234 -17966
7149 -17966 -30277 -12204 6597 28964 5354 -1929 -4381 -10945 16244 30451 54834 55476 23784
7136 23784 -14824 -24999 -34845 -2129 -23127 -32883 -17115 -11023 -28222 -16872 -25691 -8525 12443
7123 12443 6777 -15871 -20221 -27209 -32523 -16639 -7013 7604 10831 -9040 -553 -7220 -4704 -582
7109 -582 15519 12147 -10194 -11081 6310 10446 12776 3809 7974 -21219 -35687 -45262 -34282 -5275
7095 -5275 -30605 -17236 -5125 -23269 7127 20754 19944 43421 35610 9473 3946 16106 20778
7082 20778 -20605 -21519 -5308 -7812 -26151 -11712 -14074 -52118 -40058 -7948 -6086 -4102 -31029
7069 -31029 -39512 -32678 -62276 -61229 -30450 2949 45535 35731 29419 12262 10057 -9099 2128
7056 2128 26781 -29226 -26767 -21922 2723 16088 208 -31349 -27813 -33270 -53326 -72928 -51261
7043 -51261 -45457 -50818 -39799 -14464 -6456 -13370 -27389 -21298 720 -21763 -28175 -4454 631
7030 631 13358 11625 31705 24753 1544 20739 35779 36969 43010 30668 60435 78512 46455
7017 46455 25778 8862 -6180 -26606 -46911 -64537 -67601 -74722 -86915 -53217 -10913 2941
7005 2941 2920 39622 24728 -21097 -66020 -92206 -52696 -49643 -44374 1379 -9318 -70416 -84750
6992 -84750 -75410 -38100 -2493 30425 18889 -12007 -8978 -26268 -10503 -30177 -52019 -50551
6980 -50551 -60773 -53903 -28034 -36596 -50964 -8469 4027 -20560 -18025 23676 48587 60212
6968 60212 65027 47874 39077 25900 -12933 -34952 -37731 -43595 -75576 -64834 -64199 -29727 -3003
6955 -3003 -22808 -2600 16343 -7585 -36731 -12163 6483 -4630 -34839 -64384 -70690 -56327
6943 -56327 -18002 19483 22032 -18354 -20221 14041 27198 42494 38213 12351 -15782 -51753
6931 -51753 -44148 -27297 -38983 -43949 3304 24817 22207 1976 -16790 -28233 -66432 -52726
6919 -52726 -24290 20527 15629 -11491 -61975 -81897 -56085 -18531 24165 -3633 -87196 -100137
6907 -100137 -71789 -26775 -14903 -13297 10074 12325 -18625 -14781 -29521 -35828 -2812 18810
6895 18810 -31907 -48655 -4833 15416 190 -36995 3025 42140 34780 24333 10284 -2268
6883 -2268 11823 -6869 -8732 -30600 -38810 -39055 -28399 -23255 -25343 -52877 -65287 -33136 -13167
6870 -13167 3184 14227 27579 -4376 -28513 -12213 23254 56024 71373 18783 -42318 -37881
6858 -37881 -14584 -36160 -32461 -8837 20617 -415 -73715 -110765 -46755 -57032 -60616 -79408
6846 -79408 -77211 -47999 -37285 11341 46093 51280 46230 26557 18208 1064 9958 27264 20339
6833 20339 -24517 -54682 -24107 -2926 -38826 -67738 -59439 -45184 -66666 -65017 -56340 -85911
6821 -85911 -110918 -87268 -80690 -73286 -56889 -76467 -83328 -50349 -29053 -19634 -9100 -3508 -16144
6808 -16144 -3165 19631 7904 -15673 -25265 -26150 -3640 3117 -5225 4161 22569 23378 35462
6795 35462 48409 17006 -7677 -49121 -66625 -52887 -9374 -11187 -42028 -41608 -49112 -33873 -30507
6782 -30507 -27794 -46134 -53231 -26299 -10505 -23309 -12542 -10433 -20690 14603 42824 29681
6770 29681 11546 -5685 -11111 -62199 -66718 -23587 1644 2066 -45872 -100379 -87492 -51271 -50614
6757 -50614 -27521 -46107 -60195 -45897 -25211 -76061 -67680 -47194 -25095 -26400 -2747 -16693
6745 -16693 -42905 -29450 -37053 -46310 2089 29414 13258 -45884 -64276 -35421 -11544 -14850
6733 -14850 21396 33440 -26898 -15103 47426 39912 2364 17260 21950 -4437 -12958 16690
6721 16690 34045 5153 19254 63104 102688 123485 115961 116669 101103 42976 19098 70879
6709 70879 117452 183628 248955 354590 412010 347660 205920 113885 90388 106748 100182 68200
6697 68200 -7372 -22032 -4240 8869 21286 -9157 14299 44537 13688 2763 -28057 -39881
6685 -39881 -14389 -52449 -84517 -57655 -23272 -22395 -35103 -30330 -20650 40837 55371 28699 46674
6672 46674 9671 -9519 -36956 -15468 23601 18495 -11165 -19406 -4319 -11454 14306 34495
6660 34495 22079 17847 60267 54351 32972 65550 43254 44305 74591 62101 54962 51257 41227
6647 41227 30459 26534 37477 -19412 -8146 3945 -15237 -24533 -48636 -69860 -44587 -19196
6635 -19196 -10019 -40254 -6729 -13156 -38793 -51872 -43408 -45668 -35883 -29121 -65047 -81660 -84717
6622 -84717 -68479 -45516 -29561 16971 48924 56828 55870 32529 50648 49806 6527 -12062 -59292
6609 -59292 -58352 -40348 -55606 -42908 -7279 25667 25421 25119 -1883 -8032 -37820 205 21268
6596 21268 17644 37364 51410 66589 52727 24184 -13474 -44126 -25628 19442 -1476 293
6584 293 10457 23206 33631 51278 49681 12614 5329 -31205 -20284 -5903 -832 18819 48664
6571 48664 27887 11926 12360 -194 23862 -824 7389 -29325 -47495 -38840 -29588 -23647 -1984
6558 -1984 -17888 -17135 -1138 66388 71790 54350 54418 52657 41690 -3499 -32767 -7959 8374
6545 8374 25640 49910 58467 74640 53994 59424 78421 56109 45483 38893 807 -14539 -23592
6532 -23592 -19875 -17276 -12064 1191 -1397 -155 -19921 -72086 -81928 -15070 -2330 2508 4253
6519 4253 -18697 -14122 -44491 -48873 12257 23061 -19756 12663 -7643 13094 25021 2905
6507 2905 3636 25472 -18929 -51997 -29646 -26023 -45288 -46228 -44310 -67084 -97390 -72625 -62732
6494 -62732 -38275 -28348 -78297 -78639 -31729 -17309 -35204 -24386 -20568 13327 39190 40909 51014
6481 51014 27649 -8810 -55765 -42209 -1098 21982 17211 6187 9626 -2706 -38450 -35403
6469 -35403 -6871 -36086 -59106 5125 41311 -2349 -39768 -45686 -18664 2631 -32202 -36576
6457 -36576 -24067 -22041 -35292 -35946 -30269 -13429 -9156 -53495 -45625 -40619 373 23947 -14490
6444 -14490 -51649 -56145 -39086 -66198 -87043 -76254 -34741 -15560 5290 33534 47324 -15917
6432 -15917 -18099 -125 -32743 -37542 30908 64337 33342 36874 46247 42438 2942 -1325 2560
6419 2560 5469 -12735 -32792 -28901 -2351 8784 19357 14510 20387 26501 2280 -22429 -43382
6406 -43382 -37265 -13993 -25984 -13297 -3732 -3609 -5529 2145 19535 75107 87891 73508 44679
6393 44679 32571 45595 22005 5874 -22996 -35048 -37315 -23857 -15403 -5911 -18288 -50732
6381 -50732 -76098 -67381 -39709 -51298 -59660 -49359 -27223 -27925 -14317 7721 -7563 -28167 -41218
6368 -41218 -23077 -23430 -219 -19444 -17023 -18997 -19197 -22463 -17777 -27638 -18677 8579 15124 -900
6354 -900 -6589 11459 10417 -5055 -45751 -46849 -24857 -8661 -20850 -11395 -9293 22220 39308
6341 39308 31560 13559 -23359 -45628 -65712 -39590 22305 17513 13997 -9868 -26230 -20001 -18262
6328 -18262 20581 23432 21972 4910 7072 40630 56598 70700 40459 4190 -794 2304 -39302
6315 -39302 -27319 -22953 -10063 -23846 -19514 32690 32522 -14852 -25895 -42095 -48800 -39434 -54044
6302 -54044 -41385 -38296 -41719 -23928 1111 32288 34973 -4098 -16474 -5721 18722 25370 10924
6289 10924 -4950 -1003 5589 10507 -19777 -4124 31127 29253 16361 2883 -12731 -28622 -34344
6276 -34344 -36267 -32348 -43334 -11879 -6385 -8135 2317 22945 9901 480 -17820 14411 30157
6263 30157 8597 32707 26904 6017 -558 -15114 -31213 -68511 -74077 -62695 -22628 -25419 -45751
6250 -45751 8968 19315 -3351 -22747 -51675 -82714 -72749 -52242 -21427 -9506 -30409 5681
6238 5681 15287 -6506 -6529 -15918 -5157 11505 11716 -6586 -10410 -5763 -5914 -19567 -12817 -14375 -24400
6223 -24400 20985 22588 2386 -11712 3486 34826 19606 32996 55479 81180 36038 19544
6211 19544 28653 16258 -18561 -32180 -13228 -20349 -10712 -2735 -790 -27437 -31261 -26132 -22461
6198 -22461 -9973 9487 -8302 1620 -30357 -56128 -71923 -92101 -101954 -55799 8783 25785
6186 25785 36448 43010 14433 25559 65946 36555 29263 40819 34713 -5825 -28643 -47179
6174 -47179 -12030 732 -19069 8558 13415 -17623 -9412 -8677 -46463 -39917 -24666 -13425 -22780
6161 -22780 -55244 -74774 -63833 -56033 -38964 -32466 -50339 -62751 -95509 -72841 -28514 -51431
6149 -51431 -92324 -71612 -37644 -45445 -1988 20966 13888 3885 -13098 -38015 -27858 -17979
6137 -17979 8075 7169 14409 -4240 11063 3925 -26418 -46309 -36540 -38829 -35490 3270 10344
6124 10344 -48541 -82442 -84813 -71916 -40444 13102 23679 46343 25118 -4149 17211 16060
6112 16060 31618 17785 -16967 -22998 -7295 23615 43398 -3580 -15219 -16768 -3339 -15950
6100 -15950 -60413 -65693 -48200 -29239 -9116 -19068 -24061 -46100 -31237 11529 29004 -16770
6088 -16770 -30098 -21929 8947 16743 13559 -37778 -35873 -32233 -13540 55 -28016 -77619 -94865
6075 -94865 -90954 -74230 -28872 -12206 -3706 12142 2183 21652 -21398 -64587 -80871 -36394
6063 -36394 9664 -14784 -24835 -11788 -21032 -45504 -30065 -15346 -31656 -59200 -26702 -14967
6051 -14967 -42770 -11777 37277 27886 17885 9679 24027 50448 59661 35737 28572 32934 24764
6038 24764 10600 13782 18224 49568 37025 47719 23603 9060 -21338 -39343 -42443 -39693 -33906
6025 -33906 -1682 -1363 -24009 -17745 14665 25974 -4887 -15865 -18031 37942 38627 27863 -16987
6012 -16987 44 23234 10723 9665 19656 28708 17525 12066 -46293 -69826 -44872 -55760 -47924
5999 -47924 -74660 -86382 -59813 -40508 -14009 255 7936 20653 33178 11668 15066 64076
5987 64076 44854 23629 44547 20479 -8237 -19044 1570 -8665 -17860 18710 -1198 -45627
5975 -45627 -60322 -63788 -85217 -76370 -52387 -37018 -87656 -92311 -52117 -26047 -54165 -70570
5963 -70570 -73105 -44488 -27962 3263 16756 15386 -4515 -23735 -28121 -37364 -54324 -92904 -69069
5950 -69069 -40732 -18453 6212 3698 -11885 -22087 2141 31970 14028 11118 9910 15912 -37322
5937 -37322 -37430 -42378 -14777 33731 55049 39445 49454 42438 12432 1688 7049 20715 13905
5924 13905 9500 -3120 16701 17551 -17320 10113 34950 41015 32929 31881 7050 -24347 -29101
5911 -29101 -9981 -48282 -67909 -46401 -52726 -47357 -12952 -26174 -16149 9982 4878 12248 -23305
5898 -23305 -21316 -33301 -65970 -58922 -17955 -16767 -38568 -7547 -22471 4034 19743 19770 24258
5885 24258 -2247 -12053 -690 -1796 20074 3628 -20534 -7967 2106 -29440 -45542 -14936
5873 -14936 -6334 -23175 -9773 6335 -7840 -23858 -17545 -501 7101 12089 -23728 -51634 -47986
5860 -47986 8959 12552 1390 -36376 -72768 -94271 -80912 -34567 -39022 8372 7372 43028
5848 43028 21717 28701 25344 22684 11822 12733 14684 18866 8809 21497 32691 14018 34477
5835 34477 30165 27086 -13243 -35906 -65668 -87532 -98538 -87940 -73427 -71969 -61046 -56782 -41800
5822 -41800 -64959 -57858 -50424 -28324 2248 5289 7951 7407 -19665 -34166 -32834 -33035 -46145 -63560
5808 -63560 -34983 -17009 -64397 -40363 -3621 -17654 11446 57932 9913 -31140 -10195 -5655
5796 -5655 1822 -7429 -14194 14108 57818 33894 1421 11061 -21152 -19909 13880 1255 -20576
5783 -20576 -9637 -1250 30582 52872 36039 -3861 6223 32944 4135 6703 50959 46124
5771 46124 43975 43979 44237 76466 98893 85468 73988 16473 2290 -42280 -35948 -37212 -62210 -19223
5757 -19223 9479 752 61 -9887 2313 -2420 12922 60008 69256 49046 28020 -4306 -59766
5744 -59766 -75714 -79620 -53684 -3189 12488 11029 11593 8387 4960 18815 -20955 -31689 -57098
5731 -57098 -31960 17672 8810 14630 -6001 -11897 -16908 -15284 14322 39597 35182 4739 14863
5718 14863 38627 45200 30183 59793 90675 52914 -6732 -27505 -8427 22849 -433 -21768
5706 -21768 -31257 -26965 -14265 -10328 -38949 -76000 -17457 20800 2347 -6310 -7122 2425 -18057
5693 -18057 -40785 -70086 -80839 -84059 -88539 -91572 -75693 -20871 17697 9070 17412 18087 37196
5680 37196 48792 13712 -16001 10104 37154 41684 10440 7742 12028 20115 57177 88848 84940
5667 84940 50054 47054 50344 26592 -20789 -29266 -7417 -4709 -3158 5523 -5555 -11760 19064
5654 19064 1448 -20076 -59020 -73565 -64271 -25361 -6681 3309 6520 37465 47428 44510 29185
5641 29185 23397 20989 23556 1956 -11145 1166 -37262 -42456 -35542 -10696 12825 -19854 -13520
5628 -13520 14559 71512 85510 80871 22293 8350 14277 -152 6434 17094 16173 30846 23622
5615 23622 18233 31239 79267 81553 43871 47178 45816 -3064 -19795 13779 31395 17383 5147
5602 5147 45269 85178 71903 25400 -12548 -21942 -8007 6196 10312 -5313 -12309 -10687 15323
5589 15323 -22725 -65715 -43718 -31694 -36291 -6856 5479 2346 -32787 -20928 15167 23107
5577 23107 7721 -12401 -31391 -13833 20552 25277 36554 31047 -4288 -30233 -40075 -26965
5565 -26965 9 39769 27077 -2403 5368 31913 34768 13792 7137 -13585 -35068 14598
5553 14598 24078 14798 44040 30959 5520 -23654 -57029 -94 72084 82670 34096 1672
5541 1672 889 -3855 -12607 -2711 -6412 -29721 -36444 -42990 -45290 -61890 -45673 -41685 -58568 -92753
5527 -92753 -43270 15914 19902 -28716 -49302 -94005 -121536 -97056 -33042 14612 23638 12624
5515 12624 -11191 -26239 5354 37099 26371 4042 -24111 -29847 12325 9968 1255 31436
5503 31436 86429 81149 49120 27865 1585 -39582 -48729 -75286 -41824 -10997 12821 8480
5491 8480 -1446 -34967 -47009 -24460 -49860 -67109 -44986 -44501 -13203 22937 62004 26096 27780
5478 27780 60092 27275 -18304 -18230 7656 -9967 -20819 -1486 2702 12292 -281 15195 4548
5465 4548 -27035 -37687 -50171 -45731 -61936 -103308 -110194 -83556 -13175 -14598 -34386 -13187 29037
5452 29037 24783 -21910 -22685 -17147 -12955 26957 10707 -1148 29667 44927 48850 21299 23391
5439 23391 33955 18016 16109 15241 1491 14108 3943 -50671 -40907 -25075 11866 29396 30297
5426 30297 14493 19954 6552 -6635 -39015 -29251 3914 14531 5538 13073 17206 9407 2650
5413 2650 -12736 -34092 -57668 -29380 25059 24890 -11569 -39121 -29753 -6719 1180 -767 34732
5400 34732 39265 9023 19272 35844 53587 56490 977 9863 694 17529 22996 32666 17348
5387 17348 28913 29368 17989 -25460 -45793 -28336 -41259 -29678 -32866 -27622 1416 -34893 -23643
5374 -23643 -612 30176 26844 26656 -19910 -40335 -64888 -43079 -9085 -21670 -40206 -41782 -55492
5361 -55492 -87402 -39881 -2077 25473 -12645 -40130 -3922 7556 25023 29187 20248 12202
5349 12202 -29025 -21743 -55124 -74107 -68311 -82635 -81424 -61735 -27647 39601 55424 25839
5337 25839 17709 -20322 -28869 -71143 -58726 -32060 -25274 8032 34127 50029 18344 -28331
5325 -28331 -10712 -14400 -31200 -59355 -44542 -18604 -26316 -12945 5467 -32256 -62057 -35300
5313 -35300 -62181 -58912 -49769 -43793 -26139 21157 35940 45409 40469 73289 94670 83132 88565
5300 88565 108239 104125 60161 52558 31759 9193 40329 50534 43386 29656 16633 33202
5288 33202 28642 24495 50478 56515 65669 65560 41600 17669 15895 10033 -14545 -39467 3322
5275 3322 30301 56126 51067 73932 66499 39199 22136 51106 74349 33615 -34475 -45370
5263 -45370 -14143 -20918 -26050 1308 9657 -14717 -33567 -6652 -3583 -45216 -61483 -44287 -38147
5250 -38147 -12014 1148 -11045 -16252 -9873 -5917 232 930 9762 -8061 9467 57704 19329
5237 19329 19228 10725 18536 21285 15382 44547 44761 33402 48284 17868 -19432 -13005 -52520 -32840
5223 -32840 -35427 -29546 -13491 -26629 -39324 -33828 -69712 -83903 -90012 -61418 5512 34129 6830
5210 6830 20559 24094 19701 20118 47186 34342 -2118 -6367 -12867 3107 -7196 -7620 -23762 -16940
5196 -16940 -7133 6546 -2629 -10842 40751 28876 2160 -7115 -15257 -50261 -52771 -29331 -28276
5183 -28276 -28011 4731 25805 51681 23551 -18720 -266 2066 -1688 -4420 12882 37357 62015
5170 62015 39473 -1382 1302 4383 17794 9847 -18427 -47043 -37615 -34656 -51178 -22917 29730
5157 29730 56272 11928 -54426 -68300 -77360 -97167 -101807 -71147 -23948 -51009 -90376 -89092
5145 -89092 -97321 -99400 -73932 -31932 -27548 -8187 -46632 -61569 -48455 6036 12269 10624 10315
5132 10315 7893 -13875 1142 1809 -25161 -35201 -49420 -72735 -93980 -73061 -50708 -28698
5120 -28698 -7071 -4901 -6954 -18973 -36027 -41812 -21167 11659 -8998 -46767 -63145 -54728 -27763
5107 -27763 -12697 -19511 27346 53614 13650 -4262 -30990 -62169 -32868 12757 -4308 -15528
5095 -15528 12694 37397 -34585 -36384 -1853 -1029 -38806 -30592 -47265 -22722 -1292 -5118 12759
5082 12759 11215 -19831 -36903 -32437 -9282 -20001 -22722 -45429 -1262 12761 49194 60307
5070 60307 15874 -10416 -21269 -7620 6992 -19914 -3496 -467 9187 12315 9336 -865 20137
5057 20137 43253 26435 6566 15295 -160 15456 32345 6444 -20701 -9690 9858 -10313
5045 -10313 -22324 -31926 -45548 -51251 -18806 -17273 -34062 -55496 -44714 -33351 -29121 -23004 13853
5032 13853 23604 6056 -25678 -24755 -7924 -13361 -23267 -24322 -52256 -70287 -27421 12720 16480
5019 16480 5298 265 -2161 17713 39285 11454 -26592 -24368 8687 28979 57975 42639
5007 42639 -1857 -15933 -4070 27830 26968 40642 52379 8234 -1510 -36635 -67871 -50364
4995 -50364 -19745 -3691 10817 27788 23802 21157 31827 39068 -12603 -19560 -15286 -27933 -79548
4982 -79548 -80696 -42076 -42424 -24112 -27405 10240 17349 -7072 -5802 43517 63844 62672 35717
4969 35717 -14516 -1226 31341 52100 31541 12108 59832 87892 78675 1585 2107 8145 -9825
4956 -9825 19032 63195 50192 -27695 -57156 7644 -2489 -22590 -21410 -30535 -11933 -5521 1445
4943 1445 18309 -4731 -40056 -34555 16872 39719 7154 12163 26329 -129 -26324 -9885
4931 -9885 -9034 14947 27420 45212 31581 20706 41892 38294 14801 13877 15767 17748 17198 42475
4917 42475 28629 17174 6612 -3279 -1099 -7507 -21450 -12302 4566 -22014 -14897 20323 -8607
4904 -8607 -37545 -24142 -6654 7084 13990 10640 44806 51587 54312 58517 36652 38568 46186
4891 46186 61872 74223 68876 62497 29315 -7562 -38578 -3123 31525 40678 15164 -4586
4879 -4586 -32178 -63121 -15293 17180 7876 -23868 583 21830 24967 15569 -14792 -17145 -10584
4866 -10584 -37667 -24865 -16272 82 37011 59245 48880 6780 -5312 7146 35955 53687
4854 53687 24220 1490 -4702 -28280 -32386 -27743 -16982 -12174 -22767 -747 21590 17432 49210
4841 49210 31265 -4652 -4137 5482 -13229 -24937 -46568 -56051 18522 52056 57563 10206 -24459
4828 -24459 -21645 147 21846 -30329 -83144 -65873 -50138 -28630 -10258 -1297 10906 -36926
4816 -36926 -73743 -17943 35561 45023 17830 3749 31366 38426 15639 -24876 -51259 -19144
4804 -19144 11561 15611 5476 5649 14591 -36860 -40211 -40918 -32429 -43658 7768 26514 -15211
4791 -15211 -45866 -59178 -35837 29789 51734 29373 40335 -10886 -59542 -69910 -50569 -30946
4779 -30946 -58959 -51096 -48430 -18866 -753 2950 -6911 -18516 -27087 -48237 -56764 -31711 -36401
4766 -36401 -38773 -41140 -25229 14975 4096 -29233 -56066 -63711 -49016 1785 12087 -33750
4754 -33750 -81101 -60885 -49362 -35356 5655 20246 12929 26643 63138 80482 50317 41055
4742 41055 57086 29435 -692 13033 -1635 11324 -5469 -32389 -44708 -22334 -22588 13660
4730 13660 36539 45137 27131 -9907 -21165 42664 63098 6509 -38615 -46831 -28814 -17190
4718 -17190 -5393 -12806 2284 29259 16659 -4520 -12180 -14557 10880 -10702 -31370 -17459
4706 -17459 -17727 -9405 -4225 341 -22862 -25333 -11171 18676 17454 9986 25074 37296 -22214
4693 -22214 -12673 23486 23218 -9123 -9026 12314 56942 36441 18521 8067 -27185 -75279 -42615
4680 -42615 -26884 -7661 -6771 13684 3717 -127 -5983 -31862 -48602 -25790 -34444 -40905 -23740
4667 -23740 -30292 -24428 -16182 -15247 -30654 -10516 16312 -10838 -7864 7011 62369 61533 69723 45453
4653 45453 9396 -12243 -37479 -65163 -44728 -8013 14137 18788 -17711 -26368 -31134 -31435 -41860
4640 -41860 1854 -15745 -67479 -83237 -68132 -26039 -11871 -547 -24746 -4050 8949 8470
4628 8470 10792 -21946 -18364 4496 -14622 -27454 -44484 -10620 -8474 -16972 3456 -14699 12251
4615 12251 5511 1829 16047 24721 39805 41932 49719 44656 62787 82869 58467 45607 40421
4602 40421 36604 47265 64669 63257 46749 52322 19995 34292 51412 45263 4139 -45750 3101
4589 3101 22952 63654 68517 61628 57060 50901 60880 66268 86178 51220 45223 37792 36366 47929
4575 47929 47373 78832 72465 28812 47543 64357 70943 57907 47422 13877 20860 18508 22457
4562 22457 36745 19543 7780 7571 42793 82626 64954 2430 -18890 -23818 -19868 -4343 18761
4549 18761 26151 -9062 -38201 7736 60268 31518 22944 71611 61024 35714 6823 2200
4537 2200 -12350 -33720 -9461 -5303 -45304 -43448 -4563 -9841 -27617 -25948 -17183 -11554 -24578
4524 -24578 -33813 -31617 -21967 -26451 -19138 38010 57060 32276 -7635 -28684 -44045 -40566 -80935
4511 -80935 -59039 -49377 -39146 13744 20058 -41496 -77442 -49237 -24530 -37519 -8256 3794
4499 3794 342 -12194 -23277 -4573 -23435 -32438 -24732 -43518 -43623 -19703 0 2815 -31121
4486 -31121 -20290 16181 55925 71445 47064 12444 -3567 15493 21411 6032 -1043 468
4474 468 -7494 -33231 4369 41095 18172 21571 22394 121 20130 41978 10914 -8717 1908
4461 1908 37028 16317 -19060 -11492 -29736 -34639 -34609 31 -9094 5068 30656 57670 79087
4448 79087 48893 11988 8942 26137 18240 8937 722 -2912 -9677 7708 16866 -4819 -27736
4435 -27736 -23765 1986 23666 26597 25023 17241 19301 16279 13335 55647 65286 40260 41926 23966
4421 23966 -4035 -13902 -12326 13473 21145 -15936 -30827 -35218 -64247 -71021 -76855 -65658 -5292
4408 -5292 15533 -22157 -26853 -9630 -8074 -23272 -26033 -4236 20998 29660 30950 54663 14378
4395 14378 -35099 -18006 52446 41377 571 -42448 -49285 -19293 15401 13638 12924 18675 25686
4382 25686 5662 3368 26481 61831 61276 20949 -3906 21436 30693 -14188 -38927 -18363 24250
4369 24250 41480 22643 19796 -5662 -9415 -19836 -34408 -61322 -61530 -53901 -41869 -33693 -13735
4356 -13735 -1941 -5879 -28306 -56756 -71670 -41832 -33384 -57341 -6225 37299 47722 65377
4344 65377 83490 51082 20254 23703 9641 16541 63559 94606 54086 9694 22341 46573
4332 46573 54091 24162 13108 5527 30114 5519 -28303 -24539 22244 22495 -12235 -44312 -23758
4319 -23758 -36508 -48728 -43657 -49656 -73129 -76351 -95055 -82284 -58394 -41450 -36978 -24277 -33959
4306 -33959 -28708 -3765 4183 8843 5009 8674 24221 4748 -12152 -25759 -3260 1401 -23022
4293 -23022 -31155 -28648 -31526 -24558 -24211 1567 793 4804 38543 35362 34783 28871 -11798 -17981 -54679
4278 -54679 -87888 -75716 -53872 -15723 27468 24140 33779 57621 67706 55002 52692 58396 24178
4265 24178 39704 57528 51591 66471 33507 -3306 23341 30873 13118 7364 31408 52624
4253 52624 60471 36781 48791 48886 36860 -66 415 24514 12007 -32839 -43831 -15535 -633
4240 -633 -15853 -17985 -16335 -22900 4980 67743 64207 23174 -32686 -40569 -20956 -26507 -41061
4227 -41061 -44533 -39650 -28605 -36046 -39679 -25210 -4588 -15393 -28445 -23864 -13501 -31083 -34859
4214 -34859 -36264 2748 10799 17079 19946 15077 -5519 -11404 -16006 -7331 -51621 -67940 -51640
4201 -51640 -39735 7250 41917 64381 43287 -3854 -18231 -31522 -11279 757 -20703 7974
4189 7974 23289 33089 12229 5828 19190 523 -12399 22208 59928 43892 14491 -9615
4177 -9615 12188 10192 -10987 -2845 14888 21114 -1103 -14344 -439 -627 -48266 -57664 -22191
4164 -22191 19415 44315 14288 -936 22497 24455 53248 39998 2018 -8642 -5223 -15432
4152 -15432 -16477 -8124 -13809 -23191 -121 -3730 -6893 -21810 -18868 -31271 -33521 -20002 -31660
4139 -31660 -49321 -37347 -29183 -14868 -3203 -31789 -42654 -6025 14914 10595 9629 6128 25756
4126 25756 10964 -17339 -18094 26710 62598 80072 27190 31752 26760 18835 -31926 -32349 -31778 4328
4112 4328 22415 3426 -3842 -28226 -793 2382 -5613 -28323 -46854 -28116 -13262 -10114 -10729
4099 -10729 340 -23897 -40448 -43259 20 -6562 28086 61997 61835 66674 48514 13118 -3863
4086 -3863 -25618 -33447 -16735 26910 43006 51527 41918 44417 31627 39829 45617 53383 68796
4073 68796 70694 44810 8564 -38012 -28181 21331 25772 23056 -3660 -15231 -38387 -83539 -95343
4060 -95343 -69171 -7218 10227 7209 -1800 -7297 32445 58475 30428 34925 42631 105847 101974
4047 101974 68349 47332 63981 68997 52657 30995 47806 61176 43732 49252 62431 45551
4035 45551 40873 44416 27347 -219 31138 16530 2276 16139 2295 36711 31480 25338 6900
4022 6900 -9839 -15916 -21420 -8625 -19513 -16640 -2315 6953 -14732 -11885 -2771 -19949 -24191
4009 -24191 10095 9548 3505 6136 18850 23849 33651 55822 33568 13795 -3409 11110 18169
3996 18169 27594 -5225 7660 16127 22386 36705 30169 25539 -15704 -10011 -6634 13212 -3781
3983 -3781 -26379 -17821 -58766 -73949 -50551 -27999 -9498 -4117 -19223 -15454 -12672 -11504 -2065
3970 -2065 20242 37025 28476 5122 -870 -8327 -60989 -53763 -45037 -34486 -4018 9926 25255
3957 25255 26926 39975 38415 54448 60164 58563 8670 5553 -31769 -27856 -10417 -11428 -14761
3944 -14761 -22276 3355 14306 -35276 -27208 8755 28366 19892 3481 27524 21510 1485 30176
3931 30176 21839 1042 -5402 -7186 32029 64937 76849 45562 23078 49870 27978 -14399
3919 -14399 -16144 711 -36480 -63135 -56150 -28674 19048 62211 68383 26269 30335 57798 75671
3906 75671 33862 13247 15809 34533 -11127 -46256 -11666 15155 22023 19581 12967 22722 29359
3893 29359 27616 45922 51027 32738 53321 35518 15563 -52 -14842 14472 19040 22029 9723
3880 9723 10487 -28106 -5685 11243 32882 37126 20841 1382 -12491 20512 51075 65937 80566
3867 80566 81586 56433 50570 23711 13642 20166 31967 26664 14958 7077 7210 10643 -11698
3854 -11698 -21714 -46204 -48887 -19103 12811 20410 21465 -6888 -12179 -25801 -29943 -6051 37701
3841 37701 64339 42673 32294 10286 -16956 -4216 10950 28965 32852 17600 -11287 -59886
3829 -59886 -40075 -15018 -31827 -18795 -45029 -42834 44596 82299 81807 69589 48784 47525 44425
$$ [...]
##END NTUPLES=NMR SPECTRUM
##END=
