##TITLE=Analysis number 315637
Compound Code cc 43146
Book Reference 414/148
Project Code adrs
Chemist Name mattw
##JCAMPDX= 6.0         $$ Bruker NMR JCAMP-DX V2.0
##DATA TYPE= NMR SPECTRUM
##DATA CLASS= NTUPLES
##ORIGIN= Bruker BioSpin GmbH
##OWNER= NMR
$$ XWIN-NMR		Version 3.5
$$ Fri Nov 25 10:34:53 2005 GMT Standard Time (UT+0h)  MAYBRIDGE\NMR@NMR_250MHZ
##.OBSERVE FREQUENCY= 250.131544655141
##.OBSERVE NUCLEUS= ^1H
##.ACQUISITION MODE= SIMULTANEOUS (DQD)
##.ACQUISITION SCHEME= undefined
##.AVERAGES= 16
##.DIGITISER RES= 18
##SPECTROMETER/DATA SYSTEM= dpx250
##.PULSE SEQUENCE= zg30
##.SOLVENT NAME= CDCl3
##.SHIFT REFERENCE= (INTERNAL, CDCl3, 0, 16.522)
##AUDIT TRAIL= $$ (NUMBER, WHEN, WHO, WHERE, WHAT)
$$ ##TITLE= Audit trail, XWIN-NMR		Version 3.5
$$ ##JCAMPDX= 5.01
$$ ##ORIGIN= Bruker BioSpin GmbH
$$ ##OWNER= NMR
$$ C:\u/data/dgb/nmr/ADRS/13070/pdata/1/auditp.txt
$$ ##AUDIT TRAIL=  $$ (NUMBER, WHEN, WHO, WHERE, WHAT)
(   1,<2005-11-25 10:34:27.34 +000>,<MAYBRIDGE\NMR>,<NMR_250MHZ>,
      <created by zg, POWCHK disabled, PULCHK disabled
       configuration hash MD5:
       62 19 C7 07 E1 42 D1 B7 37 6C 3D D0 77 39 F9 E6
       data hash MD5: 64K
       68 48 4B BD B6 2A 8F 8B 14 6A 24 7E 3E 72 D1 84>)
(   2,<2005-11-25 10:34:41.46 +000>,<MAYBRIDGE\NMR>,<NMR_250MHZ>,
      <Start of raw data processing
       ef LB = 0.3 FT_mod = 6 PKNL = 1 SI = 32K 
       data hash MD5: 32K
       D9 3D 7E AF 1C 04 23 80 93 76 BC 9B 7D 6F 43 44>)
(   3,<2005-11-25 10:34:43.45 +000>,<MAYBRIDGE\NMR>,<NMR_250MHZ>,
      <apk 
       data hash MD5: 32K
       43 75 2C 07 9A F9 15 BE B0 6F B4 EC 6C C2 9A 21>)
(   4,<2005-11-25 10:34:44.17 +000>,<MAYBRIDGE\NMR>,<NMR_250MHZ>,
      <abs ABSG = 5 
       data hash MD5: 32K
       45 47 89 14 D9 74 38 91 CA F6 9C 6F E6 5D 3B D6>)
$$ ##END=
$$ 
$$ hash MD5
$$ 0F 43 0A F7 7A F2 64 B8 B3 92 08 A2 ED 19 FA D2
##$RELAX= 
##$RELAX= 
##$RELAX= 
##$RELAX= 
##$RELAX= 
##$RELAX= 
##$RELAX= 
$$ Bruker specific parameters
$$ --------------------------
##$DU= <C:\u>
##$EXPNO= 13070
##$NAME= <ADRS>
##$PROCNO= 1
##$TYPE= <nmr>
##$USER= <dgb>
##$AMP= (0..31)
100 100 100 100 100 100 100 100 100 100 100 100 100 100 100 100 100 100 
100 100 100 100 100 100 100 100 100 100 100 100 100 100 
##$AQSEQ= 0
##$AQ_mod= 3
##$AUNM= <au_zg>
##$AUTOPOS= <4 >
##$BF1= 250.13
##$BF2= 250.13
##$BF3= 250.13
##$BF4= 250.13
##$BF5= 500.13
##$BF6= 500.13
##$BF7= 500.13
##$BF8= 500.13
##$BYTORDA= 1
##$CFDGTYP= 0
##$CFRGTYP= 5
##$CHEMSTR= <none>
##$CNST= (0..31)
1 1 145 1 1 1 1 1 1 1 1 1 1 1 1 1 1 1 1 1 1 1 1 1 1 1 1 1 1 1 1 1 
##$CPDPRG= <>
##$CPDPRG1= <>
##$CPDPRG2= <>
##$CPDPRG3= <>
##$CPDPRG4= <mlev>
##$CPDPRG5= <mlev>
##$CPDPRG6= <mlev>
##$CPDPRG7= <mlev>
##$CPDPRG8= <mlev>
##$CPDPRGB= <>
##$CPDPRGT= <>
##$D= (0..31)
0 1 0 0 0 0 0 0 0 0.06 0 0 0 0 0 0 0.0002 0 0 0 0 0 0 0 0 0 0 0 0 0 0 
0 
##$DATE= 1132914865
##$DBL= (0..7)
120 120 120 120 120 120 120 120 
##$DBP= (0..7)
150 150 150 150 150 150 150 150 
##$DBP07= 0
##$DBPNAM0= <>
##$DBPNAM1= <>
$$ [...]
##$SUBNAM7= <"">
##$SUBNAM8= <"">
##$SUBNAM9= <"">
##$SW= 20.6930455092707
##$SWIBOX= (0..15)
0 0 3 0 0 0 0 0 0 0 0 0 0 0 0 0 
##$SW_h= 5175.983436853
##$TD= 65536
##$TD0= 1
##$TE= 294.16
##$TE2= 300
##$TE3= 300
##$TEG= 300
##$TL= (0..7)
0 120 120 120 120 120 120 120 
##$TP= (0..7)
150 150 150 150 150 150 150 150 
##$TP07= 0
##$TPNAME0= <>
##$TPNAME1= <>
##$TPNAME2= <>
##$TPNAME3= <>
##$TPNAME4= <>
##$TPNAME5= <>
##$TPNAME6= <>
##$TPNAME7= <>
##$TPOAL= (0..7)
0.5 0.5 0.5 0.5 0.5 0.5 0.5 0.5 
##$TPOFFS= (0..7)
0 0 0 0 0 0 0 0 
##$TUNHIN= 0
##$TUNHOUT= 0
##$TUNXOUT= 0
##$USERA1= <user>
##$USERA2= <user>
##$USERA3= <user>
##$USERA4= <user>
##$USERA5= <user>
##$V9= 5
##$VALIST= <valist>
##$VCLIST= <CCCCCCCCCCCCCCC>
##$VD= 0
##$VDLIST= <DDDDDDDDDDDDDDD>
##$VPLIST= <PPPPPPPPPPPPPPP>
##$VTLIST= <TTTTTTTTTTTTTTT>
##$WBST= 1024
##$WBSW= 4
##$XGAIN= (0..3)
0 0 0 0 
##$XL= 0
##$YL= 0
##$YMAX_a= 719806
##$YMIN_a= -446944
##$ZGOPTNS= <>
##$ZL1= 120
##$ZL2= 120
##$ZL3= 120
##$ZL4= 120
##$ABSF1= 16.522
##$ABSF2= -4.171173
##$ABSG= 5
##$ABSL= 3
##$ALPHA= 0
##$AQORDER= 0
##$ASSFAC= 0
##$ASSFACI= 0
##$ASSFACX= 0
##$ASSWID= 0
##$AUNMP= <proc_1d>
##$AZFE= 0.1
##$AZFW= 0.1
##$BCFW= 0
##$BC_mod= 0
##$BYTORDP= 0
##$COROFFS= 0
##$CY= 12.5
##$DATMOD= 1
##$DC= 0
##$DFILT= <>
##$DTYPP= 0
##$F1P= 14.0000005364418
##$F2P= -0.99999901652339
##$FCOR= 0.5
##$FTSIZE= 32768
##$FT_mod= 6
##$GAMMA= 0
##$GB= 0
##$INTBC= 1
##$INTSCL= 1
##$ISEN= 128
##$LB= 0.3
##$LEV0= 0
##$LPBIN= 0
##$MAXI= 10000
##$MC2= 0
##$MEAN= 0
##$ME_mod= 0
##$MI= 0
##$NCOEF= 0
##$NC_proc= -3
##$NLEV= 6
##$NOISF1= 0
##$NOISF2= 0
##$NSP= 0
##$NTH_PI= 0
##$NZP= 0
##$OFFSET= 16.522
##$PC= 1
##$PHC0= 82.84324
##$PHC1= 3.080248
##$PH_mod= 1
##$PKNL= yes
##$PPARMOD= 0
##$PSCAL= 4
##$PSIGN= 0
##$REVERSE= no
##$SF= 250.13
##$SI= 32768
##$SIGF1= 0
##$SIGF2= 0
##$SINO= 400
##$SIOLD= 32768
##$SREGLST= <1H.CDCl3>
##$SSB= 0
##$STSI= 32768
##$STSR= 0
##$SW_p= 5175.98343685301
##$SYMM= 0
##$S_DEV= 0
##$TDeff= 65536
##$TDoff= 0
##$TI= <Analysis number 999999
Compound Code 99
Book Reference 9
Project Code 9>
##$TILT= no
##$TM1= 0
##$TM2= 0
##$TOPLEV= 0
##$USERP1= <user>
##$USERP2= <user>
##$USERP3= <user>
##$USERP4= <user>
##$USERP5= <user>
##$WDW= 1
##$XDIM= 32768
##$YMAX_p= 280568701
##$YMIN_p= -207744
$$ End of Bruker specific parameters
$$ ---------------------------------
##NTUPLES= NMR SPECTRUM
##VAR_NAME=  FREQUENCY,     SPECTRUM/REAL,   SPECTRUM/IMAG
##SYMBOL=    X,             R,               I
##VAR_TYPE=  INDEPENDENT,   DEPENDENT,       DEPENDENT
##VAR_FORM=  AFFN,          ASDF,            ASDF
##VAR_DIM=   32768,         32768,           32768
##UNITS=     HZ,            ARBITRARY UNITS, ARBITRARY UNITS
##FACTOR=    0.157963299565203, 1,           1
##FIRST=     4132.6476996994, 0,             0
##LAST=      -1043.33573715361, 0,           0
##MIN=       -1043.33573715361, -207744,     0
##MAX=       4132.6476996994, 280568701,     0
$$ Real data points
##PAGE= N=1
##DATA TABLE= (X++(R..R)), XYDATA
$$ [...]
$$ plain form
16411 9884 1810 -22053 -16158 3114 15118 9559 1554 970 -11021 -16748 -14224 -21427 -24970 -25977
16397 -25977 -23845 -26122 -37305 -27009 -2371 1537 4212 10859 -3996 -20831 -30334 -29606 -21471
16384 -21471 -13996 -72 -324 -15151 -25476 -8253 -12505 -24683 -22645 -22230 -18506 -17121 -22968 -29503
16370 -29503 -30447 -24279 -14432 -47 449 -2386 5116 9300 639 -2538 4643 1928 -8227 -12330
16356 -12330 -20246 -22981 -16058 -8226 -11826 -11480 -20324 -6402 3719 -7093 -6870 2716 2657 -7880
16342 -7880 -14307 -17173 -23334 -22359 -11372 -13076 -31 5139 10613 2870 -10099 -8009 577 -2210
16328 -2210 -5269 -11175 -26634 -17021 -11369 -9756 -16367 -30057 -23559 -21846 -21832 -30991 -31790 -22370 -6294
16313 -6294 -9952 -11064 -6692 -8503 -9277 -26379 -27881 -17422 2538 6508 3887 -4918 64 -7555
$$ packed form
16411I884q074k3863N895J9272J2004n559q005n84j1991n727K524p203l543j007
16397b5977K132k277j1183J0296K4638L908K675O647j4855j6835r503P28Q135
16384b1471P475J3924k52j4827j0325J7223m252j2178K038M15L724J385n847o535
16370b9503r44O168R847J4385M96k835P502M184q661l177P181k715j0155m103
16356a2330p916k735O923P832l600L46q844J3922J0121j0812K23R586n9j0537
16342g880o427k866o161R75J0987j704J3045N170N474p743j2969K090Q586k787
16328b210l059n906j5459R613N652J613o611j3690O498J713J4r159p99R420J6076
16313f294l658j112M372j811p74j7102j502J0459J9960L970k621q805M982p619
$$ plain form
16299 -7555 -27951 -24897 -37747 -30545 -12254 3420 2692 -1546 -10684 -14210 -20752 -20604 -17502 -23734
16285 -23734 -34398 -25877 -7653 -13063 -24875 -26190 -18932 -18925 -25089 -15274 841 -6681 -2375 -7385
16271 -7385 -19109 -30806 -46751 -33586 -20525 -14510 -14747 -2516 8460 13658 4810 -13441 -34474
16258 -34474 -27223 -13139 -14742 -22570 -27843 -27262 -23755 -26866 -24484 -25709 -34263 -37802 -37180 -29302 -31756
16243 -31756 -28763 -29629 -31444 -20163 -8930 -21823 -17579 -12939 -15374 -13288 -16182 -14789 -12167 -25164
16229 -25164 -30725 -11461 1072 -10505 -30387 -28014 -35402 -36843 -13321 -19994 -28970 -39896 -35648
16216 -35648 -39506 -29180 -21818 -15879 -15896 -29153 -34112 -33783 -45158 -50686 -37983 -35471 -22677 -9430
16202 -9430 -18419 -24690 -29668 -32417 -41971 -40704 -32183 -24390 -16041 -16372 -25558 -28413 -31997 -20827 -10922
$$ packed form
16299g555k0396L054j2850P202J8291J5674p28m238r138l526o542J48L102o232
16285b3734j0664Q521J8224n410j1812j315P258Po164R815J6115p522M306n010
16271g385j1724j1697j5945J3165J3061O015k37J2231J0976N198q848j8251k1033
16258c4474P251J4084j603p828n273N81L507l111K382j225q554l539O22P878k454
16243c1756K993q66j815J1281J1233j2893M244M640k435K086k894J393K622j2997
16229b5164n561J9264J2533j1577j9882K373p388j441K3522o673q976j0926M248
16216c5648l858J0326P362N939j7j3257m959L29j1375n528J2703K512J2794J3247
16202i430q989o271m978k749r554J267Q521P793Q349l31r186k855l584J1170R905
$$ plain form
16187 -10922 -10189 -24342 -32004 -28657 -11031 6114 4046 -24297 -29713 -25492 -13678 -5322 -5243 -11879
16173 -11879 -15699 -13155 -8834 -6495 -20670 -26822 -14600 -1176 -5368 -13831 -22906 -26310 -23669 -12763
16159 -12763 -823 1596 -5342 -3650 -9695 -22567 -22100 -15257 -4371 -11806 -24166 -31812 -28521 -19975
16145 -19975 -18571 -11026 -15012 -24900 -17366 -5803 -13324 -13178 -6987 -9819 2551 7073 9704 7772
16131 7772 6676 2874 7759 13060 12442 14069 6848 -5691 -4224 10697 15613 17787 20150 18293
16117 18293 14843 17376 12193 -2764 -9014 24374 34869 28435 29312 18010 4821 9212 24777
16104 24777 17714 5387 11433 19189 9101 -8776 -16577 -22421 -19473 -17361 -26764 -39333 -48018
16091 -48018 -45732 -39800 -47741 -40704 -18789 -17556 -34149 -44059 -40368 -33696 -29962 -34703 -31142 -36244
$$ packed form
16187a0922P33j4153p662L347J7626J7145k068k8343n416M221J1814Q356P9o636
16173a1879l820K544M321K339j4175o152J2222J3424m192q463r075l404K641J0906
16159a2763J1940K419o938J692o045j2872M67O843J0886p435j2360p646L291Q546
16145a9975J404P545l986r888P534J1563p521J46O191k832J2370M522K631j932
16131G772j096l802M885N301o18J627p221j2539J467J4921M916K174K363j857
16117A8293l450K533n183j4957o250L3388J0495o434Q77j1302j3189M391J5565
16104B4777p063j2327O046P756j0088j7877p801n844K948K112r403j2569q685
16091d8018K286N932p941P037K1915J233j6593r910L691O672L734m741L561n102
$$ plain form
16077 -36244 -39326 -30121 -18291 -11331 -17368 -22885 -23432 -22877 -19997 -22937 -8406 -6986 189 -2496
16063 -2496 -4269 -698 -6311 -11458 -16174 -33153 -35483 -32671 -37924 -26319 -9852 -13411 -19497 -34681
16049 -34681 -40370 -27074 -21219 -15256 -14360 -21809 -27951 -28784 -34801 -26228 -9802 -5031 -6255 -7824
16035 -7824 -12219 -16219 -16846 -14703 -9662 -11592 -6466 -5132 -7225 -6823 -11390 -8337 -11966 -18568 -22880
16020 -22880 -32082 -37040 -37261 -31043 -19944 -15829 -14833 -24770 -44788 -46726 -23597 -15313 -31672 -34117
16006 -34117 -29978 -22197 -19887 -13373 -8279 -10999 -17315 -17878 -7786 -8399 -12137 -2566 -5314 -7563 -14118
15991 -14118 -24196 -22590 -31274 -35043 -18522 -6320 -6059 -25772 -14691 -2288 -4090 -5401 6125
15978 6125 2096 1288 8795 1773 -9854 -15813 -15662 -17886 -29551 -21756 -16716 -27431 -40455 -51963
$$ packed form
16077c6244l082R205J1830O960o037n517n47N55K880k940J4531J420P175k685
16063b496j773L571n613n147m716j6979k330K812n253J1605J6467l559o086j5184
16049c4681n689J3296N855N963Q96p449o142q33o017Q573J6426M771j224j569
16035g824m395m000o27K143N041j930N126J334k093M02m567L053l629o602m312
16020b2880r202m958k21O218J1099M115R96r937k0018j938K3129Q284j6359k445
16006c4117M139P781K310O514N094k720o316n63J0092o13l738R571k748k249o555
15991a4118j0078J606q684l769J6521J2202K61j9713J1081J2403j802j311J1526
15978F125m029q08P507p022j1627n959J51k224j1665P795N040j0715j3024j1508
$$ plain form
15964 -51963 -46446 -36232 -31352 -31044 -34603 -24528 -15440 -27104 -24644 -25550 -29470 -43052 -41367 -25796
15950 -25796 -14658 -3140 8404 9074 139 -5112 -7929 -7139 -2277 -4427 -9656 -20037 -21567 -24058
15936 -24058 -36339 -38004 -27850 -11556 -9506 -10465 -16762 -33700 -36775 -32149 -23710 -23935 -24989 -22274
15922 -22274 -5798 918 1461 858 10298 9894 -13050 -34868 -27309 -17117 -23853 -13239 -2186 -1295
15908 -1295 -14441 -30868 -42807 -44905 -31560 -16660 -9282 -23159 -18882 -20712 -34030 -36146 -27194
15895 -27194 -18451 -26512 -28231 -10193 -7426 -14793 -10948 -8343 1768 3616 -6707 -18097 -20929
15882 -20929 -13607 -4308 -9310 -15659 -14284 -11258 -18214 -15350 -20425 -21849 -8680 -936 -2801 -7234
15868 -7234 -8904 -3884 4376 -7082 -16613 -28969 -36424 -27121 -22715 -14750 -16624 -14813 -3516 906
$$ packed form
15964e1963N517J0214M880L08l559J0075R088j1664K460r06l920j3582J685J5571
15950b5796J1138J1518J1544O70q935n251k817P90M862k150n229j0381j530k491
15936b4058j2281j665J0154J6294K050r59o297j6938l075M626Q439k25j054K715
15922b2274J6476O716N43o03R440m04k2944k1818P559J0192o736J0614J1053Q91
15908a295j3146j6427j1939k098J3345J4900P378j3877M277j830j3318k116Q952
15895b7194Q743q061j719J8038K767p367L845K605J0111J848j0323j1390k832
15882b0929P322R299n002o349J375L026o956K864n075j424J3169P744j865m433
15868g234j670N020Q260j1458r531j2356p455R303M406P965j874J811J1297M422
$$ plain form
15854 906 3877 -2681 -5136 -1038 -5664 -11847 -4689 1573 -7232 -9557 -9371 -7888 -1272 -16576 -24251
15839 -24251 -17565 -3218 844 -7286 -22407 -34361 -37108 -33365 -28011 -32034 -42821 -32201 -30059
15826 -30059 -25763 -12260 -17705 -18759 -12468 -10475 -6019 -11218 -15696 -17078 -34909 -36713 -23502 -20966
15812 -20966 -16608 -19821 -21607 -15650 -11379 6436 11694 9063 -856 -4538 -6153 -15798 -18452 -32106
15798 -32106 -23830 -20642 -21130 -23876 -21801 -4709 -5081 7691 18725 12710 2466 2062 56 -7648
15784 -7648 -15744 -14764 -17441 -17821 -8994 -22535 -28981 -20646 -12780 -1528 -7640 -15404 -10994 -6232 -7832
15769 -7832 -17897 -26986 -18282 3282 -1785 -4541 -12271 -19857 -13849 -12340 -10109 -16272 -16913 -9796
15755 -9796 -4862 -9432 -4701 4140 -241 -5297 -13010 -15064 -21802 -27405 -13668 -10079 -12205 -6367
$$ packed form
15854I06K971o558k455M098m626o183P158O262q805k325J86J483O616j5304p675
15839b4251O686J4347M062q130j5121j1954k747L743N354m023j0787J0620K142
15826c0059M296J3503n445j054O291J993M456n199m478j382j7831j804J3211K536
15812b0966M358l213j786N957M271J7815N258k631r919l682j615r645k654j3654
15798c2106Q276L188m88k746K075J7092l72J2772J1034o015j0244m04k006p704
15784g648q096R80k677l80Q827j3541o446Q335P866J1252o112p764M410M762j600
15769g832j0065r089Q704K1564n067k756p730p586O008J509K231o163o41P117
15755i796M934m570M731Q841m381n056p713k054o738n603J3737L589k126N838
$$ plain form
15741 -6367 3354 8631 2777 9051 17629 -12389 -32824 -21929 -11831 -8393 -14789 -14234 -9973 -10747
15727 -10747 -806 3412 -8071 -7839 12651 23004 11973 -4776 -11750 -16557 -13191 -13019 -19122 -24808
15713 -24808 -31481 -24692 -19305 -15589 -20352 -18291 -16721 -21736 -27157 -21218 -27215 -23195 -27512 -32258
15699 -32258 -19426 -21389 -28448 -23403 -24782 -31646 -23917 -17643 -1421 -6658 -22501 -41737 -56090
15686 -56090 -44140 -25385 -27056 -38291 -40221 -35366 -36659 -34503 -38230 -34490 -21039 -10590 -19570
15673 -19570 -21777 -22320 -34204 -34628 -21721 -21771 -24027 -11703 313 -7129 -5438 -19425 -21244 -18177
15659 -18177 -22565 -24731 -14170 -10408 -8675 -6621 -12863 -13660 -9459 -15945 -20162 -10768 -5366 -12068
15645 -12068 -25330 -20882 -14473 -18215 -9263 -5209 4056 5139 -9585 -13139 -11391 -13099 -6941 -5938
$$ packed form
15741f367R721N277n854O274Q578l0018k0435J0895J0098L438o396N55M261p74
15727a0747R941M218j1483K32K0490J0353j1031j6749o974m807L366J72o103n686
15713b4808o673O789N387L716m763K061J570n015n421N939n997M020m317m746
15699c2258J2832j963p059N045j379o864P729O274J6222n237j5843j9236j4353
15686e6090J1950J8755j671j1235j930M855j293K156l727L740J3451J0449q980
15673a9570k207n43j1884m24J2907n0k256J2324J2016p442J691j3987j819L067
15659a8177m388k166J0561L762J733K054o242p97M201o486m217R394N402o702
15645a2068j3262M448O409l742Q952M054R265J083j4724l554J748j708O158J003
$$ plain form
15631 -5938 -6166 -2434 -6747 -15271 -16353 -13043 -13494 -24525 -27608 -31594 -34894 -50843 -40729 -24436
15617 -24436 -24515 -13936 -2905 -19879 -24127 -28397 -29845 -21612 -5774 2041 -2349 4802 9320 -2111
15603 -2111 -8292 -19371 -27677 -23836 -14954 -25113 -33500 -22328 -17546 -30496 -36244 -18961 5942
15590 5942 1819 -9921 -19502 -19515 -12706 -7069 -7546 -13369 -7130 -8028 5951 7549 27 -7755 -13461
15575 -13461 -23719 -28656 -19390 -10977 -8983 -14825 -21114 -19725 -1729 -14069 -34571 -30888 -21368
15562 -21368 -34246 -34200 -20066 -20167 -12865 -8279 -10821 -9055 -469 -62 -5164 -15679 -12921 1496
15548 1496 12838 15300 -3751 -22883 -14646 -8642 -14289 -19899 -26904 -14168 -14228 -26075 -18698 -17273
15534 -17273 -10389 1804 -616 -12126 -8411 -9730 -6496 -10841 -5403 -3514 -6147 -4107 7641 518
$$ packed form
15631e938k28L732m313q524j082L310m51j1031l083l986l300j5949J0114J6293
15617b4436p9J0579J1031j6974m248m270j448Q233J5838P815m390P151M518j1431
15603b111o181j1079q306L841Q882j0159q387J1172M782j2950n748J7283K4903
15590E942m123j1740r581j3O809N637m77n823O239q98J3979J598p522p782n706
15575a3461j0258m937R266Q413J994n842o289J389J7996j2340k0502L683R520
15562b1368j2878M6J4134j01P302M586k542J766Q586M07n102j0515K758J4417
15548A496J1342K462j9051j9132Q237O004n647n610p005J2736o0j1847P377J425
15534a7273O884J2193k420j1510L715j319L234m345N438J889k633K040J1748p123
$$ plain form
15520 518 -4261 -3048 -10751 -32808 -33748 -22576 -19255 -25255 -27443 -20814 -10014 -17635 -35744 -48043
15506 -48043 -40002 -16777 -4922 -16327 -16198 -5001 -869 -15534 -16016 -14864 -14885 -17953 -6460 -15720
15492 -15720 -27125 -37131 -28677 -28287 -22069 -21740 -18696 -21008 -10653 -7848 -11646 -6740 -3713 4386
15478 4386 -2366 -1732 -3791 3812 -3623 -4395 2847 4638 2309 -4428 -12469 -7455 3582 5692 2126
15463 2126 -8005 -14460 -18265 -11716 -16872 -28885 -32122 -31517 -25897 -17987 -26399 -21526 -14219 -3075
15449 -3075 2357 5685 -4326 -22709 -21204 -21784 -31137 -16213 4717 15250 20664 14933 10979 5766
15435 5766 -3298 -5764 -2246 -6130 -7721 -17104 -19636 -15077 -17580 -22153 -10649 -6155 -2302 -12123
15421 -12123 -10395 -5121 6180 10358 8794 20368 21023 1617 -13087 -14944 -1406 -4279 -11353
$$ packed form
15520E18m779J213p703k2057r40J1172L321o000k188O629J0800p621j8109j2299
15506d8043Q041K3225J1855j1405J29J1197M132j4665m82J152k1l068J1493r260
15492a5720j1405j0006Q454L90O218L29L044k312J0355K805l798M906L027Q099
15478D386o752O34k059P603p435p72P242J791k329o737q041N014J1037K110l566
15463B126j0131o455l805O549n156j2013l237O05N620P910q412M873P307J1144
15449c075N432L328j0011j8383J505n80r353J4924K0930J0533N414n731l954n213
15435E766r064k466L518l884j591r383k532M559k503m573J1504M494L853r821
15421a2123J728N274J1301M178j564J1574O55j9406j4704j857J3538k873p074
$$ plain form
15408 -11353 -15075 -11224 -9796 -6200 -15535 -11403 11 -9396 2593 4345 -6814 -22330 -23690
15395 -23690 -15443 -14520 -10595 -2742 2759 9798 8385 11231 14316 182 -22231 -16074 2257 -1366
15381 -1366 -14913 -19010 -11423 -1295 -3384 6255 21328 6497 2261 13932 22259 7214 -299
15368 -299 -1745 4725 -9938 -30585 -26067 -32470 -27150 -14279 -7583 -7384 -5332 -2039 11323 2054
15354 2054 -6148 -16995 -18879 -18587 -19256 -15086 -18986 -13825 -7566 -4481 5381 5372 5546 3375 2274 -9849
15338 -9849 -14732 -8571 -8195 -18744 -35518 -32445 -19969 -17722 -15039 -14896 5452 14096 -2291 -15621
15324 -15621 -10204 -5356 5520 1133 -5797 -15514 -2428 3684 -6510 -21535 -26756 -20486 -6296
15311 -6296 -2807 -1903 2980 7635 -3823 -20647 -24846 -12323 -7037 -7674 -985 3349 3676 1895 7699
$$ packed form
15408a1353l722L851J428L596r335M132J1414r407J1989J752j1159j5516j360
15395b3690Q247R23L925P853N501P039j413K846L085j4134k2413O157J8331l623
15381a366j3547m097P587J0128k089R639J5073j4831m236J1671Q327j5045p513
15368b99j446O470j4663k0647M518o403N320J2871O696J99K052L293J3362r269
15354B054q202j0847j884K92o69M170l900N161O259L085R862rJ74k171j101j2123
15338i849m883O161L76j0549j6774L073J2476K247K683J43K0348Q644j6387j3330
15324a5621N417M848J0876m387o930r717J3086O112j0194j5025n221O270J4190
15311f296L489R04M883M655j1458j6824m199J2523N286o37O689M334L27j781N804
$$ plain form
15296 7699 11485 23221 15677 5212 -305 -11499 -13465 -25227 -28810 -27801 -19264 -18622 -9941 -19006
15282 -19006 -17798 -12938 -7596 -7595 -20612 -31771 -21537 -18999 -21335 -22509 -13699 -3440 4256 7030
15268 7030 1573 -5360 -4851 -4497 -11100 -13339 -8151 -2738 2997 3369 1480 -13686 -19773 -17783 -23816
15253 -23816 -25130 -3441 -10730 -6879 -4937 -9958 -698 3464 -3588 -1458 1488 4070 10438 3911
15239 3911 -6836 -12503 -6045 5561 12933 9486 -14575 -23656 -23288 -10717 3960 13565 -1107
15226 -1107 -3794 -17975 -19844 -11582 -13313 -10748 1046 -3618 -3687 2932 5827 7813 6936 8358 10227
15211 10227 -2162 -6645 -7442 -10854 -7624 -7155 -761 -5026 1581 -13791 -22823 -18535 -17588 -10529 1249
15196 1249 -4178 -6443 -4752 -7942 -12287 -23546 -36188 -23590 -10030 -8940 -15591 -20395 -20132 -19781
$$ packed form
15296G699L786J1736p544j0465n517j1194j966j1762l583J009Q537O42Q681r065
15282a9006J208M860N342Jj3017j1159J0234K538k336j174Q810J0259P696K774
15268G030n457o933N09L54o603k239N188N413N735L72j889j5166o087J990o033
15253b3816j314K1689p289L851J942n021R260M162p052K130K946K582O368o527
15239C911j0747n667O458J1606P372l447k4061r081L68J2571J4677R605j4672
15226a107k687j4181j869Q262j731K565J1794m664o9O619K895J986q77J422J869
15211A0227j2389m483p97l412L230M69O394m265O607j5372r032M288R47P059J1778
15196A249n427k265J691l190m345j1259j2642J2598J3560J090o651m804K63L51
$$ plain form
15182 -19781 -7854 399 1993 -11348 -27738 -18379 -2683 -20 -20316 -40002 -37904 -38213 -32296
15169 -32296 -22093 -20123 -8440 -665 -1369 -10519 -14691 -22198 -10508 -2729 9002 1797 -986 -7867
15155 -7867 -17192 -22416 -10290 1617 13923 25697 18921 23453 26097 17917 26280 15112 16835
15142 16835 32671 24792 3980 -6052 -17617 -19612 8459 25273 24036 12734 23406 36999
15130 36999 32750 31179 18913 14829 17383 12879 14884 8982 3621 15059 22865 29051 21001 9170
15116 9170 -9724 -10653 87 572 -5425 -15090 -19975 -27237 -15936 -5165 -11153 -257 10076 7406
15102 7406 -10881 -8515 -7616 -1108 -6875 -10588 -10842 -10770 -19710 -13530 4913 2615 11373 -3530 -13982
15087 -13982 -8607 -9133 1339 3933 1360 -4381 -2006 1750 -8492 -18625 -20726 -8786 1351
$$ packed form
15182a9781J1927Q253J594j3341j6390R359J5696K663k0296j9686K098l09N917
15169c2296J0203J970J1683P775p04r150m172p507J1690P779J1731p205k783o881
15155g867r325n224J2126J1907J2306J1774o776M532K644q180Q363j1168J723
15142A6835J5836p879k0812j0032j1565j995K8071J6814j237j1302J0672J3593
15130C6999m249j571j2266m084K554m504K005n902n361J1438P806O186q050j1831
15116I170j8894r29J0740M85n997r665m885p262J1301J0771n988J0896J0333k670
15102G406j8287K366Q99O508n767l713k54P2q940O180J8443k298Q758j4903j0452
15087a3982N375n26J0472K594k573n741K375L756j0242j0133k101J1940J0137
$$ plain form
15074 1351 11552 5521 328 -7478 -16063 -13641 -20419 -12731 -1630 -2983 -7359 5318 14458 9072
15060 9072 3425 4213 9953 4285 8034 13113 12951 10250 2507 1685 4130 6193 473 1430 16477
15045 16477 11890 2237 6679 -7526 -5010 -1514 5874 -516 -1081 2165 7080 27970 21292 2604
15031 2604 5458 22929 16556 16654 10857 22374 32273 32470 26719 18134 19177 10064 1667 1517 -8899
15016 -8899 -11078 -13362 1691 4575 -1324 -5535 -7808 -16973 -4479 -1005 -4195 -5441 4293 4190
15002 4190 -11658 -7251 10004 21695 8589 14001 10939 4223 6024 20997 23433 22331 17646
14989 17646 2985 14316 20021 18539 26094 25916 20493 23968 24636 17986 4569 4852 2978 16878
14975 16878 22770 39827 53070 68972 67777 75046 82329 81366 103371 107096 77089 60818 43526
$$ packed form
15074A351J0201o031n193p806q585K422o778P688J1101j353m376J2677R140n386
15060I072n647P88N740n668L749N079j62k701p743q22K445K063n720R57J5047
15045A6477m587r653M442j4205K516L496P388o390n65L246M915K0890o678j8688
15031B604K854J7471o373R8n797J1517R899J97n751q585J043r113q397j50j0416
15016h899k179k284J5053K884n899m211k273r165J2494L474l190j246R734j03
15002D190j5848M407J7255J1691j3106N412l062o716J801J4973K436j102m685
14989A7646j4661J1331N705j482P555j78n423L475O68o650j3417K83j874J3900
14975A6878N892J7057J3243J5902j195P269P283r63K2005L725l0007j6271j7292
$$ plain form
14962 43526 22302 14623 16493 9237 3532 4039 1725 6666 10399 1610 -3705 -3346 -3716 -11712 -5010
14947 -5010 1505 -9926 -10630 -15078 -1469 13580 9241 15300 3886 2131 16404 21472 21319 23377
14933 23377 17906 6800 -7467 -13138 -2808 3637 22424 16451 1586 -282 -5914 4402 8733
14920 8733 1410 4082 14060 22816 20595 19662 22732 20889 24200 17584 1218 -19923 -5328 15023
14906 15023 20072 9189 3411 -7273 -15835 -12065 -12781 -1135 18828 7841 13545 23977 9277
14893 9277 8372 18610 18716 15509 13833 14250 15625 9426 13248 -6763 -6347 -3098 -13664 -17012 -25414
14878 -25414 -18861 -4552 -1673 -1624 -12 5918 -1468 -7288 -16837 -20133 -5941 13304 15867 11832
14864 11832 -4143 -9119 -4631 -11068 -13365 -23481 -44412 -40861 -25345 -23537 -22130 -20754 -15288
$$ packed form
14962D3526k1224p679J870p256n705N07k314M941L733q789n315L59l70p996O702
14947e010O515j1431p04m448J3609J5049m339O059j1414j755J4273N068j53K058
14933B3377n471j1106j4267n671J0330O445J8787n973j4865j868n632J0316M331
14920H733p323K672R978Q756k221r33L070j843L311o616j6366k1141J4595K0351
14906A5023N049j0883n778j0684q562L770p16J1646J9963j0987N704J0432j4700
14893I277r05J0238J06l207j676M17J375o199L822k0011M16L249j0566l348q402
14878b5414O553J4309K879M9J612N930p386n820r549l296J4192J9245K563m035
14864A1832j5975m976M488o437k297j0116k0931L551J5516J808J407J376N466
$$ plain form
14851 -15288 -20071 -5988 -10881 -12222 -3530 -116 1602 33348 42535 13664 -7691 4022 15299
14838 15299 10353 4435 4629 -1805 -7045 -12551 -8375 -111 -4047 -13662 -13572 -8190 -13565 2326 4137
14823 4137 -16973 -26660 -20871 -17453 -12422 4887 14091 17552 8290 553 -5035 -5097 -6354 -981 -6693
14808 -6693 -9613 -12877 -16623 -1630 17666 36066 25861 17301 -7634 -5389 4291 2259 -9839
14795 -9839 -6233 5890 11510 6930 -5231 4947 3788 11986 19039 19854 13417 3193 1666 -7446
14781 -7446 -21336 -28838 -20690 -19219 -27794 -20184 -13161 -22196 -13311 -9066 -6332 -949 5099 7612
14767 7612 10069 6483 11341 3526 -10318 -13317 -10546 942 746 8126 7805 -3322 7939 23314
14753 23314 23906 11191 5689 12973 1514 -4745 11283 19460 14724 18089 20188 17451 -854 -10103
$$ packed form
14851a5288m783J4083m893j341Q692L414J718L1746R187k8871k1355J1713J1277
14838A5299m946n918J94o434n240n506M176Q264l936r615R0N382n375J5891J811
14823D137k1110r687N789L418N031J7309R204L461r262p737n588o2j257N373n712
14808f693k920l264l746J4993J9296J8400j0205q560k4935K245R680k032j2098
14795i839L606J2123N620m580j2161J0178j159Q198P053Q15o437j0224j527r112
14781g446j3890p502Q148J471q575P610P023r035Q885M245K734N383O048K513
14767G612K457l586M858p815j3844k999K771J1488j96P380l21j1127J1261J5375
14753B3314N92j2715n502P284j1459o259J6028Q177m736L365K099k737j8305r249
$$ plain form
14739 -10103 -5152 -806 -491 -133 10534 5902 20475 23595 24226 15926 7318 -4207 -13987 -12950
14725 -12950 5503 19343 16551 1269 1485 6569 -3388 -12682 -18939 -9985 -9504 -11280 -22311 -10678
14711 -10678 -6632 -13232 -16201 -16493 -8497 4903 9496 2444 -18000 -8218 4772 -11644 -9866 3723
14697 3723 2359 6573 8508 11176 7832 12224 20798 20884 17025 12215 12926 931 5082 5097 -1128 -417
14681 -417 11408 16858 11760 9598 4736 -7851 499 1729 6146 1897 -1265 1720 -5996 -12736
14667 -12736 -3345 2094 704 6437 18692 25250 20639 10493 18980 16596 18973 34798 49668
14654 49668 38302 26507 23884 23136 14229 7617 -3495 -132 9718 17866 30401 30342 12186 -2734
14640 -2734 12604 5652 876 3754 7979 19239 13406 -3691 -4034 12213 6072 -1178 7671 18694
$$ packed form
14739a0103M951M346L15L58J0667m632J4573L120O31q300q608j1525r780J037
14725a2950J8453J3840k792j5282K16N084r957r294o257Q954M81j776j1031J1633
14711a0678M046o600k969k92P996J3400M593p052k0444R782J2990j6416J778J3589
14697C723j364M214J935K668l344M392Q574Q6l859m810P11j1995M151J5o225P11
14681d17J1825N450n098k162m862j2587Q350J230M417m249l162K985p716o740
14667a2736R391N439j390N733J2255O558m611j0146Q487k384K377J5825J4870
14654D9668j1366j1795k623p48q907o612j1112L363R850Q148J2535n9j8156j4920
14640b734J5338o952m776K878M225J1260n833j7097l43J6247o141p250Q849J1023
$$ plain form
14626 18694 21697 13341 17765 13179 1269 16349 20514 19775 18255 19992 8881 -8479 -13197 4000
14612 4000 1282 -9269 832 6495 -5345 1860 21829 29132 29622 24763 -7420 -21020 -13332
14599 -13332 7263 340 4347 4314 -590 -2846 1057 19488 22611 22750 28381 10561 12485 4529
14585 4529 6498 6216 14452 25096 26140 21781 13259 349 1789 10015 6282 -3930 -8858 5803
14571 5803 10622 13660 19037 19319 9877 9294 9936 14584 4119 7879 25883 15298 140 4041
14557 4041 7875 8448 18039 16483 10673 11933 8188 -6279 -12443 2203 2218 -2324 -4175 -9860 335
14542 335 10814 4221 -7390 -6103 -7681 -4668 -15175 -10922 -1697 2516 11384 30480 33509 25661
14528 25661 11966 1693 1246 -2963 1875 -338 2827 15979 25255 20749 10503 12468 5407 2757
$$ packed form
14626A8694L003q356M424m586j1910J5080M165p39j520J737j1111j7360m718J7197
14612D000k718j0551J0101N663j1840P205J9969P303M90m859l2183j3600P688
14599a3332K0595o923M007l3m904k256L903J8431L123J39N631j7820J924p956
14585D529J969k82Q236J0644J044m359q522j2910J440Q226l733j0212m928J4661
14571E803M819L038N377K82r442n83O42M648j0465L760J8004j0585j5158L901
14557D041L834N73R591j556n810J260l745j4467o164J4646J5m542j851n685J0195
14542C35J0479o593j1611J287j578L013j0507M253R225M213Q868J9096L029p848
14528B5661j3695j0273m47m209M838k213L165J3152R276m506j0246J965p061k650
$$ plain form
14514 2757 -10069 -4530 -1367 6765 7839 628 8391 20047 28516 28877 24216 13715 2126 3007
14500 3007 13429 -2385 -7146 -10315 7032 36755 40068 34576 36521 28188 23247 19222 24515 21541
14486 21541 22271 22145 18928 30334 28745 21458 12269 -522 -4209 -481 14968 31153 26057 23735
14472 23735 21702 17660 3670 -11354 -7680 -6584 4940 5067 -6853 -10011 4032 6614 2395
14459 2395 5856 14250 16017 161 -7868 -7039 -8553 -6419 7416 20616 8906 -8190 -3275 7645
14445 7645 6556 -3686 8750 22340 19320 11163 2656 1702 5010 3774 10202 9480 -3779 -9963
14431 -9963 -6081 -943 -4880 34 13156 7883 3300 680 -1407 11426 12655 15779 22707 11538
14417 11538 9915 2397 -1752 -8340 -9101 -11753 -12540 -4761 778 14398 16813 21383 40828 49124
$$ packed form
14514B757j2826N539L163Q132J074p211P763J1656Q469L61m661j0501j1589Q81
14500C007J0422j5814m761l169J7347K9723L313n492J945q333m941m025N293k974
14486B1541P30j26l217J1406j589p287r189j2791l687L728J5449J6185n096k322
14472B3735k033m042j3990j5024L674J096J1524J27j1920l158J4043K582m219
14459B395L461Q394J767j5856q029Q29j514K134J3835J3200j1710j7096M915J0920
14445G645j089j0242J2436J3590l020q157q507r54L308j236O428p22j3259o184
14431i963L882N138l937M914J3122n273m583k620k087J2833J229L124O928j1169
14417A1538j623p518m149o588p61k652p87P779N539J3620K415M570J9445Q296
$$ plain form
14403 49124 40370 27687 21443 26296 13790 6390 11342 21836 26661 29997 25566 14751 15915
14390 15915 5723 3627 -4600 1509 13346 20801 11305 9225 22307 21607 24150 27010 23446 21412
14376 21412 14369 20214 27548 26265 21943 12904 12484 23803 36057 24445 11405 9097 2467 2132
14362 2132 12572 15026 17556 15395 8667 18794 22651 27659 35282 31247 16175 5550 5081 6487
14348 6487 8006 10445 16323 16734 12838 11013 16524 5631 2411 12608 21782 26460 26804 21202 4121
14333 4121 3868 3651 9745 4894 6444 12631 19051 17582 13876 9312 3267 25889 38275 35579 36784
14318 36784 48762 46716 40066 51697 50899 39311 25830 12619 8771 6927 22860 26740 4688
14305 4688 6891 8803 3894 782 6615 8036 17362 19902 21983 34034 43842 49830 56142 58927
$$ packed form
14403D9124q754j2683o244M853j2506p400M952J0494M825L336m431j0815J164
14390A5915j0192k096q227O109J1837P455r496k080J3082p00K543K860l564k034
14376B1412p043N845P334j283m322r039m20J1319J2254j1612j3040k308o630l35
14362B132J0440K454K530k161o728J0127L857N008P623m035j5072j0625m69J406
14348F487J519K439N878M11l896j825N511j0893l220J0197R174M678L44n602j7081
14333D121k53k17O094m851J550O187O420j469l706m564o045K2622J2386k696J205
14318C6784J1978k046o650J1631p98j1588j3481j3211l848j844J5933L880k2052
14305D688K203J912m909l112N833J421R326K540K081J2051R808N988O312K785
$$ plain form
14291 58927 48201 25743 22902 20310 11350 27792 17726 18393 25567 12312 7102 13883 12131
14278 12131 10981 17390 28477 22257 12834 20401 28135 27131 31249 35954 34424 35883 34197 31948
14264 31948 31470 31770 18293 6804 4331 7544 21126 27372 26798 18123 14463 15395 1783 -5756
14250 -5756 -2965 5600 27031 40808 39963 35541 23676 9158 11910 17661 20058 18578 9489 10114
14236 10114 2240 -2191 5221 14516 24814 10421 -8981 -10926 -5005 9212 7657 15355 13507
14223 13507 13400 20035 16326 20892 26905 34749 21009 15990 9293 -4107 3280 1699 5412 22693
14209 22693 26555 23576 19279 19592 10482 2314 20200 26968 31363 33380 31828 28499 34748 42488
14195 42488 34111 27801 13807 19220 23628 24944 30936 39206 30597 37549 28644 22782 12185 14512
$$ packed form
14291E8927j0726k2458k841k592q960J6442j0066O67P174j3255n210O781j752
14278A2131j150O409J1087o220r423P567P734j004M118M705j530J459j686k249
14264C1948m78L00j3477j1489k473L213J3582O246n74q675l660R32j3612p539
14250e756K791Q565K1431J3777q45m422j1865j4518K752N751K397j480r089O25
14236A0114p874m431P412R295J0298j4393j9402j945N921J4217j555P698j848
14223A3507j07O635l709M566O013P844j3740n019o697j3400P387j581L713J7281
14209B2693L862k979m297L13r110q168J7886O768M395K017j552l329O249P740
14195D2488q377o310j3994N413M408J316N992Q270q609O952q905n862j0597K327
$$ plain form
14181 14512 10966 15710 25388 32834 36368 40839 33865 15152 -532 15051 21438 29382 43978
14168 43978 38348 34099 36687 36832 34098 36490 44092 29433 13528 2592 523 9367 26146 23592
14154 23592 22583 26179 25924 10673 536 -4518 -11296 -4699 4866 -1703 -4080 8687 -1974 834
14140 834 -430 812 15941 20242 24738 27787 18619 10351 14356 26333 30245 26399 37870 44492
14126 44492 43531 33557 41830 44566 40452 40406 35350 38091 34750 16004 5945 5668 1383 5335 6419
14111 6419 11012 17778 25344 20507 15585 8939 16057 25749 31753 35312 34510 28194 21949 20672 21172
14096 21172 20113 18844 28056 13689 14928 26654 23105 19726 28582 34982 21816 23314 31409 29451
14082 29451 19329 20090 12483 11009 14869 13393 14194 20605 31220 37487 26825 13064 38 -7873
$$ packed form
14181A4512l546M744R678P446L534M471o974j8713j5684J5583O387P944J4596
14168D3978n630m249K588J45k734K392P602j4659j5905j0936k069Q844J6779k554
14154B3592j009L596k55j5251j0137n054o778O597R565o569k377J2767j0661K808
14140H34j264J242J5129M301M496L049r168q268M005J1977L912l846J1471O622
14126D4492r61r974Q273K736m114m6n056K741l341j8746j0059k77m285L952J084
14111F419M593O766P566m837m922o646P118R692O004L559q02o316o245j277N00
14096B1172j059j269R212j4367J239J1726l549l379Q856O400j3166J498Q095j958
14082B9451j0122P61p607j474L860j476Q01O411J0615O267j0662j3761j3026p911
$$ plain form
14068 -7873 -552 12472 16462 18669 17106 36736 32193 33083 35347 31398 31033 46417 49679 29995
14054 29995 30192 19830 10663 26753 35489 38429 44805 42767 30121 20786 28938 33116 34131 24876
14040 24876 16927 14883 2416 3361 3828 12492 20475 28124 28351 20760 32065 21653 11716 18878
14026 18878 34166 45373 48792 40787 29000 18988 8688 12834 31199 27649 33237 38967 26683
14013 26683 24291 32162 46057 58939 41910 23957 28414 40435 44913 47691 41068 35155 33355
14000 33355 39618 30845 14889 16446 31690 58207 62109 59971 45449 37291 40681 52548 67049
13987 67049 75238 61645 42504 43309 52347 61759 59506 47229 45386 45484 32688 42326 35709 17669
13973 17669 8516 8388 15135 19752 18392 17539 32066 37465 29235 19118 14113 24092 34491 31647
$$ packed form
14068g873P321J3024L990K207j563J9630m543Q90K264l949l65J5384L262j9684
14054B9995J97j0362r167J6090Q736K940O376k038j2646r335Q152M178J015r255
14040B4876p949k044j2467R45M67Q664P983P649K27p591J1305j0412r937P162
14026A8878J5288J1207L419q005j1787j0012j0300M146J8365l550N588N730j2284
14013B6683k392P871J3895J2882j7029j7953M457J2021M478K778o623n913j800
14000C3355O263q773j5956J557J5244K6517L902k138j4522q158L390J1867J4501
13987F7049Q189j3593j9141Q05R038R412k253j2277j843R8j2796R638o617j8040
13973A7669r153j28O747M617j360q53J4527N399q230j0117n005R979J0399k844
$$ plain form
13959 31647 26667 32135 27930 26702 29846 35321 40749 46494 49743 51497 52148 56113 39119 19270
13945 19270 30648 37091 40755 38452 35067 39900 49185 40563 35041 47072 66870 74411 65895 54860
13931 54860 56069 59750 59450 65566 82145 76756 82244 95628 80292 72245 100040 119942 123919
13918 123919 122052 113093 104899 118387 142874 166848 174310 185857 211556 253350 288517 323509
13906 323509 367900 419979 482266 534192 568786 594549 607459 617509 618077 589358 542658 482491
13894 482491 423120 379242 327238 260356 200137 160710 124849 106606 97257 90174 88621 72156
13882 72156 73857 78828 85829 79007 86115 70672 55344 53001 51167 51238 53142 40356 40608 59144
13868 59144 62284 59386 51220 47298 43854 37036 36075 32865 36588 49146 57669 59426 70435 73408
$$ packed form
13959C1647m980N468m205j228L144N475N428N745L249J754O51L965j6994j9849
13945A9270J1378O443L664k303l385M833R285q622n522J2031J9798P541q516j1035
13931E4860J209L681l00O116J6579n389N488J3384j5336q047K7795J9902L977
13918A23919j867q959q194J3488K4487K3974P462J1547K5699M1794L5167L4992
13906C23509M4391N2079O2287N1926L4594K5763J2910J0050N68k8719m6700o0167
13894D82491n9371m3878n2004o6882o0219l9427l5861j8243r349p083j553j6465
13882G2156J701M971P001o822P108j5443j5328k343j834P1J904j2786K52J8536
13868E9144L140k898q166l922l444o818r61l210L723J2558Q523J757J1009K973
$$ plain form
13854 73408 62688 47362 44316 50708 42943 40083 37951 26447 34183 32653 35152 52229 49615
13841 49615 46016 36705 20854 21228 21542 21598 20264 25082 28772 30550 42745 38815 33544 22232 29391
13826 29391 34214 30765 31108 28938 45201 58883 57423 38091 35232 50057 59270 44492 33116
13813 33116 26737 25676 22218 29807 39682 36606 31990 42062 54848 54858 44091 39790 32982 31263
13799 31263 26071 29741 34198 34976 42839 53976 56396 54085 46327 37633 31248 35099 36849 46150
13785 46150 52095 41337 35851 38690 38757 48672 44484 31030 40484 50421 49416 61560 83543 78545
13771 78545 63396 48524 35923 38515 50269 52581 45108 54996 49513 47102 33686 30529 40620
13758 40620 25874 19367 21585 32215 37579 37093 39143 50354 62478 60889 54186 37664 35729
$$ packed form
13854G3408j0720j5326l046O392p765k860k132j1504P736j530K499J7077k614
13841D9615l599r311j5851L74L14N6j334M818L690J778J2195l930n271j1312P159
13826B9391M823l449L43k170J6263J3682j460j9332k859J4825R213j4778j1376
13813C3116o379j061l458P589R875l076m616J0072J2786J0j0767m301o808j719
13799C1263n192L670M457P78P863J1137K420k311p758q694o385L851J750R301
13785D6150N945j0758n486K839O7R915m188j3454R454R937j005J2144K1983m998
13771G8545j5149j4872j2601K592J1754K312p473R888n483k411j3416l157J0091
13758D0620j4746o507K218J0630N364m86K050J1211J2124j589o703j6522j935
$$ plain form
13745 35729 38477 38729 36772 38775 32501 37355 43307 48896 48325 48282 47292 44151 43115 38211 43679 43640
13729 43640 40075 48215 68051 67762 56157 34556 26519 39959 38338 25776 12453 8819 21000
13716 21000 34887 35358 32747 44922 52386 54820 52620 46735 57159 67610 60932 53541 53789 53997
13702 53997 57589 53081 56749 60772 51485 53815 72300 73536 68173 54511 37643 24569 23029
13689 23029 29723 38658 51261 57851 59014 49508 50739 53542 54149 54164 56236 53091 55412 51718 36423
13674 36423 33151 48034 60642 62786 51819 54485 52930 53513 52037 64815 69675 59594 58120
13661 58120 60687 62355 57330 46177 38635 45693 47903 61284 73586 67870 64800 64589 49768 42765
13647 42765 37655 40251 44972 62539 59048 52481 54163 41183 51452 59189 56250 57257 69120
$$ packed form
13745C5729K748K52j957K003o274M854N952N589n71m3r90l141j036m904N468l9
13729D3640l565Q140J9836k89j1605k1601q037J3440j621j2562j3323l634J2181
13716B1000J3887M71k611J2175P464K434k200n885J0424J0451o678p391K48K08
13702E3997L592m508L668M023r287K330J8485J236n363j3662j6868j3074j540
13689B3029O694Q935J2603O590J163r506J231K803O07J5K072l145K321l694j5295
13674C6423l272J4883J2608K144j0967K666j555N83j476J2778M860j0081j474
13661E8120K567J668n025j1153p542P058K210J3381J2302n716l070k11j4821p003
13647D2765n110K596M721J7567l491o567J682j2980J0269P737k939J007J1863
$$ plain form
13634 69120 64572 52829 55088 74585 81478 71753 53944 53996 48755 45370 48404 59529 55083 57096
13620 57096 53860 44172 39519 47361 62004 70583 61260 62850 49012 45732 39571 41673 42555 39688
13606 39688 42044 52693 49987 56183 51844 43299 37067 39262 52159 49983 54810 54275 41271 48988
13592 48988 63195 70979 73849 61164 47401 51679 58493 64373 65125 69348 64893 53431 44087 51115
13578 51115 52541 57229 56873 53546 47728 51899 56714 71532 87271 89520 72307 52583 50576 63187
13564 63187 72014 75644 64088 61274 64907 68769 82130 91780 79152 62322 62995 67020 68513 71871
13550 71871 72436 93830 93227 80580 80025 81814 83648 82347 75518 71650 66764 63179 63570 67148 78964
13535 78964 83082 75949 52811 47871 42975 36987 37237 43974 56906 63525 71422 79488 72555 61877
$$ packed form
13634F9120m548j1743K259J9497O893r725j7809N2n241l385L034J1125m446K013
13620E7096l236r688m653P842J4643Q579r323J590j3838l280o161K102Q82k867
13606C9688K356J0649k706O196m339q545o232K195J2897k176M827n35j3004P717
13592D8988J4207P784K870j2685j3763M278O814N880P52M223m455j1462r344P028
13578E1115J426M688l56l327n818M171M815J4818J5739K249j7213j9724k007J2611
13564F3187Q827L630j1556k814L633L862J3361R650j2628j6830O73M025J493L358
13550G1871N65K1394o03j2647n55J789J834j301o829l868m886l585L91L578J1816
13535G8964M118p133k3138m940m896n988K50O737J2932O619P897Q066o933j0678
$$ plain form
13521 61877 61630 62113 66644 88408 86029 84232 79619 67138 58178 49465 42697 35133 40357 40124 43534
13506 43534 41166 33199 33867 34767 41911 49437 55338 60170 57968 60459 54175 50134 52909 60534 56078
13491 56078 53992 58126 69001 77412 76495 63888 44943 35664 38455 50041 48756 59292 68398
13478 68398 69339 71641 71312 67824 62618 62258 70945 69698 65471 78178 81159 71940 74104 63880 56894
13463 56894 62222 73541 79536 72707 65006 70434 81922 79566 84300 76378 61843 72656 80462
13450 80462 72711 71743 57968 76990 79281 75986 74716 69034 67777 65961 47464 40013 50352 67270
13436 67270 78272 76392 69923 59788 69512 78271 86623 85942 76358 76626 70937 68781 59488 64477
13422 64477 62712 53397 65521 82040 80972 68750 70790 73564 78270 88329 94181 81445 76878
$$ packed form
13521F1877k47M83M531K1764k379j797m613j2481q960q713o768p564N224k33L410
13506D3534k368p967O68R00P144P526N901M832k202K491o284m041K775P625m456
13491E6078k086M134J0875Q411r17j2607j8945r279K791J1586j285J0536R106
13478F8398R41K302l29l488n206l60Q687j247m227J2707K981r219K164j0224o986
13463E6894N328J1319N995o829p701N428J1488k356M734p922j4535J0813P806
13450H0462p751r68j3775J9022K291l295j270n682j257j816j8497p451J0339J6918
13436F7270J1002j880o469j0135R724Q759Q352o81r584K68n689k156r293M989
13422F4477j765r315J2124J6519j068j2222K040K774M706J0059N852j2736m567
$$ plain form
13409 76878 72269 64378 72425 80246 83462 80793 75895 88766 96125 87951 85532 84498 83361 78297
13395 78297 81206 84652 77169 75532 76742 57907 51035 61475 57486 65536 69288 81421 82220 75586
13381 75586 67719 78995 73764 72180 73259 69846 60209 47546 55710 72622 75696 78788 83654 74017
13367 74017 72043 77323 73924 73033 70426 59326 41630 47307 68358 88474 75426 61216 61694
13354 61694 78697 81466 78690 82299 87586 94058 97789 102983 106369 90416 86126 99959 82976
13341 82976 75489 74037 73426 76352 75885 78577 76416 65303 68762 72939 86975 96090 92633 91620
13327 91620 78101 75254 79914 97887 109836 99068 80921 79526 100783 116182 115700 116640 121726
13314 121726 122176 98861 83453 92157 96718 98206 105715 107118 105913 106287 114661 126490 123514 118120
$$ packed form
13409G6878m609p891Q047P821L216k669m898J2871P359q174k419j034j137n064
13395G8297K909L446p483j637J210j8835o872J0440l989Q050L752J2133P99o634
13381G5586p867J1276n231j584J079l413r637j2663Q164J6912L074L092M866r637
13367G4017j974N280l399q91k607j1100j7696N677K1051K0116j3048j4210M78
13354F1694J7003K769k776L609N287O472L731N194L386j5953m290J3833j6983
13341H2976p487j452o11K926m67K692k161j1113L459M177J4036R115l457j013
13327I1620j3519k847M660J7973J1949j0768j8147j395K1257J5399m82R40N086
13314A21726M50k3315j5408Q704M561J488P509J403j205L74Q374J1829k976n394
$$ plain form
13300 118120 103966 100126 100553 94514 100059 110836 119965 122703 116976 123850 123411 116963 116390 115685 97776
13285 97776 89489 83466 69962 79504 87537 97230 104799 108120 98371 97160 104023 91817 91726 100048
13271 100048 96557 100810 108839 108937 102388 102228 109426 109744 122238 131917 136457 131719 128551 117234 114349
13256 114349 115124 116235 113252 111258 114257 115196 100277 95474 107526 108633 120392 130485 123938 120608
13242 120608 117561 117302 124828 137429 139583 136102 136892 144404 144293 144543 151392 148044 153494 147375 147571
13227 147571 156901 155976 160436 167506 165749 176171 178040 186580 204565 214168 211517 209802 208377 217335
13213 217335 213946 230799 243178 274170 281530 300402 331866 372524 408415 432715 461152 470471
13201 470471 473258 482407 491485 503831 483326 458162 447515 437868 411909 411289 421437 435902 426217
$$ packed form
13300A18120j4154l840M27o039N545J0777R129K738n727O874m39o448n73p05j7909
13285I7776q287o023j3504R542Q033R693P569L321r749j211O863j2206r1Q322
13271A00048l491M253Q029R8o549j60P198L18J2494R679M540m738l168j1317k885
13256A14349P75J111k983j994K999R39j4919m803J2052J107J1759J0093o547l330
13242A20608l047k59P526J2601K154l481P90P512j11K50O849l348N450o119J96
13227A47571R330r25M460P070j757J0422J869Q540J7985R603k651j715j425Q958
13213B17335l389J6853J2379L0992P360J8872L1464M0658L5891K4300K8437R319
13201D70471K787R149R078J2346k0505k5164j0647r647k5959o20J0148J4465r685
$$ plain form
13188 426217 435907 458031 484352 498319 523460 528678 531712 537486 540667 535711 521369 509129 483630
13175 483630 442602 401122 370565 348426 327494 315306 310178 295022 282866 273392 277429 276825
13163 276825 274875 270325 271753 281372 277960 265428 268176 259369 252166 250833 262166 277332 280026
13150 280026 276057 268919 261945 266856 279707 292394 290473 285406 289720 283074 281294 301883 318418
13137 318418 325566 334059 351566 361450 361535 368355 374781 378651 388525 408539 432778 458312 480412
13124 480412 477795 482295 510320 536933 558067 591593 641056 690978 747103 801037 860932 922345
13112 922345 982840 1033329 1076773 1114291 1142585 1164769 1165852 1123517 1062606 1009600 962941 930085
13100 930085 916647 891908 873706 886462 898530 899238 908029 919343 916485 915241 895686 878756
$$ packed form
13188D26217R690K2124K6321J3967K5141N218L034N774L181m956j4342j2240k5499
13175D83630m1028m1480l0557k2139k0932j2188n128j5156j2156r474M037o04
13163B76825j950m550J428R619l412j2532K748q807p203j333J1333J5166K694
13150B80026l969p138o974M911J2851J2687j921n067M314o646j780K0589J6535
13137C18418P148Q493J7507R884Q5O820O426L870R874K0014K4239K5534K2100
13124D80412k617M500K8025K6613K1134L3526M9463M9922N6125N3934N9895O1413
13112I22345O0495N0489M3444L7518K8294K2184J083m2335o0911n3006m6659l2856
13100I30085j3438k4739j8202J2756J2068P08Q791J1314k858j244j9555j6930
$$ plain form
13088 878756 866302 857603 846789 837682 844645 853758 865845 871039 878366 901189 894129 878740 871387
13075 871387 851201 818764 766278 717970 687656 664437 644801 621904 605397 595748 594895 591075
13063 591075 567844 548859 552549 553932 541363 525135 516824 522706 529452 543080 562391 586026
13051 586026 615154 632428 670956 699145 716897 726721 731156 720663 677456 616807 559859 507769
13039 507769 461081 418212 391171 368817 354025 353785 345555 336204 331368 324689 328322 314047 298817
13026 298817 295727 298109 295522 284093 291905 292713 281652 270162 273567 291104 288181 270678 266289
13013 266289 269818 267778 270740 272192 271742 275830 272031 258054 262478 272016 265863 280553 275432 254659
12999 254659 245245 239045 236665 237473 235906 238861 239571 245048 240720 237159 235759 230336 240968 237642
$$ packed form
13088H78756j2454q699j0814r107O963R113J2087N194P327K2823p060j5389p353
13075H71387k0186l2437n2486m8308l0314k3219j9636k2897j6507r649q53l820
13063E91075k3231j8985L690J383j2569j6228q311N882O746J3628J9311K3635
13051E86026K9128J7274L8528K8189J7752R824M435j0493m3207o0649n6948n2090
13039E07769m6688m2869k7041k2354j4792k40q230r351m836o679L633j4275j5230
13026B98817l090K382k587j1429P812Q08j1061j1490L405J7537k923j7503m389
13013B66289L529k040K962J452m50M088l799j3977M424R538o153J4690n121k0773
12999B54659r414o200k380Q08j567K955P10N477m328l561j400n423J0632l326
$$ plain form
12985 237642 216795 226335 235958 235328 249114 249255 243684 223515 217097 223512 225438 227252 229482 231388
12971 231388 222256 231381 248221 240861 238201 232208 211955 223387 231099 211981 210502 211959 216809
12958 216809 232145 236113 232746 214461 218788 223103 218232 215576 213383 216719 212580 209829 206169 215326
12944 215326 230376 231687 234681 226066 221936 222615 218735 220182 231274 238405 236729 218843 221170 245060
12930 245060 256224 271396 264148 261851 267159 264854 263950 260656 267835 270193 279944 287000 277515 273257
12916 273257 279582 281030 283213 273513 276895 284308 292801 298007 296305 283398 268168 256837 254989
12903 254989 274822 292219 293047 285163 289791 275255 271153 290464 299996 310464 333454 336573 341860
12890 341860 351104 344353 356773 364688 364241 357778 367056 370682 378689 383005 360407 354146 369096 372968
$$ packed form
12985B37642k0847R540R623o30J3786J41n571k0169o418O415J926J814K230J906
12971B31388r132R125J6840p360k660n993k0253J1432P712j9118j479J457M850
12958B16809J5336L968l367j8285M327M315m871k656k193L336m139k751l660R157
12944B15326J5050J311K994q615m130O79l880J447J1092P131j676j7886K327K3890
12930B45060J1164J5172p248k297N308k305r04l294P179K358R751P056r485m258
12916B73257O325J448K183r700L382P413Q493N206j702j2907j5230j1331j848
12903B54989J9833J7397Q28p884M628j4536m102J9311R532J0468K2990L119N287
12890C41860R244o751J2420P915m47o463R278L626Q007M316k2598o261J4950L872
$$ plain form
12876 372968 373960 381836 375945 369964 369475 376779 386142 394271 392079 383442 379496 390163 414410 423927
12862 423927 433886 449132 457759 468996 493321 505329 517551 532432 567824 618219 668882 722958
12850 722958 772557 820476 884018 943709 965061 1005797 1034885 1047271 1030919 984877 924594
12839 924594 855432 789312 714978 648482 580686 517451 473121 435476 421421 409456 389475
12828 389475 380579 389513 391758 388817 387240 372913 365451 370689 372722 377065 386474 387041 383981 391057
12814 391057 392954 401017 423450 447870 473533 488013 489975 488959 491610 489643 477309 486274 504104
12801 504104 504247 501648 483211 473254 475306 488106 499427 499709 502990 518366 521997 527766 550739
12788 550739 570969 598569 619661 633939 661688 688374 706004 712731 721262 736086 738870 731022
$$ packed form
12876C72968R92P876n891n981m89P304R363Q129k192q637l946J0667K4247R517
12862D23927R959J5246Q627J1237K4325J2008J2222J4881L5392N0395N0663N4076
12850G22958M9599M7919O3542N9691K1352M0736K9088J2386j6352m6042o0283
12839I24594o9162o6120p4334o6496o7796o3235m4330l7645j4055j1965j9981
12828C89475q896Q934K245k941j577j4327p462N238K033M343R409N67l060P076
12814C91057J897Q063K2433K4420K5663J4480J962j016K651j967j2334Q965J7830
12801E04104J43k599j8437r957K052J2800J1321K82L281J5376L631N769K2973
12788E50739K0230K7600K1092J4278K7749K6686J7630O727Q531J4824K784p848
$$ plain form
12776 731022 728715 718127 715705 722438 724509 725291 727949 712924 716266 724739 719901 711720 716451 715993
12762 715993 716103 725588 725550 730257 736108 739976 749755 769268 788165 811410 824229 842017 873044
12749 873044 919382 954429 989654 1010596 1012140 1019673 1032045 1026959 1038896 1050833 1061553 1071209
12737 1071209 1080987 1101264 1131355 1158162 1182764 1211593 1240630 1270353 1289685 1334255 1367793
12726 1367793 1403474 1440259 1483557 1523078 1574867 1619315 1666959 1732563 1799892 1863375 1924625
12715 1924625 1998986 2076647 2160548 2247092 2320848 2401946 2500209 2607380 2715789 2830605 2951535
12704 2951535 3098582 3244088 3377774 3526654 3694237 3857881 4031827 4227458 4434284
12695 4434284 4650805 4866367 5103751 5362612 5641373 5934318 6238167 6564242 6931388
$$ packed form
12776G31022k307j0588k422O733K071P82K658j5025L342Q473m838q181M731m58
12762G15993J10R485l8M707N851L868R779J9513J8897K3245J2819J7788L1027
12749H73044M6338L5047L5225K0942J544P533J2372n086J1937J1937J0720R656
12737A071209R778K0277L0091K6807K4602K8829K9037K9723J9332M4570L3538
12726A367793L5681L6785M3298L9521N1789M4448M7644O5604O7329O3483O1250
12715A924625P4361P7661Q3901Q6544P3756Q1098R8263J07171J08409J14816J20930
12704B951535J47047J45506J33686J48880J67583J63644J73946J95631K06826
12695D434284K16521K15562K37384K58861K78761K92945L03849L26075L67146
$$ plain form
12686 6931388 7339296 7770137 8222940 8709002 9244810 9795322 10374238 10981615 11618001
12677 11618001 12289985 13012557 13800291 14688868 15706170 16894946 18317107 20088964 22340029
12668 22340029 25187633 28803721 33293234 38613466 44589412 50862018 57105273 63152118
12660 63152118 68940457 74192904 78104221 79373772 76898459 70777113 62564770 54323548
12652 54323548 47465768 42458885 39235978 37468744 36831552 37032242 37860048 39184980
12644 39184980 40980421 43234984 45904460 48859156 51937197 55154865 58752718 63087025
12636 63087025 68409909 74652719 81315199 87631321 92916511 96920853 99863548 102114800
12628 102114800 103511328 103239868 100271471 94276208 86361894 78460142 71947672 67145607
$$ packed form
12686F931388M07908M30841M52803M86062N35808N50512N78916O07377O36386
12677A1618001O71984P22572P87734Q88577J017302J188776J422161J771857K251065
12668B2340029K847604L616088M489513N320232N975946O272606O243255O046845
12660F3152118N788339N252447L911317J269551k475313o121346q212343q241222
12652E4323548o857780n006883l222907j767234o37192K00690Q27806J324932
12644C9184980J795441K254563K669476K954696L078041L217668L597853M334307
12636F3087025N322884O242810O662480O316122N285190M004342K942695K251252
12628A02114800J396528k71460k968397n995263p914314p901752o512470m802065
$$ plain form
12620 67145607 63757487 61310843 59352081 57432912 55255941 52645457 49685470 46778810
12612 46778810 44399119 42818055 41997609 41639388 41496942 41644838 42437914 44323369 47572757
12603 47572757 52140941 57743571 63957563 70282362 76436862 82245374 87314444 90661455
12595 90661455 90788504 86309150 76956544 64373471 51369923 40173619 31460005 24975622
12587 24975622 20235085 16783762 14232322 12285569 10759098 9525750 8501510 7641088
12579 7641088 6889975 6254158 5683371 5177742 4746211 4378685 4079051 3835133 3635956
12570 3635956 3462453 3322134 3188925 3059730 2940350 2834649 2739323 2618549 2478870 2341129
12560 2341129 2208600 2057728 1912484 1786150 1688734 1595320 1513180 1429464 1360775 1308603
$$ packed form
12620F7145607l388120k446644j958762j919169k176971k610484k959987k906660
12612D6778810k379691j581064q20446l58221j42446J47896P93076J885455L249388
12603D7572757M568184N602630O213992O324799O154500N808512N069070L347011
12595I0661455J27049m479354r352606j2583073j3003548j1196304q713614o484383
12587B4975622m740537l451323k551440j946753j526471j233348j024240q60422
12579G641088p51113o35817n70787n05629m31531l67526k99634k43918j99177
12570C635956j73503j40319j33209j29195j19380j05701r5326j20774j39679j37741
12560B341129j32529j50872j45244j26334r7416r3414q2140q3716o8689n2172
$$ plain form
12550 1308603 1267706 1236521 1210975 1177317 1144853 1105587 1077161 1054920 1050564 1053626 1038990 1030125
12538 1030125 1041396 1042762 1043123 1043109 1027631 1000036 984444 967412 950223 925360 916945 910591 894304
12525 894304 899884 896380 895884 883077 868015 858729 857623 860816 855280 860419 865210 873119 867160 871967
12511 871967 899846 917911 929116 962014 987770 1010963 1051530 1082373 1114589 1151954 1183633
12500 1183633 1216496 1251327 1282852 1312913 1360979 1396763 1437820 1478097 1508454 1543187 1587195
12489 1587195 1635697 1689283 1739421 1808684 1897245 1987024 2092621 2202120 2331586 2473919
12479 2473919 2611427 2764587 2933546 3110372 3296097 3481991 3635445 3778838 3913313
12470 3913313 4057136 4211875 4384316 4563757 4765337 5010298 5272980 5537633 5808755
$$ packed form
12550A308603m0897l1185k5546l3658l2464l9266k8426k2241m356L062j4636q865
12538A030125J1271J366L61j4j5478k7595j5592j7032j7189k4863q415o354j6287
12525H94304N580l504m96j2807j5062r286j106L193n536N139M791P909n959M807
12511H71967K7879J8065J1205L2898K5756K3193M0567L0843L2216L7365L1679
12500A183633L2863L4831L1525L0061M8066L5784M1057M0277L0357L4733M4008
12489A587195M8502N3586N0138O9263Q8561Q9779J05597J09499J29466J42333
12479B473919J37508J53160J68959J76826J85725J85894J53454J43393J34475
12470C913313J43823J54739J72441J79441K01580K44961K62682K64653K71122
$$ plain form
12461 5808755 6103198 6401381 6725324 7076071 7449304 7845124 8272806 8723506 9225861
12452 9225861 9770145 10342430 10986509 11688755 12445751 13267729 14152020 15112667 16145346
12443 16145346 17258737 18464929 19789604 21256260 22925936 24855232 27186475 30131747
12435 30131747 33870107 38625908 44539325 51628586 59899249 69401659 80183868 91999592
12427 91999592 104083643 115213931 124138122 130124887 133141308 133036398 129040261 120637187
12419 120637187 108729111 95238755 81563863 68019096 54825676 42863893 33171630
12412 33171630 26053439 21063973 17540346 14970956 13009948 11445780 10121472 8956716
12404 8956716 7907755 6970114 6135345 5381936 4734253 4208199 3768617 3382551 3084377
$$ packed form
12461E808755K94443K98183L23943L50747L73233L95820M27682M50700N02355
12452I225861N44284N72285O44079P02246P56996Q21978Q84291R60647J032679
12443A6145346J113391J206192J324675J466656J669676J929296K331243K945272
12435C0131747L738360M755801N913417P089261Q270663R502410J0782209J1815724
12427I1999592J2084051J1130288Q924191N986765L016421j04910l996137q403074
12419A20637187j1908076j3490356j3674892j3544767j3193420j1961783r692263
12412C3171630p118191m989466l523627k569390j961008j564168j324308j164756
12404H956716j048961r37641q34769p53409o47683n26054m39582l86066k98174
$$ plain form
12395 3084377 2825239 2596699 2381015 2196880 2063747 1936517 1798111 1673425 1568949
12386 1568949 1492222 1418775 1321927 1232581 1151792 1087343 1027431 980663 931048 890070 864669
12375 864669 832737 801340 776764 759623 716877 691163 669218 652475 637829 633705 624208 614211
12363 614211 603713 581355 556320 536252 543627 536912 539596 539634 522925 515684 503310 496388 500099
12350 500099 501102 496416 491478 488232 472260 463102 444070 428852 416603 406553 395076 388860 379723
12337 379723 370564 372430 381454 387500 382909 385543 381758 370365 370556 364641 362057 373301 386010 394284
12323 394284 414141 428237 443598 457446 462206 479209 492975 497386 521857 525052 502855 490325
12311 490325 483176 474515 464683 480497 491068 504055 518288 526260 533756 550197 566732 576842
$$ packed form
12395C084377k59138k28540k15684j84135j33133j27230j38406j24686j04476
12386A568949p6727p3447r6848q9346q0789o4449n9912m6768m9615m0978k5401
12375H64669l1932l1397k4576j7141m2746k5714k1945j6743j4646m124r497r997
12363F14211j0498k2358k5035k0068P375o715K684L8j6709p241j2374o922L711
12350E00099J003m686m938l246j5972r158j9032j5218j2249j0050j1477o216r137
12337C79723r159J866R024O046m591K634l785j1393J91n915k584J1244J2709Q274
12323C94284J9857J4096J5361J3848M760J7003J3766M411K4471L195k2197j2530
12311D90325p149q661r832J5814J0571J2987J4233P972P496J6441J6535J0110
$$ plain form
12299 576842 587731 598518 627910 654269 688287 729422 774216 793338 827006 874144 916221
12288 916221 942496 970942 986256 967492 931407 896402 864159 824232 778142 739484 712459
12277 712459 688454 671346 649102 639099 631897 642556 654443 670554 701977 720381 744366 765917
12265 765917 786215 816166 846195 870687 883274 894127 911986 928198 959051 980587 1006329
12254 1006329 1050231 1074211 1065392 1063209 1078865 1108909 1122820 1145552 1175337 1183257 1209666 1244998
12242 1244998 1273313 1307979 1348409 1397313 1437144 1481370 1515196 1557073 1609086 1685643 1760144
12231 1760144 1838050 1931064 2030377 2136061 2243800 2363727 2478322 2602003 2750081 2905553
12221 2905553 3046014 3174141 3306346 3432016 3548656 3646036 3727193 3811812 3886972 3974277
$$ packed form
12299E76842J0889J0787K9392K6359L4018M1135M4794J9122L3668M7138M2077
12288I16221K6275K8446J5314j8764l6085l5005l2243l9927m6090l8658k7025
12277G12459k4005j7108k2244j0003p202J0659J1887J6111L1423J8404K3985K1551
12265G65917K0298K9951L0029K4492J2587J0853J7859J6212L0853K1536K5742
12254A006329M3902K3980q819k183J5656L0044J3911K2732K9785P920K6409L5332
12242A244998K8315L4666M0430M8904L9831M4226L3826M1877N2013P6557P4501
12231A760144P7906R3014R9313J05684J07739J19927J14595J23681J48078J55472
12221B905553J40461J28127J32205J25670J16640R7380Q1157Q4619P5160Q7305
$$ plain form
12211 3974277 4064984 4162419 4271349 4418422 4583371 4772444 4978272 5191584 5433320 5698766
12201 5698766 5994921 6309188 6636541 6976783 7370763 7807978 8283196 8817467 9388484
12192 9388484 10028330 10724993 11463167 12231049 13018083 13825865 14648383 15451932 16220492
12183 16220492 16947279 17684378 18534462 19613748 20993815 22767378 25042501 27940701
12175 27940701 31646523 36307069 42016406 48711413 56143878 63917357 71665805 79213639
12167 79213639 86340896 92548983 96805886 97698429 94208695 86638706 76818656 66993735
12159 66993735 58816375 52936885 49230039 47207526 46397565 46450286 47083742 48128547 49393298
12150 49393298 50638104 51754580 52880562 54272157 56134387 58539144 61503179 64909312
$$ packed form
12211C974277R0707R7435J08930J47073J64949J89073K05828K13312K41736K65446
12201E698766K96155L14267L27353L40242L93980M37215M75218N34271N71017
12192I388484O39846O96663P38174P67882P87034Q07782Q22518Q03549P68560
12183A6220492P26787P37099Q50084J079286J380067J773563K275123K898200
12175B7940701L705822M660546N709337O695007P432465P773479P748448P547834
12167G9213639P127257O208087M256903Q92543l489734p569989r820050r824921
12159F6993735q177360n879490l706846k022513q09961N2721O33456J044805J264751
12150D9393298J244806J116476J125982J391595J862230K404757K964035L406133
$$ plain form
12142 64909312 68429073 71694771 74544456 77104199 79784942 83035649 86971628 91334984
12134 91334984 95479792 98461752 99232672 97179296 92473556 86075318 79192783 72583135
12126 72583135 66390315 60504838 54926048 49791808 45345201 41759686 39040558 37062653
12118 37062653 35620684 34422468 33286655 32245501 31585708 31708725 32918684 35291750
12110 35291750 38711974 42918151 47538547 52204146 56614648 60623404 64026808 66250362
12102 66250362 66310664 63215787 56706375 47843349 38559419 30368302 23862776 18961571
12094 18961571 15351241 12696613 10727302 9205960 7979506 6945748 6060817 5303842
12086 5303842 4708572 4207087 3783090 3444490 3174802 2956897 2782312 2651519 2534854
$$ packed form
12142F4909312L519761L265698K849685K559743K680743L250707L935979M363356
12134I1334984M144808K981960P70920k053376m705740o398238o882535o609648
12126G2583135o192820n885477n578790n134240m446607l585515k719128j977905
12118C7062653j441969j198216j135813j041154o59793J23017J209959K373066
12110C5291750L420224M206177M620396M665599M410502M008756L403404K223554
12102F6250362O0302l094877o509412q863026r283930q191117o505526m901205
12094A8961571l610330k654628j969311j521342j226454j033758q84931p56975
12086E303842n95270n01485m23997l38600k69688k17905j74585j30793j16665
$$ plain form
12077 2534854 2448799 2358352 2276491 2229945 2173766 2097583 2005121 1924632 1849400 1766229 1678147
12066 1678147 1613622 1579400 1526757 1473304 1435949 1400381 1360186 1306751 1263390 1231808 1207972
12055 1207972 1183052 1147812 1103958 1070740 1044795 1037785 1044111 1048686 1052880 1046421 1059504 1068050
12043 1068050 1078229 1093023 1096903 1069616 1041784 1008455 956845 919660 871189 825562 798782
12032 798782 753781 724875 693301 656178 624979 592159 568942 563371 551908 541871 523609 528705
12020 528705 561944 592257 615869 655576 704846 738424 769583 807409 856564 883035 900466
12009 900466 907567 908869 919238 945043 959033 986118 1035476 1090300 1145079 1200259 1257997 1290566
11997 1290566 1279966 1241117 1181302 1089911 962877 846181 730308 635548 544598 480304 431615
$$ packed form
12077B534854q6055r0447q1861m6546n6179p6183r2462q0489p5232q3171q8082
12066A678147o4525l4222n2643n3453l7355l5568m0195n3435m3361l1582k3836
12055A207972k4920l5240m3854l3218k5945p010O326M575M194o459J3083Q546
12043A068050J0179J4794L880k7287k7832l3329n1610l7185m8471m5627k6780
12032G98782m5001k8906l1574l7123l1199l2820k3217n571j1463j0037j8262N096
12020E28705L3239L0313K3612L9707M9270L3578L1159L7826M9155K6471J7431
12009I00466P101J302J0369K5805J3990K7085M9358N4824N4779N5180N7738L2569
11997A290566j0600l8849n9815r1391j27034j16696j15873r4760r0950o4294m8689
$$ plain form
11986 431615 386518 356773 345815 347806 372626 406224 449590 501771 537516 550821 563717 574283
11974 574283 578539 570162 535670 484254 422430 351621 292164 228737 188679 161662 155349 143897
11962 143897 130691 120879 119246 114692 99601 79549 79725 78980 50785 24287 14991 29002 31439
11949 31439 58195 59429 69261 85024 97743 107120 100950 101641 94472 83549 89992 100827 104569
11936 104569 109901 101028 99601 103907 99043 98406 110954 124539 127418 121639 115345 108567 109153 118820
11922 118820 126248 131539 125856 137445 163721 181114 206729 212813 202068 207283 218141 230290
11910 230290 230491 227327 208400 190776 177063 161431 157877 145025 134811 110052 91166 88836
11898 88836 86205 75061 52493 41156 31984 27221 20975 6130 16126 25604 23009 27726 37501
$$ packed form
11986D31615m5097k9745j0958J991K4820L3598M3366N2181L5745J3305J2896J0566
11974E74283M256q377l4492n1416o1824p0809n9457o3427m0058k7017o313j1452
11962A43897j3206r812j633m554j5091k0052J76p45k8195k6498r296J4011K437
11949C1439K6756J234R832J5763J2719R377o170O91p169j0923O443J0835L742
11936A04569N332q873j427M306m864o37J2548J3585K879n779o294o778N86R667
11922A18820P428N291n683J1589K6276J7393K5615O084j0745N215J0858J2149
11910B30290K01l164j8927j7624j3713j5632l554j2852j0214k4759j8886k330
11898H8836k631j1144k2568j1337r172m763o246j4845R996R478k595M717R775
$$ plain form
11885 37501 14122 -2199 996 -16167 -39255 -20818 -2511 -9531 -4859 292 6391 21123 26432
11872 26432 28717 38675 53683 58152 60745 53344 52908 62839 55728 57433 54787 35922 21096 10385
11858 10385 14533 20409 21816 11505 7542 11667 19677 11621 -3227 -4547 7047 17457 17645 14690
11844 14690 23525 19925 23636 30141 21998 35722 44435 20733 9263 12152 12589 -8973 -18076 -20347
11830 -20347 -12910 -17368 -29509 -35289 -38415 -32156 -30572 -23843 -16632 -29802 -23990 -6706 4031
11817 4031 -12481 -37359 -33568 -28361 -26415 -20485 -7343 -8680 -24698 -23979 -19266 -22185 -11243 -2024
11803 -2024 -6591 -13951 -15035 -32342 -42371 -37622 -42875 -48743 -40548 -33361 -36668 -31075 -28078 -29207
11789 -29207 -40904 -42679 -46213 -35635 -20092 -24106 -25365 -9507 -8572 -20906 -32330 -33529 -34015
$$ packed form
11885C7501k3379j6321L195j7163k3088J8437J8307p020M672N151O099J4732N309
11872B6432K285R958J5008M469K593p401m36R931p111J705k646j8865j4826j0711
11858A0385M148N876J407j0311l963M125Q010q056j4848j320J1594J0410J88k955
11844A4690Q835l600L711O505q143J3724Q713k3702j1470K889M37k1562r103k271
11830b0347P437m458j2141n780l126O259J584O729P211j3170N812J7284J0737
11817D031j6512k4878L791N207J946N930J3142j337j6018P19M713k919J0942R219
11803b024m567p360j084j7307j0029M749n253n868Q195P187l307N593K997j129
11789b9207j1697j775l534J0578J5543m014j259J5858R35j2334j1424j199m86
$$ plain form
11776 -34015 -32270 -30261 -35568 -39448 -29372 -12583 -12757 -25904 -27647 -15402 -8485 -11591 -25257
11763 -25257 -19779 -16069 -7478 -9727 -10758 -7059 -156 -876 -10646 1368 4838 3589 115 13201
11749 13201 21625 21665 9636 429 21168 22170 15528 42536 74086 93626 122319 139438 164719
11736 164719 194170 239142 260725 297335 325303 355394 386267 381591 372001 344293 324587 288521
11724 288521 250343 210723 179718 168778 164153 164184 167001 178613 178236 166564 182667 202202 227190
11711 227190 246305 259916 280359 288642 297061 313195 318432 336374 362961 381981 396901 411954
11699 411954 426453 432800 434939 429451 409232 377288 356649 333559 312668 288052 263948 234962
11687 234962 211608 207347 185320 181419 181211 172977 155960 146166 119867 112706 115088 125323 140628
$$ packed form
11776c4015J745K009n307l880J0076J6789j74j3147j743J2245O917l106j3666
11763b5257N478L710Q591k249j031L699O903p20r770J2014L470j249l474J3086
11749A3201Q424M0j2029r207K0739J002o642K7008L1550J9540K8693J7119K5281
11736A64719K9451M4972K1583L6610K7968L0091L0873m676r590k7708j9706l6066
11724B88521l8178l9620l1005j0940m625L1K817J1612l77j1672J6103J9535K4988
11711B27190J9115J3611K0443Q283Q419J6134N237J7942K6587J9020J4920J5053
11699D11954J4499O347K139n488k0219l1944k0639k3090k0891k4616k4104k8986
11687B34962k3354m261k2027l901k08q234j7017r794k6299p161K382J0235J5305
$$ plain form
11674 140628 164220 192652 223790 247812 257426 278834 308482 318151 316579 299134 251575 214575
11662 214575 182212 142031 93144 45488 32328 38218 37669 21075 5982 11501 19997 3113
11650 3113 -2663 -13577 -23760 -36151 -37410 -38553 -38056 -23540 -18206 -15792 -13209 -16903 -23426 -26229
11636 -26229 -31066 -38663 -42464 -35321 -17173 -9242 -7399 -12686 -19241 -17255 -19689 -34127 -29279 -21244
11622 -21244 -16567 -7545 -16135 -30108 -43548 -52763 -58506 -48802 -49457 -42260 -38043 -42123 -37598 -35769
11608 -35769 -35092 -36642 -36654 -38633 -40773 -47727 -40727 -32959 -35784 -31344 -35094 -54233 -57041 -47940 -57681
11593 -57681 -58864 -59868 -64246 -66080 -56627 -66906 -58232 -43455 -49117 -55075 -72205 -72743 -63699 -59129
11579 -59129 -56843 -45539 -47148 -48621 -46183 -52713 -44162 -40756 -41869 -29614 -42197 -37414 -39917 -36990
$$ packed form
11674A40628K3592K8432L1138K4022R614K1408K9648R669j572j7445m7559l7000
11662B14575l2363m0181m8887m7656j3160N890n49j6594j5093N519Q496j6884
11650C113n776j0914j0183j2391j259j143M97J4516N334K414K583l694o523k803
11636b6229m837p597l801P143J8148P931J843n287o555J986k434j4438M848Q035
11622b1244M677R022q590j3973j3440r215n743R704o55P197M217m080M525J829
11608c5769O77j550j2j979k140o954P000P768k825M440l750j9139k808R101r741
11593e7681j183j004m378j834R453j0279Q674J4777n662n958j7130n38R044M570
11579e9129K286J1304j609j473K438o530Q551L406j113J2255j2583M783k503K927
$$ plain form
11565 -36990 -37352 -44479 -42000 -45863 -50954 -42766 -34082 -39366 -46774 -52185 -51927 -47555 -43875 -29723 -31386
11550 -31386 -28087 -14201 -13670 -37027 -48507 -31101 -43677 -58353 -70157 -57987 -45263 -29440
11538 -29440 -35094 -44617 -43615 -45244 -48835 -41418 -44453 -58327 -62136 -68457 -66057 -48937 -44216 -50260
11524 -50260 -42749 -40180 -47423 -52643 -59713 -52072 -40536 -31759 -42741 -49302 -51185 -52489 -44802 -50723
11510 -50723 -52369 -51667 -49694 -39187 -46841 -57213 -49132 -30227 -35534 -42419 -53803 -52300 -45415 -48461
11496 -48461 -46824 -50577 -48765 -51891 -46500 -26393 -27918 -36609 -45076 -55295 -42720 -36031 -39368 -46688
11482 -46688 -39303 -36472 -47804 -54296 -49932 -38261 -34504 -39122 -52331 -67015 -74758 -65657 -46474
11469 -46474 -34609 -40885 -50277 -50409 -47703 -49315 -50368 -44732 -51762 -49441 -36919 -42967 -43829 -35112
$$ packed form
11565c6990l62p127K479l863n091Q188Q684n284p408n411K58M372L680J4152j663
11550c1386L299J3886N31k3357j1480J7406j2576j4676j1804J2170J2724J5823
11538b9440n654r523J002j629l591P417l035j3874l809o321K400J7120M721o044
11524e0260P511K569p243n220p070P641J1536Q777j0982o561j883j304P687n921
11510e0723j646P02J973J0507p654j0372Q081J8905n307o885j1384J503O885l046
11496d8461J637l753J812l126N391K0107j525q691q467j0219J2575O689l337p320
11482d6688P385K831j1332o492M364J1671L757m618j3209j4684p743R101J9183
11469d6474J1865o276r392j32K706j612j053N636p030K321J2522o048q62Q717
$$ plain form
11455 -35112 -31594 -37350 -39911 -42547 -50595 -56237 -39782 -32810 -28811 -28192 -28557 -38290 -44829 -47917 -52399
11440 -52399 -52884 -42634 -27226 -12726 -13102 -13687 -25497 -33041 -35750 -23220 -8427 -13676 -13548 -21883
11426 -21883 -25017 -21671 -27850 -30154 -22409 -11270 -7809 -9040 -1833 -14905 -26945 -32150 -48965
11413 -48965 -58326 -46075 -46039 -34216 -18014 -12960 -11398 -3089 -2272 -10277 -16193 -13696 -24173 -29156
11399 -29156 -36565 -29577 -13560 -18518 -19724 -25051 -17736 -16869 6462 17025 5708 -3192 -6905 -4983
11385 -4983 -1323 12967 9918 19907 26921 19619 33248 60037 58224 66050 79970 84199 106927
11372 106927 142137 157014 170862 197450 228800 264834 312422 353960 387456 418694 432966
11361 432966 441738 421878 380249 316714 249610 185512 130404 98483 80219 73106 59153 48555
$$ packed form
11455c5112L518n756k561k636q048n642J6455O972L999O19l65r733o539l088m482
11440e2399m85J0250J5408J4500l76n85j1810p544k709J2530J4793n249J28q335
11426b1883l134L346o179k304P745J1139L461j231P207j3072j2040n205j6815
11413d8965r361J2251L6J1823J6202N054J562Q309Q17q005n916K497j0477m983
11399b9156p409O988J6017m958j206n327P315Q67K3331J0563j1317q900l713J922
11385d983L660J4290l049R989P014p302J3629K6789j813P826J3920M229K2728
11372A06927L5210J4877J3848K6588L1350L6034M7588M1538L3496L1238J4272
11361D32966Q772j9860m1629o3535o7104o4098n5108l1921j8264p113j3953j0598
$$ plain form
11349 48555 38039 27489 26130 24039 15322 -2384 -16294 -18347 -5558 -10116 -10570 -6297 -6604 -6994
11335 -6994 -13003 -20564 -19325 -11377 -24053 -14680 -7372 -26431 -26280 -18139 -18654 -12702 -13093 -19931 -20667
11320 -20667 -19276 -17958 -18571 -14835 -18034 -3495 -11114 -16042 -1306 10577 6291 -12092 -16991 -18190
11306 -18190 -19529 -19425 -20243 -20730 -8785 -7340 -8505 2432 8349 5355 -1988 -19301 -30860 -21179
11292 -21179 -19277 -35366 -36535 -31063 -21433 -22052 -29905 -22937 -31962 -41521 -30119 -10397 -11391 -13333
11278 -13333 -15390 -15993 -22981 -38354 -41238 -28404 -36880 -43628 -21504 -11095 -22416 -34816 -18315
11265 -18315 -428 -18992 -37742 -31422 -16700 -2336 -5525 -19134 -38567 -51821 -43794 -31441
11253 -31441 -18939 -13845 -14996 -9521 -1262 -2912 -1844 -14259 -34175 -30295 -23385 -27494 -28763 -24457
$$ packed form
11349D8555j0516j0550j359k091q717j7706j3910k053J2789m558m54M273l07l90
11335f994o009p561J239P948j2676R373P308j9059J51Q141n15N952l91o838p36
11320b0667J391J318o13L736l199J4539p619m928J4736J1883m286j8383m899j199
11306a8190j339J04q18m87J1945J445j165J0937N917k994p343j7313j1559R681
11292b1179J902j6089j169N472R630o19p853O968r025r559J1402J9722r94j942
11278a3333k057o03o988j5373k884J2834q476o748K2124J0409j1321j2400J6501
11265a8315J7887j8564j8750O320J4722J4364l189j3609j9433j3254Q027J2353
11253c1441J2502N094j151N475Q259j650J068j2415j9916L880O910m109j269M306
$$ plain form
11239 -24457 -15304 -12169 -13152 -18742 -25108 -29166 -21313 -19556 -25221 -28264 -18964 -16364 -5874 -5171 -10885
11224 -10885 -25673 -25156 -15221 -8633 -15591 -17167 -14298 -8311 874 3290 196 1128 9100 5835 -15770
11209 -15770 -36668 -34371 -20711 -20059 -16470 -20691 -16649 -5156 -6854 -23961 -33945 -31060 -39056 -37819
11195 -37819 -36467 -35781 -22324 -9969 -18309 -13042 1586 2682 -5602 3528 -6277 -20306 -16274 -11042
11181 -11042 -27841 -36924 -33005 -31739 -18028 7316 16940 1014 -8996 5443 5919 -3066 4396
11168 4396 4506 3090 -8728 -30531 -27102 -15764 -18611 -11157 -6391 -8099 9531 14224 6726 6042
11154 6042 11851 14687 23905 27947 33652 33403 27117 31399 23125 18213 24532 28051 33056 42256 52278
11139 52278 52199 53382 63490 73483 72520 60090 54151 50633 51635 45053 30033 10362 9938 17707
$$ packed form
11239b4457R153L135r83n590o366m058P853J757n665l043R300K600J0490P03n714
11224a0885j4788N17R935O588o958j576K869N987R185K416l094R32P972l265k1605
11209a5770k0898K297J3660O52L589m221M042J1493j698j7107r984K885p996J237
11195c7819J352O86J3457J2355q340N267J4628J096q284R130r805j4029M032N232
11181a1042j6799r083L919J266J3711K5344R624j5926j0010J4439M76q985P462
11168D396J10j416j1818k1803L429J1338k847P454M766j708J7630M693p498o84
11154F042N809K836R218M042N705k49o286M282q274m912O319L519N005R200J0022
11139E2278p9J183J0108R993r63j2430n939l518J002o582j5020j9671m24P769
$$ plain form
11125 17707 15772 8273 14552 25318 20377 11425 3398 -8455 -7101 -6072 -4248 2382 10059 20656
11111 20656 11039 4257 19999 23902 6282 -740 12254 14955 9252 1584 8253 3158 3123 10700
11097 10700 17362 23337 22452 21457 9576 5242 14954 12112 6017 11869 8724 14310 16559 6235
11083 6235 -16186 -15413 34 -840 5511 10754 10707 2964 -6639 -8058 10464 18700 8804 -2790 -1750
11068 -1750 -6030 -4416 -1737 4431 -12491 -16657 -17240 -17669 -11252 -6640 -709 4958 2840 2995 -1092
11053 -1092 -6189 -13101 -18140 -18273 -21459 -4040 9366 14005 16515 9965 4778 8560 -3658 -23090
11039 -23090 -23357 -14509 -2670 7124 -3220 -11089 4160 18830 14937 19819 21603 22287 21065 23743
11025 23743 11789 1601 10360 15425 26531 36696 33345 21526 22272 18331 30995 33920 33287
$$ packed form
11125A7707j935p499O279J0766m941q952q027j1853J354J029J824O630P677J0597
11111B0656r617o782J5742L903j7620p022J2994K701n703p668O669n095l5P577
11097A0700O662N975q85r95j1881m334R712k842o095N852l145N586K249j0324
11083F235k2421P73J5447q74O351N243m7p743r603j419J8522Q236r896j1594J040
11068a750m280J614K679O168j6922m166n83m29O417M612N931N667k118J55m087
11053a092n097o912n039j33l186J7419J3406M639K510o550n187L782j2218j9432
11039b3090k67Q848J1839R794j0344p869J5249J4670l893M882J784O84j222K678
11025B3743j1954j0188Q759N065J1106J0165l351j1819P46l941J2664K925o33
$$ plain form
11012 33287 38337 42831 47437 45626 30986 24480 26329 26554 24546 18806 26573 41998 52489 45640
10998 45640 41129 45242 31196 17168 12452 20432 31887 24337 22160 26949 27340 24589 20550 27407
10984 27407 20779 25495 35421 35124 26933 25016 28037 23608 19961 15985 -306 -3794 14176 39535
10970 39535 36796 45669 55097 43869 28189 18330 24301 33157 28465 31333 31961 26059 14854 -8349
10956 -8349 -4962 11581 22394 26296 16508 18322 38678 45746 42637 37548 25712 24484 30330 37045
10942 37045 44357 51842 58965 55912 52271 48702 60124 79118 93017 97213 98222 105728 117081
10929 117081 126237 126099 118885 116607 100048 93812 103015 111482 109280 104504 118297 125482 122155 127324
10915 127324 130715 138961 148148 170125 184107 170318 181580 209393 221224 207064 209309 230538
$$ packed form
11012C3287N050M494M606j811j4640o506J849K25k008n740P767J5425J0491o849
10998D5640m511M113j4046j4028m716P980J1455p550k177M789L91k751m039O857
10984B7407o628M716R926k97q191j917L021m429l647l976j6291l488J7970K5359
10970C9535k739Q873R428j1228j5680r859N971Q856m692K868O28n902j1205k3203
10956h349L387J6543J0813L902r788J814K0356P068l109n089j1836j228N846O715
10942C7045P312P485P123l053l641l569J1422J8994J3899M196J009P506J1353
10929A17081R156j38p214k278j6559o236R203Q467k202m776J3793P185l327N169
10915A27324L391Q246R187K1977J3982j3789J1262K7813J1831j4160K245K1229
$$ plain form
10903 230538 253513 260545 283888 300953 327038 360007 424817 512139 626758 755677 883887
10892 883887 1001382 1123934 1246736 1369175 1472274 1502303 1398496 1133819 825683 589595
10882 589595 443130 348576 283076 244911 220583 194022 162720 150043 140479 123387 98454
10871 98454 84951 85381 83402 78059 60941 55524 55065 51802 46550 42250 40814 35633 47429 45950
10857 45950 39528 37917 46633 43447 44682 55084 55625 47988 52134 57183 65924 67137 63295 67584
10843 67584 64616 62560 54354 46947 41424 51294 55697 56270 40078 34187 23808 34255 67751 69186
10829 69186 56702 52667 46666 45191 43955 49949 57730 65641 63942 55662 47955 56490 52521 57967
10815 57967 75806 69156 59105 58613 51356 45988 45366 62056 68692 61305 55721 49926 45098 46570
$$ packed form
10903B30538K2975P032K3343J7065K6085L2969O4810Q7322J14619J28919J28210
10892H83887J17495J22552J22802J22439J03099L0029j03807k64677l08136k36088
10882E89595j46465r4554o5500l8165k4328k6561l1302j2677r564j7092k4933
10871I8454j3503M30j979n343j7118n417m59l263n252m300j436n181J1796j479
10857D5950o422j611Q716l186J235J0402N41p637M146N049Q741J213l842M289
10843F7584k968k056q206p407n523R870M403N73j6192n891j0379J0447L3496J435
10829F9186j2484m035o001j475j236N994P781P911j699q280p707Q535l969N446
10815E7967J7839o650j0051m92p257n368o22J6690O636p387n584n795m828J472
$$ plain form
10801 46570 48542 40815 44493 41436 45321 35464 34025 28316 21426 28265 38485 39358 37506 40328
10787 40328 32926 31648 42487 42681 42875 47398 55358 57234 46948 48309 70620 90804 90481 99646
10773 99646 88497 96750 100407 101316 106103 117151 111959 99758 113504 110772 100375 111561 94917
10760 94917 82965 76975 81893 80244 85238 90064 90049 100730 111768 118772 132279 118360 123023 132860
10746 132860 124219 124146 125595 137946 152512 145132 127094 127083 136967 143428 148844 158201 169553 168535
10732 168535 176455 198061 217797 240399 250675 256922 248213 248058 269243 302146 310853 293052 257684
10719 257684 216124 171992 139073 121624 120997 119112 109019 114865 108923 116694 124849 131261 141605
10706 141605 137263 127694 136038 140337 131000 108446 109023 112745 110193 108414 114736 104296 102065 120918
$$ packed form
10801D6570J972p727L678l057L885r857j439n709o890O839J0220Q73j852K822
10787D0328p402j278J0839J94J94M523P960J876j0286J361K2311K0184l23R165
10773I9646j1149Q253L657R09M787J1048n192j2201J3746k732j0397J1186j6644
10760I4917j1952n990M918j649M994M826j5J0681J1038P004J3507j3919M663R837
10746A32860q641p3J449J2351J4566p380j8038j1R884O461N416R357J1352j018
10732A68535P920K1606J9736K2602J0276O247q709j55K1185L2903Q707j7801l5368
10719B57684m1560m4132l2919j7449o27j885j0093N846n942P771Q155O412J0344
10706A41605m342r569Q344M299r337k2554N77L722k552j779O322j0440k231J8853
$$ plain form
10692 120918 131079 133574 129783 132074 125825 128437 126042 125087 123606 110729 122230 136475 140876
10679 140876 145733 156901 147117 149812 166083 153160 138781 123862 122866 130507 127960 123768 134893
10666 134893 161358 171984 176334 183740 197429 193021 179494 192637 234777 264788 272473 268934
10654 268934 252331 241015 230807 236511 249620 246928 247446 250921 249293 249358 252584 243813 247474 231484
10640 231484 220739 231095 236937 216354 212064 202699 192106 194727 204061 207203 219996 248599 272701
10627 272701 307048 338463 354273 409137 494333 600381 669216 687964 681534 654545 629309
10616 629309 616444 596718 569920 552440 532435 520978 499881 491129 488698 485405 480627 477912
10604 477912 462364 440323 429398 435623 459630 490956 494776 512579 533779 523514 466222 437101
$$ packed form
10692A20918J0161K495l791K291o249K612k395r55j481j2877J1501J4245M401
10679A40876M857J1168r784K695J6271j2923j4379j4919r96P641k547m192J1125
10666A34893K6465J0626M350P406J3689m408j3527J3143M2140L0011P685l539
10654B68934j6603j1316j0208N704J3109k692N18L475j628O5L226q771L661j5990
10640B31484j0745J0356N842k0583m290r365j0593K621R334L142J2793K8603K4102
10627B72701L4347L1415J5810N4864Q5196J06048O8835J8748o430k6989k5236
10616F29309j2865j9726k6798j7480k0005j1457k1097q752k431l293m778k715
10604D77912j5548k2041j0925O225K4007L1326L820J7803K1200j0265n7292k9121
$$ plain form
10592 437101 452277 489617 522145 534926 536495 556904 573106 583165 599078 609790 603258 597749
10580 597749 599763 613963 640127 648609 642747 638919 639568 641526 647891 658050 671342 682396 695538
10567 695538 699782 720855 750922 770009 778185 803918 841285 875004 894955 940222 982748 1039274
10555 1039274 1083197 1113409 1153838 1184313 1214908 1234072 1269826 1310307 1339422 1370421 1420800
10544 1420800 1473748 1511671 1569681 1643422 1720853 1817976 1906171 1978534 2048530 2121781 2218293
10533 2218293 2330461 2434767 2535396 2644422 2764356 2899721 3053171 3195373 3359688
10524 3359688 3551163 3752760 3972373 4208663 4428704 4656376 4903446 5163664 5457385
10515 5457385 5778463 6121449 6494812 6879025 7266634 7652529 8078880 8538215 9027219
$$ packed form
10592D37101J5176L7340L2528J2781J569K0409J6202J0059J5913J0712o532n509
10580E97749K014J4200K6164Q482n862l828O49J958O365J0159J3292J1054J3142
10567F95538M244K1073L0067J9087Q176K5733L7367L3719J9951M5267M2526N6526
10555A039274M3923L0212M0429L0475L0595J9164L5754M0481K9115L0999N0379
10544A420800N2948L7923N8010P3741P7431R7123Q8195P2363O9996P3251R6512
10533B218293J12168J04306J00629J09026J19934J35365J53450J42202J64315
10524C359688J91475K01597K19613K36290K20041K27672K47070K60218K93721
10515E457385L21078L42986L73363L84213L87609L85895M26351M59335M89004
$$ plain form
10506 9027219 9517617 10010677 10528328 11063550 11675681 12343156 13045292 13809566 14661546
10497 14661546 15584788 16584632 17660407 18845699 20180107 21588025 23014910 24438130
10489 24438130 25868757 27295888 28787134 30398147 32168968 34143594 36464007 39450270
10481 39450270 43545270 49231580 57220481 68548737 84395855 105401218 130334633
10474 130334633 155673717 177942726 197455961 217986218 242162964 266840163 280568701
10467 280568701 266108541 217836877 157280298 108213142 75680422 55045230 41665644
10460 41665644 32714318 26561263 22203971 18976942 16482856 14542936 13002697 11726761
10452 11726761 10653595 9751083 8951446 8185025 7393950 6635139 6018549 5572918 5267353
$$ packed form
10506I027219M90398M93060N17651N35222O12131O67475P02136P64274Q51980
10497A4661546R23242R99844J075775J185292J334408J407918J426885J423220
10489B4438130J430627J427131J491246J611013J770821J974626K320413K986263
10481C9450270M095000N686310P988901J1328256J5847118K1005363K4933415
10474A30334633K5339084K2269009J9513235K0530257K4176746K4677199J3728538
10467B80568701j4460160m8271664o0556579m9067156l2532720k0635192j3379586
10460D1665644q951326o153055m357292l227029k494086j939920j540239j275936
10452A1726761j073166r02512p99637p66421p91075p58811o16590m45631l05565
$$ plain form
10443 5267353 5056090 4874218 4700907 4532001 4385285 4253095 4129869 4020499 3872973
10434 3872973 3653010 3366916 3050127 2714362 2378850 2056922 1795077 1600480 1454985
10425 1454985 1324991 1209567 1107223 1035032 972894 910312 847295 761730 682876 604948 554578
10414 554578 517829 506183 519038 517279 500802 495465 476498 447128 413709 395532 366211 341255
10402 341255 338536 343177 339664 330114 326447 314620 318229 305573 287556 260649 239721 225245 201117
10389 201117 190833 172976 170816 163638 161128 166562 155420 146651 155579 171432 177724 175796 184913
10376 184913 190071 179324 164561 171497 157138 147822 161763 148218 120207 101620 100890 92709 74617
10363 74617 60488 51764 53021 25888 11646 4006 3615 3571 5290 7977 1024 243 14754 35367
$$ packed form
10443E267353k11263j81872j73311j68906j46716j32190j23226j09370j47526
10434C872973k19963k86094l16789l35765l35512l21928k61845j94597j45495
10425A454985j29994j15424j02344p2191o2138o2582o3017q5565p8854p7928n0370
10414E54578l6749j1646J2855j759j6477n337j8967k9370l3419j8177k9321k4956
10402C41255k719M641l513r550l667j1827L609j2656j8017k6907k0928j4476k4128
10389B01117j0284j7857k160p178k510N434j1142q769Q928J5853O292j928R117
10376A84913N158j0747j4763O936j4359r316J3941j3545k8011j8587p30q181j8092
10363G4617j4129q724J257k7133j4242p640l91m4J719K687o953p81J4511K0613
$$ plain form
10349 35367 58992 77898 94908 110477 107840 94745 89531 89422 83851 70712 50635 23749 7590
10336 7590 6252 5579 -5546 -18541 -36163 -63036 -94095 -101340 -104302 -103512 -108235 -117834 -131135 -151526
10322 -151526 -166566 -168404 -180620 -199420 -207744 -181157 -146770 -105028 -76102 -37148 38887 122915
10310 122915 175309 184971 179222 160697 136061 102030 91641 93100 91960 82945 72762 51841
10298 51841 32446 39422 32847 27608 44200 31669 21569 12136 13895 19110 29723 31474 26182
10285 26182 25871 35204 46837 37187 39325 41931 40235 48660 46024 50368 45708 43590 39813 48495
10271 48495 55422 35173 26503 32758 52092 46521 27681 29219 25202 19548 22322 21368 23982 12298
10257 12298 9014 14308 18617 11030 4965 -4520 -1582 -1614 -17999 -16383 -22163 -14964 -9283 -2696 -15439
$$ packed form
10349C5367K3625J8906J7010J5569k637j3095n214j09n571j3139k0077k6886j6159
10336G590j338o73j1125j2995j7622k6873l1059p245k962P90m723r599j3301k0391
10322a51526j5040j838j2216j8800q324K6587L4387M1742K8926L8954P6035Q4028
10310A22915N2394R662n749j8525k4636l4031j0389J459j140r015j0183k0921
10298E1841j9395O976o575n239J6592j2531j0100r433J759N215J0613J751n292
10285B6182l11R333J1633r650K138K606j696Q425k636M344m660k118l777Q682
10271D8495O927k0249q670O255J9334n571j8840J538m017n654K774r54K614j1684
10257A2298l284N294M309p587o065r485K938l2j6385J616n780P199N681O587j2743
$$ plain form
10242 -15439 -39658 -36138 -33405 -30986 -26873 -34371 -31913 -27157 -16129 -11644 -10568 -14369 -22144 -14206
10228 -14206 -12119 -24674 -40485 -33228 -31399 -20670 -14205 -5436 -8642 -19258 -14148 -5925 3505
10215 3505 8613 11107 8125 5660 -9124 -13227 -1141 9785 5304 1580 -4842 -11852 -9199 -7722
10201 -7722 -16265 -24616 -23292 -9515 4464 16919 12786 6516 17791 19006 27229 29587 23245 26476
10187 26476 26642 43277 52717 46873 44951 55703 41234 26904 37987 46535 54957 51543 48417
10174 48417 60361 67341 61100 62363 59219 69366 75002 84691 107314 126766 130081 136431 144678
10161 144678 168559 183754 195986 211522 224479 240552 244539 253732 279304 304212 327718 344166
10149 344166 373309 413897 443870 485107 561372 658599 760183 879122 1026218 1181737 1321086
$$ packed form
10242a5439k4219L520K733K419M113p498K458M756J1028M485J076l801p775P938
10228a4206K087j2555j5811P257J829J0729O465Q769l206j0616N110Q223R430
10215C505N108K494k982k465j4784m103J2086J0926m481l724o422p010K653J477
10201g722q543q351J324J3777J3979J2455m133o270J1275J215Q223K358o342L231
10187B6476J66J6635R440n844j922J0752j4469j4330J1083Q548Q422l414l126
10174D8417J1944O980o241J263l144J0147N636R689K2623J9452L315O350Q247
10161A44678K3881J5195J2232J5536J2957J6073L987R193K5572K4908K3506J6448
10149C44166K9143M0588K9973M1237P6265R7227J01584J18939J47096J55519J39349
$$ plain form
10138 1321086 1444857 1587819 1686730 1732980 1725431 1619798 1439553 1253952 1085853 954744
10128 954744 837996 692267 536233 406223 313435 245041 193157 158584 127682 106436 90376
10117 90376 83228 65460 47431 51210 51749 38906 37515 32771 21497 25689 30467 46840 47579 42947
10103 42947 33148 18060 15743 11059 12391 16989 25184 34561 31599 20562 23449 40908 35204 38450
10089 38450 42854 47409 51133 53186 57886 62328 58097 52972 52739 62235 59996 48972 37313 38829
10075 38829 42741 39445 35566 50654 55946 63917 78761 97571 99196 91780 86201 105631 111299
10062 111299 123231 141511 144178 154340 163132 176895 196886 216293 247284 299709 373146 469315
10050 469315 581078 699133 829836 949942 1052649 1175505 1301119 1408200 1415780 1275163
$$ packed form
10138A321086J23771J42962R8911M6250p549j05633j80245j85601j68099j31109
10128I54744j16748j45729j56034j30010r2788o8394n1884l4573l0902k1246j6060
10117I0376p148j7768j8029L779N39j2843j391m744j1274M192M778J6373P39m632
10103D2947r799j5088k317m684J332M598Q195R377k962j1037K887J7459n704L246
10089C8450M404M555L724K053M700M442m231n125k33R496k239j1024j1659J516
10075C8829L912l296l879J5088N292P971J4844J8810J625p416n579J9430N668
10062A11299J1932J8280K667J0162Q792J3763J9991J9407L0991N2425P3437R6169
10050D69315J11763J18055J30703J20106J02707J22856J25614J07081P580j40617
$$ plain form
10040 1275163 1019113 742260 529997 401431 294799 218129 177638 143406 125142 109609
10030 109609 93787 68455 48361 53959 55229 51615 37679 20192 30547 39221 43802 58605
10018 58605 60830 53278 49005 42905 34753 30593 23381 32222 17803 11564 17424 26874 31560 35194
10004 35194 38723 38132 31586 24518 16070 7832 20882 44370 70011 97234 111118 115759 135823
9991 135823 160699 171992 179674 199945 229309 251563 264854 252224 225741 193529 155300 113318
9979 113318 98669 88245 66976 66057 67942 59310 43894 47780 36264 22444 12138 5794 -3566
9966 -3566 -3255 -6343 -6608 -2946 -9129 -4409 4041 6874 880 5085 -8592 -10325 -14257 -25704 -27968
9951 -27968 -31641 -26413 -23514 -29866 -26481 -23065 -28735 -37940 -29988 -22802 -20262 -14532 -15203 -28398 -16212
$$ packed form
10040A275163k56050k76853k12263j28566j06632p6670m0491l4232j8264j5533
10030A09609j5822k5332k0094N598J270l614j3936j7487J0355Q674M581J4803
10018E8605K225p552m273o100q152m160p212Q841j4419o239N860R450M686L634
10004C5194L529n91o546p068q448q238J3050K3488K5641K7223J3884M641K0064
9991A35823K4876J1293P682K0271K9364K2254J3291j2630k6483l2212l8229m1982
9979A13318j4649j0424k1269r19J885q632j5416L886j1516j3820j0306o344r360
9966c566L11l088k65L662o183M720Q450K833n994M205j3677j733l932j1447k264
9951b7968l673N228K899o352L385L416n670r205P952P186K540N730o71j3195J2186
$$ plain form
9936 -16212 -18049 -32404 -18932 -3189 1678 -909 -14285 -10876 -16288 -31549 -35770 -19851 122
9923 122 -336 -14017 -10172 -11686 -19926 -5985 -5194 -2578 -7763 -6133 -7454 -6464 -3750 -10725 -21940
9908 -21940 -14865 -8840 -11181 -1471 10227 11093 -3550 -10780 469 4525 -591 7140 525 -6762
9894 -6762 2573 10489 14787 13212 20919 9196 3676 11402 11770 14032 17162 9734 6795 12304 5138
9879 5138 -3040 -14112 -23348 -8532 5570 9630 6531 5730 -1856 -5724 -8094 5884 16119 28812
9865 28812 26620 18074 16020 14075 19158 9880 9584 12168 18147 30753 31419 20521 12676 6558 4051
9850 4051 23230 32400 29983 15297 16064 28550 32953 33604 30908 29683 29079 21863 10068 383 -4937
9835 -4937 -12107 -13845 -7067 -960 5424 9836 1106 -2255 2894 9409 16805 13168 22457 33619 23439
$$ packed form
9936a6212j837j4355J3472J5743M867k587j3376L409n412j5261m221J5919J9973
9923A22m58j3681L845j514q240J3941P91K616n185J630j321R90K714o975j1215
9908b1940P075O025k341R710J1698Q66j4643p230J1249M056n116P731o615p287
9894f762R335P916M298j575P707j1723n520P726L68K262L130p428k939N509p166
9879E138q178j1072r236J4816J4102M060l099q01p586l868k370J3978J0235J2693
9865B8812k192q546k054j945N083r278k96K584N979J2606O66j0898p845o118k507
9850D051J9179R170k417j4686P67J2486M403O51k696j225o04p216j1795r685n320
9835d937p170j738O778O107O384M412q730l361N149O515P396l637R289J1162j0180
$$ plain form
9820 23439 17761 25921 25861 22793 8952 277 -485 5681 9571 3804 9279 -3713 -9551 -3457 16214
9805 16214 7574 5289 -2258 -15390 -14082 -7052 3057 29892 48524 56025 48682 22821 -5082
9792 -5082 -5045 13675 22714 18820 17198 21344 40069 48685 43680 39701 36578 31845 24798 11443 13088
9777 13088 6745 887 6870 15539 19913 23602 27873 17424 11652 11336 20862 33966 25955 22053
9763 22053 27555 23482 27564 27417 32672 17990 11696 -8644 -12387 -9577 18926 29304 18842 9703
9749 9703 8936 12936 12993 20188 10941 -2453 11247 23709 26798 30565 21139 20467 27803 27120 21904
9734 21904 23034 24258 28112 25180 35026 42521 50244 50816 56003 48805 46832 35816 27658 29370 28052
9719 28052 18653 27388 38517 25427 10960 7682 23830 22670 23614 31736 31386 27815 28917 28989 24927
$$ packed form
9820B3439n678Q160o0l068j3841q675p62O166L890n767N475j2992n838O094J9671
9805A6214q640k285p547j3132J308P030J0109K6835J8632P501p343k5861k7903
9792e082L7J8720R039l894j622M146J8725Q616n005l979l123m733p047j3355J645
9777A3088o343n858N983Q669M374L689M271j0449n772l16R526J3104q011l902
9763B2053N502m073M082j47N255j4682o294k0340l743K810K8503J0378j0462r139
9749I703p67M000N7P195r247j3394J3700J2462L089L767r426o72P336o83n216
9734B1904J130J224L854k932R846P495P723N72N187p198j973j1016q158J712j318
9719B8052r399Q735J1129j3090j4467l278J6148j160R44Q122l50l571J102P2m062
$$ plain form
9704 24927 31498 39673 40516 27426 30773 36619 33307 39080 38454 29841 20806 23008 23519 20613 23893
9689 23893 15777 10204 2154 14689 22679 25845 19793 23333 31005 36384 52126 50635 46143 36556
9675 36556 26315 19769 10456 11828 14487 13798 18036 24456 26870 24668 33748 32692 19427 20963
9661 20963 15583 1257 13365 16331 18922 13580 1040 4279 10819 14161 23573 21666 31744 26649
9647 26649 15093 4132 6377 17775 22989 28883 26721 22814 24458 29515 38012 33632 33255 38426
9633 38426 39277 28083 21838 21878 39816 31146 24092 31476 42520 29343 28748 28940 19739 16717 16995
9618 16995 31331 43349 48859 45495 40317 29377 38468 46729 49296 50288 48501 49483 37387 22734
9604 22734 24015 14527 21151 33062 32620 24418 27218 46538 58540 51799 36280 33467 33060 35567
$$ packed form
9704B4927O571Q175Q43j3090L347N846l312N773o26q613r035K202N11k906L280
9689B3893q116n573q050J2535P990L166o052L540P672N379J5742j491m492r587
9675C6556j0241o546r313J372K659o89M238O420K414k202R080j056j3265J536
9661B0963n380j4326J2108K966K591n342j2540L239O540L342R412j907J0078n095
9647B6649j1556j0961K245J1398N214N894k162l907J644N057Q497m380l77N171
9633C8426Q51j1194o245M0J7938q670p054P384J1044j3177n95J92r201l022K78
9618A6995J4336J2018N510l364n178j0940R091Q261K567R92j787R82j2096j4653
9604B2734J281r488O624J1911m42q202K800J9320J2002o741j5519k813m07K507
$$ plain form
9590 35567 37367 31879 24555 38082 41062 48538 47273 42480 39618 41355 41369 49242 50459 36869 34631
9575 34631 43008 54098 42325 44463 52006 33885 18167 28047 23798 34397 36668 30790 27836
9562 27836 31720 39808 41693 40707 47871 34317 20534 34014 21338 6064 24752 30004 10504
9549 10504 32813 44795 27434 19717 17619 16825 20711 20360 14314 4257 13105 36976 28866 25536
9535 25536 26959 31670 28556 31333 38761 45470 33711 27763 26977 30076 26703 24941 26816 26562 30587
9520 30587 34287 46601 47145 20175 12028 20169 24796 28963 37852 33964 41974 39205 39415 31330 23965
9505 23965 28328 34833 43978 47646 34225 38709 40587 42299 57713 63049 64057 50659 42418 28615
9491 28615 28877 32406 37498 44671 48085 48851 55686 62625 49114 40467 21647 13539 25971 27438
$$ packed form
9590C5567J800n488p324J3527K980P476j265m793k862J737J4P873J217j3590k238
9575C4631Q377J1090j1773K138P543j8121j5718R880m249J0599K271n878k954
9562B7836L884Q088J885r86P164j3554j3783J3480j2676j5274J8688N252j9500
9549A0504K2309J1982j7361p717k098p94L886l51o046j0057Q848K3871q110l330
9535B5536J423M711l114K777P428O709j1759n948p86L099l373j762J875k54M025
9520C0587L700J2314N44k6970q147Q141M627M167Q889l888Q010k769K10q085p365
9505B3965M363O505R145L668j3421M484J878J712J5414N336J008j3398q241j3803
9491B8615K62L529N092P173L414P66O835O939j3511q647j8820q108J2432J467
$$ plain form
9477 27438 21256 21543 21199 21354 11125 6950 15678 10977 12624 23235 33574 29987 26809 22510 31111
9462 31111 41811 47505 24373 20498 16342 24844 38603 39241 45211 46206 35407 36489 39821 45408
9448 45408 42763 30856 26848 47612 56934 54016 38900 31423 41374 43429 44877 40745 20216 16110
9434 16110 30331 35609 28283 30060 35634 33964 42607 42815 42030 52707 51137 43542 50984 40540
9420 40540 49476 56645 48476 46423 51542 52193 53949 61231 59448 42865 53514 67007 62882 48199
9406 48199 48253 71559 85127 82717 56727 50480 40764 49799 55578 44354 30539 20667 25214 36482
9392 36482 41160 28264 23925 30356 28052 32540 38745 42752 36939 40198 40029 35664 35647 43469 45946
9377 45946 44961 38069 43500 52127 43545 51713 64643 66192 61102 68224 61988 61997 66426 71120 61230
$$ packed form
9477B7438o182K87l44J55j0229m175Q728m701J647J0611J0339l587l178m299Q601
9462C1111J0700N694k3132l875m156Q502J3759O38N970R95j0799J082L332N587
9448D5408k645j1907m008K0764R322k918j5116p477R951K055J448m132k0529m106
9434A6110J4221N278p326J777N574j670Q643K08p85J0677j570p595P442j0444
9420D0540Q936P169q169k053N119O51J756P282j783j6583J0649J3493m125j4683
9406D8199N4K3306J3568k410k5990o247r716R035N779j1224j3815r872M547J1268
9392C6482M678j2896m339O431k304M488O205M007n813L259j69m365j7P822K477
9377D5946r85o892N431Q627q582Q168J2930J549n090P122o236RM429M694r890
$$ plain form
9362 61230 45943 37149 38677 53321 55719 60856 54895 41087 46753 40060 32703 43727 43988 31512
9348 31512 33231 42696 54853 60598 53042 34895 26040 40079 55083 55757 59487 69809 70481 52960
9334 52960 35141 38638 48310 47566 49380 52354 50333 60097 66679 60204 43962 38213 57999 49929
9320 49929 44431 53488 60235 48403 37653 46061 49174 45520 49913 63650 71769 60804 43315
9307 43315 46763 43640 45352 65189 66871 46947 35170 39690 40626 35639 37054 38756 43500 46681
9293 46681 46664 53601 68278 74669 72985 75398 65919 57455 60441 59164 62197 52434 54220 52101 53178
9278 53178 53282 51859 44456 29503 29020 41553 49774 47712 40020 38400 44417 55967 77617 78899
9264 78899 68464 58989 66931 74455 77594 69678 62156 64452 65817 76025 81698 77347 60420 66080
$$ packed form
9362F1230j5287q794J528J4644K398N137n961j3808N666o693p357J1024K61j2476
9348C1512J719R465J2157N745p556j8147q855J4039J5004O74L730J0322O72j7521
9334E2960j7819L497R672p44J814K974k021R764O582o475j6242n749J9786q070
9320D9929n498R057O747j1832j0750Q408L113l654M393J3737Q119j0965j7489
9307D3315L448l123J712J9837J682j9924j1777M520R36m987J415J702M744L181
9293D6681j7O937J4677O391j684K413r479q464K986j277L033r763J786k119J077
9278E3178J04j423p403j4953m83J2533Q221k062p692j620O017J1550K1650J282
9264G8899j0435r475P942P524L139p916p522K296J365J0208N673m351j6927N660
$$ plain form
9250 66080 68270 64125 72701 75469 74333 69621 66419 72258 63942 45340 34541 48058 67606 87090
9236 87090 83405 80888 81910 91502 88102 85379 89446 95070 103591 117329 116689 106257 90369 97808
9222 97808 108011 120784 112698 99911 88345 97945 109626 108953 103084 104596 107746 109425 107550 116413
9208 116413 101137 100841 103405 108627 97959 93320 94795 92741 87158 91465 88912 100399 99780 94761
9194 94761 82072 74962 78707 72849 73744 78632 72105 80204 92038 102495 106632 102482 87643 81915
9180 81915 84900 98149 110764 108537 105944 119538 127870 123310 109124 92556 91005 106131 102781
9167 102781 85861 87587 91322 94016 104212 112712 116762 109927 108344 108122 110356 100899 102420 105787
9153 105787 102262 108488 126555 135368 132133 131894 119402 109639 123001 130215 111181 105120 97702 88857
$$ packed form
9250F6080K190m145Q576K768j136m712l202N839q316j8602j0799J3517J9548J9484
9236H7090l685k517J022R592l400k723M067N624Q521J3738o40j0432j5888P439
9222I7808J0203J2773q086j2787j1566R600J1681o73n869J512L150J679j875Q863
9208A16413j5276k96K564N222j0668m639J475k054n583M307k553J1487o19n019
9194I4761j2689p110L745n858Q95M888o527Q099J1834J0457M137m150j4839n728
9180H1915K985J3249J2615k227k593J3594Q332m560j4186j6568j551J5126l350
9167A02781j6920J726L735K694J0196Q500M050o835j583k22K234r457J521L367
9153A05787l525O226J8067Q813l235k39j2492r763J3362P214j9034o061p418q845
$$ plain form
9139 88857 81793 83748 84226 89079 89256 95529 105568 119949 129684 134166 130692 131741 145635 147031
9125 147031 155521 147484 131992 127898 119606 110381 108320 110454 103069 105799 103259 105108 109639 114856
9111 114856 125283 113172 114631 109453 117426 135808 126824 117100 120500 107469 92577 92322 92478 94128
9097 94128 86139 86511 98987 113573 118402 124597 132288 135257 136757 131258 124948 128290 139668 144277
9083 144277 139309 128050 117074 109040 105077 121071 125761 137098 141801 135540 137548 149818 151018
9070 151018 154140 155317 155961 157288 141577 127220 127808 131460 127182 125818 120607 118844 131673 145483
9056 145483 148558 157712 145968 132195 132437 128958 142593 157662 164180 166003 152838 145445 156138
9043 156138 162849 150055 148565 155168 149257 153722 174119 182597 168494 162782 171246 181856 182152 191874
$$ packed form
9139H8857p064J955M78M853J77O273J0039J4381R735M482l474J049J3894J396
9125A47031Q490q037j5492m094q292r225k061K134p385K730k540J849M531N217
9111A14856J0427j2111J459n178P973J8382q984r724L400j3031j4892k55J56J650
9097I4128p989L72J2476J4586M829O195P691K969J500n499o310L342J1378M609
9083A44277m968j1259j0976q034l963J5994M690J1337M703o261K008J2270J200
9070A51018L122J177O44J327j5711j4357N88L652m278j364n211j763J2829J3810
9056A45483L075R154j1744j3773K42l479J3635J5069O518J823j3165p393J0693
9043A56138O711j2794j490O603n911M465K0397Q478j4103n712Q464J0610K96R722
$$ plain form
9029 191874 188897 175598 173588 166255 172138 194509 203973 200128 202633 199289 194988 190213 190640 188008
9015 188008 183566 177716 184759 190325 179270 170546 162553 168817 193447 198657 199312 200220 197619 191792
9001 191792 196108 203214 201903 202380 205052 207145 202671 193943 190309 196561 211738 216713 200701 207415
8987 207415 216206 221595 213162 215253 215764 213652 223211 230814 229231 226487 218011 225718 222144 219083 212582
8972 212582 231906 236612 240377 235497 238392 231294 241636 250539 238847 231542 236431 242614 246349 265496
8958 265496 268156 261949 257904 267341 265206 257635 252516 246707 254162 266593 280697 275150 273390 272608
8944 272608 281801 297812 305599 294455 278745 288698 302944 321923 325936 314888 318769 322355 321421
8931 321421 341618 356294 356399 348192 360391 383343 385851 374204 374407 393180 397925 402065 398305
$$ packed form
9029A91874k977j3299k010p333N883K2371R464l845K505l344m301m775M27k632
9015A88008m442n850P043N566j1055q724p993O264K4630N210O55R08k601n827
9001A91792M316P106j311M77K672K093m474q728l634O252J5177M975j6012O714
8987B07415Q791N389q433K091N11k112R559P603j583k744q476P707l574l061o501
8972B12582J9324M706L765m880K895p098J0342Q903j1692p305M889O183L735J9147
8958B65496K660o207m045R437k135p571n119n809P455J2431J4104n547j760p82
8944B72608R193J6011P787j1144j5710R953J4246J8979M013j1048L881L586r34
8931C21421K0197J4676J05q207J2199K2952K508j1647K03J8773M745M140l760
$$ plain form
8918 398305 402604 408095 412639 432251 446573 455369 466025 464553 460649 456896 445655 455793 470932
8905 470932 489795 501163 514224 517613 528858 537663 541693 533009 524519 528083 530518 540353 546306
8892 546306 552931 563597 576382 588158 607329 619788 622111 626812 634316 654692 662803 664383 667329
8879 667329 659943 672087 694395 711886 721486 737627 737720 743382 752299 772802 791615 799207 817680
8866 817680 840738 851394 873319 891771 908642 925980 945095 962329 982550 1007531 1031523 1057432
8854 1057432 1070930 1085284 1123427 1163061 1178224 1188221 1217778 1249355 1281624 1324876 1374869 1413401
8842 1413401 1450922 1492037 1537060 1570953 1611731 1677694 1736904 1788229 1841790 1894577 1946087
8831 1946087 1997023 2047307 2118019 2184532 2256232 2329999 2407416 2498751 2606025 2707254 2777470
$$ packed form
8918C98305M299N491M544J9612J4322Q796J0656j472l904l753j1241J0138J5139
8905D70932J8863J1368J3061L389J1245Q805M030q684q490L564K435R835N953
8892E46306O625J0666J2785J1776J9171J2459K323M701P504K0376Q111J580K946
8879F67329p386J2144K2308J7491R600J6141R3N662Q917K0503J8813P592J8473
8866H17680K3058J0656K1925J8452J6871J7338J9115J7234K0221K4981K3992K5909
8854A057432J3498J4354L8143L9634J5163R997K9557L1577L2269M3252M9993L8532
8842A413401L7521M1115M5023L3893M0778O5963N9210N1325N3561N2787N1510
8831A946087N0936N0284P0712O6513P1700P3767P7417R1335J07274J01229P0216
$$ plain form
8820 2777470 2864339 2974353 3093664 3208472 3328852 3472543 3629682 3765694 3909066 4057193
8810 4057193 4213377 4382698 4558041 4733123 4921667 5127808 5346118 5563917 5798542 6047674
8800 6047674 6320058 6601828 6909051 7235674 7567571 7924395 8293531 8665358 9073533 9534810
8790 9534810 10008540 10515385 11057394 11626290 12237461 12890737 13567455 14293802 15079664 15937749
8780 15937749 16847395 17812366 18830170 19911439 21030991 22185659 23365776 24535853
8772 24535853 25678131 26773933 27778092 28637202 29334213 29852449 30155012 30205073 29999189
8763 29999189 29544187 28842155 27921115 26809586 25559244 24186767 22770095 21359069 19958054
8754 19958054 18617857 17332022 16098158 14952989 13885418 12887735 11978942 11142423 10369458
$$ packed form
8820B777470Q6869J10014J19311J14808J20380J43691J57139J36012J43372J48127
8810D057193J56184J69321J75343J75082J88544K06141K18310K17799K34625K49132
8800F047674K72384K81770L07223L26623L31897L56824L69136L71827M08175M61277
8790I534810M73730N06845N42009N68896O11171O53276O76718P26347P85862Q58085
8780A5937749R09646R64971J017804J081269J119552J154668J180117J170077
8772B4535853J142278J095802J004159Q59110O97011N18236L02563N0061k05884
8763B9999189m55002p02032r21040j111529j250342j372477j416672j411026j401015
8754A9958054j340197j285835j233864j145169j067571r97683r08793q36519p72965
$$ plain form
8745 10369458 9676783 9027833 8438393 7899238 7404327 6935247 6518641 6147012 5787028
8736 5787028 5453388 5147602 4874407 4611272 4361010 4131592 3934272 3741852 3544432 3353246
8726 3353246 3207258 3080375 2950055 2817468 2690175 2580086 2476915 2386876 2295115 2213927
8716 2213927 2143286 2054775 1962121 1888683 1821562 1760639 1696625 1634785 1595118 1550780 1501595
8705 1501595 1450651 1397578 1355005 1307049 1274884 1257357 1230290 1178500 1136656 1093281 1051198
8694 1051198 1017240 1005281 1002690 979471 966380 940486 904056 884334 880570 882841 866956 822266
8682 822266 787597 765661 763798 746224 722847 694864 676859 670649 675019 678116 650013 638840
8670 638840 626851 616472 599595 581021 575627 558487 538900 538727 528993 524993 528274 525746 511509
$$ packed form
8745A0369458o92675o48950n89440n39155m94911m69080m16606l71629l59984
8736E787028l33640l05786k73195k63135k50262k29418j97320j92420j97420j91186
8726C353246j45988j26883j30320j32587j27293j10089j03171r0039r1761q1188
8716B213927p0641q8511r2654p3438o7121o0923o4014o1840l9667m4338m9185
8705A501595n0944n3073m2573m7956l2165j7527k7067n1790m1844m3375m2083
8694A051198l3958j1959k591k3219j3091k5894l6430j9722l764K271j5885m4690
8682H22266l4669k1936j863j7574k3377k7983j8005o210M370L097k8103j1173
8670F38840j1989j0379j6877j8574n394j7140j9587j73r734m000L281k528j4237
$$ plain form
8657 511509 484853 487900 483386 473315 468127 455838 450591 456649 449940 442332 430858 434984 424335
8644 424335 427062 423481 418768 412013 399917 395465 390584 378412 368949 355383 360720 358002 342251
8631 342251 346768 355473 345075 337987 335872 343354 337982 332673 320707 310273 309793 319365 313305 297138
8617 297138 285013 286594 299941 303118 304414 298341 295832 295023 308365 317470 329247 331196 320869
8604 320869 299570 285504 292020 296339 283417 287137 286164 289986 305144 302388 307847 310833 313568 325732
8590 325732 332229 332892 338062 321227 307730 308323 320678 331459 330225 333015 343502 345220 346435 345721
8576 345721 360004 384233 416727 423472 429514 424246 428352 450998 482929 497854 506707 518472 521307
8563 521307 527311 521680 500783 479165 461377 430774 405950 388288 359823 322560 290706 274075
$$ packed form
8657E11509k6656L047m514j0071n188j2289n247O058o709p608j1474M126j0649
8644D24335K727l581m713o755j2096m452m881j2172r463j3566N337k718j5751
8631C42251M517Q705j0398p088k115P482n372n309j1966j0434m80R572o060j6167
8617B97138j2125J581J3347L177J296o073k509q09J3342R105J1777J949j0327
8604C20869k1299j4066O516M319j2922L720r73L822J5158k756N459K986K735J2164
8590C25732O497O63N170j6835j3497N93J2355J0781j234K790J0487J718J215p14
8576C45721J4283K4229L2494O745O042n268M106K2646L1931J4925Q853J1765K835
8563E21307O004n631k0897k1618j7788l0603k4824j7662k8465l7263l1854j6631
$$ plain form
8551 274075 259608 250290 232389 216483 206892 198319 188190 178803 178631 167225 149075 139402 138964
8538 138964 137297 145446 152591 146231 143141 149053 146941 154012 150250 143459 130351 120446 120706 122192
8524 122192 123533 123163 113420 121526 137182 149182 163013 175524 175481 155925 121617 114150 110414 114542
8510 114542 105840 102153 100876 99521 85759 73922 70115 74997 67942 61089 61857 73425 77733 73712
8496 73712 78415 83136 85146 81794 85698 90272 89429 79914 72639 86354 92278 83333 72063 62592
8482 62592 54451 57874 75442 81162 87164 89227 88235 70623 57213 47734 52204 56333 61380 59591
8468 59591 58819 61095 51620 55205 52736 61785 68480 81584 76363 57160 57685 70285 61740 64867
8454 64867 73118 78420 63381 47247 63571 70537 65362 53527 61682 60317 54886 59056 49812 43959
$$ packed form
8551B74075j4467r318j7901j5906r591q573j0129r387j72j1406j8150r673m38
8538A38964j667Q149P145o360l090N912k112P071l762o791j3108r905K60J486
8524A22192J341l70r743Q106J5656J2000J3831J2511m3j9556l4308p467l736M128
8510A14542q702l687j277j355j3762j1837l807M882p055o853P68J1568M308m021
8496G3712M703M721K010l352L904M574q43r515p275J3715N924q945j1270r471
8482F2592q141L423J7568N720O002K063r92j7612j3410r479M470M129N047j789
8468E9591p72K276r475L585k469R049O695J3104n221j9203N25J2600q545L127
8454F4867Q251N302j5039j6134J6324O966n175j1835Q155j365n431M170r244n853
$$ plain form
8440 43959 55460 52008 54355 53435 49619 43736 35919 33150 32971 32068 38272 34704 39963 45804 47069
8425 47069 37023 23463 22707 33066 34018 43295 46408 41303 42375 39717 34087 39428 28708 24333
8411 24333 20063 22888 22342 33619 33140 36436 36703 22523 14042 17395 12242 14837 10190 20633 31002
8396 31002 29876 15164 759 13683 31065 34066 22180 25702 35119 32842 24927 25913 25861 20184
8382 20184 10496 8507 17318 14078 7532 13041 7104 15774 20234 21131 23989 29797 43981 42705 44320
8367 44320 50048 45474 39241 38651 29195 40895 38500 32431 25949 14844 15288 28089 35383 16940
8353 16940 11982 5524 15930 8950 7113 8060 11717 19169 43699 62796 62828 53708 31150 21142
8339 21142 18369 6274 2260 -446 3507 9050 -722 3089 7045 6762 9104 6701 -5368 -6454
$$ packed form
8440D3959J1501l452K347r20l816n883p817k769j79r03O204l568N259N841J265
8425D7069j0046j3560p56J0359R52R277L113n105J072k658n630N341j0720m375
8411B4333m270K825n46J1277m79L296K67j4180q481L353n153K595m647J0443J0369
8396C1002j126j4712j4405J2924J7382L001j1886L522R417k277p915R86n2n677
8382B0184r688j989Q811l240o546N509n937Q670M460Q97K858N808J4184j276J615
8367D4320N728m574o233n90r456J1700k395o069o482j1105M44J2801P294j8443
8353A6940m958o458J0406o980j837R47L657P452K4530J9097L2r120k2558j0008
8339B1142k773j2095m014k706L953N543r772L811L956k83K342k403j2069j086
$$ plain form
8325 -6454 -7496 -399 -1050 -923 -3003 4466 11936 12812 15301 16580 12633 15840 34512 43004 41774
8310 41774 36675 38129 40709 35016 32311 21093 3701 -5354 5672 16072 24717 32007 23164 6401
8296 6401 -2414 2945 6699 21676 31113 18561 24126 23411 29483 45362 34177 55018 67284 54293
8282 54293 57448 50894 58031 66371 79736 82951 79368 65780 55633 69006 77101 101942 134888
8269 134888 159587 177978 193803 213497 233248 249303 260489 259952 230775 187594 142104 98848
8257 98848 72438 68598 57851 50677 51607 46897 46828 47133 46656 46477 35314 31905 25604 19712 32231
8242 32231 48638 52007 52580 38435 37198 40292 49246 50375 34749 44092 48512 61307 72868 93427
8228 93427 107984 132943 159845 191729 207622 232999 236968 238735 222663 181507 135075 110668
$$ packed form
8325f454j042P097o51J27k080P469P470Q76K489J279l947L207J8672Q492j230
8310D1774n099J454K580n693k705j1218j7392r055J1026J0400Q645P290q843j6763
8296F401q815N359L754J4977R437j2552N565p15O072J5879j1185K0841J2266j2991
8282E4293L155o554P137Q340J3365L215l583j3588j0147J3373Q095K4841L2946
8269A34888K4699J8391J5825J9694J9751J6055J1186n37k9177m3181m5490m3256
8257I8848k6410l840j0747p174R30m710o9L05m77j79j1163l409o301n892J2519
8242C2231J6407L369N73j4145j237L094Q954J129j5626R343M420J2795J1561K0559
8228I3427J4557K4959K6902L1884J5893K5377L969J767j6072m1156m6432k4407
$$ plain form
8216 110668 78954 52325 28392 10774 22035 24619 21836 13571 -8122 -18666 -20316 -20031 -15427
8203 -15427 -14984 5025 3985 -12930 -8332 2957 9620 9721 10612 7583 5411 11992 9847 5445 13998
8188 13998 25932 25994 27851 16335 18473 19819 13111 10122 13985 24683 12783 3695 16196 24725
8174 24725 13287 8670 18932 18952 7687 -2429 -877 12069 26470 17798 16216 13488 8626 12511
8160 12511 16469 9637 1652 -6338 -6996 2318 3616 10192 3208 11736 21864 23490 20501 17456 5580
8145 5580 7004 8322 -795 12359 19125 21734 22635 29890 25440 38171 29621 17316 14619 17296
8131 17296 19000 11346 11246 14252 4159 -4810 -994 -4899 -13944 -18254 -15435 -3328 3993 5237
8117 5237 2605 11075 9885 11843 -1002 -2718 -2891 786 17025 7058 2843 8638 1129 3121 7117
$$ packed form
8216A10668l1714k6629k3933j7618J1261K584k783q265k1693j0544j650K85M604
8203a5427M43K0009j040j6915M598J1289O663J01Q91l029k172O581k145m402Q553
8188A3998J1934O2J857j1516K138J346o708k989L863J0698j1900r088J2501Q529
8174B4725j1438m617J0262K0j1265j0116J552J2946J4401q672j582k728m862L885
8160A2511L958o832p985p990o58R314J298O576o984Q528J0128J626k989l045j1876
8145E580J424J318r117J3154O766K609R01P255m450J2731q550j2305k697K677
8131A7296J704p654j00L006j0093q969L816l905r045m310K819J2107P321J244
8117E237k632Q470j190J958j2845j716j73L677J6239r967m215N795p509J992L996
$$ plain form
8102 7117 20904 25144 17935 19823 27287 37276 41083 24350 20798 21135 21234 20385 19973 26370 38308
8087 38308 13429 -1121 8836 14027 18151 18459 6956 6602 13749 5330 -7253 -3564 7497 18858
8073 18858 22184 14353 16612 17120 24949 35361 35089 43188 40117 33698 53974 62110 46528 36949
8059 36949 28061 41693 60298 87738 110423 118130 120109 131574 131454 144377 171223 187678 180906
8046 180906 172777 161135 144879 109643 80395 59463 42151 27031 20674 26157 30453 14618
8034 14618 16277 15797 32494 51096 49992 40278 27095 3187 -4445 -399 10889 23626 12318
8021 12318 17399 37777 34478 30121 46442 55936 47247 32810 38110 37895 43955 62120 75131 76937
8007 76937 68494 57805 54709 57234 54645 57161 69291 55483 52900 46349 44815 56528 64599 59760
$$ packed form
8102G117J3787M240p209J888P464R989L807j6733l552L37R9q49m12O397J1938
8087C8308k4879j4550R957N191M124L08j1503l54P147q419j2583L689J1061J1361
8073A8858L326p831K259N08P829J0412k72Q099l071o419K0276Q136j5582r579
8059C6949q888J3632J8605K7440K2685P707J979J1465j20J2923K6846J6455o772
8046A80906q129j1642j6256l5236k9248k0932j7312j5120o357N483M296j5835
8034A4618J659m80J6697J8602j104r714j3183k3908p632M046J1288J2737j1308
8021A2318N081K0378l299m357J6321R494q689j4437N300k15O060J8165J3011J806
8007G6937q443j0689l096K525k589K516J2130j3808k583o551j534J1713Q071m839
$$ plain form
7993 59760 60782 69201 57061 52615 53627 51251 52268 50769 64192 64783 50575 49149 44072 51935
7979 51935 56660 65679 71291 71268 69303 61656 73564 85720 89872 87273 99478 101975 88284 83140
7965 83140 78285 79154 67814 66772 58432 38449 28387 25405 27538 23376 27293 33855 25542 31653
7951 31653 40381 45329 50985 38801 37019 50080 49505 36852 34007 45544 42294 36290 40186 40764
7937 40764 49808 50247 49034 60445 69896 66393 50864 40272 49291 65047 71152 67148 60866 61208
7923 61208 58507 58284 42649 37586 47057 43534 33510 33241 41072 44209 32515 16915 5203 3114
7909 3114 8757 16815 30636 49078 42168 35162 37141 24424 20021 13142 12302 26453 20284 18173
7895 18173 26541 22153 13937 13027 14351 25784 24341 14218 22222 27252 17953 -1126 4116 19133
$$ packed form
7993E9760J022Q419j2140m446J012k376J017j499J3423N91j4208j426n077P863
7979E1935M725R019N612k3j965p647J1908J2156M152k599J2205K497j3691n144
7965H3140m855Q69j1340j042q340j9983j0062k982K133m162L917O562q313O111
7951C1653Q728M948N656j2184j782J3061n75j2653k845J1537l250o004L896N78
7937D0764R044M39j213J1411R451l503j5529j0592R019J5756O105m004o282L42
7923F1208k701k23j5635n063R471l523j0024k69P831L137j1694j5600j1712k089
7909C114N643Q058J3821J8442o910p006J979j2717m403o879q40J4151o169k111
7895A8173Q368m388q216r10J324J1433j443j0123Q004N030r299j9079N242J5017
$$ plain form
7881 19133 20749 18863 10683 5946 11320 20172 13172 8279 2552 7062 8081 17175 20203 16098 2969
7866 2969 -8078 -6191 -8421 6609 6231 -9682 -13463 -1930 18444 27813 31542 20494 4197
7853 4197 6595 8644 5616 9903 1419 2976 -5704 -16918 -20271 -21419 -19735 -9662 6919 8143
7839 8143 10519 14416 23139 23564 24158 21346 12629 17261 27658 10478 9484 16386 5384 11917 13637
7824 13637 211 -20287 -20441 -9206 3519 4731 3036 3995 -8415 -14939 1011 11004 13815 25661
7810 25661 22815 2836 -3057 -197 -748 -12638 -18347 -17709 -5824 -88 5349 13171 -1233 -2623
7796 -2623 -5494 -7353 -4830 485 -10717 -17888 -13980 -16159 -33737 -33759 -15001 -17551 -16891 -17366 -15415
7781 -15415 -2096 -190 -18953 -26515 -28943 -30450 -26637 -23237 -21828 -21273 -10333 -8179 -15364 -25603
$$ packed form
7881A9133J616j886q180m737N374Q852p000m893n727M510J019R094L028m105j3129
7866B969j1047J887k230J5030l78j5913l781J1533K0374R369L729j1048j6297
7853D197K398K049l028M287q484J557q680j1214l353j148J684J0073J6581J224
7839H143K376L897Q723M25N94k812q717M632J0397j7180r94O902j1002O533J720
7824A3637j3426k0498j54J1235J2725J212j695R59j2410o524J5950R993K811J1846
7810B5661k846j9979n893K860n51j1890n709O38J1885N736N437P822j4404j390
7796b623k871j859K523N315j1202p171L908k179j7578k2J8758k550O60m75J951
7781a5415J3319J906j8763p562k428j507L813L400J409N55J0940K154p185j0239
$$ plain form
7767 -25603 -34588 -31128 -20898 -33762 -24838 -14332 -9971 -6323 -3237 -3365 537 -6732 -13310 -12922
7753 -12922 -21414 -22399 -24201 -28603 -27558 -22045 -7910 -7136 -17914 -14422 -1534 924 2674 780
7739 780 -5193 -25167 -26804 -24078 -27478 -24041 -32725 -25884 -20645 -19307 -10843 -7533 -13915 -24675 -26518
7724 -26518 -24400 -19112 -11668 -17621 -15500 -16302 -19745 -14894 -11518 -4625 -16361 -21239 -16457 -6403
7710 -6403 -2127 -11560 -15548 -12127 -17833 -35306 -28325 -13572 -19802 -25213 -18860 -18578 -17543 -22626 -29691
7695 -29691 -40534 -43393 -39509 -39960 -29201 -37248 -30265 -23097 -22365 -16946 -6222 -8706 -25540 -35231
7681 -35231 -23065 -21163 -25076 -19763 -23494 -34105 -33941 -27512 -24460 -37700 -46745 -39048 -33268 -25266
7667 -25266 -26992 -28985 -24839 -11102 -11208 -17617 -7818 -870 -5415 -26132 -43435 -36620 -27703 -28893
$$ packed form
7767b5603q985L460J0230j2864Q924J0506M361L648L086j28L902p269o578L88
7753a2922q492r85j802m402J045N513J4135P74j0778L492J2888K458J750j894
7739G80n973j9974j637K726l400L437q684O841N239J338Q464L310o382j0760j843
7724b6518K118N288P444n953K121q02l443M851L376O893j1736m878M782J0054
7710f403M276r433l988L421n706j7473O981J4753o230n411O353K82J035n083p065
7695b9691j0843k859L884m51J0759q047O983P168P32N419J0724k484j6834r691
7681c5231J2166J902l913N313l731j0611J64O429L052j3240r045P697N780Q002
7667b5266j726j993M146J3737j06o409R799O948m545k0717j7303O815Q917j190
$$ plain form
7653 -28893 -40233 -45661 -41955 -38683 -36408 -20174 -7732 -10505 -28138 -41709 -39028 -34764 -38856
7640 -38856 -39697 -31542 -18537 -11058 -19933 -23470 -6261 4558 152 -11989 -29718 -39883 -56235
7627 -56235 -44595 -19847 -23260 -30045 -30526 -14659 -4142 -4533 -13221 -14626 -17197 -22778 -33603 -37816
7613 -37816 -38918 -38965 -37517 -35558 -36447 -37111 -25015 -20602 -32817 -45111 -50608 -43631 -37096 -34721 -48424
7598 -48424 -48788 -43218 -36365 -37232 -36494 -39711 -45128 -26907 -29410 -39392 -36685 -28750 -20096 -35680 -42285
7583 -42285 -28433 -28914 -20516 -23689 -26726 -22798 -22872 -38851 -48743 -37473 -27829 -22033 -17462 -14740 -30830
7568 -30830 -34414 -29628 -15748 529 3365 -3592 -7383 -19178 -19395 -8899 -13727 -24809 -27785 -15423
7554 -15423 -14248 -25600 -19780 -14679 -9660 -16890 -24298 -33932 -33528 -20777 -15352 -15923 -19086 -21738 -7896
$$ packed form
7653b8893j1340n428L706L272K275J6234J2442k773j7633j3571K681M264m092
7640c8856q41Q155J3005P479q875l537J7209J0819m406j2141j7729j0165j6352
7627e6235J1640K4748l413o785m81J5867J0517l91q688j405k571n581j0825m213
7613c7816j102m7J448J959q89o64J2096M413j2215j2294n497O977O535K375j3703
7598d8424l64N570O853q67P38l217n417J8221k503r982K707P935Q654j5584o605
7583d2285J3852m81Q398l173l037L928p4j5979r892J1270R644N796M571K722j6090
7568c0830l584M786J3880J6277K836o957l791j1795k17J0496m828j1082k976J2362
7554a5423J175j1352N820N101N019p230p408r634M04J2751N425n71l163k652J3842
$$ plain form
7539 -7896 -3463 -15125 -22367 -33223 -33264 -29706 -30905 -40928 -37295 -27674 -15969 -6323 -8359 -10376
7525 -10376 -5740 -6997 -18590 -29303 -29393 -30616 -36163 -33279 -33781 -41893 -40553 -40462 -38602 -30763 -25352
7510 -25352 -31641 -33238 -23899 -25840 -35430 -55242 -50946 -43904 -37552 -33875 -25066 -10934 -5918 -3554
7496 -3554 -10547 -26396 -31345 -24104 -19065 -27660 -22362 -18949 -14733 -30355 -35823 -34290 -22617 -19768
7482 -19768 -14327 -3380 -8179 -7566 -9741 -15531 -17098 -19959 -32368 -22120 -10191 -3604 -3375 -9187
7468 -9187 -8533 559 -7194 -21517 -37063 -43322 -43866 -36998 -34549 -32288 -26552 -12288 -4455 -5186 -20717
7453 -20717 -29273 -25553 -12904 -19427 -25659 -34723 -38885 -45967 -33951 -17850 -13880 -17301 -16980 -15768
7439 -15768 -20183 -29733 -38617 -40663 -37294 -35861 -28768 -30343 -27937 -25361 -30759 -31537 -22367 -16300 -16816
$$ packed form
7539g896M433j1662p242j0856m1L558j199j0023L633R621J1705R646k036k017
7525a0376M636j257j1593j0713r0j223n547K884n02q112J340R1J860P839N411
7510b5352o289j597R339j941r590j9812M296P042O352L677Q809J4132N016K364
7496c554o993j5849m949P241N039q595N298L413M216j5622n468J533J1673K849
7482a9768N441J0947m799O13k175n790j567k861j2409J0248J1929O587K29n812
7468i187O54R092p753j4323j5546o259n44O868K449K261N736J4264P833p31j5531
7453b0717q556L720J2649o523o232r064m162p082J2016J6101L970l421L21J212
7439a5768m415r550q884k046L369J433P093j575K406K576n398p78R170O067n16
$$ plain form
7424 -16816 -13673 -12230 -8698 -15759 -7651 3688 4760 -331 -11210 -13123 -17753 -27439 -21362 -28522
7410 -28522 -29059 -27533 -18891 -14778 -14933 -9792 -8315 -19788 -27027 -21803 -17145 -20415 -25164 -20460 -22764
7395 -22764 -16606 4108 117 -18902 -28825 -31542 -19213 -17155 -10052 -414 -4890 -11608 -20463 -31198
7381 -31198 -33947 -23467 -20900 -19097 -3218 10940 11058 2363 -12209 -10122 -9416 -8342 -21362 -37054
7367 -37054 -33325 -21379 -16907 -25041 -14942 -22279 -18407 -9130 -11283 -16586 -11864 -10778 -14080 -15736
7353 -15736 -14964 -18455 -13973 -12331 -18049 -13943 -3467 -3518 -17771 -22050 -19846 -19409 -28366 -23064 -25472
7338 -25472 -35085 -33923 -36864 -36630 -34911 -39552 -45584 -22351 -21617 -16071 -16379 -17518 -20477 -19463 -21152
7323 -21152 -28407 -44161 -36609 -34585 -33649 -29868 -31996 -29750 -15936 -17082 -21239 -11088 -4166 -9988
$$ packed form
7424a6816L143J443L532p061Q108J1339J072n091j0879j913m630r686O077p160
7410b8522n37J526Q642M113j55N141J477j1473p239N224M658l270m749M704k304
7395b2764O158K0714l991j9019r923k717J2329K058P103R638m476o718q855j0735
7381c1198k749J0480K567J803J5879J4158J18q695j4572K087P06J074j3020j5692
7367c7054L729J1946M472q134J0099p337L872R277k153n303M722J086l302j656
7353a5736P72l491M482J642n718M106J0476n1j4253m279K204M37q957N302k408
7338b5472r613J162k941K34J719m641o032K3233P34N546l08j139k959J014j689
7323b1152p255j5754P552K024R36L781k128K246J3814j146m157J0151O922n822
$$ plain form
7309 -9988 -9236 -20444 -16669 -9091 -5555 -1436 -16488 -13389 -11874 -15731 -7812 -5395 -11690 -25510
7295 -25510 -16622 2787 -6500 -15594 -12423 -24432 -25741 -17733 -24673 -31400 -32881 -36668 -39980 -21898
7281 -21898 -14538 -22193 -41535 -35269 -35641 -34998 -27487 -27212 -30518 -21171 -17441 -29941 -30779 -15289 -13108
7266 -13108 -17678 -12364 -15795 -30402 -35072 -26780 -14781 -3896 -18323 -28246 -23489 -11206 5610
7253 5610 12128 1796 4798 -6329 -20718 -9202 -7889 -26734 -36554 -23747 -13645 -5391 -4267
7240 -4267 -19214 -30772 -30512 -26267 -24101 -26495 -18460 -22424 -24875 -21978 -30334 -26350 -14500 -5571
7226 -5571 -9833 -4169 -11174 -33751 -24758 -25422 -15860 -17520 -25311 -24063 -12128 -11253 -17019 -15547 -12023
7211 -12023 -23667 -32845 -23859 -3044 6272 -656 -11170 -7617 -6771 4410 -3384 -24188 -44078
$$ packed form
7309i988P52j1208L775P578L536M119j5052L099J515l857P919K417o295j3820
7295b5510Q888J9409r287r094L171j2009j309Q008o940o727j481l787l312J8082
7281b1898P360p655j9342O266l72O43P511K75l306R347L730j2500q38J5490K181
7266a3108m570N314l431j4607m670Q292J1999J0885j4427r923M757J2283J6816
7253E610O518j0332L002j1127j4389J1516J313j8845r820J2807J0102Q254J124
7240d267j4947j1558K60M245K166k394Q035l964k451K897q356L984J1850Q929
7226e571m262N664p005k2577Q993o64R562j660p791J248J1935Q75n766J472L524
7211a2023j1644r178Q986K0815R316o928j0514L553Q46J1181p794k0804j9890
$$ plain form
7198 -44078 -36576 -13440 -11511 -12520 -12648 -10736 785 6783 4099 -4245 -12492 -32135 -43326 -39424
7184 -39424 -30345 -22550 -18610 -8182 -6411 -4178 -12329 -22457 -16394 -13745 -18742 -13990 -7739 -3551
7170 -3551 -4862 -9329 -11453 -14900 -21922 -22286 -20849 -18219 -10859 -7534 2078 -3361 -24080 -34650 -36834
7155 -36834 -40659 -40253 -24726 -25264 -29876 -27382 -13703 -20991 -13898 -11501 -18878 -12193 2356 -15608
7141 -15608 -16862 -6930 2465 342 -993 -1210 -7429 -9254 -17748 -8358 -11746 -15915 -23993 -30475 -24293
7126 -24293 -20594 -21058 -20136 -18337 -27285 -22987 -15358 -11023 -10064 -4163 46 5027 -6600 -8117 -9423
7111 -9423 -14197 -18321 -23116 -28085 -29734 -5401 10200 6583 -11033 -15317 -2618 -11741 -18401 -14716
7097 -14716 3829 7315 -5160 -18748 -17220 -13995 -21754 -26691 -22816 -18193 -27218 -9532 -4526 -9510
$$ packed form
7198d4078P502K3136J929j009j28J912J1521N998k684q344q247j9643j1191L902
7184c9424R079P795L940J0428J771K233q151j0128O063K649m997M752O251M188
7170c551j311m467k124l447p022l64J437K630P360L325R612n439k0719j0570k184
7155c6834l825M06J5527n38m612K494J3679p288P093K397p377O685J4549j7964
7141a5608j254R932R395k123j335k17o219j825q494R390l388m169q078o482O182
7126b4293L699m64R22J799q948M298P629M335R59N901M209M981j1627j517j306
7111i423m774m124m795m969j649K4333J5601l617j7616m284J2699r123o660L685
7097a4716J8545L486j2475j3588J528L225p759m937L875M623r025J7686N006m984
$$ plain form
7083 -9510 -25532 -23891 -27365 -27172 -19493 -16275 -34890 -34051 -32914 -34504 -41338 -48120 -32580 -19917
7069 -19917 -17527 -15228 -15353 4915 12090 -3834 -24738 -16468 -20050 -23749 -11737 -12864 -26369 -25802
7055 -25802 -30218 -27335 -30728 -31882 -24194 -22675 -33408 -27765 -25484 -14641 -5688 -21630 -19800 -4926
7041 -4926 -2561 3756 599 -11159 -17929 -16196 -16089 -13365 -21686 -8188 1983 7034 1851 -4247
7027 -4247 -10836 -21486 -39603 -49446 -46461 -46126 -39269 -33197 -16673 -2763 -12101 -26113 -40470 -41025
7013 -41025 -33463 -21863 -22478 -29779 -25162 -19707 -23242 -28392 -29575 -39679 -31810 -22260 -20940 -22498
6999 -22498 -12758 -8744 -26926 -35562 -28322 -23595 -21853 -29869 -27432 -25236 -23854 -18458 -21974 -28832
6985 -28832 -30074 -17197 -10716 -2950 -6296 -11965 -23882 -35669 -41142 -31441 -24871 -23674 -32089 -24896
$$ packed form
7083i510j6022J641l474J93P679L218j8615Q39J137j590o834o782J5540J2663
7069a9917K390K299j25K0268P175j5924k0904Q270l582l699J2012j127j3505N67
7055b5802m416K883l393j154P688J519j0733N643K281J0843Q953j5942J830J4874
7041d926K365O317l157j1758o770J733J07K724q321J3498J0171N051n183o098
7027d247o589j0650j8117r843K985L35O857O072J6524J3910r338j4012j4357n55
7013d1025P562J1600o15p301M617N455l535n150j183j0104P869R550J320j558
6999b2498R740M014j8182q636P240M727J742q016K437K196J382N396l516o858
6985b8832j242J2877O481P766l346n669j1917j1787n473R701O570J197q415P193
$$ plain form
6971 -24896 -12204 -20179 -13078 5720 20891 15540 8288 -3443 -17506 -28049 -33702 -40112 -45294
6958 -45294 -33138 -26047 -9159 7826 -679 -9791 -19176 -23270 -22512 -5414 -533 -11755 -21761
6945 -21761 -26999 -13302 3219 3469 2758 4077 -2484 -9854 -6871 -2355 -5417 -13378 -18388 -22808 -23113
6930 -23113 -31793 -22279 -10061 -1282 -5167 -14384 -19007 -10739 -3245 1924 -3920 -5887 4543 -3343
6916 -3343 -5745 -12744 -11987 -6129 -16153 -15046 -14687 -32515 -36102 -28808 -31752 -35846 -24445 -14190
6902 -14190 -12035 -12069 -5697 -14470 -20602 -21359 -23902 -24231 -13927 -12181 -15536 -24211 -36072 -36747 -30743
6887 -30743 -37337 -25950 -10355 -1257 -5176 -19209 -27249 -19431 -13184 -16027 -22066 -24927 -29140 -18529
6873 -18529 -4034 2812 11196 4727 13999 11090 -973 -9092 -7957 -447 -8376 -9684 -591 313
$$ packed form
6971b4896J2692p975P101J8798J5171n351p252j1731j4063j0543n653o410n182
6958d5294J2156P091J6888J6985q505r112r385m094P58J7098M881j1222j0006
6945b1761n238J3697J6521K50p11J319o561p370K983M516l062p961n010m420l05
6930b3113q680R514J2218Q779l885r217m623Q268P494N169n844j967J0430p886
6916c343k402o999P57N858j0024J107L59j7828l587P294k944m094J1401J0255
6902a4190K155l4O372q773o132p57k543l29J0304J746l355q675j1861o75O004
6887c0743o594J1387J5595R098l919j4033q040P818O247k843o039k861m213J0611
6873a8529J4495O846Q384o469R272k909j2063q119J135P510p929j308R093R04
$$ plain form
6859 313 -4389 -6353 -13285 -6974 -9213 -19707 -29454 -29501 -11011 2931 -277 -6963 706 -8288 -28523
6844 -28523 -36843 -15941 -7444 -23008 -25209 -5078 -4823 -13035 -9937 -10987 -9530 -7989 -4196 -15993
6830 -15993 -10832 -8158 -16950 -29515 -25448 -9671 1995 5786 -4817 -17232 -15413 -9372 -12833
6817 -12833 -16879 -13346 -3409 -6663 -12262 -5297 6122 2876 4639 -8446 -14678 -18031 -19632 -23228
6803 -23228 -20612 -16674 -20557 -27972 -21487 -8563 -12783 -21304 -22193 -9481 -7397 -5147 2915 -2512
6789 -2512 -9247 6789 6965 -2156 -9220 -29190 -28783 -24367 -33642 -31302 -17077 -10640 -9405 -9038 -8369
6774 -8369 2594 14571 4948 1470 -3358 -5830 600 8607 -439 -5722 -26450 -41243 -33968 -29780
6760 -29780 -28010 -10903 2144 5878 15379 5671 -9035 1950 10203 9176 -517 -6566 -11034 -15797
$$ packed form
6859C13m702j964o932O311k239j0494r747m7J8490J3942l208o686P669q994k0235
6844b8523q320K0902Q497j5564k201K0131K55q212L098j050J457J541L793j1797
6830a5993N161K674q792j2565M067J5777J1666L791j0603j2415J819O041l461
6817a2833m046L533R937l254n599O965J1419l246J763j3085o232l353j601l596
6803b3228K616L938l883p415O485J2924m220q521q89J2712K084K250Q062n427
6789b512o735J6036J76r121p064j9970M07M416r275K340J4225O437J235L67O69
6774h369J0963J1977r623l478m828k472O430Q007r046n283k0728j4793P275M188
6760b9780J770J7107J3047L734R501r708j4706J0985Q253j027r693o049m468m763
$$ plain form
6746 -15797 -14236 9835 18298 13473 4005 6287 1309 -14474 -21801 -13740 -9811 -6131 -994 -4266
6732 -4266 -10570 -8753 -12031 -6203 -434 682 3694 5988 1985 -7150 -4101 3767 -1879 6560 22649
6717 22649 22980 8236 5431 1058 5406 17330 23489 27660 26009 24363 9458 646 -5234 -15517
6703 -15517 -5189 -822 -2156 12678 20617 33582 60560 74368 74312 85097 95543 96805 118055
6690 118055 137724 127157 111538 88529 56085 25483 13626 -4723 -8126 -3521 186 7157
6678 7157 4639 12083 3095 -8370 -4813 -8170 -24928 -23063 -1490 -5979 -2529 -696 -12434 -21979
6664 -21979 -21137 -1123 17712 13215 -1912 764 615 -5251 -13010 -5937 213 -11442 -10508 -13745
6650 -13745 -15736 -2885 8340 -3538 -17656 -18041 -17945 -9776 -10245 -7692 1193 -6247 -11323 -12591 -3029
$$ packed form
6746a5797J561K4071Q463m825r468K282m978j5783p327Q061L929L680N137l272
6732d266o304J817l278N828N769J116L012K294m003r135L049P868n646Q439J6089
6717B2649L31j4744k805m373M348J1924O159M171j651j646j4905q812n880j0283
6703a5517J0328M367j334J4834P939J2965K6978J3808n6J0785J0446J262K1250
6690A18055J9669j0567j5619k3009l2444l0602j1857j8349l403M605L707O971
6678G157k518P444q988j1465L557l357j6758J865K1573m489L450J833j1738r545
6664b1979Q42K0014J8835m497j5127K676j49n866p759P073O150j1655R34l237
6650a3745j991J2851J1225j1878j4118l85R6Q169m69K553Q885p440n076j268R562
$$ plain form
6635 -3029 -15285 -20843 -20548 -11455 -2280 -12962 -15991 -8262 -9844 -9639 -7425 -8731 -2149 -10805 -17140
6620 -17140 -4941 6411 -3535 -5850 -3734 -13415 -2906 -3617 -11278 -24944 -32135 -24650 -10045 5494
6606 5494 7607 -619 -2319 -8795 -19717 -35764 -33297 -37737 -36749 -22329 -24939 -36009 -27932 -32275
6592 -32275 -35559 -21927 -7554 -9853 -12611 -13449 -5147 7108 6224 -463 2644 878 4086 3926 -2081
6577 -2081 -1809 -4464 -10616 -10707 -18155 -20093 -27331 -30688 -28459 -30850 -27967 -34121 -38907 -30567 -30725 -30606
6561 -30606 -17824 -5782 -28973 -18967 -5769 -7621 -12367 5364 6864 -3201 -19783 -13985 -12746
6548 -12746 -15454 -8088 -5808 -1278 -10151 -20625 -16175 -15370 -27484 -29933 -20521 -11758 -10056 -10108 -3656
6533 -3656 -10235 -17292 -15566 -19371 -30705 -30392 -13141 -20906 -38953 -34964 -40316 -21973 -6938 -5346
$$ packed form
6635c029j2256n558K95R093R175j0682l029P729j582K05K214j306O582q656o335
6620a7140J2199J1352r946k315K116r681J0509p11p661j3666p191P485J4605J5539
6606E494K113q226j700o476j0922j6047K467m440R88J4420k610j1070Q077m343
6592c2275l284J3632J4373k299k758q38Q302J2255q84o687L107j766L208j60o007
6577b081K72k655o152r1p448j938p238l357K229k391K883o154m786Q340j58J19
6561c0606J2782J2042k3191J0006J3198j852m746J7731J500j0065j6582N798J239
6548a2746k708P366K280M530q873j0474M450Q05j2114k449R412Q763J702n2O452
6533c656o579p057J726l805j1334L13J7251p765j8047L989n352J8343J5035J592
$$ plain form
6519 -5346 -25565 -33710 -32004 -23663 -25000 -35323 -40368 -31957 -26147 -23217 -21404 -17396 -19862 -31471
6505 -31471 -38409 -39395 -44811 -38030 -33290 -19299 -13156 -5570 4508 -1753 -8728 -8136 -2319 -5817 -8605
6490 -8605 -1745 1833 -6386 -22263 -21163 -12800 -764 -14762 -19969 -8561 -4518 5753 1456 -5015
6476 -5015 -16120 -13457 -16650 -15589 -4622 1417 -11787 -13713 -9592 -5417 -15477 -14206 -892 -11991
6462 -11991 -9410 2763 9291 24122 31144 29058 19266 2128 6603 4390 -4126 -10645 -15339 -13704
6448 -13704 -5340 114 7049 2152 -2876 -1598 -12417 -11974 -706 6416 5208 -3778 -15778 -24701
6434 -24701 -29183 -40250 -40133 -21021 -14981 -14681 -12514 -12480 -7003 -6780 -18846 -14205 -589 -2647 -626
6419 -626 -3029 -9693 -23995 -13895 1276 5451 -7952 -3888 -6310 -18210 -27184 -29116 -31807 -23873
$$ packed form
6519e346k0219q145J706Q341j337j0323n045Q411N810K930J813M008k466j1609
6505c1471o938r86n416O781M740J3991O143P586J0078o261o975N92N817l498k788
6490h605O860L578q219j5877J100Q363J2036j3998n207J1408M043J0271m297o471
6476e015j1105K663l193J061J0967O039j3204j926M121M175j0060J271J3314j1099
6462a1991K581J2173O528J4831P022k086r792j7138M475k213q516o519m694J635
6448a3704Q364N454O935m897n028J278j0819M43J1268P122j208q986j2000q923
6434b4701m482j1067J17J9112O040L00K167L4N477K23j2066M641J3616k058K021
6419f26k403o664j4302J0100J5171M175j3403M064k422j1900q974j932k691P934
$$ plain form
6405 -23873 -20633 -11686 -3557 -13052 -25963 -45617 -49979 -35790 -36756 -38799 -41237 -32356 -31890 -31120 -38035
6390 -38035 -26876 -18474 -17391 -6689 -3756 -10032 -24501 -27453 -21741 -15584 -11843 -8923 -3242 -993
6376 -993 -16946 -25755 -28368 -17645 -11458 -14065 -9765 8256 7742 -7619 -14321 -14762 -17318 -2849
6362 -2849 1930 -5186 -5966 -15888 -25737 -18856 -9403 -1703 -2672 -2491 -11030 -5968 -10925 -12774 -12633 -13800
6346 -13800 -14150 -10177 -6540 1645 -1496 -5670 -3732 2742 705 -5252 -4246 29 -22831 -33890
6332 -33890 -34735 -23562 -24091 -17667 -14523 -21442 -14325 -24060 -24491 -15271 -12325 -15636 -8884 -911 -3340
6317 -3340 -14207 -18753 -21003 -19273 -18526 -21725 -24827 -25654 -27668 -20276 -13418 -12529 -9688 -8615 -10030
6302 -10030 -11922 -18938 -27199 -35684 -29465 -20700 -16444 -15884 -16973 -18644 -22490 -22045 -31268 -27950 -13501
$$ packed form
6405b3873L240Q947Q129r495j2911j9654m362J4189r66k043k438Q881M66P70o915
6390c8035J1159Q402J083J0702K933o276j4469k952N712O157L741K920N681K249
6376i93j5953q809k613J0723O187k607M300J8021n14j5361o702m41k556J4469
6362b849M779p116p80r922r849O881R453P700r69J81q539N062m957j849J41j167
6346a3800l50L973L637Q185l141m174J938O474k037n957J006M275k2860j1059
6332c3890q45J1173n29O424L144o919P117r735m31R220K946l311O752P973k429
6317c340j0867m546k250J730P47l199l102q27k014P392O858Q89K841J073j415
6302a0030j892p016q261q485O219Q765M256N60j089j671l846M45r223L318J4449
$$ plain form
6287 -13501 3639 -7143 -18140 -28534 -17572 -4335 -6894 -11883 -5238 -2110 -2303 -14987 -24874
6274 -24874 -24685 -15806 -16903 -15294 -5850 -3869 -2717 862 -1683 -4324 -2075 -1813 -1396 942 12317
6259 12317 5530 -1561 -5940 -9095 -6880 -13732 -14237 -18405 -5592 9661 9501 2539 872 -17913
6245 -17913 -27286 -25232 -16611 -20072 -14994 -17772 -9398 -18996 -16682 -7461 -11282 -13999 -10968 -1556 -4007
6230 -4007 -3955 -7440 10748 25441 23571 6711 9878 10189 2767 -12873 -22211 -12120 -1156 -12175
6216 -12175 -14274 -17029 -19871 -20504 -15490 -10844 -7536 2803 2229 -17662 -14557 -6465 -4091 -11554 -9701
6201 -9701 -1148 -12739 -18684 -22501 -26957 -24192 -15043 -24028 -17689 -18469 -22011 -22348 -13537 -17235 -17856
6186 -17856 -11269 -5155 -4818 -8649 -2078 2594 1646 8752 4359 2674 9906 8562 -5857 -20848 -18803
$$ packed form
6287a3501J7140j0782j0997j0394J0962J3237k559m989O645L128j93j2684r887
6274b4874J89Q879j097J609R444J981J152L579k545k641K249K62M17K338J1375
6259A2317o787p091m379l155K215o852n05m168J2813J5253j60o962j667j8785
6245a7913r373K054Q621l461N078k778Q374r598K314R221l821k717L031R412k451
6230d007N2l485J8188J4693j870j6860L167L11p422j5640r338J0091J0964j1019
6216a2175k099k755k842o33N014M646L308J0339n74j9891L105Q092K374p463J853
6201i701Q553j1591n945l817m456K765R149q985O339p80l542l37Q811l698o21
6186a7856O587O114L37l831O571M672r48P106m393j685P232j344j4419j4991K045
$$ plain form
6171 -18803 -2271 2795 6550 -119 -10494 -7245 3625 11405 14858 9428 -858 -6853 -6051 -2319
6157 -2319 -20624 -33746 -23954 -33190 -31781 -20224 -14243 -14192 -2365 9980 422 3068 3982 1086
6143 1086 -2878 7573 8014 4196 7382 5735 9267 19608 15372 1579 -1847 -2989 -1666 4598
6129 4598 3303 -9277 -23749 -15533 -20967 -31159 -25455 -22080 -21238 -18330 -18490 -20829 -29029 -18687
6115 -18687 -10399 -19129 -27062 -36847 -48972 -35076 -10097 4909 14143 21743 11813 -8135 -14670
6102 -14670 -26977 -25837 -17929 -7238 534 -18016 -39172 -27016 -542 12868 15671 -5200 -25167
6089 -25167 -24741 -7363 -3394 -6655 -12690 -21433 -31141 -33206 -13480 -19101 -13489 -1058 -13412 -5046
6075 -5046 6216 7415 10013 8847 3487 -1598 -17306 -23943 -8567 2175 3881 -6512 -1884 5958
$$ packed form
6171a8803J6532N066L755o669j0375L249J0870P780L453n430j0286n995Q02L732
6157b319j8305j3122R792r236J409J1557N981N1J1827J2345r558K646R14k896
6143A086l964J0451M41l818L186j647L532J0341m236j3793l426j142J323O264
6129D598j295j2580j4472Q216n434j0192N704L375Q42K908j60k339q200J0342
6115a8687Q288q730p933r785j2125J3896K4979J5006R234P600r930j9948o535
6102a4670j2307J140P908J0691P772j8550k1156J2156K6474J3410K803k0871j9967
6089b5167M26J7378L969l261o035q743r708k065J9726n621N612J2431j2354Q366
6075e046J1262J199K598j166n360n085j5708o637J5376J0742J706j0393M628P842
$$ plain form
6061 5958 -1553 -7701 -10468 -15357 -26363 -32032 -26895 -22948 -7969 -592 -1647 -6495 -3618 2575
6047 2575 257 -5288 -27527 -29408 -16620 -2608 890 -10136 -5976 2051 8733 15404 1244 -13916
6033 -13916 -15178 -12898 -16075 -19222 -11975 -7346 -12551 -6911 3712 10737 -443 -11817 -10231 -17944
6019 -17944 -17843 -16033 -18092 -5842 -17935 -25148 -17433 -14360 -7123 -2678 2550 -4027 -5312 443
6005 443 -10989 -2241 -2364 -15695 -12365 -17776 -26719 -14502 -9340 28 -5536 955 -9053 -18951
5991 -18951 -29896 -13829 7386 7601 -5726 -3189 23 5474 -1412 -13397 -16558 -16751 -22668 -20632
5977 -20632 -18322 -17023 -26499 -33632 -39440 -46863 -32607 -16527 -10480 -5806 -17521 -17427 -23102 -21900
5963 -21900 -20695 -17871 -19295 -21551 -17877 -5619 -11317 2336 9533 -5555 -8071 -19428 -22740 -13803
$$ packed form
6061E958p511o148k767m889j1006n669N137L947J4979P377j055m848K877O193
6047B575k318n545k2239j881J2788J4012L498j1026M160Q027O682O671j4160j5160
6033a3916j262K280l177l147P247M629n205N640J0623P025j1180j1374J586p713
6019a7944J01J810k059J2250j2093p213P715L073P237M445N228o577j285N755
6005D43j1432Q748j23j3331L330n411q943J2217N162R368n564O491j0008r898
5991a8951j0945J6067K1215K15j3327K537L212N451o886j1985l161j93n917K036
5977b0632K310J299r476p133n808p423J4256J6080O047M674j1715R4n675J202
5963b1900J205K824j424k256L674J2258n698J3653P197j5088k516j1357l312Q937
$$ plain form
5949 -13803 -12595 -8532 -23147 -37844 -37844 -30909 -17422 -241 -3092 -6539 -6018 4269 -8658 -12521
5935 -12521 -8106 -7399 -12049 -20315 -35301 -27264 -22174 -9575 -2880 -7454 -6503 -16238 -10438 -10467 -4895
5920 -4895 -11141 1371 1065 -11617 -7581 -8163 -11275 -931 -4545 -6454 -4313 -1541 -7652 -6261 -4678
5905 -4678 -14220 -16594 -19786 -27200 -9472 -420 -784 3658 -3783 1073 12271 8562 329 -4126 1162
5890 1162 4350 -1634 307 13215 19990 20023 7092 251 -2705 1939 11559 10985 -8233 -26208 -19641
5875 -19641 -19183 -21832 -12477 -5016 -9206 -1050 24892 35225 27519 20919 7445 12564 16566 -1190
5861 -1190 -17464 -20065 -29682 -20844 -6538 -9150 -2498 -13532 -16063 -6573 -11055 -20991 -19561 -15412
5847 -15412 -12277 3654 3467 752 -10442 -15538 -14654 -9225 -11943 -19860 -14673 -8133 -18944 -18492 -20125
$$ packed form
5949a3803J208M063j4615j4697%O935J3487J7181k851l447N21J0287j2927l863
5935a2521M415P07m650q266j4986Q037N090J2599O695m574R51r735N800k9N572
5920d895o246J2512l06j2682M036n82l112J0344l614j909K141K772o111J391J583
5905d678r542k374l192p414J7728R052l64M442p441M856J1198l709q233m455N288
5890A162L188n984J941J2908O775L3j2931o841k956M644R620n74j9218j7975O567
5875a9641M58k649R355P461m190Q156K5942J0333p706o600j3474N119M002j7756
5861a190j6274k601r617Q838J4306k612O652j1034k531R490m482r936J430M149
5847a5412L135J5931j87k715j1194n096Q84N429k718p917N187O540j0811M52j633
$$ plain form
5832 -20125 -12917 -13954 -24452 -28884 -10476 -5956 -10709 -15503 -31548 -29856 -17271 -8036 -7252 -5265
5818 -5265 -22163 -16755 -2875 -5799 -13017 -14974 -4592 7736 -9182 -9510 -10147 -2816 24356 28372
5804 28372 23493 33515 30338 12325 8483 412 -7450 -10659 -15795 -16140 -11801 -22241 -9649 20607
5790 20607 22865 6997 -1567 -3502 -3725 -697 3978 -4686 -9442 -6419 -9652 -28635 -48854 -43345
5776 -43345 -31974 -15068 -11678 -19180 -19345 -16236 -3910 -10417 -6456 -5037 -6896 -13318 -24298 -20447
5762 -20447 -3685 -4160 -4338 -15085 -25560 -16159 -10311 -2139 4208 17022 23200 25923 15305 3226
5748 3226 -14681 -17915 -21228 -10471 4702 18076 10312 13497 -1015 3099 26313 31042 17761
5735 17761 14137 18660 1756 -23295 -29052 -7869 -9898 -9613 -15715 -33594 -44179 -19151 -8164
$$ packed form
5832b0125P208j037j0498m432J8408M520m753m794j6045J692J2585R235P84J987
5818e265j6898N408J3880k924p218j957J0382J2328j6918l28o37P331K7172M016
5804B8372m879J0022l177j8013l842q071p862l209n136l45M339j0440J2592L0256
5790B0607K258j5868q564j935k23L028M675q664m756L023l233j8983k0219N509
5776d3345J1371J6906L390p502j65L109J2326o507L961J419j859o422j0980L851
5762b0447J6762m75j78j0747j0475R401N848Q172O347J2814O178K723j0618j2079
5748C226j7907l234l313J0757J5173J3374p764L185j4512M114K3214M729j3281
5735A7761l624M523j6904k5051n757K1183k029K85o102j7879j0585K5028J0987
$$ plain form
5722 -8164 -6378 -13148 -15458 -19164 -16874 -11474 -21552 -21417 -10966 5387 14509 14446 -5925 -22983
5708 -22983 -13445 -5630 -2004 2488 8832 8954 2791 19385 12517 -6838 -14685 -3559 -9024 -17543
5694 -17543 -12027 7159 16648 20055 17786 16725 22943 22602 22131 20255 9278 6728 2022 -14870
5680 -14870 -33128 -29693 -5510 16385 8047 -316 -1635 -10744 2321 14878 8375 8712 15186 12859
5666 12859 11894 16193 8546 9903 13776 17475 25835 16835 -5301 -11082 -3179 197 -8878 -18972
5652 -18972 -15105 -2207 -114 -3841 -7350 -12174 -12443 -20263 -20672 -18857 -18373 -8810 -12256 -26152 -25532
5637 -25532 -23307 -14944 -1542 8813 4382 1601 -1886 -3121 -4676 2535 4937 -11502 -17939 -14890
5623 -14890 -76 3790 -5794 -23377 -19903 -14696 -917 -471 15223 15239 18167 16376 15127 1202
$$ packed form
5722h164J786o770k310l706K290N400j0078J35J0451J6353R122o3k0371j7058
5708b2983R538P815L626M492O344J22o163J6594o868j9355p847J1126n465q519
5694a7543N516J9186R489L407k269j061O218l41m71j876j0977k550m706j6892
5680a4870j8258L435K4183K1895q338q363j319r109J3065J2557o503L37O474k327
5666A2859r65M299p647J357L873L699Q360r000k2136n781P903L376r075j0094
5652a8972L867J2898K093l727l509m824k69p820m09J815M84R563l446j3896O20
5637b5532K225Q363J3402J0355m431k781l487j235j555P211K402j6439o437L049
5623a4890J4814L866r584j7583L474N207J3779M46J5694J6K928j791j249j3925
$$ plain form
5609 1202 -6256 -10266 -14133 -12888 -2268 4162 15923 9245 7325 9304 5894 2367 10080 1867
5595 1867 -13523 -20450 -22158 -10536 -4600 -2738 -13668 -15757 -26311 -33292 -30116 -18152 -9673 -13316
5581 -13316 -1796 -1045 -21763 -19340 6314 7733 -7628 2477 14419 12610 -993 -13854 7847
5568 7847 24298 27745 22754 15929 -1832 -5896 -6444 -13039 -1858 2714 -1298 4852 15430 19601
5554 19601 9821 4524 6762 14296 16527 14841 1307 -8330 -4177 -2514 -8218 -10332 -13812 -11912
5540 -11912 -1258 5821 7316 -2575 -7859 -14481 -19714 -32028 -34233 -29869 -22757 -11279 -5208 -13023
5526 -13023 -17229 -8555 -4207 2922 14531 16350 5005 10519 6678 8258 6122 -12698 -6715 -2924
5512 -2924 5769 -5022 -8607 -8202 -14844 -32727 -38427 -26595 -6786 -7817 -8711 -11629 -22196 -27226
$$ packed form
5609A202p458m010l867J245J0620O430J1761o678j920J979l410l527P713q213
5595A867j5390o927j708J1622N936J862j0930k089j0554o981L176J1964Q479l643
5581a3316J1520P51k0718K423K5654J419j5361J0105J1942j809j3603j2861K1701
5568G847J6451L447m991o825j7761m064n48o595J1181M572m012O150J0578M171
5554A9601r780n297K238P534K231j686j3534r637M153J663n704k114l480J900
5540a1912J0654P079J495r891n284o622n233j2314k205M364P112J1478O071p815
5526a3023m206Q674M348P129J1609J819j1345N514l841J580k136j8820N983L791
5512b924Q693j0791l585M05o642j7883n700J1832J9809j031q94k918j0567n030
$$ plain form
5498 -27226 -27242 -9137 -6978 -7682 -11763 8665 18503 14014 5031 4005 -4189 -11648 -13536 -5184 -6725
5483 -6725 -1887 1718 -6680 -16620 -8374 -14365 -22223 -20397 -17927 -16787 -6045 -8360 -10285 -10199 -18953
5468 -18953 -7537 -3489 -12154 -15226 -7239 2019 1045 -6466 -11208 -20834 -24026 -12315 -14041 -2066
5454 -2066 8116 8895 5185 -2365 2147 2543 -10011 -16894 -7973 -9573 -15947 -6289 -169 -337 2678
5439 2678 -1620 4400 -283 -2633 1990 9313 3624 -14864 -26309 -23694 -24361 -14921 -5492 -10978 -9304
5424 -9304 -11365 -26340 -28200 -27133 -19158 -14009 -9829 -16844 -18335 -10559 -12597 -25204 -23689 -17070
5410 -17070 -6828 -14310 -23474 -7612 8477 5255 12123 11073 -3232 -6562 -1261 501 -3509 1006
5396 1006 2988 -3075 1846 15197 11724 22021 19385 -4173 4855 17517 19179 20098 12408 4598
$$ packed form
5498b7226j6J8105K159p04m081K0428R838m489q983j026q194p459j888Q352j541
5483f725M838L605q398r940Q246n991p858J826K470J140J0742k315j925Q6q754
5468a8953J1416M048q665l072P987R258r74p511m742r626l192J1711j726J1975
5454b066J0182P79l710p550M512L96j2554o883Q921j600o374R658O120j68L015
5439B678m298O020m683k350M623P323n689j8488j1445K615o67R440R429n486J674
5424i304k061j4975j860J067P975N149M180p015j491P776k038j2607J515O619
5410a7070J0242p482r164J5862J6089l222O868j050j4305l330N301J762m010M515
5396A006J982o063M921J3351l473J0297k636k3558R028J2662J662R19p690p810
$$ plain form
5382 4598 -5338 -12322 -17733 -21040 -7220 4698 3504 505 6995 6060 1628 -9729 -5818 830
5368 830 -9807 -21554 -23928 -6273 -1907 -10630 -18820 -17263 -5358 -4740 5489 3703 -1615 -772
5354 -772 -323 -18210 -19605 -15631 -19308 -13086 -9221 -15439 -17607 -8262 -4178 -9472 -12921 -24044 -20245
5339 -20245 -16302 -28703 -23726 -8557 -8274 -10037 -7471 -6483 -20304 -23576 -20701 -28555 -24090 -9004
5325 -9004 -32757 -40744 -23011 -15148 -4502 -3271 5231 -2689 -4620 -5414 -8292 -22205 -18225 -3389
5311 -3389 -8243 -19437 -5092 -6199 -13398 -3182 -1099 -6969 -12443 -8154 -7947 -7591 818 6741 -2280
5296 -2280 -6381 298 5785 -4025 -28340 -32723 -26163 -29451 -17767 1067 6653 5038 4220 -15869
5282 -15869 -31347 -13062 -10013 -8525 12566 15721 20106 11065 8948 9436 15400 17149 16222 11496
$$ packed form
5382D598r936o984n411l307J3820J1918j194k999O490r35m432j1357L911O648
5368H30j0637j1747k374J7655M366q723q190J557J1905O18J0229j786n318Q43
5354g72M49j7887j395L974l677O222L865o218k168R345M084n294l449j1123L799
5339b0245L943j2401M977J5169K83j763K566R88j3821l272K875p854M465J5086
5325i004k3753p987J7733P863J0646J231Q502p920j931p94k878j3913L980J4836
5311c389m854j1194J4345j107p199J0216K083n870n474M289K07L56Q409N923r021
5296b280m101O679N487r810k4315m383O560l288J1684J8834N586j615q18k0089
5282a5869j5478J8285L049J488K1091L155M385r041k117M88N964J749r27m726
$$ plain form
5268 11496 -625 7752 29341 33109 18895 11331 -2590 -7773 -8252 -13904 -25746 -22144 -17564 -3627
5254 -3627 -4220 -9783 -9456 9629 1181 -698 19077 17256 17965 19936 18209 13839 9930 8510 -2196
5239 -2196 -8573 -21831 -20127 -18967 -13545 -1996 1880 -2733 -12351 -18440 -21792 -21526 -8229 -9668
5225 -9668 -6523 -3106 -14523 -21497 -23033 -30529 -16439 -14667 -9820 -4953 5193 8521 16290 20837
5211 20837 22727 28221 17106 5962 6776 7653 1887 3358 -2584 -12344 -12866 -16605 -17005 -11373 -9545
5196 -9545 -13693 -6158 -703 -14691 -10942 -6006 271 2693 -244 -10559 -15715 -17319 -9966 7283
5182 7283 3531 -7221 -10168 -1061 5010 -5618 -11341 -14786 -20114 -12042 -323 -6206 -13949 -19175
5168 -19175 -17142 -6931 -5478 -6637 -1922 -3305 -10903 -18484 -23500 -12395 -5750 3708 -430 -5340
$$ packed form
5268A1496j2121Q377K1589L768j4214p564j3921n183m79n652j1842L602M580J3937
5254c627n93n563L27J9085q448j879J9775j821P09J971j727m370l909j420j0706
5239b196o377j3258J704J160N422J1549L876m613r618o089l352K66J3297j439
5225i668L145L417j1417o974j536p496J4090J772M847M867J0146L328P769M547
5211B0837J890N494j1115j1144Q14Q77n766J471n942r760n22l739m00N632J828
5196i545m148P535N455j3988L749M936O277K422k937j0315n156j604P353J7249
5182G283l752j0752k947R107O071j0628n723l445n328Q072J1719n883p743n226
5168a9175K033J0211J453j159M715j383p598p581n016J1105O645R458m138m910
$$ plain form
5154 -5340 -13897 -24908 -27172 -27476 -13989 -10634 -14392 -3640 -3744 -8236 -8007 -7349 -9419 -11151 -14253
5139 -14253 -5150 -6757 -6124 -11717 -23346 -22185 -9387 -11975 -3886 -2502 -10184 -18485 -8227 -1020
5125 -1020 -6124 5593 16846 23957 22469 15303 8682 -7405 -26697 -30355 -16202 -12154 -7628 13
5111 13 7336 -672 -4870 -21462 -24332 -27158 -24847 -20781 -20039 -21125 -14064 -3765 6295 -5689 4024
5096 4024 21490 8833 442 -1479 4928 8956 2979 -11190 -7057 -1097 -11920 6166 22533
5083 22533 22099 12867 723 2271 -6305 -4139 -6189 -6477 -6128 -594 -5936 -4544 -18155 -16674 -5777
5068 -5777 -14338 -24775 -16441 -2066 3246 -836 9717 16638 21551 33430 25799 21677 15786 8457
5054 8457 3216 -1965 -5149 4699 6362 3242 -5145 -258 -2895 -5619 -2180 -8866 -13057 10563 8279
$$ packed form
5154e340q557j1011k264l04J3487L355l758J0752j04m492K29O58k070j732l102
5139a4253R103j607O33n593j1629J161J2798k588Q089J384p682q301J0258P207
5125a020n104J1717J1253P111j488p166o621j6087j9292l658J4153M048M526P641
5111A3P323q008m198j6592k870k826K311M066P42j086P061J0299J0060j1984R713
5096D024J7466j2657q391j921O407M028n977j4169M133N960j0823J8086J6367
5083B2533m34r232j2144J548q576K166k050k88L49N534n342J392j3611J481J0897
5068e777q561j0437Q334J4375N312m082J0553O921M913J1879p631m122n891p329
5054H457n241n181l184R848J663l120q387M887k637k724L439o686m191K3620k284
$$ plain form
5039 8279 3891 23 3417 4341 5135 4651 -6109 -9053 -12347 -27190 -24796 -26892 -24053 -35220 -34628
5024 -34628 -20113 -1552 5648 -11588 -12054 -9937 -12229 -13210 -4342 7034 8872 4506 311 5722
5010 5722 771 -9632 -17005 -28837 -24100 -14815 -11821 -8678 -16476 -14955 -9053 -14913 -7320 5304
4996 5304 8524 7537 4530 2238 8039 -6299 -20239 -26285 -16030 -6536 -11825 2318 170 -3183
4982 -3183 1541 9367 7521 2102 2812 -10410 -18398 -13800 -18409 -17176 -11076 630 4397 -10329
4968 -10329 -3541 -7419 -5256 -1165 -7701 -2277 -13233 -16562 -6028 -22626 -22917 -17328 -3213 5804
4954 5804 9164 8717 1815 5644 22578 11087 -1592 -17425 -6205 14568 23438 19823 18564 24625
4940 24625 23418 24707 22333 19704 23377 7900 18 -4510 16848 25670 9195 7113 25504 30232
$$ packed form
5039H279m388l868L394R24P94m84j0760k944l294j4843K394k096K839j1167N92
5024c4628J4515J8561P200j7236m66K117k292r81Q868J1376J838m366m195N411
5010E722m951j0403p373j1832M737R285K994L143p798J521N902n860P593J2624
4996E304L220r87l007k292N801j4338j3940o046J0255R494n289J4143k148l353
4982c183M724P826j846n419P10j3222p988M598m609J233O100J1706L767j4726
4968a0329O788l878K163M091o536N424j0956l329J0534j6598k91N589J4115R017
4954E804L360m47o902L829J6934j1491j2679j5833J1220K0773Q870l615j259O061
4940B4625j207J289k374k629L673j5477p882m528K1358Q822j6475k082J8391M728
$$ plain form
4926 30232 23513 16448 1710 -1156 939 6835 5087 5411 -6076 -11818 2167 5294 2675 -4151
4912 -4151 -13777 -15644 -10308 -10068 -10827 -1960 6837 11668 26897 21470 14147 -5537 -14022 -7306 -12563
4897 -12563 -12092 -1873 -1446 -9175 -4414 8569 20631 20002 18129 24670 15254 20071 4099 -18734
4883 -18734 -23081 -16648 -18081 -9144 7808 14152 7115 1203 6013 25861 22463 1424 5269 14740
4869 14740 8086 -6568 -14998 -13279 1226 15177 23872 20951 8371 1234 2235 -4827 857 1110
4855 1110 -4321 4721 4063 -3271 -21679 -20387 -17043 2657 10684 7322 10405 8964 6724 4573 10750
4840 10750 19056 11948 -1115 290 8108 5999 -2487 9388 26176 38674 29620 11741 1239
4827 1239 15005 15623 27533 38321 43872 40939 32484 18590 15075 8967 3725 -13792 -7356 -4416
$$ packed form
4926C0232o719p065j4738k866K095N896j748L24j1487n742J3985L127k619o826
4912d151r626j867N336K40p59Q867Q797M831J5229n427p323j9684q485O716n257
4897a2563M71J0219M27p729M761J2983J2062o29j873O541r416M817j5972k2833
4883a8734m347O433j433Q937J6952O344p037n912M810J9848l398k1039L845R471
4869A4740o654j4654q430J719J4505J3951Q695k921j2580p137J001p062N684K53
4855A110n431R042o58p334j8408J292L344J9700Q027l362L083j441k240k151O177
4840A0750Q306p108j3063J405P818k109q486J1875J6788J2498r054j7879j0502
4827A239J3766O18J1910J0788N551k933q455j3894l515o108n242j7517O436K940
$$ plain form
4813 -4416 -13171 -20866 -19845 -16778 -13375 -7844 -1426 6284 3829 4334 -842 6650 10694 11659 15600
4798 15600 24757 25885 18861 12555 15634 22985 30760 36595 31842 22980 24522 10137 4966 -3069
4784 -3069 -9550 -12932 -8257 459 1637 -3045 -11216 -16809 -15293 -5101 -3465 6804 8645 7855 595
4769 595 -6804 -319 9028 14259 8585 1411 -7231 -9970 5315 2073 2131 5542 -1803 5922 9016
4754 9016 9646 13568 7986 1430 -4149 -175 7107 -345 -5939 -2186 -4762 8140 9100 10241 3886
4739 3886 -4494 702 10303 4214 6122 5703 -6801 1305 7610 933 -12063 -7455 16410 32884
4725 32884 41169 25284 31159 24670 8915 -5573 -3030 -3309 -6536 399 5099 2058 2318 22019
4711 22019 28984 15061 864 -5222 -7344 -16121 -10554 -3472 -13718 -22602 -12602 -3469 -7749 -1130
$$ packed form
4813d416q755p695J021L067L403N531O418P710k455N05n176P492M044R65L941
4798A5600R157J128p024o306L079P351P775N835m753q862J542j4385n171q035
4784c069o481l382M675Q716J178m682q171n593J516J0192J636J0269J841p90p260
4769E95p399O485R347N231n674p174q642k739J5285l242N8L411p345P725L094
4754I016O30L922n582o556n579L974P282p452n594L753k576J2902R60J141o355
4739C886q380N196R601o089J908m19j2504Q106O305o677j2996M608K3865J6474
4725C2884Q285j5885N875o489j5755j4488K543k79l227O935M700l041K60J9701
4711B2019O965j3923j4197o086k122q777N567P082j0246q884J0000R133m280O619
$$ plain form
4697 -1130 15309 22862 20781 -2378 2177 5897 -4890 -189 -906 -4604 -23130 -26134 -6206 2944
4683 2944 -2614 -3595 -10899 -3846 1875 -859 -14179 -27841 -20138 -13651 -16039 -9289 -7086 10682
4669 10682 24778 17926 -564 -20160 -16167 -24996 -3951 14674 17323 15236 8589 15575 13153
4656 13153 5900 5686 4135 1962 -4399 4956 -786 5077 14931 14995 18409 14894 7150 -194 -806 -4228
4640 -4228 -18453 -15447 -1852 20199 18554 15188 3785 -6573 -16215 -8959 3424 6521 196
4627 196 4484 11531 11848 10263 5275 4449 7170 8024 14335 22528 17158 15683 7848 2148 -1611 -2495
4611 -2495 -1002 -16133 -14734 2021 21097 30008 14007 -2518 8267 14160 12137 12993 9359 9018
4597 9018 4237 -5311 -5058 -13977 -20698 -17940 -2610 -3941 -4251 4049 12443 9088 5708 8046 5128
$$ packed form
4697a130J6439P553k081k3159M555L720j0787M701p17l698j8526l004J9928R150
4683B944n558r81p304P053N721k734j3320j3662P703O487k388O750K203J7768
4669A0682J4096o852j8490j9596L993q829K1045J8625K649k087o647O986k422
4656A3153p253k14j551k173o361R355n742N863R854O4L414l515p744p344o12l422
4640d228j4225L006J3595K2051j645l366j1403j0358r642P256J2383L097o325
4627A96M288P047L17j585m988q26K721Q54O311Q193n370j475p835n700l759q84
4611b495J493j5131J399J6755J9076Q911j6001j6525J0785N893k023Q56l634l41
4597I018m781r548K53q919o721K758J5330j331l10Q300Q394l355l380K338k918
$$ plain form
4582 5128 3218 6932 11949 8604 15652 16905 9451 14216 11039 110 -536 11984 12422 -8105 227
4567 227 18535 29230 19451 5108 9016 1025 9185 1961 -14484 -17050 -11545 -2340 5084 860
4553 860 -3622 -5078 -767 -8651 -22748 -15477 -1758 -1772 -27207 -33572 -18730 -9164 -16781 -4580
4539 -4580 7617 13724 15875 15187 -4326 -9338 -931 346 -14008 -9224 -357 11346 13362 15417
4525 15417 30695 29304 22591 18757 7820 868 -8281 -10026 -16766 4040 8696 -6460 -10852 -4678
4511 -4678 10595 7030 4286 7161 5613 8658 6145 5264 3185 10323 825 -14669 -23977 -22372 -16977
4496 -16977 -5679 581 -1278 -6153 13887 23474 23752 11603 7078 12186 14998 13103 11358 11068
4482 11068 5633 -8730 759 13530 2108 -3916 -3575 155 4985 7275 11632 6920 -248 -1356
$$ packed form
4582E128j910L714N017l345P048J253p454M765l177j0929o46J2520M38k0527Q332
4567B27J8308J0695r779j4343L908p991Q160p224j6445k566N505R205P424m224
4553H60m482j456M311p884j4097P271J3719j4k5435o365J4842R566p617J2201
4539d580J2197O107K151o88j9513n012Q407J277j4354M784Q867J1703K016K055
4525A5417J5278j391o713l834j0937o952r149j745o740K0806M656j5156m392O174
4511d678J5273l565k744K875j548L045k513q81k079P138r498j5494r308J605N395
4496a6977J1298O260j859m875K0040R587K78j2149m525N108K812j895j745k90
4482A1068n435j4363R489J2771j1422o024L41L730M830K290M357m712p168j108
$$ plain form
4468 -1356 -3925 -1060 7268 5137 -860 -9025 295 14426 15228 8207 3798 17013 13799 13546 9397
4453 9397 11162 9647 1007 1068 11475 6551 14664 16148 13840 4737 2227 3307 -3281 -6118 -4446
4438 -4446 4561 11730 12238 15584 19743 9539 15761 16357 11115 15774 2632 -6549 -14183 -5019 -2716
4423 -2716 9203 19203 24298 24541 24218 12504 -11313 -12917 -12620 -9929 3071 21860 19281 9239
4409 9239 8430 5616 9991 16534 9824 -6371 -12013 -6507 -5327 -1368 4262 6902 1580 -9679 -7774
4394 -7774 7767 14276 6887 10815 6713 1696 -4416 -16437 -22873 -23410 -36628 -38226 -29052 -18205
4380 -18205 -18743 -12214 9942 11683 -455 -1230 -11756 -13139 -28074 -28427 -14660 -7771 -5287 -1528
4366 -1528 -1367 -13090 -12211 -4497 -12318 -13493 -609 11773 15003 13654 11233 12917 13050 15097 5021
$$ packed form
4468a356k569K865Q328k131n997q165R320J4131Q02p021m409J3215l214k53m149
4453I397J765j515q640O1J0407m924Q113J484k308r103k510J080o588k837J672
4438d446R007P169N08L346M159j0204O222N96n242M659j3142r181p634R164K303
4423b716J1919J0000N095K43l23j1714k3817j604K97K691J3000J8789k579j0042
4409I239q09k814M375O543o710j6195n642N506J180L959N630K640n322j1259J905
4394g774J5541O509p389L928m102n017o112j2021o436n37j3218j598R174J0847
4380a8205n38O529K2156J741j2138p75j0526j383j4935l53J3767O889K484L759
4366a528J61j1723Q79P714p821j175J2884J2382L230j349k421J684J33K047j0076
$$ plain form
4351 5021 7970 -1195 4671 11896 17571 8420 3598 7459 2941 6103 -2576 -12979 -11541 -13208 -9093
4336 -9093 -14528 -18276 5019 21495 7995 10959 16107 9025 1475 -1309 51 -6701 -4995 -484
4322 -484 -532 6015 20243 19404 5774 1783 2386 6567 20073 15028 15526 21932 15130 5764 5408 1876
4306 1876 -3811 -5593 -613 -6227 -8283 9000 26961 10711 17825 15143 11454 9277 13716 -5951
4292 -5951 -16560 -28192 -25524 -14130 480 -3580 -17090 -18162 -6037 2385 -2343 -6572 -11889
4279 -11889 -31105 -26014 -10435 -3026 -526 -4155 -6260 -1855 -3299 -12860 -16210 -8292 -532 -7704
4265 -7704 -5356 -587 541 4882 4633 17970 15378 13339 15752 13548 3716 -12056 -2626 9750
4251 9750 -2324 -11306 -2838 -7261 -9653 -4986 4734 3560 -5663 -6065 -4709 18898 24844 12005
$$ packed form
4351E021K949r165N866P225N675r151m822L861m518L162q679j0403J438j667M115
4336i093n435l748K3295J6476j3500K964N148p082p550k784J360o752J706M511
4322d84m8O547J4228q39j3630l991O03M181J3506n045M98O406o802r366l56l532
4306A876n687j782M980n614k056J7283J7961j6250P114k682l689k177M439j9667
4292e951j0609j1632K668J1394J4610m060j3510j072J2125Q422m728m229n317
4279a1889j9216N091J5579P409K500l629k105M405j444r561l350P918P760p172
4265g704K348M769J128M341k49J3337k592k039K413k204r832j5772R430J2376
4251I750j2074q982Q468m423k392M667R720j174r223m02J356K3607N946j2839
$$ plain form
4237 12005 -949 -3609 -729 -6938 -17003 -13880 -6560 -2976 -2449 3043 5375 2131 -24188 -21009
4223 -21009 -13939 -2013 8400 6470 9272 -345 -5982 -2080 -13775 -15241 804 8711 10766 7084
4209 7084 4833 5280 -943 -6805 -15949 -12760 -4832 -3933 -1902 -6730 -5307 -7931 -10590 -6223 4821
4194 4821 15127 14154 5912 3246 1456 -14342 -23250 -18597 -1343 7385 2164 7895 -848 -8994
4180 -8994 2974 17110 10870 12698 17163 30540 34981 35305 29475 16044 10252 10916 20753 14576
4166 14576 8561 8236 9764 11272 -2716 -8205 -13444 -9119 -21713 -34427 -12196 -1768 -3052 802
4152 802 2975 4715 851 1250 8821 10438 127 -13737 -21839 -14201 -13160 -7992 3905 12195 10584
4137 10584 2527 -4644 5908 1848 2395 13292 5718 -5237 -6244 -9380 -8073 4897 9933 4834
$$ packed form
4237A2005j2954k660K880o209j0065L123P320L584N27N492K332l244k6319L179
4223b1009P070J1926J0413j930K802r617n637L902j1695j466J6045P907K055l682
4209G084k251M47o223n862r144L189P928Q99K031m828J423k624k659M367J1044
4194D821J0306r73q242k666j790j5798q908M653J7254Q728n221N731q743q146
4180h994J1968J4136o240J828M465J3377M441L24n830j3431n792O64R837o177
4166A4576o015l25J528J508j3988n489n239M325j2594j2714K2231J0428j284L854
4152H02K173J740l864L99P571J617j0311j3864q102P638J041N168J1897Q290j611
4137A0584q057p171J0552m060N47J0897p574j0955j007l136J307J2970N036n099
$$ plain form
4123 4834 -3695 -4434 -3374 -13025 -17287 -12363 -13632 -3052 -2392 -16202 -3329 16211 15778 11850 8574
4108 8574 9826 -1549 -12540 1464 1354 -10525 -12449 -22051 -23145 -20537 -2449 2879 11225 4908
4094 4908 -10298 -23562 -14396 4288 10260 6337 -4135 -2535 13176 13952 26147 23645 9778
$$ packed form
4123D834q529p39J060r651m262M924j269J0580O60j3810J2873J9540m33l928l276
4108H574J252j1375j0991J4004j10j1879j924r602j094K608J8088N328Q346o317
4094D908j5206j3264R166J8684N972l923j0472J600J5711P76J2195k502j3867
$$ [...]
##END NTUPLES=NMR SPECTRUM
##END=
