##TITLE=Analysis number 317468
Compound Code cc 43209
Book Reference 467/12
Project Code qc-cat
Chemist Name benw
##JCAMPDX= 6.0         $$ Bruker NMR JCAMP-DX V2.0
##DATA TYPE= NMR SPECTRUM
##DATA CLASS= NTUPLES
##ORIGIN= Bruker BioSpin GmbH
##OWNER= nmr
$$ XWIN-NMR		Version 3.5
$$ Tue Feb 21 11:41:39 2006 GMT Standard Time (UT+0h)  MAYBRIDGE\nmr@NMR_250MHZ
##.OBSERVE FREQUENCY= 250.131544655141
##.OBSERVE NUCLEUS= ^1H
##.ACQUISITION MODE= SIMULTANEOUS (DQD)
##.ACQUISITION SCHEME= undefined
##.AVERAGES= 16
##.DIGITISER RES= 18
##SPECTROMETER/DATA SYSTEM= dpx250
##.PULSE SEQUENCE= zg30
##.SOLVENT NAME= DMSO
##.SHIFT REFERENCE= (INTERNAL, DMSO, 0, 16.522)
##AUDIT TRAIL= $$ (NUMBER, WHEN, WHO, WHERE, WHAT)
$$ ##TITLE= Audit trail, XWIN-NMR		Version 3.5
$$ ##JCAMPDX= 5.01
$$ ##ORIGIN= Bruker BioSpin GmbH
$$ ##OWNER= nmr
$$ C:\u/data/dgb/nmr/ADRS/16530/pdata/1/auditp.txt
$$ ##AUDIT TRAIL=  $$ (NUMBER, WHEN, WHO, WHERE, WHAT)
(   1,<2006-02-21 11:41:01.88 +000>,<MAYBRIDGE\nmr>,<NMR_250MHZ>,
      <created by zg, POWCHK disabled, PULCHK disabled
       configuration hash MD5:
       84 BC 41 DB A1 6E 1D 46 DA 25 12 A5 C1 ED C5 3A
       data hash MD5: 64K
       93 70 AE CC 9B 2D 19 00 13 FA BC 18 1E FD 5B E5>)
(   2,<2006-02-21 11:41:20.05 +000>,<MAYBRIDGE\nmr>,<NMR_250MHZ>,
      <Start of raw data processing
       ef LB = 0.3 FT_mod = 6 PKNL = 1 SI = 32K 
       data hash MD5: 32K
       62 65 29 CE 81 0E F2 82 B7 A2 2D 74 48 DC 67 62>)
(   3,<2006-02-21 11:41:24.20 +000>,<MAYBRIDGE\nmr>,<NMR_250MHZ>,
      <apk 
       data hash MD5: 32K
       ED 78 65 5B 6A 9C 1D 3C B6 5C EB 68 6F D8 35 B2>)
(   4,<2006-02-21 11:41:25.39 +000>,<MAYBRIDGE\nmr>,<NMR_250MHZ>,
      <abs ABSG = 5 
       data hash MD5: 32K
       37 B9 9A 9F 40 D1 9D 7C C1 24 AC 44 15 F7 FD 30>)
$$ ##END=
$$ 
$$ hash MD5
$$ FF 30 84 27 17 70 F5 CE 1E FF B5 87 2F 90 F6 A5
##$RELAX= 
##$RELAX= 
##$RELAX= 
##$RELAX= 
##$RELAX= 
##$RELAX= 
##$RELAX= 
$$ Bruker specific parameters
$$ --------------------------
##$DU= <C:\u>
##$EXPNO= 16530
##$NAME= <ADRS>
##$PROCNO= 1
##$TYPE= <nmr>
##$USER= <dgb>
##$AMP= (0..31)
100 100 100 100 100 100 100 100 100 100 100 100 100 100 100 100 100 100 
100 100 100 100 100 100 100 100 100 100 100 100 100 100 
##$AQSEQ= 0
##$AQ_mod= 3
##$AUNM= <au_zg>
##$AUTOPOS= <23 >
##$BF1= 250.13
##$BF2= 250.13
##$BF3= 250.13
##$BF4= 250.13
##$BF5= 500.13
##$BF6= 500.13
##$BF7= 500.13
##$BF8= 500.13
##$BYTORDA= 1
##$CFDGTYP= 0
##$CFRGTYP= 5
##$CHEMSTR= <none>
##$CNST= (0..31)
1 1 145 1 1 1 1 1 1 1 1 1 1 1 1 1 1 1 1 1 1 1 1 1 1 1 1 1 1 1 1 1 
##$CPDPRG= <>
##$CPDPRG1= <>
##$CPDPRG2= <>
##$CPDPRG3= <>
##$CPDPRG4= <mlev>
##$CPDPRG5= <mlev>
##$CPDPRG6= <mlev>
##$CPDPRG7= <mlev>
##$CPDPRG8= <mlev>
##$CPDPRGB= <>
##$CPDPRGT= <>
##$D= (0..31)
0 1 0 0 0 0 0 0 0 0.06 0 0 0 0 0 0 0.0002 0 0 0 0 0 0 0 0 0 0 0 0 0 0 
0 
##$DATE= 1140522060
##$DBL= (0..7)
120 120 120 120 120 120 120 120 
##$DBP= (0..7)
150 150 150 150 150 150 150 150 
##$DBP07= 0
##$DBPNAM0= <>
##$DBPNAM1= <>
$$ [...]
##$SUBNAM7= <"">
##$SUBNAM8= <"">
##$SUBNAM9= <"">
##$SW= 20.6930455092707
##$SWIBOX= (0..15)
0 0 3 0 0 0 0 0 0 0 0 0 0 0 0 0 
##$SW_h= 5175.983436853
##$TD= 65536
##$TD0= 1
##$TE= 294.16
##$TE2= 300
##$TE3= 300
##$TEG= 300
##$TL= (0..7)
0 120 120 120 120 120 120 120 
##$TP= (0..7)
150 150 150 150 150 150 150 150 
##$TP07= 0
##$TPNAME0= <>
##$TPNAME1= <>
##$TPNAME2= <>
##$TPNAME3= <>
##$TPNAME4= <>
##$TPNAME5= <>
##$TPNAME6= <>
##$TPNAME7= <>
##$TPOAL= (0..7)
0.5 0.5 0.5 0.5 0.5 0.5 0.5 0.5 
##$TPOFFS= (0..7)
0 0 0 0 0 0 0 0 
##$TUNHIN= 0
##$TUNHOUT= 0
##$TUNXOUT= 0
##$USERA1= <user>
##$USERA2= <user>
##$USERA3= <user>
##$USERA4= <user>
##$USERA5= <user>
##$V9= 5
##$VALIST= <valist>
##$VCLIST= <CCCCCCCCCCCCCCC>
##$VD= 0
##$VDLIST= <DDDDDDDDDDDDDDD>
##$VPLIST= <PPPPPPPPPPPPPPP>
##$VTLIST= <TTTTTTTTTTTTTTT>
##$WBST= 1024
##$WBSW= 4
##$XGAIN= (0..3)
0 0 0 0 
##$XL= 0
##$YL= 0
##$YMAX_a= 341528
##$YMIN_a= -524393
##$ZGOPTNS= <>
##$ZL1= 120
##$ZL2= 120
##$ZL3= 120
##$ZL4= 120
##$ABSF1= 16.522
##$ABSF2= -4.171173
##$ABSG= 5
##$ABSL= 3
##$ALPHA= 0
##$AQORDER= 0
##$ASSFAC= 0
##$ASSFACI= 0
##$ASSFACX= 0
##$ASSWID= 0
##$AUNMP= <proc_1d>
##$AZFE= 0.1
##$AZFW= 0.1
##$BCFW= 0
##$BC_mod= 0
##$BYTORDP= 0
##$COROFFS= 0
##$CY= 12.5
##$DATMOD= 1
##$DC= 0
##$DFILT= <>
##$DTYPP= 0
##$F1P= 14.0000005364418
##$F2P= -0.99999901652339
##$FCOR= 0.5
##$FTSIZE= 32768
##$FT_mod= 6
##$GAMMA= 0
##$GB= 0
##$INTBC= 1
##$INTSCL= 1
##$ISEN= 128
##$LB= 0.3
##$LEV0= 0
##$LPBIN= 0
##$MAXI= 10000
##$MC2= 0
##$MEAN= 0
##$ME_mod= 0
##$MI= 0
##$NCOEF= 0
##$NC_proc= -5
##$NLEV= 6
##$NOISF1= 0
##$NOISF2= 0
##$NSP= 0
##$NTH_PI= 0
##$NZP= 0
##$OFFSET= 16.522
##$PC= 1
##$PHC0= 237.8698
##$PHC1= 6.904715
##$PH_mod= 1
##$PKNL= yes
##$PPARMOD= 0
##$PSCAL= 4
##$PSIGN= 0
##$REVERSE= no
##$SF= 250.13
##$SI= 32768
##$SIGF1= 0
##$SIGF2= 0
##$SINO= 400
##$SIOLD= 32768
##$SREGLST= <1H.DMSO>
##$SSB= 0
##$STSI= 32768
##$STSR= 0
##$SW_p= 5175.98343685301
##$SYMM= 0
##$S_DEV= 0
##$TDeff= 65536
##$TDoff= 0
##$TI= <Analysis number 999999
Compound Code 99
Book Reference 9
Project Code 9>
##$TILT= no
##$TM1= 0
##$TM2= 0
##$TOPLEV= 0
##$USERP1= <user>
##$USERP2= <user>
##$USERP3= <user>
##$USERP4= <user>
##$USERP5= <user>
##$WDW= 1
##$XDIM= 32768
##$YMAX_p= 526982362
##$YMIN_p= -648298
$$ End of Bruker specific parameters
$$ ---------------------------------
##NTUPLES= NMR SPECTRUM
##VAR_NAME=  FREQUENCY,     SPECTRUM/REAL,   SPECTRUM/IMAG
##SYMBOL=    X,             R,               I
##VAR_TYPE=  INDEPENDENT,   DEPENDENT,       DEPENDENT
##VAR_FORM=  AFFN,          ASDF,            ASDF
##VAR_DIM=   32768,         32768,           32768
##UNITS=     HZ,            ARBITRARY UNITS, ARBITRARY UNITS
##FACTOR=    0.157963299565203, 1,           1
##FIRST=     4132.6476996994, 0,             0
##LAST=      -1043.33573715361, 0,           0
##MIN=       -1043.33573715361, -648298,     0
##MAX=       4132.6476996994, 526982362,     0
$$ Real data points
##PAGE= N=1
##DATA TABLE= (X++(R..R)), XYDATA
$$ [...]
19845F9441k3461j49940N2139J08585P3362j6480P1928l9426j85740K8991Q4857
$$ 69441 45980 -103960 -51821 56764 130126 113646 185574 146148 -39592 -10601 74256
19834G4256n8131n7841K413j51232q7547L2113k3516J0516K57991J76778j19024
$$ 74256 16125 -41716 -39303 -190535 -278082 -245969 -269485 -258969 -978 175800 56776
19823E6776j00227P8023j2179n8902L8813n1016j029J13518J5386n9306o5630
$$ 56776 -43451 34572 22393 -36509 2304 -48712 -49741 63777 79163 19857 -45773
19812d5773j11179L5721R9949j1718K5705n7084p4936K4271N5253J82675j30888
$$ -45773 -156952 -121231 -21282 -33000 -7295 -64379 -139315 -115044 -59791 122884 -8004
19801h004k50923j62034J46186J43758J97350J01998j22884o8142m411k2969p7760
$$ -8004 -258927 -420961 -274775 -131017 66333 168331 45447 -22695 -27106 -50075 -127835
19790a27835L0547K4790j4205R7871q01p1318K223k1178K60515J27315j334K484
$$ -127835 -97288 -72498 -86703 11168 10367 -60951 -58728 -79906 180609 307924 306590 309074
19778C09074o8418k55225j1133P8712J2064l7388M260O1406k7864j15560L6928
$$ 309074 240656 -14569 -25702 53010 65074 27686 31946 93352 65488 -50072 -13144
19767a3144j0462j83980o9676K56711L08343K4228j06189q9175j05766o9696j38935
$$ -13144 -23606 -207586 -277262 -20551 287792 312020 205831 116656 10890 -58806 -197741
19756a97741Q4018Q9312R6831n2474j49455L6746J57755q6767k14799m009R8970
$$ -197741 -113723 -24411 72420 19946 -129509 -92763 64992 -21775 -236574 -240583 -141613
19745a41613j95834l4115J05733O4651J10031n2669Q8687K7211O1772J17142j40853
$$ -141613 -337447 -371562 -265829 -201178 -91147 -143816 -55129 -27918 33854 150996 10143
19734A0143Q0744r1438l8516Q0356J5566J1914r8378K6576O2283M1900L6558r6987
$$ 10143 90887 -551 -39067 41289 56855 68769 -29609 -3033 59250 101150 137708 40721
19722D0721m0571j96838J08639J09299j95360j63827L4861K98255J12987q1477
$$ 40721 150 -196688 -88049 21250 -174110 -337937 -303076 -4821 108166 26689
19712B6689J68879K9305o3489J31551J7250m4572K9805J04109l1556l67622j06144
$$ 26689 195568 224873 161384 292935 310185 265613 295418 399527 367971 349 -105795
19701a05795O2539J09819J01393K4894L7640O8831m8173j16105j41313j39349
$$ -105795 -43256 66563 167956 192850 230490 299321 251148 135043 -6270 -145619
19691a45619J22321P5225j888r1538r0499j0391Q7053p5757j30891K2973j35720
$$ -145619 -23298 51927 50039 -41499 -131998 -142389 -55336 -131093 -261984 -239011 -374731
19680c74731j5029J02808M7647J08018P4235o259J29030N8844j35105Q2564K9106
$$ -374731 -389760 -286952 -239305 -131287 -57052 -63311 65719 124563 -10542 72022 101128
19669A01128j20358P4724l7307l8966j85950n6973J11653J09024p1006n2635j8366
$$ 101128 -19230 55494 18187 -20779 -206729 -263702 -152049 -43025 -114031 -166666 -185032
19658a85032J54857P5382l3542j80450j07206J71787k7283L4728J09042J88227
$$ -185032 -30175 45207 11665 -168785 -275991 -104204 -131487 -96759 12283 200510
19648B00510o4399k31187k9422p046n0797Q3193J52792O6160M9329q27J51907
$$ 200510 136111 -95076 -124498 -131544 -182341 -99148 53644 119804 169133 168306 320213
19637C20213K51445J7723n0939j97046j34389j77192p1729j23507N1119j16560
$$ 320213 571658 589381 538442 341396 207007 29815 -41914 -165421 -114302 -230862
19627b30862K29875Q5585K4210m9990q6947N8580P3520J1608j97564m5333j29470
$$ -230862 -987 84598 108808 58818 -28129 30451 103971 115579 -81985 -127318 -256788
19616b56788K6082K23752N7164q0736K2176l2326N9810k4635p5909L8526l6132
$$ -256788 -230706 -6954 50210 -30526 -8350 -40676 19134 -5501 -81410 -42884 -79016
19605g9016Q4737j32569J70795J34019N8131O7674n3751m4395n4834r3937q5983
$$ -79016 5721 -126848 43947 177966 236097 303771 250020 205625 150791 56854 -29129
19594b9129M9518N57J634J43087N8499lj61073J51294K7516J20758L9762j16495
$$ -29129 20389 20946 22580 165667 224166 224163 63090 214384 241900 362658 402420 285925
19582B85925j22327j21573l1278p4126j1467k4189j58624K1021k5934p2174J21186
$$ 285925 163598 42025 10747 -63379 -74846 -99035 -257659 -236638 -262572 -334746 -213560
19571b13560K14015J60255l8992j73080j1669k0599M45K01837J51510n764J1206
$$ -213560 455 160710 121718 -51362 -63031 -83630 -83185 118652 270162 264398 275604
19560B75604k6920n8901n5083P9742o847J5758M7183j18542j10255O4570j17311
$$ 275604 248684 189783 134700 214442 207595 223353 270536 151994 41739 106309 -11002
19549a1002O6050K34445J35767m1568k9166k6349j9327J55967O5575J02415N5377
$$ -11002 55048 289493 425260 383692 354526 328177 308850 464817 530392 632807 688184
19538F88184K16911m5057l5670P3186M0631K06790o446k48702k15029r6895j459
$$ 688184 905095 860038 824368 897554 938185 1144975 1138529 889827 674798 577903 576444
19527E76444J76506J78444k4176j92676q7984j39978M9876L0661r7744j52903
$$ 576444 752950 931394 907218 714542 626558 486580 536456 567117 469373 316470
19517C16470k15748r2427R9307j23320n7756J98161K6979j01035q7134K07235
$$ 316470 100722 8295 107602 -15718 -73474 124687 151666 50631 -36503 170732
19507A70732p2084j09091o7446j490P7923J36213p2137n5564j73353J25327J3462
$$ 170732 98648 -10443 -77889 -79379 -1456 134757 62620 7056 -166297 -40970 -27508
19496b7508Q2583n4361q8538M6454K25534l9201j07037j4047j58712K8618J74222
$$ -27508 55075 714 -87824 -41370 184164 144963 37926 23879 -134833 -106215 68007
19485F8007n7152j53547R2535K0227j55311K4375J88917J10291j6805l862q3946
$$ 68007 10855 -142692 -50157 -29930 -185241 -160866 28051 138342 121537 117675 33729
19474C3729j06335Q8509J26568m4550j01393n8204p4037M0294r180r7981J41020
$$ 33729 -72606 15903 142471 97921 -3472 -61676 -135713 -95419 -104599 -202580 -61560
19463f1560j00152J02000J38422l5031r4366l8823j17419N2219J14242K3460l7306
$$ -61560 -161712 -59712 78710 43679 -50687 -89510 -206929 -154710 -40468 -17008 -54314
19452e4314M6317j4303j62395O6299K71402l4276l7208M116j64350p1845P932
$$ -54314 -7997 -22300 -184695 -118396 153006 118730 81522 85638 -78712 -150557 -142625
19441a42625j5468n798P9266R7301m4801N0571L3664j08287r0328O0570O6347
$$ -142625 -158093 -163891 -84625 12676 -32125 18446 52110 -56177 -146505 -85935 -19588
19430a9588p538N2458K2792J2720j54272K3750P6953R1679J6672j86071j26789
$$ -19588 -27126 25332 48124 60844 -93428 -69678 7275 98954 115626 -70445 -197234
19419a97234L0831j0045J11717M6570q6327o7789l8152J86336J01749q7985J6080
$$ -197234 -166403 -176448 -64731 -18161 -104488 -172277 -210429 -24093 77656 -10329 5751
19408E751j18298j27900o167J6183Q5109J29922p7100j16459L0674O5018J93615
$$ 5751 -112547 -240447 -246614 -230431 -145322 -15400 -92500 -208959 -178285 -113267 80348
19397H0348O3444j76532M2599o5093o2521j09933O806Q9612m0745N1732K9010
$$ 80348 143792 -32740 9859 -55234 -117755 -227688 -220882 -131270 -172015 -120283 -91273
19386i1273J95961K38048j72441p1371j5034l6979j4493k0071j82791m7022L838
$$ -91273 104688 342736 170295 98924 83890 46911 32418 12347 -170444 -217466 -213628
19375b13628J28897J29026J13911O0204j84095m1066J37113J52268j83432n7971
$$ -213628 -84731 44295 158206 218410 34315 -6751 130362 282630 99198 41227
19365D1227j07435j47884J21419J63835m411j27079p2101N0674q1507O9822J3495
$$ 41227 -66208 -214092 -92673 71162 66751 -60328 -132429 -81755 -163262 -93440 -79945
19354g9945J35312M5475M9335j1715K8305l8555M9636M0167l61854m11607J81872
$$ -79945 55367 100842 150177 138462 166767 128212 177848 218015 -143839 -555446 -373574
19343c73574L62413J355K9566k50365m3399Q3770j4501j11070J3680L6493J9904
$$ -373574 -11161 -9806 19760 -230605 -274004 -190234 -204735 -315805 -302125 -265632 -245728
19332b45728J64043J35614J26767P1480J15630k27126k51751j3494L1174P35m729
$$ -245728 -81685 53929 180696 252176 367806 140680 -111071 -124565 -93391 -92656 -97385
19321i7385J37424j7659j14767k4532j9937r249J37170J16886N6851n0169j05366
$$ -97385 40039 22380 -92387 -116919 -136856 -146105 -8935 107951 164802 114633 9267
19310I267l3316K9014K23959J61336L2704o2857j73048j03919j45724j69096J66458
$$ 9267 -24049 4965 228924 390260 422964 360107 187059 83140 -62584 -231680 -65222
19299f5222J85945K2088j8349R7880k7644q3176J05558J8671j10273l6424L3379
$$ -65222 120723 142811 124462 222342 194698 111522 217080 235751 125478 89054 122433
19288A22433j06672L0019J05995j95L4055O3648k0821q8927o1703j8093o9558
$$ 122433 15761 45780 151775 151580 185635 249283 228462 139535 77832 59739 -9819
19277i819j92292M927n4525K0127K74792P6168m3104J4123k335j10960O7162r6449
$$ -9819 -202111 -197184 -251709 -231582 43210 119378 76274 90397 88062 -22898 44264 -52185
19265e2185k6953J74887L31630P2048j21169j74841n3788M7215O3269L7595p4155
$$ -52185 -79138 95749 427379 499427 378258 203417 149629 196844 260113 297708 223553
19254B23553n1926Q452q9404j20544Q8818N7865o8235j1344J07635m6208J13246
$$ 223553 171627 180079 90675 -29869 58949 116814 48579 37235 144870 98662 211908
19243B11908J51129j23302l7890k8881j17003r8127n2062J50224o2090N2882Q7857
$$ 211908 363037 239735 201845 172964 55961 -42166 -94228 55996 -6094 46788 134645
19232A34645L4980o8611m2221P696J59343O3292P247j89908r5088J04929k4093
$$ 134645 169625 101014 58793 66489 225832 289124 296371 106463 11375 116304 92211
19221I2211o9423J9082Q841q080M8965K0913r6525o3784K5583J20209M01253J89910
$$ 92211 22788 41870 50711 42631 91596 112509 15984 -47800 -22217 97992 499245 689155
19209F89155q8278j65085j28788j15405j26845m5282J44444k0106K0972J28344
$$ 689155 600877 435792 307004 191599 64754 19472 163916 143810 164782 293126
19199B93126j37679n5899p6085M4597J61013j3874j07751O1257J72407j2509k80295
$$ 293126 155447 99548 23463 68060 229073 215199 107448 168705 341112 328603 48308
19188D8308k53861O5047M7733q3605l8546n6081p0458K26444Q6707j4007m1327
$$ 48308 -205553 -140506 -92773 -176378 -214924 -271005 -341463 -115019 -28312 -42319 -83646
19177h3646Q5754Q8906P8966n6003N1364j356P4507J12812o5017m5230J4002P5042
$$ -83646 2108 91014 169980 113977 165341 163985 238492 351304 286287 241057 255059 330101
19165C30101N4665j40008k36665p8521k7232J02498J13217O0508l682O742J59486
$$ 330101 384766 244758 8093 -70428 -97660 4838 118055 178563 174881 181623 341109
19154C41109O3084j59301q4811j00999J7581J89843r6163j98497Q4994K09727
$$ 341109 404193 244892 160081 59082 76663 266506 170343 -28154 56840 266567
19144B66567P5071r6232M2922l62570j82913J62861J29453J08023J82377M1756
$$ 266567 341638 245406 288328 -74242 -257155 -94294 35159 143182 325559 367315
19134C67315o0441K2625J9795j6320R4220J07173o2203k32104j03560j08306J58051
$$ 367315 306874 329499 349294 332974 427194 534367 472164 240060 136500 28194 186245
19123A86245K4761j13076j7077k3319L185K2502R1616K7228q2861N226m0298j05136
$$ 186245 211006 97930 80853 57534 60719 83221 174837 202065 119204 124430 84132 -21004
19111b1004k8889p5371m4231m1688P3406J12513K20501K3535k48048j78470J3044
$$ -21004 -49893 -125264 -169495 -211183 -137777 -25264 195237 218772 -29276 -207746 -194702
19100a94702J37852N5954M9021j83751N3112K71885M4477j53556J8096m0913q3564
$$ -194702 -56850 -896 48125 -135626 -82514 189371 233848 80292 98388 57475 -26089
19089b6089p2808O1020J25885J23327r3081j7014K31048l5580n2653J3139J07193
$$ -26089 -98897 -37877 88008 211335 118254 101240 332288 296708 244055 257194 364387
19078C64387k90987q2647K22759J10140O8145M8963K7804k01975j25332k5649
$$ 364387 73400 -9247 213512 323652 391797 440760 468564 266589 141257 115608
19068A15608P433K9611R0017k29848m6425K19922K2194k1589J05909k0303L8988
$$ 115608 123041 152652 242669 12821 -33604 186318 208512 186923 292832 272529 311517
19057C11517j09419o3093j11225J61581O4484l1765p1791q6848K1166R1944K3090
$$ 311517 202098 139005 27780 189361 253845 222080 150289 63441 84607 176551 199641
19046A99641J82026K8639q3429K578r5980o3093j58690J06976J77312j5234k38435
$$ 199641 381667 410306 326877 329455 233475 170382 11692 118668 295980 280746 42311
19035D2311o8579R3183J58919j3396r7575l0752r8313j58349J03040L27463R6849
$$ 42311 -26268 66915 225834 212438 114863 84111 -14202 -172551 -69511 257952 354801
19024C54801K2835m0945p9471p0637k43201K2119K13207l1299Q5056Q3378M418
$$ 354801 377636 336691 257220 186583 -56618 -34499 178708 147409 232465 315843 320261
19013C20261L7460q483J5812L1269P8301j67736j04706l6846K66151K75298P6545
$$ 320261 357721 349238 365050 396319 474620 306884 202178 165332 431483 706781 783326
19002G83326Q8308j5950k66102j77031L7463J05281k0580p3249j50158m3557J35758
$$ 783326 871634 855684 589582 412551 450014 555295 534715 461466 311308 267751 403509
18991D03509K25717p7194o1928j23945m6715K9928n3572j81544J41686L1649j20453
$$ 403509 629226 552032 490104 366159 319444 349372 295800 114256 255942 287591 167138
18980A67138r1056n526K50003K07506m364m3020k4423j3142l8854J26076q1075
$$ 167138 76082 70556 320559 528065 523701 480681 456258 443116 404262 530338 449263
18969D49263j88654P1486J0663K1852J03971J4635o1506K40455J61813j18224
$$ 449263 260609 332095 342758 364610 468581 483216 421710 662165 823978 705754
18959G05754k48891j72463J5424J27499N6284O4225J28292J26494J39902K6896
$$ 705754 456863 284400 299824 427323 483607 547832 676124 802618 942520 969416
18949I69416j18426r6211P6433J8485j4962O3842Q6411K17955N4520O032q390
$$ 969416 850990 754779 831212 849697 834735 898577 984988 1202943 1257463 1263495 1255105
18938A255105l93n6994m4071P0227K61415j1206k5102J19308K3983J2372J39764
$$ 1255105 1254712 1197718 1153647 1223874 1485289 1474083 1448981 1568289 1592272 1604644 1744408
18927A744408K31706L18482K75703J94075R4723J40474J65872J90921L52333K31077
$$ 1744408 1976114 2294596 2570299 2764374 2859097 2999571 3165443 3356364 3708697 3939774
18917C939774J29085K19331L57126K18007K40239Q8052K29528J27037K80250M06185
$$ 3939774 4068859 4288190 4645316 4863323 5103562 5191614 5421142 5548179 5828429 6234614
18907F234614N05999L85607L45182O89794P46255P44159Q95699J204802J455211
$$ 6234614 6740613 7126220 7471402 8161196 8907451 9651610 10547309 11752111 13207322
18898A3207322J819820K500720L223091M402858O236658Q933945J2716891J6120052
$$ 13207322 15027142 17527862 20750953 25153811 31390469 40324414 53041305 69161357
18890F9161357J8614583J8752190J5339542J0905939R060587R995338J3342898
$$ 69161357 87775940 106528130 121867672 132773611 141834198 151829536 165172434
18883A65172434J6840283J6596684J0852912J425691p985679j3544804j4204400
$$ 165172434 182012717 198609401 209462313 210888004 202902325 189357521 175153121
18876A75153121j1707914q558088q334216j1494664j5075981j7713964j8700386
$$ 175153121 163445207 154887119 146552903 135058239 119982258 102268294 83567908
18869H3567908j7169609j4104089j0877018q013765n753190m242343l193810k369578
$$ 83567908 66398299 52294210 41417192 33403427 27650237 23407894 20214084 17844506
18861A7844506j933261j494087j458989j162178q43229o45476n46563o49540n67396
$$ 17844506 15911245 14417158 12958169 11795991 10952762 10307286 9760723 9111183 8543787
18852H543787m64518m18709m23108m04884k33969k07023l31083k50103j41898
$$ 8543787 8079269 7660560 7237452 6832568 6598599 6391576 6060493 5810390 5668492
18843E668492l21844m13388k89520k95839l65101k69684k39451k50312j67542
$$ 5668492 5346648 4933260 4643740 4347901 3982800 3713116 3473665 3223353 3055811
18834C055811j71282j51150j09707p2307k61424l09610j15474j40621k95589l5513
$$ 3055811 2884529 2733379 2623672 2551365 2289941 1980331 1864857 1724236 1428647 1393134
18824A393134j7766J34926k7963j01554p8833M2007j38305l1226O348j65441j1679
$$ 1393134 1375368 1510294 1482331 1380777 1301944 1343951 1205646 1174420 1180768 1015327 1003648
18813A003648j15217j35184J53577P9180k48300o6726l4136o3284J23803M7256
$$ 1003648 888431 753247 906824 986004 737704 670978 636842 573558 697361 744617
18803G44617J4354k4705k26269l11165M4829o642J06884l619L3713K00540M6878
$$ 744617 758971 734266 507997 196832 241661 235019 341903 338284 371997 572537 619415
18792F19415J05314k1420j04871M7436N5824j28964j07865q1121J40652J67587
$$ 619415 724729 703309 598438 645874 701698 572734 464869 383748 524400 691987
18782F91987L0231k7667n802o095n9829j4811R9930L7520m1444J19925L4258j01921
$$ 691987 722218 694551 688749 682654 622825 608014 707944 745464 704020 823945 858203 756282
18770G56282j72845L855K858M9142j23969k18423m2464J93388P5494M8465Q0248
$$ 756282 583437 587292 590150 639292 515323 296900 254436 447824 523318 571783 652031
18759F52031j06794m3678j34727K106M5973l6920K3702o1684j64823q0543J00809
$$ 652031 545237 501559 366832 368938 414911 377991 401693 340009 175186 94643 195452
18748A95452L9559m9029L0565J57875J12805p2639J31296P7182O7645J25633n5149
$$ 195452 235011 185982 216547 374422 487227 414588 545884 623066 690711 816344 761195
18737G61195k279J85437o570J20537J87339J76164K98776J28657J66826L98801
$$ 761195 758916 944353 937783 1058320 1245659 1421823 1720599 1849256 2016082 2414883
18727B414883M09433L37881J99833K41778M53931L30388K01468J88234j0385l37505
$$ 2414883 2824316 3162197 3362030 3603808 4057739 4388127 4589595 4777829 4767444 4429939
18717D429939j24219l8207p1187k76947j80779j30754l09758l82563k87277p2689
$$ 4429939 4305720 4267513 4196326 3919379 3738600 3607846 3298088 2915525 2628248 2555559
18707B555559o5207k79345n23941m24769k20888k28617o7627J3989P2272J03773
$$ 2555559 2490352 2211007 1687066 1262297 1041409 812792 745165 759154 831426 935199
18697I35199N1623j2788q4133p3388k1871J83819O9843J8565J06916K45783N1172
$$ 935199 986822 974034 889901 816513 794642 978461 1048304 1066869 1173785 1419568 1470740
18686A470740j57028N2496L1177j62354q5376K8550k5572r4097L0186j64051k13039
$$ 1470740 1313712 1366208 1397385 1235031 1149655 1178205 1152633 1058536 1088722 924671 711632
18675G11632l12089o0310m2479j30200R2770r869q497J41189j5473L9901M3741
$$ 711632 399543 339233 296754 166554 259324 249455 240958 382147 366674 406575 450316
18664D50316O0657P2583J8105j9563j01154j19345j93186k1459R2593P581q46
$$ 450316 510973 583556 601661 582098 480944 361599 168413 146954 239547 247128 246282
18653B46282o0881O6337N9198o0163q9148j07282J73433K29954p8628q0200m2994
$$ 246282 185401 251738 310936 250773 161625 54343 227776 457730 379102 298902 255908
18642B55908J59523K14153J22160O7671R7928o6674r8447j65749k53026J06193
$$ 255908 415431 629584 751744 819415 917343 850669 752222 586473 333447 439640
18632D39640R9785K5319J3815j50830j30900K17910j15671j39615J12715j34386
$$ 439640 539425 564744 578559 427729 296829 514739 399068 259453 372168 237782
18622B37782l1660qP4604P8287m0201l8523L2684J56743j6315J50296O1152n3135
$$ 237782 206122 206114 280718 359005 318804 280281 312965 469708 453393 603689 664841 611706
18610F11706j52694l0404l9337L2686K8727j11519r638j4522P3630R9781J44737
$$ 611706 459012 428608 389271 421957 450684 339165 329527 315005 388635 488416 633153
18599F33153J28125M8774j3478J721j42596m2246J20506p9828O9753j48782j11098
$$ 633153 761278 810052 796574 798295 655699 613453 733959 654131 723884 575102 464004
18588D64004p3785Q7469m821k06447k6932L6954J98518K45195R4382n9835M7440
$$ 464004 390219 477688 472867 266420 239488 276442 474960 720155 814537 754702 802142
18577H02142J3112K24029K25997K12446m4388r1929o1567R1768Q4377R3091K52180
$$ 802142 815254 1039283 1265280 1477726 1433338 1341409 1279842 1371610 1455987 1549078 1801258
18566A801258J34229j18435j28190n8110j17336j18610O6212K4593j21733n2311
$$ 1801258 1935487 1817052 1688862 1630752 1513416 1394806 1461018 1485611 1363878 1311567
18556A311567O5899j88993o5300j45457J4729J5858R5212L5487j76819M2544O4073
$$ 1311567 1377466 1188473 1123173 977716 992445 1008303 1103515 1139002 962183 1004727 1068800
18545A068800k3357J61000J56298M8269J3687k277l34650j21040J86602K45545
$$ 1068800 1045443 1206443 1362741 1411010 1424697 1422420 1087770 966730 1153332 1398877
18535A398877q4735o2180n5022J2142R6357o1888j93576J75204J46786j81900
$$ 1398877 1314142 1251962 1196940 1209082 1305439 1243551 1049975 1225179 1371965 1190065
18525A190065k52550l5340n9539j38725j18157n149P1893R9799o8301j27931j70301
$$ 1190065 937515 902175 842636 703911 585754 580605 652498 752297 683996 556065 385764
18514C85764k60767J3K11997o2474P8760o74J47103O3205j7733o8818n0132O793
$$ 385764 124997 125010 337007 274533 353293 352619 499722 562927 545194 476376 426244 433037
18502D33037L8180k3441j50508K82j26313P0561J05228j8968j1559j6761K2578
$$ 433037 471217 447776 297268 297550 171237 241798 347026 328058 316499 299738 322316
18491C22316k1369Q516n7201j30565J028N9158o6104j95041j63740K36526K17453
$$ 322316 300947 309463 252262 121697 122725 181883 115779 -79262 -243002 -6476 210977
18480B10977L9509j1128J3736R1951L7948m1118P0138r8128m6905j71101k7642
$$ 210977 250486 239358 253094 345045 382993 341875 412013 313885 266980 95879 68237
18469F8237K28713J37670K868n918o0676K3324K3947k74297j30193o2285J15039
$$ 68237 296950 434620 437488 431570 370894 394218 418165 143868 13675 -48610 66429
18458F6429R1307L8053o6289n2430O6178Q5957j44606j3064J8320o2296L7728
$$ 66429 157736 195789 129500 77070 143248 229205 84599 71535 89855 27559 65287
18447F5287K1940K3081K2277J0107n4900J09699P0715j33197O043N6977K2389
$$ 65287 87227 110308 132585 142692 87792 197491 268206 135009 141052 198029 220418
18436B20418K73840Q2322j84812j52665n7259O4614Q9065Q613J17032P5759j34561
$$ 220418 494258 576580 391768 239103 181844 246458 335523 344136 461168 536927 402366
18425D02366j9273J33493N9700K4436n5137O4638K20148n1466k9813p291q3424
$$ 402366 383093 516586 576286 600722 545585 610223 830371 778905 749092 741801 658377
18414F58377J5519J65110J01118k81165k84912m5498R5830L9863J6591o4651n1839
$$ 658377 673896 839006 940124 658959 374047 328549 424379 464242 480833 416182 364343
18403C64343J0607K4853q2466J5553M4382J69283J93510r7373k07541j28536l3655
$$ 364343 374950 399803 317337 332890 377272 546555 740065 642692 435151 306615 272960
18392B72960J79845K09914M3564q4684R0456L46088K08403o7264q1233n5199J90780
$$ 272960 452805 662719 706283 621599 712055 1058143 1266546 1199282 1118049 1062850 1253630
18381A253630J82072J85437O6537J50889K59281J64579J67897O7266k65583k95022
$$ 1253630 1435702 1621139 1687676 1838565 2097846 2262425 2430322 2497588 2232005 1936983
18371A936983j05670j46722K3101J19031j42567m114R7714J6905j22293r7629
$$ 1936983 1831313 1684591 1707692 1826723 1684156 1680042 1777756 1794661 1672368 1574739
18361A574739k04065k58170j55664J1797j25121j70395J02448M4338L2065j45854
$$ 1574739 1370674 1112504 956840 968637 843516 673121 775569 819907 851972 706118
18351G06118q7214j30449K5509o4646J33652J66264n0024o7446j8014m0116p6287
$$ 706118 618904 488455 513964 449318 582970 749234 699210 631764 613750 573634 497347
18340D97347K143J1539J43004J00544j46560j26040J06728J35777L9402J23646
$$ 497347 499490 511029 654033 754577 608017 481977 588705 724482 763884 887530
18330H87530j7090q2112K5164J1587p2466q2119J64400m7703j03960N6717r927
$$ 887530 870440 788328 813492 825079 752613 670494 834894 787191 683231 739948 730021
18319G30021M2645J7204J35851j0475R0864r7807k6166J57341L4212j40388j28919
$$ 730021 772666 789870 925721 915246 1006110 908303 882137 1039478 1073690 933302 804383
18308H04383j22788j46763K43568J68253J2586P5145J6149Q1105K21577k9408
$$ 804383 681595 534832 778400 946653 959239 1034384 1050533 1131638 1353215 1323807
18298A323807J08941N1676r3189j24487j79885j62703o0832l6715n754p7284p2418
$$ 1323807 1432748 1484424 1391235 1266748 1086863 924160 863328 826613 820859 743575 671157
18287F71157P3580K68936J47553Q2449J78459R33o4051N7276q5272j58405p7230
$$ 671157 744737 1013673 1161226 1243675 1422134 1423067 1359016 1416292 1331020 1172615 1095385
18276A095385M8720P044J56984R5816N0699O842J4052J58918n1898j50157K0991
$$ 1095385 1144105 1151149 1308133 1403949 1454648 1461490 1475542 1634460 1582562 1432405 1453396
18265A453396J61545K30974J57597J38093J9199K9883K31555J39830K2395L8107
$$ 1453396 1614941 1845915 2003512 2141605 2160804 2190687 2422242 2562072 2584467 2622574
18255B622574J71597L28023L64248N58814M53865M74707P18287R92960J180731
$$ 2622574 2794171 3122194 3486442 4045256 4499121 4973828 5692115 6685075 7865806
18246G865806J787424K356061L191524M087290M798389M994395M420626K835607
$$ 7865806 9653230 12009291 15200815 19288105 24086494 29080889 33501515 36337122
18238C6337122Q44130p78187j546481j173957n74451o50185j627385k493778l310137
$$ 36337122 37181252 36403065 34856584 33682627 33108176 32457991 30830606 28336828 25026691
18229B5026691l792584l604341l118000k333497j665427r53700l80123k57764
$$ 25026691 21234107 17629766 14511766 12178269 10512842 9559142 9179019 8921255
18221H921255n84162k27596k07112Q5803m3092k28243P4754J9767J20781J35082
$$ 8921255 8337093 8109497 7902385 7988188 7945096 7716853 7791607 7811374 7932155 8067237
18211H067237K02296J80234K51794L38379K87130N54529O57480R66277J469785
$$ 8067237 8269533 8449767 8701561 9039940 9327070 9881599 10539079 11505356 12975141
18202A2975141J898883K639807L820944N749898Q480088J1490946J4145548J5165713
$$ 12975141 14874024 17513831 21334775 27084673 35564761 47055707 61201255 76366968
18194G6366968J2590885P852209L526260K066069K932297M279079L252693m27094
$$ 76366968 88957853 96810062 100336322 102402391 105334688 109613767 112866460 112439366
18186A12439366n469789r659675j2292747j3527112j3055712j1374698r161802
$$ 112439366 106969577 97309902 85017155 71490043 58434331 47059633 37897831
18179C7897831p351120n894346m363416k868629k069184j587204r45961n80248
$$ 37897831 30546711 24652365 20288949 17420320 15351136 13763932 12817971 12237723
18171A2237723n52564n42632l38447l376R053j67344M1734O0242K5560p9168q3290
$$ 12237723 11685159 11142527 10804080 10800704 10809757 10642413 10684147 10744389 10769949 10690781 10607491
18160A0607491Q7727J29992M24053P24174J236256J703926K486634L738685N770987
$$ 10607491 10695218 10825210 11249263 11973437 13209693 14913619 17400253 21138938 26909925
18151B6909925R161879J2667374J5045859J4822359J1116946O689370M570188
$$ 26909925 36071804 48739178 63785037 78607396 89724342 96413712 100983900
18144A00983900M575610N003886L714536p44463o412701j0857368j2974836j2573760
$$ 100983900 105559510 110563396 114277932 113533469 107120768 96263400 83288564 70714804
18136G0714804j1370938r908460q464041p044668n742687m684755l439866k195873
$$ 70714804 59343866 49435406 40971365 33926697 28184010 23499255 20059389 17863516
18128A7863516j511691j254973r32532n39092n45680k82429j4370J8106j02803
$$ 17863516 16351825 15096852 14164320 13625228 13079548 12797119 12782749 12800855 12698052
18119A2698052q9960L95718O19483P68900P18803J417481J993402K780319L575877
$$ 12698052 12608092 13003810 13623293 14392193 15110996 16528477 18521879 21302198 24878075
18110B4878075M153570M414634M966863N372240N180962M946232M465561M523241
$$ 24878075 29031645 33446279 38413142 43785382 48966344 53912576 58378137 62901378
18102F2901378N364955N959212O796013P401279P859609Q045849P704485N993376
$$ 62901378 68266333 74225545 81021558 88422837 96282446 104328295 112032780 118026156
18094A18026156K906234M37324j399016k830370l326809l330573l352077k754403
$$ 118026156 120932390 121369714 119970698 117140328 113813519 110482946 107130869 104376466
18086A04376466k223845k442077m137114n918533p031073q140768q954836q712262
$$ 104376466 102152621 99710544 95573430 89654897 82623824 74483056 65528220 56815958
18078E6815958q177933p448998o340176m868927l661206k566172j765683r82183
$$ 56815958 48638025 41189027 34848851 29979924 26318718 23752546 21986863 21004680
18070B1004680m42588m3528M26524P57906J321940K037537K681089L344222M439318
$$ 21004680 20562092 20518564 20945088 21702994 23024934 25062471 27743560 31087782 35527100
18061C5527100N403337O453685P375128Q757721J0515417J2083804J3113303J3920107
$$ 35527100 40930437 47384122 54759250 63516971 74032388 86116192 99229495 113149602
18053A13149602J4666238J4262389J3994054J4583044J3548119R130768N547151
$$ 113149602 127815840 142078229 156072283 170655327 184203446 193334214 198881365
18046A98881365M604592L370980J543890j14259j608591k472045l048838l183937
$$ 198881365 203485957 206856937 208400827 208286568 206677977 204205932 201157094 197973157
18038A97973157m341525p879214j0489904j1479812j2163082j3436695j4332272
$$ 197973157 193631632 185752418 175262514 163782702 151619620 138182925 123850653
18031A23850653j3968995j2927487j1966623j0583640r109966p946938o981408
$$ 123850653 109881658 96954171 84987548 74403908 65293942 57347004 50365596
18024E0365596o168893n308660m437961l680957l200114k987583k437789j847109
$$ 50365596 44196703 38888043 34450082 30769125 27569011 24581428 22143639 20296530
18016B0296530j663417j417827j119342p71003m91106k25734k97933l59113k96481
$$ 20296530 18633113 17215286 16095944 15324941 14833835 14608101 14310168 13951055 13654574
18007A3654574m53228m96644l58011k04392j157L4708O204k43148m14154l09698
$$ 13654574 13201346 12704702 12346691 12142299 12141142 12175850 12182054 11938906 11524752 11215054
17997A1215054n3774K66449L20750M17782N97059N33692N06275P87055J289239
$$ 11215054 11161280 11427729 11748479 12166261 12763320 13297012 13803287 14590342 15879581
17988A5879581J914536K778123M382425O607743J0219966J6290494K3604047K7226940
$$ 15879581 17794117 20572240 24954665 31562408 41782374 58072868 81676915 108903855
17980A08903855K1470824Q156433j107303k896212J363718J4896410L2279510
$$ 108903855 130374679 138531112 137423809 134527597 135891315 150787725 183067235
17973A83067235L9730848K5549900j565062k0953259l0108542l0265947j8673457
$$ 183067235 222798083 248347983 246782921 225829662 195721120 165455173 146781716
17966A46781716k762928N994584R07385j1043725j8870999k2780219k3252522
$$ 146781716 144018788 150013372 150920757 139877032 121006033 98225814 74973292
17959G4973292j9079664j3257714q651378n936294m338642k791888j958852j583668
$$ 74973292 55893628 42635914 33984536 28048242 23709600 20917712 18958860 17375192
17951A7375192j288233p32653p47812o36131m73671m70465l61381j53556l24171
$$ 17375192 16086959 15354306 14606494 13970363 13496692 13026227 12664846 12511290 12187119
17942A2187119j25454k06227j17946n4931K033J48704n0287J75850M63040N85345
$$ 12187119 12061665 11855438 11737492 11682561 11684594 11833298 11783011 11958861 12421901 13007246
17932A3007246J115925J718270K247322K989093L651565M782071N652609N876815
$$ 13007246 14123171 15841441 18088763 21077856 24729421 29511492 35164101 41040916
17924D1040916N811129N942523N554026M162998L052318K898527K842933K743477
$$ 41040916 46852045 52794568 58348594 62511592 65563910 68462437 71305370 74048847
17916G4048847L649932M599042M841396M640941L982048K298549O92682j247042
$$ 74048847 77698779 82297821 87139217 91780158 95762206 98060755 98753437 97506395
17908I7506395l519653m737686n095225n342621m745961m221206l485027k477774
$$ 97506395 93986742 89249056 84153831 78811210 74065249 69844043 66359016 63881242
17900F3881242k550935l318326m055326m368885m868524n088795m869087m483431
$$ 63881242 61330307 58011981 53956655 49587770 44719246 39630451 34761364 30277933
17892C0277933l949305l231089k378545j762906j061686m72083J93350P14487
$$ 30277933 26328628 23097539 20718994 18956088 17894402 17422319 17615669 18330156
17884A8330156J006034J492447K285456L234679L820276L641825L663317L978197
$$ 18330156 19336190 20828637 23114093 26348772 30169048 33810873 37474190 41452387
17876D1452387L692603K280537J694549J847594J781584J631344K561587L470321
$$ 41452387 45144990 47425527 49120076 50967670 52749254 54380598 56942185 60412506
17868F0412506L065018K918544L564692K760373M25573j321910j812250l146016
$$ 60412506 63477524 66396068 69960760 72721133 73146706 71824796 70012546 66866530
17860F6866530m266005l855443l236560l102384k684209j464018j166768k229181
$$ 66866530 62600525 58745082 55508522 52406138 49721929 48257911 47091143 44861962
17852D4861962k464218k602294l481947l756813l617311l481138l516103l192377
$$ 44861962 42397744 39795450 36313503 32556690 28939379 25458241 21942138 18749761
17844A8749761k670439k203569k004095j687115j097664q12702p33292n22528
$$ 18749761 16079322 13875753 11871658 10184543 9086879 8274177 7540885 7018357
17836G018357n48220n23452o45315m21580k01660j33814k37747j68926j58319
$$ 7018357 6470137 5946685 5301370 4879790 4678130 4544316 4306569 4137643 3979324
17827C979324j73346j34127j81843l15001k91481k28986r4553j24800j39119k09023
$$ 3979324 3805978 3671851 3490008 3175007 2883526 2654540 2559987 2435187 2296068 2087045
17817B087045q9736j09046K23111o7307j59334j03122j77750j30699M6329j1634
$$ 2087045 1997309 1888263 2111374 2044067 1884733 1781611 1603861 1473162 1519491 1507857
17807A507857j32546j26125J26574J51214j22563o4214L2857k0694K6697L6603
$$ 1507857 1375311 1249186 1375760 1526974 1404411 1340197 1373054 1352360 1379057 1415660
17797A415660O7036j37722j32784N5812P7020p0701J24766j26687j69615O1256
$$ 1415660 1482696 1344974 1212190 1268002 1345022 1274321 1399087 1272400 1102785 1164041
17787A164041J20656j11623k17754p2075N0197N031q8466J36209j7527K3116M8518
$$ 1164041 1284697 1173074 955320 883245 933442 938473 850007 986216 968689 991805 1040323
17776A040323J92008J59352k84541j20774M3940k32226N659L116M1914J10128
$$ 1040323 1232331 1391683 1107142 986368 1030308 798082 803741 806857 848771 958899
17766I58899K0880J32315J88456K41889L51910k5659L5366l0976k69149l89811
$$ 958899 979779 1112094 1300550 1542439 1894349 1868690 1904056 1873080 1603931 1214120
17756A214120n7870J87591J27464J43569K25179N7627j25416k64698k26478j22420
$$ 1214120 1156250 1343841 1471305 1614874 1840053 1897680 1772264 1507566 1281088 1158668
17746A158668j80890j20696j9567K89453J71437M8173l8835j32433j84351k63210
$$ 1158668 977778 857082 837515 1126968 1298405 1346578 1307743 1175310 990959 727749
17736G27749J55608J54590q0338j79965j55481P6088J31406K4323K9376K1537
$$ 727749 883357 1037947 957609 777644 622163 698251 829657 853980 883356 904893
17726I04893K6723m3644j5377O2861Q9971J05034j19029p689j41140N8568O2073
$$ 904893 931616 887972 872595 935456 1025427 1130461 1011432 1003743 862603 921171 983244
17715I83244k06804m5382M4215N2319P9547m4186k8532j26957m9640J02011P7390
$$ 983244 776440 731058 775273 827592 907139 862953 834421 707464 657824 759835 837225
17704H37225Q2685r1405j39613m6093K5760J69847J68274j49165r8404q815j40177
$$ 837225 919910 828505 688892 642799 668559 838406 1006680 857515 759111 750296 610119
17693F10119K9790j04895k22560N3832P2450J3060P3876J15887m4175o1943K1111
$$ 610119 639909 535014 312454 366286 438736 451796 525672 641559 597384 535441 556552
17682E56552m7487J24051K05537J19922n854Q0039J11082J07343J89094m1916
$$ 556552 509065 633116 838653 958575 952721 1032760 1143842 1251185 1440279 1398363
17672A398363J6372Q6172o6514j35646K4078J7095J6656L3484j67598j49134k8520
$$ 1398363 1414735 1500907 1434393 1298747 1322825 1339920 1356576 1390060 1222462 1073328 1044808
17661A044808j04204j95723p5431n4415p0173J2078n8658k5993K04239N328j3431
$$ 1044808 940604 744881 669450 615035 544862 556940 498282 472289 676528 681856 668425
17650F68425K736p4043o4871J4095j9711j906j3264p6976j47123j09592J32717
$$ 668425 671161 597118 532247 546342 526631 524725 511461 434485 287362 177770 310487
17639C10487K42312J48173M3738q9899J2113Q877J95194j5336k51610P9892N5858
$$ 310487 552799 700972 744710 654811 666924 675801 870995 855659 604049 683941 739799
17628G39799J94595N3606J27363P7061O9268k2739J07836K4391j67082j74258
$$ 739799 934394 988000 1115363 1192424 1261692 1238953 1346789 1371180 1204098 1029840
17618A029840k6647J64882K4879j8243L4408Q5220l0836J34452o8809O3550R9857
$$ 1029840 1003193 1168075 1192954 1174711 1209119 1294339 1263503 1397955 1329146 1392696 1492553
17607A492553L4141J86433L3418J35069J01623R9648K5724P0077K32028K19911
$$ 1492553 1526694 1713127 1746545 1881614 1983237 2082885 2108609 2178686 2410714 2630625
17597B630625J09790K15302J11998J28342K28808R1332K5437P6288j36788Q6773
$$ 2630625 2740415 2955717 3067715 3196057 3424865 3516197 3541634 3617922 3481134 3567907
17587C567907Q1209n2142L9174J65399K01557K26427M25298O3390q3362J50514
$$ 3567907 3649116 3596974 3636148 3801547 4003104 4229531 4654829 4718219 4634857 4785371
17577D785371K18471J51721L59267N68742K91425R0775K42358K48439Q9903K39747
$$ 4785371 5003842 5155563 5514830 6083572 6374997 6465772 6708130 6956569 7046472 7286219
17567G286219J99942K39052K71625M17083K56079P04439R36600Q23225Q75789
$$ 7286219 7486161 7725213 7996838 8413921 8670000 9374439 10311039 11134264 12010053
17558A2010053J130378J639869K394639L060643M148418O158618R445394J4606446
$$ 12010053 13140431 14780300 17174939 20235582 24384000 30542618 39988012 54594458
17550E4594458K1325099K7105500K5449989J4841844N254115L684350Q937427
$$ 54594458 75919557 103025057 128475046 143316890 148571005 152255355 161192782
17543A61192782J9734978K8665480K4627246P173042j1609304k2752139k4091108
$$ 161192782 180927760 209593240 234220486 241393528 229784224 207032085 182940977
17536A82940977j6794210o478743l891110j0631642j7768512k1429728k3000098
$$ 182940977 166146767 159668024 155776914 145145272 127376760 105947032 82946934
17529H2946934k0855895j5555880j0437243p048959m852828l593839k779528k170167
$$ 82946934 62091039 46535159 36097916 29048957 24196129 20602290 17822762 15652595
17521A5652595j667469j234288j094906r47806q05460o59017m11195j50190l36541
$$ 15652595 13985126 12750838 11655932 10708126 9902666 9243649 8832454 8682264 8345723
17512H345723o26668m51058m35780j79503k22118k30732k05354p8117k53491l96171
$$ 8345723 7719055 7267997 6832217 6652714 6430596 6199864 5994510 5916393 5662902 5266731
17502E266731k63993l23679l54858m55846k41793k60458k39355r7946n6746j05329
$$ 5266731 5002738 4679059 4324201 3868355 3626562 3366104 3126749 3028803 2972057 2866728
17492B866728o7441M3060P1367o7727m5196P3782L1269k14144l02898k73740j10439
$$ 2866728 2799287 2842347 2913714 2845987 2800791 2874573 2905842 2691698 2388800 2115060 2004621
17481B004621p8023l1137n6704l14717j95283N5197J551j34584j03157j21539
$$ 2004621 1926598 1895461 1838757 1524040 1328757 1383954 1385505 1250921 1147764 1026225
17471A026225j96370m3900p3969k46614l906O2746Q6918q7500P560r854r9763
$$ 1026225 829855 785955 711986 465372 461466 524212 611130 523630 531190 521336 421573
17460D21573M4244R250K01777j41516j38598j15520q9656r399J76443J08852n7273
$$ 421573 465817 475067 676844 535328 396730 281210 191554 182155 358598 467450 410177
17449D10177K830l3208o4896n0031k10915k0457L04750M5883j0034M1855q2887
$$ 410177 413007 379799 314903 264872 53957 33500 338250 384133 374099 415954 333067
17438C33067P6917j27690j90180m9578Q4130j08748J12745L40754Q8103n0123
$$ 333067 409984 282294 92114 42536 126666 17918 130663 471417 559520 509397
17428E09397j55229j76706j24767j12651J34007P2745J02676N6369R4439K6669
$$ 509397 354168 177462 52695 -59956 74051 146796 249472 305841 400280 426949
17418D26949K172r6118M3935m9239k9565j22605J79604K60653L5066P9861J21159
$$ 426949 429121 333003 376938 327699 298134 175529 355133 615786 650852 730713 851872
17407H51872R5580q1689o9093J1499q3520K798J9364k1796q4364r8550j73053
$$ 851872 947452 865763 796670 808169 724649 727447 746811 725015 640651 542101 369048
17396C69048l006J17288j88286l3658o8389N6024m6289j00469K3092L8051q3919
$$ 369048 366042 483330 295044 261386 192997 249021 202732 102263 125355 163406 79487
17385G9487j799r6201R0371O8133k0692J65061L29893K74193J76490q3304k47170
$$ 79487 77688 -18513 71858 139991 119299 284360 614253 888446 1064936 981632 734462
17374G34462J0390R7088K20751K92629J75545J23839k59775k93234J04630j32502
$$ 734462 744852 841940 1062691 1355320 1530865 1654704 1394929 1101695 1206325 1073823
17364A073823l506r5805J036J73370L5227j98064q1482j65697l65241j52318J25528
$$ 1073823 1070317 974512 975548 1148918 1184145 986081 904599 738902 373661 221343 346871
17353C46871K92457k5209j96853j17198o7165O72M9263n7630l137j45413p527
$$ 346871 639328 614119 417266 300068 232903 233575 282838 225208 222071 76658 69131
17342F9131l3567r1752M3534Q2843N7935j16948M413L9416l9474k3080J01898
$$ 69131 35564 -56188 -12654 70189 128124 11176 15589 55005 15531 -7549 94349
17331I4349K27508j05915j65061M2547N6660P329J37311N3232K9891Q903o2674
$$ 94349 321857 215942 50881 93428 150088 157417 294728 347960 377851 386754 324080
17320C24080k68282k51508o0580l2999l3428Q4583P8595Q0215l4350R2677J27278
$$ 324080 55798 -195710 -256290 -289289 -322717 -238134 -159539 -79324 -113674 -20997 106281
17309A06281o5050j31235J87866K5338M0918J02978J09962M5268j1391j3714q4213
$$ 106281 41231 -90004 97862 123200 164118 267096 377058 422326 410935 397221 313008
17298C13008o7978R0812P8465n4565j46334j60454k00170o3698J56581O0125K3344
$$ 313008 245030 335842 414307 359742 213408 52954 -147216 -210914 -54333 5792 29136
17287B9136k3421r0867R9267o5717P8846J68963J04717P3061Q0488j40594K9478
$$ 29136 5715 -85152 14115 -51602 27244 196207 300924 373985 454473 313879 343357
17276C43357q6064j78843O7367J18041o0055k83768M8413J80699j02385j77354
$$ 343357 257293 78450 145817 263858 203803 -79965 -31552 149147 46762 -130592
17266a30592m1478Q2202l9399k07288n8414J27918q2116J39475J74739O4267k5661
$$ -130592 -172070 -89868 -129267 -336555 -394969 -267051 -349167 -209692 -34953 29314 3653
17255C653j48125J13448J59589N0291J17308j4726K7616j52273j25097o7024N4589
$$ 3653 -144472 -31024 128565 178856 296164 281438 309054 156781 31684 -35340 19249
17244A9249J03880L9739J2180l0596P2919j5766j03627J11609J39191M4132o276
$$ 19249 123129 162868 175048 144452 217371 201605 97978 209587 348778 392910 386634
17233C86634l39453k78911O4008J20307p9486R6957J41824r0344j22472p6281
$$ 386634 47181 -231730 -167722 -47415 -126901 -29944 111880 21536 -100936 -177217
17223a77217r7212k3124l7436k9232l9934O8980K6753P9906J23459K2967R7379
$$ -177217 -274429 -297553 -334989 -364221 -404155 -335175 -308422 -228516 -105057 -82090 15289
17212A5289l1888J71289k5931P9924K9686j51809j60072j28240m1253P512K5293
$$ 15289 -16599 154690 128759 208683 238369 86560 -73512 -201752 -243005 -235493 -210200
17201b10200J95861K1747R846j58479j4161Q9557J51675k9280p7332J412k2897
$$ -210200 -14339 7408 17254 -141225 -155386 -65829 85846 56566 -20766 -19354 -42251
17190d2251j65644k19322M7103J30661q1917J37045P8681j2704j0448r1089o8905
$$ -42251 -207895 -427217 -380114 -249453 -331370 -194325 -115644 -128348 -138796 -229885 -298790
17179b98790J36121J21772J15215j98940q2407j6283J77069J5543j9227M9056
$$ -298790 -162669 -40897 74318 -124622 -207029 -223312 -46243 -30700 -49927 -871
17169h71j26478N1497J26859O5793J88237J06685m790j44839n7802o6261K4349
$$ -871 -127349 -75852 51007 116800 305037 411722 406932 262093 204291 138030 162379
17158A62379J30018n5695j03859j24734l6448R6954M99l8066k58380j56115k1146
$$ 162379 292397 236702 132843 8109 -28339 68615 69114 31048 -227332 -383447 -404593
17147d04593Q1926J12871R7000K7029J7559q6494j91011n925K03502J55677Q5921
$$ -404593 -322667 -209796 -112796 -85767 -68208 -154702 -345713 -351638 -148136 7541 93462
17136I3462L4101o7315K6925M3491j04765o4085j20049r490j08327Q5989o3434
$$ 93462 127563 60248 87173 130664 25899 -38186 -158235 -167725 -276052 -190063 -253497
17125b53497r7891J76479J64387J19307L4172J8267K0048j8487r6127K7171K6984
$$ -253497 -351388 -174909 -10522 108785 142957 161224 181272 162785 66658 93829 120813
17114A20813r1981j44861o6099j5850N1061O4447j61058j17879q3981L4109Q4177
$$ 120813 28832 -116029 -182128 -197978 -146917 -82470 -243528 -361407 -445388 -411279 -327102
17103c27102R2514l9524q6984k3391l1516J79737J87466M5793k2444P7267J46927
$$ -327102 -234588 -274112 -361096 -384487 -416003 -236266 -48800 -3007 -25451 51816 198743
17092A98743n4951r3092j73006n9174P2635P4696j85201j54086K8519R1386J8082
$$ 198743 143792 50700 -122306 -181480 -108845 -34149 -219350 -373436 -344917 -253531 -235449
17081b35449Q6765j49242m6675R3398J45260j2315k2287r468J75757m8173q8561
$$ -235449 -148684 -297926 -344601 -251203 -105943 -118258 -140545 -150013 25744 -22429 -110990
17070a10990K8219J7568o4163o9561J33685j935j11390K9795K06426K09235O6756
$$ -110990 -82771 -65203 -129366 -198927 -65242 -67177 -178567 -148772 57654 266889 333645
17059C33645M8165M0019l1227l7023j35894j0451j52512n2126j7279q8339j909
$$ 333645 381810 421829 390602 353579 217685 207234 54722 2596 -14683 -103022 -104931
17048a04931L16143J13740p7783j58127q0817j7637K4599K01414j2264m4615R035
$$ -104931 211212 324952 247169 89042 8225 -9412 15187 216601 204337 159722 168757
17037A68757l810R364J0095K2545k26925k50644m5363J76736J18255j0197K1504
$$ 168757 164947 174311 184406 206951 -19974 -270618 -315981 -139245 -20990 -31187 -9683
17026i683o5893K3068o6745m7653L5946l9409o1228n014L4045Q880j19925R286
$$ -9683 -75576 -52508 -119253 -166906 -130960 -170369 -231597 -236611 -202566 -193686 -313611 -304325
17014c04325K65010L2389o6898K0586q1143L1512L7900J6277r4543q1144J9564
$$ -304325 -39315 -6926 -73824 -53238 -134381 -102869 -64969 -48692 -143235 -224379 -204815
17003b04815J84788J07250N0359l954j56518j34568J371J37002j41309r8297K03824
$$ -204815 -20027 87223 137582 133628 -22890 -157458 -156087 -19085 -160394 -258691 -54867
16992e4867Q2192m0280j13691O2011J43009k4981q0582r819k0359l3734j53301
$$ -54867 27325 -12955 -126646 -64635 78374 53393 -27189 -37008 -57367 -91101 -244402
16981b44402j4580N7120J38984m4499j41893M1701J61044K5536J6490j1628k9962
$$ -244402 -258982 -201862 -62878 -107377 -249270 -207569 -46525 -20989 -4499 -16127 -46089
16970d6089N8737J26853O4218O9073R535p8560N1234j10599j16038N7411J1870
$$ -46089 12648 139501 203719 272792 282327 203767 255001 144402 28364 85775 97645
16959I7645N4915k8878N9592J13103l999K709J01421J3201P1096J41559o8052
$$ 97645 152560 123682 183274 296377 292378 295087 396508 409709 480805 622364 554312
16948E54312Q3023J52820R3421k4171k2787O4886j42586j26905J53683j20881
$$ 554312 637335 790155 883576 859405 836618 901504 758918 632013 785696 664815
16938F64815j67367N1441K3324K15433j54774j18366j99690k86145k07774J02692
$$ 664815 497448 548889 572213 787646 632872 514506 314816 28671 -179103 -76411
16928g6411K63792j14993p4784k6936j01974k42603N8556l6108J44280O8743L491
$$ -76411 187381 72388 -2396 -29332 -131306 -373909 -315353 -351461 -207181 -138438 -134947
16917a34947L5779M1904j63220q1739J43669Q68j69322j44848O1533J74420l9130
$$ -134947 -99168 -57264 -220484 -302223 -158554 -157686 -327008 -471856 -410323 -235903 -275033
16906b75033k04336J33106N3445L5461r999j02565N1881L29364J08586j69615
$$ -275033 -479369 -346263 -292818 -257357 -267356 -369921 -318040 11324 119910 -49705
16896d9705j83539j55069J67229J75673J61648J05215j04743j68034j18728N7626
$$ -49705 -233244 -388313 -221084 -45411 116237 221452 116709 -51325 -170053 -112427
16886a12427j1585j19392N9115K8454j30896l1864J01509L90108P9881n3204J31450
$$ -112427 -124012 -243404 -184289 -155835 -286731 -318595 -217086 173022 252903 199699 331149
16875C31149K8325j82762j7557j8908l02497j10720J9845o4725p8204J32128K10048
$$ 331149 359474 176712 159155 140247 -162250 -272970 -253125 -317850 -396054 -263926 -53878
16864e3878Q0928p1296p8042j2792R1930Q3364J7377j3738j2472N1942l14316
$$ -53878 27050 -44246 -122288 -135080 -43150 40214 57591 43853 31381 83323 -230993
16853b30993k29483J04334K52108J28342M9855q431l6531k4333j46998j81956
$$ -230993 -460476 -356142 -104034 24308 74163 65732 29201 4868 -142130 -324086
16843c24086q7099m2334O5584J19480J19061Q6324q4695l5022J20070J56369J8633
$$ -324086 -411185 -453519 -387935 -268455 -149394 -63070 -147765 -182787 -62717 93652 112285
16832A12285N2119p1726j63810p5568m0307N0437R6842K3901Q6045P7989k3040
$$ 112285 164404 92678 -71132 -146700 -187007 -136570 -39728 -15827 70218 148207 125167
16821A25167l01771j12857K2988j57543O8953J55299J93516K09452K27971j00799
$$ 125167 -176604 -289461 -266473 -424016 -355063 -199764 -6248 203204 431175 330376
16811C30376j46292j23088J0078M4418j36200n8220M3270j0974j6480j03346P8715
$$ 330376 184084 60996 71074 115492 -20708 -78928 -35658 -46632 -63112 -166458 -87743
16800h7743N9003j25753j8361N4725j39829q9844N2983P9646J42469K38831R2176
$$ -87743 -28740 -154493 -172854 -118129 -257958 -347802 -294819 -215173 -72704 166127 258303
16789B58303j25638l0201N4367j35587j38342j53152K6372j2721r722R8200L2461
$$ 258303 132665 102464 156831 21244 -117098 -270250 -243878 -256599 -266321 -168121 -135660
16778a35660J21365k8586j04687m2479Q563Q1096M7523J20567l07220O3417J52687
$$ -135660 -14295 -42881 -147568 -190047 -181484 -100388 -52865 67702 -239518 -176101 -23414
16767b3414J35704Q3589m7440O8204j25007j64774j2702N6848M6501p4722Q8856
$$ -23414 112290 195879 148439 216643 91636 -73138 -85840 -28992 17509 -57213 31643
16756C1643m3900k2572J4708l1285l7478L907L2565L713N532K7637K0794q1945
$$ 31643 -12257 -34829 -20121 -51406 -88884 -84977 -52412 -48699 -43167 -15530 5264 -76681
16744g6681j15771q798O2308J51880k3898r7747J69627K8992r2157M6594J11876
$$ -76681 -192452 -201250 -138942 12938 -10960 -108707 60920 89912 -2245 44349 156225
16733A56225j56993l23259o3210O7078M0697J7127k12868j323K324K8325J21181
$$ 156225 -768 -324027 -387237 -320159 -279462 -262335 -475203 -476526 -474202 -445877 -324696
16722c24696Q6034N6335L1189Q6953j9293m7894k2825J30435J26979l3344j32263
$$ -324696 -238662 -182327 -151138 -64185 -83478 -131372 -154197 -23762 103217 69873 -62390
16711f2390N9680j38100k1374P9586J00429m8222j8061J02425R392M1154N9511
$$ -62390 -2710 -140810 -162184 -82598 17831 -30391 -48452 53973 63365 104519 164030
16700A64030L5163r4037k33909L3137R0955K70773J07393l1531j67703p2023L2111
$$ 164030 199193 105156 -128753 -95616 -4661 266112 373505 341974 174271 102248 134359
16689A34359q4459M7048N0583K9545M3637q8817j04390J54321p8186j79167j02673
$$ 134359 49900 96948 147531 177076 220713 131896 27506 181827 103641 -75526 -178199
16678a78199O710p0868j9579n9369k590R0413N726L8431K20931J38572J9153r5760
$$ -178199 -171489 -242357 -261936 -321305 -323895 -233482 -227756 -189325 31606 170178 189331 93571
16666I3571m373j72088r0717K0967r1788L333J03523j18405N0570J10897J47964
$$ 93571 89198 -82890 -173607 -152640 -244428 -241095 -137572 -255977 -205407 -94510 53454
16655E3454J7731k59680j65309N3587N3975k57J83579Q011J9887J48947k7565
$$ 53454 71185 -188495 -353804 -300217 -246242 -246499 -62920 -54909 -35022 113925 86360
16644H6360j43981j28348j67655j3724J62149J02756J14046K96896N2222j40943
$$ 86360 -57621 -185969 -353624 -367348 -205199 -102443 11603 308499 360721 219778
16634B19778k51172o5611r4359o1828j44349K8582o6296P8665K82462N5325j640
$$ 219778 -31394 -97005 -191364 -253192 -397541 -368959 -435255 -356590 -74128 -18803 -20443
16623b0443j7695o9522k48252o1429J41160Q7499J38666K31157K209k8486j08561
$$ -20443 -38138 -107660 -355912 -417341 -276181 -188682 -50016 181141 183350 154864 46303
16612D6303m1265l8395k7536Q6817J53787r9135M7088P1667J6770K1620o4785
$$ 46303 5038 -33357 -60893 25924 179711 80576 127664 199331 216101 237721 172936
16601A72936L6628l8295N1133Q8845o6954k62304l11718O5607J73985Q857j30791
$$ 172936 209564 171269 222402 311247 244293 -18011 -329729 -264122 -90137 -81280 -212071
16590b12071J62635J88896j76023q4068q6455K910J28748j8368J32230r2934j52885
$$ -212071 -49436 139460 -36563 -120631 -207086 -204176 -75428 -93796 38434 -54500 -207385
16579b07385J37443Q9308j11349j46364J10684J31212k3618j58718j16927L9887
$$ -207385 -69942 19366 -91983 -238347 -127663 3549 -20069 -178787 -295714 -255827
16569b55827J88310O5562P0486O4651r1677l0304J26210M8401r2711n2235J04999
$$ -255827 -67517 -1955 68531 133182 41505 11201 137411 185812 93101 40866 145865
16558A45865r3022n9176K8261p5606j11696N1106N5146j1793J0559R2020L3030
$$ 145865 52843 -6333 21928 -53678 -165374 -114268 -59122 -70915 -60356 31664 64694
16547F4694K3626J51504l4k64292k94641M0104R2200J01867J3015q6042j67040
$$ 64694 88320 239824 239790 -24502 -319143 -279039 -186839 -84972 -71957 -157999 -325039
16536c25039n969O5952K11275M9535j9988n0370J57284M7753j5306j42659k176
$$ -325039 -331008 -265056 -53781 -4246 -24234 -74604 82680 130433 115127 -27532 -29708
16525b9708k072k46649j39954J67642K97226J78792j05686j37727q9378r8666
$$ -29708 -31780 -278429 -418383 -250741 46485 225277 119591 -18136 -107514 -206180
16515b06180O283K3475M5352J25335J03216j00786l2288K7476J48576J39737k58562
$$ -206180 -199897 -176422 -131070 -5735 97481 -3305 -35593 -8117 140459 280196 21634
16504B1634j16789p4485K948m028j32259L348J10129J64313N1217j11014J9570
$$ 21634 -95155 -169640 -166692 -170720 -302979 -299631 -189502 -25189 26028 -84986 -65416
16493f5416j6214j25188J04971M442N640k9142j58253N5973k7268k7995k4441
$$ -65416 -81630 -206818 -101847 -97405 -91765 -120907 -279160 -223187 -250455 -278450 -302891
16482c02891J01785r4462J771P2717j29919O0363q3880N5459n4922j15585J80844
$$ -302891 -201106 -295568 -293797 -221080 -350999 -290636 -374516 -319057 -373979 -489564 -308720
16471c08720J12336R7744P3830m2886J5035j48497n7465M293J49550l0517J18009
$$ -308720 -196384 -98640 -24810 -67696 -52661 -201158 -258623 -254330 -104780 -135297 -17288
16460a7288K9813j27633j8909n0541j92283L0877k0854m8666K2950J62387N6107
$$ -17288 12525 -115108 -134017 -184558 -376841 -345964 -366818 -415484 -392534 -230147 -174040
16449a74040j71646j00425N2567R6857P0739K6485o1625J7062Q7874J44314Q5707
$$ -174040 -345686 -446111 -393544 -296687 -225948 -199463 -261088 -244026 -156152 -11838 73869
16438G3869o4816q9164L080O0583L4388M9440M113j06512K5551r990l504k0378
$$ 73869 9053 -80111 -77031 -16448 17940 67380 71493 -35019 -9468 -19458 -22962 -43340
16426d3340j40646J25531k371l5535k20189n0107J25513j70322J67252M10Q7332
$$ -43340 -183986 -58455 -60826 -96361 -316550 -366657 -241144 -411466 -244214 -243804 -156472
16415a56472R5988N1783J52713K54737q3582j40974k35600L6189M6149J64418
$$ -156472 -60484 -8701 144012 398749 315167 174193 -61407 -25218 20931 185349
16405A85349l1982k02407m2774r6182J04184j09597j6738J09862J29064K7270
$$ 185349 153367 -49040 -91814 -187996 -83812 -193409 -210147 -100285 28779 56049
16395E6049n4723o2755P1620p5323k8117O8052L9490j49113j24902l9623J0391
$$ 56049 1326 -61429 10191 -65132 -93249 -25197 14293 -134820 -259722 -299345 -288954
16384b88954J28896l7382J0166p3507L1004O9375J39299J72807q341p6894k7707
$$ -288954 -160058 -197440 -187274 -260781 -229777 -160402 -21103 151704 143363 66469 38762
16373C8762k21417Q1113L1347l2945J36901o6611j605J76496k2888j83129k75074
$$ 38762 -182655 -101542 -70195 -103140 33761 -32850 -34455 142041 119153 -63976 -339050
16362c39050k3549K26496R8149m0963k10877o5831M9467j19400J04182M6168r3753
$$ -339050 -362599 -136103 -37954 -78917 -289794 -355625 -306158 -425558 -321376 -275208 -368961
16351c68961J73899J78540M1401o8094J44383J3478O3451q8503j28819L1293J0253
$$ -368961 -195062 -16522 24879 -43215 101168 114646 178097 89594 -39225 -7932 2321
16340B321r8200L3349J33395j00719j54600K0208Q0321J55855J29020P2575k53588
$$ 2321 -95879 -62530 70865 -29854 -184454 -164246 -83925 71930 200950 273525 19937
16329A9937l51426m2292J32214J44240o729J12518j8541p8690L1907j6572j2080
$$ 19937 -331489 -373781 -241567 -97327 -104056 8462 -10079 -88769 -56862 -73434 -85514
16318h5514l6862J12951j3262j10059j452R6223j942p0398P4917L7447L2623r9794
$$ -85514 -122376 -9425 -22687 -132746 -134198 -37975 -39917 -110315 -35398 2049 34672 -65122
16306f5122n9567L0237K5499j21114j35420J62284J309j29850n0874k7958j0039
$$ -65122 -124689 -94452 -68953 -190067 -325487 -163203 -161894 -291744 -342618 -370576 -380615
16295c80615m8651P6008N4642m4570K64058J56462R935k18047o1668J04700P0129
$$ -380615 -429266 -353258 -298616 -343186 -79128 77334 87269 -130778 -192446 -87746 -17617
16284a7617q6096J46253O941k15662j8811p3901M9583M3052Q278J7546j13586
$$ -17617 -103713 42540 49481 -166181 -184992 -258893 -209310 -166258 -157980 -140434 -254020
16273b54020J5744J08820q1589o5053L3442Q8783J50778P3450m0123k3676J1202
$$ -254020 -238276 -129456 -211045 -276098 -242656 -153873 -3095 70355 30232 6556 17758
16262A7758R6717M2279j47597k1250l5226K00402M4263p7501j69761l982n1672
$$ 17758 114475 156754 9157 -12093 -47319 153083 197346 119845 -49916 -53898 -105570
16251a05570k11313R2357L14339p9845J0827O8382q975j60831j19511P285L3571
$$ -105570 -316883 -224526 89813 9968 20795 89177 80202 -80629 -200140 -192855 -159284
16240a59284Q549k4179p0516M5278L7464N4086J29203J75784M0008m0240j72058
$$ -159284 -150735 -174914 -245430 -200152 -162688 -108602 20601 196385 236393 196153 24095
16229B4095k21212l9357K4069q5678o619J44983J580O3222N6719J40952j07703
$$ 24095 -197117 -236474 -212405 -298083 -304702 -159719 -158139 -94917 -38198 102754 -4949
16218d949j98941J34086J45097N9414o5053j1613L5294L989K9465P5179j00090
$$ -4949 -203890 -69804 75293 134707 69654 58041 93335 97324 126789 201968 101878
16207A01878J2140K62578J75755j94219j48700M34j24699j0933n7073M0347l3798
$$ 101878 114018 376596 552351 358132 209432 209866 85167 74234 17161 57508 23710
16196B3710P239K0471l7850j215m5821o3595j06448R1l1269k5822R3174K10136
$$ 23710 30949 51420 13570 12355 -33466 -97061 -203509 -203418 -234687 -260509 -167335 42801
16184D2801l2420J6764n2471j4143R2457N997M2279j59053p1569j08225j41074
$$ 42801 10381 27145 -25326 -39469 52988 58985 101264 -57789 -129358 -237583 -378657
16173c78657J09479K10350N0556k535K0815n9367j90198l2749R5588L092N7040
$$ -378657 -269178 -58828 -8272 -10807 10008 -49359 -239557 -272306 -176718 -173626 -116586
16162a16586k5817p4841j2803K2068n2973P1662J47907J5641J39770R7297r4951
$$ -116586 -142403 -217244 -230047 -207979 -260952 -189290 -41383 -25742 114028 211325 116374
16151A16374J49149J42206m0071j46459r4828k10827r5763J86246J24627j42783
$$ 116374 265523 407729 367658 221199 126371 -84456 -180219 6027 130654 -12129
16141a2129j47243p234J83612Q4852N7686l5363j09574k23216j1744J98847Q375
$$ -12129 -159372 -166606 17006 101858 159544 124181 14607 -208609 -220353 -21506 -13131
16130a3131j26027N222J46694M3387J44679o3316q2423k00395r1990R5264K7365
$$ -13131 -139158 -133936 12758 56145 200824 137508 55085 -145310 -237300 -142036 -114671
16119a14671J46254o5421l3925M0172K4098M6257p068k27634R139J03192J43461
$$ -114671 31583 -33838 -67763 -27591 -3493 42764 35696 -191938 -182799 -79607 63854
16108F3854k9912o7297Q6651j35158J8360J90715M135j92129p016J62549o1769
$$ 63854 33942 -33355 53296 -81862 -63502 127213 131348 -60781 -67797 94752 32983
16097C2983m9013P883n7679j8431j04922q655p8307k6176J10183N6695P1355L0297
$$ 32983 -16030 -8147 -65826 -84257 -189179 -197834 -276141 -302317 -192134 -135439 -64084 -33787
16085c3787J16226k14042j99908R7592J06528j3592O2827J4863L9113J14361J00717
$$ -33787 82439 -131603 -331511 -233919 -127391 -140983 -78156 -63293 -24180 90181 190898
16074A90898k2926M6795j73407j13944Q59K6197M7997J22545K3021j10053L2363
$$ 190898 167972 214767 41360 -72584 -71725 -45528 2469 125014 148035 37982 70345
16063G0345N6439r9942J6427O9414n8343Q5389k5970L2682k20340j22928J15636
$$ 70345 126784 26842 43269 112683 54340 139729 113759 146441 -73899 -196827 -81191
16052h1191P4792j2691J4020p2544k0476N1537q0253j94557L1147K44744J11759
$$ -81191 -6399 -19090 -5070 -77614 -98090 -46553 -126806 -321363 -290216 -45472 66287
16041F6287q0497r0781J2156R1084k4583p5954O3850J29179J38857j24939k30741
$$ 66287 -14210 -104991 -92835 -1751 -26334 -102288 -38438 90741 229598 104659 -126082
16030a26082O9110J50239L1706j34408j01315l8973q1620k15574r1668O3461K10288
$$ -126082 -56972 93267 124973 -9435 -110750 -149723 -231343 -446917 -538585 -475124 -264836
16019b64836J48486k1145l2460J08248K19287R270M7147p5850j73692k4363n6729
$$ -264836 -116350 -137495 -169955 -61707 157580 166850 213997 138147 -35545 -59908 -116637
16008a16637J11802L0829r992k7327L0806p693J88126O7523M9638l6077p1774
$$ -116637 -4835 25994 16002 -11325 19481 11788 199914 267437 317075 280998 209224
15997B09224r8986j82897j20821l6179j43518J0302J54144J00324O7891Q8040
$$ 209224 110238 -72659 -193480 -229659 -373177 -362875 -208731 -108407 -40516 47524
15987D7524R3886m6727l6612q6142j23687J09639J28152K9572j39962J81238l3593
$$ 47524 141410 94683 58071 -28071 -151758 -42119 86033 115605 -24357 156881 123288
15976A23288r3107n9885k0126o2090m797O8322N2831o7172L7588J00697j9875
$$ 123288 30181 -29704 -49830 -111920 -116717 -48395 4436 -62736 -25148 75549 55674
15965E5674p5330k15580O5897K36001P4686p6372j33953K2651O2328l2874k06329
$$ 55674 -19656 -235236 -169339 66662 141348 64976 -68977 -46326 16002 -16872 -223201
15954b23201j72464j13009j09519J90331J30349Q820j01975l2010Q3569J16925
$$ -223201 -395665 -508674 -618193 -427862 -297513 -288693 -390668 -422678 -339109 -222184
15944b22184K15r9258k2190P1479J28987l0743n6960j01143P4355j24667N3425
$$ -222184 -221969 -321227 -343417 -271938 -142951 -173694 -230654 -331797 -257442 -382109 -328684
15933c28684J56196J8533k4529m4613j90638P6576J43807o675j53673P950o1761
$$ -328684 -172488 -153955 -178484 -223097 -413735 -337159 -193352 -200027 -353700 -345750 -407511
15922d07511q3392P7339M8041J85635n1415L8029O5540P0492o3378P0366J14340
$$ -407511 -490903 -413564 -365523 -179888 -231303 -193274 -127734 -57242 -120620 -50254 64086
15911F4086k7613j5133O9337P8421j50663P7517K33516j25769j02737j36013j13889
$$ 64086 36473 21340 90677 169098 18435 95952 329468 203699 100962 -35051 -148940
15900a48940N917J00971m0050l6327o0956M2806J07442M8328k5780k3689j33723
$$ -148940 -143023 -42052 -82102 -118429 -179385 -136579 -29137 19191 -6589 -30278 -164001
15889a64001m7762J47045J34877J59128O6165j04051k9404j23507l6865P7225
$$ -164001 -211763 -64718 70159 229287 295452 191401 161997 38490 1625 78850
15879G8850K645j68640j07387J00871R5516N4787j53096j24949R4529O1299K0761
$$ 78850 81495 -87145 -194532 -93661 1855 56642 -96454 -221403 -126874 -65575 -44814
15868d4814j4838N9029J82691j08545j15460j05659o3318l7792R8813K36908Q1297
$$ -44814 -59652 -623 182068 73523 -41937 -147596 -210914 -248706 -149893 87015 168312
15857A68312j19124L223n2366O2326N4346L0854j17036m4196o8373r7590K1614
$$ 168312 49188 52411 45 62371 116717 147571 30535 -13661 -82034 -179624 -158010
15846a58010M8737J56008k2940m7894K5415N2233N2563j31453O2400J87307R3241
$$ -158010 -109273 46735 23795 -24099 1316 53549 106112 -25341 37059 224366 317607
15835C17607n3616j03999k02551k06697p9170j960O735M2460m7469M7072l5962
$$ 317607 263991 159992 -42559 -249256 -328426 -330386 -323651 -281191 -328660 -281588 -317550
15824c17550m3421J23758R3689J46515j3354l1502M2717j8829R7480J9111l3498
$$ -317550 -360971 -237213 -143524 2991 -10363 -41865 852 -17977 79503 98614 65116
15813F5116r381n4046O333P7832O2070j1350J27820o7146j60636K3977j0277j20595
$$ 65116 55735 1689 8022 85854 147924 136574 264394 197248 36612 60589 50312 -70283
15801g0283q834L834J15767M6714N8056n8991l5111q5689j74300j03248J51135
$$ -70283 -79117 -75283 40484 87198 145254 86263 51152 -34537 -208837 -312085 -160950
15790a60950L0239P7436J93918j89700j48936R6330Q1036N3589j21188j16346
$$ -160950 -130711 -53275 140643 -49057 -197993 -101663 -20627 32962 -88226 -204572
15780b04572L3464m5813J11664J32208m7703j16037j16218J09455J3701J87705
$$ -204572 -171108 -216921 -105257 26951 -20752 -136789 -253007 -143552 -129851 57854
15770E7854J32650j18682j9385p4723P6313J09147J2471M6966o8088K6466m882
$$ 57854 190504 71822 52437 -22286 54027 163174 175645 222611 154523 180989 176107
15759A76107j01064O1429J36697K16246K15270J78746J88725K89608Q60085J558752
$$ 176107 75043 136472 273169 489415 704685 883431 1072156 1361764 2221849 3780601
15749C780601J671562N36907n94309q20507j044982j373726r97047m18537l51713
$$ 3780601 5452163 5989070 5394761 4574254 3529272 2155546 1158499 739962 388249
15740C88249j49309J08238J01325j09266k09714Q4019J76509J7730k3143j72744
$$ 388249 238940 347178 448503 339237 129523 213542 390051 407781 384638 211894
15730B11894q7627n9470n4744J7163j16447k63897O0698J07134Q8376Q4773n6124
$$ 211894 124267 64797 10053 27216 -89231 -353128 -292430 -185296 -96920 -12147 -68271
15719f8271p1860J54008j6706K428J1089K7910k48516l612P5998r4797k856Q9039
$$ -68271 -140131 13877 -2829 -401 10688 38598 -209918 -213530 -137532 -232329 -235185 -146146
15707a46146O3492R413J40047J27525j4260j20896o1583n3327r3479K2960M0635
$$ -146146 -82654 -73241 66806 194331 180071 59175 -2408 -55735 -149214 -126254 -85619
15696h5619j9696j02341J20862r180K811Q9306o6606j93830k5108Q1476J26349
$$ -85619 -105315 -207656 -86794 -95974 -93163 -3857 -70463 -264293 -289401 -207925 -81576
15685h1576n4475p8044q9370p7688K0893K10063J04855j32084K7705J28222J19672
$$ -81576 -136051 -214095 -303465 -381153 -360260 -150197 -45342 -177426 -149721 -21499 98173
15674I8173q9824J69649j5820k36348o7506Q9766o7257o825Q0403N775Q509O418
$$ 98173 8349 177998 162178 -74170 -141676 -51910 -119167 -125992 -45589 -39814 -31305 -24887
15662b4887L4329M8841j34853K2660Q4069k39451q9442J77993P9043n328l8344
$$ -24887 9442 58283 -76570 -53910 30159 -209292 -298734 -120741 -41698 -47026 -85370
15651h5370O600p9944n0526k3107N5577J36247J03794j26526Q4394J93083L1882
$$ -85370 -78770 -158714 -209240 -232347 -176770 -40523 63271 -63255 21139 214222 246104
15640B46104j1248O1723j39511J32501l6580p8777p3165j4307M0768j3396o0129
$$ 246104 234856 296579 157068 289569 252989 174212 101047 86740 127508 114112 53983
15629E3983l5240m6626O6283j95731j17053K8439J90439J00799j3781p8128n919
$$ 53983 18743 -27883 38400 -157331 -274384 -245945 -55506 45293 31512 -46616 -52535
15618e2535K06945k2922m5739l4361k182J8307l9960j31008P8992M3716p7880
$$ -52535 154410 131488 85749 51388 49206 67513 27553 -103455 -24463 19253 -58627
15607e8627k35269j18664P0664L5698Q3937O9883N2629K8706k1624j06823m6205
$$ -58627 -293896 -412560 -341896 -306198 -222261 -152378 -99749 -71043 -92667 -199490 -245695
15596b45695R2259P1244J30730o811o0183Q1311L6039p7678r617N8492m730P4173
$$ -245695 -153436 -82192 48538 41727 -18456 62855 98894 21216 11599 70091 65361 139534
15584A39534M5592j7667j30131n8848m2997L9751J29877k2662K573l1607J11447
$$ 139534 185126 167459 37328 -21520 -64517 -24766 105111 82449 85022 53415 164862
15573A64862J22071M0730j22450j35329P2078r057m6749O4920r0809j24800Q8945
$$ 164862 286933 327663 205213 69884 141962 132905 86156 151076 60267 -64533 24412
15562B4412M7194j87248k37533j9617J73155J08801Q454M2323o3280J11335m0665
$$ 24412 71606 -115642 -353175 -372792 -199637 -90836 -82382 -40059 -103339 7996 -32669
15551c2669K259q4122q8038J53589K27246Q9419p9251j3746r2300k713M9034k170
$$ -32669 -30410 -114532 -202570 -48981 178265 267684 188433 174687 82387 79674 128708 126538
15539A26538k4070j40043k24156o6078J93821O1578J56326j81980j37293J47764
$$ 126538 102468 -37575 -261731 -327809 -133988 -72410 83916 -98064 -235357 -87593
15529h7593K51815J57131r3517j79684j11607o357J01773n590Q447K8377j9131
$$ -87593 164222 321353 227836 48152 -63455 -69812 31961 26371 34818 63195 44064
15518D4064k16982j01987J01452K8244L9819Q8959K6843R7014k7890q9615k08008
$$ 44064 -172918 -274905 -173453 -145209 -105390 -16431 10412 107426 79536 -10079 -218087
15507b18087J47044O3002j47571m427Q9934j6915j07827n1932K7903K13551M7071
$$ -218087 -71043 -8041 -155612 -160039 -70105 -87020 -194847 -246779 -218876 -5325 41746
15496D1746k05331J10057J474O5579l2664o473J41646M583k06575j8038J26439
$$ 41746 -163585 -53528 -52054 13525 -19139 -25612 116034 120617 -85958 -103996 22443
15485B2443R449N4724K2051j14458J0666N0621l5282j98785j33985K5745L4484
$$ 22443 31892 86616 108667 -5791 4875 55496 20214 -178571 -312556 -286811 -252327
15474b52327O7845M2136Q1068n396O1269j47624N286K11077J80644r0607n4163
$$ -252327 -184482 -142346 -61278 -66674 -5405 -153029 -147743 63334 243978 153371 99208
15463I9208j16213j15190O7983O2005p397k2524l3783R6903l1879P8688J10084
$$ 99208 -17005 -132195 -64212 -2207 -9604 -32128 -65911 30992 -887 77801 187885
15452A87885O3191q5165j00608j65294N8354j6886P1431R2533J76268j74824j87032
$$ 187885 251076 165911 65303 -99991 -41637 -58523 12908 105441 281709 106885 -80147
15441h0147l598n1211L0239J46920J03848j13369k07873n9126j3716l2300Q5084
$$ -80147 -83745 -134956 -104717 42203 146051 32682 -175191 -234317 -248033 -280333 -195249
15430a95249Q7748R8755R9265j34721m5933N6734P8592j55485K0925r3742j29501
$$ -195249 -107501 -8746 90519 -44202 -90135 -33401 45191 -110294 -89369 -183111 -312612
15419c12612M1264J39718J08515J01156o499k30683K1828Q1653N8782J32753l4808
$$ -312612 -271348 -131630 -23115 78041 71542 -159141 -137313 -55660 3122 135875 101067
15408A01067j75756N2485J13052j48856j13122Q145r2047P6640K74832J21720
$$ 101067 -74689 -22204 90848 -58008 -171130 -162985 -255032 -178392 96440 218160
15398B18160j11668l7608J8279n2208j17104r2683l7861J07671J22897N8709o1359
$$ 218160 106492 68884 87163 34955 -82149 -174832 -212693 -105022 17875 76584 15225
15387A5225j39881n4736J0210R0426M300J6276q9762L8966R4079K4177l3794J2429
$$ 15225 -124656 -179392 -169182 -78756 -74456 -58180 -147942 -108976 -14897 9280 -24514 -12085
15375a2085O4755N862P2710J46033l7728j93135r0991k9486q9835J18239k0899
$$ -12085 52670 58532 131242 277275 239547 46412 -44579 -74065 -163900 -45661 -66560
15364f6560q5748P3564o2301j24418o3256K9136K33741K65252M1536j43389K4950
$$ -66560 -152308 -78744 -141045 -265463 -328719 -299583 -65842 199410 240946 97557 122507
15353A22507k0372r6182J3775L0551o0416J099J14631R199K1941L5739M394p6521
$$ 122507 102135 5953 19728 50279 -10137 -9038 105593 114792 136733 172472 176866 100345
15341A00345J3976N7629n6974j36745j01775O8912j8017O6584J4331o9292m8356
$$ 100345 114321 171950 114976 -21769 -123544 -54632 -72649 -6065 8266 -61026 -109382
15330a09382J06020N0090l4046N9920l5565j21404k8727j4826L3318l4818N0457
$$ -109382 -3362 46728 12682 72602 37037 -84367 -113094 -127920 -94602 -129420 -78963
15319g8963P9855k2251o6815j6107J05123J14079J00683j0713n9789M1583M0828
$$ -78963 892 -21359 -88174 -104281 842 114921 215604 204891 145102 186685 227513
15308B27513n5130n0089P2230q0286j96229n6182J46601J63825P1508L558j68811
$$ 227513 172383 122294 194524 114238 -81991 -138173 8428 172253 243761 247319 78508
15297G8508m9916J00228K5817j45354l3133p0644J30049P6883L1800L1142J40918
$$ 78508 28592 128820 154637 9283 -23850 -94494 35555 112438 144238 175380 316298
15286C16298J5723j13629J38427O6186k18228p5650j3998K23797J40009j2897
$$ 316298 332021 218392 356819 423005 204777 129127 115129 338926 478935 466038
15276D66038L947J7820j8286K0058R3789k37655P443K56363L00916M21167J81260
$$ 466038 469985 487805 469519 489577 583366 345711 353154 609517 910433 1331600 1512860
15265A512860J52538K42784L37566K49891J78024K2214o6227j80182j81558j37755
$$ 1512860 1665398 1908182 2245748 2495639 2673663 2695877 2629650 2449468 2267910 2130155
15255B130155J0563m27611m86699p5149j58937j32679l2447k09710j82188j30819
$$ 2130155 2140718 1713107 1226408 1151259 992322 859643 827196 617486 435298 304479
15245C04479N1119K0655K153K7233l410j6160Q9742R158k15461q1516p1341o7516
$$ 304479 355598 376253 378406 405639 402229 386069 475811 484969 269508 187992 116651 49135
15233D9135j92232M0579L3266l5020J97833J19624O7614j0599o6952J31927j12868
$$ 49135 -143097 -102518 -69252 -104272 93561 213185 280799 270200 203248 335175 222307
15222B22307j45307m1552J8066n7252P7341m197R1640K889M6585k9103o5483r4941
$$ 222307 77000 35448 53514 -3738 73603 69406 161046 163935 210520 181417 115934 20993
15210B0993J03669J69148K665j16442j1833P2111K3014Q0023j35197m182J0821
$$ 20993 124662 293810 296475 180033 168200 240311 263325 343348 208151 203969 214790
15199B14790L1781o8218K2462j92219n2509R5403O0446n2580j07882K06644R7658
$$ 214790 246571 178353 200815 8596 -43913 51490 111936 59356 -48526 158118 255776
15188B55776J10432o2129n3025q9250K23941l9424O2512n2410j82792r1438n0658
$$ 255776 366208 304079 251054 161804 385745 346321 408833 356423 173631 82193 31535
15177C1535j63292K16336Q7255q2072L2547J00289k3922M788j7788Q5361l36766
$$ 31535 -131757 84579 171834 89762 122309 222598 198676 203464 185676 271037 -65729
15166f5729Q2079k5986n1295k7866K37594M07j35299K3395K43247R6333q6741
$$ -65729 16350 -9636 -60931 -88797 148797 149204 13905 37300 280547 376880 290139
15155B90139j65219J7751N5364L8776j11662J312k5584l7463J8164J57139O45
$$ 290139 124920 142671 198035 236811 125149 126461 100877 63414 81578 238717 239362
15144B39362M5605m1199o3164j03168J41658J0920k41810m7564N4793Q5053Q3627
$$ 239362 284967 243768 180604 77436 219094 230014 -11796 -59360 -4567 80486 164113
15133A64113J567m8670k0769Q5756O4393j20232j8175R9167l0797j54057K6624
$$ 164113 165680 117010 96241 181997 246390 126158 107983 207150 176353 22296 48920
15122D8920j36138j09566m4815J42412K89389J34403Q6458l0427l06944N366O4049
$$ 48920 -87218 -196784 -241599 -99187 190202 324605 411063 380636 73692 79058 143107
15111A43107q2530M4291J17664Q9980m4314R1800P0961o605j031j82590k37852
$$ 143107 60577 104868 222532 312512 268198 359998 430959 424354 423323 240733 2881
15100B881Q2957K02742n559j59988q1670J52352J6901j21129p4608n1901l0045
$$ 2881 85838 288580 283021 123033 41363 193715 210616 89487 14879 -37022 -67067
15089f7067J43742J2112M5195J84544K2988k9645j02034J29592O467J09335j30784
$$ -67067 76675 88787 133982 318526 341514 311869 209835 339427 345894 455229 324445
15078C24445n0311P0831l8925J35216M4653j22391j9964P2753J54913P9792n3315
$$ 324445 274134 344965 306040 441256 485909 363518 343554 416307 571220 651012 597697
15067E97697q2334j28704p0695j2307J60454k2732j51073N819Q4453K0523R6537
$$ 597697 515363 386659 315964 303657 464111 441379 290306 296125 380578 401101 497638
15056D97638M7820J89027R871j18732P6658l1949r7690J6113J585J386J77501
$$ 497638 545458 734485 744356 625624 702282 670333 572643 588756 590341 591727 769228
15045G69228n2889O4613P4001j40420r0097J890N0991k26473j41486N5731j4267
$$ 769228 716339 780952 854953 714533 624436 626326 677317 450844 309358 365089 350822
15034C50822R6486n8820o9042k8761J10655O2067j24893L911k6960P5660l1190
$$ 350822 447308 388488 319446 290685 401340 463407 338514 342425 315465 391125 359935
15023C59935o5797j52355m7629J66636J81752N7868k2162j4387k6589m2819Q3274
$$ 359935 294138 141783 94154 260790 442542 500410 478248 463861 437272 394453 477727
15012D77727K16591J22992j03076q0981J02649m4945p1717j51490j20273J35870
$$ 477727 694318 817310 714234 633253 735902 690957 619240 467750 347477 483347
15002D83347L8986l8821L4824q5912J13388J1801J1115R9884n3591j3350j18841
$$ 483347 522333 483512 518336 432424 545812 557613 568728 668612 615021 601671 482830
14991D82830j7055R9981J06926K4726R9057j6598J3106j8203M7243P0843J0766
$$ 482830 465775 565756 672682 697408 796465 779867 792973 774770 822013 892856 903622
14980I03622J11045o1345K21591K71382J64770L8125k09015k46300J79517Q3749
$$ 903622 1014667 953322 1174913 1446295 1611065 1649190 1440175 1193875 1373392 1457141
14970A457141K5397l308j6512l5021j02577N0481Q4647l8172r6611p0752N2255
$$ 1457141 1482538 1479230 1462718 1427697 1325120 1375601 1460248 1422076 1325465 1254713 1306968
14959A306968Q5361J92491K84685Q7608J12026m1793J09620q8902N4408K09730
$$ 1306968 1392329 1584820 1869505 1957113 2069139 2027346 2136966 2048064 2102472 2312202
14949B312202N3388K23790K91237J37641J03070K57218M02705L21546O42498P25606
$$ 2312202 2365590 2589380 2880617 3018258 3121328 3378546 3781251 4102797 4745295 5470901
14939E470901O00279M47576M95282P65363Q69079J389332K253776K651162L710001
$$ 5470901 6071180 6518756 7014038 7779401 8648480 10037812 12291588 14942750 18652751
14930A8652751N954847R633028J4978647K1457933K2528248J1467313l342130
$$ 18652751 24607598 34240626 49219273 70677206 93205454 104672767 101330637
14923A01330637j1316267j6197805j8071947j4646687r664036o224070l898985
$$ 101330637 90014370 73816565 55744618 41097931 31433895 25209825 21310840
14916B1310840k362688j636240j313277j033512o17162n81037n45247l94930k74291
$$ 21310840 18948152 17311912 15998635 14965123 14347961 13766924 13221677 12826747 12552456
14907A2552456k06256k91529J02522L03995M58805O48431R64250J328252K280808
$$ 12552456 12346200 12054671 12157193 12461188 12919993 13568424 14532674 15860926 18141734
14898A8141734L209780M166804N857118Q419337J2869598K0420874L2555450M6367564
$$ 18141734 21351514 25518318 31375436 39794773 52664371 73085245 105640695 152008259
14890A52008259N0247816K9185894p247601k8810738l7001361m2430999l5061178
$$ 152008259 202256075 231441969 224194368 195383630 158382269 115951270 80890092
14883H0890092k2468682j3414609q525849n871640m198497l214384k605165k268460
$$ 80890092 58421410 45006801 36480952 30609312 26410815 23196431 20591266 18322806
14875A8322806j668928j100263q39477o88148n37854l18760j46514p4027K24565
$$ 18322806 16653878 15553615 14714138 14025990 13488136 13169376 13022862 12948835 13173400
14866A3173400M90568Q63027J085701J516303K005721K673354L478596M845346
$$ 13173400 13663968 14526995 15612696 17128999 19134720 21808074 25286670 30132016
14858C0132016P446279J1382393J7672579K4605890K4309263J1156576n562494
$$ 30132016 37578295 48960688 66633267 91239157 115548420 126704996 121142502
14851A21142502j3917017j9074493k0697655j6201427j0341607o177331l719588
$$ 121142502 107225485 88150992 67453337 51251910 40910303 34732972 31013384
14844C1013384k083149j048680l6626P21815J344672K041526K724549L504611
$$ 31013384 28930235 27881555 27844929 28566744 29911416 31952942 34677491 38182102
14836C8182102M293099N053992N873517P351618R701310J3122244J7818482K4159645
$$ 38182102 42475201 47529193 53402710 60754328 70455638 83577882 101396364 125556009
14828A25556009L2197625M0873440M9204165N5481056N8470800N6672560M9353333
$$ 125556009 157753634 198627074 247831239 303312295 361783095 418455655 467808988
14821D67808988L7072031K0477892J623451j7108099l3642214m6424294n3921524
$$ 467808988 504881019 525358911 526982362 509874263 476232049 429807755 375886231
14814C75886231n6225409n4199381m8442689m0663460l2966372k5534209j9313367
$$ 375886231 319660822 265461441 217018752 176355292 143388920 117854711 98541344
14807I8541344j4540875j1105737q757101p089264o026115n432054m875269m318387
$$ 98541344 84000469 72894732 64137631 57048367 51022252 45590198 40714929 36396542
14799C6396542l816087l431107k987691k464002k170355j713225j453513j193289
$$ 36396542 32580455 29149348 26161657 23697655 21527300 19814075 18360562 17167273
14791A7167273r82707j320819j301754j026417q37294m92227n46886o82254n20761
$$ 17167273 16184566 14863747 13561993 12535576 11698282 11206055 10659169 9976915 9456154
14782I456154o23082m06471j95046l10545m64055n28663m19262k46242m02836
$$ 9456154 8833072 8426601 8231555 7921010 7456955 6928292 6509030 6262788 5859952
14773E859952j09807p8284j93536L970J5033k0830J43690j30246k42174k66117
$$ 5859952 5750145 5671861 5478325 5482295 5497328 5476498 5620188 5489942 5247768 4981651
14763D981651l57304l66400m20370k20410j15157k00163j01245k10243j07006
$$ 4981651 4624347 4257947 3837577 3617167 3502010 3301847 3200602 2990359 2883353
14754B883353l17042j66277l6460K42303j8438k65806N8721K10797Q8293J3303
$$ 2883353 2566311 2400034 2363574 2605877 2587439 2321633 2380354 2591151 2679444 2692747
14744B692747J10757K8082q996j01865j61950k08482j48781j98518q9707O5029
$$ 2692747 2803504 2831586 2822590 2720725 2558775 2350293 2201512 2002994 1913287 1978316
14734A978316Q9760Q2727R0372J50161Q5348j35332k14050l99222k02425k16439
$$ 1978316 2068076 2150803 2241175 2391336 2476684 2341352 2127302 1728080 1525655 1309216
14724A309216n2254j56406k49077k3769R4370J89725o211o6597p7043j22225Q8133
$$ 1309216 1256962 1100556 851479 827710 922080 1111805 1105594 1038997 961954 839729 927862
14713I27862j7940q5169J09581J20628o9573j94312Q8414J74899k52917l22696
$$ 927862 909922 824753 934334 1054962 985389 791077 879491 1054390 801473 478777
14703D78777j05306n1680p912J30788p479K7394L5600l5007n8028O0094j08855
$$ 478777 373471 321791 313879 444667 437188 464582 500182 465175 407147 467241 358386
14692C58386o3207q0184r052M1540l706M7059o9936q5753K22180K4798k8477R609
$$ 358386 295179 214995 205943 247483 243777 290836 220900 135147 357327 382125 353648 363257
14680C63257k6562J15427k3016k53113O8402j3890K8275M1306n2842J30156J82299
$$ 363257 336695 452122 429106 175993 244395 230505 258780 300086 247244 377400 559699
14669E59699m568q4316o3068L0178O372J40495J8710q4279j5579j22555P414Q3826
$$ 559699 555131 470815 407747 437925 444297 584792 603502 519223 503644 381089 388503 472329
14657D72329j64614j31710p2930J5752J54077J25451q9023j89395n5055K0364
$$ 472329 307715 176005 103075 118827 272904 398355 309332 119937 64882 85246
14647H5246k7559M6629o8185L7690j704m2259J88071K09426j58496j19898n1787
$$ 85246 57687 104316 36131 73821 72117 29858 217929 427355 268859 148961 97174
14636I7174K16228K01676j5334M9383j0314j43193O8249k5827j62556J5801R7800
$$ 97174 313402 515078 499744 549127 538813 395620 463869 438042 275486 291287 389087
14625C89087P8314P924j72193j934J75944K10915J06487P4921L23540M41878K39407
$$ 389087 467401 475325 303132 301198 477142 688057 794544 869465 1193005 1634883 1874290
14614A874290J50375J30553P2630J51748L1109j50326l23460j20737k27675j27187
$$ 1874290 2024665 2155218 2227848 2379596 2410705 2260379 1936919 1816182 1588507 1461320
14604A461320j09834j80967j97398j76252k09844j52655P1219J11881r091j31611
$$ 1461320 1351486 1170519 973121 796869 587025 434370 505589 617470 608379 476768
14594D76768q3193j09552m9954K3616p6787j7260j29733P0971P8185J3251Q4098
$$ 476768 393575 284023 234069 257685 180898 163638 33905 104876 183061 196312 280410
14583B80410P4787j40782q1381j91429l8504K07438J83960j49889J13011n9028
$$ 280410 355197 214415 133034 -58395 -96899 110539 294499 144610 257621 198593
14573A98593n0090k057j43754J0012K36141n7338l7908R4512K3528k0656q0319
$$ 198593 148503 146446 2692 12704 248845 191507 153599 248111 271639 250983 170664
14562A70664R3220K6584p9643m47k13216j11185J72532J49265O3739j2393o0175
$$ 170664 263884 290468 210825 210378 -2838 -114023 58509 207774 271513 259120 198945
14551A98945O2340P5232M7547j38217j3654j54443j43526K8801J64115J8713o7347
$$ 198945 261285 336517 384064 245847 232193 77750 -65776 -36975 127140 145853 78506
14540G8506j89463J46722J6190n0924J5067J01622Q8269j3975m8460J8163j4387
$$ 78506 -110957 35765 51955 1031 16098 117720 205989 192014 143554 161717 147330
14529A47330R938Q9159n6381l2315r8489k58497J28258L69304J2665o6841K3537
$$ 147330 157268 246427 190046 157731 59242 -199255 -70997 298307 310972 244131 267668
14518B67668J4839K0695j22236j36820j5844j1586L7138j63847J05719J40562
$$ 267668 282507 303202 180966 44146 28302 16716 53854 -109993 -4274 136288
14508A36288Q7461j58759k22618K12633K02785r3585j51227l965m2235m3073K3457
$$ 136288 223749 64990 -157628 55005 257790 164205 12978 9013 -33222 -76295 -52838
14497e2838j15097O5045j44173k1231K38752J34251J11796J0761r8789J16789
$$ -52838 -167935 -102890 -247063 -268294 -29542 104709 216505 227266 128477 245266
14487B45266O5859j38485j913l4449j55780J68499j18935n110j1889j6257j03136
$$ 245266 311125 172640 170727 136278 -19502 148997 30062 24952 13063 -3194 -106330
14476a06330L3225M6503j00911j10853J66304J59100q2156l7851p1797R248J88621
$$ -106330 -73105 -26602 -127513 -238366 -72062 87038 4882 -32969 -104766 -95518 93103
14465I3103o3021p4003k35068l6438O0897J05018J29666r0708J57332J03297j60752
$$ 93103 30082 -43921 -278989 -315427 -254530 -149512 -19846 -110554 46778 150075 -10677
14454a0677L3678J39101J06897j03984o9595O1425l1698K0502j0481j1636P9385
$$ -10677 23001 162102 268999 165015 95420 156845 125147 145649 135168 123532 202917
14443B02917n0002j81924j8699j37510o8028J52857K18329J00091P0317j1904
$$ 202917 152915 -29009 -47708 -185218 -253246 -100389 117940 218031 288348 276444
14433B76444k80951j30570J65194J00535k74421R0504M9880K2024j30882J83285
$$ 276444 -4507 -135077 30117 130652 -143769 -53265 -3385 18639 -112243 71042
14423G1042K6999L2192J36185M8929k40270m1303J05732L0352p8501q2099J0287
$$ 71042 98041 130233 266418 315347 75077 33774 139506 169858 91357 9258 19545
14412A9545J17022O203K3958J61631k15750j53583J12620J29257m7123r5958P3683
$$ 19545 136567 142770 166728 328359 112609 -40974 71646 200903 153780 57822 131505
14401A31505M0005J90O1655o2802p5735j32764n4589J50823R2590M6758J6244
$$ 131505 171510 171700 233355 170553 94818 -37946 -92535 58288 150878 197636 213880
14390B13880M7226Q0098j63459N4116M7392k01061M1528L51930K55522J81972
$$ 213880 261106 341204 177745 231861 279253 78192 119720 471650 727172 909144
14380I09144J79857K17822L17364J7508O5935K83533K95865K9365J73000M2450
$$ 909144 1089001 1306823 1624187 1641695 1707630 1991163 2287028 2316393 2489393 2531843
14370B531843p2373k07533k17871k20502j97446j71740j95987j65244j17840k11185
$$ 2531843 2459470 2251937 2034066 1813564 1616118 1444378 1248391 1083147 965307 754122
14360G54122j65529j70776k2863M9042k6763k27957j0389j15678J14028J50395
$$ 754122 588593 417817 394954 443996 417233 189276 178887 63209 177237 327632
14350C27632K11017R545L1096N8857j23582j06496j2604j08999j50934j9129l7420
$$ 327632 538649 548194 579290 638147 514565 408069 395465 286466 135532 116403 78983
14339G8983m8977J35569J26470l1470q3531J9825j19344R0454M4972P393j48501
$$ 78983 30006 165575 292045 260575 177044 196869 77525 167979 212951 220344 71843
14328G1843J6549j2594K6214o7178J05509J11412q7496j48166K4476J11428j22245
$$ 71843 88392 75798 102012 34834 140343 251755 164259 16093 40569 151997 29752
14317B9752j76134M9160J62192J9254k2238n9720j0488j03307o5535R0404K35172
$$ 29752 -146382 -97222 64970 84224 61986 2266 -8222 -111529 -177064 -86660 148512
14306A48512l0013k50589M3754j3947l4535J92397J6714K2740k43172j85815J29418
$$ 148512 118499 -132090 -88336 -102283 -136818 55579 72293 95033 -148139 -333954 -204536
14295b04536J12493J02401J47541j093m931m5998j03433P884N214K48811r0216
$$ -204536 -92043 10358 157899 156806 151875 105877 2444 10328 15542 264353 174137
14284A74137j95980m7856O7745r8080J17670Q5913M1984r1872j89171K1323J30243
$$ 174137 -21843 -69699 -1954 -100034 17636 103549 145533 53661 -135510 -114187 16056
14273A6056J23915j69689O6930Q5851j10571n3327K01440P1132j36740j3319j2219
$$ 16056 139971 -29718 37212 123063 12492 -40835 160605 231737 94997 81678 69459
14262F9459O3766J37831L5600q7425q2968j63824l8394K0642j96018j48485J88532
$$ 69459 133225 271056 306656 219231 136263 -27561 -65955 -45313 -241331 -389816 -201284
14251b01284R3123J23224M8929m6882o4005q3272M95K02512Q4762j8257l1442
$$ -201284 -108161 15063 63992 17110 -46895 -130167 -129672 72840 157602 139345 107903
14240A07903o118l4400L0728j3496L94j6701j03711n7311J80585J28136j01010
$$ 107903 101785 67385 98113 84617 85011 68310 -35401 -92712 87873 216009 114999
14229A14999j34353R6408r5189K1599K04384q028o6825Q0682o3826j66179K6106
$$ 114999 -19354 77054 -18135 3464 207848 199820 132995 213677 149851 -16328 9778
14218I778J96499k22718r4446N3998P7581j3415o1006j29459N1818J59781J10174
$$ 9778 206277 -16441 -110887 -56889 20692 7277 -53729 -183188 -131370 28411 138585
14207A38585L4831j7028l0328J0982K02132L4886k66683k13188J02250O8035K8645
$$ 138585 173416 156388 126060 137042 339174 374060 107377 -105811 -3561 64474 93119
14196I3119l0075J11877J21317k0572K1615j29392j30692j58306j32934l4818
$$ 93119 63044 174921 296238 275666 297281 167889 37197 -121109 -254043 -288861
14186b88861l5787R2660J40920J66520J70682j15588j87497j26458K9416L29768
$$ -288861 -324648 -231988 -91068 75452 246134 130546 -56951 -183409 -153993 175775
14176A75775N2508j78360q6055N3925n7232j94710P5943J79671J40195j49703
$$ 175775 228283 49923 -36132 17793 -39439 -234149 -158206 21465 161660 11957
14166A1957j14184R6282K4904J94387P6867K73402N4235n8469J994K71273P4179
$$ 11957 -102227 -5945 18959 213346 290213 563615 617850 559381 561375 832648 906827
14155I06827n973R5591R3876N9049J73164o1796o4305n7048j51409O9254k9898
$$ 906827 900854 996445 1090321 1149370 1322534 1260738 1196433 1139385 987976 1057230 1027332
14144A027332j54127k20833j82616j38558o391r992j7068j43641j8403J15777
$$ 1027332 873205 652372 469756 331198 324807 314815 297747 154106 135703 251480
14134B51480m2788j1431j0915L4429Q43n0406P0960K1814n1231n9258J17549J35436
$$ 251480 208692 197261 186346 220775 221618 171212 242172 263986 212755 153497 271046 406482
14122D06482P8074L05118J40618K00544J26105j39161K2782K46086j7047p9821
$$ 406482 484556 789674 930292 1130836 1256941 1117780 1140562 1386648 1369601 1289780
14112A289780N0277n6809j92150k65978q6277k0784j55725k07204j42747j31390
$$ 1289780 1340057 1283248 1091098 825120 738843 718059 562334 355130 212383 80993
14102H0993n7781K6384p7067q4246P043J39614J11397M2026Q06j1914J8248k3330
$$ 80993 23212 49596 -27471 -111717 -104674 34940 146337 188363 189169 177255 195503 172173
14090A72173r5305m4521J27278L2974Q5382M8639o8734j6982p6130q8768K816
$$ 172173 76868 32347 159625 192599 277981 326620 257886 240904 164774 76006 78822
14079G8822l9261k6870r6800q2670n3326O0131J01435J25561J9619Q3564q7344
$$ 78822 39561 12691 -84109 -166779 -220105 -159974 -58539 67022 86641 170205 82861
14068H2861p8125R9443L4905J25354J765q902J32861M5307j46159j34169K7114
$$ 82861 4736 104179 139084 264438 266203 257301 390162 435469 289310 155141 182255
14057A82255M842j15626k4985J12448j5489Q419j43382q6067N584O8137R9850
$$ 182255 187097 71471 46486 158934 143445 151864 8482 -77585 -72001 -3864 95986
14046I5986j7765q3931N8673K02648J37548o2740j72246l3123Q2612K6934j10117
$$ 95986 78221 -5710 52963 255611 393159 330419 158173 125050 207662 234596 124479
14035A24479P9536J11713N8571J2475j26401j09967Q4406O9564j15550K568J919
$$ 124479 204015 315728 374299 386774 260373 150406 234812 304376 188826 191394 193313
14024A93313m5972j31578p8585l337j20698J1681o5889M9460J83635M6852o708
$$ 193313 147341 15763 -62822 -66159 -186857 -175176 -241065 -191605 -7970 38882 32174
14013C2174J44892J87357K0998n1000o267K5953j12443k1354l7911q4875j29876
$$ 32174 177066 364423 385421 334421 328154 354107 241664 220310 182399 97524 -32352
14002c2352K7470Q3323l501J25012j67225j66300J40473K21445j4309j20836q6432
$$ -32352 -4882 78441 74940 199952 32727 -133573 6900 228345 214036 93200 6768
13991F768j2045R3454K45498o1787j41197p3672o9195Q2001k324O717J20573j05680
$$ 6768 -5277 88177 333675 271888 130691 57019 -12176 69825 67501 74218 194791 89111
13979H9111j38041l689J03817P3699L1801j50618K3107m9709o4212l3392L1114
$$ 89111 -48930 -52619 51198 124897 156698 6080 29187 -20522 -84734 -118126 -87012
13968h7012J18689J93300Q126K8531j5189j34960q9415J55796R1910q7701o0991
$$ -87012 31677 224977 233103 261634 246445 111485 22070 177866 269776 182075 121084
13957A21084L3128j05334J44061J76123p3237j85993k9332j26057N0222P7824
$$ 121084 154212 48878 192939 369062 295825 109832 80500 -45557 4665 82489
13947H2489j5908m3729P1242P1296R1101Q1022K07747q2399l09448k52621N8674
$$ 82489 66581 22852 94094 165390 256491 337513 545260 462861 153413 -99208 -40534
13936d0534P2837k04392l9699J88826Q1277K41842k3600m3866J29196l3571L2628
$$ -40534 32303 -172089 -211788 -22962 58315 300157 276557 232691 361887 328316 360944
13925C60944q0320o3066O2873J65537m2967k52029r3111K47390l0963k00974j25086
$$ 360944 280624 217558 280431 445968 403001 150972 57861 305251 274288 73314 -51772
13914e1772j91633p4430K8354J62511M2609K2632M7136J34311R9855L9426L3272
$$ -51772 -243405 -317835 -289481 -126970 -84361 -61729 -14593 119718 219573 258999 292271
13903B92271j71070K158R722P9503L0453m5450q2155n7842J51018R9547l3790
$$ 292271 121201 123359 133081 212584 243037 197587 115432 57590 208608 308155 274365
13892B74365o5172n4172n2245P5721N863p6819K9887K09580O4923j08304L3744
$$ 274365 209193 155021 102776 178497 184360 107541 137428 347008 411931 303627 337371
13881C37371Q132p5911N796j13787K7709O3984o6656m9193J6084m4465j35177
$$ 337371 345503 269592 275388 161601 189310 253294 186638 137445 153529 109064 -26113
13870b6113K5941J15101L7972L358Q4280J02376j14485j19486K46636k1388N262
$$ -26113 -172 114929 152901 156259 240539 342915 228430 108944 355580 334192 339454
13859C39454Q1428j06611j39485J26817P8273L5136J54380J40158n0454k21923
$$ 339454 420882 314271 174786 301603 379876 415012 569392 709550 659096 437173
13849D37173k3719J89471o3640q4482L8328K2870K0331k7219J09566M7016J01413
$$ 437173 413454 602925 539285 454803 493131 516001 536332 509113 618679 665695 767108
13838G67108m8575J16475j09111k12221j0750L4382Q8767J33379L02j36838P3347
$$ 767108 718533 835008 725897 513676 502926 537308 626075 759454 759756 622918 696265
13827F96265j35286k36578j36980P2081k8331j6576R3044N9533j8446N545J7513
$$ 696265 560979 324401 187421 259502 231171 214595 307639 367172 348726 354271 371784
13816C71784o694K38439K36878o6115j06446o8575j3283k6511R059L7942o78m2724
$$ 371784 365090 603529 840407 774292 667846 599271 585988 559477 568536 606478 605800 563076
13804E63076J19969L46441K55060L7307j979m8282K974q1202j14106O0656n032
$$ 563076 683045 1029486 1284546 1321853 1319874 1271592 1274566 1193364 1079258 1139914 1134882
13793A134882K2350m4628j10107p9458p5395k2175R6812K59918m3307k92616L9269
$$ 1134882 1157232 1112604 1002497 923039 847644 825469 922281 1182199 1138892 846276 885545
13782H85545K67102j0230O319n3705K3040J26748J34725n9181n9438J31143R535
$$ 885545 1152647 1142417 1148736 1095031 1118071 1244819 1379544 1320363 1260925 1392068 1401603
13771A401603j18178M2226J20392j8063j1577M644N4391L09213O152j12714M8291
$$ 1401603 1283425 1325651 1446043 1427980 1416403 1421047 1475438 1784651 1790803 1678089 1726380
13760A726380J23814K67971J46288J49496O7315J83889Q7795k1592J93182L52206
$$ 1726380 1850194 2118165 2264453 2413949 2481264 2665153 2752948 2731356 2924538 3276744
13750C276744K72106K15903L14104L26074L36356N52090M15614J11385K66499
$$ 3276744 3548850 3764753 4078857 4404931 4741287 5293377 5708991 5820376 6086875
13741F086875K02887J48167P6234J43169L22453N25601L85827L68281N87454P68563
$$ 6086875 6289762 6437929 6514163 6657332 6979785 7505386 7891213 8259494 8846948 9615511
13731I615511R48030J160060J447092J857063K396310K842247L333172M434300
$$ 9615511 10563541 11723601 13170693 15027756 17424066 20266313 23599485 28033785
13723B8033785N993378Q322766J1644092J6050949K0226347K3657462K6399681
$$ 28033785 34027163 42349929 53994021 70044970 90271317 113928779 140328460
13716A40328460K8342686K9357677K7378541K1734918J4942138Q166777N95053
$$ 140328460 168671146 198028823 225407364 247142282 262084420 270251197 270846250
13709B70846250q117930j6319690k2263066k5493569k6485467k6331899k4521294
$$ 270846250 262728320 246408630 224145564 198651995 172166528 145834629 121313335
13702A21313335k1433120j7658609j4353510j0876353p776982n610583m200016
$$ 121313335 99880215 82221606 67868096 56991743 49214761 43604178 39404162
13695C9404162k851975j809034j001435l51180K61494J153752J955644L242317
$$ 39404162 36552187 34743153 33741718 33390538 33652032 34805784 36761428 40003745
13687D0003745M845052P361074J0645269J4512132J8229847K1712427K4257049
$$ 40003745 44848797 52209871 62855140 77367272 95597119 117309546 141566595
13680A41566595K6005379K6697319K4452990J9409786J2900958O302875p32093
$$ 141566595 167571974 194269293 218722283 238132069 251033027 257335902 256603809
13673B56603809q933662j6704947k2203589k4795724k5609057k5306209k3490014
$$ 256603809 247670147 230965200 208761611 183965887 158356830 133050621 109560607
13666A09560607k0485054j6834662j3438714j0381861p641201n822948m540571
$$ 109560607 89075553 72240891 58802177 48420316 40779115 34956167 30415596
13659C0415596l741608l189967k753832k126649j880850j776812j390354j126184
$$ 30415596 26673988 23484021 20730189 18603540 16722690 14945878 13555524 12429340
13651A2429340r68128q92801p89589p77134o91885n17484m86088l93622l39756
$$ 12429340 11461212 10568411 9778822 9001688 8309803 7792319 7306231 6912609 6572853
13642F572853m26239l50030k51482o2704k35742j35259j96721k10621n104q3518
$$ 6572853 6146614 5796584 5545102 5482398 5246656 5111397 4914676 4704055 4698951 4615433
13632D615433j39259N2632J50100J8779k24997j42131j5334p9966j55512r2726
$$ 4615433 4476174 4528806 4678906 4697685 4472688 4330557 4315223 4235257 4079745 3987019
13622C987019k45810l27293k22247k41331k20159k05557j72918k71912j35854
$$ 3987019 3741209 3413916 3191669 2950338 2730179 2524622 2351704 2079792 1943938
13613A943938K202n2738l2015K8488p2022q5183J1019K5596j84541j45211j26667
$$ 1943938 1946140 1893402 1861387 1889875 1817853 1732670 1743689 1769285 1584744 1439533 1312866
13602A312866J1928n953r1398p8386q7408j06795l3928Q415J05691m3273j99545
$$ 1312866 1324794 1318841 1227443 1149057 1061649 954854 920926 929341 1035032 991759 792214
13591G92214j45898Q3028J14213K3126r7871j88717l1902K00921J45151Q692O682
$$ 792214 646316 729344 843557 866683 768812 580095 548193 749114 894265 902957 909639
13580I09639N158k60331l7225J53166k2278j51344r9664k54296O7571J27156L6264
$$ 909639 914797 654466 617241 770407 748129 596785 497121 242825 310396 437552 473816
13569D73816J1980J09503O5414L4155m9855k45238P6637l6064j26838q4307o1178
$$ 473816 485796 595299 660713 694868 645013 399775 476412 440348 313510 229203 168025
13558A68025L7052Q7336j9466M2996O5678l0843r7767j0904J21317n047k07690
$$ 168025 205077 292413 272947 315943 381621 350778 253011 242107 363424 358377 150687
13547A50687j59212j38228J00937k1621j9761l1340N909M7861M5529O8045q1816
$$ 150687 -8525 -146753 -45816 -67437 -87198 -118538 -112629 -64768 -19239 48806 -33010
13536c3010L7234J64706J7847K1339J395p9744k7539L8613j20758p0277P725J24969
$$ -33010 4224 168930 186777 208116 209511 129767 102228 140841 20083 -50194 -42469 82500
13524H2500K08909o1754l30836l9679K03950J86336k5051o0162k62680O8130K68519
$$ 82500 291409 229655 -101181 -140860 63090 249426 224375 164213 -98467 -30337 238182
13513B38182N6858p352J70818J0056j59459J9857o8140j63284k51226J2732J27356
$$ 238182 295040 287688 458506 468562 309103 328960 260820 97536 -153690 -140958 -13602
13502a3602L8588L5911K46343m8816P5395R0457q7078k27640o8714Q8299L3145
$$ -13602 24986 60897 307240 258424 333819 424276 337198 109558 40844 129143 162288
13491A62288k9383k2979j7776K40956R7512j6468n5802J15662L296j83922j01693
$$ 162288 132905 109926 92150 333106 430618 414150 358348 474010 477306 293384 191691
13480A91691m3610r835Q4578Q6665r6982j39836M2359L0106M32J35474p7581j80081
$$ 191691 148081 138246 222824 309489 212507 72671 115030 145136 145568 281042 203461 23380
13468B3380j84788N723J40338R8473N8224r370j09607m8808j09989J93084O5542
$$ 23380 -161408 -155685 -15347 83126 141350 131980 22373 -26435 -136424 56660 122202
13457A22202j21587K8135J79667L7895p4108k0711j5740P075J12489R2202m2518
$$ 122202 615 28750 208417 246312 172204 151493 135753 142828 255317 347519 305001
13446C05001l8298r8197k36937m1827K2508M2253J79117L23823J05557J19735
$$ 305001 266703 168506 -68431 -110258 -87750 -45497 133620 457443 563000 682735
13436F82735K166j94407j67772j95108O5182m9477j73924j06621J42805L0955
$$ 682735 684901 490494 322722 127614 192796 143319 -30605 -137226 5579 36534
13426C6534j08824N1452J29815p7874j40822r1554p6444J50126K33605o7048j14738
$$ 36534 -72290 -20838 108977 31103 -109719 -201273 -277717 -127591 106014 38966 -75772
13415g5772j7588J33375J09159J86828l4714L1620R6390o5131N2774j47202n085
$$ -75772 -93360 40015 149174 336002 301288 332908 429298 364167 416941 269739 264654
13404B64654j18344l47897k3820K09534M3573j3119j2447J10637J67301p6880
$$ 264654 146310 -201587 -225407 -15873 27700 14581 2134 112771 280072 203192
13394B03192o1784M0127k5955R1221j67369k57473R157o6799O2450P624J03234
$$ 203192 141408 181535 155580 246801 79432 -178041 -168884 -235683 -173233 -165609 -62375
13383f2375N9780O6959K9524r538j1941l4007j28762Q1277L0850m0007q975N0909
$$ -62375 -2595 64364 93888 84350 72409 38402 -90360 -9083 21767 -18240 -27215 23694
13371B3694L042L0818j6161j36788R1932J90108J47779o9174j85605p4387R7046
$$ 23694 26736 57554 41393 -95395 -3463 186645 334424 265250 79645 5258 102304
13360A02304J58911L9666j71173j40028O1665j8870r2678L6016O7685J09230j57795
$$ 102304 261215 300881 129708 -10320 51345 32475 -60203 -24187 43498 152728 -5067
13349e067l9142n5023J0996p0138L9069L8968j77671j20551P615R6363J16324
$$ -5067 -44209 -99232 -88236 -158374 -119305 -80337 -258008 -378559 -370944 -274581 -158257
13338a58257o1203P3992J31575J77190K3320j28478k83774N2358L2867l9739k01523
$$ -158257 -219460 -145468 -13893 163297 186617 58139 -225635 -173277 -140410 -180149 -381672
13327c81672M5521J11213j2021J9386J08370O6459q1401N3257j49848L8445J10479
$$ -381672 -336151 -224938 -236959 -217573 -109203 -42744 -124145 -70888 -220736 -182291 -71812
13316g1812K9174k12457k3624L6838O8407r6806p3455j8888k0618K34403K57227
$$ -71812 -42638 -255095 -278719 -241881 -173474 -270280 -343735 -362623 -383241 -148838 108389
13305A08389J41352j51810J7715k2518k31159n7134J54413N2917J63574J45740
$$ 108389 249741 97931 115646 93128 -138031 -195165 -40752 12165 175739 321479
13295C21479Q8577o4052j06355M6397K0411p4154n6701k4242l5358p9011l0464
$$ 321479 410056 346004 239649 286046 306457 232303 175602 151360 116002 36991 6527
13284F527K3116l0492m035N7358P0085p8989O3013m1011J01964R9953j4301K2262
$$ 6527 29643 -849 -4884 52474 122559 43570 106583 65572 167536 267489 253188 275450
13272B75450J48437J48174O0407J79763J95389K63990J53055O4761Q2823m0190
$$ 275450 423887 572061 632468 812231 1007620 1271610 1424665 1489426 1572249 1532059
13262A532059k56039m8515L7016j61694k43744p7213p6687n8535k88133j26123
$$ 1532059 1276020 1227505 1264521 1102827 859083 781870 705183 646648 358515 232392
13252B32392K5580J35263K4683N141j72592k1782j8550J30566Q7875j87123M5450
$$ 232392 257972 393235 417918 423059 250467 228685 210135 340701 428576 241453 286903
13241B86903J39259R6104O981m590J59039Q9038o3935K3094K3745J68199J11430
$$ 286903 426162 522266 529247 524657 683696 772734 708799 731893 755638 923837 1035267
13230A035267J335J31588J46760m6125o0750l2768r0906k16367r2991K194p7263
$$ 1035267 1036602 1168190 1314950 1268825 1208075 1175307 1084401 868034 775043 777237 699974
13219F99974j2050N1340j51359k73750j44245l6803J6510j25964R2734J63573
$$ 699974 687924 739264 587905 314155 169910 133107 149617 23653 116387 279960
13209B79960K2777Q8107n327j14571j61533q07O9738K4968o6863k5520N3690l1683
$$ 279960 302737 390844 385517 270946 109413 108606 178344 203312 136449 110929 164619 132936
13197A32936l1573p4500O7400P8713P2260l3677j18789j05574L6552M9412L329
$$ 132936 101363 26863 94263 172976 245236 211559 92770 -12804 23748 73160 76489
13186G6489j03200Q5127n3062N7974J11707O0255j51238j94219o4773r6644L0412
$$ 76489 -26711 58416 5354 63328 175035 235290 84052 -110167 -174940 -271584 -241172
13175b41172Q4342J01837l6461J04047J99959J58780K9076K5418m5074P3290n6936
$$ -241172 -156830 -54993 -91454 12593 212552 371332 400408 425826 380752 454042 397106
13164C97106j4388J3452q6114j70112m4224j18792O7252Q7131J27359n0779j66744
$$ 397106 382718 396170 310056 139944 95720 -23072 44180 131311 258670 207891 41147
13153D1147j22265j24580J788J67872P4939l4273n5069m1830N3227n8515M6816
$$ 41147 -81118 -205698 -203910 -36038 38901 4628 -50441 -92271 -39044 -97559 -50743
13142e0743k6255k17942N9482R5410l7793m9071M2746m2007K3389L5267M7494
$$ -50743 -76998 -294940 -235458 -140048 -177841 -226912 -184166 -226173 -202784 -167517 -120023
13131a20023J96411P3477m1759P2272j0686L2742j22240j40760J17400p0040j45441
$$ -120023 76388 149865 108106 180378 169692 202434 80194 -60566 56834 -13206 -158647
13120a58647j62367N7201p3342K6773J03923J97502n2573j62158J41946Q5374
$$ -158647 -321014 -263813 -337155 -310382 -206459 -8957 -61530 -223688 -81742 3632
13110C632j06886J11587P5371n8646o1509r9583M7865J48210P6345j13334K0633
$$ 3632 -103254 8333 83704 25058 -36451 -136034 -88169 60041 136386 23052 43685
13099D3685J62027j5580j32414R3233j22589k91913k22309R7777R4349Q4242q3067
$$ 43685 205712 190132 57718 150951 28362 -263551 -485860 -388083 -293734 -209492 -292559
13088b92559l2132K9374M4911Q1376o765j9941J5931K33520K6716l7948P6224
$$ -292559 -324691 -295317 -250406 -169030 -175795 -195736 -179805 53715 80431 42483 118707
13077A18707M5989q821n3596j2341L1387J1305l0948q9376J46872J94549j23447
$$ 118707 164696 155875 102279 89938 121325 132630 101682 12306 159178 353727 230280
13066B30280p5386k51302j67853M1956J11885J13872N254j00321j78328J8966
$$ 230280 154894 -96408 -264261 -222305 -110420 3452 8706 -91615 -269943 -250977
13056b50977J87746m3353p4812P6798J06885J21578J64324o1891k71401m0320
$$ -250977 -63231 -106584 -181396 -104598 2287 123865 288189 226298 -45103 -85423
13046h5423j0883n1481l8685R0747L7527P849J4606j24226Q6579J41508Q0399
$$ -85423 -96306 -147787 -186472 -95725 -58198 -50349 -35743 -159969 -73390 68118 148517
13035A48517N2971K2119j46622j37023j3784J20595n3666N3109J05178k0031r0796
$$ 148517 201488 223607 76985 -60038 -73822 46773 -6893 46216 151394 131363 40567
13024D0567l2135l3382m0559l5257k314m9475o2308J32742K8616m0915N8752J7324
$$ 40567 8432 -24950 -65509 -100766 -103080 -152555 -214863 -82121 -53505 -94420 -35668 -18344
13012a8344k1408J11464Q0065j86445k39645O1120O2999J36067J27150J53669
$$ -18344 -39752 71712 151777 -34668 -274313 -213193 -150194 -14127 113023 266692
13002B66692j89050j50676k2675j51375J66033o6317J2599J02170J09126l784
$$ 266692 77642 -73034 -95709 -247084 -81051 -147368 -134769 -32599 76527 72743
12992G2743l2391n3602j0725j68022L3464O5960J12028N8851l5021M5898L3737
$$ 72743 40352 -13250 -23975 -191997 -158533 -92573 19455 78306 43285 89183 122920
12981A22920p6264l7492Q0423n0439P4899N8057K0821p6507k06460j42475j63129
$$ 122920 46656 9164 89587 39148 114047 172104 192925 116418 -90042 -232517 -395646
12970c95646J58316J83856J19623J2356m2265p2550L8003O2874O3550J8522q0394
$$ -395646 -237330 -53474 66149 78505 36240 -36310 1693 64567 128117 146639 66245
12959F6245m0073L1967P5598j25120k42464j5970J68594N5621K067K6637k0975
$$ 66245 26172 58139 133737 8617 -233847 -249817 -81223 -25602 -23535 3102 -17873
12948a7873m6213J08214r01k3596k288R579R2373Q1973p9232j8962O7282q1701
$$ -17873 -64086 44128 43227 19631 17343 26922 119295 201268 122036 103074 170356 88655
12936H8655j47883J21638J87095K8594R391j41768j020K9063j87467r3536j097
$$ 88655 -59228 62410 249505 278099 287490 145722 144702 173765 -13702 -107238 -108335
12925a08335R3080Q8908M0280j05198o4307l0011J21856q3543j59745J36906J32297
$$ -108335 -15255 73653 113933 8735 -55572 -85583 36273 -47270 -207015 -70109 62188
12914F2188K3548j05010k6433J03780n687n140k4182J39102j3083j35909p278
$$ 62188 85736 -19274 -45707 58073 52386 47246 23064 162166 149083 13174 5896
12903E896P0512j06407l9933P382k0460K62594q2888o6672K44066J05845j55573
$$ 5896 76408 -29999 -69932 -62550 -83010 179584 96696 30024 274090 379935 224362
12892B24362n9417J08166o8701j52741L7372O4175K7138J04357M9421j2230j94910
$$ 224362 164945 273111 204410 51669 89041 153216 180354 284711 334132 321902 126992
12881A26992n3360q6154k3996K5858N8011J88777J10643K6609n5179K8711M8380
$$ 126992 73632 -12522 -36518 -10660 47351 236128 346771 373380 318201 346912 395292
12870C95292L5643J5963N0212j04615j1954k5183n4220J8804P4400J46909K83659
$$ 395292 430935 446898 497110 392495 380541 355358 301138 319942 394342 541251 824910
12859H24910L11347K01862J6979r6545j76536j2535P0166j72597j36605N7775
$$ 824910 1136257 1338119 1355098 1258553 1082017 1069482 1139648 967051 830446 888221
12849H88221r8976j26615n7467L4401Q093r1860q605M601j31306j22862j01958
$$ 888221 789245 662630 605163 639564 647657 555797 547192 551793 420487 297625 195667
12838A95667k08640j11345J8541J210K36522q67J00433R2754j17720j39533l7540
$$ 195667 -12973 -124318 -105777 -104567 131955 131088 231521 324275 206555 67022 29482
12827B9482K7063l2937j23969L5880J5293o907l4102K4928N1371R4544R5056j59413
$$ 29482 56545 23608 -100361 -64481 -49188 -56095 -90197 -65269 -13898 80646 175702 16289
12815A6289r7634n8141j0856j28158J2069J86706J2509j63624J03827K22658N6856
$$ 16289 -81345 -139486 -150342 -278500 -266431 -79725 -67216 -230840 -127013 95645 152501
12804A52501j83506k48847L3794K13388K9619m0203K04212n7063j79145J20012
$$ 152501 -31005 -279852 -246058 -32670 -3051 -43254 160958 103895 -75250 44762
12794D4762M3910j09385j3727p6653n3904P5018Q3955O2418J5286p2897L914j779
$$ 44762 88672 -20713 -34440 -111093 -164997 -89979 -6024 56394 71680 -1217 2697 918
12782I18j26749O4048J51123J4075o0403j9428N962Q8545M5541j24656r3875k11356
$$ 918 -125831 -61783 89340 103415 43012 23584 29546 118091 163632 38976 -54899 -266255
12770b66255r7336K80921K86870R1264k5887m0453l7470j08216J51954K40291
$$ -266255 -363591 -82670 204200 295464 269577 229124 191654 83438 235392 475683
12760D75683P8095J12452N2222L6716J53608K85548J44197J49286R0845J33350
$$ 475683 553778 666230 718452 755168 908776 1194324 1338521 1487807 1578652 1712002
12750A712002K44380m703J00785K32208K71578m6169L9000j26188K1201p2847
$$ 1712002 1956382 1951679 2052464 2284672 2556250 2510081 2549081 2422893 2444094 2371247
12740B371247l49709k63100j15079j82832k91231k92524j45573j11666j1119q5338
$$ 2371247 2021538 1758438 1643359 1460527 1169296 876772 731199 619533 608414 523076
12730E23076J1161r5195k30451j55256m3957J11734J12999R6755M0772k22368
$$ 523076 534237 439042 208591 53335 9378 121112 234111 330866 371638 149270
12720A49270k82023k4838K40735J11946j05480k0768j35153R4921L5281j10792
$$ 149270 -132753 -157591 83144 195090 89610 68842 -66311 28610 63891 -46901
12710d6901M2944P4728N5364K38665J26861j26582k33062o0257n2286k1509Q4490
$$ -46901 -3957 70771 126135 364800 491661 365079 132017 71760 19474 -2035 82455
12699H2455l5032j20210j82534Q8688K00457j13590j27540l872J6706k8111K36503
$$ 82455 47423 -72787 -255321 -166633 33824 -79766 -207306 -211178 -194472 -222583 13920
12688A3920J35324Q2455N0782j22165K8910l1058p6994j26405p4209J8649k5961
$$ 13920 149244 231699 282481 160316 189226 158168 81174 -45231 -119440 -100791 -126752
12677a26752l7234O2271N0005R0127k6634L1179j02269r9613l6501K30845r0675
$$ -126752 -163986 -101715 -51710 38417 11783 42962 -59307 -158920 -195421 35424 -55251
12666e5251o6950o2462K08521J09886q6040J9469l1784K2982j64963K2540J35416
$$ -55251 -122201 -184663 23858 133744 47704 67173 35389 58371 -106592 -84052 51364
12655E1364m8505p7785J23361n4528j78052Q3592J30526J48933K8445q0076K2903
$$ 51364 2859 -74926 48435 -6093 -184145 -100553 29973 178906 207351 127275 150178
12644A50178j51697K1604O6488N3636j41426k92536J9813R5645R4552n8239j36873
$$ 150178 -1519 20085 86573 140209 -1217 -293753 -273940 -178295 -83743 -141982 -278855
12633b78855j07683J44110J73704Q6462J2848m197L1066j9180J16764N2931k15486
$$ -278855 -386538 -242428 -68724 17738 30586 26389 57455 38275 155039 207970 -7516
12622g516m0342J94622q3373o9516J9582j17692P5300K5129J19866J43262J60518
$$ -7516 -47858 146764 63391 -6125 13457 -104235 -28935 -3806 116060 259322 419840
12611D19840l7742j41852M0045J19920p0875N11K6018m5671j5574j73302m8043
$$ 419840 382098 240246 280291 400211 329336 329847 355865 310194 294620 121318 73275
12600G3275J65228M5141k54880j74280r0996r212J12565l8809Q6182J19785Q1258
$$ 73275 238503 283644 28764 -145516 -236512 -245724 -133159 -171968 -85786 33999 115257
12589A15257j77343J0505k8658O1993J74313N5412K1011j09957j52960q2398O4320
$$ 115257 -62086 -51581 -80239 -18246 156067 211479 232490 122533 -30427 -112825 -48505
12578d8505m4118N8632k839n9878j09345O9532O5207J4217q9217l5885o7331k3231
$$ -48505 -92623 -33991 -36830 -96708 -206053 -136521 -71314 -57097 -146314 -182199 -249530 -272761
12566b72761j16597j21382M6983L72017J32127R1890n1357n2127M764O4871k14653
$$ -272761 -389358 -510740 -463757 -91740 40387 132277 80920 28793 33557 98428 -116225
12555a16225J19350J75144Q2879r2707k10756o7551P100J46394r3470J59370N100
$$ -116225 3125 178269 261148 168441 -42315 -109866 -102766 43628 -49842 109528 114628
12544A14628m7543K443j20488j16961R0050L5976Q8474q4309n7700r2332j35860
$$ 114628 67085 69528 -50960 -167921 -77871 -41895 46579 -37730 -95430 -187762 -323622
12533c23622R6489J58710o0999q1891O794P5114R4138Q965J03253L7950n3907
$$ -323622 -227133 -68423 -129422 -211313 -204519 -129405 -35267 -26302 76951 114901 60994
12522F0994r5288j01814p9267m6330q995J14717J98969j46218l2325J58189R7440
$$ 60994 -34294 -136108 -215375 -261705 -270700 -155983 42986 -103232 -135557 22632 120072
12511A20072l0105R0687j09819J711l9294k74090j14727L8550K99132P9231r9787
$$ 120072 89967 180654 70835 72546 33252 -240838 -355565 -317015 -17883 61348 -38439
12500c8439j4590l3388J05910J09549j3993o9309j61375j815J10058j6010j22002
$$ -38439 -53029 -86417 19493 129042 115049 45740 -115635 -117450 -7392 -23402 -145404
12489a45404O1634N7988J92854J0983l66Q9647J4991j7313j11080j47877J12144
$$ -145404 -83770 -25782 167072 178055 177689 267336 282327 265014 153934 6057 118201
12478A18201Q5884n7249J98116M8824j80804k29701q5988P902O8848J9717r7009
$$ 118201 204085 146836 344952 393776 212972 -16729 -102717 -94815 -25967 -6250 -103259
12467a03259P0964J7629K6403p5636l7167R9694Q9557j31117j36775j8781L2649
$$ -103259 -32295 -14666 11737 -63899 -101066 -1372 88185 -42932 -179707 -198488 -165839
12456a65839J34038J53953o1905j17619P1654k3497J08209J2558l9952N9311j13478
$$ -165839 -31801 122152 60247 -57372 14282 -9215 98994 111552 71600 130911 17433
12445A7433n0402o1799o1076K161Q5463J67759J80219o3080m9754k09614j02158
$$ 17433 -32969 -94768 -155844 -153683 -68220 99539 279758 216678 166924 -42690 -144848
12434a44848J33521N2665N0629j5068l8247O3962P639N1720k7220k348J05417
$$ -144848 -11327 41338 91967 76899 38652 102614 110253 161973 134753 132405 237822
12423B37822J4109m4991q5573P4076r5041j00552L9830p2245q8787O0326J10867
$$ 237822 251931 206940 121367 195443 100402 -150 39680 -32565 -121352 -61026 49841
12412D9841M2290O1487p5096l993n102m5538q4003m0221j6534J06021q5084j9709
$$ 49841 92131 153618 78522 74529 69427 23889 -60114 -100335 -116869 -10848 -95932 -115641
12400a15641r589n2257q8903J05405m301P7186K51474L7735n2550l7449M2367
$$ -115641 -125230 -177487 -266390 -160985 -165286 -88100 163374 201109 148559 111110 153477
12389A53477j05330J6159p9937r1049p1764J3801N2263m3737L6708L0287O6585
$$ 153477 48147 64306 -15631 -106680 -178444 -164643 -112380 -156117 -119409 -89122 -22537
12378b2537O2135O5686k2972j13612p4764P7679J27O6107q0989l8775j7382J4099
$$ -22537 39598 105284 82312 -31300 -106064 -28385 -28258 37849 -43140 -81915 -99297 -85198
12366h5198R9312k7296J0381n6082j05630j14105K1769K8922M9217Q5252j46540
$$ -85198 14114 -13182 -2801 -58883 -164513 -278618 -256849 -227927 -178710 -93458 -239998
12355b39998J9741M5458N0148O6946P0042O3216K54789j675K9025j38680K411
$$ -239998 -220257 -174799 -124651 -57705 12337 75553 330342 328667 357692 219012 221423
12344B21423k1273k928j12831L1567J98931J10233j4853l062r1993j45525k9648
$$ 221423 200150 197222 84391 115958 314889 425122 410269 407207 315214 169689 140041
12333A40041k9931M6096K622Q3827Q903M8778J7882j57255j20334Q3546l0984
$$ 140041 110110 156206 158828 242655 251558 300336 318218 160963 40629 124175 93191
12322I3191j24175J58049p4696j24322J79174K32785Q9173l7427J05098M6476
$$ 93191 -30984 127065 52369 -71953 107221 340006 429179 391752 496850 543326
12312E43326p5879j64153j44884m9463k9159K8098R7625j13894j25583J01144
$$ 543326 467447 303294 158410 108947 79788 107886 205511 91617 -33966 67178
12302F7178j39029j05251p5418k4648O5433J27482J45884J96645J98875r0612
$$ 67178 -71851 -177102 -252520 -277168 -211735 -84253 61631 258276 457151 366539
12292C66539n8344j6422j31386j35812m1344j5364J0495J07451J06821L1402Q9721
$$ 366539 308195 291773 160387 24575 -16769 -32133 -21638 85813 192634 224036 313757
12281C13757J07946n6419j36638L8710n7868P7410R7349P1328k47608j61022M1854
$$ 313757 421703 365284 228646 267356 209488 286898 384247 455575 207967 46945 88799
12270H8799l7672K9656J00579j1055j77992o4344K9399k4320P6957o2181K25331
$$ 88799 51127 80783 181362 170307 -7685 -72029 -42630 -66950 10007 -52174 173157
12259A73157J52912Q7070p0862j04822n443J06446q3405k03910J07602R7596j77867
$$ 173157 326069 413139 342277 237455 232012 338458 255053 51143 158745 256341 78474
12248G8474j56535J8218p8116j52100O4554J92376K06121N4913p8800J8158l0328
$$ 78474 -78061 -59843 -137959 -290059 -225505 -33129 172992 227905 149105 167263 136935
12237A36935k22663j47709J6214Q5499J5273j21690m409J2556M7637N5042P6761
$$ 136935 -85728 -233437 -217223 -131724 -116451 -238141 -242550 -229994 -182357 -127315 -50554
12226e0554P1990K0413N5996j69489j0623O2914j55540o321J56606J81009J70259
$$ -50554 21436 41849 97845 -71644 -82267 -19353 -174893 -181214 -24608 156401 326660
12215C26660L6879j73612n9060r07p2318m0073J23974j37451k1142j1844K00606
$$ 326660 363539 189927 130867 129960 57642 17569 141543 4092 -17050 -28894 171712
12204A71712j46656j40644l651k6118R8975O8660n3141r2310j37013o8290K10172
$$ 171712 25056 -115588 -119239 -145357 -46382 22278 -30863 -123173 -260186 -328476 -118304
12193a18304K3049l794J56309K43671J66395n3590q3771p473n1451M5128j6658
$$ -118304 -95255 -99049 57260 300931 467326 413736 329965 322492 271041 316169 299511
12182B99511j57505j3086R5112J77565L4608p4195q5972j00434Q3626J39300J65782
$$ 299511 142006 128920 224032 401597 436205 362010 276038 175604 259230 398530 564312
12171E64312n6895j16413K1378j45534j94211K26260P4950j26378M6125O4720
$$ 564312 507417 391004 412382 266848 72637 298897 373847 247469 293594 358314
12161C58314l0914j65312j00969k8940r7244J11502o4116m7058R0869J02198r251
$$ 358314 327400 162088 61119 32179 -65065 46437 -17679 -64737 26132 128330 119079
12150A19079p1329p4242j2560Q3154K0820m7204Q426K4295k7004J31966L0050
$$ 119079 47750 -26492 -39052 44102 64922 17718 26144 50439 23435 155401 185451
12139A85451j27581k25223k2663M099L1856l2812M7994J37126O8449n0245j40389
$$ 185451 57870 -167353 -190016 -185917 -154061 -186873 -138879 -1753 66696 16451 -123938
12128a23938l0193K01157J02920j11543j7221j38311n2249K44084L2467p3634
$$ -123938 -154131 47026 149946 38403 21182 -117129 -169378 74706 107173 33539
12118C3539j1371p0746K8492R7583O5277j6196j4022J90506K8311j53273j41602
$$ 33539 22168 -48578 -20086 77497 142774 126578 112556 303062 331373 178100 36498
12107C6498j32299j7778o0869j08891M4903J14679K10745N5845p677L2329r423
$$ 36498 -95801 -113579 -174448 -283339 -238436 -123757 86988 142833 135156 167485 158062
12096A58062K11121O0883J09058j7975j68847k5039j31429k07115j72032J04027
$$ 158062 369183 430066 539124 521149 352302 327263 195834 -11281 -183313 -79286
12086g9286J44498K25809R9739n1797n9486k2145p1234m1884k6261p6963j42058
$$ -79286 65212 291021 390760 338963 279477 257332 186098 144214 117953 40990 -101068
12075a01068k362J61719J47754j46047j70239l2952K14579J67154J62775J01925
$$ -101068 -103430 58289 206043 59996 -110243 -143195 71384 238538 401313 503238
12065E03238l3907J5898L0414k1279K053j23636J11108O0251J29552q6837k40273
$$ 503238 469331 485229 515643 494364 496417 372781 483889 544140 673692 586855 346582
12054C46582J0510L7906J00790M667O374K0607R4404r6931p2082r2436M3264L5760
$$ 346582 357092 394998 495788 500455 506829 527436 621840 524909 452827 360391 403655 439415
12042D39415p822R704N4164J17785n6077j41934Q0401n7567l9810J76827J79679
$$ 439415 431593 441297 495461 613246 557169 415235 495636 438069 398259 575086 754765
12031G54765K7271n6160k310j16482r2567O1574K55290K802P0795N7957O4671
$$ 754765 782036 725876 723566 607084 514517 576091 831381 834183 904978 962935 1027606
12020A027606j91863k37233q5393l4009J85601N8732K2171R701j33093j80875
$$ 1027606 835743 598510 513117 479108 664709 723441 745612 755313 622220 441345
12010D41345J83045K06898O6331j9939j302q2194p0177J16233R0464j13589j11236
$$ 441345 624390 831288 897619 877680 876378 794184 724007 840240 930704 817115 705879
11999G05879J79301k0561j18674n374J13860M7764j74958L5792L2639k5731m5544
$$ 705879 885180 864619 745945 740571 854431 902195 727237 763029 795668 769937 724393
11988G24393m8083k8774N4843p932k9277L4872K09169J18335J77427r8940j26697
$$ 724393 676310 647536 702379 694447 665170 700042 909211 1027546 1204973 1106033 979336
11977I79336P2814J81665P9479J10801J3623L2640R2276m0246j7803J45655J95439
$$ 979336 1052150 1233815 1313294 1424095 1437718 1470358 1562634 1522388 1504585 1650240 1845679
11966A845679P6280K23827J5823k5787K58620K9932l6204J41701J13464J64646
$$ 1845679 1921959 2145786 2161609 2135822 2394442 2424374 2388170 2529871 2643335 2807981
11956B807981K10582n285j46853K48667L75799R5771K91747N72373N18392N24492
$$ 2807981 3018563 3013278 2866425 3115092 3490891 3586662 3878409 4450782 4969174 5493666
11946E493666M18778P40565R46581J028484J079880R90470J420032J986203K526205
$$ 5493666 5912444 6653009 7599590 8628074 9707954 10698424 12118456 14104659 16630864
11937A6630864L482860M700237O103521Q523523J2731691J9167602K9719264M6812921
$$ 16630864 20113724 24813961 30917482 39441005 52172696 71340298 101059562 147872483
11929A47872483O9561154Q0713852N2604797j565520l6010525n3439553o4672214
$$ 147872483 217433637 298147489 350752286 349186766 313176241 259736688 195064474
11922A95064474n6853041l9601290k5622621j6968711j1460366q254751n882894
$$ 195064474 138211433 98610143 72987522 56018811 44558445 36303694 30420800
11915C0420800m543275l575695l024177k291282j952892j641093j296888j082831
$$ 30420800 25877525 22301830 19277653 16986371 15033479 13392386 12095498 11012667
11907A1012667p96172o78694q13045p59746n17325l49647n14288m59980j53810
$$ 11012667 10216495 9537801 8724756 7965010 7447685 7098038 6583750 6123770 5969960
11898E969960l13359l12716k33373l05251l24884j91297l54893l53198l30010
$$ 5969960 5656601 5343885 5110512 4805261 4480377 4289080 3934187 3580989 3250979
11889C250979k25175j80849j93680j34317K1262j90191o9209o6766j88029j64505
$$ 3250979 3025804 2844955 2651275 2516958 2538220 2348029 2278820 2212054 2024025 1859520
11879A859520o940j08354k6380k28906q6858m6439O7875j16563n7923N0423l0490
$$ 1859520 1852580 1744226 1717846 1488940 1402082 1355643 1423518 1306955 1249032 1299455 1268965
11868A268965j54893j83816r5996K5432R6235j11985j62306M7322P1015J21462
$$ 1268965 1114072 930256 834260 859692 955927 843942 681636 728958 799973 921435
11858I21435J35480j59325j64050k87961M3573K79882O1438J5059j92626p3042
$$ 921435 1056915 897590 733540 445579 489152 769034 830472 845531 652905 579863
11848E79863k6948k27988J66490P8432k22099Q9531Q5713p8389J79476j5064k43308
$$ 579863 552915 324927 491417 569849 347750 437281 522994 444605 624081 609017 365709
11837C65709r7898m689q5579J024n0606Q1819l547J6267J29047m8577J59289K02768
$$ 365709 267811 263122 177543 178567 127961 209780 206233 222500 351547 302970 462259 665027
11825F65027j05542q6735l1262P635k40845k8042j6654m1695O92J302o4145P8470
$$ 665027 559485 472750 441488 449123 208278 180236 163582 121887 122579 123881 59736 138206
11813A38206r534L1000p2361R4271Q2375J25497q0982k8889j81758n2391r1524
$$ 138206 128672 159672 87311 181582 263957 389454 308472 279583 97825 45434 -46090
11802d6090l4288l032j72118M7522J40664N3009k0042L6954j3773k8390k490M5633
$$ -46090 -80378 -83410 -255528 -208006 -67342 -14333 -34375 2579 -11194 -39584 -42074 3559
11790C559p3283o2613P5270k1539j5161K0873l693J32666k853o9207J77596L4921
$$ 3559 -69724 -132337 -57067 -78606 -93767 -72894 -76587 56079 53226 -15981 161615 196536
11778A96536P4519j29783q5767P1606l1751o4014K524j59185M4761O0379L9712
$$ 196536 271055 141272 55505 127111 95360 31346 33870 -125315 -80554 -20175 19537
11767A9537P6939O7269o3785q9467J64868J62852L8353k3481j13875N0675m4632
$$ 19537 96476 163745 99960 10493 175361 338213 376566 353085 239210 289885 245253
11756B45253m2371j53912j05298J5964j62291j14225L2755N9329p1484Q6327K9736
$$ 245253 202882 48970 -56328 -40364 -202655 -316880 -284125 -224796 -296280 -209953 -180217
11745a80217K0082J61415M2981j27965J06610J78532J45962j62903j94483J05249
$$ -180217 -160135 1280 44261 -83704 22906 201438 347400 184497 -9986 95263
11735I5263n5753m1205R9669j2631R0965r3303j34704j5355K45494K0885o8917
$$ 95263 39510 -1695 97974 85343 176308 83005 -51699 -67054 178440 199325 130408
11724A30408M6587l4601J2198J09662k8566K0699M1419q6122j63339R656J03884
$$ 130408 176995 142394 154592 264254 235688 256387 297806 211684 48345 58001 161885
11713A61885j938L8579j53673O0842K6819K6611P847R7669q1781j99480o9838
$$ 161885 159947 198526 44853 105695 132514 159125 166972 264641 182860 -16620 -86458
11702h6458j5496j90502l8517K24894K33702J59985J55047o7776j02318l96041
$$ -86458 -101954 -292456 -330973 -106079 127623 287608 442655 374879 272561 -123480
11692a23480r5995L1434n081J20201O1891J15725r9819n4110k4459j06824J7104
$$ -123480 -219475 -188041 -193122 -72921 -11030 104695 4876 -49234 -73693 -180517 -163413
11681a63413M7984J13911k386j30361K1836J14796k7472n5432m3055l2755N1499
$$ -163413 -115429 -1518 -3904 -134265 -112429 2367 -25105 -80537 -123592 -156347 -104848
11670a04848J42918M6274l6898o1850P7846j5556N1002Q8587j17275j15053O9461
$$ -104848 38070 84344 47446 -14404 63442 47886 98888 187475 70200 -44853 24608
11659B4608m7244R411L7485R7957J46728R4094j50750r5112j39125n7448l9641
$$ 24608 -22636 -13225 24260 122217 268945 363039 212289 117177 -21948 -79396 -119037
11648a19037K54244O5838k07702n5870o7233K5494M8435r7202O7501n829r9798
$$ -119037 135207 201045 -6657 -62527 -129760 -104266 -55831 -153033 -85532 -91361 -191159
11637a91159J34237J58066K0884R0872j96586k6285K78102j54619k32199j21567
$$ -191159 -56922 101144 122028 212900 16314 -9971 268131 113512 -118687 -240254
11627b40254l0266R8373J29119K1986o492Q0066O9647r8268m4147J09708N9454
$$ -240254 -270520 -172147 -43028 -21042 -27534 52532 122179 23911 -20236 89472 148926
11616A48926j0590q3169n3386J27714J17907J7128l15909l018m7560o0556l2561
$$ 148926 138336 55167 1781 129495 247402 264530 -51379 -54397 -101957 -162513 -195074
11605a95074J83970Q2509J4005J32461j38112j55852n1043o8348L1180J50596
$$ -195074 -11104 71405 85410 217871 79759 -76093 -127136 -195484 -164304 -13708
11595a3708J12858j3917m5449q677n0991O8629p8174r5920k3699J3643o860J04926
$$ -13708 99150 85233 39784 31107 -19884 48745 -29429 -125349 -149048 -135405 -142265 -37339
11583c7339j32629N4254Q3100o7048J55703J39585q1364j62990o3721p624L0474
$$ -37339 -169968 -115714 -32614 -99662 56041 195626 114262 -48728 -112449 -120073 -89599
11572h9599L9921o0477J03792O2671N6456J561m1858j1442j55505j2966K6203
$$ -89599 -49678 -110155 -6363 56308 112764 114325 72467 61025 -94480 -107446 -81243
11561h1243o1533J19092N701N16R5843M7644j3732k44985o4682N8095K09458J68603
$$ -81243 -142776 -23684 -17983 -17467 78376 126020 112288 -132697 -197379 -139284 70174 238777
11549B38777K01221R900j84139l3286M0121J06971j52105j07803K0988n6990k5423
$$ 238777 439998 449898 265759 232473 272594 379565 227460 119657 140645 83655 58232
11538E8232R0271L112n3815l5657M3280p1656J87628M884n8624m5658q0435m7798
$$ 58232 148503 151615 97800 62143 105423 33767 221395 226279 167655 121997 41562 -6236
11526f236n8825q8943L9j45804r8917L7649o4799J61147J79030Q3576l7845k64872
$$ -6236 -65061 -154004 -153965 -299769 -398686 -361037 -425836 -264689 -85659 -2083 -39928 -304800
11514c04800l1092M7357J15706J05240P5331J5868Q8118K0j68121l9308R1121
$$ -304800 -335892 -288535 -172829 -67589 7742 23610 111728 111748 -56373 -95681 -4560
11503d560o6254j2110j2887r9164p0542j9852J27580J69823J44668o4446r6171
$$ -4560 -70814 -82924 -95811 -194975 -265517 -285369 -157789 12034 156702 92256 -3915
11492c915j69217P4620p602k784J12241q1112L702J26888J59036J48216q5003
$$ -3915 -173132 -98512 -106114 -108898 3343 -77769 -74067 52821 211857 360073 275070
11481B75070j35142j61053j55623n2436J07148J77786l0431M859O299J59574P0676
$$ 275070 139928 -21125 -176748 -229184 -122036 55750 25319 30178 36477 196051 266727
11470B66727j35426p4829j36832N0645J27897j03324j64862j96593J833O6725
$$ 266727 131301 56472 -80360 -29715 98182 -5142 -170004 -366597 -364764 -298039
11460b98039K87313R4333l013p1553m8518j5272j09869o4651K9181P4240J95062
$$ -298039 -10726 83607 80594 9041 -39477 -54749 -164618 -229269 -200088 -125848 69214
11449F9214R7829O8655r1397r1498n2926r3090n7388r3832J61565J02981k4340
$$ 69214 167043 235698 144301 52803 -123 -93213 -150601 -244433 -82868 20113 -4227
11438d227q794M8084L6705K0078j49505n7625J09586r9870j04964r6040L0572
$$ -4227 -13021 35063 71768 91846 -57659 -115284 -5698 -105568 -210532 -306572 -276000
11427b76000N1313K0392Q5646j49993L0527P9332r8527p0732J12120R4342L9235
$$ -276000 -224687 -204295 -118649 -268642 -238115 -158783 -257310 -328042 -215922 -121580 -82345
11416h2345J8010p9915J459n2007J25654J03946k6910k23636R4830J65620J03628
$$ -82345 -64335 -144250 -142791 -194798 -69144 34802 7892 -215744 -120914 44706 148334
11405A48334k44917q5804Q7013j30017q9559j03338Q4279L0480O3869R5416J36682
$$ 148334 -96583 -182387 -95374 -225391 -314950 -418288 -334009 -303529 -239660 -144244 -7562
11394g562k3632p0391m0750K13596o266j34969L1343j73452r3023m6820J74737
$$ -7562 -31194 -101585 -142335 71261 64995 -69974 -38631 -212083 -305106 -351926 -177189
11383a77189J1148N3566k3885J23186J57015j73602m2173j27877M6625P7591K1526
$$ -177189 -166041 -112475 -136360 -13174 143841 -29761 -71934 -199811 -153186 -75595 -54069
11372e4069n5360J44642Q6004p5178j11159j11890j02499q1293J64409Q3275j25252
$$ -54069 -109429 35213 121217 46039 -65120 -177010 -279509 -360802 -196393 -113118 -238370
11361b38370J28867K10083n2555J82233l9433j48337n4925J04383J87504k4723
$$ -238370 -109503 100580 48025 230258 190825 42488 -12437 91946 279450 254727
11351B54727j46829K952j41316j30256m0188N6058n069J58899L7466M0567P3455
$$ 254727 107898 110850 -30466 -160722 -200910 -144852 -149921 8978 46444 87011 160466
11340A60466J7827k80J1659l2354j86614j77444l81J02912j08223l0296n8036
$$ 160466 178293 178013 189672 157318 -29296 -206740 -207121 -104209 -212432 -242728 -300764
11329c00764J60065J33421N8018j0235o5216J48424L0179j3390r7740L3794L0802
$$ -300764 -140699 -7278 50740 40505 -24711 123713 153892 140502 42762 76556 107358
11318A07358j51414j65693J39360o16q9232Q607J44875L0854k82858M8921K15300
$$ 107358 -44056 -209749 -70389 -71005 -160237 -151630 -6755 24099 -258759 -209838 5462
11307E462n8600L3096j28147j6721r7883j43017K0430K51257M414n3413k1392
$$ 5462 -53138 -20042 -148189 -164910 -262793 -405810 -385380 -134123 -129709 -183122 -204514
11296b04514j063Q1843M9726p3373L8205L72799K11055l62492j78973L2309Q0538
$$ -204514 -205577 -123734 -74008 -147381 -109176 263623 474678 112186 -66787 -34478 46060
11285D6060n7021L7375l1969J3428K00718J52804p9440j01105K4732J12218k26997
$$ 46060 -10961 26414 -5555 7873 208591 361395 281955 180850 205582 317800 90803
11274I0803j20029J04966k7791m0960o2952o3166K5248L8444n0829p9390Q2979
$$ 90803 -29226 75740 47949 6989 -55963 -119129 -93881 -55437 -106266 -185656 -102677
11263a02677k6965P48m6715M803o6432k4759J36174J53681L9513m3679P3626L7467
$$ -102677 -129642 -128894 -175609 -170806 -237238 -261997 -125823 27858 67371 23692 97318 134785
11251A34785j67686j40418j04517J13549J49979Q19j06555L22J5144m3252k2032
$$ 134785 -32901 -173319 -277836 -164287 -14308 -13489 -120044 -119722 -104578 -147830 -169862
11240a69862M124L5926P5024m6534j45734n4190j9022Q2211J12639J5803Q1157
$$ -169862 -165738 -129812 -54788 -101322 -247056 -301246 -320268 -238057 -125418 -109615 -28458
11229b8458J44688k1576m5296J51948N6219O7877l7277p6323n1101l1705j41743
$$ -28458 116230 94654 49358 201306 257525 325402 288125 211802 160701 128996 -12747
11218a2747n3192O9894N9761R4169o6989j42272p7286N0500K7300j30530J32133
$$ -12747 -65939 3955 63716 157885 90896 -51376 -128662 -78162 -50862 -181392 -49259
11207d9259K43083j2095n9578p2143j55699N3584N8275J52757k7706j68682K509
$$ -49259 193824 181729 122151 50008 -105691 -52107 6168 158925 131219 -37463 -34954
11196c4954P7754M0869o9267N5897n5016L6341j5553j85365l41832J7652J86045
$$ -34954 42800 83669 14402 70299 15283 51624 36071 -149294 -491126 -473474 -287429
11185b87429q8159N9195L0684p8648L648J24230N5583O0797J13291J461Q0781
$$ -287429 -375588 -316393 -285709 -364357 -360709 -236479 -180896 -120099 -6808 -5347 75434
11174G5434l3758n308M4674m3080j37113o9192J66968N1746o9029j27889q4184
$$ 75434 41676 36368 81042 37962 -99151 -168343 -1375 50371 -18658 -146547 -230731
11163b30731L4050Q426J6542J37022J50553j55928J1441P4087Q8777L8359M83
$$ -230731 -196681 -188255 -171713 -34691 115862 -40066 -28625 45462 134239 172598 173081
11152A73081N7457M2376l05885k19061k81R5931k5873o9773J29433K1004N4419
$$ 173081 230538 272914 -32971 -252032 -252313 -156382 -182255 -252028 -122595 -101591 -47172
11141d7172m8969J392j09074j01408J84030O3039O5942p6939m9361J14190r8277
$$ -47172 -96141 -94749 -203823 -305231 -121201 -58162 7780 -69159 -118520 -4330 -102607
11130a02607n5689m0292J95876J86101j05268r5512j073n3385k5274J18460J2324
$$ -102607 -158296 -198588 -2712 183389 78121 -17391 -18464 -71849 -97123 21337 33661
11119C3661p7689J50301R86m6069k7842k07656j0885K649P2063J10658P8560j69508
$$ 33661 -44028 106273 107259 61190 33348 -174308 -185193 -182544 -110481 177 78737 -90771
11107i0771p0478P7914q346N6860p2749L5717K01902J29213K0886k11687k8887
$$ -90771 -161249 -83335 -91681 -34821 -107570 -71853 130049 259262 280148 68461 39574
11096C9574N5447K9912R056j43032l93P1664r5476P0310J25637M1426m6009j11129
$$ 39574 95021 124933 133989 -9043 -9436 62228 -33248 37062 162699 204125 158116 46987
11084D6987j80750j02006J5429m726j1802K3361M7015J66255J8538N5736r9241
$$ 46987 -133763 -235769 -220340 -225066 -236868 -213507 -166492 -237 18301 74037 -25204
11073b5204j63027l3564R5445K77326L2406j23809j19570K7146O6503J43511K0079
$$ -25204 -188231 -221795 -126350 150976 183382 59573 -59997 -32851 33652 177163 197242
11062A97242j54117n1002l3732j50952j6487J48158R4298M9982M6110m8812j6036
$$ 197242 43125 -7877 -41609 -192561 -209048 -60890 33408 83390 129500 80688 64652
11051F4652l63o4728n1302l2707o4875k9555J20691J14576j1913M084J24588j31671
$$ 64652 64289 -439 -51741 -84448 -149323 -178878 -58187 56389 44476 48560 173148 41477
11039D1477M4078O9489J36315R2123o8453M2417J68173J98838P4340M0630N2638
$$ 41477 85555 155044 291359 383482 315029 357446 525619 724457 798797 839427 892065
11028H92065k8474N2874K9909p660L8458K02465M1213k4627p5341j22376p8651
$$ 892065 863591 916465 946374 938714 977172 1179637 1220850 1196223 1120882 998506 919855
11017I19855Q0844J13253J00967Q4487P9233P0707J07143l7365j83422p3562j30467
$$ 919855 1000699 1113952 1214919 1299406 1378639 1449346 1556489 1519124 1335702 1262140 1131673
11006A131673m7892O07j47668k14179R1124K34944n5438o1571J16789j81508o4525
$$ 1131673 1083781 1084388 936720 722541 813665 1048609 993171 931600 1048389 866881 802356
10995H02356p6278l04652l7599l4504J20814J67082J51159j47591l71578j2591
$$ 802356 726078 421426 383827 349323 470137 637219 788378 640787 269209 256618
10985B56618P9078J21936N2549l1795j13976j53708m3757J27225L8492j75551
$$ 256618 335696 457632 510181 478386 364410 210702 166945 294170 332662 157111
10975A57111k68960L322j9303j0673L2125m700Q2923M5045J92264L8670n7511
$$ 157111 -111849 -108527 -127830 -138503 -106378 -111078 -28155 16890 209154 247824 190313
10964A90313Q0899J38232j0451R6070k6423n0462K5170k8448k10960j09861n5440
$$ 190313 271212 409444 398993 495063 468640 418178 443348 414900 203940 94079 38639
10953C8639L4967J23820J07756N735q6534O2677k5033j8828j05503o9234o3223
$$ 38639 73606 197426 305182 310917 224383 287060 262027 243199 137696 68462 5239
10942E239R0144k38252j23809N4147o1106o4195M5139J14918J88179l015j99300
$$ 5239 95383 -142869 -266678 -212531 -273637 -337832 -292693 -177775 10404 7389 -191911
10931a91911j61063L5745K41400R7281k1101j1778J00751K3398j09104n110k6271
$$ -191911 -352974 -317229 -75829 21452 351 -11427 89324 112722 3618 -1492 -27763
10920b7763o6409L1787L0636k2806j807q9300o5898l0150L9654K1057j12402j50385
$$ -27763 -94172 -62385 -31749 -54555 -56362 -145662 -211560 -241710 -202056 -180999 -293401 -443786
10908d43786J14127K50589J54382Q8782N7131p5689p9261q95j27431J108m7867
$$ -443786 -329659 -79070 75312 164094 221225 145536 66275 65380 -62051 -60943 -108810
10897a08810J4154l03J1113p0664j0508K12734M4031j05970l2307P1179Q7445
$$ -108810 -94656 -94959 -83846 -154510 -165018 47716 91747 -14223 -46530 24649 112094
10886A12094k56621j55078N3746N6836N6447J37521J3622J28711Q1758j21875
$$ 112094 -144527 -299605 -245859 -189023 -132576 4945 18567 147278 229036 107161
10876A07161r0892m4342l2671l2849O6188k5869o5757N5568O1333j09001K8602
$$ 107161 16269 -28073 -60744 -93593 -27405 -53274 -119031 -63463 -2130 -111131 -82529
10865h2529j42727L5571J20440m9158J16178K2922N9415Q7137j66339K0610K15715
$$ -82529 -225256 -189685 -69245 -118403 -2225 20697 80112 167249 910 21520 237235
10854B37235J04195O3752k1377l2705j70089Q8452R0309O9955P6678R8622j78127
$$ 237235 341430 405182 383805 351100 181011 269463 359772 429727 506405 605027 426900
10843D26900k92314j55753m9270Q836L2529o70J37893M5986J24315L2230j06460
$$ 426900 134586 -21167 -70437 -61601 -29072 -29742 108151 154137 278452 310682 204222
10832B04222o079J34371J2054j07548m9480j30311K547o835O99J670K25944J40643
$$ 204222 198143 332514 344568 237020 187540 57229 59776 52941 53640 55310 281254 421897
10820D21897N3923j17365k66512M8188J74892Q9289r3392j19633o606j06275J56964
$$ 421897 475820 358455 91943 140131 315023 404312 310920 191287 184681 78406 235370
10809B35370J08243k33862j54265j51924l3649K5040K09198m5214N8681K9085
$$ 235370 343613 109751 -44514 -196438 -230087 -205047 4151 -41063 17618 46703
10799D6703o1701l6329N8179J61769J39661K6603j69710o1675L0331j11171l5779
$$ 46703 -14998 -51327 6852 168621 308282 334885 165175 103500 133831 22660 -13119
10788a3119k5279N7908n9407o4240J92675J49444J47733m1556k33465J2742n646
$$ -13119 -38398 19510 -39897 -104137 88538 237982 385715 344159 110694 123436 117790
10777A17790j6121k81711j42743K07107O3325J62313J27973J19805j21574m665
$$ 117790 101669 -180042 -322785 -115678 -52353 109960 237933 357738 236164 231499
10767B31499p9240J6399J054J24761j876j71552j41337P0486j5640q306m6930
$$ 231499 152259 168658 169712 294473 292597 121045 -20292 50194 34554 26248 -20682
10756b0682k0782J79774J36365J39135n7403o3972o7558k01047k57647m6911J58475
$$ -20682 -41464 138310 274675 413810 356407 292435 224877 23830 -233817 -280728 -122253
10745a22253J33845J53880J06260j14368k28618j49961J74372M8918L6170K1276
$$ -122253 11592 165472 271732 157364 -71254 -221215 -46843 2075 38245 59521
10735E9521l4271J23381K50761J25496j38224k18252Q2264K07066J20930R6770
$$ 59521 25250 148631 399392 524888 386664 168412 250676 457742 578672 675442
10725F75442M2071j79471k17791K5902k5273k575J57458P2701q4738J8267J504
$$ 675442 717513 538042 320251 346153 320880 318305 475763 548464 463726 481993 483497
10714D83497j13810R316K11532P9963p3112Q3683K4998l2381m4729j08032k1604
$$ 483497 369687 379003 590535 670498 597386 681069 706067 673686 628957 520925 499321
10703D99321J14477n903k4586K1785K2754K46539J55492j34031k20087o6833k9719
$$ 499321 613798 607895 583309 605094 627848 874387 1029879 895848 675761 608928 579209
10692E79209j7915n2695k0297J44794p4588j29445p9107j8788J60274K1747l3989
$$ 579209 561294 508599 488302 633096 558508 429063 349956 331168 491442 513189 479200
10681D79200q616l8093m93k1987P9729p672n3753q0374L9131J53740O2076j24675
$$ 479200 470584 432491 431998 410011 489740 482068 428315 347941 387072 540812 602888 478213
10669D78213j19504o7654K13379J98350M2918j20790N1618n2004O3819J72259
$$ 478213 358709 291055 504434 702784 745702 624912 676530 624526 688345 860604
10659H60604O0413j46129L7866J67448p5833P8276J2508j21711Q2369K46965J01238
$$ 860604 921017 774888 812754 980202 904369 982645 995153 873442 955811 1202776 1304014
10648A304014N9310M7291P3506J99541K42369L24572L82753K59780J39349j04068
$$ 1304014 1363324 1410615 1484121 1683662 1926031 2250603 2633356 2893136 3032485 2928417
10638B928417j8001l9080k99231j25966N3766J92007K55584J24096J48790J80021
$$ 2928417 2910416 2871336 2572105 2446139 2499905 2691912 2947496 3071592 3220382 3400403
10628C400403K47865M85418M36591K99431O05892O82590M65888M05418P19098
$$ 3400403 3648268 4133686 4570277 4869708 5475600 6158190 6624078 7029496 7748594
10619G748594O66493R12576J300964J346754J784789K774956L765556N008710
$$ 7748594 8415087 9327663 10628627 11975381 13760170 16535126 20300682 25309392
10611B5309392O749672Q766157J1087412J2692224J2331812R150036M645856N47019
$$ 25309392 32059064 40825221 51912633 64604857 76936669 86086705 90732561 91279580
10603I1279580j802610k237955n46501L204604Q393778J4709406K1106796K5283834
$$ 91279580 89476970 87239015 86692514 89897118 98290896 113000302 134107098 159390932
10595A59390932K3126085J4391709K675433o952875j2410708j3031731q808684
$$ 159390932 182517017 196908726 199584159 192631284 180220576 167188845 158380161
10588A58380161j294388Q135808J7975687K6956272L1668863K6461700J1293948
$$ 158380161 157085773 165221581 183197268 210153540 241822403 268284103 279578051
10581B79578051o237918j9615071k6855364k7374356k1717212j2900513l493581
$$ 279578051 273340133 253725062 226869698 199495342 177778130 164877617 161384036
10574A61384036N438045J2513835J5448207J1176684K19495j1436102j9248376
$$ 161384036 166822081 179335916 194784123 205960807 206180302 194744200 175495824
10567A75495824k2883546k2144467j7621521j1520716n891837j263740J932918
$$ 175495824 152612278 130467811 112846290 101325574 95433737 94169997 96102915
10560I6102915K800318Q45708l413413q087982j1004015j2294932j1729066j0251949
$$ 96102915 98903233 99748941 96335528 88247546 77243531 64948599 53219533 42967584
10552D2967584p971896n898607m633364l572542k625135k056239j767126j344400
$$ 42967584 34995688 29097081 24463717 20891175 18266040 16209801 14442675 13098275
10544A3098275j133561r51291r72065q67466o54687o86378n25810k78254n22146
$$ 13098275 11964714 11013423 10041358 9173892 8519205 7832827 7307017 7028763 6506617
10535F506617o36168m36654k98147k43104l38570j48449n8885k40043l27169l03754
$$ 6506617 5870449 5433795 5135648 4892544 4553974 4405525 4346640 4106597 3779428 3475674
10525C475674j48436o8261j20224k42420j23469r7472j49988j36866k54435l33274
$$ 3475674 3327238 3258977 3138753 2896333 2772864 2675392 2525404 2388538 2134103 1800829
10515A800829j60754o4514j41965J2417j8882j334J77257J86357p1705j96611
$$ 1800829 1640075 1575561 1433596 1446013 1427131 1425797 1603054 1789411 1717706 1521095
10505A521095j14619j59325n9353j51671j43920J33379Q7669p4878n270k0434
$$ 1521095 1406476 1247151 1187798 1036127 892207 1025586 1113255 1038377 1033107 1012673
10495A012673o8629j5248o2089j68259r7892K7811r2217O9185J6665J09429J6818
$$ 1012673 944044 928796 866707 698448 600556 628367 536150 605335 622000 731429 748247
10484G48247J05616O3949q6581k74335o9583P0273j5900r4799L8727j42635L6385
$$ 748247 853863 917812 831231 556896 487313 557586 541686 446887 485614 342979 379364
10473C79364r9601R0816l899L4509J05059Q833j82667j46939k5738l4408J63013
$$ 379364 279763 370579 366680 401189 506248 515081 332414 185475 159737 125329 288342
10462B88342L1365J9594J33452p547j88113K1307L1726J3071m9646j66585Q8394
$$ 288342 319707 339301 472753 465206 277093 298400 330126 343197 293551 126966 215360
10451B15360j16252n9036o2448L7054q565J37560Q4016r2309J74290N7330j00136
$$ 215360 99108 40072 -22376 14678 6113 143673 227689 135380 309670 367000 266864
10440B66864j7881N5003r0714R7313j14956m3203K2037J32781j04283j40279m4312
$$ 266864 248983 303986 213272 310585 195629 152426 174463 307244 202961 62682 18370
10429A8370J50428J74170j56325L7760P1872r593R5881l3801j52657j74782q6740
$$ 18370 168798 342968 186643 224403 296275 286682 382563 348762 196105 21323 -65417
10418f5417J62165J08093p4679o691J11213N0868j81326m9386O9435l3574j43867
$$ -65417 96748 204841 130162 123471 234684 285552 104226 54840 124275 90701 -53166
10407e3166l2899J82368O4178o0257j02615p386N1062Q1823J46628J26998Q8439
$$ -53166 -86065 96303 160481 100224 -2391 -9777 41285 123108 269736 396734 485173
10396D85173j98096j69318P2220j53602q8036M9164J42499K16754J07909l8488
$$ 485173 287077 117759 189979 36377 -51659 -2495 140004 356758 464667 426179
10386D26179o705M4886n7083p7060j81674L4063J08901M7067m6837L421R9274
$$ 426179 419474 464360 407277 330217 148543 182606 291507 338574 291737 295158 394432
10375C94432J3271j45466p9468m3439J22324P0171r3083j839N5682N5124l3639
$$ 394432 407703 262237 182769 139330 261654 331825 238742 236903 292585 347709 314070
10364C14070j72936N5883J1488j30547p816m6456J9768L2106Q2120P5598J45293
$$ 314070 141134 197017 208505 77958 70142 23686 43454 75560 157680 233278 378571
10353C78571N5420R8278J4695n9778O7281n436j15973m0999q3987J28656j63696
$$ 378571 433991 532269 546964 487186 554467 549031 433058 392059 308072 436728 273032
10342B73032l8702j6547Q4257m6030j06926L4380k28753o3541J18660k8481J44361
$$ 273032 234330 217783 302040 256010 149084 183464 -45289 -108830 9830 -18651 125710
10331A25710k4588N4339K16684Q9810p4691j46265j30306k6151l2678j53893o7107
$$ 125710 101122 155461 372145 461955 387264 240999 110693 84542 51864 -102029 -169136
10320a69136K61744J00124k9350O0854o5169k6625j33539m4084O5923O5450J9674
$$ -169136 92608 192732 163382 224236 159067 132442 -1097 -45181 20742 86192 105866
10309A05866J2484k9803k1662j26789j04143M0048K13007n5898j15682L6802r4475
$$ 105866 118350 88547 66885 -59904 -164047 -123999 89008 33110 -82572 -45770 -140245
10298a40245M2530L4596N6860J47795Q2395q00K5686j23706q8252P9882j4430
$$ -140245 -97715 -63119 -6259 141536 223931 223131 248817 125111 36859 116741 102311
10287A02311j81423o4207J55568O8040r5309Q750M4567m2219P9778J07572O7432
$$ 102311 -79112 -143319 12249 80289 -15020 -6270 38297 -3922 75856 183428 250860
10276B50860m4101k48599j76576M3174O8851K29334J59656Q56r1143P2334j68347
$$ 250860 206759 -41840 -218416 -175242 -106391 122943 282599 283455 192312 264646 96299
10265I6299j89235J39963K44693N3380j89171k61701o5656J01985R6223k32436
$$ 96299 -92936 47027 291720 345100 155929 -105772 -171428 -69443 26780 -205656
10255b05656o768P2290O7232J44067N5165R0479L8481Q2038J41909p151o4598
$$ -205656 -212424 -140134 -72902 71165 126330 216809 255290 337328 479237 472086 407488
10244D07488j45026j14388n5496M17l7843Q8452M9227l7050K8486J05565p3792
$$ 407488 262462 148074 92578 92995 55152 143604 192831 155781 184267 289832 216040
10233B16040l8391q738q9286M7902Q1584j5094K420N1968M3227J36153L3436o0304
$$ 216040 177649 168911 79625 127527 209111 194017 196437 248405 291632 427785 461221 400917
10221D00917j09757j20570j01631j8240P1262k0883J6641l8545j34709R4680P8404
$$ 400917 291160 170590 68959 50719 121981 101098 117739 79194 -55515 39165 117569
10210A17569n8600j24113p835m7677J62995R5150K04494J12418j40518q8276k6185
$$ 117569 58969 -65144 -72979 -120656 42339 137489 341983 454401 313883 225607 199422
10199A99422K4703K2236J54293o7700J02793J26196O7517O5987J04301J54528
$$ 199422 224125 246361 400654 332954 435747 561943 629460 695447 799748 954276
10189I54276J38194m9624J23805K14349Q1778Q7547J33132M2459K51395N14919
$$ 954276 1092470 1042846 1166651 1381000 1462778 1550325 1683457 1725916 1977311 2492230
10179B492230P67146N84086M60611N58020M17365J094j95997n10568o75158n31525
$$ 2492230 3259376 3843462 4304073 4862093 5279458 5280552 5084555 4573987 3898829 3367304
10169C367304m98077o12755l03289j35672l24831j02638k3335J3357J87353J54073
$$ 3367304 2869227 2256472 1953183 1817511 1492680 1390042 1366707 1380064 1567417 1721490
10159A721490N015N83J64806l6945r5209q2161j0733L5563M9192J11435J57973
$$ 1721490 1726505 1727088 1891894 1854949 1759740 1677579 1666846 1702409 1751601 1863036 2021009
10148B021009J6290L3919j6193j99829n943l1419j38172j25268j40340r6268j85739
$$ 2021009 2037299 2071218 2055025 1855196 1849253 1817834 1679662 1554394 1414054 1317786 1132047
10137A132047p1294K38385K96008J62176j15873k55116k10736j78995m2218j5285
$$ 1132047 1060753 1299138 1595146 1757322 1641449 1386333 1175597 996602 954384 939099
10127I39099l3020p5503j15422O1472N9126M1296J2261l5640M9135k27892N2455
$$ 939099 906079 830576 715154 776626 835752 877048 889309 853669 902804 674912 727367
10116G27367k7818p6584O2726K06690K42491M24356M68544K17499L00411q858
$$ 727367 699549 622965 685691 892381 1134872 1559228 2027772 2245271 2545682 2536824
10106B536824j72279j29452l33597l06871k71493l86903j98475j47635j4227j31899
$$ 2536824 2364545 2235093 1901496 1594625 1323132 936229 737754 590119 575892 443993
10096D43993k9651j36720p0593p4301J49523k4004O0088Q3304Q2872O4011j73702
$$ 443993 414342 277622 207029 132728 282251 258247 318335 401639 484511 548522 374820
10085C74820n629J22158p7914J1197k6655q5802j54680j35909j1979J26972J37890
$$ 374820 369191 491349 413435 424632 397977 312175 157495 21586 9607 136579 274469
10074B74469q7710P4672k7793m5296P9992J02588L5966j41139q3897m1346j70581
$$ 274469 186759 261431 233638 188342 268334 370922 406888 265749 181852 140506 -30075
10063c0075j56876Q2795J36835R1547J4259Q137R6216K1747q4321L1111J03179
$$ -30075 -186951 -104156 32679 124226 138485 146622 242838 264585 180264 211375 314554
10052C14554o782j15477J45412R0057k56769Q380r144J7793N2422J73757n9278
$$ 314554 307772 192295 337707 427764 170995 179375 170231 188024 240446 414203 354925
10041C54925m0687r0810k6115k44263j59356P1187J28981K03141J23295j36707
$$ 354925 314238 223428 197313 -46950 -206306 -135119 -6138 197003 320298 183591
10031A83591k56375J08252K87980j13134j02570n1436k40991L5803Q7861J5905
$$ 183591 -72784 35468 323448 210314 107744 56308 -184683 -148880 -61019 -45114
10021d5114p6976J2666J96321j20017Q8653J41883K4532l8144Q4476n4908o0536
$$ -45114 -122090 -109424 86897 -33120 55533 197416 221948 183804 268280 213372 152836
10010A52836J8526l806j6483J67132j31238j05123o782p9261J63815n9885k38912
$$ 152836 171362 167556 151073 318205 186967 81844 75062 -4199 159616 99731 -139181
9999a39181J00687J90719J42195j24811j87463k1304L5322J13811L7133n5995
$$ -139181 -38494 152225 294420 169609 -17854 -39158 -3836 109975 147108 91113
9989I1113o4337Q443j64433k7694M849J96899J16209r518k25220j80405J6810
$$ 91113 26776 35219 -129214 -156908 -152059 44840 161049 151531 -73689 -254094 -237284
9978b37284J12003O9907j6909J6814M4126K03396J90981L0278K6952O5409j03291
$$ -237284 -125281 -55374 -72283 -55469 -11343 192053 383034 413312 440264 505673 402382
9967D02382p0036j88588j71382q6280k6143n7684K4324J05247O6686J12835J02081
$$ 402382 332346 143758 -27624 -113904 -140047 -197731 -173407 -68160 -1474 111361 213442
9956B13442j42435j48805N4478K02791J61784n1894j40578j42273j93370n3100
$$ 213442 71007 -77798 -23320 179471 341255 289361 148783 6510 -186860 -239960
9946b39960r578R9514J91318Q1119o4167p201J33950k4230O0365m8876O4569K2121
$$ -239960 -249538 -150024 41294 122413 58246 51045 184995 160765 221130 172254 236823 258944
9934B58944R5745j15552o2285j30325j27352j27228K5319K40488Q7806M4293L7622
$$ 258944 354689 239137 176852 46527 -80825 -208053 -182734 57754 145560 189853 227475
9923B27475m1362j65199j47112N0552R5247P9181r3587j26683J804M1335Q7881
$$ 227475 186113 20914 -126198 -75646 19601 98782 5195 -121488 -119684 -78349 9532
9912I532K6603P5345P622n7618j02287J10555M5674R721J29115J19154j95029
$$ 9532 36135 111480 119102 61484 -40803 69752 115426 125147 254262 373416 178387
9901A78387R0773J27093j45090j09603Q1225j10120M0414n2402Q2070N4828r9706
$$ 178387 269160 396253 251163 141560 222785 112665 153079 100677 182747 237575 137869
9890A37869L2062J11951R6207K1176p4891l1574L6000p9596k2800J78398J02479
$$ 137869 169931 281882 378089 399265 324374 292800 328800 249204 226404 404802 507281
9879E07281R4139L85574M85682R64586J466042J295256M86393l81024q06752q60682
$$ 507281 601420 986994 1472676 2437262 3903304 5198560 5684953 5303929 4497177 3636495
9869C636495q67831p69422m37880k96325m47854k95522k01009J2213P7783K02703
$$ 3636495 2768664 1999242 1561362 1265037 817183 521661 320652 332865 410648 613351
9859F13351K9982k20059j27116p1364j84348K8990J02611O9237P4197N0397p5827
$$ 613351 643333 423274 296158 224794 40446 69436 172047 241284 315481 365878 290051
9848B90051j2135j2062k6103J8767K1314j65298k368l5668j33239j59858l7824
$$ 290051 277916 265854 239751 258518 279832 114534 112166 76498 -56741 -216599 -254423
9837b54423J3478J74344J93207P2263J69882K3490K6883j12081k70176n4499J49354
$$ -254423 -240945 -66601 126606 198869 368751 392241 419124 307043 36867 -17632 131722
9826A31722n5025l6599j67434J81566J57613J11236j6750j50337q6954j49855
$$ 131722 76697 40098 -127336 54230 211843 323079 306329 155992 69038 -80817
9816h0817p8499m7109K7733R977K1155J75689M6841k27195J4754K5162O5616J12086
$$ -80817 -159316 -206425 -178692 -168715 -147560 28129 74970 -152225 -137471 -112309 -46693 65393
9804F5393M5200n2027l4368O6706M146J9805M2959n7222j45160k55774j08930
$$ 65393 110593 58566 24198 90904 95050 114855 157814 100592 -44568 -300342 -409272
9793d09272K53642J77750m9129O710R653N6612K0575p3272n2376n691l8365L1876
$$ -409272 -155630 22120 -27009 -20299 -10646 45966 66541 -6731 -59107 -64798 -103163 -71287
9781g1287j24959k3118N6976J60908J43009m6031J39784K13324N3070k53163j74223
$$ -71287 -196246 -219364 -162388 -1480 141529 95498 235282 448606 501676 248513 74290
9770G4290m7052J33927J61680J10620p3666j21989M7246J3203m2216Q7683j8025
$$ 74290 27238 161165 322845 433465 359799 237810 285056 298259 256043 343726 325701
9759C25701L3019o8959j96028j17171k1524q5436R7466R5248j07062j6664J22413
$$ 325701 358720 289761 93733 -23438 -44962 -130398 -32932 62316 -44746 -61410 61003
9748F1003o9862j27405J31977J26784j2426p9991k8429q2936P9474J38900n3117
$$ 61003 -8859 -136264 -4287 122497 110071 30080 1651 -81285 -1811 137089 83972
9737H3972j51538j16732M4669Q6116J70435k3094M060n3550J03247K8551R9811
$$ 83972 -67566 -184298 -139629 -53513 116922 93828 97888 44338 147585 176136 275947
9726B75947j3332j03756j32575j61594J08429n035N7578m5663j28642P7411Q9427
$$ 275947 262615 158859 26284 -135310 -26881 -31916 25662 -20001 -148643 -71232 18195
9715A8195Q532j5371R1587l8048j77945n8176R8287J0370l69390J13780L4066
$$ 18195 26727 11356 102943 64895 -113050 -171226 -72939 -62569 -431959 -318179 -284113
9704b84113r4799J96102K92254J7101j19177r5344J3677N4515j23343k3311l6362
$$ -284113 -378912 -182810 109444 126545 7368 -87976 -74299 -19784 -143127 -166438 -202800
9693b02800Q7816R4894p3326R5823K57205o6125k33259r6294l2471N4172k9575
$$ -202800 -114984 -20090 -93416 2407 259612 193487 -39772 -136066 -168537 -114365 -143940
9682a43940L9905J90633K3688N2350j23624l05271p0067N37J84870R0743j1208
$$ -143940 -104035 86598 110286 162636 39012 -266259 -336326 -335789 -150919 -60176 -71384
$$ [...]
##END NTUPLES=NMR SPECTRUM
##END=
