##TITLE=Analysis number 316358
Compound Code cc 43210
Book Reference 467/2
Project Code adrs
Chemist Name benw
##JCAMPDX= 6.0         $$ Bruker NMR JCAMP-DX V2.0
##DATA TYPE= NMR SPECTRUM
##DATA CLASS= NTUPLES
##ORIGIN= Bruker BioSpin GmbH
##OWNER= nmr
$$ XWIN-NMR		Version 3.5
$$ Thu Jan 12 11:11:40 2006 GMT Standard Time (UT+0h)  MAYBRIDGE\nmr@NMR_250MHZ
##.OBSERVE FREQUENCY= 250.131544655141
##.OBSERVE NUCLEUS= ^1H
##.ACQUISITION MODE= SIMULTANEOUS (DQD)
##.ACQUISITION SCHEME= undefined
##.AVERAGES= 16
##.DIGITISER RES= 18
##SPECTROMETER/DATA SYSTEM= dpx250
##.PULSE SEQUENCE= zg30
##.SOLVENT NAME= CDCl3
##.SHIFT REFERENCE= (INTERNAL, CDCl3, 0, 16.522)
##AUDIT TRAIL= $$ (NUMBER, WHEN, WHO, WHERE, WHAT)
$$ ##TITLE= Audit trail, XWIN-NMR		Version 3.5
$$ ##JCAMPDX= 5.01
$$ ##ORIGIN= Bruker BioSpin GmbH
$$ ##OWNER= nmr
$$ C:\u/data/dgb/nmr/ADRS/14510/pdata/1/auditp.txt
$$ ##AUDIT TRAIL=  $$ (NUMBER, WHEN, WHO, WHERE, WHAT)
(   1,<2006-01-12 11:11:18.52 +000>,<MAYBRIDGE\nmr>,<NMR_250MHZ>,
      <created by zg, POWCHK disabled, PULCHK disabled
       configuration hash MD5:
       62 19 C7 07 E1 42 D1 B7 37 6C 3D D0 77 39 F9 E6
       data hash MD5: 64K
       61 1A 9F 2E 61 17 2C 83 3E E4 B1 05 21 00 6B 7F>)
(   2,<2006-01-12 11:11:30.72 +000>,<MAYBRIDGE\nmr>,<NMR_250MHZ>,
      <Start of raw data processing
       ef LB = 0.3 FT_mod = 6 PKNL = 1 SI = 32K 
       data hash MD5: 32K
       AF 79 23 FB 0F 91 B9 E6 5C 30 CE 27 3A 58 F8 AA>)
(   3,<2006-01-12 11:11:32.83 +000>,<MAYBRIDGE\nmr>,<NMR_250MHZ>,
      <apk 
       data hash MD5: 32K
       77 E7 73 D0 1E BF 7D 08 1F 8D 8E D3 7D EB 1F F4>)
(   4,<2006-01-12 11:11:33.63 +000>,<MAYBRIDGE\nmr>,<NMR_250MHZ>,
      <abs ABSG = 5 
       data hash MD5: 32K
       62 B7 64 AF F2 C9 5D EE C2 EB 5F A6 DE AF B5 F4>)
$$ ##END=
$$ 
$$ hash MD5
$$ E3 46 6C 91 B8 72 E6 E9 73 2C EC 34 F2 6F 69 6F
##$RELAX= 
##$RELAX= 
##$RELAX= 
##$RELAX= 
##$RELAX= 
##$RELAX= 
##$RELAX= 
$$ Bruker specific parameters
$$ --------------------------
##$DU= <C:\u>
##$EXPNO= 14510
##$NAME= <ADRS>
##$PROCNO= 1
##$TYPE= <nmr>
##$USER= <dgb>
##$AMP= (0..31)
100 100 100 100 100 100 100 100 100 100 100 100 100 100 100 100 100 100 
100 100 100 100 100 100 100 100 100 100 100 100 100 100 
##$AQSEQ= 0
##$AQ_mod= 3
##$AUNM= <au_zg>
##$AUTOPOS= <9 >
##$BF1= 250.13
##$BF2= 250.13
##$BF3= 250.13
##$BF4= 250.13
##$BF5= 500.13
##$BF6= 500.13
##$BF7= 500.13
##$BF8= 500.13
##$BYTORDA= 1
##$CFDGTYP= 0
##$CFRGTYP= 5
##$CHEMSTR= <none>
##$CNST= (0..31)
1 1 145 1 1 1 1 1 1 1 1 1 1 1 1 1 1 1 1 1 1 1 1 1 1 1 1 1 1 1 1 1 
##$CPDPRG= <>
##$CPDPRG1= <>
##$CPDPRG2= <>
##$CPDPRG3= <>
##$CPDPRG4= <mlev>
##$CPDPRG5= <mlev>
##$CPDPRG6= <mlev>
##$CPDPRG7= <mlev>
##$CPDPRG8= <mlev>
##$CPDPRGB= <>
##$CPDPRGT= <>
##$D= (0..31)
0 1 0 0 0 0 0 0 0 0.06 0 0 0 0 0 0 0.0002 0 0 0 0 0 0 0 0 0 0 0 0 0 0 
0 
##$DATE= 1137064277
##$DBL= (0..7)
120 120 120 120 120 120 120 120 
##$DBP= (0..7)
150 150 150 150 150 150 150 150 
##$DBP07= 0
##$DBPNAM0= <>
##$DBPNAM1= <>
$$ [...]
##$SUBNAM7= <"">
##$SUBNAM8= <"">
##$SUBNAM9= <"">
##$SW= 20.6930455092707
##$SWIBOX= (0..15)
0 0 3 0 0 0 0 0 0 0 0 0 0 0 0 0 
##$SW_h= 5175.983436853
##$TD= 65536
##$TD0= 1
##$TE= 294.16
##$TE2= 300
##$TE3= 300
##$TEG= 300
##$TL= (0..7)
0 120 120 120 120 120 120 120 
##$TP= (0..7)
150 150 150 150 150 150 150 150 
##$TP07= 0
##$TPNAME0= <>
##$TPNAME1= <>
##$TPNAME2= <>
##$TPNAME3= <>
##$TPNAME4= <>
##$TPNAME5= <>
##$TPNAME6= <>
##$TPNAME7= <>
##$TPOAL= (0..7)
0.5 0.5 0.5 0.5 0.5 0.5 0.5 0.5 
##$TPOFFS= (0..7)
0 0 0 0 0 0 0 0 
##$TUNHIN= 0
##$TUNHOUT= 0
##$TUNXOUT= 0
##$USERA1= <user>
##$USERA2= <user>
##$USERA3= <user>
##$USERA4= <user>
##$USERA5= <user>
##$V9= 5
##$VALIST= <valist>
##$VCLIST= <CCCCCCCCCCCCCCC>
##$VD= 0
##$VDLIST= <DDDDDDDDDDDDDDD>
##$VPLIST= <PPPPPPPPPPPPPPP>
##$VTLIST= <TTTTTTTTTTTTTTT>
##$WBST= 1024
##$WBSW= 4
##$XGAIN= (0..3)
0 0 0 0 
##$XL= 0
##$YL= 0
##$YMAX_a= 523209
##$YMIN_a= -449139
##$ZGOPTNS= <>
##$ZL1= 120
##$ZL2= 120
##$ZL3= 120
##$ZL4= 120
##$ABSF1= 16.522
##$ABSF2= -4.171173
##$ABSG= 5
##$ABSL= 3
##$ALPHA= 0
##$AQORDER= 0
##$ASSFAC= 0
##$ASSFACI= 0
##$ASSFACX= 0
##$ASSWID= 0
##$AUNMP= <proc_1d>
##$AZFE= 0.1
##$AZFW= 0.1
##$BCFW= 0
##$BC_mod= 0
##$BYTORDP= 0
##$COROFFS= 0
##$CY= 12.5
##$DATMOD= 1
##$DC= 0
##$DFILT= <>
##$DTYPP= 0
##$F1P= 14.0000005364418
##$F2P= -0.99999901652339
##$FCOR= 0.5
##$FTSIZE= 32768
##$FT_mod= 6
##$GAMMA= 0
##$GB= 0
##$INTBC= 1
##$INTSCL= 1
##$ISEN= 128
##$LB= 0.3
##$LEV0= 0
##$LPBIN= 0
##$MAXI= 10000
##$MC2= 0
##$MEAN= 0
##$ME_mod= 0
##$MI= 0
##$NCOEF= 0
##$NC_proc= -4
##$NLEV= 6
##$NOISF1= 0
##$NOISF2= 0
##$NSP= 0
##$NTH_PI= 0
##$NZP= 0
##$OFFSET= 16.522
##$PC= 1
##$PHC0= 84.98071
##$PHC1= 2.413623
##$PH_mod= 1
##$PKNL= yes
##$PPARMOD= 0
##$PSCAL= 4
##$PSIGN= 0
##$REVERSE= no
##$SF= 250.13
##$SI= 32768
##$SIGF1= 0
##$SIGF2= 0
##$SINO= 400
##$SIOLD= 32768
##$SREGLST= <1H.CDCl3>
##$SSB= 0
##$STSI= 32768
##$STSR= 0
##$SW_p= 5175.98343685301
##$SYMM= 0
##$S_DEV= 0
##$TDeff= 65536
##$TDoff= 0
##$TI= <Analysis number 999999
Compound Code 99
Book Reference 9
Project Code 9>
##$TILT= no
##$TM1= 0
##$TM2= 0
##$TOPLEV= 0
##$USERP1= <user>
##$USERP2= <user>
##$USERP3= <user>
##$USERP4= <user>
##$USERP5= <user>
##$WDW= 1
##$XDIM= 32768
##$YMAX_p= 373080736
##$YMIN_p= -229204
$$ End of Bruker specific parameters
$$ ---------------------------------
##NTUPLES= NMR SPECTRUM
##VAR_NAME=  FREQUENCY,     SPECTRUM/REAL,   SPECTRUM/IMAG
##SYMBOL=    X,             R,               I
##VAR_TYPE=  INDEPENDENT,   DEPENDENT,       DEPENDENT
##VAR_FORM=  AFFN,          ASDF,            ASDF
##VAR_DIM=   32768,         32768,           32768
##UNITS=     HZ,            ARBITRARY UNITS, ARBITRARY UNITS
##FACTOR=    0.157963299565203, 1,           1
##FIRST=     4132.6476996994, 0,             0
##LAST=      -1043.33573715361, 0,           0
##MIN=       -1043.33573715361, -229204,     0
##MAX=       4132.6476996994, 373080736,     0
$$ Real data points
##PAGE= N=1
##DATA TABLE= (X++(R..R)), XYDATA
$$ [...]
$$ plain form
19969 67283 63592 54186 45378 51877 48244 27525 21056 -6350 31151 52311 47926 60565 51164
19956 51164 41082 47825 46711 31071 2537 -29201 -14639 48538 84750 35843 23931 21491
19944 21491 5053 -28910 -37633 11160 61193 62415 65199 78005 63955 27116 3416 27499
19932 27499 46442 19215 -32600 -54820 -53499 -29926 18349 45902 31047 29695 54869 62627
19920 62627 108080 112937 84483 58367 29821 11685 35379 30961 23705 -21166 -4645 -72848
19908 -72848 -86840 -17649 15735 -11219 -48917 -15144 25858 58363 68285 60183 79597 98792
19896 98792 134785 153992 145467 151603 205991 193129 251450 273425 200474 184577 189568 195918
19884 195918 176087 200947 160048 133499 94535 90696 56790 34929 14039 27855 18649 37551
$$ packed form
19969F7283l691r406q808O499l633k0719o469k7406L7501K1160m385J2639r401
19956E1164j0082O743j114j5640k8534l1738J4562O3177L6212m8907j1912k440
19944B1491j6438l3963q723M8793N0033J222K784J2806j4050l6839k3700K4083
19932B7499J8943k7227n1815k2220J321K3573M8275K7553j4855j352K5174P758
19920F2627M5453M857k8454k6116k8546j8136K3694m418p256m4871J6521o8203
19908g2848j3992O9191L3384k6954l7698L3773M1002L2505R922q102J9414J9195
19896I8792L5993J9207q525O136N4388j2862N8321K1975p2951j5897M991O350
19884A95918j9831K4860m0899k6549l8964l839l3906k1861k0890J3816r206J8902
$$ plain form
19872 37551 61127 16133 -64154 -108527 -39255 37494 72899 84860 13183 -35401 -37313 -30438
19860 -30438 -20926 21126 32905 68434 32070 -11974 -142 40227 73050 114225 81229 92501
19848 92501 125597 103472 104621 139083 148672 119243 73238 64672 54445 49431 71405 43658
19836 43658 63172 109588 85770 47529 31346 -3088 -19451 4291 41581 35428 37602 70027
19824 70027 46274 41450 89345 94462 96946 76784 28680 40091 63914 94369 85674 17895
19812 17895 -31333 24060 37503 84128 131959 147349 109760 16655 -10400 -28019 1043 19011
19800 19011 13638 23695 77859 62390 44309 115619 135203 106630 61513 29232 61498 85724
19788 85724 139364 170250 114671 82847 96951 88007 60552 58503 61486 95476 75628 77216
$$ packed form
19872C7551K3576m4994q0287m4373O9272P6749L5405J1961p1677m8584j912O875
19860c0438R512M2052J1779L5529l6364m4044J1832M0369L2823M1175l2996J1272
19848I2501L3096k2125J149L4462R589k9429m6005q566j0227n014K1974k7747
19836D3658J9514M6416k3818l8241j6183l4434j6363K3742L7290o153K174L2425
19824G0027k3753m824M7895N117K484k0162m8104J1411K3823L0455q695o7779
19812A7895m9228N5393J3443M6625M7831J5390l7589r3105k7055j7619K9062J7968
19800A9011n373J0057N4164j5469j8081P1310J9584k8573m5117l2281L2266K4226
19788H5724N3640L0886n5579l1824J4104q944k7455k049K983L3990j9848J588
$$ plain form
19776 77216 90227 140351 133839 119924 91457 125625 133232 126243 102559 105929 111628 79277 63560
19763 63560 51273 35074 24865 -28281 -24059 13008 28011 26782 51735 21825 49668 27478
19751 27478 -18868 -7935 51790 92153 82614 79638 80311 69026 88249 110984 131093 114700
19739 114700 107327 104881 106126 93892 44418 59700 118025 123221 113944 88629 117676 106160
19727 106160 81360 73471 96615 103085 116255 123052 99557 99440 70826 42067 5265 -2609 40029
19714 40029 69882 45470 2399 -16274 -10870 14607 26959 43654 69462 62578 20813 29651
19702 29651 23131 18828 54098 60700 77391 69851 83168 108896 107455 50950 60149 77888 44990
19689 44990 10663 27650 13746 37090 47051 6955 -1142 -25946 -26628 14181 33426 57945
$$ packed form
19776G7216J3011N0124o512j3915k8467L4168P607o989k3684L370N699l2351j5717
19763F3560j2287j6199j0209n3146M222L7067J5003j229K4953k9910K7843k2190
19751B7478m6346J0933N9725M0363r539k976O73j1285J9223K2735K0109j6393
19739A14700p373k446J245j2234m9474J5282N8325N196r277k5315K9047j1516
19727A06160k4800p889K3144O470J3170O797k3495j17k8614k8759l6802p874M2638
19714D0029K9853k4412m3071j8673N404K5477J2352J6695K5808o884m1765Q838
19702B9651o520m303L5270O602J6691p540J3317K5728j441n6505R199J7739l2898
19689D4990l4327J6987j3904K3344R961m0096q097k4804o82M0809J9245K4519
$$ plain form
19677 57945 63699 57139 44943 37250 97257 168031 161896 120716 102594 120685 116967 85649 81692
19664 81692 99004 80086 71395 34427 -4633 7296 13777 72595 75264 107454 61181 6255
19652 6255 -6591 16925 17422 73610 134503 98840 62308 35103 5105 -9519 -16270 -13064 23737
19639 23737 71960 76831 73519 64805 41292 19306 27347 47038 45417 62222 121641 73793 -13551
19626 -13551 -5690 38369 65005 70097 69098 18482 -23105 15885 69335 98789 78069 33691
19614 33691 70053 71459 39535 17009 -17890 -6200 11748 -20716 5612 28204 26973 4287
19602 4287 -2641 18716 71494 65827 46941 55496 12395 -45088 -33334 -15399 -2774 23899
19590 23899 29551 13235 50530 43596 78556 60800 39706 64771 86221 95980 67279 36069
$$ packed form
19677E7945N754o560j2196p693O0007P0774o135m1180j8122J8091l718l1318l957
19664H1692J7312j8918q691l6968l9060J1929O481N8818K669L2190m6273n4926
19652F255j2846K3516M97N6188O0893l5663l6532k7205k9998j4624o751L206L6801
19639B3737M8223M871l312q714k3513k1986Q041J9691j621J6805N9419m7848q7344
19626a3551P861M4059K6636N092r99n0616m1587L8990N3450K9454k0720m4378
19614C3691L6362J406l1924k2526l4899J1690J7948l2464K6328K2592j231k2686
19602D287o928K1357N2778n667j8886Q555m3101n7483J1754J7935J2625K6673
19590B3899N652j6316L7295o934L4960j7756k1094K5065K1450R759k8701l1210
$$ plain form
19578 36069 15942 42239 66927 86433 79128 61158 61539 54442 86920 76579 59994 77808
19566 77808 68781 36960 55841 98227 90660 52867 6694 23629 28235 56022 53508 46397 40138
19553 40138 34392 55338 77596 109504 89946 84839 57885 88107 117937 77304 98366 106117
19541 106117 144356 127297 118617 106543 113214 115909 128693 140038 142646 183949 194169 148704
19529 148704 106636 90185 110548 157780 194234 193433 168466 133741 144508 125258 45855 10109
19517 10109 43211 107698 105721 79422 62508 30790 8093 7545 32626 82726 80022 76869 33894
19504 33894 43401 101842 81302 63799 70627 79950 174611 268424 352122 368728 381410 438668
19492 438668 552656 648556 600917 558106 607601 724342 867254 914239 823140 656567 544645
$$ packed form
19578C6069k0127K6297K4688J9506p305j7970L81p097L2478j0341j6585J7814
19566G7808r027l1821J8881M2386p567l7793m6173J6935M606K7787k514p111o259
19553D0138n746K0946K2258L1908j9558n107k6954L0222K9830m0633K1062P751
19541A06117L8239j7059q680j2074O671K695J2784J1345K608M1303J0220m5465
19529A48704m2068j6451K0363M7232L6454q01k4967l4725J0767j9250p9403l5746
19517A0109L3102O4487j977k6299j6914l1718k2697n48K5081N0100k704l153m2975
19504C3894R507N8441k0540j7503O828R323R4661R3813Q3698J6606J2682N7258
19492D38668J13988R5900m7639m2811M9495J16741J42912M6985r1099j66573j11922
$$ plain form
19481 544645 564016 583527 527490 480751 381668 310836 278783 221190 187782 123984 98749
19470 98749 64187 31012 45644 80369 54489 97978 189505 144851 135440 154539 161301 159687
19458 159687 192724 204893 193106 183797 169970 161339 154579 141614 135287 145971 110529 87267
19446 87267 120536 152989 109067 58017 64451 83559 33476 43875 99049 120105 160953 146162
19434 146162 100853 119257 154468 156065 136879 116014 47607 51785 75475 68817 62968 81855
19422 81855 128273 190538 154594 115186 82463 125050 162352 146786 124322 149078 146331 119739
19410 119739 62370 68985 113159 135918 170274 154258 148193 100954 61942 81212 94091 132293
19398 132293 133024 147257 173695 189610 177271 158977 114139 48679 554 29094 52408 97062
$$ packed form
19481E44645J9371J9511n6037m6739r9083p0832l2053n7593l3408o3798k5235
19470I8749l4562l3175J4632L4725k5880M3489R1527m4654r411J9099O762j614
19458A59687L3037J2169j1787r309j3827q631o760j2965o327J0684l5442k3262
19446H7267L3269L2453m3922n1050O434J9108n0083J0399N5174K1056M0848j4791
19434A46162m5309J8404L5211J597j9186k0865o8407M178K3690o658n849J8887
19422H1855M6418O2265l5944l9408l2723M2587L7302j5566k2464K4756k747k6592
19410A19739n7369O615M4174K2759L4356j6016o065m7239l9012J9270J2879L8202
19398A32293P31J4233K6438J5915j2339j8294m4838o5460m8125K8540K3314M4654
$$ plain form
19386 97062 156885 168550 145749 159962 175285 141608 84071 77479 113068 118413 148218 185485
19374 185485 177536 156721 88963 69376 94592 109973 123543 118187 70242 136439 165782 150427
19362 150427 185503 166181 180241 168310 146588 143196 111824 78175 77165 130829 178595 183786
19350 183786 137762 158180 168076 164680 178417 146689 103350 120830 142235 166102 159690 124960
19338 124960 112956 173967 159517 101374 88350 157821 179341 119902 128848 140819 87142 96071
19326 96071 156421 186026 186997 174177 118135 88904 79577 68506 149041 215516 200970 181065
19314 181065 150376 156221 140149 145486 152325 166609 155349 150597 158029 136124 113289 132328
19302 132328 136944 135644 183780 230511 258230 224674 226788 237797 218329 196045 240374 336510
$$ packed form
19386I7062N9823J1665k2801J4213J5323l3677n7537o592L5589N345K9805L7267
19374A85485p949k0815o7758j9587K5216J5381J3570n356m7945O6197K9343j5355
19362A50427L5076j9322J4060j1931k1722l392l1372l3649j010N3664M7766N191
19350A83786m6024K0418R896l396J3737l1728m3339J7480K1405K3867o412l4730
19338A24960j2004O1011j4450n8143j3024O9471K1520n9439Q946J1971n3677Q929
19326I6071O0350K9605R71j2820n6042k9231r327j1071Q0535O6475j4546j9905
19314A81065l0689N845j6072N337O839J4284j1260m752P432k1905k2835J9039
19302A32328M616j300M8136M6731K7719l3556K114J1009j9468k2284M4329R6136
$$ plain form
19290 336510 364769 320337 305629 281711 279131 298133 354095 361731 343780 335376 310987 335277
19278 335277 311013 302936 323153 301889 336731 332135 334787 304339 292744 279824 257444 272834
19266 272834 253176 247173 223563 196705 192277 210796 205124 168457 134590 109606 130953 184339
19254 184339 185913 159471 154063 141053 113949 149688 211275 227898 221173 224435 282692 260596
19242 260596 205637 194192 229462 226455 189877 141004 126177 217552 262988 220423 127443 105504
19230 105504 187352 235534 225579 264273 252934 221919 212334 230464 238912 261425 293156 305969
19218 305969 301703 292463 275296 230428 238341 298640 333304 381561 468768 547551 569448 601624
19206 601624 660524 692407 675154 625576 652320 701331 733434 722328 691743 672758 687741
$$ packed form
19290C36510K8259m4432j4708k3918k580J9002N5962P636j7951q404k4389K4290
19278C35277k4264q077K0217k1264L4842m596K652l0448j1595j2920k2380J5390
19266B72834j9658o003k3610k6858m428J8519n672l6667l3867k4984K1347N3386
19254A84339J574k6442n408j3010k7104L5739O1587J6623o725L262N8257k2096
19242B60596n4959j1445L5270l007l6578m8873j4827R1375M5436m2565r2980k1939
19230A05504Q1848M8182r955L8694j1339l1015r585J8130Q448K2513L1731J2813
19218C05969m266r240j7167m4868P913O0299L4664M8257Q7207P8783K1897L2176
19206F01624N8900L1883j7253m9578K6744M9011L2103j1106l0585j8985J4983
$$ plain form
19195 687741 691367 653244 594250 586346 499992 463268 495264 477605 377544 342064 340135 327783
19183 327783 287866 229409 230790 288844 268358 228994 212180 216840 215000 214593 229036 217667
19171 217667 185059 190189 189694 220564 232556 223996 211530 207855 216048 205784 183896 200077 254623
19158 254623 272574 276460 276628 235136 206452 228003 226853 201174 171570 134725 133577 177944
19146 177944 171414 129024 122834 143662 155758 159035 134396 138339 140936 142272 134813 115469 141595
19133 141595 83727 84997 132545 176027 215094 200546 167369 113071 54711 85044 154068 179153
19121 179153 161064 171376 143603 98797 127565 155049 190159 187139 103963 101792 141592 150990
19109 150990 164775 163050 156607 144133 120367 167933 182181 219508 197837 224348 247570 215943
$$ packed form
19195F87741L626l8123n8994p904q6354l6724L1996j7659j00061l5480j929j2352
19183C27783l9917n8457J381N8054k0486l9364j6814M660j840m07J4443j1369
19171B17667l2608N130m95L0870J1992q560j2466l675Q193j0264k1888J6181N4546
19158B54623J7951L886J68m1492k8684K1551j150k5679k9604l6845j148M4367
19146A77944o530m2390o190K0828J2096L277k4639L943K597J336p459j9344K6126
19133A41595n7868J270M7548M3482L9067j4548l3177n4298n8360L0333O9024K5085
19121A79153j8089J0312k7773m4806K8768K7484L5110l020q3176k171L9800R398
19109A50990J3785j725o443j2474k3766M7566J4248L7327k1671K6511K3222l1627
$$ plain form
19097 215943 206236 205350 206409 222529 200330 187726 197333 185549 197052 203859 187130 180859 139425
19084 139425 122200 171975 197463 183791 180073 184377 195749 225635 232981 267043 197095 130896
19072 130896 149352 198746 195499 170275 159904 145609 109030 108785 103254 155032 154183 96783 96132
19059 96132 143905 170689 191617 232993 244584 232175 231465 216421 156363 169759 239687 300434
19047 300434 309732 292124 276403 262739 216425 194410 211448 248055 228324 208583 224912 179585
19035 179585 143619 120720 102981 149453 180321 243252 229734 229623 208476 229138 180462 150553
19023 150553 144307 168115 170659 169298 177421 183504 173710 162856 186537 183285 188974 178807 195374
19010 195374 219119 202568 183690 187863 195362 188536 118454 123835 155711 190546 202542 176570
$$ packed form
19097B15943r707q86J059J6120k2199j2604R607j1784J1503O807j6729o271m1434
19084A39425j7225M9775K5488j3672l718M304J1372K9886P346L4062o9948o6199
19072A30896J8456M9394l247k5224j0371j4295l6579k45n531N1778q49n7400o51
19059I6132M7773K6784K0928M1376J1591j2409p10j5044o0058J3396O9928O0747
19047C00434R298j7608j5721j3664m6314k2015J7038L6607j9731j9741J6329m5327
19035A79585l5966k2899j7739M6472L0868O2931j3518j11k1147K0662m8676k9909
19023A50553o246K3808K544j361Q123O083r794j0854K3681l252N689j0167J6567
19010A95374K3745j6551j8878M173P499o826p0082N381L1876L4835J1996k5972
$$ plain form
18998 176570 193054 170899 158414 224446 254297 273083 321026 309575 290702 314855 313095 303655
18986 303655 284233 281183 279276 274656 338572 352158 337498 272916 298289 311474 276256 277094
18974 277094 263042 251826 237376 272288 342412 325379 307759 346094 361952 397989 405097 390748
18962 390748 370213 385541 447542 530073 559869 607500 565263 553485 599677 618160 631586
18951 631586 586388 530305 483429 486863 521116 544758 550909 544825 541430 511658 506400 510253 482633
18938 482633 427952 424375 419981 431404 426038 435682 421084 388168 349595 323620 291760 300696
18926 300696 326263 367955 369466 384585 375902 414281 419081 445988 468617 468333 487748 525891
18914 525891 484000 424185 404139 475334 563843 601021 666019 651816 606280 611880 643139 672312
$$ packed form
18998A76570J6484k2155j2485O6032K9851J8786M7943j1451j8873K4153j760r440
18986C03655j9422l050j907m620O3916J3586j4660o4582K5373J3185l5218Q38
18974B77094j4052j1216j4450L4912P0124j7033j7620L8335J5858L6037P108j4349
18962C90748k0535J5328O2001Q2531K9796M7631m2237j1778M6192J8483J3426
18951F31586m5198n6083m6876L434L4253K3642O151o084l395k9772n258L853k7620
18938D82633n4681l577m394J1423n366R644j4598l2916l8573k5975l1860Q936
18926C00696K5567M1692J511J5119q683L8379M800K6907K2629k84J9415L8143
18914E25891m1891n9815k0046P1195Q8509L7178O4998j4203m5536N600L1259K9173
$$ plain form
18902 672312 694699 709877 687517 649641 637290 657354 672348 647281 615455 554321 582549
18891 582549 619076 552643 523069 468413 477867 516758 478716 418301 403086 401440 446893 514841
18879 514841 473505 443274 379120 378051 368065 342616 433837 432086 400212 385111 404026 442611
18867 442611 412347 438182 468620 533294 522994 471493 483142 490660 453582 458885 522593 561308
18855 561308 541125 523100 575618 599532 573506 534965 476098 507888 563774 564002 587053 671476
18843 671476 666576 580610 505444 527891 576477 627448 662495 692219 688595 645431 685488 711000
18831 711000 679047 670497 735670 750092 777925 798824 807225 830904 851032 924367 984424 1009622
18819 1009622 999633 1005075 1017086 1005962 1011323 1057703 1114591 1153676 1201894 1272223 1328358 1370113
$$ packed form
18902F72312K2387J5178k2360l7876j2351K0064J4994k5067l1826o1134K8228
18891E82549L6527o6433k9574n4656R454L8891l8042o0415j5215j646M5453O7948
18879E14841m1336l0231o4154j069r986k5449R1221j751l1874j5101J8915L8585
18867D42611l0264K5835L0438O4674j0300n1501J1649P518l7078N303O3708L8715
18855E61308k0183j8025N2518K3914k6026l8541n8867L1790N5886K28K3051Q4423
18843F71476m900q5966p5166K2447M8586N0971L5047K9724l624m3164M0057K5512
18831G11000l1953q550O5173J4422K7833K0899Q401K3679K0128P3335O0057K5198
18819A009622r989N442J2011j1124N361M6380N6888L9085M8218P0329N6135M1755
$$ plain form
18807 1370113 1391395 1415112 1481561 1504412 1544076 1570854 1598223 1653187 1682034 1724993 1793242
18796 1793242 1764989 1694913 1694444 1744229 1791467 1820668 1805688 1808846 1809421 1793075 1775080 1682029
18784 1682029 1661471 1610097 1597808 1614450 1575321 1548234 1524972 1536343 1511964 1454102 1424206
18773 1424206 1455774 1410575 1400390 1439878 1483540 1498699 1488560 1418848 1345248 1250523 1184571
18762 1184571 1201671 1218503 1227945 1208869 1187193 1150561 1087023 1067702 1067567 1088697 1072045 1059502
18750 1059502 1009934 1015133 1054551 1078538 1036720 989199 982777 965520 919568 881283 912865 954982
18738 954982 995791 1035960 1009576 993480 931836 934770 915649 891177 825390 780189 810924 860665
18726 860665 837346 859696 850408 849567 882076 892358 876282 910973 939006 880462 850386 894153
$$ packed form
18807A370113K1282K3717O6449K2851L9664K6778K7369N4964K8847M2959O8249
18796A793242k8253p0076m69M9785M7238K9201j4980L158N75j6346j7995r3051
18784A682029k0558n1374j2289J6642l9129k7087k3262J1371k4379n7862k9896
18773A424206L1568m5199j0185L9488M3662J5159j0139o9712p3600r4725o5952
18762A184571J7100J6832R442j9076k1676l6632o3538j9321j35K1130j6652j2543
18750A059502m9568N199L9418K3987m1818m7521o422j7257m5952l8285L1582M2117
18738I54982M0809M0169k6384j6096o1644K934j9121k4472o5787m5201L0735M9741
18726H60665k3319K2350r288q41L2509J0282j6076L4691K8033n8544l0076M3767
$$ plain form
18714 894153 902254 923279 911950 938186 892079 934457 943976 926683 966073 941053 879469 858220
18702 858220 888994 949667 974863 1005220 1031316 1078608 1132322 1171312 1192434 1217907 1203534
18691 1203534 1205031 1238595 1261685 1288295 1335031 1345416 1303680 1312233 1331226 1384200 1369272 1392755
18679 1392755 1401000 1398301 1413968 1445895 1488047 1534366 1586509 1608542 1587825 1596206 1655904 1688868
18667 1688868 1730489 1737058 1735779 1739707 1784586 1812795 1860974 1873008 1896251 1947132 1921931 1832411
18655 1832411 1782007 1843511 1876285 1865094 1884359 1918812 1912696 1892896 1893354 1834192 1813962 1830945
18643 1830945 1852475 1878287 1913563 1976263 2008269 2076652 2160312 2233455 2274510 2356884 2370051
18632 2370051 2384392 2410779 2468490 2519218 2515223 2502354 2520554 2523150 2533293 2548298 2590484 2657661
$$ packed form
18714H94153Q101K1025j1329K6236m6107M2378R519j7293L9390k5020o1584k1249
18702H58220L0774O0673K5196L0357K6096M7292N3714L8990K1122K5473j4373
18691A203534J497L3564K3090K6610M6736J0385m1736Q553J8993N2974j4928K3483
18679A392755Q245k699J5667L1927M2152M6319N2143K2033k0717Q381N9698L2964
18667A688868M1621O569j279L928M4879K8209M8179J2034K3243N0881k5201q9520
18655A832411n0404O1504L2774j1191J9265L4453o116j9800M58n9162k0230J6983
18643A830945K1530K5812L5276O2700L2006O8383Q3660P3143M1055Q2374J3167
18632B370051J4341K6387N7711N0728l995j2869J8200K596J0143J5005M2186O7177
$$ plain form
18620 2657661 2705460 2721804 2726451 2741306 2807071 2870796 2925034 2956987 3028255 3163464 3265111
18609 3265111 3353443 3440825 3535599 3699311 3912024 4055154 4159358 4165697 4277435 4466324
18599 4466324 4608259 4759670 4956880 5187494 5414452 5632929 5876385 6128201 6457080
18590 6457080 6811662 7138619 7456086 7801218 8218382 8652444 9100406 9545070 10076901
18581 10076901 10636477 11227731 11931095 12726156 13599526 14686993 15903701 17201238 18779447
18572 18779447 20612937 22703376 25134233 27883198 30999838 34482270 38477105 43072373
18564 43072373 48357416 54374849 60909863 67788600 74758454 81659554 88275846 94387913
18556 94387913 99877966 104642007 108555635 111644942 113821492 114837683 114628125 113079953
$$ packed form
18620B657661M7799J6344M647J4855O5765O3725N4238L1953P1268J35209J01647
18609C265111Q8332Q7382R4774J63712K12713J43130J04204O339J11738J88889
18599D466324J41935J51411J97210K30614K26958K18477K43456K51816L28879
18590F457080L54582L26957L17467L45132M17164M34062M47962M44664N31831
18581A0076901N59576N91254P03364P95061Q73370J087467J216708J297537J578209
18572A8779447J833490K090439K430857K748965L116640L482432L994835M595268
18564D3072373N285043O017433O535014O878737O969854O901100O616292O112067
18556I4387913N490053M764041L913628L089307K176550J016191k09558j548172
$$ plain form
18548 113079953 110207663 106296034 101730059 96767362 91423079 85725133 79737612 73578799
18540 73578799 67306643 61228213 55582150 50592169 46306326 42744390 40020062 37929510
18532 37929510 36361047 35192733 34169861 33056274 31731460 30249953 28729970 27306021
18524 27306021 26126505 25260359 24790861 24637425 24695787 24867375 25119240 25208951 24898891
18515 24898891 24205970 23242085 22198991 21179289 20381869 19860837 19531176 19203778 18804175
18506 18804175 18116292 17204574 16264323 15372086 14549596 13770367 12979206 12394979 11876695
18497 11876695 11435444 11041256 10595916 10077440 9551825 9001825 8555426 8182927 7819646
18488 7819646 7553270 7357067 7113855 6882465 6672390 6489711 6272502 6096641 5973867
$$ packed form
18548A13079953k872290l911629m565975m962697n344283n697946n987521o158813
18540G3578799o272156o078430n646063m989981m285843l561936k724328k090552
18532C7929510j568463j168314j022872j113587j324814j481507j519983j423949
18524B7306021j179516q66146m69498j53436N8362J71588K51865Q9711l10060
18515B4898891o92921r63885j043094j019702p97420n21032l29661l27398l99603
18506A8804175o87883r11718r40251q92237q22490p79229p91161n84227n18284
18497A1876695m41251l94188m45340n18476n25615n50000m46399l72499l63281
18488G819646k66376j96203k43212k31390k10075j82679k17209j75861j22774
$$ plain form
18479 5973867 5810060 5641513 5498996 5422813 5350828 5276676 5243289 5237257 5243622 5242767 5300531
18468 5300531 5435182 5579322 5790960 6003865 6296176 6593737 6844423 7037898 7156937
18459 7156937 7276781 7433470 7613144 7847186 8070234 8243603 8435764 8506375 8548667 8598040
18449 8598040 8725565 8889305 9131775 9485940 9922064 10550752 11324640 12303656 13630858
18440 13630858 15489437 18165599 21769523 25942174 30100129 34144565 38009068 40569233
18432 40569233 41571412 42691891 44260611 45484678 46957899 49242465 51117616 51864266
18424 51864266 52343369 52646015 52810604 52581511 51220715 49859750 49433907 48945157 48109362
18415 48109362 47583176 46533409 43309168 38785264 34276520 29871206 25749148 22582527
$$ packed form
18479E973867j63807j68547j42517p6183p1985p4152l3387o032O365q55N7764
18468E300531J34651J44140K11638K12905K92311K97561K50686J93475J19039
18459G156937J19844J56689J79674K34042K23048J73369J92161P0611M2292M9373
18449H598040J27525J63740K42470L54165M36124O28688P73888R79016J327202
18440A3630858J858579K676162L603924M172651M157955M044436L864503K560165
18432D0569233J002179J120479J568720J224067J473221K284566J875151P46650
18424E1864266M79103L02646J64589k29093j360796j360965m25843m88750q35795
18415D8109362n26186j049767l224241m523904m508744m405314m122058l166621
$$ plain form
18407 22582527 20553631 19294542 18459028 17840340 17368273 16913223 16417301 16040042 15774825
18398 15774825 15760432 15923896 16244653 16689985 17197779 17886139 18851905 20276889 22396685
18389 22396685 25471244 29772180 35068793 40529573 45660688 50855756 54976501 56554530
18381 56554530 57460237 59070805 60524575 61853857 64271090 66928117 68170014 68830788
18373 68830788 69219807 69319357 69197513 67578798 64881272 63119247 61903976 60059143 58458510
18364 58458510 56919089 53177506 47243524 41103829 35065640 29047148 23959718 20221489
18356 20221489 17618210 15826594 14587225 13631665 12852552 12196268 11720000 11289684 10881107
18347 10881107 10575976 10295756 9963834 9654555 9376273 9120859 8851544 8636905 8474014
$$ packed form
18407B2582527k028896j259089q35514o18688m72067m55050m95922l77259k65217
18398A5774825j4393J63464L20757M45332N07794O88360R65766J424984K119796
18389B2396685L074559M300936N296613N460780N131115N195068M120745J578029
18381E6554530R05707J610568J453770J329282K417233K657027J241897O60774
18373F8830788L89019R9550j21844j618715k697526j762025j215271j844833j600633
18364E8458510j539421l741583n933982o139695o038189o018492n087430l738229
18356B0221489k603279j791616j239369r55560p79113o56284m76268m30316m08577
18347A0881107l05131k80220l31922l09279k78282k55414k69315k14639j62891
$$ plain form
18338 8474014 8290456 8080168 7903808 7698912 7487146 7203668 6895761 6681266 6427014
18329 6427014 6195158 6026292 5881220 5696594 5524057 5330405 5183993 4979796 4805572
18320 4805572 4637449 4483491 4335676 4190638 4053044 3977552 3875660 3740639 3612240 3490178
18310 3490178 3381040 3244467 3145078 3115526 3078396 2969805 2858054 2765416 2737471 2697412
18300 2697412 2622594 2537478 2437519 2284294 2174072 2128174 2068453 2058295 2028521 2001768 2011483
18289 2011483 2003171 1972898 1986701 1943481 1937440 1941429 1957968 1969122 1949170 1890863 1848613 1848758
18277 1848758 1901673 1920994 1949845 1971890 2052378 2134464 2169782 2159144 2146064 2074215 2039282
18266 2039282 2106678 2138257 2173773 2216469 2240034 2238345 2222470 2212234 2161019 2131174 2093978
$$ packed form
18338H474014j83558k10288j76360k04896k11766k83478l07907k14495k54252
18329F427014k31856j68866j45072j84626j72537j93652j46412k04197j74224
18320D805572j68123j53958j47815j45038j37594p5492j01892j35021j28399j22062
18310C490178j09138j36573r9389k9552l7130j08591j11751r2638k7945m0059
18300B697412p4818q5116r9959j53225j10222m5898n9721j0158k9774k6753R715
18289B011483q312l0273J3803m3220o041L989J6539J1154j9952n8307m2250J45
18277A848758N2915J9321K8851K2045Q0488Q2086L5318j0638j3080p1849l4933
18266B039282O7396L1579L5516M2696K3565j689j5875j0236n1215k9845l7196
$$ plain form
18255 2093978 2019483 1974307 1960875 1999660 1995064 1911256 1842078 1811880 1792919 1741826 1685550
18244 1685550 1637555 1647496 1621295 1533683 1522034 1549454 1573972 1571819 1603951 1582736 1556023 1563464
18232 1563464 1559424 1581835 1648311 1684431 1711638 1711391 1756192 1811704 1869520 1891877 1955950 2062317
18220 2062317 2146051 2273523 2358027 2485906 2632689 2825512 3112095 3468059 3947781 4630247
18210 4630247 5442567 6283455 6949951 6915411 6178014 5269463 4484580 3910189 3539702 3294981
18200 3294981 3130668 3069195 3050408 3014987 3016818 3074143 3167757 3245855 3350256 3462973 3599177
18189 3599177 3742025 3889156 4065908 4288434 4527335 4756199 5031466 5365666 5688054
18180 5688054 5930621 6140934 6345943 6580002 6868600 7260016 7741843 8315103 8914588
$$ packed form
18255B093978p4495m5176j3432L8785m596q3808o9178l0198j8961n1093n6276
18244A685550m7995R941k6201q7612j1649K7420K4518k153L2132k1215k6713P441
18232A563464m040K2411O6476L6120K7207k47M4801N5512N7816K2357O4073J06367
18220B062317Q3734J27472Q4504J27879J46783J92823K86583L55964M79722O82466
18210D630247Q12320Q40888O66496l4540p37397r08551p84883n74391l70487k44721
18200C294981j64313o1473j8787l5421J831N7325R3614P8098J04401J12717J36204
18189C599177J42848J47131J76752K22526K38901K28864K75267L34200L22388
18180E688054K42567K10313K05009K34059K88598L91416M81827N73260N99485
$$ plain form
18171 8914588 9613179 10428701 11450066 12652562 14154464 16042779 18534551 21750007
18163 21750007 25932143 31360230 37776979 44511588 51073615 57887532 64914290 71080544
18155 71080544 75390617 78493880 80657101 81142332 81677816 84329729 89225270 94676097
18147 94676097 100390072 107002853 113828113 118630724 120668756 119734274 115928597 109588118
18139 109588118 102148733 95646344 90263951 85276885 81220766 79275041 78555005 77147377
18131 77147377 74608435 71872270 67821164 61839880 55323516 49497567 44248978 39144985
18123 39144985 34755858 31648036 29675450 28486675 27936844 27858042 28275606 29312989 31178557
18114 31178557 34090137 38475879 45398388 56655101 72192443 85483695 82736927 65856125
$$ packed form
18171H914588O98591Q15522J021365J202496J501902J888315K491772L215456
18163B1750007M182136N428087O416749O734609O562027O813917P026758O166254
18155G1080544M310073L103263K163221M85231N35484K651913M895541N450827
18147I4676097N713975O612781O825260M802611K038032r34482l805677o340479
18139A09588118p439385o502389n382393m987066m056119j945725p20036j407628
18131G7147377k538942k736165m051106n981284o516364n825949n248589n103993
18123C9144985m389127l107822j972586j188775n49831p8802M17564J037383J865568
18114C1178557K911580M385742O922509J1256713J5537342J3291252k746768j6880802
$$ plain form
18106 65856125 49162570 38378221 32027875 28029041 25422329 23746979 22745952 22309377
18098 22309377 22306750 22768139 23792631 25504750 28106784 31970824 37549408 45271086 54813610
18089 54813610 64456086 71714370 74083061 71340466 63958458 53609279 43049055 34148386
18081 34148386 27722576 23323060 20366852 18357371 16863826 15761496 14949253 14245134
18073 14245134 13633095 13163254 12621058 12096372 11713485 11431184 11237577 11111812 11072324
18064 11072324 11110718 11125668 11087735 10987436 10945328 10904540 11020968 11237457 11579716 12130564
18054 12130564 12842573 13774316 14907719 16242624 17850893 19861151 22493446 25958042
18046 25958042 30543513 36660182 45141791 56899390 72624724 91563125 110846754
$$ packed form
18106F5856125j6693555j0784349o350346l998834k606712j675350j001027m36575
18098B2309377k627M61389J024492J712119K602034L864040N578584P721678R542524
18089E4813610R642476P258284K368691k742595p382008j0349179j0560224q900669
18081C4148386o425810m399516k956208k009481j493545j102330q12243p04119
18073A4245134o12039m69841n42196n24686l82887k82301j93607j25765l9488
18064A1072324L8394J4950l7933j00299m2108m0788J16428K16489L42259N50848
18054A2130564P12009R31743J133403J334905J608269K010258K632295L464596
18046B5958042M585471O116669Q481609J1757599J5725334J8938401J9283629
$$ plain form
18039 110846754 126108578 133369173 130893860 119043282 100972707 80636719 62173407
18032 62173407 47635861 37304364 30253627 25379918 21953636 19503827 17687691 16292361
18024 16292361 15204372 14337245 13571122 12915081 12397959 11953830 11661212 11491288 11362872
18015 11362872 11273497 11194117 11202025 11122797 11092830 11070650 11030357 11056219 11209262 11479369 11875426
18004 11875426 12320796 12837689 13387391 14017870 14767592 15746890 16977477 18654023 20901708
17995 20901708 24038267 28449303 34773807 43492503 54173798 64925991 73006279 75821728
17987 75821728 73050262 65192877 53859212 42048693 32009659 24717770 19843696 16582242
17979 16582242 14311783 12680216 11425890 10451954 9680318 9071293 8542564 8081275 7734617
$$ packed form
18039A10846754J5261824P260595k475313j1850578j8070575k0335988j8463312
18032F2173407j4537546j0331497p050737m873709l426282k449809j816136j395330
18024A6292361j087989q67127p66123o56041n17122m44129k92618j69924j28416
18015A1362872q9375p9380P908p9228k9967k2180m0293K5862J53043K70107L96057
18004A1875426M45370N16893N49702O30479P49722R79298J230587J676546K247685
17995B0901708L136559M411036O324504Q718696J0681295J0752193Q080288K815449
17987G5821728k771466p857385j1333665j1810519j0039034p291889m874074l261454
17979A6582242k270459j631567j254326r73936p71636o09025n28729m61289l46658
$$ plain form
17970 7734617 7503399 7203016 6952450 6744052 6680778 6607260 6500509 6414054 6345137 6266025
17960 6266025 6167958 6074137 5993951 5915373 5930549 5950329 5958214 5940071 5885583 5827696 5717497
17949 5717497 5514056 5326031 5157110 5028785 4910230 4749562 4616015 4510112 4417231 4345685
17939 4345685 4283198 4270372 4232128 4163469 4144673 4108515 4071634 4039987 4086135 4066935 4057342
17928 4057342 4084510 4134909 4141652 4180836 4209051 4297814 4347469 4382068 4388193 4405746 4481002 4567578
17916 4567578 4676365 4796646 4895417 5008909 5142651 5257836 5417702 5575513 5744988 5924387
17906 5924387 6115546 6378021 6641714 6827760 7055727 7366473 7656548 7984353 8350309
17897 8350309 8686357 9058046 9487622 9930720 10360621 10821702 11325051 11864111 12449506
$$ packed form
17970G734617k31218l00383k50566k08398o3274p3518j06751q6455o8917p9112
17960F266025r8067r3821q0186p8578J5176J9780P885j8143n4488n7887j10199
17949E717497k03441j88025j68921j28325j18555j60668j33547j05903r2881p1546
17939D345685o2487j2826l8244o8659j8796l6158l6881l1647M6148j9200r593
17928D057342K7168N0399O743L9184K8215Q8763M9655L4599O125J7553P5256Q6576
17916D567578J08787J20281R8771J13492J33742J15185J59866J57811J69475J79399
17906E924387J91159K62475K63693J86046K27967L10746K90075L27805L65956
17897H350309L36048L71689M29576M43098M29901M61081N03349N39060N85395
$$ plain form
17888 12449506 13079855 13719627 14422700 15291851 16357593 17635587 19135720 20980310 23159282
17879 23159282 25504003 27704220 29394971 30534087 31629227 33122863 35379624 38394195
17871 38394195 42293952 47069341 52563224 58416219 64186283 69802560 75466212 81389899
17863 81389899 87372366 93111906 98423011 103283360 107716646 111671446 114796621 116730473
17855 116730473 117102338 115860198 113174876 109404739 104955040 99982136 94592120 88674793
17847 88674793 82229404 75483437 68778845 62384499 56503168 51312768 46846001 43010792
17839 43010792 39752437 37059298 34843488 32904593 31252703 29833668 28668682 27664945
17831 27664945 26798719 26100543 25527991 25123510 24870361 24681184 24555686 24642793 24885407
$$ packed form
17888A2449506O30349O39772P03073Q69151J065742J277994J500133J844590K178972
17879B3159282K344721K200217J690751J139116J095140J493636K256761L014571
17871C8394195L899757M775389N493883N852995N770064N616277N663652N923687
17863H1389899N982467N739540N311105M860349M433286L954800L125175J933852
17855A16730473L71865j242140k685322l770137m449699m972904n390016n917327
17847H8674793o445389o745967o704592o394346n881331n190400m466767l835209
17839D3010792l258355k693139k215810j938895j651890j419035j164986j003737
17831B7664945q66226o98176n72552m04481k53149j89177j25498Q7107K42614
$$ plain form
17822 24885407 25329759 25991127 26923763 28272580 30213812 33096230 36976094 41542448
17814 41542448 45863232 49442074 53708122 59524998 65381187 68634156 70138623 71943081
17806 71943081 74505463 77863514 81548102 83718536 82051376 79540772 79635622 80750924
17798 80750924 78751037 74176283 69738435 66252106 63579681 61407431 58478281 52971313
17790 52971313 46599185 41717921 38116414 34211142 29782269 25813211 22895869 20917905
17782 20917905 19514373 18529164 17867193 17431832 17105689 16916457 16863977 16895702 17060438
17773 17060438 17383214 17928534 18729126 19818742 21401517 23632879 26616718 29909504
17765 29909504 32736640 35248647 38598584 42892467 46486305 48020063 48896012 50243360
$$ packed form
17822B4885407M44352O61368R32636J348817J941232K882418L879864M566354
17814D1542448M320784L578842M266048N816876N856189L252969J504467J804458
17806G1943081K562382L358051L684588K170434j667160k510604R4850J115302
17798H0750924j999887m574754m437848l486329k672425k172250k929150n506968
17790E2971313o372128m881264l601507l905272m428873l969058k917342j977964
17782B0917905j403532r85209o61971m35361l26143j89232n2480L1725J64736
17773A7060438L22776N45320Q00592J089616J582775K231362K983839L292786
17765B9909504K827136K512007L349937M293883L593838J533758Q75949J347348
$$ plain form
17757 50243360 52150822 54494545 56731603 57300296 55574277 54383779 55062125 55439371
17749 55439371 53109877 49749232 46759735 44459743 42657199 41030496 38408939 34090699
17741 34090699 29893057 26857105 24393975 21404387 18281056 15705071 13839085 12496200
17733 12496200 11558688 10870818 10297164 9838980 9466595 9113273 8770476 8442704 8163551
17724 8163551 7862984 7624035 7407579 7198287 6953268 6732723 6518547 6336502 6161835
17715 6161835 5913128 5695574 5511888 5329458 5181554 5071864 4954858 4796872 4634308
17706 4634308 4425032 4261584 4133895 4007379 3879601 3713532 3545897 3386848 3259015
17697 3259015 3142957 2987092 2915303 2913377 2859720 2769271 2667442 2574182 2526352 2480041 2393851
$$ packed form
17757E0243360J907462K343723K237058N68693j726019j190498O78346L77246
17749E5439371k329494l360645k989497k299992j802544j626703k621557m318240
17741C4090699m197642l035952k463130k989588l123331k575985j865986j342885
17733A2496200r37512o87870n73654m58184l72385l53322l42797l27772k79153
17724H163551l00567k38949k16456k09292k45019k20545k14176j82045j74667
17715F161835k48707k17554j83686j82430j47904j09690j17006j57986j62564
17706D634308k09276j63448j27689j26516j27778j66069j67635j59049j27833
17697C259015j16058j55865p1789j926n3657r0449j01829r3260m7830m6311q6190
$$ plain form
17686 2393851 2326456 2216943 2189422 2144122 2108203 2085605 2089615 2060832 1974032 1951564 1911504
17675 1911504 1914149 1947069 1898509 1839941 1765834 1678866 1610166 1602829 1638624 1657010 1646383 1634646
17663 1634646 1586364 1560378 1562232 1542281 1490332 1534190 1576347 1512590 1468584 1502215 1512214 1512923
17651 1512923 1538276 1540197 1529134 1504813 1428509 1427762 1456957 1552595 1561279 1481031 1446058 1460986
17639 1460986 1514119 1596329 1611903 1639890 1642820 1664701 1699874 1699635 1690534 1662898 1656631 1700696
17627 1700696 1679245 1687814 1765956 1798294 1840064 1868917 1880247 1916554 1980296 1970297 1901637 1833319
17615 1833319 1823388 1792382 1789942 1774670 1763529 1760169 1742408 1720031 1765607 1821936 1850989 1840662
17603 1840662 1817624 1835462 1855379 1853781 1829891 1848415 1893869 1917816 1910267 1931388 1984536 2074201
$$ packed form
17686B393851o7395j09513k7521m5300l5919k2598M010k8783q6800k2468m0060
17675A911504K645L2920m8560n8568p4107q6968o8700p337L5795J8386j0627j1737
17663A634646m8282k5986J854j9951n1949M3858M2157o3757m4006L3631R999P09
17651A512923K5353J921j1063k4321p6304p47K9195R5638Q684q0248l4973J4928
17639A460986N3133Q2210J5574K7987K930K1881L5173k39r101k7636o267M4065
17627A700696k1451Q569P8142L2338M1770K8853J1330L6307O3742r999o8660o8318
17615A833319r931l1006k440j5272j1141l360j7761k2377M5576N6329K9053j0327
17603A840662k3038J7838J9917j598k3890J8524M5454K3947p549K1121N3148Q9665
$$ plain form
17591 2074201 2117293 2105785 2101840 2082767 2101751 2153121 2261226 2326712 2326008 2391272 2487915 2582971
17579 2582971 2686218 2744374 2827473 2917048 3025122 3190463 3319584 3406656 3554576 3714832
17569 3714832 3936431 4161605 4442293 4722816 4948085 5157813 5327861 5532357 5767744
17560 5767744 6019283 6244896 6520103 6898607 7313753 7774247 8266294 8759767 9377196
17551 9377196 10015373 10697339 11475641 12384461 13432513 14613592 15953784 17550920 19446493
17542 19446493 21499392 23932172 26819551 30146375 34107017 38809473 44255632 50430029
17534 50430029 57232543 64444154 71546069 78054469 83635229 88452733 92867212 97349491
17526 97349491 102099715 106910662 111160795 113847007 114178386 111875952 107601712 102350630
$$ packed form
17591B074201M3092j1508l945j9073J8984N1370J08105O5486p04O5264R6643R5056
17579B582971J03247N8156Q3099Q9575J08074J65341J29121Q7072J47920J60256
17569C714832K21599K25174K80688K80523K25269K09728J70048K04496K35387
17560E767744K51539K25613K75207L78504M15146M60494M92047M93473O17429
17551I377196O38177O81966P78302R08820J048052J181079J340192J597136J895573
17542A9446493K052899K432780K887379L326824L960642M702456N446159O174397
17534E0430029O802514P211611P101915O508400N580760M817504M414479M482279
17526I7349491M750224M810947M250133K686212L31379k302434m274240n251082
$$ plain form
17518 102350630 97022410 92083650 87494418 82904169 77795323 71923984 65456682 58767287
17510 58767287 52361103 46538891 41538071 37345986 33808139 30885649 28460058 26415422
17502 26415422 24705793 23246499 21993615 20888017 19895007 19009027 18307812 17603877 16982919
17493 16982919 16439232 15890946 15391367 14918205 14437849 13938683 13488750 13044737 12580056
17484 12580056 12149163 11680620 11219621 10774772 10352384 9949230 9583665 9144087 8713236
17475 8713236 8305170 7922615 7542983 7208305 6918840 6705929 6495601 6278100 5975783
17466 5975783 5695495 5457427 5264077 5016203 4753276 4514762 4289802 4101987 3883307
17457 3883307 3717748 3569835 3394093 3266029 3109650 2999077 2912407 2810439 2743048 2677535
$$ packed form
17518A02350630n328220m938760m589232m590249n108846n871339o467302o689395
17510E8767287o406184n822212n000820m192085l537847k922490k425591k044636
17502B6415422j709629j459294j252884j105598r93010q85980p01215p03935o20958
17493A6982919n43687n48286m99579m73162m80356m99166m49933m44013m64681
17484A2580056m30893m68543m60999m44849m22388m03154l65565m39578m30851
17475H713236m08066l82555l79632l34678k89465k12911k10328k17501l02317
17466E975783k80288k38068j93350k47874k62927k38514k24960j87815k18680
17457C883307j65559j47913j75742j28064j56379j10573q6670j01968o7391o5513
$$ plain form
17447 2677535 2589983 2495210 2422106 2415044 2476650 2396244 2295700 2177439 2081571 1936226 1780778
17436 1780778 1689920 1646611 1557369 1521563 1483196 1423726 1347230 1275999 1272891 1264981 1215877 1153836
17424 1153836 1126719 1062307 1050880 1029021 1011800 970871 973777 968374 900232 873644 820090 846643
17412 846643 924557 948827 905457 899445 896695 872731 850196 802058 770959 766132 752332 678696
17400 678696 629403 641941 657391 680978 690228 669165 653978 603408 551697 508053 509711 488073
17388 488073 455834 439123 439370 414841 352319 308345 290291 271899 255988 263559 280005 225408
17376 225408 206697 250219 285778 243921 249533 290463 302973 236740 197106 218627 241302 277787
17364 277787 296311 271290 213588 211906 239221 219921 245729 324973 331111 335191 274983 267197
$$ packed form
17447B677535q7552r4773p3104p062O1606q0406j00544j18261r5868j45345j55448
17436A780778r0858m3309q9242l5806l8367n9470p6496p1231l108p910m9104o2041
17424A153836k7117o4412j1427k1859j7221m0929K906n403o8142k6588n3554K6553
17412H46643P7914K4270m3370o012k750k3964k2535m8138l1099m827j3800p3636
17400F78696m9293J2538J5450K3587R250k1063j5187n0570n1711m3644J658k1638
17388D88073l2239j6711K47k4529o2522m3974j8054j8392j5911P571J6446n4597
17376B25408j8711M3522L5559m1857N612M0930J2510o6233l9634K1521K2675L6485
17364B77787J8524k5021n7702j682K7315j9300K5808P9244O138M080o0208p786
$$ plain form
17352 267197 285489 273138 263918 246642 241351 261548 279113 238816 241864 211907 178593 196567
17340 196567 200715 210163 216005 252385 272491 243165 236593 225211 215993 202648 193814 223935 224083
17327 224083 214161 228891 235693 240292 205846 179790 243933 217416 182566 216886 214468 213713 284680
17314 284680 336167 316628 264655 286819 282281 344497 345613 340447 393025 471813 476578 454911
17302 454911 522318 572321 571390 516132 464799 443831 453027 480171 497069 523620 534939 519513
17290 519513 529061 469045 435386 483176 506361 525473 492550 507206 454242 391197 400154 341524
17278 341524 302143 272025 223441 200264 257644 292331 289139 287670 317136 304213 333366 395054
17266 395054 410154 364988 395670 458524 517393 520108 554805 552920 622439 704434 729899 768390
$$ packed form
17352B67197J8292j2351r220j7276n291K0197J7565m0297L048k9957l3314J7974
17340A96567M148R448N842L6380K0106k9326o572j1382r218j3345q834L0121J48
17327B24083r922J4730O802M599l4446k6056O4143k6517l4850L4320k418p55P0967
17314B84680N1487j9539n1973K2164m538O2216J116n166N2578P8788M765k1667
17302D54911O7407N0003r31n5258n1333k0968R196K7144J6898K6551J1319j5426
17290E19513R548o0016l3659M7790K3185J9112l2923J4656n2964o3045Q957n8630
17278C41524l9381l0118m8584k3177N7380L4687l192j469K9466j2923K9153O1688
17266C95054J5100m5166L0682O2854N8869K715L4697j885O9519Q1995K5465L8491
$$ plain form
17254 768390 836534 936021 1002132 1013014 949968 909156 897136 899140 826241 750718 752263 741119
17242 741119 747490 667509 554067 558357 508481 439677 420587 405172 407746 354706 331428 339917
17230 339917 327798 278300 262456 273712 274597 238553 202686 164835 162605 149241 173708 144004
17218 144004 93222 62246 59735 57112 72238 72284 54891 76633 113354 139064 152869 172686
17206 172686 158460 127718 146165 159985 124680 81981 53758 68001 61841 35822 661 6497
17194 6497 27101 39298 43846 42367 37046 40960 32780 -14234 -61513 -16240 45711 67127 20078
17181 20078 2645 6190 -3243 -18575 39712 79288 78346 55810 51778 11478 -44085 -40593 6762
17168 6762 28030 -11721 -2002 -20657 -18908 21051 37080 13477 -21357 -36566 -25595 2775
$$ packed form
17254G68390O8144R9487O6111J0882o3046m0812j2020K004p2899p5523J545j1144
17242G41119O371p9981j13442M290m9876o8804j9090j5415K574n3040k3278Q489
17230C39917j2119m9498j5844J1256Q85l6044l5867l7851k230j3364K4467k9704
17218A44004n0782l0976k511k623J5126M6j7393K1742L6721K5710J3805J9817
17206A72686j4226l0742J8447J3820l5305m2699k8223J4243o160k6019l5161N836
17194F497K0604J2197M548j479n321L914q180m7014m7279M5273O1951K1416m7049
17181B0078j7433L545r433j5332N8287L9576r42k2536m032m0300n5563L492M7355
17168F762K1268l9751R719j8655J749L9959J6029k3603l4834j5209J0971K8370
$$ plain form
17156 2775 18085 21784 9078 6145 -34820 -58655 -46037 -28868 2992 43424 77607 46073
17144 46073 -1613 -8964 30954 25027 49891 38058 -8396 -65463 -64620 -27518 29599 43866
17132 43866 11556 -41681 -51213 -51242 -42972 -46897 -24196 -50345 -30764 -12473 -35306 -57768 -11834
17119 -11834 26942 -11572 -49338 -53101 -39238 8130 32725 4064 -13260 -17026 -2628 -11613
17107 -11613 -41708 -65559 -62729 -38103 -32327 -51403 -67794 -30620 -22219 -31595 -6598 5179
17095 5179 -28800 -39267 -29062 -46198 -82168 -17883 44035 51756 75202 63125 36304 -2402
17083 -2402 -24606 -54095 -64224 -54704 -69167 -74492 -56265 -70702 -68153 -49903 -57972 -50144 -46041
17070 -46041 -55612 -73595 -79279 -75177 -41888 -72248 -43716 -23732 -17589 -508 32839 68133
$$ packed form
17156B775J5310L699j2706k933m0965k3835J2618J7169L1860M0432L4183l1534
17144D6073m7686p351L9918n927K4864j1833m6454n7067Q43L7102N7117J4267
17132D3866l2310n3237r532k9Q270l925K2701k6149J9581J8291k2833k2462M5934
17119a1834L8776l8514l7766l763J3863M7368K4595k8661j7324l766J4398q985
17107a1613l0095k3851K830K4626N776j9076j6391L7174Q401r376K4997J1777
17095E179l3979j0467J0205j7136l5970O4285O1918P721K3446j2077k6821l8706
17083b402k2204k9489j0129R520j4463n325J8227j4437K549J8250q069P828M103
17070d6041r571j7983n684M102L3289l0360K8532J9984O143J7081L3347L5294
$$ plain form
17058 68133 8860 -8734 -40671 -42085 -13131 -5449 -39915 -24950 -26159 -727 -5342 -8284 30519
17045 30519 56890 63970 91715 58418 15734 -23286 -19836 13482 27758 2281 62621 85813
17033 85813 60649 39072 21380 12515 16290 22209 50653 8774 -26686 -34246 -13728 -18916 -36574
17020 -36574 -44290 -28514 4936 -23809 -55635 -49709 -63943 -30823 -5764 -68480 -61770 -25433
17008 -25433 -25538 -33741 -85712 -62347 4166 -19079 -90531 -85785 -63132 -50772 -34696 -31113 -23676
16995 -23676 -22630 -43627 -26046 -16553 -24163 -17183 -49255 -60741 -54403 -93926 -77059 -90331 -82340
16982 -82340 -74154 -14764 11609 -25751 -63913 -67594 -58202 -80864 -88936 -80844 -58644 -77134 -36194
16969 -36194 -9220 1483 5521 -15877 -30500 -26509 -25463 -47342 -38014 -8443 -35979 -38672 -18038
$$ packed form
17058F8133n9273j7594l1937j414K8954P682l4466J4965j209K5432m615k942L8803
17045C0519K6371P080K7745l3297m2684l9020L450L3318J4276k5477O0340K3192
17033H5813k5164k1577j7692q865L775N919K8444m1879l5460p560K0518n188j7658
17020c6574p716J5776L3450k8745l1826N926j4234L3120K5059o2716O710L6337
17008b5433j05q203n1971K3365O6513k3245p1452M746K2653J2360J6076L583P437
16995b3676J046k0997J7581R493p610O980l2072j1486O338l9523J6867j3272P991
16982h2340Q186N9390K6373l7360l8162l681R392k2662q072Q092K2200j8490M0940
16969c6194K6974J0703M038k1398j4623L991J046k1879R328K9571k7536k693K0634
$$ plain form
16956 -18038 -4126 -49968 -96735 -76283 -52253 -32272 -52946 -63411 -62579 -17665 11189 -1110
16944 -1110 -22133 44202 46924 6915 34119 55091 41000 3673 39099 145887 189836 240356
16932 240356 296979 296840 289324 353338 431105 481722 477682 499931 513068 527057 555609 539801
16920 539801 493430 509645 465977 424427 418761 406567 390780 382555 384462 352588 306558 192330
16908 192330 131887 129151 94414 77763 106775 125222 94077 121538 117650 87747 91655 81570
16896 81570 46290 39689 4089 -5131 41149 58973 10821 -12868 1653 -7938 -2396 5044 38304
16883 38304 61597 26002 23477 18563 13409 10580 5117 -9950 1952 21661 7928 -52052 -50529
16870 -50529 3103 550 -7191 -8600 -41960 -54713 -69449 -32219 -42401 -85369 -100582 -74463
$$ packed form
16956a8038J3912m5842m6767K0452K4030J9981k0674j0465Q32M4914K8854j2299
16944a110k1023O6335K722m0009K7204K0972j4091l7327L5426J06788M3949N0520
16932B40356N6623j39p516O4014P7767N0617m040K2249J3137J3989K8552j5808
16920E39801m6371J6215m3668m1550n666j2194j5787q225J907l1874m6030j14228
16908A92330o0443k736l4737j6651K9012J8447l1145K7461l888k9903L908j0085
16896H1570l5280o601l5600r220M6280J7824m8152k3689J4521r591N542P440L3260
16883C8304K3293l5595k525m914n154k829n463j5067J1902J9709j3733n9980J523
16870e0529N3632k553p741j409l3360j2753j4736L7230j0182m2968j5213K6119
$$ plain form
16858 -74463 -66059 -65393 -78298 -69642 -58735 -79964 -121663 -79689 -50361 -76884 -96400 -116320
16846 -116320 -82114 -47357 -52872 -35783 -66847 -80633 -85552 -83907 -136460 -120752 -110356 -86567
16834 -86567 -62296 -33746 4369 9305 -19936 -74215 -108265 -117524 -114434 -15277 23850 1140
16822 1140 -66613 -86564 -83215 -78370 -47972 -38697 -56046 -48826 -14981 -26763 -42500 -20839 -10185
16809 -10185 5134 20717 3016 -18860 -51314 -56681 -32742 1038 -2997 -2070 -61156 -77274
16797 -77274 -24158 -22378 -65135 -85605 -92475 -77099 -72277 -80510 -68943 -43926 -73512 -37949
16785 -37949 -21405 -37054 -62496 -56151 -59102 -27878 -16625 -8626 -51712 -58990 -50770 -59676 -59566
16772 -59566 -86845 -85148 -31908 -45467 -46667 -67436 -65450 -66411 -81692 -123695 -114706 -63114 -36316
$$ packed form
16858g4463Q404O66j2905Q656J0907k1229m1699M1974K9328k6523j9516j9920
16846a16320L4206L4757n515J7089l1064j3786m919J645n2553J5708J0396K3789
16834h6567K4271K8550L8115M936k9241n4279l4050r259L090R9157L9127k2710
16822A140o7753j9951L349M845L0398R275j7349P220L3845j1782j5737K1661J0654
16809a0185J5319J5583j7701k1876l2454n367K3939L3780m035R27n9086j6118
16797g7274N3116J780m2757k0470o870J5376M822q233J1567K5017k9586L5563
16785c7949J6544j5649k5442O345k951L1224J1253P999m3086p278Q220q906J10
16772e9566k7279J697N3240j3559j200k0769J986r61j5281m2003Q989N1592K6798
$$ plain form
16759 -36316 -43584 -80718 -89024 -71829 -76122 -89650 -80374 -91030 -79194 -59815 -78449 -64643
16747 -64643 -41616 -80564 -127113 -112745 -73742 -28875 -42066 -70667 -104806 -84174 -58077 -3496
16735 -3496 -33493 -69446 -74300 -72323 -66257 -68417 -67558 -97541 -141602 -132103 -153407 -124016 -106100
16722 -106100 -66105 -43609 -26596 -10104 -31238 -2250 7478 -39187 -107389 -108432 -89336 -130784
16710 -130784 -132521 -56531 -5046 -23639 -50573 -63661 -119143 -78714 -26278 13955 -11517 -40737
16698 -40737 -72448 -72318 -60154 -49052 -84728 -90583 -74847 -81454 -32591 5518 -28695 -12111
16686 -12111 -14707 -62318 -75305 -82472 -104352 -113716 -71672 -27938 -44080 -27537 -26349 -17046 -47671
16673 -47671 -72570 -54134 -99960 -119722 -116340 -90146 -43100 -45236 -68506 -71162 -78819 -107033
$$ packed form
16759c6316p268l7134q306J7195m293j3528R276j0656J1836J9379j8634J3806
16747f4643K3027l8948m6549J4368L9003M4867j3191k8601l4139K0632K6097N4581
16735c496k9997l5953m854J977O066k160Q59k9983m4061R499k1304K9391J7916
16722a06100L9995K2496J7013J6492k1134K8988R728m6665o8202j043J9096m1448
16710a30784j737P5990N1485j8593k6934j3088n5482M0429N2436M0233k5472k9220
16698d0737l1711J30J2164J1102l5676n855J5736o607M8863L8109l4213J6584
16686a2111k596m7611j2987p167k1880r364M2044M3734j6142J6543J188R303l0625
16673d7671k4899J8436m5826j9762L382K6194M7046k136k3270k656p657k8214
$$ plain form
16661 -107033 -91047 -68183 -28825 -13977 -49467 -31323 -15390 -18874 -57460 -60864 -76393 -80555
16649 -80555 -83944 -80505 -38720 -45411 -40953 -44897 -77092 -63942 -48706 -58261 -49416 -745 95743
16636 95743 67079 -14816 -64059 -70848 -46513 -54193 -68778 -76553 -70446 -95763 -91469 -74955 -46537
16623 -46537 -50727 -47778 -85776 -117031 -94113 -64152 -50587 -41449 -64933 -101958 -75699 -51263
16611 -51263 11625 53182 41718 72881 9945 -21852 -22281 -64156 -69727 -68061 -74677 -33374 29030
16598 29030 2365 -42219 -66830 -74939 -80057 -99158 -117190 -130141 -133581 -151773 -81185 -73883
16586 -73883 -91433 -84301 -87447 -90000 -50704 -76060 -74414 -84132 -78412 -25822 -30350 -32249 -2332
16573 -2332 -14427 -11463 24983 15083 -11328 -27416 -100299 -141734 -114458 -144200 -145090 -128629 -144493
$$ packed form
16661a07033J5986K2864L9358J4848l5490J8144J5933l484l8586l404j5529m162
16649h0555l389L439M1785o691M458l944l2195J3150J5236r555Q845M8671R6488
16636I5743k8664q1895m9243o789K4335p680j4585p775O107k5317M294J6514K8418
16623d6537m190K949l7998l1255K2918K9961J3565R138k3484l7025K6259K4436
16611e1263O2888M1557j1464L1163o2936l1797m29m1875n571J666o616M1303O2404
16598B9030k6665m4584k4611q109n118j9101j8032j2951l440j8192P0588P302
16586g3883j7550P132l146k553L9296k5356J646r718N720N2590m528j899K9917
16573b332j2095K964L6446r900k6411j6088p2883m1435K7276k9742q90J6461j5864
$$ plain form
16560 -144493 -143623 -120038 -133334 -162501 -161413 -125402 -83662 -73644 -88304 -66831 -35306 -27200
16548 -27200 2062 13637 -35903 -43610 -32840 7788 -12212 -54988 -23996 15492 -27742 -100367
16536 -100367 -80391 -97737 -79938 -92780 -133057 -79932 -51557 -55477 -157 14721 -27656 -43663
16524 -43663 -53560 -35827 -15403 -14718 8266 21229 -1069 -17129 -25963 -12819 56360 44139
16512 44139 8242 -22886 -25483 22673 -14236 -6147 -7583 -22800 -22540 7734 -12692 -19401 -42161
16499 -42161 -30452 -62569 -52517 -48222 -9605 2731 -26070 -68549 -42297 -39540 -55849 -62616
16487 -62616 -76792 -59936 -25063 -66021 -76258 -70953 -125554 -185577 -186027 -97081 -26684 5608
16475 5608 11695 -29496 -88928 -89501 -123602 -151792 -134240 -129558 -137600 -96408 -83599 -69342 -65085
$$ packed form
16560a44493Q70K3585j3296k9167J088L6011M1740J0018j4660K1473L1525Q106
16548b7200K9262J1575m9540p707J0770M0628k0000m2776L0992L9488m3234p2625
16536a00367J9976j7346J7799j2842m0277N3125K8375l920N5320J4878m2377j6007
16524d3663r897J7733K0424O85K2984J2963k2298j6060q834J3144O9179j2221
16512D4139l5897l1128k597M8156l6909Q089j436j5217K60L0274k0426o709k2760
16499d2161J1709l2117J0052M295L8617J2336k8801m2479K6252K757j6309o767
16487f2616j4176J6856L4873m0958j0237N305n4601o0023m50Q8946P0397L2292
16475E608O087m1191n9432n73l4101k8190J7552M682q042M1192J2809J4257M257
$$ plain form
16462 -65085 -69338 -59613 -30944 -33718 -88943 -82796 -42009 -28162 -78255 -108307 -144359 -136344 -84035
16449 -84035 -76909 -57906 -36441 -45071 -63421 -44973 -24545 -17848 10802 -963 -17292 -65092
16437 -65092 -124042 -162181 -132589 -96866 -80803 -93135 -145813 -125393 -89820 -107087 -85222 -66124
16425 -66124 -42350 -44241 -75445 -88417 -69684 -72459 -126279 -121003 -105414 -96318 -121391 -142329
16413 -142329 -103368 -48749 -30167 -44660 -30838 16881 23516 -21337 -23579 -34890 -68152 -53755
16401 -53755 -21462 -15346 -45028 -34129 -45297 -50978 -48465 12245 71298 117172 97200 41136
16389 41136 10900 4574 -24261 -16298 -24066 -11049 -716 -11806 -20714 -34513 -46076 -86655
16377 -86655 -124418 -130071 -122208 -48249 -50566 -28120 13542 17335 -36587 -19802 -13415 20949 -14479
$$ packed form
16462f5085m253R725K8669k774n5225O147M0787J3847n0093l0052l6052Q015N2309
16449h4035P126J9003K1465q630j8350J8448K0428O697K8650j1765j6329m7800
16437f5092n8950l8139K9592L5723J6063j2332n2678K0420L5573j7267K1865J9098
16425f6124K3774j891l1204j2972J8733k775n3820N276J5589R096k5073k0938
16413a42329L8961N4619J8582j4493J3822M7719O635m4853k242j1311l3262J4397
16401e3755L2293O116k9682J0899j1168n681K513O0710N9053M5874j9972n6064
16389D1136l0236o326k8835P963p768J3017J0333j1090q908j3799j1563m0579
16377h6655l7763n653P863P3959k317K2446M1662L793n3922J6785O387L4364l5428
$$ plain form
16364 -14479 -24966 -47177 -49555 -47996 -84380 -118391 -146125 -101475 -56023 -82443 -53483 -64614
16352 -64614 -47537 -68022 -87077 -81347 -81758 -57985 -98908 -111230 -95852 -53019 -43793 -48562 -57878
16339 -57878 -63137 -47621 -11446 -18904 221 -34680 -50889 -25980 -31951 -59679 -62194 -34858
16327 -34858 -42127 -32112 19642 31101 8954 42490 19769 -61726 -97492 -97790 -63333 -16101
16315 -16101 -5839 -23120 -40488 -2248 55225 79915 44417 21030 -19507 -55137 -57446 -62424
16303 -62424 -53338 -56027 -84884 -80622 -67124 -12488 21519 84 14442 -45143 -129671 -108150
16291 -108150 -79237 -88730 -60628 -79433 -63396 -11845 21887 18854 -3427 21899 -15883 -19058
16279 -19058 -14490 -1658 10379 7004 -32319 -102061 -95611 -46509 -38315 -91582 -103262 -58341
$$ packed form
16364a4479j0487k2211k378J559l6384l4011k7734M4650M5452k6420K8960j1131
16352f4614J7077k0485j9055N730m11K3773m0923j2322J5378M2833R226m769r316
16339e7878n259J5516L6175p458J9125l4901j6209K4909n971k7728k515K7336
16327c4858p269J0015N1754J1459k2147L3536k2721q1495l5766k98L4457M7232
16315a6101J0262j7281j7368L8240N7473K4690l5498k3387m0537l5630k309m978
16303f2424R086k689k8857M262J3498N4636L4007k1435J4358n9585q4528K1521
16291a08150K8913r493K8102j8805J6037N1551L3732l033k2281K5326l7782l175
16279a9058M568J2832J2037l375l9323o9742O450M9102Q194n3267j1680M4921
$$ plain form
16267 -58341 -17454 23464 -11461 -82272 -84140 -99126 -98350 -58255 -56289 -26076 -4153 -47447
16255 -47447 -80883 -21773 21066 20349 15867 45723 -19059 -58919 -74202 -68443 -69914 -73142 -42306
16242 -42306 -63927 -93682 -55153 -22547 -67561 -77184 -46213 -77887 -76700 -32771 -52328 -65922
16230 -65922 -69139 -112089 -133337 -73086 -45593 -21661 -4768 -39040 -66928 -81253 -84025 -101201
16218 -101201 -104088 -115865 -81638 -73056 -62357 -6178 -7919 16541 30103 19623 -58122 -89958
16206 -89958 -49833 -45161 -5876 9803 -21108 -19763 -57987 -102828 -106065 -52627 -26129 -35592
16194 -35592 -44228 -10549 15467 33882 48096 25918 5452 -27907 -63511 -57627 -74881 -68560
16182 -68560 -41929 -43512 -40687 -38636 -10936 2284 23866 -19331 -17248 -48329 -71073 -80646 -77541
$$ packed form
16267e8341M0887M0918l4925p0811j868j4986P76M0095J966L0213K1923m3294
16255d7447l3436N9110M2839p17m482K9856o4782l9860j5283N759j471l228L0836
16242d2306k1621k9755L8529L2606m5014r623L0971l1674J187M3929j9557j3594
16230f5922l217m2950k1248O0251K7493K3932J6893l4272k7888j4325k772j7176
16218a01201k887j1777L4227Q582J0699N6179j741K4460J3562j0480p7745l1836
16206h9958M0125M672L9285J5679l0911J345l8224m4841l237N3438K6498r463
16194c5592q636L3679K6016J8415J4214k2178k0466l3359l5604N884j7254O321
16182f8560K6631j583K825K051K7700J3220K1582m3197K083l1081k2744r573L105
$$ plain form
16169 -77541 -56692 -60567 -7748 39334 6362 -53471 -69565 -69212 -91758 -95461 -57918 -11857
16157 -11857 -23785 -44566 -85077 -74212 -54080 -28684 -30596 -32968 -16103 -96629 -129286 -109776
16145 -109776 -104361 -108110 -115068 -100008 -96140 -103279 -100857 -55490 -49198 -121729 -126452 -95918 -13015
16132 -13015 -25499 -62091 -80534 -41651 -2750 -9028 -40552 -40800 -69729 -92967 -49892 -87271
16120 -87271 -128943 -106455 -88256 -62649 -33090 -42265 -79799 -87180 -51134 -65980 -55659 -20988
16108 -20988 -14090 -24894 -35563 -57556 -75297 -70190 -74572 -50920 -16791 20672 25371 16331 12742
16095 12742 20069 25346 20846 -29104 -76824 -74632 -55048 -53318 -27110 -37589 -36742 -34900 -28279
16082 -28279 -36415 -33075 -24903 -62086 -76218 -79960 -25038 -2209 -57850 -104443 -146935 -121420
$$ packed form
16169g7541K0849l875N2819M7082l2972n9833j6094L53k2546l703L7543M6061
16157a1857j1928k0781m0511J0865K0132K5396j912k372J6865q0526l2657J9510
16145a09776N415l749o958J5060L868p139K422M5367O292p2531m723L0534Q2903
16132a3015j2484l6592j8443L8883L8901o278l1524k48k8929k3238M3075l7379
16120h7271m1672K2488J8199K5607K9559r175l7534p381L6046j4846J0321L4671
16108b0988O898j0804j0669k1993j7741N107m382K3652L4129L7463M699r040l589
16095A2742P327N277m500m9950m7720K192J9584J730K6208j0479Q47J842O621
16082b8279q136L340Q172l7183j4132l742N4922K2829n5641m6593m2492K5515
$$ plain form
16070 -121420 -74753 -69874 -42340 -28048 -41271 -69994 -53856 18490 -14944 -84305 -80153 -41930
16058 -41930 -34716 -41072 -49092 -76410 -60939 -47907 -10955 45288 29014 -6959 -50688 -46035
16046 -46035 -24027 -12695 -18944 -41690 -35855 -24454 -23508 -16819 -47914 -39266 -27287 31555 29489
16033 29489 -38670 -89233 -77460 -110361 -169348 -147003 -109137 -128197 -115803 -80992 -49603 -13918
16021 -13918 -28390 -27347 -66831 -95918 -68529 -18781 -12080 -28577 -26500 -46963 -80164 -94318
16009 -94318 -104414 -103158 -51518 7061 37980 12484 -23187 -25150 2862 31795 16134 -21343
15997 -21343 -18255 3931 13035 71494 131659 119868 56132 55909 13134 -27537 -28289 -19465 39502
15984 39502 60524 52691 38780 -5043 -15571 788 -32696 -55709 -86901 -80533 -46519 -22655
$$ packed form
16070a21420M6667M879K7534J4292j3223k8723J6138P2346l3434o9361M152L8223
16058d1930P214o356q020k7318J5471J3032L6952N6243j6274l5973m3729M653
16046d6035K2008J1332o249k2746N835J1401R46O689l1095Q648J1979N8842k066
16033B9489o8159n0563J1773l2901n8987K2345L7866j9060J2394L4811L1389L5685
16021a3918j4472J043l9484k9087K7389M9748O701j6497K077k0463l3201j4154
16009i4318j0096J256N1640N8579L0919k5496l5671j963K8012K8933j5661l7477
15997b1343L088K2186R104N8459O0165j1791o3736k23m2775m0671p52Q824N8967
15984C9502K1022p833j3911m3823j0528J6359l3484k3013l1192O368L4014K3864
$$ plain form
15972 -22655 -2352 -17364 2433 -3763 14700 40170 31340 7050 -1968 -72611 -64196 -50348
15960 -50348 -36741 -3939 -4925 12802 -15451 -23427 -26367 -57337 -100720 -95118 -64251 -72171 -61383
15947 -61383 -26548 -24274 -39695 527 34546 19203 -53016 -66282 -11072 5885 10154 -14497
15935 -14497 -724 -9902 -42341 -25385 24216 46291 -4707 -49183 -56292 -78861 -105495 -90314
15923 -90314 -71248 -75262 -45705 -6766 22899 25761 7801 -2270 -2738 33134 57974 32685
15911 32685 25977 -10006 -47703 -39397 -25911 -14759 298 29691 93039 69241 78440 88860
15899 88860 44045 21920 40089 57113 34994 36386 42176 38640 6210 -6110 -41146 -5238
15887 -5238 34224 41789 751 -15067 -41621 -41870 -45082 -88412 -70349 -21221 -5636 -3161 6657
$$ packed form
15972b2655K0303j5012J9797o196J8463K5470q830k4290r018p0643Q415J3848
15960e0348J3607L2802r86J7727k8253p976k940l0970m3383N602L0867p920J0788
15947f1383L4835K274j5421M0222L4019j5343p2219j3266N5210J6957M269k4651
15935a4497J3773r178l2439J6956M9601K2075n0998m4476p109k2569k6634J5181
15923i0314J9066m014K9557L8939K9665K862j7960j0071m68L5872K4840k5289
15911C2685o708l5983l7697Q306J3486J1152J5057K9393O3348k3798R199J0420
15899H8860m4815k2125J8169J7024k2119J392N790l536l2430j2320l5036L5908
15887e238L9462P565m1038j5818k6554k49l212m3330J8063M9128J5585K475R818
$$ plain form
15874 6657 28673 38224 6096 60190 70495 40536 50251 25078 -43975 -44165 -26118 -60344 -12864
15861 -12864 -15621 -44671 -94216 -79104 -48912 11836 3802 8231 6756 52438 62064 52676 61824
15848 61824 74093 50405 57322 76517 75521 59216 86245 100609 104067 145247 131194 107007
15836 107007 108081 83039 24990 28735 40401 53793 77468 53133 4912 -21926 -32871 -46750
15824 -46750 -78571 -62178 -39624 -42027 -11046 3728 19665 13747 42551 60272 35112 -22618
15812 -22618 -15720 21344 22627 12653 66633 103198 104197 23178 -16347 29392 73490 99594 109444
15799 109444 93674 69436 16486 1804 10513 27759 3582 11324 -17119 -48165 -21447 -41462
15787 -41462 -40564 11684 62226 80429 53881 27364 20604 12421 20913 30839 14100 36885 43401
$$ packed form
15874F657K2016R551l2128N4094J0305k9959R715k5173o9053j90J8047l4226M7480
15861a2864k757k9050m9545J5112L0192O0748q034M429j475M5682R626r388R148
15848F1824J2269k3688O917J9195r96j6305K7029J4364L458M1180j4053k4187
15836A07007J074k5042n8049L745J1666J3392K3675k4335m8221k6838j0945j3879
15824d6750l1821J6393K2554k403L0981J4774J5937n918K8804J7721k5160n7730
15812b2618O898L7064J283r974N3980L6565R99q1019l9525M5739M4098K6104R850
15799A09444j5770k4238n2950j4682Q709J7246k4177P742k8443l1046K6718k0015
15787d1462Q98N2248N0542J8203k6548k6517o760q183Q492R926j6739K2785O516
$$ plain form
15774 43401 469 -65158 -101451 -76125 -90825 -112214 -71566 -36933 -11235 16988 29898 22736
15762 22736 28431 12084 -22755 -38134 -30691 -18006 -2015 965 24617 69931 86074 51090
15750 51090 58899 44054 -17392 10406 51759 -79 -50542 19152 22259 26094 2706 -15771
15738 -15771 10248 64225 98572 104663 50748 6645 7298 41498 88148 63048 11547 -24540
15726 -24540 -7348 41659 22310 -15956 -33545 -24193 -32674 -7921 -14691 -12364 4752 8113 -40408
15713 -40408 -61250 -29495 -45490 -52387 -5433 -10343 -30325 -41512 5475 40013 44780 42222
15701 42222 39773 22576 30096 11593 -19319 -61184 -26640 -9369 -5579 28319 18055 27387
15689 27387 87644 94521 97291 64877 443 -49859 -5602 -26244 3643 38050 72748 48319
$$ packed form
15774D3401m2932o5627l6293K5326j4700k1389M0648L4633K5698K8223J2910p162
15762B2736N695j6347l4839j5379P443J2685J5991K980K3652M5314J6143l4984
15750E1090P809j4845o1446K7798M1353n1838n0463O9694L107L835k3388j8477
15738a5771K6019N3977L4347O091n3915m4103O53L4200M6650k5100n1501l6087
15726b4540J7192M9007j9349l8266j7589R352q481K4753o770K327J7116L361m8521
15713d0408k0842L1755j5995o897M6954m910j9982j1187M6987L4538M767k558
15701D2222k449j7197P520j8503l0912m1865L4544J7271L790L3898j0264R332
15689B7387O0257O877K770l2414o4434n0302M4257k0642K9887L4407L4698k4429
$$ plain form
15677 48319 -44406 -32857 38610 69396 47779 54364 40524 -3494 -35622 -15692 9035 -3763
15665 -3763 -8013 14100 38595 2438 -2358 47515 71805 55781 45968 69343 31876 60864
15653 60864 61548 11406 -8523 -13427 6527 30605 -8910 -39359 47594 54723 38254 18823
15641 18823 37510 17629 1992 861 10053 25109 31675 47038 53051 91860 96810 83687 55714
15628 55714 37526 -4630 -27199 -8231 3363 69786 97203 25184 -22260 -7575 37785 29104
15616 29104 32121 50371 19322 30417 30984 -2180 -2601 47463 18198 5961 65443 61218 14990
15603 14990 7147 95330 92449 76841 74359 12145 -24582 13645 21835 15152 41842 25759 -2157
15590 -2157 23725 33217 37933 3686 16433 20193 23773 -36821 8394 65464 42744 6374 -51058
$$ packed form
15677D8319r2725J1549P1467L0786k1617O585j3840m4018l2128J9930K4727j2798
15665c763m250K2113K4495l6157m796M9873K4290j6024r813K3375l7467K8988
15653F0864O84n0142j9929m904J9954K4078l9515l0449Q6953P129j6469j9431
15641A8823J8687j9881j5637j131R192J5056O566J5363O013L8809M950j3123k7973
15628E5714j8188m2156k2569J8968J1594O6423K7417p2019m7444J4685M5360q681
15616B9104L017J8250l1049J1095N67l3164m21N0064k9265j2237N9482m225m6228
15603A4990p843Q8183k881j5608k482o2214l6727L8227Q190o683K6690j6083k7916
15590b157K5882R492M716l4247J2747L760L580o0594M5215N7070k2720l6370n7432
$$ plain form
15577 -51058 -58492 9682 68361 81376 42543 2908 19155 78983 89057 88108 85741 100496
15565 100496 113437 128443 105695 73729 9895 4878 11942 -32649 -37942 8738 38127 1583
15553 1583 44391 61547 52554 41627 -10651 18565 46644 64367 81550 75011 96365 88814
15541 88814 64339 73769 93754 74649 60830 112530 194911 177976 72698 14030 -23154 -10153
15529 -10153 -1231 52690 108863 116692 144718 160132 185206 128788 114069 76037 76555 126148
15517 126148 138086 140059 148102 114647 94412 88236 63492 40429 63847 138398 146354 136199
15505 136199 127677 112692 149962 135792 102745 78373 46442 55948 109441 176285 152884 113540
15493 113540 109024 109828 82193 69767 81609 99166 113327 66527 15257 35682 73376 102804
$$ packed form
15577e1058p434O8174N8679J3015l8833l9635J6247N9828J0074r49k367J4755
15565A00496J2941J5006k2748l1966o3834n017P064m4591n293M6680K9389l6544
15553A583M2808J7156q993j0927n2278K9216K8079J7723J7183o539K1354p551
15541H8814k4475R430J9985j9105j3819N1700Q2381j6935j05278n8668l7184J3001
15529a0153Q922N3921N6173P829K8026J5414K5074n6418j4719l8032N18M9593
15517A26148J1938J973Q043l3455k0235o176k4744k3063K3418P4551P956j0155
15505A36199q522j4985L7270j4170l3047k4372l1931R506N3493O6844k3401l9344
15493A13540m516Q04k7635j2426J1842J7557J4161m6800n1270K0425L7694K9428
$$ plain form
15481 102804 90675 89458 75888 118526 159857 179490 151840 125117 104425 145228 146364 99300
15469 99300 137372 144863 122993 84302 95439 134182 112740 109541 173363 164530 127506 182012
15457 182012 201354 160615 161983 151285 193154 213844 199595 225657 228309 220842 226018 233466
15445 233466 218738 223218 195582 206897 282622 318783 269494 255842 251688 244698 249835 274862
15433 274862 318455 352024 340469 349048 385927 446269 424283 413331 419798 412648 478901 513617
15421 513617 578119 654501 698097 751882 818740 828850 891016 1019729 1143718 1214777 1321125
15410 1321125 1436394 1559406 1736259 1948680 2207281 2457890 2783681 3153223 3554409
15401 3554409 4001875 4485532 5145343 5992960 7002725 8313023 9852291 11535516 13398245
$$ packed form
15481A02804j2129j217j3570M2638M1331J9633k7650k6723k0692M0803J136m7064
15469I9300L8072P491k1870l8691J1137L8743k1442l199O3822q833l7024N4506
15457A82012J9342m0739J368j0698M1869K0690j4249K6062K652p467N176P448
15445B33466j4728M480k7636J1315P5725L6161m9289j3652m154o990N137K5027
15433B74862M3593L3569j1555Q579L6879O0342k1986j0952O467p150O6253L4716
15421E13617O4502P6382M3596N3785O6858J0110O2166J28713J23989P1059J06348
15410A321125J15269J23012J76853K12421K58601K50609L25791L69542M01186
15401C554409M47466M83657O59811Q47617J009765J310298J539268J683225J862729
$$ plain form
15392 13398245 15243493 16947142 18350929 19218912 19430724 18986495 17893675 16285215
15384 16285215 14393467 12466185 10612616 8958055 7591584 6486362 5675221 5058695
15376 5058695 4533361 4160769 3832591 3556316 3265339 3001914 2798859 2628288 2456104
15367 2456104 2324939 2201890 2051993 1936699 1852794 1767522 1690007 1598447 1583843 1542840
15357 1542840 1536982 1558820 1526624 1499468 1451530 1415379 1409935 1323141 1269192 1220899 1193388 1059015
15345 1059015 996610 979192 972080 971536 963151 925870 855409 782090 813569 773318 740836 670750
15333 670750 627965 562772 531869 525345 464725 475059 495407 496943 479349 422328 393291 360240
15321 360240 356609 328788 303313 260425 255773 280749 312433 337998 327097 330997 290004 251890
$$ packed form
15392A3398245J845248J703649J403787Q67983K11812m44229j092820j608460
15384A6285215j891748j927282j853569j654561j366471j105222q11141o16526
15376E058695n25334l72592l28178k76275k90977k63425k03055j70571j72184
15367B456104j31165j23049j49897j15294q3905q5272p7515r1560j4604m1003
15357A542840n858K1838l2196k7156m7938l6151n444q6794n3949m8293k7511j34373
15345A059015o2405j7418p112n44q385l7281p0461p3319L1479m0251l2482p0086
15333F70750m2785o5193l0903o524o0620J0334K0348J536j7594n7021k9037l3051
15321C60240l631k7821k5475m2888m652K4976L1684K5565j0901L900m0993l8114
$$ plain form
15309 251890 274027 276350 222103 186798 201955 208420 212734 194310 196974 250833 258384 230205
15297 230205 199832 191165 212557 212322 202627 195464 183287 127284 98242 110191 112917 100328 90296
15284 90296 63764 52194 72593 120338 118434 121260 88828 54078 74268 118835 150376 164804
15272 164804 137891 113776 75640 124295 184843 182561 141285 128896 139425 116996 89757 50458
15260 50458 46995 108675 148633 168485 174924 177407 174350 144869 121303 67115 61332 59756 61780
15247 61780 54610 59229 92132 107361 69272 26410 38411 80638 84500 45568 31353 30173
15235 30173 92426 117586 127743 151135 113501 99588 76509 85131 106443 163580 214862 191447
15223 191447 169557 109985 73077 133947 141100 76912 42486 37914 62384 27255 9356 30529
$$ packed form
15309B51890K2137K323n4247l5305J5157O465M314j8424K664N3859P551k8179
15297B30205l0373q667K1392k35r695p163j2177n6003k9042J1949K726j2589j0032
15284I0296k6532j1570K0399M7745j904K826l2432l4750K0190M4567L1541J4428
15272A64804k6913k4115l8136M8655O0548k282m1276j2389J0529k2429k7239l9299
15260E0458l463O1680L9958J9852O439K483l057k9481k3566n4188n783j576K024
15247F1780p170M619L2903J5229l8089m2862J2001M2227L862l8932j4215j180
15235C0173O2253K5160J0157K3392l7634j3913k3079Q622K1312N7137N1282k3415
15223A91447k1890n9572l6908O0870P153o4188l4426m572K4470l5129j7899K1173
$$ plain form
15211 30529 55537 49389 10237 39154 121331 68218 13888 47941 76233 68430 93161 135506
15199 135506 133071 69153 61414 81274 87311 101396 99128 79618 126882 165391 157890 177662
15187 177662 182966 186313 141583 156314 162144 145654 130953 95363 100787 148745 128607 80847
15175 80847 75255 114623 130542 145375 198077 192317 139041 131971 133337 178955 151096 83346
15163 83346 70235 71362 70289 53486 58965 83316 96144 134896 141060 75987 75357 114958 148735
15150 148735 160640 137285 143032 149317 135491 152264 149338 120916 114643 95573 86795 119392
15138 119392 158263 213145 224962 210979 197510 206232 194394 149648 125389 130936 119193 133426
15126 133426 180174 242436 298520 310848 270239 249582 249695 294053 307130 351982 431936 508406
$$ packed form
15211C0529K5008o148l9152K8917Q2177n3113n4330L4053K8292p803K4731M2345
15199A35506k435o3918p739J9860O037J4085k268j9510M7264L8509p501J9772
15187A77662N304L347m4730J4731N830j6490j4701l5590N424M7958k0138m7760
15175H0847n592L9368J5919J4833N2702n760n3276p070J366M5618k7859o7750
15163H3346j3111J127j073j6803N479K4351J2828L8752O164o5073o30L9601L3777
15150A48735J1905k3355N747O285j3826J6773k926k8422o273j9070q778L2597
15138A19392L8871N4882J1817j3983j3469Q722j1838m4746k4259N547j1743J4233
15126A33426M6748O2262N6084J2328m0609k0657J13M4358J3077M4852P9954P6470
$$ plain form
15114 508406 565731 611752 690814 799225 952850 1177819 1392645 1511414 1634746 1810866
15104 1810866 1994637 2069791 2073684 1997322 1914680 1758998 1576909 1396196 1269051 1076582
15094 1076582 935375 805872 651974 503091 455549 420059 379103 391136 406141 433461
15084 433461 464002 407595 332787 287463 260153 257237 248701 309338 258846 222777 222464 228228
15072 228228 268081 252101 263642 299453 300987 287413 286618 293867 290877 278587 270970 239815 204066
15059 204066 194150 202995 190661 151033 180743 213769 200816 217832 221369 235538 198445 165441
15047 165441 149262 178071 231736 233550 199771 212666 195002 222046 218868 227820 238913 198455
15035 198455 212186 242979 267046 265430 254963 259407 252946 226151 193240 185555 201555 202876
$$ packed form
15114E08406N7325M6021P9062J08411J53625K24969K14826J18769J23332J76120
15104A810866J83771P5154L893p6362q2642j55682j82089j80713j27145j92469
15094A076582j41207j29503j53898j48883m7542l5490m0956J2033J5005K7320
15084D33461L0541n6407p4808m5324k7310k916q536O0637n0492l6069l13N764
15072B28228L9853j5980J1541L5811J534j3574p95P249k990j2290p617l1155l5749
15059B04066r916Q845j2334l9628K9710L3026j2953J7016L537J4169l7093l3004
15047A65441j6179K8809N3665J814l3779J2895j7664K7044l178Q952J1093m0458
15035A98455J3731L0793K4067j616j0467M444o461k6795l2911p685J6000J321
$$ plain form
15023 202876 198146 225203 216072 210683 189386 220880 245963 249739 257527 240699 233806 226464 241381
15010 241381 252928 216808 181784 160347 160985 143260 134690 113973 138030 190273 238219 207642
14998 207642 158566 164813 182821 198115 174866 186545 266957 295063 276237 274602 270782 296095
14986 296095 292083 281798 261249 291139 280093 220015 163256 233421 274996 308792 303384 269392
14974 269392 278942 294323 339953 390988 380383 378616 413466 433061 448253 420741 466259 564732
14962 564732 696059 799670 976196 1222665 1487658 1741210 1963877 2017944 2013333 1899455
14952 1899455 1675988 1439078 1241702 1037975 877266 704916 618526 627341 552055 510254
14942 510254 515994 512477 510687 560864 591183 560812 565444 621094 599589 585581 585427 604579 601130
$$ packed form
15023B02876m730K7057r131n389k1297L1494K5083L776P788j6828o893p342J4917
15010B41381J1547l6120l5024k1437O38j7725q570k0717K4057N2243M7946l0577
14998B07642m9076O247J8008J5294k3249J1679Q0412K8106j8826j635l820K5313
14986B96095m012j0285k0549K9890j1046o0078n6759P0165M1575L3796n408l3992
14974B69392R550J5381M5630N1035j0605j767L4850J9595J5192k7512M5518R8473
14962E64732J31327J03611J76526K46469K64993K53552K22667N4067m611j13878
14952A899455k23467k36910j97376k03727j60709j72350q6390Q815p5286m1801
14942E10254N740l517j790N0177L0319l0371M632N5650k1505j4008j54J9152l449
$$ plain form
14929 601130 601255 619421 663753 680192 660688 669771 683313 676944 614450 608893 642884 603740
14917 603740 578129 552977 563925 577857 534729 528871 485827 536369 569076 531752 515249 511249
14905 511249 500420 439989 443932 465279 428650 408186 412040 431087 422339 398369 410396 368412
14893 368412 357192 354119 356411 299500 302784 315702 312152 279239 218851 220042 250371 262680
14881 262680 263319 246664 301583 314071 269491 258852 300993 308188 317989 343158 368583 332730
14869 332730 350481 389457 404863 409763 380823 368759 415249 458881 511633 508830 534071 530886
14857 530886 563445 615854 634950 621259 628784 619956 610009 618916 618773 586044 559770 583938 584091
14844 584091 569680 558961 583536 643884 669501 665034 640461 602522 637367 599228 607230 596697
$$ packed form
14929F01130J25J8166M4332J6439j9504R083J3542o369o2494n557L3991l9144
14917F03740k5611k5152J0948J3932m3128n858m3044N0542L2707l7324j6503m000
14905E11249j0829o0431L943K1347l6629k0464L854J9047q748k3970J2027m1984
14893C68412j1220l073K292n6911L284J2918l550l2913o0388J191L0329J2309
14881B62680O39j6655N4919J2488m4580j0639M2141P195R801K5169K5425l5853
14869C32730J7751L8976J5406M900k8940j2064M6490M3632N2752k803K5241l185
14857E30886L2559N2409J9096j3691P525q828r947Q907j43l2729k6274K4168J53
14844E84091j4411j0719K4575O0348K5617m467k4573l7939L4845l8139Q002j0533
$$ plain form
14832 596697 581092 520603 458172 445298 467833 515335 580538 604471 576602 557509 550461 530105
14820 530105 571795 659998 704011 670298 667780 690977 693593 737332 809215 854277 876079 928454
14808 928454 997521 1062585 1140452 1249484 1287189 1302177 1347582 1384628 1413264 1470314 1521828
14797 1521828 1560167 1573045 1543205 1559147 1593746 1574615 1538732 1515384 1466581 1448224 1422466
14786 1422466 1403550 1403094 1393670 1331218 1317211 1414769 1584825 1701815 1854816 1966966 2069060
14775 2069060 2166190 2242498 2282290 2314818 2311242 2255101 2171546 2062123 1905067 1826856 1736566
14764 1736566 1646412 1554590 1464239 1406617 1421561 1452966 1474199 1510494 1534022 1500116 1464053
14753 1464053 1447825 1429886 1478008 1538243 1564121 1596321 1659478 1640106 1688710 1790194 1855512
$$ packed form
14832E96697j5605o0489o2431j2874K2535M7502O5203K3933k7869j9093p048k0356
14820E30105M1690Q8203M4013l3713k518K3197K616M3739P1883M5062K1802N2375
14808I28454O9067O5064P7867J09032L7705J4988M5405L7046K8636N7050N1514
14797A521828L8339J2878k9840J5942L4599j9131l5883k3348m8803j8357k5758
14786A422466j8916m56r424o2452j4007R7558J70056J16990J53001J12150J02094
14775B069060R7130P6308L9792L2528l576n6141q3555j09423j57056p8211r0290
14764A736566r0154r1822r0351n7622J4944L1405K1233L6295K3528l3906l6063
14753A464053j6228j7939M8122O0235K5878L2200O3157j9372M8604J01484O5318
$$ plain form
14742 1855512 1889268 1894724 1925879 1953912 1985720 1992700 2004085 2028713 2072043 2120442 2176670 2268182
14730 2268182 2305244 2354554 2402617 2418578 2497959 2571560 2597026 2646995 2679234 2772464 2886735
14719 2886735 2972461 3049758 3115672 3198606 3300434 3460083 3638451 3781654 3935377 4098268
14709 4098268 4218308 4332579 4518923 4748141 4973638 5186514 5426648 5677022 5926775
14700 5926775 6189034 6517568 6872314 7246869 7655447 8074858 8549975 9098318 9718123
14691 9718123 10449863 11324609 12302433 13461310 14870481 16540140 18553155 20937515 23818348
14682 23818348 27204347 31171810 35743031 41064937 47303911 54614353 63425641 74419993
14674 74419993 88381652 106228668 128687641 155994215 187619967 222338275 258548371
$$ packed form
14742A855512L3756N456L1155K8033L1808O980J1385K4628M3330M8399N6228R1512
14730B268182L7062M9310M8063J5961P9381P3601K5466M9969L2239R3230J14271
14719B886735Q5726P7297O5914Q2934J01828J59649J78368J43203J53723J62891
14709D098268J20040J14271J86344K29218K25497K12876K40134K50374K49753
14700E926775K62259L28534L54746L74555M08578M19411M75117N48343O19805
14691I718123P31740Q74746R77824J158877J409171J669659K013015K384360K880833
14682B3818348L385999L967463M571221N321906O238974P310442Q811288J0994352
14674G4419993J3961659J7847016K2458973K7306574L1625752L4718308L6210096
$$ plain form
14667 258548371 294102344 326024709 351326938 367540730 373080736 367478631 351227469
14660 351227469 325788326 293567927 257542246 220759778 185855340 154498481 127686346
14653 127686346 106015225 89358168 77055889 68022639 61116208 55635102 51080929
14646 51080929 47179590 43733663 40740083 38098557 35807236 33827624 32096179 30676052
14638 30676052 29512510 28593927 27849222 27289758 26792075 26283301 25792326 25375199 24982966
14629 24982966 24504518 23961855 23318223 22637114 21892103 21064214 20060616 19138351 18249674
14620 18249674 17331040 16443221 15595284 14718553 13931420 13245576 12600890 11985672 11440887
14611 11440887 10851334 10277951 9729521 9232610 8800489 8333665 7849887 7407400 7006584
$$ packed form
14667B58548371L5553973L1922365K5302229J6213792N540006n602105j6251162
14660C51227469k5439143l2220399l6025681l6782468l4904438l1356859k6812135
14653A27686346k1671121j6657057j2302279r033250o906431n481106m554173
14646E1080929l901339l445927k993580k641526k291321j979612j731445j420127
14638C0676052j163542r18583p44705n59464m97683n08774m90975m17127l92233
14629B4982966m78448n42663o43632o81109p45011q27889j003598r22265q88677
14620A8249674r18634q87819q47937q76731p87133o85844o44686o15218n44785
14611A1440887n89553n73383n48430m96911m32121m66824m83778m42487m00816
$$ plain form
14602 7006584 6685313 6405103 6119855 5844191 5572411 5310663 5000822 4755450 4509813
14593 4509813 4262796 4037359 3839883 3667056 3477101 3383239 3254723 3080837 2884178 2704607
14583 2704607 2561337 2454683 2362402 2246882 2110932 2022171 1980660 1903930 1821964 1718807
14573 1718807 1605407 1496545 1408441 1393698 1366228 1321797 1314986 1230443 1162508 1141768 1159667
14562 1159667 1120673 1076025 1067311 1049620 999603 958361 959502 974997 1012485 1033214 1011184 1001255
14550 1001255 1022147 1010787 962804 943809 931148 884194 869684 873505 904462 874380 840648
14539 840648 823379 729451 690909 681756 682207 624851 582444 591961 559683 565475 583907 520973
14527 520973 446304 397942 363074 307194 199268 179187 184581 150538 103709 91691 65449
$$ packed form
14602G006584l21271k80210k85248k75664k71780k61748l09841k45372k45637
14593D509813k47017k25437j97476j72827j89955r3862j28516j73886j96659j79571
14583B704607j43270j06654r2281j15520j35950q8761m1511p6730q1966j03157
14573A718807j13400j08862q8104j4743k7470m4431o811q4543o7935k0740J7899
14562A159667l8994m4648q714j7691n0017m1242J141J5495L7488K0729k2030r929
14550A001255K0892j1360m7983j8995j2661m6954j4510L821L0957l0082l3732
14539H40648j7269r3928l8542r153M51n7356m2407R517l2278N792J8432o2934
14527E20973p4669m8362l4868n5880j07926k0081N394l4043m6829j2018k6242
$$ plain form
14516 65449 95662 91256 101919 129310 139403 161223 164782 143250 139415 134441 117850 102241
14504 102241 114763 132181 146541 159127 110692 113312 114661 119537 148162 197278 265859 257819
14492 257819 217755 249097 234271 205782 176491 229491 267711 282530 290783 260251 224682 197594
14480 197594 210458 240536 265491 258081 255827 240663 239455 256107 193462 213341 206616 230298
14468 230298 272602 291168 313737 316063 307260 261695 242396 247708 257595 271959 302762 286553
14456 286553 288011 278427 270792 272036 269642 237386 252921 240140 245506 225444 186156 167077 114299
14443 114299 99694 99795 140863 174214 183560 202251 166811 132035 103380 110189 92090 98269
14431 98269 76683 90196 171494 219181 219306 173264 118785 131410 144774 123797 110226 122594
$$ packed form
14516F5449L0213m406J0663K7391J0093K1820L559k1532l835m974j6591j5609
14504A02241J2522J7418J4360J2586m8435K620J349M876K8625M9116O8581q040
14492B57819m0064L1342j4826k8489k9291N3000L8220J4819Q253l0532l5569k7088
14480A97594J2864L0078K4955p410k254j5164j208J6652o2645J9879o725K3682
14468B30298M2304J8566K2569K326q803m5565j9299N312R887J4364L0803j6209
14456B86553J458r584p635J244k394l2256J5535j2781N366k0062l9288j9079n2778
14443A14299j4605J01M1068L3351R346J8691l5440l4776k8655O809j8099O179
14431I8269k1586J3513Q1298M7687J25m6042n4479J2625J3364k0977j3571J2368
$$ plain form
14419 122594 143207 129084 122845 101496 108780 151371 160767 162039 104406 104565 84364 64120 41804
14406 41804 51666 79934 33054 -40761 -45440 -29224 -10393 -44380 -100225 -56581 -22693 -67217
14394 -67217 -107261 -92786 -131845 -187443 -229204 -210946 -146331 -176287 -206316 -138316 -63802 -46704
14382 -46704 -59932 -88437 -87602 -69599 -86828 -51344 12809 8026 -48707 -61826 -74565 -121749
14370 -121749 -126252 -87246 -24837 -36644 -82192 -60227 -107669 -120846 -54746 -27738 -13612 -19312
14358 -19312 -17321 -39113 -23449 -78903 -154555 -168000 -169163 -178178 -160421 -135825 -180781 -166587
14346 -166587 -135480 -113840 -107428 -85687 -83818 -119685 -77918 -40912 -38041 6881 -11788 11970
14334 11970 2646 -43283 -46728 -57151 -64647 -11103 30537 27269 38801 72234 60302 65116 58906
$$ packed form
14419A22594K0613j4123o239k1349P284M2591R396J272n7633J59k0201k0244k2316
14406D1804R862K8268m6880p3815m679J6216J8831l3987n5845M3644L3888m4524
14394f7217m0044J4475l9059n5598m1761J8258O4615k9956l0029O8000P4514J7098
14382d6704j3228k8505Q35J8003j7229L5484O4153m783n6733j3119j2739m7184
14370a21749m503L9006O2409j1807m5548K1965m7442j3177O6100K7008J4126n700
14358a9312J991k1792J5664n5454p5652j3445j163r015J7757K4596m4956J4194
14346a66587L1107K1640O412K1741J869l5867M1767L7006K871M4922j8669K3758
14334A1970r324m5929l445j0423p496N3544M1640l268J1532L3433j1932M814o210
$$ plain form
14321 58906 54528 44506 83245 74199 102244 85246 69066 47190 36897 29195 42875 34584
14309 34584 56897 100033 66244 12783 31393 41628 62233 47214 22667 11811 -2470 16932
14297 16932 29037 17578 -2400 2598 5119 25810 64516 80526 36422 5514 12897 41644
14285 41644 88936 81729 72493 80401 28719 -3463 -6807 -10575 -6159 -22084 -31382 -44830 -26777
14272 -26777 -7251 -23683 -8431 -1928 -51212 -65222 -52925 -52431 -3135 -58752 -112580 -120392
14260 -120392 -57853 -21836 -21687 -13583 11933 27958 6781 -18921 -27214 2175 -8735 -28676
14248 -28676 -25336 266 42056 74332 80211 86452 71239 86152 108625 114410 149188 128859
14236 128859 77373 109284 174410 124545 157927 242633 296867 367878 466698 583455 693967
$$ packed form
14321E8906m378j0022L8739r046K8045j6998j6180k1876j0293p702J3680q291
14309C4584K2313M3136l3789n3461J8610J0235K0605j5019k4547j0856j4281J9402
14297A6932J2105j1459j9978M998K521K0691L8706J6010m4104l0908P383K8747
14285D1644M7292p207r236P908n1682l2182l344l768M416j5925r298j3448J8053
14272b6777J9526j6432J5252O503m9284j4010J2297M94M9296n5617n3828p812
14260a20392O2539L6017J49Q104K5516J6025k1177k5702q293K9389j0910j9941
14248b8676L340K5602M1790L2276N879O241j5213J4913K2473N785L4778k0329
14236A28859n1486L1911O5126m9865L3382Q4706N4234P1011R8820J16757J10512
$$ plain form
14225 693967 840037 995582 1193968 1406827 1573116 1733203 1866104 1946696 1985978 1938980
14215 1938980 1796773 1661932 1518043 1322521 1075660 944427 817610 660381 550295
14206 550295 474899 455126 425437 339140 313156 315474 291106 227577 175186 206911 285150 309615
14194 309615 223576 164883 166449 112863 108749 123009 130848 83035 64667 60625 94514 147028
14182 147028 152930 144800 128251 107114 56724 26953 30597 45131 58593 78914 74876 117300
14170 117300 98838 92983 44101 -7330 -35671 -24573 17907 27746 89017 113556 63197 29981
14158 29981 604 -7391 -7016 -18903 -30685 -26558 23559 17056 9688 8640 -12313 -32057 -26862
14145 -26862 -49599 -56354 -45266 -1409 8106 -52271 -37315 -32450 -40999 -61966 -63130 -34223 -25472
$$ packed form
14225F93967J46070J55545J98386K12859J66289J60087J32901Q0592L9282m6998
14215A938980j42207j34841j43889j95522k46861j31233j26817j57229j10086
14206E50295p5396j9773k9689q6297k5984K318k4368o3529n2391L1725P8239K4465
14194C09615q6039n8693J566n3586m114J4260P839m7813j8368m042L3889N2514
14182A47028N902q130j6549k1137n0390k9771L644J4534J3462K0321m038M2424
14170A17300j8462n855m8882n1431k8341J1098M2480R839O1271K4539n0359l3216
14158B9981k9377p995L75j1887j1782M127N0117o503p368j048k0953j9744N195
14145b6862k2737o755J1088M3857R515o0377J4956M865q549k0967j164K8907Q751
$$ plain form
14132 -25472 -26602 -4417 32245 40027 15509 -10060 -22458 -9257 -43218 -44316 -45169 -79685 -58966
14119 -58966 -95327 -119684 -81754 -66910 -62511 -112251 -105383 -56177 -38645 -57255 -44253 -6138
14107 -6138 -18358 -92525 -100341 -76475 -75390 -73736 -55074 -9700 -1420 -34615 -28257 -44134 -26834
14094 -26834 -24245 -28366 -15118 -40363 -15825 -28823 -88007 -84933 -41717 -48331 -60020 -53901 -33427
14081 -33427 -46808 -37711 -6052 -21028 -50970 -63887 -54734 12631 40507 19987 14929 -20748
14069 -20748 18491 61363 54306 28793 18319 18728 -11521 19952 19166 -19894 -18403 11703 32206
14056 32206 8014 8015 -7351 -26187 18563 -12126 -77413 -23620 19445 37100 41503 42366 21754
14043 21754 96387 123314 138659 164878 164577 142420 183139 207233 288425 312851 310882 391838
$$ packed form
14132b5472j130K2185L6662P782k4518k5569j2398J3201l3961j098q53l4516K0719
14119e8966l6361k4357L7930J4844M399m9740O868M9206J7532j8610J3002L8115
14107f138j2220p4167p816K3866J085J654J8662M5374Q280l3195O358j5877J7300
14094b6834K589m121J3248k5245K4538j2998n9184L074M3216o614j1689O119K0474
14081c3427j3381R097L1659j4976k9942j2917R153O7365K7876k0520n058l5677
14069b0748L9239M2872p057k5513j0474M09l0249L1473p86l9060J491L0106K0503
14056C2206k4192Jj5366j8836M4750l0689o5287N3793M3065J7655M403Q63k0612
14043B1754P4633K6927J5345K6219l01k2157M0719K4094Q1192K4426j969Q0956
$$ plain form
14031 391838 473588 574894 785694 968318 1177242 1444879 1652736 1869262 2067622 2171119
14021 2171119 2238503 2240601 2216703 2033772 1768670 1550563 1322108 1090017 895452 736117
14011 736117 584539 445702 340439 306827 290148 224992 182018 151015 175356 218269 212853
14000 212853 161548 119578 63649 52668 58782 20766 7949 24527 60519 108985 84737 33330
13988 33330 37076 65169 84791 63553 75911 115609 135220 136173 115075 66125 51187 56774
13976 56774 25952 21404 19799 29636 20412 36088 104839 133401 105721 53878 5232 -2558 16686
13963 16686 25659 62925 116726 27158 -54803 -103409 -83299 -33437 -55078 -92141 -59813 -24933
13951 -24933 37047 60072 49173 -13546 -22447 -45843 -64128 -101132 -50466 -65570 -126373 -149843
$$ packed form
14031C91838Q1750J01306K10800J82624K08924K67637K07857K16526J98360J03497
14021B171119O7384K098k3898j82931k65102k18107k28455k32091j94565j59335
14011G36117j51578j38837j05263l3612j6679o5156m2974l1003K4341M2913n416
14000B12853n1305m1970n5929j0981O114l8016j2817J6578L5992M8466k4248n1407
13988C3330L746K8093J9622k1238J2358L9698J9611R53k1098m8950j4938N587
13976E6774l0822m548j605R837r224J5676O8751K8562k7680n1843m8646p790J9244
13963A6686Q973L7266N3801q9568q1961m8606K0110M9862k1641l7063L2328L4880
13951b4933O1980K3025j0899o2719q901k3396j8285l7004N0666j5104o0803k3470
$$ plain form
13939 -149843 -116127 -145904 -130745 -97502 -96494 -76261 -55844 1392 -1345 17038 61337 70436
13927 70436 85114 83290 86873 62869 67819 47846 15447 32011 39894 43174 26054 33989 59604
13914 59604 77293 56275 18094 12250 -6984 -49971 -17291 45195 78704 89709 92595 30176
13902 30176 -21111 -59106 -61637 9175 24361 -15443 -12206 33142 27663 32907 50944 17593
13890 17593 19513 27610 2747 -2604 -1560 -7456 -13651 -14357 -46755 -78032 -63879 -39001 -17931
13877 -17931 -13220 -32342 -40074 -54132 -53880 -69943 -82750 -45053 -47616 -28993 -80773 -107989 -111915
13864 -111915 -114412 -88666 -35806 -53085 -37369 281 -2051 -29192 -50897 -33923 -28322 -14828
13852 -14828 -2922 -12758 -40941 -62400 -67285 -75003 -64717 12271 30270 -15447 -24635 -14327
$$ packed form
13939a49843L3716k9777J5159L3243J008K0233K0417N7236k737J8383M4299R099
13927G0436J4678j824L583k4004M950j9973l2399J6564P883L280j7120P935K5615
13914E9604J7689k1018l8181n844j9234m2987L2680O2486L3509J1005K886o2419
13902C0176n1287l7995k531P0812J5186l9804L237M5348n479N244J8037l3351
13890A7593J920Q097k4863n351J044n896o195p06l2398l1277J4153K4878K1070
13877a7931M711j9122p732j4058K52j6063j2807L7697k563J8623n1780k7216l926
13864a11915k497K5746N2860j7279J5716L7650k332k7141k1705J6974N601J3494
13852a4828J1906r836k8183k1459m885p718J0286P6988J7999m5717r188J0308
$$ plain form
13840 -14327 -73357 -106107 -72412 -32823 -35181 -49839 -27154 10354 -14688 23316 70139 20732
13828 20732 -27136 -60886 -74870 -16729 722 -7373 25955 61583 -20985 -67076 -64606 -71577
13816 -71577 -80078 -54112 -16289 31172 -19031 -49829 -19774 38243 68718 -9509 -63817 -52697
13804 -52697 -18441 -4858 -23381 -4511 2733 28222 7924 -9924 -3231 34259 -9090 7834
13792 7834 47493 77639 94414 59883 61267 53254 -2164 3382 88491 32740 9965 75199
13780 75199 81446 75742 79510 88650 76382 91738 157847 161886 190560 247783 249727 263555 296985
13767 296985 357779 360896 338972 381359 456534 621633 785818 944256 1118695 1360365 1674583
13756 1674583 1903864 2150520 2362891 2437904 2420284 2293360 2077087 1842982 1598859 1300135
$$ packed form
13840a4327n9030l2750L3695L9589k358j4658K2685L7508k5042L8004M6823m9407
13828B0732m7868l3750j3984N8141J7451q095L3328L5628q2568m6091K470o971
13816g1577q501K5966L7823M7461n0203l0798L0055N8017L0475p8227n4308J1120
13804e2697L4256J3583j8523J8870P244K5489k0298j7848O693L7490m3349J6924
13792G834L9659L0146J6775l4531J384q013n5418N546Q5109n5751k2775O5234
13780G5199O247n704L768R140j2268J5356O6109M039K8674N7223J944J3828L3430
13767B96985O0794L117k1924M2387P5175J65099J64185J58438J74439K41670L14218
13756A674583K29281K46656K12371P5013j7620j26924k16273k34105k44123k98724
$$ plain form
13746 1300135 1037065 855426 723949 565684 480626 386790 311484 307410 292246 272612 253804
13735 253804 250914 258489 249710 240848 251732 198773 167088 160352 179282 246365 232527 203469
13723 203469 165430 155539 135773 118130 132560 146775 134794 96538 81854 110574 119246 103003
13711 103003 110318 99445 96295 124922 116866 93217 140518 190210 188151 136792 51272 -11353
13699 -11353 7467 33844 63213 25952 -4968 36972 27312 10766 7053 26098 47414 51240
13687 51240 17969 9970 23856 40756 68965 56295 -24613 -91084 -108543 -91829 -80723 -61928
13675 -61928 -17381 5478 -10372 6580 51434 36336 28336 31289 -4567 -21570 -52913 -64187
13663 -64187 -22175 -15539 -10228 21333 46876 11666 6477 -6248 -8273 35726 39145 16063 54371
$$ packed form
13746A300135k63070j81639j31477j58265q5058r3836p5306m074j5164j9634j8808
13735B53804k890P575q779q862J0884n2959l1685o736J8930O7083j3838k9058
13723B03469l8039r891j9766j7643J4430J4215j1981l8256j4684K8720Q672j6243
13711A03003P315j0873l150K8627q056k3649M7301M9692k059n1359q5520o2625
13699a1353J8820K6377K9369l7261l0920M1940r660j6546l713J9045K1316L826
13687E1240l3271p999J3886J6900K8209j2670q0908o6471j7459J6714J1106J8795
13675f1928M4547K2859j5850J6952M4854j5098q000K953l5856j7003l1343j1274
13663f4187M2012O636N311L1561K5543l5210n189j2725k025M3999L419k3082L8308
$$ plain form
13650 54371 106325 171376 181357 138650 127257 87612 93928 104153 61483 18633 29565 6512
13638 6512 -16905 -12244 -26438 -16228 -23380 -48985 -79813 -17779 12067 1674 -23275 -47237
13626 -47237 -63824 -51285 -983 -3093 -15154 -245 -709 -2494 -14816 728 1819 33810 77280
13613 77280 73050 20158 -274 -65283 -57814 -32650 -7342 -13234 -3778 5214 -3852 5419 -3514
13600 -3514 25841 31883 19915 3512 11861 45257 55503 5687 5746 15684 -1256 -17361 -21321
13587 -21321 -38799 -89182 -105735 -98583 -90441 -75306 -49812 -33465 -17306 -4177 10516 11212
13575 11212 -33170 -84756 -77893 -73479 -84339 -39264 -6268 -15907 30056 33063 19629 20648 -23735
13562 -23735 3430 95 -12075 -3619 -20602 -23724 -41232 -73507 -88030 -6425 74427 85215
$$ packed form
13650E4371N1954O5051R981m2707j1393l9645O316J0225m2670m2850J0932k3053
13638F512k3417M661j4194J0210p152k5605l0828O2034K9846j0393k4949k3962
13626d7237j6587J2539N0302k110j2061J4909m64j785j2322J5544J091L1991M3470
13613G7280m230n2892k0432o5009P469K5164K5308n892R456Q992r066R271q933
13600c514K9355O042j1968j6403Q349L3396J0246m9816N9R938j6940j6105l960
13587b1321j7478n0383j6553P152Q142J5135K5494J6347J6159J3129J4693O96
13575A1212m4382n1586O863M414j0860M5075L2996r639M5963L007j3434J019m4383
13562b3735K7165l335j2170Q456j6983l122j7508l2275j4523Q1605Q0852J0788
$$ plain form
13550 85215 65715 67603 43142 6849 7001 19893 56065 3998 -3531 -5314 -19166 -52102 -49660
13537 -49660 -37924 21670 60623 64854 16903 33973 -14671 -36600 -34382 23353 46231 12390
13525 12390 -5341 -30503 -38198 -35045 2212 -23767 -8860 -19560 -16220 -45970 -72938 -40607
13513 -40607 11962 995 -41208 -18361 23599 39146 -2319 -12578 -11783 -21607 -3554 -27323
13501 -27323 -12784 38559 46083 27036 19522 -5588 -34630 -40504 -38558 -9414 51665 9093
13489 9093 -53762 -48839 -11088 -42443 -34332 8874 45905 -4718 -24376 3484 2343 -20967
13477 -20967 -14683 -6247 -42032 -23992 -12394 -14574 -34336 -21574 -11516 41559 37697 -11880
13465 -11880 -17751 27843 12716 26639 -2882 24193 30723 25808 18330 2854 -10482 12662
$$ packed form
13550H5215j9500J888k4461l6293J52J2892L6172n2067p529j783j3852l2936K442
13537d9660J1736N9594L8953M231m7951J7070m8644k1929K218N7735K2878l3841
13525A2390j7731k5162p695L153L7257k5979J4907j0700L340k9750k6968L2331
13513d0607N2569j0967m2203K2847M1960J5547m1465j0259P95r824J8053k3769
13501b7323J4539N1343P524j9047p514k5110k9042n874J946K9144O1079m2572
13489I093o2855M923L7751l1355Q111M3206L7031n0623j9658K7860j141k3310
13477b0967O284Q436l5785J8040J1598k180j9762J2762J0058N3075l862m9577
13465a1880n871M5594j5127J3923k9521K7075O530m915p478j5476j3336K3144
$$ plain form
13453 12662 4511 -14175 557 12973 -10058 -8925 -7638 -6840 24702 15860 -14118 22311 52690
13440 52690 7094 -19734 -32838 -23974 -1297 14554 24990 7556 13085 56246 73845 97456
13428 97456 81982 84703 47375 32543 19567 -17299 -45619 -27937 13695 19059 14075 24874
13416 24874 42425 37128 2777 -17117 -22531 628 -24037 36282 66234 52309 56309 35335
13404 35335 44498 40792 -17946 -44018 -11533 -3639 -25679 -11529 31295 47774 56224 129681
13392 129681 130207 74886 36255 18460 32514 -1530 -66796 -27950 -40467 -48519 -10897 -8940
13380 -8940 19612 43195 26999 -27639 -83215 -93520 -19244 29408 20451 5997 73739 70580
13368 70580 -5138 -37813 -46047 -14748 6383 26802 55554 22996 6710 -60721 -67009 -13083
$$ packed form
13453A2662q151j8686J4732J2416k3031J133J287P98L1542q842k9978L6429L0379
13440E2690m5596k6828j3104Q864K2677J5851J0436j7434N529M3161J7599K3611
13428I7456j5474K721l7328j4832j2976l6866k8320J7682M1632N364m984J0799
13416B4874J7551n297l4351j9894n414K3159k4665O0319K9952j3925M000k0974
13404C5335R163l706n8738k6072L2485P894k2040J4150M2824J6479Q450P3457
13392A29681N26n5321l8631j7795J4054l4044o5266L8846j2517q052L7622J957
13380h940K8552K3583j6196n4638n5576j0305P4276M8652q957j4454O7742l159
13368G0580p5718l2675q234L1299K1131K0419K8752l2558j6286o7431o288N3926
$$ plain form
13356 -13083 40118 56326 35874 37419 59765 42509 46108 26714 39976 67385 86062 91357
13344 91357 118548 164014 114382 72069 102076 97793 50311 53905 79578 50018 859 37771
13332 37771 47321 47745 74977 57907 24293 5002 11726 31749 24339 14858 45560 65180 22310
13319 22310 19498 40610 77783 47126 34684 61393 78617 48670 100401 101430 79434 52284
13307 52284 72909 48578 -641 -32195 41208 104395 125636 133030 64784 40902 53491 86135
13295 86135 89338 84851 61293 -1111 -42614 -10835 111 -47239 -58213 -22561 -49859 -12838
13283 -12838 -5409 -4984 -5250 -20643 7642 73166 108531 64187 40674 31683 22567 22584 21091 -36043
13269 -36043 -54823 -36905 51960 80594 106184 67568 91115 71408 50919 51707 67648 55328
$$ packed form
13356a3083N3201J6208k0452J545K2346j7256L599j9394J3262K7409J8677N295
13344I1357K7191M5466m9632m2313L0007m283m7482L594K5673k9560m9159L6912
13332C7771R550M24K7232j7070l3614j9291O724K0023p410r481L0702J9620m2870
13319B2310k812K1112L7173l0657j2442K6709J7224k9947N1731J029k1996k7150
13307E2284K0625k4331m9219l1554P3403O3187K1241P394o8246k3882J2589L2644
13295H6135L203m487k3558o2404m1503L1779J0946m7350j0974L5652k7298L7021
13283a2838P429M25k66j5393K8285O5524L5365m4344k3513q991r116J7j493n7134
13269c6043j8780J7918Q8865K8634K5590l8616K3547j9707k0489P88J5941j2320
$$ plain form
13257 55328 69072 108070 105484 76533 98458 100421 73213 71619 46974 49703 79518 44858
13245 44858 -14208 17589 43979 52081 52487 48821 34650 68719 93107 77489 30711 6196
13233 6196 16114 80921 79250 67516 98509 68180 2796 -18746 35946 71440 42426 42841 124608
13220 124608 126238 101356 118322 107421 91744 106034 68773 43627 89871 105819 83734 89425
13208 89425 99598 92980 82472 22335 20313 38236 19609 19367 54712 86852 108442 110493 95614
13195 95614 71509 37357 20563 -6231 32469 94292 84827 90475 141139 157660 173234 226105
13183 226105 219959 181373 199270 182656 196454 196451 213762 221245 209741 155726 120070 74683 100200
13170 100200 132807 165125 118205 112384 89066 98203 130042 138564 76664 37090 66199 119236
$$ packed form
13257E5328J3744L8998k586k8951K1925J963k7208j594k4645K729K9815l4660
13245D4858n9066L1797K6390Q102M06l666j4171L4069K4388j5618m6778k4515
13233F196R918O4807j671j1734L0993l0329o5384k1542N4692L5494k9014M15Q1767
13220A24608J630k4882J6966j0901j5677J4290l7261k5146M6244J5948k2085N691
13208H9425J0173o618j0508o0137k022J7923j8627k42L5345L2140K1590K051j4879
13195I5614k4105l4152j6794k6794L8700O1823r465N648N0664J6521J5574N2871
13183B26105o146l8586J7897j6614J3798lJ7311P483j1504n4015l5656m5387K5517
13170A00200L2607L2318m6920n821k3318R137L1839Q522o1900l9574K9109N3037
$$ plain form
13158 119236 94940 84066 94906 63068 31771 19070 21471 -1234 -6384 23712 71631 48368
13146 48368 28600 85362 82174 94770 112151 46516 22946 79972 105503 114739 107574 103826
13134 103826 134928 140915 102297 79427 138411 131956 67357 65512 114763 107801 65129 66478
13122 66478 40318 42138 68361 73841 97705 83487 75539 67241 89498 62029 23138 51550
13110 51550 68030 51895 10982 21483 107178 221017 247924 231710 192571 158538 160345 139834
13098 139834 81389 49381 19088 7255 -25340 18564 47164 79322 123597 109779 63882
13087 63882 26361 41753 42177 99988 118108 94371 105498 145688 161640 179370 188854 171393
13075 171393 108992 70095 26290 28070 37143 22141 25875 73163 82549 150838 230406 236467
$$ packed form
13158A19236k4296j0874J0840l1838l1297j2701K401k2705n150L0096M7919k3263
13146D8368j9768N6762l188J2596J7381o5635k3570N7026K5531R236p165l748
13134A03826L1102N987l8618k2870N8984o455o4599j845M9251o962m2672J349
13122F6478k6160J820K6223N480K3864j4218p948q298K2257k7469l8891K8412
13110E1550J6480j6135m0913J0501Q5695J13839K6907j6214l9139l4033J807k0511
13098A39834n8445l2008l0293j1833l2595M3904K8600L2158M4275j3818m5897
13087F3882l7521J5392M24N7811J8120k3737J1127M0190J5952J7730R484j7461
13075A71393o2401l8897m3805J780R073j5002L734M7288R386O8289P9568O061
$$ plain form
13063 236467 187962 162015 167367 151499 107426 124706 174420 171968 182027 163191 109162 80663
13051 80663 104309 109872 110130 168790 214136 152209 116881 129113 142707 139874 152444 132332
13039 132332 115206 123498 64793 49880 74041 103931 172651 188509 211276 204276 203964 188052
13027 188052 169208 161045 164155 146763 198274 233577 220395 182670 171840 193582 190412 252874
13015 252874 264533 214775 158628 179304 179445 111492 85941 72750 64509 72656 136282 199520
13003 199520 194067 125248 124422 151276 125630 104285 56161 51197 48904 41472 104842 138077 176523
12990 176523 184629 146714 130865 154428 157863 142833 133218 71489 93777 97841 64392 96547
12978 96547 115390 110084 79141 79950 82009 46990 -12373 2016 44889 54848 42072 40392 81841
$$ packed form
13063B36467m8505k5947N352j5868m4073J7280M9714k452J0059j8836n4029k8499
13051H0663K3646N563K58N8660M5346o1927l5328J2232J3594k833J2570k0112
13039A32332j7126Q292n8705j4913K4161K9890O8720J5858K2767p000l12j5912
13027A88052j8844q163L110j7392N1511L5303j3182l7725j0830K1742l170O2462
13015B52874J1659m9758n6147K0676J41o7953k5551j3191q241Q147O3626O3238
13003A99520n453o8819q26K6854k5646k1345m8124m964k293p432O3370L3235L8446
12990A76523Q106l7915j5849K3563L435j5030r615o1729K2288M064l3449L2155
12978I6547J8843n306l0943Q09K059l5019n9363J4389M2873R959j2776j680M1449
$$ plain form
12965 81841 102700 132801 143640 85094 16263 13353 46048 99552 124964 174234 210434 217662
12953 217662 155929 97964 67781 140158 204660 208881 154723 128170 155621 193552 217928 214194
12941 214194 207659 235148 230358 195683 160626 134624 123285 143482 131480 119869 107107 125881
12929 125881 154019 158739 169689 226433 266728 203960 157898 196133 146077 120713 148406 170013
12917 170013 188210 176889 156023 178818 229906 200966 165448 156624 130307 173023 192028 170270
12905 170270 188810 220814 214506 177125 194941 207918 202245 197243 124138 70684 91025 110104
12893 110104 80967 77291 92535 117750 163999 152998 120081 122676 144066 163980 184025 177409
12881 177409 142059 108837 94834 94305 103240 122187 137291 137994 136704 127445 120491 110651 103668
$$ packed form
12965H1841K0859L0101J0839n8546o8831k910L2695N3504K5412M9270L6200P228
12953B17662o1733n7965l0183P2377O4502M221n4158k6553K7451L7931K4376l734
12941B14194o535K7489m790l4675l5057k6002j1339K0197j2002j1611j2762J8774
12929A25881K8138M720J0950N6744M0295o2768m6062L8235n0056k5364K7693K1607
12917A70013J8197j1321k0866K2795N1088k8940l5518q824k6317M2716J9005k1758
12905A70270J8540L2004o308l7381J7816J2977n673n002p3105n3454K0341J9079
12893A10104k9137l676J5244K5215M6249j1001l2917K595K1390J9914K0045o616
12881A77409l5350l3222j4003n29Q935J8947J5104P03j290r259o954r840o983
$$ plain form
12868 103668 104374 117743 150255 153275 167289 185816 176438 166587 134533 100251 71481 106716
12856 106716 145089 156196 194252 192061 196086 179777 162603 150297 146796 137335 105984 82483
12844 82483 138596 143316 109038 109473 95481 112461 126547 123523 178297 208647 222113 212185 221462
12831 221462 252926 253054 203375 153144 167721 184619 162820 171004 197308 185877 143831 130541
12819 130541 140401 167898 152700 181803 196321 151867 78910 108658 168138 183450 166385 158371
12807 158371 126532 103654 115907 126014 150698 185298 261917 282070 258296 237691 210867
12796 210867 203366 217496 145055 86362 96525 118250 159956 136742 105854 173651 200590 203293
12784 203293 196112 182547 147271 155383 136248 131657 121680 133037 178336 163100 205531 234179
$$ packed form
12868A03668P06J3369L2512L020J4014J8527r378r851l2054l4282k8770L5235
12856A06716L8373J1107L8056k191M025j6309j7174j2306l501r461l1351k3501
12844H2483N6113M720l4278M35j3992J6980J4086l024N4774L0350J3466r928R277
12831B21462L1464J28m9679n0231J4577J6898k1799Q184K6304j1431m2046j3290
12819A30541R860K7497j5198K9103J4518m4454p2957K9748N9480J5312j7065q014
12807A58371l1839k2878J2253J0107K4684L4600P6619K0153k3774k0605k6824
12796B10867p501J4130p2441n8693J0163K1725M1706k3214l0888O7797K6939K703
12784B03293p181j3565l5276Q112j9135m591r977J1357M5299j5236M2431K8648
$$ plain form
12772 234179 233129 218368 228390 207596 136203 100636 127210 157873 166594 183008 212960 233114
12760 233114 240226 220292 210538 211000 181890 213086 207511 230094 252155 240182 256487 275447
12748 275447 274585 221678 229964 229698 189903 200804 173734 168310 123509 93818 71076 76063 92632
12735 92632 144233 223076 226762 180304 149267 153678 132404 138419 165634 194597 241876 244030
12723 244030 286131 280073 255891 203099 167055 173038 156760 152469 148101 138324 93862 65425
12711 65425 117243 162804 186533 180397 229805 174078 127427 168068 192965 190965 181019 152575
12699 152575 145294 213833 213847 165688 138445 140180 135058 98715 145495 194304 195764 221636 250541
12686 250541 237266 179336 179780 203898 208658 231508 245560 214449 168287 182471 192904 228787
$$ packed form
12772B34179j050j4761J0022k0794p1393l5567K6574L0663Q721J6414K9952K0154
12760B33114P112j9934r754M62k9110L1196n575K2583K2061j1973J6305J8960
12748B75447q62n2907Q286k66l9795J0901k7070n424m4801k9691k2742M987J6569
12735I2632N1601P8843L686m6458l1037M411k1274O015K7215K8963M7279K154
12723B44030M2101o058k4182n2792l6044N983j6278m291m368r777m4462k8437
12711F5425N1818M5561K3729o136M9408n5727m6651M0641K4897k000r946k8444
12699A52575p281O8539J4m8159k7243J735n122l6343M6780M8809J460K5872K8905
12686B50541j3275n7930M44K4118M760K2850J4052l1111m6162J4184J0433L5883
$$ plain form
12674 228787 268625 258894 193989 135875 140626 176640 200443 217792 248340 288346 311273 258006
12662 258006 231837 205430 186712 170853 173859 183174 226209 242557 231335 189904 192573 214726
12650 214726 247186 257444 242408 255983 246938 261572 263964 232425 200117 220341 232993 214243
12638 214243 183466 110628 132838 175541 147376 117199 119896 175920 208923 188277 148992 138262
12626 138262 124236 114215 182935 233330 275262 284786 280531 238908 196576 203545 193168 278112
12614 278112 283266 263588 233009 288890 289382 280381 269344 271614 199317 181279 235735 280846
12602 280846 269660 284228 285836 210519 202148 201071 181764 162551 158420 154687 149554 146076 178993
12589 178993 181110 177198 240487 213947 175365 160210 165034 225260 235204 246624 279288 235951
$$ packed form
12674B28787L9838r731o4905n8114M751L6014K3803J7349L0548M0006K2927n3267
12662B58006k6169k6407j8718j5859L006R315M3035J6348j1222m1431K669K2153
12650B14726L2460J0258j5036J3575r045J4634K392l1539l2308K0224J2652j8750
12638B14243l0777p2838K2210M2703k8165l0177K697N6024L3003k0646l9285j0730
12626A38262j4026j0021O8720N0395M1932R524m255m1623m2332O969j0377Q4944
12614B78112N154j9678l0579N5881M92r001j1037K270p2297j8038N4456M5111
12602B80846j1186J4568J608p5317q371j077j9307j9213m131l733n133l478L2917
12589A78993K117l912O3289k6540l8582j5155M824O0226R944J1420L2664m3337
$$ plain form
12577 235951 231654 231604 258848 279490 292467 329376 355706 306043 267473 265938 261128 269905 239449
12564 239449 196751 191125 167781 195342 258018 317490 309349 299724 301886 317245 278116 281438
12552 281438 287971 278662 322573 336749 333512 328115 295044 245706 279130 334612 362120 329623
12540 329623 289519 276978 272194 255833 296674 311084 243605 226105 270405 303035 303878 328533
12528 328533 346183 318804 271499 303422 300768 312329 241198 201404 227876 238613 270744 253951
12516 253951 219968 212164 251268 243365 258914 318800 315513 315782 338580 332319 347667 331023 289062
12503 289062 261723 268496 333388 350534 287262 273988 273100 279261 289617 313822 321664 311973 333055
12490 333055 335774 329842 292855 249076 228120 230430 258882 292553 254124 272799 315037 295432
$$ packed form
12577B35951m297n0K7244K0642J2977L6909K6330m9663l8570j535m810Q777l0456
12564B39449m2698n626k3344K7561O2676N9472q141r625K162J5359l9129L322
12552B81438O533r309M3911J4176l237n397l3071m9338L3424N5482K7508l2497
12540C29623m0104j2541m784j6361M0841J4410o7479j7500M4300L2630Q43K4655
12528C28533J7650k7379m7305L1923k654J1561p1131l9794K6472J0737L2131j6793
12516B53951l3983p804L9104p903J5549N9886l287K69K2798o261J5348j6644m1961
12503B89062k7339O773O4892J7146o3272j3274q88O161J0356K4205P842r691K1082
12490C33055K719n932l6987m3779k0956K310K8452L3671l8429J8675M2238j9605
$$ plain form
12478 295432 297484 274315 273857 281182 269084 287108 278640 283846 301883 308929 347172 329215 305910
12465 305910 273999 284643 297116 281692 282782 303789 259690 227912 260940 299417 246374 257787
12453 257787 310679 366836 366635 343797 344091 318131 314525 302207 342052 370885 391369 389948 377307
12440 377307 337765 293604 331970 338380 295882 302420 316886 282964 304150 325200 298323 305714
12428 305714 322768 288129 289481 338260 300856 327252 354390 325520 324631 312054 299928 278309
12416 278309 295021 290246 292350 310407 301115 277788 279511 325544 332403 294461 248914 304729
12404 304729 349593 358825 379354 385493 380506 368400 360211 364892 362118 387189 394586 400172 389605
12391 389605 392295 385761 369980 356385 353596 350021 367349 378451 372751 383225 392110 395112 383829
$$ packed form
12478B95432K052k3169m58P325j2098J8024q468N206J8037P046L8243j7957k3305
12465C05910l1911J0644J2473j5424J090K1007m4099l1778L3028L8477n3043J1413
12453B57787N2892N6157k01k2838K94k5960l606j2318L9845K8833K0484j421j2641
12440C77307l9542m4161L8366O410m2498O538J4466l3922K1186K1050k6877P391
12428C05714J7054l4639J352M8779l7404K6396K7138k8870q89j2577j2126k1619
12416B78309J6712m775K104J8057r292k3327J723M6033O859l7942m5547N5815
12404C04729M4864R232K0529O139m987j2106q189M681k774K5071P397N586j0567
12391C89605K690o534j5781j3595k789l575J7328J1102n700J0474Q885L002j1283
$$ plain form
12378 383829 406920 402851 355054 347366 414699 438752 408829 397838 421729 384812 339027 345874
12366 345874 395477 388016 390252 407578 446107 429496 390759 351417 349350 363757 391413 423692
12354 423692 358909 340105 354023 336058 338857 356781 335344 315883 307342 313327 323052 302292
12342 302292 366278 378039 392563 394330 375235 410240 424989 405642 381473 383864 388097 370402
12330 370402 358544 320607 347417 353744 342688 392568 390508 355737 372271 405761 429500 433706
12318 433706 421468 384269 312605 339832 375414 382999 401018 412287 415084 412618 394511 340266
12306 340266 341421 347620 316250 314562 261537 236732 273485 299117 272143 266252 278682 314482
12294 314482 403623 481382 459626 376817 338650 312939 324638 322051 330119 332436 334688 348283
$$ packed form
12378C83829K3091m069m7797p688O7333K4053k9923j0991K3891l6917m5785O847
12366C45874M9603p461K236J7326L8529j6611l8737l9342k067J4407K7656L2279
12354D23692o4783j8804J3918j7965K799J7924k1437j9461q541N985R725k0760
12342C02292O3986J1761J4524J767j9095L5005J4749j9347k4169K391M233j7695
12330C70402j1858l7937K6810O327j1056M9880k060l4771J6534L3490K3739M206
12318D33706j2238l7199p1664K7227L5582P585J8019J1269K797k466j8107n4245
12306C40266J155O199l1370j688n3025k4805L6753K5632k6974n891J2430L5800
12294C14482Q9141P7759k1756q2809l8167k5711J1699k587Q068K317K252J3595
$$ plain form
12282 348283 363450 380021 320144 306448 301101 290419 351044 372649 336781 286062 245632 250689
12270 250689 232984 271306 294127 329868 370613 379550 367192 385795 360410 343707 334122 327272
12258 327272 356245 376962 376464 337381 288061 344754 339763 310652 300152 315500 362701 379969
12246 379969 389117 415616 435607 367508 366282 340061 320935 316381 323996 339888 370414 334841
12234 334841 313587 340262 345773 341720 370367 380886 302785 308308 368322 405227 399548 376668
12222 376668 352504 327558 308160 311427 267116 289423 265556 244224 238832 241850 252088 266664
12210 266664 341400 360342 349461 331682 303945 248394 229993 229063 270220 331418 345760 338472
12198 338472 343498 322426 316940 306972 368144 354225 325618 308410 267273 309856 337790 345138
$$ packed form
12282C48283J5167J6571n9877j3696n347j0682O0625K1605l5868n0719m0430N057
12270B50689j7705L8322K2821L5741M0745Q937j2358J8603k5385j6703r585o850
12258C27272K8973K0717m98l9083m9320N6693m991k9111j0500J5348M7201J7268
12246C79969R148K6499J9991o8099j226k6221j9126m554P615J5892L0526l5573
12234C34841k1254K6675N511m053K8647J0519p8101N523O0014L6905n679k2880
12222C76668k4164k4946j9398L267m4311K2307k3867k1332n392L018J0238J4576
12210B66664P4736J8942j0881j7779k7737n5551j8401r30M1157O1198J4342p288
12198C38472N026k1072n486r968O1172j3919k8607j7208m1137M2583K7934P348
$$ plain form
12186 345138 357477 338634 340172 417644 405071 359814 341556 339664 383756 363325 336032 339583
12174 339583 347148 335728 320042 300321 311388 284268 315039 337223 330814 338697 305812 321574
12162 321574 384625 357603 322092 283859 264411 306501 278336 234127 267256 274544 320677 343547
12150 343547 340476 330153 292506 236394 249053 282994 295531 314843 315480 317383 308493 317250 364665
12137 364665 395976 411131 404511 378261 278060 262185 234862 232563 254261 285631 296368 343828
12125 343828 377973 333131 246874 263774 258557 217723 263168 280264 303045 289382 273169 284990
12113 284990 297612 316360 297767 281482 290489 287449 318520 336802 311591 288198 254744 263568
12101 263568 293859 305951 310001 286504 263876 262414 347030 351195 301684 349330 380106 459709
$$ packed form
12186C45138J2339j8843J538P7472j2573m5257j8258j892M4092k0431k7293L551
12174C39583P565j1420j5686j9721J1067k7120L0771K2184o409P883l2885J5762
12162C21574O3051k7022l5511l8233j9448M2090k8165m4209L3129P288M6133K2870
12150C43547l071j0323l7647n6112J2659L3941J2537J9312O37J903q890Q757M7415
12137C64665L1311J5155o620k6250j00201j5875k7323k299K1698L1370J0737M7460
12125C43828L4145m4842q6257J6900n217m0834M5445J7096K2781j3663j6213J1821
12113B84990J2622J8748j8593j6285R007l040L1071J8282k5211k3393l3454Q824
12101B63568L0291J2092M050k3497k2628j462Q4616M165m9511M7646L0776P9603
$$ plain form
12089 459709 439145 440592 474609 417883 326295 320541 342442 349114 330745 348915 312571 320635
12077 320635 315018 314403 302410 236770 216743 240727 275254 306587 299004 272303 232352 233369
12065 233369 223539 238157 225892 243377 247197 284191 289518 239397 218919 239363 247395 287123
12053 287123 257703 205938 184539 181941 201565 250281 291995 325977 318405 294127 357954 361617
12041 361617 333665 327635 315551 304093 308285 314187 325519 278132 317116 293630 298719 293498
12029 293498 304089 292892 230390 274608 328938 315136 271077 200915 186473 242442 241568 231813
12017 231813 248295 288145 338340 328859 339522 350265 356722 334745 284649 244419 251639 260526
12005 260526 254727 313898 337529 332362 347138 340350 328219 277725 272200 288079 279637 277132 340278
$$ packed form
12089D59709k0564J447L4017n6726r1588n754K1901O672j8369J8170l6344Q064
12077C20635n617o15j1993o5640k0027K3984L4527L1333p583k6701l9951J017
12065B33369r830J4618j2265J7485L820L6994N327n0121k0478K0444Q032L9728
12053B87123k9420n1765k1399k598J9624M8716M1714L3982p572k4278O3827L663
12041C61617k7952o030j2084j1458M192N902J1332m7387L8984k3486N089n221
12029B93498J0591j1197o2502M4218N4330j3802m4059p0162j4442N5969q74r755
12017B31813J6482L9850N0195r481J0663J0743O457k1977n0096m0230P220Q887
12005B60526n799N9171K3631n167J4776o788j2131n0494n525J5879q442k505O3146
$$ plain form
11992 340278 351271 346249 334651 267376 273145 330003 340136 398118 394233 372941 350482 275263
11980 275263 250867 244319 203611 224192 259459 281705 310442 333173 335634 282545 310569 329729
11968 329729 383703 368266 371255 406568 473164 520388 554401 600145 574928 530888 512615 536293
11956 536293 450551 346478 322195 375670 352965 267538 275839 281161 274694 347922 391164 370797
11944 370797 345136 303465 328580 271238 238767 233986 267903 289210 293343 276848 278276 292880
11932 292880 323349 317661 344603 354679 373164 358929 370576 436541 517659 632501 722713
11921 722713 814982 921672 997442 950403 835961 706542 574692 498918 467495 434439 394891
11910 394891 363186 321039 340894 356365 336735 317011 341038 362490 358232 363543 367233 318276
$$ packed form
11992C40278J0993n022j1598o7275N769N6858J0133N7982l885k1292k2459p5219
11980B75263k4396o548m0708K0581L5267K2246K8737K2731K461n3089K8024J9160
11968C29729N3974j5437K989L5313O6596M7224L4013M5744k5217m4040j8273K3678
11956E36293q5742j04073k4283N3475k2705q5427Q301N322o467P3228M3242k0367
11944C70797k5661m1671K5115n7342l2471m781L3917K1307M133j6495J428J4604
11932B92880L0469n688K6942J0076J8485j4235J1647O5965Q1118J14842R0212
11921G22713R2269J06690P5770m7039j14442j29419j31850p5774l1423l3056l9548
11910C94891l1705m2147J9855J5471j9630j9724K4027K1452m258N311L690m8957
$$ plain form
11898 318276 279445 279713 269461 263135 238403 271686 292697 289881 274901 296757 310944 302548
11886 302548 295362 296280 306786 344040 388912 423718 486231 612306 665498 644257 585992 514568
11874 514568 396149 310628 267828 248942 195169 152449 144059 124514 103348 140769 167658
11863 167658 154543 169803 182363 162724 146358 169170 173124 188606 191436 181671 232621 202119
11851 202119 189411 253017 253292 193694 190665 195603 268197 238677 226374 217874 175623 176547 213983
11838 213983 217407 182275 173504 182608 200760 203921 238085 219780 146930 171434 201290 182363
11826 182363 177212 147254 165040 219605 253023 184444 177602 149001 115692 102326 125776 178911
11814 178911 189189 180947 190889 222793 276838 302951 292493 274957 257436 252376 237733 236937
$$ packed form
11898C18276l8831K68j0252o326k4732L3283K1011k816j4980K1856J4187q396
11886C02548p186R18J0506L7254M4872L4806O2513J26075N3192k1241n8265p1424
11874E14568j18419q5521m2800j8886n3773m2720q390j9545k1166L7421K6889
11863A67658j3115J5260J2560j9639j6366K2812L954J5482K830r765N0950l0502
11851B02119j2708O3606K75n9598l029M938P2594k9520j2303q500m2251R24L7436
11838B13983L424l5132q771R104J8152L161L4164j8305p2850K4504K9856j8927
11826A82363n151k9958J7786N4565L3418o8579o842k8601l3309j3366K3450N3135
11814A78911J0278q242R942L1904N4045K6113j0458j7536j7521n060j4643p96
$$ plain form
11802 236937 215886 180646 175191 203841 251117 209221 138326 144403 196687 199097 177316 181363
11790 181363 197364 189014 203817 201701 137997 162303 176251 172377 205897 189191 185216 210352
11778 210352 232855 283770 282869 258106 259330 262480 243429 247371 255597 259402 252367 262923 284229
11765 284229 288575 313788 335002 353933 262198 147067 132841 170629 180247 184827 205995 164339
11753 164339 132769 151682 167218 178148 171192 174828 151781 109900 136979 101981 72670 84399
11741 84399 105968 124141 143233 154960 172060 153119 147953 153763 204311 206569 149273 165190
11729 165190 173016 172437 183756 169744 133930 127131 146515 153064 211843 249365 261125 225756
11717 225756 194106 199195 233568 216166 192591 188102 179614 184277 213603 231958 188581 173543
$$ packed form
11802B36937k1051l5240n455K8650M7276m1896p0895O077N2284K410k1781M047
11790A81363J6001q350J4803k116o3704K4306J3948l874L3520j6706l975K5136
11778B10352K2503N0915r01k4763J224L150j9051L942Q226L805p035J0556K1306
11765B84229M346K5213K1214J8931r1735j15131j4226L7788R618M580K1168m1656
11753A64339l1570J8913J5536J0930o956L636k3047m1881K7079l4998k9311J1729
11741H4399K1569J8173J9092J1727J7100j8941n166N810N0548K258n7296J5917
11729A65190P826n79J1319j4012l5814o799J9384O549N8779L7522J1760l5369
11717B25756l1650N089L4373j7402k3575m489q488M663K9326J8355m3377j5038
$$ plain form
11705 173543 205863 225670 186411 191137 251977 291704 299463 300405 253748 255621 287659 289634 224134
11692 224134 196147 170697 165354 202576 255593 221724 180059 147545 98745 126744 208275 230396
11680 230396 183713 122159 115044 139092 172887 193596 175577 190612 141862 128704 114215 115354
11668 115354 108131 126754 115920 139966 143343 188858 189559 154171 111096 102562 113400 156262
11656 156262 173620 184429 148764 107305 94972 180607 252271 251861 250625 226911 176480 155891
11644 155891 155124 216501 207935 194747 125962 129001 161532 195857 265003 228818 176520 165926
11632 165926 177434 212715 205075 208387 167194 147598 148313 165531 165493 154455 151980 142018 124233
11619 124233 119725 129925 142171 104784 112527 126949 95060 78356 109665 127170 122037 112737
$$ packed form
11705A73543L2320J9807l9259M726O0840L9727P759R42m6657J873L2038J975o5500
11692B24134k7987k5450n343L7222N3017l3869m1665l2514m8800K7999Q1531K2121
11680B30396m6683o1554p115K4048L3795K0709j8019J5035m8750j3158j4489J139
11668A15354p223J8623j0834K4046L377M5515P01l5388m3075q534J0838M2862
11656A56262J7358J0809l5665m1459j2333Q5635P1664m10j236k3714n0431k0589
11644A55891p67O1377q566j3188o8785L039L2531L4325O9146l6185n2298j0594
11632A65926J1508L5281p640L312m1193j9596P15J7218l8j1038k475r962j7785
11619A24233m508J0200J2246l7387P743J4422l1889j6704L1309J7505n133r300
$$ plain form
11607 112737 114859 137630 153634 127628 158343 167383 193119 197441 171818 167913 190137 123906
11595 123906 98494 127048 133010 139222 179846 200750 213080 165144 130921 144008 171116 157424
11583 157424 170596 186105 176568 114322 104922 140683 183253 174020 172442 170623 177393 158515 140116
11570 140116 121731 132202 137730 124584 85926 104502 157634 168188 136082 108074 91553 79964
11558 79964 79181 129521 127773 175158 181760 240268 208111 157876 142862 141112 124137 133391 159398
11545 159398 201465 172589 140425 120517 149924 184382 134138 102457 145818 128217 128149 119903
11533 119903 110862 103552 96300 89371 110300 109666 128851 121823 137916 141245 134433 128319 132913 140264
11519 140264 127527 105916 76557 82534 95965 81770 80724 107787 112121 78715 49319 16130
$$ packed form
11607A12737K122K2771J6004k6006L0715R040K5736M322k5623l905K2224o6231
11595A23906k5412K8554N962O212M0624K0904J2330m7936l4223J3087K7108j3692
11583A57424J3172J5509r537o2246r400L5761M2570r233j578j819O770j8878j8399
11570A40116j8385J0471N528j3146l8658J8576N3132J0554l2106k8008j6521j1589
11558G9964p83N0340j748M7385O602N8508l2157n0235j5014j750j6975R254K6007
11545A59398M2067k8876l2164j9908K9407L4458n0244l1681M3361j7601o8q246
11533A19903r041p310p252o929K0929o34J9185p028J6093L329o812o114M594P351
11519A40264j2737k1611k9359N977J3431j4195j046K7063M334l3406k9396l3189
$$ plain form
11507 16130 -2549 7778 28866 97114 91548 28614 7253 5623 13388 40850 88374 122840
11495 122840 97857 89000 79211 108904 119593 125518 74436 73221 87074 89703 96489 84506 100464
11482 100464 89361 92203 80119 48830 37949 52116 12120 10683 77583 92862 91287 113497
11470 113497 75374 52030 22331 3127 44678 93919 132910 161182 185796 206005 169275
11459 169275 95755 57346 31011 16469 12377 56686 102046 90065 108868 93823 75225 42300
11447 42300 78433 87332 58914 43575 43815 93688 116428 127834 120747 132690 135546 98189 102395
11434 102395 120007 188724 189361 143725 112078 96988 81028 46200 27720 38313 65028 65373
11422 65373 82936 93309 86589 78287 72922 52731 82625 102034 112038 140925 85682 1937
$$ packed form
11507A6130j8679J0327K1088O8248n566o2934k1361j630P765K7462M7524L4466
11495A22840k4983q857r789K9693J0689N925n1082j215J3853K629O786j1983J5958
11482A00464j1103K842j2084l1289j0881J4167l9996j437O6900J5279j575K2210
11470A13497l8123k3344k9699j9204M1551M9241L8991K8272K4614K0209l6730
11459A69275p3520l8409k6335j4542m092M4309M5360j1981J8803j5045j8598l2925
11447D2300L6133Q899k8418j5339K40M9873K2740J1406p087J1943K856l7357M206
11434A02395J7612O8717O37m5636l1647j5090j5960l4828j8480J0593K6715L45
11422F5373J7563J0373o720q302n365k0191K9894J9409J0004K8887n5243q3745
$$ plain form
11410 1937 7199 65929 92581 83729 83542 41566 20032 -18810 -23483 23656 51653 69491 82253
11397 82253 82326 114363 136336 98926 46363 76332 90194 90520 84690 55151 59568 32336 48224
11384 48224 67837 84767 145358 160453 143151 94995 100940 75932 52435 66630 67763 32078
11372 32078 34321 81442 110939 133361 132863 66354 -3602 48817 91314 97998 68188 91981
11360 91981 132604 152387 127514 145208 167866 200531 119312 50640 35966 49836 71158 66954
11348 66954 29319 40169 77078 80714 64743 64866 83799 142066 143858 125319 122753 143827 102228
11335 102228 66136 67973 81268 97225 104574 67347 15721 13312 30727 -5343 -42508 -10759
11323 -10759 -10126 32600 50513 72339 112022 105105 45332 -5896 4004 30829 62366 58318 53290
$$ packed form
11410A937N262N8730K6652q852j87m1976k1534l8842m673M7139K7997J7838J2762
11397H2253P3L2037K1973l7410n2563K9969J3862L26n830k9539M417k7232J5888
11384D8224J9613J6930O0591J5095j7302m8156N945k5008k3497J4195J133l5685
11372C2078K243M7121K9497K2422m98o6509o9956N2419M2497O684k9810K3793
11360I1981M0623J9783k4873J7694K2658L2665q1219o8672j4674J3870K1322m204
11348F6954l7635J0850L6909L636j5971J23J8933N8267J792j8539k566K1074m1599
11335A02228l6092J837J3295J5957P349l7227n1626k409J7415l6070l7165L1749
11323a0759O33M2726J7913K1826L9683o917n9773n1228R900K6825L1537m048n028
$$ plain form
11310 53290 30252 -6693 -31121 10038 45653 47995 62896 98374 106227 73671 77461 62985
11298 62985 81453 140723 173210 186175 167428 127466 94746 116543 173027 163768 148006 153089
11286 153089 191840 193696 184401 210423 290504 359848 412989 451413 517908 677566 937512
11275 937512 1289282 1702003 2020640 2183546 2219873 2078397 1780063 1372453 980449 704424
11265 704424 515869 415778 384841 402160 391823 350829 342441 338268 282303 175230 204634
11254 204634 180245 175939 203007 206088 166365 157315 158431 154945 167492 154954 170928 140734
11242 140734 139759 149135 120444 176950 186648 124109 87253 86728 92152 120189 113806 71283 18644
11229 18644 36249 97987 122335 130391 111668 122693 111166 119577 162765 135979 126915 118369
$$ packed form
11310E3290k3038l6945k4428M1159L5615K342J4901L5478P853l2556L790j4476
11298F2985J8468N9270L2487J2965j8747l9962l2720K1797N6484r259j5762N083
11286A53089L8751J856r295K6022Q0081O9344N3141L8424O6495J59658K59946
11275I37512L51770M12721L18637J62906L6327j41476k98334m07610l92004k76025
11265G04424j88555j00091l0937J7319j0337m0994q388m173n5965j07073K9404
11254B04634k4389m306K7068L081l9723r050J116l486J2547j2538J5974l0194
11242A40734r75R376k8691N6506R698o2539l6856n25N424K8037o383m2523n2639
11229A8644J7605O1738K4348Q056j8723J1025j1527Q411M3188k6786r064q546
$$ plain form
11217 118369 124929 136554 158267 140837 59476 16280 94236 123979 106371 52509 42479 35354
11205 35354 14973 1624 25417 63891 76784 75559 71404 65006 87817 148049 163097 139837
11193 139837 81725 71875 117907 124162 153305 114263 102192 139313 110878 88235 74249 87936
11181 87936 69826 56882 79607 97693 139632 157748 173850 184087 186548 140912 89140 32410
11169 32410 -11944 10650 64245 134036 214714 259664 323391 400112 470964 600760 739953
11158 739953 946744 1245424 1586002 1854555 1934479 1885567 1884502 1862461 1620102 1229609
11148 1229609 864667 666440 507974 381031 322881 282361 227746 199446 212273 193161
11138 193161 215044 188647 152223 136510 116565 121498 128918 122345 116788 92644 93003 95472 59229
$$ packed form
11217A18369O560J1625K1713j7430q1361m3196P7956K9743j7608n3862j0030p125
11205C5354k0381j3349K3793L8474J2893j225m155o398K2811O0232J5048k3260
11193A39837n8112r850M6032O255K9143l9042j2071L7121k8435k2643j3986J3687
11181H7936j8110j2944K2725J8086M1939J8116J6102J0237K461m5636n1772n6730
11169C2410m4354K2594N3595O9791Q0678M4950O3727P6721P0852J29796J39193
11158G39953K06791K98680L40578K68553P9924m8912j065k2041k42359l90493
11148A229609l64942j98227j58466j26943n8150m0520n4615k8300J2827j9112
11138A93161K1883k6397l6424j5713j9945M933P420o573n557k4144L59K469l6243
$$ plain form
11125 59229 77478 106251 114411 137730 125320 117820 124144 131084 119877 141320 175577 137685
11113 137685 67900 32158 6289 18805 27722 62653 51524 21563 54870 64684 46030 45008
11101 45008 46977 53727 74651 102470 109555 78519 55101 -1852 -15239 25356 75066 70466
11089 70466 4640 -24432 23485 56598 72428 74163 51349 55131 55730 5914 31931 96033
11077 96033 72628 18914 -16300 29117 96399 98202 113643 68117 65398 84071 86822 101756
11065 101756 109089 47639 -8254 -19955 -24563 -29475 -16689 -3529 13091 42496 79742 115134
11053 115134 82980 93393 93846 73835 29670 43493 69595 71582 11151 66447 73953 13214
11041 13214 -14471 -7749 8655 34064 33738 68653 109563 152629 76681 35467 83810 118492
$$ packed form
11125E9229J8249K8773Q160K3319j2410p500O324O940j1207K1443L4257l7892
11113A37685o9785l5742k5869J2516Q917L4931j1129k9961L3307R814j8654j022
11101D5008J969O750K0924K7819P085l1036k3418n6953j3387M0595M9710m600
11089G0466o5826k9072M7917L3113J5830J735k2814L782N99m9816K6017O4102
11077I6033k3405n3714l5214M5417O7282J803J5441m5526k719J8673K751J4934
11065A01756P333o1450n5893j1701m608m912J2786J3160J6620K9405L7246L5392
11053A15134l2154J0413M53k0011m4165J3823K6102J987o0431N5296P506o0739
11041A3214k7685O722J6404K5409l26L4915M0910M3066p5948m1214M8343L4682
$$ plain form
11029 118492 99352 61705 -10425 -28835 -27864 -7760 8905 43385 85897 124883 113279 36627
11017 36627 -39934 -48222 -21187 14365 29313 18338 -8593 -48184 -48078 -14165 -12692 4239
11005 4239 -27609 -71317 -45242 -45981 -55290 -246 -20959 16765 63743 51430 51336 46188 25897
10992 25897 14570 22389 3337 -32330 -47958 -17859 -32412 -33307 -20083 16140 -1950 13408
10980 13408 18107 11654 -486 5666 -5805 11446 33186 27571 27686 36428 26531 36922 42087
10967 42087 36636 34842 46274 56322 31949 -42360 -99919 -121125 -88542 -17359 12739 27284
10955 27284 21036 -11799 -39474 -32637 -17545 -10647 3179 -13901 -33572 -59212 -48234 -1242
10943 -1242 44112 64057 56545 50614 28990 3376 -1126 3687 -46934 -28741 21279 26309 -16179
$$ packed form
11029A18492j9140l7647p2130j8410R71K0104J6665L4480M2512L8986j1604p6652
11017C6627p6561q288K7035L5552J4948j0975k6931l9591J06L3913J473J6931
11005D239l1848m3708K6075p39r309N5044k0713L7724M6978j2313r4n148k0291
10992B5897j1327P819j9052l5667j5628L0099j4553q95J3224L6223j8090J5358
10980A3408M699o453j2140O152j1471J7251K1740n615J15Q742r897J0391N165
10967D2087n451j794J1432J0048k4373p4309n7559k1206L2583P1183L0098J4545
10955B7284o248l2835k7675O837J5092O898J3826j7080j9671k5640J0978M6992
10943a242M5354J9945p512n931k1624k5614m502M813n0621J8193N0020N030m2488
$$ plain form
10930 -16179 -3368 12547 -12326 -10922 23444 36524 14349 34789 709 -33166 -86429 -73191
10918 -73191 -92455 -86946 -81059 -57131 -37417 16718 50412 11358 -28728 -40708 -14292 -10648
10906 -10648 -51102 7915 43510 -3465 -58722 -63391 15014 15185 -28936 -46222 -42094 -50969 -18830
10893 -18830 40988 40683 52469 29115 -33707 -64835 9844 -6808 -10490 -18421 37508 54267
10881 54267 30878 16763 -43389 -92 60690 63854 18447 -36627 -47788 -27042 17013 7428
10869 7428 -14758 -16537 33815 56932 53969 66424 7548 -23550 -46719 -2457 -3157 -70391 -38031
10856 -38031 12679 -19461 -35320 -19299 4510 -47 -2621 14901 -17965 -50870 -23257 -12066
10844 -12066 -12735 -7251 12358 20534 46059 46242 30715 35749 80398 64933 31278 37399 62953
$$ packed form
10930a6179J2811J5915k4873J404L4366J3080k2175K0440l4080l3875n3263J3238
10918g3191j9264N509N887K3928J9714N4135L3694l9054m0086j1980K6416L644
10906a0648m0454N9017L5595m6975n5257m669P8405J71m4121j7286M128q875L2139
10893a8830N9818l05J1786k3354o2822l1128P4679j6652l682p931N5929J6759
10881E4267k3389j4115o0152M3297O0782L164m5407n5074j1161K0746M4055r585
10869G428k2186j779N0352K3117k963J2455n8876l1098k3169M4262p00o7234L2360
10856c8031N0710l2140j5859J6021K3809m557k574J7522l2866l2905K7613J1191
10844a2066o69N484J9609Q176K5525J83j5527N034M4649j5465l3655O121K5554
$$ plain form
10831 62953 28184 -29642 -30088 -43437 -15904 3986 20928 4100 -22118 8453 -3683 17248
10819 17248 22744 49063 68172 79492 45235 12115 3190 25224 20395 67340 69664 76594 79681
10806 79681 23490 -23714 -15041 14614 376 -1795 -41047 -32412 -23263 -28545 -843 30283 27393
10793 27393 69122 80034 78244 99410 125812 137686 46096 4954 -21766 -45920 5751 36847
10781 36847 39090 35991 17405 6019 -12563 -28865 -12101 27842 52654 43520 22296 24859
10769 24859 -5895 -21420 22019 48679 88091 98294 59189 29102 -28365 -59017 -38272 -41449
10757 -41449 -42088 20598 56368 23171 35481 56139 67986 56040 24848 16716 -40344 -47397
10745 -47397 -24711 3381 -56021 -56758 -65529 -41429 -2143 16810 555 -31926 -53774 -39203
$$ packed form
10831F2953l4769n7826m46j3349K7533J9890J6942j6828k6218L0571j2136K0931
10819A7248N496K6319J9109J1320l4257l3120q925K2034m829M6945K324O930L087
10806G9681n6191m7204Q673K9655j4238k171l9252Q635R149n282K7702L1126k890
10793B7393M1729J0912j790K1166K6402J1874r1590m1142k6720k4154N1671L1096
10781C6847K243l099j8586j1386j8582j6302J6764L9943K4812r134k1224K563
10769B4859l0754j5525M3439K6660L9412J0203l9105l0087n7467l0652K0745l177
10757d1449o39O2686L5770l3197J2310K0658J1847j1946l1192q132n7060p053
10745d7397K2686K8092n9402p37q771K4100L9286J8953j6255l2481k1848J4571
$$ plain form
10733 -39203 -17586 21569 -4095 20415 -6157 -99184 -150131 -134981 -41219 -16332 -9546 -36383
10721 -36383 -67382 -15400 -11174 -10961 7083 -13503 -64695 -82472 -59102 6529 77776 95820
10709 95820 75445 45819 -21299 -65157 -78176 -18131 15948 16741 8653 54612 -13492 -9553
10697 -9553 42960 60882 89025 87512 11084 -17880 -27426 -53001 -9357 37870 4986 -78306
10685 -78306 -80979 -53666 -69596 -88032 -87342 -70888 -57006 -50346 -45178 -76738 -119068 -119588 -134047
10672 -134047 -102864 -48440 -81296 -60693 -60018 -88348 -87117 -52233 8081 28448 39303 52557
10660 52557 74277 35757 -21315 -18950 -32349 -3959 -10895 -32274 -8706 -5655 20041 34338
10648 34338 38265 46026 19258 -18350 -35862 -17787 -7014 18133 39009 7679 -28474 -67604
$$ packed form
10733c9203K1617L9155k5664K4510k6572r3027n0947J5150R3762K4887O786k6837
10721c6383l0999N1982M226K13J8044k0586n1192j7777K3370O5631P1247J8044
10709I5820k0375k9626o7118m3858j3019O0045L4079P93q088M5959o8104L939
10697i553N2513J7922K8143j513p6428k8964r546k5575M3644M7227l2884q3292
10685g8306k673K7313j5930j8436O90J6454J3882O660N168l1560m2330n20j4459
10672a34047L1183N4424l2856K0603O75k8330J231L4884O0314K0367J0855J3254
10660E2557K1720l8520n7072K365j3399K8390o936k1379K3568L051K5696J4297
10648C4338L927P761k6768l7608j7512J8075J0773K5147K0876l1330l6153l9130
$$ plain form
10636 -67604 -50591 7309 -28823 -74636 -83866 -29653 -17576 -2537 -11574 -7495 31502 7774
10624 7774 -6275 7909 22787 -7991 -59153 -47428 -8452 -26427 -51796 -50137 -8053 6891
10612 6891 -75142 -68780 2630 47947 53937 -10203 -53348 -45632 -33499 -13931 22515 -2221
10600 -2221 -2664 14477 259 -13740 11611 1193 -12126 -47262 -70145 -57475 -64128 -48975
10588 -48975 -27067 -20807 -28062 -23453 -52003 -54622 -31264 26600 64202 50111 -9763 -67524
10576 -67524 -113349 -102877 -86008 -67449 -62333 -78476 -77003 -64394 -76463 -130407 -141101 -82101
10564 -82101 -1095 30270 72482 52122 10767 26916 35874 -10429 -2787 15916 14883 76416
10552 76416 84053 62948 43345 8735 -28994 -34860 -17037 -41985 -53238 -44264 -90923 -36290
$$ packed form
10636f7604J7013N7900l6132m5813r230N4213J2077J5039r037M079L8997k3728
10624G774j4049J4184J4878l0778n1162J1725L8976j7975k5369J659M2084J4944
10612F891q2033O362P1410M5317N990o4140m3145P716J2133J9568L6446k4736
10600b221m43J7141j4218j3999K5351j0418j3319l5136k2883J2670o653J5153
10588d8975K1908O260p255M609k8550k619K3358N7864L7602j4091n9874n7761
10576f7524m5825J0472J6869J8559N116j6143J473J2609j2069n3944j0694N9000
10564h2101Q1006L1365M2212k0360m1355J6149Q958m6303P642J8703j033O1533
10552G6416P637k1105j9603l4610l7729n866J7823k4948j1253Q974m6659N4633
$$ plain form
10540 -36290 12165 -13300 -20426 -43099 -59362 -114501 -108278 -66597 -16455 -32807 -47121 -27865
10528 -27865 -17631 -10633 20517 61022 33398 61246 55088 50970 36432 -3026 8167 -5595
10516 -5595 -49285 -29901 23103 47571 65098 36161 6175 -14466 -3922 -1101 6675 54642
10504 54642 54621 35637 22365 17025 -2349 11816 20349 26483 33220 -24389 -54483 -39440 -69036
10491 -69036 -42847 -5202 -8742 -8815 -3098 -21710 139 -1379 -4065 -9441 -34951 -5399 21632
10478 21632 49224 -6884 -28628 -51822 -25245 -17848 -21364 22659 -5162 -80463 -106397 -95217
10466 -95217 -58964 -40558 25636 79452 90308 76966 25906 6575 16812 59328 68110 2656
10454 2656 -35414 -10933 1890 -33088 -67633 -76049 -89728 -83918 -61954 3092 -9079 -20703
$$ packed form
10540c6290M8455k5465p126k2673j6263n5139O223M1681N0142j6352j4314J9256
10528b7865J0234O998L1150M0505k7624K7848o158m118j4538l9458J1193j3762
10516e595m3690J9384N3004K4468J7527k8937k9986k0641J0544K821P776M7967
10504E4642k1j8984j3272n340j9374J4165Q533O134O737n7609l0094J5043k9596
10491f9036K6189L7645l540p3N717j8612K1849j518k686n376k5510K9552K7031
10478B1632K7592n6108k1744k3194K6577P397l516M4023k7821p5301k5934J1180
10466i5217L6253J8406O6194N3816J0856j3342n1060j9331J0237M2516Q782o5454
10454B656l8070K4481J2823l4978l4545q416j3679N810K1964O5046j2171j1624
$$ plain form
10442 -20703 -5215 24130 35644 1089 12649 70715 66944 12838 -14320 -6044 21790 15916
10430 15916 28927 -885 -34688 -20676 8261 36809 61180 23916 1710 -54980 -106186 -103563
10418 -103563 -43319 1369 -54406 -31029 -14852 -42388 -5552 57632 71946 52998 66257
10407 66257 60801 52799 36206 34888 22274 41846 9384 -18951 -13751 -6827 -37520 -70477 -28410
10394 -28410 1803 27459 687 -31489 -45904 -72948 -87112 -79322 -47651 -21826 -23791 -7170
10382 -7170 20189 -7906 -32237 -83304 -29751 -18871 -26506 -15236 6619 -11298 -15172 -22588
10370 -22588 -20563 -60695 -16174 -22316 -45045 -84317 -93508 -50842 -35738 -82224 -96881 -84638
10358 -84638 -64678 -52101 -43877 -45798 -53386 -26276 -42247 8676 43128 17377 5262 15456
$$ packed form
10442b0703J5488K9345J1514l4555J1560N8066l771n4106k7158Q276K7834n874
10430A5916J3011k9812l3803J4012K8937K8548K4371l7264k2206n6690n1206K623
10418a03563O0244M4688n5775K3377J6177k7536L6836O3184J4314j8948J3259
10407F6257n456q002j6593j318j2614J9572l2462k8335N200O924l0693l2957M2067
10394b8410L0213K5656k6772l2176j4415k7044j4164P790L1671K5825j965J6621
10382g170K7359k8095k4331n1067N3553J0880p635J1270K1855j7917l874p416
10370b2588K025m0132M4521o142k2729l9272r191M2666J5104m6486j4657J2243
10358h4638J9960J2577Q224j921p588K7110j5971N0923L4452k5751j2115J0194
$$ plain form
10346 15456 36812 8122 -10717 -23084 36285 71940 12597 -1295 -15176 -67443 -62242 -46438
10334 -46438 -68450 -47595 -29324 -29313 -12756 49839 76439 48733 4615 9656 40233 22751
10322 22751 15047 44081 62761 39180 13785 -5471 -56053 -4737 -6210 -37401 -33819 -23552
10310 -23552 -30701 -39547 1372 36485 86619 99567 41906 15476 62413 94462 86755 65179
10298 65179 23804 -18709 1436 40386 80554 140944 126016 106290 97451 116493 167086 245273
10286 245273 241470 216507 195930 121501 154082 187507 192176 133022 54596 63726 39932 37392
10274 37392 29859 19075 17010 46142 57405 15777 12999 10460 16920 6815 12075 37703 83906
10261 83906 77518 47533 11029 12666 -9730 30290 37389 24925 45829 49166 52663 16016 37998
$$ packed form
10346A5456K1356k8690j8839j2367N9369L5655n9343j3892j3881n2267N201J5804
10334d6438k2012K0855J8271J1J6557O2595K6600k7706m4118N041L0577j7482
10322B2751p704K9034J8680k3581k5395j9256n0582N1316j473l1191L582J0267
10310b3552p149q846M0919L5113N0134J2948n7661k6430M6937L2049p707k1576
10298F5179m1375m2513K0145L8950M0168O0390j4928j9726q839J9042N0593P8187
10286B45273l803k4963k0577p4429L2581L3425M669n9154p8426R130k3794k540
10274C7392p533j0784k065K9132J1263m1628k778k539O460j0105N260K5628M6203
10261H3906o388k9985l6504J637k2396M0020P099j2464K0904L337L497l6647K1982
$$ plain form
10248 37998 62081 54710 24572 34147 49777 46801 80108 21551 48722 25231 -25143 -28495
10236 -28495 7983 15514 -306 -3534 7597 18216 66994 84973 117582 113002 110424 139142
10224 139142 128677 123707 116054 110733 88257 30017 33532 32323 19110 -2635 -13882 38897
10212 38897 32416 -19684 -2040 -4385 4700 27650 42460 15540 -6737 22028 27559 51451
10200 51451 56737 44235 3060 -49253 -46313 -36202 6733 55850 11420 -18673 23639 7673
10188 7673 -45069 -27388 -18415 -24479 50921 50259 32985 72309 89261 92596 95928 57617 36832
10175 36832 27596 25660 74591 77855 91608 154930 170834 137423 110092 90028 62768 99516
10163 99516 146413 93561 26392 15577 24904 38370 29616 78556 79880 77144 73169 27515 43620
$$ packed form
10248C7998K4083p371l0138R575J5630k976L3307n8557K7171k3491n0374l352
10236b8495L6478P531j5820l228J1131J0619M8778J7979L2609m580k578K8718
10224A39142j0465m970p653n321k2476n8240L515j209j3213k1745j1247N2779
10212C8897o481n2100J7644k345R085K2950J4810k6920k2277K8765N531K3892
10200E1451N286j2502m1175n2313K940J0111M2935M9117m4430l0093M2312j5966
10188G673n2742J7681Q973o064P5400o62j7274L9324J6952L335L332l8311k0785
10175C6832r236j936M8931L264J3753O3322J5904l3411k7331k0064k7260L6748
10163I9516M6897n2852o7169j0815R327J3466q754M8940J324k736l975m5654J6105
$$ plain form
10150 43620 87983 47234 -8200 -49477 -19188 25466 47040 21062 11945 6364 14382 -14019
10138 -14019 -4312 15892 11070 -15312 -52409 -16935 31780 32888 -17400 -16453 6829 25282 2444
10125 2444 14851 43866 85346 90863 117478 112040 144636 215122 230393 256355 310703 379696
10113 379696 360693 264638 251727 260858 289573 294800 263538 229343 204716 172865 130017 95773
10101 95773 137796 92448 44007 82509 90239 44419 21833 61679 55632 14043 -11332 -5175
10089 -5175 -6505 1303 -6418 -7622 -18117 -11034 -9219 -38312 -42648 -25819 -9539 26390 38302
10076 38302 88942 110297 36585 61360 124524 96499 62272 35279 12872 -43893 -57582 -19956
10064 -19956 -15739 -42425 -36852 -9353 27224 14510 -41300 -72546 -12153 21596 -23846 -15804
$$ packed form
10150D3620M4363m0749n5434m1277L0289M4654K1574k5978r117n581Q018k8401
10138a4019R707K0204m822k6382l7097L5474M8715J108n0288R47K3282J8453k2838
10125B444J2407K9015M1480N517K6615n438L2596P0486J5271K5962N4348O8993
10113C79696j9003r6055j2911R131K8715N227l1262l4195k4627l1851m2848l4244
10101I5773M2023m5348m8441L8502P730m5820k2586L9846o047m1589k5375O157
10089e175j330P808p721j204j0495P083J815k9093m336J6829J6280L5929J1912
10076C8302N0640K1355p3712K4775O3164k8025l4227k6993k2407n6765j3689L7626
10064a9956M217k6686N573K7499L6577j2714n5810l1246O0393L3749m5442Q042
$$ plain form
10052 -15804 -41529 -58440 -79423 -59188 -7442 29040 -39596 -94298 -73304 -20111 -22468 -14316
10040 -14316 -26919 -54023 -44121 -3666 42210 45143 9744 -47822 -63983 -61727 -46973 -34887
10028 -34887 -67758 -93260 -25816 -20618 -19915 -5463 -31917 -18727 54469 97673 110441 97486
10016 97486 121543 74733 14711 -2762 -140 -14364 -28894 -49241 -42103 -16895 5933 -13961
10004 -13961 -13315 -10496 11029 -42786 -110338 -95725 -56157 -34661 -55989 -26544 42007 56874
9992 56874 35668 54823 31335 -1056 45180 36876 25011 11480 -25629 -35347 6636 4427
9980 4427 -10045 -15127 -24651 -30656 -56471 -32659 -4424 -58725 -72908 -98018 -89130 -94126 -63455
9967 -63455 -40831 -73225 -61074 -26254 24698 28972 8886 32631 23268 25332 1358 -13260
$$ packed form
10052a5804k5725j6911k0983K0235N1746L6482o8636n4702K0994N3193k357Q152
10040a4316j2603k7104R902M0455M5876K933l5399n7566j6161K256J4754J2086
10028c4887l2871k5502O7444N198P03J4452k6454J3190P3196M3204J2768j2955
10016I7486K4057m6810o0022j7473K622j4224j4530k0347P138K5208K2828j9894
10004a3961O46K819K1525n3815o7552J4613L9568K1496k1328K9445O8551J4867
9992E6874k1206J9155k3488l2391M6236q304j1865j3531l7109r718M1983k209
9980D427j4472n082r524o005k5815K3812K8235n4301j4183k5110Q888m996L0671
9967f3455K2624l2394J2151L4820N0952M274k0086K3745r363K064k3974j4618
$$ plain form
9955 -13260 -13854 -46239 -56316 -20743 -21012 1482 16038 32280 39309 50752 83233 63523 45815
9942 45815 28837 15168 -7546 48217 27072 -49334 -45415 -24041 13991 -18614 -29909 -1782
9930 -1782 39270 1338 -25935 -46659 -62954 -50399 -43396 -60597 -15796 23312 19521 -3492
9918 -3492 -48224 -33622 -28810 -50213 -53363 7067 -5468 -72612 -42883 5690 -19720 30679
9906 30679 49145 7147 -26855 -14536 47259 156238 167809 172907 169249 117435 45934 96422
9894 96422 116957 92173 101657 87303 69772 22431 59411 71788 77332 93147 97018 64210
9882 64210 23108 -24232 -40566 -26772 -89502 -65869 33816 68041 74355 93726 65218 65676
9870 65676 32659 49633 150593 175444 198998 208809 201004 165265 88687 36263 64872 82824
$$ packed form
9955a3260n94l2385j0077L5573k69K2494J4556J6242P029J1443L2481j9710j7708
9942D5815j6978j3669k2714N5763k1145p6406L919K1374L8032l2605j1295K8127
9930a782M1052l7932k7273k0724j6295J2555P003j7201M4801L9108l791k3013
9918c492m4732J4602M812k1403l150O0430j2535o7144K9729M8573k5410N0399
9906C0679J8466m1998l4002J2319O1795J08979J1571N098l658n1814p1501N0488
9894I6422K0535k4784R484j4354j7531m7341L6980J2377N544J5815L871l2808
9882F4210m1102m7340j6334J3794o2730K3633R9685L4225O314J9371k8508M58
9870F5676l3017J6974J00960K4851K3554R811p805l5739p6578n2424K8609J7952
$$ plain form
9858 82824 66839 50589 82349 122062 70584 39392 50000 96221 97932 94990 89814 69771
9846 69771 34292 43166 18347 16446 -15725 -97985 -77893 -33735 -46992 -23067 20651 28620
9834 28620 57533 35793 16585 -24585 -37377 -18162 -17517 -17201 -27514 -25999 -33486 8890 4954
9821 4954 27152 47521 83764 99260 58183 18987 22675 -705 -34501 -47821 -79949 -75347
9809 -75347 -55741 -40459 -21076 -35459 -42959 -82582 -90433 -82068 -59737 19123 15760 -6555 -30306
9796 -30306 -35784 -17541 -17243 -54701 -53059 -25672 -5380 -36309 -45232 -42434 -51701 -45843 -44090 -26916
9782 -26916 19511 21216 18236 3468 2167 -32525 -2457 13348 2974 -29838 -60070 -42659
9770 -42659 -36493 -18701 25254 12045 -9955 -15126 -29104 -14913 -702 -8396 -42626 -50853 -24554
$$ packed form
9858H2824j5985j6250L1760L9713n1478l1192J0608M6221J711k942n176k0043
9846F9771l5479Q874k4819j901l2171q2260K0092M4158j3257K3925M3718P969
9834B8620K8913k1740j9208m1170j2792J9215O45L16j0313J515p487M2376l936
9821D954K2198K0369L6243J5496m1077l9196L688k3380l3796j3320l2128M602
9809g5347J9606J5282J9383j4383p500l9623p851Q365K2331P8860l363k2315k3751
9796c0306n478J8243K98l7458J642K7387K0292l0929q923K798r267N858J753J7174
9782b6916M6427J705k980j4768j301l4692L0068J5805j0374l2812l0232J7411
9770d2659O166J7792M3955j3209k2000n171j3978J4191J4211p694l4230q227K6299
$$ plain form
9757 -24554 -28963 -29311 -15296 -3042 670 29519 33196 17332 -11153 -38939 11093 2373 -12947
9744 -12947 -47179 -48257 -28373 -28746 23585 27642 37698 19177 -5624 38302 76412 55991 34213
9731 34213 -4307 -5331 -12527 -25438 -54045 -49394 -20565 -24548 -68775 -54555 -34347 15938 18971
9718 18971 7907 11229 25150 72010 46538 6838 -5490 -4204 -2810 13991 1204 19523
9706 19523 15272 40890 58272 -2766 -15723 56103 104475 41887 5404 11207 57533 81534
9694 81534 62361 4681 -50663 -11436 30053 53649 34107 44925 48624 26999 1394 27686
9682 27686 15014 -23113 -7508 -5061 -24563 -79911 -72922 -50020 -41117 -64700 -48351 2040
9670 2040 6490 -2687 8623 63851 37970 -206 -48229 -74727 -112912 -107466 -47871 -7229 7451
$$ packed form
9757b4554m409l48J4015J2254L712K8849L677j5864k8485k7786N0032q720j5320
9744a2947l4232j078J9884l73N2331M057J0056j8521k4801M3926L8110k0421k1778
9731C4213l8520j024p196j2911k8607M651K8829l983m4227J4220K0208N0285L033
9718A8971j1064L322J3921M6860k5472l9700j2328J286J394J6801j2787J8319
9706A9523m251K5618J7382o1038j2957P1826M8372o2588l6483N803M6326K4001
9694H1534j9173n7680n5344L9227M1489K3596j9542J0818L699k1625k5605K6292
9682B7686j2672l8127J5605K447j9502n5348O989K2902Q903k3583J6349N0391
9670B040M450r177J1310N5228k5881l8176m8023k6498l8185N446N9595M0642J4680
$$ plain form
9657 7451 7281 -4702 4502 11020 33729 47046 56036 23906 -3494 -24171 -78483 -82291 -31102
9644 -31102 -18433 -49849 -63912 -41955 -22416 -11849 -22482 -14754 9399 -23967 -1007 26774
9632 26774 -31960 -43719 -15159 -37649 -34472 5823 -4396 -1898 -45717 -47134 -22482 -15586 -2454
9619 -2454 5904 -105 4053 -4083 -3057 -4886 -5013 35212 69577 52525 20924 18295 -3282 -23455
9605 -23455 -19262 -20091 -62620 -102430 -107794 -50008 -25675 -72740 -77801 -44753 -44160 -54355 -51489
9592 -51489 -69441 -67869 -64862 -42927 -51860 -49655 -69645 -75797 -35830 -36879 -51671 -47637 -68541
9579 -68541 -95663 -111305 -132172 -117725 -73554 -90722 -62014 -62506 -68175 -36867 -15712 28474
9567 28474 71034 65702 61387 4750 -4983 64032 88360 13520 -71377 -49033 -37975 -44852 -38354
$$ packed form
9657G451j70j1983R204O518K2709J3317Q990l2130k7400k0677n4312l808N1189
9644c1102J2669l1416j4063K1957J9539J0567j0633P728K4153l3366K2960K7781
9632B6774n8734j1759K8560k2490L177M0295j0219K498m3819j417K4652O896J3132
9619b454Q358o009M158q136J026j829j27M0225L4365j7052l1601k629k1577k0173
9605b3455M193q29m2529l9810n364N7786K4333m7065n061L3048N93j0195K866
9592e1489j7952J572L007K1935q933K205j9990o152L9967j049j4792M034k0904
9579f8541k7122j5642k0867J4447M4171j7168K8708m92n669L1308K1155M4186
9567B8474M2560n332m315n6637r733O9015K4328p4840q4897K2344J1058o877O498
$$ plain form
9554 -38354 -85636 -116179 -56044 1130 -5077 2793 14594 -25718 -55196 -48948 -20427 -3789
9542 -3789 -18865 -18121 13484 36553 7930 -23018 -19396 -15882 6463 -15993 -57327 -76851 -111004
9529 -111004 -112548 -117000 -97146 7256 32696 18598 -22454 -42986 -20831 -4750 15134 42121
9517 42121 89813 93417 70473 36973 -11198 9495 -6781 -14997 -24597 -20408 -34957 -64944 -65239
9504 -65239 -79056 -45987 -26553 -16593 -47016 -8178 20258 -9222 -13395 6230 -33541 -61168
9492 -61168 -27595 -7005 -975 9503 48942 77387 70457 10420 -5320 22810 60366 38950
9480 38950 38794 23843 8465 14878 47946 11058 -4496 -12930 -8586 10380 -22319 -69541 -110965
9467 -110965 -113788 -60568 -51871 -55031 1371 66688 70308 69777 15050 -38947 -63040 -38619 -25041
$$ packed form
9554c8354m7282l0543O0135N7174o207P870J1801m0312k9478O248K8521J6638
9542c789j5076P44L1605K3069k8623l0948L622L514K2345k2456m1334j9524l4153
9529a11004j544m452J9854J04402K5440j4098m1052k0532K2155J6081J9884K6987
9517D2121M7692L604k2944l3500m8171K0693j6276q216r600M189j4549k9987k95
9504f5239j3817L3069J9434R960l0423L8838K8436k9480m173J9625l9771k7627
9492f1168L3573K0590O030J0478L9439K8445o930o0037j5740K8130L7556k1416
9480C8950j56j4951j5378O413L3068l6888j5554q434M344J8966l2699m7222m1424
9467a10965k823N3220Q697l160N6402O5317L620n31n4727n3997k4093K4421J3578
$$ plain form
9454 -25041 2030 -5204 -21023 -32857 -63183 -48842 -42194 -79182 -45642 -29771 -24890 -42533
9442 -42533 -62152 1242 62356 67656 19066 -12552 -35083 -47868 -33676 -9455 -15203 -9984
9430 -9984 -16658 -16242 -28413 -15573 12386 19794 31120 25899 29641 -15643 -27555 -27570 -52874 -77243
9416 -77243 -38385 -40090 3072 20421 -15610 -14465 12524 28124 -14898 17588 71770 78494
9404 78494 34425 12359 -46162 -87788 -32107 20259 33236 11518 -3607 29728 12812 -50181
9392 -50181 -100190 -67791 -45681 -52515 -45303 -5652 15298 -20503 2439 66998 70207 374
9380 374 -2412 24152 59114 86934 50584 -28402 -70115 -73422 -84226 -38947 6684 -16419 -18631
9367 -18631 -18168 -20194 -32499 -34183 -30587 -24497 -18206 34321 67774 45002 56187 45380 -39914
$$ packed form
9454b5041K7071p234j5819j1834l0326J4341O648l6988L3540J5871M881j7643
9442d2533j9619O3394O1114N300m8590l1618k2531j2785J4192K4221n748N219
9430i984o674M16j2171J2840K7959P408J1326n221L742m5284j1912j5k5304k4369
9416g7243L8858j705M3162J7349l6031J145K6989J5600m3022L2486N4182O724
9404G8494m4069k2066n8521m1626N5681N2366J2977k1718j5125L3335j6916o2993
9392e0181n0009L2399K2110o834P212L9651K0950l5801K2942O4559L209o9833
9380C74k786K6564L4962K7820l6350p8986m1713l307j0804M5279M5631k3103k212
9367a8631M63k026j2305j684L596O090O291N2527L3453k2772J1185j0807q5294
$$ plain form
9354 -39914 -95451 -78497 -89607 -85605 -76810 -64408 -84280 -65338 -38425 -11766 -11836 -12186 -14115
9341 -14115 -65665 -59004 -21971 6832 -20900 -29271 -1337 23947 -4237 27525 74465 41180
9329 41180 -17503 -30951 2073 56615 50889 17439 -9497 -66380 -87767 -54833 17147 53884
9317 53884 -28487 -48461 13328 12073 1012 1024 -22122 -30960 -45497 -39479 7852 38149 100646
9304 100646 129018 62070 85466 45069 33090 -19757 -16453 50317 87138 80784 51275 25136
9292 25136 5231 -21473 -54563 -58996 -25566 -37987 -47102 18592 42826 13539 31820 101874
9280 101874 95507 17855 11015 30034 42067 74994 87333 78178 52146 10573 -19452 -30415
9268 -30415 -20016 57669 63873 39476 40251 -9072 -52674 -51897 -17188 61889 77448 96364 43662
$$ packed form
9354c9914n5537J6954j1110M002Q795J2402j9872J8942K6913K6659p0l50j929
9341a4115n1550O661L7033K8803k7732q371K7934K5284k8184L1762M6940l3285
9329D1180n8683j3448L3024N4542n726l3450k6936n6883k1387L2934P1980L6737
9317E3884q2371j9974O1789j255j1061J2k3146q838j4537O018M7331L0297O2497
9304A00646K8372o6948K3396m0397j1979n2847L304O6770L6821o354k9509k6139
9292B5136j9905k6704l3090m433L3430j2421r115O5694K4234k9287J8281P0054
9280A01874o367p7652o840J9019J2033L2927J2339r155k6032m1573l0025j0963
9268c0415J0399P7685O204k4397P75m9323m3602P77L4709P9077J5559J8916n2702
$$ plain form
9255 43662 -18469 -55083 -75496 -19406 -8059 -25019 1301 25773 40602 28712 26552 -7223
9243 -7223 -18136 -13167 -47794 -42727 -37779 -44620 -39545 -37101 -35658 -5905 10083 18740 46268 51708
9229 51708 91627 88566 51290 243 -24905 -30269 -498 33188 44599 23243 -6041 26495
9217 26495 38559 -3914 -42802 -4995 30766 28901 51424 55877 38018 41171 17049 -14865
9205 -14865 -27155 -55226 -91342 -80050 -25601 11427 38113 66599 10213 30385 70919 96056
9193 96056 89068 33613 6450 66505 123354 75569 60604 48973 84120 120304 119177 105138
9181 105138 105712 100660 87331 72112 32873 20025 27958 47886 35269 -10091 30694 68286
9169 68286 58313 61490 87460 115577 122076 112877 120768 96595 100461 122568 110064 54015 44086
$$ packed form
9255D3662o2131l6614k0413N6090J1347j6960K6320K4472J4829j1890k160l3775
9243g223j0913M969l4627N067M948o841N075K444J443K9753J5988Q657K7528N440
9229E1708L9919l061l7276n1047k5148n364K9771L3686J1411k1356k9284L2536
9217B6495J2064m2473l8888L7807L5761j865K2523M453j7859L153k4122l1914
9205a4865j2290k8071l6116J1292N4449L7028K6686K8486n6386K0172M0534K5137
9193I6056o988n5455k7163O0055N6849m7785j4965j1631L5147L6184j127j4039
9181A05138N74n052j3329j5219l9239j2848P933J9928j2617m5360M0785L7592
9169F8286r973L177K5970K8117O499r199P891k4173L866K2107j2504n6049r929
$$ plain form
9156 44086 12082 18280 65104 112866 110027 85512 82354 78911 80036 65251 22055 19630 68363
9143 68363 94193 110504 133924 152964 169473 115819 85654 146948 156699 157135 157976 165573 163457
9130 163457 136042 101673 103515 144669 79179 22287 23737 35711 44622 43734 42573 59298 82779
9117 82779 82278 79439 105540 146650 183402 204618 197727 211011 186250 164761 135805 147945 135467
9104 135467 98172 88456 62551 64607 107801 110861 107222 95497 78838 111323 121522 102550
9092 102550 120885 105757 113892 155487 168753 144495 174783 204677 229157 247002 253052 252918
9080 252918 291355 239252 199066 212780 218856 178048 162794 189699 185878 152518 126899 151380
9068 151380 163067 143417 168420 206251 160836 130733 147974 188709 216109 155457 106097 101646
$$ packed form
9156D4086l2004O198M6824M7762k839k4515l158l443J125j4785m3196k425M8733
9143F8363K5830J6311K3420J9040J6509n3654l0165O1294R751M36Q41P597k116
9130A63457k7415l4369J842M1154o5490n6892J450J1974Q911q88j161J6725K3481
9117H2779n01k839K6101M1110L6752K1216o891J3284k4761k1489k8956J2140j2478
9104A35467l7295r716k5905K056M3194L060l639j1725j6659L2485J0199j8972
9092A02550J8335j5128Q135M1595J3266k4258L0288K9894K4480J7845O050j34
9080B52918L8437n2103m0186J3714O076m0808j5254K6905l821l3360k5619K4481
9068A51380J1687j9650K5003L7831m5415l0103J7241M0735K7400o0652m9360m451
$$ plain form
9056 101646 144070 196135 212159 188678 159759 166443 194975 231562 188633 123507 58095 59109
9044 59109 82081 110143 115508 133776 161640 141384 121259 174008 211978 232861 243309 254718
9032 254718 233703 196261 162602 234931 260939 227854 202910 227393 222093 215366 201012 194767
9020 194767 161361 187367 196036 204355 242795 226800 203796 177924 120813 138047 155776 143006
9008 143006 122473 130700 180438 227947 191663 152935 155959 143670 84421 74576 78675 137288
8996 137288 189429 184044 190950 207432 206699 165581 158970 167127 155565 153592 198926 185477 186496
8983 186496 174342 173254 166646 148243 168697 157700 121415 152303 189687 217725 238782 215387
8971 215387 184845 134540 83730 101678 135340 108661 99084 121512 135071 129486 156086 126136
$$ packed form
9056A01646M2424N2065J6024k3481k8919O684K8532L6587m2929o5126o5412J014
9044E9109K2972K8062N365J8268K7864k0256k0125N2749L7970K0883J0448J1409
9032B54718k1015l7442l3659P2329K6008l3085k4944K4483n300o727j4354o245
9020A94767l3406K6006Q669Q319L8440j5995k3004k5872n7111J7234J7729j2770
9008A43006k0533Q227M9738M7509l6284l8728L024j2289n9249r845M099N8613
8996A37288N2141n385O906J6482p33m1118o611Q157j1562j973M5334j3449J019
8983A86496j2154j088o608j8403K0454j0997l6285L0888L7384K8038K1057k3395
8971B15387l0542n0305n0810J7948L3662k6679r577K2428J3559n585K6600k9950
$$ plain form
8959 126136 81580 53851 92996 89600 102836 145853 139943 121496 113665 86288 76868 96551
8947 96551 85329 72488 68654 83278 84259 27089 24809 10946 -12480 2446 68788 66462 85807
8934 85807 122336 117673 42215 39117 13823 31009 14251 37070 31434 43277 19763 51535
$$ packed form
8959A26136m4556k7729L9145l396J3236M3017n910j8447p831k7377r420J9683
8947I6551j1222j2841l834J4624R81n7170k280j3863k3426J4926O6342k326J9345
8934H5807L6529m663p5458l098k5294J7186j6758K2819n636J1843k3514L1772
$$ [...]
##END NTUPLES=NMR SPECTRUM
##END=
