##TITLE=316672	cc 43214	467/8	adrs	benw
##JCAMPDX= 6.0         $$ Bruker NMR JCAMP-DX V2.0
##DATA TYPE= NMR SPECTRUM
##DATA CLASS= NTUPLES
##ORIGIN= Bruker BioSpin GmbH
##OWNER= nmr
$$ XWIN-NMR		Version 3.5
$$ Tue Jul 11 13:28:21 2006 GMT Daylight Time (UT+1h)  MAYBRIDGE\nmr@NMR_250MHZ
##.OBSERVE FREQUENCY= 250.131544655141
##.OBSERVE NUCLEUS= ^1H
##.ACQUISITION MODE= SIMULTANEOUS (DQD)
##.ACQUISITION SCHEME= undefined
##.AVERAGES= 16
##.DIGITISER RES= 18
##SPECTROMETER/DATA SYSTEM= dpx250
##.PULSE SEQUENCE= zg30
##.SOLVENT NAME= CDCl3
##.SHIFT REFERENCE= (INTERNAL, CDCl3, 0, 16.522)
##AUDIT TRAIL= $$ (NUMBER, WHEN, WHO, WHERE, WHAT)
$$ ##TITLE= Audit trail, XWIN-NMR		Version 3.5
$$ ##JCAMPDX= 5.01
$$ ##ORIGIN= Bruker BioSpin GmbH
$$ ##OWNER= nmr
$$ C:/u/data/dgb/nmr/ADRS/15120/pdata/1/auditp.txt
$$ ##AUDIT TRAIL=  $$ (NUMBER, WHEN, WHO, WHERE, WHAT)
(   1,<2006-01-24 09:34:46.55 +000>,<MAYBRIDGE\nmr>,<NMR_250MHZ>,
      <created by zg, POWCHK disabled, PULCHK disabled
       configuration hash MD5:
       62 19 C7 07 E1 42 D1 B7 37 6C 3D D0 77 39 F9 E6
       data hash MD5: 64K
       F4 F3 20 79 E0 84 63 48 6A 65 C5 92 FB E8 6D 99>)
(   2,<2006-01-24 09:34:52.82 +000>,<MAYBRIDGE\nmr>,<NMR_250MHZ>,
      <Start of raw data processing
       ef LB = 0.3 FT_mod = 6 PKNL = 1 SI = 32K 
       data hash MD5: 32K
       97 71 CC CE CC 96 F3 B0 31 6B B6 73 BB 60 A2 78>)
(   3,<2006-01-24 09:34:54.74 +000>,<MAYBRIDGE\nmr>,<NMR_250MHZ>,
      <apk 
       data hash MD5: 32K
       3E D6 55 7F 1B 9C 1D 04 73 5C 29 8C 41 2A 06 B2>)
(   4,<2006-01-24 09:34:55.66 +000>,<MAYBRIDGE\nmr>,<NMR_250MHZ>,
      <abs ABSG = 5 
       data hash MD5: 32K
       94 1F AA 64 65 95 18 C8 F7 1F 82 06 AE 29 C5 C5>)
$$ ##END=
$$ 
$$ hash MD5
$$ 41 A6 0D DC 0C B6 BF 5C D2 5B 82 93 1A 1B 31 FF
##$RELAX= 
##$RELAX= 
##$RELAX= 
##$RELAX= 
##$RELAX= 
##$RELAX= 
##$RELAX= 
$$ Bruker specific parameters
$$ --------------------------
##$DU= <C:\Restored>
##$EXPNO= 15120
##$NAME= <ADRS>
##$PROCNO= 1
##$TYPE= <nmr>
##$USER= <dgb>
##$AMP= (0..31)
100 100 100 100 100 100 100 100 100 100 100 100 100 100 100 100 100 100 
100 100 100 100 100 100 100 100 100 100 100 100 100 100 
##$AQSEQ= 0
##$AQ_mod= 3
##$AUNM= <au_zg>
##$AUTOPOS= <9 >
##$BF1= 250.13
##$BF2= 250.13
##$BF3= 250.13
##$BF4= 250.13
##$BF5= 500.13
##$BF6= 500.13
##$BF7= 500.13
##$BF8= 500.13
##$BYTORDA= 1
##$CFDGTYP= 0
##$CFRGTYP= 5
##$CHEMSTR= <none>
##$CNST= (0..31)
1 1 145 1 1 1 1 1 1 1 1 1 1 1 1 1 1 1 1 1 1 1 1 1 1 1 1 1 1 1 1 1 
##$CPDPRG= <>
##$CPDPRG1= <>
##$CPDPRG2= <>
##$CPDPRG3= <>
##$CPDPRG4= <mlev>
##$CPDPRG5= <mlev>
##$CPDPRG6= <mlev>
##$CPDPRG7= <mlev>
##$CPDPRG8= <mlev>
##$CPDPRGB= <>
##$CPDPRGT= <>
##$D= (0..31)
0 1 0 0 0 0 0 0 0 0.06 0 0 0 0 0 0 0.0002 0 0 0 0 0 0 0 0 0 0 0 0 0 0 
0 
##$DATE= 1138095285
##$DBL= (0..7)
120 120 120 120 120 120 120 120 
##$DBP= (0..7)
150 150 150 150 150 150 150 150 
##$DBP07= 0
##$DBPNAM0= <>
##$DBPNAM1= <>
##$DBPNAM2= <>
##$DBPNAM3= <>
##$DBPNAM4= <>
##$DBPNAM5= <>
$$ [...]
##$SUBNAM7= <"">
##$SUBNAM8= <"">
##$SUBNAM9= <"">
##$SW= 20.6930455092707
##$SWIBOX= (0..15)
0 0 3 0 0 0 0 0 0 0 0 0 0 0 0 0 
##$SW_h= 5175.983436853
##$TD= 65536
##$TD0= 1
##$TE= 294.16
##$TE2= 300
##$TE3= 300
##$TEG= 300
##$TL= (0..7)
0 120 120 120 120 120 120 120 
##$TP= (0..7)
150 150 150 150 150 150 150 150 
##$TP07= 0
##$TPNAME0= <>
##$TPNAME1= <>
##$TPNAME2= <>
##$TPNAME3= <>
##$TPNAME4= <>
##$TPNAME5= <>
##$TPNAME6= <>
##$TPNAME7= <>
##$TPOAL= (0..7)
0.5 0.5 0.5 0.5 0.5 0.5 0.5 0.5 
##$TPOFFS= (0..7)
0 0 0 0 0 0 0 0 
##$TUNHIN= 0
##$TUNHOUT= 0
##$TUNXOUT= 0
##$USERA1= <user>
##$USERA2= <user>
##$USERA3= <user>
##$USERA4= <user>
##$USERA5= <user>
##$V9= 5
##$VALIST= <valist>
##$VCLIST= <CCCCCCCCCCCCCCC>
##$VD= 0
##$VDLIST= <DDDDDDDDDDDDDDD>
##$VPLIST= <PPPPPPPPPPPPPPP>
##$VTLIST= <TTTTTTTTTTTTTTT>
##$WBST= 1024
##$WBSW= 4
##$XGAIN= (0..3)
0 0 0 0 
##$XL= 0
##$YL= 0
##$YMAX_a= 265748
##$YMIN_a= -566671
##$ZGOPTNS= <>
##$ZL1= 120
##$ZL2= 120
##$ZL3= 120
##$ZL4= 120
##$ABSF1= 16.522
##$ABSF2= -4.171173
##$ABSG= 5
##$ABSL= 3
##$ALPHA= 0
##$AQORDER= 0
##$ASSFAC= 0
##$ASSFACI= 0
##$ASSFACX= 0
##$ASSWID= 0
##$AUNMP= <proc_1d>
##$AZFE= 0.1
##$AZFW= 0.1
##$BCFW= 0
##$BC_mod= 0
##$BYTORDP= 0
##$COROFFS= 0
##$CY= 12.5
##$DATMOD= 1
##$DC= 0
##$DFILT= <>
##$DTYPP= 0
##$F1P= 14.0000005364418
##$F2P= -0.99999901652339
##$FCOR= 0.5
##$FTSIZE= 32768
##$FT_mod= 6
##$GAMMA= 0
##$GB= 0
##$INTBC= 1
##$INTSCL= 1
##$ISEN= 128
##$LB= 0.3
##$LEV0= 0
##$LPBIN= 0
##$MAXI= 10000
##$MC2= 0
##$MEAN= 0
##$ME_mod= 0
##$MI= 0
##$NCOEF= 0
##$NC_proc= -4
##$NLEV= 6
##$NOISF1= 0
##$NOISF2= 0
##$NSP= 0
##$NTH_PI= 0
##$NZP= 0
##$OFFSET= 16.522
##$PC= 1
##$PHC0= 245.3757
##$PHC1= -4.909584
##$PH_mod= 1
##$PKNL= yes
##$PPARMOD= 0
##$PSCAL= 4
##$PSIGN= 0
##$REVERSE= no
##$SF= 250.13
##$SI= 32768
##$SIGF1= 0
##$SIGF2= 0
##$SINO= 400
##$SIOLD= 32768
##$SREGLST= <1H.CDCl3>
##$SSB= 0
##$STSI= 32768
##$STSR= 0
##$SW_p= 5175.98343685301
##$SYMM= 0
##$S_DEV= 0
##$TDeff= 65536
##$TDoff= 0
##$TI= <Analysis number 999999
Compound Code 99
Book Reference 9
Project Code 9>
##$TILT= no
##$TM1= 0
##$TM2= 0
##$TOPLEV= 0
##$USERP1= <user>
##$USERP2= <user>
##$USERP3= <user>
##$USERP4= <user>
##$USERP5= <user>
##$WDW= 1
##$XDIM= 32768
##$YMAX_p= 398933877
##$YMIN_p= -1879303
$$ End of Bruker specific parameters
$$ ---------------------------------
##NTUPLES= NMR SPECTRUM
##VAR_NAME=  FREQUENCY,     SPECTRUM/REAL,   SPECTRUM/IMAG
##SYMBOL=    X,             R,               I
##VAR_TYPE=  INDEPENDENT,   DEPENDENT,       DEPENDENT
##VAR_FORM=  AFFN,          ASDF,            ASDF
##VAR_DIM=   32768,         32768,           32768
##UNITS=     HZ,            ARBITRARY UNITS, ARBITRARY UNITS
##FACTOR=    0.157963299565203, 1,           1
##FIRST=     4132.6476996994, 0,             0
##LAST=      -1043.33573715361, 0,           0
##MIN=       -1043.33573715361, -1879303,    0
##MAX=       4132.6476996994, 398933877,     0
$$ Real data points
##PAGE= N=1
##DATA TABLE= (X++(R..R)), XYDATA
$$ [...]
19814I1845n709M79K1528j1168n9014l3967K2496R71j4273Q3365M3190k4708l1779
$$ 91845 86136 86615 108143 96975 37961 3994 26490 27461 13188 96553 139743 115035 83256
19801H3256K5824K4941l9674o1986M2357M6349J7720o1372n2431o978j5145l1012
$$ 83256 109080 134021 94347 32361 74718 121067 138787 77415 24984 18006 2861 -28151
19789b8151L5421J7104K0056j9033l2791j2750j6531P97r120J1889Q7008m696
$$ -28151 7270 24374 44430 25397 -7394 -20144 -36675 -35878 -44998 -33109 53899 49203
19777D9203J2909M4785j2799q6743N909P1284n0790r242J2820j2382q9387K219
$$ 49203 62112 106897 94098 7355 13264 84548 33758 24516 37336 24954 -64433 -62214
19765f2214n83J0464L2097O324J1408K8538Q0409L1005j0551l2122J0719Q0475
$$ -62214 -62797 -52333 -20236 -13912 -2504 26034 106443 137448 126897 94775 105494 185969
19753A85969k9133p0595n3197L5513N4134o1390R657q35J0947J5401l6416r5007
$$ 185969 156836 86241 33044 68557 122691 61301 70958 70123 81070 96471 60055 -34952
19741c4952l9684K4682J012q753O3384l6989n5330K4823J3155l6607q637N7414
$$ -34952 -74636 -49954 -48942 -57695 5689 -31300 -86630 -61807 -48652 -85259 -93896 -36482
19729c6482M9449M3829o3617k3594J995M9868L5186j0872k5161K8507P7646r305
$$ -36482 12967 56796 -6821 -30415 -28420 21448 56634 45762 20601 49108 126754 117449
19717A17449j17281R031M720j6513l5512l243P8756N0190K9353M072n2462p0063
$$ 117449 168 9199 13919 -2594 -38106 -41349 37407 87597 116950 121022 68560 -1503
19705a503Q933L9017l1829N6655N8429j7528j3370l8079k7591J6762L7600N746
$$ -1503 7430 46447 14618 71273 129702 112174 98804 60725 33134 49896 87496 93242
19693I3242J5453M5916k8471m0781j602j4841n1814k8808j0372N4032P6063P837
$$ 93242 108695 154611 126140 85359 83757 68916 17102 -11706 -22078 31954 108017 115854
19681A15854m7642n1989L2618J7264O1311J01335O761q5224m1184r188j994r212
$$ 115854 68212 16223 48841 66105 127416 228751 235512 150288 109104 99916 97922 88710
19669H8710K3441O186J094n720O9400R079o5159k1552J4321n3164r5237q194N5489
$$ 88710 112151 118337 119431 113711 183111 192190 127031 105479 119800 66636 -28601 -36795 18694
19656A8694L7464Q598K0508l7874j5197k7053j6430Q1262R2725N682k3400J6031
$$ 18694 56158 64756 85264 47390 32193 5140 -11290 69972 162697 168379 144979 161010
19644A61010k5611o5427m5389l6286J1112k2825K3850L1378R963J4062J1577j5603
$$ 161010 135399 69972 24583 -11703 -591 -23416 434 31812 41775 55837 67414 51811
19632E1811Q68O5761o3795q2933m1541J2869M6491L4308k9291J1443l9697M8709
$$ 51811 52679 118440 54645 -28288 -69829 -56960 -10469 23839 -5452 5991 -33706 15003
19620A5003J8928N1341J4575r308J3730j0508N883J2331j2423p3353k953j7432
$$ 15003 33931 85272 99847 90539 104269 93761 99644 111975 99552 26199 23246 5814
19608E814J2400N359L121K2334J5484L505J6080K6646p0931n851O0391J2438n5354
$$ 5814 18214 23573 26694 49028 64512 68017 84097 110743 39812 33961 94352 106790 51436
19595E1436j6052l5686O5247K8832p854O0177m4872l6982k3084R248m5156K7630
$$ 51436 35384 -302 64945 93777 85923 146100 101228 64246 41162 50410 5254 32884
19583C2884p37k8986J0159J5993n73K3864Q352L3831M7222j799l2403k165J5492
$$ 32884 32147 3161 13320 29313 28740 52604 60956 94787 142009 140210 107807 105642 121134
19570A21134N537N1983n8401m2012j2236r702o7023M7869J8773n7983l4039m651
$$ 121134 126671 178654 120253 78241 66005 56303 -10720 37149 55922 -2061 -36100 -40751
19558d0751j8177k7343p348N701O0646O7472K0806J7965M114q741m0451K8304
$$ -40751 -58928 -86271 -93619 -87918 -27272 40200 61006 78971 83085 74344 33893 62197
19546F2197K8950K1276M704l5853l5934N1280P5547l5519n8311L604l0170L9840
$$ 62197 91147 112423 117127 81274 45340 96620 172167 136648 78337 81941 51771 91611
19534I1611l126o719j9698m4916r534l4361j507L5569M431m4901k6255N2751P2269
$$ 91611 88485 81766 62068 17152 7618 -26743 -28250 7319 11750 -33151 -59406 -6655 65614
19521F5614L2470L4983J0711k0275n5169P943l0050n2983k3877J2356l321p239
$$ 65614 98084 133067 143778 123503 68334 76277 46227 -6756 -30633 -18277 -21598 -28837
19509b8837j5976K9464N2006L131k9429J2881P082L2526l6421l0369J9307j760
$$ -28837 -44813 -15349 36657 39788 10359 23240 30322 62848 26427 -3942 15365 13605
19497A3605l6807L6434N5332L724o4091j876r547l1063j5348K4141Q1612J9012
$$ 13605 -23202 13232 68564 72288 8197 6321 -3226 -34289 -49637 -25496 56116 75128
19485G5128k1316k9604k2873L2485M6338K2981j0545K8500m5540K3932K4723o1462
$$ 75128 53812 24208 1335 33820 80158 103139 92594 121094 75554 99486 124209 62747
19473F2747q827L6212L2807K2797J506o2348j27983L2327L8113k7800j4856J8259
$$ 62747 53920 90132 122939 145736 147242 84894 -43089 -10762 27351 -449 -15305 2954
19461B954J18272J8275j7787l2404K7758k5097k0810M0786K9316l1510o0618K6502
$$ 2954 121226 139501 121714 89310 117068 91971 71161 111947 141263 109753 49135 75637
19449G5637Q471m3080L4621J8488P333k5249j9216K4843L7509m5221m4453j8895
$$ 75637 84108 41028 75649 94137 101470 76221 57005 81848 119357 74136 29683 10788
19437A0788L2385N1748l5577l1385J4079p784K0351N912J0645n158L533j1840
$$ 10788 43173 94921 59344 27959 42038 34254 54605 60517 71162 66004 69537 57697
19425E7697n5341k8610N3081M5033m211J8076k5842p2421o197K6550K0511O2308
$$ 57697 2356 -26254 26827 71860 67649 85725 59883 -12538 -18735 7815 28326 90634
19413I0634J9648J8485k1677p800k0845q9408n1544K3147j1833l33K2090P2793
$$ 90634 110282 128767 107090 99290 78445 -10963 -62507 -39360 -51193 -51526 -29436 43357
19401D3357L8123L771j0590L4273k2959k0092Q1083K5136j8053K9722p6976p6369
$$ 43357 81480 85251 74661 108934 85975 65883 146966 172102 154049 183771 106795 30426
19389C0426m680m3008q598M4676N9817L2064m7024n4255K0374J2962o0058o1993
$$ 30426 25746 -17262 -25860 18816 78633 110697 63673 9418 29792 42754 -17304 -79297
19377g9297L3104L9202M9688M5196K3897K2576l4973l5131K2161J7871n5924k1674
$$ -79297 -46193 -6991 42697 87893 111790 134366 99393 64262 86423 104294 48370 26696
19365B6696N662q263M4944k8777l5853M9117L2229L8969O893J5995o861r106m6291
$$ 26696 32358 24095 69039 40262 4409 53526 85755 124724 131617 147612 140751 131645 85354
19352H5354l6533O457J3755m2932p911J5094O1824l995p9743p32M1971k2934O7809
$$ 85354 48821 55278 69033 26101 18190 33284 95108 91113 11370 10638 52609 29675 97484
19339I7484J4585j3371p603l9519p8L6044j4911r099L1167P721J8010R992K6925
$$ 97484 112069 98698 91095 51576 51498 87542 72631 63532 94699 102420 120430 130422 157347
19326A57347k3012l0079L5624J199J81m9989n9047j2888q859L3566L9354Q965
$$ 157347 134335 104256 139880 141079 141260 91271 32224 19336 10477 44043 83397 92362
19314I2362J6973K6082k2018K2140l2230L985L5895j6382O3481L5991k9325K5836
$$ 92362 109335 135417 113399 135539 103309 107294 143189 126807 190288 226279 196954 222790
19302B22790k1880M5999R9105L7842N2180O5455N0766J14443J05895O0953J6176
$$ 222790 200910 246909 346014 383856 436036 501491 552257 666700 772595 833548 849724
19291H49724J2489O2714J4082k8385k8878J4449l5522l8471j15871p3071j2736
$$ 849724 862213 924927 939009 910624 881746 896195 860673 822202 706331 633260 620524
19280F20524k5739m7933R81l3930o7740n7254o1234k1366J1200j9087l4195j5230
$$ 620524 594785 546852 547833 513903 446163 388909 327675 306309 317509 298422 264227 248997
19268B48997n6132n4936K9716K2882k5587l8870Q192K3121J0246K5026J2212m8777
$$ 248997 192865 137929 167645 190527 164940 126070 134262 157383 167629 192655 204867 156090
19256A56090j1772J7216O868k2976m8465p7691o5172N8005L3690O7823M7159m748
$$ 156090 144318 161534 168402 145426 96961 19270 -45902 12103 45793 113616 160775 156027
19244A56027o5408l24l974K3500K0882p698L960K3238J3225k0380n212N4390M057
$$ 156027 90619 90295 86321 109821 130703 123005 126965 150203 163428 143048 137836 192226 196283
19231A96283m9254J9338N2065L0246k3962o1775l8702r448O049K6709k311M7319
$$ 196283 147029 166367 218432 248678 224716 162941 124239 114791 120840 147549 145238 192557
19219A92557j8450O7892j3330m1263j8476p3552j1697J1795j6832J3835J6642
$$ 192557 174107 241999 228669 187406 168930 95378 83681 95476 78644 92479 109121
19208A09121M6051L8523m4207k7978j3021J2877L1380K0109r7M3084o798l1269
$$ 109121 155172 193695 149488 121510 108489 121366 152746 172855 172758 215842 209044 177775
19196A77775k5314K5292L9984P885J7318J16540P2434M7477J8852K4081J4718
$$ 177775 152461 177753 217737 225622 242940 359480 431914 479391 498243 522324 537042
19185E37042J5844O4513J3408J0523j8846J909J00688J08658m3795q8653o906
$$ 537042 552886 617399 630807 641330 622484 624393 725081 833739 789944 701291 694385
19174F94385K3986k241n6632n9528j13654m7692K0147j01349o6201k3795p1235
$$ 694385 718371 716130 659498 599970 486316 438624 458771 357422 291221 267426 196191
19163A96191R606k9270n965L9055l0082m7359K8183K7020J7567k9771q984j465
$$ 196191 205797 176527 170562 209617 179535 132176 160359 187379 204946 175175 166191 164726
19151A64726M4200J2111J5345n4144o2921j2824J9824P5293J5073j4970m5176
$$ 164726 208926 221037 236382 182238 119317 106493 126317 201610 216683 201713 156537
19140A56537m8874k6149R473M6452r353l7929l1567l8219M9087M7737K5720m1539
$$ 156537 107663 81514 90987 137439 128086 90157 58590 20371 69458 117195 142915 101376
19128A01376l375k4923k5248Q034L0882P9809n830m1395o664k4915L6436K4037
$$ 101376 98001 73078 47830 55864 86746 166555 160725 119330 112666 87751 124187 148224
19116A48224r654L5500j5817m8235J082j0480k2989L1302K0565N6193j9577k308
$$ 148224 138570 174070 158253 110018 111100 100620 77631 108933 129498 185691 166114 163806
19104A63806N0206M2093J12610R359k7651k0726P72N385j6516k3644R33K521L0888
$$ 163806 214012 256105 368715 378074 350423 329697 330469 335854 319338 295694 296627 299148 330036
19091C30036j904J1690P476J2307j055j13885K0214N1734J429M3079j5752q3655
$$ 330036 328132 339822 347298 359605 358550 244665 264879 316613 318042 361121 345369 261714
19079B61714k2138L855o7892j7434K9111j3569k5912j1357k723q278j7944L6333
$$ 261714 239576 243431 175539 158105 187216 173647 147735 136378 133655 125377 107433 143766
19067A43766N3683J1375q17l0432K3112l3775j9906L3753Q713J5256k331K5482
$$ 143766 197449 208824 208007 177575 200687 166912 147006 180759 189472 204728 202397 227879
19055B27879N293K5941O4335m611q4594n964K6270J4440M4033R0387N412L4723
$$ 227879 233172 259113 323448 318837 234243 228279 254549 268989 313022 403409 408821 443544
19043D43544q793k7673O6548J215n3459J0905o919o1656Q013J1534J6534r4717
$$ 443544 434751 407078 473626 474841 421382 432287 425368 363712 371725 383259 399793 305076
19031C05076n8340l0834k5987k8234l3P843M3170M0564o4199n5596q3197j061
$$ 305076 246736 215902 189915 161681 161648 169491 212661 253225 189026 133430 50233 49172
19019D9172K6755p1537l8003O0671O5494L7466n113m2474n5381M8784J1204J297
$$ 49172 75927 4390 -33613 27058 92552 130018 124905 82431 27050 75834 87038 88335
19007H8335k3114r475L3790N9265P426r3593m4398O3177M7272Q031J1283J4962
$$ 88335 65221 55746 89536 148801 156227 62634 18236 81413 128685 136716 147999 162961
18995A62961l8184n7004j2919p481k3656k2732L1520K5067m1876P392L3628j7056
$$ 162961 124777 67773 54854 47373 23717 985 32505 57572 15696 23088 56716 39660
18983C9660l5365M7784N9176P7233J0494m779L178q507l4039o6629M1794N6588
$$ 39660 4295 52079 111255 188488 198982 194203 197381 188874 154835 88206 130000 186588
18971A86588J624l0324K6622L1416p7994l5240n612l3390p083K3463R8428M3879
$$ 186588 188212 157888 184510 215926 137932 102692 97080 63690 56607 80070 178498 222377
18959B22377K5311N758q4728n7431l61O269K3297l3335k5843n8952L7946l8767
$$ 222377 247688 253446 168718 111287 110926 117195 140492 107157 81314 22362 60308 21541
18947B1541J3147R4058J3213r170j4913L6452J1265k0068m1857J5106L9510k7319
$$ 21541 34688 128746 141959 132789 117876 154328 165593 145525 103668 118774 158284 130965
18935A30965j7887K9489L2733J0064n611j2166j4100k8798k3685j9161o972J8681
$$ 130965 113078 142567 175300 185364 179753 167587 153487 124689 101004 81843 74871 93552
18923I3552K1677Q1O8217Q439k0523n9734o443m375N8249J5691p272M9818m2582
$$ 93552 115229 115310 183527 191966 171443 111709 105266 100891 159140 174831 167559 217377 174795
18910A74795o5658M5647J4199J6224k5782q668k7479l3305m0867K727J3924L0981
$$ 174795 109137 154784 168983 185207 159425 150757 123278 89973 49106 51833 65757 96738
18898I6738Q375M638M3006L9376l836o8440q661k6739m0636M2122J06217L7893
$$ 96738 105113 109751 152757 192133 188297 119857 111196 84457 43821 85943 192160 230053
18886B30053L415k2663p3749L6682m257j4982P5480N9973k0677j1381m6780n3917
$$ 230053 233468 210805 137056 173738 169481 154499 229979 289952 269275 257894 211114 157197
18874A57197k9283L2706l3938J2363O3140J8906j7k9835j614j2766r706J5843
$$ 157197 127914 160620 126682 139045 202185 221091 221074 191239 189625 176859 167153 182996
18862A82996k3451K0350P4262l8115n2360n4838J9952P7944P3408j3522n8372
$$ 182996 159545 179895 254157 216042 163682 108844 128796 206740 280148 266626 208254
18851B08254l4969M1547L5258k8666m9907l3084M7393J8835p547L8657j3196M3393
$$ 208254 173285 214832 250090 221424 171517 138433 185826 204661 197114 235771 222575 265968
18839B65968K1789K4141j8452k7139j8362k8793K3730L8546O4065Q9332P6340
$$ 265968 287757 311898 293446 266307 247945 219152 242882 281428 345493 434825 511165
18828E11165q784M2510J03448K236p4289J8423L2733k239j913O6847M4534L3973
$$ 511165 502381 544891 648339 650575 576286 594709 627442 625203 623290 690137 734671 768644
18816G68644L3948K417m7006j1515J6721j3765j14297m7470k7954j9425P4596
$$ 768644 802592 805009 758003 746488 763209 749444 635147 587677 559723 540298 614894
18805F14894J7334j3996J4038l008n9458n7047n4928R10P997n5059o4257J6241
$$ 614894 632228 618232 632270 629262 569804 512757 457829 458739 466736 411677 347420 363661
18793C63661L6033M6775R944Q588k4520k4338J2599q166O6304J2231K0206n673
$$ 363661 399694 446469 456413 465001 440481 416143 428742 420576 486880 499111 519317 513644
18781E13644L6271K6045p269l0802k8412m3156l4276K2314K2567N2333O171l827
$$ 513644 549915 575960 568691 537889 509477 466321 432045 454359 476926 529259 535430 531603
18769E31603k4711O4315J06268J42499J28390J60476R0982p1365n4239j03802
$$ 531603 506892 571207 677475 819974 948364 1108840 1199822 1128457 1074218 970416
18759I70416q5761n0512J4023J5134j4106K7642j9918k5612J0653k5080o9022
$$ 970416 884655 834143 848166 863300 849194 876836 856918 831306 841959 816879 747857
18748G47857l3614M1013j6091n6778o3288j7631q54o6947K5626P1354J6444j0782
$$ 747857 714243 755256 739165 682387 619099 601468 600614 533667 559293 630647 647091 636309
18736F36309L0308Q378j9352O2711J3523P6964O9626k8755m898P7917N7040k8164
$$ 636309 666617 674995 655643 718354 731877 808841 878467 849712 844814 922731 979771 951607
18724I51607r397n4203J8041K8983K5562L4946m7285q9380j30918j11627p240
$$ 951607 942210 888007 906048 935031 960593 995539 948254 858874 727956 616329 609089
18713F09089l138n3919j17680k0862k9277M781k5496m5232J2722P1003n4113l5557
$$ 609089 605951 552032 434352 413490 384213 388994 363498 318266 330988 401991 347878 312321
18701C12321L0202o2516m8931M2235j2403j3639M0131L0594j6181K1379P699P875
$$ 312321 342523 280007 231076 273311 260908 247269 287400 317994 301813 323192 330891 338766
18689C38766k6673L1012K1768j3403l707j142p1939n9580J5318L9122O9520L4014
$$ 338766 312093 343105 364873 351470 347763 346621 274682 215102 230420 269542 339062 373076
18677C73076M1611L152l0681n4055N7199m967K7281K461K6095m4018o3962l4041
$$ 373076 414687 417839 387158 333103 390302 385335 412616 415077 441172 397154 333192 299151
18665B99151O8504J56418J1706N6416P0216O8186L3800J7981O1739R1206O2441
$$ 299151 367655 524073 535779 592195 662411 730597 764397 782378 844117 935323 997764
18654I97764j654L1069K7545P1319M8818k2301L7386L124q565K985j2649o9295
$$ 997764 996110 1027179 1054724 1126043 1174861 1152560 1189946 1193070 1184505 1187490 1174841 1105546
18642A105546q5457j01615m0011K3475m5996p8232j0266q2305l5424n6361P993
$$ 1105546 1020089 918474 878463 901938 855942 777710 767444 685139 649715 593354 601347
18631F01347Q235O5265L2502p06j2983O0978L6683k1389K4543k0886J671L4477
$$ 601347 609582 674847 707349 706643 693660 754638 791321 769932 794475 773589 775260 809737
18619H09737R190J7479J5124k4042m4355J7508O3688Q377N4696O4996R411N883
$$ 809737 818927 836406 851530 827488 783133 800641 864329 872706 927402 992398 1001809 1007692
18607A007692L5213k084o0525O595Q4176O1064J2297n864L3493P1501J3262j4286
$$ 1007692 1042905 1040821 980296 986891 1071067 1132131 1144428 1138564 1172057 1243558 1256820 1242534
18595A242534j8262K7559J06003P8945M2381K6796J0380K202L7709m2650O8855
$$ 1242534 1224272 1251831 1357834 1436779 1479160 1505956 1516336 1518538 1556247 1513597 1582452
18584A582452J53210O2656J15196J18603M8103R0581J07368J68209J58171J49262
$$ 1582452 1735662 1798318 1913514 2032117 2080220 2170801 2278169 2446378 2604549 2753811
18574B753811J33724J94498J87692J67159K32654K00015K17907K28265J88419
$$ 2753811 2887535 3082033 3269725 3436884 3669538 3869553 4087460 4315725 4504144
18565D504144K22990K45795K96919L02102L27936K94613L68273M50413N42192
$$ 4504144 4727134 4972929 5269848 5571950 5899886 6194499 6562772 7013185 7555377
18556G555377O29848N39352O14040P24201Q03774R42632J133409J429932J660284
$$ 7555377 8185225 8724577 9338617 10062818 10866592 11809224 12942633 14372565 16032849
18547A6032849K069519K617991L169553M033974M983161O243583P498269Q394349
$$ 16032849 18102368 20720359 23889912 27923886 32907047 39150630 46648899 55043248
18539E5043248Q954803Q982290Q428467P562302O916508O708639O466015N974150
$$ 55043248 63998051 72980341 81408808 88971110 95887618 102596257 109062272 115036422
18531A15036422M888079K912129L55357k167970m119561n330469n921141o305815
$$ 115036422 119924501 122836630 123191987 121024017 116904456 111573987 105652846 99347031
18523I9347031o890426p589057q486838r102763r224401q810556p918911o838102
$$ 99347031 92456605 84867548 76380710 67277947 58053546 49242990 41324079 34485977
18515C4485977n592815m477045l569203k862453k227171j756533j474402j197222
$$ 34485977 28893162 24416117 20846914 17984461 15757290 14000757 12526355 11329133
18507A1329133r88536q37670p04071o33147n13864m83563n43969m57708l68484
$$ 11329133 10340597 9502927 8798856 8165709 7651845 7168282 6624313 6166605 5798121
18498E798121k93086k33581k22208k74249k30690k40256k80688k22559k10976
$$ 5798121 5505035 5271454 5049246 4774997 4544307 4304051 4023363 3800804 3589828
18489C589828j80728k43339k37570j41494j88887j38537j39576r7445r3533n0867
$$ 3589828 3409100 3165761 2928191 2786697 2597810 2459273 2319697 2222252 2128719 2077852
18479B077852n5785q7796j58769j48570j10854m8633r2633m4652n518j7492k2926
$$ 2077852 2022067 1934271 1775502 1626932 1516078 1467445 1374812 1330160 1324642 1307150 1284224
18468A284224j4163l3219P002n2490l9615q0507j00758L9171J05803R3901O5298
$$ 1284224 1270061 1236842 1243844 1191354 1151739 1071232 970474 1009645 1115448 1209349 1274647
18457A274647l0564l6434L9929o99n7774m3417j25530r7002o6048n4546k5701
$$ 1274647 1244083 1207649 1247578 1246879 1189105 1145688 1020158 923156 857108 802562 776861
18446G76861L0366K0897o3027k1379j2546j7718l8178r787j363K0579k5549J9368
$$ 776861 807227 828124 765097 743718 731172 713454 675276 665489 664126 684705 659156 678524
18434F78524Q7078R4417J9135M3273P9356L8391l6980Q09o1189o6199K4010j8711
$$ 678524 765602 860019 879154 922427 1001783 1040174 1003194 1004003 942814 876615 900625 881914
18422H81914p6489j8728l2297M2605R6951P3368K3571R4463N0690o5286L58N9652
$$ 881914 805425 786697 754400 797005 893956 967324 990895 1085358 1136048 1070762 1071120 1130772
18410A130772K8595M3224L2797l001o2338o4574n8605m4882p3513m4918l9604
$$ 1130772 1159367 1202591 1235388 1232387 1170049 1105475 1046870 1001988 928475 883557 843953
18399H43953l2565j01613p5267L6913l028m0225o3796k5226L9681r0788p4141
$$ 843953 811388 709775 634508 671421 668393 628168 564372 539146 578827 488039 413898
18388D13898R2125J02673P5912J29256R3160O3154P0800Q2564P5685k0761k2724
$$ 413898 506023 608696 684608 813864 907024 970178 1040978 1123542 1199227 1178466 1155742
18377A155742o2466j46569j62153j12771n8536m8520j2862J791j06391l3972Q3474
$$ 1155742 1093276 946707 784554 671783 613247 564727 551865 553656 447265 413293 496767
18366D96767m006j1929j1891p128J5887p8086j0619M1295N769L3582j8863p111
$$ 496767 492761 480832 468941 461813 477700 399614 388995 430290 436059 469641 450778 443667
18354D43667K8941q1968p0936j5920n807j04667o2011L2004N2394m4586m8007
$$ 443667 472608 390640 319704 303784 297977 193310 131299 163303 215697 171111 123104
18343A23104k4707p7934j05906j13796M33N7098l621r429J03471J10501L3245
$$ 123104 98397 20463 -85443 -199239 -198806 -141708 -145329 -154758 -51287 59214 92459
18332I2459P1391Q5219L5483m7502p6692L159O212J7454l8370j9515O234M5187
$$ 92459 163850 249069 284552 237050 160358 163517 169729 187183 148813 129298 135532 180719
18320A80719J4491q86r895M0542p632J1591m4632r42Q6526j1940l0496K6703M102
$$ 180719 195210 194324 184429 224971 217339 228930 184298 183356 269882 257942 227446 254149 258251
18307B58251M3798Q6387J7431m1504L2891K2447K4966N657N063N2279J45668Q5733
$$ 258251 302049 388436 405867 364363 397254 419701 444667 450324 455387 507666 653334 739067
18295G39067L7383l9413j44217k19606j13252k0769j7337l4096K9349L9057k1196
$$ 739067 776450 737037 592820 373214 259962 239193 221856 187760 217109 256166 234970
18284B34970k6545m8111J5847R084J8581j888j375K5471J396N876R444o3070K0604
$$ 234970 208425 160314 176161 185245 203826 201938 200563 226034 227430 233306 242750 179680 200284
18271B00284N3739P3424Q561k0349l1537k1445j9656k6778L3963m815m7065l9802
$$ 200284 254023 327447 336008 315659 284122 262677 243021 216243 250206 245391 198326 158524
18259A58524K1883l6365j9463N1086M0075j4604q860J6283N732K5899Q543J4509
$$ 158524 180407 144042 124579 175665 215740 201136 192276 208559 214291 240190 248733 263242
18247B63242J4241N7025k8402o1506J5045O0095K9737J2167l5034k6706o557k4587
$$ 263242 277483 334508 306106 244600 259645 319740 349477 361644 326610 299904 293347 268760
18235B68760K7644r225n62l9824Q2224N2539K2483n057n8277j4059J5584o7471
$$ 268760 296404 287179 286617 246793 329017 381556 404039 398982 340705 326646 342230 274759
18223B74759M704K9152O3729J7902l9380K7358n2689m8283J5897l0008M8549P9902
$$ 274759 279463 308615 372344 390246 350866 378224 325535 277252 293149 263141 311690 391592
18211C91592q08Q740L3873K5891O5690p5076p0039J6667n8817j5558l4503M0718
$$ 391592 390784 399524 433397 459288 524978 449902 379863 396530 337713 322155 287652 328370
18199C28370N678N5826K5479l959N918J5132j3890m4412r646L3825N7300J0671
$$ 328370 334048 389874 415353 411394 417312 432444 418554 374142 364496 398321 455621 466292
18187D66292J2618k0775j8284k7951P479O9864K1443L7070k9692m2965k4071k98
$$ 466292 478910 458135 439851 411900 419379 489243 510686 547756 518064 475099 451028 450730
18175D50730K75K0904K3159p75J528K1846J2684j7050L6875K7491o1723k5444
$$ 450730 451005 471909 495068 494293 495821 517667 530351 513301 550176 577667 515944 490500
18163D90500k5151J4884Q4617O1811L5006M7586P9880L3329m6522k6597n9588
$$ 490500 465349 480233 564850 626661 661667 709253 789133 822462 775940 749343 689755
18152F89755j5715N1002N2022J3614L0386l29M5830J12251Q3318P9838L9817k9916
$$ 689755 674040 725042 777064 790678 821064 820735 866565 978816 1062134 1141972 1181789 1151873
18140A151873Q890J66326J07127P3267J19756J19220R0301J46887J08793j8944
$$ 1151873 1160763 1327089 1434216 1507483 1627239 1746459 1836760 1983647 2092440 2073496
18130B073496M2700R9258J19590J76489J53163J16681J98832J81502J07144K3696
$$ 2073496 2116196 2215454 2335044 2511533 2664696 2781377 2980209 3161711 3268855 3292551
18120C292551J16987K04816J67131K54823L20065L92215P03755J086392J610296
$$ 3292551 3409538 3614354 3781485 4036308 4356373 4748588 5452343 6538735 8149031
18111H149031K325695L402907N685516J0381519K0579671L8288529L1405860j4241749
$$ 8149031 10474726 13877633 19563149 29944668 50524339 88812868 120218728 105976979
18103A05976979k1392683k1795722k2166486j5028893q726871n138038l140773
$$ 105976979 84584296 62788574 40622088 25593195 16866324 11728286 8587513
18096H587513k007746j327241j007830o78544m18443l65919l61938l63422k06374
$$ 8587513 6579767 5252526 4244696 3566152 3147709 2781790 2419852 2056430 1850056
18087A850056p7627o0223o5936j00645n2480m5241L3004K4314j1324k5593n212
$$ 1850056 1772429 1712206 1646270 1545625 1493145 1447904 1480908 1505222 1493898 1468305 1463093
18076A463093P0668M7806P8891O8776J6715J0734n6640j34372j92588j85094j81749
$$ 1463093 1533761 1581567 1660458 1729234 1745949 1756683 1700043 1565671 1373083 1187989 1006240
18065A006240j82629p2323m3795J2015p141N055K9317k7494l2712o6718k7927
$$ 1006240 823611 751288 707493 719508 712367 717422 746739 719245 686533 619815 591888
18054E91888r453j6309n913M266K085r365K7096l150J049M1503K4792j7407j6176
$$ 591888 582435 566126 560213 564479 566564 557199 584295 581145 582194 623697 648489 631082 614906
18041F14906l8162Q429P578K6404o222j4067N3918N0453n740k3189Q6311M5856
$$ 614906 576744 585173 592751 619155 612933 598866 652784 703237 697497 674308 760619 806475
18029H06475J0636L9480K2681O1162J11753O4218O5241n998r920o8122R266k4788
$$ 806475 817111 856591 879272 940434 1052187 1116405 1181646 1175648 1165728 1097606 1106872 1082084
18017A082084m6534j11827O160J6541J01499J07363J2206P885L0959L2559L6844
$$ 1082084 1035550 923723 929883 946424 1047923 1155286 1167492 1175377 1206336 1238895 1275739
18006A275739K2977j0447m3407j7408o196p3492o0945o0618n7313j9291k7390
$$ 1275739 1298716 1288269 1244862 1227454 1221258 1147766 1086821 1026203 968890 949599 922209
17995I22209o7975o8041j4809l9069j829l6188l9851J2651m1372K5305j2534M2499
$$ 922209 854234 786193 771384 732315 730486 694298 654447 667098 625726 651031 638497 680996
17983F80996P5133j3076q8819j298O8643N4200J9067L1471L3754K966o3896k4967
$$ 680996 756129 743053 654234 652936 721579 775779 794846 826317 860071 863037 799141 774174
17971G74174P1007J3261l5583j6781J4267N084K9796R2493R4081J63665K02799
$$ 774174 845181 858442 822859 806078 820345 825429 855225 947718 1041799 1205464 1408263
17960A408263J93996J24642J21840P5998N2225k1052k3508J3680J7062K7333J32156
$$ 1408263 1602259 1726901 1848741 1924739 1976964 1955912 1932404 1946084 1963146 1990479 2122635
17949B122635J18830J34522J81798J83175K16080L11329L13454L60859N55494
$$ 2122635 2241465 2375987 2557785 2740960 2957040 3268369 3581823 3942682 4498176
17940D498176Q37841J126972J631524K543695L929857O340425R464646J1655572
$$ 4498176 5336017 6462989 8094513 10638208 14568065 20908490 30373136 42028708
17932D2028708J1846855Q222387L917987j540757p532136j0443659j1052781r491814
$$ 42028708 53875563 62097950 66015937 64475180 56943044 46499385 35446604 25954790
17924B5954790p308504n048440l296203k265565j568113j066410p00327m86543
$$ 25954790 18646286 13597846 10301643 8036078 6467965 5401555 4701228 4214685
17916D214685m87535n30359n064K32239K16700K60371K87593K38107J50016J66200
$$ 4214685 3727150 3196791 3191727 3423966 3640666 3901037 4188630 4426737 4576753 4742953
17906D742953K6042K704R6138J56339J29032J19593J38556J69318K49603L75391
$$ 4742953 4768995 4771699 4867837 5024176 5153208 5272801 5411357 5580675 5830278 6205669
17896F205669M92065N89926P39821R80372J402560J855265K770972M198667O548656
$$ 6205669 6697734 7287660 8027481 9007853 10410413 12265678 15036650 19235317 25783973
17887B5783973J0196506J4452934J8202149K0204022J8957504J6278713Q650781
$$ 25783973 35980479 50433413 68635562 88839584 107797088 124075801 132726582
17880A32726582j761732q781233j5359433j9424241j9445746j7280552j3489307
$$ 132726582 130964850 122183617 106824184 87399943 67954197 50673645 37184338
17873C7184338r781260o704553m478590l068878k036046j482469j019913p02030
$$ 37184338 27403078 20698525 16219935 13151057 11115011 9632542 8612629 7910599
17865G910599m34586k43205j84248K2679R9656J14039K05712K40887J99100J71754
$$ 7910599 7476013 7232808 7048560 7071239 7170895 7284934 7490646 7731533 7930633 8102387
17855H102387J83910K72643K37622J64398J49034J65377J63061J48456K08450
$$ 8102387 8286297 8558940 8796562 8960960 9109994 9275371 9438432 9586888 9795338
17846I795338L48611M58766O04978P84814R97817J392627K050438K992047M500506
$$ 9795338 10143949 10602715 11207693 11992507 12990324 14382951 16433389 19425436 23925942
17837B3925942O987047J0700556J4252502J5962811J3757359Q821914L509230
$$ 23925942 30912989 41613545 55866047 71828858 85586217 94408131 97917361
17830I7917361m126522r062218j0122017q134208l726149J078647N609894Q617810
$$ 97917361 93790839 84728621 74606604 66472396 62746247 63824894 69434788 78052598
17822G8052598R252060P703873N545624M951820O185097Q260341R390950P882074
$$ 78052598 87304658 95008531 100554155 105505975 111691072 119951413 129342363 137224437
17814A37224437L473552k200297o726142q591535p848322o280140n743430p114983
$$ 137224437 140697989 138497692 131771550 123180015 115331693 109051553 103308123 96193140
17806I6193140r619030j1529071j2050775j1334025r758134p914448o301281m879757
$$ 96193140 86574110 75045039 62994264 51660239 41902105 33987657 27686376 22806619
17798B2806619l705293k852136k192131j735461j473947j237687r64761p18376
$$ 22806619 19101326 16249190 14057059 12321598 10847651 9609964 8645203 7926827
17790G926827n70898n38617m38976l11610l30603k31396k11529k55887j50614
$$ 7926827 7355929 6817312 6378336 6066726 5736123 5504727 5293198 5037311 4886697
17781D886697k07149k45512j60216j89777j53439j52056j89513k13785j82184
$$ 4886697 4679548 4434036 4273820 4084043 3930604 3778548 3589035 3375250 3193066
17772C193066j36489j36390o0989o8983j67592m9592l2528p5025p3791l2355P2299
$$ 3193066 3056577 2920187 2859198 2790215 2622623 2573031 2540503 2465478 2391687 2359332 2431631
17761B431631r690r7020n5552q3931j25689n2158q7510p0128l461p4043j31380
$$ 2431631 2421941 2324921 2269369 2185438 2059749 2007591 1920081 1849953 1846492 1772449 1641069
17750A641069n0921o8947j9951l3918j28765p8786j0657p2721p9783p5776n1177
$$ 1641069 1590148 1521201 1501250 1467332 1338567 1259781 1249124 1176403 1096620 1020844 969667
17739I69667k0499L8188P5304R2667O7596J26133P6596n4161o1893O089M1965
$$ 969667 949168 987356 1062660 1155327 1222923 1349056 1425652 1371491 1309598 1315687 1357652
17728A357652J4021p0289P6215N1726q402K4670m2924k5478n5695j16465j39872
$$ 1357652 1371673 1301384 1377599 1429325 1420923 1445593 1402669 1377191 1321496 1205031 1065159
17717A065159r6597r2022m4020j3363m8237k8478m2364q2140r2559M157J7606
$$ 1065159 968562 876540 832520 819157 770920 742442 700078 617938 525379 529536 547142
17706E47142J0401l4534P3232R2943N289p85l3820p5319q3751k9477J0345m4173
$$ 547142 557543 523009 596241 689184 694473 693688 659868 584549 500798 471321 481666 437493
17694D37493j49241p8559p2683j04831r3979M1730J5220M9120Q0955P0925J3235
$$ 437493 288252 209693 137010 32179 -61800 -20070 -4850 44270 125225 196150 209385
17683B09385L6732L7719M4140K4092N4173J6999J4119N675L1097K798k5284K6002
$$ 209385 246117 283836 327976 352068 406241 423240 437359 443034 474131 476929 451645 477647
17671D77647k558R209M1464L0666l739m6036m536Q8619K9761l1267J0224J7526
$$ 477647 475089 484298 525762 556428 552689 506653 502117 590736 620497 589230 599454 616980
17659F16980k0335o921N5286K3429L8232l72m4384N9977N1591K9312L6683J4234
$$ 616980 596645 589724 645010 668439 706671 706299 661915 721892 773483 802795 839478 853712
17647H53712n1180p6629j55101j37028l1118L5808j1594l442J5667N9090j9434
$$ 853712 802532 725903 570802 433774 402656 438464 426870 423428 439095 498185 478751
17636D78751J7427L3945K108l6261n7695j5805k6286K1070K6233L002O2994q069
$$ 478751 496178 530123 532231 495970 438275 422470 396184 417254 443487 446489 509483 501414
17624E01414o124n0593p621M9311Q6490J52385Q3830L639J9242J1975M0583J2414
$$ 501414 495290 444697 437076 486387 572877 725262 809092 812731 831973 843948 884531 896945
17612H96945O30R9723J29585j2381Q779j9296K0217P2259P401l8265J3639J5721
$$ 896945 897575 997298 1126883 1114502 1123281 1103985 1124202 1196461 1203862 1165597 1179236 1194957
17600A194957k8967L7504J6991K1994J4161j6194J6511M4163O6746N0447R6761
$$ 1194957 1165990 1203494 1220485 1242479 1256640 1240446 1256957 1301120 1367866 1418313 1515074
17589A515074M6288N7271K9075O2647R6706J08816N4941m827N3234P4914N1724
$$ 1515074 1561362 1618633 1647708 1710355 1807061 1915877 1970818 1965991 2019225 2094139 2145863
17578B145863L0189J16779J00915J07501Q2501J02912J91803K00082J47844J02318
$$ 2145863 2176052 2292831 2393746 2501247 2583748 2686660 2878463 3078545 3226389 3328707
17568C328707K00294J93551K39569L54148M12027L55659L38081M31263L78891
$$ 3328707 3529001 3722552 3962121 4316269 4728296 5083955 5422036 5853299 6232190
17559F232190M02687M90660N25993P26906Q39651Q70470R19079J187780J471432
$$ 6232190 6634877 7125537 7651530 8378436 9218087 10088557 11007636 12195416 13666848
17550A3666848J871668K407283L260938M390243N885743Q037373J0412168J2226572
$$ 13666848 15538516 17945799 21206737 25596980 31482723 39520096 49932264 62158836
17542F2158836J2362591R859025N691800K327306J586802L870489Q376793J2718004
$$ 62158836 74521427 84380452 90072252 92399558 93986360 97856849 106233642 118951646
17534A18951646J3775519R221940N44043p802697j2753696j3042427j0083880
$$ 118951646 132727165 141949105 142493148 134690451 121936755 108894328 98810448
17527I8810448n944772k854555k830601n483276q815368j0972153j1274512j0179860
$$ 98810448 92865676 90011121 87180520 81697244 72881876 61909723 50635211 40455351
17519D0455351q432313o569268m959145l682418k709009k008146j520361j131691
$$ 40455351 32023038 25453770 20494625 16812207 14103198 12095052 10574691 9443000
17511I443000r48253p98802o48177n38349m64088l58537l72143k98841l11477
$$ 9443000 8494747 7695945 7047768 6509419 6045331 5686794 5314651 5015810 4704333
17502D704333k40668j75976j81234k04114k45487l01944k00011j76568k14674
$$ 4704333 4463665 4287689 4106455 3902341 3656854 3354910 3154899 2978331 2763657
17493B763657q3694q2929j06382k04973k38491j73892j69958j31233j38538n9761
$$ 2763657 2679963 2597034 2490652 2285679 2047188 1873296 1703338 1572105 1433567 1373806
17483A373806p8530p5991l4467o7582m2132j8167k2043q3328k2375N220o3960
$$ 1373806 1295276 1219285 1184818 1117236 1075104 1056937 1034894 951566 929191 934411 870451
17472H70451j8504O547l0791r2611J0612P865L1799J3261O1547O975P207J8803
$$ 870451 851947 858494 827703 735092 745704 753569 785368 798629 860176 867151 874358 893161
17460H93161k1263l7785k1954J9391L3278k1442K2502l3548m7097J9473M4629
$$ 893161 871898 834113 812159 831550 864828 843386 865888 832340 785243 804716 849345
17449H49345J5164o9663J6598L0239m2182Q613J7778J6995O961P151K04943M774
$$ 849345 864509 794846 811444 841683 799501 808114 825892 842887 849848 856999 1061942 1066716
17437A066716k10372j29533o0501k6958m6274Q042M826m6212J8782O2230R6217
$$ 1066716 856344 726811 666310 639352 593078 601120 605946 559734 578516 640746 736963
17426G36963M2217m1915l1885R945l6951o8199n6313r2326p5030K4683L8787m1932
$$ 736963 779180 737265 705380 715325 678374 610175 553862 461536 386506 411189 449976 408044
17414D08044n3485p2199K9430J20381M48o3969K2675P1492J8975l360k3799k2548
$$ 408044 354559 282360 311790 432171 432619 368650 391325 462817 481792 478432 454633 432085
17402D32085o5746l3391j0611M6109k672j3377J6110O886N9265P016k2435p8055
$$ 432085 366339 332948 322337 368446 365774 352397 368507 375393 434658 441674 419239 341184
17390C41184p6862m0719n724M6187R1362L2466P2590K2035M8220P3023J44715
$$ 341184 264322 223603 217879 264066 355428 387894 460484 482519 530739 603762 748477
17379G48477J29619J09477K1399O439r0601n2606o3255l9939o0119q2173m8331
$$ 748477 878096 987573 1008972 1015411 924810 872204 808949 769010 708891 626718 578387
17368E78387q6595p7621N067k695j7979L8779M3704l9285j2917K2344j1928n5283
$$ 578387 491792 414171 419238 416543 398564 437343 481047 441762 428845 451189 439261 383978
17356C83978n5664m6821r103L2625p7839r4047o1060m7062K7624L5757l8856j25665
$$ 383978 328314 281493 272390 305015 227176 133129 72069 25007 52631 88388 49532 -76133
17344g6133o5038r6929p1606J9121Q6462J1989O2747J2244o7420p9678M505J44441
$$ -76133 -141171 -238100 -309706 -290585 -204123 -192134 -129387 -117143 -184563 -264241 -259736 -115295
17332a15295J68279J00163J05337R1231Q9845O5425k5467q9186k2744m8410n7200
$$ -115295 52984 153147 258484 349715 439560 504985 479518 390332 367588 319178 261978
17321B61978l9212K3333L7580O8788l0644L2745M9252L4230k2456n063N1960K8419
$$ 261978 222766 246099 283679 352467 321823 354568 403820 438050 415594 410531 462491 490910
17309D90910M309N524M5368Q1142O039O2485K7521k7538L077j4362K5803k1836
$$ 490910 495219 500743 546111 627253 633292 695777 723298 695760 698837 684475 710278 688442
17297F88442j7916n605j7910l7705j7803L7230m9042p4353M2017K6395l1328k3948
$$ 688442 670526 664921 647011 609306 591503 628733 579691 505338 547355 573750 542422 518474
17285E18474L1474K0331m2515m166M526n9786o2999m7457n0246J2538j344J284
$$ 518474 549948 570279 527764 523598 528124 468338 405339 357882 307636 320174 318830 320114
17273C20114J9047k7985M0256K2635q844O4124K2558O7033J3012L3916J02973
$$ 320114 339161 311176 351432 374067 365223 429347 451905 518938 531950 565866 668839
17262F68839J17750j9868Q167N5649L6194J8204l163j7661K1565M5009P6652N1840
$$ 668839 786589 766721 774888 830537 866731 884935 881772 864111 885676 930685 1007337 1059177
17250A059177k1810l098J9876l8748p9668l410K5399p1302o2002R85N62k8479
$$ 1059177 1037367 1034269 1054145 1015397 935729 932319 957718 886416 824414 825399 825961 797482
17238G97482n4358L0951Q2509K5961J2219N4701j29092o3640J6067l7325j3667
$$ 797482 743124 774075 856584 882545 894764 949465 820373 756733 772800 735475 721808
17227G21808n6749Q445m5033j0001P952L9726Q7802R1716J43203P5865k266O9243
$$ 721808 665059 673504 628471 618470 626422 666148 753950 845666 988869 1064734 1062468 1131711
17215A131711Q7174L8676J07347J16215J35109M6148m6147r9143q4800m2963M884
$$ 1131711 1218885 1257561 1364908 1481123 1616232 1662380 1616233 1517090 1432290 1389327 1394211
17204A394211M1904J9038J6602M3836L0054n7608l7373n4210q2862j9624J6013
$$ 1394211 1436115 1455153 1471755 1515591 1545645 1488037 1450664 1396454 1313592 1293968 1309981
17193A309981j6266n1180l0728j7065Q393m123k5769l1539K6499r222l0982q2236
$$ 1309981 1293715 1242535 1211807 1194742 1203135 1199012 1173243 1141704 1168203 1158981 1127999 1045763
17181A045763q3171k7897m1704k7300p2610K5754J5417l6532o5650o1361j9965
$$ 1045763 962592 934695 892991 865691 793081 818835 834252 797720 732070 670709 650744
17170F50744j7838L86n9578j7522L023J8929L9555J31287Q7216K8364L5393O3376
$$ 650744 632906 633292 573714 556192 559215 578144 617699 748986 836202 864566 899959 963335
17158I63335j959m9546M0162N9566N678K9903K7551R000J9809J03523M9900l91
$$ 963335 961376 911830 951992 1011558 1017236 1047139 1074690 1083690 1103499 1207022 1256922 1256531
17146A256531O1824M5967L3923J8672L4413N5641L7153M3542Q8932P5274J02724
$$ 1256531 1318355 1364322 1398245 1416917 1451330 1506971 1544124 1587666 1676598 1751872 1854596
17135A854596J06723P0818J45171J20990J04169J29654J09809J31187J11088J70685
$$ 1854596 1961319 2032137 2177308 2298298 2402467 2532121 2641930 2773117 2884205 3054890
17125C054890J69066K31782L61251L99354M56824O23131Q99686J258604J781165
$$ 3054890 3223956 3455738 3816989 4216343 4673167 5296298 6195984 7454588 9235753
17116I235753K767214M342161N784217N803654O442694O996576L440941K311650
$$ 9235753 12002967 16345128 22129345 27932999 34375693 41372269 44813210 47124860
17108D7124860L322088J260900O57488K437486n64396l661651k790753l450483
$$ 47124860 50446948 51707848 52365336 54802822 54238426 50576775 47786022 44335539
17100D4335539k685997n0525J051101L261803M467131J341271J386162K329384
$$ 44335539 41649542 41599017 42650118 45911921 50379052 51720323 53106485 55435869
17092E5435869j59779k0765J459404k697297n652034n403035p429273q020994
$$ 55435869 55276090 55255325 56714729 54017432 48365398 42962363 35533090 27512096
17084B7512096o500749n126150l769453k455383j548213r90287o71731n08459
$$ 27512096 21011347 15885197 12115744 9660361 8112148 7121861 6450130 5941671
17076E941671k70991j39719n2180J4401J49886K33631L14587M99543P00961J046879
$$ 5941671 5670680 5530961 5478781 5493182 5643068 5876699 6191286 6690829 7391790 8438669
17066H438669J680907K716564M260246N225881M980797O101029N721129K076721
$$ 8438669 10119576 12836140 17096386 22322267 27303064 33404093 39125222 41201943
17058D1201943K061493K374115J21190N56913J607973j726914l087306k320439
$$ 41201943 43263436 45637551 45758741 46315654 47923627 46196713 43109407 40788968
17050D0788968k805880j348420P06754J578507L925935L786960N79350J414601
$$ 40788968 37983088 36634668 37341422 38919929 42845864 46632824 47212174 48626775
17042D8626775J323244j017592L5094N64322l683109m955046n024208o965541
$$ 48626775 49950019 48932427 48967521 49531843 45848734 40893688 35869480 28903939
17034B8903939o635441n245019m129461k863973j901241j218597p76482m85451
$$ 28903939 22268498 17023479 12894018 10030045 8128804 6910207 6133725 5648274
17026E648274k50139j51706p3940o058Q6088J55840J66954K50961L32507M03774
$$ 5648274 5398135 5246429 5172489 5166431 5252519 5408359 5575313 5826274 6158781 6562555
17016F562555O10791R89781J537850K397743L770165M895979M129890L288116
$$ 6562555 7173346 8163127 9700977 12098720 15868885 20764864 24894754 28182870
17008B8182870N052033P447719O047688K543670K051431J829351L040313M777770
$$ 28182870 33234903 40682622 46730310 49273980 51325411 53154762 56195075 60972845
17000F0972845M393883j128568k064761J624517L967287O5974l325475l355848
$$ 60972845 65366728 64238160 62173399 63797916 67765203 67831177 64505702 61149854
16992F1149854l454182k412850j458499l211719o864640o245811m629946m329646
$$ 61149854 57695672 55282822 53824323 50612604 43747964 37502153 32872207 28542561
16984B8542561n053548m635960l845065l125632k207518j475941r29836n95161
$$ 28542561 23489013 18853053 15007988 11882356 9674838 8198897 7269061 6673900
16976F673900m46344k78787o3428J8103O8809R6439K68934M06138O04158R46074
$$ 6673900 6227556 5948769 5885341 5903444 5972253 6068692 6337626 6743764 7347922 8293996
16966H293996J458088K320863L584634M303657L194837L046898N126665O841997
$$ 8293996 9752084 12072947 15657581 19961238 23156075 26202973 31329638 38171635
16958C8171635M385996J924993J753613J836943L160876M729891K891131k018620
$$ 38171635 42557631 44482624 46236237 48073180 51234056 55963947 58855078 56836458
16950E6836458j120919K457030L389647j268770l074598l095272k769019j866257
$$ 56836458 55715539 58172569 61562216 60293446 57218848 54123576 51354557 49488300
16942D9488300j304693l977811o527203n193127m033172m253377m721852m113775
$$ 49488300 48183607 44205796 37678593 32485466 28452294 24198917 19477065 15363290
16934A5363290l351005k653443j915016j360703r85805p07838m75638l14515k70058
$$ 15363290 12012285 9358842 7443826 6083123 5097318 4389480 3913842 3599327 3329269
16925C329269k37098k09763k37058k38848k30377k38180j59514j00117r2695j51514
$$ 3329269 3092171 2882408 2645350 2406502 2176125 1937945 1778431 1678314 1585619 1434105
16915A434105j37023j03611m0113j2886p2979j34403j14521j8466l6990m9781
$$ 1434105 1297082 1193471 1153358 1140472 1067493 933090 818569 800103 763113 713332
16905G13332M773M9968l7211m1137j07755j94290n6589k7228l1146j8646K272
$$ 713332 718105 768073 730862 689725 581970 387680 331091 303863 272717 254071 256343
16894B56343l8985O1798M2710K088K7947n503j7492j0768q1098r6944k7721j6480
$$ 256343 217358 279156 321866 323954 351901 346398 328906 318138 237040 140096 112375 95895
16882I5895J7654K3030J9294m834J8467j0367n1117j0843q904J1678l2814k8747
$$ 95895 113549 136579 155873 151039 169506 159139 108022 97179 88275 99953 67139 38392
16870C8392q9399o439P3269K8707r753K8453m4949l4737n4541J9769J1169N193
$$ 38392 -51007 -57446 15823 44530 34777 63230 18281 -16456 -70997 -51228 -40059 -34866
16858c4866L6220K4308o5292p0325k3485K7320L5571N8009l8686n9228K467j5498
$$ -34866 1354 25662 -39630 -109955 -133440 -106120 -70549 -12540 -51226 -110454 -107987 -123485
16846a23485m019P1526O6880N9096K033K5892K2812j5292k4986k191K0909K1988
$$ -123485 -127504 -55978 10902 69998 72031 97923 120735 105443 80457 78266 99175 121163
16834A21163l0170K7197K6523L237L2930N7668k1771l9265K9904N6712k2135M8648
$$ 121163 90993 118190 144713 147950 180880 238548 216777 177512 207416 264128 241993 290641
16822B90641j5607k2786r699l9111n1586m7949q8764K5701J13627P3504l5628
$$ 290641 275034 252248 242549 203438 151852 103903 15139 40840 154467 227971 192343
16811A92343m6542p0587n6908r182n5170n7816M3480J00112N9055k7707k8010
$$ 192343 145801 75214 18306 9124 -46046 -103862 -60382 39730 98785 71078 43068
16800D3068k1379j8170N4441M3574O5400K9995K1997M6236O62n4503j40J1866
$$ 43068 21689 3519 57960 101534 166934 196929 218926 265162 265824 211321 211181 223047
16788B23047J9402J9127r310L3150M4353L3357K3853P5852n094k5944K3854J19680
$$ 223047 242449 261576 252266 285416 329769 363126 386979 462831 457737 431793 455647 575327
16776E75327L6570l712k1060K3529J6963M806j3532m094n606L1035R6586L7959
$$ 575327 611897 608185 587125 610654 627617 632423 618891 614797 609191 640226 736812 774771
16764G74771N37l511r0172K0944Q6046K1883N4664L8243J37740J62764R8536M3216
$$ 774771 775308 771797 681625 702569 788615 810498 865162 903405 1041145 1203909 1302445 1345661
16752A345661J45219J76650K07957K40847K71360K02768K59521L42306L80074
$$ 1345661 1490880 1667530 1875487 2116334 2387694 2590462 2849983 3192289 3572363
16743C572363L92693L69642L81441M19335M87452P45147J025280J380952J900453
$$ 3572363 3965056 4334698 4716139 5135474 5622926 6368073 7393353 8774305 10674758
16734A0674758K831903M242607N948948O350107O310593Q169381R312470P225989
$$ 10674758 13506661 17749268 23698216 30048323 36358916 44528297 53840767 61066756
16726F1066756L618021M069908L273539j033230j586375K63624P80344R48233
$$ 61066756 64684777 68754685 72028224 70994994 69408619 69672243 70452587 71400820
16718G1400820M569653P574899N934024M179985P569170O227853k18882m324190
$$ 71400820 75970473 83545372 89479396 93659381 101228551 107456404 107237522 102913332
16710A02913332l182965m692483r012039q221308n648512m923132m242785j083479
$$ 102913332 99730367 95037884 86025845 77804537 72156025 67232893 62990108 61906629
16702F1906629O32950r11723k016739o59463k911574o130119o766427o198952
$$ 61906629 62539579 61627856 59611117 58951654 56040080 49909961 43143534 36944582
16694C6944582o360256o679681n630462m479911l463098k456539j626483j096639
$$ 36944582 30584326 23904645 18274183 13794272 10331174 7874635 6248152 5151513
16686E151513q35890o54614m59728l15291k71968k65583k02881k30545k95430
$$ 5151513 4315623 3661009 3201281 2885990 2614022 2348439 2145558 1915013 1619583
16677A619583k04670j41888j60629j73049j77494j12179q1277m9308p2597n5953
$$ 1619583 1414913 1273025 1112396 939347 761853 649674 568397 519089 446492 390539
16667C90539k1986k7596l237L870q0835n7106O159N0765l1893o3500j1876j7896
$$ 390539 368553 340957 337720 341590 260755 203649 209808 260573 228680 165180 153304 135408
16655A35408M9204K6228k3265l1088k8705k1215m0297L0434l084k2966K3707j2316
$$ 135408 184612 210840 187575 156487 127782 106567 66270 96704 93620 70654 94361 82045
16643H2045o865l6709m6281l8996J7173l0080L3455O7598L1924j1839o9908q4231
$$ 82045 75180 38471 -7810 -46806 -29633 -59713 -26258 41340 73264 61425 -8483 -92714
16631i2714N300M662k6863J652K9656O9876K9613L3283N4290k1628J1326m623
$$ -92714 -87414 -82752 -109615 -107963 -78307 -8431 21182 54465 108755 87127 98453 93830
16619I3830n1428k9871L5746k6817j3650N4773Q4617O7645N1485J2365J8668m4667
$$ 93830 42402 12531 48277 21460 7810 62583 147200 214845 266330 278695 297363 252696
16607B52696m6079J4769J6095n635m0480l962o914l0852j8644L1017L5709r5907
$$ 252696 206617 221386 237481 231846 191366 187404 180490 149638 130994 162011 197720 101813
16595A01813J7563L2320j4774K6995m2259O108M8415k0224q4854J1781Q29K3737
$$ 101813 119376 151696 136922 163917 121658 127766 176181 155957 71103 82884 83713 107450
16583A07450l5618m6818q661q525q3113n2661R170L3217j2433m5614j6562O4807
$$ 107450 71832 25014 16353 7828 -75285 -127946 -118776 -85559 -97992 -143606 -160168 -95361
16571i5361M8346O5258k797l7141k4826P4230M1073p502j473o721P9801M1499
$$ -95361 -47015 18243 15446 -21695 -46521 27709 68782 61280 59807 53086 132887 174386
16559A74386K4846k8475Q240L232J6324j4659K4976o942j9917j3688m3886n0526
$$ 174386 199232 170757 178997 182229 198553 183894 208870 201928 182011 168323 124437 73911
16547G3911L7794L4286O7317j8635l8946L9529J2119k6958k9306l2417l9295l4650
$$ 73911 111705 145991 213308 194673 155727 195256 207375 180417 151111 118694 79399 44749
16535D4749p4318k5017m6881q4749l8030p784m1356n9573j4408p6009O783r1838
$$ 44749 -29569 -54586 -101467 -186216 -224246 -232030 -273386 -332959 -347367 -423376 -416593 -508431
16523e08431o2039J0340N7785l6145J311L6839l654M3281N3274m962M2565k329
$$ -508431 -570470 -560130 -502345 -538490 -537179 -500340 -503994 -460713 -407439 -412401 -369836 -372165
16511c72165m5111L3787M7527q767m3632j823l2719M7174R6205J16628M1396M1530
$$ -372165 -417276 -383489 -335962 -344729 -388361 -390184 -422903 -375729 -279524 -162896 -121500 -79970
16499g9970M3164J0171L1343Q50L8603P5028q125l277J2659l1168J3176K3547
$$ -79970 -36806 -26635 4708 5558 44161 119189 111064 107787 120446 89278 102454 126001
16487A26001Q489j2070l5206K6991N4742J81n0997j31230n6016q363n250M0644
$$ 126001 134490 122420 87214 114205 168947 169128 118131 -13099 -69115 -77478 -82728 -42084
16475d2084k8443p8888k9847J8370Q23K2203k2102m7244m5813J8056L8475P5583
$$ -42084 -70527 -149415 -179262 -160892 -160069 -137866 -159968 -207212 -253025 -234969 -196494 -120911
16463a20911N2504p3467l7485J2060l7406o028O7110J9665p9472K9057Q5351L9857
$$ -120911 -68407 -141874 -179359 -167299 -204705 -210733 -143623 -123958 -203430 -174373 -89022 -49165
16451d9165K5749N2484Q423k4057j1848L7081P3187N3993j9339m5992j6246k4251
$$ -49165 -23416 29068 37491 13434 1586 38667 111854 165847 146508 100516 84270 60019
16439F0019P2838J4254M0770m2287n1317P030j492j3074k3715J6370n011o3332
$$ 60019 132857 147111 187881 145594 94277 101307 99815 86741 63026 79396 74385 11053
16427A1053m9101K5099j3575p7889m5705p679Q2634J3521l4310j429J4852j9499
$$ 11053 -38048 -12949 -26524 -104413 -150118 -157797 -75163 -61642 -95952 -97381 -82529 -102028
16415a02028l8678K3778J2791n1862r225J5648K5813p7387n1719L3720J08725
$$ -102028 -140706 -116928 -104137 -155999 -165224 -149576 -123763 -201150 -252869 -219149 -110424
16404a10424O4144q591o773K0394q9144j03312J9782N433K1010P3570J8477K7565
$$ -110424 -46280 -54871 -61644 -41250 -130394 -233706 -213924 -208491 -187481 -113911 -95434 -67869
16392f7869K035j8918l1504K5095k2121k3444o3694l3831O3273k490L309M8563
$$ -67869 -65834 -84752 -116256 -91161 -113282 -136726 -200420 -234251 -170978 -173468 -170159 -121596
16380a21596m6809p8834O5983K1109k1744j9167M6735j598k155l9271J0544k044
$$ -121596 -168405 -247239 -181256 -160147 -181891 -201058 -154323 -155921 -158076 -197347 -186803 -188847
16368a88847J4235Q6692J0134m0301j6474L3256j3906J9718L0997j7384J4257
$$ -188847 -174612 -87920 -77786 -118087 -134561 -101305 -115211 -95493 -64496 -81880 -67623
16357f7623J0880K057L63J6141k0672J6343J9818j3633m232K8328Q530p9559N593
$$ -67623 -56743 -54686 -54323 -38182 -58854 -42511 -22693 -36326 -40558 -12230 -3700 -83259 -77666
16344g7666L7062J739m6669m7068J0315K4283j47k0141J3047p664J1011l9572
$$ -77666 -40604 -38865 -85534 -132602 -122287 -98004 -98151 -118292 -105245 -112909 -101898 -141470
16332a41470l5801l106m5801M2623N5914P998l3502L6111J7910P2294J165p6049
$$ -141470 -177271 -180377 -226178 -183555 -127641 -119643 -153145 -117034 -99124 -26830 -25665 -101714
16320a01714k3876j5423o0843Q55L352M0444J2133M9538L7861o4246k6866M0342
$$ -101714 -125590 -141013 -201856 -201001 -197649 -157205 -145072 -95534 -57673 -121919 -148785 -108443
16308a08443j5508L9390m664K0906m271k9001k6523j2757k6830K256J6751l919
$$ -108443 -123951 -84561 -89225 -68319 -72590 -101591 -128114 -140871 -167701 -165445 -148694 -152613
16296a52613k350P935K2898l5899J7442j7021L9775o749K1360k5804J6833M9323
$$ -152613 -154963 -147028 -124130 -160029 -142587 -159608 -119833 -126582 -105222 -131026 -114193 -64870
16284f4870J9361J5739l8970J8433M7187k5993j1947N187m415J4499k3345n9992
$$ -64870 -45509 -29770 -68740 -50307 -3120 -29113 -41060 -35873 -40288 -25789 -49134 -109126
16272a09126M4476J2970j5595k5258N26n0843J61K9333L5374K1336l633k10p233
$$ -109126 -64650 -51680 -67275 -92533 -92007 -142850 -142689 -113356 -77982 -56646 -60279 -60489 -67722
16259f7722O032m814m5224l794M639K5187J0340k0103J636M6482k9712l1037n9887
$$ -67722 -61690 -66504 -111728 -115522 -110883 -85696 -75356 -95459 -93823 -47341 -77053 -108090 -167977
16246a67977k5115N4360K1228P8717K9396M1148L2714j5348j5323P5255P8946
$$ -167977 -193092 -138732 -117504 -38787 -9391 31757 64471 49123 33800 109055 188001
16235A88001l633N5312P2225q158p8830r31N8459N8880j1038L562K1900K9745
$$ 188001 184368 239680 311905 303747 224917 223986 282445 341325 330287 333849 355749 385494
16223C85494K8704O2554J169k5722o466k2698n5352k6841n3477l3159K5851N8637
$$ 385494 414198 476752 477921 452199 445733 423035 367683 340842 287365 254206 280057 338694
16211C38694r869l6117m8960M5380J637o0277o7535m5193r1851p1117K4502l9833
$$ 338694 328825 292708 243748 289128 290765 230488 162953 117760 25909 -45208 -20706 -60539
16199f0539O021l582j618J2842k6487k5126j4192l1138n1045L3573Q0489L5996
$$ -60539 -54518 -58100 -59718 -46876 -73363 -98489 -112681 -143819 -194864 -161291 -80802 -44806
16187d4806J7785l3856l5385L0775m9062j2426O4244j8281P134P0562j1950o5866
$$ -44806 -27021 -60877 -96262 -65487 -114549 -126975 -62731 -81012 -73878 -3316 -15266 -81132
16175h1132k2169K8414m9779L3117P3755O0745k9227l4803k979k2264o9040m031
$$ -81132 -103301 -74887 -124666 -91549 -17794 42951 13724 -21079 -24058 -46322 -115362 -119393
16163a19393k2944Q946k6025l0138L4240K5667O4804K7441J227j0794k1310K5266
$$ -119393 -142337 -133391 -159416 -189554 -155314 -129647 -64843 -37402 -36175 -46969 -68279 -43013
16151d3013J2197R488J7197l4656j21500p7763L4876N5537N3598L0597l4145k7737
$$ -43013 -30816 -21328 -4131 -38787 -160287 -238050 -203174 -147637 -94039 -63442 -97587 -125324
16139a25324J7377m243q8703k485K7165K3902o963k7489O1650Q3900N1127m5796
$$ -125324 -107947 -112190 -200893 -203378 -176213 -152311 -159274 -186763 -125113 -41213 9914 -35882
16127c5882k6500J4210o6067j3105N2557M8146N219K6505n2689n3094j8061P791
$$ -35882 -62382 -48172 -114239 -127344 -74787 -26641 -21422 5083 -47606 -100700 -118761 -110970
16115a10970K9316k4417p904k3690k6719K0311P5269m970j169M4332L6052j0707
$$ -110970 -81654 -106071 -113975 -137665 -164384 -144073 -68804 -73774 -74943 -30611 5441 -5266
16103e266l3341j0035N877Q112r76J3814l633j1490j5938J3450j5843r892L0236
$$ -5266 -38607 -48642 -42765 -34653 -35629 -21815 -25448 -36938 -52876 -39426 -55269 -65161 -34925
16090c4925K4506n7325M4063M1014p5703R923K319p784K9358p962N2181j2390
$$ -34925 -10419 -67744 -23681 17333 -58370 -48447 -46128 -53912 -24554 -32516 19665 7275
16078G275K820K8255q728k5858j37306n4914M7321L7053J1559P4499N946J4686
$$ 7275 10095 38350 29622 3764 -133542 -188456 -141135 -104082 -92523 -18024 -12078 2608
16066B608J6302p9056o0836L1136k3411r572O4201K8414L828k4409k0002m7735
$$ 2608 18910 -60146 -120982 -89846 -113257 -122829 -58628 -30214 -26386 -50795 -70797 -118532
16054a18532k939J3408K18K6386K1502j7368o1363P1085K4043k005P7587m4427
$$ -118532 -121471 -108063 -107845 -81459 -59957 -77325 -138688 -67603 -43560 -45565 32022 -12405
16042a2405j7557r476j25685j229J3625P8317j2781q556j6064P018L5526j2875
$$ -12405 -29962 -39438 -165123 -166352 -152727 -74410 -87191 -95747 -111811 -104793 -69267 -82142
16030h2142J8925K7500K1001L313l1869m6495o0182n7181k5190J02995M0743l6060
$$ -82142 -63217 -35717 -14716 -11403 -43272 -89767 -149949 -207130 -232320 -129325 -88582 -124642
16018a24642K36K9563L3103j1457m7598J7387P3739K864p700o44j5039O109O6889
$$ -124642 -124406 -94843 -61740 -73197 -120795 -103408 -29669 -26805 -34505 -35149 -50188 -44079 22810
16005B2810O820p6406m6852K8822M584k5352K1022j1124k0638j933m7509j1845
$$ 22810 29630 -46776 -93628 -64806 -60222 -85574 -64552 -75676 -96314 -98247 -145756 -157601
15993a57601K4775M2520L2007J9538L5517p439j7665j6183k4318J7079k3344O64
$$ -157601 -132826 -90306 -58299 -38761 -3244 -10683 -28348 -44531 -68849 -51770 -75114 -74450
15981g4450K8216m2576k2938j9239L3207L7769N460k8684K2100M5659n8210j7463
$$ -74450 -46234 -88810 -111748 -130987 -97780 -60011 -54551 -83235 -61135 -15476 -73686 -91149
15969i1149n15K2119M5886J2378J4985k5553l4424l2940N37l5708j0197k913L0110
$$ -91149 -91664 -69545 -23659 -11281 3704 -21849 -56273 -89213 -88676 -124384 -134581 -137494 -107384
15956a07384j4142L5943o862K9391N4841N6500l0655p5917m0283N7072O8517L7098
$$ -107384 -121526 -85583 -92445 -63054 -8213 48287 17632 -58285 -98568 -41496 27021 64119
15944F4119L437K708L4861k2695l8829o7721m5241L0294K8730N1518J2918q150
$$ 64119 67556 70264 105125 82430 43601 -24120 -69361 -39067 -10337 41181 54099 45949
15932D5949J409O5152j7001p2365l7712n7623M1129K0939k7079l7042j4422q755
$$ 45949 47358 112510 95509 23144 -14568 -72191 -31062 -10123 -37202 -74244 -88666 -97421
15920i7421l027L8389L8212M060q924J3547M596l2410l8216r948K1530Q463p7668
$$ -97421 -100448 -62059 -23847 -19787 -28711 -15164 -10568 -42978 -81194 -91142 -69612 -61149 -138817
15907a38817o1519P0093M0037L8058N295k1382j7304N9265m3464p8269k5609M8501
$$ -138817 -200336 -130243 -90206 -52148 -46853 -68235 -85539 -26274 -69738 -148007 -173616 -125115
15895a25115L0231J5231K0153P8715M0937l133k0756J0860J1844k4308p9178q569
$$ -125115 -94884 -79653 -59500 19215 60152 57019 36263 47123 58967 34659 -44519 -53088
15883e3088M234R9261P050m104k1711r142M736L6955R945L989k7901m7578n1148
$$ -53088 -48854 50407 57457 53353 31642 22500 27236 64191 74136 78125 50224 2646 -48502
15870d8502o5613N9351N4255l5572k2058k552K1456P5443K0153n2659K7279k6302
$$ -48502 -114115 -54764 -509 -36081 -58139 -60691 -39235 36208 56361 3702 30981 4679
15858D679q9533m2346R6282R2803O1201K4506k1611p9908p9631j9789K5530Q1893
$$ 4679 -84854 -127200 -30918 61885 123086 147592 125981 46073 -33558 -53347 -27817 54076
15846E4076N0709p6879k3097m8733j1949j4170k9405j1016M1764j4329O4790P675
$$ 54076 104785 27906 4809 -43924 -55873 -70043 -99448 -110464 -68700 -83029 -18239 -10564
15834a0564L9046K4723m7113k7754k6124q190P7391N6705K4685q0488o6961j5090
$$ -10564 28482 53205 6092 -21662 -47786 -55976 21415 78120 102805 22317 -44644 -59734
15822e9734K7145J5388J5832O7706r0q6434J8981k6271j6896L5372j1381l8191
$$ -59734 -32589 -17201 -1369 66337 66247 -20187 -1206 -27477 -44373 -9001 -20382 -58573
15810e8573j7507O4480k9130r375Q7581l8438k8913k8512k4031M3751k1015M2185
$$ -58573 -76080 -11600 -40730 -50105 37476 -962 -29875 -58387 -82418 -38667 -59682 -17497
15798a7497K3098m3370J6840k414J0480J2376o215j5497k2762l5904m0695K2692
$$ -17497 5601 -37769 -20929 -23343 -12863 -487 -6702 -22199 -44961 -80865 -121560 -98868
15786i8868k3816k1795k1914o726l42J0176j1463P2902N2436P8003n7177n5361
$$ -98868 -122684 -144479 -166393 -173119 -173461 -163285 -174748 -101846 -49410 28593 -28584 -83945
15774h3945J7038o517L0037L6706l3334l7854M6440j2435n1337j7575K2561L8361
$$ -83945 -66907 -73424 -43387 -6681 -40015 -77869 -31429 -43864 -95201 -112776 -90215 -51854
15762e1854K3875J8764l0098j1582M3350L3424K4877k0791j1117K1415j867l7745
$$ -51854 -27979 -9215 -39313 -50895 -7545 25879 50756 29965 18848 40263 38396 651
15750F51o442K4143J5163j6871N2803K7365n5859j765J9597K5486l7641l3307
$$ 651 -5791 18352 33515 16644 69447 96812 40953 39188 58785 84271 46630 13323
15738A3323l375j3022P147n0259Q717M4684R900O1408K1989l8249m0783J2496
$$ 13323 9948 -3074 4073 -46186 -37469 7215 17115 78523 100512 62263 21480 33976
15726C3976m0216n4078J4k631l2738k351K1127M1086J4263L6357K6167L0871k8684
$$ 33976 -6240 -60318 -60304 -62935 -95673 -98024 -76897 -35811 -21548 14809 40976 71847 43163
15713D3163j15230k7722J5401J13294O3301l6413k1825j5340l9053L007j6591
$$ 43163 -72067 -99789 -84388 28906 92207 55794 33969 18629 -20424 -17417 -34008
15702c4008K019O6434L1683P9224n402j03704l5819K6780M315k7820m6828m4438
$$ -34008 -31989 34445 66128 145352 139950 36246 427 27207 31522 3702 -43126 -87564
15690h7564L4583J9741l2422J2151k1096n658J13246J24133J4479n6079k5612
$$ -87564 -52981 -33240 -65662 -53511 -74607 -80265 32981 157114 171593 115514 89902
15679H9902p167k7682j9037n1276m1616Q5012L1156l0721m4831R2282k1296p9275
$$ 89902 82735 55053 36016 -15260 -56876 28136 59292 28571 -16260 76022 54726 -24549
15667b4549K4778L5894O076N4482L1264l9547o6449o0286j0432L6732l1887N4060
$$ -24549 229 36123 42199 96681 127945 88398 21949 -38337 -48769 -12037 -43924 10136
15655A0136N4730L8136o4106k8125K4389O5849J8900n5012k8930Q374q529K0720
$$ 10136 64866 103002 38896 10771 35160 101009 119909 64897 35967 44341 35812 56532
15643E6532m3060l5139N3934j1274l7747K2990m28Q876J0880k5888K6181L7011
$$ 56532 13472 -21667 32267 20993 -16754 6236 5808 14684 25564 -324 25857 62868
15631F2868J5054q016L5216m1918o086Q822l9745m7337j4667r035l2199K7244
$$ 62868 77922 69906 105122 63204 57118 65940 26195 -21142 -35809 -44844 -77043 -49799
15619d9799K7791L6193j5286K557M2123N9244L2791J4767o5052n55l4796m4082
$$ -49799 -22008 14185 -1101 1456 43579 102823 135614 150381 85329 84774 49978 5896
15607E896M3699m5564j256O2909J1961l4779j7234K8227M35K3604K6319k180n8334
$$ 5896 49595 4031 2775 65684 77645 42866 25632 53859 54294 77898 104217 102037 43703
15594D3703l4145k9786o0788L8930k0993n4917O5774P9861j0643o5462J2659L2115
$$ 43703 9558 -20228 -81016 -42086 -63079 -117996 -52222 27639 16996 -48466 -35807 -3692
15582c692j0556p07J4705M5048N5619J8971o732K1736n5715p0856j8639K1410
$$ -3692 -14248 -14955 -250 44798 100417 119388 112656 134392 78677 7821 -10818 10592
15570A0592o4728p5463J21961P9402J6700J8223J1929k4915p9298k3915N743J6051
$$ 10592 -54136 -129599 -7638 71764 88464 106687 118616 93701 14403 -9512 -3769 12282
15558A2282j5100M78K5699J1243P308K3981o5153J1417J9387m783p513L7341K0063
$$ 12282 -2818 -2340 23359 34602 41910 65891 738 12155 31542 26759 19246 56587 76650
15545G6650p7294l6904L9182r381J0865o8238K0654P8078O305R390N2154k0020
$$ 76650 -644 -37548 1634 -7747 3118 -65120 -44466 33612 39917 49307 101461 81441
15533H1441J2163p081l0018r1424N155O9185M2774j5065r5045k2373l099J9876
$$ 81441 93604 86523 56505 -34919 -29764 39421 82195 67130 -27915 -50288 -53387 -33511
15521c3511M1464J5618n631L0943M0878k931J3879p169J5999K0687J1266k9571
$$ -33511 7953 23571 17940 48883 89761 86830 100709 93540 109539 130226 141492 111921
15509A11921l3409l6364N2673M538l2177j0885j1611l5906K8355l7208L8402Q4841
$$ 111921 78512 42148 94821 99359 67182 56297 44686 8780 37135 -73 38329 123170
15497A23170k0025l8647o1078J838m346K487J6712p1629k7103O1159L7571l8394
$$ 123170 103145 64498 3420 5258 912 3399 20111 -51518 -78621 -17462 20109 -18285
15485a8285P83O809j7585Q500P778j9286k7229N1232K5279L330K5940L0590P454
$$ -18285 -17502 -10693 -28278 -19778 -12000 -31286 -58515 -7283 17996 21326 47266 77856 85310
15472H5310n3520J3811k9127O7315j7800j3874q689n2380K2277J797K9465J4539
$$ 85310 31790 45601 16474 83789 65989 52115 43426 -8954 13323 15120 44585 59124
15460E9124n5660j3723K0829k5209n3665M9932P0005k1284j0562P00l7953l3372
$$ 59124 3464 -10259 10570 -14639 -68304 -18372 51633 30349 19787 20487 -17466 -50838
15448e0838M6202K6569N9784p184l2266n4375k7674M1398K3294L7917q088m1493
$$ -50838 -4636 21933 81717 74533 42267 -12108 -39782 1616 24910 62827 54739 13246
15436A3246k7604N6525L1959l8665o6818k3209J6141p4321k0231N7785O4977J9267
$$ 13246 -14358 42167 74126 35461 -31357 -54566 -38425 -112746 -132977 -75192 -10215 9052
15424I052K2445O2949l645m2487n0109m204M4634l948m1246k711O236J8922k5808
$$ 9052 31497 94446 90801 48314 -1795 -5999 38635 34687 -6559 -9270 -3034 15888 -9920
15411i920k204J0805k7810N883O4771n6058n1331l5014K9546O4974M1334m3267
$$ -9920 -12124 -1319 -29129 -23246 41525 -14533 -65864 -100878 -71332 -6358 34976 -8291
15399h291L7750L2958L9660k2397m952j6813J0268k1009l330R0590J961J0727
$$ -8291 29459 62417 102077 79680 74728 57915 68183 47174 43844 134434 136395 147122
15387A47122J5843n7832k2828J0258j3454o4322j4305j4341M6425L8210L2237
$$ 147122 162965 105133 82305 92563 79109 14787 482 -13859 32566 70776 103013
15376A03013Q021j597k914k3757k0455M2869L5632o3828r458l9119M738N9455
$$ 103013 111034 109437 106523 82766 62311 105180 140812 76984 67526 28407 33145 92600
15364I2600k684k1242K5681N0522J7184n9183N899J3300o5823n7272J2445K3727
$$ 92600 89916 68674 94355 144877 162061 102878 108777 122077 56254 -1018 11427 35154
15352C5154J5708p7771l1285O8267L7936J1693M2951j5770l9815k5616j9853j1317
$$ 35154 50862 -26909 -58194 10073 48009 59702 102653 86883 47068 21452 1599 -9718
15340i718O5451M9352m2785p1119n3483R283N0183N3979q209j8236k4746N5048
$$ -9718 55733 105085 62300 -8819 -62302 -53019 -2836 51143 42934 24698 -48 55000
15328E5000O8453P029p6702M0599j1135q17O5286p012m7138q0892j2580l3222
$$ 55000 123453 130482 53780 94379 83244 82427 147713 140701 93563 12671 91 -33131
15316c3131m8723M2102L2609L381j9588N637J1035o058k012P386L0517M5487R2237
$$ -33131 -81854 -39752 -7143 -3762 -23350 -17713 -6678 -12736 -14748 -7362 23155 68642 160879
15303A60879j6471K6391K785J0700n2773k8661N5434m438n1200n1154J3383K4139
$$ 160879 144408 170799 173584 184284 131511 102850 158284 153846 102646 51492 64875 89014
15291H9014j643l8741l2078M3486Q144l2842k1776J003J2516L0548J2943Q658
$$ 89014 87371 48630 16552 60038 68182 35340 13564 14567 27083 57631 70574 79232
15279G9232j7932p452M1791k1130M100l584n4438p686j6243K0790O1178N7638
$$ 79232 61300 53848 95639 74509 78609 75025 20587 12901 -3342 17448 78626 136264
15267A36264K3490M7956p8514j01329P3138J1081m397L754J3509K5596L7428l1166
$$ 136264 159754 207710 129196 27867 101005 112086 107689 111443 124952 150548 187976 156810
15255A56810n5315m0688m763L0427K185j4687M6656L4783k6650o0696j0769Q7877
$$ 156810 101495 60807 56044 86471 88656 73969 120625 155408 128758 68062 57293 145170
15243A45170M9880m1733k1046p264p3819j2688J2720M7768L0013m0562l9975j8432
$$ 145170 195050 153317 132271 125007 51188 38500 51220 98988 129001 88439 48464 30032
15231C0032r138L675L005M5742M7712K0287J3154J432q2578l9719L9906J5979
$$ 30032 20894 24569 27574 73316 121028 141315 154469 155901 73323 33604 73510 89489
15219H9489O1441N3695L2574l8324m2839m8161k2735J0548l8176k7310M9330J752
$$ 89489 150930 204625 237199 198875 156036 107875 85140 95688 57512 30202 79532 81284
15207H1284q657l7597p842j993K4022M4672l3732j9630P609O9729k9306k0035
$$ 81284 72627 35030 27188 25195 49217 93889 60157 40527 48136 117865 88559 68524
15195F8524K1935J8172l8255p560K681M6457N6602j7188j9689K6174r444K469
$$ 68524 90459 108631 70376 62816 65497 111954 168556 151368 131679 157853 148409 150878
15183A50878M0599K8648m2374n4855m8188K1268p4340J8299Q0707K2939L389j652
$$ 150878 191477 220125 177751 122896 74708 95976 21636 39935 120642 143581 146970 145318
15171A45318J381L0874k4548m4777m384K8454k8770m0328J7987J7030j8612K9011
$$ 145318 146699 177573 153025 108248 103864 132318 103548 63220 81207 98237 79625 108636
15159A08636qk2044j3496Q144k0694r993j2998J3532j0154L5327P3846K8588K0866
$$ 108636 108628 86584 73088 81232 60538 50545 37547 51079 40925 76252 150098 178686 199552
15146A99552L3091n6898m6904k2055j5050K3991j0006l3393N8474J1022l8155
$$ 199552 232643 175745 128841 106786 91736 115727 105721 72328 130802 141824 103669
15135A03669L3666K4872M7380l7470q1517q404k4716M835j574L7212L5651m1720
$$ 103669 137335 162207 209587 172117 90600 82196 57480 62315 60741 97953 133604 91884
15123I1884o9163Q3534K6258m2279p212K5342k5954N8315O1346k4977j5357N3719
$$ 91884 22721 106255 132513 90234 83022 108364 82410 140725 202071 177094 161737 215456
15111B15456n0760p0729K9387L4087j03030p431L1487r033P448M2974Q1823l4362
$$ 215456 164696 93967 123354 157441 54411 46980 78467 69434 76882 119856 201679 167317
15099A67317k5571j8526K866l9302j4388J9471M2341j4402K25M9366M8551J57
$$ 167317 141746 123220 126086 86784 72396 91867 134208 119806 120031 169397 217948 218105
15087B18105R407m324o6047n1039m0157j1893N2641O9325k9727n8618n3325L7591
$$ 218105 227512 223188 157141 106102 65945 54052 106693 176018 146291 87673 34348 71939
15075G1939J8357j7310M9460Q9869j4286j0475j3623j8992o0769J8137j6562J8051
$$ 71939 90296 72986 122446 212315 198029 187554 173931 154939 94170 112307 95745 113796
15063A13796P465l6056j4067J219l7951J8905M6259J9482j1378R2189N1613m6781
$$ 113796 121261 85205 71138 72357 34406 53311 99570 119052 107674 199863 251476 204695
15051B04695k2124k0478o8949M7006L2307j7660P968L6113N426o4847O0165K7517
$$ 204695 182571 162093 93144 140150 172457 154797 162765 198878 204304 139457 199622 227139
15039B27139J361L2198k1537o5916p7133j9282N4785N7154K0142j7620k9568J3703
$$ 227139 228500 260698 239161 173245 96112 76830 131615 188769 208911 191291 161723 175426
15027A75426P357j3668k1599j8605j5862J2064N2692N159K5948K2681m2901j7082
$$ 175426 182783 169115 147516 128911 113049 125113 177805 182964 208912 231593 188692 171610
15015A71610l0603o4139M3588R3112N0002J6179L2673q299n2717l1247m1270k201
$$ 171610 141007 76868 120456 213568 263570 279749 312422 304123 251406 220159 178889 176688
15003A76688M5081P3457k7785R72P5433L0958M715n90O7569L6918K6029M6643
$$ 176688 221769 295226 267441 268413 343846 374804 379519 378929 446498 483416 509445 556088
14991E56088R8139J84570J93900J95965K70935K57364J73696Q3308J16864J22655
$$ 556088 654227 838797 1032697 1228662 1499597 1756961 1930657 2013965 2130829 2253484
14981B253484K2602m3576j95882k43431j90190k02660k07095j18477j49621k30160
$$ 2253484 2276086 2232510 2036628 1793197 1603007 1400347 1193252 1074775 925154 694994
14971F94994j37460o4848o3681p2809o9499m2096o4137M163M0534J4277o919m812
$$ 694994 557534 492686 429005 356196 286697 244601 180464 184627 225161 239438 232519 227707
14959B27707k4849K2658m156m70m5026j6722Q9772M4903m8293p0081o0277K3280
$$ 227707 202858 225516 221360 220890 175864 159142 248914 293817 245524 175443 115166 138446
14947A38446J4209j0171Q803l4941J8696O2208K9395j2296l4621m0362P8593M2958
$$ 138446 152655 142484 151287 116346 135042 197250 226645 214349 179728 139366 217959 260917
14935B60917o6547k7121J7580R264o92J2470O6706j3693k2913l045Q387M193J8221
$$ 260917 194370 167249 184829 194093 193401 205871 272577 258884 235971 232926 241313 245506 263727
14922B63727j3763n2179K5243L0448l920o098J701J6546L1700j1240M2963L0119
$$ 263727 249964 197785 223028 253476 249556 243458 245159 261705 293405 282165 325128 355247
14910C55247l265j7208j222L1203r4835n6677j3042o8529L4920Q9286P4138k437
$$ 355247 351982 334774 333552 364755 269920 213243 200201 131672 166592 255878 330016 327579
14898C27579m3547J3406M4121j704L7359R2051K8374P145O4960P6494k2808n9049
$$ 327579 284032 297438 341559 339855 377214 469265 497639 504784 569744 646238 623430 564381
14886E64381n03L9492P7772R1926K06802J30222J03890J30931J80240J41335K21729
$$ 564381 563878 603370 681142 773068 979870 1110092 1213982 1344913 1525153 1666488 1888217
14875A888217K09054N9811m8347q1978m3018j38860k44283j63409j27584k29236
$$ 1888217 2097271 2157082 2108735 2026757 1983739 1844879 1600596 1437187 1309603 1080367
14865A080367k07523j44591j1423K8469o8511n1661m957K747j01545j01348J558
$$ 1080367 872844 728253 716830 745299 676788 625127 620170 622917 521372 420024 421582
14854D21582l8861o131j8542k0222k7124k6761j4936M1779P4828j8681K8766M963
$$ 421582 382721 376590 358048 337826 310702 283941 269005 310784 385612 366931 395697 400660
14842D00660l9984j2243J9445J3112M3701o5531l5511M8816L7645L2304j6207
$$ 400660 360676 348433 367878 380990 424691 359160 323649 372465 410110 442414 426207
14831D26207L736J9870q3740J0914P3134o307k5018J6319j4380k7672Q257K8749
$$ 426207 429943 449813 366073 376987 450121 443814 418796 435115 420735 393063 401320 430069
14819D30069o3196o3482R8161Q1330k9132M4195L1973l7305m3680m5740M6J1374
$$ 430069 366873 303391 401552 482882 453750 497945 529918 492613 448933 403193 403239 414613
14807D14613l3317K8553L9052K8273n15K878N167P3862R3522L7894K5090k3918
$$ 414613 381296 409849 448901 477174 476659 479537 484704 558566 652088 689982 715072 691154
14795F91154l3586m6195K9285N0778M0142q113l0929j07744j4609k3818j1250
$$ 691154 657568 611373 640658 691436 731578 723465 692536 584792 570183 546365 535115
14784E35115K7350k3444k9623l3121K7540o9632j7392M847j165Q712n2341L3532
$$ 535115 562465 539021 509398 476277 503817 434185 416793 421640 420475 429187 376846 410378
14772D10378J63724R5282m3715m608Q161L0374j6306n491M132n2982J3575L6738
$$ 410378 574102 669384 625669 621061 629222 659596 643290 637799 641931 588949 602524 639262
14760F39262k0493l4612J0896J12762k9893O982Q5512L0993O9449J30537r532
$$ 639262 618769 584157 595053 707815 677922 684904 770416 801409 870858 1001395 991863
14749I91863R092Q5903J06857J68805O6597Q3708P2299J67945J52978K34241J81593
$$ 991863 1000955 1086858 1193715 1362520 1429117 1512825 1585124 1753069 1906047 2140288 2321881
14738B321881J27121J31060N8971m5555j01594j45686j61912k40264l49099l26778
$$ 2321881 2449002 2580062 2639033 2593478 2491884 2346198 2184286 1944022 1594923 1268145
14728A268145k71948j51096j42042j72981j64065o7573M7098J3686L3719O2398
$$ 1268145 996197 845101 703059 530078 366013 298440 345538 359224 392943 455341
14718D55341j043m4506O847j1694k9431M5921O3340L8974j7759K6773K1921n3920
$$ 455341 454298 409792 416639 404945 375514 421435 484775 523749 505990 532763 554684 500764
14706E00764K5454P0787p2274J0983O458l8777o6279p089N3547O9310j640r1131
$$ 500764 526218 597005 524731 535714 542172 503395 437116 430027 483574 552884 551244 460113
14694D60113m4408K0291J3263L2947M0349K719K7993L763N3601M7711J5898k0004
$$ 460113 415705 435996 449259 482206 522555 525274 553267 557030 610631 658342 674240 654236
14682F54236N6601M5288M2689j735N3818P5125J3193L9489O6700N6215N2702Q2572
$$ 654236 710837 756125 798814 797079 850897 926022 939215 978704 1045404 1101619 1154321 1236893
14670A236893Q988k1562L1618M2118R920L8876l9697m1215q8654l1772l7696m7411
$$ 1236893 1245881 1224319 1255937 1298055 1307975 1346851 1307154 1265939 1177285 1145513 1107817 1060406
14658A060406J0754o9730m4060J9087J7192M97M761M338K5172o8425J4251R5438
$$ 1060406 1071160 1001430 957370 976457 993649 994146 998907 1003245 1028417 959992 974243 1069681
14646A069681K3209l7418j354K1649K5531K5927K8195L3824l6767j5893J552o0035
$$ 1069681 1092890 1055472 1054118 1075767 1101298 1127225 1155420 1189244 1152477 1136584 1138136 1078101
14634A078101Q1621M7644j4649q882l192l709L927n184P0648K6559J8394n524
$$ 1078101 1159722 1207366 1192717 1183835 1180643 1176934 1180861 1175677 1246325 1272884 1291278 1285754
14622A285754m5830J0335O9577P4870M1576N3286K6316J9660N3653R5462R4817
$$ 1285754 1239924 1250259 1319836 1394706 1436282 1489568 1515884 1535544 1589197 1684659 1779476
14611A779476M0291Q1448M5642R635L337N6514O1381L4224L4831K025J8497O6465
$$ 1779476 1819767 1901215 1946857 1956492 1959829 2016343 2077724 2111948 2146779 2148804 2167301 2233766
14599B233766Q0449Q9600N3417P0719J04955J49568J35981R7366J02824J42084
$$ 2233766 2314215 2403815 2457232 2527951 2632906 2782474 2918455 3015821 3118645 3260729
14589C260729J23100J80930J70769J04062R1311J16422J28285J72104J59018J57195
$$ 3260729 3383829 3564759 3735528 3839590 3930901 4047323 4175608 4347712 4506730 4663925
14579D663925J72968L06911K78415K95324L46162M60494M94686N48242O13503
$$ 4663925 4836893 5143804 5422219 5717543 6063705 6524199 7018885 7567127 8180630
14570H180630P28369Q86084R69640J193613J467880J817747K109657K452592K783046
$$ 8180630 8908999 9795083 10764723 11958336 13426216 15243963 17353620 19806212 22589258
14561B2589258L109469L442632L963730M748772N924515P861580J0975654J5728879
$$ 22589258 25698727 29141359 33105089 37853861 43778376 51639956 62615610 78344489
14553G8344489K1682856K8248225L4790471M0395307M3991448M4480433M1161855
$$ 78344489 100027345 128275570 163066041 203461348 247452796 291933229 333095084
14546C33095084L3829873K2840858R168062n562875j9345111l1130033l9713328
$$ 333095084 366924957 389765815 398933877 393371002 374025891 342895858 303182530
14539C03182530m4469581m5198065m2554062l7614026l1268908k4407929j7972304
$$ 303182530 258712949 213514884 170960822 133346796 102077888 77669959 59697655
14532E9697655j2850022r096292o652969n039290m023854l323720k885589k549973
$$ 59697655 46847633 37751341 31098372 26059082 22035228 18711508 15825919 13275946
14524A3275946k161408j860568j484121j111235r38507q18291n99791m57019m00915
$$ 13275946 11114538 9253970 7769849 6658614 5720107 4901816 4302025 3845006 3444091
14515C444091l31096l03843k68487k29879k03515j98869j76512j88194j42188
$$ 3444091 3112995 2809152 2540665 2310786 2107271 1908402 1731890 1543696 1401508
14506A401508o6497j13783j43164p7403q7515m7487q7821J6587M0599k0527j3681
$$ 1401508 1335011 1221228 1078064 1000661 913146 865659 777838 794425 835024 814497 800816
14495H00816M9887o9346j1920p647P957p9078j18417o5295p2101j02914n7034
$$ 800816 850703 781357 769437 761790 769747 690669 572252 506957 434856 331942 274908
14484B74908R738m1280l4980j9737m1199p5477O295r048j072J3317q03m5332l281
$$ 274908 284646 243366 208386 188649 147450 71973 78268 69220 68148 81465 80662 35330 32049
14471C2049K2717M3467k3744k9601o9816l6528K3206N4501J3281L2774M44Q434
$$ 32049 54766 98233 74489 44888 -24928 -61456 -38250 16251 29532 62306 62750 71184
14459G1184J5828l4707p4167l8885m9474j8654q891j877j533m4852K5613J5044
$$ 71184 87012 52305 -21862 -60747 -110221 -128875 -137766 -139643 -141176 -186028 -160415 -145371
14447a45371n6259M7656L0055J4148M4638l0428Q194k6101n0136q8705L2880M1746
$$ -145371 -201630 -153974 -123919 -109771 -65133 -95561 -87367 -113468 -163604 -252309 -219429 -177683
14435a77683L1665P42L5074L4544N8505L4543m6377j2504n104l1082m7952L279
$$ -177683 -146018 -145276 -110202 -75658 -17153 17390 -28987 -41491 -46595 -77677 -125629 -122350
14423a22350N209K0022J2992L3206J5058j6741n83N8973R547R724O069J9367m081
$$ -122350 -117141 -97119 -84127 -50921 -35863 -52604 -53187 5786 15333 25057 31126 50493 46412
14410D6412L926J9361K0940j4883l6741m3796L9607J7912m1889l0784J9266N5426
$$ 46412 50338 69699 90639 75756 39015 -4781 34826 52738 10849 -19935 -669 54757
14398E4757r573m2541j8324k5090R505k7268j5276N9086k3159j6229j7941M6803
$$ 54757 45184 2643 -15681 -40771 -31266 -58534 -73810 -14724 -37883 -54112 -72053 -25250
14386b5250L1155o5597l9610L9403P0398K3050n7344L121R4236O481j1511p0409
$$ -25250 5905 -59692 -99302 -59899 10499 33549 -23795 -20674 73562 80043 68532 -1877
14374a877J2410J7428J427l6378j0668k793M2715M2252l2771m3626l9813l0920
$$ -1877 10533 27961 29388 -6990 -17658 -20451 22264 64516 31745 -11881 -51694 -82614
14362h2614j02993r6425j64734k67773j97100j50649j68212k66168k46249j36386
$$ -82614 -185607 -282032 -446766 -714539 -911639 -1062288 -1230500 -1496668 -1742917 -1879303
14352a879303O6837K9889K7482Q4569J66995R7525J05778J06773J14923R2028
$$ -1879303 -1812466 -1782577 -1755095 -1670526 -1503531 -1406006 -1300228 -1193455 -1078532 -986504
14342i86504L1415L7689J55036O2896j8174P702P0339M7569P7540P5576J1797
$$ -986504 -955089 -917400 -762364 -699468 -717642 -709940 -639601 -592032 -514492 -438916 -427119
14331d27119J7860R222n3864R038J02435N7885L4558L7022j4068N169N5588L2652
$$ -427119 -409259 -400037 -453901 -444863 -342428 -284543 -249985 -212963 -227031 -221862 -166274 -133622
14319a33622r7646j5657Q705N7157j3625n644k8003l8215j6118L3273L6200j623
$$ -133622 -231268 -246925 -238220 -181063 -194688 -200332 -228335 -266550 -282668 -249395 -213195 -214818
14307b14818q416n4154q938J0392M2964J9956M5612q947p0669J9099p681j2953
$$ -214818 -223234 -277388 -286326 -275934 -232970 -213014 -167402 -176349 -247018 -227919 -235600 -248553
14295b48553p151l2031N4167K8927n6061j3952L5580J3557r430M5148j1627j0621
$$ -248553 -255704 -287735 -233568 -204641 -260702 -274654 -239074 -225517 -234947 -189799 -201426 -212047
14283b12047R241J1018N117J4688j6596N097J2122k8333j7565L9792R1506M4094
$$ -212047 -202806 -191788 -186671 -171983 -188579 -183482 -171360 -199693 -217258 -177466 -85960 -41866
14271d1866J4346j8291r7645l7584l2087J3280m9312l1649M0296L2948J7036J2334
$$ -41866 -27520 -45811 -143456 -181040 -213127 -199847 -249159 -280808 -240512 -207564 -190528 -178194
14259a78194j3921n5910n342N2349J2658P0176N9845j9186q3407M533J00956L547
$$ -178194 -192115 -248025 -253367 -201018 -188360 -118184 -58339 -77525 -160932 -156399 -55443 -51896
14247e1896M7822j0597o3253j505l0351k0467r068J0677M4532m3165n7778N8417
$$ -51896 -4074 -14671 -77924 -79429 -109780 -130247 -139315 -128638 -84106 -127271 -185049 -126632
14235a26632J0544j0929o1032m0455j6737k7983j179M0978N594O5190N3163L588
$$ -126632 -116088 -127017 -188049 -228504 -245241 -273224 -274403 -233425 -227831 -162641 -109478 -105890
14223a05890J6700j3597l5496M814O7622l1988j4311m100k7208m5101K2170N685
$$ -105890 -89190 -102787 -138283 -133469 -65847 -97835 -112146 -116246 -143454 -188555 -166385 -160700
14211a60700k4597m820J1200J4203L8033k2935k9680J8369L444j0325Q0577M8527
$$ -160700 -185297 -190117 -178917 -164714 -126681 -149616 -179296 -160927 -157483 -167808 -87231 -38704
14199c8704K1812n0825l6572Q1085L443l7895k0469j7360N8545L9778m8121j5448
$$ -38704 -16892 -67717 -104289 -23204 -19761 -57656 -78125 -95485 -36940 2838 -45283 -60731
14187f0731q637l0888j323j9128l039l8386m9811K3065L9284N7836k8823N0586
$$ -60731 -69368 -100256 -101579 -120707 -123746 -162132 -211943 -188878 -149594 -91758 -120581 -69995
14175f9995L3584O662n1202l0976O497o605l1983j6509M817M6649n0084m774L3846
$$ -69995 -36411 -29749 -80951 -111927 -105430 -112035 -144018 -160527 -155710 -109061 -159145 -163919 -130073
14162a30073O2181j8146l3696O495M3531K5699L1594k8066k9661l1710L5722P6530
$$ -130073 -67892 -86038 -119734 -113239 -69708 -44009 -12415 -40481 -70142 -101852 -66130 10400
14150A0400o663n7470l8958K281j4145j7452j3682m4406O3418P1364l1342J8879
$$ 10400 3737 -53733 -92691 -90410 -104555 -122007 -135689 -180095 -116677 -45313 -76655 -57776
14138e7776J0098l3684k5023k5425J8479L9527L1148m8198l3802k0717L1917L7439
$$ -57776 -47678 -81362 -106385 -131810 -113331 -73804 -42656 -90854 -124656 -145373 -113456 -76017
14126g6017N4102O696k3931K9276J56m6522J6960O1145L2420O3997L333L0062
$$ -76017 -21915 -15219 -39150 -9874 -9718 -56240 -39280 21865 54285 118282 121615 151677
14114A51677O1570L129N4301Q8438J00541P5865J35559O5876J40623K83709K46750
$$ 151677 213247 216376 270677 359115 459656 535521 671080 736956 877579 1161288 1408038
14103A408038K73597J81162N9816R8205q66j35359j36061j68500k43007k79308
$$ 1408038 1681635 1862797 1922613 2020818 2019952 1884593 1748532 1580032 1337025 1057717
14093A057717j95165j50007j16895j06184j26610j41726p0572q948r9001k4793
$$ 1057717 862552 712545 595650 489466 362856 221130 150558 141610 42609 17816
14083A7816R031k4857J3701r697J5899J7457l0320l5963N6483k8928m1075P4023
$$ 17816 26847 1990 15691 5994 21893 39350 9030 -26933 29550 622 -40453 33570
14071C3570M9833l1868k5402j0636j2319j1065k0432k5685K1706j577J8600p459
$$ 33570 83403 51535 26133 15497 3178 -7887 -28319 -54004 -32298 -33875 -15275 -22734
14059b2734j4545j5369j5327K4692p558O803k1315J5962L2992L5785k004r920
$$ -22734 -37279 -52648 -67975 -43283 -50841 -44038 -65353 -49391 -16399 19386 17382 7462
14047G462l8211L3597L5624O181L6453l8115k4944l7979P329l6384N4666P6917
$$ 7462 -30749 2848 38472 44653 81106 42991 18047 -19932 -12603 -48987 5679 82596
14035H2596L0219m1286l4153j2953q285p6816J0621o754k8333M3049M3187l8487
$$ 82596 112815 71529 37376 24423 16138 -60678 -50057 -56811 -85144 -42095 1092 -37395
14023c7395p3093K4498j1587L0368M7385L6083K3692M1503l5207J1423L2987O892
$$ -37395 -110488 -85990 -97577 -67209 -19824 16259 39951 81454 46247 57670 90657 97549
14011I7549m1791n2291m6066m9747q679Q2842N3930j8531r73k3095j4752J1701
$$ 97549 55758 3467 -42599 -92346 -101025 -18183 35747 17216 16243 -6852 -21604 -9903
13999i903j8835K5173k9857l6660L8343J7575L7009K5540j9461j08613m8350j5407
$$ -9903 -28738 -3565 -33422 -70082 -31739 -14164 22845 48385 28924 -79689 -128039 -143446
13987a43446N8059J7007N4259J627p686O4907R449N1249J0396m7633n1142j4364
$$ -143446 -85387 -68380 -14121 -12494 -20180 44727 54176 105425 115821 68188 17046 2682
13975B682j9153K3738o172n984J0547l90r24K8247l1897l2411j4714l7259J4239
$$ 2682 -16471 7267 1095 -4889 5658 5268 4344 32591 694 -31717 -46431 -83690 -69451
13962f9451O4568k7365j5657m5126L3062N0230K7848K3730j9001l3932p6244J9353
$$ -69451 -4883 -32248 -47905 -93031 -59969 -9739 18109 41839 22838 -11094 -87338 -67985
13950f7985M3957J8581J434Q182M7519J2004k7447n1538O0524k515j6929L1562
$$ -67985 -24028 -5447 -4013 4169 51688 63692 36245 -15293 45231 42716 25787 57349
13938E7349r233j5818Q732o063M0300J9202l4777j6653m6325k2070K4584O7245
$$ 57349 48116 32298 41030 34967 75267 94469 59692 43039 -3286 -25356 -772 66473
13926F6473N0342l9333m0806M6479L5596o9337l1588J9358K9888K4293O5603Q4609
$$ 66473 116815 77482 36676 83155 118751 49414 17826 37184 67072 91365 156968 241577
13914B41577P7381J31066J19392J16790J21778J89236J08270J01486K1673R467
$$ 241577 318958 450024 569416 686206 807984 997220 1105490 1206976 1228649 1238116
13904A238116k2684r3656j76875j51949j54527j29685j15659j50435o8806j064
$$ 1238116 1215432 1121776 944901 792952 638425 508740 393081 242646 173840 172776
13894A72776o6197n3415J8035j3024n4817J3820m3925N5148k4145m7505K1730
$$ 172776 106579 53164 71199 58175 3358 17178 -26747 28401 4256 -43249 -21519
13883b1519K1233m6385p559L499n010M0910K5596m2359K9287P3245J0238o8860
$$ -21519 -286 -46671 -54230 -50731 -55741 -14831 10765 -31594 -2307 70938 81176 12316
13871A2316o1251N189P1399j63n914j4726k5219o4461m0728r100K3002L8157L8072
$$ 12316 -48935 -43746 27653 27490 21576 6850 -18369 -82830 -123558 -132658 -109656 -71499 -33427
13858c3427M7798J3876L341L886k7110l78P300L2524M295j4486m1743J0449K9120
$$ -33427 14371 28247 31588 35474 8364 7986 15286 47810 52105 37619 -4124 6325 35445
13845C5445j569n815K5719k1299l1595J7777l9296k6977K2762j5305l0440j2929
$$ 35445 33876 28061 53780 32481 886 18663 -20633 -47610 -24848 -40153 -70593 -83522
13833h3522R1191M7110k4272l0974j8815o575M3728K4539j2449j0523n099N4459
$$ -83522 7669 54779 30507 -467 -19282 -25857 17871 42410 29961 19438 14339 68798
13821F8798l9123l7898m0344L010M1426k547L6137m3416j188L041L1514J3575
$$ 68798 29675 -8223 -48567 -45557 -4131 -6678 29459 -13957 -15145 -12104 19410 32985
13809C2985J7288n8644q67p967J1238J9863R505M1810J4463o4807m776N3300Q359
$$ 32985 50273 -8371 -9238 -17205 -5967 13896 23401 65211 79674 14867 10091 63391 71750
13796G1750p3846J7806j9299k7197O424P19K9761j8257M112L9775L3919n60M5649
$$ 71750 -2096 15710 -3589 -30786 -24362 -23643 6118 -12139 -8027 31748 65667 65107 110756
13783A10756R698o1288k8585K1463l0818j201O478P733r337J5780j0030J8343
$$ 110756 120454 59166 30581 52044 21226 20025 26503 34236 24899 40679 30649 48992
13771D8992J03127L9922K452l9508r2923l5743k806J61P693q652p73K1432k3162
$$ 48992 152119 192041 194493 154985 62062 26319 23513 23674 31367 22715 21942 43374 20212
13758B0212l0049Q6895j1901O2537L7966m4869j0071l0035q5736m4154J6166J0861
$$ 20212 -9837 77058 65157 127694 165660 120791 110720 80685 -5051 -49205 -33039 -22178
13746b2178L0657L3299k5633K6360N367k2012j8716p81J4531L6243k3218O8085
$$ -22178 8479 41778 16145 42505 47872 25860 7144 6363 20894 57137 33919 102004
13734A02004M8431k1583m1248L3260O5395l5720p9703k6018k0755J3249K3138
$$ 102004 150435 128852 87604 120864 186259 150539 70836 44818 24063 37312 60450
13723F0450J5782k049K5416N7635j7223l4907J4953R994j7363m087L0296L3749
$$ 60450 76232 74183 99599 157234 140011 105104 120057 130051 112688 108601 138897 172646
13711A72646p2994n4332L5281m3963p0229J14045Q2727M949K5798O075l2892J2496
$$ 172646 99652 45320 80601 36638 -33591 80454 163181 168130 193928 200003 167111 179607
13699A79607o1076k3263l3506r668J9040m1985p9852r598N6522K1355k5898N3741
$$ 179607 118531 95268 61762 52094 71134 29149 -50703 -60301 -3779 17576 -8322 45419
13687D5419N9456k1618j6722O5213L5515J5617j5531q914j7571j9034q364J955
$$ 45419 104875 83257 66535 131748 167263 182880 167349 158435 140864 121830 113466 115421
13675A15421k945M1799R612l7001L5721k111k9650J9323K0792J8654J4416k3441
$$ 115421 112476 154275 163887 126886 162607 160496 130846 150169 170961 189615 204031 180590
13663A80590n1874J5589m1397M8393J11086L0070J1084q5504L7383k1308n2429
$$ 180590 128716 144305 102908 151301 262387 292457 303541 218037 255420 234112 181683
13652A81683l5985l8690j7779n5843J9469M0712j4467k9608P969Q781L8760K1560
$$ 181683 145698 107008 89229 33386 52855 93567 79100 49492 57461 66242 105002 126562
13640A26562k0088L3102L1062L1790n9171l6659K1924M5528K6463l6371n0740
$$ 126562 106474 139576 170638 202428 143257 106598 128522 174050 200513 164142 113402
13629A13402m5092N5659l162N5209m797N0794j9173n9725M909j541P964o003L436
$$ 113402 68310 123969 120807 176016 171219 222013 202840 143115 148024 146483 154447 148444 151880
13616A51880J3575k0197k9929n8070J4498J887m4042P315R294M6999L9934l1313
$$ 151880 165455 145258 115329 57259 71757 73644 29602 36917 46211 93210 133144 101831
13604A01831o5648k4237k3579J7018j6579J1021Q8353K6572k1030j7407K2334
$$ 101831 36183 11946 -11633 5385 -11194 -173 88180 114752 93722 76315 98649
13593I8649J5212k2613p0m1507O913N4959K0400J7907l7478k871K52O9886M5127
$$ 98649 113861 91248 91178 49671 56584 111543 131943 149850 112372 109501 109753 179639 224766
13580B24766j6865J4692N2294J4468j666n7212p3281k5477K9475L8328O71K8872
$$ 224766 207901 222593 274887 289355 287689 230477 157196 131719 161194 199522 200193 229065
13568B29065m4684o465j0620K1842J4295j9054n2740j6883k997r209O1244j2303
$$ 229065 184381 177916 167296 189138 203433 184379 131639 114756 111759 102550 163794 151491
13556A51491J7070O9214Q452l3635p702L1705k8496l4211J8197J0274M1045J5347
$$ 151491 168561 237775 246227 212592 204890 236595 208099 173888 192085 202359 243404 258751
13544B58751m678l3808l0746j07647m6637k5296M9662K3913L2150P0006K9423
$$ 258751 254073 220265 189519 81872 35235 9939 59601 83514 115664 185670 215093
13533B15093l1709M1524J137l5932l8597n145k0227j0012p357q906J2388M4428
$$ 215093 183384 224908 226045 190113 151516 146371 126144 116132 108775 99869 112257 156685
13521A56685j3547n1576K0076M1480l2759k9172j3756L2375K4426L4177K534p6801
$$ 156685 143138 91562 111638 153118 120359 91187 77431 109806 134232 168409 170943 94142
13509I4142n9700m886O697M3265O7428M629q1306J8984J7340J3543O1046N9367
$$ 94142 34442 29556 36253 79518 146946 151575 70269 89253 106593 120136 181182 240549
13497B40549r863l3872k0945m1639l6024J5124N7868o264n485r9522L7937N3510
$$ 240549 230686 196814 175869 134230 98206 113330 171198 164934 159449 59927 97864 151374
13485A51374j265K4702j5894M4377K1069j0004k6804j2289n26m5228p1150k440
$$ 151374 150109 174811 158917 203294 224363 214359 187555 175266 174740 129512 58362 55922
13473E5922K0639K5403j099j8384L9980M9113O277P1948l8054k9524j2476m0282
$$ 55922 76561 101964 100865 82481 122461 171574 177851 249799 211745 182221 169745 129463
13461A29463k8283J1003M0133Q68P147l8025K4623O2615N3394k7789k9184j0910
$$ 129463 101180 112183 152316 153184 160331 122306 146929 209544 262938 235149 205965 195055
13449A95055L8721l1104l7492r561J8143k95O9335P0376J2601m9456k9240L2961
$$ 195055 233776 202672 165180 155619 173762 173467 242802 313178 325779 276323 247083 280044
13437B80044K9547P145n1229k5337l7962j7938j5162P261J349j2583L5802N0953
$$ 280044 309591 316736 265507 240170 202208 184270 169108 176369 177718 165135 200937 251890
13425B51890O9445q458m1555K0150n3637k3691j9734j53O2810Q214M643J2707
$$ 251890 321335 312877 271322 291472 237835 214144 194410 194257 257067 265281 269924 282631
13413B82631J4259j5085j17226N704O4286M339p157l9259m7056M261K9205L1221
$$ 282631 296890 281805 164579 170283 234569 238908 231751 192492 145436 149697 178902 210123
13401B10123m5137J4886j0996O8625O6029N4650l945k9814j08748k4969M425k9748
$$ 210123 164986 179872 168876 237501 303530 358180 354235 324421 215673 190704 195129 165381
13389A65381o2078N1027L293k9033k9511K6841K6280j3776J2923q7Q919L3541
$$ 165381 103303 154330 157623 128590 99079 125920 152200 138424 151347 151260 160179 193720
13377A93720Q7661Q9317L1247p9644j20736j4657O3993L3555R640o6159j5830
$$ 193720 281381 370698 401945 322301 201565 186908 250901 284456 294096 227937 212107
13366B12107O6966J1076J1502J8889p386m0917l5521m7990k9192Q078p030p63
$$ 212107 279073 290149 301651 320540 313154 272237 236716 188726 159534 167612 160582 159819
13354A59819N0292j7628J498o2L4927M5650M1068N9573K2056J1802j6691n7354
$$ 159819 210111 192483 193981 193919 228846 274496 315564 375137 397193 408995 392304 334950
13342C34950n8310M8067k8324m7252j5405L6876j3113j7049N874K2610j0188J0575
$$ 334950 276640 324707 296383 249131 233726 270602 257489 240440 246314 268924 258736 269311
13330B69311L9388M6766l9169m9776n0022n028L0605L7593M3386L659k2308q3986
$$ 269311 308699 355465 316296 266520 216498 211470 242075 279668 323054 326713 304405 220419
13318B20419J0418k863L5420K014j2898J1950N0907j9111l2218k898L6918K2540
$$ 220419 230837 227974 263394 265408 252510 264460 315367 296256 264038 261140 298058 320598
13306C20598K06k7335m3079k940O4986k6863m5654l473j7611m5777L1068N4906
$$ 320598 320804 293469 250390 247450 312436 285573 239919 236446 218835 173058 204126 259032
13294B59032J9689K0685j1885m0249k7266j6478J1585N5826K1774k769l786j6782
$$ 259032 278721 299406 287521 247272 220006 203528 215113 270939 292713 289944 286158 269376
13282B69376R154K0116k6562P464m1112p403N1426J09796O604q4054k5717n9443
$$ 269376 278530 298646 272084 279548 238436 231033 282459 392255 398859 314805 289088 229645
13270B29645M9187m516K032K5940k0687j6680l7610k5160O510o886K9362j5586
$$ 229645 278832 274316 276348 302288 281601 264921 227311 202151 208661 201775 231137 215551
13258B15551K674K2628K4587m1359O247P9952m7290m1957J3566N8406N5190k5333
$$ 215551 218225 240853 265440 224081 230328 310280 262990 221033 234599 293005 348195 322862
13246C22862j12075J9994P1595J1615m662p244k6315p792J2536L9826M4307j6531
$$ 322862 210787 230781 302376 313991 309329 302085 275770 267978 280514 320340 364647 348116
13234C48116j0883p2583k732R1041j4646K7750r304k7476J0493J2336k5430p684
$$ 348116 337233 264650 261918 352959 338313 366063 356759 329283 339776 352112 326682 318998
13222C18998J1649J4030J2513J9039K0731N2159r076J3178k3384m6944L1153k7932
$$ 318998 330647 344677 357190 376229 396960 449119 440043 453221 429837 382893 414046 386114
13210C86114J1381m516k8469m7412j4902j3347L5663J3628m0659M4900M995K6069
$$ 386114 397495 392979 364510 317098 302196 288849 324512 338140 297481 342381 347376 373445
13198C73445l8785J5283M0861k0614J5729J5103L4372n7048k6490J1382L5311
$$ 373445 334660 349943 390804 370190 385919 401022 435394 378346 351856 363238 398549
13187C98549n0745P996J3243k2237R955M1128N9757j6940m5411N361M351m2911
$$ 398549 347804 355800 369043 346806 356761 397889 457646 440706 395295 400656 405007 362096
13175C62096J7782j8998N340l0953K4251p219L15O349N6190J010L0875P3530K8458
$$ 362096 379878 360880 366220 335267 359518 352299 352614 358963 415153 416163 447038 520568 549026
13162E49026o0719o6883l2251J8910N4799j7501k8561k2081n872L0793J7244K8309
$$ 549026 488307 421424 389173 408083 462882 445381 416820 394739 388867 419660 436904 465213
13150D65213l3958k1175K7161l081l1270k2942M6384j143J0759r1375J5746N7817
$$ 465213 431255 410080 437241 434160 402890 379948 426332 425189 435948 344573 360319 418136
13138D18136K080M2236M2835r186k2271l0126l3718J4179L1958p0037k7865j3365
$$ 418136 420216 462452 505287 496101 473830 443704 409986 424165 456123 386086 358221 344856
13126C44856M3593Q1582O6987L5440n0687P58o8183o4150O5367M409J6951j4242
$$ 344856 388449 470031 537018 572458 521771 522529 454346 390196 455563 459972 476923 462681
13114D62681m4458K2148L5724k907o3079M109M6878P2271L8884q6591l7733K9733
$$ 462681 418223 440371 476095 473188 410109 414218 461096 533367 572251 485660 447927 477660
13102D77660K2048K8301k4916m5443o6N4557l1324p374N1309O338p4596j7757
$$ 477660 499708 528009 503093 457650 457584 512141 480817 473443 524752 531090 456494 438737
13090D38737K2087L8339M173K24j3057k178L6153p877J5227k4768l3124l3139
$$ 438737 460824 499163 503336 503560 490503 488325 524478 516601 531828 507060 473936 440797
13078D40797P85L7650R343J9717K3496j4691p3095L999N3710P3243j9920J9560
$$ 440797 441582 479232 488575 508292 531788 517097 444002 448001 501711 574954 555034 574594
13066E74594m8869K0581L0478m7833L050J5326M7728Q436j8645m3993j7197N3467
$$ 574594 525725 546306 576784 528951 532001 547327 595055 603491 584846 540853 523656 577123
13054E77123j8391k4441K3733j5818N3526J0806n7142l9045l0354N4325J4370
$$ 577123 558732 534291 558024 542206 595732 606538 549396 510351 479997 534322 548692
13043E48692J2635L6240K8304O1397N8183N456r3738p248l3287n9594L1615N0384
$$ 548692 561327 597567 625871 687268 745451 750907 657169 649921 616634 557040 588655 639039
13031F39039O0687k1083o1284m0359J9960L7280J3933k7063q266J2455J2737l2069
$$ 639039 699726 678643 617359 577000 596960 634240 648173 621110 612844 625299 638036 605967
13019F05967l8592K8103N8431M1615L4296q561p5284m725m445J8433O61l7313
$$ 605967 567375 595478 653909 695524 729820 721259 645975 641250 636805 655238 655899 618586
13007F18586J8165L6078P4684k2617j1046o6389J3733k141N4747k2692j0490k5359
$$ 618586 636751 672829 747513 724896 713850 647461 661194 659053 713800 691108 680618 655259
12995F55259L0661P4847M6074m8668N232J5852l0736p496l5165l7933O2707l8568
$$ 655259 685920 760767 806841 758173 763405 779257 748521 741025 705860 667927 730634 692066
12983F92066o1506L1339l1408M8964N9828P7407k7750p3268k3645M6673L0280
$$ 692066 630560 661899 630491 679455 739283 816690 788940 715672 692027 738700 768980
12972G68980P187j8667q565J8945M3022l7826o3537K6039p740k9324N607J2997
$$ 768980 776167 757500 748935 767880 810902 773076 709539 735578 727838 698514 704121 717118
12960G17118O745J6196N2012M734j5014J4805l5013j763J2930k6915o635K8136
$$ 717118 723863 740059 792071 796805 781791 796596 761583 759820 772750 745835 739200 767336
12948G67336L6296L1225O555J123L6270L0230k3850J6093L8349k7017o3989m8776
$$ 767336 803632 834857 841412 842535 878805 909035 885185 901278 939627 912610 848621 799845
12936G99845L6163P6782L6697j4697l3122k8756j1300l5022J8775j2189R172N7809
$$ 799845 836008 912790 949487 934790 901668 872912 861612 826590 845365 833176 842348 900157
12924I00157L557M7041J0524R750j962l1820K3302p7686M1237J14662J650p7264
$$ 900157 903714 950755 961279 971029 969067 937247 960549 882863 924100 1038762 1040412 963148
12912I63148m7475n3313N2431O8097q151k3427p066N384n673j3537k6351l829
$$ 963148 915673 862360 914791 982888 974737 951310 944244 949628 943955 930418 904067 900238
12900I00238J7622K2738k720K3517q514l6416l666N3878P4041o3013n4493l4329
$$ 900238 917860 940598 937878 961395 952881 916465 912799 966677 1040718 977705 923212 888883
12888H88883K188J26867N4167Q058p3020m783k6936O3437N4153M8735L627J111
$$ 888883 891071 1017938 1072105 1080163 1007143 1002360 975424 1038861 1093014 1141749 1145376 1146487
12876A146487k0619N492j1098L5899P3263l3454j8258p4520L3096J0178m9108
$$ 1146487 1125868 1131360 1120262 1156161 1229424 1195970 1177712 1103192 1136288 1146466 1097358
12865A097358p5103j0541L3863P7970K295L9092k5345k6453K2346J4496L1040
$$ 1097358 1022255 1011714 1045577 1123547 1125842 1164934 1139589 1113136 1135482 1149978 1181018
12854A181018l647j3856N3807N6684n8653q5110L2996J9148o151j2331M7195O6769
$$ 1181018 1177371 1163515 1217322 1274006 1215353 1130243 1163239 1182387 1176236 1163905 1211100 1277869
12842A277869K5345J0523j8693k302k4306j0927O2837N2777n391m3803m26K0925
$$ 1277869 1303214 1313737 1295044 1292742 1268436 1257509 1320346 1373123 1367732 1323929 1323503 1344428
12830A344428n6639o6334l9577M7495Q7069N7003l4547K1094L9442N731j00768
$$ 1344428 1287789 1221455 1181878 1229373 1316442 1373445 1338898 1359992 1399434 1405165 1304397
12819A304397l1764K5357K6723J8823k7177m0381K2647N8107K2699l7728k7545
$$ 1304397 1272633 1297990 1324713 1343536 1316359 1275978 1298625 1356732 1379431 1341703 1314158
12808A314158j4202R591K3790K1155j2627O7526M4674K2496l5780J8403L1746
$$ 1314158 1299956 1309547 1333337 1354492 1341865 1409391 1454065 1476561 1440781 1459184 1490930
12797A490930K139j5675J8120N1280K3453o9629R991N7218r605o702J8795l7480
$$ 1490930 1493069 1477394 1495514 1546794 1570247 1500618 1510609 1567827 1558222 1551520 1570315 1532835
12785A532835N4945K5285M5268M7283K4249k9237j4199O689M0231p21j4328k3197
$$ 1532835 1587780 1613065 1658333 1705616 1729865 1700628 1686429 1693118 1733349 1732628 1718300 1695103
12773A695103k8123K9008L0402r131k5357l8374J9946Q6539L2590J2903n999n378
$$ 1695103 1666980 1695988 1726390 1717259 1691902 1653528 1673474 1760013 1792603 1805506 1799507 1794129
12761A794129n172o984J1600l5092N803Q4654L1788p106l6550L47k4055k6158
$$ 1794129 1788957 1781973 1793573 1758481 1764284 1848938 1880726 1873620 1837070 1837417 1813362 1787204
12749A787204J1705L3812Q0804n3830p064Q2974O0486M0075j0045O508j5905J7070
$$ 1787204 1798909 1832721 1913525 1859695 1852631 1935605 1996091 2036166 2026121 2032629 2016724 2033794
12737B033794k445l5738j9966O0135k4269m3604k775K5125K0712J6236O8210j3827
$$ 2033794 2031349 1995611 1975645 2035780 2011511 1967907 1965132 1990257 2010969 2027205 2095415 2081588
12725B081588M2015J5227M7023j0755J8197M5268l8265j5000P786L3467K5090
$$ 2081588 2123603 2138830 2185853 2175098 2193295 2238563 2200298 2185298 2193084 2226551 2251641
12714B251641L8987J1889R089L6393L9183j7693m8383k6185k875M7619N6438k3038
$$ 2251641 2290628 2302517 2311606 2347999 2387182 2369489 2321106 2294921 2292046 2339665 2396103 2373065
12702B373065n1148j5170K2555K8751O464L3517M2669L8524J9377J0543n306l1519
$$ 2373065 2321917 2306747 2329302 2358053 2364517 2398034 2440703 2479227 2498604 2509147 2503841 2472322
12690B472322J9579Q1590M1124L6748J2186k4163l2386q475R2899k5202n928M5753
$$ 2472322 2491901 2573491 2614615 2651363 2663549 2639386 2607000 2598525 2691424 2666222 2660294 2706047
12678B706047L4670L7424M3639o2429j4853k21J1368M3671N5019O075K6200Q790
$$ 2706047 2740717 2778141 2821780 2759351 2744498 2744277 2755645 2799316 2854335 2860410 2886610 2895400
12666B895400K6539j6981j0551L1602N8199N2659M617J9545J175r733J3834N4809
$$ 2895400 2921939 2904958 2894407 2926009 2984208 3036867 3041484 3061029 3062204 3052471 3066305 3121114
12654C121114K9623M6746k2183o215K5742K9074Q1251N9832p3417k5728L8483
$$ 3121114 3150737 3197483 3175300 3169085 3194827 3223901 3305152 3364984 3291567 3265839 3304322
12643C304322k19O3139K3279q082P0998N8250K5473j1490m470K5830P6335O7370
$$ 3304322 3304103 3367242 3390521 3382439 3453437 3511687 3537160 3525670 3521200 3547030 3623365 3690735
12631C690735N0389k1878k6084N1570k1828k2135O7738J2614k1711K0045P9247
$$ 3690735 3741124 3719246 3693162 3744732 3722904 3700769 3768507 3781121 3759410 3779455 3858702
12620C858702P7540O83l788K874P7274j2377l9480k0196L5257P4397P0157k930
$$ 3858702 3936242 3936925 3933137 3936011 4013285 4000908 3961428 3941232 3976489 4050886 4121043 4118113
12608D118113M2754O6148R1034L9571m143j97K9861M2133M6638L2462J3503L7105
$$ 4118113 4160867 4227015 4318049 4357620 4353477 4353280 4383141 4425274 4471912 4504374 4517877 4554982
12596D554982j3267n609L1188J5235R170O6117J01641K8921p4784k378M2783R1058
$$ 4554982 4541715 4536106 4567294 4582529 4591699 4657816 4759457 4788378 4713594 4711216 4753999 4845057
12584D845057N6137O2608j237k0626Q6119Q4006N7837Q1934O1667k866M1096K9878
$$ 4845057 4901194 4963802 4962565 4941939 5028058 5112064 5169901 5251835 5313502 5310636 5351732 5381610
12572E381610K3722K4981P1672M8451K5465M9494M9400N6437K2873K8485O4161
$$ 5381610 5405332 5430313 5501985 5550436 5575901 5625395 5674795 5731232 5754105 5782590 5846751
12561E846751l7332O1613M412P1954L3664L2946O9363O7417O4412J0412L9037
$$ 5846751 5809419 5871032 5875444 5947398 5981062 6014008 6083371 6150788 6215200 6225612 6264649
12550F264649J23970N8209J9462O4472L6696N3782r347N6929K0766N8417Q1190
$$ 6264649 6388619 6446828 6466290 6530762 6567458 6621240 6611893 6668822 6689588 6748005 6829195
12539F829195J3682J471P3717N8778M2390J08102R3935M692M8102O6655O5865
$$ 6829195 6842877 6844348 6918065 6976843 7019233 7127335 7221270 7225962 7274064 7340719 7406584
12528G406584O5367k8161P5801J21165J42441M3388L2591l284M8908M8437N9318
$$ 7406584 7471951 7443790 7519591 7640756 7783197 7826585 7859176 7855892 7904800 7953237 8012555
12517H012555P5283O3056N8776K6895L4046M9836R9347O3954Q6051R2206J34575
$$ 8012555 8087838 8150894 8209670 8236565 8270611 8320447 8419794 8483748 8569799 8662005 8796580
12506H796580P2054L3244M5087J01427J12989J13020K0256Q5735J12030N2343
$$ 8796580 8868634 8901878 8946965 9048392 9161381 9274401 9294657 9380392 9492422 9544765
12496I544765J5450Q0122O9976J30913J41131N0411O6457L8480k50J6528O6183
$$ 9544765 9560215 9640337 9710313 9841226 9982357 10032768 10099225 10137705 10137455 10153983 10220166
12485A0220166P0619J48789Q9582O5807R3836Q9726N9662J02947M4373k9788J14695
$$ 10220166 10290785 10439574 10529156 10594963 10688799 10778525 10838187 10941134 10985507 10955719 11070414
12474A1070414J43645J56052R4405J49918J03953J01843M0071R0149L9752Q6275
$$ 11070414 11214059 11370111 11464516 11614434 11718387 11820230 11860301 11950450 11990202 12076477
12464A2076477Q1717J20599N7056R3239Q9502J04022P0877J64528J34563P0455
$$ 12076477 12158194 12278793 12335849 12429088 12518590 12622612 12693489 12858017 12992580 13063035
12454A3063035L9177L8663J8701Q2122J35926J35322O5290P1285J06485P3011
$$ 13063035 13102212 13140875 13159576 13241698 13377624 13512946 13578236 13649521 13756006 13829017
12444A3829017J02328J09410P2753J12465J17635O2466N8548R2021J28978N3416
$$ 13829017 13931345 14040755 14113508 14225973 14343608 14406074 14464622 14556643 14685621 14739037
12434A4739037P4341J14240P5468J58019J28502m757K7450Q5487R7968O6088J25420
$$ 14739037 14813378 14927618 15003086 15161105 15289607 15284850 15312300 15397787 15495755 15561843 15687263
12423A5687263J51294J11604P0138m060l0532N3947J40804J03131P1390M6859
$$ 15687263 15838557 15950161 16020299 16016239 15985707 16039654 16180458 16283589 16354979 16401838
12413A6401838N9362N1207J01946J04357P2396R41P4908R860K2016O6203Q2406
$$ 16401838 16461200 16512407 16614353 16718710 16791106 16792047 16866955 16876815 16898831 16965034 17047440
12402A7047440N7971p546L9963M6784l7660N028J1616P9518O2149j0062O7033
$$ 17047440 17105411 17097865 17137828 17184612 17146952 17151980 17163596 17243114 17305263 17295201 17362234
12391A7362234O2727K932P05K5857m383k8799M360J9682J4154O2718O7892M8549
$$ 17362234 17424961 17427893 17428598 17454455 17450072 17421273 17425633 17445315 17459469 17522187 17590079 17638628
12379A7638628m043n1290n319l0644o5057l5619L3697O997k1885j0868l0811l3945
$$ 17638628 17634585 17583295 17577976 17547332 17482275 17446656 17480353 17487350 17465465 17454597 17423786 17389841
12367A7389841k5747p5310l7656m6590o6940l3067o4004p5625R83o2895o6704
$$ 17389841 17364094 17288784 17251128 17204538 17137598 17104531 17040527 16964902 16965885 16902990 16836286
12356A6836286l7139p7074o8503k9248p8925q0055o6593n9271m4065p6400n4218
$$ 16836286 16799147 16722073 16653570 16624322 16545397 16465342 16398749 16339478 16295413 16219013 16164795
12345A6164795j08119l1437j01640j22310m3709k4857m3545p9199j18577r296
$$ 16164795 16056676 16025239 15923599 15801289 15757580 15732723 15689178 15609979 15491402 15482106
12335A5482106n5004j26396j12524j21652r4814p2493n5801j36867j71199r6145
$$ 15482106 15427102 15300706 15188182 15066530 14971716 14899223 14843422 14706555 14535356 14439211
12325A4439211l6692p9452p2463N674j2066j01515j65662j30746r0245p1141j27022
$$ 14439211 14402519 14323067 14250604 14256278 14244212 14142697 13977035 13846289 13756044 13684903 13557881
12314A3557881r0866j03686q6289n9135q3704j59695p9344n8907o0549q6623j14047
$$ 13557881 13467015 13363329 13277040 13217905 13134201 12974506 12895162 12836255 12775706 12689083 12575036
12303A2575036j03457j24653m074r3819j78957j51435k2460n8333q5084l3090
$$ 12575036 12471579 12346926 12342852 12249033 12070076 11918641 11896181 11837848 11752764 11719674
12293A1719674m6870n9613j26240j37578j59020j54594p7203j54948o3900m0210
$$ 11719674 11672804 11613191 11486951 11349373 11190353 11035759 10958556 10803608 10739708 10699498
12283A0699498j4352n9057p0396m6020o4877j76974j30345k5723l0468j10478
$$ 10699498 10685146 10626089 10555693 10509673 10444796 10267822 10137477 10111754 10081286 9970808
12273I970808r4115p7709j29905j25800p4588l2000p6698l0299p3156j12538q7650
$$ 9970808 9876693 9798984 9669079 9543279 9468691 9436691 9359993 9329694 9256538 9144000 9056350
12262I056350j3131j08551j04988q7649p8015j00686n2244l6370L0885n5708j19355
$$ 9056350 9043219 8934668 8829680 8742031 8664016 8563330 8511086 8474716 8505601 8449893 8330538
12251H330538j25116n9680n9662p0203n7172n6541j25044m0904o9076o3877l3451
$$ 8330538 8205422 8145742 8086080 8015877 7958705 7902164 7777120 7736216 7667140 7603263 7569812
12240G569812q9819q9607j00668m8460L698m2085o5525p6410m3726r2812m766
$$ 7569812 7479993 7390386 7289718 7241258 7244956 7202871 7137346 7060936 7017210 6924398 6919632
12229F919632n2011r7367l9338m0194k5356o4550p2314k0832l4246o4913j09634
$$ 6919632 6867621 6770254 6730916 6690722 6665366 6600816 6528502 6507670 6473424 6408511 6298877
12218F298877p1469K0285L825k4084j03487p4978q2119j05555o1296n9301q2076
$$ 6298877 6227408 6247693 6251518 6227434 6123947 6048969 5966850 5861295 5799999 5740698 5658622
12207E658622q894k1468k8710r704r4415m6846O467m6659n3882n2409q0611j3213
$$ 5658622 5649728 5628260 5599550 5589846 5495431 5448585 5455052 5408393 5354511 5302102 5221491 5208278
12195E208278l1107m5786l5920j4180q6995O370j5473n9293j6200P381l4552j1047
$$ 5208278 5177171 5131385 5095465 5081285 4994290 5000660 4985187 4925894 4909694 4917075 4882523 4871476
12183D871476m7613p4454j30253n821J1144k8305l0976n8240j27191m8582n494
$$ 4871476 4823863 4749409 4619156 4613335 4624479 4596174 4565198 4506958 4379767 4331185 4325691
12172D325691J7845j0319l0382m6813n2451o8280l6098j00473p4017K5664j6515
$$ 4325691 4343536 4333217 4302835 4256022 4203571 4135291 4099193 3998720 3924703 3950367 3933852
12161C933852k3561j4551M6283K2555j5959p3625j8092l0053k1526q9715L6898
$$ 3933852 3910291 3895740 3942023 3964578 3948619 3874994 3856902 3826849 3805323 3715608 3752506
12150C752506M605J897k8076n3451k0522l6839q6843k8003l5285l7741l3871k3551
$$ 3752506 3757111 3759008 3730932 3677481 3656959 3620120 3533277 3505274 3469989 3432248 3398377 3374826
12138C374826l1223j5139j9563k7436J2868L3034Q463m8862k8417m7961l7732
$$ 3374826 3343603 3328464 3308901 3281465 3294333 3327367 3335830 3286968 3258551 3210590 3172858
12127C172858l9323N7183K6377q7819o6235P816L6173k8517o1831J2770r2848
$$ 3172858 3133535 3190718 3217095 3129276 3063041 3070857 3107030 3078513 3016682 3029452 2936604
12116B936604q6732j2516N3591R519o7693p1411k3095K7970K4074k4321J2900
$$ 2936604 2849872 2837356 2890947 2900466 2832773 2761362 2738267 2766237 2790311 2765990 2778890
12105B778890P32m3351j09049J0565Q2553m5010n6585J773k2867j4694n446O2653
$$ 2778890 2779622 2736271 2627222 2637787 2720340 2675330 2618745 2620518 2597651 2582957 2577511 2640164
12093B640164o881l5616j5731o4119m2453j1339j3523n178r321K5445J1452r9980
$$ 2640164 2633283 2597667 2581936 2517817 2475364 2464025 2450502 2445324 2436003 2461448 2472900 2372920
12081B372920n3971q59j1783P411l9104n2170K0010o9659K2636M5164k4484p8145
$$ 2372920 2318949 2318090 2306307 2313718 2274614 2222444 2242454 2172795 2195431 2240595 2216111 2137966
12069B137966M9542K8069M5443m5367p6493n5999r25J3522Q264M101k1191j6910
$$ 2137966 2187508 2215577 2261020 2215653 2139160 2083161 2082236 2095758 2104022 2108123 2086932 2070022
12057B070022n1936J7604m9461j5630N0975k0438n0225j3289L9262L1649o9167
$$ 2070022 2018086 2035690 1986229 1970599 2021574 2001136 1950911 1937622 1976884 2008533 1939366
12046A939366m9927J5654L5771l1479r4808J1666L7038m3129J17427K159m1991
$$ 1939366 1889439 1905093 1940864 1909385 1814577 1826243 1863281 1820152 1937579 1939738 1897747
12035A897747m2057k6267K7726j6967l0052K7701K4661m8327K5413m876l7426
$$ 1897747 1855690 1829423 1857149 1840182 1810130 1837831 1862492 1814165 1839578 1834702 1797276
12024A797276j436M1505J1599L2068k7379p0096o5187l2214K9427L6238j1871
$$ 1797276 1795840 1837345 1848944 1881012 1853633 1783537 1718350 1686136 1715563 1751801 1739930
12013A739930l4263k0184l127j9490L262k1147P657l3791o0458M226l0293p486
$$ 1739930 1705667 1685483 1682356 1662866 1666128 1644981 1652638 1618847 1558389 1562615 1532322 1524836
12001A524836K9918n5416N55K0986Q165j0659k595K4755m7273j6795J3598J8390
$$ 1524836 1554754 1499338 1499893 1520879 1529044 1518385 1515790 1540545 1493272 1476477 1490075 1508465
11989A508465j93j1438k886J9237m9675l2951N11Q5336p327Q074o2252m0601l2538
$$ 1508465 1508272 1496834 1493948 1513185 1463510 1430559 1431070 1516406 1509079 1517153 1454901 1414300 1381762
11976A381762l1694n413N7276k893m7226K4248j6183l4313l1396J5000L708r6614
$$ 1381762 1350068 1344655 1401931 1399038 1351812 1376060 1359877 1325564 1294168 1309168 1312876 1216262
11964A216262m1391k8194P123R4026P0793R358J4314n6436j00575L8446j3688
$$ 1216262 1174871 1146677 1153800 1247826 1318619 1327977 1342291 1285855 1185280 1223726 1210038
11953A210038j4825O2414K4768N9153J334o5652j08134j1307j1199J673l1965
$$ 1210038 1195213 1257627 1282395 1341548 1342882 1277230 1169096 1157789 1146590 1148263 1116298
11942A116298p7056m2013p150N7254L6297J0840M3387m6459M4138M2939K9183
$$ 1116298 1039242 997229 990079 1047333 1083630 1094470 1137857 1091398 1135536 1178475 1207658
11931A207658j8093k9567L9002J0477o9715m8617l7947Q751o0156J3957J6816
$$ 1207658 1189565 1159998 1199000 1209477 1139762 1091145 1053198 1061949 1001793 1015750 1032566
11920A032566N4216n031r6317l5574N1281P8781N103l8731m4818k6929M9007N299
$$ 1032566 1086782 1081751 985434 949860 1001141 1079922 1085025 1046294 1001476 974547 1023554 1028853
11908A028853o7378k3137k7271l1671N4840O4758R988p5303j5841M3976m5868
$$ 1028853 961475 938338 911067 879396 934236 998994 1008982 933679 917838 961814 915946
11897I15946o2608R166Q1303j9495L6053j2862k4579j9750m035Q977M055r034
$$ 915946 853338 862504 943807 924312 960365 947503 922924 903174 899139 908116 912171 903137
11885I03137o7009p4632j1655L5875L1580O0681N4326L1821l6547n951K5768k0623
$$ 903137 836128 761496 749841 785716 817296 877977 932303 964124 927577 921626 947394 926771
11873I26771J4525j5203l4750j9498j1021l8763l8279K9244P9610l5761j9544
$$ 926771 941296 926093 891343 871845 860824 822061 783782 813026 892636 856875 837331
11862H37331j1510l4382K0073K8855m1496j5090m1203l7894J1865Q82m711j3611
$$ 837331 825821 791439 811512 840367 798871 783781 742578 704684 716549 717431 712720 699109
11850F99109O0548L2194l2643Q874R89L2665o212n0943J7484l5021j09493k2652
$$ 699109 759657 791851 759208 768082 769071 801736 795524 744581 762065 727044 617551 594899
11838E94899Q8381Q1432j6604j3525q658P477l7022j1829m076j6199J6565J0951
$$ 594899 683280 764712 748108 734583 725925 733402 696380 684551 680475 664276 680841 691792
11826F91792P2369n7656k6333o696l011K4782J3226J9898l3578R153K7551L0903
$$ 691792 764161 706505 680172 673476 670465 695247 708473 728371 694793 703946 731497 762400
11814G62400J214k7667K68K7036k9271p0405m0646n8718Q964K4839R336k6748
$$ 762400 763614 735947 736215 763251 733980 663575 622929 564211 573175 598014 607350 580602
11802E80602J03291J6784R91j3554k1496O909p81J2623m2323l1963k3031k628
$$ 580602 683893 700677 701668 688114 666618 673527 672746 685369 643046 611083 588052 585424
11790E85424K2496k2121M3493N2316J0873n4891o3774q813K4581n959m7154P96
$$ 585424 607920 585799 629292 681608 692481 637590 573816 565003 589584 583625 536471 537267
11778E37267k0222R646L9158j988m260P0308J1918q592l8442q8471L63L0251P055
$$ 537267 517045 526691 565849 563861 559601 629909 641827 633235 594793 506322 506685 536936 543991
11765E43991P317Q730q9073l9574N1362N1060m0114m4845j4267L3655P6659J5027
$$ 543991 551308 560038 470965 431391 482753 533813 493699 448854 434587 468242 544901 559928
11753E59928R354q679l4343l072K354J2509n0485J0731J2016J5508m7711n9372
$$ 559928 569282 560603 526260 523188 525542 538051 487566 498297 510313 525821 478110 418738
11741D18738O4229L7340l476P4883J7937N48o027K2625J591l7709O679j6966J5605
$$ 418738 482967 520307 516831 591714 609651 610199 604172 626797 628388 590679 597358 580392 595997
11728E95997j0986m0478r888l7147J0046K4086r859K2811k0091q947q439P773
$$ 595997 585011 544533 534645 497498 507544 531630 521771 544582 524491 515544 507105 514878
11716E14878l0753k3077L5399l744k0283L8819N1464o7231Q773k5850m0682M1520
$$ 514878 484125 461048 496447 492703 472420 511239 562703 495472 504245 478395 437713 479233
11704D79233j085k8215K1477R0860M0180m8362q5804l2441l3631n9490O608M6257
$$ 479233 478148 449933 471410 562270 602450 554088 468284 435843 402212 342722 349330 395587
11692C95587L6015j7246o730l2028k1735P1475K8450m6878n4507J7462K4198q528
$$ 395587 431602 414356 407626 375598 353863 425338 453788 406910 352403 369865 394063 385535
11680C85535J1412M0679n449k9127K831M1133P554N0931j845r733n5702j6359
$$ 385535 396947 437626 432177 403050 405881 447014 454568 505499 503654 493921 438219 421860
11668D21860P610K7479L39j8367K783j2724J2756K618q382k6989m8365k5837k8828
$$ 421860 429470 456949 457288 438921 441704 428980 441736 444354 435972 408983 360618 334781 305953
11655C05953j6406K0761Q0752J4267N2912j2760m4392j536J7039k6703J2345p5214
$$ 305953 289547 310308 391060 405327 458239 445479 401087 399551 416590 389887 402232 327018
11643C27018n2170K0764K4802M1170O2170J643J0430k9034l8163L453k721k7924
$$ 327018 274848 295612 320414 361584 423754 425397 435827 406793 368630 372083 369362 341438
11631C41438n2418l8987M0046O0143j102m501L1228l2833J5610N0606J8857p1314
$$ 341438 289020 250033 290079 350222 349120 344619 375847 343014 358624 409230 428087 356773
11619C56773J3684N6149M5585p5422o9054m9247r514N5094l8924J3045o654p85
$$ 356773 370457 426606 472191 396769 327715 278468 268954 324048 285124 298169 291515 290730
11607B90730o359K7394K2755L9930l4868o3189j1923J23835N0340O126k72Q806
$$ 290730 284371 311765 334520 374450 339582 276393 264470 388305 438645 444771 444499 453305
11595D53305n9922l9302l2684n9840k5791J1211j5761O1204J6859j4162J3561
$$ 453305 393383 354081 321397 261557 235766 246977 231216 292420 309279 295117 308678
11584C08678l4946q912M9216J5715N252L1120p078m2654l9963N776L7351j9745
$$ 308678 273732 264820 314036 329751 335003 366123 359045 316391 276428 282204 319555 299810
11572B99810n448r6002k7145L1058N2791K6194m1104Q720M2574j9219K8662j5183
$$ 299810 294362 198360 171215 202273 255064 281258 240154 248874 291448 272229 300891 285708
11560B85708J3307J3087M7952n6861p7324O917N3906K6422L3323R54l4604K1589
$$ 285708 299015 312102 360054 303193 225869 232786 286692 313114 346437 347391 312787 334376
11548C34376L1300l3428l1881l8669O314Q737N3938K7434l3215o4010L9382j7062
$$ 334376 365676 332248 300367 261698 268012 276749 330687 358121 324906 260896 300278 283216
11536B83216j8932m503L4781k3096j6100M3502k0355J4371l6548m6338J7469P2008
$$ 283216 264284 259781 294562 271466 255366 298868 278513 292884 256336 209998 227467 299475
11524B99475K360m449j4889J626J8309m0612k1492O037m0988k5211L163j0078
$$ 299475 301835 297386 282497 284123 302432 261820 240328 246365 205377 180166 183329 173251
11512A73251L9382M7048K5018l8490q9174j2791J01173o88K2200l0458p1822K1412
$$ 173251 212633 259681 284699 246209 157035 144244 245417 244729 266929 236471 164649 186061
11500A86061Q9397P7870n6255p0108N53L4952j8457M8430M1913k5823q6676m807
$$ 186061 275458 353328 297073 226965 227518 262470 244013 292443 334356 308533 221857 217050
11488B17050N5082J4020M6410N0794l6952r4152n4518o568J4204j6326M0799M4596
$$ 217050 272132 286152 332562 383356 346404 252252 197734 191166 205370 189044 229843 274439
11476B74439K071M2808n7236j6327M598K2127R233K1762K5323m3605L6472O5092
$$ 274439 276510 319318 262082 245755 250353 272480 281713 303475 328798 285193 321665 386757
11464C86757M9159m3609n1943p5006j8720q747k2666J3320M8844K8415m2547K534
$$ 386757 435916 392307 340364 265358 246638 237891 215225 228545 277389 305804 263257 265791
11452B65791Q218j0753K1712l2123l4910J6329J729k9629J2584J3279K594n7508
$$ 265791 274009 263256 284968 252845 217935 234264 235993 206364 218948 232227 234821 177313
11440A77313p5106N2630N0589m1602l3339L7532L7799j9004o301L1449N232l5323
$$ 177313 102207 154837 205426 163824 130485 168017 205816 186812 180511 211960 217192 181869
11428A81869J6445Q2620K2461k2530m5182R17J2R263N1000l4693n2985J9120O364
$$ 181869 198314 280934 303395 280865 235683 236600 236612 245875 296875 262182 209197 228317 234681
11415B34681m7729M768L5254p188p838l547O3153k2882j0044L5599K0524k6657
$$ 234681 186952 191720 226974 219786 211948 208401 271554 248672 238628 274227 294751 268094
11403B68094J0769m6588N297k1549l2383k6514k3103K3910J2899j396l0860L4584
$$ 268094 278863 232275 237572 216023 183640 157126 134023 157933 170832 169436 138576 173160
11391A73160K8920J7715k3403K9148m931k2019o457M4417J6425m8095l0390p618
$$ 173160 202080 219795 196392 225540 220609 198590 192133 236550 252975 204880 174490 166872
11379A66872n627J5284M3368K9759M7141P248l2664l8261j0595J4797P755K0839
$$ 166872 161245 176529 219897 249656 296797 304045 271381 233120 222525 237322 245077 265916
11367B65916K6443n3676L8895J026o0016K0809l1230j22155k0920L2568J1492
$$ 265916 292359 238683 277578 278604 218588 239397 208167 86012 65092 97660 109152
11356A09152j2916N2473J192J4046M7071J4681j4921j5806l6728k4K542Q27r016
$$ 109152 96236 148709 149901 163947 211018 225699 210778 194972 158244 158220 160762 161589 152573
11343A52573M5783M6721J8869L4366J3456m0366n177q5697o1265L2249P4371J4740
$$ 152573 198356 245077 263946 298312 311768 271402 266225 180528 119263 151512 225883 240623
11331B40623q0342L2911O101k5720k5829L0973O8420k5416m0907l3270p8383k9394
$$ 240623 160281 193192 199293 173573 147744 178717 247137 221721 180814 147544 69161 39767
11319C9767Q0200M4709k9111J2502N6714J5701k9140k4776L9920j5332J5739N4562
$$ 39767 119967 164676 135565 148067 204781 220482 191342 166566 206486 191154 206893 261455
11307B61455J80l7855m680M553P0933k5845o3429l1235M7324R7439K6151n755
$$ 261455 261635 223780 219100 223653 294586 268741 205312 174077 221401 318840 344991 339236
11295C39236J470P7614Q1374K3552j8336N4606L1437K2542P4555J55997J78740
$$ 339236 340706 418320 499694 523246 504910 559516 590953 613495 688050 844047 1022787
11284A022787J20324K93971O15881R96050J561582J533752Q58184N01340J76426
$$ 1022787 1143111 1437082 2052963 3049013 4610595 6144347 7002531 7503871 7680297
11275G680297q13296j484207j427321j164828q72407o16067l87922j91162j31751
$$ 7680297 6867001 5382794 3955473 2790645 1918238 1302171 914249 723087 591336
11266E91336p5537p3514l9586o5507j28310p6885J9559N9306j0584L5452j4111
$$ 591336 515799 442285 402699 337192 208882 131997 151556 210862 200278 235730 221619
11255B21619o0886l5766L6221L6683l1277k7959O5296P531J4973j3126m4280m4542
$$ 221619 160733 124967 161188 197871 166594 138635 203931 211462 226435 213309 169029 124487
11243A24487M838K3148k0929L0940O1251l3170k917L8635K9587m8539q949K1227
$$ 124487 129325 152473 131544 162484 223735 190565 187648 226283 255870 207331 198382 219609
11231B19609k2211j7376N3013j4003j1691p0966n1496J2062Q94k298M9499L8859
$$ 219609 197398 180022 233035 219032 207341 136375 84879 96941 97835 95537 145036 183895
11219A83895N7737N0105p2798j19412p881j5547m8640P6532N5884n7522J8341
$$ 183895 241632 291737 218939 99527 91646 76099 27459 103991 159875 102353 120694
11208A20694K2365J9647K6710K6626k2727m3295o271n7628l2965K474L3958K2444
$$ 120694 143059 162706 189416 216042 193315 150020 143749 86121 53156 55630 89588 112032
11196A12032N4659k6362K502K3419k6803J9858k1257M6865R961N0012k978J3793
$$ 112032 166691 140329 142831 166250 139447 159305 138048 184913 194874 244886 241908 255701
11184B55701r132l8294M3738O9546o499J4606j4953n8555L268J09473P8830J14978
$$ 255701 246569 208275 252013 321559 315060 329666 314713 256158 259426 368899 447729 562707
11172E62707P4357Q0549J64881L14230L50272O95500J226974J479970R46751J71890
$$ 562707 637064 717613 882494 1196724 1546996 2242496 3469470 4949440 5896191 6068081
11162F068081J62438L87013j35884j057138j207365j133156r67822o50906m65547
$$ 6068081 6230519 6617532 6481648 5424510 4217145 3083989 2116167 1465261 999714
11153I99714k35904j61881p5584j23293j21886m7977k9973k0747k0372j3047l7339
$$ 999714 763810 601929 526345 403052 281166 233189 203216 182469 162097 149050 111711
11142A11711n0239p64j5122k6239l171J3898J06220M3110N720k1782o6544k4584
$$ 111711 61472 60708 45586 19347 16176 30074 136294 179404 185124 163342 96798 72214
11130G2214L0998Q0365m4071o943K5033n1270n3417j8921J2675K3284k3438l2443
$$ 72214 103212 183577 139506 132563 157596 106326 52909 33988 46663 69947 46509 14066
11118A4066J6505j1572L428L0835m9422j8640l0357N6801M7888j4669m0476N2596
$$ 14066 30571 18999 22427 53262 3840 -14800 -45157 11644 59532 44863 4387 56983
11106E6983N0198M4236L8150n8927l8461j4783j48j1207L4584K1547l1880q578
$$ 56983 107181 151417 189567 130640 92179 77396 77248 66041 100625 122172 90292 81714
11094H1714J6887M5585l5831q7166m2553l9341O2996J34557p362J7249J2909n3385
$$ 81714 98601 144186 108355 21189 -21364 -60705 2291 136848 129486 146735 159644 106259
11082A06259p4766L3689M1136K4765P038q251m6259l0730M4666K0494r378R41
$$ 106259 31493 65182 106318 131083 138121 129870 83611 52881 97547 118041 108663 109604
11070A09604K6056L5059l1277m0862J0994j9857N800K6264j0738k2221K2125L6936
$$ 109604 135660 170719 139442 98580 109574 89717 95517 121781 111043 88822 110947 147883
11058A47883R181k495l341M4802p096l3217j3214m6038k5221L4997j183m6345
$$ 147883 157064 154569 151228 196030 188934 155717 142503 96465 71244 106241 105058 58713
11046E8713p700P6794k7580n9707m2666o670O811j9491l8024R570M2684N6561
$$ 58713 51013 127807 100227 40520 -2146 -8816 -2005 -21496 -59520 -49950 -7266 49295
11034D9295K8254l4751K7887r337k4540k8088n367J3595o920J0796P406n840j6278
$$ 49295 77549 42798 70685 61348 36808 8720 3353 16948 10028 20824 28230 22390 6112
11021F112N1865L5392K932m760q8880l1379L7837K3982M7295j4903p1824k455
$$ 6112 57977 93369 96301 91541 2661 -28718 9119 33101 80396 65493 -6331 -8786
11009h786J10350O6331M434p6784o1396J2268J5664Q1022j2401l5664J5380J935
$$ -8786 101564 167895 172329 95545 34149 46417 62081 143103 130702 95038 110418 112353
10997A12353k3249J999l7812J2554M1849l8156p7645m2084M0081O7395J2842J7766
$$ 112353 89104 91103 53291 65845 107694 69538 -8107 -50191 -10110 57285 70127 87893
10985H7893K9272j2812K605m861r542l411P095l2094l6752j5012J570n974M8381
$$ 87893 117165 104353 106958 102097 92555 89144 96239 64145 27393 12381 13951 7977 56358
10972E6358j5282o7472k8180k1341J3033K6859N545j5566l9119L2040O1403j6339
$$ 56358 41076 -26396 -54576 -75917 -62884 -36025 -30480 -46046 -85165 -53125 8278 -8061
10960h061j3773M9052K3694j1420q977O614o7633m8805L6527N5138q155j1846
$$ -8061 -21834 27218 50912 39492 30515 37129 -30504 -79309 -42782 12356 4201 -7645
10948g645L843L6423K9918l6184q679j3720K9710k2599l3564O5475j8211m9143
$$ -7645 -3802 32621 62539 26355 17676 3956 33666 11067 -22497 42978 24767 -24376
10936b4376p317J4141L3567j6529k7047L2380m2909l9850N9253N3670J0554K169
$$ -24376 -31693 -17552 16015 -514 -27561 4819 -38090 -77940 -18687 34983 45537 47706
10924D7706m6539m3802K088K3089L5986K505P473q893n9277l6942j0816K4806
$$ 47706 1167 -42635 -40547 -17458 18528 21033 28506 19613 -39664 -76606 -87422 -62616
10912f2616k8177O2271N2047J8958k9839J10380P5533k5805l4412k3078l2669
$$ -62616 -90793 -28522 23525 42483 12644 123024 198557 172752 138340 115262 82593
10901H2593P448k5683j355K5747q566n009n3503L665M4359M1267p085Q831n5653
$$ 82593 90041 64358 63003 88750 80184 75175 21672 25337 69696 110963 103878 112709 57056
10888E7056j2646k3036p5846j5107P0062M2857j7942o3005j1628N7268K443n3324
$$ 57056 44410 21374 -54472 -69579 483 43340 25398 -37607 -49235 8033 10476 -42848
10876d2848j0924Q0029R771m4967L371o406M4882m480k9639J8954K8866p043J610
$$ -42848 -53772 26257 36028 -8939 -5568 -11974 32908 28428 -1211 17743 46609 39566 41176
10863D1176l6910l9972m7580l569N7828M5387n440K6578J985N7878J9129l8016
$$ 41176 4266 -35706 -83286 -86855 -29027 16360 10920 37498 39483 97361 116490 78474
10851G8474m7578l8282n964L0377P375J7742L766K931o2066o6160M5043N8768
$$ 78474 30896 -7386 -13350 17027 24402 42144 45910 48841 -13225 -79385 -34342 24426
10839B4426K1863k8256j869L621M4514k1145k9327K8143j5725k0443P6634j524
$$ 24426 46289 18033 16164 19785 64299 43154 13827 41970 26245 5802 82436 80912
10827H0912R792k0205l5122p7687J5390L8744M1550r900l325m703m351M402L9133
$$ 80912 90704 70499 35377 -42310 -26920 11824 53374 43474 40149 35446 31095 35497 74630
10814G4630m0820q0958n7731L4908R1327M3441n0490P668P0130N6650k6821k3186
$$ 74630 33810 -47148 -104879 -69971 21356 64797 14307 21975 92105 148755 121934 98748
10802I8748l0455k5174J1178M540N7141j6943k1930M2324k3807j2971l1980m0387
$$ 98748 68293 43119 54297 58837 115978 99035 77105 119429 95622 82651 50671 10284
10790A0284l869J5666l5513m9609K1134P7712R531m421K7716l1030k982l673K24
$$ 10284 6415 22081 -13432 -63041 -41907 35805 45336 40915 68631 37601 34619 30946 31170
10777C1170l6101N3897R570j7927j6780o813O873L421l4681J4369J8430K2409
$$ 31170 -4931 48966 58536 40609 23829 17016 23889 27310 -7371 6998 25428 47837
10765D7837J7122m5517m0056k187J938M4386K0158M2185L1189K1107o5841l7558
$$ 47837 64959 19442 -20614 -22801 -20863 23523 43681 85866 117055 138162 72321 34763
10753C4763N4783J405J2936l415r9466o9026O3177O0187O9070l3454j8864l1119
$$ 34763 89546 90951 103887 100472 1006 -68020 -4843 55344 124414 90960 72096 40977
10741D0977K2492J5967k9900l9508K2100R667J8030J2369J651J2234o8378J0535
$$ 40977 63469 79436 49536 10028 32128 41795 59825 72194 73845 86079 17701 28236
10729B8236N8175k5821M337k7323J2008O668J1031J3596n5146o0397N0569Q338
$$ 28236 86411 60590 64927 37604 49612 56280 67311 80907 25761 -34636 15933 24271
10717B4271K5989K245j8122m931j675L2179J1406K7247J2018p3317q468o640j0657
$$ 24271 50260 52505 34383 29452 27777 59956 71362 98609 110627 37310 28842 22202 11545
10704A1545L863j265P38L2130N7632K424O613L6282k2545k1521o4249N3299J7745
$$ 11545 15408 14143 14881 47011 104643 107067 113680 149962 127417 105896 41647 94946 112691
10691A12691o887L3764o993q7523k646n224r0506l8927N6961K6528J4972j6430
$$ 112691 105804 139568 132575 45052 42406 37182 -53324 -92251 -35290 -8762 6210 -10220
10679a0220n4433M71j6433k1013N350q247j3557N5614Q606M445j2973Q54J2066
$$ -10220 -64653 -64182 -80615 -101628 -96278 -104525 -118082 -62468 -53862 -49417 -62390 -61536 -49470
10666d9470j0964K9534l2744j8564j7910O5634O7103j179k1983n1914m9049O187
$$ -49470 -60434 -30900 -63644 -82208 -100118 -34484 32619 31440 9457 -42457 -91506 -85319
10654h5319L4926K5775K819l6694j8674R8287J11432k1005m6094j0286m3549M8
$$ -85319 -50393 -24618 -21799 -58493 -77167 21120 132552 111547 65453 55167 11618 11666
10642A1666j9534l6906j2322M1009J7196Q698k172N933J6918J9825r81m2086j5621
$$ 11666 -7868 -44774 -57096 -16087 1109 9807 7635 13568 30486 50311 49330 7244 -8377
10629h377K2869M5549N2664o1405k8995N5371L3614l7356o2003M0453L3305L1447
$$ -8377 14492 60041 112705 51300 22305 77676 111290 73934 11931 52384 85689 117136
10617A17136k3121n4075o851J234k8668J1943J7831l0187L4991m0366J8225J6739
$$ 117136 94015 39940 33089 34323 5655 17598 35429 5242 40233 -133 18092 34831
10605C4831l1519k3229J798K4639P1948L2354j3377n0761K1856L7826l6499n7977
$$ 34831 3312 -19917 -18119 6520 78468 110822 97445 46684 68540 106366 69867 11890
10593A1890m274Q986J1577J4871o0131q583O0704N1140j1824J0521j0482N0874
$$ 11890 7616 16602 28179 43050 -17081 -25664 35040 86180 74356 84877 74395 125269
10581A25269n983N6999J7685p4011n9717k8712p2613m6670J0415k9582N814O330
$$ 125269 119286 176285 193970 119959 60242 31530 -41083 -87753 -77338 -106920 -101106 -94776
10569i4776O5970O0583O5546N799K0620L0897K024k671K262J3983l876J3107K9234
$$ -94776 -28806 31777 97323 103122 123742 154639 156663 153992 156254 170237 166361 179468 208702
10556B08702q086q0173p9804m1580l9616M9713N0409K5812m0518k8003J5120j3666
$$ 208702 200616 120443 40639 -941 -40557 9156 59565 85377 44859 16856 31976 18310
10544A8310j3019k1311k931m54J3220K9050J7719k4423r647M9930J4830n3327
$$ 18310 5291 -16020 -18951 -19405 -6185 22865 40584 16161 6514 56444 71274 17947
10532A7947l1263J1363L5187j5182l6824L491j5095M6870R4443N4564m5202n3938
$$ 17947 -13316 -1953 33234 18052 -18772 -15281 -30376 16494 110937 165501 120299 66361
10520F6361p9759m3996M6308M478m0924j2283M5989M4804k7935m8775j0545O9388
$$ 66361 -13398 -57394 -11086 -6608 -47532 -59815 -13826 30978 3043 -45732 -56277 13111
10508A3111M6717J6573k1124m1266j6198k8432m8148L3515L5472l6256k6113J6328
$$ 13111 59828 76401 55277 14011 -2187 -30619 -78767 -45252 -9780 -46036 -72149 -55821
10496e5821N8174M3894L8695Q135j0933O2565n063j14536j5149L0705J6181L75
$$ -55821 2353 46247 84942 93077 82144 144709 139646 25110 9961 40666 56847 57222
10484E7222n0681m1397j3587Q116k0657j6090M6040J4347K0264k5963r848K6864
$$ 57222 6541 -34856 -48443 -40327 -60984 -77074 -31034 -16687 3577 -22386 -32234 -5370
10472e370L4083o2005P480L0223j983K6333M6644J2152J0245m9092q910L3221
$$ -5370 28713 -33292 -25812 4411 2428 28761 75405 87557 97802 48710 39800 73021
10460G3021l6418q1364K997J5976P0959N469j5596o0950n539l0365J7599M2936
$$ 73021 36603 -44761 -41764 -25788 45171 50640 35044 -25906 -31445 -61810 -44211 -1275
10448a275M4716L8524R238J798M406Q604l2m0363m9160L8013k1320p8978L0287
$$ -1275 43441 81965 91203 93001 97407 106011 105979 65616 16456 54469 33149 -45829 -15542
10435a5542N8679j1928k2552j7113K0831J5025M590l7416L54O1137L2733k9942
$$ -15542 43137 31209 8657 -8456 12375 27400 31990 -5426 -5072 56065 88798 58856
10423E8856l4681l5097n3940N258J9538m5248k7026N4992N5789L7716j8695J3394
$$ 58856 24175 -10922 -64862 -59604 -40066 -85314 -112340 -57348 -1559 36157 17462 30856
10411C0856m2351l5889J06J827J6496N841L2055N4600J4118l1515q1054k747O0084
$$ 30856 -11495 -47384 -47278 -45451 -28955 -23114 8941 63541 77659 46144 -34910 -37657 22427
10398B2427K2103K4264N873O0129j7924n9827j2332o0117q827L5402K2955J8031
$$ 22427 44530 68794 74667 134796 116872 57045 44713 -15404 -24231 11171 34126 52157
10386E2157n2162K193M4791j0014L508l9679k9111J459K1266l263n9937L9638
$$ 52157 -5 2188 46979 36965 40473 794 -28317 -26858 -5592 -8855 -68792 -29154
10374b9154P881j436m9019m0754p499L5241K2493N8244l332J2072q247o9379Q071
$$ -29154 -21273 -22709 -71728 -112482 -119981 -84740 -62247 -4003 -7335 4737 -3510 -72889 -64818
10361f4818K4055l9169J1223m8K9242J2658K6324K0182k2762k1361N4428L6021
$$ -64818 -40763 -79932 -68709 -68757 -39515 -26857 -533 19649 -3113 -24474 29954 65975
10349F5975k3690n2355o1164k2574J0775O358N2269L4871K0440k8674k3743q60
$$ 65975 42285 -10070 -71234 -93808 -83033 -76675 -24406 10465 30905 2231 -21512 -22372
10337b2372N9025L7013K0448j2235L2045l1089n3762m5856J7889l2353k7565j5871
$$ -22372 36653 73666 94114 81879 113924 82835 29073 -16783 1106 -31247 -58812 -74683
10325g4683K68K0051L2302j3735l4744Q928K7308K9805L5254K5802j5993m7467
$$ -74683 -74415 -54364 -22062 -35797 -70541 -61613 -34305 -4500 30754 56556 40563 -6904
10313f904k6595J9007N8331L0707N069l5331O5227K4532J0765p373n6683R947
$$ -6904 -33499 -14492 43839 74546 79615 44284 109511 134043 144808 137435 80752 90699
10301I0699j0844k7110K5339J0379j15244n0659l5598l9048N9561P3204M0560
$$ 90699 79855 52745 78084 88463 -26781 -77440 -113038 -152086 -92525 -19321 21239
10290B1239l2825o0130L8292J6815j9933K9928p3843o8981J583L4875N0635L8152
$$ 21239 -11586 -71716 -33424 -16609 -36542 -6614 -80457 -149438 -147855 -112980 -62345 -24193
10278b4193L2180p772j7220l0551K6802K2239k8007l8303J6039J8935Q848j324
$$ -24193 7987 215 -17005 -47556 -20754 1485 -26522 -64825 -48786 -29851 -21003 -22327
10266b2327j4866K1082K7581l3790l9821k0620K5337Q2928K5435j1976O762k327
$$ -22327 -37193 -16111 11470 -22320 -62141 -82761 -57424 25504 50939 38963 45725 43398
10254D3398r548L7086k774L2963L0473J1700k2418q9439m8970J1752R367l3430
$$ 43398 33850 70936 68162 101125 131598 143298 120880 31441 -17529 -5777 3590 -29840
10242b9840n6261J5151L8910k5794j5449o9921O7534P5308J7019m5843q284J3433
$$ -29840 -86101 -70950 -32040 -57834 -73283 -143204 -75670 -362 16657 -29186 -37470 -24037
10230b4037J3551r826k9581L1086K9669M1973N4285P2873Q919p2400k611k9949
$$ -24037 -10486 -20312 -49893 -18807 10862 52835 107120 179993 188912 116512 113901 83952
10218H3952J9927M6882K3269p2770n6002m0815J093M9125L8935n3016l1159J9611
$$ 83952 103879 150761 174030 101260 45258 4443 5536 54661 93596 40580 9421 29032
10206B9032K8945j9950k982l5954l8176N8407k1199q73n085L0477P325l8703M260
$$ 29032 57977 38027 35045 -909 -39085 19322 -1877 -2750 -7835 22642 29967 -8736 -4476
10193d476j4789L3284j2287L5874j8712O84K7062q9670j3229P4226M3165j4025
$$ -4476 -19265 14019 1732 37606 18894 19578 46640 -43030 -56259 17967 61132 47107
10181D7107l4857o746p1150k9176N2831K1412l2130L9376k9281L871j0815K0630
$$ 47107 12250 5504 -65646 -94822 -41991 -20579 -52709 -13333 -42614 -38743 -49558 -28928
10169b8928P0735j125o262l475Q400L2061P949j2972J9398m2361o2304l3197K8984
$$ -28928 41807 40682 34420 30945 39345 71406 79355 66383 85781 43420 -18884 -52081 -23097
10156b3097p816k1658P465l91L2995M3474L479k5367k5166p199j3358K0973N1558
$$ -23097 -30913 -52571 -45106 -45497 -12502 30972 34451 9084 -16082 -23281 -36639 -15666 35892
10143C5892m1202j1044j0596j5336l0420M041L4269R2406K2215N607j6905n1977
$$ 35892 -5310 -16354 -26950 -42286 -72706 -68665 -34396 58010 80225 85832 68927 16950
10131A6950q4972k6789N3545J7747N6053j5075q5613k51M6062J04808l054L0897
$$ 16950 -68022 -94811 -41266 -23519 32534 17459 -68154 -68405 -22343 82465 79411 110308
10119A10308N3008j7881j3500k6765r6268n0106j8789J387L6128L7768m4201P442
$$ 110308 163316 145435 131935 105170 8902 -41204 -59993 -58606 -22478 15290 -28911 -21469
10107b1469L0585k6345K9284K7635k1844N4447N340m4095p706K9212O3009j942
$$ -21469 9116 -17229 12055 39690 17846 72293 77633 33538 25832 55044 118053 116111
10095A16111R200K2684k0009J1598q421j8923J3024m2427o8463J9148O377L4850
$$ 116111 125311 147995 127986 139584 131163 112240 125264 82837 14374 33522 39899 74749
10083G4749J0192q831M854j276J3754K2172m196l4721j7603N150k239l5703k5863
$$ 74749 84941 76110 80964 79688 93442 115614 111418 76697 59094 64244 62005 26302 439
10070D39j8414M3050l3638J4840N9362l2965L925M2461m0656o35j0308K1969p281
$$ 439 -17975 25075 -8563 6277 65639 32674 36599 79060 38404 37769 27461 49430 42149
10057D2149j8171M5402J0975k1800K6298N4774J7441m6766l5529n6257j6451K7605
$$ 42149 23978 69380 80355 58555 84853 139627 157068 110302 74773 18516 2065 29670
10045B9670M1176K3910N6718J45920K19463L90354P17544N18576l77446l90574
$$ 29670 70846 94756 151474 297394 516857 907211 1624755 2143331 1765885 1375311
10035A375311l83638l95538j70687j21136p4953l4402l0507l2480k6461l0796
$$ 1375311 991673 596135 425448 304312 229359 194957 164450 131970 105509 74713
10025G4713K1583O2527P7314l6941m8088N54n1585k9323l9567m656k0443l6870
$$ 74713 96296 158823 236137 199196 151108 151662 100077 70754 31187 26531 6088 -30782
10013c0782o842k0693K4527J02664L7264n2740p1783j6573k8918J0932K1916M2084
$$ -30782 -37624 -58317 -33790 68874 106138 53398 -18385 -34958 -63876 -52944 -31028 11056
10001A1056m8603k7688L4447N1577P569l4515j8767J0474k4782p72K9170J5390
$$ 11056 -37547 -65235 -30788 20789 28358 -6157 -24924 -14450 -39232 -40004 -10834 4556
9989D556N0952J3867q0678N103m7225k5733M3317N4219L6409L7217q5723r1870
$$ 4556 55508 69375 -11303 -6200 -53425 -79158 -35841 18378 54787 92004 6281 -85589
9977h5589M5271M1081J7072l2970l2088p433K013m445k4024j1906K341L6599J9638
$$ -85589 -40318 763 17835 -15135 -47223 -54656 -52643 -57088 -81112 -93018 -90677 -54078 -34440
9964c4440k9674K350J8214p644l2623Q680L5387N4069J2755J5146k3086j8695
$$ -34440 -64114 -61764 -43550 -51194 -83817 -75137 -39750 14319 27074 42220 19134 439
9952D39l0530p494J8958J7109o6690k47N223K2445K1574J1078M610J1208K5432
$$ 439 -30091 -37585 -18627 -1518 -68208 -68455 -63232 -40787 -19213 -8135 -3525 7683 33115
9939C3115J027o8757j2053L340M316P156k7031K770M8931K8310k7117k9597K0250
$$ 33115 34142 -34615 -46668 -43328 -39012 -31856 -58887 -56117 -7186 21124 -5993 -35590 -15340
9926a5340j4901J3644J5843j9542n4061K1474N0420P1853R38n3214n1961k2026
$$ -15340 -30241 -16597 -754 -20296 -74357 -52883 -2463 69390 70328 17114 -34847 -56873
9914e6873j5906O6785O982l9192P025j1894k8820p595Q7945J2235l0418k8758
$$ -56873 -72779 -5994 988 -38204 -31179 -43073 -71893 -79488 8457 20692 -9726 -38484
9902c8484j1820J8794j2519k1933l682L6992N01M204K9549k5196l1239K4493k5116
$$ -38484 -50304 -31510 -44029 -65962 -69644 -32652 -32151 -27947 1602 -23594 -54833 -30340 -55456
9889e5456J8619K0262m6716L0409K9787k9045L9647M0509K2674J348o5986m0288
$$ -55456 -36837 -16575 -63291 -32882 -3095 -32140 7507 48016 70690 72038 6052 -34236
9877c4236n251N7208J03610r157o2193m1975m2998k3569L6514j6148j6381k2226
$$ -34236 -39487 17721 121331 112174 49981 8006 -34992 -58561 -22047 -38195 -54576 -76802
9865g6802L1743N0155k0372l5661k060k6723k6509L1219M3188l2070p4578j4845
$$ -76802 -45059 5096 -15276 -50937 -52997 -79720 -106229 -75010 -31822 -63892 -138470 -153315
9853a53315L3765N2359P2664O3732P4736n2730m3551k7447o348j232l9692k7481
$$ -153315 -119550 -67191 5473 69205 143941 91211 47660 20213 13865 12633 -27059 -54540
9841e4540N0480M7634O988K8415N632k1060J032N373m2906j5007L56J7570K0473
$$ -54540 -4060 43574 50562 78977 84609 63549 64581 69954 27048 12041 12397 29967 50440
9828E0440l213r947p9479n9159n979L4924J6754m530m7529m4805l636K6629L6354
$$ 50440 47227 37280 -42199 -101358 -107337 -72413 -55659 -60189 -107718 -152523 -156159 -129530 -93176
9815i3176M3163Q01K0180M8864M5495k4434j3491j542o1527q2690j1436j8837
$$ -93176 -50013 -49212 -29032 19832 65327 40893 27402 25860 -35667 -118357 -129793 -148630
9803a48630j6023N189J5686L8163k6418K6891P0956K3582o3120L8608R4188N1498
$$ -148630 -164653 -159464 -143778 -105615 -132033 -105142 -34186 -10604 -73724 -35116 59072 110570
9791A10570k1196k6492R761l3126l7074L1031m625r0699M7571N7411j2479k6017
$$ 110570 89374 62882 72643 39517 2443 33474 28849 -61850 -14279 43132 30653 4636
9779D636n0759m0981M061j0804k7496Q627k6004j5846L5375q269k4042M8348M6779
$$ 4636 -46123 -87104 -83043 -93847 -121343 -112716 -138720 -154566 -119191 -127460 -151502 -103154 -56375
9766e6375K0612J7931k5970o3864K4632p568J250J6584O2994J0013J4507J7436
$$ -56375 -35763 -17832 -43802 -107666 -83034 -90602 -89352 -72768 -9774 239 14746 32182
9754C2182l2705M3027O684j9565j1947j5977m753o811j1996N2137l3126l048M9068
$$ 32182 -523 42504 49188 29623 17676 1699 -3054 -9865 -21861 30276 -2850 -5898 43170
9741D3170k9482n9713m6125l355P5014l1110p730J6589m9607m411j9827O4444
$$ 43170 13688 -46025 -92150 -95505 -20491 -51601 -59331 -42742 -92349 -96760 -116587 -52143
9729e2143R02j8146L5639r743K2441K7237j1321K1962L0860n1638l7166k022R505
$$ -52143 -51241 -69387 -33748 -43491 -21050 6187 -5134 16828 47688 -3950 -41116 -43138 -33633
9716c3633L4485K3304K9586J0438l5350r691j6262O405j6518j6501J5107J69N4955
$$ -33633 852 24156 53742 64180 28830 19139 2877 9282 -7236 -23737 -8630 -8461 46494
9703D6494l898p4404o7262o7157O9662M2473l0653j2995L6130L8140K7944o436
$$ 46494 42596 -31808 -99070 -166227 -96565 -54092 -84745 -97740 -61610 -23470 4474 -1962
9691a962j16326k8097O9357k4841J3590M7077j3504m5598m8115M5784O9262K7377
$$ -1962 -118288 -146385 -77028 -101869 -88279 -41202 -54706 -100304 -148419 -102635 -33373 -5996
9679e996k2656l2257K0282J2202K2125m15n0235j5186J799o0353j2033J2938L9033
$$ -5996 -28652 -60909 -40627 -28425 -6300 -6715 -56950 -72136 -70337 -130690 -142723 -129785 -90752
9666i0752N465Q2928N7118k7811l2935O2288L6906M2214M5437m8258m7211r8341
$$ -90752 -85287 -2359 54759 26948 -5987 56301 93207 135421 180858 132600 85389 -12952
9654a2952o8553L1817M7221N4805O45r2964m7824j4193q1860J6955K9584k6158
$$ -12952 -81505 -49688 -2467 52338 52983 -39981 -87805 -101998 -183858 -166903 -137319 -163477
9642a63477N2773Q4808q307n733N9271K5806j7247l3851p0888r929M4462L844
$$ -163477 -110704 -25896 -34203 -39936 19335 45141 27894 -5957 -76845 -86774 -42312 -38468
9630c8468R519M8796k6711n8772l3633L8533O1098K8956j4190l1976M4149N7951
$$ -38468 -28949 19847 -6864 -65636 -99269 -60736 362 29318 15128 -16848 27301 85252
9618H5252J5790q522p0133l8105J4676R289K8258M804J3842o2842j6452k3744
$$ 85252 101042 92520 22387 -15718 -1042 8247 36505 41309 55151 -7691 -24143 -47887
9606d7887J5906J9358j3088l8416L7705O675j0280l4499N5322K0794o1929l3703
$$ -47887 -31981 -12623 -25711 -64127 -26422 -19747 -30027 -64526 -9204 11590 -50339 -84042
9594h4042J9989L9838M2827J0206M8779n7387q9343J2851N0030m5368l1694m922
$$ -84042 -64053 -24215 18612 28818 77597 20210 -69133 -56282 -6252 -51620 -83314 -88236
9582h8236J8947L4906N1815J1493j1123j6526K9411J7419m5666l0651j5851K2232
$$ -88236 -69289 -34383 17432 28925 17802 1276 30687 48106 2440 -28211 -44062 -21830
9570b1830K8363j0039m0482M3003k7961l3564l719M2386L3938K1323K3332O285
$$ -21830 6533 -3506 -43988 -985 -28946 -62510 -66229 -23843 10095 31418 54750 61035
9558F1035l4369j6377k1002L7126J0731o147n6294j0939m4065j8505L1618O7170
$$ 61035 26666 10289 -10713 26413 37144 30997 -25297 -36236 -80301 -98806 -67188 -18
9546a8M3013p7078o2480O6366k6685l0127N2806N9741m932k5508J5193N126J8765
$$ -18 42995 -34083 -96563 -30197 -56882 -87009 -34203 25538 20606 -4902 10291 15417 34182
9533C4182m1193m7216K0706k9141j6446j95m7582K8555K1852K5399K4016n276
$$ 34182 -7011 -54227 -33521 -62662 -79108 -79303 -126885 -98330 -76478 -51079 -27063 -32339
9521c2339J5504K4270K45p870L5697L7266J0843n5137q3776j8935Q6042L4423
$$ -32339 -16835 7435 7680 -190 35507 72773 83616 28479 -55297 -74232 11810 46233
9509D6233m3125o1003o5614O6309Q8020O1212J2850l3270k3016k6779j0640R387
$$ 46233 3108 -57895 -123509 -57200 30820 92032 104882 71612 48596 21817 11177 20564
9497B0564q875P910M4912J4280J9155l0487j06093p0912j3027O5374N538o2205
$$ 20564 11689 19599 64511 78791 97946 67459 -38634 -109546 -122573 -57199 -51661 -113866
9485a13866j1529M4157L3492J8455k837N279k163p216M1492N38Q622l6247l7545
$$ -113866 -125395 -81238 -47746 -29291 -32128 -26849 -29012 -36228 5264 5802 14424 -21823 -59368
9472e9368j4142m326L4150L2560M9732L7760j12392m6495K6720N2845j4747j5447
$$ -59368 -73510 -77836 -43686 -11126 38606 76366 -36026 -82521 -55801 -2956 -17703 -33150
9460c3150k312n2299l9671N746L3471N5155M1132N6322J1921R117J5850m3182
$$ -33150 -35462 -87761 -127432 -121686 -88215 -33060 8072 64394 76315 85432 101282 58100
9448E8100j0930M585K2249K5324p8744o6924O984M2365K8093l3109m3539o310
$$ 58100 47170 51755 74004 99328 20584 -46340 -39356 3009 31102 -2007 -45546 -51856
9436e1856K6360K4754L9173L5991M1856o3033l7642N9080k0105n9545m8156k5705
$$ -51856 -25496 -742 38431 74422 116278 53245 15603 74683 54578 -4967 -53123 -78828
9424g8828P8610O7917j8196j0619J4472l9507j5393j8291M2313P7853k599m5993
$$ -78828 -218 67699 49503 38884 53356 13849 -1544 -19835 22478 100331 97732 51739
9412E1739l3607n3440J390L7554l2731J1270l3173O3489j2281k5082K6415M7437
$$ 51739 18132 -35308 -33918 3636 -29095 -17825 -50998 12491 210 -24872 1543 48980
9400D8980l1493L5401L1888L7073Q781k0584K1125N6642q0673j01245r4363l1452
$$ 48980 17487 52888 84776 121849 130630 110046 131171 187813 107140 5895 -88468 -119920
9388a19920M8326N1718l4436L2532J1750n683K225l1328k12P741j3081m268k0902
$$ -119920 -71594 -19876 -54312 -21780 -10030 -15713 -13488 -44816 -45028 -37287 -50368 -54636 -75538
9375g5538J6829k4121P822l7567P934L1807k3614l8295q661L7499m745o178L0204
$$ -75538 -58709 -82830 -75008 -112575 -104641 -72834 -96448 -134743 -143404 -105905 -110650 -116828 -86624
9362h6624P505N7563K3490J9952k0415N8769N9522k5641j02651l0036Q770J5158
$$ -86624 -79119 -21556 1934 21886 1471 60240 119762 94121 -8530 -38566 -29796 -14638
9350a4638q899L0429N0398J6522j9754j4561M098m9188k9671J3395k2698J9941
$$ -14638 -23537 6892 57290 73812 54058 39497 43595 -5593 -35264 -21869 -44567 -24626
9338b4626O1401L1974Q667l5776j4580J8592k4543r016M5666J8836l5105k2055
$$ -24626 36775 68749 77416 41640 27060 45652 21109 12093 57759 76595 41490 19435
9326A9435J4786k0153p7694M717n561k8507Q450O093L2187j967J5532j7936L802
$$ 19435 34221 14068 -63626 -58909 -64470 -92977 -84527 -78434 -46247 -48214 -32682 -50618 -46816
9313d6816N3538j5907P921L3062P3608M1307k1693p600L4063L1747j266n4892
$$ -46816 6722 -9185 -1264 31798 105406 146713 125020 117420 151483 183230 181964 127072
9301A27072r516l7763j6876O7682O5957j3026m2164m5807m0283m005K3051J9486
$$ 127072 117556 79793 62917 130599 196556 183530 141366 95559 55276 51271 74322 93808
9289I3808K7887m7559L956p8513n5382k5544M8880N2937n2802J9201M008N32k7588
$$ 93808 121695 74136 78092 -421 -55803 -81347 -32467 20470 -32332 -13131 -9123 -8591 -36179
9276c6179O1954K0333n4466m5034O700O140J3362j0513M2883K6260j0517k4658
$$ -36179 25775 46108 -8358 -53392 -46692 -40552 -27190 -37703 5180 31440 20923 -3735
9264c735M6217K635O4111j6860K4837l870l1779K332j5776L637P3365l562m2327
$$ -3735 42482 45117 109228 92368 117205 113335 81556 83888 68112 71749 145114 141552 99225
9251I9225J9831K116J2369K8158r1888p1569k403O6984K2644K8934j1904n9164
$$ 99225 119056 121172 133541 161699 69811 -1758 -4161 62823 85467 114401 102497 43333
9239D3333k6746k6750K0668p971M0665k2393J1859J6490m4905J1495J0370l1932
$$ 43333 16587 -10163 10505 2534 43199 20806 32665 49155 4250 15745 26115 -5817
9227e817o843o810K4280M4858m7926k7404J7086L9645M8608k760k8066l7543L3080
$$ -5817 -12660 -19470 4810 49668 1742 -25662 -8576 31069 79677 76917 48851 11308 44388
9214D4388N0255N511j108m0837m8213m6516R972K3776L4209N9740J0431l9228
$$ 44388 94643 100154 99046 58209 9996 -36520 -26548 -2772 31437 91177 101608 62380
9202F2380Q246l8664k6156l2934q3906j0061L1365L4248L6832L6363j5756l4227
$$ 62380 70626 31962 5806 -27128 -111034 -121095 -89730 -55482 -18650 17713 1957 -32270
9190c2270m2391p33N1967M5374N9114P526O92J6250n4121M190m130l2512J6072
$$ -32270 -74661 -75394 -23427 21947 81061 88587 89279 105529 51408 55598 51468 18956 35028
9177C5028J90k4804j7614K9950J9748k5356k5485o452O7800K5647o948K8103q001
$$ 35028 35218 10414 -7200 22750 42498 17142 -8343 -14795 53005 78652 71704 99807 91806
9164I1806l8306j3086m5317m0235k252N315N814J6189J7977o205j8361k8064J5963
$$ 91806 53500 40414 -4903 -45138 -47390 -42075 -36261 -20072 -2095 -8300 -26661 -54725 -38762
9151c8762O2453j0249j8221j7226L1270J2427J8401k5506N5777L7327m0205k6675
$$ -38762 23691 13442 -4779 -22005 9265 21692 40093 14587 70364 107691 67486 40811
9139D0811J4679k7154k4404M9983J9714m8385l907K9071j4438r867J5273r313
$$ 40811 55490 28336 3932 53915 73629 25244 21337 50408 35970 26103 41376 32063
9127C2063J1470M8722r511n7360m7709r192L573K6605K3387K0971k8956l8732
$$ 32063 43533 92255 82744 25384 -22325 -31517 -27944 -1339 22048 43019 14063 -24669
9115b4669O8076J861L354l9514k3030k1893N0888J7228l3794j2910N000n172Q007
$$ -24669 43407 45268 48622 9108 -13922 -35815 15073 32301 -1493 -14403 -9403 -14575 -6568
9102f568k1744q769k7068l3308N2230J5952l511q4066p948O0524O674P229O3338
$$ -6568 -28312 -37081 -64149 -97457 -45227 -29275 -32786 -116852 -124800 -64276 -57602 -50373 12965
9089A2965K2265m608j221J2242k6170L702m0127k0886j8785M5406M0998K2345
$$ 12965 35230 30622 29401 41643 15473 19175 -20952 -41838 -60623 -15217 25781 48126
9077D8126j1984K55J4630M6374l171l3994j49020l1623N7253j258j0600M1615
$$ 48126 36142 36397 51027 97401 94230 60236 -88784 -120407 -63154 -64412 -75012 -33397
9065c3397N4946Q7450J7421J0509m3128o2371k7184k1980o163M2264L0674J2623
$$ -33397 21549 108999 126420 136929 93801 31430 4246 -17734 -23897 18367 49041 61664
9053F1664l592k8050l9944N988N2408l2149K3297n5863K5523L7255q689l3927
$$ 61664 58072 30022 -9922 -3934 48474 16325 39622 -16241 9282 46537 37848 3921
9041C921m2482l8204N2785J1787r0242l8794L3560N454r482N4038M5631l5883
$$ 3921 -38561 -76765 -23980 -12193 -102435 -141229 -107669 -102215 -111697 -57659 -12028 -47911
9029d7911J5097m4135N1078M5089N8066j8353o9318J9674M8212K3504q923p6045
$$ -47911 -32814 -76949 -25871 19218 77284 58931 -10387 9287 57499 81003 72080 -3965
9017c965N975n6036j9183L3209N9989P5433m3107L279p2141j5352N227K8178k713
$$ -3965 2010 -54026 -73209 -40000 19989 95422 52315 55594 -16547 -31899 -26672 1506 -1207
9004a207k5980K6310M684k7318o6453k6995K1706L6906L0978K7113J6892n0020
$$ -1207 -27187 -877 3807 -23511 -89964 -116959 -95253 -58347 -27369 -256 16636 -33384
8992c3384o3591K6787P2942j751o4998l5924P929J9367K678m916J7279O7114j6913
$$ -33384 -96975 -70188 2754 1003 -63995 -99919 -91990 -72623 -69945 -74861 -57582 9532 -7381
8979g381k7492Q133j4528R254M416M2025N3299L2898n0930l1259p611n1052l0486
$$ -7381 -34873 -26740 -41268 -32014 -27598 14427 67726 100624 49694 18435 10824 -40228 -70714
8966g0714J3703K4121M2661k3319L8848K3076j5609K6448O315j7867k9184K4333
$$ -70714 -57011 -32890 9771 -13548 25300 48376 32767 59215 65530 47663 18479 42812
$$ [...]
##END NTUPLES=NMR SPECTRUM
##END=
