##TITLE=Analysis number 316413
Compound Code cc 43310
Book Reference 414/158
Project Code adrs
Chemist Name mattw
##JCAMPDX= 6.0         $$ Bruker NMR JCAMP-DX V2.0
##DATA TYPE= NMR SPECTRUM
##DATA CLASS= NTUPLES
##ORIGIN= Bruker BioSpin GmbH
##OWNER= nmr
$$ XWIN-NMR		Version 3.5
$$ Fri Jan 13 10:02:33 2006 GMT Standard Time (UT+0h)  MAYBRIDGE\nmr@NMR_250MHZ
##.OBSERVE FREQUENCY= 250.131544655141
##.OBSERVE NUCLEUS= ^1H
##.ACQUISITION MODE= SIMULTANEOUS (DQD)
##.ACQUISITION SCHEME= undefined
##.AVERAGES= 16
##.DIGITISER RES= 18
##SPECTROMETER/DATA SYSTEM= dpx250
##.PULSE SEQUENCE= zg30
##.SOLVENT NAME= CDCl3
##.SHIFT REFERENCE= (INTERNAL, CDCl3, 0, 16.522)
##AUDIT TRAIL= $$ (NUMBER, WHEN, WHO, WHERE, WHAT)
$$ ##TITLE= Audit trail, XWIN-NMR		Version 3.5
$$ ##JCAMPDX= 5.01
$$ ##ORIGIN= Bruker BioSpin GmbH
$$ ##OWNER= nmr
$$ C:\u/data/dgb/nmr/ADRS/14570/pdata/1/auditp.txt
$$ ##AUDIT TRAIL=  $$ (NUMBER, WHEN, WHO, WHERE, WHAT)
(   1,<2006-01-13 10:02:00.48 +000>,<MAYBRIDGE\nmr>,<NMR_250MHZ>,
      <created by zg, POWCHK disabled, PULCHK disabled
       configuration hash MD5:
       62 19 C7 07 E1 42 D1 B7 37 6C 3D D0 77 39 F9 E6
       data hash MD5: 64K
       F9 CA 11 02 54 48 08 C1 BB 8A 45 AE 61 CB 5D 44>)
(   2,<2006-01-13 10:02:19.82 +000>,<MAYBRIDGE\nmr>,<NMR_250MHZ>,
      <Start of raw data processing
       ef LB = 0.3 FT_mod = 6 PKNL = 1 SI = 32K 
       data hash MD5: 32K
       F1 B9 2C A3 59 1F 26 E9 FF 6B BC 90 4E 55 F0 C2>)
(   3,<2006-01-13 10:02:21.87 +000>,<MAYBRIDGE\nmr>,<NMR_250MHZ>,
      <apk 
       data hash MD5: 32K
       1E 8E F9 F9 CF 91 D2 4E 8C C5 CE 01 09 E5 86 26>)
(   4,<2006-01-13 10:02:22.79 +000>,<MAYBRIDGE\nmr>,<NMR_250MHZ>,
      <abs ABSG = 5 
       data hash MD5: 32K
       1D F7 CF 3B CC 8B A3 C3 60 58 C4 F1 EF CD 4A 72>)
$$ ##END=
$$ 
$$ hash MD5
$$ 17 A0 5C 96 D4 72 13 15 40 3B 79 DB 0C 85 4E 67
##$RELAX= 
##$RELAX= 
##$RELAX= 
##$RELAX= 
##$RELAX= 
##$RELAX= 
##$RELAX= 
$$ Bruker specific parameters
$$ --------------------------
##$DU= <C:\u>
##$EXPNO= 14570
##$NAME= <ADRS>
##$PROCNO= 1
##$TYPE= <nmr>
##$USER= <dgb>
##$AMP= (0..31)
100 100 100 100 100 100 100 100 100 100 100 100 100 100 100 100 100 100 
100 100 100 100 100 100 100 100 100 100 100 100 100 100 
##$AQSEQ= 0
##$AQ_mod= 3
##$AUNM= <au_zg>
##$AUTOPOS= <53 >
##$BF1= 250.13
##$BF2= 250.13
##$BF3= 250.13
##$BF4= 250.13
##$BF5= 500.13
##$BF6= 500.13
##$BF7= 500.13
##$BF8= 500.13
##$BYTORDA= 1
##$CFDGTYP= 0
##$CFRGTYP= 5
##$CHEMSTR= <none>
##$CNST= (0..31)
1 1 145 1 1 1 1 1 1 1 1 1 1 1 1 1 1 1 1 1 1 1 1 1 1 1 1 1 1 1 1 1 
##$CPDPRG= <>
##$CPDPRG1= <>
##$CPDPRG2= <>
##$CPDPRG3= <>
##$CPDPRG4= <mlev>
##$CPDPRG5= <mlev>
##$CPDPRG6= <mlev>
##$CPDPRG7= <mlev>
##$CPDPRG8= <mlev>
##$CPDPRGB= <>
##$CPDPRGT= <>
##$D= (0..31)
0 1 0 0 0 0 0 0 0 0.06 0 0 0 0 0 0 0.0002 0 0 0 0 0 0 0 0 0 0 0 0 0 0 
0 
##$DATE= 1137146518
##$DBL= (0..7)
120 120 120 120 120 120 120 120 
##$DBP= (0..7)
150 150 150 150 150 150 150 150 
##$DBP07= 0
##$DBPNAM0= <>
##$DBPNAM1= <>
$$ [...]
##$SUBNAM7= <"">
##$SUBNAM8= <"">
##$SUBNAM9= <"">
##$SW= 20.6930455092707
##$SWIBOX= (0..15)
0 0 3 0 0 0 0 0 0 0 0 0 0 0 0 0 
##$SW_h= 5175.983436853
##$TD= 65536
##$TD0= 1
##$TE= 294.16
##$TE2= 300
##$TE3= 300
##$TEG= 300
##$TL= (0..7)
0 120 120 120 120 120 120 120 
##$TP= (0..7)
150 150 150 150 150 150 150 150 
##$TP07= 0
##$TPNAME0= <>
##$TPNAME1= <>
##$TPNAME2= <>
##$TPNAME3= <>
##$TPNAME4= <>
##$TPNAME5= <>
##$TPNAME6= <>
##$TPNAME7= <>
##$TPOAL= (0..7)
0.5 0.5 0.5 0.5 0.5 0.5 0.5 0.5 
##$TPOFFS= (0..7)
0 0 0 0 0 0 0 0 
##$TUNHIN= 0
##$TUNHOUT= 0
##$TUNXOUT= 0
##$USERA1= <user>
##$USERA2= <user>
##$USERA3= <user>
##$USERA4= <user>
##$USERA5= <user>
##$V9= 5
##$VALIST= <valist>
##$VCLIST= <CCCCCCCCCCCCCCC>
##$VD= 0
##$VDLIST= <DDDDDDDDDDDDDDD>
##$VPLIST= <PPPPPPPPPPPPPPP>
##$VTLIST= <TTTTTTTTTTTTTTT>
##$WBST= 1024
##$WBSW= 4
##$XGAIN= (0..3)
0 0 0 0 
##$XL= 0
##$YL= 0
##$YMAX_a= 594299
##$YMIN_a= -504739
##$ZGOPTNS= <>
##$ZL1= 120
##$ZL2= 120
##$ZL3= 120
##$ZL4= 120
##$ABSF1= 16.522
##$ABSF2= -4.171173
##$ABSG= 5
##$ABSL= 3
##$ALPHA= 0
##$AQORDER= 0
##$ASSFAC= 0
##$ASSFACI= 0
##$ASSFACX= 0
##$ASSWID= 0
##$AUNMP= <proc_1d>
##$AZFE= 0.1
##$AZFW= 0.1
##$BCFW= 0
##$BC_mod= 0
##$BYTORDP= 0
##$COROFFS= 0
##$CY= 12.5
##$DATMOD= 1
##$DC= 0
##$DFILT= <>
##$DTYPP= 0
##$F1P= 14.0000005364418
##$F2P= -0.99999901652339
##$FCOR= 0.5
##$FTSIZE= 32768
##$FT_mod= 6
##$GAMMA= 0
##$GB= 0
##$INTBC= 1
##$INTSCL= 1
##$ISEN= 128
##$LB= 0.3
##$LEV0= 0
##$LPBIN= 0
##$MAXI= 10000
##$MC2= 0
##$MEAN= 0
##$ME_mod= 0
##$MI= 0
##$NCOEF= 0
##$NC_proc= -3
##$NLEV= 6
##$NOISF1= 0
##$NOISF2= 0
##$NSP= 0
##$NTH_PI= 0
##$NZP= 0
##$OFFSET= 16.522
##$PC= 1
##$PHC0= 82.34356
##$PHC1= 3.588622
##$PH_mod= 1
##$PKNL= yes
##$PPARMOD= 0
##$PSCAL= 4
##$PSIGN= 0
##$REVERSE= no
##$SF= 250.13
##$SI= 32768
##$SIGF1= 0
##$SIGF2= 0
##$SINO= 400
##$SIOLD= 32768
##$SREGLST= <1H.CDCl3>
##$SSB= 0
##$STSI= 32768
##$STSR= 0
##$SW_p= 5175.98343685301
##$SYMM= 0
##$S_DEV= 0
##$TDeff= 65536
##$TDoff= 0
##$TI= <Analysis number 999999
Compound Code 99
Book Reference 9
Project Code 9>
##$TILT= no
##$TM1= 0
##$TM2= 0
##$TOPLEV= 0
##$USERP1= <user>
##$USERP2= <user>
##$USERP3= <user>
##$USERP4= <user>
##$USERP5= <user>
##$WDW= 1
##$XDIM= 32768
##$YMAX_p= 292789367
##$YMIN_p= -201268
$$ End of Bruker specific parameters
$$ ---------------------------------
##NTUPLES= NMR SPECTRUM
##VAR_NAME=  FREQUENCY,     SPECTRUM/REAL,   SPECTRUM/IMAG
##SYMBOL=    X,             R,               I
##VAR_TYPE=  INDEPENDENT,   DEPENDENT,       DEPENDENT
##VAR_FORM=  AFFN,          ASDF,            ASDF
##VAR_DIM=   32768,         32768,           32768
##UNITS=     HZ,            ARBITRARY UNITS, ARBITRARY UNITS
##FACTOR=    0.157963299565203, 1,           1
##FIRST=     4132.6476996994, 0,             0
##LAST=      -1043.33573715361, 0,           0
##MIN=       -1043.33573715361, -201268,     0
##MAX=       4132.6476996994, 292789367,     0
$$ Real data points
##PAGE= N=1
##DATA TABLE= (X++(R..R)), XYDATA
$$ [...]
25056 2000 -16342 -1250 10322 -4841 -20746 -5205 2877 -10364 -10688 -1137 3434 13904 20688
25043 20688 22908 37171 30240 14358 26155 24267 16564 10959 -10114 -2688 12112 22151 21352
25030 21352 18354 25202 26063 10650 -14826 -25338 6294 16601 32233 25708 13227 5077 -2635
25017 -2635 -7435 -6740 -575 19552 24671 24116 7467 6153 842 -6522 -10931 -15116 -18965 -31888
25003 -31888 -27104 -22319 -41984 -29592 -7421 17461 30114 28808 7534 -4245 -13491 -9644 235
24990 235 12757 6069 -6093 -4983 -6132 1398 24184 -608 -13489 -19752 -15487 -14479 -17419 -6480
24976 -6480 -20164 -36600 -23511 -6499 9481 7694 843 2293 5042 12137 25291 16812 7377
24963 7377 -7260 -3824 -7074 -4756 7497 -7584 -18343 -4039 13823 18421 30659 43875 34176
24950 34176 10117 4482 -2916 15563 16241 10558 -4105 -17425 -23182 -10572 -4111 -19973 -7409
24937 -7409 -17518 901 17143 -4540 -30342 -26631 -30630 -30627 -32786 -30229 -13468 11741 11941 13226
24923 13226 21302 4406 -4088 3420 9835 -4891 8069 4972 -11252 -20630 -33504 -36251 -23562
24910 -23562 -14252 6878 5293 3490 10240 12163 -11246 -17500 802 11850 6992 5737 8473
24897 8473 10358 -6415 -3536 6197 3488 -6924 3242 16338 6343 -14874 -1190 13720 2802
24884 2802 -12469 -26206 -21593 -671 5570 -1696 -23068 -22046 -12179 -7992 5108 -735 -2971
24871 -2971 -1095 15315 25013 12838 14805 13149 3939 -4541 -3217 -12166 -19108 -33585 -30694 -31316
24857 -31316 -32263 -30406 -20087 -13054 440 4884 3208 -19719 -28049 -19104 -16337 -15415 -12213 -20703
24843 -20703 -18312 -7563 5489 -8214 -15020 -5419 -14038 -25440 -24654 -6788 7080 15590 17448
24830 17448 27294 36573 26526 16302 14181 -2489 -9492 8070 20412 14720 11013 12267 2806
24817 2806 22365 22750 -3865 -10894 1754 5470 -7656 -27041 -29560 -18655 -27920 -6392 6754
24804 6754 7742 -14383 -26975 -30855 -30013 -17538 -8184 -6879 -3308 4722 1160 -14477 -3005 19961
24790 19961 32565 29290 29753 28881 37491 37460 22175 24349 28004 29410 27843 9732 -1837 10012
24776 10012 23095 36442 26031 19021 3395 -7086 -2331 12605 3275 -14687 -22413 2518
24764 2518 18443 24428 16975 16939 12359 791 12856 16229 22425 31869 24999 17982 13283 14957
24750 14957 29780 49732 55250 25934 6124 14016 -6154 -16621 -5445 -9515 -20739 -10024
24738 -10024 78 6076 -817 -3491 -8784 -20233 -8198 17407 24890 33473 22702 26284 33098
24725 33098 39738 50346 49465 45308 9817 -13744 -32056 -29837 8591 34587 7657 -6365 -14865
24712 -14865 -26253 -10919 -6901 410 1274 -5796 -26237 -41906 -25767 -5195 -13392 -26750 -25052
24699 -25052 -13242 -18416 -32891 -22422 -15748 -9488 -13026 -10195 3980 -11110 -27236 -24719 -46980
24686 -46980 -48001 -32046 -25690 -21576 -2625 14638 5079 25649 38039 37669 24721 18436 18167
24673 18167 3413 -7208 5537 8558 5612 9802 2608 -8669 -21379 -8516 -132 6215 22001
24660 22001 14521 4976 4726 4913 16979 11364 12691 22825 33087 24135 -4446 -11041 -20824 -21756
24646 -21756 -10342 -756 15715 18703 12921 4536 -12428 -29028 -28513 -24231 -11856 -8583 -15630
24633 -15630 8792 19308 31742 39941 20053 9727 7747 118 12362 8858 6536 9401 9442
24620 9442 -15811 -14558 5510 3206 18780 27403 20265 6764 1986 15312 13941 9273 16352
24607 16352 25035 24009 31052 8731 -3180 -6931 1292 -2427 -1390 -3457 24092 34169 20380
24594 20380 -1057 -4517 -22271 -32898 -20665 -20424 -29349 -30656 -31847 -23906 -22903 -741 3921
24581 3921 -5674 1295 -10132 -16584 -13385 6755 7025 4596 17832 13965 14677 32725 20134 -2016
24567 -2016 -4477 9330 14215 12525 25978 23776 24475 13221 -4777 -2525 2827 -7347 5677
24554 5677 -4735 -7291 359 2755 -12350 -15859 -19572 -22438 -24687 -14017 -8929 8545 17382 15239
24540 15239 13875 -1314 -9284 -4511 17120 36890 23158 27397 26989 25540 21308 5146 3296
24527 3296 -13311 -22309 -14205 -3767 10857 8142 15918 12656 12027 11577 -2639 -1311 -5663 3907
24513 3907 5054 -3412 -17821 -15677 -9493 161 2208 11796 19333 15730 20952 25777 31847 16116
24499 16116 7346 4454 -5233 -20593 1819 31619 23779 16613 6460 11111 29131 13462 15132
24486 15132 13545 9760 6240 -8292 -9968 2746 12920 11317 21679 16577 -10301 1243 7765
24473 7765 15296 6892 5473 5737 -3503 3720 -2696 -11422 -31824 -36754 -28904 -8701 -8532 -26932
24459 -26932 -30628 -17867 -13810 -17297 -13400 986 7425 16410 24648 4500 -8599 961 1331 -159
24445 -159 -4435 -9605 -17106 -17914 -7594 3283 10056 18518 2611 -13001 -27071 -32937 -18547 -14453
24431 -14453 -7458 -7142 -11973 -5970 60 1928 8306 21590 29556 23841 11530 9421 1576 -664
24417 -664 9600 698 -11701 -790 27086 44760 54254 36433 25799 4671 4724 16289 3285
24404 3285 8857 1358 -6103 -2413 1541 -4004 29381 33661 23909 10425 5895 17875 28741 19147
24390 19147 1431 -2756 4149 -2620 -10517 2843 22098 23023 38520 31206 5560 4053 -2906
24377 -2906 -3911 16485 24357 26677 21376 27781 14568 -5481 -13050 -1928 -1680 3537 -3376 22183
24363 22183 47937 39117 34483 40343 48874 45631 21817 24378 20911 11758 14494 7500 2617 12678
24349 12678 25227 40097 20756 -1854 1098 15406 31677 5776 3129 14774 15774 12891
24337 12891 -925 -10990 -14846 -18584 -18703 6039 -6109 -6478 17339 25083 41810 28631 12757
24324 12757 -12546 -31639 -30528 -32850 -16942 -19858 -27369 -24435 593 18526 -40 -8713 13
24311 13 -7605 6559 3971 -3503 -4943 -2702 17352 28499 20790 5251 -2958 7918 14216 24153
24297 24153 11980 20072 12390 8966 24075 18618 11915 9595 1944 -9357 -16055 -20718 -14965 -10595
24283 -10595 -7744 3895 12414 27644 44064 39061 32551 16717 5759 439 1127 12148 23397
24270 23397 12603 7249 -6180 -21687 -8686 22708 29643 25700 7080 118 17367 19651 9188
24257 9188 -1566 -20063 -27562 -13544 8218 8608 672 9770 14442 16118 13141 1952 12116
24244 12116 3794 -20009 1796 8656 16552 22975 18848 25626 35069 15677 8677 35769 30770
24231 30770 -3797 -20550 -32796 -37480 -18947 -13282 -11734 -7594 3325 5243 -4833 -1813 -4198
24218 -4198 -16879 -15520 20609 33362 20528 4295 17224 44385 41468 35155 21635 11121
24206 11121 9331 20804 20738 13579 8072 12666 9007 -20788 -18707 -12648 3285 7912 3090 -2592
24192 -2592 -17821 -22999 -2577 8920 -40 -17212 -10766 -10370 -5668 -14169 -14687 -15194 -13614 -25242
24178 -25242 -40457 -36665 -37290 -27068 -3447 -507 3889 -19135 -24669 -29043 -27144 -22436 5182
24165 5182 9676 -10795 -23953 -25994 -29755 -13301 -4758 -7326 -13054 6274 12037 -5660 13720
24152 13720 25640 10577 -15528 -18254 -11307 -581 11397 12860 22989 17333 17721 31322 30592
24139 30592 42195 26269 -2448 -5454 4044 5381 8977 4863 4250 1935 -11797 -25602 -14447
24126 -14447 -23688 -3614 11476 13161 12175 17832 22827 19353 15815 13935 22920 5401 -9059 -16066
24112 -16066 -17162 -15835 -16665 -11711 -25599 -12571 -17776 -23935 -5776 1361 16600 25684 26685 15444
24098 15444 -7569 -9146 -10945 -3868 21181 30918 18209 2630 -10719 -17527 7628 36082 33298
24085 33298 21357 2366 8656 15300 33146 38421 17022 -13913 -9156 -2008 2766 7805 8984
24072 8984 24825 28832 29173 20864 20412 19430 391 -2131 19113 32027 46374 51762 40134 18947
24058 18947 4945 8078 15973 17404 10377 12202 28368 13675 -5644 9683 28570 25408 16254
24045 16254 12357 249 -3319 -12767 -16270 -17687 -16101 -9711 11166 10806 -7742 -21900 -19446 -9310
24031 -9310 7871 32176 30383 11648 6461 8983 -6148 1770 10471 6352 588 4113 19967
24018 19967 34594 19904 -5946 2523 21048 20650 1951 -5220 -4189 -2873 9104 -6099 -4276
24005 -4276 -11050 -12052 -7393 -902 -2819 -8267 -22661 -30721 -21079 2772 1230 -15585 -12440 -12695
23991 -12695 13317 17883 8121 11829 12755 22226 31835 21668 6675 15698 24915 27516 14384 1218
23977 1218 -20907 -36041 -18355 -14519 -16580 -5979 -5962 -5258 6169 7531 14648 15341 11941 8554
23963 8554 1947 2645 27221 25316 5174 -12462 -2876 13300 17102 -37 -11522 -16842 -28456
23950 -28456 -25917 -34225 -24872 -1490 5663 15268 31011 36298 45045 36126 16000 1751 -19141
23937 -19141 -4489 7888 10365 24268 22254 27160 29580 23999 29019 31598 30174 25736 16498 15803
23923 15803 17231 -4868 -14249 -32 13534 23262 21922 10899 3566 -4957 -12273 -18184 -3317
23910 -3317 -4963 -13568 4413 16535 13331 21039 15766 2781 -13779 -17467 -17047 -1447 722 8883
23896 8883 6727 -4429 -8651 6450 6755 -11357 -10666 -9778 -6989 -11400 -19685 -23001 -18250 -19827 -20756
23881 -20756 -20916 -16064 -8284 -18478 -9740 10886 18638 23749 30173 34812 28545 26561 28856 18962
23867 18962 16720 2778 -28 1770 3151 11052 1102 -9753 -133 4558 3901 2097 -5801 -14319
23853 -14319 -23775 -26832 -14327 -15571 -13583 -7406 -8469 -5953 4526 5105 -3568 1593 -827 9088
23839 9088 14821 16291 7832 10954 36678 26477 20718 19077 17640 20765 29946 31218 34579 47891
23825 47891 56005 48471 32959 11193 5600 7423 19832 32800 21479 -5377 -13416 3455 6419
23812 6419 15140 1621 -595 -1112 737 -5344 -21122 -36374 -37369 -27051 -21352 -8207 4001 12281
23798 12281 2741 -1788 -643 -9435 -10833 -11142 -40590 -51264 -57378 -41053 -34757 -10689 14918
23785 14918 -2422 -13885 -223 692 17997 17983 9711 9020 2989 11557 9223 17945 27636 29051
23771 29051 40543 43699 44853 42965 22832 14122 13442 12905 19808 3766 -21309 -28049 11919 23149
23757 23149 17590 33603 32713 20538 27209 14233 7871 23981 30623 27572 8645 -6945 -21403
23744 -21403 -15684 1138 5495 -19724 -12159 -2370 -13582 -12463 -2568 1663 -4408 -1343 10058
23731 10058 12541 20881 22313 8206 -10258 -26741 -18756 -17583 -24372 -15935 -2397 -8963 9641
23718 9641 19769 27364 18740 13660 4656 -5968 9719 -6107 -28706 -36336 -14006 6386 15927
23705 15927 19799 34226 35933 33448 40845 42990 23048 21649 25996 42473 42361 23166 24539 31927
23691 31927 27042 26297 16561 -21893 -23940 -8798 -1726 12471 17070 29095 8219 -6596 -7885
23678 -7885 1212 -3895 -2462 25102 49736 30421 21537 6823 13468 6065 -754 4052 -5985
23665 -5985 -7855 2376 -10640 -23332 -28828 -30389 -33377 -21611 -13400 -8223 15305 27704 14619
23652 14619 9855 -2222 3565 11038 14874 15878 20905 14381 -3494 -22207 -14364 -10827 -10321 -4424
23638 -4424 -15980 -12048 3615 -4168 -7253 -2689 2407 4479 -4320 -6519 3737 5327 11858 24368
23624 24368 22760 38173 38208 27121 33878 26531 3850 -10289 4798 10358 11011 -11546 -9228 -5986
23610 -5986 -3328 10215 5626 -3778 -4545 -6200 -1305 8019 12918 34276 37131 25556 -9734 -11735
23596 -11735 6208 7231 -10088 -12552 -2312 838 8378 943 -13774 -17048 -18877 -2625 7118
23583 7118 18459 22727 28283 10866 3084 -11345 -10625 -1295 6287 24389 6390 -7973 -4401
23570 -4401 485 2863 20866 26168 35462 40959 57664 38205 24130 29006 23057 15405 15970 -6999
23556 -6999 -29990 -24827 -1686 16134 8710 13168 19868 13141 9545 15392 5752 -475 8629 18196
23542 18196 15380 19013 25844 25202 34261 24530 -25 -10841 1016 15459 26463 35343 51656
23529 51656 43893 32972 25339 18622 9985 8806 800 -12210 -13093 -5698 27198 27072 3026 9808
23515 9808 26994 5585 -12112 -8811 -16110 -8622 3429 4540 8139 7693 12203 -3109 -15327
23502 -15327 -21077 -23805 -20028 -22954 -11213 4388 -7189 -658 9019 23299 23451 -759 8672
23489 8672 20900 2567 -15459 -2465 12240 24092 38495 26093 -11861 -22509 3496 1963
23477 1963 -19645 -26934 -12416 2566 3139 -6151 13823 25877 13573 -4422 6235 20720 -10992
23464 -10992 -9020 3315 -3611 -14908 -8143 -1839 -11547 -14935 -9476 664 2139 2360 112 -9523
23450 -9523 -10791 -11190 -13837 -2492 12759 25040 20429 22031 19635 21278 24913 32376 19516 7761
23436 7761 12366 15186 4770 -13362 314 13008 27680 18114 20377 23682 7349 6478 8091
23423 8091 4123 -9632 -16807 -6866 -11246 -38946 -47069 -27336 -9446 5846 18464 17297 8674
23410 8674 -3932 -3236 -13201 -23117 -31069 -15895 -14289 -22798 -11430 -3098 -14369 369 2089 -20197
23396 -20197 -28743 -21499 -3417 4974 7692 2213 -1625 14380 6215 1848 -1013 -886 3404 16497
23382 16497 30673 22027 -765 -5356 11109 -916 -7223 -6473 -23572 -28016 -12054 4148 9605
23369 9605 -6038 -25520 -17971 -20455 -17224 -14376 -30245 -26697 -3387 -4762 -13157 -12305 -9730 4679
23355 4679 8609 9098 19326 16260 28435 29680 9185 5080 17119 24590 39385 31422 34050 31535
23341 31535 23191 22137 24908 18515 16138 19587 7887 4151 8986 9004 12702 10685 5082 14824 18135
23326 18135 7715 8374 10460 4672 2168 -23946 -22637 -15328 -4087 -675 9781 2049 -4564 -2942
23312 -2942 7667 3757 -13476 -10088 -18952 -31514 -28703 -22220 -22204 -28295 -40140 -34302 -19027 -5018
23298 -5018 8356 12729 -7750 284 11329 1279 1485 -204 20994 23555 9247 5639 4950 12154
23284 12154 -629 -3242 2718 -15701 -30706 -41941 -43124 -8889 -4429 -24590 -19953 -9404 3786
23271 3786 -5875 -13534 -19292 -17553 -7561 1205 -12161 -12550 5628 20922 35125 58785 42302
23258 42302 19983 11718 -6233 -8661 -6595 -8171 -23321 -21929 -11202 -16774 -23442 -6492 13828
23245 13828 8427 16319 23920 23611 26217 27134 40418 41045 15369 -2469 -1008 8571 14721 -2001
23231 -2001 -20016 -4349 -3231 -15155 -19524 -19923 -19832 -19733 -39 14333 23634 32335 25004 14780
23217 14780 391 -7742 2669 12837 10202 -8079 -18905 -17623 5077 9226 4541 -3273 15057
23204 15057 21240 2956 -8210 -6319 -17401 -31836 -445 15531 7958 19021 24282 -691
23192 -691 -24250 -22238 -5640 -8685 -32709 -34531 -33050 -33238 -22567 -10009 -25688 -24954 -29176 -30211
23178 -30211 -26585 -34400 -24109 -6379 3791 9265 13971 10197 15750 12002 -2837 -3733 -922 1689
23164 1689 -8125 -14576 -2413 -471 -6080 -6200 -11990 -9416 4730 14422 22808 32454 10091 1608
23150 1608 10479 10566 15107 10694 16310 12234 12249 4433 -5129 3135 -2103 -12851 -6378 -15239 -22617
23135 -22617 -1258 5222 -20638 -26150 -17174 -17612 -488 -17162 -5144 -9695 -51 7274 13157
23122 13157 5702 3002 10796 6059 11984 4863 -15215 -18559 -9371 -11852 2399 1277 -4036 -12813
23108 -12813 -28591 -14170 3699 9680 3669 -6746 -22302 -36033 -23357 -11535 -12220 -5256 4067
23095 4067 973 12725 29439 41622 34948 23694 15460 3187 9659 6524 -3170 -19909 -18398
23082 -18398 -6188 -11313 -16664 -24978 -21482 -18434 -8063 -5315 -6057 10302 17471 7713 -5180 2012
23068 2012 5419 4428 -6633 -37442 -43987 -27755 2876 10289 -4163 -5389 5622 -10243 -5095
23055 -5095 -9059 -17124 -6244 -15502 -10693 2599 -6369 1938 -6868 -8379 -6662 -14269 -15160 -7089
23041 -7089 3988 3990 -10686 -27843 -31913 -14218 8464 -5439 -10364 -1761 -422 -955 5767 9313
23027 9313 6362 -144 -22649 -14660 -15175 -10817 -1837 -9448 -6355 -8908 -30923 -37548 -38042 -50055
23013 -50055 -36048 -29466 -4262 9817 -1019 -10016 -7037 -19821 -15267 1959 11580 -5384 -982
23000 -982 4277 5797 12346 2032 -13815 -16378 -24156 -23279 -23900 -5059 -12655 -23922 -10267 -18631
22986 -18631 10050 29904 45128 36644 6164 -9601 -6586 -15905 -31595 -31417 -14200 1074 340
22973 340 7180 5419 8553 24741 19787 14463 14532 10800 3456 10882 7500 -22646 -32611 -33140 -25345
22958 -25345 -16603 -36510 -36144 -29670 -24128 -20061 -23701 -5069 2227 -1052 17427 29388 11901
22945 11901 -5270 -21939 -23886 2604 23075 28162 36210 32173 16908 -10248 -19748 -8932 5809
22932 5809 6496 -228 8803 -1330 -7818 -32515 -33487 -19366 -15466 -10491 -14406 -24521 -13602 4252
22918 4252 7532 13335 -4022 -24339 -20304 -12164 -3407 9594 9908 453 373 -2731 13907 16826
22904 16826 3762 -15923 6537 -1079 -9660 -5012 326 6750 19107 30551 25357 3821 -6726
22891 -6726 -20670 -1269 10920 2039 -6005 -3948 16300 33365 25127 -4412 -29056 -19690 6213
22878 6213 13118 7971 16079 20694 19272 32180 47906 29152 18963 -5693 -24088 -11952 6387
22865 6387 10349 3503 4789 12246 -16543 -24354 -18628 1830 8990 22261 24313 18948 19601 3532
22851 3532 -4100 12860 11556 -5291 436 9002 6980 7754 17554 2324 -5283 -7519 -1833 9144
22837 9144 14925 112 -16169 -3100 -1756 -8552 -18126 -28205 -4276 11965 11138 15816 34158
22824 34158 35531 21242 6289 26039 21982 26648 31883 10935 2220 528 9057 -10462 -12034
22811 -12034 7530 2352 2154 5705 2502 7739 9509 16132 26152 10412 -2816 -719 16263
22798 16263 17490 -3294 -21046 -36685 -19119 -100 3180 -9240 -13919 -16073 -5231 -11468 -15920
22785 -15920 -8752 -9315 -414 6048 6694 2103 5789 14298 4811 -17961 -8707 -9387 -5122 -5223 -7365
22770 -7365 -1831 31076 36789 18272 16626 31202 22752 20724 33827 28015 29161 35145 12253
22757 12253 -8704 -3748 10624 23879 15956 11197 2263 -6815 -4682 11753 9443 14991 14944 8949
22743 8949 11591 16645 1894 7776 22330 18062 7052 13058 5425 -679 11671 18915 15777 7679
22729 7679 -1797 -3763 15891 27221 35687 29101 6712 6357 17715 3455 -16895 -13554 -9092
22716 -9092 4371 6696 24132 34162 38031 32197 9551 15112 12496 -5960 -12098 -23289 -23523
22703 -23523 -15252 -18401 -10093 -3954 10675 -15574 -14573 -14048 -2582 -1121 13633 -4227 -32665
22690 -32665 -31997 -37934 -47783 -61666 -56625 -55463 -49557 -29470 -4947 -5434 -10887 1237 -10570 1402
22676 1402 36 -6674 -3088 7672 2885 8351 8059 717 5901 -2248 -423 -6445 -16281 -20888 -15454
22661 -15454 -17922 -9150 266 -5034 5438 5997 10793 10121 -1670 -6026 4516 -2256 -17459 -18449
22647 -18449 -15303 -13267 -12146 -12499 -12245 -11292 -7745 -9872 -3225 4048 3892 7444 6437 -56 -4704
22632 -4704 -8998 8458 2699 -25914 -21525 -5695 4446 14623 18463 9267 -800 -5547 1671
22619 1671 11803 11141 6523 2674 -10373 -17590 -1880 4116 1360 -9559 -27866 -33356 -31489 -15612
22605 -15612 13213 13893 3638 3730 6696 -1083 10967 31984 25842 16310 -4542 -14118 -31104 -21776
22591 -21776 -11300 -20775 -36750 -27735 -6307 -6450 8876 8029 24615 21365 6597 6175 -12697
22578 -12697 -13336 -20188 -14842 437 8751 -3217 -13952 -4744 2490 15081 1921 -8545 -22479
22565 -22479 -23413 7642 25713 37485 26967 1679 -16089 -28513 -33580 -35501 -15284 7892
22553 7892 18676 13211 2388 -5598 -24739 -34445 -26815 -23633 -12193 8478 4767 -5108 -6746
22540 -6746 -29187 -38631 -19243 -7177 9037 10869 18120 7120 -19271 -41422 -50158 -57537 -43246
22527 -43246 -41925 -21990 -19197 -9905 20519 26346 25804 20975 32457 24442 10255 27563 39518
22514 39518 17743 -2824 10671 24677 20195 -4391 -13210 2306 14366 23528 21127 14486 -7067
22501 -7067 -15805 -7121 7760 29757 18868 11402 14641 13014 12642 6203 -10151 2101 10620 6611
22487 6611 4201 9988 18032 17148 30035 44718 42737 37809 21804 7931 -2302 9051 15381
22474 15381 10961 -7732 -9533 4452 8170 8135 2160 4780 12143 16553 13441 6226 7339 15924
22460 15924 28151 16854 -12034 -13140 -9239 -23270 -38917 -33316 -23225 -19163 -7881 -2341 -19265
22447 -19265 -17490 -17276 -6189 -2166 -4558 -11019 -7935 -9394 277 -18889 -24805 -18985 -16438 -16303
22433 -16303 -12028 -10051 -7915 22826 44709 44587 43850 18678 9468 16395 6177 8025 5188 300
22419 300 -10188 -1388 9257 1740 -1383 1705 10835 12001 -4907 18595 22334 2046 -2746 -8462
22405 -8462 -14556 -13712 -5779 1581 7818 26003 41883 40286 7708 15147 29255 7774 -2333
22392 -2333 -27610 -41235 -33767 -11720 -9844 -3332 -2740 3732 11309 10486 18562 15993 2719 2899
22378 2899 -4656 11111 18232 850 -12152 -181 -8898 -24313 -5569 10739 -2407 -2887 8233
22365 8233 7624 -3033 -12512 2448 -3052 -11707 -1312 -1212 5224 23141 23764 24324 22886 20628 21719
22350 21719 9754 2722 -1558 -1857 7368 29224 28583 -1269 -23479 -29865 -18286 6075 11108
22337 11108 -3822 3378 5195 -4025 -3906 1502 -15633 -16354 -11910 -16972 -20552 -31466 -39764 -24797
22323 -24797 -22767 -24854 -23680 -16144 833 13270 15279 35017 35126 26476 654 -11991 -20484
22310 -20484 -41460 -54073 -27454 -6540 1754 -23049 -29813 -20956 -15312 -11763 -5326 -1195 -8298
22297 -8298 -6570 5846 2617 -1759 -6448 -11055 -12553 -17532 -18250 -17050 -7141 -871 11582 13173
22283 13173 -6625 -10378 -5298 1499 -1275 -13409 -13653 -17101 -18790 -23378 -22589 -17088 -29367 -49479
22269 -49479 -43924 -26665 -8220 14858 22901 35351 5696 -11727 -2946 20146 16242 6517 9091
22256 9091 340 3314 5506 22105 10801 3453 4677 2637 -3382 -9137 -13164 -1401 -2854 -1235
22242 -1235 7729 -5896 -25155 584 9056 19363 31959 26010 12814 4270 -746 -13674 -26897
22229 -26897 -31786 -31039 -31504 -32059 -16590 14755 28783 22273 24952 17720 -12023 -17782 -16262 -22544
22215 -22544 -19530 -14925 -19456 -17699 -4530 -23152 -32519 -11561 6458 -3453 -19773 -6879 -11313
22202 -11313 -8648 -5361 -9223 -18768 -30750 -8329 -7566 -24246 -30136 -27206 -24869 -20993 -18006 -2912
22188 -2912 5350 -2405 -10928 -5190 6747 11972 27977 34926 31035 18931 -1059 14733 29457
22175 29457 24525 27111 29822 17896 7938 -5790 -27828 -30359 -24232 -28974 -36640 -27798 -31020 -29083
22161 -29083 -26719 -19494 -6887 7146 5935 11302 34841 20876 7691 306 -10426 -19172 -28717
22148 -28717 -11221 8624 13951 11518 2445 6550 36776 45307 44268 51223 37684 7262 -9603
22135 -9603 -3870 3170 -1034 -17366 -33293 -36447 -27917 -30606 -18540 -21896 -28204 -26320 -4121 -1707
22121 -1707 -3327 -1414 -1098 -5699 -15466 -28017 -30914 -27274 -13733 -1123 -3448 -12051 -22550 -15142
22107 -15142 -22842 -19536 -11171 -3592 -19724 -32823 -24547 -58 -7679 -16122 -18437 5819 -3182
22094 -3182 -14929 1483 2119 9061 7844 -18950 -21195 -610 6223 35202 49499 26287 3845
22081 3845 4727 -1434 -14807 -25751 -27030 -31108 -32468 -24238 -20063 -25583 -11924 -1508 -358 -6975
22067 -6975 -9231 -9334 -14906 -16331 10984 22137 16053 24077 22613 37845 39723 10207 10928 10598
22053 10598 24954 30707 13362 -22349 -27076 -16829 1277 24095 21153 22544 18953 17358 31905
22040 31905 26254 -9792 -30920 -19302 4825 4947 9044 21763 14480 9946 4991 -2420 -22563
22027 -22563 -10570 7794 15661 25307 1658 -2558 -1574 -7015 12555 19052 2990 6536 20682
22014 20682 18857 4996 -3216 -9821 -410 -11176 -23471 -27864 -17331 -4292 -7038 -14737 -845
22001 -845 3287 6635 18966 232 10652 12729 1076 15706 13821 18192 6079 -7878 -16261
21988 -16261 -16919 -14589 -24583 -20808 9061 22213 24179 6815 -1906 10097 9689 8722 9711 13359
21974 13359 -3205 -13356 -6124 8101 2753 8378 17415 8245 21026 26712 27600 11366 3307
21961 3307 -10419 -26904 -17734 -10771 -5313 -10451 -11348 -6776 8311 9290 14169 14099 9275 6015 -9683
21946 -9683 -16805 -29936 -31100 -30501 -26595 -799 -5064 5070 29076 25637 9890 12520 30594
21933 30594 34506 38186 32842 7164 8337 11151 16251 21007 11759 -7164 -6451 -5148 -25312 -23963
21919 -23963 -28879 -32558 -23021 -1254 9124 6825 14059 26003 36301 11280 -13966 -7068 6902
21906 6902 4158 -16126 -20530 7237 36645 45024 12486 -13092 1700 19517 13499 7167 6522
21893 6522 5698 -787 -5900 -8151 -1063 -6703 -5240 7253 18710 -780 -20748 -37998 -30008 -23383
21879 -23383 -14798 1903 1547 2730 11493 10959 9032 4954 -1525 -9116 -13162 -9822 -6687 -2617 -15895
21864 -15895 -20966 -5176 -10275 -24280 -22949 6295 27462 31943 23531 17367 5593 -4848 -10294
21851 -10294 -19984 -8501 11892 19 -16580 -14650 -22828 -14922 -7799 -15334 -10172 -7123 -21261
21838 -21261 -21919 -413 -2953 -18547 -23706 -14783 2080 10243 21317 14915 3454 11782 21736
21825 21736 16111 -5284 -5716 1319 4689 -12926 -10670 -10235 -9700 -14589 -18320 -16126 -15713 -15440 5890
21810 5890 7068 -2226 -1717 3107 -12618 -23714 -18106 -26947 -24011 -15586 -8653 -3233 6862 19391
21796 19391 13919 7319 10557 15024 -2662 316 12392 -191 4431 -12191 -325 14070 27240
21783 27240 23739 17231 9548 14478 -1385 -21901 -28735 -50698 -40058 -30654 -29356 -32857 -15642
21770 -15642 -15509 -7257 13522 3428 -18413 -25439 -27948 -14306 -16042 -29920 -29784 -20873 -6153
21757 -6153 -1916 -1403 6492 11890 11531 5947 -7093 -16915 4795 19633 21218 5340 15375 -5715
21743 -5715 -31540 -30402 -14997 -13388 -25850 -28405 -15207 1534 -6554 -23349 -7107 5402 2230
21730 2230 4962 -16174 -18083 7259 7893 16735 18032 11597 11585 24418 33856 28862 4497 4777 519
21715 519 3837 14281 13803 11667 19935 14469 -10905 -7469 -5212 -7980 22226 16533 4969 -8960
21701 -8960 1075 -218 1098 16979 20409 21408 18230 18347 24492 10555 -14903 -27710 -33022 -26315
21687 -26315 -33040 -28048 -5934 12691 15514 23628 35796 25252 -4651 -24307 -26601 -10616 14517
21674 14517 2041 3112 2811 -6306 -27194 -35971 -23795 -3212 21616 34253 15615 -3168 7472
21661 7472 17415 345 -13351 -269 6444 14279 11437 3120 16527 44851 55130 33657 13431
21648 13431 7968 24485 33332 26603 16810 10826 530 -10332 -8952 6069 -5338 -19031 1944
21635 1944 1356 -11204 -44498 -48401 -9122 25942 40489 33924 22605 4110 -6380 4545 16054
21622 16054 11341 14195 14193 1389 -14440 -32428 -47992 -44371 -32327 -199 8854 -4159 -12760
21609 -12760 -21803 -1717 12848 -8192 -22498 -9892 -7369 -9352 -8582 -18067 -19407 -19692 -21158 -7142
21595 -7142 14988 7220 -2928 -27015 -18670 -11287 3157 -6410 -6536 271 -9723 -35514 -41327 -34033
21581 -34033 -34543 -31120 -27680 -17771 3224 18757 7815 -3211 -7289 -9913 -17569 -19552 7327
21568 7327 -8006 -32359 -27716 -27667 -24943 -18501 -9250 474 17606 33256 37055 18838 26012 26964
21554 26964 7963 -10261 -9537 -8492 -8933 -8437 -17847 -23063 -14400 -4841 -3240 3887 9194 14485 5338
21539 5338 -6750 -7422 1756 3846 8612 1032 5127 5991 7007 14029 -3252 -22453 -27023 -39969
21525 -39969 -40159 -28901 -20102 -9543 17701 -9601 -22698 -7566 -20195 -14615 -6942 -24977 -41329
21512 -41329 -22514 -9362 4628 12794 31564 31012 37594 25679 12309 31177 52325 45659 44691
21499 44691 21651 3893 -21915 -32222 -21994 -11280 -6181 -2144 -717 -2153 -6933 -5465 -10897
21486 -10897 -22905 -12343 12234 12312 4619 215 6474 8838 -502 -20533 -20338 -10286 -16226 -23791
21472 -23791 -22435 -26412 -24092 -32606 -47187 -37441 -14508 6359 6123 -15649 -33554 -17146 -30322
21459 -30322 -45855 -29149 -23610 -18083 -2599 1893 4893 13715 21969 13673 11820 18512 16769 6136
21445 6136 -5058 -2584 130 -2368 -20317 -14762 -7520 -10702 -16206 -26457 -25958 -7023 -3546 -12892
21431 -12892 -683 3359 -15032 -24206 -27780 -19665 -23245 -35838 -22669 -3528 -16944 -30947 -36031
21418 -36031 -19712 11718 8771 -1007 -4462 12786 34760 39570 29198 14479 6549 -5305 -3892
21405 -3892 -4690 -14651 8068 20206 13789 -17194 -26294 -14660 -14175 -1165 -617 -7816 9458 19093
21391 19093 21721 20852 12786 8308 1184 329 -24669 -23159 -4623 -6947 -2026 -1723 -15056 -22947
21377 -22947 -19134 -19560 -13429 -9114 -9406 -33014 -27207 -16716 -17422 -4060 -8260 -16370 -12509 -20381
21363 -20381 -24687 -15267 -20215 -22549 -12533 16737 26850 3756 -29506 -34273 -22454 -27095 -22941
21350 -22941 -27782 -20695 -5787 -6933 -4752 2946 -8428 -11920 -1903 11888 3401 -19311 -25663
21337 -25663 -21443 -7731 -6425 -19799 -6778 5207 -10202 -13302 675 14757 -133 -1615
21325 -1615 356 -9234 -5565 -12486 -21658 -27628 -36421 -31208 -2971 38169 27996 17487 25113 31246
21311 31246 17625 25500 41240 40642 16047 10485 32554 48994 31178 31609 37418 31740 27828
21298 27828 11877 -10979 -3486 4080 16475 10117 -7591 -13154 -6614 13374 330 -9445 330
21285 330 -505 3598 -4278 -10456 -33631 -41477 -30714 -25568 -28123 -24470 -9967 -19249 -50589 -52697
21271 -52697 -42685 -13231 864 -7422 -28083 -18894 -11836 -32296 -24115 -3020 20064 19118 17693
21258 17693 33950 45723 34587 11630 5763 -6497 -16243 -8858 -7096 -4344 908 2079 11439
21245 11439 3878 -6186 -20045 -41260 -39894 -33604 -12200 -2805 20545 26764 19332 17599 14187
21232 14187 27210 1800 8357 5142 2001 -14398 -31356 -33688 -16112 -13797 -327 8633 -5244
21219 -5244 -10942 -2875 -9033 -7048 1142 10617 3952 1996 9313 23238 20194 8428 8322 21939
21205 21939 24139 24585 21192 11091 26155 17686 2739 3632 -9321 -15120 -23170 -21362 -9912 -6893
21191 -6893 -1272 7022 2378 -8099 -20501 -22394 -8798 9954 16002 9350 -428 -6730 -7277 923
21177 923 10659 18515 17578 8868 -3977 -27307 -27024 -19129 -15988 -19191 -24836 -4814 1994 -7492 409
21162 409 8841 13389 18384 16914 19755 12650 8095 -5407 -7404 7002 16227 22264 20494 14955
21148 14955 1144 3173 13951 1887 -6681 -14154 -25808 -19906 -16441 -18347 -26159 -14301 -17743
21135 -17743 -21880 -12319 -19344 -16770 -3859 6698 -7614 -22785 -17226 -6199 4868 -18105 -38752
21122 -38752 -43116 -55265 -46513 -30848 -15343 10205 19198 -18366 -31548 -22174 -13795 -1206 21378
21109 21378 29735 9423 -22091 -15927 16596 28675 21160 24590 26865 14309 -9582 -2239 -6763
21096 -6763 -11678 -7859 -14536 1650 7340 -799 8330 4023 -8753 -11371 -15664 -14604 2818 31094
21082 31094 23222 5171 1888 -6923 -14641 -23154 -9078 4128 13033 11916 22785 6684 11516
21069 11516 8390 -11165 -23360 -18591 9101 17022 23399 22943 4191 -10332 -33423 -25907 -23240
21056 -23240 9273 20205 4701 -542 455 -15362 -22364 -21861 -13595 -7823 -8171 -11636 375 -9263
21042 -9263 -5709 -12856 -5549 6378 15662 25412 18956 10427 -4548 -15644 -14450 -7960 16277 31602
21028 31602 29727 10960 14070 15504 7385 18708 25700 22778 32863 29952 40939 38751 41121
21015 41121 37565 14328 134 1895 -5149 -5521 -7801 6278 3713 -2857 2781 25154 36370
21002 36370 31374 10734 4510 1396 6794 14593 6746 -10074 -27081 -20650 -559 2409 17846
20989 17846 20374 7963 -448 898 -6459 -15959 -18527 -11874 2707 7222 -2221 -1065 857 5362
20975 5362 14747 14401 17359 28295 15306 -715 5587 14368 22849 4229 -20328 5903 38610
20962 38610 14192 -3947 16516 35791 14118 10375 18432 2042 -14796 -1951 -1252 106 -10800
20949 -10800 -14370 2163 14345 22884 23636 18535 4632 7562 23990 28435 28277 17742 -3461
20936 -3461 -2673 7589 10557 482 5413 40087 46187 38665 18114 -15519 -29262 -3380 11491
20923 11491 6468 -11949 1193 912 921 9236 10109 -6690 -11541 -22721 -10826 -17902 -20830 -9712
20909 -9712 -4201 -4186 -287 9561 14158 2179 373 8992 -124 183 12854 16218 -4613 -20249
20895 -20249 -14680 -8846 1695 7601 7726 -7892 -6698 3021 3935 -4959 2562 13006 13726 9497
20881 9497 8651 16761 15173 28067 12140 8645 14467 1973 -13511 -31920 -24447 -8541 19854
20868 19854 41163 36676 9879 -11062 -14338 -23705 -11663 -431 -20125 -23072 -22025 -10119 -17997
20855 -17997 -8546 1928 1629 -546 -15228 -12667 -8350 -8741 -21953 -35714 -55761 -60710 -43004
20842 -43004 -25736 -2165 9104 16622 28341 23825 -5676 -18291 1975 14041 799 3215
20830 3215 -17893 -11184 -7758 -18603 -25049 -18006 -19710 -9810 -4469 -4744 -13440 -836 8361 12018
20816 12018 23142 15582 -7401 -20265 -24538 -31403 -31984 -27390 -19823 -18803 -26079 -23379 -16724 -24229
20802 -24229 -13697 -1427 1882 7782 3003 -17963 -38974 -40934 -34779 -37275 -41354 -42073 -28210
20789 -28210 -12053 -14479 -21167 -7591 -9687 -1234 543 28299 22824 7971 -11480 -6942 1666
20776 1666 21261 26611 21803 6127 -1273 -4142 1741 -6330 -28475 -35592 -19089 -6960 3451
20763 3451 -4385 -2824 -3022 -24848 -33599 -29804 -31792 -31216 -13782 -4526 -7211 -8806 -7068 -14416 -9601
20748 -9601 1114 -5105 -2235 -4196 -11227 -23754 -29524 -30378 1491 20177 1760 -15134 -23488
20735 -23488 -8969 3641 1665 -17091 -35654 -28706 -24434 -17356 5979 16742 1296 14100
20723 14100 39440 40038 21612 22713 15413 12488 23416 51489 56617 43739 17277 14244 2321
20710 2321 -87 -23255 -35117 -13994 -2340 7719 18405 24039 25465 15333 -7290 -18473
20698 -18473 -9852 6661 -5342 -9368 -3270 -12748 5216 325 -26517 -30934 -24460 -19416 -16465
20685 -16465 -21155 -6237 -1088 8692 14130 -2295 7906 -6457 -2375 11011 20903 -2423 -21996
20672 -21996 -41572 -26903 -11224 -4362 -2866 -12399 -12388 1084 -3731 14301 8569 -14046 -30100
20659 -30100 -22535 -23124 -14803 1215 2024 -7831 1579 5126 15669 22655 16777 11268 11868 6919 6549
20644 6549 -14965 -9107 -9419 -17362 -21165 -15254 -4887 -8128 -10777 -3866 11611 -4592 -14174 -18635
20630 -18635 -12965 -17785 -19915 -10252 2625 2443 20590 15614 -10550 -19237 -20135 -31772 -21113 -26248
20616 -26248 -20873 -24761 -23163 -26626 5951 10811 9319 803 -18469 -11073 -2314 440 9458 21228
20602 21228 22888 -1881 -17250 -21362 -11929 -1086 -6458 -4258 -7619 99 2213 -3336 8834
20589 8834 18484 22630 -3267 -618 -2199 -11024 -3601 -599 -9530 -13590 -8120 -15254 -27060 -26016
20575 -26016 -28248 -34762 -26730 -18807 11551 15771 -1827 1515 8753 16680 41890 50850 18102
20562 18102 10716 38535 39333 10154 -5315 -7557 7207 -2216 7671 24552 8808 -5231 -14070
20549 -14070 -13172 -12814 1929 -4455 -870 2871 5535 -5936 -12675 -14272 -19399 -4628 -7905 -12477
20535 -12477 -28186 -8477 19487 -1107 -1975 17486 2754 4151 5480 8228 40818 54269 40080
20522 40080 14410 8430 27470 43174 36949 25909 322 -4257 -9548 -29757 -20205 -16421 -25726
20509 -25726 -28413 -21594 -26199 -14030 8384 11283 21061 27828 16177 5640 18208 27849 16340
20496 16340 12008 2077 16615 11144 684 10999 10575 -5195 -4416 12090 16682 8223 5809 14145
20482 14145 4778 -11883 -21797 -15552 -1738 -3632 5689 5608 9170 -6933 -15870 -8475 -5090 -2536
20468 -2536 10454 9567 -4491 -9144 -3185 13571 12636 -3778 -6291 -7677 -18467 -54230 -51488 -27965
20454 -27965 -7422 3854 12817 5827 -894 -3900 -15519 -21008 -9560 -15530 -18734 -4705 8289
20441 8289 15530 8197 11897 1274 8313 15993 14969 18484 38913 19450 2370 -1706 -3017 -1724
20427 -1724 252 8995 20381 12523 -10912 7527 7102 7777 2580 19818 8507 -8137 301 2135
20413 2135 6906 16143 35720 21264 10319 14205 -2326 -11736 -10678 -6661 -18326 -14447 -20150
20400 -20150 -19126 -7053 4661 3051 3555 25189 35715 11888 1056 338 5084 -3487 14046
20387 14046 16755 16000 22783 15488 22561 4468 -10095 2377 27602 48708 41110 25672 23753
20374 23753 12300 7255 10386 21248 34047 35380 13190 218 5551 -13572 -28794 -30572 -20452
20361 -20452 -38647 -52106 -51773 -40644 -24097 -14820 -30473 -14673 -7578 2406 13216 7501 6648
20348 6648 16238 8596 -2045 -555 26299 32411 17175 10939 -5993 2012 3666 -12592 -24547
20335 -24547 -15776 15840 25957 -2557 -9112 -6523 -7842 -10372 1814 -8486 -2273 7880 19500
20322 19500 24014 15665 10564 12729 12741 3412 -17450 -9029 -755 -936 12333 7317 14623 36814
20308 36814 42389 26152 7683 -13087 -23271 -24865 -3793 18260 13011 -1093 -17378 -13532
20296 -13532 -5289 12629 1848 17158 9358 -17905 -11474 879 25144 20564 -2857 -7998 -23112
20283 -23112 -40208 -32395 -28094 -14468 -17069 -14661 -1700 -4252 -15238 1753 9266 13332 1954
20270 1954 -16420 -21978 -22862 -24675 -22554 -14837 -19010 -26521 -12020 16702 17959 -19005 -6093 6609
20256 6609 6944 3728 -19027 -17214 -23583 -17648 -1102 -17332 -28708 -18997 -13166 -27818 -26636 -25291
20242 -25291 -18697 1629 22707 20137 18169 7698 -18338 -27556 -23870 -16841 -18443 -16911 -927
20229 -927 -3705 12277 23617 15125 -14054 -18352 -13215 -6771 7883 14247 21904 22592 17335 11540
20215 11540 17475 24633 15933 23955 16580 -1268 -24190 -27409 -15837 1037 -685 1830 -14953
20202 -14953 -15472 -9242 -13537 -44 -3509 -3430 -14558 -21962 -31212 -4003 13640 2621 -10401 -17508
20188 -17508 -7752 -3936 -3370 6554 710 3502 -1104 1550 2893 -1914 2346 730 -23694 -32476
20174 -32476 -17070 3386 1570 -11196 -17801 -6674 17049 11257 9080 19253 9924 10046 16881
20161 16881 8469 -11005 -7094 13792 23720 29108 17318 12486 13792 20001 18355 19185 12421 -13613
20147 -13613 -22573 -10878 -13801 -19765 4186 27517 45608 59775 46954 40091 14510 -1134
20135 -1134 19267 15456 16003 14634 12953 15574 23687 30519 42140 45057 32939 11150 12334 13143
20121 13143 20894 8469 2403 -11817 -12818 5189 6202 19627 19704 20009 15182 16804 15170 -1825
20107 -1825 -7173 5540 9766 4502 2589 6767 62 8541 20023 10627 -1516 -7251 530 -3272
20093 -3272 -11683 1535 18657 14184 -2623 239 -17619 -44075 -38507 -36893 -29567 -14614 -9405
20080 -9405 -2105 25242 29038 23255 5707 10372 16391 11779 28044 30706 33980 40229 34816 23570
20066 23570 24270 46716 38929 13912 19612 24978 39826 38217 15276 10502 17857 20902 7003
20053 7003 8060 4364 16528 18653 2280 -6311 10324 22763 24358 28811 20106 24148 25215 13529
20039 13529 3689 7102 5721 -9809 -17296 -5488 -3279 -5890 1447 12836 12746 34134 41701 23501
20025 23501 20250 43761 53291 60622 37527 38854 62836 50248 31373 16762 8299 4565 12414
20012 12414 11564 16884 25644 51334 58986 69632 56799 40682 33400 18359 28280 17031 13171
19999 13171 14690 38039 46084 22841 9984 18917 33317 39493 42460 36043 23018 21681 21545
19986 21545 9636 12816 21527 25008 36543 31904 17953 4572 -8732 -19109 -7765 16691
19974 16691 10973 -9876 -16875 -6150 -3707 -434 -5967 -10637 4777 914 5762 15723 4469
19961 4469 9692 15538 11494 19414 13124 -8523 -10076 3658 1650 -5877 15118 20443 15496 12122
19947 12122 -2700 -22892 -28714 -19695 -15098 1601 6778 11677 23035 16860 28646 32034 55739
19934 55739 65017 50181 17633 1346 7128 1886 -14814 -3308 21503 15764 -2606 -6698 6555
19921 6555 7091 9164 22530 10473 -18928 -16835 -12011 -16760 -16197 -605 13476 12102 3087 -12990
19907 -12990 -23676 -18847 -11801 -7817 -5761 -11651 -14529 -11866 -11891 2608 12214 20861 27257 18632
19893 18632 -10849 -7481 -2886 2823 23657 32640 35267 36117 24315 14724 33356 54885 46518
19880 46518 31604 20153 29405 41986 33162 19202 28717 44691 44832 36452 19263 10216 -8602
19867 -8602 -11364 -16077 -7857 -4025 -19021 -515 21340 20688 31474 19842 13169 19554 22373 33308
19853 33308 25477 -1838 -15347 -12242 1246 7609 -16323 -20157 -10700 -16006 -2902 5717 8774
19840 8774 8778 4334 -665 -4756 9840 30719 54907 62018 65922 48430 19051 3734 -1104 -115
19826 -115 7584 26062 40666 38978 13072 10822 23247 24002 18954 26230 17033 36329 41273 32848
19812 32848 11797 6411 15305 17181 24573 21543 -3449 -23536 -29971 -21728 -1820 8530 16806
19799 16806 8141 5042 5091 9144 16745 -10835 -4195 1003 7726 7479 4676 2397 19693 34722
19785 34722 23024 14097 16559 1747 6112 15845 19183 26917 20941 -10037 -29777 -13326 -3074
19772 -3074 -4541 2244 4025 14789 23698 6634 5790 21122 26721 28141 30348 24125 9015 -1363
19758 -1363 3684 25471 45880 51513 62681 43710 40502 35294 40552 36227 20088 9035 14432
19745 14432 12316 16099 21219 33058 33730 33815 30696 14677 13657 11346 10338 15264 22421 40350
19731 40350 41712 29603 21833 19791 11372 18214 9287 7551 20271 16608 28930 29836 16202 22808
19717 22808 30085 47533 41995 19650 13792 24106 14761 -2349 -2356 2152 6901 21653 25701 27710
19703 27710 17731 640 -4606 -16025 -12625 11055 28532 22963 22259 11925 12923 26931 19436
19690 19436 321 -15159 2332 15841 11679 13775 4782 18483 17356 9203 277 -6665 -13068
19677 -13068 -18350 -16822 -8003 14073 26249 29437 17312 19029 11785 -1998 8837 21130 11992
19664 11992 16858 25168 19553 8007 11272 10374 2240 12503 13302 3800 842 9997 6486 11100
19650 11100 14028 15620 23520 20347 9715 -14038 8018 24762 28220 42454 36191 35668 51356
19637 51356 68075 57042 34449 36739 34423 23738 31561 39475 46914 52656 51315 42875 19551
19624 19551 20563 30716 20116 34974 40603 37861 42148 36412 38355 29911 33547 41687 30427
19611 30427 15489 21674 37008 34235 15960 26829 32512 33759 36310 26228 23779 16241 15326
19598 15326 14224 6249 -1724 -247 2347 25091 34276 42753 46161 20340 2305 5788 24441
19585 24441 32321 37576 28415 20345 2858 8519 33204 31166 10293 -9120 9268 13455 17698
19572 17698 23836 16626 19364 15817 15445 18008 15947 7231 15030 10521 3439 33675 42997 34991
19558 34991 31066 30644 40450 30141 24049 19317 22637 28789 19172 17279 23108 31525 14971 19233
19544 19233 16196 22561 19072 19605 16592 10132 27445 32194 20435 28441 32667 21588 25640 35865
19530 35865 39760 41896 41857 37121 31005 13926 25061 40572 24425 9653 5741 8454 32096
19517 32096 40711 44902 35577 8431 1668 32532 56113 57438 55445 40203 568 -17871 -14108
19504 -14108 -2581 27418 31602 22733 19211 18255 46472 40601 32629 36241 39472 38399 49461 51758
19490 51758 62606 71871 61399 62702 80952 76698 33280 5270 8517 16343 31469 51095 22347
19477 22347 11646 28609 37507 34576 37145 51126 56658 26504 8170 12766 22518 26945 24501
19464 24501 22914 12380 7300 25011 41822 48323 54193 47360 28513 13941 13634 22783 23440 35706
19450 35706 38803 36815 51574 63309 57407 70630 75244 41055 51220 67127 55308 49861 26763
19437 26763 7043 19024 21933 12946 20611 48204 48386 35542 12487 16431 25834 32475 21755
19424 21755 17201 8660 13011 -1314 2943 26484 13909 23633 26953 21927 3825 21280 31657
19411 31657 47440 36728 13981 7625 23887 27450 17859 36927 48812 28567 12927 15019
19399 15019 21677 29072 36352 44650 59418 77730 74101 46412 43650 45622 40432 23410 25100
19386 25100 37346 53560 47161 46153 49755 44486 26602 13191 33204 59278 60006 45415 37146
19373 37146 43043 60489 64168 50081 53142 46934 39015 33254 44710 37811 34358 33309 31393 46469
19359 46469 57608 32698 18511 12667 13699 27669 54091 59998 59117 55689 53894 41798 55202
19346 55202 53231 53637 72062 73230 60108 53995 54183 49988 37385 41530 57849 62892 63737 50727
19332 50727 37791 30893 34857 49082 70677 73105 54766 56985 68915 63369 51283 56164 66505
19319 66505 65195 68890 68269 77259 70405 90070 120573 111874 95344 87562 82733 84665 72814 76379
19305 76379 88948 92443 89774 102895 115129 114148 119407 121791 101392 126125 161808 171092 165297
19292 165297 171001 174338 183271 199660 227138 258817 288824 311120 317540 329341 343801 390469
19280 390469 431319 476265 544143 631320 698458 755105 810947 878833 933507 989910 1007385
19269 1007385 995696 976578 958881 907130 847024 786696 753880 722886 638060 557674 491355
19258 491355 440576 407110 365794 330330 281376 243607 212340 188960 179171 181434 179882 165325
19246 165325 153955 134045 111772 96924 85225 91006 108968 124942 116058 118600 118880 95685
19234 95685 84846 88019 85525 57505 40076 63657 62799 61091 68845 78908 93736 96602 89690
19221 89690 87173 96045 62491 53068 70703 76889 72703 68537 70054 91101 93792 69575 63935
19208 63935 66038 71092 67036 58958 59861 75240 69976 60384 61121 67350 49599 42875 57852 99336
19194 99336 108445 86473 70610 76211 71426 80031 95017 123376 134745 138526 153855 177373 197323
19181 197323 205652 238275 280610 329018 358846 394353 423298 459246 494011 520758 540563 560562
19169 560562 584377 586420 561005 531955 496106 475546 432505 390790 374944 362338 325363 278491
19157 278491 227171 198583 171106 146791 151393 147416 139793 122220 98733 79125 55375 56788
19145 56788 81148 97896 107251 116065 95341 69882 61120 72738 72245 93636 103838 107823 83503
19132 83503 66280 73851 60594 55930 43543 29970 36098 48348 60791 72409 77945 79598 75445
19119 75445 62497 54224 44272 39227 44809 49348 48721 43439 62402 69794 63614 62189 49244 47508
19105 47508 65997 49576 41799 42898 54646 59908 57621 51823 54918 74703 69001 64035 75399
19092 75399 73127 68690 58818 61228 76337 80296 65461 56756 56074 56027 59283 51780 55471 59343 53502
19077 53502 59314 63252 70824 70700 66560 49196 31789 41171 51862 58352 76291 53723 58687
19064 58687 47499 59995 74017 79723 79969 59898 50320 45875 38475 41652 49886 67052 77641
19051 77641 62601 53729 79778 84050 57823 36756 22899 46688 52668 40225 40554 45734 51171
19038 51171 57025 55509 56927 45271 44759 48020 40549 22641 38872 63346 61635 58741 41254
19025 41254 43575 39274 36795 66229 86256 95089 99700 113834 119932 103064 73936 61439 71130
19012 71130 84157 90208 88780 81533 66925 48841 42824 29605 30302 49084 68061 91592 91954
18999 91954 104693 112415 120899 145365 170320 213562 268754 333355 402895 450578 474341 490856
18987 490856 455084 404382 354681 341815 318718 294928 298267 308545 342003 385969 440536 510190
18975 510190 576007 597518 552568 505100 466176 437422 410895 391263 365099 335477 272635
18964 272635 200148 164225 137829 114894 95576 101710 103474 114799 130614 120551 103933 111553
18952 111553 129736 139775 154066 159597 190563 231436 254157 260636 262868 251517 243623 222810
18940 222810 202992 214620 225320 279671 338118 388814 454268 525310 561260 578342 575990 563271
18928 563271 554098 568038 544319 487750 423449 396667 384911 419950 449686 459005 448379 394782
18916 394782 312624 248438 209001 195856 198123 194027 182308 181353 170243 164091 162197 160153 156824
18903 156824 136013 142931 112665 91687 102814 106629 104456 102347 105703 127361 113470 97808
18891 97808 94001 113483 109046 92990 97629 98807 96962 80264 67632 71358 70795 70077 94151 93085
18877 93085 79097 70228 85717 82549 61477 42347 40239 28446 26864 38742 48695 57790 89840
18864 89840 106066 117294 123963 115361 127481 132304 118810 110785 119910 131388 130657 116769 106785
18851 106785 100258 130543 152362 135867 147753 146891 139708 120816 109696 111579 128920 139595
18839 139595 128372 107045 107020 137996 137394 122372 133720 145660 127571 122358 106641 101741 127079
18826 127079 139063 153091 141394 115724 120000 138979 132870 127864 143827 162874 165071 152581
18814 152581 141667 147687 154408 165463 163809 170845 178981 163031 150220 159566 176990 177747 163439
18801 163439 161234 164810 168993 176786 174575 182954 185898 201572 204704 213561 239386 232989 220794
18788 220794 224198 219852 228272 243648 266597 273899 267190 286626 300958 299428 285782 275398 294239
18775 294239 318135 347286 372095 401821 412508 419170 499491 593825 608205 578671 530170 469728
18763 469728 469175 479523 481629 490609 512069 515765 557322 589071 630184 667770 704150 721814
18751 721814 741476 776825 817361 877550 977166 1085971 1200940 1325648 1471152 1660647
18741 1660647 1904553 2204754 2539951 2887769 3176035 3387789 3601650 3826242 4069049
18732 4069049 4296017 4446603 4450475 4281520 4037742 3772767 3539490 3301430 3025687 2725902
18722 2725902 2394010 2041056 1737979 1485667 1292466 1126506 1002980 890192 823654 793600
18712 793600 757224 735682 698883 646517 615422 580816 552727 524085 516002 487309 468354 446495
18700 446495 412956 375247 342133 311520 320626 350066 337765 327475 314872 315651 305934 289797
18688 289797 278165 264224 247961 242622 243651 246317 258331 269854 262894 268440 258781 245382 240872
18675 240872 256666 274574 286313 290914 293493 292333 303900 300576 304745 307212 297197 318455 336102
18662 336102 355833 373285 370915 380862 391667 402526 424751 429927 431319 429822 434834 433790 416864
18649 416864 393976 395058 390133 379921 357490 349236 365283 372110 400309 402024 386279 390780 400090
18636 400090 409639 410286 390296 385745 384231 399242 432027 440786 445137 451361 446887 446157 448086 447528
18622 447528 457108 471017 497080 488016 477366 494345 520465 507037 504046 495432 474176 477141
18610 477141 504152 535383 565865 570841 562306 566798 565285 576397 601316 629789 643597 659265
18598 659265 661618 675863 689628 692275 711998 727799 726889 726652 746012 775932 787291 783539 807126
18585 807126 826415 856516 915014 985108 1052539 1091957 1129222 1182872 1248191 1300858 1329379
18574 1329379 1342359 1383857 1456694 1539347 1617978 1710470 1809019 1913205 2055401 2195241 2317761
18563 2317761 2456364 2590896 2718606 2867020 3006580 3154739 3344236 3575945 3783244
18554 3783244 4007585 4242126 4465418 4672838 4885327 5137993 5442547 5809379 6224029
18545 6224029 6668375 7152736 7693396 8340865 9108204 10020688 11092928 12345228 13840825
18536 13840825 15664508 17949752 20908159 24748801 29754855 36078727 43523216 51559919
18528 51559919 59400020 66117709 71474997 76057251 80570054 85590996 90991454 95617629
18520 95617629 98200776 97955464 94760266 89686142 84062671 78714655 73926510 69117815
18512 69117815 63325076 56264502 48215201 39926190 32315863 25884536 20805623 16993913
18504 16993913 14162899 12059497 10463364 9234067 8285036 7539332 6957996 6486570 6110753
18495 6110753 5832107 5627813 5470460 5350630 5270501 5230132 5221260 5252911 5295730 5379581 5514707
18484 5514707 5708541 6001050 6378900 6788267 7182748 7590661 8084391 8753923 9820526
18475 9820526 11599421 14212748 17209119 20114374 21481591 21301217 20116826 18571640
18467 18571640 17608403 17477396 18167159 19753794 22399513 26617759 33552012 45503016
18459 45503016 65221272 91512794 121258441 146907970 155503655 151932495 134293576
18452 134293576 110222228 85701884 64350566 48508119 38948915 35114752 36399083
18445 36399083 41117602 46836795 50532885 48721347 42912632 34368336 25875955 19205944
18437 19205944 14610836 11838222 10304562 9575256 9322671 9327121 9395111 9502225 9654867
18428 9654867 9876376 10234420 10707732 11197637 11754041 12406824 13289770 14696504 16913605
18419 16913605 20485021 26236686 34462706 43995177 53168084 57928286 57276660 52936644
18411 52936644 46940437 42709653 42129791 46717972 57770729 75554466 100535454 130140536
18403 130140536 157672473 177452105 181005451 162160855 133109615 97597072 67079708
18396 67079708 45034368 30878371 22749627 18202524 15698397 14527689 14452828 15536784
18388 15536784 17527605 19777686 21391108 20614604 18241924 14675477 11093279 8333263
18380 8333263 6482270 5386648 4752464 4309314 3848510 3382584 2884146 2432788 2073382
18371 2073382 1786403 1573536 1414038 1292980 1217534 1176970 1163657 1172816 1156327 1132500 1059445
18360 1059445 959582 894665 818581 744396 684734 646836 620975 612519 604249 570288 564759 568295
18348 568295 548771 532879 500750 473770 463894 438500 407986 419568 439305 457509 465157 454441
18336 454441 439930 440489 429995 396159 359895 328983 333101 334343 333696 333968 318715 312715 303116
18323 303116 293927 271211 253924 232036 237091 248144 259008 268996 268462 267285 260760 272037 292528
18310 292528 294831 282371 250418 227571 221014 221146 227892 225029 232994 241321 234292 235807 225286
18297 225286 190241 162657 139203 118452 119580 137060 142396 143308 150125 152596 143576 154640 172287
18284 172287 150533 142801 143986 147530 162973 157643 156910 160074 168045 194768 204810 216136 248721
18271 248721 250866 231500 214575 223208 230891 217060 192099 153451 134353 143600 160155 157549
18259 157549 165385 180208 170956 181969 186650 187786 190290 194978 198869 204106 228184 260432 306021
18246 306021 320880 319840 317123 315226 328260 373671 418219 474649 515500 557538 599795 643722
18234 643722 651087 620903 595674 582347 520994 482975 448710 432569 444441 480889 504688 521670
18222 521670 539884 566472 621657 627142 593087 570942 553069 539418 516959 495015 449313 387229
18210 387229 324619 284634 255173 220057 179710 149874 139298 136042 129791 136698 145006 158841
18198 158841 160273 176119 197476 215201 225246 201863 199201 228108 237852 240030 237668 231934 237114
18185 237114 236701 240495 274660 335675 377633 408047 433125 432661 429575 419438 401082 387805 403489
18172 403489 436476 436778 408416 399146 402036 404261 395330 406346 413822 398402 374259 365106 334693
18159 334693 299585 281286 257180 238690 236465 238575 237412 257134 265061 286995 292137 270270
18147 270270 237861 223869 237108 262711 286266 301970 306756 331437 361283 373981 391005 382329
18135 382329 399902 437981 482043 513026 581271 639422 708858 793420 878906 964237 1036770
18124 1036770 1107774 1215732 1351447 1502308 1696263 1938215 2224910 2591484 3107719 3824153
18114 3824153 4881903 6638243 9861312 16448501 29068376 40002964 35992758 28240050
18106 28240050 18416982 10437041 6158266 4045537 2908795 2192787 1711187 1390199
18098 1390199 1175849 1004926 900549 808322 738500 677514 632330 615118 580502 544582 571437
18087 571437 634038 693942 750465 798361 804543 774782 759929 775508 832333 913499 986287 1025311
18075 1025311 980012 879357 753294 666228 635171 635085 665129 690373 666200 591917 487260
18064 487260 400017 347070 308525 266538 250139 267772 268370 258809 262049 263346 255432 247558 225633
18051 225633 212471 208473 219628 233590 232360 238858 236709 238196 238020 241766 230009 209635 214684
18038 214684 222916 227879 209752 189966 183174 201940 207236 221472 226345 218499 207132 227109 253175
18025 253175 254945 228921 229618 244492 247977 237543 210471 191511 194072 198655 191273 189824 192075
18012 192075 175232 166236 176228 164810 170070 170650 178867 188608 175376 171814 177443 181141 178453 167598
17998 167598 177599 185553 171072 171530 165301 166549 168774 172334 186755 197067 189027 216796 241094
17985 241094 251619 234899 225091 226720 246012 240153 229332 241153 241483 245311 254468 250799 242119
17972 242119 261599 258250 241657 232169 237880 247249 240878 237795 243712 240173 252577 258689 253915
17959 253915 251824 235099 233182 251850 265544 277162 301217 314995 305602 322169 334551 348645
17947 348645 370427 396233 409214 409666 412536 413664 411834 434836 482029 532461 599511 643919
17935 643919 691974 735143 762962 781812 787361 802523 836147 873553 877893 868938 872836 872812 900810
17922 900810 918139 927590 912887 867395 802010 726796 671850 616735 599814 603664 572655 555001
17910 555001 572486 599784 616938 637945 667130 678532 699096 701247 684137 687225 678809 678836 705740
17897 705740 736674 769790 783460 798500 834041 865323 910483 985819 1073544 1201567 1355126
17886 1355126 1524618 1687648 1848702 1991087 2079342 2156483 2240348 2352533 2445376 2492781
17876 2492781 2487308 2496091 2511201 2525197 2579577 2696450 2877457 3076941 3312342 3571320 3811369
17865 3811369 4002089 4148657 4241555 4286909 4339698 4406090 4485427 4589982 4724230 4874511
17855 4874511 5023514 5212670 5463190 5755883 6092271 6486459 6946903 7474208 8082507
17846 8082507 8811226 9699993 10740156 12000956 13568917 15560010 18123394 21584484
17838 21584484 26420045 33476594 43772564 57314980 71147037 80336026 83381089 83812635
17830 83812635 86826441 96183062 110932851 125013497 131994685 128604481 116668293 102610424
17822 102610424 92620628 89125030 88993696 85808191 76146624 61927843 46947180 34212101
17814 34212101 24934844 18691501 14513575 11646637 9597671 8075769 6945794 6049941
17806 6049941 5349336 4788711 4334505 3997620 3777625 3626853 3480360 3314135 3170507
17797 3170507 3047500 2955511 2916836 2881313 2864603 2853423 2765975 2630225 2504229 2421260 2341894
17786 2341894 2279307 2236259 2191556 2171798 2160957 2185727 2201387 2201033 2197603 2213980 2295440 2413665
17774 2413665 2520752 2578177 2581570 2562927 2554029 2575553 2612163 2687711 2810134 2945832 3064412
17763 3064412 3180756 3317599 3528665 3771417 3923001 4043238 4181672 4367951 4532210
17754 4532210 4702391 4905143 5190203 5586846 6099088 6810560 7834695 9395515 11504404
17745 11504404 13458140 14882206 16500497 18929434 21419957 22102688 21903415 21781038
17737 21781038 22209479 22951593 24046797 26225525 30598282 39000815 52987980 69036428
17729 69036428 81212178 93612262 110547822 130739768 138514031 136090636 129969211
17722 129969211 121059848 109398730 94919094 81141662 68923674 59137514 51318047
17715 51318047 45701254 43628209 44824643 44849559 41401609 36989996 32889217 29325090
17707 29325090 25226679 20899229 16826279 13490762 11250189 9891336 9132491 8694530
17699 8694530 8491782 8522022 8717129 9064213 9533719 10200699 11206124 12699699 14850024
17690 14850024 18066754 22435865 26604744 29613404 32929976 37846470 43059775 44686383
17682 44686383 44252274 44428128 46875197 51492510 57236588 64686466 75628366 88481336
17674 88481336 97591992 104213899 111873940 120680595 116655259 103878964 89711877 77168411
17666 77168411 64876512 50903874 38169746 27505952 20332520 16592703 15002612
17659 15002612 14073832 13395307 13390344 14165797 14413246 13266936 11757415 10384457 9251403
17650 9251403 7912948 6475497 5136466 4048957 3292429 2830339 2525483 2335751 2230258
17641 2230258 2153156 2034273 1879833 1774543 1714982 1622895 1474300 1327146 1211731 1094124
17631 1094124 944088 802547 698496 625578 586442 544955 519844 508099 479538 477081 468999
17620 468999 442199 433039 442901 445754 428019 402775 375033 383447 392361 372979 364409 364631 376577
17607 376577 381047 376630 372156 363680 360782 370886 360659 375086 394581 413974 395866 386032 394702
17594 394702 393220 393328 375315 381325 392301 392941 375780 364890 360903 357082 361715 371690 369550 358998
17580 358998 364590 372421 366168 352644 348672 368092 383992 391217 398027 420547 438288 410614 379464
17567 379464 372781 394160 406046 411016 397394 390938 384923 387607 401557 412387 422298 434749 451952
17554 451952 481491 498949 515092 542443 562375 550219 550734 576523 603564 624730 652134 677453
17542 677453 707050 729741 750460 780555 804246 854477 905912 942284 957962 984493 1027670
17531 1027670 1098229 1174128 1245143 1321170 1390052 1459732 1565117 1687299 1834459 1977088
17521 1977088 2135479 2277689 2396833 2493031 2644137 2860369 3141337 3475989 3835762 4178712
17511 4178712 4458910 4642608 4819759 5075369 5468628 6027041 6712384 7457452 8168661
17502 8168661 8854156 9650359 10669943 12056393 14014069 16741972 20652305 26546253
17494 26546253 35685468 48809878 63770847 75307507 78344138 74518850 68240044 65414134
17486 65414134 70710058 86225831 108367912 127334325 131277138 119478679 98605777
17479 98605777 77915638 64216527 60003893 63459433 69067471 69683396 62564146 50353812
17471 50353812 37042423 26012130 18281895 13326581 10145016 8002159 6524686 5497216
17463 5497216 4821914 4364496 4032585 3736903 3427222 3103803 2801111 2490210 2281484
17454 2281484 2146554 2066595 2026000 2014906 1939449 1808683 1616513 1408470 1256054 1181489
17444 1181489 1161256 1220899 1237926 1124864 992733 850776 713810 614074 539774 500115
17434 500115 468514 439486 418127 392811 384806 383819 357089 333467 314394 304570 299235 297413 280751
17421 280751 289399 305930 302420 283946 277506 263775 252779 248108 239927 225555 204042 200276 204483
17408 204483 196788 189083 182382 178738 172909 177355 175909 167176 155702 155359 147311 138960 126339 106553
17394 106553 94407 79369 84049 102448 85525 64340 48758 51911 54044 30924 33616 35740
17382 35740 26346 28971 28597 21197 2881 4887 8815 16999 9775 -373 19467 22968 23992 28938
17368 28938 44305 53685 61761 73244 77386 86725 86556 94054 94360 80405 61684 50487 64157
17355 64157 97218 135005 156315 152154 132934 104894 84891 72783 66041 75453 96277 101218
17343 101218 95905 87518 80796 74295 89564 95901 84266 78207 84755 74250 74696 66836 55927
17330 55927 54708 72913 99049 102826 85425 73679 63737 62899 58413 55591 69127 75298 53537
17317 53537 36822 43640 29368 21466 31116 32647 29312 26268 29449 16847 -8609 -16964 -12062
17304 -12062 -6044 3989 9755 11095 -806 -23135 -35372 -40142 -46714 -35175 -20075 -5387 -13608
17291 -13608 -33443 -52861 -65106 -69352 -59582 -45201 -45218 -54001 -37691 -20416 -15947 -13869 -18099
17278 -18099 -43134 -56626 -54576 -51465 -43188 -27584 -19639 -19824 -7856 12448 6271 -818 7978
17265 7978 20282 24299 26850 37969 37392 40317 45769 53856 58561 49544 30905 35655 44133 55807
17251 55807 53212 38301 46990 50470 50254 46641 58179 70653 87536 85474 89180 91797 108036
17238 108036 114646 127605 149651 163183 182196 204121 261264 363587 489050 609881 697437
17227 697437 718218 768106 854704 948583 1018652 1050848 1040328 1006093 953358 917516 875320
17216 875320 849029 818580 784197 752549 679186 615251 564933 523586 464594 391117 346509
17205 346509 311296 275873 233427 207031 177176 154210 127929 121070 135020 129472 111438 110362
17193 110362 107279 105410 101464 101592 68756 60056 66980 52295 41478 39541 39040 55537 82757
17180 82757 135420 149084 155306 185479 228134 275536 316546 335121 339982 364585 394389 399670
17168 399670 401194 390391 352120 306031 268389 251808 220670 198363 196010 211702 224949 229694
17156 229694 259208 279959 309722 317511 315818 294194 262779 226837 175376 137226 100355 75138
17144 75138 51719 23790 7745 7907 10923 13725 19716 29986 26885 25098 -13073 -33804 -41321
17131 -41321 -46598 -57785 -58680 -42930 -43027 -43685 -48401 -45396 -34550 -40771 -44530 -31531 -37682 -43248
17117 -43248 -30196 -39810 -56978 -50947 -49900 -45726 -39760 -52734 -62858 -57088 -40811 -29864 -37736
17104 -37736 -44433 -36095 -25341 -47797 -50385 -36061 -24719 -36824 -39862 -35088 -28882 -42179 -45836
17091 -45836 -15322 866 6814 1033 -10613 -20658 -37383 -53552 -53442 -50879 -37248 -42820 -42940
17078 -42940 -53539 -42466 -24981 -17029 -24636 -37446 -47384 -35261 -29596 -34720 -45709 -30659 -27911
17065 -27911 -49962 -50490 -24317 -11745 -23726 -26926 -23397 -17323 -17492 -19429 -8811 -20881 -19359
17052 -19359 -19843 -16194 -26050 -23136 -41417 -34942 -19080 -25930 -46879 -38923 -16904 -13641 -15897 -25306
17038 -25306 -30938 -38069 -32008 -39964 -39402 -49296 -39254 -20904 -14979 -21433 -38379 -65138 -31196
17025 -31196 -1565 4663 17316 7917 -7559 -22900 -34537 -22925 6781 17934 8086 19402
17013 19402 11735 -15559 -27088 -28373 -28112 -24937 -39147 -14381 -20466 -20493 -9445 -8813 -12146 -24676
16999 -24676 -37951 -41307 -37013 -17614 1730 13141 14258 -279 -11542 -5818 1001 -10854 -17523
16986 -17523 -31102 -31715 -33637 -16829 -30344 -43760 -37362 -52053 -65686 -59266 -43801 -24493 -722
16973 -722 -5036 -24672 -39003 -37765 -43966 -44985 -56218 -59107 -47070 -24810 -28512 -30429 -23945 -13022
16959 -13022 -12140 -5429 -19572 -33328 -41639 -49324 -53810 -61039 -65099 -63193 -55334 -29122 -21149 -30219
16945 -30219 -26836 -22754 -29608 -29593 -38416 -31936 -31529 -41646 -44863 -43465 -32340 -9918 -21645 -25800
16931 -25800 -35205 -35520 -22142 -27392 -38993 -28883 -18310 -5886 -33881 -36735 -33459 -60432 -53457
16918 -53457 -15855 -6000 -21534 -17809 -1084 20142 13521 -11906 1951 12263 9808 5913 4379
16905 4379 12157 28912 37233 24157 20645 33370 51944 46158 52109 45250 54006 88165 150948
16892 150948 231268 287051 358719 420240 429977 379551 355052 380617 457826 575275 667273
16881 667273 679277 618151 494436 383534 312447 313459 348677 391535 379600 323442 256888
16870 256888 172729 125794 112303 89127 52331 17140 15477 15469 6720 -3376 492 -5014 -10431
16857 -10431 -16045 -17556 -19858 -14661 -9777 -10678 -17065 -22086 -29873 -19839 -3534 -3636 -17334 -16357
16843 -16357 -21580 -35055 -25275 -20392 -33516 -35966 -31009 -37889 -41725 -58534 -52363 -38884 -27846
16830 -27846 -27816 -10631 -9498 -15458 189 7567 -136 -1287 3883 -14086 -18823 -26719 -31898 -29270
16816 -29270 -28395 -21818 -24045 -27865 -27504 -39896 -39864 -27305 -13917 -19226 -37463 -38742 -25672 -19077
16802 -19077 -17340 -16940 -16730 -2503 -25816 -41970 -31931 -12972 -8463 -3245 340 -2979 -15620
16789 -15620 -21254 -28574 -50179 -43512 -31567 -27867 -32702 -41531 -21931 -16175 -29117 -25945 -28629
16776 -28629 -33803 -43964 -28006 -28015 -38031 -33333 -30670 -37929 -51467 -51922 -38188 -35545 -33571 -23792
16762 -23792 -18263 -36009 -36940 -29648 -29670 -38704 -31942 -27663 -38832 -46059 -57065 -58612 -57620 -64202 -75641
16747 -75641 -64325 -67127 -48073 -19767 -21080 -42624 -41247 -37498 -34076 -27096 -18626 -16344 -12270
16734 -12270 -17086 -25473 -19586 -12108 -11500 -15603 -10920 8273 428 -10691 -1314 13212 14959 6425
16720 6425 -27282 -34057 -35434 -29803 -31378 -38576 -49378 -26233 -16652 -7983 -35157 -54677 -60156
16707 -60156 -74476 -72546 -45742 -9511 17932 6957 10722 14661 17309 6856 -17995 -35876
16695 -35876 -24430 -20913 -8602 829 -12930 -14755 -6625 -22576 -43480 -38475 -35410 -20209 -8375
16682 -8375 -24555 -53722 -66621 -54748 -30011 -16246 -12789 -50485 -71562 -62223 -36790 -13422
16670 -13422 -4610 -30475 -46994 -43185 -30688 -32113 -34045 -33238 -31286 -26308 -19914 -13106 942 725
16656 725 -15260 -28846 -31172 -27827 -12584 -8752 -31875 -33218 -32903 -37472 -39494 -37258 -19200 -15072
16642 -15072 -5050 -26353 -29529 -48996 -52387 -36247 -29529 -30182 -39817 -58541 -60961 -69584 -79064
16629 -79064 -66863 -48749 -49792 -50069 -22934 -30379 -24106 -25259 -24534 -21640 -34625 -30517 -22802 -20991
16615 -20991 -39317 -35334 -23746 -18204 -10132 -36383 -50899 -38525 -42861 -44622 -33895 -25546 -42422
16602 -42422 -31925 -54290 -58257 -32328 -33000 -52161 -49450 -33667 -29735 -52172 -59953 -51435 -42231
16589 -42231 -37954 -26747 -19641 -28143 -31525 -31040 -37920 -22606 -7485 1266 -3073 -10547 -16730 -19317
16575 -19317 -33555 -39577 -34446 -42603 -39543 -46582 -55641 -47903 -51625 -36844 -28891 -31480 -23941 -24711
16561 -24711 -18274 -9877 -6755 -23600 -25480 -17118 -29675 -34366 -33008 -38676 -35351 -33625 -41951 -57557
16547 -57557 -56008 -42731 -26736 -29204 -33039 -25703 -30500 -24293 -38083 -30687 -11877 -12511 -22971
16534 -22971 -14604 -21068 -24721 -29851 -4438 2513 -17031 -27902 -32140 -7343 46 -10286 -20199
16521 -20199 -29549 -25620 -47132 -60312 -47184 -49854 -59027 -54348 -50938 -35090 -41118 -30046 -37877
16508 -37877 -30795 -33591 -24349 -15141 -21728 -24848 -19517 -25292 -33173 -9314 -8496 -12070 -24603 -21438
16494 -21438 -8347 -8438 -13213 -16541 -13794 -14490 -18579 -10271 -13418 -9444 1423 -12135 -16991 -28561
16480 -28561 -24794 -26861 -44880 -57515 -52652 -35596 -29257 -17188 -33825 -45945 -50930 -56131 -58691
16467 -58691 -61537 -65550 -53956 -48702 -39537 -29398 -17995 -14122 -13194 -5994 1681 -23559 -25753 -7230
16453 -7230 -7670 -17468 -38984 -29818 -29142 -26459 -27010 -35108 -26806 -26307 -14380 -11250 11728 2832 -16022
16438 -16022 -8597 -5120 4171 3693 -14171 -21811 -15299 -28736 -31108 -27954 -11949 -4561 -15569 -24851
16424 -24851 -19286 -8709 -10049 -1711 7300 -2176 -3295 -17291 -16170 -1797 -16111 -31951 -53595
16411 -53595 -22785 -14401 -17055 -19751 -19874 -28475 -16427 -12595 -18460 -32335 -41602 -36447 -20079 -6231
16397 -6231 -16341 -16704 -14329 -15564 -20330 -20264 -34444 -33653 -38817 -53469 -61627 -49773 -46101 -20181
16383 -20181 -5111 -3294 -14719 -21733 -21216 -23799 -8357 213 -3208 8306 18052 4837 3483
16370 3483 11899 11366 -3187 2512 19294 25340 10735 3118 1450 -1934 -4059 -8377 -24139 -20592
16356 -20592 -31262 -33080 -16288 -8581 -12532 -24705 -28062 -26129 -18775 -29976 -36299 -7760 2532
16343 2532 -4213 -2455 -1722 -26182 -8158 3128 -14859 -10389 -11973 -13872 -10428 -16291 -3762 -4337
16329 -4337 -17017 -12927 -39430 -52874 -42159 -27055 -26779 -35919 -42100 -31027 -19135 -23409 -16974
16316 -16974 -6476 2200 10190 6070 -451 -4039 4896 10639 13543 17551 -668 -22191 -25746 -19356
16302 -19356 -17209 -15784 -15089 -13667 -13995 -16274 -10571 -3483 6322 13863 -8520 -21673 -33939 -26779
16288 -26779 -15497 -30589 -32880 -26193 -24656 -22277 -17320 -8310 10272 -1130 -386 -10869 -15654
16275 -15654 -17299 -26950 -22336 -825 3131 -24853 -36140 -27996 -11343 -1940 15516 20342 -7267
16262 -7267 -20344 -18028 -13851 -13820 -14902 -9365 -16158 -24229 -5640 5184 201 -396 -9731 -6509 -2810
16247 -2810 -19689 -6208 1761 -333 -10148 -21411 2318 15756 20505 30600 22163 -5823 -15779
16234 -15779 -18927 -26872 -25519 -9133 -20289 -37376 -33506 -17712 -8734 -25961 -34725 -46555 -46559 -45950
16220 -45950 -31109 -23901 -19640 5345 7045 -7125 -2975 11833 9460 -4433 -23064 -20930 -23386
16207 -23386 -28362 -24747 -13281 -16843 -5948 3446 -10716 -39857 -43169 -28570 -14124 -21903 -13739
16194 -13739 -12946 -33371 -21651 -4857 -12443 -25531 -27528 -10939 6480 -2966 -22210 -14282 2420
16181 2420 16714 -8518 -32494 -27337 -48366 -49657 -37813 -24753 -10142 -378 4817 7311 -13028
16168 -13028 -25158 -54607 -52639 -37674 -41614 -28076 -17575 -21372 -19183 -9923 3722 5281 -8509
16155 -8509 -16846 -304 7718 11840 15992 -5900 -25879 -24215 -29832 -43290 -46720 -33074 -1348
16142 -1348 9949 -2135 -6077 -15815 -25679 -45627 -39914 -11227 -3158 2544 5304 1752 3624 4359
16128 4359 -5663 -5952 -175 -20175 -20793 -3418 928 20203 24164 -17376 -28785 -40187 -42719
16115 -42719 -35795 -23899 -8480 4687 12650 2606 -10754 -2709 11516 4162 -5351 -85 9107
16102 9107 13562 184 -8807 -2570 -22429 -21375 -9574 -20040 -20482 -14994 -13623 -6200 -11281 -15068
16088 -15068 -9238 -13712 -21889 -21989 -17612 -4689 -925 -10021 -23067 -15922 -18623 -25199 -20246 -21513
16074 -21513 -30939 -29463 -40231 -36907 -29345 -35607 -33129 -21263 -4906 -943 -21753 -31418 -23600
16061 -23600 -39464 -49914 -38874 -6697 17917 6227 -15359 -22727 -24111 -31248 -28258 -13909
16049 -13909 -10282 -9749 -1404 -2802 -19285 -21726 -23241 -19993 -15248 -211 -8322 -27834 -12072 -8576
16035 -8576 -16164 -13237 -28973 -28608 -36772 -36634 -18979 -10123 -23799 -38901 -22064 -3645 -15554
16022 -15554 -5713 -19454 -26146 -5437 -3135 1454 -7054 -10948 -9353 -9594 -6164 -7661 -19300 -15466
16008 -15466 -14746 -3743 1263 14203 21068 27852 13976 524 1294 -388 1084 -2486 -7274 -17082
15994 -17082 -16535 -17341 -11689 -18107 -21641 -24732 -16745 -32508 -34775 -27973 -26336 -34399 -47127 -29367
15980 -29367 -6444 -5778 -11435 -11372 -14469 -9039 -16866 -10240 2498 8626 10220 -1155 -16188 -6126
15966 -6126 -4266 -9494 785 -9580 -4785 -3326 -5285 -6529 6620 12185 14624 35571 21927
15953 21927 1684 -15970 -6544 -7423 -12348 -9690 -8509 -8864 3129 4324 -8980 5024 28535
15940 28535 23317 10967 15557 9865 21898 14598 -498 3634 10043 15791 8579 -2120 -24216
15927 -24216 -32954 -30803 -24008 -23676 -58912 -59561 -32661 -21313 -14420 -11949 -10277 -17024 -17813 -7166
15913 -7166 -11281 -29397 -28995 -26771 -39828 -23825 3403 13886 19333 30446 29782 9672 5540
15900 5540 -3722 -6955 2884 1670 -1303 -16362 -22488 -8178 -5553 -27904 -42457 -20889 5846
15887 5846 12994 7702 -13829 -20329 -21994 -17141 -17598 -11202 -4055 -5784 -5176 -18372 -40233 -38515
15873 -38515 -50907 -27715 -10110 -12246 -4129 -6466 1809 -329 -778 863 -12919 -15720 8578
15860 8578 5180 6571 7850 2720 -7161 -14874 -32177 -21297 -15899 11 30448 25545 13781
15847 13781 6523 -15416 -30035 -39466 -46031 -34645 -30080 -32959 -23422 -9044 474 10143 18170
15834 18170 22931 15592 626 1821 924 4561 -4199 -10926 3760 10223 10475 14268 3388 1137
15820 1137 -4731 -7659 -7711 -10522 10773 16728 17331 9344 18545 19633 13956 8076 14776 9870 3856
15805 3856 14479 15999 10578 -4503 -13711 -18510 -12445 3434 7769 6501 -2713 -9491 -7112 -17794
15791 -17794 -12147 -1690 -16066 -26612 -13861 987 6917 4409 -2259 441 4041 9166 11476
15778 11476 9541 5281 5356 959 -2985 -15773 -27719 -39199 -46366 -31455 -25170 -17799 -36577 -23149
15764 -23149 -4792 -1223 5674 11679 11289 -8472 -15465 -15046 -1955 9320 -2229 5693 20537
15751 20537 25444 25366 23484 21444 20581 22280 19207 8257 15636 17707 17985 26850 36553 42783 35948
15736 35948 25144 30409 21630 12550 22001 15671 2904 -4597 2618 2980 2192 -13531 -12197 10049
15722 10049 22882 18651 26635 26074 25653 15500 2282 -23637 -35947 -45719 -34901 -21247 4141
15709 4141 14420 3021 -794 -6478 -6278 -9921 -1057 -899 -541 4254 -8527 -22839 -42694 -49370
15695 -49370 -36850 -12338 1490 -17 -12358 -5966 8713 -2052 -2619 -18497 -13095 -10121 -16092
15682 -16092 -5261 3830 -15097 -3383 -8329 -5033 12890 18119 14440 39287 55155 36060 6749
15669 6749 26700 30826 26912 38707 39400 30091 13988 13918 16154 -2389 4183 1552 -6705 -6966 -3026
15654 -3026 15241 28061 13738 9190 541 -15230 -22054 -24633 -12957 -14955 -26064 -28859 -9135
15641 -9135 11507 10238 17294 -980 -1237 -8156 -20108 -20428 -13324 7109 -3279 -19541 -14605 3881
15627 3881 14801 22197 20309 -151 -6179 10579 19038 17133 9907 15356 21920 2682 -4294 2190
15613 2190 -2227 3266 7310 6829 10492 22918 16475 18364 16398 27035 22719 11168 9453 11021
15599 11021 19078 38401 27552 7469 9069 11442 23367 16413 -3629 2164 14938 11973 19351
15586 19351 13901 26189 21778 23990 20630 7791 11360 -15216 -42615 -36120 -36915 -32589 -22270
15573 -22270 -18477 10270 27081 4711 -20524 -35433 -44388 -43649 -17125 -20848 -33616 -31306 -23974
15560 -23974 -24911 -19625 -8520 4338 17396 4432 9291 25155 33340 16581 -9508 -1857 6036
15547 6036 12250 25190 22338 20577 22422 21372 15672 9704 8777 16600 14950 -3098 -10160 -9397 3380
15532 3380 4008 5826 12727 17114 18322 -7971 -19090 -29546 -38120 -25830 -3583 -6452 -19937
15519 -19937 -16681 -16777 2182 21937 18725 3762 8474 -8159 -732 3945 -647 1096 21627 25563
15505 25563 16425 25379 26539 12231 -10532 -5033 -6144 -1918 14651 12634 19886 33249 27856
15492 27856 21923 27938 16948 -6151 -11494 -9340 -3663 -11551 -14870 -15969 -1741 16301 19293
15479 19293 22024 4481 10590 31205 30385 26894 34690 38922 33981 13419 17078 30454 21520 4058
15465 4058 -683 -15546 -15248 -11368 -32283 -46013 -22511 -1914 9518 23280 31746 28683 11865
15452 11865 7151 4038 9224 13875 998 6051 15392 2802 -4683 -3932 22056 18593 13579 11354
15438 11354 17468 23326 17459 -1298 -19059 -13125 5827 -894 -5740 -3035 15780 34267 42846
15425 42846 39474 47452 62591 30530 31045 40587 37022 33530 37708 42084 26715 17742 14925 12092
15411 12092 12541 17081 11689 16731 27504 25050 29464 38272 25247 15187 11079 12103 12774 19713
15397 19713 14747 1523 3107 -4044 -1197 -3500 -5015 -4402 -2864 -1260 843 10808 19343 7730
15383 7730 -12719 -4398 6167 1719 -12749 -21840 -24082 -16118 -6608 -13638 -16215 -7690 -19593 -21656
15369 -21656 -1340 2807 12177 13245 19522 19088 12808 -2207 -2239 3430 11942 33017 36325 41593
15355 41593 50146 57386 39525 20362 32900 42741 48135 25290 12915 1617 -2603 -10336 -3557
15342 -3557 -5121 -17106 -19494 -5001 -976 16102 38483 21792 -682 -533 -1613 6874 17633
15329 17633 15934 11569 22191 36827 25851 30433 29631 12356 -1503 -10249 -15080 -9526 -2729
15316 -2729 11644 22402 31620 33885 16470 11095 35960 43840 34943 36113 42340 36240 39521 41633
15302 41633 35427 24653 34125 33728 30127 39919 41969 35857 45604 41137 31092 34848 41363 40963
15288 40963 59007 74957 73364 70355 90568 95210 85441 79942 82477 71621 78426 60853 30498
15275 30498 20371 11673 -14845 -20176 -6327 -782 3056 11268 28218 18155 8523 14777 22140
15262 22140 41798 52604 64800 59478 60261 54357 20392 -780 12663 25863 35569 31797 11923
15249 11923 12860 15835 26447 38719 31076 40844 45607 54534 51695 33346 17045 22055 33235
15236 33235 43159 34703 40187 38566 24125 -1186 -923 3839 4484 7968 10387 4417 6424 16643
15222 16643 18295 18264 26431 36474 33820 30678 21285 12039 20554 11736 -1912 5408 20598 36600
15208 36600 47512 42341 25955 22397 3721 -8375 22502 56639 47681 18391 -5287 -14191
15196 -14191 8349 58087 74163 75107 64410 44781 33826 18420 6172 10327 9168 17978 31299
15183 31299 30863 28562 4750 -8271 -12308 -16266 -3816 -261 389 4059 11597 2563 -6853 -1973
15169 -1973 1017 2571 927 18964 31578 31690 11323 26984 27614 21290 24247 22510 16888 17858
15155 17858 27754 35578 43389 38743 48165 55360 50575 36962 36005 44105 41516 21715 18550 21874
15141 21874 25380 17135 9141 22550 27823 22332 21744 26355 39291 42422 32653 34349 36746 33812
15127 33812 26195 15866 26776 44939 24727 22433 22938 32259 29828 19295 25378 29053 34908
15114 34908 42367 42820 55475 52725 46855 39021 15425 25219 32766 48144 65083 59618 45065
15101 45065 41537 49065 48244 36969 18183 3402 17227 5471 -20442 -22092 -37253 -37694 -21437
15088 -21437 -4322 18525 35328 55126 74746 83204 97584 137448 143707 156573 175327 205221
15076 205221 216279 246601 279610 318877 384340 460252 564571 710623 848998 998683 1152092
15065 1152092 1298654 1422048 1523013 1557491 1532671 1454001 1323379 1167669 1011569 847413
15055 847413 694456 566774 452814 366038 308925 258811 222547 194461 171601 136909 132217
15044 132217 132791 121649 95171 84188 69788 54070 43518 56211 71253 63707 49304 35561
15032 35561 52647 56302 73055 66436 65776 76212 82518 81035 73706 63799 51060 47689 66425
15019 66425 60515 52770 63742 75395 80976 71452 53386 30744 18113 46922 68902 70667 62561
15006 62561 71445 63237 58431 42457 35119 44611 58095 47186 45341 67093 77812 61705 53517
14993 53517 61833 74924 65707 60901 61917 75800 111874 127759 121534 85808 68867 80970 75570
14980 75570 55519 50167 56677 48161 48137 54016 86738 103757 100663 112194 110752 122819 107452
14967 107452 72908 76669 89416 87770 82253 64711 81717 99775 113624 103670 100512 77936
14955 77936 82095 99807 118216 126004 164782 225329 277607 309764 324408 337309 333638 309528
14943 309528 261031 212451 152572 121755 106459 87322 112115 111852 79763 50393 54622 53584
14931 53584 65607 71187 73713 72380 75107 74490 86245 102841 93644 116742 129835 119700 129021
14918 129021 144600 125706 108172 98083 100376 107091 110500 123186 107798 110196 111948 109291 112307
14905 112307 122834 154657 151702 141273 159435 163623 138145 133627 130410 115894 112982 131751
14893 131751 151080 175690 183221 165968 148241 142518 149303 157460 168625 191136 228760 245710
14881 245710 270748 298885 340464 346674 325403 309272 304030 300426 301157 290014 260157 241183
14869 241183 246545 238971 220700 213286 215664 201197 192976 212156 223431 204211 163352 158377 176449
14856 176449 187094 169916 169798 160886 161229 157540 147098 139401 137174 116661 112657 131725 136988
14843 136988 135969 143934 149155 151921 132914 133797 127299 127401 133845 149816 175730 183872 184601 185359
14829 185359 203203 220460 216309 220317 217445 230107 260665 274057 276159 279516 272452 255282 239029
14816 239029 232537 223766 197124 162637 136336 138313 129983 111741 99471 94412 112414 135595
14804 135595 130710 128309 109331 102090 116509 132443 115013 88636 89918 75684 75596 90534 108549
14791 108549 111670 100629 92360 91542 89191 84933 75401 53355 46571 27426 17251 15965 30821
14778 30821 48751 40707 66175 100565 111765 117046 118073 132945 155790 161010 173729 193165
14766 193165 186473 184855 173083 160900 161711 184968 192150 170723 183046 186240 196649 201865 197601
14753 197601 192434 200577 224133 239112 267194 278983 313193 343892 361719 380919 382124 394858
14741 394858 405436 407525 415855 434493 450500 457153 468657 472324 462045 463801 465988 464718 456865
14728 456865 462034 488474 492122 502016 512335 532970 536582 510985 507113 503729 491650 484695 484092
14715 484092 506179 521852 536984 547703 563440 594405 623711 641552 639161 642185 663436 681851
14703 681851 696721 725261 734953 738816 748585 758615 767117 779887 825872 844540 851589 873839
14691 873839 927706 976057 1002329 1039749 1109910 1171483 1194512 1221670 1280759 1336808 1397372
14680 1397372 1459699 1533704 1620956 1698092 1773087 1843455 1920684 2016731 2114717 2242463 2342811
14669 2342811 2449003 2547237 2657861 2807300 2976629 3135001 3283659 3440866 3642388 3863167
14659 3863167 4100912 4350169 4614451 4906709 5228103 5604937 6036714 6520395 7070515
14650 7070515 7700968 8398408 9212903 10201323 11389945 12780814 14392465 16253087 18397736
14641 18397736 20798987 23467292 26427459 29750626 33540740 38049502 43807598 51657096
14633 51657096 62797968 78366310 99083274 124684804 154202385 185838590 217479018
14626 217479018 246657835 270665044 286741848 292789367 287861001 272532920 248741351
14619 248741351 219070264 186379345 153136958 121737856 93959722 71178894 53783884
14612 53783884 41355920 32816658 26936459 22683627 19393630 16703297 14378810 12332725
14604 12332725 10547670 8964318 7614078 6496252 5614517 4901676 4306974 3806501 3409037
14595 3409037 3070846 2786018 2530433 2308407 2133339 1961047 1771546 1618974 1515935
14586 1515935 1415222 1321312 1249053 1156452 1080588 1013817 956935 904746 863702 804050 765440
14575 765440 757780 750854 749008 737368 724753 711601 711894 684717 642887 602510 556254 534029
14563 534029 527078 524378 517969 507100 516958 500959 474356 471179 448953 425864 412548 391280
14551 391280 365072 340710 336139 314564 298437 297802 278893 275413 259687 231251 202448 171686
14539 171686 179978 181265 186627 174074 154910 149761 159553 161704 157009 172144 159002 150517 135954
14526 135954 121667 128994 123894 102740 95027 102871 103627 103357 88594 73228 42059 58874 80138
14513 80138 70886 50097 46204 54233 67150 68531 63772 54674 62809 60028 58271 56778 81097 110907
14499 110907 141090 169397 176103 167590 166018 184712 204947 216065 217062 206063 227555 238020
14487 238020 236567 219803 208020 188030 169728 175416 174525 164874 156948 158598 157112 140468 155294
14474 155294 191088 189088 164683 152961 175978 188797 186603 206538 217280 217224 220311 192464 157710
14461 157710 139163 145899 139328 140719 144179 117416 102272 97244 108123 98637 91248 81148 80953
14448 80953 94177 87707 80003 61796 53008 53297 62815 48599 20508 27737 35337 22237 2933
14435 2933 -5056 -8040 -12008 -26000 -59782 -81465 -105132 -100740 -88276 -90379 -99015 -100774 -83928
14422 -83928 -83240 -91533 -100044 -96251 -101434 -100501 -74045 -60941 -62895 -69965 -65392 -43879 -8462 24994
14408 24994 33330 10384 -15308 -21123 -4915 -17668 -15908 -6986 -21423 -33823 -21419 -18801 -21496
14395 -21496 -21131 -19994 -23571 -38555 -48431 -47989 -29595 -37771 -36845 -44423 -24776 -8397 -22323 -22683
14381 -22683 -26080 -22348 -39129 -26579 -14770 -21875 -23780 -17678 -14886 -29214 -16097 -17644 -31707
14368 -31707 -42625 -39745 -31464 -22702 -45759 -55025 -55822 -46899 -40510 -38188 -19949 -23381 -24150 -23443
14354 -23443 -17182 -23799 -48710 -59276 -60774 -66844 -63796 -63525 -53506 -70600 -63312 -54802 -35582
14341 -35582 -18146 -13262 -34755 -49677 -57998 -51464 -18677 -6930 -2931 -9093 1740 11769 12687
14328 12687 -13359 -27190 -22904 -18317 -27671 -36415 -41265 -35814 -15707 -6384 -7748 -10881 10102
14315 10102 14671 15551 4986 -1523 -7397 -3232 -20017 -49169 -57104 -58492 -54859 -50026 -26217 -4934
14301 -4934 -14686 -23509 -29409 -31649 -12567 -21569 -27504 -13104 -4728 2974 -9375 -11360 10133 4546
14287 4546 -10478 -34231 -63556 -69699 -40837 -29565 -36078 -27528 -29957 -28248 -21200 -24190 -22194
14274 -22194 -29229 -29936 -33877 -42691 -46813 -42860 -44301 -37728 -28936 -38304 -48739 -41906 -51181 -44157
14260 -44157 -38389 -35713 -33148 -15140 -24584 -35416 -28155 -13561 -17363 -26735 -29762 -27087 -18935 -25722
14246 -25722 -47617 -56455 -51684 -50034 -42326 -34572 -28910 -35190 -32010 -39299 -32839 -6614 -12945 -30911
14232 -30911 -27706 -19146 -21983 -19770 -8984 1670 3344 3724 914 685 -1209 -7575 -18499 -22661
14218 -22661 -4241 16998 32118 18707 8952 13599 16086 14724 16755 28853 16737 16071 13412
14205 13412 630 12687 5654 -11328 -9751 5465 34013 64303 74463 68659 71462 76956 108190
14192 108190 134422 169243 197105 243260 287161 364022 442018 564165 722225 880620 1045986
14181 1045986 1189251 1314887 1407045 1452366 1444423 1396782 1305228 1154700 990247 843425
14171 843425 682553 524439 407126 319624 246464 181786 131971 107689 102374 109608 109469 109711
14159 109711 104131 116044 109068 94456 82786 61304 60984 65297 78107 77882 73874 76108 80738
14146 80738 56992 35639 21077 16788 -7315 -31660 -31538 -19475 -21177 -13897 -12066 -20179 -13628
14133 -13628 -17981 -29127 -42938 -46522 -25490 -12912 -8271 7481 7314 -23660 -42611 -40609 -7362
14120 -7362 -2643 -2952 6997 -7504 -23331 -29919 -20945 -14160 -25371 -17396 8864 -2984 -19661
14107 -19661 -40925 -38332 -37639 -49942 -59808 -44556 -32270 -13998 -4931 2670 3800 -4833 -12976
14094 -12976 -35005 -30982 -42747 -43466 -42288 -24682 -7618 -414 -3644 -16652 -41537 -56302 -47166
14081 -47166 -29440 -18396 -21402 -43602 -43706 -27766 -18160 -1540 -2681 -27752 -34654 -21357 -20085
14068 -20085 -19164 -15961 -22731 -18923 -26331 -7605 -16527 -34224 -24950 -27556 -58549 -77780 -87997
14055 -87997 -67959 -56993 -52968 -46938 -48033 -37792 -21879 -30148 -20220 -14923 2457 -9651 -6654
14042 -6654 -25659 -43994 -39086 -18217 11462 2773 -32552 -37882 -37047 -18508 -3651 -19706 -32536
14029 -32536 -51584 -55980 -46194 -39520 -35924 -7066 -15137 -30833 -14972 -12805 -19383 -28996 -22090
14016 -22090 -17596 -23376 -19156 4803 2278 -11916 -26373 -30533 -12076 -8931 -12487 -8701 -1995
14003 -1995 -2981 -5920 -1110 -5590 -16396 -21224 -21854 -23305 42 23808 7899 1874 -2892 -4822
13989 -4822 3465 -19830 -43552 -49409 -13014 1773 12935 26805 35622 51105 60837 61950 81821
13976 81821 86632 83571 81541 76659 61587 53698 46907 39012 17676 17319 -3078 -26688 -22388 -14805
13962 -14805 9928 11830 6251 -18942 -36061 -43011 -48339 -52901 -54247 -58370 -41834 -27498 -13105
13949 -13105 -12310 -12628 -24552 -23065 -31004 -33552 -22653 -17430 -18749 -24502 -33951 -38433 -47893 -44376
13935 -44376 -55051 -41307 -28570 -32020 -26637 -11329 3491 29743 23116 1356 -3021 2203 -15017
13922 -15017 -25194 -29235 -21919 -16156 -6654 -19792 -26073 -26317 -24752 -23658 -16172 -14841 -20797 -15841
13908 -15841 -8123 -15412 -16930 -21171 -34908 -41008 -46267 -30449 -7225 -14002 -31976 -32968 -10070
13895 -10070 23284 30368 24205 17894 11649 19221 34448 25283 8563 2331 1 -19371 -20117 -13912
13881 -13912 -20883 -25952 -31815 -47006 -47304 -27241 -10551 -22800 -36426 -43871 -22034 -6079 -2091
13868 -2091 -2002 -5041 -7906 -29568 -46427 -33735 -35999 -21045 -4551 3361 3406 -3940 -16708 -28168
13854 -28168 -36168 -35149 -25361 -33693 -23460 -29542 -29909 -28167 -22882 -9661 18856 10772 5419 -7723
13840 -7723 -27081 -29926 -16247 -1988 -10897 -18175 -12006 -10869 -21729 -29449 -13100 -10360 -33102
13827 -33102 -34875 -22414 -2618 -3475 -20047 -24142 -22856 -18226 -22200 -32214 -32999 -21544 -7860
13814 -7860 3493 -3020 -13660 -14047 -3878 -14147 -23819 -14624 -17254 -29895 -52864 -44041 -26734
13801 -26734 -25588 -26133 -15666 -9088 -16250 -39753 -42120 -40463 -39133 -64926 -68142 -52505 -31284
13788 -31284 -25496 -32673 -26710 -11128 -12003 -16456 -16936 -22509 -30275 -652 -357 -9376 -4987 9229
13774 9229 21147 7674 -30514 -33233 -40058 -41939 -39911 -36232 -26467 -40340 -49375 -32091 633
13761 633 8811 -7807 -3478 -7130 -27274 -38510 -32223 -20131 -23486 -37552 -50012 -48200 -32937
13748 -32937 -25184 -31826 -22375 -25158 -38602 -55569 -55697 -36356 -52001 -77070 -60980 -43264 -51887
13735 -51887 -56928 -43472 -16354 -4838 -20813 -20167 -14772 -25353 -21725 -12468 -10855 -19379 -47208
13722 -47208 -45352 -50545 -44266 -32637 -22192 -6330 6002 6533 -1471 10044 -966 5102 3567
13709 3567 -1146 4667 1497 -6448 -955 2295 -7676 -10690 -11463 -28566 -32168 -26593 -26106 -23279 -39089
13694 -39089 -19506 -2993 451 -32351 -66301 -62368 -51906 -61954 -67498 -75195 -76676 -90270 -64053
13681 -64053 -40176 -31574 -20285 -16324 -20462 -23341 -25589 -21833 -38614 -57042 -56084 -51196 -33570
13668 -33570 -35533 -36673 -33778 -915 9541 5692 -12733 -31157 -30563 -17561 -3872 -18607 -24481
13655 -24481 -32586 -37435 -42297 -38087 -40439 -40181 -43322 -20093 -3908 -21595 -34592 -19397 -6371
13642 -6371 -3824 2703 -5292 -6123 -2622 -8272 -13824 -30106 -13573 -12324 -5220 -14753 -17618 -7868
13628 -7868 5588 13546 6114 -12955 -11789 -1146 -15778 -15486 -16163 -21196 -27404 -55939 -55701 -59690
13614 -59690 -51391 -31889 -38413 -48103 -27064 -11386 2654 9659 -620 -2182 1995 7375 11671
13601 11671 -5015 -21709 -17250 -11222 -14055 -3982 -3469 1881 1420 -14573 -25167 -13390 -6372
13588 -6372 -12042 -12974 2614 4571 2948 304 -7019 -31353 -49551 -56213 -55913 -39780 -37445 -43447
13574 -43447 -48574 -14839 6478 19654 4979 -17410 -38088 -27989 -2918 4702 13112 3546
13562 3546 15476 32763 39289 27361 5963 -5731 10753 20062 7808 2714 -3941 -12586 -22271
13549 -22271 -24457 -18292 -16841 -37616 -33215 -19357 -34317 -32403 -18159 -4229 -5098 -15436 -25808
13536 -25808 -17486 -12519 -8810 8463 14330 -367 -9234 -15068 -25985 -15341 -18190 -15441 -18195
13523 -18195 -22212 -9257 -13641 -12787 -10816 -22595 -21143 -25712 -41308 -42786 -40637 -40081 -31422 -15224
13509 -15224 -18246 -25574 -14798 -5818 -15328 -26006 -28436 -30573 -34036 -29360 -37111 -42253 -44249 -47522
13495 -47522 -20042 10445 12867 9785 7015 -1784 -1605 -9085 -15734 -11734 -15352 -9553 -267 11584
13481 11584 -10764 -33049 -46107 -44309 -52718 -39191 -8017 7184 -9226 -7297 -20140 -25166
13469 -25166 -29475 -33388 -35990 -31247 -30732 -25484 -35536 -30473 -30491 -24605 -22285 -22349 -19815 -23801 -16682
13454 -16682 -1359 -1260 -22594 -23108 -9420 -19815 -35536 -42005 -41382 -17934 -7662 -3871 328 4355
13440 4355 23794 30819 24882 -10587 -25747 -12630 -12796 -1171 -7425 -13654 -24124 -21918 -5735
13427 -5735 -409 4104 -3291 -22337 -13258 -19934 -26460 -27221 -7356 -2649 3919 -14308 -9274 -5006
13413 -5006 -22468 -35232 -37248 -35656 -33970 -25846 -13021 -3445 -17330 -21471 -7869 -16861 -17581 -12988
13399 -12988 8631 1776 -6569 -8728 -433 -17579 -52367 -43444 -42967 -30227 -19977 -25991 -34059
13386 -34059 -20619 -23974 -26786 -31599 -28918 -5733 21778 25173 1579 -17581 -16592 -13198 -19956
13373 -19956 -30727 -36415 -40465 -45761 -41369 -13043 -6384 -17817 -7652 -12005 -18777 -18109 4159
13360 4159 13146 15234 15877 6569 -4520 -23160 -26735 -16102 -15565 -10497 -18501 -30546 -8131 10455
13346 10455 -10475 -14377 -788 -6736 -35974 -52400 -42718 -16899 -20975 -24959 -32480 -55006 -52803
13333 -52803 -28133 -11020 -252 -8325 -38182 -43770 -36011 -30737 -33242 -8375 -7434 -22518 -1059
13320 -1059 9795 -8835 -12256 6448 3896 -30269 -48396 -60561 -51371 -44029 -54158 -47673 -45326
13307 -45326 -19350 -16815 -24454 -11393 -10285 -29796 -34012 -24247 -12419 -12358 -10423 194 -1867 4249
13293 4249 634 8901 -4571 -770 25493 51777 46001 36269 28978 20941 8347 -8139 -17988
13280 -17988 -11365 -23506 -24570 -9185 1557 -10659 2677 16456 19529 6769 -15087 -28193
13268 -28193 -46446 -54643 -45899 -35174 -24800 1103 6602 -554 11304 8025 2068 7945 -1032
13255 -1032 -4920 7641 -2044 -32131 -35815 -28273 -21315 -15940 -22791 -42717 -40803 -23468 -9296
13242 -9296 -7644 -6290 -10615 -3429 12348 -1333 -24068 -19408 -17111 -18724 -29828 -42440 -40643
13229 -40643 -37283 -26932 -19317 -37195 -36797 -21695 -17387 -27676 -25213 -20952 -26690 -14854 -3673
13216 -3673 4150 3976 3371 -15639 -14859 -9868 -21734 -30236 -32058 -32473 -19799 -12936 -4503 319 -9224
13201 -9224 -25878 -25048 -34555 -39726 -42567 -41038 -33604 -23239 -32819 -44018 -16142 -3510 -12017 -13909
13187 -13909 -8900 -5691 -8692 -8405 -8163 4362 35799 38693 35357 34491 62002 87152 118981 148287
13173 148287 144863 113862 85655 66967 54812 46466 19136 1850 214 -681 -6191 -8184 -14795
13160 -14795 -3096 8400 -12083 -21583 -24001 -14335 1375 11390 10428 1540 -18079 -9469 -3903
13147 -3903 -21824 -35727 -45745 -25150 -6523 -9223 2854 9049 25699 28054 31447 31852 33846
13134 33846 57300 83323 125877 204459 311712 406950 432029 379731 291384 203963 138204
13123 138204 89549 54910 41956 27215 15217 944 865 -5333 8574 24728 30800 6566
13111 6566 11764 24539 31441 34459 31405 26750 35581 39609 14909 206 5761 13954 21646 11448
13097 11448 2811 -19488 -10628 12329 11759 8957 33628 46136 75487 112816 152520 211579 303987
13084 303987 381458 431741 416551 335316 232054 159296 110703 73916 66286 40616 9113
13073 9113 10273 5435 16428 6632 -11783 -3750 17981 6129 -7186 -16830 -9279 6801 -693
13060 -693 -11819 -19573 -29531 -33203 -31470 -23072 -16742 -9253 -21738 -32509 -18776 -11674 -14354 -21773
13046 -21773 -14028 17334 33105 40231 60390 73016 81446 103487 130696 134276 109104 68073
13034 68073 29613 15028 16612 28340 31386 12817 -489 1754 -21874 -29015 -20860 -9965 -5932
13021 -5932 5199 -11000 -4547 -1578 -17395 -21414 -8244 -15404 -41656 -62983 -63352 -40708 -34115
13008 -34115 -34783 -9973 4258 6763 -3728 -6210 7510 466 -18611 -12085 14841 -3640 -4509
12995 -4509 -9071 -21443 -25748 -15434 -20790 -13015 2740 10995 1573 -17349 -23054 -13222 116
12982 116 -3566 2037 -10205 -18048 -19852 -11369 -1546 788 -7152 -10557 2327 -4628 -18387 -5549
12968 -5549 -8304 -24091 -16006 19382 14269 15242 17913 12056 510 -3464 15045 36334 24666
12955 24666 -5698 -18052 -23347 -22748 -25249 -48075 -54484 -45155 -30186 -26841 -40484 -31829 -31880 -38397
12941 -38397 -21649 -19701 -26437 -25774 -26390 -18796 -20964 -16406 -15742 -6565 -29565 -31456 -25390 -16689 -25377
12926 -25377 -44632 -42802 -27004 -20351 -46419 -68854 -49966 -23436 -7204 -3847 -9865 -26430
12914 -26430 -26301 -24969 -11513 -4708 1260 -6686 -20765 -22324 -13786 -18917 -37107 -21488 9659
12901 9659 22375 26792 4276 -4724 -11129 -31452 -34532 -25275 -22303 -28152 -45503 -39072 -21904
12888 -21904 -5702 -5571 -26781 -10964 -3452 3550 4530 -4963 12503 13201 5376 -10287 -6377 -13272
12874 -13272 -30097 -24836 -11734 -10338 -16241 -4061 -9822 -26492 -34907 -30087 -32371 -16258 -15390
12861 -15390 -13875 1785 -1119 -784 7502 10543 8385 13158 20351 23086 14085 20328 23051 20193
12847 20193 10220 -10864 -28274 -15912 -4456 -13377 -24647 -45431 -46804 -35416 675 12183
12835 12183 4029 1468 17487 -4926 -20457 -12314 -9848 -14931 -556 23790 -314 -21859 1826
12822 1826 10679 -5193 -18140 -19871 -20829 -33174 -21224 -23294 -20556 -21103 -36077 -55950 -46118 -45053
12808 -45053 -28652 -9590 -5380 -10043 -15262 -28316 -39168 -28938 -13639 -39008 -35507 -19310
12796 -19310 -13875 -29285 -41478 -47016 -35317 200 -7697 12263 20506 38617 57281 98110
12784 98110 96888 66945 74573 80259 69438 59735 59001 48675 22017 16880 25708 26352 36101 40193
12770 40193 34717 14465 -5357 -1543 11023 10242 4542 13998 34186 39606 18439 18178 15255 19244
12756 19244 14095 4030 -16460 -23319 -20194 -13346 6458 3535 1071 -2349 -17105 -7153 5909
12743 5909 16227 6850 -2396 -6038 858 7028 -4125 -5485 -21443 -29149 -24677 -22552 1358 9462
12729 9462 -7902 -5745 508 3422 -8783 -19270 -42862 -36892 -19826 -8495 3885 7974 -7658
12716 -7658 -48663 -63227 -51204 -24995 -17302 2730 5641 8316 8673 12092 -19705 -20341 -9931
12703 -9931 1089 2488 -1434 -1935 14793 19867 19722 9200 -1873 -7902 -10534 -15527 -18106 -14370
12689 -14370 -17616 -7718 -965 -3905 -4539 7186 3807 15110 40897 42367 19708 11756 6819 -12222
12675 -12222 -11706 -22481 -28408 -20483 -12468 -2623 -9606 -33203 -32953 -11627 5637 14230 1911 -2515
12661 -2515 -128 8363 11935 -2146 1737 -2459 17052 30708 25393 19713 20223 21055 20238 14344 -2751
12646 -2751 -2617 1339 970 -612 -2753 1174 289 -8842 -13532 -26235 -35091 -39833 -23134 765 -2657
12631 -2657 -1725 4379 -12581 -29371 -27465 -28766 -24853 -25461 -26232 -12634 -8804 -37769 -29372 -19951
12617 -19951 -9189 4249 -2099 -20004 -28822 -28788 -45842 -43900 -34562 -27624 -22554 -28342 -15668 -5754
12603 -5754 -6854 -6026 -5001 -6665 2989 -3653 10923 29674 27050 26495 41223 49876 37369 21579
12589 21579 13034 8216 4279 -2668 3604 -10799 -11753 -23741 -23836 -28306 -15125 8407 21525 8379
12575 8379 9768 -908 -8092 8799 24145 8553 15078 43876 56023 45164 27339 924
12563 924 -18369 -20986 -29187 -32886 -30572 -14798 -13338 -22345 -21888 -24696 -7731 -9146 -11996 -21740
12549 -21740 -22102 -34270 -50914 -54047 -46915 -35538 -13909 4451 11040 -10553 -21162 -40936 -45343
12536 -45343 -46484 -33471 -18972 -27675 -16755 -19307 -19311 -17589 -9035 -19489 -6855 3513 7055 7942
12522 7942 -942 -8016 -25902 -18392 9865 9005 7691 10632 12181 1729 2012 -1264 2398 9155
12508 9155 15760 9761 7123 14091 15716 -7493 -26057 -16021 -18906 -11543 6006 21108 22998
12495 22998 27903 27620 21674 3104 -5638 -17125 -14996 -16866 -9646 -225 7624 9104 13006 15957
12481 15957 41648 39011 30651 11338 -2606 7082 -5575 -7020 5923 25455 19294 17913 17872
12468 17872 4155 11936 11705 7321 7237 337 -3390 -9181 7251 5100 -19211 -18600 -19370 -31017 -31763
12453 -31763 -29306 -20635 -32017 -20523 -13589 -33186 -41303 -35104 -31375 -33842 -34954 3893 37416
12440 37416 45334 34316 28188 -4012 -13836 -22708 -28372 -25189 -25738 -13827 -8451 -15802 -9976 13141
12426 13141 6848 8928 9487 18680 16470 10446 11934 5986 -11246 -24057 -13658 -7489 -7765 -9584
12412 -9584 -11880 -8932 26706 28008 11271 7279 8757 -10600 -3299 19268 26078 25410 27681 36054
12398 36054 26039 8426 -1818 13526 11754 -315 20298 15979 17647 28230 33294 29955 11409
12385 11409 -5851 2829 12357 22645 24656 21993 16578 29743 28706 39789 33211 17485 21468
12372 21468 32600 28301 13494 21312 20618 23812 15486 13797 12498 7316 1617 -78 -5642 -9169
12358 -9169 11272 26117 48732 51955 38440 6073 -6210 -3093 543 7059 14999 11925 12984
12345 12984 9342 14017 19861 32393 18796 2714 3651 18432 24877 26646 17369 17585 11520 13653
12331 13653 20193 32410 32893 8557 3346 29626 28910 23333 22258 9980 -19463 -16833 957
12318 957 13522 2465 -13656 -20219 2462 12620 -7032 -27896 -32018 -43500 -54064 -37423
12306 -37423 -24100 -2132 1618 627 -1664 1013 -9628 -2091 -3228 -5999 12072 10913 10078 -2912
12292 -2912 -28981 -18095 -7494 4138 -3314 -7565 1712 17473 -1858 -18504 -24536 -9084 2227
12279 2227 410 -721 -5182 -11347 -1554 22060 18217 14595 11731 18278 20544 15957 -828 -4430
12265 -4430 22333 12869 -9028 42 -1395 -4464 16400 7003 -12986 -1996 15201 37093 37429
12252 37429 23463 21341 -2143 -33252 -22047 -16510 -28142 -35187 -6458 5876 21908 21566 28496
12239 28496 42399 36729 5736 -16592 -16467 -8138 -7565 -18681 -37760 -29587 -6182 -8019 -19349
12226 -19349 -11968 -5156 6668 886 -7834 -7875 -1714 13539 38802 22619 3855 4933 1821 6130
12212 6130 -16710 -6291 -5529 -7811 -3671 2282 8939 20668 13131 -5365 3428 16327 -3720
12199 -3720 -13845 -10283 -285 -9127 -10626 -19054 -26103 -22274 -5930 -8443 -1035 12893 24040 32996
12185 32996 26555 12533 2878 -8247 -10372 -11039 -8977 -24258 -22928 -12045 9044 5808 12763
12172 12763 12878 12666 10175 17199 14442 855 -11465 -4065 13452 -937 15966 16008 -3144 837
12158 837 951 -4214 5556 21735 28427 34191 32000 20628 6288 -20236 -19700 -12002 3575 6753
12144 6753 -892 10980 12032 21408 21646 12758 3981 -2592 7076 8266 7735 10394 14801 22502 33011
12129 33011 36230 30943 533 -8440 -7366 -6398 -265 23038 19772 15480 16430 9462 866 13152
12115 13152 22338 1116 -3515 6895 5300 -2393 -8202 -13758 -3248 4979 11601 11267 21424 4947
12101 4947 10904 17334 13544 663 -9343 -21153 855 9689 14197 1466 -8538 -28959 -11401
12088 -11401 -4682 1120 -3536 -6212 -17765 -21919 -24115 -13677 -6986 2652 11743 10137 11272 9806
12074 9806 4407 -2737 -3168 -23053 -31529 -23351 -9881 5130 13991 17377 19970 4530 -13200 -9659
12060 -9659 -5765 -12117 -24340 -13073 14342 -1706 -8564 -859 -9223 -21524 -8010 9717 32228
12047 32228 45609 24497 8546 9422 34340 34624 22165 23323 26244 22726 10554 286 -3424
12034 -3424 12300 20874 24119 18860 10121 587 15416 11293 33199 49672 46822 25973 91
12021 91 70 338 7231 25393 33917 32049 17925 -8188 -16213 -18144 6945 5952 -10049 -6612 -6930
12006 -6930 11436 12606 16279 29609 31479 13910 6431 -1900 -11279 -7706 135 10032 12041 14373
11992 14373 17433 5953 -2507 -107 -5530 -108 -9194 -25550 -21618 -17603 -10035 -1891 -3240 -7224
11978 -7224 5086 13545 6507 3718 4065 -7787 -15679 -25036 -20370 -960 -141 -8266 4911 1520
11964 1520 -814 -5475 5778 -3749 -14623 -14677 23158 47824 49572 55819 63831 82171 63439 32848
11950 32848 20945 32699 28282 18672 18922 14127 22526 25881 22726 17690 24429 17931 32715 41385
11936 41385 36372 41069 47806 40173 20348 18383 9494 488 1741 10772 18995 12284 8026 12299
11922 12299 29421 41778 49152 41599 46331 61550 77714 98344 110412 115492 118888 106777 68671
11909 68671 34519 27815 13882 3256 590 12958 20005 24114 14128 28181 33294 15173 26561
11896 26561 51283 39428 27923 8642 2661 3882 23040 41703 39888 17657 9259 16132 35958
11883 35958 43376 50021 50981 34757 26098 35835 30338 17669 34866 74985 80573 77666 66031
11870 66031 56460 44384 14456 -4455 -8535 7953 13679 30207 46863 55766 40255 29511
11858 29511 23388 22717 20132 12068 -10914 -3183 -2334 9906 6198 20811 23941 20759 17195 14323
11844 14323 10540 552 7112 22480 14700 16301 22118 24060 -2510 10979 32128 30455 28292
11831 28292 16092 12630 -10556 -7364 -3861 -6313 -24166 -27746 -16535 -17393 -17570 8701 23979
11818 23979 28949 31719 33109 24875 32976 14898 -3337 -7031 -2375 11492 8654 9182 7317 12496
11804 12496 17348 15112 14446 7732 15087 31954 24921 21238 33202 30690 21785 12747 17786 11555
11790 11555 18648 9674 13288 15601 5649 18793 19579 22088 27395 28479 35844 29904 21969 18323
11776 18323 824 -360 3903 9763 -5880 -4156 -4097 -6321 19234 14861 4176 16090 20674 26516
11762 26516 29951 35204 18473 6727 13449 20956 31803 50698 61394 57849 58423 49809 30877
11749 30877 22160 30063 23725 3857 22605 23731 20700 6696 -6132 2871 -907 -4691 -7181
11736 -7181 -9632 5807 4146 12828 24540 26514 9703 -10578 8167 24585 15204 10161 10524
11723 10524 12778 31309 16954 23829 26342 8340 28070 33272 14796 16301 15747 7255 14069
11710 14069 33714 28616 16855 17224 25110 24167 32898 16771 1839 11483 38797 47881 66597
11697 66597 70614 61147 50361 46334 69630 84237 66407 51856 46756 23227 29772 18610 2336
11684 2336 -839 1137 -20777 -8613 18116 17594 9134 34214 38770 10025 1425 18607 26203
11671 26203 36267 27992 25693 27163 20687 21067 29664 15804 7638 21636 39376 36469 43241 54645
11657 54645 51319 30176 23196 32003 26392 25302 14705 3392 5875 6284 28714 43879 41371
11644 41371 19549 -4333 -14024 2110 19193 23923 21525 33651 39636 22388 21329 36741 36365
11631 36365 31714 28215 16532 2178 -3508 -9468 8185 22449 22043 23133 18608 -3430 -12592
11618 -12592 -9165 3228 26533 38401 26494 5133 -254 14108 18150 35357 34011 23049
11606 23049 19800 34277 42348 43700 37981 14841 629 -5767 -3377 3091 13670 19916 33362
11593 33362 44784 41823 39797 43226 37508 55738 64832 55235 34401 52566 57869 47690 43192
11580 43192 35801 30912 33582 28130 38348 36060 32950 24630 21623 22721 21810 18402 4049 8155
11566 8155 4090 1331 22533 14216 -18392 -30078 -24955 -3965 9060 -185 11772 10024 12955
11553 12955 22485 14439 -4560 585 10083 25519 16760 1512 -2429 17419 27009 35186 45434
11540 45434 43665 36380 20513 16865 36509 51357 43296 35692 24826 36551 48752 34326 31606
11527 31606 50993 50526 46048 53315 57640 40013 46519 52298 50820 47659 44386 35025 29918 13226
11513 13226 25742 60534 59675 45204 44173 36654 25550 23377 28650 44421 23662 18468 32462
11500 32462 24493 18035 15867 7091 27173 25494 21564 8907 10404 21589 31056 39082 15726
11487 15726 13166 36083 34510 34705 33240 32501 12482 11804 12109 18528 16796 22335 27849 21613 11637
11472 11637 905 -2674 2284 851 15731 14586 -1838 3732 29061 13748 629 -929 10188
11459 10188 12634 29319 22189 -647 -9310 27003 55067 39373 22859 12328 21443 33681
11447 33681 36031 34723 24516 25499 21544 24038 25025 2109 -11377 -586 12696 11843 28795 17049
11433 17049 10718 24009 21923 36867 41131 46273 58233 42498 39532 46989 29601 37000 42566
11420 42566 32852 11277 -8731 -8574 3586 26421 40791 49809 30444 20525 37363 39234 20003
11407 20003 18507 26701 38039 54469 62603 68311 66801 72165 66271 72527 69194 65425 69536 63804
11393 63804 60804 54895 36754 6608 20385 37494 45589 42025 30651 35645 50372 53429 45488
11380 45488 35682 31151 43899 37124 24992 24316 16167 4380 18004 31483 38228 41005 40902 46833
11366 46833 51699 51477 38322 25405 42655 41694 45909 61452 58893 46035 47046 35599 40352
11353 40352 37028 29012 10900 14327 34029 38870 23266 -4588 2530 13843 12411 31962 38402
11340 38402 48072 46738 59375 69153 66817 57326 70195 71682 54391 37462 31006 43358 53515
11327 53515 52833 52889 58023 65366 52090 36086 30393 43279 43184 45654 52000 50606 53169 52668 56945
11312 56945 62472 68654 51984 50892 60943 67339 72420 68906 73024 79361 85378 84445 111385 128939
11298 128939 104104 95781 89849 81328 94668 105189 140845 182287 182182 163480 176285 180242 186624
11285 186624 198334 202412 222446 256734 278341 314463 346993 382821 448662 515103 568462 616689
11273 616689 676662 754098 863996 1029462 1274603 1689252 2396068 3644235 5473614 7058542
11263 7058542 7882622 8318269 8102887 6838749 5119508 3490888 2205369 1416392 952251
11254 952251 688620 539406 452048 368507 324102 288957 248535 226079 190853 149927 125234
11243 125234 125168 94109 61388 61420 71610 62526 67236 89802 86913 86904 85747 92891 100336 94352 67435
11228 67435 61855 63342 65162 69812 56367 48004 34812 26258 16736 26418 40055 43507 55476
11215 55476 57883 56845 55598 68340 51780 59927 84191 89997 79170 53437 58173 53640 46989
11202 46989 55548 71818 77020 87873 91069 78463 69878 70138 80918 85658 92925 84119 85409 93421
11188 93421 93351 100705 92819 87124 84702 78427 91892 104615 118055 130606 123148 115105 106239 108817
11174 108817 119812 125671 121108 123555 140397 148453 154908 176431 202398 222389 229122 241869 275628
11161 275628 308639 317877 342980 418741 502417 584804 650919 717192 819867 988627 1242356
11150 1242356 1667448 2397902 3665949 5384121 6566300 6760892 6770588 7029307 6950223
11141 6950223 5967405 4503035 3030478 1907660 1221358 862669 646176 509907 438501
11132 438501 377434 319003 262723 210882 178921 165164 134959 125372 113718 98752 80417 80215
11120 80215 74366 88267 86094 89506 90667 68557 57294 43347 39300 53197 58912 60553 76329
11107 76329 69199 74427 60610 53376 55851 64225 67343 58603 40978 40217 43467 57583 54225 46588
11093 46588 41885 55951 57098 37216 34188 39152 28518 30534 35573 40804 28337 22180 31806
11080 31806 40851 54047 65111 72909 67460 57742 48803 49358 57586 76735 68737 59923 64643 61325
11066 61325 55083 39117 31650 27934 31435 47699 58044 62442 37885 11142 13398 18872 5908
11053 5908 -3682 3701 -1388 -6526 10337 29143 42768 59401 58491 56784 69142 32920 12257
11040 12257 15009 8921 10124 18136 14611 20583 17481 18847 26186 23802 2055 7199 28105 24659
11026 24659 45378 59696 71194 52665 39703 43582 30930 23207 30163 33510 24395 42859 54586
11013 54586 81717 84471 63052 50935 39120 37101 34082 30092 26347 21870 27375 43547 63200
11000 63200 62761 56737 39705 36725 60491 63855 55533 36654 46358 52849 43304 50676 51451 61195
10986 61195 72148 30315 19713 41112 57458 70123 52523 56261 45458 36288 31593 28354
10974 28354 41164 24752 -12769 1882 26439 29388 20150 33843 41402 29321 24328 26870 37887
10961 37887 61976 66123 67950 63639 44448 37634 30146 49788 48475 33764 25731 38829 58987
10948 58987 49709 49706 55159 48648 38909 31605 42154 53535 56407 58277 50195 37041 38260 29400
10934 29400 54493 85972 64939 43153 46830 45587 45162 59199 50659 29274 42349 59231 61383
10921 61383 55428 39060 29334 34643 32980 32335 10017 8668 22900 24651 38886 44753 49076 42504
10907 42504 39267 34698 42526 45122 42320 22141 23453 39587 58767 61109 55844 47330 47828 60646
10893 60646 65060 59288 44520 48338 66841 50361 56067 66809 54012 51635 46969 52022 62311
10880 62311 43103 34905 38457 44214 46063 64054 74414 54347 42747 19120 20045 5859 -3285
10867 -3285 20656 53348 53548 51992 63036 60832 50010 53584 52171 33808 30226 22906 19121 15830
10853 15830 21788 16128 10492 33681 53353 68892 67445 71540 73818 54339 61409 77316 84226
10840 84226 88202 80615 51359 45930 56111 68853 65839 50037 36063 41756 58989 78218 80586
10827 80586 67876 53241 50955 63464 78707 80937 68153 64494 89815 98901 77883 61036
10815 61036 54529 37936 47590 47588 54652 53154 46451 23887 34009 54419 57253 32330 21816 30754
10801 30754 18236 22049 29074 32996 31758 33072 55528 72941 64944 58212 57551 68711 84736
10788 84736 77442 63862 28359 23965 25743 31239 36928 39622 37706 50069 63774 52782 44001
10775 44001 38413 30318 35836 52168 63754 73128 66239 47259 19314 30320 62734 73503 62482
10762 62482 56004 64821 69189 66844 76694 72492 58314 70864 68158 69578 61249 53290 70647 63879
10748 63879 46656 39421 50100 47181 29721 31316 29337 37191 53089 55327 61077 43693 50250
10735 50250 53767 39673 47974 66304 61307 81512 85410 86050 57528 42614 48759 57240 74362
10722 74362 65536 59585 68146 48024 33076 44558 45822 44089 58438 64759 60769 42521 20142
10709 20142 17527 33336 41433 66103 83995 80723 71185 77784 79869 71422 43454 23798 10452
10696 10452 15103 32873 45546 50210 44591 45757 53943 67948 67998 76004 81832 79164 84294 70542
10682 70542 68794 57496 62400 57317 60095 61975 56317 47504 46042 36162 38224 40782 52365 79982
10668 79982 72921 59538 63952 66742 63484 74746 72141 48747 35328 39280 39310 16076 14230 24862
10654 24862 35363 37510 45162 47606 61780 73746 55465 44891 44316 46571 43869 45876 56240
10641 56240 79273 72096 55970 68419 73382 62304 61358 50317 26677 7230 10877 30413 56442
10628 56442 57111 45134 39378 32260 27891 31963 43215 52643 54761 43127 24365 3586 13508
10615 13508 20915 6195 4402 20824 30914 44748 43347 55879 61730 33856 19703 19799 34006
10602 34006 39835 55857 72339 83305 68322 63504 64781 70100 46664 53908 45685 22935 21733
10589 21733 39989 40446 44701 43772 26902 12356 9709 19898 27103 21404 24937 26992 25980 26265
10575 26265 27200 20622 18241 36103 43876 52005 47147 34397 23149 12130 29570 33395 42253
10562 42253 39935 43660 47567 48222 45225 25877 10760 7653 -421 786 -5559 -6518 3253 19120
10548 19120 37916 51176 58466 52924 42518 34509 48955 59043 67337 74972 73101 60395 50875
10535 50875 54463 56322 68749 76001 72045 63557 60754 65844 55461 58155 59207 68050 83731 78471
10521 78471 62414 71687 76776 64579 62946 70961 64414 80240 73511 77673 64977 45446 38967
10508 38967 33717 43119 16803 -6604 -4651 17606 31928 45076 38283 36063 30032 20570 19858
10495 19858 22933 32672 34570 33204 49735 54905 43085 37921 28877 15878 9763 15465 19198 33578
10481 33578 48126 47044 42941 38375 40867 40361 37687 34894 39694 57853 48260 28147 38193 49797
10467 49797 44420 42364 67073 80167 59359 50433 60203 48326 25968 18032 30589 42269 60817
10454 60817 51211 21115 -1076 15625 35553 38867 43626 44096 35416 33138 46393 52680 46739
10441 46739 48859 64644 57039 53183 51541 57463 54632 55315 51900 60393 44900 22907 7668 21940
10427 21940 31400 38344 39894 47529 38780 39811 43385 38434 51555 60181 46595 36708 51106 64974
10413 64974 63946 80182 72414 51157 50263 43742 34919 35715 32125 40677 53862 44032 37051 30017
10399 30017 28953 38018 49015 59614 58195 39296 31600 53808 63678 70811 58904 44775 18795
10386 18795 17919 24817 26345 43061 69827 74420 78537 54910 49716 47311 48158 35599 33786 45903
10372 45903 46311 48864 39511 40046 51225 56479 46045 45559 42658 33806 40804 35111 21766 26352
10358 26352 37621 57115 59675 56869 32873 29856 26053 33257 29690 40202 55966 58271 62309
10345 62309 71262 73189 60049 52281 58398 57474 48637 45177 55830 73125 67393 50022 56295 58203
10331 58203 47709 48608 52611 37362 25280 46435 61572 86754 93826 82929 65955 78392
10319 78392 58359 55130 65521 61589 62785 63396 48250 50472 60729 65240 72446 65510 55749 43991
10305 43991 51037 62222 52753 45788 61656 79026 71510 63937 57174 50431 49566 31463 38894 53896
10291 53896 54605 63059 62859 65688 53677 53792 58359 54270 44100 51498 42940 27831 29655 29880 24025
10276 24025 26140 11147 26163 25672 30138 35947 43016 47926 34994 25323 22700 22864 14164 12119
10262 12119 35933 47542 38040 43221 53431 68304 82764 72131 62740 53761 57353 43826 33958
10249 33958 30994 25741 20942 13503 47786 55689 54150 40654 37140 29681 30421 43818 39177 16692
10235 16692 8709 13483 3613 8695 1614 15701 37291 37891 43829 50061 51351 40564 36889 57591
10221 57591 60155 45202 27134 29342 26852 18971 18955 23823 25107 10551 25171 46901 54156 48839
10207 48839 44425 52130 71732 62121 70661 66334 46887 44552 34625 16725 13742 30253 45439
10194 45439 42368 34594 22866 31855 48030 28892 32342 27106 5906 -7557 -18328 -18998 4434
10181 4434 25164 28143 42153 48716 41781 23102 41638 44102 40074 57190 78180 83434 68705
10168 68705 59072 72244 69608 59397 75624 94949 84362 59940 41293 30276 35148 51844
10156 51844 51876 40328 18749 16681 36913 45579 35018 37814 29997 22601 43631 35303 27195 22574
10142 22574 5991 30626 55898 65223 39180 41335 52728 66598 52992 48890 52071 32966
10130 32966 31975 37075 20892 8164 18696 40347 25787 18207 29714 38664 41581 58697 51255
10117 51255 44981 45174 59250 46939 38029 38633 28481 14503 -11527 -9394 -3005 11121 31395
10104 31395 46753 31649 18197 26541 34965 41094 59182 70128 83273 74665 72147 101440 117317
10091 117317 125934 120506 110327 121266 118478 128755 133398 118475 96616 90098 76315 67146 48137
10078 48137 39363 41515 32869 38855 34612 18649 -8725 -5465 16271 31273 45504 52924 54577
10065 54577 31884 11447 -3811 -8990 -161 -2248 -13083 -10448 1162 23217 40395 55219
10053 55219 52823 43975 33659 21274 36163 60744 60439 50019 40994 28925 29452 23816 19525
10040 19525 17067 7864 14393 44408 31639 21483 14791 -8429 -15025 -5795 -4556 916 -2594
10027 -2594 -6219 -1429 19859 53443 46418 61472 72841 77125 79042 68805 57052 37855 28508
10014 28508 26105 31184 27811 -3797 -20195 -3511 9631 16183 24301 8848 -6880 -66 10836
10001 10836 21135 26776 31333 51809 51163 51171 64583 55522 43158 36826 28418 13282 5250 12062
9987 12062 19464 17277 21757 22669 40698 50580 40842 41384 47911 38078 35616 34439 25300 19951 39257
9972 39257 61498 52166 34505 4744 982 -268 1849 9313 1495 1289 19179 19606 23176 15985
9958 15985 23097 46329 49973 35878 28233 33064 27912 29646 34198 33550 27634 40543 46123 29710
9944 29710 16085 23382 15768 22859 15393 22547 25022 37128 35252 21965 16687 10804 -8188 -801
9930 -801 10401 14805 26983 41144 23481 22345 36574 25765 4623 22984 32150 28593 49106
9917 49106 48323 55770 46190 36594 33890 35903 23743 13609 29350 36931 41660 34486 21986 29997
9903 29997 25826 19570 14562 577 9120 20691 22647 37758 49746 55759 61849 61668 40668 38506
9889 38506 37679 44081 63596 58362 23219 560 -14396 -23481 -2152 19450 42821 36540 30417
9876 30417 27849 10468 19938 22209 39994 51172 50398 50129 50421 54022 63415 74550 108508 113884
9862 113884 117112 114678 102077 103005 147927 173960 161728 149398 146483 120634 111717 101415 92768
9849 92768 84448 70113 50606 44557 61167 59079 54053 43054 54745 80060 76183 79205 81483
9836 81483 80330 79538 89755 98143 121785 167891 187376 234561 284357 340761 476800 725564
9824 725564 1158040 1668396 1979119 1886852 1508902 1033824 647121 383955 243668 162191
9814 162191 122237 86501 59923 39653 39208 54620 62064 66035 41688 41691 42526 42589 32041 27017
9800 27017 29651 47600 46441 27632 40348 40845 39305 45038 45662 42196 31349 1663 -26389 -19741
9786 -19741 -779 7753 19896 16210 22384 23800 16094 26903 23592 3704 -2739 49 5925 7268
9772 7268 -1911 -2813 4647 10104 17509 9856 -1824 -8492 21242 30771 25068 35669 38746 21858
9758 21858 18242 9678 -7478 -14430 -2955 -5226 -675 12641 22232 15421 -4955 -7830 19595
9745 19595 22671 22285 22891 25476 5214 4871 10606 16503 15951 -4070 2053 15931 11123 3838 419
9730 419 422 -10524 -9203 -1146 -23054 -29345 -2451 5223 26772 31704 9206 -15267 -8630 97
9716 97 7688 29339 44364 41218 29843 27699 27270 29380 40931 64324 67355 63720 50626 23767
9702 23767 9247 9540 23588 42803 45110 34303 18287 11067 25473 43642 44977 22548 -1246
9689 -1246 -5326 13847 22077 22929 25546 10721 17686 31583 18777 7063 5267 7322 925 -13753
9675 -13753 -7162 -3309 7814 25147 9779 7541 31707 21360 4161 -9098 -11586 3201 20409
9662 20409 32838 51782 54395 48506 46540 46460 34803 23990 26315 34223 40572 15322 27063 19836
9648 19836 2760 -16538 -5450 10145 20668 25777 29149 26798 38953 47009 34770 17424 17715
9635 17715 9841 18845 18747 19612 18116 19724 14491 -4277 -15569 -2929 5211 16600 -1015 -13089
9621 -13089 -21157 4495 26803 22963 11753 13235 12148 12011 -5148 4879 20033 26811 41709
9608 41709 33618 28668 32283 26400 31121 19457 14153 10602 8654 2306 6571 -1062 -4977 -13777
9594 -13777 -8033 -8513 3242 8928 -4037 -17648 -2770 19640 20087 10092 5565 24563 13455
9581 13455 -2225 -13367 1995 16362 13038 -15106 -4406 9627 19594 27378 18457 16205 12158
9568 12158 12134 28592 29552 12193 21221 6315 11981 19530 23586 12618 1726 -1998 219 -17265
9554 -17265 -8168 -6498 -1452 -766 14883 14698 6234 -3611 13060 25635 11347 9672 3687 2359
9540 2359 657 -609 -12075 -14431 2112 17447 -2293 -12775 4381 25774 11702 8748 11952
9527 11952 5575 -962 -10188 -5126 8507 17887 4680 3616 1912 4034 79 22027 11377 10163
9513 10163 21051 27157 28759 39046 26595 10799 5328 2812 -6967 -18540 -10042 13472 23009
9500 23009 36269 46739 42602 21355 8407 19712 881 -21487 -14933 10235 24932 10937
9488 10937 14421 21120 1292 -11007 2639 5896 28049 26823 7198 -17226 -20046 -15420 -3131
9475 -3131 3599 -5643 -7832 4002 1027 14624 28780 16881 -12596 -24587 -15058 20395 33320
9462 33320 15779 -175 9507 18892 21463 8529 -43 -302 707 7537 9014 23548 18952 18038
9448 18038 44337 48769 39785 41009 34944 20778 2495 -1585 7034 440 -21505 -31019 -13266
9435 -13266 -2881 2078 13042 11440 1170 -9921 5110 14033 3714 -4132 2991 15967 19380
9422 19380 20184 7732 6795 10890 18894 20174 -3043 1620 16446 25969 36124 43081 23841 26717
9408 26717 32610 42032 38457 19006 26451 53663 54509 42303 53220 43186 24741 25074 8528
9395 8528 7819 -1666 -2386 685 19523 13151 -1229 -9989 -7805 -586 -4520 19116 17080 28760
9381 28760 31622 11683 787 1110 -6845 -8575 -16057 -9995 -7703 -10189 5477 8226 -96 850
9367 850 21965 24998 10847 20914 9658 2017 9422 6594 14062 -3581 -311 2901 -1549 -961
9353 -961 8070 3416 -4476 1296 12491 9433 11449 -6991 -10869 715 29138 29803 21377 27492
9339 27492 29614 14076 15090 26193 14510 38420 41327 9122 6650 2348 950 -6601 -17041
9326 -17041 -21472 -23826 -2680 -7979 -18722 -14471 -19289 -11933 3307 8419 -16396 -34685 -16995
9313 -16995 8645 16671 11870 21245 5765 10731 960 17119 21221 40112 28052 18422 6959
9300 6959 3792 10689 11868 4015 3388 85 7291 8954 -8116 -7397 31 4377 -10329 -20453 -19175
9285 -19175 -4778 -6521 -8184 -10992 -26796 -17855 5671 32240 20541 7784 10296 23809 17237
9272 17237 -1731 -21474 -32154 -31971 -29593 -23002 -2188 4343 -683 -9734 -5901 -11002 -350 -3348
9258 -3348 5081 -312 -14352 -351 10766 -10086 -13363 -18765 -26425 -16668 -7691 -11618 -6077 -2716
9244 -2716 5964 9385 6135 12162 9441 14803 20535 10443 -8885 -10254 -1407 -2358 -1498 804 -21288
9229 -21288 -18793 -2499 1962 -16147 -37405 -49865 -42681 -15971 -4954 11979 31566 12594
9217 12594 -4119 -6589 -6582 -13224 15499 38356 19740 3276 -4870 8600 24212 14594 6263 12396
9203 12396 17264 36791 31817 18904 15903 4423 5585 -1706 -2747 -316 20552 24140 30476 32538
9189 32538 32072 25489 9889 21922 35770 54526 52956 20319 350 2456 -1639 -6048 15879
9176 15879 27187 37631 42459 46869 39816 50409 48710 44390 41039 23398 -856 4863 24852
9163 24852 24257 32366 40611 41048 44260 20036 6061 -3777 6519 26524 5352 3311 -13116 1824
9149 1824 20381 1327 2025 3225 21225 32139 36118 18876 -3592 -18655 -12587 -419 14168
9136 14168 25426 22008 7036 6431 4617 -1501 -14437 -1242 9303 20930 25996 17448 1740
9123 1740 4637 1982 3830 -3130 -5720 9893 17531 18897 6738 9565 36881 35287 34557 28439
9109 28439 27420 35859 52863 67821 37975 8163 -2769 5789 4698 5997 -4182 -15940 5075
9096 5075 10963 -2905 10392 23159 36540 55380 56698 35226 22422 27573 37247 41525 33635
9083 33635 26414 21732 19196 18032 4692 12832 22334 48474 50604 46726 37224 33745 43861 48176
9069 48176 32925 32605 47206 46198 21099 8721 -12855 -8310 -15957 1973 3945 19840 34054
9056 34054 16991 108 -1915 18040 39996 37819 17735 8653 14886 9310 14294 32032 29282
9043 29282 20086 20441 8408 -3644 13581 25904 23715 -142 -4628 -3130 25031 14326 14148
9030 14148 1762 -18493 -11406 14881 34068 32104 24771 42370 58515 62436 71564 61060 54333
9017 54333 36269 42938 40014 22362 32423 37722 21073 18186 24198 39752 30233 2703 -24666
9004 -24666 -27184 -23860 8096 15802 13030 33153 -4354 -24600 -39668 -16347 -8526 631 21433
8991 21433 27017 32553 26717 5285 5337 15536 29571 42819 55745 42815 24986 13430 -3175
8978 -3175 5521 24572 36189 42225 18102 -10865 -5020 23973 57396 43445 15904 669 625
8965 625 8380 17106 34798 32594 21314 -11231 -12413 -1395 -10672 -15888 -14819 2138 15423 5143
8951 5143 17005 20468 16832 5980 -3196 -16712 -14603 -1311 7775 23186 19521 8509 15044
8938 15044 25611 27036 22410 21449 26564 30629 20618 10975 11285 -901 4662 -7551 -17877 -15061
8924 -15061 -4468 -571 -6475 -20805 -38340 -30543 -16664 -16771 -1443 4381 10571 12522 34777
8911 34777 40447 16556 7438 -14512 -25993 -8897 14247 16641 4674 -2536 -13450 -12903 4327
8898 4327 -2554 -30340 -37883 -30423 -17808 -15258 2621 -3597 -21630 -30976 -22929 -24728 -37291 -40737
8884 -40737 -30184 -5497 6193 13474 16665 8872 -6975 -25012 -13112 12110 23275 19721 -360
8871 -360 3238 -364 -4742 4042 10905 18761 32799 38261 40020 20449 1492 13908 16206 -603
8857 -603 -1823 3250 6835 -9991 -9434 -22484 -39066 -31565 -21739 -30652 -35712 -23631 -2967 -2426
8843 -2426 -10495 -3170 17116 30352 29361 22566 35741 38748 25600 11787 3353 13513 2252
8830 2252 -5579 -6656 -13401 -9677 14226 21482 20984 -2585 -7479 2726 4905 2480 -2616 -22031
8816 -22031 -39942 -24008 -10887 -17468 -11541 -11099 -16574 -25264 -14023 19352 23987 1436 -19599
8803 -19599 -8281 -10298 -18389 -19228 -18929 -17339 -16047 -14877 -5284 -1764 -11691 -4177 8679 8627 3187
8788 3187 8597 13256 7796 8836 8669 11848 -16884 -37098 -26057 -24379 -20160 -12818 -7672 1420
8774 1420 1579 -2719 -21087 -26434 -3768 7130 2700 -7891 -28642 -30872 -26299 -18554 -949 10539
8760 10539 5925 5749 10250 6300 32964 44910 32899 20678 44917 51654 29071 18800 32772
8747 32772 32005 27734 36767 28053 7661 8641 9045 5423 10481 5836 1437 -2861 4548 18349 17691
8732 17691 8236 2077 8910 10874 10046 5903 -1365 4686 15681 2980 6330 23572 34230 24295
8718 24295 10241 -3755 -1587 12931 -2415 7367 16083 24370 10057 -4903 -10243 1075 23918
8705 23918 31195 36971 28271 18206 20656 34982 33411 24394 21748 28705 22846 23318 24562 14645
8691 14645 8758 10671 2600 3057 7521 -3415 -12131 3992 33394 25940 8812 18099 25246 26397
8677 26397 10102 15745 25873 18269 -1910 -24986 -30147 -21744 7954 10136 -6819 -16216 -7370
8664 -7370 1117 -3268 7217 17698 25765 21163 22171 10078 -1938 8951 22672 35010 27273
8651 27273 11764 8900 25427 25078 6687 16020 30455 34139 33926 44520 58755 59777 58766 71169
8637 71169 58524 43619 44675 53084 50803 50549 56298 47208 75505 99911 131558 170735 210761
8624 210761 324227 491020 577553 503351 397048 315429 224856 157452 135850 134059 119795
8613 119795 98571 92877 104430 109594 106362 110510 114206 104187 69142 70707 81371 79978 73620
8600 73620 71594 84823 99316 78463 88798 111963 121995 142071 137747 122337 103978 105508
8588 105508 117140 121528 129346 134218 139716 160240 182496 247708 361008 563224 878256 1081950
8576 1081950 990943 780792 521569 337918 216599 159787 126616 106476 102661 75152 53490
8565 53490 52120 58484 70926 71058 75073 86794 75490 54783 44180 34801 33912 31672 13951 16471
8551 16471 30031 25445 20577 7706 10956 9257 37154 50736 29484 24802 37602 50704 79975
8538 79975 107973 119534 110126 145665 209911 338764 474137 478062 387390 276831 163879
8527 163879 106557 76947 59502 40446 34165 29966 18817 18137 17510 32098 5063 -23667 -15401
8514 -15401 -17337 -1172 -4844 239 7632 -4815 -16426 -2993 -3030 2852 14061 9906 13503 27651
8500 27651 36930 27980 25731 20739 28205 11910 -4122 -14722 -30685 -14743 -12010 -16052 -19528
8487 -19528 -2721 3885 -7587 -4018 17551 16113 4487 17761 23207 29451 27896 6114 3101
8474 3101 2464 -4637 -7244 -9651 1154 3021 -3310 3128 15916 20008 19411 12043 -3735 -41923
8460 -41923 -33578 -5308 -5669 4060 -6736 1988 -2040 -1063 11942 19802 1508 -24600 -22217 -16373
8446 -16373 -17063 652 -123 -8413 -14807 10660 26822 22119 13143 23809 20876 17565 249 -13358
8432 -13358 -21308 -29429 -24808 -18048 -18965 -9572 -24779 -42090 2621 15775 11414 14035 5236 11667
8418 11667 13101 12221 -560 -11019 -10020 3672 12358 1936 12407 4140 23484 39008 46104
8405 46104 14944 -18137 -17609 -20092 -20429 -29456 -34549 -20703 -7871 -16556 -4297 -2200 20351 35846
8391 35846 46043 40856 29379 16125 5249 8584 -2185 2568 -2191 -11903 -33618 -41194 -35610
8378 -35610 -48690 -51135 -39553 -23172 -6674 -28274 -37325 -11697 13773 8490 -10277 -15256 -8471
8365 -8471 10517 37429 40210 31835 11845 -829 1205 16822 27719 20794 29048 21361 15060
8352 15060 11947 5714 4927 16660 18484 23573 2761 364 -8782 -1583 -1730 4512 991 -7299 -4593
8337 -4593 -8136 -29456 -8846 1144 -5395 -7551 4337 11106 2233 6381 2538 20342 34971 44012
8323 44012 36781 20707 12193 12814 -8763 -18127 -14532 -18413 -6941 11436 14654 2050 -7543 -33634
8309 -33634 -41537 -41645 -37204 -11590 -24202 -40949 -32756 -19360 -8178 -5749 -7239 -6029 -5958 -15107
8295 -15107 -26134 -19521 6459 -9969 -24417 -17670 -14879 -5804 -3797 -14062 -11175 -22412 -33791
8282 -33791 -24822 1572 108 -12387 3716 -62 3461 6324 -3525 1203 24089 16465 20030 4768
8268 4768 -2127 -6795 -12425 -17202 -14514 7422 11000 12029 22479 32143 30077 18185 -7082 -2367
8254 -2367 -2392 -10013 5635 17866 88 -16856 -5928 -18840 -21713 -1162 -11451 -17027 -16246 -13679
8240 -13679 -27854 -28406 -9026 2906 -5108 -14470 -14072 -12438 -27729 -40740 -27852 -8154 -2335
8227 -2335 5189 1090 8229 -7797 -20656 -21518 -19544 -19448 -18055 -25901 -26673 -12272 -5659 -28205 -25403
8212 -25403 -14977 -18673 -18876 -11842 -11950 -32094 -48296 -49223 -41733 -29779 -33766 -14135 -10753 -7137
8198 -7137 -7933 -19625 -38809 -31966 -3589 -1812 -4433 5261 10382 15273 20941 28431 19328 12021
8184 12021 11433 14956 6753 8053 14060 -686 -16322 -13369 -1221 13067 29035 43463 36359
8171 36359 13694 -1748 -32478 -49819 -35964 -1470 18666 4462 2152 1048 -11275 -11230 -28084
8158 -28084 -54008 -64008 -48495 -44874 -47749 -29833 -36040 -25814 -12473 -10965 -3736 1694 -5534
8145 -5534 -12498 -7445 14935 13449 -23441 -26794 -1386 -7980 -5312 11750 8957 11411 13711 -1459
8131 -1459 -6535 -17882 -10780 -2468 -15281 -17074 -16771 -15911 5207 21005 29923 22054 8853 7137
8117 7137 1514 11006 1629 4331 13807 8092 10993 8195 -7481 -9371 -14635 -17877 -31900 -34358
8103 -34358 -29221 -22295 -6112 -10435 4130 7084 -297 3888 -7020 -9815 -15622 3349 4882 -14031
8089 -14031 -11079 -2591 -1222 -6803 421 8984 4516 -15900 -12681 -3534 -949 -15666 -21529 -32553
8075 -32553 -35049 -25149 -5321 -4240 -23649 -42939 -21555 -6107 -7292 -668 8384 2860 -12222
8062 -12222 -33196 -32653 2229 21036 35368 28132 6275 -25433 -27758 -32631 -24208 -26338 -5948
8049 -5948 13706 7879 -14394 -15649 -5950 11858 21957 7996 -5528 -14532 -2986 15805 13950
8036 13950 23518 24062 8483 -7815 -17417 -12749 -19510 -12865 -1559 12441 30205 39519 28368
8023 28368 15236 23666 19237 9434 4894 6427 2291 8299 9477 15090 30834 31770 27494 14251
8009 14251 34179 35887 32294 23131 4288 -3767 -7873 12405 17165 11595 7000 -625 1453 10178
7995 10178 46359 45073 35906 55855 45858 25735 10887 11759 15488 45583 64617 77033 83887
7982 83887 72369 43595 47058 63117 46653 37810 50404 39392 33089 51803 78870 100730
7970 100730 106701 119929 124209 104714 69168 53465 55571 68662 64764 70056 81662 94831 100697
7957 100697 100943 101912 94893 97139 101403 83115 93032 84679 65470 60958 42863 15616 4747 6063
7943 6063 8393 7412 8931 656 12176 19727 23263 17175 14792 2941 345 20486 27586 28579 33422
7928 33422 25528 26675 20363 18968 8426 3174 -6032 14780 26453 33584 55698 64726 66494 73485
7914 73485 94427 94775 84931 66951 53927 45814 42512 47548 49962 39090 42745 26929 29418 39886
7900 39886 31057 17236 5249 3140 23304 26571 31343 14739 3272 -10104 -2193 -12215 -24251
7887 -24251 -30481 -17215 13203 31296 20980 8215 11130 16124 15842 21619 16812 17382 21513 27289
7873 27289 33442 30858 30436 25539 23184 19441 6054 -30540 -34874 -7440 -1239 -10414 1538 11998
7859 11998 18245 12897 12628 -577 6748 -2593 -745 10926 4067 6945 32665 32835 43033 25959
7845 25959 3988 17217 15769 1821 -10382 -15291 -14110 -13712 -31744 -9038 11059 18618 33264
7832 33264 16916 -792 -10553 -17729 -24609 -21207 -13654 -3327 8662 1322 -869 -7351 -28628
7819 -28628 -31795 -28734 -11361 -15289 -13569 -11502 -4849 5153 9136 -9621 -21894 -24100 -15733 -12289
7805 -12289 -12736 7564 20190 18493 3232 -8098 -15109 -13768 -31749 -17013 -594 -1149 -20909
7792 -20909 12194 21606 11210 2020 2951 18372 31818 20104 10429 9980 3209 -14831 -16252 -17325
7778 -17325 -28338 -26165 -24906 -30853 -35856 -18583 6018 6885 4718 -10027 -13099 5295 1496 -5160
7764 -5160 -18951 -14098 3018 57 -10217 -21582 -6406 230 4173 -12857 10795 12778 10397
7751 10397 26119 18650 16924 -17 -17114 -13548 -10958 -21450 -25386 -14115 -271 -6879 -29451
7738 -29451 -34831 -15361 -21564 4693 6404 15715 11021 -5960 135 18831 34645 21417 15216
7725 15216 29264 44954 39850 18750 -3738 2375 1805 9334 11477 -5074 -19990 -24896 -25385 -25761
7711 -25761 -4398 9648 8496 6432 -2129 9597 29601 16373 -3391 6261 12501 6084 7377
7698 7377 8981 2237 -667 -6565 -7663 -8995 -10387 -27771 -16696 -18068 -22822 -11392 -10828 -10770 -8122
7683 -8122 -6242 2972 16368 24199 7049 -11029 -21103 -22911 -1998 16763 23745 -46 -14115
7670 -14115 -13545 6003 4353 -6857 -11406 -31413 -29089 -23014 -18437 -19653 -40859 -32476 -6996 -16243
7656 -16243 -19083 -20449 -24430 -13180 -8398 -26324 -4787 -9339 -13422 -21955 -30130 -15911 -15744 -19674
7642 -19674 -22762 -27319 -25700 -3897 1795 9275 -9144 -24256 -24380 -19344 -13860 -9386 -9062 -10832
7628 -10832 -3989 -9585 -10038 -1653 -345 -16787 -15353 -4936 8858 14830 7894 -4776 -20817 -27039
7614 -27039 -10796 4322 -10523 -23537 -33011 -29347 -14962 -20826 -18585 -11667 -23103 -12035 -20598
7601 -20598 -27753 -40291 -42371 -17573 -7906 -9352 -9985 -28317 -31129 -29565 -21675 1014 1897 -1853
7587 -1853 -16945 -13372 -20860 -23411 -3982 14919 6064 -6170 -1055 9407 -4183 -12334 7271
7574 7271 8514 10986 9941 1621 -26071 -17992 -18205 -15458 -7921 -14906 -13809 -11892 -5189 7911 -8684
7559 -8684 -21290 -28059 -19705 -13244 -15307 -26673 -41045 -42258 -21435 -22374 -25977 -15659 -24884 -17961
7545 -17961 -28841 -42226 -42665 -21061 -15362 -5953 -17653 1761 97 -15270 1445 1261 -26669
7532 -26669 -23992 -24996 -18675 9980 -1969 -20615 -14568 3210 4287 4626 -9652 1028 16446
7519 16446 10876 5876 -1622 -9858 -11265 -10024 -10394 3639 -9169 -10078 -9649 -32716 -32347 -23139 -15196
7504 -15196 955 15147 23286 18699 21118 3563 -20123 -24042 3531 21093 11872 1570 10804
7491 10804 5312 246 -6593 -3908 -13158 -9433 -13220 -21792 -16111 -8233 -10131 -14410 -11246 8604
7477 8604 -9791 -24932 -8360 -5283 3869 20495 -3642 -20509 -12344 -986 11157 3450 -12441
7464 -12441 -19899 -14138 -14502 -19165 -23759 -20460 4748 16524 3734 -9366 -9565 3759 4036 -16364
7450 -16364 -31964 -27140 -818 1007 -389 -647 11526 6181 -15522 -10018 42 -8746 3182
7437 3182 -1640 23 4367 9797 20033 12739 3388 -5124 -13055 -10806 7070 1144 -10721 -8390
7423 -8390 6681 -7353 -18442 -17892 -8840 -23962 -32622 -9522 8890 1569 17103 11070 27301
7410 27301 36154 15306 -2110 -17029 1710 12215 -16014 -26744 -24345 -12002 2121 7561
7398 7561 12219 1911 -22692 -26826 -37881 -34878 -12827 2590 -1611 -5705 -14706 -15763 11774
7385 11774 36119 33939 30926 17467 14772 18294 17420 3251 1968 13834 -493 4628 3365 1242
7371 1242 10055 14097 19347 13227 12995 7880 9558 -9286 3357 19632 10074 9892 6250 -4995
7357 -4995 -6081 -12113 -21161 -7563 17592 21915 17507 17676 28016 37127 20223 2617 -9716 -17350
7343 -17350 1712 27032 4886 -11504 -31346 -41825 -40990 -27410 -24238 -8269 13529 -1316
7331 -1316 -27803 -24543 -8742 361 -18322 -23413 -16328 -27987 -35296 -25769 -27998 -33035 -26341 -17222
7317 -17222 -25120 -21724 -9420 -6216 742 -19348 -20107 -11049 -1770 -2286 -17593 -16658 -18622 -21590 -4481
7302 -4481 3876 23699 12904 -2082 -22925 -41195 -44885 -32792 -13458 -18796 -20636 -15006 -3901
7289 -3901 12821 24368 17900 -6463 -22521 -34641 -36212 -35017 -36331 -10236 -8359 -32600 -13440
7276 -13440 -4270 3145 -2802 4466 2527 3160 -6994 -13930 -15490 -16813 1543 22519 21403 19700
7262 19700 26825 19882 4012 -15299 -15641 -5292 14720 39657 26310 8116 15120 19226 15371
7249 15371 -9626 -28627 -35807 -28172 -11873 2232 -7425 -19717 -28330 -35958 -36479 -25597 -26667
7236 -26667 -36103 -27080 -17021 -13041 -19994 -36126 -45542 -30038 -27321 -18424 -12497 -10151 -19087 -6076
7222 -6076 -5789 -14469 -7122 -2400 1205 16454 1956 -14006 -12523 -2340 -8464 -10950 -19316 -27243
7208 -27243 63 17751 16142 3287 -4824 -23433 -13600 -15625 -17511 -18167 -22270 -28037 -32899 -15111
7194 -15111 -5810 -7040 -23263 -20231 -28499 -32691 -34989 -31609 -22243 5582 985 -22023 -32107 -30451
7180 -30451 -13631 -13066 -7776 -3930 5996 30892 29284 43171 43793 23530 -14273 -24088 -20879 -8796
7166 -8796 -2356 -11237 -5097 11611 8708 5409 -4034 -13245 -2051 4911 -26876 -43337 -33362 -35908
7152 -35908 -53749 -36978 -3361 12114 1209 -3377 726 -3676 -19306 -22775 -10905 -7196 3359
7139 3359 -4488 -23929 -24264 -9362 -24588 -30737 -24568 -13339 -27394 -36394 -18615 3605 8881
7126 8881 10561 -2804 -11412 -22015 -11102 -10760 -10525 -12564 -4687 -25583 -41623 -24003 -8121 -2230
7112 -2230 -6330 -4861 9324 11235 -11856 -15048 -1746 2357 -8553 3599 8487 -6131 -10470
7099 -10470 -8796 -15316 -14554 -2195 -5067 -10212 -5049 2582 11236 9423 -2829 -14017 -40946 -51963
7085 -51963 -63186 -49103 -27005 -24821 -21520 -2359 7026 7994 -2288 -5985 -38991 -37664 -28804
7072 -28804 -13820 573 13926 23448 25879 6028 -14080 -21868 -35060 -37496 -30246 -17035 -3833
7059 -3833 1218 5919 4528 -14820 -7770 -8529 -14960 -25104 -20782 -13803 9907 5797 -4828 -16232
7045 -16232 -11857 -7196 -12857 -12849 3296 11402 14679 4366 -19547 -36177 -29194 -6332 29179 35352
7031 35352 4553 -5108 -10686 -18420 -29975 -44355 -36800 -15279 -17348 -47590 -40003 -38300 -40471
7018 -40471 -28325 -32872 -37474 -31109 -18660 -5170 -4877 -9016 4812 16460 18514 -4836 3460
7005 3460 -6280 -23790 -20349 -19545 -16630 -15854 -21603 -37719 -39734 -30464 -926 -2516 -17006 -34434
6991 -34434 -40624 -31175 -20054 -20020 -11966 -8879 -16052 -16505 -20542 -13379 -15800 -17337 9700 3460 -102
6976 -102 14358 7767 -7920 -16371 -12198 -9338 2671 16917 30115 18014 -674 12372 25492
6963 25492 23499 -3758 -4086 6249 3064 -2276 -12385 -22149 -14116 -11083 -19983 -32713 -19806 -24478
6949 -24478 -33942 -22597 -12234 -19019 -15765 -20934 -21933 -11454 4844 22224 6664 -15178 -5828
6936 -5828 3460 1427 5264 4254 3603 8534 17497 -6441 -17319 -46862 -43672 -21516 -16102 -15200
6922 -15200 -14557 -518 379 -15427 -23355 -37522 -50734 -25507 9280 8522 3043 -11020 -20922 -35302
6908 -35302 -39955 -30181 -21446 -28483 -20402 -16494 -19271 -26825 -43423 -27959 -27165 -15762 -13926 -22291
6894 -22291 -31349 -45065 -24552 -30424 -23013 -7379 -21209 -23360 -12982 -15122 -12469 -3022 -11958
6881 -11958 -23573 -42386 -28785 -22016 -28727 -16423 2011 -6250 -17262 -31566 -46997 -53972 -40539
6868 -40539 -30053 -38194 -29027 -33708 -33980 -5583 12631 8338 16238 30416 24511 1871 -20344
6855 -20344 -12507 3190 -5790 -16490 -14012 -17152 -9646 -19306 -12982 3304 -3067 14350 24086 30383
6841 30383 24783 17191 8574 9678 20675 17829 13907 16121 13072 5932 4960 -15088 -35494 -31859
6827 -31859 -22434 -4003 -10207 2295 8309 -2546 -13762 2661 2587 11177 13160 35304 35116 8465
6813 8465 -16145 -19802 -25177 -19875 -26245 -37970 -25576 -7542 1481 15378 -3263 -35002 -12480
6800 -12480 -17355 -6979 13967 18624 10134 4422 -2230 -11536 -25318 -18130 -18428 -32149 -37447 -36900
6786 -36900 -18271 -4094 -70 -19841 -27066 -24464 -29019 -45396 -44091 -19280 28 13623 16951
6773 16951 17801 16790 11947 -5842 -5970 -10051 -9633 -21501 -11870 -2348 3698 8413 15878 10518 -4486
6758 -4486 -9564 -18681 1461 20088 39608 30009 24124 5664 -1685 16276 -545 -7891 333
6745 333 -1952 -5930 12469 4800 -21363 -17897 -2668 -14712 -27980 -32739 -32309 -27242 -26609 -17843
6731 -17843 -6304 -3119 1545 -7854 -13618 -6704 -22663 -34064 -27953 -12034 -1695 -9122 -8030
6718 -8030 -3001 3788 11304 -2453 5685 7566 -5081 -8057 -2252 15285 14171 20153 13893 1724
6704 1724 5066 20700 28810 13675 -3675 -16361 -19495 -1698 11981 13652 -1233 -13703 -16921
6691 -16921 -15137 -14002 -12759 -19828 -12229 4341 8843 -3107 4539 11884 -1547 -8793 -18139 -10012
6677 -10012 -4427 16195 19672 32017 24376 859 -11190 -2354 13806 9109 435 -15290 -36559
6664 -36559 -38592 -39710 -36844 -31755 -13369 3507 2367 1525 -6678 -8977 -1547 -2110 20379 1045
6650 1045 -2842 -17809 -18765 -32469 -36031 -13373 -11129 -33027 -29525 -14550 7267 27034 22204
6637 22204 1851 1225 14904 27586 20328 5965 1374 -4495 -20407 -28978 -35103 -33551 -23047
6624 -23047 -28934 -16478 -12409 -8256 -14128 6717 24211 11121 -2042 4900 -1181 -18581 -34343
6611 -34343 -35757 -20424 -471 12711 -5752 -24833 -19683 -6106 -17265 -3188 180 496 -5284
6598 -5284 -17840 -17867 -32398 -52255 -36737 -40193 -37563 -22719 -6661 3004 -12993 -48614 -71504
6585 -71504 -71219 -41353 -15001 -3291 15530 28122 32628 11594 -1355 -16709 -11288 -5553 -11406
6572 -11406 -19590 -25708 -22441 -30270 -22998 -1435 -13628 -27128 -16664 -25746 -11941 30183 42669
6559 42669 39210 35952 26139 11805 -1346 -23236 -20588 -26664 -29696 -29273 -38679 -46096 -51427 -35196
6545 -35196 -40335 -34608 -27091 -12507 -22858 -23573 -11075 4042 4565 8016 15788 13216 9029 -2160
6531 -2160 -5893 5333 17959 12782 19144 17412 -10945 4209 231 1916 5642 -9522 -1778 -940
6517 -940 -5864 -4376 13766 -416 -23438 -29501 -24952 -22091 -36276 -25078 -17901 -27379 -29996 -32878
6503 -32878 -25655 -21691 -20177 -14117 -7983 3053 905 -16668 -22591 3012 24213 18012 463
6490 463 -4597 13165 29942 31129 158 -9838 4540 -7393 -8069 -13601 -18118 -26399 -27048 -21258
6476 -21258 -17692 -13810 -18754 -1248 6535 6000 23064 20659 19218 27886 24179 28129 29279 28412 8253
6461 8253 -4902 -10544 -4681 -3008 6835 -4807 -7091 -16018 -29976 -27299 -22683 -20984 -21898 -20762
6447 -20762 -16804 -24637 -25054 -14305 -11112 -14109 5235 12673 7933 947 16002 24479 17671 -399
6433 -399 -10895 -3529 -10110 -24462 -42033 -41080 -42059 -49222 -42870 -31589 -25600 -35426 -25247 -481
6419 -481 -2172 -24535 -30411 -19988 5744 -5862 -24759 -26082 -5476 2118 -1683 -7601 -3813 -5386
6405 -5386 6266 5157 -1689 -13032 -17290 -21530 -22962 -28127 -10047 -424 -11962 2206 20041
6392 20041 29476 9659 -12025 -10982 -1360 15493 14493 1443 1261 -15816 -14995 -24869 -16719 -26310
6378 -26310 -32851 -22769 -5665 22327 20822 -3940 -235 11263 9414 -179 2192 -7760 -8890
6365 -8890 -1745 1498 14507 5974 613 -16514 -21713 -16281 -28579 -31797 -18780 -23145 -32383 -37441
6351 -37441 -49703 -39741 -35584 -32416 -33350 -26267 -26332 -41062 -46702 -44591 -27839 -22653 -19528 -11124 -9063
6336 -9063 -14795 -19851 -18897 -4055 -15433 -30809 -26038 -21520 -25666 -16826 -350 3500 -2554 -6876
6322 -6876 -18308 -14852 -23850 -21914 -20002 2943 5889 4551 3166 -24884 -38508 -41110 -29858 -16707
6308 -16707 -8266 10004 -766 5070 7109 13415 3453 -14163 -14135 -2815 9159 10393 -3886 -985
6294 -985 -8026 -13110 -6299 -9685 -22578 -26291 -30283 -28804 -39443 -45702 -16764 3442 10479 -4113
6280 -4113 -2601 -6841 -14647 -19563 -34874 -37128 -27770 -31756 -15045 7807 -4889 -11595 -13089 -22349
6266 -22349 -34051 -25376 -19299 -15592 10219 24009 24752 15640 -7879 -10384 -4130 -20567 -23884 -23141
6252 -23141 -16166 -829 -20610 -18969 -3344 8115 363 -12537 -20346 -30727 -37087 -23413 -2498
6239 -2498 -8460 -11628 -21010 -43167 -34982 -30892 -37627 -30283 -13020 -2024 -750 22930 20737 48
6225 48 -1342 7007 17424 28025 30345 28233 34417 26402 -2993 -15770 -29997 -23769 -33081 -39485
6211 -39485 -40833 -29488 -19356 -14581 -14618 -6549 2462 2527 -29522 -49245 -50988 -21232 560 12341
6197 12341 4483 3648 2795 10394 8976 -11480 -24277 -10274 -6583 -8768 2534 22661 3234 -1914
6183 -1914 4776 -4157 1016 12373 1669 -1485 -13652 -27969 -40185 -20558 -9481 -3850 17449
6170 17449 16995 11404 18715 29350 25506 30853 16940 -1282 -14592 -5410 22419 2165 -11100
6157 -11100 13434 40091 38918 25817 2859 -32667 -49830 -48939 -23800 -17082 -21209 -10840 -3893
6144 -3893 -1808 13483 22789 31983 19987 -408 5770 -6365 -21202 -24456 -14830 -12111 -22214
6131 -22214 -23172 -19470 -34726 -29920 -19547 -10721 15104 27755 25710 -1115 -11708 -2580 -5575
6118 -5575 -4720 -15660 -37212 -38125 -23372 -6392 -13073 -13953 -8472 -8962 -17345 -2943 1810 -17159
6104 -17159 -471 19626 21355 8795 12863 7899 2651 -8031 -26512 -19695 -11394 -3524 6777
6091 6777 12351 1603 -5292 -14070 -12425 -2321 13138 -7177 -34584 -37058 -41621 -57475 -74738
6078 -74738 -65686 -51072 -26739 -10653 -6734 -20767 -16411 -2684 4624 2788 -3116 -21696 -31135
6065 -31135 -40928 -33079 -24016 -744 4170 2238 -6145 -173 29504 31607 25766 4203 -11342 -13545
6051 -13545 -23125 -12519 -7223 -5718 -15145 -20742 3883 643 -5505 -23432 -22194 4230 16831
6038 16831 -1088 -4111 -1174 -15699 -19616 -4953 4330 1938 -18056 -28217 -38573 -46341 -53385
6025 -53385 -64225 -77427 -66430 -57174 -41207 -12824 -4668 -7644 -12201 -14133 1807 -3127 -20922
6012 -20922 -20231 5682 8199 -6741 -4032 -9137 -15750 -8912 -7705 2576 4471 5802 -2321 -7502
5998 -7502 8137 8748 6273 1171 -7717 -30277 -32430 -31874 -29251 1074 3958 -13849 -13055 -23264
5984 -23264 -30958 -52809 -47628 -30733 -12768 -23075 -29109 -33320 -26665 -34348 -46186 -29856 -23332
5971 -23332 -23169 -17563 1303 2791 -4949 -21426 -23694 -23710 -38399 -54679 -41803 -19617 42 13707
5957 13707 4972 14485 25192 25544 10087 6748 1489 -4242 -14536 -8669 -6067 -1544 9506 8256
5943 8256 7008 -5129 -23144 -16048 -12352 -9727 -4920 -21627 -16513 -19965 -16383 2322 11707 2233
5929 2233 -4775 738 10755 10709 19608 2604 -11914 -16408 -4631 -3680 -10722 -8368 -21845 -27010
5915 -27010 -27922 -43624 -13223 -4961 -4807 -4770 6814 -6081 -33031 -32338 -32776 1886 2434 -22480 -28376
5900 -28376 -21865 -12194 -4815 4902 13688 17122 -3522 -1972 -6340 -14123 -2038 10223 -9813 -17890
5886 -17890 -24358 -17197 -13107 -16030 -29588 -39654 -35366 -46284 -38316 -21878 -38995 -46143 -33367
5873 -33367 -13456 -20641 -12591 -24411 -33772 -14371 -2381 23435 6596 -16406 -32158 -32474 -23556
5860 -23556 -20074 -4221 9199 24404 26801 14381 5294 -10962 -9709 7843 6836 -2419 -2285
5847 -2285 -7156 -19382 -20332 -16392 -10610 -14945 -20253 -18707 -13797 1270 14937 14726 -8076 -4174
5833 -4174 5905 16536 24718 2079 -17527 -24900 -4467 17242 16455 2421 -3413 -8125 -11064
5820 -11064 5795 6861 13643 13191 21757 26705 40861 26662 4742 -2260 -22508 -41738 -45999
5807 -45999 -26181 -9937 -9015 -27596 -30666 -19603 -13562 -6936 1908 6435 -17057 -48006 -39126
5794 -39126 -31827 -23500 -7842 -5355 -5339 2521 15534 27075 41057 40031 7661 -11599 -19840 -8166
5780 -8166 24321 14976 -3543 10304 9825 -5146 -27404 -23787 -8495 -8346 -23118 1760 18852
5767 18852 -2978 -15768 -4434 2948 -2234 5454 7597 -2774 -5377 -9344 -24692 -35063 -19485
5754 -19485 -10229 -37705 -51105 -44929 -33503 -24387 -17008 -17712 -18566 -20617 4110 16472 7002 11527
5740 11527 517 -6709 -20802 -45496 -48889 -50965 -41717 -45711 -32033 -11823 -15416 -16192 -21394 -23344
5726 -23344 -24328 -14175 -19161 1935 19086 15053 13299 15080 1723 5495 7192 9438 -8224 -8531
5712 -8531 -3495 9784 5344 -5559 -37088 -29952 -12860 -10780 -734 -14627 -23375 -17073 -11788
5699 -11788 -11572 -23208 -38514 -15119 21910 22025 15457 10154 27017 5122 -36099 -42498 -32198
5686 -32198 -21753 -18762 -11661 -9115 -10596 -21849 -20702 -7570 -7476 603 7553 -6349 -14737 -8862
5672 -8862 9475 36983 27522 8334 4968 2147 463 -5933 -10327 -13942 -31358 -50597 -41243 -24499
5658 -24499 -11328 -19303 -32347 -36784 -26668 -13878 -5679 -18245 -11891 -4056 -9972 -11144 14676
5645 14676 9079 -4343 -13013 -22995 -26908 -15463 1073 10610 15100 16560 14628 1199 -10504
5632 -10504 -15847 -9352 -4081 -1478 14197 6130 -15678 -21985 -2441 10912 22480 28962 27905
5619 27905 19549 18158 32412 43471 5215 -24594 -35113 -16597 -1704 -955 2086 -9329 -5079
5606 -5079 -10651 -30196 -26812 -39332 -44841 -30814 -12648 -381 -26784 -31536 -19492 -3477 -8867
5593 -8867 -16289 -25007 -23986 1838 13514 7365 9120 1846 -22563 -25875 -11709 1420 18340
5580 18340 2988 1822 -11983 2943 21683 11407 -15689 -22701 -20255 -24526 -45036 -53039 -61580
5567 -61580 -38422 -21613 -15394 906 -3894 2414 3466 4864 -1453 -1918 -4403 -26358 -18994 -15778
5553 -15778 -11481 -7903 -14896 -21905 -5958 7293 25863 15117 9804 19457 10747 3583 -874 573
5539 573 -4233 -11075 -25573 -16455 -25785 -36011 -17384 -2773 -6752 -10556 -910 6363 -12596 -30679
5525 -30679 -24817 -14744 -6822 -19209 -30167 -17512 -4121 4160 -1178 -532 -4432 -3413 -33111
5512 -33111 -44551 -35015 -32152 -10271 5221 -3201 -25654 -28739 -29086 -23742 -22727 -27636 -24402 -21024
5498 -21024 -3786 -3609 -3301 -3267 6518 1839 -17882 -28213 -15334 2695 4782 -4713 -22058 -25806
5484 -25806 -10239 19201 14840 6885 -1353 6379 -1879 -11730 -21135 -11683 -3738 4914 -11178 -8459
5470 -8459 -1524 -12880 -19298 -22620 -20482 -1685 14068 4101 13373 -8596 -7951 -33834 -29614 -7652
5456 -7652 -12094 726 5908 8385 11657 5803 11220 6161 -18508 -34484 -13869 -11951 -2025 -730
5442 -730 11752 21310 34175 25743 4675 2941 -7674 -18316 -4753 15210 -2214 -16405 -2916
5429 -2916 2379 7718 6674 11267 13671 5900 1700 10268 10652 17945 8840 -7 -1915 -11748 -22217
5414 -22217 -19662 98 21330 14181 -2222 968 -17875 -27781 1860 25527 42283 37419 19286
5401 19286 13223 17776 -16206 -3434 -503 6771 17265 14779 3014 -22128 -30984 -18007 -20598
5388 -20598 -6384 4295 -7552 -10163 4902 26035 20810 7026 -8095 -14550 -1507 16639
5376 16639 3989 -15082 -16033 -13115 180 2621 -16991 -24627 -9245 -9376 -6263 14620 23943 22319
5362 22319 -5080 -37153 -30656 -7264 -1082 609 -1764 -7857 6207 11405 5289 -14480 -13431
5349 -13431 4135 13020 999 -7773 6201 19247 16497 -4309 -14379 -36463 -40376 -39157 -33858
5336 -33858 -20490 -15148 -3505 -12282 -11292 -6903 941 5992 -4929 -5349 -10304 -14168 -15838 -10048
5322 -10048 -12571 -7614 12874 42490 32901 14546 2394 -7019 -9886 -15206 -15740 -4016 6989
5309 6989 2055 1535 -1449 -19742 -35736 -41806 -29470 -19044 -18134 -22252 -7221 3287 1526 -22687
5295 -22687 -27698 -5232 -2713 -4447 -27785 -17315 -23321 -22751 -49310 -70928 -76780 -62229 -22935
5282 -22935 -13033 -16817 2546 15 -20641 -36312 -24916 -5271 -2748 -21061 -23509 -12115 355
5269 355 23059 16499 -14330 -18432 -25315 -17287 -29315 -37763 -11844 -15617 -9268 -10304 -8761 -11966
5255 -11966 -1211 3959 8784 -16188 -11077 -2454 -8491 -9437 -13920 -24944 -12432 16082 8832 -1676
5241 -1676 -2458 -226 -6071 -10617 4107 15771 19989 17728 17989 9377 6223 -1560 -13600 -4688 9628
5226 9628 2596 -22572 -20709 -2573 -753 -3198 3355 -11175 -3725 -3719 -10209 -6359 -6761 -17255 -7532
5211 -7532 -2983 -21555 -35322 -40895 -34225 3177 18505 14740 21497 27445 20380 -9975 -25172
5198 -25172 -39425 -64173 -53996 -18804 -25760 -19019 -16507 -4473 10941 11775 7338 503 -4310
5185 -4310 -8721 -16954 -26484 -17056 -22457 -62344 -54654 -36295 -19510 -10261 -1697 -3976 -17395 -15655
5171 -15655 -17995 3232 8668 -4160 5786 5236 10642 16604 3904 -11436 -22393 -18955 4032
5158 4032 15181 24754 26338 21270 12776 8287 -1907 1103 7434 -11164 899 -13635 -4373 1997
5144 1997 12598 -6561 2642 20876 20103 28016 24197 42306 32712 32773 31699 26368 8520 -5765
5130 -5765 -2895 2316 -12847 -18284 -25656 -26144 -23917 -7704 -10094 -20295 -8630 10110 30127 39783
5116 39783 34789 22133 18017 18629 21327 30440 15098 6568 4129 -9197 -10078 -8413 -10738 -4596
5102 -4596 -14778 -15780 -12236 -17945 -18450 -1863 -1844 -12010 -15466 -8120 -9746 -5498 -9945 2312 -7821
5087 -7821 -15185 -4618 1207 11679 4924 3260 3856 1339 6420 -2174 -3868 5626 20025 18546
5073 18546 2990 3472 17216 18082 8189 8016 8057 -5598 4632 -2160 -10847 8833 21646 15429
5059 15429 -19519 -42320 -31849 -22385 -12301 -8735 -19951 -7192 3235 18690 21721 18134 10822
5046 10822 7672 -1748 -16691 -16692 612 -4235 -25576 -28142 -24789 -25858 -9195 18716 7108 3274
5032 3274 -15851 -21888 -10957 4373 14513 -2810 -14637 4025 4981 -4986 12197 18763 22629
5019 22629 15986 17389 39433 43902 26946 32275 23516 -3853 2252 11142 2099 -3732 -40784 -37497
5005 -37497 -31578 -26537 -24268 -44348 -53167 -56751 -27658 -15920 -3045 7484 7507 -8085 -20208
4992 -20208 -15138 -16554 -15239 -14021 -21296 -4680 -2117 15965 33140 11874 7985 14425 472
4979 472 -19800 -28469 -25770 -34398 -56214 -61629 -37250 -32706 -26360 -30189 -26534 -40212 -47101 -40900
4965 -40900 -24788 -3983 -594 10150 2214 -6375 20819 29510 14742 73 -4387 633 -6465
4952 -6465 -24880 -40139 -33305 -11822 4198 4905 22017 18255 -13754 -31406 -25812 6714 13431
4939 13431 -724 419 -11019 -18275 16404 39669 35033 14240 8329 10028 12936 11775 11928 12525
4925 12525 13083 -4583 -22796 -27560 -37021 2728 7424 -890 19281 21788 25261 6344 -6616
4912 -6616 -23129 -24070 -8911 18057 17214 -182 -9580 -23049 -32571 -24141 2110 4897 -9619 -13273
4898 -13273 2822 14116 13311 5034 -11182 -16739 -30382 -33418 -13301 5037 8055 -8550 -8555 8676
4884 8676 5143 -11003 -20270 -15442 -11660 3705 -4604 -7670 6824 19147 689 -19655 -14980
4871 -14980 -11003 -12694 -15196 -4102 12291 17015 19594 26440 2415 12769 18419 20392 3603
4858 3603 -9292 -36117 -34767 -3811 9324 3413 -3566 10391 11352 2165 -10335 -10794 1458 2930
4844 2930 -18289 -39696 -41311 -7173 6668 -564 5236 -1908 -5672 -8381 -8528 -8978 -8042 -26415
4830 -26415 -40088 -20328 -4055 -208 4473 -11434 -10612 10518 -1530 -13108 419 -1082 -14111
4817 -14111 -19550 -14224 -1896 -11501 -28872 -29943 -17401 772 9937 2454 -2900 -8567 1775
4804 1775 8272 18098 5911 14887 14768 11444 28270 30117 17263 8113 9777 11207 11009 18544 26386
4789 26386 24530 16819 28590 8878 6046 3929 28626 22527 19724 -3625 -37247 -23456 -8743
4776 -8743 -5566 -17743 -11501 -18102 -15663 -13286 -17194 -11744 -16242 -13339 -10831 -5885 3021 -13662
4762 -13662 -16015 -13491 -19812 454 6527 5760 10950 14541 21295 27503 33366 29085 26478 28571 28747
4747 28747 12649 -7192 -29789 -28241 -36453 -36224 -29330 -26232 -6135 5615 12396 -19014 -55829
4734 -55829 -45089 -13704 4146 4921 17387 16970 30922 32470 13577 9892 10753 -3666 2662 11980
4720 11980 11902 -5876 -10916 -29333 -27343 -4770 33269 12314 -38534 -31284 4376 9574 -1907
4707 -1907 5231 22017 20519 -12402 -32777 -41079 -40519 -41611 -30887 -30633 -16747 415 1410 -3545
4693 -3545 6541 20325 35469 14384 -11178 -4444 -308 18125 12823 3847 -1592 -13713 -8204
4680 -8204 -13873 -6632 9867 10629 -7317 -20868 -20336 11800 21626 27249 26575 21153 16521 15916 4773
4665 4773 9114 24330 14953 1413 -6617 -9622 -23623 -18961 -6713 -2503 7950 11201 12248 -791
4651 -791 -15049 -14554 -8448 -13833 4228 18704 14517 -10416 9622 26542 30495 -682 -27831
4638 -27831 -30608 -35242 -37611 -20932 -7132 -9772 -5530 2062 -3574 -2946 11255 28188 12537 -22837
4624 -22837 -22284 -14936 -19646 -31506 -44399 -37945 -34337 -12207 6593 15289 32282 39453 13952
4611 13952 -12603 -14931 -9507 15420 24824 29991 17330 20626 29124 17511 -150 2755 9954
4598 9954 -726 1738 1727 13355 8592 17333 32103 30174 20973 24081 29560 31354 21209 2397
4584 2397 2135 -8311 -27497 -41530 -32356 -13053 -1557 -2042 22697 22295 1515 -5920 4026 24590
4570 24590 4924 -20190 -31513 -18338 -9824 -2519 11659 20329 16090 19719 1827 -7935 -6084
4557 -6084 6201 1464 -5091 -7944 -14650 -22892 -20683 -12780 -8277 3796 4940 -4845 7969 8088
4543 8088 2394 10988 6789 -6451 -16195 -21578 -22605 -19363 -27754 -38720 -34649 -37413 -32607 -32999 -18427
4528 -18427 694 749 -3303 -11345 -2617 10950 -1902 35 669 5567 2222 -11548 -15869 -13860
4514 -13860 -8012 -12026 -32095 -34478 -17258 10532 8637 -3859 15394 23213 21337 12587 -3815
4501 -3815 3044 16173 16002 -6800 -7721 -6853 -417 13248 25938 16381 4819 -2028 4595 11297
4487 11297 15311 31112 23917 4443 -7527 -198 14795 36593 48033 18591 2032 10217 14565
4474 14565 6524 1462 1882 8555 1772 -5019 -3008 18650 20748 25169 34407 36962 29830 1632
4460 1632 -1733 856 -8600 -4306 -4524 895 12218 10834 2668 1849 1455 -13793 -9534 -5762 -150
4445 -150 11359 20335 15285 3182 14581 8367 16936 28241 13984 15969 388 -460 -4409 -19042
4431 -19042 -33478 -43450 -47749 -41587 -19006 -4886 12712 23471 14017 -1347 -14317 -10862 -11494
4418 -11494 -11723 -7355 -1108 2331 11523 397 -1673 -17366 -14487 -15041 -16379 -33947 -44363 -36845
4404 -36845 -19720 -12335 -26202 -20624 10790 10930 -8810 -23273 -20550 -14873 -18732 -19366 -4049 -1476
4390 -1476 -2426 21702 10891 570 1614 5096 4108 2701 6894 8362 23536 11590 4656 1455
4376 1455 -8174 -13999 -26171 -9903 6294 13703 371 -476 3326 2005 -9703 -17941 -24652 -34018
4362 -34018 -43201 -37034 -13501 -16817 -30722 -32878 -42966 -37569 -31831 -29570 -4475 13362 7136
4349 7136 -7957 -10346 -19482 -30076 -29678 -22117 -10176 -13041 -10242 -21097 -16782 -17402 -16752 -31808
4335 -31808 -34288 -47559 -57716 -61231 -40413 -23750 -1620 -12788 -16130 -13325 295 6869 17971
4322 17971 13941 -3556 -11463 -18929 -20770 -18853 -21981 -18654 -3628 4717 -5222 4662 14496 12558
4308 12558 -1137 -18678 -31947 -21591 5510 6640 -19517 -18672 -16702 -33775 -46093 -28293 -24015
4295 -24015 -49137 -41168 -29672 -28149 -33678 -21204 -20614 -30429 -31128 -33020 -30585 -14235 -2398 9625
4281 9625 -12083 -34403 -39466 -52026 -35825 -22532 -21776 -2756 5759 3663 -9564 -26126 -35097
4268 -35097 -34505 -22172 -13120 -7701 2312 9887 15164 18160 10424 8664 14321 18077 14215 13370 17574
4253 17574 -10697 -14385 -16093 -10683 -3648 -103 -4172 -266 12060 2613 -7958 -9627 -10499 -602
4239 -602 -1629 -7733 -9721 -5412 -20425 -31963 -28938 -24607 -31620 -18922 -15679 -16530 -7579 -5655 -6305
4224 -6305 7158 5453 -22900 -4468 5537 -188 -7902 -4795 -13849 -29363 -58630 -63208 -59504
4211 -59504 -43326 -29375 -21003 -27268 -34827 -35121 -27886 -23274 -11764 1934 913 -3736 -11176 -8237
4197 -8237 -2737 5758 3676 -2733 -13280 -23072 -26958 -15518 -9550 12212 22683 17543 7221 -6691
4183 -6691 -15613 1243 7711 19098 6645 -26354 -31997 -23241 18162 28480 33470 43150 44741
4170 44741 35149 10243 -1248 -484 13984 15786 -6314 -7181 -9289 -24139 -30130 -8364 8622
4157 8622 17300 6173 -23027 -46403 -51049 -27077 -19799 -41518 -38895 -32883 -27341 -23369 -22061 -29103
4143 -29103 -20288 6277 4931 13343 -2837 3595 5717 -11642 -11782 -9959 -21210 -22849 -7888 25740
4129 25740 30748 1769 -16353 -23411 -3704 -895 -7693 -16445 -13894 -18665 -1903 18022 23592
4116 23592 19367 6094 -12491 -4617 -1130 -4075 16970 30742 40513 39016 13117 -3480 24404
4103 24404 31441 21016 5720 -3221 -15918 -16188 -18230 -14965 13694 14834 12377 -4528 -4373 14813
4089 14813 5186 10467 11233 3273 -914 3555 22147 41368 46183 32756 10931 -17738 -44073
4076 -44073 -38125 -20582 -28914 -38315 -24802 -13423 -11927 -9360 -10021 -5595 -5756 -14297 -12943 6421
4062 6421 27311 26768 22178 6339 15470 8612 -8819 -6993 920 -1213 4836 25769 25781 28966 15513
4047 15513 5652 21582 30905 2419 -8287 -10186 7613 13904 20155 6499 12658 20580 1610
4034 1610 -1651 601 1764 4089 -2240 -4239 5342 6539 -9535 -12988 -4423 2072 11433 30749
4020 30749 46818 50916 28085 8415 9658 11783 7967 2007 17345 1247 -11553 -6489 13300
4007 13300 20455 6664 3342 1724 4690 1114 9235 12029 17215 4267 -15351 -16942 -9585 -15429
3993 -15429 -22286 -11121 -7574 -21797 -13346 -4300 2096 20764 19389 6345 -8731 -11716 2954
3980 2954 14362 8414 15999 9072 -7219 193 1582 -3066 7606 19529 -946 2625 -7366 -7407
3966 -7407 9933 17967 18224 9132 15581 13738 4837 17361 21813 82 10058 39899 25821 23932
3952 23932 19890 24645 18771 5986 -8544 -21676 -21346 -27968 6981 24278 20666 8575 -14894
3939 -14894 -12358 -8289 -22252 -17050 -7885 -6811 -11527 -14482 -8545 -2944 -1640 -9885 -13179 -10661
3925 -10661 -5489 4971 12691 3811 -17013 -21681 -19979 -15330 -7790 -12472 -19097 -9421 -2440 -12439
3911 -12439 -7254 -1144 20457 29424 8759 -4383 -13228 -9907 -12445 -29282 -27536 -19831 -35424
3898 -35424 -17506 -12522 2165 8963 14558 14071 13184 -841 -9682 -3337 5150 5079 -10116 -3690 -16286
3883 -16286 -26611 -9919 -2836 -13654 -28092 -7291 -8763 11812 8668 -17231 -20422 -18029 -6034
3870 -6034 -3498 -2438 -14312 -5227 7096 3802 661 -5788 -10940 -14559 -28711 -22203 -8208 -2766
3856 -2766 -14305 -22139 2418 7191 8905 4570 -15712 -34305 -36612 -12932 -16619 -14807 -1891
3843 -1891 7476 4199 -4432 -3883 -9145 -5774 5029 7100 -9523 212 9444 -14562 -19248 -25376
3829 -25376 -5690 -10700 -1332 10062 4512 -4367 -9217 -3692 27313 38049 44383 41216 57731
3816 57731 71358 61729 37695 3163 -2721 2426 20865 27632 34484 40483 -898 -6969 10453
3803 10453 3728 5635 -4085 -5077 13299 9812 -3625 -28718 -33706 -20396 -7821 10591 13399
3790 13399 -8485 -17188 -6144 -8278 -30873 -35367 -17347 -25879 -15183 -5053 -7673 8225 32199
3777 32199 30558 24971 16423 5199 14292 14182 5847 14815 17004 3822 -9710 -33753 -26995 -26028
3763 -26028 -25619 -22721 -23242 -13459 -3125 -15201 -15647 -14968 -26311 -19301 -7670 -5424 -5921 8610 10772
3748 10772 14860 15850 -1409 -2632 -3234 2478 -11669 -26747 -11361 -19755 -29016 -16473 -1554 17694
3734 17694 13577 -5185 186 -6225 -7739 -11392 -17410 -5971 -2453 -3164 -5695 -15263 -14744 -1922
3720 -1922 14427 13467 15035 8215 -152 -793 8918 20241 15864 -13034 -44546 -26709 -8098 -49
3706 -49 1169 622 -6872 -7466 -1455 -13612 -31057 -31955 -21785 -12543 -1604 5239 -5542 -9894 -1150
3691 -1150 -8630 3051 -10024 -5023 616 5558 19702 22407 12565 -8377 -21871 -15456 -1970
3678 -1970 -1754 -9244 -10511 -5811 -1451 -5813 -12330 -15160 -6883 -11871 -21547 -23022 -7845 -6203 -10942
$$ [...]
##END NTUPLES=NMR SPECTRUM
##END=
