##TITLE=Analysis number 317360
Compound Code cc 43314
Book Reference 414/184
Project Code adrs
Chemist Name mattw
##JCAMPDX= 6.0         $$ Bruker NMR JCAMP-DX V2.0
##DATA TYPE= NMR SPECTRUM
##DATA CLASS= NTUPLES
##ORIGIN= Bruker BioSpin GmbH
##OWNER= nmr
$$ XWIN-NMR		Version 3.5
$$ Fri Feb 17 09:15:21 2006 GMT Standard Time (UT+0h)  MAYBRIDGE\nmr@NMR_250MHZ
##.OBSERVE FREQUENCY= 250.131544655141
##.OBSERVE NUCLEUS= ^1H
##.ACQUISITION MODE= SIMULTANEOUS (DQD)
##.ACQUISITION SCHEME= undefined
##.AVERAGES= 16
##.DIGITISER RES= 18
##SPECTROMETER/DATA SYSTEM= dpx250
##.PULSE SEQUENCE= zg30
##.SOLVENT NAME= CDCl3
##.SHIFT REFERENCE= (INTERNAL, CDCl3, 0, 16.522)
##AUDIT TRAIL= $$ (NUMBER, WHEN, WHO, WHERE, WHAT)
$$ ##TITLE= Audit trail, XWIN-NMR		Version 3.5
$$ ##JCAMPDX= 5.01
$$ ##ORIGIN= Bruker BioSpin GmbH
$$ ##OWNER= nmr
$$ C:\u/data/dgb/nmr/ADRS/16190/pdata/1/auditp.txt
$$ ##AUDIT TRAIL=  $$ (NUMBER, WHEN, WHO, WHERE, WHAT)
(   1,<2006-02-17 09:15:00.05 +000>,<MAYBRIDGE\nmr>,<NMR_250MHZ>,
      <created by zg, POWCHK disabled, PULCHK disabled
       configuration hash MD5:
       84 BC 41 DB A1 6E 1D 46 DA 25 12 A5 C1 ED C5 3A
       data hash MD5: 64K
       96 D8 3D 2B 5D 04 8B 6E E5 35 2E B4 7A 55 20 58>)
(   2,<2006-02-17 09:15:11.68 +000>,<MAYBRIDGE\nmr>,<NMR_250MHZ>,
      <Start of raw data processing
       ef LB = 0.3 FT_mod = 6 PKNL = 1 SI = 32K 
       data hash MD5: 32K
       93 92 09 50 48 2D 2A 58 50 06 F6 02 13 70 00 F4>)
(   3,<2006-02-17 09:15:13.52 +000>,<MAYBRIDGE\nmr>,<NMR_250MHZ>,
      <apk 
       data hash MD5: 32K
       B1 67 07 02 64 A6 5E 5A 0D 7C A8 30 A5 BA 76 21>)
(   4,<2006-02-17 09:15:14.32 +000>,<MAYBRIDGE\nmr>,<NMR_250MHZ>,
      <abs ABSG = 5 
       data hash MD5: 32K
       15 EE BA 74 05 62 C3 FC 73 19 18 5B 7B 3A AE E1>)
$$ ##END=
$$ 
$$ hash MD5
$$ 27 70 AB 37 D5 43 68 32 A9 F5 A5 AC 60 80 17 E5
##$RELAX= 
##$RELAX= 
##$RELAX= 
##$RELAX= 
##$RELAX= 
##$RELAX= 
##$RELAX= 
$$ Bruker specific parameters
$$ --------------------------
##$DU= <C:\u>
##$EXPNO= 16190
##$NAME= <ADRS>
##$PROCNO= 1
##$TYPE= <nmr>
##$USER= <dgb>
##$AMP= (0..31)
100 100 100 100 100 100 100 100 100 100 100 100 100 100 100 100 100 100 
100 100 100 100 100 100 100 100 100 100 100 100 100 100 
##$AQSEQ= 0
##$AQ_mod= 3
##$AUNM= <au_zg>
##$AUTOPOS= <7 >
##$BF1= 250.13
##$BF2= 250.13
##$BF3= 250.13
##$BF4= 250.13
##$BF5= 500.13
##$BF6= 500.13
##$BF7= 500.13
##$BF8= 500.13
##$BYTORDA= 1
##$CFDGTYP= 0
##$CFRGTYP= 5
##$CHEMSTR= <none>
##$CNST= (0..31)
1 1 145 1 1 1 1 1 1 1 1 1 1 1 1 1 1 1 1 1 1 1 1 1 1 1 1 1 1 1 1 1 
##$CPDPRG= <>
##$CPDPRG1= <>
##$CPDPRG2= <>
##$CPDPRG3= <>
##$CPDPRG4= <mlev>
##$CPDPRG5= <mlev>
##$CPDPRG6= <mlev>
##$CPDPRG7= <mlev>
##$CPDPRG8= <mlev>
##$CPDPRGB= <>
##$CPDPRGT= <>
##$D= (0..31)
0 1 0 0 0 0 0 0 0 0.06 0 0 0 0 0 0 0.0002 0 0 0 0 0 0 0 0 0 0 0 0 0 0 
0 
##$DATE= 1140167698
##$DBL= (0..7)
120 120 120 120 120 120 120 120 
##$DBP= (0..7)
150 150 150 150 150 150 150 150 
##$DBP07= 0
##$DBPNAM0= <>
##$DBPNAM1= <>
$$ [...]
##$SUBNAM7= <"">
##$SUBNAM8= <"">
##$SUBNAM9= <"">
##$SW= 20.6930455092707
##$SWIBOX= (0..15)
0 0 3 0 0 0 0 0 0 0 0 0 0 0 0 0 
##$SW_h= 5175.983436853
##$TD= 65536
##$TD0= 1
##$TE= 293.16
##$TE2= 300
##$TE3= 300
##$TEG= 300
##$TL= (0..7)
0 120 120 120 120 120 120 120 
##$TP= (0..7)
150 150 150 150 150 150 150 150 
##$TP07= 0
##$TPNAME0= <>
##$TPNAME1= <>
##$TPNAME2= <>
##$TPNAME3= <>
##$TPNAME4= <>
##$TPNAME5= <>
##$TPNAME6= <>
##$TPNAME7= <>
##$TPOAL= (0..7)
0.5 0.5 0.5 0.5 0.5 0.5 0.5 0.5 
##$TPOFFS= (0..7)
0 0 0 0 0 0 0 0 
##$TUNHIN= 0
##$TUNHOUT= 0
##$TUNXOUT= 0
##$USERA1= <user>
##$USERA2= <user>
##$USERA3= <user>
##$USERA4= <user>
##$USERA5= <user>
##$V9= 5
##$VALIST= <valist>
##$VCLIST= <CCCCCCCCCCCCCCC>
##$VD= 0
##$VDLIST= <DDDDDDDDDDDDDDD>
##$VPLIST= <PPPPPPPPPPPPPPP>
##$VTLIST= <TTTTTTTTTTTTTTT>
##$WBST= 1024
##$WBSW= 4
##$XGAIN= (0..3)
0 0 0 0 
##$XL= 0
##$YL= 0
##$YMAX_a= 372173
##$YMIN_a= -389810
##$ZGOPTNS= <>
##$ZL1= 120
##$ZL2= 120
##$ZL3= 120
##$ZL4= 120
##$ABSF1= 16.522
##$ABSF2= -4.171173
##$ABSG= 5
##$ABSL= 3
##$ALPHA= 0
##$AQORDER= 0
##$ASSFAC= 0
##$ASSFACI= 0
##$ASSFACX= 0
##$ASSWID= 0
##$AUNMP= <proc_1d>
##$AZFE= 0.1
##$AZFW= 0.1
##$BCFW= 0
##$BC_mod= 0
##$BYTORDP= 0
##$COROFFS= 0
##$CY= 12.5
##$DATMOD= 1
##$DC= 0
##$DFILT= <>
##$DTYPP= 0
##$F1P= 14.0000005364418
##$F2P= -0.99999901652339
##$FCOR= 0.5
##$FTSIZE= 32768
##$FT_mod= 6
##$GAMMA= 0
##$GB= 0
##$INTBC= 1
##$INTSCL= 1
##$ISEN= 128
##$LB= 0.3
##$LEV0= 0
##$LPBIN= 0
##$MAXI= 10000
##$MC2= 0
##$MEAN= 0
##$ME_mod= 0
##$MI= 0
##$NCOEF= 0
##$NC_proc= -4
##$NLEV= 6
##$NOISF1= 0
##$NOISF2= 0
##$NSP= 0
##$NTH_PI= 0
##$NZP= 0
##$OFFSET= 16.522
##$PC= 1
##$PHC0= 107.2434
##$PHC1= 2.016821
##$PH_mod= 1
##$PKNL= yes
##$PPARMOD= 0
##$PSCAL= 4
##$PSIGN= 0
##$REVERSE= no
##$SF= 250.13
##$SI= 32768
##$SIGF1= 0
##$SIGF2= 0
##$SINO= 400
##$SIOLD= 32768
##$SREGLST= <1H.CDCl3>
##$SSB= 0
##$STSI= 32768
##$STSR= 0
##$SW_p= 5175.98343685301
##$SYMM= 0
##$S_DEV= 0
##$TDeff= 65536
##$TDoff= 0
##$TI= <Analysis number 999999
Compound Code 99
Book Reference 9
Project Code 9>
##$TILT= no
##$TM1= 0
##$TM2= 0
##$TOPLEV= 0
##$USERP1= <user>
##$USERP2= <user>
##$USERP3= <user>
##$USERP4= <user>
##$USERP5= <user>
##$WDW= 1
##$XDIM= 32768
##$YMAX_p= 399545208
##$YMIN_p= -361105
$$ End of Bruker specific parameters
$$ ---------------------------------
##NTUPLES= NMR SPECTRUM
##VAR_NAME=  FREQUENCY,     SPECTRUM/REAL,   SPECTRUM/IMAG
##SYMBOL=    X,             R,               I
##VAR_TYPE=  INDEPENDENT,   DEPENDENT,       DEPENDENT
##VAR_FORM=  AFFN,          ASDF,            ASDF
##VAR_DIM=   32768,         32768,           32768
##UNITS=     HZ,            ARBITRARY UNITS, ARBITRARY UNITS
##FACTOR=    0.157963299565203, 1,           1
##FIRST=     4132.6476996994, 0,             0
##LAST=      -1043.33573715361, 0,           0
##MIN=       -1043.33573715361, -361105,     0
##MAX=       4132.6476996994, 399545208,     0
$$ Real data points
##PAGE= N=1
##DATA TABLE= (X++(R..R)), XYDATA
$$ [...]
19789A4733o0298r3684m265J63666j0745J9185k5278m4898q842j7362o4304L4550
19777i7542J24528P248J1604L2756N2673J0580j1442k053r1853q4761R573O0157
19765B1468N3015n0928Q31M0184q5730j14028O0311j5886N8538J17747n256n1361
19753B8905q0331L0696R1745K2739n9663l7945m845N4228N4809j33683q0285O1266
19741e2364M9215J0050l2416j06269J8051J31352r583m8337p581m1545j8578N3790
19729e4215O9933n823N6597j059k411j2160o973N0231P3436j9023j21109L2238
19717E9662P0722n8765J0528P7555n0925n349l0096o4393k0700M2408p5122l4049
19705g8524J3426K6360k8847k7559O6728N3074j0872K0982M6579J490p5570l2340
$$ y = [14733, -45565, -139249, -143514, 20152, 9407, 28592, 3314, -41584, -50426, -67788, -132092, -97542, 26986, 34234, 45838, 78594, 131267, 141847, 130405, 128352, 36499, -48262, -38689, 21468, 74483, 23555, 24386, 64570, -21160, -135188, -74877, -90763, -32225, 85522, 80266, 28905, -51426, -20730, 71015, 93754, 34091, -3854, -8699, 45529, 100338, -33345, -113630, -52364, -3149, 6901, -25515, -131784, -113733, 17619, 8036, -40301, -47882, -89427, -108005, -54215, 15718, 9895, 66492, 65433, 63022, 50862, 43889, 94120, 167556, 148533, 27424, 59662, 130384, 71619, 82147, 159702, 108777, 103428, 73332, 8939, -11761, 30647, -44475, -78524, -65098, -38738, -67585, -95144, -28416, 24658, 13786, 34768, 81347, 82837, 7267, -25073]
19693b5073j7570J06k5606R7572L5124n6402q899J29715K2323o6860o90o1713
19681B2027K9678n3632l0156L7479P1073L1295p7600m360m8908K2346q1901l0713
19669a13372K7293Q4968J2977j3757L9325p772N3823M2820n1918p2790k5508N0077
19657B6166N937j7181m5325O138L8865M0280j3766K3132k4414L312m624J4907
19645E3427k799J97l0383O124o5956n671m0365K0157K7177N6380k6246j4234M9483
19632B7291j0136o5182P1041N0611N9397M332M1018n7156m3788P7309k6614r7512
19620C0611K1611N6617k6560N609j5743m0441q183n1381p771L1319J457M2981
19608D0126n4679o625P2851J15569l2896N4444K1111q9910k2052J1316k0823J3893
$$ y = [-25073, -42643, -42537, -68143, 29429, 64553, 8151, -748, 128967, 151290, 84430, 83740, 22027, 51705, -1927, -32083, 5396, 76469, 107764, 30164, 25804, -23104, -758, -82659, -113372, -86079, -1111, 11866, -1891, 37434, 29662, 83485, 126305, 74387, 1597, -23911, 26166, 32103, 14922, -30403, -24265, 14600, 54880, 41114, 64246, 39832, 43144, 38520, 53427, 50628, 50825, 20442, 26566, -39390, -45061, -85426, -65269, -38092, 18288, -7958, -22192, 27291, 17155, -48027, 23014, 73625, 133022, 137354, 178372, 121216, 77428, 154737, 128123, 30611, 52222, 108839, 82279, 87888, 72145, 31704, 23521, -27860, -35631, -4312, -2855, 40126, -14553, -21178, 51673, 167242, 134346, 188790, 209901, 119991, 97939, 109255, 88432, 102325]
19596A02325r349m2940J3692N0900n3595j14334K41Q5947L1846j4095q8064p8009
19584a15435M7112p670N6586R9367R04q6189m5641M6135K8825l1523l5824k0026
19572f3379p269q453l113L9719K8271j7505o2874O1408J26097L8663k8427p6460
19560B6678l7223O7886L6216q5248J0731q52j2889k8810J3829K9295J2430p7955
19548d5912K4736O124R4794P1538o6255r2989n704P2935P1499L4544K5782J9032
19536B10124m6276o7718j04292R23k821p3686j23138J9611R8171J70042K0749
19525A01689r2333M0234L5921r9604Q523q047K1406l0549m0274n907K2679L7943
19513h319K0980K4461n9425K802k6618l3864j6724L0541Q2795P8390o7676m8898
$$ y = [102325, 92976, 50036, 63728, 114628, 61033, -53301, -53060, 32887, 64733, 50638, -37426, -115435, -68323, -75993, -19407, 79960, 80864, -5325, -50966, -4831, 23994, -7529, -43353, -63379, -70648, -79101, -82214, -42495, -14224, -31729, -94603, -33195, 92902, 131565, 103138, 26678, -10545, 57341, 93557, 8309, 19040, 18188, 5299, -23511, -9682, 19613, 32043, -45912, -21176, -15052, 79742, 151280, 85025, -7964, -13668, 59267, 130766, 165310, 191092, 210124, 163848, 96130, -8162, -7239, -10060, -83746, -206884, -187273, -89102, 80940, 101689, 9356, 49590, 85511, -14093, -5570, -13617, 7789, -22760, -63034, -68941, -46262, -8319, 12661, 37122, -22303, -19501, -46119, -79983, -96707, -66166, 16629, 95019, 27343, -21555]
19501b1555J02532O8877m0436j6984J8250k0732j8924p305j08146m8184k3283
19490a15890J29446N5847M3758o199l913j4704l051k211K7471O8741M563o8652
19478A15206l7685O0758J16866k5595j20172n8931o793k1711r4407o7592M6738
19467i3318R2377O0217l1542K6848J2096m9441n3966O678k4770M0584K9119j7534
19455b652K902M4107O9764J780q0736J953J8064l468M9681L8382K4168k7680P992
19442A44257l5467J5515N9348N4922m6252j26976r8996P034P005M7839Q5824M9542
19430A63595j9463m8803p2884j65113k4568O0136J10998j0897L7843R768j6750
19419B3862K3281J21156M4526j33508j1619J5866L3577m8715m1667Q4023K5933
$$ y = [-21555, 80977, 149854, 109418, 92434, 110684, 89952, 71028, 63723, -44423, -92607, -115890, 13556, 69403, 113161, 106962, 103049, 88345, 85294, 83083, 110554, 179295, 183858, 115206, 77521, 138279, 255145, 229550, 109378, 50447, 43654, 21943, -72464, -140056, -93318, -941, 59276, 27734, 54582, 66678, 17237, -36729, -30051, -54821, -14237, 14882, -2652, 250, 44357, 114121, 115901, 35165, 37118, 55182, 51714, 101395, 139777, 163945, 136265, 144257, 108790, 124305, 183653, 238575, 192323, 65347, -33649, -26615, -19610, 28229, 114053, 163595, 144132, 95329, 22445, -142668, -167236, -107100, 3898, -6999, 30844, 40612, 23862, 47143, 168299, 212825, 79317, 67698, 83564, 117141, 68426, 26759, 110782, 136715]
19408A36715M9545l2622p6453l6723n4371p1735K5533R1321J4767m868L3132L7531
19396A11772P6431j8565j06236l7061j7900O4477j1643M6644L6020p5079r8642
19385b9782o3602Q4364J10429J0950k088P2686L0424j6678n0210p5300R400P7183
19373A57776j4172o9113p9855o4733K3622L8496P3406N5773K0399N0429m4390
19362A47638m6579n4110m861N9307j137m4245j8752m4667P6666Q4227l8889L9355
19350A53953k4761n6850m6389L587K3005P9179j4156k4719n7299n1804L2108L6184
19338E2038j6621Q50K8118j1860j74N4090m8173m2865r107L8355M5839O6511M3347
19325B00348l0226m4098m0264L0310k4156P4626l4131j07913q2258J3218R9820
$$ y = [136715, 186260, 153638, 77185, 40462, -13909, -85644, -60111, 31210, 45977, 41109, 74241, 111772, 188203, 169638, 63402, 26341, 8441, 72918, 61275, 107919, 143939, 68860, -29782, -93384, -9020, 101409, 112359, 110271, 182957, 213381, 196703, 146493, 71193, 80593, 157776, 143604, 74491, -5364, -70097, -46475, -7979, 65427, 121200, 141599, 192028, 147638, 101059, 46949, 42088, 101395, 100258, 56013, 37261, -7406, 69260, 153487, 114598, 153953, 129192, 72342, 25953, 29540, 52545, 131724, 117568, 92849, 35550, -16254, 15854, 52038, 35417, 36267, 64385, 52525, 52351, 106441, 58268, 15403, 6296, 44651, 90490, 157001, 200348, 170122, 126024, 85760, 116070, 91914, 166540, 132409, 24496, -57762, -44544, 55276]
19314E5276J9474l5772k2045J11505M5462L1900L5069k4090K7159j47246j28844
19303c2152L2108P9548k1891l9440N8954l0478M933k4661k1786k3146L3706L2511
19291D8206L6132j7221n3175N2627l9077K1092M824l811j7632N6243J718k7162
19279F2764P2037K803o3127l9419N319k2998J1969Q9766n9869j11472l1319K7583
19267e5963o0975L165K7089Q4669L4169k9404P649L9522m2156n0214M4649J08533
19255A10733M9461M0270m4o9991j48669p1003N5114l5171n2438M2262O4350M7902
19243C2776P3260K4891M5022Q5302K434l3855m1140m0384o7095O175Q811N5506
19231A51703K8270k2221J9334L0393l675j901m5600j07288L2044L1359m5130K8525
$$ y = [55276, 74750, 38978, 16933, 128438, 173900, 205800, 240869, 216779, 243938, 96692, -32152, -44, 79504, 57613, 18173, 77127, 46649, 51582, 26921, 5135, -18011, 15695, 48206, 84338, 67117, 13942, 66569, 27492, 48584, 53408, 49597, 31965, 88208, 89926, 62764, 134801, 137604, 74477, 35058, 40377, 17379, 29348, 119114, 59245, -52227, -83546, -55963, -116938, -113773, -86684, -2015, 32154, 2750, 10399, 49921, 7765, -42449, 2200, 110733, 160194, 200464, 200420, 130429, -18240, -89243, -34129, -69300, -121738, -79476, -15126, 32776, 106036, 130927, 175949, 261251, 263685, 229830, 188690, 148306, 81211, 87386, 96197, 151703, 179973, 157752, 177086, 207479, 203804, 201903, 156303, 49015, 81059, 112418, 67288, 95813]
19219I5813k8882j02393M946j6286K2541K6100p2853O514L4902P714M2557J1491
19207C2164r725m8207l193M4482J13075J02878O194l1990o3107n4316m8847R897
19195D9305K4859M9917q854k261j5071Q925l0116r646L78L0253K4820L403o927
19182A18985n641N6287K2731j4064o7930o3498l7783J7991O2728k7656J3857J2148
19170H8155m0536j0046m73Q3448o760J6752l0873J1247J5125M6060L2368q0250
19158A24217l4302P6084J02857J1633O6040M243N8300K8817l5897j8570M5014
19147D28436O5507Q6166O5542N6310O3546p590m0306O2189k2247P2655J0658j12373
19135G28493o6652n8859r7165l9278k955l3901o9511r4331K8790J793q198N922
$$ y = [95813, 66931, -35462, -30516, -46802, -24261, 1839, -71014, -64500, -29598, -21884, 20673, 32164, 22439, -25768, -28961, 15521, 128596, 231474, 237668, 205678, 142571, 88255, 39408, 49305, 74164, 124081, 115227, 112966, 97895, 106820, 76704, 67058, 67436, 97689, 122509, 125912, 118985, 113344, 169631, 192362, 178298, 110368, 46870, 9087, 27078, 89806, 62150, 76007, 88155, 47619, 37573, 37100, 120548, 113788, 130540, 99667, 110914, 126039, 172099, 204467, 124217, 89915, 165999, 268856, 280489, 346529, 350772, 409072, 437889, 401992, 383422, 428436, 493943, 580109, 645651, 701961, 765507, 757917, 717611, 779800, 757553, 830208, 840866, 728493, 661841, 602982, 505817, 466539, 463584, 429683, 360172, 265841, 294631, 296424, 288226, 294148]
19123B94148M735k5042m3962q5452p135m3917n189p206N3549k2179O106K7589
19111A46045l8758n3284J6853n393j0278M3256J30177j4948o2004m7973J2511
19100A16204l9192J5973O1718k8602m1686N1313M278o1405o436R4489L4139o4661
19088A36132l9617K4788K8358o64L8638L8808m070N183j23301j11671M0539O243
19076C9366m242N6625K4918p8850P535N9945J0793K352N480p2099r8648m7374
19064i4199P9636M9050L2381K2987j2701o079N5598Q1093Q6676k259j8387k0398
19052B53398m5327p7007j07432L9470N2807M8021J01173l1326n5896l1315k3007
19041A23559O968O8688M2940k0718j00643p4267k991m0507P6618K1107K4099L8251
$$ y = [294148, 298883, 273841, 229879, 144427, 137292, 93375, 88186, 80980, 134529, 112350, 118456, 146045, 107287, 54003, 70856, 65463, 55185, 98441, 228618, 213670, 151666, 103693, 116204, 77012, 92985, 154703, 126101, 84415, 135728, 140006, 78601, 72165, 166654, 200793, 136132, 96515, 121303, 149661, 148997, 187635, 226443, 222373, 227556, 104255, -7416, 33123, 39366, 35124, 91749, 116667, 37817, 45352, 105297, 116090, 118442, 123922, 51823, -46825, -94199, -14563, 34487, 66868, 89855, 77154, 71075, 126673, 207766, 294442, 292183, 273796, 253398, 208071, 131064, 23632, 63102, 115909, 163930, 265103, 233777, 177881, 146566, 123559, 130527, 199215, 242155, 221437, 120794, 46527, 43536, 3029, 79647, 100754, 124853, 163104]
19029A63104p0272M463P5903N4027J09910n107j01573n9435l8339l5777p7444
19018A9460J9956P8012k6881m0676J9954L3410k9931J2288J35082p0882J3247
19007A63039N2805L6556j0318k4367m8205p8955o8696L5423L3538n5605L0075
18996F5290M0335J8146P2495k9511m4838l1786J5918J6674M3746L0230L730m1769
18984A58660n0755K981J4709m4758p7402J23176J21198m3892p0239K6461k3853
18973A36286l1460P095O8746N1361l0318m6479j794r5o4832K2670j6339l4799
18961F0042N2571m5499n0198N5835M1469n8975m0419k2916J2064p2943J8703L9820
18949a0446l3828l079N1753k63P1406N9669n4024k375M6575j8591n9897J0296
$$ y = [163104, 92832, 97295, 173198, 227225, 337135, 332028, 230455, 171020, 132681, 96904, 19460, 39416, 117428, 90547, 49871, 69825, 103235, 73304, 85592, 220674, 149792, 163039, 215844, 252400, 242082, 217715, 169510, 90555, 21859, 57282, 90820, 35215, 65290, 105625, 123771, 196266, 166755, 121917, 90131, 106049, 122723, 166469, 196699, 200429, 158660, 107905, 110886, 125595, 80837, 3435, 126611, 247809, 203917, 133678, 160139, 136286, 104826, 111921, 180667, 232028, 201710, 155231, 153437, 153342, 88510, 111180, 94841, 60042, 112613, 67114, 16916, 72751, 114220, 55245, 14826, -8090, 3974, -68969, -50266, -10446, -44274, -47353, 4400, 4137, 75543, 135212, 81188, 78813, 125388, 106797, 46900, 57196]
18937E7196l1440O823O5832K4404l2247j0904K7483R333n0154n5572M1228J55319
18925B07301J31482K1476j01051m5958M5779N8545l2068p9925j06958q0881j8615
18914h73P5060J8314J7399M4739k8712k9591n1981p216L0744K2365L3516l1398
18902I2366P1798M2890j1739N1604j2510r665o6597j9665N9515j3487L7433M4532
18890B66475q1595K4M3947M2563p8543q3770l3888O9481N0680n8534m777K3481
18878A55544o0421n8116j7634J6696J10136j4915p3344J4931m3246k35J4526m2599
18866A323K5826M9044N9391M6233l343N1673l4308p4359M1575M4025l9383K0268
18854A87965m8728J2018P1615k6386m5604J3427J1513J6308j1547O9245M3964
$$ y = [57196, 25756, 32579, 98411, 122815, 90568, 79664, 107147, 116480, 66326, 10754, 51982, 207301, 338783, 360259, 259208, 213250, 259029, 317574, 285506, 205581, 98623, 17742, -873, 74187, 92501, 109900, 154639, 125927, 96336, 44355, 37139, 67883, 90248, 123764, 92366, 164164, 207054, 195315, 246919, 234409, 224744, 158147, 138482, 197997, 184510, 221943, 266475, 184880, 184904, 228851, 271414, 192871, 109101, 75213, 144694, 195374, 136840, 132063, 155544, 95123, 37007, 19373, 36069, 146205, 131290, 57946, 72877, 29631, 29396, 43922, 1323, 27149, 76193, 135584, 181817, 178474, 230147, 195839, 121480, 163055, 207080, 167697, 187965, 139237, 151255, 222870, 196484, 150880, 164307, 175820, 192128, 180581, 249826, 293790]
18843B93790k5855l41k906N3681n8505j06635m4061j587O2750J5871O4701M6481
18831B97384j7878K1344M7702p4930o2819K4491k0983N015l6876L3941L6563j5665
18819B37289L69j14423m8867L1107N1552r812k5838L7017M4524N713L607L7484
18807B49722M4545L4319K0677j3280j22283p4281J5464M6603m7976Q24K6661J303
18795A82298L6877K3927k9943k2443L8055j6821Q1532K841n931o4459L219n2013
18783A77139J0223M8418m0488K3785k7452k2774M6359P8604n6883j15479o2597
18772E8855R0626J00311O6415P7018J27501k4953L1335L29676L42865J9280j48815
18761A070114k43867k23937j31259o6242J6844n5573n0875r6242j8801k370l5381
$$ y = [293790, 267935, 267594, 264688, 318369, 259864, 153229, 109168, 107581, 170331, 186202, 250903, 297384, 279506, 300850, 348552, 273622, 210803, 235294, 214311, 219326, 182450, 216391, 252954, 237289, 237658, 123235, 74368, 105475, 157027, 147215, 121377, 158394, 202918, 208631, 212238, 249722, 294267, 328586, 349263, 335983, 213700, 139419, 154883, 201486, 153510, 154334, 180995, 182298, 219175, 243102, 213159, 190716, 228771, 211950, 293482, 296323, 290392, 225933, 229152, 177139, 187362, 235780, 195292, 219077, 191625, 168851, 215210, 293814, 236931, 121452, 58855, 149481, 249792, 316207, 393225, 520726, 495773, 527108, 856784, 1199649, 1218929, 1070114, 826247, 602310, 471051, 404809, 421653, 366080, 315205, 218963, 200162, 197792, 162411]
18750A62411P6734K8231J6161J00033M8964j02951m7476P3007K9610l6194r8568
18739B49962N20k7888M9807p624p2998j2978J2891O7821n3319p5702R419k4110
18727A15801n3496L9755N4189Q4171m5732j3215n1373K1028N2519j7463l8634
18716A47550O0528p7636j8031j4643j4393K4213p8142k9320o0463P2182O6709
18705G8554P7168l9164n9875P5369K9823R999M720L8858J10560K2695q693l4215
18693C05799p4220n9255k5786k3232P4190L4305p9895Q4189J40917l7180K3983
18682C63815O963n289J0164L6879j11767m1744l3433o793m3642Q880k0693j8287
18670A45053k5527J9496P4067K7076J9195N037p4800N4457L6803q0052P881P8251
$$ y = [162411, 239145, 267376, 283537, 383570, 432534, 329583, 282107, 355114, 384724, 348530, 249962, 250482, 222594, 272401, 264777, 191779, 178801, 191692, 259513, 206194, 130492, 139911, 115801, 62305, 102060, 156249, 240420, 194688, 181473, 130100, 151128, 203647, 186184, 147550, 208078, 130442, 112411, 97768, 83375, 107588, 29446, 126, -60337, 11845, 78554, 155722, 116558, 56683, 132052, 161875, 171874, 176594, 215452, 326012, 348707, 340014, 305799, 231579, 172324, 146538, 123306, 197496, 231801, 151906, 236095, 377012, 339832, 363815, 370778, 365489, 375653, 412532, 300765, 259021, 225588, 218795, 175153, 184033, 163340, 145053, 119526, 139022, 213089, 240165, 259360, 264397, 189597, 244054, 280857, 200805, 208686, 286937]
18658B86937M9884l4361l9948J9745m0822N0649P4013Q7827k8787j26567L5666
18647C34236M7971k8433l0099m6207M6251M4331n2555m181L2296J4911M144j7864
18635C44801Q723K9479m091O0061o691m1596l5094K2853J08651M6402K4441O5770
18623F23709j414m4019o323r2211m8804n8682N4600O6387P4015m8513m7707R908
18611D80946J2983M1357L3351o823j12170r0190O160j1241L4859O5239o1458J4477
18599D07490J03454L7473L4571J00318K3080p4447o9574k7736n2206K8715N1209
18588E62347J3083Q5963P5404l58J7661l8864m9374O9744j4873k21q1576l6223
18576F02713J56726Q9584n636J2263m30r6307k4725Q6513P7327R1958N8537M609
$$ y = [286937, 336821, 302460, 262512, 282257, 241435, 292084, 366097, 453924, 425137, 298570, 334236, 382207, 353774, 323675, 277468, 323719, 368050, 315495, 311314, 343610, 358521, 362665, 344801, 353524, 383003, 378912, 438973, 432282, 390686, 355592, 378445, 487096, 533498, 557939, 623709, 622295, 578276, 571953, 479742, 430938, 372256, 426856, 493243, 567258, 518745, 471038, 480946, 493929, 535286, 568637, 561814, 449644, 359454, 365614, 354373, 389232, 454471, 393013, 407490, 510944, 548417, 582988, 683306, 706386, 631939, 562365, 534629, 482423, 511138, 562347, 575430, 661393, 736797, 736439, 754100, 715236, 665862, 735606, 720733, 720512, 638936, 602713, 759439, 849023, 843387, 855650, 855220, 758913, 734188, 820701, 898028, 989986, 1048523, 1053132]
18564A053132n1534j05751j190R6191m2833L014M5276J07684O2042j1361M4388
18553A199058L1321L1804L0652p832l772R5471J46466K3754l157P8508J02648
18542A724921J09610R8123P6902P8083J26822J18586J03264J55228J68764J19244
18532B879547J54536J33106J77752J48387J78454K28564K29450K12724J81609
18523D524129J66248J73808K32076K77545L64986M58157M74718N38177N96369
18514G806213O84969Q62489J039656J319223J559111J899377K441774L122884
18506B0735696M011804N051435O206854P353470Q326355Q797969Q487436P602882
18498G6573901O918582O425772O413182O549295O107763M783158K546777j09862
$$ y = [1053132, 1001598, 895847, 894657, 990848, 948015, 951029, 996305, 1103989, 1166031, 1154670, 1199058, 1230379, 1262183, 1292835, 1285003, 1281231, 1376702, 1523168, 1546922, 1543765, 1622273, 1724921, 1834531, 1932654, 2009556, 2087639, 2214461, 2333047, 2436311, 2591539, 2760303, 2879547, 3034083, 3167189, 3344941, 3493328, 3671782, 3900346, 4129796, 4342520, 4524129, 4690377, 4864185, 5096261, 5373806, 5738792, 6196949, 6671667, 7209844, 7806213, 8491182, 9353671, 10393327, 11712550, 13271661, 15171038, 17612812, 20735696, 24747500, 29798935, 36005789, 43359259, 51685614, 60483583, 68971019, 76573901, 83492483, 89918255, 96331437, 102880732, 108988495, 113771653, 116318430, 116208568]
18490A16208568k686779m406542n291564n465438n544044o039439o931459q020204
18482G1823099q647057q738440q186522p163812n925622m834538l860590l118617
18474B1347901k537813k081566j736193j535017j226781r97954q58450p80416
18466I593711o05088n36650o38285n68766m22061l47969l59541l15522j44304
18457E655525k10651l08267l65736l09903j99847j90367j87250j90954k41802
18448C450748k28799k43099k44253j87618j64019j24873r5124j04678j45446k02225
18438A710614j33830l8009n6904k3958k2420l4763n6162q3656j9368J1757q7816
18427A165485j25480m982k4594p3594k1966l2474K9930m5382o3522r3537r1872
$$ y = [116208568, 113521789, 109115247, 103823683, 98358245, 92814201, 86774762, 79843303, 71823099, 63176042, 54437602, 46251080, 39087268, 33161646, 28327108, 24466518, 21347901, 18810088, 16728522, 14992329, 13457312, 12230531, 11232577, 10374127, 9593711, 8988623, 8451973, 7813688, 7244922, 6822861, 6474892, 6115351, 5799829, 5655525, 5444874, 5136607, 4770871, 4460968, 4261121, 4070754, 3883504, 3692550, 3450748, 3221949, 2978850, 2734597, 2546979, 2382960, 2258087, 2162963, 2058285, 1912839, 1710614, 1576784, 1538775, 1481871, 1457913, 1435493, 1400730, 1344568, 1260912, 1241544, 1253301, 1165485, 1040005, 1035023, 1010429, 936835, 914869, 882395, 912325, 866943, 803421, 709884, 618012]
18416F18012j0881k9447O7845J94317O2057N2326P4956m8135m7168o0815m8566
18405H24501k6420M4276R9887r087m2162K9567k5961n9093m1435j3681j2506k2360
18393G45526K9829J2036q8347L3408j04696p9556J3957j3028o1349K0855M7934
18382E56569P050J39944Q6139N7137M7378P7495N8041M7961P0259N3873o5647
18371A136199N9315J38574K1708l3027o0226j43437l1863K4293j13702m7834Q2496
18360A032496J5631j1299L2758l8460l0323l789J0657j8188n9222j74511j0207
18349G45543J2593o9179p543J7155m9134q1337p0102P178l8303K0458N1363R2640
18337F31332J1334Q930r997j3495J7079O6216r0638j08513j5458q376R4410J26882
$$ y = [618012, 607131, 577684, 645529, 839846, 901903, 954229, 1029185, 981050, 933882, 873067, 824501, 798081, 842357, 942244, 933157, 890995, 920562, 894601, 835508, 794073, 780392, 767886, 745526, 775355, 787391, 699044, 732452, 627756, 548200, 562157, 549129, 487780, 508635, 556569, 563619, 703563, 789702, 846839, 894217, 971712, 1029753, 1077714, 1147973, 1201846, 1136199, 1195514, 1334088, 1355796, 1322769, 1262543, 1119106, 1087243, 1111536, 997834, 950000, 1032496, 1048127, 1036828, 1069586, 1031126, 1000803, 997014, 1007671, 989483, 930261, 755750, 745543, 758136, 688957, 681414, 698569, 649435, 568098, 497996, 505174, 466871, 487329, 538692, 631332, 642666, 651596, 641599, 628104, 645183, 711399, 620761, 512248, 496790, 488414, 582824, 709706]
18325G09706Q7524J39902J10179N337q9835m9464o2731p6735q9632l3295j48877
18314E02079j34323l0313m150K6074N7921N4110n4528o5064L549P3605k9472j13735
18302B85753J5974k3082J768M4569k4359P3891Q7663n9192J00024M2833p538J2239
18290E50543k9279n9654J8127m1780k2770j4799p3678j1975K7594R074M0297P2993
18278D64693J10036R5333L4514p473k7782o6247j24550m0698j4463k5764N4202
18267D51801J55079J3359l7660l2475j38977j50178J8142K8990k778M0212l2345
18256C13170o7490O881J20737N3232M8233J0561j9679o8994J1048L7870K8080
18245D73649R097j9267M0749l9145j33377J5501O2625Q3295k5841N2127j2740
$$ y = [709706, 797230, 937132, 1047311, 1052648, 962813, 913349, 850618, 773883, 684251, 650956, 502079, 367756, 337443, 333293, 359367, 417288, 471398, 416870, 351806, 355355, 428960, 399488, 285753, 301727, 278645, 280413, 324982, 300623, 374514, 462177, 402985, 503009, 545842, 538304, 550543, 521264, 461610, 479737, 437957, 415187, 400388, 326710, 314735, 342329, 351403, 391700, 464693, 574729, 670062, 704576, 697103, 669321, 603074, 478524, 437826, 423363, 397599, 451801, 606880, 620239, 582579, 550104, 411127, 260949, 279091, 308081, 305303, 345515, 313170, 245680, 252561, 373298, 426530, 474763, 485324, 465645, 396651, 407699, 445569, 473649, 482746, 463479, 504228, 465083, 331706, 347207, 409832, 493127, 467286, 519413, 506673]
18234E06673j28546o4706M6492K6772r4162m7178k1822P207J6574K5389k0382
18223B52311k5962M9644Q5187K6333K3389L0458J06910m4821q5908l7548r488
18212C70505j33613o2416P7114J4154M5618L4450l9090K499N4303M5932J30934
18201E40390l6442K721j22159j02958k979J47854K8794j2427M6480N8015L4185
18190E81474L3299K0021o8527p1713K9463P3107J29415N2594K5731k2979o3759
18179G18126K9293m273l2721O3606J562J3871N5732K0209N0631k0111m5631j956
18167H48338N1052q9830j58702k6347Q0481R7202M175m3650k5181J1184k6120
18156G22602q878j08159J664N0586N875o8071k0685J8992K0651k284M0761N7810
$$ y = [506673, 378127, 313421, 359913, 386685, 292523, 245345, 223523, 230730, 247304, 272693, 252311, 226349, 275993, 361180, 387513, 410902, 441360, 548270, 503449, 417541, 379993, 370505, 236892, 174476, 251590, 265744, 311362, 345812, 306722, 309221, 363524, 409456, 540390, 503948, 506669, 384510, 281552, 278573, 426427, 455221, 442794, 489274, 547289, 581474, 614773, 634794, 566267, 494554, 524017, 597124, 726539, 779133, 804864, 781885, 718126, 747419, 743146, 710425, 774031, 775593, 789464, 845196, 865405, 916036, 895925, 850294, 848338, 899390, 809560, 650858, 624511, 704992, 802194, 806369, 762719, 737538, 748722, 722602, 713724, 605565, 607229, 657815, 663690, 595619, 574934, 593926, 614577, 612293, 653054, 710864]
18144G10864O1367J3423j7337k2538K8873O1071K4878m766k6943k3390O4766O9164
18132I39432M9860J26590K10336K08517J45717J34095P6545R4031O7991L8044
18122B091158O3933J94165K75982L21963L08372N23426P12111P54083R86784J480470
18112G712447K127709L148648N123270R435738J9594832M1859048O0824455K6512205
18104A76338352k5098381m3259740m2426294k5798374j3120440p151596m272904
18097A5210623k759696j826226j364835j132654r22378q71212p16122n44212m42253
18088D631035l89836l30377k46806k10276k79957k76946k21167j79194j27643
18079B368833p3144r8691p6744q4507j75331k03515k14104k32806j09983k7357
$$ y = [710864, 772231, 785654, 768317, 745779, 774652, 835723, 860601, 855835, 828892, 805502, 870268, 939432, 989292, 1115882, 1326218, 1534735, 1680452, 1814547, 1891092, 1985123, 2053114, 2091158, 2155091, 2349256, 2625238, 2947201, 3255573, 3778999, 4491110, 5245193, 6231977, 7712447, 9840156, 12988804, 18112074, 27547812, 47142644, 89001692, 149826147, 176338352, 151239971, 107980231, 65553937, 39755563, 26635123, 19483527, 15210623, 12450927, 10624701, 9259866, 8127212, 7204834, 6333622, 5617500, 5073288, 4631035, 4241199, 3910822, 3664016, 3453740, 3173783, 2896837, 2675670, 2496476, 2368833, 2295689, 2196998, 2120254, 2035747, 1860416, 1656901, 1442797, 1209991, 1100008, 1072651]
18069A072651n4659p7555l335J2081p0024q8796l0231J870j33672n1270N0698
18058F27758p897m1091j9215n255p3961L758J9453Q0902N7386l3757n8119r6578
18046D53384q3801n9931n1995M6548j2385k1046l8131K9815n1619J3880O4840
18035B89559O1008N5151N7479P2039M5249k2162j7322O989o84q473p5868j54071
18023C08894n8255k2601N9313N5006O0014k9559K3596M1132j7276m9431j4992
18012C55841P6042o4473l9211m5841k1182O3600k9363L5828L8697k340J1214J7967
18000C96779J2055j0955N3679k589r341L7443k9914k9935o297k858m9635Q867
17988C67299M1093m3716k0003R8811J29863P5928j07712j7205N4556q2539j26867
$$ y = [1072651, 1017992, 940437, 937102, 949183, 879159, 790363, 760132, 762002, 628330, 577060, 627758, 619861, 578770, 559555, 554300, 480339, 484097, 503550, 584452, 641838, 608081, 549962, 453384, 369583, 309652, 257657, 304205, 291820, 270774, 232643, 262458, 210839, 224719, 289559, 350567, 405718, 463197, 535236, 580485, 558323, 541001, 547990, 547306, 538833, 462965, 308894, 250639, 228038, 287351, 342357, 402371, 372812, 396408, 437540, 420264, 370833, 355841, 431883, 367410, 328199, 282358, 261176, 324776, 295413, 331241, 369938, 367598, 378812, 396779, 408834, 397879, 451558, 448969, 439628, 477071, 447157, 417222, 410925, 408067, 358432, 367299, 408392, 364676, 344673, 443484, 573347, 649275, 541563, 524358, 578914, 496375, 369508]
17977C69508r8135O5104O3716K5788M828n4732P1471J1743n2392q0842Q570K5557
17965C60184K7389n4624m4874j1061O4441P7678Q7123j6747m3404J9666Q518n309
17953D68980l5467K81M8090K7451M5201O9112l4639o5945n851N5771L9574j4186
17941E98372M1622J5099O3333P6929O0074k0240O8623J54551J63361R2274K0752
17930A334750p3217m5811Q527o0226j48292j33704q2377p7443l1549J5411q189
17919F97880J14582Q5749N3076j43105p6273N831p44K7514m029j8879N2075J39963
17907I33640q1450k10713M580J49332J54490m5556m6527k7698n1100J272M0812
17896H21082J06119R3947R068j9354j7720J320r807j8391p7170J3881O6868J2364
$$ y = [369508, 271373, 336477, 400193, 425981, 430809, 376077, 447548, 459291, 406899, 326057, 334627, 360184, 387573, 332949, 288075, 277014, 341455, 419133, 506256, 489509, 446105, 465771, 474289, 468980, 433513, 433794, 481884, 509335, 554536, 623648, 589009, 523064, 517213, 572984, 612558, 598372, 639994, 655093, 718426, 795355, 855429, 835189, 903812, 1058363, 1221724, 1313998, 1334750, 1261533, 1215722, 1224249, 1164023, 1015731, 882027, 799650, 722207, 690658, 706069, 697880, 812462, 898211, 951287, 808182, 731909, 737740, 736996, 764510, 760481, 741602, 793677, 933640, 852190, 641477, 646057, 795389, 949879, 904323, 857796, 830098, 778998, 780270, 821082, 927201, 1021148, 1030216, 1010862, 993142, 994462, 984655, 966264, 889094, 902975, 969843, 982207]
17884I82207J4217J17850O8522Q533P2735K75078J67637k3241p4701r8480j56900
17873A353457o9560J4075m224j3975j20160q7062J4507O9603M4247m7700p8068
17862A075140j43835l2543J2585O2315J13445L2048o7483N4642J0608K5051N3854
17851A195827O482m8271O1632O9213p564N2319J17344R2149M0035J02103M8435
17840A729704O2447J72819J44352L7314P0436Q8087J22237J7150K0402J2841J5151
17829B492940O2176J18835P5609L1074j1280N30r655n1973k3532q546J74564J72162
17817C022904M0269J17463P2216l4793P067Q2213J82540J46477P7774K16477J01155
17806D031762J01057R4255K29375J86511J94173J32267K31041M04746M58699N66083
$$ y = [982207, 996424, 1114274, 1182796, 1191329, 1264064, 1539142, 1706779, 1683538, 1608837, 1510357, 1353457, 1283897, 1297972, 1293748, 1279773, 1159613, 1072551, 1087058, 1156661, 1200908, 1153208, 1075140, 931305, 898762, 911347, 973662, 1087107, 1119155, 1051672, 1106314, 1116922, 1141973, 1195827, 1202309, 1154038, 1215670, 1284883, 1277319, 1329638, 1446982, 1539131, 1579166, 1681269, 1729704, 1792151, 1964970, 2109322, 2146636, 2217072, 2305159, 2427396, 2444546, 2464948, 2477789, 2492940, 2555116, 2673951, 2749560, 2780634, 2769354, 2769884, 2760229, 2708256, 2684724, 2676178, 2850742, 3022904, 3063173, 3180636, 3252852, 3218059, 3225126, 3307339, 3489879, 3636356, 3714130, 3930607, 4031762, 4132819, 4227074, 4456449, 4642960, 4837133, 4969400, 5200441, 5605187, 6063886, 6629969]
17796F629969N71785P66371R55954J122169J504875J908679K454268L449078M761310
17787B4124458O664824R283085J2329523J4209316J3009355Q568822L960200K737350
17779I4886933N934461J1185760J4361780J2174398M648157m821665j1266191
17772A27103633j2374644q523786l596875j901686m907442r962288j3465890j3842590
17764E8528432j1857835r030678o700591m977694l685934k837769k238797j772927
17756A5426207j459279j135292q97947p91200p73824o55110n07102m25119n48406
17747H232928n09665m28948l66278l82608k26298j92201k71327l38708k38422
17738E278473j88379k35896k41475j93127j63651j42837j01863j01922q4558m6311
$$ y = [6629969, 7201754, 7968125, 8924079, 10046248, 11551123, 13459802, 15914070, 19363148, 24124458, 30789282, 40072367, 52401890, 66611206, 79620561, 88189383, 92149583, 94886933, 100821394, 112007154, 126368934, 138543332, 143191489, 138369824, 127103633, 114728989, 106205203, 102608328, 100706642, 95799200, 85836912, 72371022, 58528432, 46670597, 37639919, 30939328, 25961634, 22275700, 19437931, 17199134, 15426207, 13966928, 12831636, 11933689, 11142489, 10368665, 9713555, 9206453, 8781334, 8232928, 7723263, 7294315, 6928037, 6545429, 6319131, 6126930, 5855603, 5516895, 5278473, 5090094, 4854198, 4612723, 4419596, 4255945, 4113108, 4011245, 3909323, 3824765, 3778454]
17728C778454k039r0009j18624r8649l5606R5128J82618L9895L3502J68947J81302
17717D134919L32332K82973K83508K87259L01159L79870N14354P62600J058643
17708H337617J524958J604128J411265J831197K163658J205070N0933l15787l46061
17699A7466978l67319l66904J47225R34048K182819M551053Q472582J4347223
17691D7367705J8233896J6637684J7536032K3260540K0488832N894873l160550
17684A46259012o175834r870629j6182464j8500271j6580449j1666140o865103
17677F0418122l982110k488542J75143K450769M68525l508603n156129n410951
17669D2966224n875292o159045n800741m604897l138619j940193j083842m74305
$$ y = [3778454, 3776415, 3686406, 3567782, 3469133, 3433527, 3528655, 3711273, 3751168, 3784670, 3953617, 4134919, 4467251, 4750224, 5033732, 5320991, 5622150, 6002020, 6516374, 7278974, 8337617, 9862575, 11466703, 12877968, 14709165, 16872823, 18077893, 18128826, 17813039, 17466978, 17099659, 16732755, 16879980, 17814028, 19996847, 24547900, 33020482, 47367705, 65601601, 82239285, 99775317, 123035857, 143524689, 149419562, 146259012, 140083178, 130212549, 114030085, 95529814, 78949365, 67283225, 60418122, 56436012, 53947470, 54122613, 56573382, 57041907, 53533304, 48377175, 42966224, 37090932, 30931887, 25131146, 20526249, 17387630, 15447437, 14363595, 13889290]
17661A3889290k33200q2894M683K0168R4888L13955N65374J016624J825896L427470
17651B0842254N397038O359765N798912O223310P707082O042414J194781j347644
17643E8217912j248989k95490J449956M489525Q549169J4988288K3041808K4841740
17635A34033919J7962126J5545782J6576628O489187j2764918k1258275k2177220
17628A34407229k2734859k3917519k1957028j7414810j1417713o678416l575154
17621B6711730j412408k38640P3017K67863Q47999N49081j229730k387115k399476
17612B0782321k358546k600405k649719k250295j634860j079111o50821n93905
17604F964659n91509n73066n60520m84611m39723m47993l98665k99355l19420
$$ y = [13889290, 13656090, 13573196, 13577879, 13598047, 13692935, 14006890, 14572264, 15588888, 17414784, 20842254, 26239292, 32599057, 38397969, 44621279, 52328361, 58370775, 59565556, 58217912, 56968923, 56673433, 58123389, 62612914, 71162083, 86150371, 109192179, 134033919, 151996045, 167541827, 184118455, 190607642, 177842724, 156584449, 134407229, 111672370, 87754851, 65797823, 48383013, 36965300, 30286884, 26711730, 25299322, 25060682, 25133699, 25401562, 26249561, 26798642, 25568912, 23181797, 20782321, 18423775, 15823370, 13173651, 10923356, 9288496, 8209385, 7558564, 6964659, 6373150, 5800084, 5239564, 4754953, 4315230, 3867237, 3468572, 3169217, 2849797]
17595B849797k64138k41411j36562k4165j06716j02062n2472j36097j55335r4366
17585A536473q7331n3805o6006o9122p5367p5880p8405R0901L7092m2850j05875
17574A009825m6142m8886K167p372l8975j23313j4783J5397J04439M3744m0161
17563H55940o3301n0806O1225j474L326K8116P4030l6509M0676J6382N8641L7286
17551A023532k72o72O2911p5568q1689Q3455J21772k2988M1398l7064M2006O0418
17539A217239Q1543J39712K7496M3198J61269J55118Q9505J13167J58696O1949
17529B248892L7776J34259K76085J49127K88413L08120K52121K59418J97885J57319
17519D309415J61797L19000M87745N86221O71360O11143P03614P84567J037524
$$ y = [2849797, 2585659, 2344248, 2207686, 2183521, 2076805, 1974743, 1922271, 1786174, 1630839, 1536473, 1449142, 1395337, 1329331, 1260209, 1184842, 1108962, 1030557, 1121458, 1158550, 1115700, 1009825, 963683, 914797, 916964, 909592, 870617, 747304, 732521, 747918, 852357, 896101, 855940, 792639, 741833, 803058, 801584, 804910, 833026, 907056, 870547, 911223, 927605, 986246, 1023532, 1023260, 1022588, 1085499, 1009931, 928242, 1011697, 1133469, 1110481, 1151879, 1114815, 1156821, 1217239, 1298782, 1438494, 1465990, 1509188, 1670457, 1825575, 1915080, 2028247, 2186943, 2248892, 2286668, 2420927, 2697012, 2846139, 3134552, 3442672, 3694793, 3954211, 4152096, 4309415, 4471212, 4790212, 5277957, 5864178, 6535538, 7146681, 7850295, 8634862, 9672386]
17510I672386J411115K048434K897947M208796O058251Q772445J2118217J4607818
17502F1795409J3812542R022141K409877j718912j261956M024044J1997336J8554548
17494A18635029J8787151J0143067l350752j4487014j8634410j5500179q386310
17487H7206582j550405J771795p6263n649968j0972811j3286999j2452529r877137
17479C5112265p287208n107452l636063k742424k102941j661784j234414j041015
17471A0298964q38074o81240o56564p24557o78993n08723l74344k33691l33640
17462E269138k97563k46431l12039l04812l39661l72975k00976k61280j75159
17453B758242j58533j14928p8579j89084j87348j77093j73790j66788r0147r0224
$$ y = [9672386, 11083501, 13131935, 16029882, 20238678, 26296929, 35069374, 47187591, 61795409, 75607951, 84630092, 87039969, 85321057, 84059101, 88083145, 100080481, 118635029, 137422180, 147565247, 144214495, 129727481, 111093071, 95592892, 87206582, 85656177, 87427972, 87351709, 81701741, 70728930, 57441931, 44989402, 35112265, 27825057, 22717605, 19081542, 16339118, 14236177, 12574393, 11339979, 10298964, 9460890, 8779650, 8123086, 7398529, 6719536, 6210813, 5836469, 5602778, 5269138, 4971575, 4725144, 4413105, 4108293, 3768632, 3395657, 3194681, 2933401, 2758242, 2599709, 2484781, 2406202, 2217118, 2029770, 1852677, 1678887, 1512099, 1421952, 1331728]
17443A331728o4439P3180J59495J78660J43582j32608k84189l38065j02823j66230
17433G98291j70724r813N4736l1874r94m6590j9080l8994o4241J0631R6835k474
17421E75709o4756J1392n3790k4677j6788K8647m0467n0617q8666M1816R2943
17410D10746K8080l7777j4404L489N66j404j4242N0300m8573j18213n4676j8831
17398A85061j162M0071m2692M0536P8292Q101l2424n230k7990l9797K8014n943
17386B24837o9753J2975R7640K8583j00897k8922l2287L0038J12688Q7372J7689
17375C79963k4180r2474J0084J7801q198j6457k3884M4149o3909o5450N5599J5051
17363B28095N2958p7540j2243q884j00493l5267N2617P8291K8783k2709O309n4662
$$ y = [1331728, 1267289, 1340469, 1499964, 1678624, 1822206, 1689598, 1405409, 1067344, 964521, 798291, 627567, 617754, 672490, 640616, 639622, 593032, 573952, 534958, 470717, 481348, 578183, 575709, 510953, 522345, 468555, 443878, 427090, 455737, 415270, 364653, 275987, 317803, 410746, 438826, 401049, 386645, 390134, 390700, 389296, 375054, 425354, 376781, 258568, 203892, 185061, 183899, 223970, 181278, 221814, 300106, 308207, 275783, 270553, 242563, 202766, 230780, 224837, 155084, 168059, 265699, 294282, 193385, 164463, 132176, 162214, 274902, 362274, 379963, 355783, 263309, 273393, 291194, 282996, 266539, 242655, 286804, 222895, 157445, 213044, 228095, 281053, 203513, 191270, 182386, 81893, 46626, 99243, 177534, 206317, 183608, 189917, 135255]
17351A35255L0628Q2829L0713L7346n1429r21L2679n8549m2121r0155J2642q0033
17339C8884L0594Q1809J23971K451q172l8940l0196n3796K4220r5081Q5803O8591
17327B30138M1402K5617n468l5814J018M9226j0364Q451j1834m0866j314L6900
17315B87092o8671k5413o1107p4842j096n1083o6064j5004Q0112O7287o465M9398
17303A14144l7190n1753m840L9513P8711R6544j5752k6656L2896P2992r4991j8
17291B03600k7213o0911P822q9J6833o0589P7395J9831N3146N0067k4182o3910
17279A91800k0803l6632k009N6620Q402m9541K6667n397n5647O6146Q8773J08238
17267C76617q143j88696j7314P4764L0166M3883N5067n3128m7182K7545R9863
$$ y = [135255, 165883, 248712, 279425, 316771, 265342, 264421, 297100, 238551, 196430, 106275, 118917, 38884, 69478, 151287, 275258, 277709, 269537, 230597, 200401, 146605, 170825, 75744, 161547, 230138, 271540, 297157, 291689, 255875, 256893, 306119, 295755, 304206, 292372, 251506, 250192, 287092, 218421, 193008, 131901, 57059, 55963, 4880, -61184, -76188, 3924, 71211, 64746, 114144, 76954, 25201, 20361, 59874, 138585, 235129, 219377, 192721, 225617, 298609, 203618, 203600, 176387, 115476, 123298, 123209, 140042, 79453, 156848, 176679, 229825, 279892, 255710, 191800, 170997, 134365, 132356, 188976, 197378, 147837, 174504, 169107, 113460, 179606, 268379, 376617, 368474, 179778, 162464, 237228, 267394, 311277, 366344, 313216, 266034, 293579, 393442]
17256C93442k0534n0945o3929k4309P1806k8318n8080J33684J13836m4979m715
17245D16959N8301p3894L069J7355m4896L9387j612L7432L8919J22770n6072j2002
17233E45716O9329m162O2920j0785q6663k2k5224j7550j8171M648l9353N180J36952
17220F22815O9004N1215M8354Q4553l4231j0748L5076O658r403J14943J08074
17209A086310j6507l2443L6728j9236K5045O6815l0782J8906J12741J10295N4443
17198A412315J28811J32621J5266j0987m349o4320M9818K0338O8693J57373J61273
17187B066852K09800L01396M99779P13917P89015R72110R67166R59184R32959
17178H412178J309923K246161L678099M725137M644606K460513o73022k961748
$$ y = [393442, 372908, 321963, 258034, 233725, 305531, 277213, 219133, 352817, 466653, 421674, 416959, 475260, 401366, 404435, 421790, 376894, 416281, 414669, 452101, 491020, 613790, 557718, 545716, 615045, 610883, 673803, 663018, 576355, 576333, 551109, 533559, 515388, 520036, 480683, 485863, 622815, 691819, 743034, 791388, 875941, 841710, 830962, 866038, 872696, 863293, 978236, 1086310, 1069803, 1037360, 1074088, 1054852, 1079897, 1146712, 1115930, 1134836, 1247577, 1357872, 1412315, 1541126, 1673747, 1689013, 1678026, 1673677, 1609357, 1659175, 1679513, 1748206, 1905579, 2066852, 2276652, 2578048, 3077827, 3791744, 4580759, 5552869, 6520035, 7479219, 8412178, 9722101, 11968262, 15646361, 20371498, 25016104, 27476617, 26803595, 23841847]
17170B3841847l544511k585250j127938J25798J199971K190490L723316N888875
17162B9712598R801387J7507909L0191804M4023641N0832425M0176245J4315904
17155B36561913j1702047l0047694l6461417l5467306k9416923k1784536j3809198
17148E7872792o822775n61201M884851Q592483Q858727L853743m299942j0656706
17140F1721972j3042166j1564164q516430n701923l577914k104924j176755o75849
17132A5361847n20808n43032m67665k54022j0175J27687J80320O436m0588L27884
17122A4167884J009110K249965M372355P477923J0903482J2347820R015131J943557
17114F3487227m632190p879420o888892l346106J479384P365999J3866430K0105951
$$ y = [23841847, 20297336, 17712086, 16584148, 16709946, 17909917, 20100407, 23823723, 29712598, 39513985, 57021894, 87213698, 131237339, 182069764, 222246009, 236561913, 224859866, 194812172, 158350755, 122883449, 93466526, 71681990, 57872792, 51050017, 50488816, 55373667, 63966150, 72824877, 76678620, 72378678, 61721972, 48679806, 37115642, 28599212, 22897289, 19319375, 17214451, 16037696, 15361847, 14841039, 14298007, 13830342, 13576320, 13566145, 13693832, 13874152, 13880588, 13840000, 14167884, 15176994, 17426959, 21799314, 29277237, 40180719, 52528539, 61543670, 63487227, 58855037, 50975617, 44086725, 40740619, 42220003, 49586002, 63452432, 83558383]
17106H3558383K5040612K8918888K9028294K1328466K265920k0770211l4535710
17099A34834642l7189686k9640619k0154402j2427313p462077m794594l294637
17092A9871314k215036j293337m10720O52247J686944K343335J930157j49084
17084B2415820k321300l485690l461339k561833j742730j082654p24810n04556
17076F530908n23774m66856l33179k64618k72483m16969m41672m05527m34215
17067B971615l02245j79139j12444k1808j0873m1643j34121j83034k32662j56898
17057A596748j21937j83219j48489j00380j43010j17297p1175L7431k6256n7214
17047F65202O578r899p4862k11j14227j15359k5445q8247Q5713J21876K8971p6213
$$ y = [83558383, 108598995, 137517883, 166546177, 187874643, 190140563, 169370352, 134834642, 97644956, 68004337, 47849935, 35422622, 27960545, 23165951, 19871314, 17656278, 16362941, 15952221, 16604468, 18291412, 20634747, 22564904, 22415820, 20094520, 16608830, 13147491, 10585658, 8842928, 7760274, 7035464, 6530908, 6007134, 5540278, 5207099, 4942481, 4669998, 4253029, 3811357, 3405830, 2971615, 2669370, 2490231, 2377787, 2355979, 2345106, 2303463, 2169342, 1986308, 1753646, 1596748, 1474811, 1291592, 1143103, 1042723, 899713, 782416, 711241, 748672, 722416, 665202, 671780, 661881, 587019, 586808, 472581, 357222, 331777, 243530, 329243, 451119, 480090, 403877]
17035D03877q4800l3636r2817k2735n3886j6635O0679j1215p5383k99l7234J7299
17023E3215O5476J37971Q8626j4758k3441j07503p4441p8969p7286K1940J50541
17012A41371J20979L8016L5987P419O7291K00182L8515j57013j84450m0257m2992
17001B25048j14201M9642k9836K4573j3146j09012j9934n2013m0746p749M0264
16990d7110L4295j5890K5208j2471n2426O5700M6229L0661P8220l2250p4645Q92
16978D6413m9692k2603m717q6394j05113J1782N2866P3746l0806K0433K4617o6534
16966a36002q0419M8371n1244l6218r9825K5824R3253J8743J17095P473r0424
16955a83373j8976J15871O0842l2997L3228r8827k8929N4165l3831k1712l3425
$$ y = [403877, 319077, 285441, 192624, 169889, 116003, 99368, 160047, 148832, 73449, 73150, 35916, 53215, 118691, 256662, 345288, 330530, 307089, 199586, 125145, 46176, -31110, -9170, 141371, 262350, 300366, 336353, 343772, 411063, 611245, 649760, 492747, 308297, 268040, 225048, 110847, 160489, 130653, 155226, 142080, 33068, 13134, -38879, -79625, -87374, -47110, -12815, -28705, -3497, -15968, -68394, -2694, 43535, 74196, 152416, 120166, 45521, 46413, -3279, -25882, -30599, -116993, -222106, -210324, -157458, -83712, -114518, -94085, -69468, -136002, -216421, -168050, -219294, -255512, -355337, -329513, -236260, -217517, -100422, -92949, -183373, -202349, -86478, -25636, -58633, -25405, -124232, -153161, -98996, -132827, -154539, -187964]
16944a87964l4421k558O4815J0414j8950Q4075j8895P097m4067j30056k5725P4776
16932b21459L7673J8347L9671R205K8594j542m7924j13378p8529O771O3135J53730
16920a05706P337k5505m9656L4087l2947k2039Q3393M8143O3607k6824k3506n3682
16908a03298k1558Q3599J03224Q1785L6020J38518J22944N4356m4603r8784k1637
16897C30566R8156P7413O2093P7839l6775k0921l8366j7131j54595o8653m640
16886C04986M72j4203K5657j4448p6638j47704j03435j18233p6125P1R8615J8051
16874a02934n996j4219M6555j8033r6646m4867L8446R3119m126o1495r0027k7880
16862b88103m805J17604Q2593k3806R132k479j2677l401J3661k1332m9640J0522
$$ y = [-187964, -222385, -224943, -160128, -149714, -168664, -84589, -103484, -96387, -140454, -270510, -296235, -221459, -183786, -165439, -125768, -116563, -87969, -89511, -137435, -250813, -329342, -322571, -259436, -105706, -98369, -123874, -173530, -139443, -172390, -194429, -111036, -62893, 714, -26110, -49616, -103298, -124856, -41257, 61967, 143752, 179772, 318290, 441234, 495590, 450987, 352203, 330566, 428722, 506135, 568228, 646067, 609292, 588371, 550005, 532874, 378279, 309626, 304986, 305458, 291255, 316912, 302464, 225826, 78122, -25313, -143546, -219671, -219600, -120985, -102934, -108930, -123149, -76594, -94627, -191273, -236140, -197694, -104575, -108701, -170196, -260223, -288103, -292908, -175304, -92711, -116517, -107385, -109864, -122541, -125942, -112281, -133613, -183253, -172731]
16850a72731m541L3145J31000P6671m789r4733q0483K0474q6890q0356L0147M4321
16838a88765l1365L6665K3894l8753L5919K369o7326n2999k7805K3657P7269P1133
16826a36107J2553o3147m7864R6501O0678n7926q016j5893q8557p9475k6425J5054
16814c38624j7882J07713q401l2582Q072J05483K1640o2432M8450Q551n6631M3139
16802a73504J1825l0969k3111P0528j7449N2284K3559j8971p0663n5583R3207
16791a38847O1524P074O672p2144n7134k3193P2860Q2231M4631o4621m1794o1499
16779a84240k2120m3218m8480o3047P5470P9870l7595p5825R209L8617N3129K787
16767b15443n6127l0291J1521K9221M9636J46082Q024r154l9317n5093l0416L7787
$$ y = [-172731, -177272, -144127, -13127, 63544, 58755, -35978, -116461, -95987, -182877, -263233, -233086, -188765, -220130, -183465, -159571, -198324, -162405, -160036, -227362, -280361, -308166, -284509, -207240, -136107, -123554, -186701, -234565, -138064, -77386, -135312, -143328, -159221, -247778, -327253, -353678, -338624, -356506, -248793, -257194, -289776, -281704, -176221, -154581, -217013, -168563, -160012, -216643, -173504, -161679, -192648, -215759, -145231, -162680, -110396, -86837, -105808, -176471, -232054, -138847, -77323, -70249, -63577, -135721, -192855, -216048, -143188, -60957, -16326, -80947, -122741, -184240, -206360, -249578, -298058, -361105, -285635, -205765, -243360, -319185, -309976, -271359, -218230, -215443, -271570, -301861, -290340, -261119, -211483, -65401, -57377, -66531, -105848, -160941, -191357, -153570]
16755a53570k4369k2983p2793j5433R7773J20915j0644j9880j7883p2606R3885
16744i7588J9433m1979j26872p0905K7314J03254M3830p320R2264l7391r4005
16733a89965n6215J4678Q1052R8171R8155M7064j18384r2596J3008k6807M991
16722a26848M7757L7234Q198j4273R0379Q9866j8242j27576k1437L4046j1297
16711a2193j836m0513p5350r677N8908M5745o8128m5162O198L1325K3696O6623
16699b0364O3256L0738j6381k4250n5189R721M954L2648Q032m0751J812L8508
16687C2734n3430j33121k6800K258P0656k1273J8761J14462K5271q472p1747m1038
16675i1739J03004M4142l7935o1955R029j029R7695J70128J71668R4097k7826
$$ y = [-153570, -177939, -200922, -273715, -289148, -191375, -70460, -81104, -100984, -118867, -191473, -97588, -78155, -120134, -247006, -317911, -290597, -187343, -143513, -150833, -58569, -95960, -189965, -246180, -231502, -150450, -52279, 45876, 92940, -25444, -118040, -105032, -131839, -126848, -79091, -41857, -33659, -47932, 42447, 132313, 114071, -13505, -34942, -896, -12193, -14029, -54542, -129892, -139569, -80661, -34916, -103044, -148206, -142008, -110683, -86987, -20364, 42892, 73630, 57249, 32999, -22190, -12469, -7515, 25133, 33165, -7586, -5774, 32734, -20696, -153817, -180617, -178359, -107703, -128976, -110215, 4247, 29518, 21046, -50701, -91739, 11265, 55407, 17472, -44483, -35454, -36483, 61212, 231340, 403008, 497105, 469279]
16664D69279n0104P9965J17569K7529p898j32505j16774k265l6582j9223m1041
16653B87950P3858L1471N3280m3293K4600m7619j07494m8941p1825k1012N744
16642A36719l2498P770k9075j06622m4857P1955J12798P2522n1477j3587N1381
16631A75029n6699m1892k767J5112R941p0113j3209L2066n215n1955O1254J54683
16619B06235L5917L4669J55844J9399l4313l2087m2810P7396M1667l4451n1473
16608C75993j62995l6275l1917n4814l1038q4539L021l0462m6399M854N6048J61859
16596A23336J42044K1767J3703m1901l124q2294j64209j69841n4903M1696j2637
16585a86363k6673K2290k8447j0774N5115j5366l2351q471J763J0016l1953P4045
$$ y = [469279, 419175, 499140, 616709, 644238, 636340, 503835, 387061, 384796, 348214, 328991, 287950, 361808, 393279, 446559, 403266, 427866, 380247, 272753, 223812, 151987, 130975, 136719, 104221, 111991, 82916, -23706, -68563, 3392, 116190, 188712, 137235, 123648, 175029, 118330, 76438, 73671, 88783, 98724, 28611, 15402, 47468, 42253, -9702, 51552, 206235, 242152, 276821, 432665, 452064, 417751, 385664, 342854, 420250, 461917, 427466, 375993, 212998, 176723, 144806, 89992, 58954, -25585, -22564, -53026, -99425, -94571, -38523, 123336, 265380, 287147, 300850, 258949, 255825, 173531, 9322, -160519, -215422, -173726, -186363, -213036, -190746, -219193, -229967, -174852, -190218, -222569, -231040, -229277, -219261, -251214, -177169]
16573a77169Q3965L4551j951o021J7932j5038j5588R818j5249K4721J16226O2991
16561A19188j23153j24067l0521K7511P1717l6096l3140P059M7728M1030m5116
16550g7860m8662K5789p578K6293O481J1222M4826k0126N308R8880o3134r7388
16538i5949J0692k5354j045J00007m2927p6207o5112K2701K3790j6152R7226O3331
16526d999N6905l4214k8091k628L784o0104J9842K4090P5l4504m9469N8081O1992
16513A0760J07054M0946p8772j31533q4598j2118O4736L4161o0950J1072l164
16502a02406K1671R30j29m9953j8411K4287K9224L6737N4625K8226n8559l5155
16490f8913k5441K5831k6862Q0604J6427J1074k2807q2078n7590j9318R584m6931
$$ y = [-177169, -93204, -58653, -60604, -66625, -48693, -63731, -79319, -69501, -84750, -60029, 56197, 119188, -3965, -128032, -158553, -131042, -59325, -95421, -128561, -121502, -73774, -32744, -77860, -126522, -100733, -108311, -82018, -75537, -64315, -19489, -39615, -34307, 64573, 1439, -95949, -85257, -110611, -111656, -11649, -54576, -130783, -195895, -173194, -149404, -165556, -68330, -4999, 51906, 17692, -10399, -13027, -9243, -69347, -49505, -25415, -25340, -59844, -109313, -51232, 10760, 117814, 158760, 79988, -51545, -136143, -148261, -83525, -49364, -110314, -99242, -102406, -80735, -79805, -79934, -129887, -148298, -124011, -94787, -58050, -3425, 24801, -33758, -68913, -94354, -68523, -95385, -14781, 1646, 12720, -10087, -92165, -149755, -169073, -159489, -206420]
16478b06420K7892j0647L0128p6918j476L5204N0476l2910L3330K2964N4640j04746
16466a78483M473j2122P455k5734K8352Q0745P2143L5898k1017k6544r958J5125
16454b9667K7504Q217o6004j9831L630n2712l1274O8642J5102r061j4951m4411
16442a44816J29562M9011j24195M8592P0284n194N42N418j2051P1095m7986n5248
16430a4986o27N8783M4855J6452m0223r6106r8109p6268R486Q7423L3584J21661
16418D5925j7668j11201p3835l0111J4431P4817m1397j4459O1573k493n4095M0110
16406a08403P9815m9003j8906M1023o6593K5451l6903j6416L0278j495o586k9631
16394a57369j1599Q6991M2970o2338j2033Q568m2521k8999L6606l586m0977J5165
$$ y = [-206420, -178528, -189175, -159047, -235965, -237441, -202237, -151761, -184671, -151341, -128377, -73737, -178483, -174010, -186132, -178677, -204411, -176059, -95314, -23171, 12727, -8290, -34834, -44792, -29667, -2163, 6054, -59950, -79781, -76151, -128863, -160137, -91495, -76393, -85454, -100405, -144816, -15254, 33757, -90438, -41846, 28438, 23244, 23786, 29204, 17153, 88248, 40262, -14986, -15613, 43170, 88025, 104477, 64254, -31852, -129961, -206229, -196743, -109320, -75736, 45925, 28257, -82944, -156779, -186890, -172459, -97642, -139039, -153498, -91925, -94418, -148513, -108403, -28588, -77591, -96497, -55474, -122067, -96616, -133519, -149935, -119657, -121152, -127738, -157369, -168968, -81977, -39007, -101345, -113378, -104810, -147331, -176330, -139724, -143310, -184287, -169122]
16382a69122o525j7828L1050J0287J3089J3475K5974L4755m1914K2759P9115n829
16370a0714o0786k8778m754M7634K0869K2471J4517k6946j5713k3778l9106m3602
16358a48686j9344M3318N0451O5523m4089N920J1599M9748L7549n0358q4991j01266
16346a84626M989Q187J5963K6557j5732k3962O3744O2085q4266p8761k7007Q0891
16334a51938O7759J2944r787R7206O705l1638R1096R839n1286M7974n2337j9193
16322A7344l4650n7798l2115k5017M9791j5613K2758J0524R6107l547J9071j7867
16310B8988r4640j28K2037q339L9812k5177n892q969k1922O4383m7624o0458j3919
16297a31848J7841o923L7574M7212J7885Q892J589o241j7419N574o5660n6479
$$ y = [-169122, -175647, -193475, -162425, -152138, -139049, -125574, -99600, -64845, -106759, -84000, -4885, -10714, -71500, -100278, -105032, -57398, -36529, -14058, 459, -26487, -42200, -65978, -105084, -148686, -168030, -124712, -74261, -8738, -52827, -46907, -35308, 14440, 51989, 1631, -83360, -184626, -179637, -171450, -155487, -128930, -144662, -168624, -104880, -42795, -127061, -205822, -232829, -151938, -84179, -71235, -81022, 16184, 22889, -8749, 82347, 92186, 40900, 88874, 36537, 17344, -17306, -75104, -107219, -132236, -82445, -98058, -75300, -64776, 31331, 27784, 46855, 28988, -65652, -65780, -43743, -52082, -12270, -37447, -43339, -52308, -74230, -9847, -57471, -117929, -131848, -114007, -120930, -83356, -36144, -18259, -9367, -7778, -14019, -31438, -25864, -91524, -148003]
16285a48003J25126r6216q4982J04603m1584n1087P9821J919p7101L4023M3096
16274a10385r100m7347k5772j2202J748l6836Q1451M0907o4685n5392L0265O1263
16262a46085m1924l1250p887n7197J3365Q5961L085l1382J8911N266P7800n633
16250a16970r7074L0685k1612L7010R4709K585n9037j3152K3139K6879R8662J6401
16238B2225l746J05490L5580j49333j20492O8778n558p2516J03604L5514l3332
16227a3786O1377p3851n918K3255N6225R9589K1462q5540p3533m8275k0686L2752
16215b6929Q2702O0278O8084j01445n2869J4004j6533k2634j2983j2600J690q2200
16203a01435M949m730l830L5212J8527j6168j2618m6537n2803l4543J8664M2207
$$ y = [-148003, -22877, -119093, -204075, -99472, -141056, -192143, -112322, -110403, -187504, -153481, -110385, -119485, -166832, -192604, -204806, -203058, -239894, -158443, -117536, -182221, -237613, -207348, -146085, -188009, -219259, -227146, -284343, -270978, -185017, -181932, -213314, -194403, -189137, -111337, -116970, -214044, -183359, -204971, -167961, -73252, -70667, -129704, -142856, -119717, -92838, 5824, 22225, 18479, 123969, 159549, 10216, -110276, -41498, -47056, -119572, -15968, 19546, -13786, 47591, -26260, -32178, -8923, 47302, 146891, 168353, 82813, 9280, -38995, -59681, -26929, 55773, 116051, 184135, 82690, 29821, 43825, 27292, 4658, -8325, -20925, -19235, -101435, -96486, -101216, -105046, -69834, -51307, -67475, -80093, -126630, -179433, -213976, -195312, -153105]
16191a53105Q7578K0377n1198p817q063O7655M4459k7464N6279J342k5400j1224
16179f581M6Q4762O2815k0299n5109P670k1573M6288r0589p5865k9735l1416K7931
16166a01655o3842J4157M6055O5526j1878M413m0416m2864k8573j8312M0894Q2238
16154e4257J0349k3220M4480k7959p8510K1979M3001O3518R4426p4600O508q3122
16142e7407l7741K6133R516k7439m6838P8128P4412k5400n2052L153M0972M482
16130a0081n5567J3197J08419K8076r1699q4902j11720k3837O1603K1407m7631
16119a92735l1280N5036O7443r395Q4155N6621Q712j19334p7448j9793M9839K222
16107a25957J7419L0698k7733l5667O5150J03277q939K1637j7970k9542K6736
$$ y = [-153105, -65527, -45150, -96348, -104165, -112228, -44573, -114, -27578, 28701, 30043, 4643, -6581, -6535, 78227, 141042, 120743, 65634, 73304, 51731, 98019, 7430, -68435, -98170, -129586, -101655, -165497, -151340, -105285, -39759, -51637, -47224, -87640, -130504, -159077, -177389, -136495, -54257, -43908, -67128, -22648, -50607, -129117, -107138, -64137, -619, 93807, 19207, 25715, -57407, -95148, -69015, -59499, -86938, -133776, -55648, 18764, -6636, -58688, -55535, -14563, -10081, -65648, -52451, 55968, 84044, -7655, -92557, -204277, -228114, -166511, -145104, -192735, -224015, -168979, -101536, -110931, -26776, 29845, 38557, -80777, -158225, -178018, -128179, -125957, -108538, -77840, -105573, -141240, -76090, 27187, 18248, 39885, 21915, -7627, 19109]
16096A9109l7372m2961R0920l8016k8349l5443m1177L6620K5724k792p470l9185
16084a00392J2157O8273l2594J7716J7347j0857p007K4116j27335j0152R9825
16073d8903m763j0672O354K0266K3237l164o7047j01342J4039P2640Q7849J2575
16061A069J2228o4639l6233K0582O939O0491L7044J4391n1851p2742j00356K3108
16049a49969M4481p050J0565M5204K3464l412j7838L8893k5576j4669j3461K7405
16037d1963n4920p346K5434M1608k0767j13530O289J6011N6961R2703k3437J8980
16025c977m6761l1530J4421L8370o1798j8904j800P3404L2828k0351o5475o8540
16013a60113j2614P8207J23944j5890m2376R558N5875R0011o5045j14544R1139
$$ y = [19109, -18263, -61224, 29696, -8320, -36669, -72112, -113289, -76669, -50945, -53737, -61207, -100392, -88235, -19962, -52556, -34840, -17493, -28350, -35357, -11241, -138576, -148728, -48903, -53666, -64338, -57984, -37718, -14481, -17645, -84692, -186034, -171995, -99355, -11506, 1069, 13297, -51342, -87575, -66993, -60054, 437, 37481, 51872, 21, -72721, -173077, -149969, -105488, -112538, -101973, -56769, -33305, -36717, -54555, -15662, -41238, -55907, -69368, -41963, -96883, -104229, -78795, -37187, -57954, -171484, -165195, -149184, -92223, 480, -22957, -3977, -50738, -82268, -67847, -29477, -91275, -110179, -111979, -38575, -5747, -26098, -91573, -160113, -172727, -94520, 29424, 13534, -28842, -19284, 36591, 126602, 61557, -52987, 38152]
16002C8152L9089l5555o2178n0803p784R2630L8768j2879m4479m2711m753k6371
15990g8874k5192L1888M3540N188P1670K8961K3184m8759K5788O1064L8945m6856
15978A30547r6732o0606o848K3959M7951o3942m8717K4416k7645r0712j9995l1029
15966b19353N7419N6209N8468P3828j2856r0704k586P010o0364K2042J32405k7707
15954f189p0758k271R5357N3569l1119L284q19m3009l8991q3206j7845n8506k0230
15941b20733J34362N7854k8414J2895R2641l5777j16101j2942R1805J4805j6120
15930b5725N9475O9659o2503o9767p1975j7684O71R9961n2761j1009O1421P4059
15918E3822j5169n9094l5169K855j9671J0426N9543L3121L387J0979q026l642
$$ y = [38152, 77241, 41686, -20492, -71295, -79079, 13551, 52319, 39440, -5039, -47750, -52503, -78874, -104066, -72178, -28638, -23450, 48220, 77181, 100365, 51606, 77394, 138458, 177403, 130547, 33815, -26791, -33639, -9680, 38271, -25671, -74388, -49972, -77617, -168329, -188324, -219353, -161934, -105725, -47257, 26571, 13715, -76989, -79575, -72565, -132929, -110887, 21518, -6189, -76947, -79218, 16139, 69708, 38589, 41873, 41054, -1955, -40946, -124152, -141997, -200503, -220733, -86371, -28517, -56931, -44036, 48605, 12828, -103273, -116215, -24410, -9605, -25725, 33750, 103409, 40906, -28861, -100836, -118520, -117849, -17888, -70649, -81658, -20237, 53822, 38653, -20441, -55610, -52755, -72426, -62000, -2457, 30664, 34051, 45030, 37004, 33362]
15906C3362J9215q9656K4231K5876l7201l9908o5556K7011O3678l2332p4024O636
15894a38668J3949r4222m3300K6479N3213J08982O0039p0069j7456L8563n0992
15883a13482j03405n3682L0893R3104j5663K9015O8223L5745r4278J206O4973
15872e7351K6840p2812k3175O4334k5845J1041N2733K3937J7988o264q1493k02
15860g0269J7525k5495O9689L4620P399Q7437o5281q2919m3011m0331L4407K0666
15848e5563k5303l2617n1293k3380R1959p090J0187R3171K6372l6143J7080R016
15836A6396o8196O539n93L9254L7929j5040o6311n7912L7259P5269J1124J0416
15824B6134l0190n400o296P5837j0275l5357K6722j46112p8688O4477N7056M4403
$$ y = [33362, 52577, -37079, -12848, 13028, -24173, -64081, -129637, -102626, -38948, -71280, -145304, -138668, -124719, -218941, -262241, -235762, -182549, -73567, -13528, -83597, -101053, -62490, -113482, -216887, -270569, -239676, -146572, -162235, -133220, -64997, -29252, -123530, -122324, -57351, -30511, -103323, -126498, -62164, -88009, -76968, -24235, -298, 17690, 11426, -70067, -70269, -52744, -78239, -8550, 26070, 33469, 120906, 55625, -27294, -70305, -110636, -76229, -55563, -80866, -113483, -164776, -188156, -96197, -103287, -93100, 71, 26443, -9700, 7380, 16396, -51800, -45261, -45854, -6600, 31329, 16289, -50022, -107934, -70675, 4594, 15718, 26134, -4056, -9456, -15752, 60085, 49810, 14453, 41175, -104937, -183625, -119148, -62092, -17689]
15812a7689K9488N3370P155p0119j2434J26177l2410n6367k0300k4896l1541R2668
15800D3102O9209l7206J588p4612q0232J6808m56M8956p9542k4805k9942M8085
15788i9047j6466N4360m3852n2100J4005K5815n7894N2460R097m0210m5945m2025
15776b41802K758R003R0507P330J933K9951o8572K9526J01450M7767n3227K3564
15764a9812K1049O9189l4885m7820o3502m74P9039J04518N0107o6103m9728p8167
15752c6589O3779J06075j9334l3852n6636j08032M788Q6054O9817l3615m291J876
15740D0040J6040o2588j5303K1877M8530r29j2187l7779l3056l1690K1280O7259
15728B1494k7207n2409N7361o659l8629L7193L5727r1808l5883J01003P1144j344
$$ y = [-17689, 11799, 65169, 72324, 2205, -10229, 115948, 83538, 27171, 6871, -18025, -49566, 43102, 112311, 75105, 76693, 2081, -78151, -61343, -61799, -12843, -92385, -117190, -147132, -99047, -115513, -61153, -105005, -157105, -143100, -117285, -175179, -122719, -113622, -153832, -199777, -241802, -239044, -230041, -139534, -132204, -130271, -100320, -168892, -139366, -37916, 9851, -43376, -19812, 1237, 70426, 35541, -12279, -75781, -76255, 2784, 107302, 157409, 91306, 41578, -36589, 27190, 133265, 113931, 80079, 23443, -84589, -79801, 6253, 76070, 42455, 38164, 40040, 56080, -6508, -21811, 66, 48596, 47667, 35480, -2299, -35355, -67045, -45765, 21494, -5713, -58122, -761, -7420, -46049, -8856, 26871, -64937, -100820, 183, 71327, 69983]
15716F9983p0151k6915J12795m1805m0336N3705r252l3133k5448k0975p3822Q995
15704i6359l5303j9838k1611N8338O3195O9283J2819m7832m834K0281J28842Q4170
15692B11151o2116m0784j05532q3302M5848R58Q5676M2388j04860m9123L6410
15681b3286P8835K0167m0955r5760k5156j8113L0829m6750J38388K6446p9915
15670c5270K7311P680K7551N9612K2022L025o0311m7166K8070r1293J997l1000
15658h7772o2949J1469J0292J4814K3803K8304O6270o3968K6776l7982m5333k9491
15646a45767p231O9345M4372L9833N7398N704Q78j11358N063R5055l7476k1369
15634e553j5469N677r262n8071o0379j9431K8552K8601P5051J17994k4509J6053
$$ y = [69983, -168, -27083, 85712, 43907, 3571, 57276, 48024, 14891, -10557, -31532, -105354, -96359, -131662, -151500, -173111, -114773, -51578, 17705, 30524, -17308, -22142, -1861, 126981, 211151, 149035, 108251, 2719, -80583, -34735, -33777, 51899, 94287, -10573, -59696, -23286, 55549, 75716, 34761, -60999, -86155, -104268, -73439, -120189, 18199, 44645, -35270, -7959, -279, 27272, 86884, 108906, 111931, 51620, 4454, 32524, -58769, -56772, -87772, -150721, -139252, -128960, -114146, -90343, -62039, 4231, -59737, -32961, -70943, -116276, -145767, -152998, -83653, -39281, 552, 57950, 63654, 64532, -46826, -41763, 53292, 15816, -5553, -21022, -15345, -24607, -82678, -143057, -162488, -133936, -105335, -30284, 87710, 63201, 79254]
15622G9254J01467k2362k9335p0780p3193N8146N3523k7103J4003j0977k3116
15611D9527K7255J4080p7791n23N5665N9440J8742p6834j03579Q8269O0899o9015
15599D6135n8910L874N2029J7412j4673p017j5376n0495M906M2154M9216o5877
15587C378k0661r992J2273P1394r384K975q6537J7352K5992j7215j06393n4108
15575a70926K5743O1681n0763l8923O1458j6046J15471N6833o028m9889k8920
15564d0309M926M9822L8355j8104P682N4307n3141K9447P7139L414k2685J2872
15552A43725j32301j59422j09903o5835Q4751R2958m1900K0590J44891P2826j29496
15541g9116m7065K2294N6875K4573k8048q277R0313M2498N4661o4509r0123m0988
$$ y = [79254, 180721, 158359, 129024, 58244, -14949, 43197, 96720, 69617, 83620, 72643, 49527, 76782, 90862, 13071, 12548, 68213, 127653, 146395, 69561, -34018, 54251, 115150, 46135, -12775, -8901, 43128, 60540, 45867, 38850, 23474, -27021, -22115, 20039, 69255, 3378, -17283, -27275, -15002, 56392, 47008, 49983, -36554, -19202, 6790, -10425, -116818, -170926, -145183, -83502, -134265, -173188, -111730, -127776, -12305, 44528, 38500, -11389, -40309, -35383, 14439, 52794, 34690, 42372, 96679, 43538, 72985, 150124, 153538, 130853, 143725, 11424, -147998, -257901, -323736, -238985, -146027, -187927, -167337, -22446, 50380, -79116, -126181, -103887, -47012, -22439, -50487, -58764, 31549, 74047, 128708, 64199, -25924, -66912]
15529f6912O5850l18L448j8680l0318L6054N6056r76j4656M1697L5597M9591l7495
15516A18938m2197m1816q0391r5712L3471J6896M0812o9360p0947q3401K6736
15505b46971N1333R4814J32114K1283o6065q2617j5687N9739O3050J4472l0688
15494e223q1547q9441J600K1327R6170J5230l5036L2424L8077K2041Q5937n1067
15482E0492r1744K0132M2843M0115p6437K6800o455p6134j51l0023j769K488O0561
15469c9282r365O6489M0522k8775P591L7169J2654K1535l4946j0360Q777j9475
15457E2534K0597j8278o1528n5217N1348l5681o9177q322n9627m9884J48868O8032
15445a6335J0398n1956o37k3790J4563k6026L8566j6048J225j1682l1142j2026
$$ y = [-66912, -1062, -1380, 2068, -16612, -46930, -10876, 45180, 44204, 29548, 71245, 106842, 156433, 118938, 76741, 34925, -45466, -141178, -107707, -90811, -49999, -119359, -190306, -273707, -246971, -195638, -100824, 31290, 52573, -13492, -96109, -111796, -52057, 10993, 25465, -5223, -86770, -176211, -174611, -153284, -57114, -41884, -76920, -44496, -6419, 15622, 101559, 50492, -41252, -21120, 21723, 61838, -14599, 12201, 5746, -70388, -70539, -100562, -102331, -99843, -39282, -48647, 17842, 58364, 29589, 37180, 74349, 87003, 108538, 73592, 63232, 72009, 52534, 73131, 54853, -6675, -61892, -10544, -46225, -115402, -123724, -183351, -233235, -84367, -16335, -5937, -57893, -58530, -82320, -67757, -93783, -55217, -71265, -70040, -81722, -112864, -124890]
15433a24890J52868Q817p8641o5887L251N5101O3996O9027l7150q5067J0275O8679
15421D0379J3659m3065k9461P6680j6776o9916m7854k7040O5304L2604K432K5758
15409B2704J6168R715k1684m6555L5376O4191n0089j0024j9554n6289M7498R4396
15397H5853l5291r8243o3355O3270L7418K8825K9200K2120k6515n4487p015L4718
15385A6498m3069l7970P3445l5280J1744Q2367N5489L2267n7112p0344k3100R2486
15373I7421N7878m7723j10014M9697L3646l9339K0118L4894j40619m2818k03L7144
15361d9918K5387p1711K702L2643J33605J28056L111n6818J1592j3270m4686L8985
15349A39678Q816m1917l5418k2572j04912n2639M3820O8313O1168L8641O1044
$$ y = [-124890, 27978, 36795, -41846, -107733, -104482, -49381, 14615, 83642, 46492, -38575, -28300, 40379, 54038, 10973, -18488, 58192, 41416, -28500, -76354, -103394, -38090, -5486, -3054, 22704, 38872, 48587, 26903, -19652, 15724, 79915, 29826, 19802, 248, -56041, -8543, 85853, 50562, -47681, -111036, -47766, -10348, 18477, 47677, 69797, 43282, -11205, -18220, 16498, -26571, -64541, 8904, -26376, -14632, 67735, 123224, 155491, 98379, 28035, 4935, 97421, 155299, 107576, -2438, 47259, 80905, 41566, 61684, 96578, -44041, -86859, -87062, -49918, -24531, -96242, -93540, -60897, 72708, 200764, 203875, 147057, 158649, 145379, 100693, 139678, 148494, 106577, 71159, 48587, -56325, -108964, -65144, 3169, 64337, 102978, 164022]
15338A64022o3649m6801o571m08K1835L4815J30965j07226j12289m8488R4179
15327F0384L7593j17229k8028n830N579L8365J07063P1412o6530o1056J0708O2385
15315A14816P9758K6095r0901p1199m2165j0891K2257m5461k6710R577M2580N8659
15303F6415o9921o7028j066K458R4207K1437j1829K0920J9728m958l8869q023
15291B3471N2966M8200o2365q8347r197N5408K5419K1700k6733n3184p256k9438
15279d9356O7717R315m419J53430M6609p7630j4714J7659R19k3451m9863J0965
15267H7181J5316n0764l786J6275p2293J6913J32624J6830n4758K253m6193n0517
15255I081m9650l2751J04496J06796j0888k6677j2020l3523q3975L0072J8757
$$ y = [164022, 100373, 53572, 47001, 46593, 68428, 103243, 234208, 126982, 14693, -33795, 60384, 97977, -19252, -47280, -53110, -47531, -9166, 97897, 169309, 102779, 41723, 52431, 114816, 194574, 220669, 129768, 58569, 16404, 5513, 27770, -17691, -44401, -34824, 7756, 66415, -3506, -70534, -71600, -69142, 25065, 46502, 34673, 55593, 75321, 70363, 31494, 23471, 76437, 124637, 62272, -26075, -35272, 20136, 45555, 67255, 40522, -12662, -19918, -49356, 18361, 27676, 23257, 176687, 223296, 145666, 130952, 148611, 149530, 126079, 76216, 87181, 102497, 51733, 47947, 64222, -8071, 8842, 141466, 158296, 103538, 105791, 59598, 9081, -40569, -73320, 31176, 137972, 127084, 100407, 88387, 54864, -29111, 961, 19718]
15244A9718j1962L8490L165m7761J4635L8117R0471L4435j12079p811O464j760
15232F4122k7606j20778Q1813P0671N375M739r3156k9173m2493N9495L5880o8030
15220e9141J2933O0141k2610q6743N3199M5994K0681j09467K6736L3764J3410
15209a1103m871m9778L6197k8440L1030J2519L040L1283k3125L8982L8161Q9638
15197A63533m3156K309o1603m4791K4936O336k8298L8652N0635j3447p3478j11101
15185h9473K7262M9046l0202M3550K7411q8637K3463J06345P7033J1579m8638
15174A08739M0809j94o3988M9281k7770L1229J309l1850o9396k628N0645k4902
15162F1284m2221j0185m3805J48K3370o853N0985m7010n9700N8350M7570k5604
$$ y = [19718, 7756, 46246, 49411, 1650, 16285, 54402, 144873, 179308, 67229, 59418, 65882, 64122, 36516, -84262, -2449, 68222, 73597, 78336, -14820, -43993, -86486, -26991, 8889, -59141, -46208, 13933, -8677, -95420, -42221, 3773, 24454, -85013, -58277, -24513, -11103, -15974, -65752, -29555, -57995, -26965, -14446, -11406, 19877, -3248, 35734, 73895, 163533, 120377, 122686, 61083, 16292, 41228, 47564, 19266, 57918, 108553, 95106, 21628, -89473, -62211, -13165, -43367, 183, 27594, -61043, -37580, 68765, 145798, 157377, 108739, 149548, 149354, 85366, 134647, 106877, 138106, 139415, 107565, 38169, 35541, 86186, 61284, 19063, 8878, -34927, -34779, -11409, -18262, 32723, -14287, -73987, -15637, 31933, 6329]
15150F329j8623O4105O8571J4791o4550m3914k520K9122P8797r221M0427n440
15138A57874o8972r5827J5410n84J5628K2696Q3924J9093n1405j0300K2871M973
15126A15381L6498J9537K7298L6082j00623k5163o9456o4139R069j998j4468R3411
15114F1429K3572o8627K0392M0933K1561j4273L8980K7074k5984q1062l9708J07706
15102A11993K641o0671j02058o6552j96Q5507K8494m9025M9387L6064q8079o5502
15090a17997J2893O302J04972O9284Q1026k2225J6435l793j6023o2049j02330
15079c3505J8591O1021k8638J0438k262K9583O9336K1518N1223n1804j0654n2235
15067H2612R447o3360K114Q1198M4446j14226k4219K5355l0198Q716Q6993l3728
$$ y = [6329, -12294, 51811, 120382, 135173, 70623, 26709, 24189, 53311, 132108, 122887, 163314, 157874, 88902, -6925, 8485, 7901, 23529, 46225, 130149, 149242, 97837, 87537, 110408, 115381, 151879, 171416, 198714, 234796, 134173, 109010, 39554, -24585, -15516, -17514, -31982, 61429, 85001, 16374, 36766, 77699, 99260, 84987, 123967, 151041, 125057, 43995, 4287, 111993, 114634, 53963, -48095, -114647, -114843, -29336, -842, -49867, -480, 35584, -52495, -117997, -105104, -98802, 6170, 75454, 156480, 134255, 150690, 146897, 130874, 68825, -33505, -14914, 46107, 17469, 27907, 25645, 55228, 124564, 146082, 197305, 145501, 134847, 82612, 92059, 28699, 30813, 112011, 156457, 42231, 18012, 43367, 13169, 21885, 108878, 75150]
15055G5150N8828n388P543N9850k6868j8577k768j2452J0382n8774Q231K0043
15043A15200l8299k8484n521K7005O965o4543k8617M4756O2390L9693o478k4415
15031I9652K0733L865j07146R470J0716M7939L6971l697p4330p810L9442N0324
15019A26129N7452M7540N1246o7590j13668j7777n8712k9120o914l5610N9445
15008A2421J8622l3679L2921M380p6722k3489J22432j1923l7248q1952Q119J08860
14996D2742O45K0517O0798N4323l1026j8528l7714M018J8057k8925k7986j8176
14984C8745L4578j3292L1873R4699N3722j2362p0335k6433n8315m3332N3659M6784
14972A29991M0559O830r3931k7168N1177K4844n5031m8874Q7094l0183j4285J13346
$$ y = [75150, 133978, 128590, 136133, 195983, 169115, 150538, 147770, 135318, 145700, 86926, 95157, 115200, 76901, 48417, 42896, 69901, 76866, 12323, -16294, 28462, 90852, 130545, 124067, 99652, 120385, 124250, 17104, 26574, 37290, 85229, 122200, 118503, 44173, 36363, 75805, 126129, 183581, 231121, 282367, 214777, 101109, 83332, 24620, -4500, -11414, -47024, 12421, 31043, -2636, 30285, 34665, -42057, -65546, 56886, 44963, 7715, -74237, -66118, 42742, 43387, 63904, 124702, 179025, 147999, 129471, 91757, 95775, 113832, 84907, 56921, 38745, 73323, 60031, 91904, 186603, 240325, 227963, 157628, 131195, 72880, 29548, 83207, 129991, 170550, 177380, 83449, 56281, 107458, 132302, 77271, 28397, 115491, 85308, 71023, 184369]
14960A84369l398o3314N8990P7m4475K3683m9245l8865j32464k0813N1032J280
14948c3143k6183M4964J0483R6778K7903O947K9902k1620p9458m5383J7586j4796
14936A3980L7501J36365J53801Q2007J06607J14634J74631K88161K48218K69217
14926A625122J72496J01882O3667K6148o5619m2904q9057k06825j89177k20847
14916A174886j95084j28402j50812j70242j23884l1955j6435m9154l5265P26p9998
14905A94381n4070L0138l530K9687l1196L0140L4839j3511M589p1942N2032q8695
14893A12862l5299R7665N1384k6540O672N504R714R1410l7911m5855P6531K5269
14881C31406p5264j06223k6543K783j1847P71Q1125L9296l6202K6053n973P3379
$$ y = [184369, 180971, 117657, 176647, 176724, 132249, 155932, 106687, 67822, -64642, -85455, -34423, -33143, -59326, -14362, -3879, 92899, 120802, 127749, 157651, 136031, 56573, 11190, 28776, 13980, 51481, 187846, 341647, 423654, 530261, 644895, 819526, 1107687, 1355905, 1625122, 1797618, 1899500, 1963167, 1989315, 1923696, 1880792, 1791735, 1584910, 1395733, 1174886, 979802, 851400, 700588, 530346, 406462, 374507, 358072, 308918, 273653, 274379, 194381, 140311, 170449, 166919, 196606, 165410, 195550, 230389, 216878, 221467, 149525, 201557, 112862, 77563, 175228, 226612, 200072, 206744, 212248, 221962, 313372, 275461, 229606, 306137, 331406, 256142, 149919, 123376, 126159, 114312, 115083, 196208, 235504, 199302, 225355, 219382, 292761]
14869B92761M4032p1457j8985q7754r1388J1019M5535n8105m1595j2186K7154
14858C9031L6345j3717K5986P2254l5713L1384L0102k1744L8965R502n7034j4625
14846A40736N729N4008N2172m4938M529J7220l6310N8924L9187k0457m4197l1298
14834A95305K5353l54r0874k6679J6864P9599k0606j7275J6905j552L123J416
14822A81225N599P6734J7034j3292o6532l176m781p1179K1769P5650J0479p4485
14810A55045J05083L6881p1809l405J5184N6114O0181q9129l2545L7501K513L0338
14798C01952j8884j8122k155j11648L8339o1858r6386k470J02801R7294k7702
14787B01161l9503n5202q476Q1116o8088p3380R6523P3952M4591j1611l4728K6060
$$ y = [292761, 336793, 265336, 246351, 158597, 67209, 78228, 123763, 65658, 24063, 11877, 39031, 75376, 61659, 87645, 159899, 124186, 155570, 185672, 163928, 202893, 212395, 155361, 140736, 146465, 200473, 252645, 207707, 212236, 229456, 193146, 252070, 291257, 270800, 226603, 195305, 220658, 220304, 129430, 102751, 119615, 199214, 178608, 161333, 178238, 176686, 179809, 181225, 186824, 263558, 280592, 267300, 200768, 197592, 192811, 121632, 143401, 219051, 229530, 155045, 260128, 297009, 225200, 221795, 236979, 293093, 353274, 264145, 231600, 269101, 271614, 301952, 283068, 264946, 262791, 151143, 189482, 127624, 31238, 28768, 131569, 228863, 201161, 161658, 106456, 97980, 179096, 111008, 37628, 134151, 208103, 252694, 241083, 206355, 232415]
14775B32415J2841j318k5066p7522P145O0696J5703k2176n269k2591Q1362r756
14763B46464p1911o1432o4820J0446P6605K2367L0973O7509Q0095N3267q1837
14752C07726K8396K0503q3627o3686k1413J9117J2955N5572K9431P462J8114L9673
14740C70223J960L0535p579j2347N5350O8670p3861j25747M4503M523q6777k2277
14728B47176O6453p551j5734n7734j4072q4519k4423K3975O5111O1799m7382k5129
14716A87970L6243K6677j4795J9745M3706r985l8100N7739j5049k197J0537n1313
14704B51178o355j8073M5312n1345N8697k1317P752R804l7455J2668K6162j4693
14692B62335l5388Q0106R0452M1342J1746l6455j4612J4464L7718K5240p3143
$$ y = [232415, 245256, 243938, 218872, 141350, 148495, 209191, 224894, 202718, 197449, 174858, 256220, 246464, 174553, 113121, 48301, 58747, 135352, 157719, 188692, 256201, 336296, 389563, 307726, 336122, 356625, 272998, 209312, 187899, 207016, 219971, 275543, 304974, 312436, 330550, 370223, 372183, 402718, 395139, 382792, 438142, 506812, 432951, 307204, 351707, 356230, 269453, 247176, 313629, 306078, 290344, 232610, 218538, 134019, 109596, 133571, 198682, 260481, 213099, 187970, 224213, 250890, 236095, 255840, 299546, 289561, 251461, 309200, 294151, 291954, 302491, 251178, 244823, 226750, 272062, 220717, 279414, 258097, 265849, 275653, 238198, 250866, 277028, 262335, 226947, 307053, 397505, 438847, 450593, 414138, 399526, 413990, 451708, 476948, 403805]
14681D03805J11380j5853k0818n9663L8326j14504p1469R820J4780N7474k4483
14670C28795o7715Q228K7331n3901N9241L7925L5140k583L1089O3077L347q9831
14658C80143j3587J5582l2365m9745j7869K5699p561k9909K8852o6702o2415J19011
14646B89134k066J4187Q399o342L5983L6572k8679j7685L0671K2725M1109M3742
14634D67750O397n7879L1211N7656M7417J4493p8767j9476O2913L5202n8097J5230
14622E24050Q5852m954j01626J2164J36703J43216N7584m3828j12194M1559K4514
14611G63040k4594l2022J0547p5597n9544L0236k1422r0849n0074l8200L9854
14600D51375P750j9987j0465K0358K0675j2806l3750K6667J31674J1917R0777
$$ y = [403805, 515185, 499332, 478514, 418851, 457177, 342673, 271204, 281024, 295804, 353278, 328795, 261080, 269308, 296639, 242738, 301979, 339904, 375044, 372461, 403550, 466627, 469974, 380143, 366556, 382138, 349773, 300028, 282159, 307858, 300297, 270388, 299240, 232538, 170123, 289134, 287068, 301255, 309654, 303312, 339295, 375867, 347188, 329503, 360174, 382899, 424008, 467750, 474147, 416268, 447479, 505135, 552552, 567045, 488278, 468802, 531715, 566917, 508820, 524050, 609902, 604948, 503322, 515486, 652189, 795405, 852989, 809161, 696967, 738526, 763040, 738446, 706424, 716971, 641374, 581830, 612066, 590644, 499795, 449721, 411521, 451375, 459125, 439138, 428673, 449031, 469706, 456900, 423150, 449817, 581491, 593408, 684185]
14589F84185m27o616O3157m6825j36301m4833Q179L5738Q8920L6158q710J5257
14577F87882j6970M7226j4570J6231J0598j2634m0841M4741K7515N7818M0764
14566H47760P84Q2799R5499M1557m6312P0721L9485q9866k6822O3685o0154n8437
14554I60699J27801J26639K351M3541Q5951J07939P0734j9472J4480J0604K9676
14543A560943k623m1236P222J58036J3342j1977P9577Q2879Q0349J0127Q357R7369
14531B042365J93664J42104R0969J25311L6414N3455L7984M3451M9021R0232J07083
14520C012053J14220J24349K6514J01058K88364L75108L96581M79301O22879O04064
14510F144491O95964Q88621J135978J446576J762705K098711K375131K726157
$$ y = [684185, 683758, 677142, 740299, 693474, 557173, 512340, 520519, 556257, 645177, 681335, 672625, 687882, 670912, 718138, 703568, 719799, 730397, 717763, 676922, 721663, 749178, 806996, 847760, 848544, 931343, 1026842, 1068399, 1022087, 1092808, 1132293, 1042427, 1015605, 1079290, 1019136, 960699, 1088500, 1215139, 1217490, 1261031, 1346982, 1454921, 1525655, 1506183, 1520663, 1531267, 1560943, 1558320, 1517084, 1524306, 1682342, 1695684, 1683707, 1763284, 1846163, 1926512, 1936639, 1944996, 2042365, 2236029, 2378133, 2469102, 2594413, 2630827, 2684282, 2722266, 2765717, 2814738, 2904970, 3012053, 3126273, 3250622, 3277136, 3378194, 3666558, 4041666, 4438247, 4917548, 5540427, 6144491, 6840455, 7729076, 8865054, 10311630, 12074335, 14173046, 16548177, 19274334]
14502A9274334K980665L293238L701062M263839N303146P072498J0377552J5591294
14494G1857628K2850837L1459526L9987867M6862478N0532094M9475218M2632337
14487C55657985L0226495J3660728m826696k2479160l6674145m5746749m9453208
14480B40365250m7773827m2283009l4346425k5937968j8196901j2189662q346241
14473E1291217o051774m900699m169052l779454l609011l482521l267420k836409
14465A9194877k433851k061577j743554j414850j131377r08149p90623o60345
14457H050551o16278n22546n22964n02564n24246m60766m71451m66071j86068
14448C777597k50136l61774k56395k55146j13149j70961k60842k58981j88225
$$ y = [19274334, 22254999, 25548237, 29249299, 33513138, 38816284, 45888782, 56266334, 71857628, 94708465, 126167991, 166155858, 213018336, 263550430, 313025648, 355657985, 385884480, 399545208, 394718512, 372239352, 335565207, 289818458, 240365250, 192591423, 150308414, 115961989, 90024021, 71827120, 59637458, 51291217, 45239443, 40338744, 36169692, 32390238, 28781227, 25298706, 22031286, 19194877, 16761026, 14699449, 12955895, 11541045, 10409668, 9501519, 8710896, 8050551, 7434273, 6911727, 6388763, 5886199, 5361953, 4901187, 4429736, 3963665, 3777597, 3527461, 3165687, 2909292, 2654146, 2540997, 2370036, 2109194, 1850213, 1661988]
14439A661988q1318j32813l5201j63557j15109k5144m2229l4999j27230j18441
14429G85947j46310j21105q6083o7962l4982j9135k4562O865k7645n7214n5183
14418A52631m357J2642N4287k1083n1543m8788k4108N5418M3181L9436j2684K3828
14406B18860q3260n2642R2736J5083k8385j4632N0483Q0610K1610l7250j7653
14395B45560l3029J7442m1690j16105J4036n0911j06973P6814L755l4211k0365
14384d5677L3713k4004l2657K0201k4601K649J16515P8086K3341N5662q1115n0625
14372G1488M1056Q887Q3485O3800L6949o2606p0267k8364J2262n2522o6555j060
14360C6553l2064j23754j32241P291k5286r749R305j902j3745J10547O4424Q269
$$ y = [1661988, 1580670, 1447857, 1412656, 1249099, 1133990, 1108846, 1066617, 1031618, 904388, 785947, 639637, 518532, 432449, 364487, 329505, 310370, 285808, 292673, 265028, 207814, 152631, 148274, 160916, 215203, 194120, 142577, 93789, 69681, 125099, 168280, 207716, 195032, 218860, 135600, 82958, 175694, 190777, 162392, 147760, 198243, 278853, 300463, 263213, 245560, 212531, 229973, 188283, 72178, 86214, 35303, -71670, 5144, 8899, -25312, -45677, -11964, -35968, -68625, -48424, -73025, -70376, 46139, 124225, 147566, 203228, 122113, 71488, 112544, 121431, 204916, 268716, 305665, 243059, 172792, 144428, 156690, 104168, 37613, 36553, 4489, -119265, -251506, -244215, -269501, -279250, -269945, -271847, -285592, -175045, -110621, -102352]
14348a02352j1420k9617p2364K4640Q6909P5519n1338n0986k3751M8159J06189
14337d12M7513r2581L5215O7555k0044r5709o7710j6139J7026j3162M0678M507
14325i3263j7780l0260L6844l0213n7090N3201R5838N4905K1344j9802K8908J4887
14313E7519r1247k8116N7515P284p4342r7010M4063M7823n5499N8275R2820R0917
14301A10002N394q4900o0977K292n6618k5195J0390j4963j313L0185N2519j10211
14289a43395k0053N044K8294O006J6453J0450l0742k9303N9026l0071k5628L8638
14277a15281L0488l2849l2192m0336J7029n6833m2767O04K3522L1985J26328K0619
14265f9683p8904j5277J18698K0778J8554l9456l9019Q3067J2181o0166l5480
$$ y = [-102352, -113772, -143389, -215753, -191113, -104204, -28685, -80023, -131009, -154760, -106601, -412, 47101, -45480, -10265, 57290, 37246, -58463, -126173, -142312, -125286, -138448, -97770, -93263, -111043, -141303, -104459, -134672, -191762, -138561, -42723, 12182, 33526, 13724, 42632, 57519, -33728, -61844, -4329, 2955, -71387, -168397, -124334, -76511, -132010, -73735, 19085, 110002, 115396, 30496, -30481, -28189, -84807, -110002, -99612, -114575, -115888, -85703, -33184, -143395, -163448, -158404, -130110, -124104, -107651, -97201, -127943, -157246, -98220, -128291, -153919, -115281, -84793, -117642, -149834, -190170, -173141, -229974, -272741, -272137, -248615, -216630, -90302, -69683, -148587, -163864, -45166, -24388, -5834, -45290, -84309, -1242, 10939, -49227, -84707]
14254h4707k41R568Q0238J0100l6472k3509L0782n0719m4111N5948r198k1062
14242h3383m2199q712J2495N0041J02206O4209L596n9751l3055l3446J1881l6215
14230e2333l6460p1122p47L9402q180M6059P2526j7923l6761J9231O7660R7415
14218A18767K8299l3898j16679n9532l4855L113O9407K603P944j7744K7027j0592
14206a6140n569j7079o0590m8373Q693J1170J3215Q2445j336L0754m84p576q9805
14193a00675J0718N9501m0821m0324l2852L8443o219j3219O1541L4360J9438r7850
14181a07959l5609J3535O0431N9090P1914q9811n7395L055N5465J10413j0666
14170G2463m229n1333o1382N3032M4471L3126o0326r0638J7854k7628k1460q7391
$$ y = [-84707, -84948, -75380, 4858, 14958, -21514, -45023, -14241, -64960, -109071, -53123, -62321, -83383, -125582, -134294, -121799, -71758, 30448, 94657, 98253, 38502, 5447, -27999, -16118, -52333, -88793, -159915, -160662, -121260, -129440, -83381, -10855, -28778, -65539, -46308, 21352, 118767, 147066, 113168, -3511, -63043, -97898, -94785, -25378, -22775, -14831, -32575, -5548, -16140, -21709, -38788, -99378, -147751, -139058, -127888, -114673, -32228, -33564, -2810, -3294, -10870, -100675, -89957, -30456, -71277, -111601, -144453, -106010, -112229, -125448, -63907, -29547, -10109, -107959, -143568, -130033, -69602, -10512, 61402, -28409, -85804, -82749, -27284, 83129, 72463, 68234, 16901, -44481, 8551, 53022, 86148, 25822, -64816, -46962, -74590, -96050, -183441]
14158a83441k0089O7353M4089J0393M9906N647l541j2760J5563K7698o0731m750
14146f4663J0731j4542p4014L3260O3812k3638j16421K8012L8141P1880L5234
14135a2208k2303j15600k3514J24239P1652n608k2752J2148l9889K8765N3080
14124D8010l8458m3488N4888M1186l0746l3224O8468k4076K0539o6886n3504q7548
14112a44839o2996J07862J10684K5642p0941l4621p7863J8756J0855J4570o232
14101a09123j9187o9459N3996K6577M9766P5328l811l0459m3032r2921m5156J0329
14089a97152J3093L4523O3790K9405M986j2826N256r0656l3900M4909J09763J385
14077b7424n579l1688M2012p325l7620k2836R5141O6710r9389l1163j2514k5926
$$ y = [-183441, -203530, -136177, -92088, -81695, -31789, -26142, -29683, -42443, -26880, 818, -59913, -64663, -53932, -68474, -142488, -109228, -45416, -69054, -185475, -157463, -119322, -47442, -12208, -34511, -150111, -173625, -49386, 22266, 16658, -6094, 6054, -33835, -5070, 48010, 9552, -33936, 20952, 62138, 31392, -1832, 66636, 42560, 63099, -3787, -57291, -144839, -207835, -99973, 10711, 36353, -34588, -69209, -147072, -128316, -117461, -102891, -109123, -128310, -197769, -143773, -117196, -67430, 7898, 4087, -26372, -69404, -162325, -207481, -197152, -184059, -149536, -85746, -56341, -51355, -64181, -58925, -149581, -183481, -138572, -28809, -27424, -33003, -64691, -22679, -30004, -67624, -90460, 4681, 71391, -27998, -59161, -71675, -97601]
14065i7601O8886O0607j7785n9910M4798O4766J3885l3243j9584M1073N2911j4237
14053A04566L0869K31613J20764J46722K19827J99935K58087K67767K42119J51353
14043A973622L3899K6544L1663l9674k11507k71481l39052l69870j98314j09713
14033E26117j38656m5928O6133q936m8444n1218q3395P581k7696k2917K2185N7813
14021B52639n9799j41940P3294N8534k4492n9577j4823r2664p563R1943R4960
14010A70512L955o28p322n0640l8050j4452j8512l6026k6180K4385p6827J6255
13998e3530p9475o288J25567J72821n339l0798O6244J0482J4425J0689o8787j5941
13986A40070Q5309Q18m963k6546J1507P3191k9416K9459L0394n620q8150N4600
$$ y = [-97601, -28715, 31892, 14107, -45803, -1005, 63761, 77646, 44403, 24819, 65892, 118803, 104566, 135435, 367048, 487812, 634534, 854361, 1054296, 1312383, 1580150, 1822269, 1973622, 2007521, 2034065, 2065728, 2026054, 1814547, 1543066, 1204014, 834144, 635830, 526117, 387461, 341533, 407666, 398730, 350286, 299068, 215673, 223254, 195558, 172641, 194826, 252639, 192840, 50900, 124194, 182728, 158236, 98659, 83836, -8828, -16391, 75552, 170512, 174467, 173839, 166517, 115877, 77827, 63375, 44863, 8837, -17343, 7042, -69785, -53530, -133005, -139293, -13726, 159095, 153756, 122958, 189202, 199684, 214109, 224798, 156011, 140070, 225379, 226197, 221234, 194688, 206195, 279386, 249970, 279429, 309823, 304203, 216053, 270653]
13974B70653L2011K5892K9976J1004p185r7598P9551J5460q3186K8438K7555O9299
13962D01870o4987N333P839J1829m8522O5480q5926N7396Q9651m862j7754J6983
13950D34330p692M767o6488j00140m795K875o8429l3286j1843N5249O7481l2969
13938B39060n6100n2031Q471k6006p8233K6625n943k3881J3701K1670q150J2973
13926G2156p8265o9182L4674l0548L1644P0767J27086M2281L6518m1940k1356
13915A73835n3543r3996O1190l87j1670N0380O7388K6014j3826m2318r7837o3281
13903A949J8470l5308O66P4750K5814M7377n5236m1330m0309l5121M10o809M7950
13890C273J2730J4948k3278l8155l6667m3540J1826R2809P9538n2591j30190L873
$$ y = [270653, 302664, 328556, 358532, 369536, 362351, 264753, 344304, 359764, 276578, 305016, 332571, 401870, 336883, 342216, 350055, 361884, 313362, 378842, 292916, 350312, 439963, 435101, 417347, 434330, 426638, 431405, 364917, 264777, 259982, 262857, 194428, 161142, 149299, 204548, 272029, 239060, 182960, 130929, 139400, 113394, 35161, 61786, 55843, 31962, 45663, 67333, 59183, 72156, -6109, -75291, -40617, -71165, -39521, 31246, 158332, 200613, 237131, 195191, 173835, 120292, 26296, 87486, 87099, 75429, 125809, 193197, 219211, 205385, 163067, 65230, 1949, 20419, -14889, -14223, 60527, 86341, 133718, 78482, 37152, -3157, -38278, -37868, -44677, 3273, 16003, 30951, 7673, -30482, -67149, -110689, -98863, -6054, 73484, 20893, -109297, -105424]
13878a05424N9682Q5005K8399k9419n2494N1998R9230k5735p9025j6397K9280
13867D5100k6775o942O5851j1576k200j059M4415M5292k8429k6042q4352p8730
13855f5447L0615k3340r7831j1920K4558J09121Q9215K9429p5867l7442K8181
13844g28J40099L9203j05977r4195L3984P3858N2821o3363r5224j2351J44166
13833A12293k2694n9937m8447l6263K1396r712r514N4216J27592r3642j74348
13822a39060p3001M3456Q2082J10386k2568M059k178l1931L660L8850j2763L734
13810D726K1656J6310K4551j5878P007Q0405O3846q0924m9199j24565q8693R8910
13798d1848J6544k4125K1220J5829K0898J1052N813K0661m9418n9902m839J11718
$$ y = [-105424, -45742, 39263, 67662, 38243, -14251, 37747, 136977, 111242, 32217, 15820, 45100, 18325, 11383, 77234, 65658, 63458, 62399, 106814, 152106, 123677, 97635, 13283, -65447, -34832, -58172, -156003, -167923, -143365, -34244, 54971, 84400, 8533, -28909, -728, 139371, 178574, 72597, -21598, 12386, 86244, 139065, 75702, -19522, -31873, 112293, 89599, 29662, -18785, -55048, -33652, -43364, -52878, 1338, 128930, 35288, -139060, -212061, -168605, -86523, 23863, 1295, 5354, 3176, -28755, -25095, 13755, 992, 4726, 26382, 42692, 67243, 51365, 58372, 138777, 202623, 121699, 72500, -52065, -140758, -41848, -25304, -49429, -28209, -12380, 8518, 19570, 25383, 46044, -3374, -63276, -68115, 43603]
13786D3603K4074K7351p0020n2382k8877j0089r9314m8591R9186Q7085O0419p2137
13774c9692j1414M9743M008N6628P912P3421k7286K0950Q093j31025n2694k8646
13762g0002l42L3861J16340m888j18276J5533J8732m2468k2359M6548R9710K4918
13750I7307k9187Q965o5096L6425M7555o1030N578l0543n7403n0206P3693R0639
13738F6697N2175R90k5413o2369n4811O1170L4232l7914M7497J5299n7658q8819
13726d8924L3777J7554j36073J8307r565L3982N8521P9297M3386M5950j1304J6466
13714A41374o7627J3957J4574j10015k0758N8680L1867k2870k2133N3087k0673
13703D9463M1868L2145n9631l3022J5208O7119N584n9787K494M2441k1445J2294
$$ y = [43603, 67677, 95028, 25008, -27374, -56251, -66340, -165654, -214245, -115059, -27974, 32445, -39692, -51106, -1363, 2645, 59273, 67185, 140606, 113320, 134270, 142363, 11338, -41356, -70002, -70344, -36483, 79857, 74969, -43307, -27774, -9042, -51510, -73869, -27321, 72389, 97307, 68120, 77085, 11989, 48414, 95969, 34939, 40517, 9974, -47429, -97635, -23942, 66697, 118872, 119862, 94449, 32080, -22731, 38439, 72671, 34757, 82254, 97553, 39895, -48924, -15147, 2407, -133666, -115359, -124924, -90942, -32421, 46876, 90262, 136212, 124908, 141374, 73747, 87704, 102278, -7737, -28495, 30185, 62052, 39182, 17049, 70136, 49463, 91331, 123476, 63845, 30823, 46031, 113150, 118734, 58947, 61441, 103882, 82437, 94731]
13691I4731r1606K0401k0444r4228n9160j1382L7649R6715r41N8558J4614r689
13679C5218p828N1544n9340m9116N543L6586N3000J02100Q2699r5290m3545O5535
13667A77106P1345J2131p7232p6432K8496P3679J8134j07773j06710M5115R7002
13656A54861J8799k7305O7599k0634P983r1488n3940R3483O5541n8769o3511M019
13644I6638M9268q6661k2123M1237L1668k241O170L3466P3654j9494l6551k2781
13632A42250p0006l249O0156k8767K1576N6044n333Q0197J8576n1931Q9401l5306
13620B73608l4013k3866n5526M8905R901m4609m1925J2475l2703P8122O5905p6343
13608A79931m3967N4137K2903K0920o0291p4370n3352J4855M5848L1728N8887
$$ y = [94731, 3125, 23526, 3082, -91146, -150306, -161688, -124039, -27324, -28265, 30293, 44907, 35218, 27390, 78934, 19594, -29522, -23979, 12607, 65607, 167707, 250406, 155116, 111571, 177106, 248451, 260582, 183350, 106918, 135414, 209093, 227227, 119454, 12744, 57859, 154861, 173660, 146355, 213954, 193320, 201303, 109815, 55875, 149358, 214899, 156130, 92619, 96638, 145906, 59245, 37122, 78359, 110027, 107786, 113956, 147422, 221076, 201582, 165031, 142250, 72244, 68995, 129151, 100384, 121960, 178004, 172671, 252868, 271444, 219513, 308914, 273608, 239595, 215729, 160203, 209108, 219009, 174400, 132475, 144950, 112247, 190369, 256274, 179931, 135964, 190101, 213004, 233924, 173633, 99263, 45911, 60766, 106614, 138342, 197229]
13597A97229Q9022m2101o2761M1852N9423k6315j8950l3735o4976q5034j9659
13586C3995Q4465O8693P216J5486K6613o9221P7091m4097n7413J8954J05145J415
13574B68342l0662P4534Q7024K0507r6155n7083p0722r0587k5993J02010L9235
13563B20450r3078k4349N519j3556O5788O4834j2531J9562o3417n5979l914K1207
13551A30536M6685L7699l9049r7380k2412J12573K2814n3822N1569q131K6007
13540B07089O2883Q444m0096p2885p7K558j6254Q1660J0271m0474M9239O4146
13528C16504o7941N0406L2852j0821m3837p8262m4748k5586O2788R4140j4216
13517B71279j3147J1167J4328l5229p2676j03579o2676q840M7868P1520k1070
$$ y = [197229, 286251, 244150, 181389, 223241, 282664, 256349, 237399, 203664, 138688, 53654, 33995, 118460, 187153, 194369, 209855, 236468, 167247, 244338, 200241, 142828, 161782, 266927, 268342, 237680, 312214, 399238, 419745, 323590, 266507, 195785, 105198, 79205, 181215, 220450, 127372, 103023, 108542, 94986, 160774, 225608, 213077, 232639, 169222, 113243, 109329, 130536, 177221, 214920, 175871, 78491, 56079, 168652, 191466, 137644, 189213, 181082, 207089, 269972, 278416, 238320, 165435, 165358, 167916, 151662, 233322, 243593, 203119, 252358, 316504, 248563, 298969, 331821, 321000, 277163, 198901, 154153, 128567, 191355, 285495, 271279, 258132, 269299, 283627, 248398, 175722, 72143, 9467, 627, 48495, 120015, 98945]
13506I8945m3122N76R0275n4535l7012l219O8958L5535m6328L6055p682m1640
13494I6806J2069q2845j5668m563K256N0369R278R518k5295K6101P369l9601n1302
13481e508Q99K7394O1766Q983M5906j3032O0712o9570k9797l1441l5096O2271
13469H3487L9002K6549j7427k6130M7988j01242n4964J2714J8135l7274L0210
13458B1048k8692P486N5702o7190m8280N3196p600j2506O4453Q1730J070q6511
13446C3906K0068N7190L4677m3577l9451N2464K24398M9086q0720m7597j24362
13435A36082j3867N8122R01l7348o333o7882J058k7621q881J1000p4302k8905
13423e7976O8808L0724m6239n6862L6611P5388k2819j4329M5508j4900J03723
$$ y = [98945, 55823, 56399, 146674, 92139, 55127, 51908, 120866, 156401, 110073, 146128, 138446, 96806, 108875, 26030, 10362, 5799, 8055, 58424, 67702, 77220, 51925, 78026, 85395, 45794, -5508, -4609, 22785, 84551, 93534, 139440, 126408, 187120, 117550, 87753, 56312, 21216, 83487, 122489, 149038, 131611, 105481, 153469, 52227, -2737, 9977, 28112, -9162, 21048, -7644, -158, 55544, -11646, -59926, -6730, -14330, -26836, 37617, 119347, 120417, 33906, 53974, 111164, 145841, 102264, 62813, 115277, 339675, 388761, 308041, 260444, 136082, 122215, 180337, 181238, 143890, 137557, 69675, 70733, 43112, 34231, 45231, -29071, -57976, 10832, 41556, -4683, -61545, -24934, 50454, 27635, 13306, 58814, 43914, 147637]
13412A47637l5405k1954m710p3771J9645J07291J01270q4399o0523K2014m6744
13401G0351P9223N244K4280K6071l350N9056l9923j8328K2290r5468p5161j8091
13389C6194N4344M6159J0159q5172j53176P9532R1924J4801k1236L9815N8149
13378A71493j4443R609l7780K8328J0568O623O348p151j8189M6633K197j8536
13366A85700l3648J7378O1446J1942k8887l7294J9110J6257M98K4159M7443j3438
13354B70666j6425n0872o979K7407O2337L6116q260m1073n7739n1416m067p748
13342A51947P4117j2059m6713l7573k9334K0120J7234M57K4487P6992l4377J0072
13330B15370J3597p9156o6668j2076J3296j0637J03923J0308M1352N2685J7988
$$ y = [147637, 112232, 90278, 85568, 11797, 31442, 138733, 240003, 155604, 95081, 117095, 70351, 149574, 154818, 179098, 205169, 201819, 260875, 220952, 202624, 224914, 129446, 54285, 36194, 90538, 136697, 146856, 61684, -91492, -11960, 79964, 94765, 73529, 113344, 171493, 157050, 166659, 128879, 157207, 167775, 174398, 180746, 173595, 155406, 202039, 204236, 185700, 152052, 169430, 230876, 242818, 213931, 176637, 195747, 212004, 212502, 236661, 284104, 270666, 254241, 203369, 196390, 223797, 286134, 322250, 313990, 272917, 215178, 163762, 159695, 151947, 226064, 214005, 167292, 129719, 100385, 120505, 137739, 138196, 162683, 239675, 205298, 215370, 228967, 149811, 83143, 71067, 84363, 73726, 177649, 187957, 229309, 281994, 299982]
13319B99982p4119Q0K1586q8043l5073J2889K8880J5499O3838J9347r5007J3543
13307A83402l3150N925K8862r7311j6131J4610k5072M5032O783l610Q503J0076
13295A27919q6739o9866P3590J06117l3034k0054m5103N055M815k1755Q182L0851
13283G9978J1997L0905p4987k3361N5590N677k0956J5649j9846M8848N7719M7173
13271B14386m5564j5204L9214k6712j8168N8347K2401J6639l5690L2948p453k9872
13259B05272m1702Q2853L564m7645p8877l8792L1285M8125L6948L4009m921Q1577
13247C11696O2132o4044l7761l4477J1499n1764K909O8688N5146J8926K015M9004
13235C93969R8091j6956p188O3596N2547O1382m9704J1926O7618l7321q4694l3449
$$ y = [299982, 225863, 225943, 247529, 159486, 124413, 137302, 166182, 181681, 245519, 264866, 169859, 183402, 150252, 156177, 185039, 87728, 71597, 86207, 61135, 106167, 112950, 109340, 117843, 127919, 41180, -28686, 44904, 151021, 117987, 97933, 52830, 57885, 62700, 40945, 49127, 79978, 91975, 122880, 47893, 24532, 80122, 85799, 64843, 80492, 60646, 109494, 167213, 214386, 168822, 153618, 192832, 166120, 147952, 206299, 228700, 245339, 209649, 242597, 235144, 205272, 163570, 246423, 249987, 202342, 123465, 84673, 115958, 164083, 201031, 235040, 230119, 311696, 373828, 309784, 272023, 237546, 249045, 197281, 200190, 268878, 324024, 342950, 344965, 393969, 492060, 475104, 467916, 531512, 584059, 645441, 595737, 607663, 675281, 637960, 553266, 519817]
13223E19817O2407j4975K4513N9780r405j0465R616P0718K9496L5956l525l6374
13211G37559j2757l2541K0652l6145m5340K4543K5356K7711n0894Q053N2368j4325
13199G04240L3047L1604l460k4735n3148M3160K297r2526j59086j7682j2926j4647
13187D36138n0379K8633r8460l541J6941m6247o8813M7011J29134J1953L7256
13176D39626p2650k3963M7442L6320K519p9024R123q5658l4736Q3602j6101n7119
13164B49381l5995m131N34L0808L935k0948K4882J4981M6817P7722J67908J11892
13152F67786O2192O7835M64j4482j7799j15533k17613n1302j7499o7844j9035
13141B77170j3860o5360l2064P0137n7076o7998j4709P0493M349K871N0554N5437
$$ y = [519817, 582224, 567249, 591762, 651542, 642137, 631672, 641288, 712006, 741502, 777458, 773933, 737559, 724802, 692261, 712913, 676768, 631428, 655971, 681327, 709038, 658144, 666197, 718565, 704240, 737287, 768891, 765431, 740696, 687548, 730708, 733005, 640479, 481393, 463711, 450785, 436138, 385759, 414392, 315932, 312391, 329332, 283085, 214272, 261283, 390417, 402370, 439626, 366976, 343013, 390455, 426775, 429294, 350270, 359393, 273735, 238999, 322601, 306500, 249381, 213386, 209255, 209789, 240597, 244532, 223584, 248466, 263447, 310264, 387986, 555894, 667786, 729978, 797813, 798277, 783795, 765996, 650463, 432850, 381548, 364049, 296205, 277170, 263310, 197950, 165886, 236023, 178947, 110949, 96240, 166733, 171082, 173953, 224507, 279944]
13129B79944q614L0406k3957r9854j789N3965K5471L4119K1126n7629n5468L7808
13117B35528n6586K2710n2585l3960L1005M4059Q2022M6234J02805J46932J16160
13106F84324J27771R1729j2928j43939j11660j16483L924j4490n3535k6990l2916
13095C94807l5616L3647J2115n3770J0001k6292j25393k8033n0630M0877Q1161
13084B52874J13867M2805p866l3967q6619Q5483L4229m7537M1441j471L5884P7767
13072E06890O7932n5277m7698r047P2449l2305l3530L7094r142l3241J5313K3901
13060E03339j3845N4535L6934m8510n9795j09330O9826M5691k7567j21736N601
13049C35143Q5400l7848j72303j3510K9803N2467J6178N768j7724P1322n7399
$$ y = [279944, 271330, 301736, 277779, 177925, 176136, 230101, 255572, 289691, 310817, 253188, 197720, 235528, 178942, 201652, 149067, 115107, 146112, 190171, 272193, 318427, 421232, 568164, 684324, 812095, 903824, 890896, 746957, 635297, 518814, 522738, 508248, 454713, 427723, 394807, 359191, 392838, 404953, 351183, 361184, 334892, 209499, 181466, 130836, 171713, 252874, 366741, 409546, 401680, 367713, 281094, 366577, 400806, 353269, 394710, 393239, 429123, 506890, 574822, 519545, 471847, 462800, 535249, 502944, 469414, 506508, 497366, 464125, 479438, 503339, 489494, 544029, 580963, 532453, 472658, 363328, 433154, 478845, 451278, 329542, 335143, 420543, 382695, 210392, 196882, 226685, 279152, 295330, 301098, 283374, 354696, 297297]
13038B97297O762J05499l3808j9881j0644J7555j2569J4562k2329M7531M3118
13027D33093p008j8562K0526n6502l7772M448r303k786J6439M5427J8469K8181
13015D34650j3691j326k9196L4827M4615K6120P6796J4302j2512j9069o56o2153
13003D92707M6807K272P7046j8520n6384q5318o6648M1206J14074N7677M180o3527
12991E45572n7084O0577J3428m9663l3759r241n9669j4657O8166J9801l6165j4622
12979D32684K9202l1190M8786K6927k2401j3596m995j8145M6821N4694j0232q695
12967E29860P155K2153P5742O6354r207P731l0142o2680P871p140l6605p8067
12955D93025K1770P4321k6863r600O2075O4327L8193m998q4946l4776Q9044k8802
$$ y = [297297, 304059, 409558, 375750, 355869, 345225, 362780, 350211, 364773, 342444, 389975, 433093, 426085, 407523, 428049, 371547, 333775, 338223, 328920, 326134, 342573, 388000, 406469, 434650, 420959, 419633, 390437, 425264, 469879, 495999, 572795, 587097, 574585, 555516, 554860, 492707, 539514, 541786, 618832, 600312, 543928, 458610, 391962, 433168, 547242, 604919, 609099, 545572, 488488, 549065, 562493, 512830, 479071, 469830, 410161, 395504, 463670, 483471, 447306, 432684, 461886, 430696, 479482, 506409, 484008, 470412, 465417, 447272, 494093, 548787, 538555, 529860, 537015, 559168, 634910, 701264, 692057, 699788, 669646, 606966, 614837, 607697, 571092, 493025, 514795, 589116, 562253, 552653, 614728, 679055, 717248, 712250, 627304, 592528, 681572, 652770]
12943F52770R371o2687K982Q706k5384L3304l9882n955m303p8727N1580M6151
12931E87926k2249Q6718Q424J2451N620l8906m8830n2710n7614k4908j887K0074
12919D74109K6788K1428r8104k2681k1094Q9232L9679k1207k1217O1946J02409
12908F31288L2486n8196q4369K9833j5311J28313m6346k9158K3547j340J02430
12897G13177k6055J928m7862O8437m002q348O7328r3190K4264J8412m4237n8965
12885F10887m220J3637k6118L1199M5157M8012k6685r2971n2434m4529M4365M5081
12873E91381N4816K649M7011r9686j248k6799l2828M2679m270K6112j5534j3374
12861E70909M7636L4296p7717l2563K3930P5692J1685K0910K603N9973n0687j3778
$$ y = [652770, 662141, 599454, 602436, 611142, 585758, 619062, 579180, 573225, 568922, 490195, 541775, 587926, 565677, 652395, 660819, 673270, 678890, 639984, 591154, 538444, 480830, 455922, 454035, 474109, 500897, 522325, 424221, 401540, 380446, 469678, 509357, 488150, 466933, 528879, 631288, 663774, 605578, 521209, 551042, 535731, 664044, 617698, 588540, 612087, 610747, 713177, 687122, 689050, 641188, 709625, 705623, 697275, 764603, 671413, 695677, 714089, 669852, 610887, 606667, 620304, 594186, 625385, 670542, 718554, 691869, 598898, 546464, 501935, 546300, 591381, 646197, 648846, 695857, 596171, 594923, 568124, 535296, 577975, 573705, 599817, 584283, 570909, 618545, 652841, 575124, 542561, 566491, 642183, 653868, 674778, 677381, 737354, 686667, 672889]
12849F72889R5862k3625n7840k8086o638J2590J00319J7279n1534j397O8245p272
12837G90792p9765L8753L8229j6549j1463m2772j28188J1582N9010L1026M8096
12826G38751k2981J7070O5862K6989O1893m5203j06877p0328P1888l3117n6552
12815F47395L8236R5839p768m4225P5464l1945o8815l5931M0375J52558J4532
12804H75715p1912J1296n3573O0441J77989Q464p5146j8083J806O746L4338K5134
12792I83215q072j0787L0733j01165K3946k2521J1094J7706o6821J3327N7119
12781I27774M1786l610m935R2253J9509m6557l6229o3769K9089L0614m1803M7019
12769I91141L2817O7786M2193n3547q2192l2112M6529N0874J4176P923Q738l3720
$$ y = [672889, 768751, 745126, 687286, 659200, 652562, 665152, 765471, 782750, 731216, 729819, 798064, 790792, 711027, 749780, 788009, 771460, 759997, 717225, 589037, 600619, 659629, 690655, 738751, 715770, 732840, 798702, 825691, 887584, 842381, 735504, 665176, 737064, 703947, 647395, 685631, 781470, 773702, 729477, 804941, 772996, 704181, 668250, 708625, 861183, 875715, 803803, 815099, 761526, 821967, 999956, 1008420, 933274, 915191, 916997, 923743, 958081, 983215, 975143, 964356, 995089, 893924, 917870, 895349, 906443, 924149, 857328, 870655, 927774, 969560, 965950, 961015, 1053268, 1072777, 1026220, 989991, 926222, 955311, 985925, 944122, 991141, 1023958, 1091744, 1133937, 1080390, 998198, 966086, 1012615, 1063489, 1077665, 1085588, 1094326, 1060606]
12757A060606K8536L3224m4617l093L1852o5680o7503K4101Q017M3337J23661
12746A172441l45o6124j03349l8135J66351J6743N6341q779l491N1038Q8004o703
12734A323992l8323n6829o835q7460r2944K3704J21422Q6136M2995P0178J00819
12723A486855J9971l3740o2435P98k4643n4036O7028J7485J9880P035P211l0812
12711A420597K237L7207k8185l1570o7751o008N838l5977K6403L3367O5820M6846
12699A468824j4979M1797l4860L7060n4441J2778J30287Q8527N4685p0717l8010
12688A620951j4935L6617K0786P6857J1042o2172j06750J8926O9304k8930K9536
12677A671232J47107O4291n2760J9906L2796M9870K0190r5209N9780M2257K4895
$$ y = [1060606, 1089142, 1122366, 1077749, 1074656, 1106508, 1040828, 973325, 997426, 1005443, 1048780, 1172441, 1172096, 1105972, 1002623, 964488, 1130839, 1147582, 1203923, 1195144, 1191653, 1242691, 1330695, 1323992, 1285669, 1228840, 1222005, 1134545, 1041601, 1065305, 1186727, 1272863, 1315858, 1386036, 1486855, 1506826, 1473086, 1410651, 1411449, 1386806, 1332770, 1399798, 1417283, 1437163, 1444198, 1451409, 1420597, 1422834, 1460041, 1431856, 1400286, 1332535, 1326527, 1332365, 1296388, 1322791, 1356158, 1421978, 1468824, 1453845, 1495642, 1460782, 1497842, 1443401, 1456179, 1586466, 1674993, 1729678, 1658961, 1620951, 1606016, 1642633, 1663419, 1740276, 1751318, 1689146, 1582396, 1601322, 1670626, 1641696, 1671232, 1818339, 1882630, 1829870, 1849776, 1882572, 1932442, 1952632, 1857423, 1917203, 1959460, 1984355]
12666A984355M8225M6588J15953M1346M2965M9732M8334R543R4870R2131P8959
12655B653001p276O2640m0042l7327k7591j2504n6746k5571L3509m8949l9841
12644B453303L319L7719q6114l4823l2045J5837K9605p1757k9953Q1329J55096
12633B521516j4239J2215J3545q9507j1406K6075Q136N5276R8980j9056o421J15444
12621B710558o0281j61R6294l2807m9840K4630Q7580P768Q16p2003N1832M3864
12609B808250R748n737l179M9223O7822Q5643N792N1767Q3654J1130P0752N9514
12597C294379O7283k7734l7646K5751M583k5081m8481P4242Q9508N3041O1633
12586C531478j05341j4634J7903Q8495P3016J59507K4315j1896L8987k8716n724
$$ y = [1984355, 2032580, 2079168, 2195121, 2236467, 2279432, 2329164, 2377498, 2387041, 2481911, 2574042, 2653001, 2645725, 2708365, 2668323, 2630996, 2603405, 2590901, 2534155, 2508584, 2542093, 2493144, 2453303, 2456622, 2494341, 2408227, 2373404, 2341359, 2357196, 2386801, 2315044, 2285091, 2366420, 2521516, 2507277, 2519492, 2533037, 2443530, 2432124, 2458199, 2466335, 2521611, 2620591, 2601535, 2595114, 2710558, 2650277, 2650116, 2746410, 2713603, 2663763, 2688393, 2775973, 2783741, 2784557, 2712554, 2764386, 2808250, 2817998, 2812261, 2809082, 2858305, 2926127, 3011770, 3017562, 3069329, 3152983, 3164113, 3234865, 3294379, 3361662, 3333928, 3296282, 3322033, 3326616, 3301535, 3253054, 3327296, 3416804, 3469845, 3531478, 3426137, 3411503, 3429406, 3517901, 3590917, 3750424, 3774739, 3762843, 3801830, 3773114, 3767390]
12575C767390l8546p0103O1383K47007R0018M0363K079O685J08044J02302J6012
12564D332634L5289P3700M8431J01743O0006K7245N5290j5069N717P9379j6379
12553D787986K7486R0283O5388M7876Q0523L5992O7530Q8516J0512k9713Q6515
12542E358894L5194J13091R7242J15497J66456M0607K1091R791J49257J22925
12532F230045P6972M6524R5182Q1730M0528P0860J72837N5960n2811N8279J37248
12521G013354J16032N7122O4152J05939J86345R5757L6239N9165N1795J16814
12511G902714J08751J65932J16222L5223K9775J74083K16197R3290J42620K18635
12501I203442P0994j1406P5282J08985K04279K71384J43820J28470J26147J88892
$$ y = [3767390, 3728844, 3658741, 3720124, 3967131, 4057149, 4097512, 4099591, 4106276, 4214320, 4316622, 4332634, 4367923, 4441623, 4490054, 4591797, 4651803, 4679048, 4734338, 4719269, 4724986, 4804365, 4787986, 4815472, 4905755, 4971143, 5019019, 5099542, 5135534, 5203064, 5291580, 5302092, 5272379, 5358894, 5394088, 5507179, 5604421, 5719918, 5886374, 5926981, 5948072, 5957863, 6107120, 6230045, 6307017, 6353541, 6448723, 6530453, 6570981, 6641841, 6814678, 6870638, 6817827, 6876106, 7013354, 7129386, 7186508, 7250660, 7356599, 7542944, 7638701, 7674940, 7734105, 7785900, 7902714, 8011465, 8177397, 8293619, 8328842, 8358617, 8532700, 8748897, 8842187, 8984807, 9203442, 9274436, 9263030, 9338312, 9447297, 9651576, 9922960, 10066780, 10195250, 10321397, 10510289]
12491A0510289J75396Q5125J01961J28535J66724J29534K21567K75475K74325
12482A2068931K14589J30859N2378J36048K21275K77166J93029K08158K10808
12473A3713241K44150J35538O7960J90355L25780K97452K63201K42388K49053
12464A5729118K29232K17435J85537K37182K21491J92627L00311L16353L34633
12455A7963919L24988K78158K75884K89365L11912K89544K51559K87439K21909
12446B0494677K46717M23509L67764L33177K99227L52238K72977K81405L25662
12437B3397353L00270L12091K55752K92651L29378L14506L53335L26630K40579
12428B6122545L20732K89154K80444K12031K86716K23311K31336L32316K89233
$$ y = [10510289, 10685685, 10770810, 10872771, 11001306, 11168030, 11297564, 11519131, 11794606, 12068931, 12283520, 12414379, 12466757, 12602805, 12824080, 13101246, 13294275, 13502433, 13713241, 13957391, 14092929, 14160889, 14351244, 14677024, 14974476, 15237677, 15480065, 15729118, 15958350, 16175785, 16361322, 16598504, 16819995, 17012622, 17312933, 17629286, 17963919, 18288907, 18567065, 18842949, 19132314, 19444226, 19733770, 19985329, 20272768, 20494677, 20741394, 21164903, 21532667, 21865844, 22165071, 22517309, 22790286, 23071691, 23397353, 23697623, 24009714, 24265466, 24558117, 24887495, 25202001, 25555336, 25881966, 26122545, 26443277, 26732431, 27012875, 27224906, 27511622, 27734933, 27966269, 28298585, 28587818]
12419B8587818K57429Q1869J34502L24498J95603J17893J25502K41696J25643
12410C0192453P3825J38649R5051L4556Q0390N2370Q5542j6779R9250M6402n4454
12399C0827255m7766L8198m7783o7920p9831j51516k14727j53195q6736j23943
12389B9892036q0249j48784k46262k12623k52460k65385j79731k39078k51601
12380B8015863l12803k58560k29021k80797k93181k87082k91117l99566k73229
12371B5390507k07863k50029k31007l32640m10528l17983l56939l72246k83324
12362B2627948k12632l49171l66798l27053l83231l21522k31556j73172l26120
12353A9936693l13521k76378k70878l13918k92661k76229l39597l28520k73749
$$ y = [28587818, 28845247, 28927116, 29061618, 29386116, 29581719, 29699612, 29825114, 30066810, 30192453, 30266278, 30404927, 30499978, 30534534, 30614924, 30667294, 30752836, 30736057, 30835307, 30881709, 30827255, 30779489, 30817687, 30769904, 30701984, 30622153, 30470637, 30255910, 30102715, 30015979, 29892036, 29811787, 29663003, 29416741, 29204118, 28951658, 28686273, 28506542, 28267464, 28015863, 27703060, 27444500, 27215479, 26934682, 26641501, 26354419, 26063302, 25663736, 25390507, 25182644, 24932615, 24701608, 24368968, 23958440, 23640457, 23283518, 22911272, 22627948, 22415316, 22066145, 21699347, 21372294, 20989063, 20667541, 20435985, 20262813, 19936693, 19623172, 19346794, 19075916, 18761998, 18469337, 18193108, 17853511, 17524991, 17251242]
12344A7251242k29045l69980k64430k04480k78479k90736k43629j79668j04792
12335A5086003j90351k80738l05205k89755j62932j98554j98126j86020k15380
12326A3058942k26599k74442j62251k02849j77493k18849k64971k21381r9842
12317A1210265j59417j54304j74638j27683j38012k24917j23303j24788k33415
12308I749788j46658o2413q6430k02859j45020n4616j35048j48506k19008j05413
12298H443817r2690q4965j34981j33608j03604j40119j61016j44204p2032p1152
12288G305446j33726p9046m3516k5367q8191p6712r3734r1662k5702j46178j58806
12277F342806j40811j09441o5716n2666p7896p3782r0179j35494n9512o0967n7782
$$ y = [17251242, 17022197, 16652217, 16387787, 16183307, 15904828, 15614092, 15370463, 15190795, 15086003, 14895652, 14614914, 14309709, 14019954, 13857022, 13658468, 13460342, 13274322, 13058942, 12832343, 12557901, 12395650, 12192801, 12015308, 11796459, 11531488, 11310107, 11210265, 11050848, 10896544, 10721906, 10594223, 10456211, 10231294, 10107991, 9983203, 9749788, 9603130, 9540717, 9454287, 9251428, 9106408, 9051792, 8916744, 8768238, 8549230, 8443817, 8351127, 8266162, 8131181, 7997573, 7893969, 7753850, 7592834, 7448630, 7376598, 7305446, 7171720, 7092674, 7049158, 7023791, 6935600, 6858888, 6765154, 6673492, 6647790, 6501612, 6342806, 6201995, 6092554, 6026838, 5974172, 5896276, 5822494, 5732315, 5596821, 5537309, 5476342, 5418560]
12266E418560o9592j18549p8781j02749M3403o8159j12679o5753n9632J8195p6872
12255D727392q9164l0715q0413o3810j04255o8852k8677j09234n0125M0058N0588
12244D192793k2355K0004l8935j01443j34924o6648l2661p8727l2899q3490q6217
12233C534498N3584O2860p0481n8745k4328r426O007l350l7510j25365l1566n2890
12221C243288l5350m3081o4611k0910n7051j3513k6929p7022p7778k6870M3899
12210B844072l7324k8008J27662p063r4609j00963j6109q7778K3668k4393j00717
12199B498438R5334O572k3519j3953q2001o7479m1762r7339o2337L3048l8657
12188B206345k3164p3035L2164R9293L6462o7521q38l2779j62078O343R2569P5549
$$ y = [5418560, 5348968, 5230419, 5151638, 5048889, 5092292, 5024133, 4911454, 4845701, 4786069, 4804264, 4727392, 4638228, 4607513, 4527100, 4463290, 4359035, 4290183, 4261506, 4152272, 4102147, 4142205, 4192793, 4170438, 4190442, 4151507, 4050064, 3915140, 3848492, 3815831, 3737104, 3704205, 3620715, 3534498, 3588082, 3650942, 3580461, 3521716, 3497388, 3487962, 3493969, 3490619, 3453109, 3327744, 3296178, 3243288, 3207938, 3164857, 3100246, 3079336, 3022285, 3008772, 2981843, 2904821, 2827043, 2800173, 2844072, 2806748, 2778740, 2906402, 2899339, 2804730, 2703767, 2687658, 2599880, 2623548, 2599155, 2498438, 2593772, 2600344, 2576825, 2562872, 2480871, 2413392, 2371630, 2274291, 2211954, 2245002, 2206345, 2183181, 2110146, 2142310, 2241603, 2278065, 2210544, 2209706, 2176927, 2014849, 2021192, 2113761, 2189310]
12176B189310j1480j45013q0357l5160j005K1267o3108p6125R4553L2550m3861
12165A881571J2209L0238m628m2446L1021l6263m2183k5386n9423m3736m700N745
12153A702019J4739J00101K6667j3867K2766n1086j24400q9580p0383M1320J05062
12142A663358l1091j16133j03151J6996K8227M8226Q2121q712m9989o6248o1675
12131A401929k7667k2148R6097K3345o3009n1745O6921O8377r069q4268J04295
12120A503058k4173q4680K8916q209p5907p9687L949J0906l4940P6849L5322p8894
12108A272510r0689r90m9863j7139j4303r224K8861N3111J6507j1395J00834p4559
12096A203661n0386P787N5113k6936p3599p0189L1589O6995P168m5396j9487p3240
$$ y = [2189310, 2177830, 2032817, 1952460, 1917300, 1916295, 1937562, 1874454, 1798329, 1892882, 1925432, 1881571, 1893780, 1924018, 1919390, 1876944, 1907965, 1871702, 1829519, 1804133, 1744710, 1700974, 1696274, 1702019, 1716758, 1816859, 1843526, 1829659, 1852425, 1801339, 1676939, 1587359, 1516976, 1558296, 1663358, 1632267, 1516134, 1412983, 1429979, 1458206, 1506432, 1588553, 1579841, 1529852, 1463604, 1401929, 1374262, 1352114, 1448211, 1471556, 1408547, 1356802, 1423723, 1492100, 1483031, 1398763, 1503058, 1478885, 1394205, 1423121, 1414912, 1339005, 1259318, 1263267, 1274173, 1239233, 1316082, 1351404, 1272510, 1181821, 1180831, 1130968, 1113829, 1099526, 1090302, 1119163, 1172274, 1188781, 1177386, 1278220, 1203661, 1153275, 1161062, 1216175, 1189239, 1115640, 1045451, 1077040, 1144035, 1151203, 1105807, 1086320, 1013080]
12084A013080n0211J17576M5817m0063O328o0144l3748m8155m1615J39807K8240
12073A076912m9642J970K5052l0220o2542L5310P357K9432K1182l029r5732q4943
12061H71107k202n3985K1006M8465Q2419j9738N6j2140M544J7435l4482j3585
12049I08900p1669r5799j2208M9507P3838J4976l4804q202k4233O1017L3748l3033
12037H62038p1373m7459N512L7628K2659k7999M6211K3330m391m5240k9100L363
12025G75179m9101j8332M868K2327O1489L3392j99j34738j4672o5159j2693N8418
12013F60779o335k4434N1671K3705j5246K4629o3814l2747Q395P4684L5175j13063
12001F23399p9683p862K1882K9849k9417j8348m3189K3167k8267P0404J8369P0398
$$ y = [1013080, 962869, 1080445, 1126262, 1086199, 1092527, 1032383, 998635, 950480, 908865, 1048672, 1076912, 1027270, 1029240, 1054292, 1024072, 961530, 996840, 1004197, 1033629, 1054811, 1051782, 956050, 871107, 868905, 814920, 835926, 884391, 966810, 947072, 947128, 934988, 939532, 956967, 922485, 908900, 837231, 741432, 729224, 778731, 852569, 867545, 832741, 824539, 800306, 861323, 895071, 862038, 790665, 743206, 748718, 786346, 809005, 781006, 827217, 850547, 846156, 800916, 771816, 775179, 726078, 707746, 712614, 734941, 796430, 829822, 829623, 694885, 680213, 615054, 602361, 660779, 654444, 630010, 681681, 705386, 690140, 714769, 650955, 618208, 626603, 701287, 736462, 623399, 543716, 535854, 557736, 587585, 558168, 539820, 496631, 519798, 491531, 561935, 580304, 650702]
11989F50702l7880r6073N1308P5166O907O325n0333k5740j1375n7287k8348J18261
11977F01633L5619K8505N774n5964j41431o6489J28335J14911l2774o1437j2675
11966E44007o0320j22467j3390k8679J558J33536Q4519j7259o8697m1923L2609
11955D43494m9715k7196o0760L5193O3866J6537k5283J3525M5650O3416j28415
11944C90312k4374K9133O1346M6340l1608M9151N3388o1545o4538J3204K8122
11933D88931p0610n8890m5135n6296q5341Q6649O4222J7660K9417m2191q1854
11922B46562O7940P9393l6208j5146m881j7806K9076O0919m2125n430R504J0887
11910C82685Q8477l6838k7586k3832o1581k3929k6166K8267J9631l0844J16975
$$ y = [650702, 612822, 516749, 568057, 643223, 650130, 656455, 606122, 580382, 569007, 511720, 483372, 601633, 637252, 665757, 671531, 615567, 474136, 407647, 535982, 650893, 618119, 556682, 544007, 483687, 361220, 347830, 319151, 320709, 454245, 538764, 521505, 452808, 410885, 443494, 393779, 366583, 305823, 341016, 404882, 421419, 396136, 409661, 455311, 518727, 390312, 365938, 395071, 456417, 502757, 471149, 520300, 573688, 512143, 447605, 460809, 488931, 418321, 359431, 314296, 258000, 172659, 259308, 323530, 341190, 370607, 328416, 246562, 314502, 393895, 357687, 342541, 337660, 319854, 348930, 409849, 367724, 362294, 371798, 382685, 471162, 434324, 406738, 382906, 321325, 297396, 271230, 299497, 319128, 288284, 405259]
11899D05259l8159m9423M9387j6325k1407j3621K1631L0644l5714l9027J2389
11888C05634m8830j4376K0023J6115o365m4707L8730L2025q727o696K7999M4552
11876C55377O7311Q9041l0178q6663l9837l3266K0214k1016J4090k5133l1432
11865B78508J6905k2397r5356l3730J5649J1798P5164Q5002q2462K745M8228M3163
11853C43217O0998N7734o5005j08273q0363l9737O5467l2255M5357O2269O3780
11842C73189j2959l9461O2269K1215K2593q2996r56l2680m4075j8816k7025M2889
11830B63187j7K9801M9567j5809J1814M5727p9407p4299l5069m9702L9793O3238
11818B48824q07O4853k4432k21j9736O3865k4811o731q790k8963m325K5305J9482
$$ y = [405259, 367100, 317677, 367064, 350739, 329332, 315711, 337342, 367986, 332272, 293245, 305634, 256804, 242428, 262451, 278566, 272201, 227494, 266224, 298249, 289522, 282826, 310825, 355377, 422688, 511729, 481551, 394888, 355051, 321785, 341999, 320983, 335073, 309940, 278508, 295413, 273016, 177660, 143930, 159579, 171377, 246541, 331543, 249081, 251826, 300054, 343217, 404215, 461949, 396944, 288671, 208308, 168571, 234038, 201783, 247140, 309409, 373189, 360230, 320769, 383038, 404253, 426846, 343850, 342894, 310214, 266139, 247323, 220298, 263187, 263170, 292971, 342538, 326729, 338543, 384270, 304863, 230564, 195495, 145793, 185586, 248824, 248017, 312870, 288438, 288217, 268481, 332346, 307535, 300804, 292014, 263051, 258726, 284031, 303513]
11805C03513j20841r6460J6156j7058N6708P2839O1074r214m8329J2392P4060
11794C04840N65o1225k6175k6908j02634m4781M2969P5657k6863M4944K8805j588
11782B07606j2527m3052m7760p0045j4361P1498n0213p6756P1636J43665J16261
11771B95952r4824o8093o9566M7467K5285k1285n2505K7707R1273p6298p7883
11760B7230O9993k7229J05372J00867R8840L5616o2003n5491n3796k4247l8403
11749A76749m1784l8142R5147r679m7900j6499P204l706O2471O3512k1609K474
11737B28238j4456o2036J22580M2121j08645m6724O6936p5052q5582K6568J598
11726I5546n2541M3652L1488l9197r883J03057M1434N5228j00847j12421l6895
$$ y = [303513, 182672, 86212, 102368, 85310, 142018, 214857, 275931, 266717, 218388, 230780, 304840, 305405, 244180, 218005, 191097, 88463, 43682, 86651, 162308, 135445, 180389, 209194, 207606, 195079, 152027, 104267, 34222, 19861, 91359, 41146, -35610, 36026, 179691, 295952, 201128, 133035, 63469, 110936, 136221, 114936, 62431, 90138, 181411, 105113, 27230, 97223, 69994, 175366, 276233, 375073, 410689, 348686, 293195, 239399, 215152, 176749, 134965, 96823, 191970, 182291, 134391, 117892, 125096, 121390, 183861, 247373, 225764, 228238, 213782, 151746, 274326, 316447, 207802, 161078, 228014, 152962, 67380, 93948, 95546, 43005, 86657, 118145, 78948, 69065, 172122, 213556, 268784, 167937, 55516, 18621]
11715A8621Q1498M9163m7447Q8140R5901L709m3960k0084j8081L7657n230N5339
11703B95226K231m4573M152J1206n7624k4416l5243p2230K2449O480K6314k4953
11691A09019M579l2172k6718k044O4093L948l8625J8519j7015J5410L198N7354
11679A59546m0024J9296r559m3053q352L1869M2374o2354O7842K9564L6761J8699
11667B42609p5534P5084P765J2720k1594j0880K947k4368j29150n6921m6955J1330
11655a2947J3150K8515O3634Q8672m3443J7138P5003Q389l7382J3612r528j5067
11643A89746j7232o1570K6563l0454l282P7284N198n9592M391j2102K7552L8635
11631A85137M3984M8347M2417j28523j24920l1688O3569p535k5409J0714k9895
$$ y = [18621, 100119, 149282, 101835, 189975, 285876, 289585, 245625, 225541, 207460, 245117, 239887, 295226, 297457, 252884, 257036, 268242, 210618, 186202, 150959, 78729, 101178, 107658, 133972, 109019, 113598, 81426, 54708, 52664, 116757, 120705, 82080, 100599, 83584, 98994, 102192, 159546, 119522, 138818, 129259, 86206, 77854, 109723, 152097, 89743, 157585, 187149, 223910, 242609, 167075, 242159, 249924, 262644, 241050, 230170, 233117, 208749, 79599, 22678, -24277, -12947, 203, 28718, 92352, 181024, 137581, 154719, 229722, 238111, 200729, 214341, 204813, 189746, 172514, 110944, 137507, 107053, 103771, 181055, 186253, 126661, 131052, 118950, 146502, 185137, 229121, 277468, 319885, 191362, 66442, 34754, 98323, 90788, 65379, 76093, 46198]
11620D6198p82O7200K0657j7749J1852l0516K5222l2800m0117k1109J9600l5632
11608A2024l7444O9062O5822M708q6336L7526M5350P22m3429j4526J6911K9261
11596I9651q1571j6891k14o1893K4319Q9760L6450q3178m0896O1361P6703M9807
11584A53408L6890j53737j9286P6732P0317K6877M9219j1928j4020k0746l2418
11573A61308M243l0008n9247N4574M3401r3029l6811r539k9252m695P1081K7178
11561I9204K1011n2777r4193k3596L2374O9233M3861r802K4344M5079J478K6993
11549A83209n9061r0800O050O6144Q6878j4694n9569o3484k3720J19810K9188
11538A79951p7354K591P9360O1259j22185m5224J8201M9599P8830K6665m1741
$$ y = [46198, 45416, 112616, 133273, 115524, 127376, 96860, 122082, 89282, 49165, 28056, 47656, 12024, -25420, 43642, 109464, 114172, 27836, 65362, 110712, 111434, 68005, 53479, 70390, 99651, 18080, 1189, 975, -60918, -36599, 53161, 89611, 6433, -34463, 26898, 103601, 153408, 190298, 36561, 17275, 94007, 164324, 191201, 240420, 228492, 214472, 193726, 161308, 165551, 135543, 76296, 130870, 174271, 81242, 44431, 34892, 5640, 945, 72026, 99204, 120215, 67438, -26755, -50351, -17977, 51256, 95117, 85315, 109659, 154738, 156216, 183209, 124148, 33348, 39398, 105542, 192420, 177726, 118157, 54673, 30953, 150763, 179951, 102597, 105188, 184548, 245807, 123622, 78398, 96599, 146198, 225028, 251693, 209952]
11527B09952p8562L4650K6894J8305J11875o8690j41619J044j7375m1521M5898
11516A00851r871K1054P3143k9967J132N431o6350n8214K6756j625J3469J1145
11504H6954j8632m5827O83p5832m934O2811J8587m2479p3850k419K027R4371J12790
11491A14250J35477j8361l3644K14o9689j10023J1482M3403n6861k2056l0159
11480c5967J12998P4950n7611N5927m9485n5202r2725l6086J26138k621N119j7985
11468B7450R485j6758J1265j947k1770m0805O652J2536P6905R0390O4574o7837
11456A50140m8686k9931j2979n5489J9599n3971Q1415O7209N0918n2943j29578
11445a4296n4441k0596P3804P7352M3576k5981N39L0255k7606k3677K9303N4166
$$ y = [209952, 131390, 166040, 192934, 211239, 323114, 254424, 112805, 113849, 96474, 54953, 100851, 90980, 112034, 185177, 155210, 156342, 161773, 95423, 37209, 63965, 62340, 75809, 86954, 68322, 22495, 23178, -52654, -57588, 5223, 23810, -18669, -92519, -94938, -92911, 1460, 114250, 249727, 231366, 197722, 197936, 128247, 18224, 29706, 73109, 16248, -5808, -35967, 77031, 151981, 94370, 150297, 100812, 45610, -47115, -83201, 42937, 40316, 45435, 27450, 36935, 20177, 31442, 29495, 7725, -33080, -26428, -13892, 63013, 153403, 217977, 150140, 101454, 71523, 58544, 3055, 22654, -31317, 50098, 117307, 168225, 115282, -14296, -68737, -89333, -15529, 61823, 105399, 79418, 79957, 110212, 82606, 58929, 88232, 142398]
11433A42398o0810l3009Q198M1179L8429o9639j59107n5517J12448R697o048P4657
11421D2876K0899n1814m3363K219O3964J1983j02226q042m4971j4730M6146N7714
11409a9345R794Q4781q605o0170j1454M7496K0910M8267n0116m5337J881N5717
11397G3819l535o9738l2341N8072K4480j2992P057P3611j467k853n6532n663K5310
11384G7228k5973N5899l6396l8352k005r281n8160J564L9223k909J0584O8743
11372H0165J8409k6493j9605K349k0282k0422N7469Q0089M7349j21119n8604L8307
11360E7612K9605l1016r426o3554N5899Q880j37318n6500J37874Q9304m0353j9144
11348B1863p4225q8722M2633j4126l0839L2861O0070O9554N8199O9572O4701l3838
$$ y = [142398, 81588, 48579, 56777, 97956, 136385, 66746, -92361, -147878, -35430, -25733, -31781, 42876, 63775, 11961, -31402, -29183, 34781, 46764, -55462, -63504, -108475, -123205, -77059, -19345, -9551, 75230, 66625, 6455, -4999, 42497, 63407, 111674, 61558, 16221, 18102, 73819, 70284, 546, -31795, 26277, 50757, 37765, 44822, 118433, 116966, 114113, 57581, 51918, 77228, 51255, 107154, 70758, 32406, 30401, 21120, -37040, -35476, 3747, 838, 11422, 80165, 98574, 72081, 52476, 54825, 34543, 14121, 71590, 151679, 199028, 77909, 19305, 57612, 87217, 56201, 46775, -16779, 39120, 48000, -89318, -145818, -7944, 81360, 41007, 21863, -52362, -141084, -98451, -112577, -143416, -110555, -50485, 19069, 77268, 146840, 211541, 177703]
11336A77703q0809o992o9769q9973N2476P0118j1980o4318n1355O1427M8241n716
11324B9053Q0417K9399l3002m2377j5646P299J7072j9450k1145P832O5620m4791
11312F0281p3758M538J11947n2204m5694N0612m9541j7954O4835K5272m5280k8652
11300D402K7313N4151J3249l1016m079O411k6560k4845k5223k2915K6008N5082
11288E1978m4401j1627l4533J7032P5951J07548j6933o4882J7504m1747l9236
11277A6654J2846K7683J21864k9882o1678j3818L354O0389O431p9445J249M2621
11265A08268L6624L0460p8289j02134j944O5898k2431o3394l5499K8134m0046
11254g4353m0288J968M4651Q0771J2863k065P2081J4862m2852j13081r388O3688
$$ y = [177703, 96894, 89902, 20133, -69840, -17364, 52754, 40774, -23544, -74899, -13472, 34769, 29053, 109470, 138869, 105867, 63490, 47844, 55143, 72215, 52765, 31620, 39452, 105072, 60281, -13477, -8939, 103008, 50804, 5110, 55722, 6181, -11773, 53062, 78334, 33054, 4402, 31715, 85866, 99115, 68099, 64020, 70431, 43871, 19026, -6197, -29112, -3104, 51978, 7577, -4050, -38583, -21551, 54400, 161948, 145015, 80133, 97637, 55890, 16654, 29500, 57183, 179047, 149165, 87487, 73669, 77023, 137412, 143843, 64398, 65647, 108268, 144892, 175352, 97063, -5071, -7015, 58883, 36452, -26942, -62441, -34307, -74353, -114641, -112673, -68022, 12749, 25612, 23547, 95628, 110490, 67638, -45443, -54831, 8857]
11242H857J9321P062K2903K4194l2332l0265k9612M746l3718N835k2973j7407
11230g3389O3305J3773K3152Q7774n306m5390p5128N409K0467J2335J6294M7328
11218I0624j8240q2908l4804L9825K4066J3177M6082l6180m3634O8986J1441n7411
11206B1024m4499m8286J0338N5447R403Q571N7919Q178k842k227k0950n1559j4593
11193a4076P860K8999k2632l440k9657M905M3136J7947k5338P4361R5229Q088
11181A85382m385l8136n3357j5555o2474O7519n0559L4873m6084n7912L6284o1973
11169f6377l0026k525J20727P8177K0908J9769n3060l3839r5308K6677J12321
11158I7444K6935p5829r2106q6023M3603N3380r3299j599O9538L6515l9176K7444
$$ y = [8857, 28178, 35240, 58143, 82337, 50005, 19740, -9872, -5126, -38844, -33009, -55982, -73389, -10084, 3689, 26841, 114615, 109309, 63919, -11209, -5800, 14667, 27002, 43296, 90624, 72384, -10524, -45328, -5503, 18563, 31740, 77822, 41642, -1992, 66994, 78435, 21024, -23475, -71761, -61423, -5976, 3427, 11998, 69917, 78095, 75253, 73026, 52076, 517, -14076, -6216, 22783, 151, -3289, -32946, -28041, 15095, 33042, 7704, 82065, 177294, 185382, 180997, 142861, 89504, 73949, 11475, 78994, 28435, 63308, 17224, -40688, -4404, -66377, -96403, -98928, 21799, 99976, 120884, 140653, 87593, 53754, -41554, -14877, 97444, 124379, 48550, -43556, -129579, -85976, -32596, -125895, -127494, -57956, -21441, -60617, -33173]
11146c3173O4795j3536O174j0091q424l3066m0584n5019n1277P014r875K2264
11134a54798P3296J8946J4491j06650o3186L4237J07879Q3146N738p2395L4308
11123b4988K5888J4948M3961M4758O7740r0935m1691r26p0099m9694N9650j573
11111b2961J1983o3270M5419Q0122P3629n1430m149o664k8670l3701j8141k3579
11099d1412j13326k1422L8400M4741O924q524L8064j4012L4948Q7325m2509j24055
11087a14858n8868J3505N7215J9987R4727K2316m4155j2199k9114P478p517M0725
11075a0758N9792j2356m0763M2071P7533k3141l4414j4146K1817n0531l0770k1383
11063c7049n4280K2909L6897O3814j9775j00786j1388K7579J9729k6045j9753
$$ y = [-33173, 31622, 18086, 24260, 14169, 5745, -27321, -67905, -122924, -174201, -167187, -177062, -154798, -81502, -62556, -48065, -154715, -217901, -183664, -75785, 7361, 13099, -59296, -24988, 900, 15848, 59809, 104567, 172307, 81372, 39681, 38755, -31344, -81038, -21388, -22961, -10978, -74248, -28829, 51293, 124922, 73492, 69343, 62679, 34009, 308, -17833, -41412, -154738, -176160, -137760, -93019, -86095, -94619, -56555, -70567, -35619, 51706, 9197, -114858, -173726, -160221, -103006, -83019, 11708, 34024, -10131, -22330, -51444, -43966, -51483, -10758, 49034, 36678, -4085, 37986, 115519, 92378, 57964, 43818, 65635, 15104, -15666, -37049, -91329, -68420, -31523, 32291, 12516, -88270, -99658, -72079, -52350, -78395, -98148]
11052i8148N6205N6161j1806M8410K012o454l6145l1645l0415j1864P6132K9147
11040D1590P2843q2935J1454j970p604P8984q1240l7409p9173l6552l0708J14748
11028c7972Q2580L1491o399j8467j8190l9555m7092o8305Q718R3697o574L9691
11016A3623O2360m7806j3737K7052O7494K2381l3707j9973N9540m783j087n1347
11004H0010j20489l470R4773k8296m9027Q098L6199L5918n0269l3627j5276K3847
10992b1609q43L996R6156K0291j6504k3640m1632j1829n321j15091K4920K9068
10980f2038O582M2847L9939O367k4077J7184m5924j7673N6040K5254l4590O6574
10968G6485k5464r2097k0099k2826M7178n074R2340K2963m4960J3701P0269J8863
$$ y = [-98148, -41943, 14218, 2412, 50822, 52834, 46380, 10235, -21410, -51825, -63689, 12443, 41590, 114433, 31498, 42952, 40982, 33378, 112362, 31122, -6287, -85460, -122012, -152720, -37972, 44608, 76099, 69700, 51233, 33043, -6512, -53604, -121909, -113191, -19494, -26068, 13623, 75983, 28177, 14440, 41492, 108986, 131367, 97660, 77687, 137227, 132444, 131357, 80010, -40479, -43949, 50824, 22528, -26499, -18401, 17798, 53716, 3447, -30180, -45456, -21609, -22452, -18456, 77700, 97991, 81487, 57847, 16215, 4386, -935, -116026, -91106, -62038, -55456, -12609, 27330, 33697, 9620, 26804, -19120, -36793, 19247, 44501, 9911, 76485, 51021, -41076, -61175, -84001, -36823, -41897, 50443, 73406, 28446, 42147, 112416, 131279]
10956A31279n2765m3164j1071M1313K3701m4364N6513M9557l0786n8051j8800
10945D3362o8810k239k923O2861N8921J3277Q878j2182l7547j29155P283J04629
10933D6355n9878J0730M6623l5541m000j9594j8776o4658k8270P2431J07026J4690
10921F7138l6587o3708k4924K620J3415M882m2572m7417R6254N3981P754l1078
10909b42l9117r1811j0237P7564K7182L3659q8689q1782N2245R7304K3760o5363
10897f5527l1485J6147P0031R5247J1629l0733n1201n7550M8785J05649J8269
10886A29261k9716k1358l4049o0438N302R244K8009k5338k8350m8544j9932J12887
10874A6978L3935M557Q217m1258N8435R239L3537o3995m8051J01227p843Q3333
$$ y = [131279, 78514, 35350, 24279, 65592, 89293, 44929, 101442, 150999, 120213, 62162, 43362, -25448, -27687, -30610, 32251, 91172, 104449, 113327, 101145, 63598, -65557, -58274, 46355, -13523, -2793, 43830, 8289, 4289, -15305, -34081, -98739, -127009, -54578, 52448, 67138, 30551, -33157, -58081, -55461, -42046, -37164, -79736, -127153, -30899, 23082, 30836, -242, -39359, -131170, -141407, -63843, -36661, -3002, -91691, -173473, -121228, -23924, -164, -65527, -97012, -80865, -10834, 84413, 96042, 65309, 14108, -43442, 5343, 110992, 129261, 99545, 78187, 44138, -16300, -10998, -1754, 26255, 917, -27433, -75977, -95909, 16978, 50913, 55470, 63687, 22429, 80864, 90103, 123640, 59645, 11594, 112821, 104978, 188311]
10862A88311O4699n2975p0992m9430j8638Q4164o8716j8741M0745n4148N3816
10851I8095k9644k9191Q665L8258j0805n6422n2026K514l110Q529L4098O5215
10839G4176j2206R2511q569l2741q8955p5607L1751N9629o4376p828l495l5987
10827g1697P2027L8630N6977M9402Q310k6822r3754K5033J1076K2642m0652q2239
10815c1067p302j413J5298M8195o4659J1378K6980m4195q6391l2962M9595O1406
10803e5137n4622Q2287L3870k687j2719m8012j8901l0081o5876m8788L7096N3145
10791a30425n462M416O610k001J0067K0150J0415k8171K4067J07222l7524k9611
10779e0247O0684j7016n5289L3366l444k0141J40476N7833K7065k6461k5113o5828
$$ y = [188311, 253010, 200035, 129043, 79613, 60975, 145139, 76423, 57682, 98427, 44279, 98095, 68451, 39260, 47925, 86183, 75378, 18956, -33070, -30556, -33666, -25137, 8961, 74176, 61970, 154481, 145912, 113171, 24216, -51391, -19640, 39989, -24387, -32215, -35710, -71697, 330, 38960, 95937, 145339, 153649, 126827, 33073, 58106, 69182, 91824, 51172, -31067, -38369, -39782, -24484, 23711, -40948, -29570, -2590, -46785, -133176, -166138, -116543, -55137, -109759, -27472, 6398, 3711, -9008, -57020, -75921, -106002, -171878, -220666, -183570, -130425, -135887, -131471, -124861, -126862, -116795, -96645, -86230, -114401, -90334, 16888, -20636, -50247, 10437, -6579, -61868, -28502, -31946, -52087, 88389, 146222, 173287, 146826, 121713, 55885]
10767E5885r3601M837L0915p573j6192M9018m863j0839m1856J2273K095o6282
10755h6183p9335o2346J53230N4532q8890n9357J9902J335J1403M5286P4154P8164
10743F1895k3126q317N1220p8514r0039k5958M1426j2097k3534m4915K7198P0453
10731e4308J02277m28p4473K7200n884K0848J5544O4992j3266o7857L7747j2086
10719D0306j11273n1673L9662Q0834L0172J1894O9205L137k6311j26251r6507
10708a36805k6135K4747J0853J19044N1276K4201M544j21409n8490l3490L2637
10697a09027N0434J7720N8790l056o5331M7892J09194K5871J1076j2661l0366
10686A00536n3759n261L5637L5821K696l6330r7305m9488J0385L6593k1481J7096
$$ y = [55885, -37716, -32879, -1964, -9537, -25729, 23289, 18426, 7587, -34269, -21996, -19901, -86183, -165518, -227864, -74634, -20102, -108992, -168349, -148447, -147112, -135709, -90423, -16269, 61895, 38769, 30452, 81672, 3158, -86881, -112839, -71413, -83510, -107044, -151959, -124761, -54308, 47969, 47541, -26932, 268, -5616, 15232, 30776, 95768, 82502, 14645, 52392, 40306, -70967, -122640, -82978, -2144, 28028, 39922, 109127, 112264, 85953, -40298, -136805, -162940, -138193, -127340, -8296, 42980, 67181, 71725, -49684, -108174, -141664, -109027, -58593, -40873, 17917, 14861, -50470, -2578, 106616, 132487, 143563, 130902, 100536, 46777, 41516, 77153, 112974, 115670, 79340, -17965, -67453, -57068, -20475, -41956, -24860]
10674b4860O7579q8588q9236K4666J01040J8127r0598M7972J41783N7152j52957
10663A2080M2047M1001J5230J2757j2106K6186K0550l6104p0997j9002J2996P7542
10651A22180N2841N1015P1505M5904j13935j77563q1486K122P972q154n5392j1652
10639i4643O0013L3357N0883J2067K5894p943j2791J7836P0302m2906o7421j4765
10627B9883K9927l3823n4331m5262n682m1468n3340k1472O2641J24252N1564n962
10615C6927k4302N244r503J3649J9401L7854k781o250J4385j0862j34783L3580
10603b7441R7824m0594p1530j9534N9042K0913m7776J1588k097m907M115J5391
10591e006k6615J6730k3075k9993J6988P3695M1910k9859p4050m1584r2871K5176
$$ y = [-24860, 42719, -45869, -135105, -110439, -9399, 8728, -81870, -33898, 107885, 165037, 12080, 54127, 95128, 110358, 123115, 111009, 137195, 157745, 121641, 50644, 31642, 44638, 122180, 175021, 226036, 297541, 343445, 229510, 51947, -29539, -27417, -19445, -27599, -82991, -94643, -34630, -1273, 49610, 61677, 87571, 79628, 66837, 84673, 154975, 112069, 44648, 29883, 59810, 25987, -28344, -73606, -79288, -120756, -174096, -195568, -132927, -8675, 42889, 36927, 12625, 17869, 8366, 22015, 41416, 79270, 76489, 70239, 84624, 73762, -61021, -27441, 70383, 29789, -41741, -61275, -2233, 18680, -29096, -17508, -19605, -24512, -20397, -5006, -31621, -14891, -37966, -67959, -50971, 22724, 64634, 34775, -39275, -80859, -173730, -148554]
10579a48554K1490M5537J0328m3788k8526m1220Q35M4141L5356O0985J5960m1703
10567f9159Q2427J24566K1296j22171m7831l775l284o404J36049N5836K38n3199
10555A14589m3827j7067m3222k4221N3537K1698m1080m5980j3856l9438L7392
10544d1475M20L200j8763m4933O7675R5108n2253k2309n068k3294n8372M946M2107
10531e3011M1742K249L4550p947o83k8490k2988j4693j0933M9311M9640l5735
10519C012n0658q6345m2060L1045N5555P2947R1642j0230r8011m4434O536R2844
10507B1843N9433q769r568o5465j00064O4906M8899K4o1375K4422P9844k3154
10495C0976j15591l6976K7354M2413J0573L1734j8150P6352P8811o6285n0586
$$ y = [-148554, -127064, -81527, -71199, -114987, -143513, -184733, -183898, -139757, -104401, -43416, -27456, -69159, 13268, 137834, 159130, 36959, -10872, -14647, -17931, -24335, 111714, 167550, 167788, 114589, 70762, 53695, 10473, -13748, 39789, 61487, 20407, -25573, -39429, -78867, -41475, -41055, -37855, -56618, -101551, -33876, 61232, 8979, -13330, -18398, -41692, -100064, -95118, -53011, -11269, -9020, 25530, 17583, 16900, -11590, -34578, -49271, -60204, -10893, 38747, 3012, -47646, -133991, -176051, -145006, -89451, -16504, 75138, 64908, -33103, -77537, -71001, 21843, 81276, 72507, 62939, -2526, -102590, -37684, 11215, 11239, -50136, -25714, 54130, 30976, -84615, -121591, -94237, -51824, -41251, -9517, -27667, 48685, 127496, 61211, 10625]
10484A0625J4843Q240K1620m2984k5084q6173L8574O1680o078N0224j276J8763
10472F2974M8894K0441L8553p54J0826l8517p4756m9920L8603j950p7231q0142
10460a02979K84J36959K4613j2815K5444l9722l4719R539K9239J5451j4896M830
10448D1228Q2289R626k4554l3045o0865m9168P421R940n0177k07j3984m8258L2938
10435i6816J115K8312J7272K9004j4196p7515J6605K089K2346k0817K7827N1733
10423a3041Q0364k194j33805l4199R6757J24307J21393l9551o1251k9863k9227
10412G9690j4599j6835p3525p8294P0237N7466o990m4815l668O0504m7210M8413
10400C0374k0923k3166n2286J933n4933L2271J0851L4728j1558N063Q0724J27547
$$ y = [10625, 25468, 33708, 55328, 12344, -12740, -98913, -60339, 1341, -4737, 45487, 44211, 62974, 111868, 132309, 170862, 170108, 180934, 142417, 67661, 17741, 56344, 54394, -22837, -102979, -102695, 34264, 58877, 46062, 71506, 31784, -2935, 6604, 35843, 51294, 36398, 41228, 123517, 133143, 108589, 75544, 14679, -34489, -27068, -17128, -67305, -67512, -81496, -129754, -96816, -95701, -67389, -50117, -21113, -35309, -112824, -96219, -94130, -71784, -92601, -64774, -13041, 67323, 65129, -68676, -102875, -6118, 118189, 239582, 200031, 138780, 108917, 79690, 65091, 48256, -25269, -103563, -33326, 24140, 17150, -27665, -31333, 29171, -18039, 30374, 9451, -13715, -66001, -64068, -119001, -86730, -75879, -41151, -52709, -47646, 33078, 160625]
10388A60625j03996p7486P5124K2422m376m5786j1228r7070J5180L2259p068J1326
10376c0074k500N8178k0334j37601l1967N585N8484N8876K7254L156p21K8965
10364A7301N3666O1061l9831n6466o7444q0443n7018J1433K87J2284O2980Q1566
10352f24K1106j6160J2724p189p6780L6034m5230R551L712J8476j0952N2214K1716
10339A8598N7401K5466l3413l7879k1076J1998O4526O9122l5746K199j7762l7198
10327F6236r5415j6279n165O9718J8822K1535J9299m2990m6101Q2685N0655N1251
10315A74251M1842P230L0572j13324r531j2267L7206j5923o6580k6435L6375o379
10303G7037P60Q761R4378K6041r9373j17507J7998Q499q328J2514P2405N3119
$$ y = [160625, 56629, -20857, 54267, 76689, 72313, 26527, 15299, -81771, -66591, -34332, -41400, -30074, -32574, 25604, 5270, -132331, -164298, -158713, -100229, -41353, -14099, -10943, -11664, 17301, 70967, 132028, 92197, 35731, -31713, -112156, -169174, -157741, -157454, -145170, -82190, -624, 20482, 4322, 17046, 9857, -66923, -30889, -76119, -66568, -62856, -44380, -55332, -3118, 18598, 75999, 101465, 68052, 30173, 9097, 21095, 85621, 154743, 118997, 121196, 103434, 66236, -29179, -45458, -50623, 19095, 37917, 59452, 78751, 35761, -10340, 72345, 123000, 174251, 216093, 223323, 253895, 140571, 131040, 118773, 155979, 140056, 73476, 47041, 83416, 77037, 77797, 86558, 180936, 206977, 107604, -9903, 8095, 16594, 8266, 20780, 93185, 146304]
10291A46304L1387O4523L7767J03940K00450K02754L19293N11744O36907L04571
10281B559640j09272l83324m55275l95635l62906k28225j18095l3582j9058m002
10271D50266M9109j1848J0244M1956J46222J26776J34428L03901M35736L93116
10261B079906K14585m1430k96160m70425l50941k34161j44540r4989j11014j61485
10251C89346j61907O0486N8073r6705m8554N5024O860K2924j0466P342O908J6889
10239C06220p3792k3380n1066J3421K3677K4905n1841L1760j06146p0351N6871
10228H0278K1501k4714j8230M965r9456M3509j7606j5932K0559m575Q685O5430
10216F4414K9589r825l9756j1603R293l4057k0194l6502J1418Q840N2775Q055
$$ y = [146304, 177691, 242214, 279981, 383921, 584371, 787125, 1106418, 1618162, 2255069, 2559640, 2450368, 2067044, 1611769, 1216134, 853228, 625003, 506908, 473326, 454268, 450266, 499375, 487527, 497771, 539727, 685949, 812725, 947153, 1251054, 1686790, 2079906, 2294491, 2253061, 1956901, 1486476, 1135535, 901374, 756834, 661845, 550831, 389346, 227439, 287925, 345998, 249293, 200739, 255763, 262623, 285547, 275081, 282423, 289331, 306220, 232428, 209048, 157982, 171403, 195080, 219985, 168144, 199904, 93758, 23407, 80278, 101779, 77065, 58835, 63800, -35656, 7853, -9753, -25685, -5126, -9701, -1016, 64414, 94003, 84178, 44422, 32819, 42112, 8055, -12139, -48641, -37223, -28383, 24392, 32447]
10204C2447l4825K1273P544o1348l624M7691K529k5886M6213p0961O1379L9839
10192F2271q2631j35509K6584P3342K539O8575m613M9756Q1333J7137j9105p3023
10180F6656m9304p0837k4221k6306l031L8270J02973L3019p5101N433k6763M810
10168b4402m14q94K3432j7954l8613O3123Q1484L9324Q633n9795l8286p4286j168
10155c9816O2753M0905o9542o2651k3863Q6134Q2594o1042p2863J8225L7858q0465
10143h1773o4544n3034J5671K8600J44806O6888n6470K6590o511p5528l5696J5269
10131g5732m812r226J5020n9595l8592L2264R108m255O9144M1771p3362J4102
10119h4165N9359N6644k9211l0471J93m6959r320M5130N8452L3400r451m9212
$$ y = [32447, -2378, 18895, 26439, -34909, -38533, 9158, 11687, -14199, 32014, -38947, 22432, 62271, -20360, -155869, -129285, -55943, -53404, 15171, 10558, 60314, 141647, 158784, 139679, 66656, 17352, -53485, -77706, -104012, -107043, -68773, 34200, 67219, -7882, -2449, -29212, -24402, -24816, -25710, -2278, -20232, -58845, 4278, 85762, 125086, 133719, 73924, 35638, -38648, -39816, 22937, 63842, -5700, -68351, -92214, -6080, 76514, 15472, -57391, -39166, -1308, -81773, -146317, -199351, -183680, -155080, -10274, 56614, 144, 26734, 20223, -55305, -91001, -75732, -80544, -89770, -74750, -134345, -172937, -140673, -131565, -135820, -66676, -24905, -98267, -84165, -24806, 31838, 2627, -27844, -27651, -74610, -83930, -38800, 19652, 53052, 43601, -5611]
10107e611L8856K7007j1954k4239M8588N9121l6283o9734m2783n8559J6606O6858
10095G873J8796R4271R789o42n6177j01968Q096l4414l3200k6931K4719N7707
10083c2081j3189Q8995M4520q8429q8350q7656j4446Q6570M367p8932M4658J09055
10071b4918J33264j2613n8202n0627K7138J8572O1950k5824p69L1402L4245p6273
10059E7345j09510n1123K2536R4457O161n7750Q2216l717r668l3558o6830n4317
10047a23758R3417L9888j5720j3581o6701l373O7877P8874q1555n3671K775K7691
10035d7837j6436K4915L4461N7063J7453j3265K8905m4081n1881l3973m7266j2365
10023a04307Q036M2219L1948J5387O2487L2969k8325R652k9274J2738m7344n6586
$$ y = [-5611, 33245, 60252, 48298, 24059, 72647, 131768, 95485, 25751, -17032, -75591, -58985, 7873, 26669, 120940, 130729, 130087, 73910, -28058, -19962, -54376, -87576, -114507, -89788, -32081, -45270, 43725, 88245, -184, -88534, -176190, -190636, -104066, -99699, -178631, -133973, -24918, 108346, 95733, 37531, -13096, 14042, 32614, 94564, 68740, 67971, 99373, 133618, 57345, -52165, -103288, -80752, 13705, 19866, -37884, 44332, 40615, 30947, -2611, -69441, -123758, -30341, 9547, -6173, -19754, -86455, -89828, -21951, 56923, -24632, -78303, -75528, -47837, -64273, -39358, -4897, 52166, 69619, 56354, 85259, 41178, -10703, -44676, -91942, -104307, -96271, -54052, -22104, -6717, 55770, 88739, 60414, 70066, 40792, 53530, 6186, -50400]
10011e0400n5748o2439O0871M6124k045J0087k9075L2592J4153o7949L4836m851
9999g3844L4782J41562O5766r062J7155q0392k9899k7631q4148k1345l4851L3146
9987f8761j1896J7779M4711j4733p0634M6491M4900Q6120m3841n6275L992J6718
9975e429j0192k7514j08869l4463J02963q255K2274P588o8681M9583J6048O2659
9963b288j6202J16082k8598q8238p6409N8250M6906k7557k1358j6224l8534j8112
9951a12282J3116k1683R3762N0869l9977r177K3964n0400n1102Q10r772K3903
9939h7969J16718N963O1738j8746k1895n8565j6309l961j7079N743J0267R594
9927a4501o801j03572j5979l1969M6151Q1043J6248K7563L3071j3449N9606r6156
$$ y = [-50400, -106148, -168587, -107716, -61592, -63637, -53550, -82625, -50033, -35880, -103829, -68993, -73844, -39062, 102500, 168266, 159204, 176359, 95967, 66068, 38437, -45711, -67056, -101907, -68761, -80657, -62878, -18167, -32900, -103534, -57043, -12143, 73977, 30136, -26139, -22147, -5429, -15621, -43135, -152004, -186467, -83504, -91759, -69485, -61897, -130578, -80995, -64947, -2288, -18490, 97592, 68994, -19244, -95653, -37403, 9503, -18054, -39412, -55636, -94170, -112282, -99166, -120849, -27087, 23782, -16195, -25372, -1408, -51808, -102910, -102100, -111872, -87969, 28749, 34712, 96450, 77704, 55809, -2756, -19065, -23026, -40105, -34362, -24095, -14501, -21302, -124874, -140853, -172822, -126671, -45628, -29380, -1817, 31254, 17805, 77411, -18745]
9915a8745j35327r4325R470N0768R9116j5402j06882k6031R9139M5885l6979M8007
9903h1306J7095J38836k7773o5682j688r202p3348L0081J02916j598K0768l1672
9891A7427r1837k6500J6702P0432K4884m2968k3930N682O4710J1849k9190o2006
9879f4745P455L5125j746l9911o047M020O5271P6248n7391N2985P0700L202K9211
9866A74377o534r3768j66054Q6154N8256o3145k0757m7666J049K8411M3601k4507
9854c0583m0570O2388R4019P4832P9193J52509R2169J34890M36178O11104N92290
9843B258419K12449l07681o20136n36908m22864j97364j39962j13424m8259m6691
9833C7579N026O3012K8394n9796r1071K3191k4723j4487J5069n8230j7112j791
$$ y = [-18745, -154072, -248397, -238927, -188159, -89043, -104445, -211327, -237358, -138219, -92334, -129313, -81306, -64211, 74625, 46852, -18830, -20518, -29720, -103068, -72987, 29929, 28331, 49099, 17427, -74410, -100910, -84208, -13776, 11108, -31860, -55790, -50108, 14602, 26451, -2739, -64745, -57290, -22165, -23911, -63822, -69869, -65849, -578, 75670, 18279, 71264, 141964, 145166, 174377, 167843, 74075, -91979, -5825, 52431, -10714, -31471, -79137, -78088, -49677, -6076, -30583, -71153, -8765, 85254, 160086, 239279, 391788, 483957, 618847, 1055025, 1666129, 2258419, 2470868, 2163187, 1543051, 1006143, 583279, 385915, 245953, 132529, 84270, 37579, 42605, 105617, 134011, 74215, -16856, 6335, -18388, -32875, -17806, -76036, -93148, -94939]
9821i4939M6681L4983p3408J9954K1933N9077q69L3026L7478j7775r013J9653
9809G6781J5715Q1650K2813o6235n7981m3555m4274J5898l270n2333m0252j399
9797i6442P3104J7109J16438N5680q1892k0285j5589Q6193n4754r0418n1625o280
9785f8761J00007n4234l6778l7706R3014Q0865k8559j04629R416P1792P2358q9723
9773G062o3177j4580k8275R8913L4368o9848R054n4220N8224M7969K748Q639m2221
9760e344l3784L9265m7690l9152o3597n9561J9768J9158M297m677J6630M5083
9748a09604O5247K4881j4733r9750l7697K4043J56225O6184j36323L2976M508
9737b4043N8384O9680M1236m8442j14032m5750J5383j2185j7740N9451j994N5270
$$ y = [-94939, -48258, -13275, -86683, -66729, -44796, 14281, 13412, 46438, 83916, 66141, 57128, 76781, 92496, 174146, 196959, 130724, 72743, 29188, -15086, 812, -2458, -54791, -95043, -96442, -23338, -6229, 110209, 165889, 83997, 63712, 48123, 134316, 79562, -10856, -62481, -68761, 31246, -22988, -59766, -97472, -4458, 76407, 47848, -56781, -47365, 24427, 96785, 7062, -56115, -70695, -98970, -57, 34311, -35537, -26483, -80703, -22479, 25490, 28238, 36877, -5344, -39128, 137, -47553, -86705, -150302, -209863, -190095, -170937, -166640, -171317, -154687, -109604, -44357, -19476, -34209, -133959, -171656, -147613, 8612, 74796, -61527, -28551, -24043, 34341, 104021, 145257, 96815, -17217, -62967, -47584, -59769, -77509, -18058, -20052, 35218]
9725C5218L014L5872l3089l7883O168N6441k1116l7652P131J29470L4174J1929
9713A89677o9670j65568m4018k1527o0559j5331M9027K3630P4972j7154P3054
9702A6533R341k088l2415n0294J6599o6606o814O1221J29649M6884o2568p1924
9690a2482M2767n8752l2468J8761l5338N8054K7036O865k6573p4270n9682n0778
9678a96860M6243N1742k1061q538j0392P4493P0576M6698M0425m5169n8300l1625
9666d1768l1186P158N7896Q3460r122o7928j7387O644l3305K5948N2992L8960
9654G2362j4415m0556J3399o1564k7388o7966O921j5765M469K4142N9004J06652
9642E9295n3105r2669K3595N4178J3939N6804j02682Q263m0692m1062L5105N4664
$$ y = [35218, 38232, 74104, 41015, 3132, 9300, 65741, 44625, 6973, 14104, 143574, 177748, 189677, 120007, -45561, -89579, -111106, -171665, -186996, -137969, -114339, -39367, -56521, 16533, 25874, 23786, -8629, -58923, -42324, -108930, -115744, -54523, 75126, 122010, 59442, -12482, 30285, -28467, -60935, -42174, -77512, -19458, 7578, 14443, -12130, -86400, -146082, -196860, -150617, -98875, -119936, -128474, -138866, -64373, 6203, 52901, 93326, 48157, -10143, -41768, -72954, -65796, -7900, 75560, 66438, -1490, -18877, -12233, -45538, -19590, 33402, 72362, 57947, 17391, 30790, -30774, -58162, -126128, -119207, -134972, -130503, -106361, -47357, 59295, 6190, -86479, -62884, -8706, 5233, 62037, -40645, -32382, -73074, -114136, -79031, -24367]
9630b4367L0283O103M586j0859J4213P982n3391J04468l9660k4154K7642P4095
9618A16941p708n4789l6826l3869m838r062r870L3448l638n2726k6919L0151K387
9605e7318p8458M4572N6549M3642n0157o3133N2765r232J7129L993n120M327l4792
9592g5233p4026J3577N4270O773k8894L6330M3847n1673k8280m4966J8722J00156
9580b9397M0480K4949k3924p8880p244L4509j4902k7185J02242J02550n405l9387
9568G8406o9874n3099P0001Q1345l999p0361k983R3302K3608N7836j09983j5678
9556G8521j02792Q254q205l3517N8233M2981m7873k588l1254p6782L5647Q8268
9544H893l6346M7987O5943p515m6661J0930P291R441o7161j9576j6987K16J7583
$$ y = [-24367, 5916, 12019, 16605, 5746, 19959, 27941, -25450, 79018, 39358, 15204, 42846, 116941, 109233, 54444, 17618, -16251, -21089, -30151, -40021, -6573, -10211, -62937, -89856, -59705, -57318, -135776, -91204, -34655, 8987, -41170, -104303, -51538, -60770, -43641, -39648, -44768, -40441, -75233, -149259, -135682, -81412, -74639, -103533, -67203, -23356, -75029, -103309, -148275, -129553, -29397, 11083, 36032, 12108, -66772, -74016, -39507, -54409, -81594, 20648, 123198, 117793, 78406, 8532, -44567, 25434, 106779, 102780, 32419, 29436, 122738, 146346, 204182, 94199, 78521, -24271, -16017, -24222, -57739, 494, 43475, -4398, -6986, -38240, -115022, -79375, 8893, -27453, 20534, 86477, 78962, 32301, 43231, 50522, 59963, -7198, -26774, -43761, -43545, -25962]
9531b5962j2718N1126K9324j0887l7494m8586p0901P5831O2629j1906j20072j7589
9519a37205j0500j48m863L4519j8129K5566J21162J2691m9186L0110N8888M2492
9507A05397j5135j16640p5523p4650j8882J0901L4277J2078m775N2433J9884j4972
9495h5607J16936j1120m9373J3792l0881m243N1005n5349j15774J4048L7577N7531
9483f1458j6425P1262k5671r8037L4293L8760J5501l0600k7052P5750L6605P0523
9471H3451l778j20305j17213m4307k4540K8670O4851P8896M9228J13251m9279
9460E8925N0993L8310p3746j2699o2k9726L4090k3714l590J7235p5919r3663J8463
9447i5103P9196O6942O2624K217k6670n2990j10372l8620J9523K2599m3603O0932
$$ y = [-25962, -38680, 12446, 41770, 30883, -6611, -55197, -126098, -50267, 12362, 456, -119616, -137205, -147705, -147853, -152716, -118197, -136326, -110760, 10402, 23093, -26093, 4017, 62905, 105397, 90262, -26378, -101901, -176551, -195433, -184532, -150255, -138177, -142952, -90519, -70635, -85607, 31329, 20209, -29164, -15372, -46253, -50496, 509, -54840, -170614, -156566, -118989, -61458, -77883, -6621, -32292, -130329, -96036, -57276, -41775, -72375, -99427, -23677, 12928, 83451, 79673, -40632, -157845, -202152, -226692, -198022, -133171, -54275, -5047, 108204, 58925, 109918, 148228, 74482, 61783, 61721, 31995, 66085, 42371, 38781, 56016, -19903, -113566, -95103, -15907, 51035, 113659, 115876, 89206, 36216, -74156, -112776, -93253, -70654, -114257, -53325]
9435e3325K0764k802J4424l9874p6819J5398N2671K300p1502j2734M1932O5832
9423d3735N3019J9111k1472M112L2524J5481K4292O8093n4213p3368l6297N8332
9411D5879R5609J5485q0668o0809j2193j1793o2840p9347K6219R7990J18152K1173
9399A12857n2674p5438o7426M7889L0960R5311j9176l4139J555l7294N7596Q509
9387F8530M335J8400k8951j8874q1854j1454O4382R9525L5448L3041q5648r1437
9375E443k3726J07310J7391M867k9396m5484M947j5485o8946q9958m6041P9615
9363i9463j9386M5038m2721o2072O0568o597o1583l5141J00989M4117J6898M6010
9351a3343j7760L3931M0390j0004L4129m6436j5670O2535O4978n3325o3678O734
$$ y = [-53325, -32561, -35363, -20939, -60813, -137632, -122234, -69563, -67263, -138765, -151499, -109567, -43735, 9284, 28395, 6923, 11035, 43559, 59040, 83332, 151425, 97212, 23844, -12453, 45879, 141488, 156973, 76305, 15496, 3303, -8490, -71330, -150677, -124458, -26468, 91684, 112857, 60183, -15255, -82681, -34792, -3832, 91479, 72303, 38164, 39719, 2425, 60021, 68530, 72865, 91265, 62314, 43440, -38414, -49868, 14514, 114039, 149487, 182528, 96880, 5443, -18283, 89027, 106418, 111285, 81889, 36405, 41352, 25867, -43079, -133037, -179078, -99463, -118849, -73811, -116532, -178604, -118036, -124633, -186216, -221357, -120368, -76251, -59353, -13343, -31103, 2828, 43218, 33214, 67343, 20907, 5237, 67772, 132750, 79425, 15747, 22481]
9339B2481m9511P927K5623p722R8839N433j36257J350l5176m740m8828p6588L5472
9326a61697J15098O4274m5518j8659J0861p6792o019J11889L5224l0477r959m0607
9314e2382j8996K7316J4983L8315J1853L0158j5470k8210R4290p0172j7491m0007
9302b5813p9168J5914o508L5102j4582l1932N825n462Q3103Q7906m9423M2334
9290E7296j8804O3324k2011m3600K8662k981l9646M9166p3579k7611m8891k1689
9278a00364M7654P0080j21523p7635L5715J25961J1485R887J4898m3324J5169
9267a1997j2150j758q9482M2726n879p8203O4217J01440o4580N706K3131O9674
9255D2845n0432k4210j8499j4800m8967l4550P3424P9317O7261m2567m8985j0426
$$ y = [22481, -27030, -19103, 6520, -1202, 97637, 103070, -33187, -31837, -67013, -71753, -120581, -197169, -161697, -46599, 17675, -27843, -46502, -35641, -112433, -118452, -6563, 28661, -1816, -11775, -52382, -71378, -44062, -29079, 9236, 21089, 51247, 35777, 7567, 101857, 31685, 14194, -25813, -104981, -89067, -95575, -60473, -75055, -106987, -101162, -106624, -23521, 64385, 14962, 57296, 38492, 101816, 79805, 36205, 64867, 61886, 22240, 71406, -2173, -29784, -78675, -100364, -52710, 17370, -104153, -181788, -146073, -20112, -8627, 1260, 16158, -27166, -11997, -24147, -25905, -115387, -72661, -78540, -156743, -92526, 8914, -55666, -49960, -26829, 42845, -7587, -31797, -50296, -65096, -114063, -148613, -75189, 4128, 71389, 28822, -20163, -30589]
9243c0589j1717l2493K8052k1893N2813K5876l1585J3671j6718L3888K3133N8918
9231I1356O436p8273r9956N5220n581p419J1583L8096k1970l1885K5872j8242
9219c4763q4343L5198J26466n7858j8200O9670L2784K8756k256j1530K7440J8689
9207A30053q0166m8497n3778L9345N2212K0341l4864n7670n6726L4522O891p8615
9195a26952j0226R5581j693N0479K2553l7242k4375K9267o768o4036K3983J05834
9183E6405O4672J649o8820j00823q2289P2259l0188p0110R6510P215L4822N0417
9171C1719m940k9226K3003n9091O4753K9064K0689M8889q5599j3790k3372q6862
9159h4763M3658K7136j30689N3587o668L0161j7011k6067r970n1105R2856O4619
$$ y = [-30589, -42306, -74799, -46747, -68640, -15827, 10049, -21536, -7865, -24583, 9305, 32438, 91356, 97792, 19519, -80437, -25217, -30798, -38217, -26634, 11462, -10508, -42393, -16521, -34763, -119106, -83908, 42558, -15300, -33500, 36170, 68954, 97710, 95454, 83924, 111364, 130053, 49887, 1390, -52388, -13043, 39169, 59510, 24646, -33024, -89750, -55228, -48337, -126952, -137178, -41597, -43290, 7189, 29742, -7500, -31875, -2608, -9376, -73412, -49429, 56405, 121077, 122726, 53906, -46917, -129206, -56947, -87135, -157245, -60735, -53520, -18698, 31719, 26779, -2447, 20556, -38535, 26218, 55282, 75971, 124860, 39261, 25471, 2099, -84763, -41105, -13969, -144658, -91071, -97739, -67578, -84589, -110656, -120626, -171731, -78875, -14256]
9147a4256L8011j0540P3726Q2728m8305m4645J5886j4681k6873m2366L4210l7282
9135E613j4372M5612N2806l9341m9842J8450L3003J0783n7661j49340L5733J0898
9123i7658J3997P6478m7888o6297l1242J1609O4356n6055L9666J14212p2107l2277
9111h3206M6852L1527N0120K3299j1196r8238l4005p5845N1746J23589j6321k73
9099H049j9756j12786m356Q7459j2332m7175L6553N2801L3490J955J9068L5017
9087G7987O7010L0469M526o0410r8265q3626J347l5082k0104o08L4521Q0618j6176
9074a7793m731n9879n1305R3517R1137R327p089m9459o1741O6985R189j3144L4902
9061C9916k1531m9853K8896L7007N6166M7108j0242n7849l9028O697n5522m3172
$$ y = [-14256, 23755, 13215, 86941, 169669, 121364, 76719, 92605, 77924, 51051, 8685, 42895, 5613, -8759, 36853, 89659, 50318, 476, 18926, 51929, 62712, 5051, -144289, -108556, -97658, -83661, -7183, -55071, -121368, -152610, -141001, -76645, -132700, -93034, 21178, -50929, -83206, -36354, -4827, 45293, 68592, 57396, -40842, -74847, -150692, -98946, 24643, 8322, 8049, -11707, -124493, -128849, -41390, -53722, -100897, -64344, -11543, 21947, 23902, 42970, 77987, 144997, 175466, 179992, 119582, 21317, -62309, -60962, -96044, -116148, -116756, -82235, -1617, -17793, -22524, -82403, -133708, -40191, 50946, 60273, 53184, 3725, -58016, 8969, 18158, 5014, 39916, 18385, -31468, -2572, 34435, 90601, 137709, 127467, 69618, 30590, 37287, -18235, -61407]
9049f1407J1509j0504O2841O1657m390j5296n5350k9180l4712l4518J5678N4866
9037c8806n828N2325o8122l3294J2354P1249J28608L8251q0912m296r92m9258
9025B1279q1140j7928J307k692N1272J39365L9493j24795M4098j2961j4050n5276
9013a2028k6906M8083L026O2292l5668N6338L0576k7947j6170j1379j0329m1255
9001A8633J3258M5014o4022J3322J2752N3242M0314m0521l9307n1747O7774l2116
8989C6596o0821j2166l9370k0793k23n1842k968J8410P3650P6101M0520L2832
$$ y = [-61407, -49898, -60402, 2439, 64096, 59706, 44410, -10940, -40120, -74832, -109350, -93672, -38806, -44634, 7691, -60431, -93725, -81371, -10122, 118486, 156737, 75825, 71529, 70537, 21279, -59861, -77789, -76482, -79174, -27902, 111463, 150956, 26161, 70259, 57298, 43248, -12028, -38934, 9149, 12175, 74467, 38799, 95137, 125713, 97766, 81596, 70217, 59888, 18633, 31891, 76905, 12883, 26205, 38957, 92199, 132513, 91992, 52685, 938, 68712, 36596, -24225, -36391, -75761, -96554, -96777, -148619, -151587, -133177, -59527, 16574, 57094, 89926]
$$ [...]
##END NTUPLES=NMR SPECTRUM
##END=
