##TITLE=Analysis number 314479
Compound Code cc 43316
Book Reference 414/136
Project Code adrs
Chemist Name mattw
##JCAMPDX= 6.0         $$ Bruker NMR JCAMP-DX V2.0
##DATA TYPE= NMR SPECTRUM
##DATA CLASS= NTUPLES
##ORIGIN= Bruker BioSpin GmbH
##OWNER= NMR
$$ XWIN-NMR		Version 3.5
$$ Tue Oct 18 09:38:32 2005 GMT Daylight Time (UT+1h)  MAYBRIDGE\NMR@NMR_250MHZ
##.OBSERVE FREQUENCY= 250.131544655141
##.OBSERVE NUCLEUS= ^1H
##.ACQUISITION MODE= SIMULTANEOUS (DQD)
##.ACQUISITION SCHEME= undefined
##.AVERAGES= 16
##.DIGITISER RES= 18
##SPECTROMETER/DATA SYSTEM= dpx250
##.PULSE SEQUENCE= zg30
##.SOLVENT NAME= CDCl3
##.SHIFT REFERENCE= (INTERNAL, CDCl3, 0, 16.522)
##AUDIT TRAIL= $$ (NUMBER, WHEN, WHO, WHERE, WHAT)
$$ ##TITLE= Audit trail, XWIN-NMR		Version 3.5
$$ ##JCAMPDX= 5.01
$$ ##ORIGIN= Bruker BioSpin GmbH
$$ ##OWNER= NMR
$$ C:\u/data/dgb/nmr/ADRS/10930/pdata/1/auditp.txt
$$ ##AUDIT TRAIL=  $$ (NUMBER, WHEN, WHO, WHERE, WHAT)
(   1,<2005-10-18 09:38:01.80 +100>,<MAYBRIDGE\NMR>,<NMR_250MHZ>,
      <created by zg, POWCHK disabled, PULCHK disabled
       configuration hash MD5:
       62 19 C7 07 E1 42 D1 B7 37 6C 3D D0 77 39 F9 E6
       data hash MD5: 64K
       41 34 1E 40 FF AF 4F 20 99 3E 5B 8D 38 2A FB AE>)
(   2,<2005-10-18 09:38:16.08 +100>,<MAYBRIDGE\NMR>,<NMR_250MHZ>,
      <Start of raw data processing
       ef LB = 0.3 FT_mod = 6 PKNL = 1 SI = 32K 
       data hash MD5: 32K
       A5 FF 9B A8 55 50 79 98 BC 19 F0 DD 24 51 CB 80>)
(   3,<2005-10-18 09:38:20.94 +100>,<MAYBRIDGE\NMR>,<NMR_250MHZ>,
      <apk 
       data hash MD5: 32K
       2E 03 49 68 26 ED 3D 87 34 5E 0B DA FE 22 09 3E>)
(   4,<2005-10-18 09:38:22.58 +100>,<MAYBRIDGE\NMR>,<NMR_250MHZ>,
      <abs ABSG = 5 
       data hash MD5: 32K
       A1 A1 98 FC 77 70 92 F7 20 AF 22 14 E9 2B A7 DF>)
$$ ##END=
$$ 
$$ hash MD5
$$ 77 4A C2 57 1C 1D F0 4B E6 20 6B FE 9A 3A FF 82
##$RELAX= 
##$RELAX= 
##$RELAX= 
##$RELAX= 
##$RELAX= 
##$RELAX= 
##$RELAX= 
$$ Bruker specific parameters
$$ --------------------------
##$DU= <C:\u>
##$EXPNO= 10930
##$NAME= <ADRS>
##$PROCNO= 1
##$TYPE= <nmr>
##$USER= <dgb>
##$AMP= (0..31)
100 100 100 100 100 100 100 100 100 100 100 100 100 100 100 100 100 100 
100 100 100 100 100 100 100 100 100 100 100 100 100 100 
##$AQSEQ= 0
##$AQ_mod= 3
##$AUNM= <au_zg>
##$AUTOPOS= <10 >
##$BF1= 250.13
##$BF2= 250.13
##$BF3= 250.13
##$BF4= 250.13
##$BF5= 500.13
##$BF6= 500.13
##$BF7= 500.13
##$BF8= 500.13
##$BYTORDA= 1
##$CFDGTYP= 0
##$CFRGTYP= 5
##$CHEMSTR= <none>
##$CNST= (0..31)
1 1 145 1 1 1 1 1 1 1 1 1 1 1 1 1 1 1 1 1 1 1 1 1 1 1 1 1 1 1 1 1 
##$CPDPRG= <>
##$CPDPRG1= <>
##$CPDPRG2= <>
##$CPDPRG3= <>
##$CPDPRG4= <mlev>
##$CPDPRG5= <mlev>
##$CPDPRG6= <mlev>
##$CPDPRG7= <mlev>
##$CPDPRG8= <mlev>
##$CPDPRGB= <>
##$CPDPRGT= <>
##$D= (0..31)
0 1 0 0 0 0 0 0 0 0.06 0 0 0 0 0 0 0.0002 0 0 0 0 0 0 0 0 0 0 0 0 0 0 
0 
##$DATE= 1129624680
##$DBL= (0..7)
120 120 120 120 120 120 120 120 
##$DBP= (0..7)
150 150 150 150 150 150 150 150 
##$DBP07= 0
##$DBPNAM0= <>
##$DBPNAM1= <>
$$ [...]
##$SUBNAM7= <"">
##$SUBNAM8= <"">
##$SUBNAM9= <"">
##$SW= 20.6930455092707
##$SWIBOX= (0..15)
0 0 3 0 0 0 0 0 0 0 0 0 0 0 0 0 
##$SW_h= 5175.983436853
##$TD= 65536
##$TD0= 1
##$TE= 294.16
##$TE2= 300
##$TE3= 300
##$TEG= 300
##$TL= (0..7)
0 120 120 120 120 120 120 120 
##$TP= (0..7)
150 150 150 150 150 150 150 150 
##$TP07= 0
##$TPNAME0= <>
##$TPNAME1= <>
##$TPNAME2= <>
##$TPNAME3= <>
##$TPNAME4= <>
##$TPNAME5= <>
##$TPNAME6= <>
##$TPNAME7= <>
##$TPOAL= (0..7)
0.5 0.5 0.5 0.5 0.5 0.5 0.5 0.5 
##$TPOFFS= (0..7)
0 0 0 0 0 0 0 0 
##$TUNHIN= 0
##$TUNHOUT= 0
##$TUNXOUT= 0
##$USERA1= <user>
##$USERA2= <user>
##$USERA3= <user>
##$USERA4= <user>
##$USERA5= <user>
##$V9= 5
##$VALIST= <valist>
##$VCLIST= <CCCCCCCCCCCCCCC>
##$VD= 0
##$VDLIST= <DDDDDDDDDDDDDDD>
##$VPLIST= <PPPPPPPPPPPPPPP>
##$VTLIST= <TTTTTTTTTTTTTTT>
##$WBST= 1024
##$WBSW= 4
##$XGAIN= (0..3)
0 0 0 0 
##$XL= 0
##$YL= 0
##$YMAX_a= 487887
##$YMIN_a= -361764
##$ZGOPTNS= <>
##$ZL1= 120
##$ZL2= 120
##$ZL3= 120
##$ZL4= 120
##$ABSF1= 16.522
##$ABSF2= -4.171173
##$ABSG= 5
##$ABSL= 3
##$ALPHA= 0
##$AQORDER= 0
##$ASSFAC= 0
##$ASSFACI= 0
##$ASSFACX= 0
##$ASSWID= 0
##$AUNMP= <proc_1d>
##$AZFE= 0.1
##$AZFW= 0.1
##$BCFW= 0
##$BC_mod= 0
##$BYTORDP= 0
##$COROFFS= 0
##$CY= 12.5
##$DATMOD= 1
##$DC= 0
##$DFILT= <>
##$DTYPP= 0
##$F1P= 14.0000005364418
##$F2P= -0.99999901652339
##$FCOR= 0.5
##$FTSIZE= 32768
##$FT_mod= 6
##$GAMMA= 0
##$GB= 0
##$INTBC= 1
##$INTSCL= 1
##$ISEN= 128
##$LB= 0.3
##$LEV0= 0
##$LPBIN= 0
##$MAXI= 10000
##$MC2= 0
##$MEAN= 0
##$ME_mod= 0
##$MI= 0
##$NCOEF= 0
##$NC_proc= -4
##$NLEV= 6
##$NOISF1= 0
##$NOISF2= 0
##$NSP= 0
##$NTH_PI= 0
##$NZP= 0
##$OFFSET= 16.522
##$PC= 1
##$PHC0= -64.46359
##$PHC1= 9.268777
##$PH_mod= 1
##$PKNL= yes
##$PPARMOD= 0
##$PSCAL= 4
##$PSIGN= 0
##$REVERSE= no
##$SF= 250.13
##$SI= 32768
##$SIGF1= 0
##$SIGF2= 0
##$SINO= 400
##$SIOLD= 32768
##$SREGLST= <1H.CDCl3>
##$SSB= 0
##$STSI= 32768
##$STSR= 0
##$SW_p= 5175.98343685301
##$SYMM= 0
##$S_DEV= 0
##$TDeff= 65536
##$TDoff= 0
##$TI= <Analysis number 999999
Compound Code 99
Book Reference 9
Project Code 9>
##$TILT= no
##$TM1= 0
##$TM2= 0
##$TOPLEV= 0
##$USERP1= <user>
##$USERP2= <user>
##$USERP3= <user>
##$USERP4= <user>
##$USERP5= <user>
##$WDW= 1
##$XDIM= 32768
##$YMAX_p= 339535048
##$YMIN_p= -338598
$$ End of Bruker specific parameters
$$ ---------------------------------
##NTUPLES= NMR SPECTRUM
##VAR_NAME=  FREQUENCY,     SPECTRUM/REAL,   SPECTRUM/IMAG
##SYMBOL=    X,             R,               I
##VAR_TYPE=  INDEPENDENT,   DEPENDENT,       DEPENDENT
##VAR_FORM=  AFFN,          ASDF,            ASDF
##VAR_DIM=   32768,         32768,           32768
##UNITS=     HZ,            ARBITRARY UNITS, ARBITRARY UNITS
##FACTOR=    0.157963299565203, 1,           1
##FIRST=     4132.6476996994, 0,             0
##LAST=      -1043.33573715361, 0,           0
##MIN=       -1043.33573715361, -338598,     0
##MAX=       4132.6476996994, 339535048,     0
$$ Real data points
##PAGE= N=1
##DATA TABLE= (X++(R..R)), XYDATA
$$ [...]
24471 36359 -18271 -30399 6812 7866 -48652 -32403 -41309 -57871 -14223 23001 -57889 -127344
24459 -127344 -121997 -53568 -46357 -76413 -81035 -40590 -22866 -16658 -80778 -156911 -164684 -101026
24447 -101026 -83753 -69212 -62872 -8447 96800 126919 27657 -66248 -114468 -204220 -228292
24436 -228292 -149620 -104994 -10848 33320 -615 -51957 3344 16316 -42282 -49305 -79939 -63028
24424 -63028 -46578 -145061 -152064 -88079 -595 70401 34923 -5966 -58286 -114075 -125016 -86928
24412 -86928 -121014 -87131 -83346 -29491 -36481 -116898 -153720 -132592 -146804 -173181 -179790 -143064
24400 -143064 -113340 -76541 -88958 -27189 82239 -52673 -134442 -129544 -24488 48106 24987
24389 24987 -15894 -45820 -28440 21330 -26295 -57675 -134440 -133876 -14295 102293 72079 27299
24377 27299 24799 -59591 -104567 -50951 -4934 48350 72365 70814 -29701 -38063 2983 41279
24365 41279 -11280 -30051 -7685 -88488 -146902 -37927 71252 -10112 -111076 -121428 -133266
24354 -133266 -134147 7044 12713 58633 -12783 -137061 -172152 -112722 -21979 -9054 226 7110
24342 7110 -15018 -1204 -29645 57725 88590 36415 66465 114742 91342 -8301 -79034 -48991
24330 -48991 -2768 17991 33622 -5227 2180 -97506 -190171 -144261 -71348 -46215 -9833 -26503
24318 -26503 -42231 -60944 -18249 61142 29371 -70757 -75415 -40708 -54552 -70935 -48003 -12091
24306 -12091 -64035 -102505 -156583 -35655 54949 47283 17483 46477 30664 43751 19393 -60754
24294 -60754 -41672 9440 -22824 -60104 -88399 -151711 -136558 -48075 -82708 -30381 -10224 29850
24282 29850 54377 42448 -8418 -77298 -81206 -78060 -47240 16337 20064 -85988 -95984 8535
24270 8535 78565 127157 156465 139226 20428 -71575 26872 28305 -28611 -60886 -53849 -54488
24258 -54488 -79096 55166 52330 -39439 -110991 -35539 106961 113635 42654 -40142 -43924 -46284
24246 -46284 -3119 34838 -5061 -54590 4320 17322 48430 -5939 10835 33902 141496
24235 141496 158548 42834 -41309 -33961 -62432 -77172 -59440 30279 18676 -83008 -136391
24224 -136391 -63274 -35801 -52470 -12966 105657 194378 157879 146089 139612 85004 48520
24213 48520 12301 -33194 -43684 -61189 -51008 -109397 -154795 -159230 -75583 -131690 -260790 -267840
24201 -267840 -162367 -86086 -92742 -85068 19864 82564 27359 23988 51019 85275 137833 56858
24189 56858 -65485 -17724 55227 41985 48968 -4687 46359 132062 98576 58056 -18220 -74259
24177 -74259 -22555 -25363 -50030 16541 84528 56045 48869 55552 -38159 -92489 -126072 -92736
24165 -92736 -73466 -105018 -49778 51197 92744 98375 140096 127192 70321 49316 53508 12923
24153 12923 10393 21129 -93166 -196788 -126570 10139 19490 -38431 -47268 9447 77290 106539
24141 106539 55486 -12648 44725 97523 85117 33724 -21284 -7024 921 10556 -38278 -48683
24129 -48683 -1034 115974 139084 56019 -9884 -55715 -100239 -167730 -122621 -121104 -85494 -91238
24117 -91238 -116079 -57101 -46066 -92944 -177650 -181092 -125021 -117127 -83453 -44124 -37988 -56718
24105 -56718 -39221 -77562 -193577 -209803 -121786 -52649 -42518 -58844 51749 78685 -23677
24094 -23677 -25611 72819 30009 75413 112597 55667 6203 -55909 -102212 -71792 -67555 -87388
24082 -87388 -38266 34625 -2879 -71403 -82239 -92657 -93175 -3965 22442 -49679 -67542 -63142
24070 -63142 -114684 -114713 -135205 -142387 -70560 3606 56246 16285 -35853 -53468 -65558 -22561
24058 -22561 96834 185152 157338 106553 68829 89786 96711 75740 175917 144392 97087
24047 97087 42704 14882 23790 -37773 -74849 -55800 -49434 -72532 -43093 -84553 -54066 -58178
24035 -58178 -87385 -59109 5348 63777 130485 89529 54102 18392 -43802 -121174 -75033 -28914
24023 -28914 78043 7098 -49608 -86908 -55568 -55527 -130153 -115505 -35870 -41877 -42414 -19752 42513
24010 42513 -15694 -116984 -190444 -113767 -87227 -18763 45028 129771 104619 46559 718
23999 718 -75053 -128944 -35556 44189 -7004 24475 33478 18590 -36619 -14737 -4930 -55755
23987 -55755 -60295 -52466 -63215 9283 22833 32120 94118 110624 77325 48568 16017 22174
23975 22174 -28495 25344 417 -2883 8143 46148 18628 35891 23255 -31009 25477 92714
23963 92714 3339 -118877 -186789 -169723 -135521 -114456 -200122 -194306 -79481 -45846 -61860
23952 -61860 -87334 -106273 -150776 -174751 -50691 66973 135392 97759 59604 71961 70711
23941 70711 57213 26258 39109 81895 202846 189563 219771 200845 108328 9642 7803 17764
23929 17764 5836 -3504 4914 62217 16938 -20781 -140749 -188592 -133785 -127614 -91855 -67171
23917 -67171 -127485 -112096 -84604 -3562 47463 122094 79350 42953 23507 23526 98543 88682
23905 88682 62605 23888 -8167 -53225 -106752 -52755 -29186 -32590 49202 111532 30985 -87853
23893 -87853 -163487 -250551 -266951 -200833 -88205 -21061 -50950 -29161 32139 73612 102828
23882 102828 168317 175094 108003 41431 27278 -107400 -84349 36659 82775 112387 78925
23871 78925 51220 41105 145351 167847 87694 -28368 -39368 -74753 -79876 -74599 -51212 50269
23859 50269 31079 4686 79283 20742 -49611 -62115 -21645 -13168 15432 45625 26170 -18716
23847 -18716 -45073 -44953 -28396 44787 -11237 -85466 -92858 -47177 26761 12359 77952 34139
23835 34139 -79314 -130152 -12861 63668 91486 1025 -73519 -90270 -61397 -70127 -67871 -86825
23823 -86825 -84956 -45378 -31376 58220 35232 -3182 73554 80043 6009 8431 23852 66220
23811 66220 75891 -7241 -23964 42246 102486 95884 136675 101780 56535 128581 184576 131705
23799 131705 90826 60586 93051 142196 102950 33606 -24169 -51966 84992 10212 -29990
23788 -29990 12491 -12743 -63154 -96868 -93942 -67341 11521 87050 65755 51620 -17182 -70227
23776 -70227 13491 -8064 -83458 -107944 -79526 -104053 -78680 -14607 84765 145059 127883 26483
23764 26483 -7678 -17701 16072 -44548 -39849 -76155 -33886 -107674 -127174 -44510 -7185 45671
23752 45671 9618 20433 -57708 -65434 -51200 -9724 -15484 -2511 -18924 18185 -17191 -552
23740 -552 41481 -18345 -48645 -78663 -108579 -103788 -65544 -46140 -75907 -162450 -80742 -37325
23728 -37325 -39928 -70225 -44378 3404 -25659 -36107 -73001 -20173 66925 118029 62852 -34804
23716 -34804 -63681 -126020 -59349 -19061 10119 -39657 -47597 -1214 24109 -54131 -23979 49688
23704 49688 31880 93607 102120 86561 67989 86264 79734 -5422 -94652 -98394 -115413 -78092
23692 -78092 -92671 -106196 -9862 6295 7307 -68517 4109 92396 103575 122253 56564 -34012
23680 -34012 -18215 89010 109784 56503 76591 55919 -21588 20533 56015 -4816 -9835 10424
23668 10424 -6804 -24560 -108165 -100943 -6766 -12795 -60168 -37762 101191 121430 25903 -3224
23656 -3224 75150 31935 32463 62828 -61434 -159631 -125770 -121101 -82816 -12710 4728 -6274
23644 -6274 51938 12052 -10674 1521 -51304 -98903 -50680 -122442 -65336 -76382 -43257 -30807
23632 -30807 -11026 -99710 -74833 -89188 -106137 -57272 -15451 14004 46497 39532 81919 24415
23620 24415 -8271 -17786 23208 -62676 -84592 -89057 -90368 -49792 15059 38505 45129 48354 10554
23607 10554 88401 156372 92992 -15132 -120506 -31305 -30089 -30636 -33925 -46034 -109359 -77608
23595 -77608 -93691 -76010 32179 46788 -98636 -113279 -96460 -119286 -87476 -10282 21332
23584 21332 21177 -47283 -77779 -74864 43129 90874 81573 44055 422 -44066 27681 91305
23572 91305 93698 50606 23759 28702 -13720 -24434 -25315 1091 34157 73004 121625 170840
23560 170840 139614 63877 30024 34204 -44818 -7868 62808 -25862 -34810 -20367 -42493 -27649
23548 -27649 9188 9258 60243 84812 178436 129131 161015 251467 208340 178258 193671 128181
23536 128181 76928 83906 91616 99868 38473 17129 28603 95258 183303 128825 82867 148634
23524 148634 163991 54469 18805 136652 146762 94962 54182 58973 88305 62779 26651
23513 26651 21972 -47874 -99003 -87102 -29396 -34385 -26721 -25195 -48438 5622 57426 26609
23501 26609 20435 15101 8611 10317 -102843 -235072 -159645 -114233 -69027 -89039 -50282 14204
23489 14204 13008 1559 -20331 27475 84848 20488 1431 -87272 -67271 42883 31608 19146
23477 19146 27556 72897 59568 -12533 -11523 -36568 5825 114745 175011 132667 95966 125523
23465 125523 145703 56979 -50027 -4819 59158 70902 47256 45378 42188 -7814 5842 57262
23453 57262 827 -16246 -17110 -29979 -24324 -392 -22282 -2309 80530 8866 -11294 -40565
23441 -40565 -16635 48647 88656 15757 -22536 -3996 1055 -19922 -57458 -124530 -137566 -68573
23429 -68573 -5010 -5822 5920 -8658 -16242 1927 82235 105485 37986 1355 -32325 -90039
23417 -90039 -136469 -6766 -868 -61732 -83490 -106025 -88420 -22991 -39599 -64944 32794 32530
23405 32530 -52008 -88963 -107414 -87469 -73016 -31271 -123130 -134574 -98398 -104605 -104044 -63130
23393 -63130 -20948 -15257 -1634 -180 -36891 -12043 18785 -40650 -36920 -60351 -79272 -97313
23381 -97313 -162044 -83613 -16118 -33979 -87243 -64387 -54941 -89767 -109043 -103839 -91808 -95389
23369 -95389 2543 -44512 35469 32182 -23896 -129754 -82427 -7221 24072 27648 34533 4378
23357 4378 -78208 -117518 -17514 -27499 -10872 58536 109879 63144 8792 1214 -21710 -43321
23345 -43321 -85911 -140402 -125352 -65244 -26271 21729 52839 37596 56985 8820 31508 33024
23333 33024 2312 34654 40922 -18937 1122 8259 13077 12318 15692 30442 65272 54375 32994
23320 32994 -47180 -26609 -11903 43484 64048 58384 -5621 -47300 54179 -15235 -100900 -11024
23308 -11024 38427 20927 -33355 -57755 -38033 58002 81905 54618 27513 -415 -100076 -136110
23296 -136110 -24711 32198 132477 180625 106772 20637 10642 54408 -11620 -24729 35798
23285 35798 95986 45814 94308 95412 127514 118136 39560 11151 54002 117072 108127 106568
23273 106568 102221 89313 81191 53864 48320 37991 -15682 -86094 -138827 -99131 -84822 -66178
23261 -66178 39403 12460 -89766 -55929 -44081 -25779 -30236 -36081 -19899 16459 27949 65923
23249 65923 26696 -18760 17846 70309 53233 66602 38790 -133230 -205710 -174105 -172383 -162858
23237 -162858 -140747 -173134 -170315 -127332 -43779 39240 91 -89367 -116768 -39636 2904 -30507
23225 -30507 -68441 -110068 -123554 -117323 -116749 -43805 28420 108959 49055 16692 66616 39101
23213 39101 9142 -19249 -8744 -56384 34741 137061 150301 86831 44448 29924 11297
23202 11297 -76338 -45988 -3116 -29109 64537 58096 469 36579 -5371 39589 7973 -3380
23190 -3380 -1174 12065 56185 70707 111142 106293 1754 -14734 -47264 -53077 -38899 -47041
23178 -47041 9314 38393 -16290 10742 72231 34988 -20970 -14476 -9407 -24886 -27268 -35170
23166 -35170 -48493 -25787 16835 -27795 -87006 -27691 63185 35040 -77278 -134518 -85745
23155 -85745 -7492 15978 -23497 -93952 -43321 41532 77011 142775 122407 -36736 -59740
23144 -59740 35528 69688 47307 33926 -27308 -83597 -48499 -1342 5175 -66763 -104074 -177561
23132 -177561 -107942 -55177 -11898 -78394 -41985 -8498 25567 124355 153608 175144 192606
23121 192606 152598 31099 -10996 -15840 33799 43116 -13114 -6891 12730 16396 16023 -13509
23109 -13509 1560 12906 26299 23050 64666 100564 150444 92043 120767 81806 92956 57384
23097 57384 34385 10385 -49578 -116261 -164531 -229639 -209018 -162721 -126526 -56573 -36406 44709
23085 44709 43252 44103 105776 32878 -11372 -28054 -19131 -39476 -16320 -10649 -14212 -37889 -133085
23072 -133085 -161086 -104331 114469 148663 76195 59876 96333 95674 130433 184694 100452 32404
23060 32404 36920 115085 156142 181298 131752 89372 7839 -60781 -34415 -11204 54454 23075
23048 23075 46731 142076 195697 161472 133819 131246 134500 158904 160084 114546 87049 64054
23036 64054 15371 -36563 -50176 -50022 -18266 -10767 -53471 320 19216 -23329 4175 -38979
23024 -38979 6400 15753 3407 -3064 -39353 -82397 -175341 -31460 23431 -22148 1970 36980
23012 36980 -2663 8072 -19479 60582 124438 37641 4909 57917 79171 57304 -11753 -32113
23000 -32113 34462 163928 174224 161313 138175 151821 87995 45667 43502 46058 120961 99413
22988 99413 -1562 -2090 -53479 -54303 -63686 -38452 -23464 -38045 -104812 -99236 -77744 -68116 -45414
22975 -45414 -53664 -68569 -38142 -8529 13062 62574 54077 -47587 -97034 -106001 3465 15419
22963 15419 16090 -38375 -41708 -37518 30143 64595 44216 -56841 -185439 -160022 -118293 -35215
22951 -35215 52037 46181 -7347 32769 67613 73713 -16930 -65419 -96210 -136321 -104008 -17529
22939 -17529 -2696 -67267 -58772 -42392 -106158 -93373 -74400 -67196 -13875 55185 74280 34213
22927 34213 46596 73049 69819 79659 61081 7814 90436 -18032 -124751 -76359 -109967 -141195
22915 -141195 -145186 -111986 -136577 -215126 -107399 -9885 47128 29192 9212 30532 81854
22904 81854 143534 188906 218053 222450 181573 80777 -8334 -34665 -30468 -5431 31396 76772
22892 76772 24545 -78194 -103588 -79461 -123156 -115114 -83280 -154011 -145740 -73219 -302 12279
22880 12279 8624 21651 15265 -44223 -74629 19920 73797 102369 20541 22126 10621 -10534
22868 -10534 -44914 -38505 13992 50184 48619 11377 -66194 -67082 -139476 -171274 -69043 -37610
22856 -37610 58884 98804 83786 26792 -5879 -85474 -348 64693 52709 25457 -30544 -38622
22844 -38622 1195 50357 63609 26930 39559 122549 116101 120187 -25616 -134246 -180377 -175557
22832 -175557 -115278 -45129 40653 69602 119265 95888 27953 20747 21193 -63701 -62826 -1970
22820 -1970 4424 5798 -23783 -11193 3383 -23160 48556 148070 180131 161348 113289 60557
22808 60557 -40 42035 108720 97251 95162 32161 31965 45637 68464 41092 26463 5111
22796 5111 80614 190894 188799 123548 93723 23384 22585 -92791 -143152 -98368 -15001 32155
22784 32155 34655 16098 -21118 -9276 49366 5841 -83363 -65835 -42438 23968 27819 -48778
22772 -48778 -94602 -59531 -56254 21744 56047 97798 143530 112040 12382 -114113 -122513 -107690
22760 -107690 -176352 -212180 -169554 -110239 -1602 -10138 -47716 -59551 -34717 55272 92568
22749 92568 74516 58098 50751 41885 54088 61657 95989 60804 37950 23113 33989 6191
22737 6191 -91746 -117046 -79984 17713 9843 11460 47389 29611 -19371 -14454 17320 -6771
22725 -6771 -62865 -34072 85325 128963 133299 89706 60164 40825 -22635 -69793 1715 37850
22713 37850 42463 55687 43905 66947 -6207 -28801 -28288 -56361 -55627 -29767 -55155 -73559 -11009
22700 -11009 91185 65676 39360 89898 155277 134404 136952 1611 -66559 -65855 -73458 -100334
22688 -100334 -38746 -46836 -3597 58264 29596 -19489 -27964 -95354 -59460 -31086 -23409 17202
22676 17202 -15761 -56372 -26780 -13253 24643 -1405 -15156 15797 16779 -3226 -5683 17389
22664 17389 -20465 -87715 -34505 52584 128234 145873 99878 28991 61969 16827 29147 -6300
22652 -6300 -56192 -73800 13190 -38523 -28871 -6566 -38566 -141738 -82397 21912 85971 141637
22640 141637 175386 153265 42929 -9907 -17541 -41461 -57985 -76643 -66553 -105416 -123268
22629 -123268 -70910 -115785 11497 31240 -7694 -122601 -100518 2648 26001 27061 1990
22618 1990 -29756 -116717 -205496 -152110 -127128 -187387 -176999 -176768 -116180 -82439 -86636 -148078
22606 -148078 -141948 -139205 -102157 -45253 -71266 -37866 -9149 7973 27491 -23501 -15375 12446
22594 12446 -42544 -84561 -90324 43014 127216 90597 68855 78699 41597 -12423 -33583 -20868
22582 -20868 62937 75767 -43801 -44658 22070 21715 44111 551 -54342 -16438 10781 -3689
22570 -3689 91353 16060 -39295 -13467 -45888 -10491 38166 75183 6591 -2813 -155 -30285
22558 -30285 -125082 -165692 -125428 -7551 19187 2353 -53752 -67387 -66848 -46887 -38519 58994
22546 58994 70531 19024 -7873 23111 35867 60990 34567 -33828 -101080 -29816 82815
22535 82815 88352 88008 25103 69021 21780 -54412 -65515 -33475 36871 18196 4181 -11739
22523 -11739 -19920 -120064 -88555 -24400 10631 -27281 -50562 -21411 -39069 -77269 -118878 -115567
22511 -115567 -62109 -140653 -192159 -127644 -140002 -151212 -147714 -73337 -55287 -47281 -108706 -213631
22499 -213631 -191755 -142850 -78727 -3965 -41091 -57225 -66471 -31447 -17136 550 24350 102013
22487 102013 131705 112185 109281 102873 78726 20857 20423 -63686 -55613 -19535 -11394 -41381 -71588
22474 -71588 -79034 -104932 -11730 106591 206787 165640 116453 51109 -33459 -42532 -34598 -22731
22462 -22731 62022 63612 156029 213409 151137 76837 10020 85144 106634 121895 89881 20374
22450 20374 -30888 -9865 -29671 -19304 -38802 -41571 -77182 -82999 -30678 -7499 -39045 -64304
22438 -64304 -56385 -108456 -110751 -46840 31427 -55609 -132119 -164416 -117924 -128371 -78780 -68997
22426 -68997 -38966 -2077 -7708 40539 59947 136395 107991 69192 42059 1537 -53049 -144986
22414 -144986 -95424 -66173 -88016 -2188 -36223 -74887 -102512 -138623 -83983 -27474 -2053
22403 -2053 -14714 -122225 -82256 -41533 -8763 -127942 -94507 -16769 -5332 16060 32720
22392 32720 16753 5460 -26748 -39963 -34472 -167819 -115298 21686 13100 5609 -5143 -32277
22380 -32277 -2312 9465 63238 96177 124953 119710 116439 93607 89120 59816 -8521 2772
22368 2772 -7252 -67029 -108606 -36572 12698 27271 102504 98426 92202 70278 31625 -3730
22356 -3730 -15945 3405 40386 106640 56697 15910 -6997 5381 70928 132092 -12763 -112848
22344 -112848 -185555 -157276 30481 125524 46309 -74315 -3397 77 -25786 37142 27150
22333 27150 -8401 29266 -6873 -14082 -15567 47488 -8430 -30559 34516 28822 -5182 49363
22321 49363 34530 47985 69726 85126 74393 44971 29580 27379 32386 94093 82281 -35239
22309 -35239 -57633 50854 30867 30674 54734 24179 31986 22324 15763 -35648 -128201 -135104 -132118
22296 -132118 -60984 16345 -12909 -10776 -83950 -174729 -201519 -62072 -6159 12766 19814 -33941
22284 -33941 -67078 -48933 722 -43855 13702 5408 -16089 68430 25914 59682 82227 75821
22272 75821 76369 88020 166190 222556 180258 135474 79730 83867 65666 98982 84580 129185
22260 129185 65895 76327 53134 39991 -24951 -48775 -25105 -32678 -16161 -16109 -33898 -24072
22248 -24072 51854 151393 88556 3610 -110817 -188384 -240933 -155700 -80630 -75567 -69491 -79935
22236 -79935 -129318 -127829 -32305 -57985 -101666 -25280 32670 25756 -33188 -81486 -93253 -78323
22224 -78323 -100057 -141721 -207059 -151907 -93156 -97472 -73498 -48658 -26484 -12476 -3715 6387
22212 6387 -3279 -19046 8918 45250 142446 110626 -13368 -71120 -48699 -22943 -7941 45545
22200 45545 32497 1245 -57965 -55748 -50630 -26667 -52987 -1038 14989 -34077 -45935 -72064
22188 -72064 -123148 -134256 -137278 -103197 -42374 -59766 -36957 64775 175262 124635 41961
22177 41961 -55139 -20273 17609 18836 -24879 13118 5159 -22621 19698 57912 25762 25954
22165 25954 -4338 32004 49951 -2305 -45424 -121267 -159773 -156530 -46026 29767 10394 -15399
22153 -15399 -47660 -77875 -45815 -66065 -46357 -52499 -59943 -10299 98470 70911 33393 -25097
22141 -25097 -42316 -55782 -78843 -29945 -18474 3958 18023 6492 36200 46875 64994 6416
22129 6416 19425 10740 -38170 -25027 9248 14127 -10331 -6078 21258 65911 42115 -81702
22117 -81702 -130575 -114541 -161024 -128139 -110721 -92282 -61268 -38329 -60305 -102013 -130329 -140875
22105 -140875 -110592 -95953 -50805 46038 128906 120749 37913 46472 99646 68731 -35007 -115782
22093 -115782 -121165 -65372 -14828 39602 105336 134272 137636 62513 2637 18456 2159 18998
22081 18998 6305 -10888 29951 128158 145025 108911 64431 125145 55397 22053 -4930 -42593
22069 -42593 -3561 25964 -67074 -23045 41369 10051 -72977 -152707 -123564 -64400 43731
22058 43731 55764 45141 8028 -14911 55946 21013 70796 49162 13512 -19928 -42185 -76666
22046 -76666 -78815 -102549 -142292 -99052 -24496 3598 -43997 -91821 13569 -33873 -103055 -98469
22034 -98469 -99851 -58553 -84384 -83712 10135 31247 74575 121191 126394 116875 94207 46080 80193
22021 80193 98039 131108 77575 530 78219 12957 12872 14156 -17545 -44089 -12771 -12473 -20011
22008 -20011 -45765 -75724 -168455 -206857 -144595 -69098 -44895 14976 70904 57400 12882 -13403
21996 -13403 30619 -33784 -75945 -64276 84395 52470 -48672 -126874 -39188 -51366 -83831
21985 -83831 10931 47897 -44849 -45258 -13495 -2680 -61012 40672 46406 -23487 -61237 -51984
21973 -51984 -63405 -15591 14198 54004 51763 -16476 -93328 -15456 53649 50068 2701 14575
21961 14575 15663 26678 -85211 -112714 -118007 -136219 -75709 -43146 -13214 6086 5710 59577
21949 59577 -2685 -133754 -148129 -124397 -85356 -91042 -123401 -97013 6590 4273 67603 151798
21937 151798 132190 107820 113969 128895 99190 74068 53676 74845 94396 45220 722 -20842
21925 -20842 -76184 -92949 -22761 29303 10717 -44317 17806 68784 97626 33871 192 109056
21913 109056 81360 36125 21718 92259 66980 -7647 -25132 -58110 -45892 20180 -10218
21902 -10218 -143411 -164771 -55473 -16804 8295 -35280 -8389 51112 -23997 -23245 -33154 -19489
21890 -19489 5434 35755 32303 37761 116554 82054 67694 148854 166161 112002 42078 20613
21878 20613 15408 -8579 46246 77319 34495 43972 70940 44103 11018 -48556 -92278 4319
21866 4319 34702 91912 63693 3909 -3665 -103855 -78729 -1828 -11138 19302 37639 65478
21854 65478 42643 -116199 -187341 -158984 -118758 -26963 13457 -6078 -86281 -193934 -214226
21843 -214226 -182058 -137242 -78094 -85214 -23931 -61594 -85992 -39931 -39513 -56532 -24190 -39863
21831 -39863 -22784 -43777 -44973 -21356 31694 46130 76767 52972 109196 129813 171671 201114
21819 201114 152760 66039 51919 8864 -136978 -179401 -140955 -78353 69992 35718 -51838
21808 -51838 -50424 -11524 34274 80205 48691 50500 50903 66127 37108 1411 -33940 -12258
21796 -12258 -21521 -70312 -40478 19358 -74275 -125879 -55595 -72912 -121121 -129986 -136761 -77024
21784 -77024 -53501 -34003 -38139 -56449 -95214 -63325 -38710 -75177 -68232 -50911 -82181 -115808
21772 -115808 -143309 -70572 -159382 -87914 -29835 -39553 -48554 -54126 -21660 43408 11326 -62144
21760 -62144 -102830 -8899 23742 26088 14087 76602 96127 107940 91181 -24054 6184 27483
21748 27483 1002 -29243 18721 14099 2308 -30081 -47210 -18119 -25186 -53183 -56303 -115034
21736 -115034 -170947 -57842 -72629 -25180 33180 73569 57330 77129 35252 -110157 -243672
21725 -243672 -201135 -135290 -86274 -86110 -88924 -172596 -167469 -138837 -68667 -62400 -132823 -106161
21713 -106161 21688 149549 159844 154020 40754 -73295 -15247 683 1972 -22074 47088
21702 47088 87347 61078 40705 99625 123112 113482 78951 25872 5210 23638 -38544 -40007
21690 -40007 -112047 -117993 -113934 -96319 -17020 -8846 15605 137407 98404 66594 74783 23853
21678 23853 20493 -46276 -81382 -20334 53812 84372 35341 37418 40033 20176 -13713 -26149
21666 -26149 -59200 -19049 72272 127899 112500 -4997 -58290 -60434 -12722 -5712 -24442 -10128
21654 -10128 -68732 -4077 -4202 -51414 -41417 -91029 -99021 -95986 -34962 -59660 -50232 -11988 -17525
21641 -17525 -84269 -75167 -86860 -78553 -21406 3851 -17845 -16891 -39105 -42102 -67425 -102229 -26147
21628 -26147 -4839 52061 49148 112394 121591 83909 52034 -32860 13084 31059 16161 -35530
21616 -35530 14640 4815 -32525 -125298 -143101 -102776 4570 38778 -60685 -148017 -147054 -70891
21604 -70891 -63407 -54795 -65134 -40438 17640 12483 -68364 -112107 -103021 1821 86305 122887
21592 122887 132963 105317 98800 79507 -14660 30727 61548 9601 -80417 -19285 -54682 -96465
21580 -96465 -102763 -24538 -70496 -110638 -139049 -110700 -17814 -5793 -44988 13582 14147 -12439
21568 -12439 -13816 -24 -14231 -19175 37885 5511 43072 91427 77979 -23922 -78219 -52908
21556 -52908 -43892 -48025 11578 39368 -59546 -112261 -84943 -17689 26032 24984 -56534 -96610
21544 -96610 -138923 -75200 -31188 13133 -52915 -27676 -2040 -7757 -1852 39830 47761 12532
21532 12532 6214 53008 134485 138973 72084 46684 95858 118547 89242 100930 94229 142567
21520 142567 90419 58836 -10467 -116472 -147780 -156044 -187705 -180416 -82987 54760 93040
21509 93040 51962 -16429 -119054 -93051 -32868 18132 87966 -40005 -168566 -67718 -75064
21498 -75064 -75627 5156 14878 27490 130332 101934 51203 -22761 -39171 14049 -28052 -67010
21486 -67010 -77953 -126683 -132414 -61775 -1565 -759 -6652 8162 33466 11611 1720 37799 72044
21473 72044 33589 -18426 -11682 -74496 -113456 -60905 13072 76420 103282 36351 -82865 -126214
21461 -126214 -62378 11951 -29827 37840 49329 33064 -63 5566 -11246 11016 -31346 -71496
21449 -71496 1929 18890 -85926 -135601 -91626 25434 59687 -33390 -9490 42820 35679
21438 35679 -26030 -128852 -183280 -158278 -83355 -86805 -101282 -128321 -86022 -79941 -140425 -85182
21426 -85182 -29649 -45425 9591 98559 144419 50120 -83574 -143108 -139610 -93216 -62745 -89875
21414 -89875 -51816 -88057 -44185 -84579 -158618 -129865 -64384 -61188 -57341 -36643 -21436 32941
21402 32941 18920 -75798 -57069 -35063 83554 89559 12458 -15839 -35554 -72830 -114909 -99583
21390 -99583 -57796 -74769 -104688 -151339 -150900 -158361 -76635 -47589 -26222 1127 58630 -26420
21378 -26420 -97827 -172913 -209970 -141608 -21222 68876 95870 70239 65344 125828 161819 89466
21366 89466 28874 7631 -20737 40415 97032 91385 56168 62936 58216 124546 51544 48018
21354 48018 68160 -360 -144927 -171859 -101213 -170674 -129199 -51051 -39964 -62483 -66903 -9655
21342 -9655 45539 119998 154343 89124 105345 181593 81679 57060 22749 8863 33492 6228
21330 6228 -12139 43183 25505 1691 70461 -28021 -107395 -133984 -99089 -55779 11887 44895
21318 44895 90315 54071 27667 20767 83530 117744 50898 -35466 -57997 26960 -8717 -136634
21306 -136634 -169271 -126200 -111931 -93203 -31604 -23049 -12796 2780 -11718 38567 68437 75911
21294 75911 43911 24244 20123 -42385 -10335 -35549 -112445 -74635 -30916 -28546 -16701 -10840
21282 -10840 -89495 -148096 -85006 -108170 -63782 25620 -5907 -63135 -29100 24139 16918 56824
21270 56824 40014 -29016 -76635 -93389 -70904 -38896 14282 82765 147352 177621 112077 57118
21258 57118 68629 98411 133839 83308 33896 3499 -18538 -34214 -80914 -122685 -117069 -30077
21246 -30077 13686 -97202 -57675 -55245 -19672 20052 15956 39741 -5680 -34013 -71003 -33584
21234 -33584 -45958 -36480 68434 139598 83664 52709 87707 2526 -52602 -86675 -88192 -66208
21222 -66208 4265 -12779 -99427 -108196 -61112 -8677 34636 -10966 -90968 -114939 -42237 -37871
21210 -37871 -10631 32452 15701 47887 129205 89447 -1064 28786 36009 30200 18417 -15933
21198 -15933 9100 -27218 3458 -4860 -2037 -239 27760 58178 40503 58989 50246 19722
21186 19722 36425 36969 17187 27686 17880 -9490 27259 96950 59301 -70364 -147502 -137606
21174 -137606 -29679 -1138 -124451 -116262 -113845 -88304 -44130 586 26893 -24806 -15853 -12375
21162 -12375 -7990 39941 57769 42826 30148 48822 -2578 -109167 -104714 -17886 760 6921
21150 6921 26964 26471 -25533 29835 27179 -32401 33428 50283 43348 68445 84508 11971 -96212
21137 -96212 -76339 -27637 5858 -69668 -102573 -6069 93868 78810 -25732 -72522 -51570
21126 -51570 -12822 397 20677 148712 111355 -83047 -137886 -65611 -102077 -160553 -81854
21115 -81854 -41155 -7155 -3453 -32076 -67128 -72912 27218 4960 -3083 2889 21795 36063
21103 36063 37329 143790 221988 265334 228215 152293 40741 14806 85271 12498 -122645
21092 -122645 -143796 -43463 35823 72189 123143 16912 -3084 -7726 -4149 -7077 -287 71850
21080 71850 104540 45572 40148 -54415 -146091 -135163 -24327 18565 34269 9332 -115703
21069 -115703 -91352 45198 18737 -15478 -33589 -43344 -15089 9431 109651 67834 75703
21058 75703 131085 85156 63656 20737 77188 66594 73629 80388 136538 130760 -5454 -89054
21046 -89054 -174295 -104819 -43836 -33809 -7651 -21327 -16123 57716 -33247 -81939 -52902 -79030
21034 -79030 -6033 55512 14638 36290 43270 -49537 -106749 -109995 -161547 -221831 -190905 -153062
21022 -153062 -143701 -100586 -99087 -63840 -82412 -102609 -97046 -111795 -56314 -83768 -79753 -53742
21010 -53742 -11270 33191 4146 -2854 -20391 -95729 -87469 -35440 -44874 11261 -16795 -51869
20998 -51869 42394 83818 21831 -45628 -71831 8328 102470 78093 72499 18525 -104654 -123797
20986 -123797 -74516 -53145 -26291 -42075 -109062 -83138 -84318 -46908 -95911 -190142 -167025 -251584
20974 -251584 -143947 -92371 -42500 53394 74319 139346 190428 144434 108472 76391 -27411
20963 -27411 -40958 -2968 89910 79147 26806 -16624 -76350 -108046 -68669 -75590 -112292 -96411
20951 -96411 -74113 -23463 -14362 14351 -62479 -64494 -37418 -35183 -74764 -62256 15255 31338
20939 31338 -11465 26356 -3370 -78028 -88766 -4042 15136 19403 10607 -25718 -6060 40818
20927 40818 38903 94437 105073 58830 -27407 -97864 -58335 -27961 -29219 -36851 -74448 -56803
20915 -56803 -44156 23439 67130 -77190 -196056 -203577 -164921 -74618 -75196 -96982 -103959 -134789
20903 -134789 -160267 -116516 -73615 -21257 -26474 -49898 12986 85039 71299 -3817 -76502 -82425
20891 -82425 4453 340 -10270 -15611 -62048 -23149 -97649 -197840 -168749 -44677 -32283 -39169
20879 -39169 -14889 72472 86829 9587 46387 113164 174775 202249 119269 59961 12179 -59950
20867 -59950 -72180 8218 84830 119969 98580 22861 12885 -32977 -111680 -126009 -139555 -174422
20855 -174422 -72139 23343 70671 69067 34913 11061 28458 29390 -3746 33450 16497 -83582
20843 -83582 -106303 -72729 -35777 -7346 9885 4973 16 -35356 -92263 -100480 -93725 7463
20831 7463 11407 -2158 642 -98732 -94186 -34505 -62589 -87965 -121759 -143680 -84087 -53157
20819 -53157 -11644 4160 19937 51042 -1303 -57965 -6515 -5223 39825 28460 -22091 -21588
20807 -21588 -33970 -34036 -122710 -140080 -121409 -98102 -146341 -123353 -32749 -94344 -86979 -139932
20795 -139932 -117694 -93570 7978 30730 36553 26795 -36299 -96768 -59491 -2579 4625 -31982
20783 -31982 -120934 -143946 -119942 -16146 48616 123883 109297 28310 75107 32986 64635
20772 64635 49743 53423 17567 -84287 -51156 -6503 33764 54539 116365 130147 56519 -38108
20760 -38108 -24525 -15713 3261 36022 68333 53298 25242 -131145 -124881 -39767 -68443 -17430
20748 -17430 -51050 44842 81376 -19244 -109881 -77053 -52368 -44875 -30200 -58379 -34019 2633
20736 2633 -112309 -137158 -132902 -113318 -67633 23881 120765 128408 95363 39125 -50347 -46941
20724 -46941 -37311 -57947 -5809 30558 2349 -102607 -147906 -101792 11336 2810 -35467 -38272
20712 -38272 -25288 -69299 -66154 -128711 -163297 -142627 -70782 -94605 -89692 -12350 35419 7277
20700 7277 -54142 -1045 115760 77034 33024 3247 -32144 28426 49039 58839 47621 98346
20688 98346 72708 19898 -17613 -124 -21351 -53131 -42297 -112382 -129668 -80736 -524 -1516
20676 -1516 -16874 -22348 21603 -12213 -60929 -107857 -33564 38809 41219 43551 116245 124478 54290
20663 54290 43418 87932 64411 59907 -4169 -59424 -50066 17212 21846 -18171 11261 29333
20651 29333 42070 -36120 -78329 -15460 -28962 -34315 71968 29720 -53243 -59975 36872 166232
20639 166232 133297 115024 97353 95387 72650 -2371 -24285 -45689 -29793 -33450 35226 84938
20627 84938 119942 94805 187628 167209 55663 15398 -32646 -9559 88427 43356 -5242
20616 -5242 -24500 -45308 -90858 -143347 -78206 -46810 -34248 -36482 -68445 -80910 -88373 -54606
20604 -54606 34591 101760 71136 23275 13414 25715 5228 -30462 -10441 -14197 -9164 56361
20592 56361 53412 60115 58066 54776 -54401 -125820 -44168 62246 85483 -14679 -27089 55177
20580 55177 10241 -63879 -127528 -65581 -41751 -25017 1993 -16230 7534 20406 -5299 -50534
20568 -50534 -32853 27706 48434 -445 -25813 22282 16980 -56786 -30111 -17243 35340 31064
20556 31064 47286 39290 76133 79556 30611 -87137 -124678 -126082 -114406 -79828 -8732 -60501
20544 -60501 -83786 -40687 -34832 38770 32730 74628 113006 55514 3105 23830 33604 84583
20532 84583 115859 96145 25007 -94570 -50972 4543 2633 -24558 -69231 -129356 -143958 -98873
20520 -98873 -53788 -64434 -85516 -22177 33526 -45931 -108183 -146899 -101637 -112758 -162590 -153278
20508 -153278 -139423 -89894 -120424 -93975 -34503 25858 -16201 -87248 -148525 -119896 -31723
20497 -31723 -35140 -73958 -70270 -77691 -111869 -29744 30185 -48345 -77347 -76350 -49427 -32884 -63664
20484 -63664 -106808 -27888 -38150 47762 54105 15054 43133 103150 103942 72964 89898 94762
20472 94762 59458 19082 -114394 -171898 -169203 -89578 -100885 -106927 -92859 -72526 -109106 -129675
20460 -129675 -98631 -18036 22583 52835 98564 96406 39889 53088 28440 18461 31111 -3863
20448 -3863 -58646 -121282 -93686 -98972 -196392 -210952 -73341 -51070 -94809 7644 91386 144443
20436 144443 140301 155022 176254 175439 128725 54762 -44945 -120451 -108991 -5965 103639 128344
20424 128344 55175 60169 103236 59733 81954 10430 -114932 -159470 -114044 -67311 8999
20413 8999 21454 48194 9071 -64926 -12705 110784 122600 148607 130514 53346 -21847 -38892
20401 -38892 -2017 89181 134164 164476 98111 12065 -15129 -23639 -15440 19723 38948 82600
20389 82600 58474 53787 62232 41266 -665 52215 52746 4150 7189 8366 4722 24464 -85966
20376 -85966 -123753 -70492 -11065 -87928 -139507 -166292 -196571 -168600 -183498 -159319 -160522 -68234
20364 -68234 -48873 -37927 -19001 5024 -66771 -66153 -112701 -67464 -66659 -96225 -63272 -152879
20352 -152879 -162529 -79920 -22166 -43370 -10356 -18867 -50440 -66868 -39020 -38379 -92324 -116292
20340 -116292 -94300 -68119 -631 70702 11832 -58302 -25300 3395 12252 -71404 -77808 12553
20328 12553 87851 60346 47650 97347 79583 34886 13398 -17432 -28680 -43054 -42871 -118411
20316 -118411 -85232 -71818 -20673 38315 120040 163910 142375 151847 155333 72465 48099 142335
20304 142335 132592 110417 102306 56241 63416 135916 169276 57785 22428 -14143 -117677 -13666
20292 -13666 -8131 -11048 -76711 -109704 -81113 -56816 -55429 -50659 -79015 -27493 78827 80786
20280 80786 67078 27054 26995 -31111 -142646 -183281 -175965 -79097 -95883 -70573 -14577 -2925
20268 -2925 -6255 81264 78263 68953 -18495 -11387 48368 94307 78679 77006 109886 36400 -38461
20255 -38461 -68792 35562 128894 121909 77331 -54089 -91158 -91126 -88904 -15965 16206 67930
20243 67930 41133 -3123 -32465 -43320 21151 95249 74370 81035 28508 -36184 -40731 -30682
20231 -30682 -165326 -173808 -109969 -44568 -31929 -27954 -1151 36309 5201 -44040 -111143 -122310
20219 -122310 -131159 -50106 -33193 -121902 -122882 -62715 9226 77710 53291 128493 201393 154041
20207 154041 66547 49051 22548 58828 91504 54023 -27728 -41285 16287 119915 91993
20196 91993 -2684 -23684 1184 -56738 -66870 -65271 -62752 -89248 -90378 -46534 31235 75791
20184 75791 60058 29611 10022 -19128 -51566 -72119 -78933 -69648 -32287 -18468 -31761 -3636
20172 -3636 12642 42320 28600 63761 69026 13752 -11050 -18040 25299 40921 -7737 11671
20160 11671 63066 45129 37981 104466 113229 117834 -12434 -44281 -42131 -34594 -26152 -66343 -112625
20147 -112625 -86433 -52638 5346 -15382 -108739 -195840 -185020 -180812 -180052 -121448 -77196 -108593
20135 -108593 -129581 -126249 -39435 -32191 -45026 3233 37560 74477 76441 36427 32150 112944
20123 112944 115418 91940 98735 107242 75791 -1386 -194442 -204728 -123884 -32619 -73122 -79228
20111 -79228 -15950 61238 88258 49572 -17664 -37944 86953 74880 40095 33985 96897 98858
20099 98858 40735 -51102 -28865 14877 -6803 40256 17298 -8433 44922 67861 17881 -41695
20087 -41695 -6958 -24618 -55638 -66706 -48685 9714 113149 202776 180151 173557 146273 3694
20075 3694 -35852 -45984 -2193 61157 57473 77383 125257 120487 53287 133545 219306 150590
20063 150590 19205 84364 124012 62244 84566 95076 58255 49564 71623 79908 -37552
20052 -37552 -55606 28418 116563 99620 1512 -40928 -30642 -8341 47471 47824 35050 75149
20040 75149 130358 140362 61666 43471 215 -8352 -4230 -84581 -124870 -53196 -14335 -41991
20028 -41991 -77444 -56580 6126 19657 -37443 -48004 -2054 -13413 -91645 -48921 16777 85916
20016 85916 32985 33501 23985 -20716 -55345 -27496 -10721 68448 66181 51928 45147 139450 113112
20003 113112 -8214 -31326 -9379 58366 20640 -13939 -23836 -4786 -11231 -38154 -40263 -114239
19991 -114239 -53798 29298 31739 -15577 -52428 -80897 -114804 -53765 -24631 -37944 26012 75775
19979 75775 160355 86491 -5742 -41596 -6313 51006 62406 118285 40398 -53350 -30341 -29361
19967 -29361 -119124 -189284 -203656 -228200 -226440 -203073 -137723 -83063 -23910 28474 -21766 -7141
19955 -7141 84777 118323 82628 23958 -1363 70732 101215 72198 -20288 -61461 -20490 30115
19943 30115 -69995 -93932 -88858 -65169 -42288 7161 -33690 -36342 -58196 -75654 -43538 14355
19931 14355 59610 27611 -11564 -71227 -142400 -110526 -87474 -108383 -119266 -59386 67225
19920 67225 74817 21592 -6627 -10758 -62865 -74980 7654 105371 126113 15170 9482 18949
19908 18949 -3962 -59124 -95120 -100705 8003 16736 -22501 -117662 -78962 -154478 -163812 -164344
19896 -164344 -201897 -123638 -76144 -63402 7448 73377 87687 89765 37660 507 37059 -12714
19884 -12714 -53974 -33490 -78216 -147194 -86488 -131766 -96357 -38973 -223 38424 37615 7811
19872 7811 73871 119981 132009 98606 29469 4073 7771 116078 116654 43625 77252 17827
19860 17827 -28972 -67714 -66695 14751 69029 47232 -11241 -11946 -51702 -103179 -135287 -138534
19848 -138534 -125076 -63870 -38752 -64038 -42291 -134780 -11907 53567 -14674 22134 34485
19837 34485 44650 48675 54672 108190 138293 117622 117707 175137 155558 76842 -71224 -122039
19825 -122039 -133737 -133466 -98665 -48598 -21044 -76010 -63179 -111980 -119407 -56154 -24192 629
19813 629 25834 -36941 -50489 -106748 -79466 -15069 -53894 -84451 -48804 -107116 -182849 -175586
19801 -175586 -146497 -134510 -115097 -58599 -20303 11902 -3412 28768 -12355 -15021 -73338 -71401
19789 -71401 51740 49572 53514 -52816 -108847 -46933 -54554 -20896 3976 100252 85275 -5799
19777 -5799 -89828 53838 195559 147674 154996 186626 118489 95036 64476 60194 12412 2742
19765 2742 -39489 -84653 -52163 -54187 -42664 24244 124561 140513 83696 84353 -16951 -56764
19753 -56764 -11496 -51995 -73364 -186794 -149118 -125332 11763 100329 94821 84407 25173
19742 25173 47058 73055 16370 23947 -8349 -31341 8497 67953 115278 102809 21028 46679
19730 46679 110948 125103 156440 122304 68755 4142 12405 57646 111883 136682 85598 45209
19718 45209 45200 36790 27292 5282 2819 35301 88574 126256 28045 -112641 -74231 -62336 15837
19705 15837 68621 89880 172274 183520 131205 134517 124714 113916 38471 78900 72097 11112
19693 11112 -68023 -82675 -93311 -8385 16115 2815 12389 49995 65673 8009 5572 97925
19681 97925 107447 42367 63015 135702 41208 -19210 -85094 -126127 -131168 -87705 -99332 -133053
19669 -133053 -150853 -191805 -137940 -84509 -121066 -203719 -212680 -109510 -87246 -39281 -29669 -83036
19657 -83036 -120911 -8174 1525 12767 14415 -29795 56044 156733 57871 17764 -6786 32524
19645 32524 67636 84023 3852 19249 21319 19528 54630 93881 65228 -2130 -84175 -83209
19633 -83209 -29183 -45878 -100574 -98805 -59429 13899 59117 59352 63303 20344 37891 82891
19621 82891 72305 67777 60976 67142 9335 12883 50563 -1756 14021 -10117 -22245 -52447
19609 -52447 -17416 -26470 -48754 -69710 -30961 -27807 -32438 -21753 -14800 -18151 12238 53837 79697
19596 79697 90569 113530 124558 163442 100511 39133 -10960 100703 165353 218606 255603
19585 255603 138385 142334 201175 125899 68108 95902 41275 -23530 -14205 15111 27020 59125
19573 59125 65212 -33817 -93294 -18637 98912 87710 91607 85036 -12484 -31708 19681 1137
19561 1137 -8026 -51169 -66010 -98103 -45590 -16343 -48752 -59830 -119407 -105184 -60707 54196
19549 54196 145079 101101 -15912 16329 -9427 -27636 -108890 -88357 -73443 -30692 8091
19538 8091 65311 85717 40967 -18176 -56563 -7866 81615 82998 -14466 42524 45795 -82274
19526 -82274 -177886 -92742 16576 128076 148498 123448 44379 26048 41884 -57292 -23007
19515 -23007 -15736 -4016 -59913 14222 -30142 -91685 -131266 -124100 -28525 79420 106893 89601
19503 89601 -5855 22723 33772 -18483 10456 26601 17872 -1106 3347 -16119 -21721 -60581
19491 -60581 -116271 -83579 -61716 -45170 -24968 -95578 -101358 -111346 -10332 -6115 -103191 -120451
19479 -120451 -42435 2271 -5217 7137 -19895 3577 44635 13907 -18114 16130 -9435 -65062
19467 -65062 -76377 -53049 -36109 34298 98228 148336 84712 74983 85163 55085 10249 -13865
19455 -13865 36669 107415 88516 90684 79540 -37129 -53597 30611 29547 70903 43643 -24005
19443 -24005 -19276 65900 189092 195906 91647 6402 -29563 8373 63062 78209 87662 93845
19431 93845 109670 97504 81960 94407 137561 190468 153146 124652 84416 10715 42522 67162
19419 67162 17841 124284 180208 60511 84779 130670 93299 121158 76276 40357 60439
19408 60439 70530 43788 43389 62701 100955 130710 99086 -8639 -52050 26585 58918 52228
19396 52228 89925 112346 107594 692 11936 101666 84778 59820 97412 34232 -39784 4949
19384 4949 -65369 -116516 -118813 -148390 -124972 -67446 -34922 -90933 -84431 -51963 37392 59799
19372 59799 26386 69627 165314 198798 198350 156311 102326 99425 128597 143573 105640 109885
19360 109885 95032 59913 44609 121489 169691 161039 103968 56141 30523 -15159 -7355 2387
19348 2387 73903 44635 9027 61342 46156 68070 97969 128117 106636 107195 108963 -43493
19336 -43493 -82488 13950 57162 79965 139908 222312 167547 182502 114394 54823 94411 121187
19324 121187 121481 77304 139812 129072 104971 90637 48402 47725 131024 209905 128042 115132
19312 115132 144704 53310 -49629 8834 -7454 -61830 19008 55233 11530 -30275 -25244
19301 -25244 49042 84826 117203 165552 169839 129181 40662 -9709 92370 128640 109451 66908
19289 66908 13795 16247 128497 166996 167989 154442 86592 160154 217339 248539 290179 359854
19277 359854 420592 521821 590063 648698 633846 584107 623660 559887 500298 490051 516358
19266 516358 563700 603880 701064 761801 839961 861916 716734 630302 680581 671383 607119
19255 607119 588980 537406 482550 474003 478634 498448 421144 245162 296834 300055 272041 301454
19243 301454 446993 440997 333950 434552 504290 523572 592578 611328 674474 750053 805778
19232 805778 814641 852253 834672 865683 905184 824872 727614 645509 678200 777636 797380 846608
19220 846608 928764 1040426 1080450 1023378 1040086 1005036 907169 871612 839703 852484 884739
19209 884739 845163 769148 658308 508683 459587 468317 493883 421273 318167 380821 306729
19198 306729 244715 261732 203926 74707 78247 198457 128796 103131 195012 239256 219029
19187 219029 199351 106344 118692 217352 271464 200355 82920 47934 24643 132964 197783
19176 197783 230503 268670 257543 266876 252063 221939 198018 192545 220033 213593 182837 63782
19164 63782 -1150 53748 135248 56440 69944 132545 189173 209194 186661 136008 19923
19153 19923 -119676 -127459 -62732 -17931 24788 -26123 27792 76407 38778 -39905 -50987 30857
19141 30857 83058 85113 61265 41244 -48443 -109288 -72119 -66735 -56577 -35856 1642 17256
19129 17256 41841 27981 6387 -42160 -76112 1501 56673 54155 118399 145502 60555 -43310
19117 -43310 -46534 43452 67622 41117 31421 14630 122237 138253 89816 36769 85883 133766
19105 133766 72867 61888 21110 63304 88817 29970 9119 47781 90192 115926 100465
19094 100465 107333 159985 132773 83565 80217 116985 147872 153148 126233 97336 84188 108629
19082 108629 129623 184908 233559 178691 86799 119544 131878 87625 110670 217249 218706
19071 218706 156322 54277 -8330 -65823 3512 45143 85479 58602 121716 147356 196509
19060 196509 202035 181213 152806 159211 148848 75062 73403 124719 132466 154409 152845 158702 136507
19047 136507 91239 145821 178694 233209 237831 167577 148397 223278 197520 118648 83811 133583
19035 133583 179873 138823 44885 -21471 120538 239134 267490 195530 301029 271737 195233
19024 195233 67906 -79862 -113341 31560 164790 197831 190781 190288 103621 63603 65962
19013 65962 44816 132499 187980 150248 143826 158198 111144 129030 160464 142434 131050 129518
19001 129518 182191 266963 335506 323108 263029 175107 218225 224020 159551 127632 123844 199293
18989 199293 217494 205428 222979 280255 367543 366294 290600 263589 171458 90289 128716 156704
18977 156704 184089 195787 211638 179113 212123 268322 207162 171059 195458 235268 202139
18966 202139 169394 179207 162016 149421 124964 150820 153432 167632 262699 295351 255963 308246
18954 308246 365514 397191 428610 423886 392889 354535 285962 235672 269264 269428 278178 355552
18942 355552 363584 337633 305811 318078 327910 233101 184952 200966 263490 286410 314422 268254
18930 268254 261948 229065 277639 318515 241581 277467 245331 176389 149615 190225 242982 346328
18918 346328 285076 223292 219502 166351 251519 330521 357654 315280 366559 433219 470467 434424
18906 434424 345495 287825 283607 287705 348960 328899 325088 325094 280936 308611 365214 396374 391097
18893 391097 321318 346195 381772 365870 293759 275288 403833 516519 541928 448363 407764
18882 407764 350009 370883 329276 272526 223676 266580 303430 263644 287148 323255 299874
18871 299874 194847 172237 282384 362779 301024 235615 251445 229594 301901 373771 441485
18860 441485 452494 490530 399206 322201 347858 330726 382884 446452 540603 588014 499028
18849 499028 371918 387041 448237 460688 445577 519002 594622 662175 605480 586870 625286
18838 625286 664763 742993 773492 717718 663065 695437 694620 625391 684411 675550 719334 699156
18826 699156 661439 652172 607577 632922 632960 608954 623873 687982 767184 831979 831495 810771 740205
18813 740205 766966 835072 898345 948156 940950 979701 996983 948806 904370 936498 1006201 1070286
18801 1070286 1132902 1127941 1239987 1282418 1295178 1334094 1226106 1226236 1279519 1266795 1305961
18790 1305961 1503966 1489452 1428999 1522469 1622958 1668322 1688566 1818216 2038612 2210169
18780 2210169 2360335 2514585 2581622 2716686 2973414 3233568 3605950 4139693 4643456 5088324
18770 5088324 5468412 5861586 6267726 6829907 7554252 8618612 9816527 11080784 12510470
18761 12510470 14280506 16804472 20252984 24286442 28346400 31485251 32941707 33754266
18753 33754266 35090439 38204822 44379798 55116037 72283986 95998858 122631262
18746 122631262 147475455 162959323 163386078 156355298 145086763 130859198 114495939
18739 114495939 98872341 85967394 77669229 74905954 76005295 78419108 79540880 76489774
18731 76489774 69571418 61295860 53035918 46049829 40604918 36322544 32793902 30011129
18723 30011129 27789976 26067562 24755649 23772469 23051151 22490937 22005415 21619265 21346688
18714 21346688 21202156 21336173 21922062 23134049 25226387 28573633 33746551 41115330
18706 41115330 50290766 59646349 67204713 70331472 69051374 66666189 65828247 69160949
18698 69160949 78583954 94349429 114737350 138151873 161443099 181233482 195642012
18691 195642012 200637145 188269295 162739696 134641234 108338183 88661159 75846961
18684 75846961 68243464 64223712 62221675 60910849 58745441 54631680 49513640 44335700
18676 44335700 39599502 35480611 31794061 28398710 25460879 22979286 20750061 18933182
18668 18933182 17337459 16006091 14807356 13680046 12546998 11427432 10419989 9508389
18660 9508389 8723863 7974946 7382971 6918536 6453020 6004105 5638624 5324518 5043150
18651 5043150 4767077 4549069 4284344 4105271 4009254 3899658 3790513 3621597 3517823 3428843
18641 3428843 3346733 3317577 3303316 3265620 3244945 3192388 3119951 3048771 3193704 3295785 3332292
18630 3332292 3408732 3498389 3598497 3699286 3798284 3907327 4187744 4371642 4492486 4663934
18620 4663934 4874616 5159154 5388915 5743903 6032371 6371507 6719033 7094651 7466259
18611 7466259 7877680 8376379 8927378 9487643 10067750 10849886 11828806 12797400 13864743
18602 13864743 15108293 16639264 18439909 20558256 22996227 25923631 29388893 33441157
18594 33441157 38339189 44057077 50384147 57244968 64322857 71258386 77789933 83786816
18586 83786816 89469311 94796199 99661927 103830245 106964249 108652853 108816956 107612891
18578 107612891 105491879 102566897 99026293 94866682 90069372 84577439 78423838 72102087
18570 72102087 65826921 59777555 54283482 49340756 44971907 41184175 37833306 34922814
18562 34922814 32149892 29725027 27476399 25428278 23540015 21844354 20301794 18849440
18554 18849440 17489515 16266406 15152736 14203599 13376528 12549411 11705631 10973158 10314809
18545 10314809 9708534 9112657 8414203 7828905 7395782 6953703 6501446 6196018 5777339
18536 5777339 5356718 5026663 4709050 4437532 4155660 3957236 3777545 3658563 3494400
18527 3494400 3357592 3250511 3060178 2877000 2671521 2619064 2655962 2590888 2375188 2328543
18517 2328543 2367833 2307717 2198580 2184347 2141352 2206547 2256277 2284888 2424362 2540586 2535274
18506 2535274 2459532 2469551 2447132 2356314 2267465 2141148 2043684 2009247 1951038 1915069 1888977
18495 1888977 1854639 1762104 1586152 1549740 1514266 1503492 1547799 1414445 1299830 1223486 1188159
18484 1188159 1140784 1072364 977374 967078 1006392 946041 823789 839767 819315 731081 679614
18473 679614 693146 677833 636678 677147 763316 824398 758801 687605 777661 810695 682010
18462 682010 667796 674548 664180 697657 768578 810313 832657 782464 715211 574893 635922
18451 635922 708446 678697 627872 626247 660227 657027 620118 586506 631801 683778 695369 711179
18439 711179 672850 629527 636432 645363 589557 596701 528236 500276 526704 446151 373581 361338
18427 361338 377200 530953 698381 672643 589602 605338 582534 522769 504495 477136 436435
18416 436435 400588 388275 321357 290945 331889 429385 565308 613233 567704 581379 608291
18405 608291 570307 523743 456439 429390 414865 473998 513301 507368 513352 373903 303708 282009
18393 282009 288694 211599 199453 284019 318281 240245 213948 232190 158910 162890 99896 163414
18381 163414 251586 237570 188987 176965 227284 143939 115306 203715 264070 312036 304831 258908
18369 258908 236663 269000 316971 339129 322300 306136 203562 154613 164416 293003 290149
18358 290149 247028 323461 307908 258184 231422 266397 256050 289601 374743 459070 455206 389820
18346 389820 362744 352316 393211 406351 363410 310581 382878 336785 310444 345213 331090
18335 331090 323943 247066 299387 341771 340910 380400 395687 403425 305148 296666 304696 242286 226376
18322 226376 253353 219194 241233 271314 195992 200552 268915 350929 241959 268869 408052
18311 408052 508318 375667 292241 252177 326414 299221 267262 336064 308380 311005 402201
18300 402201 375131 298798 269939 324481 339846 310624 356563 339752 363597 314196 261562
18289 261562 250343 299180 248415 246872 256021 230941 250564 315230 412044 365626 294498 276704
18277 276704 298999 203844 272236 321861 308815 331870 353441 252148 325047 410224 418989
18266 418989 354216 299257 355619 438436 465194 411196 295129 272271 354939 400672 439027
18255 439027 403449 357611 360908 426669 374643 357893 413242 400546 399787 370517 417021 484110
18243 484110 416578 365620 329806 365172 438250 429529 371601 399373 402565 416239 390128 321245
18231 321245 347684 342845 314105 355538 443350 556147 723304 715871 671388 704457 670605
18220 670605 694949 774449 887934 851662 836929 874007 927788 969389 987113 930149 877992
18209 877992 760937 685178 716909 664447 572784 610766 579373 576515 604732 627545 672313
18198 672313 715665 747907 851356 724254 601978 499699 472657 485355 524301 549383 556533
18187 556533 515997 545839 525918 509203 549081 669591 766922 763681 745403 708500 820899
18176 820899 971643 1017008 1058469 1116593 1165057 1259760 1466572 1538313 1461760 1330008 1339704
18165 1339704 1314207 1282160 1311980 1295700 1446405 1555837 1682478 1785809 1672277 1534567
18155 1534567 1384930 1255358 1275801 1223628 1126681 1125414 1135718 1212820 1274179 1295890 1252927
18144 1252927 1229761 1312649 1441210 1437948 1425652 1386090 1442725 1500308 1579714 1642076 1687199
18133 1687199 1777955 1962352 2193681 2411254 2542799 2662948 2812184 3037104 3169315 3388359
18123 3388359 3640142 4052124 4518796 5047932 5691511 6429970 7281797 8234236 9224972
18114 9224972 10627178 12453399 15029342 18608980 23684446 31898292 46081617 71071173
18106 71071173 109131633 139525458 122581174 84649018 59508380 44841481 35855603
18099 35855603 30018974 25885442 22666377 20114665 18140552 16717470 15826424 15261282
18091 15261282 15052722 14736641 13938776 12909692 11806940 10691213 9793153 9111361 8676179
18082 8676179 8256318 7940808 7741083 7763988 7908530 8032297 8113045 8195785 8446986 8842740
18072 8842740 9337911 9880872 10616803 11703449 13214835 15242773 17906446 20795359 23128627
18063 23128627 25296904 28607421 33314656 37917890 41322821 45793678 54066942 67018972
18055 67018972 82254703 94082048 102310085 115148305 135895977 155504727 158666232
18048 158666232 150027148 147238143 149258269 144877884 131655050 118283799 109664444 102123378
18040 102123378 93349303 86391049 83276198 81593499 76976172 69903616 63875401 59545961
18032 59545961 55514422 50250819 44476605 39440276 35559938 32487387 29890315 27826543
18024 27826543 26272225 25298189 24519676 23680383 23075620 22839977 23019685 23620517 24885284
18015 24885284 27180630 30581520 34596246 38005686 40729609 44577393 50547986 57256822
18007 57256822 61355074 63588095 68160263 75479171 82878617 90449980 101934836 116421463
17999 116421463 125176534 125356770 127199044 137069403 144655783 135435243 117876935 105708783
17991 105708783 99559912 92752666 81199207 69086873 60209391 54871499 51770837 48580570
17983 48580570 44215092 40267089 37463203 35168063 32270577 28811873 25735177 23209065
17975 23209065 21001691 19075549 17376330 15920396 14758584 13686549 12704316 11866692
17967 11866692 11125515 10357427 9678808 9099282 8638444 8239487 7849180 7420878 7002769
17958 7002769 6730338 6485992 6344299 6296019 6173928 6019499 5820169 5762972 5726924 5607674
17948 5607674 5548281 5690151 5851732 5941499 6072608 6211456 6375258 6512496 6725807 6941571
17938 6941571 7213587 7502096 7876989 8252899 8658753 9155284 9769006 10403967 11200726
17929 11200726 12003829 12925684 14000845 15265759 16726045 18368370 20324083 22783496
17921 22783496 25753017 29230918 33380869 38239535 44044913 50743883 58195884 66086427
17913 66086427 73725361 80623155 86658669 92274010 97881938 103355299 108307033 111960322
17905 111960322 113659571 113187040 110985069 107692237 104046049 100156436 95702028 90309542
17897 90309542 83989635 76984339 69791959 62897407 56672597 51162611 46435884 42334968
17889 42334968 38714252 35435222 32526667 29920699 27603673 25430328 23485592 21775921
17881 21775921 20115987 18563330 17191153 15934092 14721312 13650890 12673842 11888635
17873 11888635 11170175 10440414 9728579 9237992 8807025 8446495 8038417 7481964 6950052
17864 6950052 6561055 6252671 5924129 5602634 5273389 5112764 4906817 4632773 4358282
17855 4358282 4232561 4133456 3996405 3829095 3659652 3513502 3338191 3199199 3056854 2870511
17845 2870511 2722651 2611999 2473173 2298729 2112039 2101444 2106463 1961430 1828493 1832613
17835 1832613 1785710 1719633 1671964 1586654 1476705 1417344 1430437 1343182 1324019 1330063 1311294
17824 1311294 1163199 1047224 1086994 1153048 1151746 1114731 1112449 1105688 1026675 944195 948482 1048924
17812 1048924 1000557 934934 973103 931965 912989 815663 753284 759375 754008 705576 681006 726811
17800 726811 728506 710220 674374 699091 656819 619142 657288 633325 520593 484602 570363
17789 570363 676692 791019 851113 807901 775588 754614 710597 702023 770790 801823 808154
17778 808154 752640 705535 722116 712248 690540 656756 652997 633040 620823 625504 621593 705604
17766 705604 670495 559772 512300 536091 623583 581275 557904 661392 666308 670533 731139
17755 731139 719297 686082 675731 624517 589908 643227 569814 607925 576558 557247 543968
17744 543968 565384 537008 491151 483814 380724 353302 484241 531307 513551 470191 439343
17733 439343 387624 374338 384536 345711 362847 326452 366936 414974 430196 480616 539101
17722 539101 547943 529854 487115 425766 407146 363474 356918 434014 423087 377236 384633 462503
17710 462503 427048 407238 475594 608007 576471 463931 387530 347452 338953 358471 362289
17699 362289 312202 331439 311809 288638 233332 289821 312666 303416 254042 263756 301468 321708
17687 321708 324525 384103 405586 273825 179878 268229 253021 317639 388854 390494 427186 385685
17675 385685 334297 288577 271248 289026 300487 236886 237623 253222 299271 340742 300505 329093
17663 329093 406232 427508 454033 419524 350006 333920 265907 293573 310565 231323 150146
17652 150146 228675 274167 280250 364015 336295 440994 374789 280742 252622 276708 296682
17641 296682 347538 380331 425015 527162 580724 613844 588488 606407 641633 643092 605241
17630 605241 558944 603371 637077 554859 486692 472883 515199 556413 515893 523892 636348
17619 636348 694660 739545 740390 717844 767238 827936 870735 849976 875977 885914 816653 828811
17607 828811 858635 829062 828985 864565 867912 825441 827841 907235 996848 1033050 1001364 983156
17595 983156 1057644 1022084 1036837 1021453 1014466 1089456 1041705 1079029 1221429 1325848 1282494
17584 1282494 1307025 1347297 1420969 1458425 1510044 1527951 1620825 1686516 1697432 1725772 1810988
17573 1810988 1901544 2004153 2121025 2297078 2366397 2463171 2671917 2878677 3014233 3159795
17563 3159795 3313442 3549688 3813943 4096350 4360026 4665653 5010308 5385136 5837309
17554 5837309 6360310 6857562 7377485 7869227 8497768 9231746 10031026 11097994 12236072
17545 12236072 13443033 14911300 16701821 18775001 21324070 24340965 27907500 32440789
17537 32440789 38018710 44672607 52389449 60464935 67940291 74048697 78685082 82506270
17529 82506270 86555550 91804361 98448264 105764071 112283349 115921555 115635183 111840624
17521 111840624 106129887 100479351 95946371 92573775 89728853 86403901 81804999 75726214
17513 75726214 68785869 61753184 55265352 49561481 44651347 40297832 36538972 33250620
17505 33250620 30329215 27757395 25518285 23534816 21750358 20121018 18653301 17261688
17497 17261688 15904045 14632948 13436410 12493374 11724316 10982643 10261680 9575899 8963696
17488 8963696 8370462 7722554 7241749 6836704 6402463 5961291 5617213 5345447 4965777
17479 4965777 4644698 4424142 4207071 4005470 3782359 3582088 3334934 3125865 2937859
17470 2937859 2831556 2714564 2554037 2453622 2361973 2223141 2019108 1920477 1811501 1637728
17460 1637728 1511190 1506109 1428179 1365884 1394397 1414894 1350628 1329551 1341398 1263724 1111979
17449 1111979 1003394 942883 914864 891811 892963 881578 882781 873894 1011666 1213831 1433298
17438 1433298 1496575 1314602 1093960 933524 840781 823053 862058 925786 866701 758864
17428 758864 694878 658232 657562 714499 755931 750714 719547 676448 701667 730405 742735 654072
17416 654072 560397 411576 315324 350774 349532 393228 516113 488521 467601 407182 327714
17405 327714 396330 480008 463235 462956 547506 516743 471972 487890 504163 557015 509357 444419
17393 444419 434816 398661 434971 433507 440199 397216 427905 408365 351338 340966 367164 362198
17381 362198 358225 368846 406212 289813 227595 147980 173846 258627 339484 376432 317685
17370 317685 332925 353677 314684 268042 184031 150544 97050 151066 214862 232232 135262
17359 135262 108878 138246 225709 187355 170373 152407 164554 185113 181105 224966 240258 290892
17347 290892 245333 131641 161882 215729 285474 253423 241436 273479 282093 207675 172163
17336 172163 95813 4665 29046 76842 52041 8986 75150 145411 117442 38814 123547
17325 123547 201818 229733 205207 165768 93163 122213 191737 211766 175085 179958 258963 206777
17313 206777 215372 214684 282763 308933 363410 442515 564555 603615 569173 583542 675992 717807
17301 717807 715531 682941 647839 662899 638901 596095 519966 529327 583013 591200 618568 588188
17289 588188 510151 496239 520619 449247 436026 375469 326706 293047 216215 225518 263139 305830
17277 305830 274643 216553 209718 229195 205037 191550 229377 155870 160241 218980 234496 276784
17265 276784 306811 283661 246843 203388 222696 190677 137974 152223 253492 214430 163501
17254 163501 149382 224325 172719 188230 138694 32461 68748 181227 174629 216922 301912
17243 301912 308300 189283 115557 62278 73741 50062 103208 76524 31682 35852 23643 375
17231 375 45176 66089 47271 44538 59132 79295 124455 139094 204071 195061 77850 46140
17219 46140 48846 124940 162643 125702 128875 91921 -3691 -49605 -92131 -102149 -82195 -100106
17207 -100106 -57762 -2922 -47431 -84405 -27855 -5042 -28412 33556 94829 63601 39415
17196 39415 -17943 -80884 -24908 -64009 2631 21787 -12395 2836 101429 84767 76720 106316
17184 106316 144039 69334 -26663 21405 138541 189299 190614 222523 284104 192545 38449
17173 38449 -9910 15182 -10263 -73051 -89900 -50309 -59155 -80254 -54258 -18969 37158 -10614
17161 -10614 -105280 -168821 -117186 35812 44782 7018 23086 75487 110597 121676 69838 36525
17149 36525 77980 78567 112201 110891 72690 129110 127216 149503 112195 82519 27125 -8737
17137 -8737 6586 -119275 -74716 48963 45106 30208 30006 57973 74108 102229 105680 121898
17125 121898 105592 70267 27173 -10870 -21449 117299 128568 75368 104353 96370 115201
17114 115201 46055 -29855 -16301 -48652 -59824 -26794 -31030 45853 195794 215375 227538
17103 227538 238398 99021 -27231 -44889 -28397 -63500 -100373 -118220 -140801 -105473 -2489
17092 -2489 53065 7908 -93630 -116645 -15421 -3438 -76561 -47810 -37467 -39984 -18450 -3628
17080 -3628 -22005 -19294 47485 34397 18337 27267 -5642 51078 99770 145909 96358 24204
17068 24204 -56036 -87390 -119264 -100397 -24516 -29133 -48910 58208 148289 106104 32963 40401
17056 40401 8179 -31319 46109 118608 76864 -26537 -51577 -47080 -68543 -69291 -26569 -37852
17044 -37852 -64070 -15622 43715 89660 40939 55122 105850 224509 268989 265543 309217 258493
17032 258493 156379 64674 -49498 22588 82251 33935 68304 65899 58057 9314 -11963
17021 -11963 -52531 -69392 -102931 25652 46023 -12640 705 -49572 -37394 26711 49201
17010 49201 82131 90301 94352 79392 112441 95694 30649 -37498 -1765 67320 22655 -75292
16998 -75292 -91476 -23788 -25460 -64358 19166 44872 78818 107539 30857 27391 87067 116187
16986 116187 131851 144884 69641 86062 125268 108666 75113 27380 -99543 -145670 -70775
16975 -70775 -109098 -95816 -18384 -45509 -81137 -159684 -120923 -98678 -1981 -19158 -17018 -6678
16963 -6678 19737 6948 -121 50512 64390 57929 47922 25312 14430 61864 132885 132926 63009
16950 63009 48814 13725 41282 80916 71874 65476 76666 117248 118811 64373 58416 81953
16938 81953 53519 86332 88897 96159 182310 269886 325364 394744 439569 528821 500957 526276
16926 526276 537803 475352 445903 437772 529409 644388 725884 691994 692538 567378 448407
16915 448407 472960 501848 467039 440310 391556 462165 531843 473117 369400 304276 287156
16904 287156 190473 64779 68398 30211 83703 143332 137430 110173 62117 -10253 -10008 17374
16892 17374 -32456 -47527 1107 -14220 -63957 -6632 61828 19022 58565 121864 39336 -29707
16880 -29707 -61956 75205 106750 -396 -121734 -128197 -157886 -95044 -61269 -3535 7373
16869 7373 16350 3868 -10490 26475 -46584 -43516 -35807 -63590 -6065 -6236 435 -8330 15291
16856 15291 37838 126716 190109 137662 82987 120597 224852 201802 112479 49413 27275
16845 27275 81185 104153 42911 -18858 -66973 -6377 24494 -53087 -57341 -18914 21000 -3009
16833 -3009 -51462 -4833 4586 -73582 -86860 -97991 -101778 -37730 -56449 -98274 -62745 -97345
16821 -97345 -62454 -29599 38163 13508 -26013 -58635 -62287 -82611 -53780 -69458 -80530 -74955
16809 -74955 -23601 54537 100422 91136 69000 22603 -80882 -138547 -115422 -34525 31801 -62060
16797 -62060 -125023 9774 100499 96618 98947 130017 103245 59640 67850 55604 79318 101091
16785 101091 78834 45469 82337 136017 126962 159290 13201 -58617 -2538 83944 50186
16774 50186 16488 34828 51042 32438 30759 -26414 -84851 -90070 -111719 -40228 32635 -11925
16762 -11925 -63593 -156818 -126143 -118446 -58212 -54364 -35717 -51102 -1390 -9010 53259 37119
16750 37119 -26570 -67070 -95093 -130658 -122777 -47882 -60642 -65341 5986 23326 71934 58804
16738 58804 52977 36064 46679 130785 86950 5005 -16915 58285 94017 73863 -23431 -80179
16726 -80179 -30811 -43508 -110647 -209486 -146689 -129274 -121864 -42514 -64779 -42096 11794 72099
16714 72099 14901 -37545 -57610 -27868 13904 -7769 44643 58585 1465 38885 122896 94091
16702 94091 -19638 -99936 -62067 18415 30046 25460 74156 95256 94849 70233 -6432 -66709
16690 -66709 -49458 -97668 -92049 -61806 -53403 33064 13353 -26998 -17684 54622 171189 219739
16678 219739 189252 117578 53512 -14703 93 23062 32166 -6247 -58553 -134626 -126216 -24558
16666 -24558 38959 -10127 13083 11832 7089 -27954 -33060 12124 57126 -2835 -18583 -28438
16654 -28438 -61910 -64475 -34837 -36360 30240 102616 63136 -10617 -6946 -84183 -85567 -51731
16642 -51731 -49335 -21216 -5648 -34347 11303 89864 123688 160180 81081 82560 48665 19879
16630 19879 -29326 -89345 -88357 -42538 49151 12995 -93325 -36084 -49660 -87835 -121767 -126951
16618 -126951 -193689 -184581 -206877 -97690 -82227 -43344 28710 33917 20850 5739 14233 -57748
16606 -57748 -80977 -109701 -136381 -183224 -208851 -237124 -311949 -271975 -183496 -120273 -91021 -48189
16594 -48189 -9282 1930 19871 -54539 -96069 -102778 -28800 -46546 -67558 -78147 -110967 -140731
16582 -140731 -125358 -146816 -66057 -36881 -61359 -78026 -166414 -188414 -124678 -50632 -30173
16571 -30173 8519 114560 128139 198628 162526 90149 70892 61749 -35826 -39244 -26583 -116235
16559 -116235 -188033 -71099 9522 106419 72726 -9369 39999 37870 -16576 -56031 -21875
16548 -21875 81688 127517 24938 -39270 -111034 -147324 -156139 -116856 -75582 -15698 67024
16537 67024 66873 21477 6599 46747 15386 5492 -9392 7330 80807 121179 120892 29492 -38458
16524 -38458 -39678 30533 75772 44572 -12996 12461 63295 46590 -29612 -19558 -6747 -42860
16512 -42860 -14758 -31521 -112538 -90028 -12378 43403 36926 55115 94640 20437 -42260 -48691
16500 -48691 -99440 -27491 11457 -54211 -86310 -52776 27655 137134 124534 105964 43688
16489 43688 31688 -35088 -10420 -1935 -67792 -7983 50054 49866 -4534 -30930 -27639 -2898
16477 -2898 -49126 -53201 17991 22825 62665 99357 136652 25647 4967 133500 88405 50218
16465 50218 62766 83008 59231 52957 17043 -36060 -8323 -1092 -9940 8520 59436 122422
16453 122422 138666 1231 -102066 -97569 -104729 -86375 -14521 -27201 -23334 -40081 -107821 -116029
16441 -116029 -51947 -5184 67620 19281 -1490 33970 -38078 -86642 -44308 19455 5733
16430 5733 -41618 15847 61511 204527 185420 221091 211547 97547 8253 23580 58075 79622
16418 79622 87162 68550 30268 11383 32067 23571 38990 74243 98566 11638 -40368 -93871
16406 -93871 -53602 51447 62092 -3808 -124629 -171545 -98985 -83304 -46503 13935 56448
16395 56448 12122 -77894 -67879 10487 -18706 -113354 -97057 -25833 66 -89478 -145192 -80466
16383 -80466 48004 59521 -60385 -120950 -165243 -130221 -75098 -50814 -21759 -15089 -24572 -31533
16371 -31533 -115672 -126456 -104447 -98683 -120384 -87902 -50196 58228 154665 151879 116265 -32950
16359 -32950 -53990 -3065 64130 127868 33470 -16797 -57982 -186396 -187959 -130950 -121567 -98065
16347 -98065 -86988 -34428 -2817 -56156 -115433 -88621 -8368 14180 28805 17435 32872 115650
16335 115650 101054 61534 21772 -84685 -94987 -51091 -48974 -2767 28990 51834 -13004
16324 -13004 -91454 -60637 -53754 -120969 -103709 -81891 -34435 -66391 -69006 -55015 -104785 -81996
16312 -81996 -17874 -77689 -121167 -39644 -106355 -170297 -51677 26452 144761 183662 112538
16301 112538 38326 52928 13918 -31908 -24041 -11548 6240 -33954 -28013 -50884 -148124 -173923
16289 -173923 -125993 -98833 -59225 -82967 -103527 -113570 -34560 48138 29275 6515 -73547
16278 -73547 -133199 -172751 -220785 -157614 -57248 -50755 -81982 -75053 41280 75912 13542 -6029
16266 -6029 -5431 -30940 -8152 -11401 35479 42424 16434 -45311 -58906 -77845 -22194 -3091 -242
16253 -242 -36866 -102235 -120666 -116730 -69587 -65330 -87567 -175665 -197313 -45429 119036 121417
16241 121417 66855 9650 58111 48944 44212 32556 14665 51671 -25879 -35847 -50090 27697
16229 27697 44312 15739 -33118 -38266 942 -37160 -53553 -33335 -34077 -76633 -94938 -82216
16217 -82216 -72220 13882 -797 22051 135932 134829 73420 -11129 -46788 -7260 32118 16972
16205 16972 -37966 -54336 -753 110901 138011 98949 41321 25626 -16795 -53707 -51387 36097
16193 36097 29483 19154 42367 25845 -55467 -83083 -75697 -56156 -22293 -16690 26825 24496
16181 24496 13431 10787 62320 128964 68534 52459 -15117 -93812 -106745 -14160 6628 -1666
16169 -1666 -17305 52566 134061 109332 52344 -17863 -11675 11651 25678 90409 160516 81336
16157 81336 72315 94326 -27395 -95895 -119197 -116556 -71256 37086 81473 111073 3613
16146 3613 -80693 -58800 -25746 -74549 -67526 -54949 -80435 -105791 -146676 -131045 -87793 -30676
16134 -30676 -30845 -32456 -36639 -45436 -15911 -99654 -79385 -5472 18936 35726 69724 86938 7250
16121 7250 -12901 -73082 -42919 21896 -22767 -74082 -147548 -201809 -206607 -185258 -146852 -132965
16109 -132965 -112726 -130911 -41759 -25231 -65429 -46284 48500 -31980 -68463 -31697 -45825
16098 -45825 -14447 31071 -11362 -34373 -31866 -41397 -51988 15709 90305 -11662 -26425 1981
16086 1981 46677 61139 63977 70337 60097 49205 114642 111649 36135 -40073 -49994 -5255 26726
16073 26726 -11824 -21045 -64466 -29068 -43442 -18555 3493 -10547 80213 59561 -5125 -62646
16061 -62646 -65151 -94116 -166648 -207473 -179275 -109270 -115795 -154556 -46168 75331 17219 -76764
16049 -76764 -31324 -10932 -4643 36617 46384 60608 22494 22622 16958 -9581 -49087 27947 -992
16036 -992 -46014 -54548 -98995 -143617 -84536 -78954 -72635 -35405 -24366 -8514 -56210 5882 33711
16023 33711 -27290 40755 120013 190125 183042 148970 95486 4321 -16019 -25152 -60532 -119843
16011 -119843 -93448 10953 107432 55898 15941 -27488 -61882 -53159 10073 3447 -101645
16000 -101645 -179869 -163389 -94745 -79196 -137554 -147129 -196279 -192256 -103666 -139728 -116271 -151998
15988 -151998 -189116 -229294 -114079 34151 -5561 -24577 -42181 -11150 -83461 -93876 -65938
15977 -65938 -53508 -108303 -107775 -44948 -18043 -40176 -73152 -70792 -39126 -32522 -48697 -57362 -81725
15964 -81725 -116900 -97621 -76627 -112845 -98129 -81796 -59550 -16847 94370 159410 126801
15953 126801 70003 18171 15200 42945 62317 12778 -139630 -112284 -64313 -119887 -136721
15942 -136721 -168548 -108026 44099 64430 28229 90914 62339 18708 -16485 -48371 -72210
15931 -72210 -59310 11104 -22698 -86730 -138116 -136216 -85455 -47988 -14837 -12201 -49097 -61613
15919 -61613 -113236 -51243 40039 144555 169087 112599 93039 33094 44803 170061 145191
15908 145191 30232 55124 106899 96187 55858 -2034 34984 8445 -11701 42728 128681
15897 128681 118525 -9168 -36194 26623 35303 61944 16326 105883 81258 43840 31650
15886 31650 -11386 -47735 4423 20789 13895 45962 75941 17882 -81441 -159451 -120422 -91760
15874 -91760 -10005 -55757 -80764 -81950 -50431 6341 -30208 -27373 -109186 -139165 -114766 -112894
15862 -112894 -82452 -44296 -56470 -108658 -83691 15364 16884 484 -12774 -55128 -19522 -47044
15850 -47044 -71311 -82501 -69398 5173 19705 27424 -14187 -8181 38914 36166 56739 28036
15838 28036 12691 74417 119996 428 14740 65843 68396 31670 58248 -29603 -16000 -29356
15826 -29356 42155 180909 130041 50948 17515 75859 121174 41020 27764 335 -21809
15815 -21809 -66799 -20380 -10927 795 -552 -21368 -59438 -115444 -95418 -100040 -81378 -96231
15803 -96231 8640 76101 7586 -115078 -124040 -81163 -9874 31462 11553 16906 -14351 40120
15791 40120 22561 46666 78947 2835 -63809 -32512 -18188 25361 32277 -8909 -43955 -852
15779 -852 54756 41772 94984 14703 -20424 38743 48314 -16506 -92347 -96302 -156176 -98856
15767 -98856 30816 95914 1736 -27359 -62642 -19528 -2549 46915 4655 -123907 -155459
15756 -155459 -124102 -60976 -84166 -162991 -116659 5001 32329 -1129 -63680 -98685 -91536
15745 -91536 -74885 -35622 30258 -24487 61253 112026 84165 73120 46664 103641 100740 1199
15733 1199 13718 -29493 19914 -8090 -81459 -118683 -127752 -128048 -87337 -114513 -126443 -159244
15721 -159244 -114986 20884 63892 30212 -22688 -84447 -77568 -65796 -66874 -31667 39841 45724
15709 45724 9964 92559 66120 47004 5108 -26782 -43514 -80520 -132224 -179452 -162610 -132777
15697 -132777 -96039 -24994 8085 69653 72283 -64477 -66192 -45799 -61048 -19158 14491 -17652
15685 -17652 -29938 2961 -44708 -164689 -153457 -127681 -115187 -96090 -81019 -24264 37776
15674 37776 -56070 -66609 -115048 -128272 -44471 49650 51195 6462 -36603 -48442 -16602 55406
15662 55406 36502 -14192 -66208 -111088 -13979 16644 5257 17942 1402 3165 21822 108540
15650 108540 66409 -76506 -179557 -172668 -94555 -138133 -96335 -56377 -44648 -40443 -10098
15639 -10098 22755 2834 -38394 -72725 -14309 18453 -45202 -32512 -44084 -66218 -107396 -99134
15627 -99134 -19213 -51223 -157512 -102106 -31086 -54873 -109525 -184125 -153975 -104276 -113082 -30518
15615 -30518 40019 -34910 -103685 -47576 -24205 -1125 13073 -4625 -6359 26417 548 83414
15603 83414 30920 -4031 -85780 -18659 36285 35301 -47910 -94963 -72001 34526 25485 -33044
15591 -33044 -49990 41455 20444 -28921 -51656 -33283 9052 57410 -1119 -112673 -137981
15580 -137981 -106252 -125596 -39552 -34090 -834 73399 43615 35355 6887 71346 81312 21769
15568 21769 -43289 -15093 44876 117948 133891 145468 87938 46588 124285 27535 44086 56450
15556 56450 -178 7569 16701 12025 11906 12554 57720 116387 93097 93561 115747 52830 -23177
15543 -23177 12816 44807 -10986 -29866 39499 37273 29861 43644 36053 2023 33247 93971
15531 93971 163207 142507 41235 9285 -13703 44867 52270 61550 10551 -84379 -128554 -80734
15519 -80734 18390 63899 118647 115791 135060 98013 31917 -15193 -6837 69619 -7889 -91930
15507 -91930 -107381 -130645 -62208 75873 97054 110686 125832 11226 42843 -165 24203
15496 24203 85594 38186 22669 -3085 -6016 -11440 -25386 14384 95999 71503 51671 94192
15484 94192 184100 123061 68360 -22458 -3978 -24198 -151373 -189113 -164791 -147831 -77391
15473 -77391 -19206 47031 20357 -32361 -73598 -36095 -27597 -58934 -62691 854 98910 89379
15461 89379 42753 87208 78316 8398 7394 -39967 -73122 40177 79154 -1476 -64568 -87763
15449 -87763 -22228 -12321 -106593 -123691 -98341 -96778 -35362 -15110 -2362 -55578 -130261 -77879
15437 -77879 -35617 6558 5416 30500 117245 129085 99651 108010 132785 52575 20772 -20355
15425 -20355 -42111 -44358 -83767 -76109 -49603 -42880 -32758 -79653 -239188 -227174 -118135 -115200
15413 -115200 -40674 -21104 -11934 -3857 -30117 -28672 -25196 -66603 -38577 54509 80204 106378
15401 106378 156287 160314 102328 70089 -18579 -7942 59796 117441 128714 185480 215531 184558
15389 184558 111874 37162 -30864 -72302 -56314 -60896 -81286 -81894 -112195 -120005 -101383 -64175
15377 -64175 -81001 -41001 10090 -15180 1695 -7185 -41284 -554 -9790 50931 126202 111415
15365 111415 78460 95559 111025 50638 -8843 39747 52253 65620 43786 -6089 81737
15354 81737 86892 55073 -29052 -83517 -70003 9637 52451 95968 110851 114808 86209 15056
15342 15056 12640 16735 -84575 -141154 -42767 7258 896 5183 76454 91867 -16339 -103234
15330 -103234 -65806 44011 20376 22307 3328 -24639 -13303 41285 30059 57733 122236
15319 122236 112320 111951 59545 16300 106279 242654 207987 140501 141595 132368 90218 58078
15307 58078 28724 44618 96017 92269 134300 133697 249363 311258 345860 335962 385569 496953
15295 496953 611801 801466 897151 990256 1197522 1342652 1471829 1624980 1684331 1713479
15285 1713479 1651864 1605680 1502593 1443286 1433232 1317339 1126224 993453 932925 762417
15275 762417 591785 555829 621766 609976 580066 493189 395940 231110 167092 250006 280341
15264 280341 146849 114700 105481 125507 148923 151761 75068 34432 65056 8649 50108 111361
15252 111361 104855 59796 22549 36991 38950 76958 123731 87105 -40198 -146007 -170566
15241 -170566 -60669 -53577 -2420 -8495 -95305 -170695 -149281 -49855 83193 57367 -13670
15230 -13670 -74952 -28395 18445 40833 53925 26152 -79314 -156416 -216194 -163229 -71378
15219 -71378 32547 59691 -41700 -96609 -49619 2749 60730 42813 -20832 28625 94987
15208 94987 112991 92055 36161 -23906 10792 85215 73480 115636 219314 248634 248536 135706
15196 135706 49678 11446 20295 141314 189590 164139 122261 34048 -32677 -93297 -51676
15185 -51676 -66076 -75781 -12255 -7004 9635 43191 -11432 19516 30352 244 -25713 -32067
15173 -32067 52939 18232 23672 12377 81490 101890 124499 108171 94192 -29418 -10017 -28810
15161 -28810 -73965 -2318 62875 73621 -4261 47711 124179 176501 192975 141379 117435 72683
15149 72683 28333 107317 118053 110133 177742 302652 312753 244745 171220 -23311 -49320
15138 -49320 77537 153722 36933 7549 -28111 -20247 15300 74554 98961 113062 151711
15127 151711 132950 112239 149315 104288 37556 36474 80929 112866 -15531 -46626 1642
15116 1642 -36431 -80236 16107 62388 72174 38673 3437 69793 170175 187561 201687 290064
15104 290064 262262 152114 123404 146026 175686 127082 145667 257630 232486 169296 168758
15093 168758 180016 168132 253858 293689 220987 132955 79301 124719 177031 171111 140419 170995
15081 170995 175124 73134 10086 74719 76665 166115 123864 60078 67303 97963 161612 243081
15069 243081 306584 230853 246432 174246 152071 214664 244781 248758 239923 139387 108275 58757
15057 58757 136683 179521 63359 71907 107649 147865 129431 111708 103710 83840 118743 175155
15045 175155 213195 219545 280676 188388 124676 135530 167259 89189 169162 213767 164806 216430
15033 216430 218374 196867 108213 119224 99795 77064 133893 231317 196052 168735 188373 229625
15021 229625 180737 163466 179324 161679 121360 161466 203727 215585 196492 117976 114011 17577
15009 17577 42299 198000 274759 366063 282271 204138 166549 143710 78721 130319 188536
14998 188536 194320 172449 98372 131715 157621 194157 102816 96525 74949 135990 224914 226106
14986 226106 179298 181386 147543 47819 33250 67380 68561 -11605 89223 166173 180965 158509
14974 158509 160958 197906 240026 231052 171248 160519 124631 162255 181091 129039 198076 245195
14962 245195 292732 357848 360842 343187 349582 409740 427227 468426 464067 452572 602420 741307
14950 741307 765009 733349 700869 749321 726618 647570 555383 619037 719730 682674 675418
14939 675418 687166 687140 641183 656574 714774 828574 833576 813720 761345 762107 817575 874561
14927 874561 866180 866517 895736 899696 879252 938851 959605 969117 1044932 1131987 1145954 1092575
14915 1092575 1013341 931125 933544 981035 1026286 1078248 1080713 1124054 1116755 1119629 1204565 1236081
14903 1236081 1285150 1347548 1417876 1464045 1467650 1477269 1485668 1567092 1571426 1619709 1701681 1792600
14891 1792600 1878197 2005267 2138115 2248211 2465687 2641555 2865396 3085387 3368558 3639644
14881 3639644 3892289 4185981 4493536 4830427 5225041 5737593 6371562 6953340 7723188
14872 7723188 8627774 9755472 11152599 12723232 14380987 16476469 18886482 21738985
14864 21738985 24886905 28562064 32843622 37878431 44107641 52011565 62313465 75997706
14856 75997706 94137679 117169375 144801068 175857302 208535053 241297538 272586004
14849 272586004 300424926 322365530 335951422 339535048 333133514 318020644 296513223
14842 296513223 270903240 242881375 214139486 186332365 160956144 139320630 121927492
14835 121927492 108325609 97683815 89063857 81592966 74810682 68583722 62713826 57074937
14827 57074937 51797521 46784971 42049775 37675084 33807571 30299989 27192433 24575917
14819 24575917 22220799 20022669 18130089 16516993 15090841 13774430 12713583 11693785
14811 11693785 10768486 9991585 9293496 8619863 7927128 7278105 6750269 6305383 5804703
14802 5804703 5393126 5155570 4820934 4388408 4151432 3846456 3557403 3399769 3224859
14793 3224859 2976777 2772195 2660670 2563575 2359667 2243570 2143336 2013933 1917431 1878524
14783 1878524 1807472 1635118 1444850 1378924 1341704 1302676 1187365 1152335 1119675 1122878 1170530
14772 1170530 1162322 1177735 1126876 1033433 1027758 1044761 1026963 1058700 999087 1011284 1023747 1042844
14760 1042844 1010436 863803 812614 727784 750652 760434 766624 794572 757180 764831 741396 677929
14748 677929 657120 653255 680734 663110 579232 584466 648033 688815 733453 669676 667835 726092
14736 726092 744017 773340 799039 793007 809589 813703 763532 723250 684673 623927 596678 626621
14724 626621 677743 735220 749701 737568 738876 812523 931703 955101 1026322 1007475 1034348
14713 1034348 963730 912595 971522 940155 910596 814819 869699 949092 863682 742411 588630
14702 588630 539398 531780 477809 468771 574067 551680 474284 457620 471524 469990 445631 427103
14690 427103 455232 425879 369548 353905 313613 326684 418658 420465 452576 434379 384889 361187
14678 361187 359471 322400 256623 252049 251204 241572 213788 240399 271358 244595 211898 324622
14666 324622 274470 192765 159151 223454 304874 341001 365300 376810 299644 283924 284073 215030
14654 215030 133408 149480 111782 96372 40505 55041 28141 23352 123134 203379 216287 202701
14642 202701 217386 180671 188751 135307 144142 67012 46285 67485 78993 53780 66530 95467
14630 95467 45149 22819 48912 42882 63204 138212 128831 156633 123539 68386 76167 105605
14618 105605 75682 138508 147725 199009 162658 77525 95613 142852 238283 299885 318267 265723
14606 265723 213359 183987 157177 132780 207565 289166 323197 312270 317189 221201 173672 221521
14594 221521 205208 228002 182746 125083 170814 177264 142444 123596 100035 69267 150045 228054
14582 228054 314347 361851 275534 170547 201879 242097 220140 123430 167743 200894 174830
14571 174830 37173 -19726 79526 102688 134825 171865 221922 197150 260236 203616 208656
14560 208656 167552 11171 62948 53579 124055 175573 170143 155232 149157 132160 175195 119559
14548 119559 51901 16857 38915 10267 41709 74832 39853 -21466 -105298 -134843 -113107
14537 -113107 -138599 -38010 34619 108508 199280 85619 -16552 -71472 -96145 -44261 -47285
14526 -47285 38374 147767 220004 168477 159666 151066 121938 95442 -14481 -70762 -34799 -18647
14514 -18647 8039 59876 146573 158433 98348 35919 4771 29696 59147 66267 83978 113435
14502 113435 89194 98555 151496 153556 116680 90200 54028 55391 66022 71251 95142 153124
14490 153124 129795 42278 59387 87822 22206 -82559 -36650 32196 57502 37473 106703
14479 106703 178202 205244 197062 207657 219277 99634 34897 104468 131066 109600 47577
14468 47577 27992 38489 73997 161340 107655 65961 64153 79532 141269 132206 57345 23640
14456 23640 105813 149079 116451 90879 116234 49688 46818 149773 158663 91423 87980 49373
14444 49373 34202 19325 16699 35704 98007 165072 197914 174903 156644 76784 48095 91751
14432 91751 205995 231404 193996 234753 235920 176509 77271 4101 31943 43449 78159 94179
14420 94179 206254 317563 306801 276662 334749 323414 362791 468594 563439 600472 685405
14409 685405 715282 796552 978134 1039844 1127638 1243457 1444658 1676731 1780129 1871381
14399 1871381 1817282 1649622 1516349 1461030 1333248 1086818 901906 774539 673663 624848
14389 624848 579308 593981 610069 584948 442824 415133 426337 388321 387399 394746 342146 289120
14377 289120 239670 242738 291974 290926 196625 165212 169877 190563 187517 129377 60829 43186
14365 43186 56292 3306 -8982 37899 1570 1903 48017 82496 96466 96529 130800 175497 111574
14352 111574 91996 121276 121766 57381 50217 -33734 -89258 -52680 -86574 -89235 -100870 -123296
14340 -123296 -105730 -23414 10221 31808 15519 6109 48282 32817 22176 13901 -4871 -39783
14328 -39783 74953 94742 122781 130140 44961 93332 77222 106217 98794 29220 -39988 -45838
14316 -45838 -8506 64511 187843 229680 145891 107898 127199 96212 33544 20147 67910
14305 67910 104100 153303 120497 74509 150964 156584 154689 162494 28869 23516 89446 76141
14293 76141 -31549 -51373 339 23415 55743 91729 32065 9372 60431 151600 152276 108085
14281 108085 64481 53703 22322 11025 78790 121865 177226 164485 129158 181905 176358 217386
14269 217386 142435 46601 46143 39688 3547 26909 78977 28459 3550 11522 57842 113990
14257 113990 69337 11952 -62590 -142286 -144465 -199401 -162259 -25557 79547 119770 41070
14246 41070 52374 11744 19920 13942 -16611 -26360 5406 -45676 -79534 -69109 -74170 -54743
14234 -54743 -36612 10276 -71177 -27976 -19203 -3675 -66418 -103581 -10891 61778 21780 -46525
14222 -46525 24821 -5183 -90511 25455 115065 95016 6818 -146749 -163611 -68390 -41673
14211 -41673 -99611 -91263 -11654 48621 -13881 -37534 -25221 -36804 -22982 15814 -4877 -73974
14199 -73974 -85021 -42215 -45666 -18268 -45928 13776 -2872 32319 -26570 -52570 -52375 -32830
14187 -32830 -34174 -38149 31838 121459 130852 124565 76228 36189 62911 113253 165084 218783
14175 218783 245450 206456 138851 93071 85513 68425 51736 15542 39955 78596 112972 19717
14163 19717 -6451 494 16833 -64819 -64328 -16480 63830 86566 91853 105440 209091 325202
14151 325202 254677 98341 9564 -66920 -89435 -86758 -74523 -24705 -15266 -8732 -50996 -965
14139 -965 25134 22727 47172 97973 78502 -7442 -45485 -29585 2543 -65803 -97875 -101023
14127 -101023 -76899 -79891 -69504 -4203 -78763 -47948 -2943 -23734 -15232 -8722 -35551 5647
14115 5647 -32007 -39206 51465 99303 103250 108657 85712 9193 -5532 -26148 61047 197481
14103 197481 172813 123409 51907 1514 -29418 -43602 -36822 -55505 -111000 -45416 -48796 -58793
14091 -58793 -108497 -115052 -78345 -107752 -12794 118511 154726 60732 -10389 10959 49047 2908
14079 2908 -55297 -128297 -122677 -26450 79860 98053 80727 -69387 -63702 -4933 -42054 -12011
14067 -12011 -8073 9278 -20027 -8546 31278 47004 75060 121199 16866 -69153 -42122 35042
14055 35042 34746 99621 124257 156488 145034 95195 -41537 -27810 9645 53563 31796 76629
14043 76629 76320 91647 28296 -8315 47288 82064 70535 115896 116325 153851 132079 39561
14031 39561 -45957 -74536 11762 121673 121154 106184 50312 72547 124704 113351 130688 166558
14019 166558 82373 42857 57867 149292 219253 195774 131477 123012 109648 101435 95024 90078
14007 90078 122077 148681 56117 75828 112110 41347 33738 4089 -8347 7190 2796 -96707
13995 -96707 -134664 -179349 -129195 -125108 -124084 -198254 -122019 -40452 -8276 133893 201107 198666
13983 198666 142787 134049 81304 -8233 -38074 -36513 -82305 -89307 8845 127643 81281 47224
13971 47224 -41540 -88936 -99203 -119981 -133461 -76077 -57648 -22976 -25250 -44914 3648 -42035
13959 -42035 -103375 -58150 -43139 -69202 -18577 47128 -47444 -161913 -205781 -115559 -57522
13948 -57522 -11543 88664 44177 -2707 43115 39243 53153 20770 27102 62305 -19667 4085
13936 4085 20025 36141 56496 55697 30408 -30475 18117 57540 25523 -32705 -7085 -6758 -16638
13923 -16638 10499 22218 111887 53298 20183 -1974 -77126 -94570 -80927 27791 150998
13912 150998 108148 98490 143203 103886 41335 101638 120189 68048 40755 77467 149864 124017
13900 124017 6975 4260 31377 52742 2408 -23527 -16665 3766 22613 -21100 -338 6811
13888 6811 40749 111768 92014 31081 15633 -13937 -2364 37602 -2611 10360 13169 -27785
13876 -27785 7489 23136 -30874 -13444 66485 43919 -21984 -13172 63155 97073 -21148 -85055
13864 -85055 -79879 -87310 -120834 -214566 -105894 -60863 -30967 -2899 22758 13079 -42733 -60890
13852 -60890 13634 60353 81818 76872 13996 -34519 -54153 -37097 -1206 39154 57743 16721
13840 16721 -32906 -70701 -50535 -3393 20079 1496 -35617 -93839 -45847 11107 4664 -11451
13828 -11451 -16921 -72584 -109178 -8620 -26883 -67884 -126409 -130463 -24817 16226 10577 -391
13816 -391 -45116 -8572 44466 37959 3269 -33064 25220 53092 112684 75047 61742 26895
13804 26895 -42483 -8115 61418 98578 131617 90980 -3121 -3454 6157 -8393 -25751 23353
13792 23353 -21765 -54595 -62237 -44819 15969 99594 53289 53867 33661 37932 47415 31880 29763
13779 29763 30538 27090 84047 101159 71801 -10879 -76586 -35681 106131 153938 188301 130910
13767 130910 32464 -14272 -36091 -11177 8994 23801 7074 -39353 -5614 -12916 4128 -1637
13755 -1637 -42786 -54746 -35203 94944 66949 -3579 35719 85517 62493 11703 -40898 -21132
13743 -21132 -27051 -64917 -15349 30077 23480 -26220 -84420 -124665 -130723 -95375 -93292 -71857
13731 -71857 -91453 -90565 -16799 -68398 -97171 8152 109166 90907 111021 95794 51877 110242
13719 110242 152270 187282 141903 153492 105005 73223 100883 5660 -55140 -7007 10552
13708 10552 -51830 -184689 -152420 -56210 11816 12042 86034 62350 -33039 -55646 12649 -56225
13696 -56225 -97370 -86342 -90104 -78689 5834 79982 64091 -12191 -34239 -39622 -29726 -30595 -34373
13683 -34373 -70466 -14943 24866 109805 127716 91068 22280 -19930 -42909 16057 11396 -39592
13671 -39592 -131114 -117558 -68087 -126199 -219592 -157698 -82208 -56580 -43935 -140180 -123750 -124013
13659 -124013 -57221 -3545 34030 -51214 -38334 70585 57247 -51575 -103496 -123316 -116049
13648 -116049 -62419 7438 91217 63529 -38140 -186551 -154286 -52411 -1244 119573 51086
13637 51086 36405 41858 107224 60940 -33620 -17424 -3108 -23963 17077 70436 118811 105552
13625 105552 24540 10127 -54322 -64798 -1285 21339 14847 7377 4576 -3144 10540 -15758
13613 -15758 -7977 71889 113926 126300 43059 30021 20783 33293 69724 96540 98596 104562
13601 104562 105500 45554 -9049 -22572 -53343 994 -17623 -112982 -26561 23727 -84588 -136000
13589 -136000 -147155 -195415 -153460 -80788 -78436 -90386 9023 36581 14286 10897 -86187 -62598
13577 -62598 24590 99132 128665 137536 57785 87461 53098 -25209 3217 -14786 -21092 -16499
13565 -16499 -62641 -140933 -65880 12059 13299 15306 87652 110591 64947 120467 160408 80817
13553 80817 -9765 -68452 -7637 -9587 18353 -3864 -71785 -104952 -135897 -67654 -45957 -69526
13541 -69526 -21764 60659 7872 -67049 -18224 14255 46947 53699 27665 80070 5792 -12733
13529 -12733 -39313 10261 18810 23389 19388 -16733 -26404 -47981 -35392 -37765 -3385 31571 27692
13516 27692 49915 90379 106362 129651 120271 110647 91724 90428 142852 149238 111702 120844 65596
13503 65596 64982 105857 77746 45294 -22326 24598 30079 57089 63342 -59364 -79664 -72943
13491 -72943 -20591 97647 118298 116272 26469 -42891 -88819 -48517 -34630 -76355 -50607 -42541
13479 -42541 63132 84006 117789 98843 71004 56321 102753 53328 91129 2861 1711 7365
13467 7365 -75985 -93662 -19715 65378 149839 132721 138073 68452 1910 6547 -22015 -3106
13455 -3106 -37052 -80558 -102054 -65006 -33332 49786 158530 124489 55683 64091 600 -28472
13443 -28472 50367 10209 66026 75927 53409 80036 111154 -11519 -104855 -17782 111384
13432 111384 186557 193366 122872 32981 -2994 -48130 -23707 44012 -21339 -48680 -27519 -34227
13420 -34227 -88705 -129421 -120626 -51885 -9075 -24016 -17683 -41371 -54705 -5653 141849 162409
13408 162409 117128 86029 33786 23257 20283 94666 9295 -56914 -50416 -58324 -49650 25228
13396 25228 -24156 -71367 -74474 -14399 -17866 -52807 -82995 -10673 -171 2137 10787 10652 73892
13383 73892 -9768 -194153 -163571 -51555 32665 54488 87453 100264 157383 159399 16953
13372 16953 19328 9226 -49363 -95030 -139623 -101581 -33946 67445 167970 116123 -11427
13361 -11427 -34345 40081 -12770 15617 12171 20687 2246 -45098 -6461 76846 108443 44323
13349 44323 -8378 -8562 31803 83672 62000 -8711 -63463 -32424 19945 52397 81102 69680
13337 69680 88490 -16212 -55843 -14479 6862 110595 190913 213037 125240 38681 -36394
13326 -36394 -38430 42591 120224 10409 -135008 -144864 -100131 -51896 -22050 -11187 23631 111507
13314 111507 49729 -45462 -81244 -51078 25335 52954 56821 10904 -28517 -22998 -31872 11654
13302 11654 35585 -8878 -77593 -54148 -43604 -36624 -50482 -15892 39439 -4057 -84591 -116294
13290 -116294 -6325 30007 27490 32355 57771 114619 48312 -40248 -15406 26242 9017 -6800
13278 -6800 -43960 -12781 130346 167904 106202 37465 -5917 43606 61744 54309 45362 -43266
13266 -43266 -29022 -130 -18508 40885 33721 74603 123631 86700 111471 69966 -16484 50679
13254 50679 25993 -27294 -15083 -53894 -45072 -111251 -182808 -182243 -68314 -88597 -130061 -167173
13242 -167173 -40507 100001 148631 135422 110348 61216 86236 105952 42331 2849 14352
13231 14352 3606 -7464 -2192 -25773 -19600 69038 68575 37484 78873 70079 -45393 -132346
13219 -132346 -53052 31439 36674 68830 162850 273986 245479 220817 139949 23050 -40692
13208 -40692 -78617 40359 151850 74986 10567 34762 143445 202594 98724 244 -30993
13197 -30993 -31698 -40140 27455 120340 130300 137237 76755 -45118 -60479 -41660 -18328 -14798 8537
13184 8537 34805 5369 -47797 -38370 -5794 32128 66231 72791 34197 -54626 -51302 -62097
13172 -62097 -91167 -71883 -128819 -126209 -121551 -146334 -106216 -45295 -56833 -118392 -91230 11816
13160 11816 2600 16653 -17979 -44054 -10688 72904 61919 1570 -62222 -120953 -189434 -230683
13148 -230683 -190408 -59785 27759 54674 163 -7484 -4668 -9004 2754 -18834 -38975 -4772
13136 -4772 58667 32634 -20800 -9038 -95040 -130267 -75003 -94504 -98112 -107944 -143506 -102050
13124 -102050 -100795 -72524 -130848 -116945 -45171 35263 10722 44477 52855 -939 -23591 -7050
13112 -7050 18239 58473 65548 35684 66338 88470 74975 107975 61818 37669 61507 9475
13100 9475 26171 8590 -69721 -67836 -54230 -25373 12672 42569 -3171 -73338 -129121 -146933
13088 -146933 -116319 -49092 3313 65195 -11316 -46704 -62996 -160282 -183499 -109373 -101385 -94747
13076 -94747 -60610 -70330 -81313 -30128 -7502 15647 58267 28987 -16295 -23922 -45256 -57448
13064 -57448 -25733 -463 4117 -18721 -18450 71106 166806 144736 63535 71985 71335 46938 28399
13051 28399 -43123 -24577 52527 -6816 2555 -59471 -157304 -154606 -93142 -25890 10727 -42820
13039 -42820 -46613 23347 71882 112782 98647 97708 108958 78312 102977 124909 157330 146498
13027 146498 133460 41538 8707 5065 -33168 47630 -21264 -145489 -204163 -99493 -83905
13016 -83905 -74733 -14021 -8680 -52235 -117316 -28602 -53565 -63533 -119053 -135816 -89573 22684
13004 22684 25035 -75415 -25430 42639 16175 25700 100376 109208 66505 108375 122405 66571
12992 66571 -53850 -83771 7109 63964 76135 6868 -61858 -107865 -89387 -65799 -49500
12981 -49500 -51591 -28443 -16051 -29985 31604 111709 171551 123124 53471 5416 753 -59589
12969 -59589 -110246 -109616 -128452 -140655 -162333 -184536 -175773 -116263 -47448 -48932 -11372 -29540
12957 -29540 -61675 84833 104432 -11778 -27654 2482 -4922 -85427 -137200 -137758 -153487 -65375
12945 -65375 6569 136758 170816 114856 84634 68464 1175 14927 52721 49104 18591 -11472
12933 -11472 -18265 -7333 3921 -35885 -41610 -109547 -78048 12904 42644 73108 45018 19167
12921 19167 131885 92817 -1948 16418 10032 22999 -12254 -42188 -29535 -52233 -123794 -107127
12909 -107127 -22815 39762 26235 -9366 23373 88237 12422 655 48326 20070 -6336
12898 -6336 -12694 -15092 -42644 -3023 41567 45753 51300 25382 19132 58432 58921 79168 39459
12885 39459 775 91529 93183 110159 125102 118688 111587 66148 7330 84844 136111 97714
12873 97714 116036 107348 90404 21207 -56198 -78417 -95811 -23492 64000 17845 33758 29085
12861 29085 -62943 -180336 -159233 -165794 -139810 -127640 -181105 -117765 -56890 -48181 1719 -12999
12849 -12999 -35493 -57582 -64000 -83557 -38986 -30713 -27045 -91631 -113922 -39100 80714 55314
12837 55314 572 -59273 -139516 -242848 -172431 -161030 -206395 -210231 -159666 -147434 -69941 -105338
12825 -105338 -4560 36595 26239 5623 -34981 -49960 -19153 -72099 -498 -3943 22476
12814 22476 26012 -35796 -94375 -66705 -4333 66760 115891 71816 -42953 -54733 -47608 32235
12802 32235 54159 18494 -2062 -42804 76703 26643 -50574 12123 110478 126224 148825
12791 148825 96311 25953 -22801 1223 -27621 -77458 -84986 -143690 -83663 1815 20615 61415
12779 61415 64541 55956 -3123 14866 43002 76573 25011 -69558 -97149 -143270 -104812 -27124
12767 -27124 31181 -21846 10731 53101 49940 18810 -43315 -98725 -139532 -149947 -125719 -10625
12755 -10625 13722 -7394 -11502 -28471 -64827 -52620 -105504 -38130 -42568 -106525 -36126 8545
12743 8545 -76091 -35188 5891 -72910 -77934 60225 190921 148882 113951 130256 58686 -21013
12731 -21013 -23475 -6058 4372 25594 24076 35570 51940 29183 20963 24489 -6394 -53126
12719 -53126 -64923 -19570 -22736 -132166 -220392 -177598 -83945 -82688 -157916 -83427 -34414 -9800
12707 -9800 156937 209445 26669 18548 1089 -5194 1475 18988 35009 24760 51347 15566
12695 15566 37819 4806 -34591 -36409 -20335 42302 -76053 -134594 -96401 -42216 -54540 -16916
12683 -16916 -18464 -136555 -210921 -261049 -230415 -206614 -196521 -140898 -12061 -754 -21934
12672 -21934 -25820 -161269 -180322 -108483 -97388 -128761 -134981 -48555 -47160 -32755 -20062 -25
12660 -25 9439 132886 149328 106535 15595 -27775 -38594 -41330 18645 7860 72250 73583 28434
12647 28434 -8218 -67897 -88327 -130212 3820 73550 70927 31885 82370 83959 44038 76160
12635 76160 85335 15463 -15438 17149 66052 67356 -6326 -32944 -52324 -107723 -65540 -36242
12623 -36242 -20050 -72176 -92732 -53667 -39905 -27406 -31619 -81100 29902 95170 60930 106810
12611 106810 133129 143515 203104 215339 160661 87032 117940 106319 43636 15071 -104212
12600 -104212 -159783 -125639 -124608 -48985 -2642 -37458 -121396 -182640 -163172 -132265 -6184
12589 -6184 21136 10638 21983 -49228 -50711 -15356 -64632 -37320 9318 -27916 -100425 -104650
12577 -104650 -104890 -181538 -237466 -184982 -151905 -90632 -77112 -35327 -21540 -69429 -11442 15480
12565 15480 -20431 21683 23482 -7875 1743 -11595 -20027 73513 -33515 -172612 -112979 -153263
12553 -153263 -195213 -154110 -103677 -73353 -41935 -14982 16133 -33135 -81086 -61349 -27652
12542 -27652 -16582 -33291 15121 47883 -46112 -44103 -7090 -32262 -57095 -22875 9373 89463
12530 89463 138899 168152 85841 49195 22000 6376 61766 126330 118375 61074 72099 48648
12518 48648 48450 20483 -65590 -113325 -159794 -178076 -117716 -96204 -119033 -118905 -15435 2219
12506 2219 63792 121838 103860 119905 111494 56918 -53762 -23550 40824 82757 29689 -29181
12494 -29181 -18836 80651 105026 86355 62497 84830 97004 24717 -15828 1275 -3774 19520
12482 19520 -51265 -179031 -125444 -98128 -145050 -170296 -121687 -42796 -18132 35584 46566
12471 46566 -54830 -78461 -68265 -93482 -149317 -88622 -13867 38679 131563 146971 121061
12460 121061 67820 -3594 -48760 15494 73737 80252 76169 25718 -25771 -100837 -210255 -215280
12448 -215280 -183013 -175517 -195132 -101089 -40402 21468 99052 74094 33413 -18097 -62015 -6431
12436 -6431 123237 142711 142909 136026 83124 33813 8398 -81517 -98829 -76837 -75091 -77064 -70526
12423 -70526 -50883 -31001 13709 -7263 -45308 -73528 -130289 -125703 -74023 -55314 85780 34796
12411 34796 25824 32762 -34596 -102077 -86620 80523 79671 10529 -28841 -15970 14931 -70932
12399 -70932 -70837 -43765 -95937 -522 43752 47676 -20552 52731 67663 3665 -33209 -7645
12387 -7645 -31808 -62450 -104439 -29003 32702 83631 153755 128431 126854 88304 125690 170723
12375 170723 62410 -39756 -53321 14780 146400 166855 99149 41305 -4255 -10942 47766
12364 47766 54663 84728 35648 -58251 -81367 12014 89526 43334 -4663 27742 58566 111966
12352 111966 53800 -26368 -36997 -43169 52666 65464 22914 -11844 -11955 -921 43027 55524
12340 55524 47199 -32660 -40461 45286 86034 109191 118063 56362 -60259 -61280 -26910 -4032
12328 -4032 127842 250304 153249 53078 88938 159493 206880 94176 54238 22210 6902
12317 6902 -50369 -16863 -12080 30186 39308 -3698 18067 -17734 -30886 -93200 -152137 -72387
12305 -72387 70867 112926 88088 -7600 -18794 -176 55369 40013 -20318 -67558 -137582
12294 -137582 -88515 -44967 -19397 -62138 -67852 -90476 -13796 30343 7411 -8840 55228 136501
12282 136501 106833 48943 462 -145185 -84070 -126921 -184191 -185542 -199594 -186708 -73905
12271 -73905 -46481 -59513 -40200 40472 68730 50611 -56901 -97478 -111475 -90014 -52625
12260 -52625 -21982 -77698 -140731 -124623 -40066 51666 50647 72247 115402 70044 89292 70217
12248 70217 -30433 -74101 -85069 -117959 -119219 -65962 41922 127238 118860 7392 -38619
12237 -38619 16911 -21292 -78803 -115158 -85297 -13681 30119 69499 9615 -23262 3841 44846
12225 44846 31687 -83124 -115628 -54509 46584 142903 85759 11272 -64719 44188 56184
12214 56184 38578 40142 -19193 -101397 -57784 -57502 -24689 10816 121505 182940 190512 109371
12202 109371 64341 12962 -29709 -6750 28102 73593 42173 -29605 -96038 -69824 -15038
12191 -15038 5659 39941 105773 37190 -27820 -33421 -25693 -100133 -134162 -99346 -61078 -32796
12179 -32796 -54389 -33576 23658 73978 95300 14244 16725 -11044 -9364 -63150 -136491 -107664
12167 -107664 -73668 -33245 28510 1210 -17955 24175 21288 56145 59491 35756 22660 -18770
12155 -18770 -63621 -103293 -17251 -32520 -90883 -67752 -149437 -125448 -89318 -78718 -36701 27331
12143 27331 -12240 -931 -31722 29792 58381 39010 -69738 -122948 -69753 -64070 -78316 -4483
12131 -4483 -67633 -105048 -62137 -33505 3240 151333 185170 257409 216888 133738 96860 44829
12119 44829 54746 52107 9866 -57127 -57190 -19666 -59036 25680 -721 -58831 -58026 -48730 42027
12106 42027 61270 13127 26727 15724 -7842 -34354 -90156 -42627 -12083 -80593 -183103
12095 -183103 -134412 -73823 -3098 30425 -24429 9725 26642 -111758 -187922 -195743 -175812
12084 -175812 -148285 -73266 -36833 -82006 -108260 -47071 -46525 -58311 -69722 -103640 -135409 -114094
12072 -114094 -32511 46340 10315 -28007 16344 24067 -7381 24755 24097 -22916 -16694 -4566
12060 -4566 -28169 -13522 -73661 -83355 -32891 -20792 -33317 18156 8496 -22729 -122999 -81774
12048 -81774 20415 95929 47874 21501 14614 -1796 39383 -31626 -26795 -11349 -62168 -116104
12036 -116104 -121210 -151695 -114894 -31213 -54278 -70337 -100777 -74050 -39479 -36786 -42140 -59241
12024 -59241 -76094 -60739 -1765 99927 19844 -12373 -100487 -88827 9812 16919 14252 82917
12012 82917 82416 26070 -78963 -116562 -67292 -13081 -33966 -69069 -62222 -54845 -42174 -76493
12000 -76493 -117610 -131924 -77835 -84925 -145013 -124013 -57146 -25403 46790 16279 -81929 -25820
11988 -25820 -11514 -11670 -68204 -91744 -112820 -113601 -32248 98066 160971 185781 67560 51494
11976 51494 -6167 -72570 -86434 -64834 -13666 -65821 -25457 47394 74543 106069 110484 79680
11964 79680 4926 -55252 -75475 -113450 -180314 -105864 19544 53282 -4451 -84059 -110833
11953 -110833 -69299 23193 114332 135919 83963 52785 12109 -80294 -96990 -88910 -53980 15863
11941 15863 33192 -80383 -98881 -86900 25771 104896 88457 9039 37791 7785 -57561
11930 -57561 -45885 -32342 -104400 -152960 -90448 72613 142700 119557 119033 79856 -34555 -110486
11918 -110486 -99141 -75453 -53632 -80644 -101424 -107647 -88425 -107672 -121932 -159958 -144086 -110789
11906 -110789 -64624 704 -73268 -108800 -139100 -137673 -159408 -175703 -196057 -204300 -110844 -113108
11894 -113108 -95344 -44170 -36890 -16392 30695 41117 1775 8162 125196 47933 -35207 -40629
11882 -40629 -39282 -16863 -55941 -55260 -90274 -71717 34786 68800 19541 -63389 -4417 -8006
11870 -8006 -5859 16732 60338 7318 88889 95998 102424 150003 105529 2749 19939 21955
11858 21955 6628 62046 62421 8939 -69170 -112547 -196275 -188102 -75634 70634 161103 213033
11846 213033 145407 28778 -63220 -60288 -19244 31603 -445 -88698 -87181 -119178 -97691 -25666
11834 -25666 90344 122312 127193 15205 15844 76062 78107 64847 50048 33008 24278 -4355
11822 -4355 7922 17505 -2038 -60156 -45935 54663 22440 -55472 -141276 -138667 -9983 -29266
11810 -29266 -136758 -137945 -94262 -9573 35267 84462 132282 25379 -106156 -133762 -77785
11799 -77785 37078 -22690 15790 37152 90609 33792 -5572 -12079 33759 86486 112300 96539
11787 96539 50083 -44079 -94185 -98076 -141951 -46555 657 -30963 -63398 -85480 -65973 3145
11775 3145 -29658 -13959 17133 2985 -59180 -138549 -116740 -94482 -43647 -99537 -167956 -151630
11763 -151630 -82919 -99001 -107883 -71249 -126470 -91516 -34267 46573 98532 -47277 -146899
11752 -146899 -134476 -75406 -97451 -173073 -127120 3126 -21611 -29879 33991 58295 82718
11741 82718 85064 14908 -9721 2356 33417 -64197 -112997 -100813 16396 83160 49297 -32080
11729 -32080 -50449 -108320 -123580 2038 37321 -20321 -54801 -34695 -66918 -34547 817
11718 817 33555 -12887 25363 2307 35598 60017 45473 -58517 -2062 22968 67882 33910
11706 33910 36354 89287 179742 150956 66539 -85604 -103267 -15367 24399 82366 97886 53585
11694 53585 -6007 -87613 -83718 -55270 -15839 8754 -73975 -69217 -8958 37803 96051 67369
11682 67369 86186 59976 9572 -3907 -30177 -10900 27500 81461 62049 44201 13098 -57278
11670 -57278 -85946 -55950 -88264 -105985 -91584 -65205 -65728 -56700 -22777 -28221 -87796 3397
11658 3397 7866 -42927 -29884 49539 -5860 16456 -10473 639 35521 88182 95591 -1648
11646 -1648 -4735 430 -35513 -85794 -95080 3461 28979 10556 -72201 -94297 -46843 -27506
11634 -27506 -72085 -90653 -32722 -98123 -133861 -164361 -177965 -111629 -128027 -78072 -33537 22432
11622 22432 -34388 -121218 -75958 16242 10146 27074 54999 48683 109250 89803 72172 73165
11610 73165 47980 17725 -57208 -107491 -8241 91345 101414 28010 -42096 -5699 25822 23420
11598 23420 89051 160475 70486 -6365 -65215 -53874 -22774 -47053 -82252 -42960 24327 -25798
11586 -25798 -142140 -173478 -107877 -65494 -56788 -99662 -43649 25241 -19240 -70685 -9877 -43209
11574 -43209 -53597 11467 16562 -19972 -8064 -4269 -10842 -99565 -154902 -139718 -90436 -25394
11562 -25394 21812 -16095 -21529 -20752 7612 -32242 -19365 8639 -74857 -2129 55917 -78366
11550 -78366 -152506 -91130 72413 92715 73135 -17617 20778 52989 54062 32398 5430 74383
11538 74383 53780 -31780 -19675 14689 -1213 15497 53894 20280 -20273 -97666 -28909 -17090
11526 -17090 -74704 -128027 -72860 -43625 -71253 -79916 -65030 49191 42270 -99281 -145811 -58753
11514 -58753 -46106 -37933 -48665 -82864 -95700 -115188 -109285 -63765 -16816 -63887 -118541 -64098
11502 -64098 909 -2212 -155 -6016 1681 19202 -38588 -30077 -4674 -58445 -33954 59444 111126
11489 111126 83503 68891 126456 59081 -32660 -29829 -29845 -11819 66955 102908 96259 165656
11477 165656 62540 -90395 -87851 -79980 -88529 -99612 -27311 63174 93909 21720 -31839 -60013
11465 -60013 -24398 -56136 -86522 -77163 24553 15991 -40195 -6961 472 46919 22886 70631
11453 70631 130324 216806 187149 54825 -7609 10174 -13296 -26829 1098 50205 152611
11442 152611 209757 247798 159850 131175 91061 39377 32812 70949 -28677 -20894 -39201 -87506
11430 -87506 -46672 61387 95129 113273 59341 44844 -30957 -118562 -109852 -92086 -36778 -102878
11418 -102878 -155105 -50682 -36125 20970 67112 129425 154933 69625 63377 8314 -46413
11407 -46413 47687 24516 14748 48527 95057 26425 -4941 81750 144139 184584 180798 52079
11395 52079 -76346 -33437 33006 45331 33365 19369 21855 47696 56345 79450 54191 49969
11383 49969 35835 9115 96199 114426 -55996 -83752 -45120 -74301 -76879 -89178 -33303 -21675
11371 -21675 42085 77070 6277 16079 38657 50058 149478 226256 104833 27497 38929 105167
11359 105167 45678 -27250 22580 94750 120371 70705 32425 34103 -8522 -6218 300 -3074
11347 -3074 52490 57774 13454 46307 78639 52340 65070 43931 91364 172151 148107 115088
11335 115088 100060 120678 97745 74371 50012 -3977 84647 19095 -65256 -68817 -59438 -27728
11323 -27728 15026 95691 56687 10799 -884 -50514 -9998 32889 52345 66421 45728 16075
11311 16075 -38976 -31037 -55843 -55801 66609 93248 79383 99746 27884 32304 115573 209936
11299 209936 210932 99772 934 -37417 26278 31643 62721 95281 10699 12695 3437 -48411
11287 -48411 -86351 -23734 7122 -67848 -120252 -85030 -95612 -135430 -122079 -49419 -61739 -72938
11275 -72938 -41677 -38164 -21690 19388 42728 16054 33198 60217 71935 13018 49205 33765
11263 33765 10467 86319 10881 12532 23146 69463 42901 -2401 -63312 -96579 -82038 -97289
11251 -97289 -109772 -115100 -55347 43047 35769 -13566 -2547 3734 -16829 -2520 59194 69335
11239 69335 113728 148839 107723 42852 50084 49275 -16456 -34406 -92687 -87226 -46361 -30926
11227 -30926 -96076 -105404 -95426 -26186 45907 66603 -48893 -72014 -46369 -69202 -55168 -21013
11215 -21013 -7951 -86753 -121771 -123122 -151006 -86152 -35875 12206 38057 45357 -480 23487
11203 23487 -69415 -135377 -61329 -36168 19362 35625 30004 -30419 -12066 93869 102380 71560
11191 71560 47062 -51476 -93354 -90104 -59163 -108155 -96792 -99607 -56635 -9461 2910 -46749
11179 -46749 -32245 -12569 -12502 -47749 -8122 51026 -46312 -46510 54063 74572 33404 10680
11167 10680 35928 8000 -99195 -1519 18682 -12600 -21337 20766 65785 170577 155243
11156 155243 55520 34685 -37262 -69281 -86699 -64781 32199 50220 87336 60046 26148
11145 26148 -65702 -113699 -66285 -14969 -29913 -39276 -54780 -55843 -54411 -58874 29105 55638
11133 55638 57265 111657 79798 81913 63089 4361 46509 166424 223124 155786 116974 88013
11121 88013 102383 89446 89019 87713 36804 33353 -14616 -15062 -64822 -72063 -96093 -86463 46969
11108 46969 76157 22412 -71128 -112609 -106696 -1506 54774 8221 -60022 -119370 -172921 -89375
11096 -89375 -64431 -103401 -117431 -123063 -80255 -69959 -46382 -6705 -112605 -110495 -71834 -61648
11084 -61648 -34558 6403 36357 56937 -4081 -105642 -135598 -93143 -4459 48832 -8668
11073 -8668 -45402 -25765 20371 3884 -2229 -50635 -81412 -47248 40831 99113 61054 -2059
11061 -2059 14620 4569 -60279 -93156 -61780 -8415 -20154 -26383 -12652 61140 77995 13468
11049 13468 -8820 -35207 -20396 -9414 7714 254 5715 -8472 -112985 -125873 -59441 -6670
11037 -6670 -48951 -62327 23320 21849 -34994 -28589 -85809 -59856 -75358 -84564 -88926 -82363 -84069
11024 -84069 -23075 -31452 -71210 -55695 -22249 -47731 -193712 -215886 -95519 -10473 3839
11013 3839 62786 40678 -122518 -134887 -128676 -74890 -16959 -88023 -112757 -35367 18149 104108
11001 104108 143858 157122 158498 99072 75072 43919 -21430 26226 40106 8683 -84853 -85715
10989 -85715 -194695 -213664 -195324 -202262 -109726 -2305 32586 -51039 -6068 29311 -30664
10978 -30664 46045 45356 -6513 15058 30435 -25465 -21350 -86964 -90286 -32726 -102464 -100029 -29076
10965 -29076 68552 72660 49998 99872 26380 -2565 -7579 -7970 -7485 51519 56475 60125 -36385
10952 -36385 -96269 -124863 -95257 -99162 -83723 -38241 -75924 -103707 -127474 -78777 -66067 -60735
10940 -60735 -127287 -127270 -72683 -52445 -54656 -90351 -94201 -42656 -33580 19035 -43629 -94278 -107716
10927 -107716 -87292 -22428 47108 -38265 -96802 -86416 -106097 -111094 -49372 -41803 46207 122076
10915 122076 189384 142201 41133 -8530 -96656 -174793 -160520 -167214 -222977 -148561 -106771
10904 -106771 -127767 -125122 -147797 -107119 -32203 23155 -9863 -58874 -147552 -141473 -90758 -18439
10892 -18439 29254 79049 99842 6741 -99044 -133970 -135754 -105980 -15731 89728 78808
10881 78808 46781 -10076 -92417 -82621 38673 92642 71223 -20630 -44737 -139463 -86828 1585
10869 1585 -3728 -13998 -70931 -87791 -130037 -73958 -19844 -92992 -79941 -137944 -139563 -125352
10857 -125352 -134621 -84046 -17923 -9322 33477 66536 84967 50454 25892 -40328 -49653 -88597
10845 -88597 -121960 -101219 -75515 -112274 -133759 -99416 -31533 -23729 -21330 -37383 -61082 -51124
10833 -51124 17202 -56769 -86641 -79841 -120148 -93514 -37261 -68271 -114789 -79583 -6053 -15698
10821 -15698 16525 -7884 -40573 -35704 -7243 -2495 23055 63044 36653 31498 -3366 -17839
10809 -17839 -73873 -116061 -104815 -111251 -62434 -56711 -2119 -2334 -13895 40449 20501 -19470
10797 -19470 -92327 -153421 -214851 -221297 -46870 27961 2850 50723 83196 94174 -11242
10786 -11242 -20480 37836 33685 77183 74780 -82976 -101704 -80541 -51966 -33444 -79475 -106571
10774 -106571 -57880 61010 110737 113737 131264 95792 69389 33929 104297 137736 137197 -9715
10762 -9715 -71366 -64703 -37981 2461 10126 30638 18744 -36056 -79100 -77615 -26671 -21691 -30718
10749 -30718 -102749 -152469 -136757 -85078 -76113 -67023 -79563 -69715 34358 72917 -11321 -61367
10737 -61367 -42587 37497 -1093 -69245 -24040 4965 91282 114583 68570 67947 58886 94711
10725 94711 73950 31116 5651 35743 139800 155385 152108 155473 63977 -82646 -105486 -140423
10713 -140423 -116278 -54255 -41233 -42407 -36036 -77289 -52030 -3516 13816 -27367 -91197 -65125
10701 -65125 -57668 -25109 18575 -27695 -59663 5907 58404 28783 57424 76823 56907 57828
10689 57828 16168 -51060 13387 65470 75094 1901 -102901 -125876 -125260 -218214 -248710 -172364
10677 -172364 -131139 -78025 -89256 -16095 26614 56407 88533 62424 -64175 -65767 -12559
10666 -12559 29027 22808 9413 -37876 -82076 -147737 -85112 -77840 -90257 -100379 -117883 -98784
10654 -98784 -92764 -95663 -101880 -103086 -95074 -68463 -73489 -58919 -8763 46118 33917 -44937 -31456
10641 -31456 -96111 -99642 -135565 -152140 -115332 -70894 -63311 -98292 -61789 -32930 -54901 -113369
10629 -113369 -46945 33113 3862 -57301 -109921 -113279 -158026 -143704 -94000 -161162 -131153 -44214
10617 -44214 -71986 -68074 34243 82225 129839 125172 190927 118853 59741 6629 -27374 -17140
10605 -17140 -26328 -61328 -53592 -36863 -261 -39203 -118071 -22372 12067 -17446 -22105 -39042
10593 -39042 12383 -39042 -85085 -69330 -10987 -16336 457 35870 77045 111860 91938 33732
10581 33732 36862 56492 59077 42870 47687 52077 -28301 -12920 -4117 -39212 -42521 -14646 26231
10568 26231 10443 19348 121818 50186 -10289 -58702 -58912 54808 47936 107653 64804 -56266
10556 -56266 -92511 -91430 -64978 4101 53791 476 -36232 -88527 -239122 -260911 -173751 -142141
10544 -142141 -42624 -29021 -21962 -22277 7091 -36199 -62699 -31063 -23590 -81437 -80645 -99235 -87500
10531 -87500 -52069 -35012 -89149 -124490 -134454 -67454 -36326 -16783 -17858 -53853 -70322 -74363
10519 -74363 -69104 12706 56918 26281 38712 36580 17287 -9630 15477 23897 10218 -1459
10507 -1459 -14303 -70781 5526 55022 56209 84982 79422 81067 27590 -51748 -85575 -68770
10495 -68770 -111921 -43707 -16879 -37844 40422 -10001 -890 29754 1248 -57456 54664 65136
10483 65136 -55954 -65957 -133426 -137040 -186497 -156910 -13122 18497 -48031 -43357 38854 27715
10471 27715 -8459 -110394 -200386 -141417 -92972 -86461 -163698 -155015 -109888 -70589 15862 150557
10459 150557 79413 -57358 -87578 -81151 -26862 38719 6064 -44480 -73222 -173383 -193331
10448 -193331 -102569 -23640 -15186 115640 178095 120020 -16486 -27291 102453 100134 28702
10437 28702 29849 1336 -68278 25799 69681 107776 169836 67204 -70785 -67578 49 5940
10425 5940 64948 122689 120719 68840 -31934 -68472 -87043 -80627 -24105 -23058 -51215 32202
10413 32202 158489 131413 19216 42528 104623 108330 52396 76236 83970 -9307 2458 90567
10401 90567 96960 95782 31082 39186 103463 -19025 30012 80267 89774 119577 79702 85014
10389 85014 28601 52713 120508 188709 112616 9576 21752 -12703 -18098 -66132 -88477 -17256
10377 -17256 46180 39378 25230 -13761 -90918 -144537 -102978 -71461 -38722 21318 21408 1861
10365 1861 -14581 -23562 -65167 -37168 8482 -52687 -9909 -59862 -89354 42827 92102 61079
10353 61079 -44261 -97104 -37665 -35822 -82723 -96199 -39745 20546 25898 -7664 -10035 -37818
10341 -37818 -129013 -134323 -136890 -96921 -48466 -102524 -91876 -56976 -35610 42482 87486 37619
10329 37619 -82454 -32459 -23135 46340 42799 61763 70076 80282 -1167 -86007 -12880 -55928
10317 -55928 -75888 -101105 -114862 1031 107626 152163 66040 -125709 -126158 -153866 -183561
10306 -183561 -258260 -208544 -101461 -79952 -1291 22621 3494 -67618 -142160 -137948 -76158
10295 -76158 -6714 -40283 -115410 -95687 -61882 -78088 -134650 -62399 2542 -56279 -101623 -56215
10283 -56215 -53481 -9352 49954 41407 61295 103593 9466 -75807 -16252 56418 111929 97975
10271 97975 43619 83281 49608 42878 155 24305 18667 -21418 -57092 -19572 77195 59812
10259 59812 74111 111046 121064 145369 183053 164784 58330 36345 15427 -41489 -87472
10248 -87472 -33904 -128211 -206516 -174351 2263 124045 90255 51480 37260 -11940 52279
10237 52279 -6073 5261 -10133 -65604 -41810 47609 49451 40076 53851 51666 78076 82064
10225 82064 28470 -17560 19422 74408 91016 13694 50644 69222 49098 30164 2239 -10814
10213 -10814 46029 20889 -52787 -127346 -18023 99028 70525 114583 125736 86491 65742
10202 65742 61565 18766 -26212 41693 19583 -55780 -47435 -26299 -42462 -92917 -99105 -123726
10190 -123726 -125577 -104493 -34632 16766 -2747 -31189 16818 129849 221128 273731 218375
10179 218375 186918 65276 26185 25763 3442 19694 27767 -23959 -69852 -10801 32150 77755
10167 77755 82217 -5192 -73578 -100593 -25622 -1264 23291 31274 140305 139419 106978 75277
10155 75277 7046 -13952 20084 -26095 -123197 -173384 -119988 -10053 20153 17760 26960 23349
10143 23349 -4714 43014 44846 40585 40184 1747 -10673 38789 72690 5912 -12170 32312
10131 32312 109144 149034 204205 214316 69511 72953 114284 95463 154620 81666 45754 32079
10119 32079 76864 64764 31374 83946 123505 92670 33514 89180 180533 142446 149383 93318
10107 93318 108778 122069 10753 38312 34010 25840 19036 25433 50546 71209 106968 120757
10095 120757 69331 27528 -11799 -27870 -75601 614 38925 27253 -46162 35392 95097
10084 95097 39054 -14008 -38426 -72430 -19159 41705 134761 239965 187559 68084 -29047
10073 -29047 33287 104119 56924 -715 -86473 -98751 -68980 -30181 -55476 -99465 -151595 -78426
10061 -78426 -22256 -9110 -44662 -18066 36158 26689 -36406 -95287 -139571 -55164 31679 63386
10049 63386 22006 7728 69634 42980 -35467 -73584 -144300 -132310 -76804 -13427 -33837 -95103
10037 -95103 -55815 -26746 -20005 13727 -48137 -67832 -63177 -135945 -52169 64723 49277 -61380
10025 -61380 -153405 -109856 -100808 -164757 -158208 -154019 -122730 -1753 48584 28815 16029 -15118
10013 -15118 22858 41385 48450 62271 34836 -45219 -60233 1295 3875 3736 -39407 -71136
10001 -71136 35453 114542 106944 -2532 -58332 -27277 -11585 -11629 37922 -62631 -87774 -14655
9989 -14655 26074 -90789 -145071 -171725 -149633 -144701 -66159 -51068 30578 107487 72015 55707
9977 55707 23848 59710 6791 -45905 -90037 -89836 -70212 -80258 -101093 -38374 113858 219144
9965 219144 238110 192540 92481 70431 29265 35715 -4219 34328 -5713 -131692 -121463
9954 -121463 13972 118627 68198 -5762 26173 8465 -125116 -174145 -56957 -7867 22515
9943 22515 -21728 -45278 13820 -33171 -101870 -103763 -73196 -67604 -6112 35241 -10508 42538
9931 42538 111885 229417 199015 250135 166799 64010 2577 -6883 78995 86597 95485 112491
9919 112491 83637 -27815 -39046 -99198 -118711 -50250 -20598 -75844 -38301 19224 46045
9908 46045 21276 -109406 -150223 -229420 -203319 -50549 -19825 -109972 -36454 1069 -26693
9897 -26693 -11198 21147 -2876 14449 -3103 -59029 -58654 -55073 -109602 -127727 -164351 -145132
9885 -145132 -62365 -145787 -99178 11628 41191 90967 119369 165824 156470 165374 195259 237992
9873 237992 209857 171088 106124 52669 106270 181297 199373 157261 157656 156182 142772 170295
9861 170295 88638 104921 186900 267399 180536 105669 71259 104725 98812 103072 99827 46710
9849 46710 46310 121445 58035 6101 22765 60354 81882 52183 102263 145498 64895 27013
9837 27013 23923 42167 31416 -1923 9367 76379 26429 -38736 309 10526 -28978 -1824
9825 -1824 23284 23931 25216 35574 70821 -30327 -34743 -37223 10609 78043 -53921 -70478 80917
9812 80917 133550 46944 74348 96024 98731 161234 138976 107482 64744 -10975 -5123 -310
9800 -310 -8433 63270 146443 140424 98464 36620 -30213 -37096 34068 50854 -3212 13706 52919
9787 52919 -7159 -24520 54486 53767 113346 169878 74801 -9741 3690 3965 14226 -34120 -141363
9774 -141363 -108183 -77790 -100863 -99803 -62062 -22628 14547 -288 56562 121589 141732 87535
9762 87535 78462 64663 113580 124881 102938 53721 -19376 15225 -16681 -16345 3114 -16804
9750 -16804 48353 41168 -14304 -14304 -14221 63416 120320 132179 162738 123568 152222 125724 34228
9737 34228 33062 31186 -14754 7557 -484 45116 20947 -13599 -29065 -10738 58140 158009
9725 158009 168317 121707 83375 108452 193065 211537 209669 182043 196707 79922 -68265
9714 -68265 -82520 -26312 -11648 46087 39078 -277 21201 -15830 3757 -113615 -124070 -32311
9702 -32311 21522 -23591 -20388 48874 89437 124962 109094 115544 94814 27086 -29232 -130714
9690 -130714 -64442 108734 81347 68772 115225 159447 118150 131479 182109 150543 81344
9679 81344 53741 93458 53441 4666 51834 85049 89497 187445 241326 151719 181593 237707
9667 237707 236377 263448 301448 264801 165848 232794 354881 366578 314949 239285 161205 155824
9655 155824 168733 237908 206018 224577 220037 197039 174971 192356 237875 262197 300737 378787
9643 378787 282848 231570 275744 286435 339006 364985 269948 227345 300303 354833 417399 534829
9631 534829 607119 594515 505595 493504 527841 515534 570049 662196 653676 726222 813535 846128
9619 846128 900320 985154 1114780 1144116 1257811 1405858 1470472 1543983 1669699 1772098 1849535
9608 1849535 1952439 2195529 2384776 2633042 2951960 3199806 3402467 3679106 4067340 4562271
9598 4562271 5118768 5749433 6431656 7241992 8132236 9221347 10386404 11620789 13018640
9589 13018640 14514256 16038786 17608894 18823436 19510314 19821030 19643654 19075575 18131603
9580 18131603 16880087 15612343 14339026 13191685 12188374 11212616 10322985 9435408 8739354
9571 8739354 8176278 7624254 7117738 6616656 6131086 5703171 5256577 4850308 4469722 4145578
9561 4145578 3815320 3587937 3397777 3096115 2884185 2641718 2401878 2216664 2111056 2042139
9551 2042139 1829096 1717849 1698615 1594840 1510652 1431692 1336591 1211648 1021132 974374
9541 974374 893393 879084 949057 940422 934848 859596 803713 731921 729849 711615 742149 682387
9529 682387 555626 430855 320235 289620 240871 221707 304499 377389 384927 340412 369264
9518 369264 457462 455283 468607 429376 378056 322075 324373 290853 297083 291673 248580 291110
9506 291110 304977 349434 315992 299661 287021 261385 224950 248726 197841 161757 107956 161751
9494 161751 246520 277329 301396 258871 226504 204336 230021 193757 184625 187174 245495 225271
9482 225271 243739 210654 240073 225347 181563 89096 53651 141397 193571 235004 203993 197145
9470 197145 172428 214808 224297 198126 204862 192198 137835 138867 164635 174241 147146 115736
9458 115736 119999 79208 79740 99302 151187 98313 152851 136639 101857 138041 116452 89012
9446 89012 176490 196669 139999 167042 136162 128256 109087 -756 15069 156720 138829 149514
9434 149514 162894 167656 200480 132885 120695 141747 156195 132203 152121 136365 93559 55974
9422 55974 57892 131734 95095 37223 -49332 23548 109463 117317 24133 3019 86881 162994
9410 162994 131081 98363 89880 142558 87693 111193 113509 49178 35774 50742 -1390 -17577
9398 -17577 14589 153103 166030 130347 126728 101290 40331 35938 22192 28017 -14644 43648
9386 43648 123795 66124 57694 15539 -23406 -34753 42162 43861 74156 59352 83 -9576
9374 -9576 -44322 -114953 -44047 85230 141542 2198 -49743 15420 77266 80164 68232 14063
9362 14063 -12242 -82297 -76929 -69018 -99553 -63980 -11693 -14786 -6683 -29663 -131066 -113538
9350 -113538 -108803 -104168 -90668 -116073 -126209 -117891 -76172 -130906 -130474 -113057 -17101 6718 -44630
9337 -44630 -24486 25396 -14501 37889 85697 74315 31233 29994 38709 80150 92002 3377
9325 3377 -30393 -55841 -31203 37864 82507 122435 52492 -5873 -32655 -55723 -123750 -203956
9313 -203956 -142428 -70136 -27559 50546 36656 30071 -18991 22881 -8346 26654 121299 139296
9301 139296 26721 -34178 -53137 37799 73609 90752 87936 101708 90227 34955 56266 45009
9289 45009 37531 9766 -24378 41040 71173 18783 51552 80906 104593 17504 -81657 -133133
9277 -133133 -108726 -61696 -16983 31509 56335 59722 61271 63031 130463 136331 136367 128690 115890
9264 115890 101694 69467 55551 46497 37780 -50837 -72735 -60695 25578 55802 -24833 -39426
9252 -39426 -139470 -169158 -138391 -61737 -56707 -71288 -115468 -153830 -42032 34101 51828 96590
9240 96590 111284 80513 -12260 -35360 -59964 -1649 -22542 -79358 34253 113162 194093 133834
9228 133834 5344 -20146 71787 105827 164326 55757 -43130 -31639 54650 71181 -5935
9217 -5935 -72254 -31275 -58614 -116438 -33777 42855 -16357 -82224 -38722 28844 51339 119483
9205 119483 114155 119450 157345 111775 68684 -5330 -72259 -128398 -130538 -28421 54344 73607
9193 73607 79199 53984 130847 141631 99889 -4151 -30277 -41919 -46602 -28401 -45294 -29789
9181 -29789 -24659 12310 -36739 -72035 -42118 -63364 -72151 -80715 -109967 -75688 -22985 -99720
9169 -99720 -120217 -64153 54256 85742 79061 78545 91139 53967 2434 -18086 58280 69565
9157 69565 68202 65082 22973 -6747 8479 13848 44766 64829 53950 -463 -80913 -38650
9145 -38650 -48874 -61773 -114859 -92571 -32951 34100 -9713 -47574 -32029 -26725 -20653 62237
9133 62237 78024 152125 175502 83040 102725 76013 61566 25472 -60146 -125757 -59072 64430
9121 64430 156514 112379 43051 -14686 -28464 -15893 28236 -37321 -70112 -61519 -45119 -8257
9109 -8257 9550 62236 79418 52871 22812 9845 -16010 -53822 -66966 12346 12064 57491
9097 57491 93408 50955 11415 15164 -19889 -24982 6626 41258 83484 86104 155732 167109
9085 167109 105556 20371 -61428 -23029 77025 31523 -9727 16098 5202 -79463 -56383
9074 -56383 -35300 -35684 28921 61265 16195 -41482 -71488 -55316 -80642 -46220 24288 -17673
9062 -17673 7931 43299 14538 29578 -4942 -32081 21255 50609 25528 -43463 2243 14315
9050 14315 -410 82598 136106 109058 123867 219103 176544 73859 -6096 -23123 -81944 -54662
9038 -54662 32067 29416 92369 67581 13579 -7767 -36088 -111268 -66463 -16957 16401 58439
9026 58439 45718 12877 -36485 14835 46345 78491 60626 4750 -15238 -28090 -40441 21315
9014 21315 43968 -33907 -36513 59706 65780 78671 72013 134295 206931 263356 233975 86022
9002 86022 75834 110821 78148 -85056 -40443 29842 -90314 -25157 -54056 -34497 131445
8991 131445 196826 106348 59527 114644 88278 32431 -6367 -2295 79272 168439 118506 63545
8979 63545 33016 25387 100568 121359 156246 65902 -52472 -162675 -70806 4039 4962 -14726
8967 -14726 -26978 -29406 -42452 -63374 -99466 -104781 -87091 12652 -8794 -44675 -33048 27024
8955 27024 54517 60142 80055 56466 -3093 57663 19681 -82965 -99883 -138822 -176793 -148025
8943 -148025 -132154 -69958 -110174 -184298 -196840 -94545 -37872 -57425 -86994 -76429 -120574
8932 -120574 -137751 -126108 -58076 8538 72265 57543 30415 16724 67852 95749 89904 41812
8920 41812 9876 76961 121787 55347 -41641 52913 94270 62473 35886 -69073 -43179 -30245
8908 -30245 -82435 -162792 -131549 -7934 28826 4205 25797 -30885 -77870 -100164 6721
8897 6721 64320 -52375 -164607 -129163 -166848 -98169 -35173 -81225 -161886 -112189 -97953 -23042
8885 -23042 282 -1803 18021 38063 22705 -11964 80020 127237 122745 73086 2803 19053
8873 19053 84550 107209 98329 72440 959 -36675 -33009 -119826 -112500 -104937 -89963 -50750 -135153
8860 -135153 -104711 -108415 -99978 -84835 -94696 -66051 -49679 -23629 -7262 -19757 79333 114275
8848 114275 65067 20608 2394 -46216 -90132 -136169 -157520 -50403 66937 56701 13944
8837 13944 -50202 -150891 -61875 -50055 -22148 77903 74032 -90008 -132916 -89952 -31292
8826 -31292 -24091 -68994 -12015 17148 -29807 -94320 -93348 -95796 -41143 -8803 -58079 -75448 -106389
8813 -106389 -96818 -103682 -86457 -87187 -54717 39452 130556 150489 93132 -25227 -74282 -103754
8801 -103754 -89022 -25099 -26648 7948 -39529 -61722 17593 95916 121945 -11836 -140863
8790 -140863 -173116 -91199 -19685 89320 215976 261635 246541 256987 137987 132225 237572
8779 237572 217582 69391 22693 -4207 -80175 -71467 -52762 -22693 -4922 -86324 -98021 15077
8767 15077 105389 108244 140618 87974 47194 31605 -614 -62645 -92774 -76093 -28498 55984
8755 55984 92036 75922 53022 84894 100633 79775 88197 113094 68337 73752 -1869 6868
8743 6868 62620 50469 10505 10976 44948 111846 206590 214629 158122 17093 -40996 -48041 36065
8730 36065 78872 48025 6706 -53610 -47458 -40834 -18672 77534 67914 29705 82604 63221
8718 63221 46587 65157 24426 72310 62023 -2715 59872 25833 687 -25608 32990 101319
8706 101319 149211 213426 131284 76039 41975 19295 14667 5928 7902 10437 32386 42182 -15327
8693 -15327 -33729 -48332 -27031 -19179 -7593 36159 39366 50995 142206 145934 127699 180533
8681 180533 237775 271542 262832 209466 153015 89299 66767 58859 55079 28463 52487 69841
8669 69841 114146 65802 108060 175897 150469 113786 37427 -8915 -43699 -24560 36017 2035
8657 2035 3476 14466 43539 122891 126677 80554 59708 91735 31929 35558 6250 9910 10375
8644 10375 51422 36270 43839 100753 186683 198405 123311 35297 80518 60740 148081 273359
8632 273359 217293 110836 168638 121244 134829 199431 240709 326863 304752 154532 76738
8621 76738 35530 52646 66565 18633 9634 32367 25354 50502 104022 121431 107216 24582
8609 24582 43182 80763 80125 38481 58887 135244 147407 179080 158458 96114 32436 13431
8597 13431 91695 129765 147081 95660 38264 78983 160691 240719 222345 190883 233036 242471
8585 242471 240710 246484 197410 273562 372551 429332 445440 471072 458735 440287 417389 432854
8573 432854 427533 405790 335555 282660 211174 126526 154485 150119 121965 177027 213085 142043
8561 142043 99804 101088 68810 106518 60551 14563 16539 81455 127190 150083 135668 139364
8549 139364 127064 87714 159859 188009 154455 135302 85920 70084 73849 70421 -11816 -75211
8537 -75211 -44238 -31866 819 14403 -9777 -8494 35646 73090 14931 -90342 -169535 -118938
8525 -118938 9731 -17760 -56479 -61948 -74813 -41575 -21625 -24586 -26034 -71709 -85512 -36943
8513 -36943 8773 25988 157724 218905 234945 173351 122436 5837 -20663 9985 19836 12803
8501 12803 21039 -11614 -34710 -21138 -22939 -17066 -3202 -7715 -11532 -21404 -82368 -76603 10090
8488 10090 76339 -37111 -106805 -31060 6461 3582 -1331 -74027 -90661 6152 52395 62164
8476 62164 63788 61913 124968 123187 63658 77710 40185 -59331 -65031 -5325 19467 48342 47754
8463 47754 74019 -5128 -38060 94894 73678 27239 47559 43844 17763 -59414 -55100 -53805
8451 -53805 -46043 73237 130999 130191 406 -28813 -66043 -78497 -114969 -125101 -86134 -70940
8439 -70940 -30482 56428 37528 -22485 -104403 -68682 -97129 -47961 -93597 -49312 50446 42604
8427 42604 35312 -4603 -22401 -372 29907 84006 44470 84237 68518 38319 87634 44438
8415 44438 -44231 -14266 -20627 -93484 -83456 -101831 -120268 13619 62672 71569 67447 -3671
8403 -3671 -57846 -25464 -9091 27440 10099 -45083 10374 37391 21841 72708 75033 -13591
8391 -13591 -26116 35551 77297 61392 26308 57309 160290 130459 100767 49146 31433 -40901
8379 -40901 200 16026 -84359 -88883 -58247 -2942 53899 67177 -31562 -181503 -151105 -115896
8367 -115896 -133045 -28304 19103 -10371 -3694 55043 96725 188791 120748 83685 79085 106825
8355 106825 99533 62322 107697 80738 35967 37007 89266 -6836 -10911 -6964 -18662 -12603 834
8342 834 -86149 -131623 -140842 -147396 -113641 -171276 -213835 -94587 -42794 -58735 -107339 -144984
8330 -144984 -99687 -139224 -60145 -1992 48001 10616 -36265 -41822 17419 38140 16990 -70029
8318 -70029 -107849 -49891 15588 60630 34010 19763 47131 29918 29710 20589 -8707 -7352 -10587
8305 -10587 -43392 -35581 -43796 -20861 7553 -37136 -35393 -42780 1275 -28434 -101166 -134652 -123126
8292 -123126 -107222 -52870 -26757 -29605 -663 -3620 65162 185898 151508 121315 87570 604
8280 604 -71528 -87038 -139219 -155152 -146385 -100012 -120245 -84175 -17832 24127 65820 112153
8268 112153 110084 32035 66600 109964 93899 18027 40799 29557 -6670 -4002 24285 97196
8256 97196 56766 62774 112651 50129 49145 134292 135307 54498 -43949 -55701 -14042 17842 -62949
8243 -62949 -124557 -140377 22157 80190 -11330 -19306 -53046 -71467 -75034 -78544 -64617 -107147
8231 -107147 -50472 37202 56213 6788 -64661 -19382 -25249 31993 66786 69721 94173 118817
8219 118817 16377 5414 81373 40214 29441 6485 13081 -71231 -69074 -8765 -30334 -58688
8207 -58688 -55275 -99509 -66175 962 -12335 -12095 45418 24919 -44719 25043 57826 57208 27528
8194 27528 -46796 -79020 -30250 -55382 -34541 -67036 -120004 -106633 -58291 -70949 -33082 33534
8182 33534 21610 12733 -36087 -107137 -79067 -98968 -91082 -62210 -51831 9554 59128 59514 154102
8169 154102 252923 206797 120697 66577 53679 99805 52755 14857 -4682 1856 -2622 33938
8157 33938 16626 20248 -17270 60373 69100 84262 64056 -52327 -60115 16058 3368 -30636
8145 -30636 -34417 -8861 36865 26685 -3321 42447 63385 91401 56914 13432 90191 144213
8133 144213 119849 57260 9562 61934 78844 19443 -1244 -61683 -78160 -11261 17147 -4616
8121 -4616 -506 14699 46112 26676 20550 -11322 19179 36784 2122 -51896 -4534 24163
8109 24163 -67489 -65456 -21132 49311 34464 -49386 -31749 40366 40487 138271 120100 13616
8097 13616 -6557 28546 104364 195412 180498 130493 145414 132440 68333 73726 124018 92593
8085 92593 28827 -5476 -5394 -1837 -47082 64748 66120 3984 -7819 -72057 -49624 -33673 -41282
8072 -41282 -32751 -53763 -20503 16415 -3123 901 33877 42136 -76976 -111415 -70062 -73490
8060 -73490 -134941 -37479 113506 85586 22605 19526 33631 74591 130936 126530 128778 189668
8048 189668 202354 195906 119867 111752 118960 43522 40204 84122 137108 72156 43770 -86124
8036 -86124 -94040 14526 125906 263792 253514 147817 113472 157141 152348 151808 169165 141299
8024 141299 132824 155801 187166 218584 104073 157452 191546 209909 213242 131931 82048 105489
8012 105489 198991 249758 215830 192613 227830 126196 75006 126960 134659 110301 93914 105578
8000 105578 111236 137453 99947 109884 149152 189193 170160 131056 120366 86549 84637 57386
7988 57386 139946 110277 56563 177 36485 82350 87147 116885 123745 99553 129534 104019
7976 104019 92445 -14115 21696 123047 153643 181163 173606 158524 35594 -28663 6347
7965 6347 24990 48735 13762 24703 23346 6938 -29434 -40901 6724 42798 45606 102893
7953 102893 111646 97364 96136 130709 180094 174072 81269 135581 140849 111923 61312 107079
7941 107079 95867 126227 66980 42885 -33166 -47024 44896 52232 103072 124861 44167 17336
7929 17336 51996 97749 70565 101000 37761 3470 45500 40256 -52788 -47908 57210 124358
7917 124358 75273 86677 93585 49816 76732 75696 32777 -27546 27307 42482 4357 -26259
7905 -26259 -40303 101353 130606 111967 192058 108275 -22054 46475 113899 137248 77186
7894 77186 -54613 -115566 -96886 -20860 -7257 68184 126404 186693 182461 128554 95442 91597
7882 91597 176917 127654 62025 55503 -5598 -65227 -144929 -98655 38984 99592 172347 227274
7870 227274 138002 123267 100334 44710 114319 73053 5162 -37229 21303 52920 -1823 -53581
7858 -53581 -52643 16347 72918 40976 -15014 17389 102624 15256 -77186 -56972 -77590 -100703
7846 -100703 -81980 -61803 6749 -40636 1181 53022 19302 -31569 -35730 -7663 119934 104151
7834 104151 136680 160553 101826 109579 116026 131029 -35466 -104254 -75383 -32586 -29282 58945
7822 58945 110499 16757 26457 34633 -21430 -89912 -108038 -67668 -4626 100694 95390 157578
7810 157578 69053 23711 4340 -70749 -57720 -64906 -90033 -99134 -118459 -64055 -43706 -37168
7798 -37168 -27958 -817 9043 82071 123056 85592 37233 -28879 -64049 -18649 60230 49258
7786 49258 -44211 -47146 -74146 -77504 -121855 -85623 -87477 -57840 -41680 -88637 -91414 -105273 -113185
7773 -113185 -141424 -73816 13393 -29233 -77047 -30986 30695 61978 70683 31992 -56119 -56983
7761 -56983 6975 18800 109719 72131 47054 20963 -22233 28107 -22810 -95521 -75964 -31661
7749 -31661 -63645 -52907 -22176 -34545 -66959 -50679 -85185 -36586 29627 -34161 -64405 -47595
7737 -47595 -16675 -17601 -22071 -122828 -133198 -75574 -28427 -21486 9557 48330 65720 117840
7725 117840 123828 23869 -37261 21870 42585 -3765 -42788 -53576 -74286 -106586 -128132 -120785
7713 -120785 -30590 -32348 -40750 -64178 -80695 -22302 -4037 -4305 -67028 -59042 -36730 39819 80462
7700 80462 112251 119360 12958 -29893 46018 7432 9482 -32192 -115278 -165511 -139679 -32667
7688 -32667 44948 42269 25864 -2622 41834 144751 131814 82007 25616 23715 53098 -4325
7676 -4325 -36980 -15539 -16917 111269 132619 45959 83247 66171 68700 103082 85597 107009
7664 107009 60186 -24808 -44282 56163 128658 59802 6919 -58556 -167705 -152471 -79820
7653 -79820 31497 55084 41574 -12421 -65358 -52418 -46551 -1630 934 -10068 -84419 -118282
7641 -118282 -78044 -62547 -42367 28598 -4604 -11841 -81626 -28578 -27131 -31851 -24370 -82308
7629 -82308 -126339 -60060 20820 66505 46658 69839 84912 73856 71524 -89719 -179303 -129221
7617 -129221 -138272 -88548 -28548 17617 -17982 -45303 -33187 -18223 -32102 -99799 -62660 -16533
7605 -16533 5148 -40065 -27955 15755 21071 12003 100102 226307 190558 145942 78623 53394
7593 53394 -16308 -31327 -76727 -100409 -115764 -49176 -26678 -74244 -16546 9371 -8008 -15932
7581 -15932 5878 44556 13620 -45758 -27573 3340 -21521 2768 64811 71799 67197 4204
7569 4204 65888 23002 21665 47780 104071 146010 89104 141906 152551 85567 6498 14392
7557 14392 76532 22708 -11708 33385 32994 -81961 -99487 -14656 20776 -26621 -156711 -192709
7545 -192709 -159787 -105932 -27639 -8238 -43370 -81227 -23198 26805 30577 43431 35547 65750
7533 65750 33363 64764 23039 -63565 -128630 -96924 -18490 46699 -14674 -31071 -38324 -48294
7521 -48294 -111826 -190826 -157389 -61378 28460 18336 76289 101436 82288 168710 204459 151511
7509 151511 84057 59852 60388 39309 -15428 21074 31098 -37858 -72008 -63660 -32321 -20890
7497 -20890 -62439 -28566 2268 34511 110299 154041 95815 -33776 -77982 16423 56617 74648
7485 74648 -3718 -91001 -91256 -117689 -44529 39010 -5723 -106944 -106825 -35566 15609 -1586
7473 -1586 -78469 -124248 -215380 -214858 -134270 -1850 8685 31063 87308 126386 35990 -6790
7461 -6790 -25640 -10101 -13644 77139 89046 60398 30708 21744 25569 74743 130948 156555 117049
7448 117049 53374 22550 1924 -5749 -11012 40920 54222 -69364 -113541 -33541 -13000 -663
7436 -663 -4528 -4482 20671 30086 44660 97218 60880 13187 -1164 77864 158812 121392 50654
7423 50654 67128 71229 34617 -36091 -37196 -53487 -50294 -16265 32694 -22267 -8765 20393
7411 20393 -40786 -68858 -63566 -82297 -41878 -13517 -47573 -40607 -29876 -49774 -114222 -111841
7399 -111841 -53646 -55339 -31231 -32156 -9190 -24792 15941 65632 41059 -58393 -19959 66760
7387 66760 128474 132200 15900 -40955 -61145 -21239 130923 162788 131295 70664 64593 10244
7375 10244 37298 86246 74732 -30190 -63157 -76862 -101963 21146 48561 -6689 -13793 -45033
7363 -45033 -99794 -97148 -70754 -37122 -103013 -92133 -54111 -24634 -105000 -122724 -65165 22239
7351 22239 21054 58262 57986 -39237 -37941 -53791 -108093 -66076 -44675 -30052 16688 -13451 2845
7338 2845 -44978 -21570 -62972 -76189 -91041 -22380 -98240 -186498 -180531 -115959 -48871 18122
7326 18122 -6220 -59932 -22405 -36499 -43300 -28317 63728 67780 49426 254 -84024 -134721
7314 -134721 -135686 -82905 -56528 -105588 -78310 -91975 -113007 -85809 -78067 17575 42072 45245
7302 45245 -12242 -25211 -10099 -54486 -23582 -56598 7408 59690 58635 41846 66837 89357
7290 89357 106459 102959 75780 65240 30112 -29620 -53262 -55124 -16042 -53747 -96940 -36542
7278 -36542 30066 -17879 -18675 28955 144536 114926 98934 20188 -65405 -117782 -112180 -6697
7266 -6697 -7905 -39315 -62242 -31023 -29768 -47087 34328 3436 -51829 -127307 -73107 23876
7254 23876 -34394 -152260 -229772 -275854 -147866 -51367 -102109 -148382 -62080 -59490 -46158 -27068
7242 -27068 96517 91808 970 -24597 -79426 -96054 -71429 -43684 22564 1887 -28405 -94371
7230 -94371 -100132 -35173 -99060 -104342 -62492 -43838 -72785 -43284 -29516 -31341 52780 122160
7218 122160 85285 29333 -85522 -30531 39629 -1359 -65627 -64258 -33350 84522 146735
7207 146735 35126 1909 68761 123258 106902 14472 17824 -51699 -66197 -129826 -174887 -121425
7195 -121425 -157659 -203879 -172028 -114890 -96359 -52006 -42773 -11987 21033 41192 2049 -83735
7183 -83735 -174994 -171397 -20597 -11550 -29221 31998 24603 -5139 46624 -6085 -68502 -24064
7171 -24064 -19112 -36607 -37864 -23806 -28668 -58946 -40184 -41524 -6836 31326 98493 111892 143168
7158 143168 164448 155481 139391 134683 57451 43420 800 -131351 -127760 -36494 37001 67138
7146 67138 -4466 80659 148459 152459 111559 38211 5219 41716 142158 180485 175571 117950
7134 117950 65119 100453 87950 22185 -528 -3526 32156 -16973 -26210 2162 40173 47445
7122 47445 88952 75340 38079 20202 -10374 -49672 66665 72599 96499 39625 -25231 -14309
7110 -14309 30467 131305 146903 78746 47598 47271 52048 57793 64192 110531 50046 57699 121804
7097 121804 116486 117402 89964 51269 95269 101205 38506 -103979 -124453 -29261 -16962 -104085
7085 -104085 -187886 -193971 -113925 -39649 -19173 -17544 16947 68394 54401 62296 63460 35735
7073 35735 5754 15688 22360 -15216 -10333 -38741 96347 182585 125507 86588 -13484 -110448
7061 -110448 -193057 -228805 -164853 -38168 45375 99759 55147 -1407 -62693 -81032 -106809
7050 -106809 -47903 -42765 -35505 57628 140632 139066 129326 87638 40566 92216 37783 43539 89550
7037 89550 66495 -17166 6318 -21267 -9827 16771 -3886 -60454 -66137 -80724 -119762 -162406
7025 -162406 -186099 -142736 -49633 -15389 -40626 -79386 -90136 -116531 -108699 -2106 42743 158633
7013 158633 146133 158698 88960 66774 115551 80415 64608 45753 2552 -95578 -118447 -163111
7001 -163111 -79965 -7558 -64456 -77237 8686 14539 -32228 -53581 -97509 -122494 -101852 -23220
6989 -23220 -653 107835 97950 -6749 -55190 36787 78097 47438 71871 88684 62949 -20062
6977 -20062 -35185 -31337 -72295 -15260 63274 90790 56902 -6423 -57355 11133 17266 -15440
6965 -15440 -68732 -51476 -81065 -50933 17670 33063 -89010 -50465 -58525 -36819 37484 75912
6953 75912 61499 8729 7130 67893 103314 16271 -12753 62216 104629 29390 18280 64508
6941 64508 94842 38193 -77024 -40707 -42177 -155030 -140410 -69268 -46169 16403 -15730 -51651
6929 -51651 -26080 -115231 -169600 -178541 -116871 -107797 -174522 -283316 -338598 -288626 -217810 -83589
6917 -83589 -18900 -138212 -121310 -129291 -127519 -110342 -93583 -49002 -49796 -52195 17098 -15331 65799
6904 65799 82162 22069 -12797 12696 1705 67584 92009 -16843 -55762 -96180 -127540 -48949
6892 -48949 57065 32575 77735 37905 49841 60764 92887 4291 -102385 -171400 -71292
6881 -71292 68289 -2285 -500 21223 -13684 37793 31171 19810 -9139 1374 78530 153074
6869 153074 178791 171641 112334 83274 36176 16574 -65724 -70938 -87696 -33283 -36670 8374
6857 8374 32158 -6903 2361 -47183 -120115 -94846 -70489 -73142 -50410 -65345 -48065 -42703 -29799
6844 -29799 -51809 -72999 -95878 -150225 -203490 -110443 -80586 -95049 -57426 -40436 -21305 -52834
6832 -52834 -48256 -80572 -67655 -16621 105496 44192 -38577 -7138 58760 62322 49174 45698
6820 45698 80144 43317 56814 108347 47166 14929 -41503 -26043 -56940 -91134 19761 69570
6808 69570 -5581 -32293 -59292 -45528 -14657 14939 60603 75563 4789 -64276 -45482 17274
6796 17274 -60083 -111721 -104031 19909 114021 107745 4784 -36741 -1778 41191 -65005 -138391
6784 -138391 -77637 -65490 -44054 -9744 -64956 -123272 -75582 -76234 -107076 -94599 -140448 -104512
6772 -104512 -43061 -4017 -7347 23600 -664 -50217 -25132 -39642 -77672 -34447 -65217 -100888
6760 -100888 -81542 -88106 -92548 -140097 -166259 -100403 -92129 -10371 69563 70870 2748 -26098
6748 -26098 12023 12939 112573 145936 88873 32745 18469 40929 22783 60618 120329 144585
6736 144585 54696 -39766 2642 25035 1712 -29035 24783 35048 109316 87986 19053 -42242
6724 -42242 -100663 -133179 -64166 13851 72501 67443 123200 151425 100362 62884 60625 37370
6712 37370 -19457 -28708 36738 58920 74320 102846 86395 72187 26536 11712 -21786 -78770
6700 -78770 -20220 33448 50839 38059 22412 59426 52356 -4349 -56399 -80166 -53612 -32669
6688 -32669 -70232 -64842 -63620 -30257 -15165 -34292 -32157 -28724 -18154 -40405 -91980 -18416 94991
6675 94991 107554 121237 116803 86181 106309 153069 151903 152009 79010 -32174 -48602 -31324
6663 -31324 -34719 -45104 -72317 -58227 -4946 18518 -89005 -166207 -160564 -146899 -138540 -169976
6651 -169976 -154602 -147208 -135740 -94204 6602 -102340 -103657 -120303 -69403 -43224 -127616 -149861
6639 -149861 -114223 -72092 -1378 15970 -1692 -55064 -102732 -20309 73401 -37034 -124909
6628 -124909 -114593 -27054 45185 108924 44176 -82266 -46013 16044 31083 98654 66427
6617 66427 61971 59791 -36595 -55807 -11037 56688 137905 33 -62850 -12910 -58166 -5396
6605 -5396 -40711 -26255 -22674 -22163 -55729 -69039 -82759 -52182 -24635 -50089 34075 42150 2818
6592 2818 47121 78776 98731 151996 148741 88411 621 26288 51038 53270 15359 43764
6580 43764 17035 -16468 15428 -29241 11123 -66266 -78114 -54627 -2711 -13245 -54723 -43359
6568 -43359 -106395 -186298 -159215 -109364 -93355 -98579 -11302 54986 38552 -92491 -98422 22195
6556 22195 74327 -30488 6927 70779 127779 75724 -9631 19394 85945 58038 33348 27211
6544 27211 -57931 -30233 -61898 -41680 71031 71777 1756 -10678 9386 -26274 -62120 -19967
6532 -19967 -72877 -117544 -89440 -26963 -19810 -19668 -35717 -101379 -180897 -137465 -58296 28672
6520 28672 36340 1757 -23426 5296 34716 24818 28399 40780 -51249 -41299 -19508 -79139 -67593
6507 -67593 -79656 -97124 -150812 -197091 -190658 -143952 -133362 -126177 -87468 -71934 -40754 -39137
6495 -39137 6303 6524 35215 -20643 -104692 -133901 -71697 8300 12160 69045 60629 33435 35572
6482 35572 36926 -32787 -17942 -2825 -13605 26395 20200 81957 -2666 22394 18929 -27821
6470 -27821 -82635 -108872 24011 24957 61203 36911 -31209 -58133 -6628 -53048 -26390 55357
6458 55357 59489 54705 83243 51137 -10609 -25705 -73349 -23509 -64527 -38989 20169 102154
6446 102154 114865 96741 72041 47589 47061 70655 65950 -2218 -38024 1638 -80242 -125365
6434 -125365 -60383 8912 72114 61921 55430 29502 29384 49234 63083 26697 1758 -65561
6422 -65561 -75655 -157500 -28234 -2878 -50877 -110639 -88532 63819 167421 114821 74224
6411 74224 78318 52815 28048 62196 28030 -24061 -67838 -91922 -109168 -75395 -35884 33760
6399 33760 3151 -80409 -179654 -196723 -137662 5499 -10032 51578 92808 87492 56261 64471
6387 64471 33777 -48934 -151499 -121698 -114190 -100314 -134564 -166269 -148331 -119761 -68487 -51010
6375 -51010 -51730 23438 -1550 20377 75537 18200 -73285 -46910 -1946 -14653 -10222 -32302
6363 -32302 -63602 -131582 -136229 -73006 21333 104010 34698 -28409 17408 43363 94495 68613
6351 68613 -29140 -54925 -43054 1968 33933 -19930 -36561 -86663 -105990 -131469 -167760 -186777
6339 -186777 -99244 12478 80963 23390 -6031 83041 86585 31796 -38141 -65702 -66504 -67902
6327 -67902 -101083 -93819 -52433 -76011 -52407 -62299 -75872 -102825 -70927 -103802 -102349 -119482
6315 -119482 -100994 -38985 -30218 -36206 31654 -9278 -40531 -2940 61113 43901 -5059 24102
6303 24102 9042 -13981 -25031 -47769 -62285 -23180 -70030 -34822 40151 26645 31843 37754
6291 37754 72471 43693 41390 -25757 -61398 -56149 523 75360 45248 -49461 -121163 -170433
6279 -170433 -71081 15661 -55307 -36400 4932 -11423 -35337 -57660 -2716 46533 72824 29663
6267 29663 -10922 -11486 6165 -52984 -159926 -87864 -15901 -93581 -55838 -43893 23089 54842
6255 54842 41233 42309 80063 14543 -6746 36701 65600 51317 48209 83005 144181 103516
6243 103516 -4025 -79991 -158772 -186039 -180458 -128319 -45554 -11362 -73321 -107953 -66525 -51883
6231 -51883 -99582 -77474 -60163 -86989 -130353 -151913 -197526 -136867 -131681 -128300 -126406 -92005
6219 -92005 -26484 -19458 -18011 -1448 25777 -81003 -119858 -89751 -74950 -42325 -132210 -80261
6207 -80261 7040 35410 30634 59774 109522 124356 95944 37520 106084 129492 5246 -19653
6195 -19653 -60608 -42472 -4765 38733 66473 39148 -101 45467 62026 54716 4778 14277
6183 14277 -47632 -106159 -101055 -79986 -33959 -63787 56373 148168 141251 43469 -67800 -5279
6171 -5279 61272 10001 -45863 -78458 -158425 -137226 -39169 33810 44892 62546 48260 -65538
6159 -65538 -77252 -44539 18436 53048 5052 -31817 -34127 -43685 -26913 42514 4251 9765
6147 9765 -1299 49615 75259 28246 35966 -21074 -97261 -195788 -202891 -177394 -141716 -93757
6135 -93757 -51221 -82958 -21725 -14538 -40133 -34247 20861 -27715 -118604 -123679 -83242 -34713
6123 -34713 -39564 -19949 -15742 -90242 -163246 -122532 -1289 143084 189821 145161 78981 71470
6111 71470 30796 4828 -45265 55314 142056 175063 136755 89225 117522 96943 40142 -13444
6099 -13444 33349 1501 -53345 -59107 -98736 -132401 -145068 -42888 6369 9486 -55269 -5900
6087 -5900 49007 125956 114969 63228 -5257 -69311 -57397 -25592 -19102 26346 79514 19720
6075 19720 58451 42237 35831 95374 127661 -22520 -79820 -88864 -62331 -29622 22470 -17302
6063 -17302 -102027 -70175 -20176 26717 -4212 20029 53189 78302 106245 137384 61066 -17346
6051 -17346 -65071 -152314 -157303 -85138 -29027 -32314 -32774 -23850 28320 25634 21724 74895 111255
6038 111255 -20893 -79901 -14261 27947 40041 14402 35172 -1221 -29170 -7476 6352
6027 6352 51757 -6855 -58070 -36927 -6278 78113 113065 170255 156505 45029 47867 10737
6015 10737 806 64977 84950 -15257 -107469 -110357 -42802 -17823 -38013 -65251 -69156 -54490
6003 -54490 19821 -38911 -60621 -66031 -12943 -19383 -22165 -19895 1501 -93909 -171316 -229629 -255728
5990 -255728 -241710 -145818 -59894 -25147 14595 -17474 -69442 -91394 -29842 6956 -13295 23783
5978 23783 79883 40398 -55826 -63627 5592 102358 144837 150943 104977 25590 6854 -39018
5966 -39018 -50200 40598 7468 -2153 -6779 22486 -24320 -114653 -96275 -61618 -62446 -97778 -65347
5953 -65347 -45086 -38916 37497 -6102 61313 44460 20267 28695 33451 103429 149658 134985
5941 134985 95870 -30977 -124694 -86434 3632 37352 -17356 -105618 -185598 -207407 -238942
5930 -238942 -123764 -9420 -51189 -99311 -54038 -16265 11300 -13137 -42715 -37058 -77322
5919 -77322 -56383 10233 5034 18838 10282 2096 676 40687 26381 16192 14904 -72371 -32009
5906 -32009 -3567 -38258 -1222 208 -75646 -135276 -332 81431 -5448 36913 98631 136551
5894 136551 96871 48131 42461 94125 87663 28165 35748 10040 -41360 -20658 36540 15526
5882 15526 -67817 -99185 -90855 -61288 -74918 -194778 -227500 -166795 -164362 -169037 -180489 -180685 -137589
5869 -137589 -163806 -89883 -9536 54610 82933 68474 36017 -7018 8277 78724 98551 14338
5857 14338 -22348 -345 84885 143280 131723 122552 174713 227499 129038 46236 35321 1599
5845 1599 28467 80278 3826 6744 28161 -30825 -48519 24185 -10889 -23356 4967 -39661
5833 -39661 10712 60853 16491 -66122 -145074 -139526 -56310 -74370 -87688 -100867 -54003 -13932
5821 -13932 -30489 13943 18695 38923 56169 10415 -69290 -112357 -24280 -21027 -15475 37925
5809 37925 -2481 -54298 -72371 -42596 -57190 -48684 2343 14796 40436 139244 95990 -7146
5797 -7146 -30493 5108 -6172 29510 92266 90036 87676 31773 -5736 60927 77272 121811
5785 121811 102269 65052 78949 98244 42249 -9619 -35001 -64006 9704 108797 36984 -84693
5773 -84693 -125708 -106545 -131178 -189242 -221930 -176836 -155251 -141220 -60979 88784 135796 98192
5761 98192 73888 92559 33788 -6357 53818 140238 210658 231136 239637 124603 -2611 -45143
5749 -45143 -58486 8506 56287 16628 12728 8451 15468 -32263 -49854 96078 110694 21493
5737 21493 -68077 -102499 -130442 -117129 -106576 -163789 -183757 -117670 -10109 2451 54608 -18092
5725 -18092 -78563 -96549 -137270 -110890 -155645 -184076 -98850 -99862 -140290 -38649 40641 -31057
5713 -31057 -7262 39331 -23933 -65238 -87443 -86201 -44141 -127636 -148590 -111906 -99915 -102171
5701 -102171 -122187 -44709 -31097 -85234 -18684 -24852 -5694 16202 30039 37213 6066 -61750
5689 -61750 -84488 -83477 -16689 -52713 -125656 -83377 -66767 30722 64145 56097 98662 5041
5677 5041 -60865 -27255 -16461 50489 48371 -1776 -28811 38450 78208 48905 -63251 -38969
5665 -38969 -52497 -50226 -90982 -59133 -65506 -74812 -36973 -41271 -147363 -203212 -165934 -143079
5653 -143079 -100676 -85452 -16561 30896 20981 8824 73375 167632 119572 -19786 -52832 -13911
5641 -13911 53549 85513 -4754 4021 4850 18299 32412 59455 18285 -62349 -44200 -50838 -31837
5628 -31837 -58068 -32621 33981 -34487 -51744 -16710 12030 -15186 1168 80774 74134 76781
5616 76781 98794 110850 67948 34894 54559 37741 40589 -1258 -50335 -65540 44681 100140
5604 100140 118348 63251 26252 22915 65444 43284 14744 16197 35512 -64075 -185092 -156210
5592 -156210 -163499 -87683 -35443 -30115 -117815 -164326 -136247 -65365 -50099 -70608 -128722 -60607
5580 -60607 59093 21659 -14443 -19748 -88249 -155903 -118947 -23256 5548 -5072 4111 -50360
5568 -50360 -112702 -3748 96077 62479 65963 62427 72157 -1462 -70673 -49988 -13607 -61302
5556 -61302 -155539 -211705 -197818 -191105 -153993 -62974 -40758 -59735 -51940 -43160 -38330 -36552 -18679
5543 -18679 34218 45920 20104 12806 25514 -91230 -162523 -60290 -79509 -112249 -32489 83390
5531 83390 82608 52756 96163 53547 809 44409 108154 49169 28075 -32259 -6518 35930
5519 35930 57958 31601 -81606 -123522 -148531 -156732 -151428 -101668 -81777 -55264 -84313 -120204
5507 -120204 -120944 -64783 -38251 -108300 -74087 -90348 -157485 -106043 -53498 -79203 -106792 -127484
5495 -127484 -190525 -187276 -107741 5460 6143 -26515 -27939 4823 1688 -78840 -115863 -60511
5483 -60511 35641 83027 40782 -49696 -99561 -52230 -7456 -1009 -23982 1068 55209 84138
5471 84138 46398 -6724 -17081 1474 6631 7116 57160 39092 -42390 -96440 -63865 23560
5459 23560 -10666 -26180 12510 93273 105565 4837 -37293 -16018 -48447 -43493 18151 74695
5447 74695 95238 50746 -74561 -43567 -25593 -3012 73871 -17429 -74442 -94078 -83042 14452
5435 14452 50017 83577 -32486 -44461 -88788 -117111 -150791 -92194 -31178 -107428 -177561 -147670
5423 -147670 -107994 -102044 -163592 -245873 -265592 -190057 -81753 -3108 38832 24594 -27280 -64258
5411 -64258 -58822 -53243 15712 -44811 -102066 -66708 -121971 -174960 -189336 -110891 6629 -23247
5399 -23247 33457 63465 183972 251495 201847 39072 -12260 80043 117418 40957 -57659
5388 -57659 -79997 -102285 -65251 -20265 -1880 -70293 -78816 -73044 -96099 -84539 -114691 -199072
5376 -199072 -263570 -260181 -155381 -89745 -98968 -46028 -57158 -74874 -96165 -51336 -84708 -58396
5364 -58396 15904 20673 -26125 -64893 6130 68717 -2828 -422 3114 -22565 19920 -4681
5352 -4681 -43712 -42946 -43885 -42868 -20169 8002 -28564 -47132 -20576 5602 -12018 -8708 2001
5339 2001 -31799 -6730 -280 -48377 -79082 -120154 -93328 -30112 -29425 -57296 -54191 -67698 7069
5326 7069 -2232 -139608 -171194 -73700 -37135 -7151 -1564 21668 22315 92922 67221 22699 5278
5313 5278 -22302 51050 50423 28091 83818 145276 155610 116908 173460 139735 91841 91428 59916
5300 59916 56842 78826 100483 50428 50475 54950 19772 -75746 -51761 -26849 8054 71461 44863
5287 44863 -37925 -91042 -26007 33079 35827 65887 -24495 -90039 -20350 31610 -12232 8245
5275 8245 -2929 -126758 -132937 -114320 -92442 -28821 -65255 -69086 -155471 -173359 -138015 -105175
5263 -105175 -13424 -73858 -89430 -61706 -51562 40118 47060 62268 38586 -36407 -15008 -38019
5251 -38019 -36498 -32602 -45595 -46426 -107207 -96080 -86476 -38510 20677 -28519 -22803 10436 26744
5238 26744 78536 38644 56737 57679 32642 28877 -69449 -101379 -75324 82169 166819 133897
5226 133897 -925 -74302 -35140 -24518 -43220 -90607 -100602 -52580 164 73116 55288 -11067
5214 -11067 -86057 -68403 -65959 -49055 -21120 5233 -27641 -3664 4865 -58574 75993 185688
5202 185688 193878 171281 126762 30856 -75117 -135534 -155404 -91238 -46379 -41176 -61718 -21201
5190 -21201 655 50529 34933 -19833 -30740 -29550 -29145 -43977 -70654 -25674 -79858 -109054
5178 -109054 -83590 -85936 -64565 -28838 -3272 -56580 -56853 -55888 -36546 74238 40610 40807 -13566
5165 -13566 -18583 57197 50552 62363 93955 69116 50745 50639 56955 79355 109293 95364 123815
5152 123815 83370 8305 -98654 -98522 -25430 -66040 -138896 -57415 -1795 89103 134842 88809
5140 88809 34374 -17786 28285 5629 -12562 90762 165862 96194 6429 -4824 27531 137710
5128 137710 167948 96965 2276 59871 86001 -21726 -56805 -26408 75971 100148 115360
5117 115360 73420 72800 59791 62058 125341 71780 -187 -35861 -96213 -126414 -77541 30448
5105 30448 65548 6264 -20845 -20775 -43867 3329 -14769 -50066 -56859 -73512 -136766 -83133 -18252
5092 -18252 -34240 -61369 -42297 102456 195191 255362 211314 130956 100735 108057 27089 -25987
5080 -25987 -30207 -17673 -30764 -39415 -63470 -95189 -101310 -64130 -77709 -129593 -106184 -46215
5068 -46215 -36806 -45 10798 -987 25470 -38106 -47511 -58602 173 -34417 -86722 -83158
5056 -83158 -65869 -5723 98102 45258 -42992 -28957 82983 72687 -57724 -86875 -98744
5045 -98744 -84366 -13845 9651 63766 64676 35507 55834 96879 -2893 -28897 64999 63588
5033 63588 -35938 -125564 -121125 -33674 -5744 19639 117932 133149 67784 73697 144677 138563
5021 138563 66627 55989 80780 16197 -11417 -87880 -85681 -32118 50209 43174 44145 38436 91628
5008 91628 22725 -14121 4291 24417 81736 117665 187205 119275 24889 27235 44672 47549
4996 47549 80404 81353 6820 32712 98972 169750 129235 63415 131037 160792 154700 179554
4984 179554 188004 142183 88604 121927 139201 100452 -260 -13184 50485 -45854 -138797 -97517
4972 -97517 -21724 -14200 11492 392 79584 67709 -29955 -34292 -41544 -72185 -94575 -74598
4960 -74598 -61802 -19528 86070 85214 35847 -2999 -19251 39351 -10703 -51996 11028 70799
4948 70799 136697 109475 17448 34180 -2392 11336 -38646 -16552 79638 16745 -42123 -64687
4936 -64687 -107123 -71374 -61460 -81893 -60051 391 -8603 12219 -38996 16361 -92350 -70830
4924 -70830 75442 117348 52825 1907 67023 93599 68983 -74339 -118403 -103724 -56911
4913 -56911 -123004 -63267 -20594 -15931 -40180 16005 30347 50982 59697 -22122 63582 92711
4901 92711 186837 83557 -25886 -22008 -56020 844 -38549 -19684 -35292 -36519 -110584 -113723
4889 -113723 -79501 -89908 -149817 -120061 -89642 -38092 -50231 29150 70610 -26296 -47093 -38808
4877 -38808 -25569 -76259 -37998 -27382 -50279 -17604 4468 -14234 -46693 -56590 -23388 7009
4865 7009 11816 -21796 -39423 -112978 -151598 -44390 64303 29690 41317 26177 -12375 -35272
4853 -35272 -15855 14062 30553 -13174 -20327 -113746 -182914 -131878 -157879 -171992 -60964 30981
4841 30981 48257 72699 56635 -47190 -60618 -93111 -56481 -96534 -51945 -64865 -99539 -175835
4829 -175835 -165808 -119859 -84695 -27115 -31339 -39797 41120 97540 64469 25048 -57536 -124893
$$ [...]
##END NTUPLES=NMR SPECTRUM
##END=
