##TITLE=Analysis number 316793
Compound Code cc 43322
Book Reference 414/164
Project Code adrs
Chemist Name mattw
##JCAMPDX= 6.0         $$ Bruker NMR JCAMP-DX V2.0
##DATA TYPE= NMR SPECTRUM
##DATA CLASS= NTUPLES
##ORIGIN= Bruker BioSpin GmbH
##OWNER= nmr
$$ XWIN-NMR		Version 3.5
$$ Fri Jan 27 08:46:18 2006 GMT Standard Time (UT+0h)  MAYBRIDGE\nmr@NMR_250MHZ
##.OBSERVE FREQUENCY= 250.131544655141
##.OBSERVE NUCLEUS= ^1H
##.ACQUISITION MODE= SIMULTANEOUS (DQD)
##.ACQUISITION SCHEME= undefined
##.AVERAGES= 16
##.DIGITISER RES= 18
##SPECTROMETER/DATA SYSTEM= dpx250
##.PULSE SEQUENCE= zg30
##.SOLVENT NAME= CDCl3
##.SHIFT REFERENCE= (INTERNAL, CDCl3, 0, 16.522)
##AUDIT TRAIL= $$ (NUMBER, WHEN, WHO, WHERE, WHAT)
$$ ##TITLE= Audit trail, XWIN-NMR		Version 3.5
$$ ##JCAMPDX= 5.01
$$ ##ORIGIN= Bruker BioSpin GmbH
$$ ##OWNER= nmr
$$ C:\u/data/dgb/nmr/ADRS/15220/pdata/1/auditp.txt
$$ ##AUDIT TRAIL=  $$ (NUMBER, WHEN, WHO, WHERE, WHAT)
(   1,<2006-01-27 08:45:28.81 +000>,<MAYBRIDGE\nmr>,<NMR_250MHZ>,
      <created by zg, POWCHK disabled, PULCHK disabled
       configuration hash MD5:
       62 19 C7 07 E1 42 D1 B7 37 6C 3D D0 77 39 F9 E6
       data hash MD5: 64K
       DF 71 49 67 A1 C2 7B 2A 37 43 14 E4 E8 D7 FA C0>)
(   2,<2006-01-27 08:45:52.76 +000>,<MAYBRIDGE\nmr>,<NMR_250MHZ>,
      <Start of raw data processing
       ef LB = 0.3 FT_mod = 6 PKNL = 1 SI = 32K 
       data hash MD5: 32K
       2D 1D 75 49 AC DA 3E 96 58 B0 36 8B 79 08 B1 D0>)
(   3,<2006-01-27 08:45:56.37 +000>,<MAYBRIDGE\nmr>,<NMR_250MHZ>,
      <apk 
       data hash MD5: 32K
       BE E0 44 92 D9 42 55 4C 48 DD 74 72 A7 3C C7 19>)
(   4,<2006-01-27 08:45:57.42 +000>,<MAYBRIDGE\nmr>,<NMR_250MHZ>,
      <abs ABSG = 5 
       data hash MD5: 32K
       F8 83 07 2B 0B 52 D5 04 A5 DF DF 92 91 2D A7 04>)
$$ ##END=
$$ 
$$ hash MD5
$$ F0 FB 0E 65 12 7F 8E 8F DA D7 09 78 8A D6 02 F7
##$RELAX= 
##$RELAX= 
##$RELAX= 
##$RELAX= 
##$RELAX= 
##$RELAX= 
##$RELAX= 
$$ Bruker specific parameters
$$ --------------------------
##$DU= <C:\u>
##$EXPNO= 15220
##$NAME= <ADRS>
##$PROCNO= 1
##$TYPE= <nmr>
##$USER= <dgb>
##$AMP= (0..31)
100 100 100 100 100 100 100 100 100 100 100 100 100 100 100 100 100 100 
100 100 100 100 100 100 100 100 100 100 100 100 100 100 
##$AQSEQ= 0
##$AQ_mod= 3
##$AUNM= <au_zg>
##$AUTOPOS= <36 >
##$BF1= 250.13
##$BF2= 250.13
##$BF3= 250.13
##$BF4= 250.13
##$BF5= 500.13
##$BF6= 500.13
##$BF7= 500.13
##$BF8= 500.13
##$BYTORDA= 1
##$CFDGTYP= 0
##$CFRGTYP= 5
##$CHEMSTR= <none>
##$CNST= (0..31)
1 1 145 1 1 1 1 1 1 1 1 1 1 1 1 1 1 1 1 1 1 1 1 1 1 1 1 1 1 1 1 1 
##$CPDPRG= <>
##$CPDPRG1= <>
##$CPDPRG2= <>
##$CPDPRG3= <>
##$CPDPRG4= <mlev>
##$CPDPRG5= <mlev>
##$CPDPRG6= <mlev>
##$CPDPRG7= <mlev>
##$CPDPRG8= <mlev>
##$CPDPRGB= <>
##$CPDPRGT= <>
##$D= (0..31)
0 1 0 0 0 0 0 0 0 0.06 0 0 0 0 0 0 0.0002 0 0 0 0 0 0 0 0 0 0 0 0 0 0 
0 
##$DATE= 1138351526
##$DBL= (0..7)
120 120 120 120 120 120 120 120 
##$DBP= (0..7)
150 150 150 150 150 150 150 150 
##$DBP07= 0
##$DBPNAM0= <>
##$DBPNAM1= <>
$$ [...]
##$SUBNAM7= <"">
##$SUBNAM8= <"">
##$SUBNAM9= <"">
##$SW= 20.6930455092707
##$SWIBOX= (0..15)
0 0 3 0 0 0 0 0 0 0 0 0 0 0 0 0 
##$SW_h= 5175.983436853
##$TD= 65536
##$TD0= 1
##$TE= 293.16
##$TE2= 300
##$TE3= 300
##$TEG= 300
##$TL= (0..7)
0 120 120 120 120 120 120 120 
##$TP= (0..7)
150 150 150 150 150 150 150 150 
##$TP07= 0
##$TPNAME0= <>
##$TPNAME1= <>
##$TPNAME2= <>
##$TPNAME3= <>
##$TPNAME4= <>
##$TPNAME5= <>
##$TPNAME6= <>
##$TPNAME7= <>
##$TPOAL= (0..7)
0.5 0.5 0.5 0.5 0.5 0.5 0.5 0.5 
##$TPOFFS= (0..7)
0 0 0 0 0 0 0 0 
##$TUNHIN= 0
##$TUNHOUT= 0
##$TUNXOUT= 0
##$USERA1= <user>
##$USERA2= <user>
##$USERA3= <user>
##$USERA4= <user>
##$USERA5= <user>
##$V9= 5
##$VALIST= <valist>
##$VCLIST= <CCCCCCCCCCCCCCC>
##$VD= 0
##$VDLIST= <DDDDDDDDDDDDDDD>
##$VPLIST= <PPPPPPPPPPPPPPP>
##$VTLIST= <TTTTTTTTTTTTTTT>
##$WBST= 1024
##$WBSW= 4
##$XGAIN= (0..3)
0 0 0 0 
##$XL= 0
##$YL= 0
##$YMAX_a= 498279
##$YMIN_a= -666079
##$ZGOPTNS= <>
##$ZL1= 120
##$ZL2= 120
##$ZL3= 120
##$ZL4= 120
##$ABSF1= 16.522
##$ABSF2= -4.171173
##$ABSG= 5
##$ABSL= 3
##$ALPHA= 0
##$AQORDER= 0
##$ASSFAC= 0
##$ASSFACI= 0
##$ASSFACX= 0
##$ASSWID= 0
##$AUNMP= <proc_1d>
##$AZFE= 0.1
##$AZFW= 0.1
##$BCFW= 0
##$BC_mod= 0
##$BYTORDP= 0
##$COROFFS= 0
##$CY= 12.5
##$DATMOD= 1
##$DC= 0
##$DFILT= <>
##$DTYPP= 0
##$F1P= 14.0000005364418
##$F2P= -0.99999901652339
##$FCOR= 0.5
##$FTSIZE= 32768
##$FT_mod= 6
##$GAMMA= 0
##$GB= 0
##$INTBC= 1
##$INTSCL= 1
##$ISEN= 128
##$LB= 0.3
##$LEV0= 0
##$LPBIN= 0
##$MAXI= 10000
##$MC2= 0
##$MEAN= 0
##$ME_mod= 0
##$MI= 0
##$NCOEF= 0
##$NC_proc= -2
##$NLEV= 6
##$NOISF1= 0
##$NOISF2= 0
##$NSP= 0
##$NTH_PI= 0
##$NZP= 0
##$OFFSET= 16.522
##$PC= 1
##$PHC0= 243.8972
##$PHC1= 6.236254
##$PH_mod= 1
##$PKNL= yes
##$PPARMOD= 0
##$PSCAL= 4
##$PSIGN= 0
##$REVERSE= no
##$SF= 250.13
##$SI= 32768
##$SIGF1= 0
##$SIGF2= 0
##$SINO= 400
##$SIOLD= 32768
##$SREGLST= <1H.CDCl3>
##$SSB= 0
##$STSI= 32768
##$STSR= 0
##$SW_p= 5175.98343685301
##$SYMM= 0
##$S_DEV= 0
##$TDeff= 65536
##$TDoff= 0
##$TI= <Analysis number 999999
Compound Code 99
Book Reference 9
Project Code 9>
##$TILT= no
##$TM1= 0
##$TM2= 0
##$TOPLEV= 0
##$USERP1= <user>
##$USERP2= <user>
##$USERP3= <user>
##$USERP4= <user>
##$USERP5= <user>
##$WDW= 1
##$XDIM= 32768
##$YMAX_p= 298332057
##$YMIN_p= -50581
$$ End of Bruker specific parameters
$$ ---------------------------------
##NTUPLES= NMR SPECTRUM
##VAR_NAME=  FREQUENCY,     SPECTRUM/REAL,   SPECTRUM/IMAG
##SYMBOL=    X,             R,               I
##VAR_TYPE=  INDEPENDENT,   DEPENDENT,       DEPENDENT
##VAR_FORM=  AFFN,          ASDF,            ASDF
##VAR_DIM=   32768,         32768,           32768
##UNITS=     HZ,            ARBITRARY UNITS, ARBITRARY UNITS
##FACTOR=    0.157963299565203, 1,           1
##FIRST=     4132.6476996994, 0,             0
##LAST=      -1043.33573715361, 0,           0
##MIN=       -1043.33573715361, -50581,      0
##MAX=       4132.6476996994, 298332057,     0
$$ Real data points
##PAGE= N=1
##DATA TABLE= (X++(R..R)), XYDATA
$$ [...]
23567 -11029 -24641 -22227 -24116 -18967 -8592 -7296 40 -14359 -10542 18753 28526 14205 -6621
23554 -6621 -19697 -23813 -16244 -6517 -5993 -8795 -4263 2645 13186 7446 6049 13983 28917 22266
23540 22266 3580 -19387 -28453 -24180 -17998 -16884 -11059 -12118 -2684 -3081 -1687 8178 6024 8320
23526 8320 -3731 -8551 3039 12162 12266 6028 -3954 -4746 6335 12523 -1613 -5839 14141 8393
23512 8393 -2571 -10094 -1837 6422 13663 9990 -35 -406 -2557 -20301 -19472 -17031 -14473 -4137
23498 -4137 5355 832 -5564 -7135 -7495 15285 30799 23327 8345 -11077 -3380 1879 8315 3466
23484 3466 1201 -1636 -7517 -2428 7981 9734 -3638 -21087 -21157 -13248 4506 16052 3391 -12214
23470 -12214 -8307 -3347 -1922 -2230 4384 11760 22990 22560 17481 10167 14354 21870 17308 13186 12299
23455 12299 2805 -8230 -8593 -2901 -1543 -2395 -9652 -10116 1522 2587 -22139 -27409 -23996 -22910
23441 -22910 -21761 -20730 -12475 -18109 -20493 -21672 -14399 -11439 2153 11295 9106 11637 7370 14253
23427 14253 7049 8050 13667 13177 13875 10429 3907 -1112 -1077 3202 2303 -12070 -4972 1648 2741
23412 2741 -4161 -15725 -12338 -15295 -20775 -26880 -26189 -14160 1193 -196 8073 5041 658 12463
23398 12463 644 -10806 -13866 -5280 15244 13883 8531 4989 47 -15455 -24527 -18782 -23902
23385 -23902 -24078 -10388 -11358 -11528 -13976 -14943 -6961 -13310 -25651 -24555 -26106 -15452 -5637 1010 -8342
23370 -8342 -12965 -26618 -23524 -10365 -3469 3268 14707 6481 12 6001 13470 10446 -2686 -9216
23356 -9216 -6165 -2293 182 2057 -9128 -15756 -17363 -17292 -20352 -22948 -22569 -11011 -11578 -12113 -8033
23341 -8033 -4860 -6916 -549 13934 16758 982 -17830 -28038 -17535 -7825 1180 258 -3526 3258
23327 3258 2527 8281 2883 5357 11385 6712 15179 17341 12537 -354 -4886 -3394 -3204 -7868 -13702
23312 -13702 -4691 7835 20523 32290 31916 12823 -6049 -707 6405 1665 9226 12082 1429
23299 1429 -6007 -1347 2930 2179 -10930 -17852 -17192 1797 -3732 5715 5754 5167 4912 -9161 -13032
23284 -13032 5216 1311 -6042 770 13799 10842 9474 -1447 205 -4394 -23827 -20469 -23859
23271 -23859 -36679 -22557 -14124 3729 14616 17012 11009 8224 1485 -7990 5911 9477 6575
23258 6575 6828 7597 -2867 -16329 -5793 6457 5858 2808 1252 497 3278 735 -4973 -7712 -13415
23243 -13415 -10522 -1058 -11514 -6400 407 -10604 -6511 -5487 -13088 -10277 -2359 1963 11941 27433
23229 27433 21951 9813 -3441 2435 -2623 -22186 -33318 -30819 -21238 -7133 -14822 -22781 -19291
23216 -19291 -4288 3948 1531 4175 -1571 -13883 -14556 -5053 -7135 -2326 -4914 -13863 -12528 -21230
23202 -21230 -22491 -8153 2028 17 -3640 -5964 8032 8061 7739 12019 -4647 647 11306 21397
23188 21397 18961 10789 10431 12740 15119 6238 -4079 -11159 -21799 -29287 -32686 -28490 -16814 -27941
23174 -27941 -26805 -19047 -9795 -2749 -6876 -30109 -24631 -7598 -7289 -13566 -11374 -9463 -9857 -16317
23160 -16317 -13008 -4344 1360 3726 1726 -10247 -4324 7400 13758 7603 -2059 -12818 -10379 -7660
23146 -7660 -19778 -2016 13676 6384 -7980 -25881 -36954 -27166 -22600 -14227 -9327 -5077 -18242
23133 -18242 -20664 -15035 -16041 -3178 -704 -15374 -9424 1216 -4354 1421 -5204 -6433 5462
23120 5462 -3583 -9557 -13207 -8150 -5194 2442 3296 10913 4783 -8509 -4240 -1677 -5331 -18181
23106 -18181 -15027 -13673 -16803 -6420 -9044 -10452 -7122 -2423 -6072 2845 6629 -1870 -18119 -24939
23092 -24939 -15011 5906 10638 4494 17320 26467 16985 11906 10597 10306 22246 24475 19823 10921
23078 10921 4115 -4016 -13169 -10626 -22325 -16581 -7061 -2712 -3109 -23078 -14742 10236 8664 5690
23064 5690 10890 13757 11104 11565 20761 20782 17039 17079 11884 10781 10474 -1943 -12349 -2223 3536
23049 3536 -10513 -8924 2384 22335 13662 15485 20191 20019 11871 2490 -345 3826 9962 20174
23035 20174 27743 24448 11758 -13345 -19877 -12155 -5270 7282 21703 26039 27832 20766 17584
23022 17584 23082 20536 10122 2872 4217 -1019 1083 1866 13642 9129 3634 294 -11479 -2499
23008 -2499 4745 13461 10040 -2138 -9942 -1902 8664 1581 -8735 -6927 4928 16560 -572
22995 -572 -13595 -10274 -2743 -6610 6401 15136 7600 -4854 -3509 -2129 -8738 -12515 -29124 -29906
22981 -29906 -30320 -27159 -28133 -27289 -17708 -5168 43 2653 14058 15657 9749 2677 -14037 -18447
22967 -18447 -16530 -21706 -20150 -14673 -23241 -25099 -15800 -19105 -25312 -14831 -1363 3221 1555 3410
22953 3410 12848 15657 16025 14424 2785 2634 23827 13259 -10521 -15987 15511 33921 36303 24733
22939 24733 7019 4695 -2737 3646 2083 -2610 -1834 -1887 -3545 10695 18397 15909 20122 9691
22925 9691 1658 -16271 -28389 -25828 -12898 -1143 -5597 -7652 -9558 -10609 -29988 -26605 -12504
22912 -12504 -10183 -8321 -4548 -4480 -10900 -2795 9553 -8133 -26958 -21997 -14430 -15677 -9827 -8538
22898 -8538 7112 2336 -3784 3005 -4853 -204 -2798 -10885 -7846 -9109 -3367 1996 2186 -12944
22884 -12944 -7998 -5182 44 4604 827 -10827 -15540 -7446 4331 9847 1196 -12894 -13322 -17847
22870 -17847 -18982 -17201 -14281 13432 19729 8580 -17 -650 -13173 -15741 -23481 -21486 -11252 -7617
22856 -7617 -2771 16080 20255 6773 269 -17231 -24813 -19131 -13765 -7385 -9016 -15231 -26277 -27043
22842 -27043 -22984 -18801 -20246 -17005 7579 19868 10009 6609 5401 5736 1044 3230 -1458 -12057
22828 -12057 -16786 -11515 5915 9646 10734 11211 18810 14921 2560 10296 6135 -3765 -7058 -5390
22814 -5390 -22130 -18040 -12658 -13615 -21374 -14583 -14354 -3946 1767 -8687 -20660 -16017 -12788 -1081
22800 -1081 25668 27236 10000 13357 2171 -11785 -712 -7386 9390 6585 786 -12178 -15793
22787 -15793 -13130 -28527 -20563 -8613 -2329 -1540 -6584 -5299 -5874 -28007 -29423 -21066 -26022 -20238
22773 -20238 -17076 -15623 -16443 -6018 15081 12119 6123 4468 4909 4763 6786 12290 17020 -663
22759 -663 -907 2507 -4543 -8592 -5439 -10690 -17230 -26107 -14784 114 -4040 -10063 -5203 -7109 -8069
22744 -8069 -672 3838 4908 10560 9441 264 2221 9755 9021 5069 -8699 -17627 -8948 -6368 -3739
22729 -3739 2006 2546 11375 13187 16271 5010 5409 -810 -2156 4157 -10402 -913 15335 11607
22715 11607 1208 1007 3165 8271 5743 15425 18201 9846 1074 -13721 -5376 1830 -11462 -9300
22701 -9300 -6035 -8980 -11919 -13920 -5824 -5387 -10186 -7721 -6876 4008 1573 4075 11682 17100 16354
22686 16354 13042 9396 -5299 -2528 3874 19301 20790 15690 19526 24655 12772 8354 8510 -7451
22672 -7451 467 11239 11969 -12497 -12952 841 5169 406 -4301 17 -419 -3171 13 2489 -3715
22657 -3715 -7920 -15173 -9882 -7898 -25861 -32383 -22902 -16234 -14671 -24483 -15340 -8942 -1680 4653
22643 4653 -3803 -15371 -25417 -30305 -17256 -14684 -11447 5208 3242 -8336 -5780 2733 -2062
22630 -2062 -22440 -17266 -7335 -4648 105 2161 -7385 -4691 10450 -10643 -23539 -23730 -26091 -28990
22616 -28990 -29836 -22770 -8480 10234 11139 7213 1799 -6006 -3793 16090 29274 39112 32986 5235
22602 5235 399 15507 11785 6454 -4601 -20028 -18716 3859 3743 -14323 -12196 303 4687
22589 4687 -2354 10319 20995 32165 29122 34692 37710 44306 60554 41889 5398 5993 2326
22576 2326 -6756 -4521 2518 9268 -4602 -2034 8779 3902 8885 22046 19524 15089 11972 8281
22562 8281 -3458 -11872 -8149 -7983 4041 4111 2777 -8160 -16077 -3431 -1153 -7786 -1201 11828
22548 11828 7793 -1325 -7986 4105 17651 20784 4628 -20206 -21970 -1089 4195 4489 10332
22535 10332 6698 -8108 -5651 -6421 -5945 1751 -3458 -5486 -7317 -11468 -19449 -15980 -12633 4663
22521 4663 21474 -297 -8628 -3545 -1881 -12209 11231 15735 9464 -4102 -971 -9067 -9073 -9630
22507 -9630 -12400 -2523 5653 5746 4374 5498 -7034 -10580 -9239 10911 28696 12638 14661 19703
22493 19703 24187 16918 4884 -20405 -23238 -12237 -96 1940 -3689 -8531 -14453 -21031 -14505
22480 -14505 1660 15572 22514 26822 21984 9641 7487 12651 8199 -4731 -2058 6468 2375
22467 2375 -6773 -3531 -9346 -3757 -6556 -9495 -8423 -5335 -5606 -11263 6904 11012 100 2971
22453 2971 1358 -383 10927 4102 -3589 -9781 -12760 4854 13620 5098 2204 -16620 -24554 -15046
22439 -15046 -12806 -4243 5719 2546 16519 7399 9170 14237 5689 -4652 -19191 -22579 -5336
22426 -5336 -2961 4841 9859 16635 18481 9850 487 3684 -2488 1069 -8490 -8358 -10875 -16374 -15769
22411 -15769 -11326 6534 5155 5605 1900 -1690 -9407 -4901 -7308 -11664 -8823 -14851 -12552 -6358
22397 -6358 5271 -1110 3924 5614 -14893 -13915 217 9694 10539 12841 13250 7901 -704 -2671 5158
22382 5158 16611 10198 7336 3209 -2047 6340 -5829 -31728 -26987 -3160 1865 2320 5986 1864
22368 1864 -12744 -10053 -5511 4150 12831 12422 1870 -8771 -1752 9673 17069 17524 15403 20110
22354 20110 28243 22137 15034 1676 2864 62 3358 6224 -1399 -9580 -3493 3218 6323 -3195
22340 -3195 -4719 -7355 -8021 650 3192 4953 3303 3555 8658 2580 2973 7968 9363 16862 30335
22325 30335 20901 16878 24707 30056 30769 17465 -2847 2746 2773 -2939 -10153 5839 13116 3762
22311 3762 -10475 -15524 -14327 -829 727 2760 3296 -10180 -19226 -18083 -11118 -10277 -9815 -3799 -9965
22296 -9965 -10898 -767 8081 13185 12844 7573 9095 13124 12111 13457 14297 13455 8116 11906 17766
22281 17766 -6297 -6417 5393 -1081 4145 2834 3357 -10552 -17398 -25120 -31382 -28406 -13355 -8817
22267 -8817 -11708 12124 21803 18738 5419 3977 7679 14735 3307 -45 6566 -2878 -1199 -808
22253 -808 -2603 -2223 11498 6161 -681 -13877 -15899 -4435 519 -2433 -9110 -16746 -26839 -28249
22239 -28249 -22340 -19536 -16968 -10017 -13660 -14180 -24103 -28496 -24214 -21813 -19762 -18263 -20858 -14768 5109
22224 5109 21043 14924 12128 16666 29908 23891 22506 15614 26378 16520 17586 17081 2233 -6152
22210 -6152 -4709 -3037 1980 2907 12871 12435 2036 -785 6285 3448 4591 -1683 962 5371 1521
22195 1521 12834 12936 4764 -581 -10194 -18416 -13073 -6620 -862 -1460 10591 -1442 -10062 -101
22181 -101 -6076 -236 7810 -1086 -6935 -5184 -5600 -5051 -4780 -9400 -8328 2191 13892 9270 496
22166 496 -3792 6719 2292 -5179 778 -2357 -15148 -10449 -15758 -17160 -14373 1431 4878 -2286
22152 -2286 -6307 -8687 -16041 -7948 7749 7017 -7745 -7560 -10393 -13850 -17984 -22058 -10073 -10853 -5593
22137 -5593 -10342 -7635 -9116 -8976 -6518 -1775 4180 -8263 -280 -6250 -14927 -14623 1167 816 1556
22122 1556 6280 2599 91 292 -6203 -11055 -10860 -7663 -12686 -7167 -6589 1990 16823 22075 16308
22107 16308 8322 1827 -12741 -12788 -7911 12887 15408 20773 26944 28687 17375 -2227 -5658 -2597
22093 -2597 -7425 -1254 -5079 -15006 -11121 -3169 2853 16633 8018 -16725 -14723 -4480 -5783 9135
22079 9135 -1672 -3277 -6265 -8893 -8172 -12904 2015 1739 -6612 -7163 -6640 -10533 -10880 -10095 653
22064 653 11949 5375 12746 20668 21527 14900 7363 3023 -1169 -16064 -17292 -14299 -30719 -26394
22050 -26394 -29858 -18355 -12291 -5274 -11842 -20379 -11568 -8514 -2114 5861 6585 285 -15496 -31844
22036 -31844 -31036 -8711 1610 4582 8396 915 -6107 -15221 -18639 -18905 -20860 -12086 -2593 -797
22022 -797 3524 -7339 -18362 -3734 -5507 -1460 -6436 -6108 -9356 -4650 6905 207 -11442 -16652
22008 -16652 -14776 -10121 -3822 -8471 -12645 -6325 -9330 -20751 -26903 -31895 -29986 -8407 -544 -6015
21994 -6015 -27543 -24757 -6091 -2249 -371 5225 4762 3376 -16749 -31139 -23095 -10688 -2662 2824
21980 2824 13944 18978 32940 32324 28649 23760 15592 10988 10975 3786 -4291 -8275 -1194 -5061 6025
21965 6025 9328 16094 29186 20850 28384 29756 17053 5116 -2184 183 5896 17366 22194 25262
21951 25262 27997 29054 15315 -1358 -18347 -11222 3621 7077 4062 1341 2240 3454 -4923 -18593
21937 -18593 -1288 1064 8256 5879 -575 -17116 -11198 6080 7386 2284 -397 -7250 -83 5034
21923 5034 12443 8059 2223 1657 4519 10894 8427 -4408 -6007 1560 3646 -1540 1904 7842 12631
21908 12631 15381 9591 3624 15402 21160 2642 -2697 8076 24579 26853 18425 8966 3880
21895 3880 -7528 3942 15939 20298 12180 -13116 -15395 -7796 1977 5057 -743 -3619 -3852 6127
21881 6127 -516 143 6570 9424 4516 12467 15223 -5494 -2280 24161 28161 25055 23085 19551
21867 19551 15818 13348 16412 8574 -2811 2973 3532 -1220 -17227 -15590 -4735 -6798 -5701 -18138
21853 -18138 -23845 -19186 -28888 -21317 -14133 -19409 -17355 -11782 -4880 1392 -5990 -10851 -7151 -5487
21839 -5487 -8163 -19773 -17664 -6776 -11291 -4691 -1858 -4764 -10672 -5970 3774 524 9277 19052
21825 19052 11565 -1771 -12702 -1253 4421 6689 -3211 -14880 -3300 -375 7878 11176 5189
21812 5189 -9894 -14991 -12727 -3263 7571 14318 19316 21876 6383 -4457 -7964 -9978 -4444 1440
21798 1440 1363 -5315 -15485 -12422 -17986 -3480 -12875 -10003 591 9453 27121 29711 19409 -1440
21784 -1440 -10305 -18219 -25078 -24238 -29218 -20183 -14992 -13089 -8378 4008 4371 8499 2695 -3298 -7407
21769 -7407 -13326 -22563 -15171 -3435 1740 3972 -3278 -1521 -4032 -8930 -7723 3250 5154 -3371
21755 -3371 -2209 -7700 -9484 5501 6801 8756 21081 25447 22792 5595 -11768 -17021 -19985 -8642
21741 -8642 -3229 -8772 64 19033 24930 10720 -2379 2287 5254 9522 3354 2077 1747 -6089
21727 -6089 -16179 -7738 8276 11089 -420 -1060 3144 5456 1554 10641 20306 6997 -8332 -12938
21713 -12938 -27149 -36736 -25672 -17679 -13009 -13212 -6312 -1974 851 13502 -7564 -10368 9617
21700 9617 13411 13060 5391 -1200 -23898 -31774 -27960 -20377 -18086 -15244 -22590 -24958 -23300 -10313
21686 -10313 8194 14467 18693 24015 23464 9050 3432 7258 3943 4197 -6780 -4192 2618 -1554
21672 -1554 -4967 -8801 -18337 -19090 -4566 -4323 -13613 -14309 -15538 -9544 -1390 -3040 -5735 -5900 -5407 5705
21656 5705 10165 5601 3903 -1187 -3106 -7440 -22438 -22443 -14800 -8012 -552 -10460 -13093 1998 6636
21641 6636 10529 621 -23934 -28686 -21537 -29183 -30632 -16806 -5558 12676 84 -8345 -7780 -7683
21627 -7683 -19985 -28240 -27215 -9153 2251 -2222 -9136 3010 9402 4251 -2114 776 -1623 415
21613 415 -705 1934 -114 -8272 7446 20721 16111 11137 12540 14694 25465 11021 6886 2386
21599 2386 1325 -2404 1229 13799 22421 29465 24322 18357 10263 9622 8057 12656 13398 8557 8404
21584 8404 12224 9351 2440 4357 -2971 -1708 -4611 -950 10921 5481 -274 -1952 2369 1270
21570 1270 3242 17426 11504 -2181 -10807 -13146 -18678 -32231 -33904 -19419 813 1709 3697 11531
21556 11531 7034 876 4949 2156 -10686 -10028 -11919 -20637 -14642 1440 3275 8485 16128 16438
21542 16438 15780 6161 -9887 -11943 -22202 -28873 -6284 7812 10663 3847 -11464 -2271 16067
21529 16067 18877 18376 3553 3158 11845 15026 17117 25834 25568 29128 17205 8940 4578 6859 6775
21514 6775 9732 9043 -3881 -13389 -13846 -19173 -16929 -4875 456 -2916 -20256 -26511 -22442 -12827
21500 -12827 -3840 -3259 6384 9498 6304 4525 3101 9468 12258 -578 15215 24321 26930 21958
21486 21958 7077 1091 3379 2924 8668 9346 -8811 -27205 -27922 -17745 -7396 7947 17415 19706
21472 19706 12898 21036 14305 482 -2678 4696 -3634 581 17026 20642 23731 19294 9014 -1272
21458 -1272 9836 8516 9304 -12194 -18186 -17721 -8051 -16946 -20989 -29900 -30995 -9301 -8319 -14594 -11144
21443 -11144 -1169 11582 5371 -11255 -7321 -7981 -951 -6848 4638 18439 23889 17247 4963
21430 4963 -7976 -22895 -21922 -15984 -15441 -7966 12224 11389 7719 6243 -6101 -943 3056 8565
21416 8565 19871 31161 28496 26363 20974 11674 8240 7286 11912 -6012 -8182 1158 7997 -1307
21402 -1307 3526 13967 25387 35225 27000 5347 -4149 -14026 -19458 -9745 -2714 -3536 7179 2435
21388 2435 -2729 -5327 -4321 -2218 -1947 8481 -6586 -18766 -8393 638 3466 5652 3819 -6409
21374 -6409 -1380 4152 3851 4559 3251 11370 21592 27074 15944 10238 1953 4700 7037 9632 10872
21359 10872 8727 17749 25079 13301 16290 29887 23750 12064 3272 -518 -207 1717 -206 -7113
21345 -7113 -11281 -6126 3520 11884 19567 19632 13151 17611 26200 24753 20931 25597 14211 9670 11940
21330 11940 10979 2409 -4663 -3689 -9991 4608 13182 18292 27982 18308 23356 28907 12434 7021
21316 7021 21437 4108 -2893 -6037 -6411 -10797 -7238 -20855 -18681 -9976 2188 4648 -5012 -7998
21302 -7998 2518 9213 9256 3712 -10861 -14492 -4643 -7090 -8561 -1750 -8250 -17574 -1465 16994
21288 16994 21442 31303 25179 5607 -2771 -13745 -14974 -9202 -8762 213 7823 -3312 930 2509
21274 2509 12428 5671 -283 3242 5277 15387 37212 31225 8026 -9378 -10233 -13323 -14847 -12058
21260 -12058 8724 18221 14944 15090 19018 -6 -8203 4216 11835 9692 1135 9507 -11530 -16994
21246 -16994 -14363 -10826 -11535 -7337 6714 -579 -1819 -4277 504 10858 11460 7388 -4793 -15625
21232 -15625 -15736 -3819 -2796 -2826 -3814 668 -10189 -15189 1432 2478 -3694 -1945 2242 9887 24546
21217 24546 15876 23094 20475 21764 31787 30567 33199 24199 8426 4213 10695 13822 11705 12755
21203 12755 15249 3512 11365 8026 2739 -4231 -1835 -3585 -4273 -965 2504 7445 4237 711
21189 711 -8696 -13167 -10110 2124 4696 15480 14418 16109 21730 12761 1998 -4807 886 -7068
21175 -7068 -155 -2074 -2736 -3859 -5757 -2179 -3165 -9605 -19346 -12495 -6187 -2828 820 841 14164
21160 14164 14541 -921 -1353 -6652 1274 297 -10299 -13628 -22370 -8537 -5875 -18687 -30419 -14473
21146 -14473 4723 -1302 -3127 569 -4751 -4030 -4752 1707 9713 7250 600 4495 -3220 -6895 5532
21131 5532 -1200 -10929 -18070 -3248 3626 9151 3135 7952 18898 18881 18200 23593 4449 -9688
21117 -9688 -17268 -26546 -21296 -7906 -5529 6733 16916 25319 13725 1737 7537 11829 10929 5903
21103 5903 -7811 -22315 -13053 -11554 -8427 -7421 8029 12687 2501 2414 2476 6405 15877 15601 12389
21088 12389 4360 423 549 5301 9233 14008 16662 23034 19451 17387 19426 17708 8595 6881 7006
21073 7006 -1323 -1623 3075 18784 15946 9509 8088 -5043 -3351 -3413 -18587 -19114 -10538 -16126 -11954
21058 -11954 -10827 -11699 -15198 -18684 -17775 -5622 -6842 82 3133 14133 18246 25765 2301 -22022
21044 -22022 -18156 -14745 -22306 -31187 -37090 -43580 -46718 -39202 -37708 -21759 -26496 -30348 -6392 656
21030 656 2874 -2654 200 12606 15182 16534 7918 1288 -17036 -14843 -13699 -15362 -10165 5405
21016 5405 9416 8333 11335 16066 19496 -3429 -19287 -10014 6786 6090 -8015 -15588 -12588 -12141
21002 -12141 -4875 -7976 -5917 499 6475 -4703 -2085 -1774 4004 -256 635 3005 6097 5244 1728
20987 1728 -1960 -11189 -16705 8096 11411 -12701 -38165 -38163 -21142 -9274 -106 10455 8309 16167
20973 16167 10058 -63 -3369 -8779 -6548 278 -5737 -22657 -15715 -6364 11207 10323 -6318 -438
20959 -438 12276 28050 19439 6120 1781 4603 6894 12769 23395 7337 -5617 -13322 -4257
20946 -4257 -609 7966 543 1342 -1236 -5888 -1947 349 4545 16403 19969 14882 12396 3690 -860
20931 -860 11675 10734 6703 -550 3572 5228 1189 -11370 -3858 713 -1103 2701 -11415 -16636
20917 -16636 -8781 9918 5613 9322 20220 14607 14094 2252 -5756 -17037 -17833 -11614 -6914 -17058
20903 -17058 -24879 -14288 -8493 177 5529 508 4340 5191 6529 9338 15543 17036 11151 -9099
20889 -9099 3384 7220 6887 7070 18142 24454 35083 40936 27550 -3406 -11507 -1372 -2676 2018
20875 2018 2051 -9689 -4462 115 59 -3446 -2622 -4137 -1802 -6934 -5919 -8535 10055 19319 5262
20860 5262 426 -750 2150 7713 7230 16281 21646 12317 -2447 -5139 -3485 7761 9247 6465
20846 6465 6512 9652 19591 4454 -3581 -6037 -2982 1212 -1251 -1468 2405 7185 -5241 -6678 -3708
20831 -3708 -4818 -7057 -2076 11358 20933 12543 15293 4029 -3696 -11091 -10116 -14215 3276 9338
20817 9338 -8993 -10008 1676 -4180 -16369 -19379 -22803 -7376 6612 -9122 -11456 -13984 -12029
20804 -12029 -3057 90 -7583 -12420 -5176 15778 27869 21648 6235 8174 16599 6252 -11816
20791 -11816 -11360 -7916 -10962 -6190 1529 -5952 -17417 -22436 -4193 2246 5595 -7177 -8699 -6845
20777 -6845 -9428 -1832 1971 -3979 -15749 -20789 -17642 -12541 -26184 -26462 -15681 936 21426 19165
20763 19165 -10357 -9965 -3585 10826 11133 9914 -8092 -15640 -7408 3944 7377 11215 16956 10591
20749 10591 3368 -711 -2572 -2896 14773 17060 6343 -11154 -11150 4416 3815 5407 21051 12391
20735 12391 7075 9199 5500 2482 8451 2080 -1137 2994 19966 29906 20948 1519 -4120 11045
20721 11045 23504 24377 13191 11027 12463 11264 17803 12541 -7917 -24275 -22849 -27127 -18449 -10262
20707 -10262 3637 5148 4234 1943 9741 4 -15049 -15964 -15576 -9439 -16180 -25311 -35530 -24483
20693 -24483 -8927 -1335 -11997 -13114 -16852 -9780 7126 10746 2087 -3181 -4878 7177 11831
20680 11831 3638 2986 2388 -1498 -9803 -9888 7535 16226 -631 -362 2075 4635 -6615 -10093 1170
20665 1170 3258 11161 31750 37464 24474 5363 10451 28469 33951 19050 15443 15027 17867 21656
20651 21656 15084 3274 -13227 -10969 1713 10230 1587 -3166 3473 18032 20487 28573 24074
20638 24074 21398 20838 2256 -8314 -6906 -20808 -11879 -840 -5590 -16203 -27863 -25629 -28842
20625 -28842 -23262 -3337 4638 14976 2448 3324 22558 20241 13263 3644 -6105 -3961 1077 19852
20611 19852 34654 24644 27680 21166 17199 7277 5792 12050 24680 32727 19090 6518 4468
20598 4468 -610 -1191 8035 665 1074 7330 7876 2625 9281 27421 35016 30564 51832 43961 29623
20583 29623 22044 15856 8375 5065 27145 30822 21591 18498 18817 18648 25954 16442 18716 23608 18440
20568 18440 16208 15295 16100 11264 -8652 -5337 10913 -1536 -4595 4783 -1169 -4694 -7345 -14285
20554 -14285 -1585 596 4483 13954 13374 6588 -4624 -12559 -12542 -9387 6174 22515 17714 10922
20540 10922 19364 23584 17950 4175 -13697 -8838 5083 5867 108 9924 3468 14277 4127
20527 4127 11343 13126 -672 -6247 -14802 4484 14354 4790 -4368 -14223 -8339 -161 9157 10131
20513 10131 308 1135 1831 1831 -4207 -2573 -2937 -11783 2518 8291 -1942 -1225 -5366 -13132 -10608 -6601
20497 -6601 5963 7746 3525 5869 3518 -11366 -25204 -15401 7166 8812 10963 6605 5010 12435
20483 12435 23426 27871 34945 30953 17972 4439 7650 3708 3739 18051 20724 18482 14399 21364
20469 21364 26770 26846 22156 16099 11079 -8555 -19225 -11358 -5589 -6824 1547 17841 14119 17572
20455 17572 8872 5587 6548 11933 8976 8491 10259 22175 19593 10393 -4249 379 9807 6229
20441 6229 7134 6828 13267 13991 16841 10722 -11944 8816 19474 -2043 -7248 -3663 -599 529
20427 529 9052 12282 17280 2701 -16872 -21281 -22832 -19888 -16087 2234 20987 12465 7956 12086
20413 12086 4020 1278 9096 10327 16316 13025 -3557 -5567 -6297 -13546 -6236 -2033 -718 -1792
20399 -1792 22498 25332 32190 36741 22797 -3646 -14463 3904 13253 6183 19588 17156 22955
20386 22955 26160 2636 -5118 -18078 -20090 -13723 -11757 -7809 3429 7826 14032 26786 18448
20373 18448 8068 7930 -7580 -11477 283 15582 22760 20565 13506 11523 13640 -3209 -13710
20360 -13710 -19591 -28419 -15811 6151 4577 -13445 -9430 -2729 2393 -4581 1591 -2544 1214 17401
20346 17401 29566 26763 16244 13618 7455 4735 6054 5914 -4327 -2699 -6527 7408 10425 15989
20332 15989 25047 29433 13237 -53 4713 12763 8373 6569 20067 21710 24073 30969 35293 34631
20318 34631 33514 26113 18264 6700 6536 -2598 -12556 -2531 11077 15059 11426 10867 1838 7537
20304 7537 11902 13425 23852 25038 23708 23879 20909 9406 15993 33137 24611 16824 20307 4020
20290 4020 -4588 -1514 -10469 -23032 -9725 13891 8779 10372 18966 18612 18639 6331 -10818 -13013
20276 -13013 -9285 -3778 2781 10194 10956 19697 17700 10028 7997 7835 8301 -2583 -15718 -14980 -12686
20261 -12686 -3229 5255 6631 8234 3923 -127 5892 16031 13480 19021 21862 9965 -10740 -18541
20247 -18541 -15171 -15046 -12543 -10506 -6663 -5470 -2608 7427 1769 1258 6806 -2048 -11907 -14471 -13749
20232 -13749 -10942 1782 -230 -5630 -7402 -9205 -7650 -1616 -2545 -1205 6557 1381 1826 13817
20218 13817 10375 230 3850 553 -1822 298 15242 13878 7659 580 -2784 -5302 -1714 -179
20204 -179 18123 15118 4607 8282 14622 11544 12229 19552 18423 15870 17519 20428 19819 27915 44393
20189 44393 33382 24016 17245 5422 -8991 -1634 9478 4815 14287 22620 21962 21480 -75 -4018
20175 -4018 -13558 -9952 -3622 1681 2092 11396 18796 12422 9642 11297 8609 10883 26743 25294 25570
20160 25570 24524 12481 780 -8945 -1319 7613 7788 16952 23475 25584 18953 26335 21466 10318
20146 10318 7994 24261 32042 26229 33230 22119 8759 12983 21352 25066 19015 5363 3424
20133 3424 8234 11024 16823 17196 6527 -7169 -8173 -19019 -15684 421 7340 4537 150 11093
20119 11093 -1426 -8567 -7047 11173 19343 10991 -11000 -15173 -11941 -8356 -14024 -6629 -6596 -5428
20105 -5428 -12605 -7027 -5701 -1133 21364 32262 25879 11249 1432 3545 10250 15284 17337 23025
20091 23025 23711 24566 34346 38653 27356 9843 16046 24946 14505 3432 11646 30987 32073 24485
20077 24485 36295 26066 14330 1639 -2304 -8204 -3661 8323 22398 27796 13690 7548 12546
20064 12546 25380 16578 1393 -853 -10369 -9312 572 6948 7899 6158 11318 25070 8976 -7107
20050 -7107 -2088 11631 3527 2594 16229 15229 9173 1603 9967 10892 3640 6066 6276 6664 7509
20035 7509 7483 15586 15558 16243 15813 16132 26377 30998 36563 37266 25681 24616 35632 22771 21509 30529
20019 30529 20363 13626 16048 13539 12306 10201 627 -10958 -7540 637 4710 10409 6263 13820
20005 13820 7880 329 6141 8481 15221 14666 23567 19169 12708 8230 12010 14386 12851 9957 30636
19990 30636 27321 21870 21348 17807 18185 18946 15836 13733 14238 17334 21636 25603 21228 26200 18914
19975 18914 11168 16965 20315 19743 16691 15352 11677 18891 26974 15916 6920 -2162 -2336 11418
19961 11418 23549 30007 11629 2256 7788 10956 9836 14992 10780 19253 21916 17732 12751 4561
19947 4561 3313 -408 -2243 -12806 -20034 -4269 4528 16506 12345 -1450 -10899 -3767 21899
19934 21899 26410 31113 19307 7311 6057 5243 15127 33923 33178 9211 -4945 4458 3678 6543
19920 6543 8505 15410 17719 18988 23264 20377 18121 41844 48956 43355 22258 28560 16726 12614
19906 12614 13823 8039 5859 12045 16896 17772 28661 26888 29924 34186 32494 27962 20077 24965
19892 24965 37389 37259 42908 40448 44911 45773 40636 25602 28755 28530 44278 39535 33075 37509
19878 37509 38996 34014 52325 52899 45389 30730 26464 15688 7792 12776 20913 20868 30135 31831
19864 31831 37919 40884 40420 31333 31103 32606 35163 38015 43604 34921 50368 56923 49812 47797 37109
19849 37109 22104 19995 42705 63535 65131 88904 118384 159209 194942 209834 199298 171439
19837 171439 150653 134725 122538 120292 112791 106391 109232 136078 169173 195503 208071 204637
19825 204637 179749 159662 156279 145899 146804 156332 159204 132478 104619 96774 93356 81143 71177
19812 71177 67469 45104 41293 41959 43216 51255 49360 59529 55255 48758 41326 52113 69219 100687
19798 100687 126127 126932 107629 104145 97952 81051 93810 101222 113022 124279 113988 126317
19786 126317 173349 211455 231031 252442 254264 260885 254106 229933 191383 184467 195382 185967
19774 185967 183132 197893 200644 185914 151578 120193 98925 96922 94446 82130 71025 73954
19762 73954 70209 57253 40796 31441 36736 53659 57459 44736 49610 56834 46887 31510 38965
19749 38965 44409 34576 27283 33164 39777 37657 37638 24166 18705 32562 32798 22331 23815 25875
19735 25875 36935 40474 39579 23831 9286 14565 26931 33347 20162 9921 8929 14660 29383
19722 29383 32635 38890 31081 30062 35404 42651 46526 44474 48277 65801 60662 45214 55294 64411
19708 64411 63660 50322 46749 38733 55562 57887 35248 31555 40466 38646 42824 57907 67318 63432
19694 63432 49131 51260 47484 29158 17705 15680 21872 35345 39752 37243 43195 34168 42752
19681 42752 38234 40825 39854 33372 33720 28361 23994 38924 52673 51494 38212 33318 23761 13276
19667 13276 7303 21831 41900 52198 44530 37334 42522 61283 73950 70045 60907 49538 50607
19654 50607 53394 37895 26861 30003 31030 41760 48550 56496 53011 42470 45633 50908 57999
19641 57999 57376 53833 51030 45493 48803 54218 53540 51964 50404 53564 40769 32361 37122 39900 38737
19626 38737 28878 34538 40121 43985 43392 51081 59015 56884 48569 53679 65143 67572 55844 53120
19612 53120 44453 46390 55256 57548 57150 62336 69342 56573 55360 49292 44484 59297 63543 65953
19598 65953 63115 54430 58527 65806 60866 62448 76992 85263 78133 72121 72887 68985 77208 82738
19584 82738 79987 82272 79378 75528 85451 89819 70234 64924 79228 88289 77199 77948 91815 73051
19570 73051 61395 87218 93643 81173 68583 66969 71535 67848 62813 70454 78129 77996 70766 60610
19556 60610 63784 80610 92306 97923 88383 90973 91187 97351 120009 123359 116009 108106 104439 103478
19542 103478 109711 107765 100001 99518 97747 97225 80145 74525 74407 72000 78270 80544 91413 107265
19528 107265 112363 105593 111742 116989 119680 112249 123972 130338 122785 127028 127160 128205 115418 97858
19514 97858 110041 114724 118275 111147 103545 94709 78902 62519 58281 61243 68752 68123 62786 67840
19500 67840 75291 79851 75045 73443 82334 86618 93815 101372 129795 127014 113537 113585 120636 127860
19486 127860 126972 111728 107889 116383 124695 133443 126566 119402 123476 117068 110483 98035 100872 86383
19472 86383 72653 83052 100834 117941 132226 141690 141562 138415 134210 132577 124593 116032 103456
19459 103456 98230 91886 92932 96997 100650 108603 108323 110624 124707 139263 137657 140410 161653 169295
19445 169295 175685 172298 156066 145130 139518 132505 123488 121789 123063 125259 119432 132610 143534
19432 143534 155621 160591 150606 160146 160077 161030 166100 170155 159421 149934 148373 144806 143243 146711
19418 146711 146872 153582 161146 181737 189642 195429 196197 201038 211147 210993 201859 198342 188086 195211
19404 195211 199440 211215 212204 205522 203768 211387 237344 242640 246758 254280 257920 271359 284509
19391 284509 274151 256567 237265 223665 228082 205066 196858 214980 234118 252946 265474 265299
19379 265299 265335 275881 286689 282344 287252 299073 300697 307248 328967 345942 359386 365686 384145
19366 384145 410605 428579 457718 480929 485583 504274 522157 546551 569925 603583 648720 706836
19354 706836 776532 876594 1025149 1183792 1316595 1363978 1362443 1360060 1357823 1361584 1403396
19343 1403396 1466918 1552068 1643881 1750238 1855078 1955896 2081021 2242935 2444581 2734470
19333 2734470 3179081 3861888 4842504 6067996 7377539 8480644 9053228 9127021 9029185
19324 9029185 9220514 10039210 11816848 15014510 20228387 27719308 36765686 45835678
19316 45835678 51842694 53270240 50629978 45893818 39846967 33283722 27102313 22263122
19308 22263122 19251543 18146499 18494674 19518602 20232596 19657198 17654802 14808261
19300 14808261 11985009 9665470 7995661 6893816 6189539 5694206 5290772 4939403 4663666
19291 4663666 4452072 4292347 4210373 4181750 4165340 4140058 4147409 4227401 4421604 4794380 5397648
19280 5397648 6328476 7753291 9818970 12512886 15535180 18229562 19663128 19555353
19272 19555353 18459819 17536150 17688581 19629014 23693265 29689985 37119325 44778953
19264 44778953 51562163 56566489 58589092 55499662 47733084 37667046 28305279 21006792
19256 21006792 16198387 13401320 11970868 11447974 11419695 11466046 11058624 10010085 8504061
19247 8504061 6959644 5637736 4628716 3931484 3444279 3094672 2821197 2614369 2440408
19238 2440408 2294836 2157979 1990803 1828653 1666996 1524981 1403367 1297748 1235867 1176107
19228 1176107 1116113 1084842 1036597 963620 910118 856060 797331 749080 718254 683600 645468
19217 645468 608937 570992 531811 503792 470356 444209 417554 395933 372794 332200 306729
19206 306729 280253 276736 278196 256417 235356 230796 228106 225231 223338 204045 195196 193716 185260
19193 185260 185131 184122 161789 152481 148402 141770 122931 108623 106567 110700 119379 127963 128132 109485
19179 109485 95058 93351 101010 106627 109470 99704 95548 96426 86792 85662 78622 69772 70937 70381
19165 70381 79521 93556 97203 81280 80062 76057 64638 70915 68131 76712 79677 72473 69546 73648
19151 73648 79198 68355 73487 70550 59264 41040 45868 56497 51587 45255 49249 47932 39461
19138 39461 34047 40878 52566 58414 35616 28059 10996 540 978 9741 5769 31149 45293
19125 45293 53000 67137 65473 73368 52787 45394 53861 46259 37140 28613 19059 10320 10543 19322
19111 19322 38089 50073 40811 38241 26303 24058 16824 32346 33831 35739 62752 55952 36996
19098 36996 22322 20154 31158 39111 19671 8592 12563 5185 698 -16211 -9475 10396 17427
19085 17427 25530 29176 13337 7966 19821 26571 24296 38489 41772 28718 37449 37745 28572 44899
19071 44899 56506 45661 34440 36603 35756 45185 47358 51638 42959 47373 42495 33171 32154 35101
19057 35101 28729 34556 35459 21543 16045 16279 17061 7957 17443 14579 10208 21700 31963 27601
19043 27601 15021 27348 36911 38999 38486 27514 15760 22134 26046 17890 13088 20642 21674 16831
19029 16831 19076 20936 18646 25491 38174 33911 30836 20691 30252 35601 34842 27330 32246 48640
19015 48640 42653 51629 39422 19165 3354 -7636 -4301 7548 19491 21517 28455 29868 31414
19002 31414 37941 25593 17388 17273 14566 13861 17118 13848 10052 13664 27586 32023 41422 46670
18988 46670 46576 44960 46063 55463 60228 45535 39332 48676 35033 33800 15919 6357 3539 1683
18974 1683 9149 21691 39413 42104 41542 31807 25893 28242 23879 27307 30000 12211 14422 24926
18960 24926 37002 39204 22704 18237 9115 -2342 4022 7402 12813 9088 15763 21436 8413
18947 8413 19223 26853 33218 49290 53163 49939 50495 47220 40220 48676 36080 29437 37218 40421
18933 40421 44308 51966 44201 34875 17024 3013 13780 24075 24221 24337 32777 36159 36223 37039 47249
18918 47249 31566 33856 30430 38731 51680 37622 25202 24001 29222 28002 32845 41146 47227
18905 47227 36612 35791 41504 34559 19997 24867 28237 42814 47976 55917 70074 77848 80600 65944
18891 65944 64417 76710 88462 90458 82938 85995 86932 84959 95503 105176 108810 120785 136376
18878 136376 143882 132626 138966 135159 135343 139587 134133 149613 144900 139943 145445 127306 107201
18865 107201 90001 90004 102314 103075 91315 73556 64675 70661 76516 61783 64473 70471 66236 54013
18851 54013 52657 61585 79136 76975 81073 87707 82028 67877 49228 41385 33209 27301 30350 42035
18837 42035 47582 53071 67968 68544 66680 63747 47523 56460 62570 65227 64079 54471 55717 62603
18823 62603 62246 77527 82394 87769 83887 76473 76302 72185 71233 68140 75523 66608 70671 75258 68235
18808 68235 71555 81705 74540 75111 76972 98254 131616 167168 187487 192470 197477 196300 204952
18795 204952 206988 206292 209111 213674 228252 246233 257824 253770 235430 197243 166618 144940 129590
18782 129590 120921 119893 110031 109472 111977 118070 117374 113812 111460 113019 108042 106891 107022 104632 104948
18767 104948 109743 114961 139496 167686 190625 190225 160947 141144 127103 108544 119006 133016
18755 133016 138690 154226 161924 180138 204176 233010 245427 262169 269218 267469 263104 252036
18743 252036 240648 234043 214995 189070 191905 206295 218253 242309 264582 289360 303776 297076
18731 297076 273168 237612 194744 178400 175115 167119 169066 176969 198588 227364 250566 264570
18719 264570 263769 240665 236203 246918 267985 295446 342142 440157 574385 718979 819862
18708 819862 860872 853710 784656 667931 560302 470696 395402 338582 310901 299083 315074
18697 315074 360005 385832 360759 306134 266108 245894 207958 197804 193897 192314 191502 185312
18685 185312 163646 174678 189979 192508 183877 178211 183332 196508 202160 195353 201211 204732 200239
18672 200239 213606 241948 282299 313821 350036 385731 393634 385705 393973 388828 388589 401341 432310
18659 432310 490915 554156 644558 742438 829207 863504 850459 782540 672656 549142 479020
18648 479020 438511 411770 411777 412096 404116 419805 435431 450100 443813 428198 420280 420995 433688 451276
18634 451276 458998 464304 468366 472598 486869 506272 512407 540068 575603 611396 640200 654817
18622 654817 684368 722000 764931 816445 862367 910927 984327 1043678 1098643 1154418 1190782
18611 1190782 1248647 1322632 1391752 1461134 1542602 1621847 1701545 1794210 1911725 2044038 2186902
18600 2186902 2362930 2549264 2769612 3045134 3387489 3788848 4268680 4846657 5566591
18591 5566591 6451637 7549940 8921882 10636583 12710281 15093561 17669977 20234641
18583 20234641 22616969 24687773 26513510 28225609 29947754 31607179 33011272 33876115
18575 33876115 34005753 33391695 32190725 30682261 29119807 27549570 25851870 23890659
18567 23890659 21588653 19044248 16474492 14051735 11929436 10149048 8697046 7527624
18559 7527624 6576103 5787845 5154910 4622931 4176461 3795612 3475426 3193798 2944204
18550 2944204 2726016 2538043 2385452 2245276 2127638 2015525 1909532 1801060 1702325 1631060
18540 1631060 1569121 1496404 1427131 1356191 1290810 1220680 1150941 1084664 1027986 957404 891472
18529 891472 835635 793548 775627 747530 708284 667396 656109 646828 626331 608234 592121 585705
18517 585705 579643 561471 537460 515258 516713 493185 455582 441566 414826 398968 405355 417004
18505 417004 428056 431233 427317 414211 396181 379336 368682 360076 345740 344792 307623 286334
18493 286334 285454 277261 242573 227548 226423 220105 231303 226249 220292 214338 206731 195038 213406
18480 213406 214518 215777 218463 224533 219271 219987 223355 235717 252833 271540 283906 287577 310367
18467 310367 341382 372248 393864 424707 431729 453629 475099 481935 473873 473336 453818 440706
18455 440706 412450 385785 373435 348168 331815 332340 316693 291473 248009 229886 231806 208399
18443 208399 185809 166670 147726 126218 108054 103885 110801 117087 131122 125058 127504 119029 121379
18430 121379 125179 116351 114929 106375 110195 123443 125030 119885 129034 146142 150937 152660 153095 165488
18416 165488 179392 168205 169848 176024 173463 158955 151264 139342 142272 151917 134983 135102 137567
18403 137567 137807 131129 115327 93702 95055 101116 109174 110508 112416 118478 121159 122616 113934 107425
18389 107425 112535 111994 114268 115057 110861 94568 88547 101361 108707 113284 116834 108940 99669 107723
18375 107723 101607 94574 89772 86574 80976 95754 107896 110645 124324 145831 148974 151826 152114
18362 152114 146029 141035 135673 135699 118254 97655 102816 108606 102025 103109 101834 100231 105820 99934
18348 99934 106496 99724 95385 91634 92686 95251 105477 109009 103937 96480 75540 81228 88412 67735
18334 67735 68456 86185 91253 85688 66370 58599 54429 62825 74708 70134 58091 68427 77926
18321 77926 70580 64004 55197 59561 65117 59507 71600 75340 80296 81077 65600 66557 73021 70517
18307 70517 65873 58179 52364 55237 58962 49588 62141 70543 58907 65836 75221 68472 70718 71456
18293 71456 79008 89255 87872 70316 69116 75628 78352 92703 104293 92343 91165 97447 90730
18280 90730 98415 85773 76581 86467 88428 86092 83142 88095 98347 95057 96657 97265 87927 90172
18266 90172 98635 88461 100571 109596 116156 123803 120253 126778 127876 111444 117884 132177 131638 126730
18252 126730 132396 132284 147416 132144 116358 117218 114883 102463 100886 102601 105229 106365 108147 116244
18238 116244 122606 127091 131908 140839 149976 144455 143251 127765 114679 102670 95551 102446 100264
18225 100264 89259 106388 117972 112322 111471 111743 119499 108401 121400 140269 147833 142325 140784
18212 140784 132797 128735 132248 134978 143127 129309 117938 106982 103397 103640 99937 88300 89816
18199 89816 95820 111420 112329 120712 118090 116885 114024 108330 101752 95175 101545 116844 125018 133044
18185 133044 128090 122165 122149 119296 126604 129508 139722 139764 125710 127138 140977 127994 108705 108659
18171 108659 117583 131518 133298 141730 151257 153089 139392 135233 141282 141931 136647 145589 170833 186879
18157 186879 187028 189677 188123 174503 179849 196836 200069 190203 189646 206861 212794 218924 227036 239307
18143 239307 246419 265379 277893 276400 276476 284944 304504 315842 304863 298006 297261 314201 343054
18130 343054 376836 394766 425183 458744 482375 495910 509664 544281 607673 676751 764077
18119 764077 835587 919855 1000951 1101949 1241002 1421546 1681179 2026092 2525046 3254192
18109 3254192 4363844 6184777 9454985 15346199 22819200 25232044 20821046 13400590
18101 13400590 8291686 5582646 4095296 3202131 2617336 2218942 1920455 1670727 1466837
18092 1466837 1297102 1150577 1038703 949443 868419 801590 749651 699343 664619 627778 600969
18081 600969 571880 543272 530344 512270 489808 474956 460964 451690 434577 428094 428648 426451
18069 426451 434017 432751 438267 440884 437456 440348 429604 408465 415891 443239 463428 447794 448041
18056 448041 452830 469378 484571 496917 507329 524122 555686 586606 600531 610511 625399 635095
18044 635095 659241 703063 758756 818335 868317 927818 996745 1075365 1155528 1243930 1345268
18033 1345268 1462916 1602444 1741159 1886539 2065567 2306003 2610292 3007203 3566456
18024 3566456 4295293 5053348 5717854 6396648 7312647 8420877 9324955 9986926 10889502
18015 10889502 12649487 15561127 19604983 23963313 27674043 31323607 36512852 42829534
18007 42829534 46398477 45739639 43581941 42486171 40890656 37082785 32321878 28566469
17999 28566469 25798689 23198802 20859123 19450775 18855094 17981018 16314001 14357499
17991 14357499 12780603 11513274 10156292 8666984 7320729 6306776 5625541 5150699
17983 5150699 4803401 4568848 4439230 4352876 4288783 4270395 4331576 4448721 4678147 5072209
17973 5072209 5714914 6662309 7915898 9296309 10528112 11702542 13211762 15088189
17965 15088189 16620022 17426715 18171863 19786226 22138035 24538498 27355203 31410290
17957 31410290 35924882 38625543 39431376 40779507 43074557 42725484 38340844 32583148
17949 32583148 28439430 25327945 21802533 17873402 14503199 12190240 10826696 10124058
17941 10124058 9498557 8599195 7592351 6781083 6140470 5477929 4757041 4121709 3636063
17932 3636063 3252012 2941836 2703063 2517265 2355106 2220720 2101857 1998634 1913692 1840402
17922 1840402 1784666 1720609 1660844 1608681 1577970 1554467 1536286 1507643 1483138 1474863 1443822
17911 1443822 1407352 1362404 1339369 1345111 1331872 1317955 1314725 1322483 1328859 1343654 1363699 1384176
17899 1384176 1424176 1474913 1517272 1557511 1595184 1642840 1713219 1792862 1866075 1976157 2095425
17888 2095425 2232559 2384502 2550788 2759310 3011069 3326192 3688191 4137643 4712997
17879 4712997 5416697 6302428 7455658 8939740 10840771 13253166 16180506 19410045
17871 19410045 22531361 25060595 26856915 28287859 29947426 32138669 34604324 36630782
17863 36630782 37485427 36862880 35049260 32764522 30699817 29159301 27804862 26020234
17855 26020234 23479034 20354596 17126938 14204930 11792086 9902057 8413321 7230004
17847 7230004 6294322 5542787 4930248 4426959 3991114 3610805 3271716 2995392 2775194
17838 2775194 2583464 2401879 2262317 2131548 2017405 1908831 1815868 1740057 1663900 1599498
17828 1599498 1519028 1432389 1356033 1294820 1240342 1173404 1108494 1042557 996730 959667 922951
17817 922951 897545 873361 849178 827057 798346 767208 748513 719590 690875 658732 623156
17806 623156 586275 557433 533565 511777 480606 459967 435826 413864 383731 358440 333734
17795 333734 325674 326063 310665 290941 271133 257749 250730 253144 239162 233943 232164 227464 228513
17782 228513 222050 195330 193735 198346 193223 185292 185997 180062 175330 168457 158087 158639 167960 152886
17768 152886 154809 158742 149552 147268 156567 148236 130095 129508 130614 133670 138468 142675 141825 138736
17754 138736 123785 115197 110335 104465 103194 99846 101073 124574 140208 152734 151686 152142 135883
17741 135883 124526 119000 100705 90054 81904 67517 73997 77250 68664 59688 66259 63319 53391
17728 53391 39712 36464 49513 49736 44495 51044 59305 59885 59757 59038 50059 37631 29169 34523 46022
17713 46022 45663 42803 51634 55674 69833 76720 71446 68606 65112 59409 58331 52421 52458 63443 51699
17698 51699 53464 57679 64537 70339 61642 60693 60806 67360 63062 58739 54874 43154 35760 41146 33831
17683 33831 36954 54538 65491 72376 66603 56315 59354 64438 51478 56005 68340 72564 71204
17670 71204 70007 78515 91004 101085 114477 114952 115495 105120 81846 83019 85951 79547 81977 101836
17656 101836 113809 112565 92502 81874 86060 75246 58665 57796 73928 80772 93513 102061 96589
17643 96589 92177 80310 67541 60817 65096 68004 78903 87499 93663 96014 93989 97451 86579
17630 86579 73014 88557 100998 115945 113252 116611 118746 102901 95677 90039 88192 111916 106472
17617 106472 107429 111111 103827 90509 94332 109196 129356 139136 148707 150159 146332 138274 148005 137948
17603 137948 144896 163291 174627 177936 191281 202773 208257 204660 207432 207435 199532 224426 238521
17590 238521 239145 240294 253980 257132 260496 263826 275304 293988 299969 318172 339947 348961 338822
17577 338822 335395 361543 386488 406802 430830 443039 470707 496553 528839 580573 629593 668037
17565 668037 698114 730202 768508 812527 858791 908939 975247 1057986 1160031 1256853 1365928
17554 1365928 1470388 1545961 1629312 1734208 1872159 2044945 2239584 2459802 2722977 3028142
17544 3028142 3376702 3792634 4334612 5049225 6000079 7269675 8936771 11140334 13959996
17535 13959996 17254957 20541143 23080658 24406773 24756528 24986900 26005504 28333629
17527 28333629 31870373 35724038 38394016 38605971 36252329 32455015 28758604 26183415
17519 26183415 24912288 24533704 24211914 23089815 20842775 17836103 14710612 11972194
17511 11972194 9823371 8180026 6941379 6008557 5266325 4679927 4215833 3823079 3491624
17502 3491624 3202718 2953454 2724594 2535371 2359265 2193915 2070959 1958112 1863038 1780048
17492 1780048 1678560 1564206 1442173 1316874 1224878 1157620 1087551 1019238 939392 877519
17482 877519 815171 751936 703107 677999 653648 609534 570823 535508 517805 477550 449306
17471 449306 425270 396599 381202 356235 334541 318848 300965 277821 277687 287373 287617 284789 284944
17458 284944 276613 282894 302927 309392 298639 293472 299764 295925 278693 252989 251174 254202 248869
17445 248869 239507 242523 257230 267629 268734 280992 328228 365200 368368 311807 247408 219391
17433 219391 196299 174556 156874 144884 131913 123314 109493 88516 74820 72148 75556 70673
17421 70673 66311 52510 61966 62580 65551 62945 44296 52641 70988 78918 63011 47352 55091
17408 55091 48355 52843 58146 58743 55311 57863 63589 60241 58738 47527 38954 35433 33308 7142
17394 7142 -11721 -5375 19214 24780 19411 19401 6219 1446 3178 -3254 -16495 -15634 -16708 -11775
17380 -11775 878 20532 22302 16305 6402 7124 5648 2179 4108 15197 15479 25915 16367 -12267
17366 -12267 -2124 20073 27470 19235 -82 7837 14317 -13106 -17894 -10565 -8176 -3195 6461
17353 6461 6368 -4359 -2054 -12007 -1107 4199 -17409 -22064 -6781 9770 14676 22589 29594 26258
17339 26258 29800 27571 14964 7085 7973 11762 13440 17414 31653 35375 34173 26469 18099 18951
17325 18951 8180 5198 9570 20854 41094 35747 23621 18873 6518 5312 -952 2155 5721
17312 5721 11381 10036 5533 -1887 -2844 -16534 -2768 7191 14839 22813 21600 11927 -2325 -22165
17298 -22165 -23368 -7672 -8025 -8978 -6887 -4227 -3007 -259 6699 6171 4558 5354 4420 13670 14933
17283 14933 8366 337 -12080 -14590 -16214 -11022 -9562 840 15621 28439 34832 44889 44419
17270 44419 59578 86201 115551 128554 136125 139802 143277 155530 166112 180058 179714 185333 196104
17257 196104 193063 181686 164505 156818 142830 120093 124949 123451 110914 82561 58581 48749
17245 48749 52402 59964 46608 25702 9005 4573 -3763 -8890 -17226 -15952 -4493 4276 15708
17232 15708 9337 -4751 -23496 -25071 -6682 -914 320 1014 7440 786 -9086 -9036 -6364 -11041
17218 -11041 -13423 -1078 8679 -8534 -1739 -2471 -15512 -20292 -14912 -14012 -15009 3935 21265 19878
17204 19878 7838 -3457 -7892 -10886 -28032 -25204 -16173 -4158 -1724 7425 6565 -12031 -17052
17191 -17052 -21190 -22472 -26920 -23401 -31869 -35622 -46669 -50581 -35134 -26544 -23544 -18869 -12549 -15441
17177 -15441 -25123 -26437 -24566 -15411 -13779 -20572 -24723 -17496 -15192 -11945 -20978 -21502 -5901 18174
17163 18174 17117 5360 7292 13411 11237 655 593 -9183 -12218 -705 3881 -9367 -11603 -3331
17149 -3331 2266 3638 8355 -563 5712 21975 37402 37710 31408 42563 60614 70645 86574
17136 86574 118750 178030 269999 386218 540641 709081 832887 880795 857924 773056 651063
17125 651063 494728 354268 246961 181751 133369 86224 56398 61530 60521 42423 33195
17114 33195 15595 4958 -6290 -5066 -1597 573 -9259 -14800 -17631 -23582 -12546 -1871 -7265
17101 -7265 -8131 -11861 -25808 -24865 -18869 -7189 -4322 5949 11914 12439 8597 3411 2018 -1274 -6100
17086 -6100 -5973 -5835 -8917 -10875 -15519 -24314 -28560 -36122 -34226 -28405 -32676 -29817 -30627 -32284 -32638 -23881
17070 -23881 -20183 -7163 2278 8455 8814 4965 -20659 -29454 -15379 -13345 -19351 -15566 -10251 -16179
17056 -16179 -27132 -15881 -8707 -8256 -18732 -16185 -15027 -970 -3751 5679 11029 -4584 -10104
17043 -10104 -6202 -5274 1832 4209 -4919 -11638 349 5311 2571 2142 -13552 -18083 -20379 -6749
17029 -6749 7289 3760 -6397 -14298 -9690 -241 -522 -20987 -21396 -21421 -2735 -4186 -11297 3979
17015 3979 3875 -18118 -25550 -17969 -23361 -12822 -17580 -30487 -39283 -42808 -33063 -24399 -24335 -8076
17001 -8076 -6869 -8892 -25865 -38326 -46598 -44697 -41150 -43762 -35338 -29718 -24894 -24089 -34797 -30869
16987 -30869 -18311 -13885 -15392 -15918 -12742 -21734 -28906 -22666 -18274 -20102 -3531 -2244 -7392 -20309
16973 -20309 -21114 -14938 -13025 -7881 5044 14938 14309 -398 -13053 -9090 5678 2565 -6667 -4910
16959 -4910 2418 827 4146 3371 -1743 -497 -865 -686 -4068 -16478 -18395 -2888 829 -2413 -859
16944 -859 5571 20819 15783 -4948 -10111 6210 19762 31521 43043 58866 81930 86498 113290
16931 113290 125634 133176 135103 137462 146520 168843 192292 197503 184808 182172 165836 136240 120673
16918 120673 101666 97549 99514 95239 83069 79823 75141 63456 49024 33484 15224 13880 24024
16905 24024 36142 27451 9606 6013 -5144 -6134 -9151 -16284 -24489 -36035 -33317 -35374 -33903 -15124
16891 -15124 -601 -3695 1130 -6239 -9514 538 2230 -2236 -9276 -12058 -10089 -15577 -14567 -1502
16877 -1502 -6157 3969 -5167 -10540 -10364 -37907 -35144 -37392 -38990 -28861 -27349 -21978 -8339 149
16863 149 -7163 -17437 -28886 -21510 -18163 -21460 -20143 -14483 -3195 -14373 -18185 -15739 -5857 -9774
16849 -9774 -15650 -12411 -6166 -7887 -24026 -24877 -26879 -28317 -30655 -29860 -24366 -15838 -11653 -11258 -18049
16834 -18049 -23911 -12506 -2601 -6628 -25619 -28558 -27803 -27412 -30443 -21689 -18255 -26656 -24056 -4806
16820 -4806 -8538 -6214 -7483 -19516 -31612 -27154 -18972 -13547 -18203 -19689 -10847 -18210 -23937 -28752
16806 -28752 -19474 -15115 -15383 -16896 -21233 2849 7847 4994 1021 587 -6168 9 5053 1142 -6780
16791 -6780 -304 15124 -5289 -15580 -22020 -23358 -21636 -15235 7661 26933 24804 9283 -4358
16778 -4358 -4154 -5961 -19737 -37975 -40364 -37711 -30239 -37986 -23866 -15636 -9461 -377 -1456 -1241
16764 -1241 5351 355 -7058 -9984 -9160 -4757 -5329 -3114 -8901 -757 -4102 -8061 -15848 -15428 -6724
16749 -6724 -12061 -23433 -23667 -22973 -6470 -3726 -14915 -6788 -9682 -27062 -25969 -15105 -15431 -14206
16735 -14206 -6070 -718 1645 1374 -11909 -15572 -21410 -22815 -23050 -18612 -22185 -25543 -21578 -11744 2361
16720 2361 12641 12262 10880 -6847 -1734 5393 -18536 -35947 -19432 -1608 -2682 -3619 -6165 -13494
16706 -13494 -9587 -7913 -10333 -1235 14356 8935 -4690 -1360 -1936 -2397 -4236 -1284 -10967 -20885
16692 -20885 -9097 -10014 -11761 -6803 -7903 -1294 -3115 -10919 -21498 -22454 -18218 -4776 22957 33371
16678 33371 20613 4902 -13588 -20858 -28217 -34348 -27526 -26672 -13719 -3961 -8072 -13781 -8952 -8621
16664 -8621 -8569 -13020 -23831 -24755 -20578 -27935 -27699 -17553 -10572 -28991 -41243 -34796 -12732 -4391
16650 -4391 -8793 -2618 -3994 -527 5077 -6226 -12416 -21958 -24442 -19780 -16543 -20194 -23725 -13212
16636 -13212 -3982 -8906 4618 2894 -4727 -13559 -23941 -30625 -27289 -28475 -21120 -10938 -31531
16623 -31531 -35187 -28158 -8882 3648 9896 13885 9559 -7238 -13033 -1935 3164 5662 14841
16610 14841 3627 -3190 -7922 -12675 -16819 -24368 -27710 -25829 -8155 -10597 -28315 -30245 -15158
16597 -15158 -5636 -12813 -11831 3453 9882 7150 507 4449 9998 10241 -1746 -15084 -21265 -18492
16583 -18492 -17761 -14892 -12823 -10600 5218 2164 -6304 -18060 -22016 -9204 95 -3219 4344 4691
16569 4691 -4346 -21021 -33117 -28872 -13733 3959 11566 1484 -10313 -13925 -2247 5868 2130
16556 2130 -4477 -4389 -12060 -18786 -17248 -7744 -16439 -35430 -25516 -9322 -9304 -5044 -187 -560 -4955
16541 -4955 -4693 -9787 -9988 -28711 -28671 -30659 -40858 -36564 -26731 -7042 -10895 -10259 -9143 298 281 -6945
16525 -6945 -5924 7756 7691 22885 2663 -5156 -4330 -257 -10500 -5990 4276 2568 6691 5267
16511 5267 -1578 -12707 -9765 -8739 -8223 -20335 -16144 -5557 3829 -192 -12481 -14502 -1489 224
16497 224 -5381 -3258 8722 14573 11613 3974 -238 -17760 -24230 -15992 -14932 -18605 -9774 -3296
16483 -3296 4157 5569 -6879 -13894 508 8230 -10493 -25170 -20960 -20357 -21455 -25593 -33467 -31790
16469 -31790 -15007 -11840 -21743 -25020 -28217 -27222 -14019 -8661 -7504 -4937 5610 20283 22838 20700
16455 20700 15891 9966 11693 1869 -10776 -8963 -8381 -7814 -13584 -19061 -17338 -14610 -8013 2634
16441 2634 11844 5144 -676 7383 14402 1677 -7721 -1827 3663 14699 5522 -13626 -13544 -12841 -4000
16426 -4000 -3773 -4677 -9569 -13873 -16139 -22455 -25231 -25785 -8359 4873 12862 3701 1375 -1498 -13279
16411 -13279 -24426 -20532 -21318 -20592 -9712 -11982 -9568 -9763 -21342 -20929 -24559 -19773 -22683 -10044
16397 -10044 -16359 -26579 -31885 -16073 -1850 540 4183 8686 17246 19867 11268 8690 -264 -16590
16383 -16590 -20952 -18487 -8107 -8374 -13372 -15287 -3856 -10240 -22830 -29928 -22348 -10075 -4314 -1014
16369 -1014 -11905 -22094 -28688 -21717 -14523 -7087 396 10003 6233 867 9986 13303 10955 2926
16355 2926 -7370 -8879 -3695 -14056 -20031 -16650 -13339 -20011 -18486 -1364 6659 2382 6908 15619
16341 15619 4842 -8102 -821 2563 -3026 -10036 -11612 -17069 -11833 -2260 -7192 -15220 -17786 -15850
16327 -15850 -4195 -2838 -409 4205 8368 3681 -7423 -11138 -6041 -5192 -5366 -10432 -7589 -10782
16313 -10782 -16332 -23984 -26580 -9621 1034 18691 22562 22463 2737 -7348 -12434 -17853 -13236 -7871
16299 -7871 -15335 -15329 -16833 -15751 -6105 -2494 -9023 -15719 -6441 4876 12084 7753 1680 1635 1480 -17826
16283 -17826 -15124 -3683 -7811 -22078 -34404 -37754 -32851 -26724 -16851 -1443 -5736 -3958 6440
16270 6440 -2901 -14795 -16778 -7836 -2163 -4481 -4306 7498 8756 5917 -367 3188 6432 8877
16256 8877 3135 2177 -1411 -4416 -6669 -13197 -20964 -15981 -12446 -12653 -19212 -16048 -17212 -20235 -17536
16241 -17536 -18108 -30819 -32656 -17153 -14116 -16900 -11366 -10155 -16557 -34502 -33801 -20459 -18541 -17237
16227 -17237 -11229 -9839 -14634 -11623 -244 4821 7618 -5485 -9685 -5456 -1733 12119 15760 22353
16213 22353 24314 11015 788 -5859 -1206 -11249 -15592 -4139 -2114 -17530 -11683 -10114 -13819
16200 -13819 -8930 -3350 -13843 -19998 -11542 -17816 -26097 -22695 -7664 182 -10993 -12482 -9459 -11722
16186 -11722 -10864 -9326 -15461 -19798 -24124 -19099 -1132 13674 -2939 -16148 -14841 -5789 -4868 2102
16172 2102 10559 -3568 -2685 -7927 -6189 -2047 -8253 -1572 -8570 -20152 -21304 -22467 -23136 -19721 1200
16157 1200 10231 16998 13790 -10081 -14187 -6418 -4962 -9837 -18072 -17481 -8261 10470 9222 -455
16143 -455 -4388 1902 3675 -8469 -11571 -4401 14986 4741 -7451 -782 17890 30544 8615
16130 8615 4642 16045 17865 6035 3530 3362 2138 -12838 -21218 -12476 2572 9674 16947 19877
16116 19877 9297 4512 326 11279 13730 -2092 -12368 -9997 -9867 -19034 -9505 4101 11918
16103 11918 -4231 -23151 -15130 205 18744 16968 5449 -17527 -23505 -5950 -5592 -3233 4947
16090 4947 11927 1979 -3422 -8657 979 676 -8192 5224 20832 26318 23379 12140 -1412 -6225
16076 -6225 -9824 -15150 -21244 -16958 -7279 6697 2551 1169 11695 9977 -567 -8466 -3868 6089
16062 6089 5490 10489 -8215 -12586 -7914 5330 13823 8708 -7570 -5478 -8118 -13244 -10709 -4968
16048 -4968 3038 877 -1216 -2206 4956 2276 -6280 3259 15822 23831 22983 23267 19153 25408 17630
16033 17630 4291 -5588 -5830 -7188 -11683 -12243 -12869 -11582 -9983 -16097 -14297 -10523 -895 -7081 -20769
16018 -20769 -23320 -8313 4810 2698 1894 7839 6287 276 -12741 -27398 -25997 -17013 -9317 -13704
16004 -13704 -26197 -30005 -13502 -5934 -6500 -11127 -11818 -7446 -3299 -3462 -8491 -5335 -3692 -4805 11522
15989 11522 20240 13494 2860 -1087 1289 10381 9355 8023 9162 -9777 1263 7780 7261 -11023
15975 -11023 -2973 3184 -340 -7077 -10024 3474 4572 671 11497 15524 7197 -4998 -7344 -13950
15961 -13950 -25771 -17725 -5872 -20120 -30152 -15813 -10568 -8085 -6316 -9298 -10615 4661 10855
15948 10855 7896 481 -4071 9475 23853 20610 -157 5178 9792 14305 6357 8710 4462 4283
15934 4283 -2583 -13463 1377 15438 14412 10697 21537 25053 8648 -2477 4980 2304 -6285
15921 -6285 -10168 -17987 -12727 -1945 -4778 -10392 -10580 -3185 13983 7622 -13810 -16095 -16899 -16112 -8887
15906 -8887 -7529 544 -5783 5302 16251 2998 -3736 -2508 -16298 -29209 -15219 -9586 -7414
15893 -7414 8972 7723 12703 13311 7742 2569 -303 -14045 -21006 -15081 -18899 -16789 -9162 -6060
15879 -6060 -704 9853 10443 18986 16833 1034 -2474 10454 11859 11646 4925 -14258 -16572 -3389
15865 -3389 1436 -1366 -5736 478 817 -4036 358 8238 9862 10349 4937 17769 30040 24142 27230
15850 27230 26730 16371 13926 688 8887 16287 -11511 -14332 -1897 9208 24057 13615 2654
15837 2654 -13687 -20895 -9574 -12242 -18352 -25910 -18240 -5176 -3786 -12449 -14370 -1167 -4575 2885
15823 2885 17057 21355 15935 18455 312 -7586 -11087 -17345 -10311 7743 -4278 -14468 -7077
15810 -7077 -7649 -19530 646 3750 -98 -4600 2362 1338 -13497 -16981 -19462 -17885 -9384 -10777
15796 -10777 -10678 -18732 -5450 834 12189 16893 13442 7896 547 1031 -11865 -13659 -10773 2113
15782 2113 4384 8279 9889 4230 5860 8588 -4138 -711 -3146 -4451 6806 5230 2820 5207
15768 5207 6434 6791 12858 10164 7245 3906 -5149 -7991 -20860 -29226 -23587 -6062 540 -1443
15754 -1443 4288 -6992 -18501 -14497 -2249 1345 7590 -596 -2028 21075 15848 6287 -8136
15741 -8136 -15630 -19418 -13330 -2150 -8260 -9553 -3658 -691 8767 10087 8589 20891 8172 10425
15727 10425 17633 16366 15740 4436 -8105 -11927 -5378 -1734 -3774 -8915 -6127 -7752 2790 11011
15713 11011 19229 23050 18948 20902 16226 4575 8702 20767 23317 25078 32895 17976 7737
15700 7737 4419 3568 -4250 -1359 -4151 11519 14448 15955 3844 -2694 2075 11901 8037 2826
15686 2826 -3660 -8688 -1417 -6786 -3045 10276 4084 -15114 -13415 -19222 -25110 -23721 -14132 -5786
15672 -5786 -8839 1947 13476 15828 9764 5921 1401 1444 6187 4096 3443 13438 17884 9539 11466
15657 11466 7327 161 6863 1333 -59 1929 6279 4056 17278 28252 28149 18153 10048 8819
15643 8819 9118 954 -8768 1482 16172 32106 35763 26131 11294 2199 9709 7405 -6209 640
15629 640 1277 5088 977 10645 14108 26570 25381 13593 3293 -58 -467 -12446 -17299 -7128
15615 -7128 -1387 -9232 -15529 -15207 5023 22420 27440 18013 5833 14169 20298 19440 17076 4974
15601 4974 -8413 -1269 2644 4529 -689 16452 23385 24436 28450 32926 33663 19902 12617 1324
15587 1324 1562 21519 26310 23762 18444 6043 -4733 3328 14881 15845 8905 -2767 -9499 -7009
15573 -7009 -22105 -28542 -38033 -23474 -3145 6252 6993 10140 8909 4310 539 -6432 -4679 -777
15559 -777 2158 4182 11686 15869 23226 21240 2206 5748 20457 23278 11194 -4741 -16696 -16087
15545 -16087 -16036 -16961 -17413 -11637 -6402 -5409 -146 5467 7746 16089 17050 4698 5206 15845 28645
15530 28645 36052 36994 34649 23137 20999 10538 9628 25600 29996 16797 763 10076 7874 5772
15516 5772 -2030 -2287 4753 8496 3958 11131 15070 17242 20688 1161 886 13624 3299 -1832
15502 -1832 -6339 -5195 -8144 -7328 -22 7974 6670 -8171 -15573 -19217 -11121 -6664 -12577 -4599 5977
15487 5977 8855 9035 6429 14480 11384 263 -943 -6511 -10121 3810 11126 9217 881 5076
15473 5076 17333 26286 26730 28980 24590 1959 -6133 2407 23785 29216 18287 18442 20177 10752
15459 10752 -5154 701 -2358 -4322 -8539 -2363 -4908 -9807 -1506 -3258 16803 37614 27977 7214
15445 7214 5399 -1685 -9479 -4420 -251 20093 34542 22268 11577 8226 16125 13727 11768 13854
15431 13854 12558 16357 15712 6597 2138 6989 20966 31367 44596 33589 29257 21844 32316
15418 32316 26237 18608 26901 20690 30322 38697 27626 21522 19059 6107 -4013 -5300 -6621 -10456
15404 -10456 -6779 7700 6573 2780 12491 15927 17466 12477 188 -1636 5898 5462 -7721 -2565
15390 -2565 14317 15113 20317 23919 20911 10496 3025 5547 322 -5017 3184 19847 21176 12977
15376 12977 8212 14638 20558 17261 17281 15248 24403 37303 42719 37692 34816 22229 24087 18327
15362 18327 3606 338 9457 28790 49510 41657 31594 32668 36776 52975 46672 41926 36618
15349 36618 35590 55018 71185 67326 49477 45915 43492 41140 37472 37275 31190 23487 10066 7369
15335 7369 10729 21271 21368 23349 13212 5341 15142 30988 41823 37266 38658 37482 38166 38412 41859
15320 41859 29437 27395 3434 -3449 6685 18062 19980 23975 13261 12520 7851 4450 -627
15307 -627 -3055 7064 14689 17634 15429 9914 19303 28675 21004 20768 22995 27333 31628 28039 12296
15292 12296 10970 11237 18764 28978 27447 22525 19744 24032 24257 37687 42631 34178 30705 25830
15278 25830 30317 15421 3049 16006 27888 25141 34467 28108 23009 18690 34346 33515 32751 46130
15264 46130 55145 61466 57916 56763 67940 77209 92998 101882 113916 128752 158670 204715 251412
15251 251412 291975 333805 394995 444282 479668 509429 507692 513345 513432 501058 465756 409532
15239 409532 360452 313182 271431 225949 187136 160746 133906 109665 104098 93147 70088 49053
15227 49053 37590 32405 33997 44601 47402 33697 30682 32066 36709 41164 49994 54555 49249 47890
15213 47890 56063 64372 57185 41450 33541 23281 16478 16615 35503 47081 43445 29030 22959
15200 22959 20143 29602 35126 36127 34968 34095 47272 46271 46429 45096 38231 41317 57100 51052
15186 51052 38887 36029 39400 47203 32447 29310 31214 24308 18610 22051 25926 34860 50698 46892
15172 46892 43773 31606 31537 24863 12104 5242 6886 17527 21177 23079 26194 25364 31358 48727
15158 48727 39388 34837 32680 36018 43040 33663 38196 54773 46818 36901 33660 33295 42895 45111
15144 45111 36365 43763 36079 43598 41888 41288 33548 36101 46935 38261 45140 46310 47673 51523
15130 51523 40754 32827 37108 31210 36757 35768 45705 60384 58203 40411 35475 42831 41340 40388
15116 40388 53223 50507 49123 48484 47893 54209 49176 36627 41442 52497 63566 63686 53743 41216
15102 41216 44465 42959 50546 46502 32641 35361 40001 46978 50991 46962 42277 44135 63523 63242
15088 63242 55937 60229 56660 59606 57634 63817 82636 69881 49704 20859 26490 33054 44903
15075 44903 54845 51970 48325 65504 81952 87762 74978 64889 80660 83514 99592 101777 100082
15062 100082 104204 115343 132700 135251 132826 122870 110121 115459 124696 115259 112451 89989 91456
15049 91456 87177 78187 63504 66438 82260 79923 73785 81624 78896 87095 78320 42804 27808
15036 27808 42780 57954 59531 67595 62240 67575 66799 75693 86145 90872 76927 68687 80699
15023 80699 88278 90803 83533 75923 74540 66045 53447 56180 78057 82941 62093 45801 54667
15010 54667 59555 51284 49759 55862 62710 64637 47717 34504 32441 39328 36521 4668 -9874
14997 -9874 7651 15752 2498 17517 42322 70321 83441 93378 90335 95013 100779 105340 106820
14984 106820 97895 90028 108789 111339 109169 98243 88764 91219 94860 104941 100945 93077 81988
14971 81988 77799 85607 93289 89679 82456 86616 90992 92407 100764 113477 120043 121052 104757 98960
14957 98960 95271 110204 132235 136986 146065 152216 150247 135550 141248 151729 157774 166545 170320
14944 170320 164859 160103 172378 177923 174899 175390 170894 168294 161426 163055 160481 158724 136577 122479
14930 122479 117277 99085 91422 103464 111086 105945 104210 100859 117795 127176 126421 136713 153239
14917 153239 172109 195498 208381 221200 230776 215371 209988 210331 212548 218379 214779 211374 212841
14904 212841 197667 198857 196612 190706 203358 215164 221188 217679 220465 217197 234849 226855 222114
14891 222114 221137 229047 240757 240939 244554 253622 272986 279156 287952 285911 281448 294458 296119 309986
14877 309986 322335 336362 350983 354014 356458 359689 366205 393649 419187 432097 444139 449405
14865 449405 459290 463521 475617 479298 493459 517888 535932 550791 583901 602726 633116 670780
14853 670780 692860 708940 725670 758594 799323 847317 889571 918735 949762 996506 1061670
14842 1061670 1119636 1186492 1257341 1332797 1419085 1519831 1628468 1764586 1909888 2046702
14832 2046702 2218469 2419224 2664486 2958542 3344681 3814113 4353339 5002810 5745882
14823 5745882 6595281 7585136 8754729 10163372 11893989 14100490 17071465 21141924
14815 21141924 26610417 33705293 42359011 52216786 62741069 73290758 83153004 91577454
14807 91577454 97731157 100860884 100580222 96964907 90521397 81995517 72217846 61946894
14799 61946894 51824713 42465004 34373156 27798179 22736340 18979631 16186556 14039501
14791 14039501 12301702 10842403 9593700 8498163 7532724 6687511 5946729 5298756 4745380
14782 4745380 4266227 3858212 3505768 3201696 2938292 2712637 2507797 2332534 2171942
14773 2171942 2034811 1915352 1813289 1712144 1595046 1489920 1397984 1314549 1241498 1168149
14763 1168149 1118153 1077342 1015017 935404 870893 822231 782403 747344 699252 663639 619066
14752 619066 573425 552515 516080 484273 459294 433599 407070 384654 370059 354716 338513
14741 338513 313683 293315 283860 289374 274545 255356 247014 239832 247938 239814 229490 230878 221773
14728 221773 208531 190363 165193 164937 157771 156902 161625 165541 154352 156004 146366 133626 139337
14715 139337 141824 140542 135287 133455 129855 114473 109102 110138 116380 121272 119399 113336 102904 79645
14701 79645 74647 76156 87196 88567 88888 99877 93708 91426 95002 109295 115102 113842 107262 101862
14687 101862 106136 117214 117300 109433 112022 102666 86717 82600 80667 78862 73094 62966 54960 50648
14673 50648 50908 43790 38583 41794 33203 32575 37421 34997 30550 30375 27799 16275 24744 24296 27272
14658 27272 31382 36511 36555 19756 16540 35212 54707 47327 24268 24866 26994 33004 36759 38508
14644 38508 31366 20336 13447 16640 13237 27607 24242 17939 23080 14365 15823 21725 13704 19751
14630 19751 23438 21757 16942 10730 15851 10237 22957 27427 26007 42451 46803 42767 37236 40254
14616 40254 38725 42140 43437 39666 40465 35839 38862 40615 35241 32728 36246 31324 18749 16213
14602 16213 13591 22990 22902 36683 39953 28229 21693 32061 40156 36404 10354 -5395 -3086 -1226
14588 -1226 9885 13485 -3696 -4150 -1549 -15684 -17992 -2424 10864 205 90 857 -4075 -9266
14574 -9266 -5875 -311 -10025 -1538 128 -19799 -24386 -25142 -8993 -6011 5639 11357 4822 11420
14560 11420 13127 8841 18291 21880 12234 25576 21593 7552 17948 13114 10195 1757 -5054 -1652
14546 -1652 8783 11311 -5033 -13507 -14831 -17785 -19690 -19450 -13958 -14368 -15898 -13735 -23769 -28332
14532 -28332 -29590 -30553 -39741 -40757 -38958 -28871 -20456 2270 13243 15224 585 2483 2682 -9486
14518 -9486 -32755 -35419 -26842 -21618 -27602 -15380 -11557 -16076 -26093 -17033 -1978 5103 17870
14505 17870 21578 15847 7968 5930 2449 9138 12276 7452 2653 11849 27986 36063 35794 28581
14491 28581 12211 8576 -1607 -6174 -3774 788 -9486 -19068 -16005 -11150 -9118 -4148 -3404 -5239
14477 -5239 -4297 -8367 -7891 -4698 113 -5122 -6400 -1833 -2707 2172 -1730 2237 6430 15529 15151 15985
14461 15985 24814 17749 -987 -2481 223 -3321 -5385 -14774 -22121 -21670 -15206 4682 -460 -2929
14447 -2929 420 1834 716 -581 -6020 -9350 4856 669 -2019 4084 4364 15335 24277 28828
14433 28828 21545 16156 17113 3463 1048 1405 -2095 -11043 -5265 -13356 -11838 -13272 -4833 -2757 2310
14418 2310 9971 12765 14291 10990 11581 10227 3903 4749 12496 10087 6853 13007 9893 -6706 -29097
14403 -29097 -33602 -22073 -22588 -18304 -10304 -10340 -16007 -8777 -1643 11517 22464 27991 23233 14777
14389 14777 12306 2877 -1127 3991 7273 16994 15028 3601 7014 20640 23385 30385 36913 43952
14375 43952 41090 35281 55701 68019 96614 130230 163664 205155 247392 286470 342464 411152
14363 411152 459525 498888 519039 517954 486059 453858 417313 363945 313040 259256 211523 179588
14351 179588 150800 130912 123853 111531 91889 81170 77264 62063 35424 12949 10885 17876
14339 17876 26560 21458 23699 29400 16534 17813 22481 33743 37974 23216 1363 -17133 -12776
14326 -12776 5613 3691 13819 9563 6174 15623 11790 6215 283 4885 2629 2538 4623 -6850
14312 -6850 -13339 -12457 2683 -193 -11157 -8924 -3099 -4529 -11618 -18468 -16900 -7847 5609 11263
14298 11263 -4228 -10146 -9523 1720 8757 18429 18381 21912 12014 2044 -13541 -17003 -2478 -12747
14284 -12747 -13917 6523 5180 -12645 -16077 -13551 -16261 -15824 -20126 -19081 -18919 -14550 -8471 -9460 -5081
14269 -5081 -10769 -13980 -13962 -15249 -5343 -14880 -17743 -12671 -6706 -3453 -1216 7396 26036 35639 27533
14254 27533 15033 11842 14531 12757 13121 10877 3930 -11693 -19141 -29074 -24965 -20716 -12716 -8839
14240 -8839 -4713 -11692 -4168 -2202 -1643 -18302 -22570 -21603 -21200 -19363 -20288 -16356 -13583 -12391 -600
14225 -600 1600 1557 -8238 -18234 -16176 -19049 -19532 -9959 -11038 -11766 -13719 -14602 -6822 122 100 -4581 8669
14208 8669 12416 -2819 -9303 -624 3615 9436 -7941 -17253 -3855 -2048 -4607 -17857 -23644 -25867
14194 -25867 -12081 1431 5088 -3128 -3219 8675 8921 -1861 -5098 -10400 -11456 -7763 -9025 -6995
14180 -6995 6345 23973 27376 26500 21816 15733 30820 56100 53838 48643 50698 74109 92069
14167 92069 109851 145619 185507 208172 209018 202118 185277 149113 125431 112980 114435 106428 79613
14154 79613 66443 66309 52053 40321 37421 40159 22602 20623 12119 18723 19092 15162 9573 -678
14140 -678 4000 5898 18481 19898 9279 9596 4694 2682 -3950 -7920 -20206 -15722 6465 -274
14126 -274 6889 25986 20683 9716 6206 -3077 -10399 -2865 -11589 1329 12309 11667 -7484 -9087
14112 -9087 -4850 -2647 -7243 -6213 -7307 -9330 -25146 -22316 -13603 -14952 -21024 -18851 -21182 -16389
14098 -16389 -15771 -3029 8276 11416 8956 2318 16059 1279 -5923 12050 16206 3376 2203
14085 2203 12311 12069 15365 23813 13712 21 -583 11100 14849 14116 5025 -2686 -2261 -699 -6849
14070 -6849 -10075 2611 4225 -6464 -13616 -17939 591 6333 12574 10284 791 -9112 -11646 -1095
14056 -1095 -15734 -25605 -13650 -8237 -13233 -11474 -12007 -13233 -10880 -8136 -10534 -2053 5469 11357
14042 11357 19829 14340 6270 9013 6725 12096 17342 21899 17956 13113 6071 4417 -5905 -15162
14028 -15162 3359 1306 -7465 -14370 -21933 -6462 -685 -54 11033 4059 7587 3456 -4039 1994
14014 1994 4274 12254 17206 364 -3083 4431 19299 23743 17363 18264 19709 16936 12474 13369 5297
13999 5297 20184 23398 7989 -14965 -35759 -35267 -28146 -23282 -34556 -31522 -24709 -18654 -20689 -17905
13985 -17905 -14162 -15240 -16139 -17859 -12061 -3242 7332 3865 -1546 -438 4162 -3096 -6231 -8499
13971 -8499 -17185 -4469 6618 13202 21309 10919 -3302 -15427 -5942 -6123 -4635 3822 11187 2293
13957 2293 -780 -2169 2950 2384 -2584 11271 20214 9037 9661 15204 12542 15935 7062 4179 490
13942 490 249 -272 3073 3252 2389 2589 1542 -777 -4265 -5537 -3270 8090 25800 33365 23581 27409
13926 27409 36035 19726 18509 16119 15386 17731 20795 7494 10924 -386 -14338 -11197 -16487 -20872
13912 -20872 -26191 -19239 -4913 2901 -57 -6265 -9354 -2122 -10237 -14859 -9342 3591 27647 34354
13898 34354 16585 -1988 -14648 -8242 -12411 -19280 -6167 8875 18187 22815 30526 26630 15143
13885 15143 18446 1468 5152 20638 20218 6610 11240 10423 12643 229 -14483 -14806 -4667 -2387
13871 -2387 -11602 -15162 -17135 -6830 -150 -9026 -9684 13230 12598 11976 23385 23848 19767 13112 8513
13856 8513 9344 3509 906 11884 7014 4431 6758 8997 6209 12160 9739 12487 14983 5826 2760
13841 2760 -1424 11150 24331 16680 9760 10958 2830 5559 19614 12640 7593 6092 -617 -8195
13827 -8195 -8448 -4739 2416 5443 12014 14807 8900 6505 -3455 3405 1526 -5205 1508 -300 4376
13812 4376 20941 18919 6388 -1986 1738 437 -3102 -1217 -5132 -5115 -4103 -2214 8961 -1479
13798 -1479 -12410 -8096 10457 10260 15558 4344 3608 6108 9860 9645 17936 25712 23749 27127 24478
13783 24478 19098 12759 -4522 -9425 -6427 -9364 -15420 -18168 -7776 -1100 9645 10680 19156 19240
13769 19240 4697 809 -1875 4142 5230 4876 -1064 -5111 2376 2173 -3019 -13039 -9842 3926
13755 3926 14015 19738 24277 19924 24502 32245 40800 33071 25717 29677 29276 19984 6476 5977 12232
13740 12232 21776 26828 19845 18976 26882 17409 3920 -8435 -10896 -4686 1697 10235 17213 20447
13726 20447 20397 4251 -4633 -917 -2861 3999 4356 -4744 12590 29111 25841 9356 11905 8227
13712 8227 -7746 -1376 7193 -1926 3352 -278 7276 6101 7014 12898 13276 3097 -2813 6821 20753
13697 20753 21914 23300 20595 20998 19993 15124 1235 2462 5160 -6645 -4237 -2429 -1768 -5474
13683 -5474 -21955 -20167 -15956 -20103 -7361 1145 -1601 5392 8202 7617 -739 4493 7792 -2763
13669 -2763 -1283 -3778 -2663 -1577 -1611 1727 -3565 -1648 3538 -34 3468 6404 7947 4600 -6445
13654 -6445 -14115 -4353 -6604 -14923 -11767 -8676 -1021 5605 4908 6237 3237 1812 3042 7971 -2391
13639 -2391 5054 7835 18812 33024 26847 15476 16905 12555 5582 -595 6026 9358 5380 17249
13625 17249 12651 4698 8498 26669 21673 11327 11522 15104 15671 15684 127 -5575 -6718 -3309 -14586
13610 -14586 -520 16017 24562 35751 29513 21023 3999 5279 22063 17207 19040 27014 12140
13597 12140 8015 2014 6292 12902 6478 -616 -83 12279 23604 26344 19598 18155 17453 20164
13583 20164 11380 12237 22785 28056 17654 13965 8125 1242 8967 15242 14713 19078 18402 29257
13569 29257 30718 6019 -323 -6173 -13266 -19571 -5843 11110 13653 14574 9499 1101 5121 16744
13555 16744 20795 22039 17764 20686 18280 11041 9181 2529 10325 13194 11506 21008 23432 18536
13541 18536 12058 6301 6328 6621 8447 3365 225 4822 14965 18383 11134 8663 10460 19397 10747
13526 10747 17127 11551 79 -11709 -9511 -1690 4922 18152 16733 12966 16267 11919 1664
13513 1664 -4913 5894 11172 10232 11164 9809 4365 16722 10149 5701 -2030 7924 18608 18061 27108
13498 27108 24674 19514 8829 11734 11635 24268 38015 32579 11003 1442 -6228 -8946 4168 8519
13484 8519 23328 23719 18795 4798 4385 8649 10092 10796 17892 16279 21614 17250 13759 27561 23852
13469 23852 25534 19991 12944 6843 -67 -6487 -7704 -46 -864 -18628 -15574 4762 30042 34581
13455 34581 20300 12070 21160 29496 13659 -2398 -1156 67 3070 5881 911 2402 3199 5483
13441 5483 17540 28915 22256 25448 22229 12508 3309 16174 29681 9398 -6916 -4732 2160
13428 2160 18416 12962 13558 7570 5686 3606 9118 6081 9955 12799 19060 21614 16655 18180 27814
13413 27814 21479 12730 30574 28934 12714 3266 13543 20800 18526 19759 20104 21783 25968 25270
13399 25270 29982 23673 13223 11365 8035 14001 7027 56 -9524 -3882 -2650 4011 5498 4196
13385 4196 3649 9024 12717 12526 15374 18141 20979 14000 3143 -4450 10239 15672 -12586 -22204
13371 -22204 -23582 -15709 -6585 -7796 -6036 3669 6949 16033 28403 26533 32549 31382 33222 30196
13357 30196 15098 5322 5362 22346 32763 22911 10814 10905 22650 26148 32253 39814 28604 30353
13343 30353 40120 45473 31867 25747 28751 40374 41492 40321 29034 16862 38190 59775 57067
13330 57067 33520 27248 26957 23386 26108 33976 41316 39317 40307 42692 27234 20242 8413 3024
13316 3024 16506 27121 24194 18684 28344 34176 42418 43484 43333 37959 43058 48429 40441 30724
13302 30724 29964 26859 23084 28774 34160 16058 2663 -356 13893 22526 22485 24770 37609 43536
13288 43536 46903 48107 45391 54690 54342 61625 67761 61334 39408 25734 42915 49098 45451 52685
13274 52685 56334 72377 64544 68106 75583 75372 74137 70473 76775 79457 81917 87893 100019 105100
13260 105100 118230 142887 173597 212954 272638 352849 450356 613577 882263 1234809 1529864
13249 1529864 1525956 1227067 866670 598133 428286 332670 266086 227699 212421 191364 162351
13238 162351 142802 136632 118918 106582 103721 96506 87252 83237 72487 94721 100460 72667 53827
13225 53827 45182 44086 43238 44381 23844 -2179 -8241 -6994 4940 24878 28373 34280 50654
13212 50654 67051 72242 64913 58299 63008 51874 38423 43410 58253 75921 73803 71829 75306
13199 75306 79729 74372 76232 66449 72874 56928 43843 40150 53451 68083 86874 74109 67948
13186 67948 56283 64071 67369 65928 63258 60229 51513 51642 53646 43409 27193 22860 27745 39437
13172 39437 39463 34284 26799 39770 47395 49170 47300 49723 53910 58268 52693 35476 32574 43217
13158 43217 61053 62618 47684 30932 32680 48965 77882 76596 67281 56376 35012 59124
13146 59124 63133 52805 44307 52648 53705 45810 41925 46917 51860 52541 59817 51488 47786 49062
13132 49062 35886 30548 36799 30598 26602 30858 39208 46821 63094 82074 85567 67622 59237
13119 59237 64690 62207 58079 42624 35422 39101 47722 60277 55724 47591 52244 55004 56723 48661
13105 48661 35995 30712 42653 35812 35768 34479 32740 28389 26890 21427 24105 35606 37198 25393
13091 25393 36327 52361 66555 61939 64711 84549 85695 78049 71481 75397 74452 74049 78585 77396
13077 77396 85694 86470 78602 76786 63677 45222 28432 33368 46304 71986 80180 77751 88217
13064 88217 87472 83493 89228 75954 71268 76808 93179 93991 82262 95670 94165 106916 120922
13051 120922 124531 114997 114035 117307 114319 112238 106075 116216 145177 177835 210397 233844 187781
13038 187781 135878 119409 110255 79849 81462 80483 80293 81342 88442 99808 115971 121018 116669
13025 116669 124684 119982 117889 125739 111130 83711 84391 97510 103843 108497 105506 92214 80523
13012 80523 89005 96905 90545 99535 99853 82158 59566 55030 53143 59100 71459 79721 65015 58616
12998 58616 58813 77199 84291 77634 71886 90506 89402 92037 105673 100687 100693 91280 75096 58551
12984 58551 35360 17047 2634 4666 15206 20560 15205 22664 51334 72706 94363 103206 112235
12971 112235 109022 115861 100927 79314 74822 83139 94816 100461 104015 93944 91986 102872 111176
12958 111176 135050 146889 143065 116426 101778 98068 110660 111945 108391 116803 123134 130098 142214
12945 142214 144802 128308 118694 125992 120856 111249 122382 138594 148639 183916 195183 193613 193228
12932 193228 205851 213132 223288 223586 226321 234915 236190 250327 268324 263724 264318 278505 308453
12919 308453 341943 364365 384076 376103 298393 180259 82847 52725 66633 75018 89220 109808
12907 109808 138011 153843 156257 154807 171623 169049 169715 183617 202943 233312 254626 259816 272511
12894 272511 291879 287562 275020 259983 257046 262015 254747 249358 247173 246524 254058 249022 259330
12881 259330 280951 310337 318476 326357 327470 323817 337851 343716 353760 365952 394838 414333
12869 414333 429283 440205 482882 525696 528281 508272 491892 471002 460303 461580 473296 489997
12857 489997 518892 544438 557117 570008 580575 587996 614877 634805 634427 663750 689169 708972
12845 708972 743739 757983 773089 802734 843104 886333 920572 954899 1022890 1114819 1192532
12834 1192532 1222492 1225896 1232141 1277652 1351161 1432212 1502317 1563997 1642828 1712769 1812369 1964645
12822 1964645 2102379 2236961 2350858 2469635 2609646 2776420 3017013 3335719 3816480
12813 3816480 4539575 5604396 6840995 7514777 7343661 6762624 6461313 6579300 7032518
12804 7032518 7749364 8719066 9996441 11676689 13693619 15810904 18104678 21083820
12796 21083820 25371414 31516181 40368867 53363009 73227043 104972466 156529761
12789 156529761 231136497 295612405 298332057 240287731 164993466 111142462 78693688
12782 78693688 58847132 46022409 37398018 31338687 26873683 23452518 20720899 18292953
12774 18292953 15987311 13842522 12035403 10606242 9466450 8528048 7719549 7029910
12766 7029910 6408721 5821298 5297190 4887875 4546746 4255485 3991920 3729929 3469059
12757 3469059 3224792 3005968 2820027 2694899 2598627 2478971 2339739 2193042 2059070 1928174
12747 1928174 1816138 1708077 1624083 1563968 1506487 1414961 1293409 1180285 1100476 1048237
12737 1048237 1017414 975025 913466 858661 797694 719926 662126 629077 588525 550789 528141
12726 528141 509613 503547 475714 442949 422907 401545 383135 372790 378104 384780 372304 359396
12714 359396 329024 309132 298339 286466 276276 294335 276485 257650 238771 219818 216926 228348
12702 228348 240200 247199 243244 227724 208151 192852 175096 157993 171059 186611 199974 187671
12690 187671 178177 171053 176863 165936 161277 138643 137389 117638 103118 92189 90949 107356 110902
12677 110902 113270 106544 115251 125943 131623 148798 171219 176729 183600 186035 204800 221669 228756
12664 228756 230676 246725 214237 129507 67600 25187 4950 14996 28733 27343 39530 37086
12652 37086 27391 15332 10037 15430 20182 22879 18855 16723 15307 18289 6535 10590 28042 34756
12638 34756 40148 48045 76359 87823 78849 71220 68021 29053 10263 28065 44496 37360 40565
12625 40565 43157 47447 49857 36658 18878 12271 18735 24735 23858 20503 23018 26003 9099 6837
12611 6837 11489 23418 33049 59168 60396 39107 21598 4281 -2962 3916 28319 48012 61226
12598 61226 80085 108498 106039 94965 106283 107367 96370 56698 29551 25095 20411 7701
12586 7701 5743 16518 26411 21186 18649 21109 25072 35993 45487 42737 36909 41618 36856 31618
12572 31618 24942 32245 26325 20916 30035 25087 6522 -1006 586 -3167 -1714 6719 441 -7913
12558 -7913 -10802 -10772 -12953 -15965 -12391 -14693 -25063 -18137 -7678 -13572 -5224 -11272 -27846 -15748
12544 -15748 -5543 -8663 -8436 -1759 -10158 -13820 10736 23889 16758 11796 22064 20467 8984
12531 8984 3851 -1685 -11180 -11709 -17125 -15142 -23605 -29377 -22217 -5274 -6149 -7172 -184 2172 -5493
12516 -5493 -20862 -20336 -12561 -14681 -20716 -24276 -20462 -1824 5145 10648 12449 17245 3993 -24454
12502 -24454 -32731 -22659 -21513 -24359 -26881 -22808 -13892 -9035 -17777 -19766 -16549 -26255 -24900 -17862
12488 -17862 -27750 -31807 -31895 -21179 -3334 5333 3504 9254 16810 23195 30126 22324 8531 -11235
12474 -11235 -14279 -2498 2279 4361 -3262 -4996 2490 -5390 -16344 -19188 -20679 -12826 -16937 -25374
12460 -25374 -13205 -1248 -22142 -12772 -1038 -3385 -7043 -5788 -11045 -14814 -6857 -9940 -9400 -1811
12446 -1811 10326 20937 24963 16428 5793 1585 2740 -12502 -17392 -3761 16042 21954 10298
12433 10298 15122 18196 2946 -15475 -8172 -9493 -6819 -6991 -8997 -6008 -15086 -11126 -1219 -858
12419 -858 -2970 -6596 -173 -10749 -20556 -21098 -9939 -10403 -2824 -5020 -7331 -6884 -13316 -8711 -10469
12404 -10469 -17172 -7659 -2732 2182 6442 -9755 -28392 -33994 -29596 -29090 -30719 -21356 -18785 -23884
12390 -23884 -16791 -16481 -7408 2405 -7993 -22739 -35030 -24147 -8853 -2295 5248 -7183 -10657
12377 -10657 -7787 -4176 9158 544 8690 9650 1356 4072 21719 41976 54389 40510 26675
12364 26675 19141 22550 2312 -26352 -22830 -7121 7145 6347 5251 -926 -14523 -6424 -4960
12351 -4960 1369 12160 7016 237 -1931 -15420 -4563 3550 6112 5667 13811 27696 38818 35275
12337 35275 7827 -8218 4821 28003 42235 44316 59810 74929 74231 80174 96315 128576
12325 128576 178678 220551 291232 394440 551483 818209 1200765 1523536 1540195 1248544
12315 1248544 869574 591988 420712 315299 244411 195762 155302 139307 121062 107985
12305 107985 93114 75536 64812 53169 36611 37730 32744 24071 29608 23449 18943 28228 34228
12292 34228 48404 41152 32052 35243 26094 21168 32706 27967 25331 34638 31237 25686 11779 13295
12278 13295 -87 -8684 -15535 -7808 -4458 -11478 -13660 2860 4926 -1221 -6261 -5432 5865 12166
12264 12166 7570 16919 28169 25105 20555 22054 27176 20635 11301 3397 752 -5231 87 -2229
12250 -2229 594 4381 12004 18086 21343 22547 19479 20080 21816 14658 13192 9475 -3462 -14138
12236 -14138 -15990 3608 7830 8667 23985 30433 18639 5953 7509 -457 -16336 -13275 -8108
12223 -8108 12714 26199 15595 -7892 -20282 -23791 -18700 -16456 -18707 -7511 -8953 -9380 -3935
12210 -3935 -3066 346 -4410 -8460 -4946 4907 16331 8021 1828 3197 7292 -1402 -12466 -15245
12196 -15245 -14632 -22265 -12075 -1788 11974 26868 34975 24787 17260 32372 23295 9987 11480
12183 11480 5675 -15446 -30586 -27473 -24068 -5789 -4349 -5033 10957 12419 15840 10151 1563 -1130
12169 -1130 -3996 -7298 7244 13261 13735 -1581 1305 8738 17877 16271 16221 14167 5531 8425 4780
12154 4780 9445 15001 3645 -6984 -11390 -8252 -8474 8801 11564 11611 19225 17936 11315 6380 14445
12139 14445 15781 14227 14603 8501 2109 4855 14994 10762 -7785 -18920 -22612 -13699 -15805 -15945
12125 -15945 2817 13554 5443 8916 6749 5941 7479 12165 12848 19024 19424 16366 10754 11535 10518
12110 10518 9159 25232 24445 10669 744 -4625 936 6881 6372 2807 1949 8258 5256 -6020
12096 -6020 -16128 -4364 11298 12650 5250 4898 13675 23558 12898 -15451 -15606 -8314 10089 6747
12082 6747 5565 15372 -5347 -17069 -7714 -2026 4886 2579 -2080 -2210 -10894 -8351 5342 28677
12068 28677 33595 39534 42461 30252 17761 11993 18328 8414 -5452 1338 -4400 -1753 4473 4080
12054 4080 -16480 -18455 -12502 7559 19068 12549 1570 340 9804 28841 31993 32233 24069 19472
12040 19472 13403 4666 -4226 -14485 -21109 -11756 -6413 -17656 -18983 -7112 -3127 1355 9479 16892
12026 16892 6223 -7519 -14735 -21646 -5527 3611 432 -14914 -15719 10679 10308 2893 2052 9421
12012 9421 8538 11688 19053 22139 5515 -1174 24793 27946 31711 15755 18501 16974 19487 6789
11998 6789 -4548 5907 20639 19919 5885 -9552 -14204 -10813 3758 25111 27178 23165 9636
11985 9636 10363 7753 7338 16060 19376 25825 29587 16598 6745 -3129 4245 5250 7182 14832 35622
11970 35622 52628 55047 52239 50772 43469 40255 29351 22982 24866 31263 28674 13107 2340
11957 2340 7640 21008 21058 23597 17567 25611 42263 32010 23958 35580 29126 31870 32916 27735
11943 27735 20284 25924 19898 19823 34336 33829 34671 22581 8794 5541 12093 11191 16274 17839 16838
11928 16838 8324 8388 17630 19768 45452 55171 32314 21006 25230 21088 29974 42780 56031 70588
11914 70588 76443 66935 58179 46473 40557 46024 49717 40101 49015 36671 14912 17463 23968 15975
11900 15975 22208 31234 45418 50549 53516 60626 53754 48847 30710 34839 41682 46915 46793 39830
11886 39830 21888 17116 10176 11871 12378 23110 35478 38513 45641 36126 35736 45176 58400 52008
11872 52008 44756 40574 22232 29386 33097 28941 34678 40931 26763 27146 30604 36434 35482 30787
11858 30787 21355 23419 26985 30509 41183 47120 46268 49720 37615 42133 52113 52471 56081 54100
11844 54100 44295 27584 32825 30914 26191 37007 47249 45844 42715 37599 42120 45811 48670 51927
11830 51927 51704 61069 63805 66215 57282 49424 38615 43008 51251 59784 68242 73057 64895 46260
11816 46260 50591 52681 45312 44460 42342 47573 57929 57974 67622 56956 55323 58565 56483 48636 54088
11801 54088 52027 47735 61237 67264 70942 60237 67143 69475 60246 62668 46330 40858 48713 56589
11787 56589 54533 46210 52899 53934 59090 52419 52224 52514 54085 61387 62118 57115 63997 56028 39735
11772 39735 41550 35328 31389 41698 46236 56413 65291 63662 50019 48290 53745 66854 72604
11759 72604 70742 68042 68494 78132 69783 56641 60217 73617 76683 78783 74237 67886 72813 65569
11745 65569 59014 50416 54271 65649 69109 70205 72848 81668 104068 104142 100332 94446 86462 64903
11731 64903 65207 89392 94134 100865 88880 74989 61907 63358 62898 51535 42620 53476 64823
11718 64823 71635 71682 59896 54289 74643 82682 81901 79920 81922 82623 92168 90221 77871 69644 67124
11703 67124 73361 74418 63077 64526 66410 63748 63444 67205 73810 67741 57971 47096 57592 68454
11689 68454 58050 52507 41793 35861 46693 62301 71310 76731 92008 94312 88806 80360 82595
11676 82595 76145 56097 57248 57959 66833 67876 54290 53497 60826 60618 60716 60357 72593 69484 59729
11661 59729 64863 69491 59405 57308 66486 83955 98439 94192 86337 71010 65507 47622 45303
11648 45303 42460 44262 61733 55016 60652 63611 50772 56546 47003 45909 43498 42512 52031 45242
11634 45242 40823 55728 69988 69497 64540 64792 70684 64277 58510 52667 44676 54487 47911 52334
11620 52334 64585 63673 62386 65849 73808 65644 81380 86214 73126 72759 68226 59118 60650 51631
11606 51631 34668 36999 36369 34436 37940 48318 61835 51923 53324 55219 64372 46303 39937 44496
11592 44496 52507 65053 61407 56696 68048 76071 70193 73736 80995 75071 66585 64139 56075 41284
11578 41284 63954 75301 89221 97083 84302 60511 45282 51932 47136 47373 59912 61917 58855
11565 58855 62885 63934 70866 60347 77135 69923 61541 68011 69780 54740 37285 27033 31164
11552 31164 40053 54398 57698 50086 42687 47787 64097 65602 59135 68954 63839 59925 48858 49933
11538 49933 53177 46162 47284 57982 62684 60664 55459 42976 36891 34900 29353 29923 32559 36664
11524 36664 32115 29128 26583 37544 47750 49526 43642 49342 43697 34849 23406 32558 36992 46185
11510 46185 39587 24358 19508 16742 21882 23845 18731 24020 24175 15124 22301 31313 26048 26566 26105
11495 26105 17488 21875 21420 20824 31309 46741 46997 44472 33872 40078 41249 36866 44048 46845
11481 46845 40943 42821 55212 57635 65209 56923 55611 53154 52616 44854 30914 14242 14508 27852
11467 27852 40845 39411 38837 46653 38881 35903 37145 42710 44711 43662 44581 34935 28682 24678 21369
11452 21369 23754 18775 12911 19994 24022 33558 30562 25849 26172 30842 39394 27722 18932 12252
11438 12252 14039 16817 16963 34590 55386 42144 19409 13192 13576 20879 18821 21006 26127 11855
11424 11855 9829 24694 37799 36010 22695 14741 8592 22070 24465 15105 5348 3461 15371
11411 15371 28599 42367 63601 57908 56820 57164 39130 24186 5782 -11972 -15312 -3378 11298
11398 11298 22211 21905 20987 24225 21721 12685 12379 17283 6289 3611 8612 8119 19757 31760
11384 31760 38183 33096 31115 42798 34882 39439 55589 49256 31349 22304 25835 15817 3535
11371 3535 11728 5223 -8473 -11145 2582 22782 36328 30026 15874 19393 22412 18933 17476
11358 17476 17675 19520 10247 14123 22797 19140 -3618 -803 15217 11287 3456 -409 8660 20943
11344 20943 28033 20087 9223 468 -2926 1757 -2708 1538 14468 12565 -800 -2887 12299
11331 12299 26269 36602 33574 30400 20576 10224 18703 15697 11266 4486 -6732 -14480 -16106
11318 -16106 -17652 -18333 -23347 -19924 -21596 3914 20270 7396 -5014 3620 -6918 -11727 -4632
11305 -4632 8355 19034 17140 9407 3845 3110 9120 14461 19252 24858 21985 21704 14648 3846
11291 3846 -233 3698 -1124 4437 13950 10128 4821 -9685 -6274 3318 6039 18711 30442 25552
11277 25552 11216 -929 1847 -3369 -1513 -2833 5775 7563 17352 24025 31129 48185 38184
11264 38184 18788 15728 9007 -1495 -12371 -10885 -585 3073 7994 11335 21193 24852 29919
11251 29919 24524 35670 41310 22392 3436 116 1675 -4791 -4959 3450 -5130 -114 3592 -5528
11237 -5528 -17886 -4406 -3326 -9627 -24347 -24016 -22522 -18168 -8565 -5348 2275 18472 28802 21284
11223 21284 22328 9851 11789 21206 9241 9154 16280 12531 10805 15843 13386 12276 19520 24481
11209 24481 21094 34293 26338 27775 35408 29784 26946 15021 7265 6224 3193 -2860 -4166 -5047
11195 -5047 -5717 5754 15066 2882 -3946 -478 21071 27679 28046 18815 9259 11874 17208 7879
11181 7879 -4714 -4016 15672 15440 12821 15142 2783 -2231 -5637 -2951 272 -185 -3343 3470 8270
11166 8270 9933 9800 9973 11220 13024 14644 12705 10279 9186 8736 21801 26834 10500 18201 25408
11151 25408 33762 36242 15051 21566 28531 21980 16410 10056 16087 23936 17373 10642 6436 -6406
11137 -6406 -25505 -9776 -7023 -12334 -6595 -2354 -3593 -8437 -13707 -13377 -10684 -12959 -3182 -1470
11123 -1470 -10552 -22825 -29951 -22597 -9905 -5100 -9751 -1676 -1925 -5394 96 12778 20172 4079
11109 4079 1199 6902 -9342 -20114 -25213 -12301 9322 11696 6960 6165 15007 21897 18347 12194
11095 12194 -23 -13942 -5534 1476 -87 7994 10893 -2132 -11797 -17486 -1968 1432 775 1773
11081 1773 5492 -5281 -3712 -10272 -15298 -12697 -18769 -26525 -22853 -19435 -24881 -24416 -18579 1310
11067 1310 2250 -9622 -16278 -14132 -12284 -9510 -5866 -5612 -9244 6108 5463 -4065 -952 2312 2229
11052 2229 -17535 -38760 -41500 -21272 -17172 -12305 -5296 -1493 -3442 -12759 -14402 -24291 -29477 -21666
11038 -21666 -3958 10119 4594 -1393 -4737 -7515 -1355 526 -5784 -1471 5411 -4687 -6816 -13933
11024 -13933 -16968 -7362 3014 -1983 -472 -443 3528 4934 1146 2473 22842 28624 25752 32567
11010 32567 19108 14235 19164 17047 10306 -2549 -5274 -375 -2915 -4323 -226 3992 -14803 -16987
10996 -16987 -17412 -18120 -17235 -5062 2437 -5323 -10862 -8920 -11451 -13763 -14137 -10898 -6880 -2871 -627
10981 -627 1623 3999 2048 977 -4228 -2827 -11980 -9415 4356 12888 12157 2041 60 -1428 8743
10966 8743 5158 -5853 -10055 -19908 -20880 -12204 -13148 -19120 -24832 -21967 -28608 -21894 -9334 2301
10952 2301 -9940 -16809 -9942 4240 4527 -4527 -12644 -9708 -8665 4529 24528 37381 32878 7606
10938 7606 -1156 -1781 -2877 -1510 -371 -1036 13410 32477 30387 19903 7329 4646 -221 -2
10924 -2 3840 7388 -10691 -16810 -19613 -18618 346 11955 16752 8625 -11405 -7779 -9906 3054
10910 3054 3760 11182 7074 -819 4052 2428 11086 3125 18781 25693 11473 10512 24347 29173
10896 29173 34028 25591 17643 14280 4503 -13161 -17785 -2759 -3860 -6266 -10186 -7506 -4114 -18495
10882 -18495 -29879 -21303 -5875 2998 15978 2688 -3308 13195 19105 24080 30400 23699 11494
10869 11494 8776 13784 10393 16941 -1492 -8171 -3237 -4707 -8903 -6615 -9187 -10886 -9842 -3147
10855 -3147 9094 17824 33251 35178 18984 -7881 -11877 -1159 2040 -1357 5911 12481 8305
10842 8305 -4953 -11291 -12413 -24115 -22425 -10551 -3607 6340 2752 -6281 -15057 -27063 -22152 -23189
10828 -23189 -22768 -12216 -4150 -6160 -21286 -21225 -9471 8211 13523 5131 -7400 -6126 -12841 -18354
10814 -18354 -29364 -35739 -40947 -42319 -40518 -39145 -38372 -17727 -12320 -1455 -12709 -11049 -7065 -10526
10800 -10526 -9506 -14978 -8658 -1315 -9556 -5960 10493 -1333 -16273 -20039 -15481 -10313 -3370 -7076
10786 -7076 -7191 345 8592 -2959 -12027 -6952 3180 27053 29447 38228 58536 71195 66812 40284
10772 40284 17590 26956 43478 28337 23402 16663 6058 -5948 -3592 -16186 -28504 -30440 -26295
10759 -26295 -24326 -26606 -14736 -15253 -17218 -2531 -5226 -10192 -1280 2510 7535 9015 12724 12128
10745 12128 6793 1482 -6698 -15933 -9265 -5408 -15891 -31948 -30409 -30872 -27767 -23330 -13752 -13653 -8429
10730 -8429 254 -14668 -16621 -5079 -718 -5767 -19854 -13360 -9906 10163 10109 -2823 -16113 -15877
10716 -15877 -11289 -9939 -2250 -2213 641 6939 -2148 -10844 -8834 -6698 -27394 -35168 -29234 -22901 -13492
10701 -13492 -12008 -10287 -13782 -17091 -15417 -13377 -8717 -18441 -22769 -25683 -20119 -13446 -18415 -14377
10687 -14377 -10856 -3869 231 -5777 -4261 6396 85 -5240 -2791 -16822 -7830 10967 8351 -7736
10673 -7736 4 4836 -11569 46 424 -13292 -25758 -27901 -25372 -9393 -12112 -13045 -17415 -13152
10659 -13152 -13906 -19449 -23728 -7983 -13018 -14786 -6293 2236 3869 4770 -2222 -7740 -1606 -13238
10645 -13238 -18508 -27057 -33291 -29392 -12547 2926 4288 7097 7967 12845 7996 4131 -2469 -6615
10631 -6615 -13597 -3819 -450 6717 4307 -5030 -19921 -12698 14693 10803 -4288 -15596 -12313 -14130
10617 -14130 1968 6297 3349 14283 21748 6220 3529 13085 13359 6033 -7630 -13677 -14748 -14668
10603 -14668 -13890 -11752 -14638 -25178 -27722 -20292 -23478 -18276 -18687 -18914 -9593 -819 -2688 -7281 -3202
10588 -3202 10464 3755 6077 -1014 -7534 -3434 4674 7000 9875 -3227 -590 9869 28230 19207
10574 19207 5879 8062 -101 -4344 -9953 -15047 -11252 -6826 1336 18213 20900 10990 -5577 -9943
10560 -9943 -8063 -4965 3729 2025 8496 10204 17624 18611 -896 -10624 -15535 -9010 2860 3187 -4897
10545 -4897 -15357 -21747 -24469 -29142 -20411 -13658 -12032 -9160 -5048 564 -2792 -10557 -24047 -21278
10531 -21278 -3660 11008 24095 23316 9200 11607 -6683 -13333 -4419 -706 -4144 -2174 -274
10518 -274 -9795 -6159 -7439 -17716 -18175 -19773 -28708 -36186 -29174 -23876 -31154 -25066 -6247 -4408 -1959
10503 -1959 5037 -12402 -19778 -26395 -23276 -7275 5624 6204 -1026 -6955 -17815 -19228 -11374 -9660
10489 -9660 -6963 -3277 -939 -11490 -19434 -523 7881 -5108 -21062 -21925 -21216 -21432 -20853 -27959 -21567
10474 -21567 -27188 -21555 -27369 -36426 -33366 -17729 -18486 -19271 -8288 -9116 -17466 -14418 -7035 12152
10460 12152 11673 10547 844 950 -9677 -18407 -480 23910 32034 24202 13291 4236 8865 9578
10446 9578 5260 6858 6272 7405 4039 7490 19135 20286 17912 1150 -7221 2370 -175 9940
10432 9940 21399 16888 12135 8403 14345 19062 4709 -5891 -7052 -2863 5224 -7700 5137
10419 5137 5566 -7144 -7368 -6740 -8721 -8315 -11171 2840 3075 -6392 -9675 -6336 8677 7227 -13149
10404 -13149 -30026 -30592 -12866 -3668 1949 14530 27220 18297 4046 6899 4136 1961 7814
10391 7814 4829 -2394 -9631 -15538 -8889 -15855 -13449 -8151 -11386 7618 20126 15364 14756 -1369
10377 -1369 -22738 -16514 3467 11473 19269 13029 8832 -5530 -15538 -21145 -14942 -5558 2 1969
10363 1969 -14645 -19599 -3962 -5256 2001 7821 2970 3929 12816 18972 2730 -3365 -9071 -9981
10349 -9981 -4582 2660 -1950 -4040 -3892 4149 1517 -10128 -14890 -18144 -15154 -13064 -8531 -12286 -16871
10334 -16871 -12409 -20677 -26536 -19961 -8464 7361 5343 -14021 -20279 -11039 -9637 -10796 -10760 -3014
10320 -3014 12796 7622 -7196 -5350 -8324 -7288 -8660 -923 -1006 227 2421 6977 25969 28272
10306 28272 22533 25124 16011 12673 10597 10898 18194 14145 9711 5662 9395 2214 -11304 -11025 1139
10291 1139 -10465 -19609 -18582 -16951 -19875 -29523 -41244 -16361 1371 -6556 -6604 1617 13524 10228
10277 10228 6178 16188 27871 33448 30745 23272 29145 16509 1118 -6865 3819 8342 7995
10264 7995 6025 4563 -71 6491 8196 16203 28932 20122 15629 13059 22891 33106 24505 11467
10250 11467 3287 -3875 858 9664 10671 6735 6162 3212 -3732 -13086 -19224 -14237 -8904 -9974 -17962
10235 -17962 -15883 2459 4534 12219 9746 8006 17108 32894 33198 20248 15027 -278 -3304 -13319
10221 -13319 -15769 3923 10679 11344 1838 6804 -3726 8320 8100 4846 4732 -2192 -3816 -3460 -12098
10206 -12098 -10905 -7287 -10082 -11366 -9843 -18347 -26744 -14761 -17945 -19196 -24774 -29800 -11086 -6897
10192 -6897 -14622 -16460 -26658 -35928 -37989 -34053 -30184 -28390 -21578 -11270 -10400 -19944 -13152 334
10178 334 5161 -4600 -16467 -16667 -6845 14644 13227 7247 1479 -6876 -556 -2815 -726 -2709 -10001
10163 -10001 -14058 -327 21438 24019 21860 23779 5345 -657 -1001 -4942 -2281 1002 -6785 -12651
10149 -12651 -11199 -3360 -3722 8361 9606 7925 -678 -10636 -7810 -1007 1408 5898 90 -7786
10135 -7786 -13295 -12166 -16170 -7497 -4763 3470 6136 1638 1971 -41 -752 -2423 2014 5967 13453
10120 13453 25587 18245 14905 13567 7888 1075 15370 25071 22944 26600 24824 23729 24596 19928
10106 19928 -6528 -20952 -17036 -15262 -25021 -14430 -13267 -23315 -23732 -11631 -6238 -10533 -11594
10093 -11594 -13847 -11170 -275 -163 -11558 -18342 -21422 -14206 -7420 1619 22314 31399 14715 -3600
10079 -3600 -9097 542 2064 -3620 1788 8944 8766 10561 4642 -9684 275 -6903 -14116 -9487 1185
10064 1185 11643 5279 -574 -2684 3693 4798 3442 9966 2006 -9580 -14000 -13955 -6356 4165
10050 4165 4497 -4309 -2827 7112 2776 -13131 -19108 -11028 -12336 -18247 -12060 -4190 17785 33908
10036 33908 30322 24431 33960 35940 47269 65689 86720 125816 189219 309983 519042 703209
10024 703209 698163 509870 314851 183428 116382 77602 52156 41292 36349 26962 21726 11987
10012 11987 12726 21216 13634 2372 -7129 -8673 -7712 10880 24188 14176 16004 2857 -16783
9999 -16783 -8761 7030 8558 3559 -4409 -5220 -11250 -7416 6091 12357 6785 10457 21075 29068
9985 29068 33344 26049 16998 4553 9189 2884 -4243 1318 17835 16193 7360 -9737 -21861 -30050
9971 -30050 -35329 -20756 -8462 -14052 -26093 -19492 -13859 -21269 -27614 -16148 -8516 -12422 -10755 -5374
9957 -5374 -2077 254 -7786 -9020 -15133 -13768 459 2924 -5618 -11880 -10094 -17733 -5625 574
9943 574 -1074 -14206 -17647 -10597 -2478 -3884 1411 -1990 2680 20666 20812 21705 5946 -330 -5578
9928 -5578 -12378 -2750 -1936 1709 -864 9786 15194 5905 -6740 1601 29053 28407 26884 26843 23801
9913 23801 13592 5604 -9325 -14269 -10794 -19642 -19295 -14473 -8418 7346 1311 2448 2962 4370
9899 4370 9972 10646 948 -2521 -10819 -5986 -5186 -14245 -4605 -3379 -9178 -17197 -25162 -30158 -28124
9884 -28124 -23380 -10379 -11048 -18404 -18105 -13512 -12112 -5178 16683 21858 14124 14120 2662 -3316 306
9869 306 947 -5474 1639 16955 24787 15441 21400 22955 24794 23706 11024 9801 8843 5242 3341
9854 3341 3614 -5277 -3623 1986 491 -2950 -6867 10356 11167 8886 -3577 -14257 -3913 -10009
9840 -10009 -4315 -10740 -16710 -6691 -12185 -17623 -7201 -7305 -9204 -4657 -830 7843 15593 5951
9826 5951 1218 6000 2641 7131 3725 -8501 -4069 -9657 -4171 -5012 -269 2345 -1970 -8668 -7416
9811 -7416 2110 -4086 1709 -1898 -2519 639 -4605 -10795 -1724 455 17009 13612 413 -10055
9797 -10055 6729 7706 549 5876 14939 8736 -1360 -18850 -20628 -21750 -7491 7270 6039 7958
9783 7958 7045 4364 -410 -4556 -1609 -6216 -14811 -11648 1100 -10283 -14872 -16329 -3543 4899
9769 4899 1280 -554 2313 11489 8822 19809 18582 451 -10763 -3092 -10837 -9758 -5813 -10588
9755 -10588 -10212 1237 546 733 -431 -7716 -16368 -35254 -39169 -28265 -28245 -20618 -16101 -16363 -22937
9740 -22937 -29202 -19952 -788 5445 1787 -3282 -291 -169 -4494 4204 14939 15799 19878 9263
9726 9263 2064 5363 -10698 -20972 -19476 -20124 -17729 -19110 -7409 769 3624 -6118 -17469 -12918
9712 -12918 2528 -2429 -11237 1113 11823 10071 13262 13185 10657 -2901 -14634 -10662 2357 5321
9698 5321 -4769 -14047 -27521 -25605 -12872 2191 -862 -10806 481 21668 19062 278 -13872
9685 -13872 -1776 4059 -1722 -6748 -405 -719 -11888 -18153 -10525 -13324 -20148 -15212 -126 -3917
9671 -3917 -19173 -31289 -32272 -24103 -8891 -9577 -15967 -5272 -4407 -9981 -13614 -7582 -6316 -4179 -864
9656 -864 -760 3588 5037 6052 131 -6738 -21331 -9903 -476 -2615 2280 5692 6903 12385 16947
9641 16947 2485 -8270 -8270 -4292 -1823 -630 4957 15585 7220 10603 11904 -615 -4139 5488
9627 5488 -8453 -5867 -3697 -8421 -3485 12096 10636 5278 12542 12821 5217 -2574 -13426 -18135
9613 -18135 -16124 -5425 -2413 -7897 -5155 5496 14243 9766 17150 14144 7626 10734 13829 8148
9599 8148 10548 7006 12654 22251 18510 10754 1439 15607 11142 13438 17421 17480 7880 1933 9549
9584 9549 10428 10434 20385 20801 10678 11637 15335 12818 6923 11393 15793 3931 -2092 776 3745 437
9568 437 -373 -3142 -14017 -17285 -19438 -28591 -31056 -30386 -3145 -14025 -19384 -2854 3458 3747 -729
9553 -729 -4931 4720 9526 6060 5099 6855 3151 -8889 -4247 -12535 -15778 -8267 -117 3455 4343
9538 4343 2553 8944 14120 9469 8067 7227 17218 8999 -10240 -12293 -15114 -11722 -16433 -15634 -6574
9523 -6574 2197 2208 4627 723 12553 12479 1636 -17068 -13198 1798 1257 8157 19167 19889 22040
9508 22040 7024 6145 10230 -850 2401 -9390 -21880 -12321 1895 2991 3004 -3613 -16677 -18259
9494 -18259 -23805 -15870 -12501 -11559 -17415 -14433 -24643 -13381 -6634 842 5212 5003 -7594 -9790
9480 -9790 -5098 1104 -416 -12605 -16205 -17428 -11685 -6398 -15048 -17340 -10360 -16630 -22637 -14952 -1518
9465 -1518 -10355 -8649 -12146 -16201 -20784 -16155 -7807 -12026 -6042 -10269 -12562 -15181 595 12177
9451 12177 4422 -6628 -6313 10153 7507 -299 168 -4704 -2577 -3706 1083 13790 14964 8003
9437 8003 1672 -15593 -27976 -28408 -16430 -7340 -14514 -8782 -7412 -11406 -5045 -9406 -6511 -4221
9423 -4221 1719 11830 576 -9172 -8822 -1930 -4914 -487 16457 17577 2841 -2458 -13924 -8145
9409 -8145 -3326 -2396 -355 -1514 -8595 -1770 8579 13972 17889 16736 18604 15960 7139 5534 -2053
9394 -2053 -18280 -13307 -2210 5935 8104 10818 7490 -612 2472 9559 -4773 -10905 -11742 -9683
9380 -9683 6735 11632 6468 360 -1425 3379 11999 1624 5843 11344 7773 2340 753 -2253
9366 -2253 1240 -4422 -230 -7279 -14404 -8580 1989 13689 4614 -4360 -3450 -4102 -12692 -18586 -22362
9351 -22362 -21792 -8545 -1445 -5613 -20859 -6881 4214 4714 -6039 6202 5999 -922 -6226 -8766
9337 -8766 -6866 -8320 -13277 -13169 -13536 -5808 -2289 -10094 -12212 4804 10167 6887 5710 6297 -2192
9322 -2192 5013 -3419 -1280 7214 22986 11703 -613 967 2329 2612 2393 10049 6461 2429 -12372
9307 -12372 -16229 -7033 -994 -4351 -6577 -3699 5130 4260 2864 -2090 5743 3778 -4459 -920 8862
9292 8862 167 4927 12551 14367 17717 16654 9719 14502 13380 4871 -922 -8777 -17020 -13746 -4832
9277 -4832 -4453 -7074 -2438 4260 -8036 -3708 4608 2847 -4834 -20802 -12327 4788 5080 -12441
9263 -12441 -19171 -26447 -28704 -10130 -13639 -12693 3398 -10939 -26118 -25854 -20261 -12085 -5710 5282
9249 5282 8970 -5218 -16101 -21637 -14669 -11666 -3748 2920 -4463 -2988 -9321 -24047 -30809 -35576
9235 -35576 -29094 -15402 -1039 -7563 -1756 -4404 -11122 -5257 9700 25567 24761 12658 10648 846
9221 846 -10105 -19979 -16100 8833 16686 15074 4195 3674 5294 -3863 -9670 -14459 -16910 -16417 -17085
9206 -17085 -11299 -6941 -8967 -10539 -4125 2311 -4889 -4575 14606 16933 18971 19959 4312 2716 4488
9191 4488 6709 -468 5294 -353 5890 11500 3187 -6236 -8284 4046 -2550 -8202 857 8213 5862
9176 5862 4851 9225 7796 -218 -11739 -10501 5720 18191 24211 11495 6697 4713 5949 12499
9162 12499 9653 6885 12728 13885 12527 7249 7372 14298 14082 22067 29293 20029 14831 8149 369
9147 369 -4998 6563 6455 10014 15646 14913 12655 -225 3577 3464 2351 8703 17081 17184 14513 6890
9131 6890 -507 -8458 -8743 -11744 -18909 -16925 -19394 -18031 -17348 -19025 -11496 -17222 -15014 -10284 -7013
9116 -7013 -9064 -3407 3240 7485 -3408 2242 5378 12880 19114 22086 12529 -9455 -15481 -11882
9102 -11882 -267 18484 22317 18707 8057 4670 -5039 479 5527 -10517 -18936 -19596 -25169 -20432
9088 -20432 -15966 -12815 -6217 -3177 -11030 -5937 -11609 -6341 2333 11961 11892 11560 8513 6330 958
9073 958 -409 -2403 -16636 -13792 -8897 2058 13885 11368 -3908 -1851 4446 15530 18593 20466
9059 20466 12613 1979 -7431 -10253 -5034 -671 -16551 -6652 5596 -8836 -13444 -5837 -5344 -1200
9045 -1200 6164 11675 1027 -13916 -31290 -17693 -2603 728 -3891 -10737 -18282 -18512 -17559 -10773
9031 -10773 -24328 -35577 -20697 -14252 -11581 -3361 -3239 2461 14496 12040 2726 7826 21803 30622
9017 30622 26014 20397 18488 5616 -3259 38 17047 10530 6832 -5643 -10446 -276 4139 2375
9003 2375 8953 3538 7174 17388 18037 20804 19070 11174 -1379 -3119 -1388 -6444 -8946 -9640 -13609
8988 -13609 -21574 -21648 -19856 -279 8722 -2442 -12880 -13798 -3040 10377 10893 19338 21403 17823
8974 17823 8655 960 3773 6882 18368 14842 15933 24934 12842 2034 1281 -1621 -3306 -19
8960 -19 -4880 6337 1977 1531 8287 -289 -18843 -22879 -7785 -899 -4639 -5503 12390 4070 -10093
8945 -10093 -2257 -694 -10057 -14517 -22610 -21655 -6605 -206 -2685 -9510 -6012 3908 2145 1229 -2111
8930 -2111 -3412 -11594 -18888 -29668 -32325 -17495 629 9765 4113 -6964 -13576 -3449 3042 4193
8916 4193 -7503 -2713 -4777 1518 14947 17812 4123 -2537 5033 20254 28402 15554 3824
8903 3824 7276 18586 14334 9053 9265 -7763 -8075 -9551 -12122 -12369 -8605 -14702 -9302 -6855 -5357
8888 -5357 -2327 2338 9972 8370 12940 10732 16272 8713 -1989 -3966 1126 -28 9137 1914 -8874
8873 -8874 -10327 -22094 -20084 -15226 -8008 5717 11837 23867 26038 1925 -5233 -3640 -1410 -5802
8859 -5802 4138 6618 -2158 -14366 -19293 -7992 -1113 9497 13210 -2468 -12508 363 16471
8846 16471 20669 17029 -12184 -18077 -17925 -20153 -929 19857 18890 13267 6359 711 632 -241 -16067
8831 -16067 -17229 -17829 -16716 -19691 -14224 -1150 7904 9580 15924 19666 8936 -12010 -20102 -13183
8817 -13183 -16337 -6908 4171 -4605 -6126 4858 7364 3176 3302 8538 10750 9939 8439 -1095 -6891
8802 -6891 -12238 -18234 -5704 6050 12731 21967 3372 -12912 -16050 -3762 -1013 973 6353 19556
8788 19556 10865 8954 -1548 -1757 -11396 -1464 8424 -5689 -28866 -30343 -11082 1000 -4535 5729
8774 5729 19643 27543 28850 8572 -5502 2124 2091 7000 13942 18391 16538 12373 5979 -2293 -14783
8759 -14783 -21862 -25585 -22196 -17759 -11592 -10425 -14285 -3857 -6884 -4244 5104 3107 3936 7312 10810
8744 10810 1967 -7128 -467 21373 11282 414 -8533 -6038 13693 26728 21818 29797 30873
8731 30873 14953 9324 4452 2393 -1961 386 6072 3149 602 55 -4552 -1948 1698 6756 13367
8716 13367 25289 27053 14227 2241 -13476 -4292 1712 9784 25020 33586 29861 15056 11774
8703 11774 8607 7578 -2568 -492 254 3000 9616 18335 21655 12091 7259 14648 16603 7215 11256
8688 11256 16922 18812 1582 -12617 -32726 -24363 -15715 -290 470 5619 8804 -298 -2279 6642
8674 6642 6392 -3696 -25126 -23441 -12190 -9812 -4197 -8595 -10120 -11846 -2646 8306 14812 4507
8660 4507 11499 19523 15829 12776 4897 -6563 -12200 -5260 -7238 -1797 19374 26370 32841 18309
8646 18309 9717 5439 -5310 -9459 -9534 1449 13358 17066 17558 13746 11029 5217 -3212 5635 -5621
8631 -5621 -17937 -24961 -23890 -20319 -19171 -8992 -12285 -12122 3750 13860 9221 14566 19636 29764
8617 29764 22838 34568 36428 32052 29342 17491 9702 4966 15100 5422 -6295 -3789 16689
8604 16689 16075 11104 13382 13785 21492 24351 26124 32109 35327 35098 28127 25203 20665 30685 24772
8589 24772 25195 36912 38016 32256 43326 45138 46184 44649 61996 64007 58732 68983 62657 52907
8575 52907 43404 48587 59503 68979 78199 87813 98318 91913 77385 86572 82676 72282 52568
8562 52568 54965 54897 52142 59634 59095 62282 57387 51025 48785 22765 3244 14531 19239 17336 10864
8547 10864 1141 3382 22898 22034 10667 4904 12690 7892 516 12705 12989 19203 18120 10739
8533 10739 -7277 -8901 -1944 6386 2390 -7970 -7984 3983 -10248 -25056 -10706 358 2219
8520 2219 -12914 -9868 -8308 -18795 -13412 -13219 6216 17659 16930 25816 27839 23257 8779 782
8506 782 -2393 5588 -6621 -9868 -5796 -4237 -11074 -1737 6584 -745 8845 15060 8152 -3628 -5430
8491 -5430 -366 15979 17303 -2367 5037 19048 21113 5236 -1299 -864 -2520 -3950 -15753 -25931
8477 -25931 -19393 -16328 -12413 -15258 -20413 -23118 -16294 -16920 -16083 -11158 -12395 -1608 -14008 -1022
8463 -1022 3479 -2318 -13969 -31468 -29976 -23668 -5883 -271 -5378 4902 7758 3387 15734 4497
8449 4497 12919 12887 14921 11928 -897 10984 22833 13582 -3684 1799 6574 2166 9156 17928
8435 17928 14243 12176 10756 11743 -43 -7581 -8025 -7159 -5159 2253 -678 11991 8130 -1101 5641
8420 5641 9705 6020 -9016 -4312 1338 2405 -4692 -11012 -12365 -15615 -11622 -15798 -26093 -30971
8406 -30971 -18673 -2113 -13915 -21873 -23053 -9723 -2178 8199 27160 26499 21006 18040 4292
8393 4292 -2159 -723 -374 -12742 -2839 -3325 -150 925 -3470 -10021 -10000 1393 10120 9645 7248 6623
8377 6623 1256 11615 6289 2813 -4059 -10263 -16808 -3783 1930 -8051 -21113 -24277 -20001 -20542
8363 -20542 -6429 4763 7216 2883 574 -15335 -22508 -23603 -30466 -15876 -4667 -5238 -9360 2687
8349 2687 3868 -4825 -6839 -1622 10254 10500 2248 3488 338 -1557 -14445 -16324 -14963 -16738 -14115
8334 -14115 -2001 2875 9490 14527 25081 34343 21955 4854 -494 1737 -365 -8954 -8628 4060
8320 4060 7824 4103 8045 4152 15402 14196 752 571 -2962 6532 22796 13329 -1539 -3645
8306 -3645 -5782 747 4288 -1065 7470 8599 8223 7581 20688 20032 22775 23585 3227 -11486 -13512
8291 -13512 2509 10473 9500 12826 4426 -7290 -2582 1278 10769 10628 4557 -96 7560 8699 -2645
8276 -2645 -6304 2521 -1672 -4689 3453 7684 -342 -9533 -5698 9884 3700 -4510 10255 21708
8262 21708 13159 -5244 -984 6231 -594 8128 11891 7120 5106 9259 12270 11245 1428 -17591
8248 -17591 -34702 -44535 -36055 -30143 -21018 -8477 -7028 7020 15620 23819 18115 12495 12215 12454
8234 12454 5463 -1977 -3643 -7279 6735 15861 6981 4447 -3728 -5330 -5837 509 1933 2343 11194
8219 11194 -816 -7327 -6584 -11180 -7772 -4671 -3207 -1726 -8656 -27616 -25401 -17623 -13417 -1668
8205 -1668 8930 6566 22583 14640 -6477 -6305 -7311 -5285 -3189 454 6222 9540 -4595 -13610
8191 -13610 -13258 -4646 -7298 -8227 -13834 -19059 -17559 -15737 -8197 -8600 -6872 1366 13972 20691 -1151
8176 -1151 -12323 -22108 -28012 -26957 -23927 -18889 -20250 -16403 -14231 -19474 -15444 -16419 -26598 -31502 -30394
8161 -30394 -26711 -19208 -12632 -9303 -9504 -5018 8170 9328 676 -3601 12350 16090 6918 -12508
8147 -12508 -17339 -12510 -18479 -19452 -10213 -172 3970 14075 6138 -10857 -3522 3131 5844 4645
8133 4645 4014 -134 4004 -2315 -471 492 5143 5310 50 -11321 -10310 -9702 -12164 -19139 -12218 -113
8117 -113 717 -5519 -9954 -10207 -13013 -1988 3526 -2700 -7360 -7965 -7586 11475 32603 33428 21999
8102 21999 8188 -9228 -8610 6850 25779 22706 27625 21114 5328 -776 4097 2255 3183 6782
8088 6782 7424 3886 -9532 -15486 -16880 -10431 -4053 -8225 -2407 -3251 3055 24097 22718 14465 14942
8073 14942 12228 -3918 5004 -119 -11907 -9373 -7409 -1299 -4275 592 9767 14994 4716 -12878
8059 -12878 -16344 -24690 -17584 -8801 -15309 -17464 -7587 -1400 9400 13783 9899 7044 2756 15187
8045 15187 22972 25907 23281 10045 10598 11269 0 -11101 -1920 5225 -5657 802 14501 12920
8031 12920 6501 2222 -5537 5612 8401 4943 1584 -3610 -4352 -14535 -7012 14123 29017 24257
8017 24257 10969 4426 47 7931 11650 8452 849 12426 17061 24135 25148 7769 1925 527
8003 527 -2309 -1203 12819 12287 18490 14602 4566 -5980 -5783 6321 18732 19224 23732 16829 20424
7988 20424 5011 2422 20799 31818 42124 34804 33142 24296 25931 40106 33567 38456 38384 29761
7974 29761 24405 26454 9901 -4015 -2113 5723 7096 13910 17341 8396 2729 1903 2493 6594 847
7959 847 7622 10198 6570 6556 12308 11769 17551 6965 -5236 -665 2786 -4268 5009 16107 16507
7944 16507 13604 11490 19742 28915 27285 17711 13565 23128 24289 6616 8783 15246 17755 15902
7930 15902 29339 35429 29382 32183 31074 23261 8934 9121 22710 28946 37347 28691 13267 18478
7916 18478 9589 4219 -1048 1214 3624 3949 11384 35424 39841 15655 6088 6090 11361 26222 30252
7901 30252 24460 20523 21283 25893 25736 24711 16172 8930 19804 28930 28914 24314 14269 9645 7624
7886 7624 263 -5109 10813 7901 1840 8297 15384 12557 20908 5663 186 978 -8858 -28186
7872 -28186 -18013 -1188 3877 7196 10325 4920 -8742 -15499 -19535 -16843 -8424 -3087 5144 -3000
7858 -3000 -6722 -4710 -9259 -1405 -68 15757 29276 12107 -4291 -11811 -72 9432 12272 18873
7844 18873 23675 13623 9790 6736 806 9166 11082 5815 10072 21658 28710 19113 13115 15433
7830 15433 16761 19084 16852 4600 12283 10032 9311 16179 12013 11551 4515 -19735 -25412 -13780
7816 -13780 -3263 12894 13048 12870 4508 -9641 -14759 -5144 9963 8742 -6961 -24427 -29634 -7769
7802 -7769 9604 -1438 -3556 -2206 -6811 -1274 837 -5979 -9324 10588 18599 13203 3185 958
7788 958 11584 8180 -2477 4715 20476 19322 10103 -478 -18454 -15843 -18937 -12698 -12013 -11631
7774 -11631 -2873 2535 19930 23002 17317 12160 5701 -10037 -18828 -15447 -21725 -11963 -17318 -20682
7760 -20682 -1180 2782 -9564 -13969 -4181 -852 1055 4579 -15277 -13163 -7916 -2242 3819 4388
7746 4388 3202 -1681 -4722 -17797 -26309 -17121 -12283 -1071 3291 7765 5740 13189 10119 10853 10731
7731 10731 5141 -4868 -2839 -9377 -11791 -12591 -3991 -1635 1072 -7172 3169 6403 -9430 -6999
7717 -6999 -6604 -11147 -16768 -16589 -5252 19285 21368 16369 7229 7955 8495 5712 -2085 -10781 -17936
7702 -17936 -12332 -7060 6065 17897 11771 11231 8724 -2644 -10198 -3556 -4763 -8767 -9345 -437
7688 -437 -1021 -353 -13456 -11544 -21014 -19872 -7676 5735 11154 10417 17902 16999 5083 9227 14510
7673 14510 4849 4020 7854 5462 -8843 -13215 -12625 -17591 -19050 -15820 -15351 -28416 -32343 -21325 -10117
7658 -10117 -4982 2721 -4501 -9280 -8060 -16606 -24638 -30855 -12879 -1619 12172 22338 16803 14838
7644 14838 7338 -6875 -7455 73 10292 18952 29110 12671 3175 4110 -4029 -2762 -17409 -9910
7630 -9910 5518 9789 12784 24585 10129 295 1420 1012 2878 -6512 -4325 888 5572 9614
7616 9614 18026 16108 543 -3785 -344 -10805 -20606 -14235 -4602 -7680 -6275 -974 -5388 -6219 -14076
7601 -14076 -28497 -20288 -16962 -11264 -7850 -2702 -3888 -7738 3566 7636 -2646 -5446 -7337 -1723
7587 -1723 8954 15913 17924 12441 12347 20405 19799 10763 6676 923 5048 9299 5107 -7080 -4532
7572 -4532 2577 1754 -3342 -13048 -6274 7220 10496 7591 7765 5267 -1143 937 15637 9654 -2949
7557 -2949 206 2229 7418 6900 8286 10076 -1965 -9072 -12166 -4995 -10558 -10840 1859 -16460 -32244
7542 -32244 -25826 -11609 1249 12527 6814 6269 4546 16390 27815 9255 2015 2681 -3166 -13034
7528 -13034 -12032 -17944 -20401 -10619 1116 -7607 -19184 -19758 -2687 3938 -7516 -10287 1252 1065
7514 1065 -15153 -13733 -7565 -15282 -11121 3341 8529 9372 4348 3462 -4688 -5122 -7248 -1748 -6878
7499 -6878 -10909 -8349 -22880 -31971 -32433 -23346 -16301 5557 9313 5912 -2214 -6603 -4552 -10503 -16143
7484 -16143 -21614 -12461 -6329 -3089 3008 4102 9018 14832 19036 11883 3600 2630 2938 -4031 -19443
7469 -19443 -26968 -20339 -9357 9710 6932 3754 -854 -10253 -22790 -33409 -30806 -14124 -12699
7456 -12699 -25041 -19668 -9620 -18117 -9055 7548 3949 3579 -1046 130 12938 9705 4859 -10277
7442 -10277 -11981 -16548 -18941 2709 4926 -635 760 -8331 3558 -8561 -25244 -25884 -24207 -29112
7428 -29112 -48954 -43645 -34334 -30911 -17016 -14904 -12159 -4523 2097 -10711 -5212 8457 6289 3438
7414 3438 -4360 -12587 -12694 -3453 -11256 -7526 -9285 -22672 -41534 -31088 598 14062 9449 9834
7400 9834 9650 -9539 -18381 -19473 -21565 -27066 -22956 -8093 3450 7126 12487 16556 6529 -6074
7386 -6074 -688 16637 17043 287 -20095 -8066 6767 -7342 -16242 -18804 -18391 -23177 -8845 -4028
7372 -4028 -2310 -7629 -17385 -11307 -9957 -27066 -20191 -7423 -4876 -1839 5131 10867 13513 24990
7358 24990 18163 13062 -1538 -12718 -4191 -12478 -10510 3166 2434 -2914 -14134 -12780 -13636 2979
7344 2979 3083 -376 159 -580 4782 -11785 -387 12958 4532 3899 3144 5719 15534 8816 4894
7329 4894 7116 6404 18821 13215 3411 -2988 -8165 -8881 -7642 3307 11241 14636 18020 8562 6406
7314 6406 8688 -748 -7269 -7060 -5876 -10573 -9127 -10760 -12245 -6108 1045 5585 -1454 -14646 -13293
7299 -13293 -9347 5822 19261 24798 20257 21542 9967 809 4556 11059 10996 8908 14656 7694
7285 7694 -3540 -7948 -13357 -7744 -7203 -12268 -10708 1077 162 -1875 -5770 -3534 2581 8057 2276
7270 2276 2998 4859 12530 4467 -583 -2026 10270 16562 -2612 -2946 10133 14706 6915 1558 9060
7255 9060 8897 10396 12214 7065 11894 16891 21154 24359 19471 13296 5708 12711 11931 23140 20406
7240 20406 14050 6865 9853 11107 14654 11647 4527 12075 11081 -3037 -525 9604 5888 1491
7226 1491 18133 22851 15045 3636 6128 22318 26532 11381 -9913 -7022 5283 16285 10530
7213 10530 -9345 -6459 -4009 -16876 5549 19188 20837 13690 -4303 -366 11171 9629 3967
7200 3967 697 -1470 1341 7373 21515 23878 13118 6154 -6713 -11576 -5243 -13852 -17075 5125
7186 5125 16517 8682 3531 -1265 -1930 426 -891 -11157 -4320 16396 11275 10530 14554 2531
7172 2531 -7931 -13424 -22104 -22250 -16764 -21287 -16496 6504 12049 2460 -3764 -9928 1729 6021
7158 6021 -16978 -21642 -16789 -22804 -27757 -26519 -17287 -20491 -19476 -5962 5479 1231 -12667 -16945
7144 -16945 -13916 -26123 -33628 -19529 -16699 -3099 9574 7662 13468 11088 3471 9772 7193 3391
7130 3391 3040 -13565 -28039 -10547 671 4400 460 -5925 -20822 1914 8077 -96 -10078 -25716
7116 -25716 -19850 -14191 -21630 -24744 -26736 -24522 -28084 -28590 -20221 -8646 1221 4352 6610 5546 6733
7101 6733 -10891 -3746 -5704 -10292 -5889 -9126 -9827 -7052 -1012 -13014 -16912 -21169 -23836 -13831
7087 -13831 -2352 19656 33394 24858 18663 26218 20553 13794 4499 8372 1419 -4121 -4852 -18748
7073 -18748 -6965 -1798 -1186 4244 15539 11470 -222 2053 20728 40670 33038 22457 18354
7060 18354 7400 7351 -4598 -12197 -8372 -13895 -20389 -19334 -28199 -30572 -11227 7430 15263 17820
7046 17820 23351 36333 40449 19819 -287 1351 -6367 -2587 6230 1346 -17229 -15690 2942
7033 2942 11066 -269 3015 -5902 -14109 -8537 -6132 897 -6803 -7984 -344 1402 -2766 -4386 -7293
7018 -7293 -6987 4157 1732 -4929 -9396 -2920 -1823 -4033 4222 -495 -5584 -1741 8585 8220 4788
7003 4788 9281 19529 4537 12599 17820 30533 18582 5092 -8332 -17362 -13303 -10900 -13424
6990 -13424 -19069 -285 -1863 -5188 -11584 -18274 -22912 -24252 -34908 -29289 -10438 4386 1777 2298
6976 2298 2654 3184 12059 7051 -3151 -12730 -17767 -17923 -15849 -10874 1507 3056 10226 9178 16592
6961 16592 7479 -8003 -13167 2745 17829 10354 12610 11958 10176 8226 14202 6726 -8489 -1684
6947 -1684 -5029 341 7221 7146 -973 1538 1961 3367 -4067 580 443 -11531 -9286 -7489 -4574 6860
6931 6860 -4485 -22424 -17058 -8672 -11393 -19253 -25077 -23070 -17860 -15394 -5746 6746 16213 13795
6917 13795 1252 10686 9711 2685 7789 9376 2791 -7580 -7347 143 3302 1987 -5222 -11291 1654
6902 1654 -8182 -5371 13304 13253 24556 28576 24951 9501 4021 4825 8231 5347 -5035 -9971 -11351
6887 -11351 -12013 5991 16951 7946 -1131 -3927 -15648 -17358 -10302 -7209 -1630 8617 9780 -3035
6873 -3035 -12766 -9806 7268 15437 8904 6337 21749 6286 -13652 -34360 -44665 -41501 -46017
6860 -46017 -45201 -35780 -28063 -18714 -18332 -14382 -7552 -4219 6354 -15097 -20957 -1852 8542 -908
6846 -908 -5239 9106 10144 167 -10929 -28365 -27809 -11009 3880 946 -4614 -4740 6084 -2401
6832 -2401 -4490 300 5526 7119 20152 15518 -5168 -2369 1827 14233 2863 1959 -3749 -17068
6818 -17068 -18344 -15104 -6261 -4597 -3137 -6671 -4416 10175 23085 22508 16435 11952 8506 6898
6804 6898 -1088 553 7854 11021 13737 9440 10256 8225 -1389 -1700 -57 -814 6322 8895 2486 3291
6788 3291 -2166 -16028 -11996 -11865 -6723 -5739 9419 20638 15662 21397 18290 -2746 -19169 -21085
6774 -21085 -7841 -3942 -7026 -5700 -9896 -20713 -11418 -3083 -10510 -23180 -25382 -22867 -25163 -24160
6760 -24160 -12080 -1852 -2362 3572 13231 5430 1574 -15883 -18976 -11152 -2579 8694 9260 14055
6746 14055 19846 17672 15053 3282 -10610 -5355 -13133 -14649 -9315 10025 16094 15411 -59 -13793
6732 -13793 -21727 -14731 -976 18089 11252 8204 -155 -8685 -4623 -1331 4403 3171 3065 4658
6718 4658 -7680 -16335 -9979 -44 10108 10958 650 -9001 -7401 -15710 -6977 6123 217 6372
6704 6372 13439 44754 74531 92043 91068 77830 67614 49540 35653 21850 16088 9636 6302
6691 6302 18285 29359 25397 17475 4926 3343 1915 -159 1088 2700 3122 5650 20794 29185
6677 29185 26082 14685 16634 22079 17783 12493 1353 260 -3558 -2859 487 4423 6541 19523
6663 19523 26131 21143 952 -10989 -32140 -37723 -24455 -17951 -11632 2773 15205 21783 13081
6650 13081 16246 22099 5417 -13631 -28612 -12251 962 11779 22703 24448 16873 6440 -8272
6637 -8272 -7546 -2483 -1755 -9492 -8743 -7953 -12055 1979 14967 11172 1277 2320 2342 84 6846 7407
6621 7407 -2126 -23022 -31396 -26487 -22331 -15521 -8428 -2801 -3572 -15031 -28958 -20191 -2170 1598
6607 1598 8086 6858 -677 -9695 -618 2386 -3175 -10882 -5155 1903 7047 13995 12592 19460 18504
6592 18504 2452 3174 1187 770 2193 -1043 8637 8017 -1238 4935 9156 11746 13447 -1065 -3318
6577 -3318 -6115 872 7124 2931 -939 -11315 -7911 -3568 -6474 2898 14356 28171 23953 12166
6563 12166 12420 1616 -3535 8686 16302 20137 6681 172 -2812 4800 3376 -3529 -874 -5906
6549 -5906 -7719 -2346 6483 -14032 -26016 -10297 -2947 1268 5438 17182 8763 1415 5763 6265
6535 6265 8253 3392 11257 14503 16486 19419 17672 8752 5400 7713 649 12184 13001 -10106 -13834
6520 -13834 -7960 6262 8000 15643 13898 -4663 -10300 -3581 -1234 -2938 12441 22304 21639 33627
6506 33627 38726 37121 22939 8383 3409 -985 -1677 -13432 -19407 -14325 -5190 6831 -794 -4188
6492 -4188 1130 9906 2873 5381 1057 -13288 -19217 -6415 4489 3439 7386 12369 27639 29478
6478 29478 39391 42196 22052 13374 1925 3273 8206 13450 16263 -3762 -19065 -22599 -23302 -14517
6464 -14517 -12167 -8519 546 -1132 -3833 3106 21371 14976 11255 -3260 -5103 -3099 9279 12924
6450 12924 15073 12580 4361 -9032 -13139 -21594 -30663 -16647 621 7071 -6313 -13284 -16054 -11023
6436 -11023 -11036 -12008 -12811 -3906 4195 -2231 -18991 -26544 -26854 -19684 -9890 3135 -3489 -11054 -15308
6421 -15308 -12387 -7348 -3848 -2894 -7841 -5121 -8883 -16069 -13223 -9634 -20212 -13193 -10751 -10667 -4813
6406 -4813 6945 -13028 -32350 -25291 -10732 -2522 -7164 -725 3561 -2672 -8555 -15665 -9904 -8073
6392 -8073 -9994 -5718 -11529 -13864 8557 13777 -3175 159 159 -14036 -11025 -2543 -2014 -9791 2642
6377 2642 24703 31063 33615 16978 17393 18910 11598 8180 12081 10109 6758 10614 -7699 -4360
6363 -4360 -13997 -16325 -24875 -15335 -9620 -10528 -12623 -6144 -16962 -11094 -18092 -10901 -4023 5759 4299
6348 4299 3019 -7261 -5644 -2604 -2527 -8386 -9593 -18221 3215 11258 12438 -5827 -16000 -12451
6334 -12451 -3273 -2606 -504 12693 13346 12568 8153 -930 -4459 -3207 -9879 -22696 -24012 -19108 -9032
6319 -9032 2802 1739 884 10642 869 -11300 -4670 -1523 -2050 -14626 -11377 -11095 -10270 -13137 -608
6304 -608 17697 17003 12229 3189 9862 12719 16544 14630 14658 11607 3268 -10139 -20962 -22124 -14277
6289 -14277 -9428 -14209 -19857 -5233 -5143 -4383 7829 791 -7524 -2905 2736 12802 17359 18369 23481
6274 23481 15758 -3322 -3693 8279 10449 10306 1230 8666 20265 23542 6103 47 -394 1088
6260 1088 5429 7613 9090 6079 -4662 -8431 -6546 -4192 699 993 -2019 -12075 -19977 -13017 2054
6245 2054 2301 -7868 -5781 -2969 -2240 -7678 -3899 -11807 -11361 -5501 -7328 -8200 -7313 -3676 12962 20857
6229 20857 15774 13895 -4786 -16659 -12797 -6295 -8275 -14742 -33181 -34860 -17967 -1859 3892
6216 3892 -9237 -7309 -6715 -8870 -4297 -4134 -19813 -15562 10129 15892 12069 2537 12634 18204
6202 18204 19082 27943 24339 -8542 -9067 4653 15809 22652 6952 -4057 334 3702 9371 6425
6188 6425 835 2293 4735 7700 9767 7723 -7231 -11350 -13270 -6389 10476 2441 -6726 -7557 -10669
6173 -10669 -1018 4166 4253 3529 -2103 2605 5975 1360 -2262 -14385 -23930 -23002 -12437 -4277 -3104
6158 -3104 6327 9490 6101 5382 6601 4857 -17583 -23403 -13903 -11185 -11174 -4026 5890 10407 -1071
6143 -1071 -5047 -236 5370 -13367 -22033 -22827 -14831 -14062 -2074 1736 3433 16759 18302 7488
6129 7488 -10623 -10215 518 -68 4993 -3654 -13809 5333 14101 14053 10496 8622 6298 -4359 -23583
6114 -23583 -26185 -33417 -32997 -26300 -18702 -18081 -32600 -27781 -13810 -9364 -10748 -7787 -1759 -6176 -5224
6099 -5224 4684 5577 155 2755 -8195 -3275 3129 -1207 -15696 -17892 -9381 -39 13275 13315 20812
6084 20812 22878 21166 12078 6605 4870 -13402 -20728 -13730 -6108 -4001 8194 -864 -7206 -4389
6070 -4389 4433 771 -8445 -5822 -3668 862 1895 6796 12411 5109 8328 16740 20843 20000 1745
6055 1745 4642 10618 4643 15350 16970 -3786 -5445 -10645 -26647 -19029 -10129 -4849 -2843 -8017
6041 -8017 -12920 -12116 8188 9179 9840 8601 -1854 1213 -2932 8126 23065 18985 25526 29845 15732
6026 15732 24928 31625 17755 4882 6418 3939 9009 18246 3481 -4750 8364 8652 13056 15784
6012 15784 9026 1923 -10257 -15048 -19641 -16249 -8698 -7136 -5083 4785 19379 8471 -9253 -4392
5998 -4392 -3200 -3871 -8120 -3431 9520 5808 3650 -1351 -4808 -15075 -19674 -18568 -13712 -14874 -12236
5983 -12236 -11484 -971 -1884 6782 4285 4756 4885 19216 24446 21029 7674 12447 16188 13868 10976
5968 10976 1314 -9044 -2545 -12894 -5989 -16075 -2162 2539 -5514 3326 2064 -15804 -22914
5955 -22914 2932 18882 9697 9840 -5453 -4136 3015 24370 27483 9758 14129 677 -2425
5942 -2425 7460 6313 -3064 -739 -1581 6073 12677 18929 19532 14353 5851 101 6396 8559 4130
5927 4130 -938 -13135 6657 19330 20720 22466 8531 -12558 -12733 -11497 -12004 -9442 -6635 -1793
5913 -1793 -1763 -3241 -9584 -752 11498 10305 -4404 -14801 -17971 -6168 2439 3602 -9894 -19795
5899 -19795 -14577 -4040 -12956 -25252 -13808 -666 6670 1797 21016 26831 13581 6203 112
5886 112 -929 551 10204 20209 17234 9170 -6886 -8619 -1426 2013 14379 7327 -1591 -9684
5872 -9684 -9643 -6555 -14256 -29227 -16784 -5171 1487 671 2760 1667 -11249 -24458 -23938 -10609
5858 -10609 -1970 1977 695 -3151 -8258 -6956 -9107 -9369 -5496 6632 -593 -7986 -9175 -4561 -4518
5843 -4518 -13224 -15363 -7028 -9627 -23843 -25556 -23946 -12154 2954 -1048 -18556 -6269 -4652 -10068
5829 -10068 -10649 2525 8651 5191 2123 3000 11195 27701 28570 10189 -16269 -14096 4799 1465
5815 1465 -8194 -1742 -1952 -2903 4920 10806 3444 -9525 -11824 -9649 -8425 -14194 -9221 -4910 -5669
5800 -5669 -8102 -12582 -7223 1968 -2103 -16807 -8610 -8711 -14312 -15465 -14622 -15723 -11886 -14231 -15396
5785 -15396 -20710 -22754 -21714 -20746 -24359 -19273 -7233 -6039 -11465 -6292 9852 3754 -16507 -35635
5771 -35635 -17371 -7339 -132 13076 28302 28359 11930 2486 6385 14913 11087 1204 478 -5794
5757 -5794 -11524 -11219 -22474 -26183 -18120 5348 35157 38146 12407 -744 -2977 10185 10235 16467
5743 16467 27324 21847 22214 10510 1664 -10184 -10101 -13646 -12584 -14424 -11521 -21147 -29918 -31356 -20243
5728 -20243 -15870 -14095 -10179 8821 6989 -8191 -14197 -5218 -5216 14333 7790 -15872 -17249 -14848
5714 -14848 -17154 -11377 -6593 -3839 -4849 -8380 -12404 -8473 -8370 3813 8726 11841 4930 8647 901
5699 901 8629 14288 -1271 -13983 -18364 -13000 -2133 -7567 1118 12241 17168 4591 -13658 -22410
5685 -22410 -14900 2594 17557 12645 2064 9828 10825 4640 -3633 -26 -189 -10744 -12351 -3679
5671 -3679 1509 1386 4575 -306 2234 -3660 -2997 2678 14428 20179 15592 28240 17916 8932 5165
5656 5165 -7069 -5149 -3437 -7908 -2471 1993 -1007 -13097 -7687 9127 15056 18576 10929 -398
5642 -398 3051 2630 -6143 -8818 -6331 -21577 -15985 -14501 -21227 -16190 -1263 -1646 -10005 -11445 -14025
5627 -14025 -11738 -19626 -24679 -26602 -30706 -15833 -3084 11490 29826 24349 21838 7444 -5050
5614 -5050 609 6275 3303 -3148 4079 10714 4147 460 7628 503 -18468 -24393 -25842 -28665 -19623
5599 -19623 -20322 -24355 -17843 -8254 3000 -102 -13742 -14858 -17263 -15699 4310 13045 9058 9300
5585 9300 20658 15220 4243 18739 20736 4868 -854 -3829 11518 8180 3788 2734 -8082
5572 -8082 -10254 -11312 -19402 -17863 -12341 -15424 -8040 -4539 -5555 -4801 11336 23562 21431 11509 7599
5557 7599 14775 -2627 -4571 -9904 -9625 -7373 -8231 -55 -5346 -3335 -10405 -10660 -2408 -1138 5919
5542 5919 330 -12206 -10196 -10588 -6994 2513 2126 7138 12689 -9240 -18943 -13491 -8525 1600 -2162
5527 -2162 -3378 8132 10424 12989 7091 1545 4594 22160 27532 19165 4139 -2650 -8282 -21061
5513 -21061 -14274 -9399 942 -138 -9825 4607 16312 16657 13691 16791 4038 7286 17667 18696
5499 18696 468 -11124 -15818 -4912 7627 10709 13253 12604 -10676 -17786 -14282 -13401 -10094 -7242
5485 -7242 -666 7143 6236 7142 8704 5315 -2802 -6647 7485 19649 10107 1937 2026 -83 -5183
5470 -5183 3458 10445 8248 21336 21753 4118 -2722 2963 -5047 5832 2402 -3144 -8067 -15004
5456 -15004 -9954 8801 2650 -14099 -14891 -20914 -24643 -19429 -14694 -18182 -31071 -12491 -11671 -15272
5442 -15272 3273 14209 9013 1593 2077 -1800 2074 2000 2517 878 7389 18463 15858 22947 15842
5427 15842 4400 4556 -116 -1023 7731 5521 -2052 2995 8771 12364 533 330 -6880 -23793 -27209
5412 -27209 -12149 -3836 -13432 -18002 -18568 -12525 -13638 -4762 8642 12146 8479 -1957 410 11799
5398 11799 15157 23721 18583 3147 -2360 -10932 -9112 -11084 -11595 -29489 -45532 -28442 -12814 -5959
5384 -5959 -3733 -10283 -1669 6682 13696 4319 -6869 -10940 -1396 3761 -830 -2464 -17416 -23062
5370 -23062 -13615 -10702 -1267 -7140 -20005 -14263 -2106 1282 -5488 -7418 -7734 -12557 -12547 -5957 15257
5355 15257 10208 -9194 -127 17099 20681 2998 -6912 1390 6838 8193 4521 -15352 -16851 -11781
5341 -11781 -8497 -2172 5348 4219 11496 13315 14051 15634 27549 23924 24173 2544 -3956 -17020
5327 -17020 -20069 -23974 -15173 -1197 4832 15089 14813 3796 -13654 -23988 -16391 -16815 -28995 -22971
5313 -22971 -17363 -30267 -17751 -13129 -5452 -16843 -15962 -21454 -24980 -19832 -4527 8061 12789 5646
5299 5646 21009 10813 -2261 -8615 -4976 3503 8759 -7565 -24198 -18429 -8860 -597 15050
5286 15050 11886 11171 -5679 -8062 -4893 -12928 -9134 -3428 4782 -2892 2363 12563 2188 3177
5272 3177 7838 -3252 2563 -8311 -28391 -23011 -12428 -19377 -26902 -29580 -13274 -6430 -5551 -671
5258 -671 3507 3321 5869 5740 -3945 -3986 -4868 2085 1385 2472 2891 9287 7414 14398 20219 16399 5777
5241 5777 16893 26490 13250 2895 4266 2422 -6621 -11034 -2964 -5368 5256 3308 3890 -5377
5227 -5377 -7091 -11038 -485 11513 19417 16231 8521 -325 -1853 -12682 -14194 -9818 -6172 -4900
5213 -4900 433 -3581 6662 1866 4996 877 -9196 -26480 -35695 -17304 -2615 -4539 1550 -11358
5199 -11358 -8909 -4873 -24606 -34657 -27054 -27846 -16403 -7925 670 4037 8157 14117 10309 13557
5185 13557 21499 10904 -9399 -14010 -4935 4907 1549 10603 17406 17978 17180 16263 17828 16987 5792
5170 5792 -1398 3177 3723 2002 -241 -3895 -5327 -719 -5830 449 3795 -3177 -14691 -20947 -21342
5155 -21342 -26072 -24076 -9694 2937 2479 5085 71 -19037 -17341 -18231 -14584 -5340 -1489 -2158 -4934
5140 -4934 -12265 -6070 2119 -3325 2300 9555 17440 13120 6349 -5191 -5494 -11293 -7053 1669 2019
5125 2019 4033 3712 10623 12027 15006 12482 -1188 -17681 -13567 -8321 2208 21379 25750 7270
5111 7270 1428 -4121 2877 6915 15018 21830 11340 14150 21238 29213 31166 28669 23634 10519
5097 10519 14664 7366 -9692 -12175 -10490 -14185 -6839 4776 5302 4579 7934 -6131 -10121 -13418
5083 -13418 -15057 -17583 -21790 -24232 -6413 10331 1698 -5957 -19521 -17027 -9397 -6337 -1709 -10895
5069 -10895 -16365 -15662 -9692 -8702 -9547 -33008 -33742 -18473 -7462 -619 -6368 -1131 -6622 -11736 -20493
5054 -20493 -11252 5716 14229 11876 1422 7953 11244 8963 6481 1028 1675 6937 1899 3046
5040 3046 10763 10205 -8277 -9551 -11019 -9904 -4441 -11588 -8887 -13296 791 -815 -7138 -580 73
5025 73 -3837 -11028 -18183 -19503 -3539 6818 15921 2808 -10488 -13923 7583 17525 5868 -899
5011 -899 -3015 -7532 -8265 -11434 -15844 -11042 -2683 -11381 -5110 -1763 -590 11046 2262 547 9512
4996 9512 13900 6288 3368 5056 1825 -594 -1893 -17597 -12887 -6691 -15211 -27509 -37438 -41555
4982 -41555 -17318 -4666 -5559 -3902 -20769 -28273 -18037 -12704 -8291 -13610 -24088 -12025 6933
4969 6933 7596 796 1353 8906 6610 6734 5807 15257 9713 3064 -8905 -7945 1359 10315 8677 11695
4953 11695 14765 19573 1859 6721 21915 36353 46978 26735 -13194 -20663 -15589 -12133 -16185
4940 -16185 -21797 -13506 -12001 2094 15877 20214 9560 965 -153 3937 -2183 -11150 -25181 -5746
4926 -5746 5754 3909 -5912 -4897 -11230 -1617 -7578 -3797 -2660 -2656 -3615 -1532 -10277 -10088 -7760 -20777
4910 -20777 -20433 -4098 10666 10201 7848 5131 -1202 -5594 -11489 -24149 -43553 -29645 -27599 -38320
4896 -38320 -42201 -42370 -40542 -41449 -37049 -27040 -20618 -14665 6917 -171 -21930 -10807 -3607 5347
4882 5347 3702 -3999 -5993 -2829 -1162 -21481 -15977 -5685 5 -2715 -4468 -354 5604 -799
4868 -799 -4938 -6661 -1883 1985 4972 3959 -1504 -8738 -22507 -20222 -134 -7763 5857 19047
4854 19047 6402 -7539 -2160 2368 4651 14779 17689 7164 1118 13352 14218 17346 23877 11956
4840 11956 -10738 -11247 -9898 -6496 165 3004 1896 1269 5756 12305 14468 7464 254 -8878 -11293
4825 -11293 -14043 -11756 -3914 225 -818 -3178 -4649 2869 1410 617 10397 22674 23511 6557 9558
4810 9558 16128 11407 -2134 5576 3987 3123 -4613 -4799 -7606 -8461 -9710 -11391 -7235 -1705 7085
4795 7085 9143 5798 13339 25991 13996 -3479 -10340 -23770 -15787 -12839 -9024 -100 7924 9215
4781 9215 -5352 -2563 10236 -829 -162 -2452 9473 13899 23258 28691 13399 7658 5752 -7097
4767 -7097 -15762 -6979 2061 682 -7660 -16643 -26888 -34341 -12911 -6866 -242 17400 20365 5421
4753 5421 -4900 8260 11404 9641 5190 9191 5760 6154 12489 13356 -1916 -4980 3807 4520 -16048
4738 -16048 -14005 -2082 3686 7248 9482 7826 11710 17285 15674 13510 8247 6802 5152 21785
4724 21785 32362 22042 11390 25407 6141 4508 21328 30300 28707 17527 8754 6605 5427
4711 5427 1632 -1340 -1960 2023 -3492 -2335 -7697 -7159 -13163 -20344 -14910 -25180 -24912 -32614 -18643
4696 -18643 373 10775 4178 -6993 -11886 -14584 -1469 5612 -2788 -1641 -2102 7712 9454 7436
4682 7436 -15641 -30966 -21974 -14388 -21158 -17437 -927 -3127 -6554 -12584 -6728 -4836 4483 917
4668 917 14392 15357 8336 3287 1815 -4709 -5622 -1837 225 1696 2018 8273 7692 5624 1749 4214
4652 4214 1914 3626 8224 6604 -2183 -2740 11928 7964 -7962 -21140 -26488 -29128 -21013 -8628
4638 -8628 -1554 -1173 6013 16300 16687 12514 13634 23221 21692 6733 -273 870 -6089 -749 4539
4623 4539 -1149 -2274 -18617 -11327 -6598 -2825 -1967 8772 17491 16512 13589 9039 3179 15425 24753
4608 24753 21955 21475 24605 16092 14884 22787 16454 -342 -1006 8342 2318 -7180 1531 15151 6049
4593 6049 -7042 -5729 6937 12385 8172 17870 22768 8998 5114 6319 8666 13872 16802 7762
4579 7762 -1384 -7209 -1386 8070 -6484 2489 8115 9050 11436 21265 19408 6129 -2863 -1579 4523
4564 4523 96 -6907 645 -24 1105 -16911 -30670 -18273 -18405 -19614 -19658 -12007 1800 5781 15483
4549 15483 15018 14213 12031 764 -11378 -18443 -14836 -20240 -19930 -8653 -8488 -12749 -11806 -9263 -29701
4534 -29701 -30631 -19535 923 3432 2306 -374 -3523 -1877 1727 5675 271 -1462 -2666 11992
4520 11992 21369 11711 -2700 -6024 -6569 -14747 -22662 -24105 -20199 -12074 -7474 5820 696 -352
4506 -352 -1108 -5147 -7335 -18425 -14015 6375 26849 29979 28887 30503 24222 11717 8113 -2295
4492 -2295 -15796 -13242 8662 6053 3445 -3932 305 1438 6156 6758 -5992 -11423 -239 -7688
4478 -7688 -19427 -17569 -21377 -23033 -30995 -22004 -3116 7522 1736 1607 -1093 8530 18641 17649
4464 17649 18427 9503 -6614 -782 -9896 -15835 -26916 -28801 -19016 -20514 -6680 3884 -2394 -11623
4450 -11623 -4712 10907 16454 11663 11789 7191 -1103 9086 17812 13107 10224 17841 18133 -1143
4436 -1143 5174 422 -692 8159 18801 25460 26895 31907 19101 15829 7890 13829 19107 11760
4422 11760 9716 7949 19649 5367 6573 18128 16180 21193 21610 6799 15265 24809 25422 20512
4408 20512 13731 9554 -13207 -23087 -17729 -19517 -24535 -28937 -25272 -26462 -24079 -19379 -29431 -20140
4394 -20140 -17350 -13770 -884 -2801 3471 2091 -1019 -4417 2442 11280 10797 2903 -7925 -11837
4380 -11837 -8644 -5617 -1235 -3454 -2137 -786 -13667 -2326 9030 421 7530 15708 23167 1316
4366 1316 -6952 -8395 2193 3988 49 1993 3419 9609 11563 -11061 -9515 -2952 -733 -16957
4352 -16957 -19913 -9760 -4710 -2957 -4899 1573 8820 3481 -3827 300 3310 -6326 -14795 -10574
4338 -10574 4856 2185 692 374 1543 2682 12862 8511 -9496 -24203 -15819 5917 6728 1354
4324 1354 -16767 -18168 -14014 -6351 -7878 -15574 -10716 -21156 -16653 -4727 8417 20286 15189 10294
4310 10294 6231 11207 15138 23455 18172 768 -6732 -3758 2648 -9686 -19370 -12431 -11017 -7557
4296 -7557 -7543 -20456 -23727 -25699 -27124 -27904 -21662 -8759 -6063 -6899 9231 8682 -2246 -9708 -14468
4281 -14468 -7010 5658 13912 16524 13669 10297 18500 20947 13685 -6997 -20690 -18098 -24076 -19934
4267 -19934 -156 -1631 -5415 -4662 -18021 -17512 -5975 3374 2486 -4929 -15098 -20261 -15198 -6874
4253 -6874 -22995 -30648 -20274 -7243 3687 3606 -10755 3431 -885 -8094 1290 -12120 -13483 -14871
4239 -14871 -14846 -22383 -24593 -23376 -13668 11246 4746 -20631 -34270 -35225 -30330 -23445 -5478 14081
4225 14081 16397 4379 352 927 674 7497 5801 -13321 -25641 -14932 5150 2730 -1800 -3827
4211 -3827 -6150 6345 738 -3581 -1233 19751 19754 35 -3402 -3329 -29517 -19761 -1719 541 -3362
4196 -3362 4169 6635 -3953 -18341 -26183 -25291 -13579 1797 -8165 -13224 -7226 -10371 -1902 204
4182 204 -1091 1092 2316 5385 1416 1359 -8022 -6012 -198 -5869 -12677 -1091 14578 33733 30422
4167 30422 26166 15001 37 1212 -4208 1451 6105 2571 -4568 -5003 17504 19657 12548 11690
4153 11690 11474 20104 14379 6654 11258 22180 26915 23660 30647 32392 36240 33508 28310 18379 -10507
4138 -10507 -28050 -22327 -24345 -11075 3739 20881 18946 7669 -3753 -1465 4435 60 5317
4125 5317 7361 5033 3106 12938 6642 7824 -2061 -745 -10959 -16096 -5394 8238 12738 5328
4111 5328 -420 -9709 -31170 -35566 -12557 772 9267 8575 5185 -7149 -14443 -8466 961 8267
4097 8267 16411 13094 10236 3134 -4867 -1784 14000 21541 7296 4997 4191 11457 10732 -8482 -31790
4082 -31790 -45213 -43346 -42742 -21191 1994 1445 9106 20641 15635 2700 -2373 -7908 -5449 -5753
4068 -5753 3552 -1728 -6198 -6989 -7914 -822 -2569 -14265 -8156 8986 22112 12483 3568 -149 -900
4053 -900 5550 5695 2180 -3849 -13833 -8560 1378 12641 8337 -324 -145 -8090 -2737 7392 -1172
4038 -1172 -5713 -4745 3598 -4526 -16967 -8966 10395 19939 15310 10079 11200 9435 7326 2554 -1158
4023 -1158 -2478 -15128 -5819 4614 10956 13288 7468 4813 16328 11798 8934 23428 20631 6908
4009 6908 896 3851 13544 8384 9054 -1819 -1932 9513 14324 5678 -5571 5385 12275 22138
3995 22138 24050 19730 15140 17221 10728 3637 -8397 -7881 12296 11215 4788 -584 7936 -8313
3981 -8313 -10793 -1546 8043 9960 585 4808 9484 4080 4768 12361 -10981 -17839 -5533 542 9100
3966 9100 -4825 -11065 -570 -5667 -13528 -20426 -34071 -37379 -32914 -28905 -30361 -23697 -5848 2278
3952 2278 274 -2029 -5813 -7400 9429 11002 -7982 -14905 -9042 10249 7345 6078 13910 13422
3938 13422 -7284 2401 2016 -3958 821 -13796 -3779 11580 12253 -719 1135 5220 12496 7015
3924 7015 -2295 -10857 -8541 -3350 -3317 -13283 -17409 -986 16768 21331 14215 14970 13397 3975 -528
3909 -528 -8685 -15434 -3611 11573 19783 6959 16758 21848 21660 16982 14625 19801 11923 -1727
3895 -1727 -7898 -6079 -17284 -18983 -10448 -3161 -14126 -16304 -19546 -6112 8488 16020 10821 3904
3881 3904 -3071 -13782 -14180 741 1008 -10271 -13827 -2889 -8806 -9744 -5869 -5508 -3796 2076 13863
3866 13863 19867 18594 8284 -1327 -5436 -10762 -10359 -4608 -7805 -7961 -8872 -16169 -14224 -10588 6598
3851 6598 3778 1665 5110 -9565 -20470 -18652 -22876 -12918 -4094 -216 286 -9509 -7754 5868
3837 5868 14440 8415 3869 5683 883 -3996 623 -4374 -9815 -10912 -8887 -5890 -15087 -13442 -1077
3822 -1077 3024 -4161 -12040 -14756 -13293 -20819 -8943 -522 -7819 -15663 -11353 -20675 -287 -5182
3808 -5182 -8615 178 -6957 -4012 2729 9911 8387 4735 14320 11364 510 633 -3469 -2065 5833
3793 5833 8532 10752 11024 -977 -3744 -811 -4131 -5920 -7133 -7248 1882 2631 9824 14631 12185
3778 12185 15725 21344 23654 8286 350 -11284 -8218 -96 8304 5733 13716 16474 3533 -4830
3764 -4830 3049 6575 9165 15289 16242 5257 2069 7163 13724 10734 -5995 -20812 -16861 -18736
3750 -18736 -6247 4186 5579 -1693 -17301 -16761 -3850 -862 -3868 -1302 3568 9453 15147 17973
3736 17973 17219 19439 20293 20336 18561 24297 17930 4788 -308 -5754 -11667 -5510 2943 12021 27027
3721 27027 14581 -3563 -12003 -8610 9589 14452 6793 1426 -1483 -12557 -13821 -15196 -11904 -2767
3707 -2767 -5561 -7799 7881 17015 8455 -9362 -21472 -12832 1664 6246 -11997 -19280 -16546 -14326
3693 -14326 -11985 -6885 125 2397 1728 10774 13891 9377 -7893 -13537 -13238 -13666 2925 13351 16308
3678 16308 14730 27010 28319 9715 11131 11505 1475 -9700 1156 307 -13673 -26802 -17207
3665 -17207 7657 -9802 -14360 -6215 -6444 2708 13217 9279 -6313 -22290 -26106 -21981 -13279 -201
3651 -201 13491 10108 -611 4190 16042 16609 11912 9726 -351 -6844 -3153 -3726 -7566 -5020 -2669
3636 -2669 3609 4957 838 -10983 -16906 -8135 1035 4147 15215 23268 6803 -4550 -5424 -8366
3622 -8366 -5882 -9930 -13758 -20180 -16094 -13320 -10932 -4479 8713 3764 -9635 -13036 -8536 -19832
3608 -19832 -18975 -4396 -2998 -10328 -8204 -10654 -6201 -2547 -11034 -16297 -13324 -20541 -12545 -17767 -18877
3593 -18877 -14720 -2945 10581 8668 11070 -2171 -2669 4734 288 0 6293 -1977 -17554 -15004
3579 -15004 -19679 -23276 -19507 -18435 -18867 -5444 213 8953 8227 5322 19065 23070 16742 11159 9060
3564 9060 749 -155 2143 2325 13434 15853 3550 1388 5403 17622 15995 -2271 -5225 -7760
3550 -7760 -6833 -12087 -7568 -11541 -12196 -3264 4683 -6965 -2532 5772 -9587 -15859 -14598 -7658 5486
3535 5486 11430 10655 5442 7589 18079 21575 13119 12725 23148 13975 12299 24212 24414 14128 4172
3520 4172 5979 2641 10887 18765 16075 7377 8287 3413 -11203 -12640 -15467 -17524 -12011 -8619 -7958
3505 -7958 629 3153 -8338 -7965 15439 20387 9494 -4470 2057 3372 11158 10274 2992 7426
3491 7426 4389 -1582 -1418 -2223 -7014 -5475 -3495 6159 12811 23277 15051 18230 18648 18778 3419
3476 3419 12280 3390 -191 15890 21773 13178 -1930 -9869 -12818 -7478 4751 -1069 6271 -4956
3462 -4956 5728 8814 1504 -3590 -8900 -2806 -3073 -12757 -36453 -37421 -24881 -22727 -11678 -4343
3448 -4343 -9054 -2811 -6307 -14154 -23773 -13538 -8676 -8056 -3133 1639 1780 16958 13464 -2989 -2435
3433 -2435 1720 4450 14076 18319 11916 -3129 -5088 -11614 -18391 -17660 -16873 -21123 -7270 2399 12155
3418 12155 20710 13039 25730 26651 8470 -736 9440 15429 253 -9909 1133 13923 19577
3405 19577 19453 27882 9274 2065 208 -426 -3408 -2595 -8850 -8990 7192 5150 -3410 -5259 -8439
3390 -8439 -8463 -13243 -14299 -12128 -14525 3602 16535 16190 -4440 1743 18237 11584 -3831 -7626
3376 -7626 -6798 8831 16537 11325 1742 -5663 -1498 2794 8530 11120 3821 7180 -7477 -7833 -17891
3361 -17891 -3357 -6688 -9884 -2536 3990 6178 6899 11023 11541 -5480 -13980 -11072 -2917 16393
3347 16393 16169 11482 -3910 -26825 -30341 -19777 -16474 -1226 7698 3080 3390 6844 17713 22318
3333 22318 9714 1574 -17329 -21832 -13851 -6795 -7384 -6696 -4750 2099 3258 3476 7390 -2295 -1867
3318 -1867 -3280 7759 11673 2670 -8101 -8670 -8488 5411 3239 8208 19201 13237 9556 5357
3304 5357 -15480 -13414 317 9232 17206 12574 6735 14895 24814 23641 20206 11947 6464 4430
3290 4430 8894 15373 16567 12001 9829 10588 2302 -13682 -13890 -7584 -7614 1588 3965 6517 -6355
3275 -6355 -20138 -13372 -19666 -18800 -18267 -15364 -18886 -1857 -2827 -9666 -13126 -19473 -20620 -23079 -15931
3260 -15931 -9692 -8545 -6607 -4094 -10582 -8258 7686 14260 16386 3793 -9024 -4205 -4478 -8181
3246 -8181 307 -3140 -3692 -13873 -9417 56 1165 -6910 -6213 3143 763 -9178 -10568 -8743 -19149
3231 -19149 -23776 -3052 3761 13869 17024 16941 21867 4723 -5894 -4421 2041 1982 -5152 -18815
3217 -18815 -18937 477 4294 8524 15024 -750 -10641 -6768 -1367 1554 11452 23104 29099 1853
3203 1853 -6754 8074 2392 3990 10002 5852 996 2257 5881 17999 15773 3749 -2396 3543
3189 3543 4387 11023 -204 -5972 -12580 -8574 11498 9635 2882 9905 9393 16697 22169 11046 -10840
3174 -10840 -18960 -18464 -7838 -3248 -4245 -5139 9762 21436 18795 8871 14570 14414 23880 5794 -8819
3159 -8819 -26292 -18665 384 342 6384 20791 13011 5650 1710 -1730 -5662 -11916 175 3636
3145 3636 6253 5111 1331 -352 -2823 -12712 -507 8712 10018 6921 2849 -1085 -1574 -1561 -7334
3130 -7334 -11732 -9167 -4122 7296 4160 -3611 -3922 -129 -1132 -12067 -9588 4173 -253 -9337
3116 -9337 -6650 -840 11527 1328 -9625 -11186 7980 10414 -4418 -7317 -16512 -13380 8431
3103 8431 19620 16381 16935 11494 3171 -3419 -14051 -4789 12405 5229 14133 26684 23896 17471
3089 17471 17787 10695 5555 6829 6677 8904 2606 3372 8345 14119 19218 13050 9161 20016 29541
3074 29541 35712 18051 5462 19397 25896 20506 22219 14617 350 -4369 -7150 -4417 7648
3061 7648 17162 6563 2847 -4350 -5829 -2116 -1092 5753 12013 11351 3504 -3760 1482 1380 -7910
3046 -7910 -10197 2157 5164 16959 12623 2520 -2805 1479 8737 17360 22356 27475 11888 2580
3032 2580 9690 812 1361 9475 19062 19611 13891 -417 -19074 -12297 -6776 -9023 5982 12712 8114
3017 8114 4796 9619 13212 618 -9599 -1236 5120 3763 -15272 -10825 -12708 -19728 -19852 -10874
3003 -10874 1254 -6349 1375 8028 2825 3913 7957 -1201 -1967 4769 -1436 -4142 4541 -4478 -159
2988 -159 9013 16856 4519 -8351 2999 19173 18755 22243 19853 14873 11897 10734 -1903 421
2974 421 6863 -1269 -6315 2256 21287 29954 6893 11284 21183 -6064 -18634 -9294 6124 6769
2960 6769 10153 12299 14553 11988 3496 1860 7274 20015 10051 7297 836 2943 6115 -4537
2946 -4537 5946 10271 6193 -7919 -15243 -3670 23043 17400 14769 19497 6431 -6529 -19063
2933 -19063 -31681 -30402 -15078 -13821 -3785 -75 -9667 -586 22714 19309 19930 23861 9337 6633
2919 6633 8228 9201 -1278 -18121 -21887 -5796 10918 -3596 -13653 -906 7644 9299 15877
2906 15877 6357 4281 5623 1247 367 -415 -4167 2537 6742 1838 12637 10365 16836 9664 13548
2891 13548 10863 -7205 -4044 -11446 -22336 -14258 3967 6038 11898 6148 -9735 -15005 -12660 -7564
2877 -7564 6645 14503 8876 5778 14314 11529 15511 -1787 -18607 -28425 -19920 -13429 -16819 -23172
2863 -23172 -17038 -9980 1689 14812 27043 12609 1315 1459 2712 -15704 -11673 -7816 -4271
2850 -4271 -837 8431 365 -7735 -4666 -5363 3083 9029 11189 -304 -2991 -3924 -11127 -10360 -13927
2835 -13927 -5910 -4900 -4575 7133 1971 6187 27661 28393 17199 3057 -15740 -6234 -1570 -7112
2821 -7112 -11267 3588 10545 8767 -1483 -16021 -1206 7411 -3402 -7623 2617 627 -4056
2808 -4056 -10135 -3114 -3791 -10366 -19268 -8080 -10927 -5657 -7247 -20135 -21113 -24792 -12215 3285
2794 3285 4959 -4702 -13485 -15408 -17915 -10108 -645 -3524 -6790 -7367 11695 21909 26111 17684 5813
2779 5813 9943 9850 -2825 7144 5231 3107 9557 15866 9521 19482 18301 -476 3641 -3030 6669
2764 6669 11469 -2991 -15260 -8996 1264 1439 7584 -4550 -13150 -12469 -8317 -11198 -8648 6258
2750 6258 22220 17211 -2338 -5423 574 -7620 -19780 -17181 -7033 -10417 3716 6219 4120 -11273
2736 -11273 -24797 -21922 2184 7145 -7901 -5070 4895 1087 4478 6490 8933 2507 8178 9745
2722 9745 3720 8181 2348 -10705 -11132 -14380 -10676 -11466 -6691 -2697 11913 14695 12050 21617 17965
2707 17965 12581 29050 26320 10737 7214 11812 15608 7946 7292 3540 -1521 -735 6610 10562 2568
2692 2568 806 -6540 -2837 -1243 -2647 -3016 6540 11006 1752 -11517 -15618 -10778 7766 21318
2678 21318 13129 4988 3025 -7783 -4975 -2406 -14429 -13017 -2562 6473 -6982 -3409 2971 18025
2664 18025 28092 18928 13716 23779 20191 8729 4895 -426 -7218 -10972 -14200 -9917 2680 12824
2650 12824 12761 3166 -6468 1312 15514 5394 3425 15470 8947 265 220 4043 13100 27605 31026
2635 31026 33502 34409 34331 16281 6281 16275 13055 11128 4084 -7098 3107 8266 713 -587
2621 -587 -742 -1144 2323 1886 2275 -10201 -7566 -8159 -3014 -9095 -7812 -8104 -13083 -9322 -1675 4811
2605 4811 13802 17190 3515 2501 16999 9482 1351 13399 18442 3343 -3356 4151 -2780 -10253
2591 -10253 -18299 -6933 -4010 -9010 -5293 12939 14318 8016 7224 12571 6905 8188 10834 14880
2577 14880 10614 14226 17647 5599 -14577 -11844 -9920 -4311 -346 8419 393 2157 11977 22090
2563 22090 15859 -2783 -4756 3617 11596 11832 11486 8980 6573 4777 -3355 -8567 -9390 -14170 -9510
2548 -9510 -1821 -9449 -13105 3354 18260 15391 5004 -12733 3757 16242 10544 -198 -10376
2535 -10376 -24531 -34155 -22494 -17255 -15238 -2656 8760 9881 1297 -6607 -16169 -12600 -12263 11496
2521 11496 23790 31782 31429 23200 -539 -11611 -19342 -25924 -35783 -26571 -25847 -16195 5228 4818
2507 4818 1572 2817 4907 5550 820 -9562 -12497 4235 -1427 -2238 15001 24216 24300 25744 20408
2492 20408 6166 -1585 -7684 3422 8626 4377 3780 -11701 -19010 -10103 -8667 -23009 -25459 -17118
2478 -17118 -16952 -78 9338 13106 -412 -7674 5258 7068 12757 8555 6212 -7468 -14558 -18883
2464 -18883 -24008 -17479 -21402 -18836 -2914 -6636 -10392 510 3734 6749 11467 9203 17053 17980
2450 17980 14682 -1985 -18685 -19788 1266 4852 6024 15706 12742 -2472 -13157 -16100 -12399
2437 -12399 872 13506 24579 20433 20389 19755 10558 14052 12256 -3461 1510 4898 2594 2373 -4090
2422 -4090 -4093 -459 806 -6132 -8007 -1380 -4023 -10136 -23944 -20691 -8126 4572 4001 1012 -16648
2407 -16648 -19958 -11081 3776 -960 -2949 19573 34985 33120 16902 12517 15236 -218 -11002
2394 -11002 -5360 -5023 -2595 -4787 -5279 -3237 3309 10853 12373 6202 3180 -11967 -25417 -18919 -16076
2379 -16076 -10876 -8673 5448 12862 -3803 -14426 -5132 -6520 -3088 -10695 -4402 4286 -84 -9467
2365 -9467 -12661 -6556 7019 5130 481 -5997 2709 26660 14819 12659 16126 8158 4722 10979
2351 10979 -262 -2876 -11453 -19686 -13433 -17428 -22730 -27109 -15701 -7314 -1080 951 588 3295
2337 3295 5860 80 4895 1886 2951 1835 1707 11076 8296 -5745 -3484 6025 15132 24646 24369
2322 24369 15782 -7354 -12859 -4926 211 -917 -17941 -27415 -34071 -28288 -29009 -26820 -24137 -20547
2308 -20547 -10371 -10698 -20419 -21802 -2679 2966 1337 -19350 -25604 -11108 -6687 -14361 -20219 -17449
2294 -17449 -15839 -21049 -10717 10513 6879 800 -2160 3051 1757 -9136 -1825 3614 2810 -4736
2280 -4736 3909 9304 16925 21888 15056 2868 -6754 -6833 -5975 -641 -1165 -1188 -5777 -4447 -646 -1092
2264 -1092 -4145 604 1850 11649 8514 -17176 -17276 -11327 -14754 -14309 -12101 -5269 -18230 -15870 -2987
2249 -2987 6233 5300 -2445 -11285 -24468 -21943 -15407 -3478 7224 2272 -8255 -15680 -11726 -3760
2235 -3760 7236 18784 22817 5628 -9112 1944 9107 4756 4639 7498 -7289 -7121 8156 2810
2221 2810 253 135 415 15434 7940 -1546 2143 -129 3769 1869 -7128 -18441 -5716 472 -5398
2206 -5398 -4666 -7806 -10377 -19470 -13610 -8926 -12466 -3803 12325 23288 17632 17069 5882 -919 1998
2191 1998 8674 -3371 -14055 -8864 -1944 -2945 -8852 -14814 -10890 -8269 1440 9637 16886 12612
2177 12612 14152 23606 24883 16600 5517 6420 10035 4363 -14707 -17842 -13366 -13443 -19270 -14191 -7090
2162 -7090 -15559 -14330 -16464 -17836 -10790 72 332 -3784 -9324 -16210 -22707 -362 -1053 9354 6706
2147 6706 8285 15645 11174 14194 18850 21515 23971 34713 40225 31250 12040 -7419 -8449 4416
2133 4416 -8562 -6102 -4563 -1157 -6051 -1771 6837 6560 946 3492 117 -16089 -15449 -11824 -13714
2118 -13714 -5377 -1262 2264 131 -1816 3907 2262 -3279 6211 5668 -2236 -17164 -22111 -19987 -20375
2103 -20375 -9555 -10440 -14811 -8622 -16745 -12111 12 2737 -1243 1868 705 1108 6097 2995 1201
2088 1201 -6480 -7954 -12940 -6986 -7378 9720 22409 15976 3761 -5817 -1923 -3570 8088 19303
2074 19303 1219 -6355 8041 22856 21543 9205 1381 9544 -1297 -6739 -12300 -12765 -1515
2061 -1515 1859 4420 6651 5916 -7290 -5103 2436 2653 3111 -2341 -6314 835 4683 -7239 -12245
2046 -12245 -16483 -20481 -12513 -8507 -4617 -11864 -21189 -14409 -6263 -4680 -9670 -19129 -9504 4199
2032 4199 10562 113 -14791 -4064 585 4686 3685 4270 17328 11218 14774 12575 3423 12782
2018 12782 6655 5876 -180 -20360 -23330 -20394 -10367 -1278 9174 5261 23848 13924 -2325 -7840
2004 -7840 -3178 2148 1882 1572 -4415 -7380 -7213 -17956 -2449 -4846 -12812 -4131 16808 28904 22322
1989 22322 10499 1967 16323 30029 10801 -7968 -10276 -8177 -1416 -1798 -17582 -23937 -25529
1976 -25529 -7552 14025 16796 16133 14590 8105 4252 -9719 -22739 -28876 -27547 -18310 -9692 -599
1962 -599 -12094 -9130 -4747 -675 1356 -1988 7767 -2189 -6954 -2277 3796 16344 27733 13125
1948 13125 8073 13613 10226 1885 -9560 -23386 -19957 -4602 -1172 -5711 -12298 -20529 -26041 -24630
1934 -24630 -9980 -7947 -10162 -4258 -3071 -13240 -2965 -4701 -1875 -12400 -11575 -11185 -10951 3547
1920 3547 13302 -4515 -5851 14710 17016 20745 20957 15076 248 -18449 -18599 -13150 -13102 -4077 7725
1905 7725 15202 10391 2832 2299 6743 7338 9598 16831 11315 6480 6724 2980 -8237 1422 -4297
1890 -4297 -5757 6971 1280 -11694 1216 4839 1562 4346 20231 11521 10087 6744 16085 21012
1876 21012 9710 3599 7179 2716 -7702 -5365 -7613 -1889 4690 13731 1389 2185 4302 79
1862 79 641 -10309 -11277 -3362 -8913 -20643 -16996 -3639 -7255 -20377 615 729 13568 15967 10784
1847 10784 10942 28081 27441 22251 12875 -2671 -6596 -1596 545 5476 9801 3549 -11595 -1243
1833 -1243 2786 4913 4779 -1809 -9466 103 -1028 -6515 -19833 -34470 -21042 -16705 -11668 11821
1819 11821 25772 22789 1130 -14725 -5620 9233 12642 18797 4130 -8990 -17005 -13252 5394
1806 5394 8994 13999 8942 16199 21148 24610 24187 26258 14717 13154 24422 16756 18065 26271 18886
1791 18886 13369 4775 368 4637 5320 4614 10344 25518 18669 3305 5947 14825 4189 2307
1777 2307 12075 3773 3229 -5655 -14989 -12542 -3143 -4280 -3760 -3200 -8601 -11222 1285 8916 10258
1762 10258 14878 11406 8736 -8894 6688 16249 -2500 -15900 -23031 -4788 -2399 -9813 -1766
1749 -1766 12733 14094 9892 11639 17798 14474 -2170 -1138 -3989 5505 2104 -9725 -11938 2121
1735 2121 6117 9948 -1247 -8019 -13096 -5101 -5516 -5685 -3743 -8526 -7937 -1930 2020 4617 5969
1720 5969 10262 10796 7833 9641 1859 -1183 4246 14276 6787 5140 6914 9379 12969 15034 2881
1705 2881 -3081 -904 -7456 -17363 -6375 -5266 -2221 -3349 -2291 7753 10911 -8532 -7690 3069
1691 3069 -3462 -12245 -22879 -24705 -9227 1470 11117 8056 7268 8030 6162 11419 7596 -3202
1677 -3202 -4886 -8940 -3287 758 -1930 2283 5199 -6328 -1436 3722 8056 8424 -1613 -11392 -14284
1662 -14284 -13401 -384 -8510 -15748 -8575 -8363 -5636 -17388 -23175 -20100 -17029 -30730 -27977 -7519
1648 -7519 9235 6205 965 3275 -4320 5259 16808 25554 15952 4976 -9591 10440 17705 16812
1634 16812 28407 15731 -12729 -21894 -12117 8832 28445 18766 16774 -778 -23920 -22493 -16070
1621 -16070 -3575 -14325 -13975 -17942 -10374 -10228 -7583 -350 3334 2242 -10181 -24305 -16213 5686
1607 5686 20808 15272 9150 5515 2271 5649 6634 12347 2648 -11720 -12161 -10436 -4261 3159 951
1592 951 3996 16368 13554 4270 -8882 -5394 -3831 -7038 -7641 5113 4909 10529 7075 1610 -8019
1577 -8019 -14308 -19807 -12837 -15149 -14843 -7450 2743 -5152 -13359 -16281 -9653 4601 -1763 -4936 -4534
1562 -4534 -6775 -4554 4162 -18 -3741 8977 -3246 -6027 -13339 -16851 -5217 19819 18072 2467
1548 2467 -13658 -17561 -13844 -12162 -11865 5264 2959 -6911 -6917 -6088 -2706 1481 -75 5978 -4747
1533 -4747 -23403 -28579 -18620 -19521 -17225 -5615 -4621 -5407 -5091 58 -3191 -3174 -6665 -11566 1995 707
1517 707 -9129 -13323 -6779 -10561 -14936 -14082 -7983 -8231 -6031 -4175 -4952 -15559 -21882 -11896 739
1502 739 7669 -10174 -8796 -13420 -11765 -10104 -7937 -6985 1190 21575 14533 4437 -13602 -12348
1488 -12348 12325 24155 10968 -2267 -6402 -3367 -5106 8487 -4131 -11342 -931 -7912 -4641
1475 -4641 7380 5724 -10109 -11937 -7945 12143 16220 10850 -123 -907 -2724 789 10319 2791
1461 2791 -16666 -29450 -28276 -7888 4309 -2835 -2771 4658 5045 -8658 -14082 9027 15475 -1863
1447 -1863 1292 9993 1942 -617 -8331 -11423 -16217 -27332 -13116 48 -13308 -13955 -6449 10604
1433 10604 -7267 -12071 -7011 -5061 10838 15198 23523 18996 3331 -1491 1066 8110 3903 -979
1419 -979 -6715 -15615 -5814 587 -7571 -4277 3839 2563 -1398 2736 -1032 -2264 97 -325 -4419
1404 -4419 5319 4033 1441 3074 6818 -8163 -9607 -6608 -17308 -33971 -26339 -6558 -4512 10597
1390 10597 21426 29987 24242 29392 7910 -5265 -6520 1108 12393 6135 4546 6535 4517 4387
1376 4387 1043 -11449 6175 23962 7568 -21009 -16702 -3076 698 6209 -2356 -13608 -6781
1363 -6781 -11778 -11409 -3162 -14255 -18875 -8021 -1597 284 -4856 -11592 -14042 -10650 -14317 -16937 -10718
1348 -10718 -7451 -4628 5482 8163 11449 1560 -5106 -11282 -10822 -18568 -10470 -8801 -20364 -10189
$$ [...]
##END NTUPLES=NMR SPECTRUM
##END=
