##TITLE=Analysis number 317121
Compound Code cc 43351
Book Reference 414/172/2
Project Code adrs
Chemist Name mattw
##JCAMPDX= 6.0         $$ Bruker NMR JCAMP-DX V2.0
##DATA TYPE= NMR SPECTRUM
##DATA CLASS= NTUPLES
##ORIGIN= Bruker BioSpin GmbH
##OWNER= nmr
$$ XWIN-NMR		Version 3.5
$$ Thu Feb  9 18:28:12 2006 GMT Standard Time (UT+0h)  MAYBRIDGE\nmr@NMR_250MHZ
##.OBSERVE FREQUENCY= 250.131544655141
##.OBSERVE NUCLEUS= ^1H
##.ACQUISITION MODE= SIMULTANEOUS (DQD)
##.ACQUISITION SCHEME= undefined
##.AVERAGES= 16
##.DIGITISER RES= 18
##SPECTROMETER/DATA SYSTEM= dpx250
##.PULSE SEQUENCE= zg30
##.SOLVENT NAME= DMSO
##.SHIFT REFERENCE= (INTERNAL, DMSO, 0, 16.522)
##AUDIT TRAIL= $$ (NUMBER, WHEN, WHO, WHERE, WHAT)
$$ ##TITLE= Audit trail, XWIN-NMR		Version 3.5
$$ ##JCAMPDX= 5.01
$$ ##ORIGIN= Bruker BioSpin GmbH
$$ ##OWNER= nmr
$$ C:\u/data/dgb/nmr/ADRS/15730/pdata/1/auditp.txt
$$ ##AUDIT TRAIL=  $$ (NUMBER, WHEN, WHO, WHERE, WHAT)
(   1,<2006-02-09 18:27:51.02 +000>,<MAYBRIDGE\nmr>,<NMR_250MHZ>,
      <created by zg, POWCHK disabled, PULCHK disabled
       configuration hash MD5:
       84 BC 41 DB A1 6E 1D 46 DA 25 12 A5 C1 ED C5 3A
       data hash MD5: 64K
       07 FE FE 83 C0 0C C1 CA 6D AF 88 26 34 8F AB 7E>)
(   2,<2006-02-09 18:28:03.58 +000>,<MAYBRIDGE\nmr>,<NMR_250MHZ>,
      <Start of raw data processing
       ef LB = 0.3 FT_mod = 6 PKNL = 1 SI = 32K 
       data hash MD5: 32K
       3D 64 E4 DF 6C 93 F3 83 35 9C F9 91 52 A7 CD AA>)
(   3,<2006-02-09 18:28:05.50 +000>,<MAYBRIDGE\nmr>,<NMR_250MHZ>,
      <apk 
       data hash MD5: 32K
       BC EF EF 08 5C B8 CB 2A B7 78 9E 45 14 2C D1 65>)
(   4,<2006-02-09 18:28:06.28 +000>,<MAYBRIDGE\nmr>,<NMR_250MHZ>,
      <abs ABSG = 5 
       data hash MD5: 32K
       D5 CA DE 74 E6 4D D5 34 61 38 C1 E9 B1 3A D7 67>)
$$ ##END=
$$ 
$$ hash MD5
$$ EB 49 B0 0D 22 11 38 5B B8 E0 AD A0 F1 C2 17 6E
##$RELAX= 
##$RELAX= 
##$RELAX= 
##$RELAX= 
##$RELAX= 
##$RELAX= 
##$RELAX= 
$$ Bruker specific parameters
$$ --------------------------
##$DU= <C:\u>
##$EXPNO= 15730
##$NAME= <ADRS>
##$PROCNO= 1
##$TYPE= <nmr>
##$USER= <dgb>
##$AMP= (0..31)
100 100 100 100 100 100 100 100 100 100 100 100 100 100 100 100 100 100 
100 100 100 100 100 100 100 100 100 100 100 100 100 100 
##$AQSEQ= 0
##$AQ_mod= 3
##$AUNM= <au_zg>
##$AUTOPOS= <7 >
##$BF1= 250.13
##$BF2= 250.13
##$BF3= 250.13
##$BF4= 250.13
##$BF5= 500.13
##$BF6= 500.13
##$BF7= 500.13
##$BF8= 500.13
##$BYTORDA= 1
##$CFDGTYP= 0
##$CFRGTYP= 5
##$CHEMSTR= <none>
##$CNST= (0..31)
1 1 145 1 1 1 1 1 1 1 1 1 1 1 1 1 1 1 1 1 1 1 1 1 1 1 1 1 1 1 1 1 
##$CPDPRG= <>
##$CPDPRG1= <>
##$CPDPRG2= <>
##$CPDPRG3= <>
##$CPDPRG4= <mlev>
##$CPDPRG5= <mlev>
##$CPDPRG6= <mlev>
##$CPDPRG7= <mlev>
##$CPDPRG8= <mlev>
##$CPDPRGB= <>
##$CPDPRGT= <>
##$D= (0..31)
0 1 0 0 0 0 0 0 0 0.06 0 0 0 0 0 0 0.0002 0 0 0 0 0 0 0 0 0 0 0 0 0 0 
0 
##$DATE= 1139509670
##$DBL= (0..7)
120 120 120 120 120 120 120 120 
##$DBP= (0..7)
150 150 150 150 150 150 150 150 
##$DBP07= 0
##$DBPNAM0= <>
##$DBPNAM1= <>
$$ [...]
##$SUBNAM7= <"">
##$SUBNAM8= <"">
##$SUBNAM9= <"">
##$SW= 20.6930455092707
##$SWIBOX= (0..15)
0 0 3 0 0 0 0 0 0 0 0 0 0 0 0 0 
##$SW_h= 5175.983436853
##$TD= 65536
##$TD0= 1
##$TE= 294.16
##$TE2= 300
##$TE3= 300
##$TEG= 300
##$TL= (0..7)
0 120 120 120 120 120 120 120 
##$TP= (0..7)
150 150 150 150 150 150 150 150 
##$TP07= 0
##$TPNAME0= <>
##$TPNAME1= <>
##$TPNAME2= <>
##$TPNAME3= <>
##$TPNAME4= <>
##$TPNAME5= <>
##$TPNAME6= <>
##$TPNAME7= <>
##$TPOAL= (0..7)
0.5 0.5 0.5 0.5 0.5 0.5 0.5 0.5 
##$TPOFFS= (0..7)
0 0 0 0 0 0 0 0 
##$TUNHIN= 0
##$TUNHOUT= 0
##$TUNXOUT= 0
##$USERA1= <user>
##$USERA2= <user>
##$USERA3= <user>
##$USERA4= <user>
##$USERA5= <user>
##$V9= 5
##$VALIST= <valist>
##$VCLIST= <CCCCCCCCCCCCCCC>
##$VD= 0
##$VDLIST= <DDDDDDDDDDDDDDD>
##$VPLIST= <PPPPPPPPPPPPPPP>
##$VTLIST= <TTTTTTTTTTTTTTT>
##$WBST= 1024
##$WBSW= 4
##$XGAIN= (0..3)
0 0 0 0 
##$XL= 0
##$YL= 0
##$YMAX_a= 304097
##$YMIN_a= -292468
##$ZGOPTNS= <>
##$ZL1= 120
##$ZL2= 120
##$ZL3= 120
##$ZL4= 120
##$ABSF1= 16.522
##$ABSF2= -4.171173
##$ABSG= 5
##$ABSL= 3
##$ALPHA= 0
##$AQORDER= 0
##$ASSFAC= 0
##$ASSFACI= 0
##$ASSFACX= 0
##$ASSWID= 0
##$AUNMP= <proc_1d>
##$AZFE= 0.1
##$AZFW= 0.1
##$BCFW= 0
##$BC_mod= 0
##$BYTORDP= 0
##$COROFFS= 0
##$CY= 12.5
##$DATMOD= 1
##$DC= 0
##$DFILT= <>
##$DTYPP= 0
##$F1P= 14.0000005364418
##$F2P= -0.99999901652339
##$FCOR= 0.5
##$FTSIZE= 32768
##$FT_mod= 6
##$GAMMA= 0
##$GB= 0
##$INTBC= 1
##$INTSCL= 1
##$ISEN= 128
##$LB= 0.3
##$LEV0= 0
##$LPBIN= 0
##$MAXI= 10000
##$MC2= 0
##$MEAN= 0
##$ME_mod= 0
##$MI= 0
##$NCOEF= 0
##$NC_proc= -5
##$NLEV= 6
##$NOISF1= 0
##$NOISF2= 0
##$NSP= 0
##$NTH_PI= 0
##$NZP= 0
##$OFFSET= 16.522
##$PC= 1
##$PHC0= 93.78375
##$PHC1= 8.783355
##$PH_mod= 1
##$PKNL= yes
##$PPARMOD= 0
##$PSCAL= 4
##$PSIGN= 0
##$REVERSE= no
##$SF= 250.13
##$SI= 32768
##$SIGF1= 0
##$SIGF2= 0
##$SINO= 400
##$SIOLD= 32768
##$SREGLST= <1H.DMSO>
##$SSB= 0
##$STSI= 32768
##$STSR= 0
##$SW_p= 5175.98343685301
##$SYMM= 0
##$S_DEV= 0
##$TDeff= 65536
##$TDoff= 0
##$TI= <Analysis number 999999
Compound Code 99
Book Reference 9
Project Code 9>
##$TILT= no
##$TM1= 0
##$TM2= 0
##$TOPLEV= 0
##$USERP1= <user>
##$USERP2= <user>
##$USERP3= <user>
##$USERP4= <user>
##$USERP5= <user>
##$WDW= 1
##$XDIM= 32768
##$YMAX_p= 437433981
##$YMIN_p= -1059798
$$ End of Bruker specific parameters
$$ ---------------------------------
##NTUPLES= NMR SPECTRUM
##VAR_NAME=  FREQUENCY,     SPECTRUM/REAL,   SPECTRUM/IMAG
##SYMBOL=    X,             R,               I
##VAR_TYPE=  INDEPENDENT,   DEPENDENT,       DEPENDENT
##VAR_FORM=  AFFN,          ASDF,            ASDF
##VAR_DIM=   32768,         32768,           32768
##UNITS=     HZ,            ARBITRARY UNITS, ARBITRARY UNITS
##FACTOR=    0.157963299565203, 1,           1
##FIRST=     4132.6476996994, 0,             0
##LAST=      -1043.33573715361, 0,           0
##MIN=       -1043.33573715361, -1059798,    0
##MAX=       4132.6476996994, 437433981,     0
$$ Real data points
##PAGE= N=1
##DATA TABLE= (X++(R..R)), XYDATA
$$ [...]
20445A15394l7123J7585n7532q7698n2932P6498n6271N7843L016j13503N1706
20434h3017K2353j12523p1181L8977J19668p6923j38349J72021K31615M9604Q4509
20423B36754q1809k23842p718p6428j40939R734J30855P3406k5258m1394O0509
20412h6130o0214k7721K08315l3944k22427p097J34292J2163J2436K6629p412
20401e1110j05161K5322P0172P2690J51889O1225J5755q7743k7746Q6417L6786
20390B48496j58291P2656l0600l71388m7491P3139R6404J7034P4176n8227j19193
20379b03285J4284N9031j18319j0721k899j27744l8837j688R7135K68944k3760
20368h7859j23641r1368M0346N8271K32102j3021m4343L5208J28202M2701M8661
$$ plain form
20445 115394 78271 95856 38324 -49374 -102306 -25808 -82079 -24236 -21220 -134723 -83017
20434 -83017 -60664 -173187 -244368 -205391 -85723 -162646 -300995 -128974 102641 152245 236754
20423 236754 154945 -68897 -76615 -153043 -293982 -284248 -153393 -79987 -105245 -146639 -86130
20412 -86130 -146344 -174065 34250 306 -222121 -229218 -94926 -82763 -70327 -43698 -51110
20401 -51110 -156271 -130949 -60777 11913 163802 225027 240782 153039 125293 211710 248496
20390 248496 90205 162861 132261 -239127 -286618 -213479 -117075 -100041 -25865 -84092 -203285
20379 -203285 -189001 -129970 -248289 -259010 -261909 -389653 -428490 -430178 -333043 -64099 -87859
20368 -87859 -211500 -302868 -262522 -204251 27851 14830 -29513 5695 133897 176598 225259
20357B25259j80051k45821j51660J10463m5508j21028K4798M5731m0609K2844
20347c55582P985n4432K3997m1008m3106K7648J78905n7497r6179K65776R8782
20336d4711N6169J1843p0608J16825J2725j16815n5301j57889M4529J43672n6127
20325a15688J52921j5493R1145j13506R0193j5283K5701J60200j54530p7704j15625
20314h7669j77968j2728K02526J17199k05814j11910J29826j8339j57351Q535
20304c13693J67224o5628j96829L7226n8895O3783Q603K23896J87345j1977j55390
20293a14335q0734O8677r3314o5705J05286j1515K0665j52722J68131M6211L5841
20282g3514O9896L008M9226p9829J5380J55445P4931J63862j20696j59408N8749
$$ plain form
20357 225259 45208 -200613 -352273 -241810 -287318 -408346 -383548 -337817 -378426 -355582
20347 -355582 -347597 -402029 -378032 -419040 -462146 -434498 -255593 -313090 -409269 -143493 -44711
20336 -44711 11458 23301 -47307 69518 82243 -34572 -89873 -247762 -203233 -59561 -115688
20325 -115688 37233 21740 112885 -621 89572 74289 99990 260190 105660 27956 -87669
20314 -87669 -265637 -278365 -75839 41360 -164454 -276364 -146538 -164877 -322228 -313693
20304 -313693 -146469 -212097 -408926 -371700 -430595 -366812 -358209 -134313 53032 41055 -114335
20293 -114335 -195069 -126392 -219706 -285411 -180125 -191640 -170975 -323697 -155566 -109355 -73514
20282 -73514 -3618 -610 48616 -31213 -15833 139612 214543 378405 257709 98301 157050
20271A57050M8945K12626j3196j11385r4044j5377L0364k2295o2686k7526l437
20260I9039L7927k32527j95683R9449P527O6564J4805J86865n8684k81035K1732
20249b34021J31113n3817m6134k9165L518p6445j5791M4994O2828P9255J52021
20238A8356O8160j45098n6819J81948L5678j9545q3600o7533j881q2996N4169
20227i9161q414j18225k7182j8213R9430N2164p6321k33861O3587J03784n4166
20216c16578j33712J50378K39790K8672M2208K9338j12758L4846O1430q0945n8825
20205a16156p2364J0958J20893M6897N0640J4703J9395O0998j30187k78745k341
20194b75309K25519O6576J894L6173p7585r0970j66314R5557J69819q9673q6397
$$ plain form
20271 157050 205995 418621 405425 294040 199996 184619 214983 192688 130002 102476 99039
20260 99039 136966 -95561 -291244 -191795 -184268 -117704 -102899 83966 25282 -255753 -234021
20249 -234021 -102908 -156725 -202859 -232024 -228506 -304951 -320742 -275748 -212920 -133665 18356
20238 18356 86516 -58582 -115401 66547 102225 82680 -920 -68453 -70334 -153330 -99161
20227 -99161 -107575 -225800 -252982 -271195 -171765 -119601 -195922 -429783 -366196 -262412 -316578
20216 -316578 -450290 -299912 -60122 -31450 10758 40096 -72662 -37816 23614 -57331 -116156
20205 -116156 -188520 -177562 -56669 -9772 40868 55571 74966 135964 5777 -272968 -275309
20194 -275309 -49790 16786 18680 54853 -22732 -113702 -280016 -184459 -14640 -104313 -190710
20183a90710K4347q4961J1498n6468Q1691J80850p5080m9520n4998J67607j02942
20172a48686q5939n5704J28019J53681J43545j69377k30545j20112p1811Q5049
20162c71880M1331P0065l0115m9775J45053J26598l6255q6270p0752J91330o3377
20151a34047o3499J2164j82013o5462j9554K18455Q1079J2414O2157K9347l6668
20140h5627r9302M2678K9055R5605q1513j243Q1334j20809k7154P3142r4228J29194
20128e8868p4492j33502m8322Q4866N4385O6760J0561p8984j0062L017J11364
20117g3277l948k46018k1390L7298o6234R7755J08628Q0655M8388j5601m5972
20106i9716O4853m8279m5191M9129K7041n3263p7080j37134p3007k5294K8431
$$ plain form
20183 -190710 -166363 -251324 -239826 -296294 -214603 -33753 -108833 -158353 -213351 -45744 -148686
20172 -148686 -234625 -290329 -162310 -8629 134916 -34461 -265006 -385118 -456929 -371880
20162 -371880 -330549 -260484 -290599 -340374 -195321 -68723 -104978 -191248 -262000 -70670 -134047
20151 -134047 -197546 -185382 -367395 -432857 -452411 -233956 -152877 -140463 -78306 -48959 -85627
20140 -85627 -184929 -142251 -113196 -17591 -99104 -100347 -19013 -139822 -166976 -93834 -188062 -58868
20128 -58868 -133360 -266862 -315184 -230318 -175933 -109173 -98612 -177596 -187658 -184641 -73277
20117 -73277 -77225 -323243 -344633 -307335 -373569 -275814 -167186 -86531 -38143 -53744 -99716
20106 -99716 -34863 -83142 -128333 -79204 -52163 -105426 -182506 -319640 -392647 -417941 -389510
20095c89510P1995J36294O5193j3909J74311K3024O84J9691m843k54052j37913
20084c09035J47163K66892m1967o745p5282k41705J19910L1820O2941J8344j3484
20073d1148j5621L3321P1944P2567J36756j3321k16992l8620n813p4039l1080
20062a22046q624P9721L1561R7926r4764p6556J07323j35879j05381o0484K9483
20051b57720j13284J85384K47509M1685n1919j67424j52217j22889o3551J01800
20041c52626P1429p927q2160L1526R3646O8453L1539R0233M6833n2888j37534
20030a99476N5710Q1659J15526J10367m8048r2244j45654J2962P083J63988O8993
20019A30866j18654o9435j71087K11212J17097J8627j15038p9118r6349N6144
$$ plain form
20095 -389510 -317515 -181221 -116028 -129937 44374 67398 68082 87773 82930 -171122 -309035
20084 -309035 -161872 105020 63053 56308 -18974 -260679 -140769 -108949 -46008 -27664 -41148
20073 -41148 -56769 -23448 48496 121063 257819 244498 27506 -11114 -16927 -90966 -122046
20062 -122046 -130670 -50949 -19388 78538 -16226 -92782 14541 -121338 -226719 -287203 -257720
20051 -257720 -371004 -185620 61889 103574 51655 -115769 -267986 -390875 -454426 -352626
20041 -352626 -281197 -289124 -371284 -339758 -246112 -177659 -146120 -55887 -9054 -61942 -199476
20030 -199476 -143766 -62107 53419 163786 115738 23494 -122160 -109198 -102115 61873 130866
20019 130866 12212 -57223 -228310 -17098 99999 118626 3588 -75530 -171879 -115735
20009a15735J03115M4906j00941j9597p8576q542Q2614J12432L9338m1635j37317
19998a19938j04683k94505J03772J98079J4131Q9216o0702l8767m926J31517j20170
19987b06976k8689Q5924M9389j57872l76715p4281J02932L65708J39309p9203
19977a80474j06388P4669O2771N3124j3445J7799J08302R5554n9557q4958J1312
19966b1291r9593J8255m1802r4598J07O1634J65246r834j14263p2029K822J07580
19954i7766J09560j40317j834J798k7843K6286J56760O3950n4348k3319l8944
19943b6017r4293R6304L1558j23658N6174l8733r0175K1727o6008m4173Q8568
19932a88726J55700j03108r8110P9165K45491l9144j78343P7818M7636q1034O3621
$$ plain form
20009 -115735 -12620 32286 -68655 -88252 -166828 -175370 -92756 19676 59014 17379 -119938
19998 -119938 -224621 -519126 -415354 -217275 -203144 -113928 -174630 -213397 -218323 -86806 -206976
19987 -206976 -235665 -149741 -100352 -258224 -634939 -709220 -606288 -240580 -101271 -180474
19977 -180474 -286862 -212193 -149422 -96298 -109743 -91944 16358 111912 52355 -32603 -21291
19966 -21291 -120884 -102629 -144431 -239029 -238922 -177288 -12042 -21876 -136139 -208168 -205346 -97766
19954 -97766 11794 -128523 -130357 -128559 -156402 -130116 26644 90594 36246 12927 -26017
19943 -26017 -120310 -24006 7552 -116106 -59932 -98665 -188840 -167113 -233121 -277294 -188726
19932 -188726 -33026 -136134 -234244 -155079 90412 51268 -127075 -49257 -1621 -82655 -19034
19921a9034j2327j50913p8617J09216K7541J7907L045k236n0315q3305l6388J11828
19909a63598j0877j35423k0932J15951J31393O7449m9361j40368J7557k4282N8686
19898a53805j44127o1737J06644Q058K11488J53605r9186l1075n537l4314j39179
19887a89165P653K21140m0462n9943k1277o6152o4183L6440R5314L2268j32839
19876a81206j09280o2452J82979K4806L0645L8300J02p1395k18954p1376J07207
19865c30624K07001J31800q1449j04271p0514k4475J19434P1040o9751J2374R5383
19854d4052N3491L2612J78514q8727m6710o8705j44002j8547q311O2644O1339
19843c0454m4515J09358J16062m6717L5242j65811J2752J55649k3266r9420j9373
$$ plain form
19921 -19034 -31361 -182274 -260891 -151675 -124134 -106227 -103182 -105418 -155733 -239038 -275426 -163598
19909 -163598 -174475 -309898 -330830 -214879 -83486 -16037 -65398 -205766 -188209 -212491 -153805
19898 -153805 -297932 -359669 -253025 -244967 -33479 120126 20940 -10135 -15672 -49986 -189165
19887 -189165 -181512 39628 -834 -60777 -82054 -148206 -212389 -175949 -80635 -48367 -181206
19876 -181206 -290486 -352938 -169959 -145153 -114508 -76208 -76106 -147501 -366455 -437831 -330624
19865 -330624 -123623 8177 -73272 -177543 -248057 -272532 -153098 -82058 -151809 -139435 -44052
19854 -44052 9439 42051 220565 131838 85128 16423 -127579 -146126 -154437 -91793 -30454
19843 -30454 -74969 34389 150451 103734 138976 -26835 -14083 141566 118300 18880 -493
19832d93p4629P9696j8943J12617q1885q4418n5899j11893J80655K08788p073
19821A46523j63246J6194M3437R1556J90711P1429J5859j36718j61030q4971O6178
19810I5922N5395m5505J6493K5928p2056k01621o0286j26356N4669M6577J14172
19799i6668R3325l2955R2489L9254L2418J37379m6356j35186m7892m2191Q0808
19788G4425L45940K14690m1006J03106Q1352O2640r9703k82212q4712j13911P2876
19777C33485J69479k2189k7547J87132K39058l585J4115J24907Q6585O7794j43726
19766A025508k73349j74194l1924n8858j2268r5959q4435l5036N7391q8652q9162
19755A39062J2618n2368n9676o9894Q9898o3176j971K206o9165J13410K2156n7239
$$ plain form
19832 -493 -75122 4574 -14369 98248 16363 -68055 -123954 -235847 -55192 153596 146523
19821 146523 -16723 -529 42908 134464 325175 396604 412463 275745 114715 29744 95922
19810 95922 151317 105812 122305 148233 76177 -125444 -185730 -312086 -257417 -210840 -96668
19799 -96668 -3343 -36298 56191 95445 127863 265242 218886 83700 35808 -6383 74425
19788 74425 420365 635055 594049 697155 778507 841147 741444 459232 374520 260609 333485
19777 333485 502964 480775 453228 640360 879418 875833 889948 1014855 1101440 1169234 1025508
19766 1025508 752159 577965 546041 487183 474915 378956 294521 259485 316876 228224 139062
19755 139062 151680 99312 39636 -30258 59640 -3536 -5507 -3301 -72466 40944 63100 5861
19743E861K4540k6695R9790P1362m58m2863K28456O1753J37619j0334J21173K51756
19731I21960Q9553N5771J88253q6016j93382q4741j83909P0886P4816j8361j91118
19720F43712j42798Q0194J21214L9277J4450j44124j84914j18316j70752p1331
19710F6612Q7873O8749M6380R5002k7876k570N9047L4541M1599j16404k94493
19699E8460j16632J0015j78677k5346J81192P8249j17R7045K4439j49395p644
19688b8411j12386O96N3427M3539M4132J47903l7809k1280k52082o6236J29418
19677i9089O1807P1376K31646o8802j45320j17696Q9664K14141m242K2023j46737
19666A08771o6071J36115J02311J55101P0663R9510N7848m4231L5386n0641k2324
$$ plain form
19743 5861 30401 3706 103496 174858 174400 131537 359993 421746 559365 549031 670204 921960
19731 921960 1011513 1067284 1255537 1169521 976139 891398 707489 778375 853191 834830 643712
19720 643712 500914 581108 702322 741599 756049 611925 427011 308695 137943 66612
19710 66612 154485 223234 269614 364616 336740 334170 393217 427758 469357 352953 58460
19699 58460 -58172 -48157 -226834 -252180 -70988 7261 7144 104189 128628 -20767 -28411
19688 -28411 -140797 -140101 -86674 -43135 997 148900 111091 89811 -162271 -228507 -99089
19677 -99089 -37282 34094 265740 196938 51618 -66078 23586 237727 233485 255508 108771
19666 108771 42700 178815 281126 436227 506890 606400 664248 620017 655403 604762 582438
19655E82438M0061j53564O1522J10894J38355J02103l0171j10449n1890R5831
19645G85130n8373k28577j21385O9835O4102P803n9192J08252M1819n0058j21722
19634D37634j99954j49394R8534J16661r3331j05567M1954Q0464j43006o1847
19624B2148j205j1910n0959J45378j863O0696j19789k08771J64089K04552r8841
19613A03525Q318p6972j37167k7021O3314J85737N4778K3253R5595m629r7145
19602A91586j59048n3648K03597j5647r5331J06663K211k26152n5981Q3748L24
19591a7678m7409r6378Q3362J70562p5820M3257M1884Q8611l9021j83664q6417
19580a18711J5890j6860P2734J22380l4785R1723j2587k62775k8058K9744l8294
$$ plain form
19655 582438 622499 468935 530457 641351 779706 881809 851638 741189 689299 785130
19645 785130 726757 498180 376795 446630 510732 518535 459343 567595 609414 559356 437634
19634 437634 237680 88286 186820 303481 210150 104583 146537 227001 83995 22148
19624 22148 20943 9033 -41926 103452 101589 162285 42496 -166275 -2186 202366 103525
19613 103525 111843 34871 -102296 -129317 -66003 119734 174512 197765 293360 288731 191586
19602 191586 32538 -21110 182487 166840 71509 178172 180383 -45769 -101750 -18002 -17678
19591 -17678 -65087 -161465 -78103 92459 16639 59896 101780 190391 151370 -32294 -118711
19580 -118711 -102821 -119681 -46947 75433 40648 132371 119784 -142991 -171049 -141305 -179599
19569a79599K39724J64292q6792N410O5183Q2784k66233j77946N8491J57060j8274
19558D4100J03107N6944l9087j1064J47502J14333J69475O315j63998l59678j89927
19547a21978R1489J78813O1951m2478o6852K0748L6029O587Q6232n9545r3861
19536I7135P5287N967j12271j21439P9230L03738J05814K7070o6697O8378j53489
19525C08723K8768J44246k9300J45920Q6752N061j27943j38763o3420j02925j90594
19514F6525J8211J35355Q4436N8390K7875l9845j92408j4274L0858P9223K41144
19503D95490J02143m1208O1613r4525K2795J757J21173K3656L3643K47848j69108
19492H05277l3537J17133R0101l4303Q2749j10111J5215m783M0934k73j5493J29264
$$ plain form
19569 -179599 60125 224417 137625 143035 208218 291002 24769 -153177 -94686 62374 44100
19558 44100 147207 204151 165064 154000 301502 415835 585310 591625 427627 67949 -121978
19547 -121978 -30489 148324 210275 167797 100945 121693 157722 164309 250541 190996 97135
19536 97135 172422 178389 66118 -55321 23909 327647 433461 460531 393834 462212 308723
19525 308723 337491 481737 452437 598357 685109 690170 562227 423464 360044 257119 66525
19514 66525 84736 220091 304527 362917 390792 350947 158539 144265 175123 254346 495490
19503 495490 597633 556425 618038 523513 546308 548065 669238 692894 726537 974385 805277
19492 805277 771740 888873 978974 944671 1027420 917309 932524 927741 968675 968402 952909 1082173
19480A082173N6858R5651R8411J24957L559m8895r2444j69182n2022j65869k6378
19469I06819j15915j52075n8264Q6351n872r8980j82206p5101Q6957L0136j27444
19458B94406n2156K6808m5241r3524j70411p181q070O7883N0178J04234j5080
19447A51846O8922J45576K23775j12798j98135j91501K7668P1912m3187l9734
19437A04344J75212Q6411K775j2891n3256j2458q077q2065j06419j03113J35734
19426A26197K86847M8355J56510j3879j57061j80320r9447k9064L4348m5279j01422
19415B5785r0277K3561N0119J508k4310J16508L02163M6292l1177j25264j66217
19404A28691N972P236o3176J60081Q9814p3721k31557j15062J21332J20866J2011
$$ plain form
19480 1082173 1139031 1234682 1333093 1458050 1461609 1412714 1320270 1151088 1099066 933197 906819
19469 906819 790904 638829 580565 666916 661044 562064 379858 304757 391714 421850 294406
19458 294406 242250 269058 223817 130293 -40118 -47299 -55369 12514 62692 166926 151846
19447 151846 220768 366344 590119 477321 279186 87685 115353 187265 144078 104344
19437 104344 279556 365967 368742 355851 302595 290137 282060 199995 93576 -9537 126197
19426 126197 413044 461399 617909 604030 446969 266649 167202 138138 172486 127207 25785
19415 25785 -64492 -40931 9188 10696 -13614 102894 405057 451349 420172 294908 128691
19404 128691 134663 141899 78723 238804 328618 254897 23340 -91722 29610 150476 162487
19393A62487M8528O4524J30578k0335p4763J28797j23600J3013J64468q0704J48007
19382E61000P7416J361j14088j04079j16243N0363P975M7477J1850n9002J11278
19371D75308J25058Q3573p7330n320k9140k1753K2554j59925j6676l0273P7354
19360D43430R7216J33781P9638k64080Q278J49712L0628p8984r6556J60793K43170
19349I07026J59909J11870N2036o3971l6588p945r4504r1112o6972R6065N0514
19338A016328j90998m3960l0781N6729L2j6500N2242J63871J22817j93457j96592
19327G39731Q4993P8301J56823j07020j76987K00J0032o4662J21499J62456j14031
19316H91335j21810J87058J94960m8402J9519P9082Q8398J05293K91369K02925
$$ plain form
19393 162487 211015 275539 406117 385782 311019 439816 316216 329229 493697 412993 561000
19382 561000 638416 639777 525689 421610 305367 355730 363705 411182 423032 364030 475308
19371 475308 600366 683939 606609 601289 572149 550396 572950 413025 396349 366076 443430
19360 443430 540646 674427 754065 489985 498263 647975 678603 599619 503063 663856 907026
19349 907026 1066935 1178805 1230841 1166870 1130282 1122337 1027833 936721 869749 965814 1016328
19338 1016328 825330 781370 750589 807318 807350 790850 843092 1006963 1129780 936323 739731
19327 739731 824724 903025 1059848 952828 775841 776041 786073 721411 842910 1005366 891335
19316 891335 769525 956583 1151543 1103141 1122660 1201742 1290140 1395433 1686802 1889727
19306A889727J03350J21767q5729K46710K18359N5328J58604K50590K14664L35712
19296C509082J56630j06446P0656L84146L88845L53426K71631N71548N73755L79581
19286F552854M49851N74887N83227N33480Q40723J172628J760005K277305K943744
19277A7688704M141081N222872N927920N551097L953919K282545J484051K015933
19269D8268122M339632Q189040J3683330K1417302L1178648M0657755M3764903
19262B11498732L5241814J8145684j239297j6823609k5310447k9607462l1204358
19255A60701057k7675556j9797057j0976075l700018M15426M29157l064944p877067
19247H8454923j1779112j2611528j1451511r329002o972604m903253l547879k538214
$$ plain form
19306 1889727 1993077 2114844 2029115 2275825 2494184 2549512 2708116 2958706 3173370 3509082
19296 3509082 3665712 3559266 3629922 4014068 4402913 4756339 5027970 5599518 6173273 6552854
19286 6552854 7002705 7577592 8160819 8694299 9535022 10707650 12467655 14744960 17688704
19277 17688704 21829785 27052657 32980577 38531674 42485593 44768138 46252189 48268122
19269 48268122 52607754 60796794 74480124 95897426 127076074 167733829 211498732
19262 211498732 246740546 264886230 263646933 246823324 221512877 191905415 160701057
19255 160701057 133025501 113228444 102252369 98552351 98967777 99396934 96331990 88454923
19247 88454923 76675811 64064283 52612772 43283770 36311166 31407913 27860034 25321820
19239B5321820j529968q11718m14030l56785k33054j4838J13407J56000P9725
19230B2310559L90799J466159K355174L346052M925025P053339R780014J2370439
19222F3997560J3653423J2523504Q425899K819408j235368j206636L197426J0766329
19214A12941545K0880830L1728380L9413007M1296492L7513744K6959508Q446944
19207C19180450j5080685l7866380n1793921n0151337l8735128k6624141j7129241
19200H1799617j0066161n040372k270666j736869l104627n375310o981150p747843
19192C9476619p016320n332510l685700k904518k283485j576599j148234j063484
19184A4465769j027497q86692q30760j096999r57573r99999q90193n22664k48916
$$ plain form
19239 25321820 23791852 22980134 22566104 22209319 21976265 21961427 22074834 22230834 22310559
19230 22310559 22701358 24167517 26522691 29868743 34793768 41847107 51627121 63997560
19222 63997560 77650983 90174487 98600386 101419794 100184426 98977790 102175216 112941545
19214 112941545 133822375 165550755 204963762 246260254 283773998 310733506 319180450
19207 319180450 304099765 266233385 214439464 164288127 125552999 98928858 81799617
19200 81799617 71733456 66693084 64422418 62685549 59580922 54205612 47224462 39476619
19192 39476619 32460299 27127789 23442089 20537571 18254086 16677487 15529253 14465769
19184 14465769 13438272 12551580 11720820 10623821 9666248 8666249 7776056 7253392 7004476
19175G004476k96230l86629m60799l41700k53023k05607l13286l39670k48634
19166D158898p4912j83509j94999l05421k20201k94886p2015M2206j20278k25347
19156B509536j1490j49414j68881j71511j35188r0296J15067k6315J0798j67753
19146A714553j24404o5592J56320J33503p5784j91911j3047J12667n0082j6935
19136A579288l0617o4031r1592j75123O1597n0554m282j29105k3931L9663j8806
19125A092507j14977Q7434j18351r3307J6662k7784k3476j10312k9551J82170
19115H61015k5605J13591J04032p3153j13293J28888r441J9505n5560K8990o8540
19104I10429J6198J79162P5832o715j46318j68724M7128o9294M6497j2960N9519
$$ plain form
19175 7004476 6708246 6321617 5860818 5519118 5266095 5060488 4747202 4407532 4158898
19166 4158898 4083986 3900477 3705478 3400057 3179856 2884970 2812955 2855161 2734883 2509536
19156 2509536 2498046 2348632 2179751 2008240 1873052 1782756 1897823 1871508 1882306 1714553
19146 1714553 1590149 1524557 1680877 1814380 1738596 1546685 1533638 1646305 1596223 1579288
19136 1579288 1548671 1484640 1393048 1217925 1279522 1228968 1224686 1095581 1071650 1111313 1092507
19125 1092507 977530 1064964 946613 853306 869968 842184 818708 708396 678845 861015
19115 861015 835410 949001 1053033 979880 866587 995475 986034 1005539 949979 978969 910429
19104 910429 926627 1105789 1181621 1174906 1028588 859864 906992 837698 884195 871235 930754
19093I30754n9300p282Q720J64876j23880q6734q5232n8462J9756J4943J43780
19082H61939J40504j39912R6588j29107l6785L3804K1764J14246O6266m1699m8357
19071I39251J23545k2905J31999L9770k7177P7275q1530m2131J01546N0175J27556
19060A417374K50489K07076J52874o4043J07931J32468L39056K21686K31483J28390
19050C124784J81790J44405K54861L05916K51041K12458K14029O8164K14848O44305
19040E616601M29310N19195M15821N79290O32278P48882R37989J358533J872566
19031A3110465K457411L208483M501117O579474J0089158J5268815K1413969K4272579
19023A00901471J9195475P590578n735134j4474789j3020580m493975N873298
$$ plain form
19093 930754 871454 864172 872892 1037768 913888 827154 741922 683460 703216 718159 861939
19082 861939 1002443 862531 959119 830012 793227 827031 848795 963041 1029307 987608 939251
19071 939251 1062796 1039891 1171890 1211660 1184483 1261758 1180228 1138097 1239643 1289818 1417374
19060 1417374 1667863 1874939 2027813 1963770 2071701 2204169 2543225 2764911 2996394 3124784
19050 3124784 3306574 3450979 3705840 4011756 4262797 4475255 4689284 4757448 4972296 5616601
19040 5616601 6045911 6565106 6980927 7560217 8192495 8941377 9879366 11237899 13110465
19031 13110465 15567876 18776359 23277476 29856950 39946108 55214923 76628892 100901471
19023 100901471 120096946 127687524 121952390 107477601 94457021 89963046 95836344
19016I5836344J6991352K6799890L0645188K7830126J9044832L004273j3532931
19009B06619074k4926608l0948778k7524791j6715753m286332O987758J6104338
19002A25308908J7044457P177533p888747k2353759k8634701k4275207j6994200
18995D9384284j1240368p499495n142698l630914k750246k160849j623844j525493
18987A3810377j183152o99365p95438o48088n87392o85549p39510o55806o87684
18978G128393l98859j51396j39808k68932k66948k6448l90232l75624l01699j78641
18968D629806j96849l09819k91341l07272j00708N513k09516n5171o5544l06619
18958B792480l22443o0749q7640k72466j84455l4067N8252j50191j46364n9922
$$ plain form
19016 95836344 112827696 139627586 170272774 198102900 217147732 220152005 206619074
19009 206619074 181692466 150743688 123218897 106503144 102216812 109204570 125308908
19002 125308908 142353365 149530898 141642151 119288392 90653691 66378484 49384284
18995 49384284 38143916 30644421 25501723 21870809 19120563 16959714 15335870 13810377
18987 13810377 12627225 11927860 11132422 10484334 9896942 9211393 8471883 7816077 7128393
18978 7128393 6729534 6578138 6438330 6169398 5902450 5876002 5485770 5110146 4808447 4629806
18968 4629806 4432957 4123138 3831797 3524525 3423817 3429330 3219814 3164643 3099099 2792480
18958 2792480 2470037 2409288 2321648 2049182 1864727 1830660 1888912 1738721 1592357 1532435
18948A532435k1740r4213l1776j49343p9538m3967O1328m131K1948L6552l6994
18937A190561k1239m9525j236J24927p117L2285n6859p2473k26726j60243o5178
18926F87177J15229L2975p7089J29370N3812p5662J18495J6365q3642J76635N1763
18915A145428j46128j11818R582J60136J27214J6751K2720l2166K25623K74425
18905A691767J49636k0313o2790N8043J8370J28850J33584J88114P4749O9101
18895B429111K06857L16690K05112J25067P291J5445L4675M7908K31578J22985
18885C742719K93053M71408L93034N60792L41535O14334O60332N97360P21100
18876H395667R80835J326092J897965K180472K912740M252357O271299R675311
$$ plain form
18948 1532435 1510695 1416482 1384706 1235363 1155825 1111858 1173186 1169055 1191003 1227555 1190561
18937 1190561 1169322 1119797 1118561 1243488 1236371 1268656 1211797 1139324 912598 752355 687177
18926 687177 802406 835381 758292 887662 941474 865812 984307 1000672 917030 1093665 1145428
18915 1145428 999300 887482 897064 1057200 1184414 1201165 1223885 1191719 1417342 1691767
18905 1691767 1841403 1821090 1758300 1816343 1834713 1963563 2097147 2285261 2360010 2429111
18895 2429111 2635968 2952658 3157770 3282837 3290128 3305573 3340248 3388156 3619734 3742719
18885 3742719 4035772 4507180 4900214 5461006 5802541 6416875 7077207 7674567 8395667
18876 8395667 9376502 10702594 12600559 14781031 17693771 21946128 28217427 37892738
18868C7892738J4826647K1854108K8107321K6859342J5577977q00895j4896404
18861A29420834j8048181r952707K090717J5094726K6266941L0345187K5412162
18854B00629679J4966809K07895j4098007k2954812k8913351k8423329j9384464
18847A02030420p313776M116578J3032622J5178410P186480o613204k0108575
18840A07508955k6019642k2054613j4995088r808919o648440m717905l335686
18833A9928662k393611j984893j688221j395666r98367r89404p89333p21461o74046
18824H293660n10875k83533l69959n56031l45203k75162n17582l74695l69370
18815D691250o9804L2177m1007k14772j13367k23913j75950l94361l71826j31792
$$ plain form
18868 37892738 52719385 74573493 102680814 129540156 145118133 144317238 129420834
18861 129420834 111372653 101419946 103510663 118605389 144872330 175217517 200629679
18854 200629679 215596488 215804383 201706376 178751564 149838213 121414884 102030420
18847 102030420 94716644 98833222 111865844 127044254 134230734 127617530 107508955
18840 107508955 81489313 59434700 44439612 34630693 27982253 23264348 19928662
18833 19928662 17535051 15550158 13861937 12466271 11467904 10478500 9689167 8967706 8293660
18824 8293660 7782785 7499252 7129293 6573262 6228059 5952897 5435315 5060620 4691250
18815 4691250 4621446 4653623 4612616 4397844 4284477 4060564 3884614 3490253 3118427 2986635
18805B986635J12594N0796p9351k51529l05003j08702k24132j53584M2009k20104
18795A849629L398l0231r503l9455j26835k17848j56974Q3573q0626j49260r8131
18784A027737L0206K16025J14175r1790n926r4132j50421j93003j14472K54763
18774I93162Q0035j15668m2931Q091o9488r616n5261k48298l7816j36224j22089
18763B43897J11312K18945m1439m4786K1274J42315K5563j35816j73809K065K29144
18752E98665o604p9160J40197J81925p3115K04530L53544P0477j48041j5265j09569
18741A117584o0955L0595J63895K01874P5388k20029j78724j03309j81651r9158
18731G45510o8366J1327n8768o7168J47609O9494q3057L4216J80271q7262J88773
$$ plain form
18805 2986635 3099229 3150025 3070674 2819145 2514142 2405440 2181308 2027724 2069733 1849629
18795 1849629 1853027 1822796 1813293 1773838 1647003 1429155 1272181 1355754 1275128 1125868 1027737
18784 1027737 1057943 1273968 1388143 1296353 1290427 1196295 1045874 852871 738399 993162
18774 993162 1073197 957529 914598 922689 853201 843585 788324 540026 502210 365986 243897
18763 243897 355209 574154 532715 487929 509203 651518 677081 541265 367456 369521 598665
18752 598665 592061 512901 653098 835023 761908 966438 1319982 1390459 1242418 1227153 1117584
18741 1117584 1056629 1087224 1251119 1452993 1528381 1308352 1129628 1026319 844668 745510
18731 745510 677144 688471 629703 562535 710144 779638 696581 730797 911068 823806 1012579
18720A012579k07092k38254K1147P4135k2237k4925j4462j34117J66132L2816
18710F65722j169m63k501m606j08769j627J60348K4255l263K65305K52067J17068
18698A362367J12063J57273r2478j78752j18562J16367N0806r3549l1339n2053
18688A232143K3139O2880O8942p051j9454P6899N6681K7009q1595m6202p763k64156
18676A121472q2446n0140j08964j05946r3038m2544N036j58135j1132J9783M4934
18665E38880R2383q7578P5555k00733j55239j02330J42513J98338Q8271l449J51115
18654G37726J05300j34122n6991k625M7989r9338k58334m6615q4399K4398K41965
18643D74954K04148J1743K5800k7492r2054k20597q4963l4064j34567n3750L4897
$$ plain form
18720 1012579 805487 567233 588380 662515 640278 615353 600891 466774 632906 665722
18710 665722 664553 664090 661589 656983 548214 546587 706935 731190 727927 993232 1245299 1362367
18698 1362367 1474430 1631703 1539225 1360473 1241911 1358278 1409084 1315535 1284196 1232143
18688 1232143 1255282 1318162 1387104 1380053 1360599 1437498 1494179 1521188 1439593 1393391 1385628 1121472
18676 1121472 1039026 988886 879922 773976 680938 638394 643430 485295 474163 493946 538880
18665 538880 631263 543685 619240 418507 263268 160938 303451 501789 590060 586611 737726
18654 737726 843026 708904 651913 649288 697277 597939 339605 292990 208591 232989 474954
18643 474954 679102 690845 716645 689153 597099 376502 291539 257475 122908 69158 104055
18632A04055M8457J12435k5247l7741N9104j782j08242K6530L2985K02540J92378
18621F05472q1465j18421r6718k7447J10856K98807J55791K63364k4598m5522
18611A040119m1680J26533Q2947j73400j95543r1394R3656J66124J39896L9951
18601A187209j40306k023J03786O7509J1741p5311j31250n689J06908r1734P9112
18590A109952R1007p5958j66801J3174K02376J30953p6014P8986R1473K4967Q8150
18579A512265K0999M4553j24686K2901L6949K0509J00861K41237J91133J56225
18569B222946J93782L20313J2324L1215L38528J87143J40455K85263J75634J55955
18559D063558K09819M15148O60053O30007N05843M17586N89723Q65551Q33494
$$ plain form
18632 104055 152512 264947 239700 201959 261063 259281 151039 177569 210554 413094 605472
18621 605472 524007 405586 308868 281421 392277 691084 846875 1110239 1085641 1040119
18611 1040119 998439 1124972 1207919 1034519 838976 747582 841238 1007362 1147258 1187209
18601 1187209 1046903 1044880 1148666 1216175 1227916 1152605 1021355 1015666 1122574 1030840 1109952
18590 1109952 1200959 1125001 958200 971374 1173750 1304703 1228689 1307675 1399148 1424115 1512265
18579 1512265 1533264 1577817 1453131 1476032 1512981 1533490 1634351 1875588 2066721 2222946
18569 2222946 2416728 2737041 2749365 2780580 3119108 3306251 3446706 3731969 3907603 4063558
18559 4063558 4273377 4688525 5348578 5978585 6484428 6902014 7491737 8357288 9190782
18550I190782J046726J020114J320148J608702K026225K746163L745544M519191
18542B7223595N070021N603947N446843M750865M293399M283472N827194R044696
18534G1544032J3456446J9050847K5145359L0820479L5114200L4331303K6435554
18527B55898220J3947496J35050j2676460k0926756k5234843k7436883k5485831
18520A58219993k0000574j4286932r438794n909995m173502m561756o652624q985419
18512H4210397j0400661j0114724r035586p938413o490529n004464l857440k670676
18504B8697904k137578j491354j103692o42391n51626k98101M981L66857P98953
18495B3643953J521560K296408L386459M673374N958548P230131Q620084R257806
$$ plain form
18550 9190782 10237508 11257622 12577770 14186472 16212697 18958860 22704404 27223595
18542 27223595 32293616 37897563 43344406 48095271 52388670 56672142 62499336 71544032
18534 71544032 85000478 104051325 129196684 160017163 195131363 229462666 255898220
18527 255898220 269845716 269980766 257304306 236377550 211142707 183705824 158219993
18520 158219993 138219419 123932487 114493693 108583698 104410196 99848440 93195816 84210397
18512 84210397 73809736 63695012 54659426 46721013 40230484 35226020 31368580 28697904
18504 28697904 26560326 25068972 23965280 23322889 22771263 22473162 22478143 22845000 23643953
18495 23643953 25165513 27461921 30848380 35521754 41480302 48710433 57330517 66588323
18487F6588323Q924485P499524N607018M326023M785268P199180J1147474J5880037
18479A31957332K0637702K3599917K2564685J9193770J3864295N544014n026021
18472B32335694j6638410k6793535l0291950k7651795k3461375j9089014j4374520
18465G4035095r841081o519650m607398l833671l899821m333537m790700m381828
18457C1827409m102525l755827l155808k642972k042712j656693j259043j088588
18449A2123241q76757q75235q08968q19855p72538o40548n65495m39671m42237
18440E881937l68679m12107l15872l86119j78423j07617k23533l09929k35823
18431C343835j04141Q157m0004k16053j92275k4223r1865j03537k4371j03962
$$ plain form
18487 66588323 75512808 83012332 88619350 92945373 97730641 104929821 116077295 131957332
18479 131957332 152595034 176194951 198759636 217953406 231817701 237361715 232335694
18472 232335694 215697284 188903749 158611799 130960004 107498629 88409615 74035095
18465 74035095 64194014 57674364 53066966 49233295 45333474 40999937 36209237 31827409
18457 31827409 27724884 23969057 20813249 18170277 16127565 14470872 13211829 12123241
18449 12123241 11246484 10371249 9562281 8742426 7969888 7329340 6763845 6324174 5881937
18440 5881937 5513258 5101151 4785279 4399160 4220737 4113120 3889587 3579658 3343835
18431 3343835 3239694 3247851 3207847 2991794 2799519 2775296 2683431 2579894 2555523 2451561
18421B451561r3068p7630k14777j55707j70008j03723j11779R7673K4086l4828
18411A611800M3461k2721o7300L1779j70249m1103j97222r2003J12521j9877q3421
18400A105665m0890J15761O4185M174k85072j95038J248J10205Q434J0277j40579
18389G58370J236J05388p1231j32997J29276J65943L6813M4860M1837R1586M7708
18378A218789P8975J4027p3266J09846M8217k05504j09772J82405K92996J07855
18368A664568j25930K6544k498j80338p6965j47303K1728p9825j89790m6184J5748
18357H79755J42620J12916m6284j41840j67811j60336O1328j56730j00167m6675
18347C76776j55402n4598K35K0894Q3230j4711m4737M2056j5502J6172l6146q2687
$$ plain form
18421 2451561 2358493 2280863 2066086 1910379 1740371 1636648 1524869 1622542 1646628 1611800
18411 1611800 1655261 1632540 1565240 1597019 1426770 1385667 1188445 1096442 1208963 1189086 1105665
18400 1105665 1064775 1180536 1244721 1248895 963823 768785 770033 880238 888672 898949 758370
18389 758370 759606 864994 793763 660766 790042 955985 992798 1037658 1079495 1171081 1218789
18378 1218789 1297764 1311791 1238525 1348371 1396588 1191084 1081312 1263717 1556713 1664568
18368 1664568 1538638 1565182 1562684 1382346 1305381 1158078 1179806 1099981 910191 864007 879755
18357 879755 1022375 1135291 1089007 947167 779356 619020 680348 523618 423451 376776
18347 376776 221374 166776 167011 187905 271135 256424 211687 253743 238241 254413 218267 135580
18335A35580L1857J57296o975m6299J0484p178l2032J26361P2265p7268k02655
18324A61436l7062J43715P9070n6225O6061K41704j06792k05018j35796M8640
18314A99733R8651J53562m4634K282j23364k4665K3358m8871n1569N9170Q3091
18303C26744j9236m6570j25030n1158P2128J65443N5152M327k9202o3087j39151
18292A50360J8683J25168j25675J2604J28355J30592J48496O7524k19058Q5494
18282E22543j38359l1693P9959j10824R5872J68729j44935n5627L0562j15080
18272C01147j40621j70417k5397j63052J41217L41950R8456p2199j33127k0105
18262A57852K26355n2683k53654J03532J56685O3433q53J04563J2923j63542n9142
$$ plain form
18335 135580 167437 324733 317758 271459 281943 274765 242733 369094 441359 364091 161436
18324 161436 124374 268089 347159 290934 356995 598699 491907 286889 151093 199733
18314 199733 298384 451946 407312 409594 286230 261565 284923 236052 184483 243653 326744
18303 326744 307508 260938 135908 84750 156878 322321 377473 381800 352598 289511 150360
18292 150360 169043 294211 168536 181140 309495 440087 588583 656107 437049 522543
18282 522543 384184 352491 432450 321626 417498 586227 441292 385665 416227 301147
18272 301147 160526 -9891 -35288 -198340 -57123 284827 383283 311084 177957 157852
18262 157852 384207 331524 77870 181402 338087 401520 400667 505230 518153 354611 295469
18251B95469J3383j29369j4410M6257m3796j9554j9513n6634P6825j0372K1775
18240A60061m2969r0622j3439K3326P9111R457r3420N5288j58O6416k4900k12238
18228h4087j8593J29699J11459M1236J23735O8873J41660k891k5065J57636L3212
18217F76874m3320M7649Q4584m4101j42184K03413Q1272J0070m0057j11289j8276
18206G04635r36l1056l3000l679j0919m9603J7738j355P8434M6163l1470k27698
18194D57254n0957n6765q6902m503N8507m0860m2012o0338r363O0253J54513L1339
18182D10166k32065j40451n1616O6086R6987l404k0698n9140q4467O5096J33555
18171A80049J10831k7027j04782k22851n4339Q4722j20512m7839N9986J22649
$$ plain form
18251 295469 308852 179483 165073 211330 167534 147980 128467 71833 148658 138286 160061
18240 160061 117092 26470 13031 36357 115468 124925 31505 86793 86635 153051 128151 -84087
18228 -84087 -102680 27019 138478 179714 303449 372322 513982 511091 486026 643662 676874
18217 676874 633554 681203 765787 721686 579502 782915 864187 874257 834200 722911 704635
18206 704635 703699 672643 639643 635964 625045 575442 593180 591825 670259 716422 684952 457254
18194 457254 406297 349532 262630 258127 316634 275774 233762 173424 164061 224314 378827 410166
18182 410166 178101 37650 -13966 52120 149107 145703 125005 65865 -18602 46494 180049
18171 180049 290880 263853 159071 -63780 -118119 -33397 -153909 -201748 -141762 -19113
18161a9113J4977j19427Q1914J54663P8206r4100j00636l0959n8220J32385O4117
18150A03807j01057j4248l759j8406j7898l8920j74869K5622J21162K31576R0905
18139B03915j99955p8024j55368J870J81547J45019J88546r8700m4822J05377
18129B49405j14796j24355n9976J47733j05636p27K46176N4893k58052R2974l9717
18118H7922m3312m3424j0862J9932J68451Q8096k81353j61299J48068M9115n5831
18107c4497O8965q3112N8485J39663q6806j2010O021J49706K0639j12051j91436
18096g6433q6763m7975J45059J68522p962j0011n3351j4316k1944R7356P0060
18085A62242r4094j97383n3602J02402K29195J60356K5137J0731k1124N5886l7117
$$ plain form
18161 -19113 -4136 -123563 -41649 113014 191220 97120 -3516 -34475 -92695 39690 103807
18150 103807 2750 -11498 -15257 -33663 -51561 -90481 -265350 -239728 -118566 113010 203915
18139 203915 3960 -74064 -229432 -227562 -46015 99004 287550 188850 144028 249405
18129 249405 134609 10254 -49722 98011 -7625 -8352 237824 292717 34665 127639 87922
18118 87922 44610 1186 -9676 10256 178707 266803 -14550 -175849 -27781 21334 -34497
18107 -34497 34468 -48644 9841 149504 62698 50688 56709 206415 227054 115003 -76433
18096 -76433 -163196 -211171 -66112 102410 94448 84437 31086 16770 -5174 92182 162242
18085 162242 68148 -129235 -182837 -80435 148760 309116 334253 344984 323860 379746 342629
18074C42629m9074j09066m6548o7501R9192R5704j55j03590L1748j7748r4711
18063H0880J07141J85598o4412k19733n9281r1293n1101J83194M3587j0295j7872
18052H6413r4358j5774K2296M8957M4402m8663o0792j0239k17988q0625l3037
18041c59408N4430P3336R1564K68957j4816j47356l7379K3810P2109m8990M6301
18030B2558J34682j3414j22205N2570Q6754J31429p8392O3322o0937R4740K08408
18019E19515J26633J48144J70095R4512o2888j53511p7453K58694J78723K5095
18009A227559L9099p332k20730l05777k46058j65403p2329O991L5009M4854P9691
17998D15574P9950o2365j53581j41347o5689n3077j59908J11731R994M6111n4587
$$ plain form
18074 342629 293555 184489 137941 70440 169632 265336 265181 161591 193339 175591 80880
18063 80880 188021 373619 309207 89474 30193 -61100 -112201 70993 114580 104285 86413
18052 86413 -7945 -23719 -1423 47534 91936 43273 -17519 -27758 -245746 -326371 -359408
18041 -359408 -304978 -231642 -140078 128879 114063 -33293 -70672 -46862 25247 -23743 22558
18030 22558 157240 143826 21621 74191 160945 292374 213982 277304 216367 311107 519515
18019 519515 646148 794292 964387 1058899 996011 842500 765047 1023741 1202464 1227559
18009 1227559 1266658 1259326 1038596 732819 486761 321358 249029 256020 291029 335883 415574
17998 415574 495524 433159 279578 138231 72542 19465 -140443 -28712 -18718 27393 -27194
17987b7194J1147p8677o6337o2629J16275J24685o9489j47099j2755P9001J97884
17976F4812P2498O0749J94883R3803J49911n658j78450P196J5710Q6313J74461
17965G36228J50083j14761p9926K420r873k5077J28039n2799N2871J71620J46992
17954A105817j29455j44643j69962k13658L9213N9095p1852k51385j40526K7887
17944A10531Q8703j2893L0661K1221j31035l0854R4631Q5199j09365j53431j5011
17933b1643o696p948l0635J46239P7j48052J118P6802K7554N0345K2605Q5480
17921A95246k1196k28307j69545N2587K17707O175k52228M936J20934k7257M7362
17910e3586q860k6178p9087J07728L9760j68374m8532P3185r7876L7540N0949
$$ plain form
17987 -27194 -16047 -94724 -161061 -223690 -107415 17270 -52219 -199318 -212073 -133072 64812
17976 64812 137310 198059 392942 486745 636656 630998 452548 459744 475454 561767 736228
17965 736228 886311 771550 691624 694044 684171 659094 787133 734334 787205 958825 1105817
17954 1105817 976362 831719 661757 448099 487312 546407 474555 223170 82644 110531
17944 110531 199234 186341 217002 238223 107188 76334 170965 256164 146799 -6632 -21643
17933 -21643 -28339 -36287 -66922 79317 79394 -68658 -67540 9262 36816 87161 109766 195246
17921 195246 174050 -54257 -223802 -171215 46492 52667 -199561 -194625 -73691 -100948 -53586
17910 -53586 -62446 -88624 -167711 -59983 -20223 -188597 -237129 -163944 -261820 -224280 -173331
17899a73331J16286m4231K2448M1266j09608j64605L0427L6465J50313k73411
17889c67981l4518K32711J59082R2100k6627j72641l831J68005l0687k1425j2114
17878a7926j61731o5615R7964k1207P3150m687o0255L4123j09736o3091Q1791
17867b17220m1811q9379K9116M7230K13498P0317q5586l628K02454J73685J25601
17856D24277r8359k01019k9411j2744p8406k6773P2963R2430l7669p8959k3247
17845C083O3821l4906k1524O6461M7311j34567j29097m6098k6051K4373L3856
17834a53338k5117Q405P6994K06658J80024q9728j3042l9757q2996R8196J02655
17823B68954j99795k52222L7154J21135J72689J83500J04763k04395o3958N2367
$$ plain form
17899 -173331 -57045 -101276 -78828 -37562 -147170 -311775 -281348 -244883 -94570 -367981
17889 -367981 -402499 -169788 -10706 81394 54767 -117874 -121705 46300 15613 -5812 -17926
17878 -17926 -179657 -245272 -147308 -168515 -95365 -100052 -160307 -126184 -235920 -299011 -217220
17867 -217220 -259031 -348410 -319294 -272064 -58566 11751 -73835 -77463 124991 298676 424277
17856 424277 325918 124899 95488 82744 4338 -22435 50528 142958 105289 26330 3083
17845 3083 66904 31998 10474 76935 124246 -10321 -139418 -185516 -211567 -187194 -153338
17834 -153338 -178455 -170050 -93056 113602 293626 203898 190856 151099 68103 166299 268954
17823 268954 69159 -183063 -145909 -24774 147915 331415 436178 231783 167825 220192
17813B20192l0641j50422m3484J462J12744L7642l17255j09553J11479K71348
17803A03512n3273j07832M8533k636l9506o4188Q1646j21883l6317M1201J18188
17792c2555J69613p9882k41642j3287J25320L3935J04641j15878m6544N1200n6110
17781a01189K5778p815Q3545N6187N2759j74259l4003Q5229l279m5110N7588R7069
17769I2500j42195q7483M1777j04106j31102O0083J07657N8482j45221q122J0149
17758b47581m6473r7743m868J48837Q5587J05610L9200J774j0302j11460j17959
17747b55378L051J54350J69599n3340j88056P07M0769r0837J5686J25720l6743
17736a14472o0474J0446k0235K3380L4816L9231Q530P3717q9048j9620O0862K2835
$$ plain form
17813 220192 189551 39129 -4355 -2893 109851 147493 -169762 -279315 -167836 103512
17803 103512 50239 -57593 -9060 -11696 -51202 -115390 -33744 -155627 -191944 -150743 -32555
17792 -32555 137058 57176 -184466 -197753 -72433 -38498 66143 -49735 -96279 -45079 -101189
17781 -101189 -75411 -83226 319 56506 109265 -64994 -98997 -13768 -17047 -62157 -4569 92500
17769 92500 -49695 -137178 -95401 -199507 -330609 -270526 -162869 -104387 -249608 -257730 -247581
17758 -247581 -294054 -391797 -396665 -247828 -162241 -56631 -17431 -15657 -25959 -137419 -255378
17747 -255378 -252327 -97977 71622 18282 -169774 -169067 -128298 -219135 -203449 -77729 -114472
17736 -114472 -174946 -164500 -184735 -161355 -126539 -87308 -78778 -5061 -94109 -113729 -52867 -30032
17724c0032P2587J08124q3173J9811l847k0243j85928j41695R600q8978l2708
17713c76482P3775l2060J45234K49596m1951j29557M7704J53947r1879j12329
17703a14002J00335J58869p5544r3864q2126J12223J11014J28887r1915j30462
17693B3415L6589j36269k6319q8426j12825N5729J29387K5590l316J33217J8969
17682E5741j20641K4394m678r7291j42107R073J31264j7239p2632j64393M169
17671c94340J19317K27399M3365J33564J60176j39773j62161R1724P383n9944
17661B6710N3400Q2252j79820j68825l0032j30735J04536R4970J58901K36776
17651B48133j95616j33952R2850j32267k2673P1573L1676O4960q0119j84537o932
$$ plain form
17724 -30032 42555 150679 67506 87317 83470 63227 -122701 -264396 -254796 -343774 -376482
17713 -376482 -302707 -334767 -189533 60063 18112 -111445 -63741 90206 -1673 -114002
17703 -114002 -13667 145202 69658 -24206 -106332 5891 116905 245792 153877 23415
17693 23415 60004 -76265 -102584 -191010 -303835 -248106 -118719 -93129 -96445 36772 55741
17682 55741 -64900 -40506 -45184 -142475 -284582 -275509 -144245 -161484 -234116 -398509 -394340
17671 -394340 -275023 -47624 -4259 129305 289481 149708 -12453 79271 86654 26710
17661 26710 80110 162362 -17458 -186283 -216315 -347050 -242514 -147544 11357 248133
17651 248133 52517 -81435 11415 -120852 -143525 -71952 -40276 24684 -55435 -239972 -246904
17640b46904J86380O1222j02544k4172j9354p4202j22388p9970J72269M8095R9971
17629a01597Q1982j21731o5523J7353K63403J28503j36278K442L9742l8050r1959
17618b1713k44773L7370M3615J1109J79621j5621m8449j21854Q234J28483k58768
17607c02746j99015K56837J63524j69389J88784K78526P5112o1247k99862j12060
17597a81536J25237m1902j33499J26447J14497k6764j22115l1484N4722j09673
17587b26070j06242J71210J118Q0719J27209J27950j13624j36808l6814L0930
17577h0422R2297M5379M3992j58301k4813m0747m523l1570j79762k61079j9922
17566f19471J07213J27697L19943m0229o0012j12820J4620R0967n1590J37584
$$ plain form
17640 -246904 -60524 698 -101846 -126018 -145372 -219574 -341962 -421932 -249663 -201568 -101597
17629 -101597 -19615 -141346 -206869 -189516 73887 202390 66112 68554 108296 70246 -21713
17618 -21713 -266486 -229116 -185501 -174392 5229 -10392 -58841 -180695 -172461 -43978 -302746
17607 -302746 -501761 -244924 -81400 -250789 -62005 216521 291633 230386 -69476 -181536
17597 -181536 -56299 -98201 -231700 -105253 9244 -17520 -139635 -171119 -116397 -226070
17587 -226070 -332312 -161102 -159984 -79265 47944 175894 62270 -74538 -111352 -80422
17577 -80422 11875 57254 101246 -57055 -81868 -122615 -127138 -158708 -338470 -599549 -619471
17566 -619471 -512258 -384561 -64618 -104847 -164859 -277679 -263059 -172092 -223682 -86098
17556h6098J53694j08282j75197k0411J09343J39125n7279o9268K7890Q0994Q826
17545C337O4571J47k4065j6161j65598j30035M5090N2190J78064k20108k7297
17534b39865J03138Q5805j7197j03586J8765M1597P0365j06126p8116m9217r7140
17523c71577N1460K49555J21973o8449N5914L9649j62300L5110k0320o5689k8147
17512a62821r5944K4764R8770J13930K1730k00533k33283R2104J68581l665o5675
17501b42042k4358Q3056j78596j01075P6619j6604K9854J78236J14317J91264
17491A10671J15613j84602q7426j14020n9026m07J33622L524j08045j85044k18522
17480e93662J05379K13028J08219p717j09382P408n4446N2896J3569L4416K28641
$$ plain form
17556 -86098 67596 -40686 -215883 -236294 -126951 12174 -45105 -114373 -86483 -5489 3337
17545 3337 67908 68055 43990 27829 -137769 -267804 -222714 -170524 7540 -212568 -239865
17534 -239865 -136727 -50922 -68119 -171705 -152940 -111343 -40978 -147104 -225220 -274437 -371577
17523 -371577 -320117 -70562 51411 -17038 38876 78525 -83775 -48665 -68985 -134674 -162821
17512 -162821 -258765 -234001 -135231 -21301 429 -200104 -433387 -341283 -172702 -176367 -242042
17501 -242042 -266400 -183344 -361940 -463015 -386396 -403000 -373146 -194910 -80593 110671
17491 110671 226284 41682 -45744 -159764 -218790 -219197 -85575 -82051 -190096 -375140 -593662
17480 -593662 -488283 -275255 -167036 -174753 -284135 -276727 -331173 -278277 -264708 -230292 -1651
17469a651L7973M830l496j78409m387l3025r6300J5783o0050O3319p841J05003
17457a58251J11021L3146j28579l4196R5114L872p6497o9096q8434n6587j34429
17446e02916r2931Q4368J27827l1299j1163N1453J1020k09303r9335R1272Q0456
17435e00551J91083K45861N3452Q5413M358j75271k72178j60249L4159J87257
17425c06666J63258L0503j05882m0963p0931k4687O7680j2276P6637L7284M1652
17414a44391K56443K9541j24473o55n9219j89723J1906L5074J00026N0856n8247
17403i2862j16843j06048p5708J28168L42888J57676j255j73207k42999O9505
17393a10685J99784j41064L5311J92551j8535j52171n0187J08372R4663J46718
$$ plain form
17469 -1651 36322 41152 37656 -140753 -145140 -178165 -274465 -258682 -318732 -255413 -263254 -158251
17457 -158251 -47230 -14084 -142663 -176859 -81745 -77873 -154370 -223466 -311900 -368487 -502916
17446 -502916 -595847 -511479 -383652 -414951 -426114 -374661 -363641 -572944 -672279 -581007 -500551
17435 -500551 -309468 -63607 -10155 75258 79616 -95655 -367833 -528082 -493923 -306666
17425 -306666 -143408 -112905 -218787 -259750 -330681 -355368 -287688 -299964 -223327 -186043 -144391
17414 -144391 112052 141593 17120 16465 -42754 -232477 -220571 -185497 -85471 -34615 -92862
17403 -92862 -209705 -315753 -391461 -263293 79595 237271 236016 62809 -180190 -110685
17393 -110685 89099 -51965 -16654 175897 157362 5191 -44996 63376 158039 304757
17383C04757J17237o0597j23900j79021n8245L3616Q4296o8139j51936N274l5060
17372a31718j40437O3954J89012R5653J0323k1129q7125o5718p6870o1532r7760
17361c23347L8963R9848N3095k4343M2148o206r977J96860q8978k19413m5631
17350b86981M0655k4844J73635K6351Q8290o988j04764K9553K7034q1790j22374
17339b42223N9686J80024j1493k12647p8790P2041j03263j7372J29155m913R5395
17328a34400J0882K1476p9808r9731l4045J05436J56008L9376K3639K583j73K0178
17316C1421j59378j18491O9332p1739l8001L0640K09050J71911K2059r6968j70444
17305a20608j93915O6681j10249m1823P7454k8109K6588K17602J73016Q2592k80761
$$ plain form
17383 304757 421994 361397 237497 58476 231 33847 118143 50004 -101932 -96658 -131718
17372 -131718 -272155 -208201 -19189 76464 86787 65658 -21467 -87185 -164055 -225587 -323347
17361 -323347 -284384 -184536 -131441 -155784 -113636 -119842 -129819 67041 -21937 -241350 -286981
17350 -286981 -246326 -271170 -97535 -71184 17106 10118 -94646 -65093 -38059 -119849 -242223
17339 -242223 -182537 -2513 -14006 -226653 -305443 -233402 -336665 -354037 -224882 -229795 -134400
17328 -134400 -123518 -102042 -181850 -281581 -315626 -210190 -54182 -14806 8833 11416 11243 31421
17316 31421 -127957 -246448 -177116 -248855 -286856 -256216 -47166 124745 146804 49836 -120608
17305 -120608 -314523 -247842 -358091 -399914 -322460 -350569 -323981 -106379 66637 149229 -131532
17294a31532p1616J0492L69Q1470j7508J3225q4223k22374p0828N2409J30256
17283c09860L56K00116N448m5146L6758J54119L3222p517j26097j75944M7310
17272a87235R145J65188J05901M3314n2491j18905L9872J8791j04091r7770K254
17261a76027n4994O0917J51896R4100M530m34j12724q7385j43014J19408Q8233
17250e5494p6981P4668Q9280J44374M4445q1424k8662J84708q9475k40422m857
17239c9840L4300n2434k01553Q9344Q3437J44458R3148o6704j96303k20347p8166
17228d10660k8395J96775J0680l1301j0245k7909J53566j7744J4798k5210M2776
17217a32869L3287L2703O6403K6974J66636Q5054j51576m8424m7540l6660j06314
$$ plain form
17294 -131532 -203148 -192656 -192287 -110817 -128325 -115100 -199323 -421697 -492525 -440116 -309860
17283 -309860 -309504 -109388 -103940 -149086 -112328 41791 75013 67496 -58601 -234545 -187235
17272 -187235 -178090 -12902 92999 136313 83822 -35083 4789 23580 -80511 -178281 -176027
17261 -176027 -231021 -170104 -18208 75892 80422 79988 -32736 -120121 -263135 -143727 -55494
17250 -55494 -132475 -57807 31473 175847 220292 138868 110206 294914 205439 -34983 -39840
17239 -39840 -5540 -57974 -259527 -170183 -86746 57712 150860 84156 -112147 -332494 -410660
17228 -410660 -439055 -242280 -231600 -262901 -273146 -301055 -147489 -165233 -150435 -175645 -132869
17217 -132869 -99582 -66879 -476 26498 193134 278188 126612 78188 30648 -6012 -112326
17206a12326R4441J13091P5233P1565l6850j58611j66691J95665J42359j04278
17196A13598k12423j97669N1142n9192n9515l48316J16977L75912R4211R1641
17186c3634L3729r8738j11195J6747J73593k5193O5151n7806R677k1121m2772
17175i1562O7726J649J11026Q1058j2060m280j54682j18123r1244q0251J41026
17164a49717m9043j68270l6068m255O1791r062j14870j18818J21599K11803R7605
17153a57305Q58P0020J55903J3265o0462j61152L8503L7176K2322j70751k1184
17142b32807J20917K6888L8874L7509n1474N0232M9754M0546O8123j39665j39519
17131a30622q078j9972L4012J37533L7088j44207j04836P3350J24136J815o8950
$$ plain form
17206 -112326 -17885 95206 170439 242004 205154 46543 -120148 75517 217876 113598
17196 113598 -98825 -296494 -245352 -304544 -364059 -712375 -595398 -219486 -125275 -33634
17186 -33634 95 -98643 -209838 -193091 -19498 -44691 20460 -37346 -27669 -48790 -91562
17175 -91562 -23836 -22187 88839 169897 157837 153557 -1125 -119248 -210492 -290743 -149717
17164 -149717 -198760 -367030 -403098 -407353 -345562 -354624 -469494 -588312 -466713 -254910 -157305
17153 -157305 -156447 -86427 69476 82741 22279 -138873 -100370 -63194 -40872 -211623 -232807
17142 -232807 -111890 -85002 -46128 -8619 -60093 -9861 39893 80439 148562 8897 -130622
17131 -130622 -138700 -158672 -124660 12873 49961 -94246 -199082 -125732 -1596 219 -68731
17120f8731K5840p2675R3019M8938j10724P0134N8313n411l931j4107k38466K2613
17108a95188K2115J029O7917p7581n4865J15184n2987m2259q8256J08772k147
17097a98266l5910P6574L3993M3489J80075O1481J4050l04329j01517J68555J20066
17086E8261N9144J5090J5704M6879K9678r4252r3291L9856J19001j39567k29839
17075a73336j33509j25241J38375J03599M9073J8443P6083lK26476j10499j61621
17064i2160R9053p6673p331n2683k105Q974m8723L5560O5329N0413p7865o0509
17052a58720J91119M5952j09641r8598K456M7484k8898j82728o2475J33398Q6107
17041a34544L5194j12619N2526L4525j37834r3163n0557L5376K25474K9428p2946
$$ plain form
17120 -68731 -42891 -115566 -22547 26391 -84333 -14199 44114 38703 34772 20665 -217801 -195188
17108 -195188 -173073 -172044 -104127 -181708 -236573 -121389 -174376 -216635 -304891 -196119 -198266
17097 -198266 -234176 -157602 -123609 -80120 99955 161436 175486 -128843 -230360 -61805 58261
17086 58261 117405 132495 148199 195078 224756 130504 37213 77069 196070 56503 -173336
17075 -173336 -306845 -432086 -293711 -190112 -141039 -122596 -46513 -46516 179960 69461 -92160
17064 -92160 6893 -69780 -77111 -129794 -131899 -122925 -171648 -136088 -70759 -20346 -98211 -158720
17052 -158720 32399 78351 -31290 -129888 -127432 -79948 -108846 -291574 -354049 -220651 -134544
17041 -134544 -99350 -211969 -159443 -124918 -262752 -355915 -406472 -371096 -145622 -116194 -189140
17030a89140J05557J50689j34260l6096J23531P2351m6864l7825j04248l3992
17020a30297p7949j56923N3787K85454R203Q2836m6824j48659l0072l7254L3100
17009a63598J15533P4433l0114j2990M6036o3981j01942j9881K6505o0279J32527
16998e7751J34827p6050J1672k1086j57271m8562L8380M5727o990k00193J85576
16987a51721L2422j45119J13493J37380j50410M8452K03527p3991j08329j47420
16977b41716J5341r616P9688L29457K41306q1012q6121j38875k215P6725k30632
16966d7670j34215R1134K1413k0748O10K1349O0767j15812J29753m6570l970P1150
16954B7191k97491j9479J15778O415p344Q3816K7509q152j15657j75035n4353
$$ plain form
17030 -189140 -83583 67106 -67154 -103250 20281 92632 45768 7943 -96305 -130297
17020 -130297 -208246 -365169 -311382 -25928 -16725 66111 19287 -129372 -159444 -196698 -163598
17009 -163598 -48065 26368 -3746 -16736 29300 -34681 -136623 -156504 -129999 -190278 -57751
16998 -57751 77076 1026 12698 -8388 -165659 -214221 -175841 -130114 -137104 -337297 -151721
16987 -151721 -119299 -264418 -150925 -13545 -163955 -115503 88024 14033 -94296 -241716
16977 -241716 -226375 -235991 -156303 173154 414460 333448 247327 108452 106237 182962 -47670
16966 -47670 -181885 -90751 -69338 -90086 -89476 -68127 -7360 -123172 6581 -39989 -43959 27191
16954 27191 -270300 -289779 -174001 -167586 -174930 -91114 -63605 -71757 -187414 -362449 -416802
16943d16802J40192J66460M2073R4657o3637O987n2136K5128q3478P7327J09244
16932D6015J36654j07375K6045j09888p6697l0999O4377j45215j75445r7677j20915
16921e91120R3786J53332J76870J11945p4036j0080M2292j39233k92962k7789
16911e56995J56607N0103Q611j11094Q9408O3686j9490o7907J28342O7880O7735
16900a23114J09233l0524q9445j31218O2707Q4229q5117j20951j03877J47201
16890b80876J27348j3184R8003M3833p6077P3505n407q2989Q5667M3766O7021
16879H0610J11811j31196j06100r5863j23237Q7584j336j1137N8374K7789j539
16868a04240j5473p0206J11493J14777j03332N5975L9838j1857j60136M4254O2457
$$ plain form
16943 -416802 -276610 -110150 -68077 26580 -37057 -30070 -82206 -57078 -140556 -63229 46015
16932 46015 182669 75294 101339 -8549 -85246 -116245 -51868 -197083 -372528 -470205 -591120
16921 -591120 -497334 -344002 -167132 -55187 -129223 -139303 -97011 -236244 -529206 -556995
16911 -556995 -400388 -350285 -341674 -452768 -363360 -299674 -319164 -387071 -258729 -190849 -123114
16900 -123114 -13881 -44405 -133850 -265068 -202361 -118132 -203249 -324200 -428077 -280876
16890 -280876 -153528 -166712 -68709 -24876 -100953 -27448 -32855 -115844 -30177 13589 80610
16879 80610 192421 61225 -44875 -140738 -263975 -176391 -177727 -188864 -130490 -102701 -104240
16868 -104240 -119713 -189919 -78426 36351 -66981 -11006 28832 16975 -143161 -98907 -36450
16857c6450Q5288J9524n7297j43052k01981n2047k3151J5191J14806l2310J9599
16846b91880P7744J8059N2591k7689r106j41531J94953l8178o7926n9588J09846
16835a82705K3823O0484l4474O3561l089j07614j61413k0613J26888k5238o2503
16824c22893J13056M8139L1430j83595j09198O7776J04073N497j5692J31755K5629
16813a04023j3546J03869R0818R4619p2602m7854M1317j65060M8903N8319L6994
16802G1754o6056j68469j0680r8903m2737J50646M1024L6211k6038q211p0417
16791a91876M2987j2190K29046m3099n9613j391j45684P1766K63558L2415k14733
16780b8814j00306j1704Q804J20321j5228J9319l1144k294q9893K6134j32701
$$ plain form
16857 -36450 48838 68362 11065 -131987 -333968 -386015 -409166 -393975 -279169 -311479 -291880
16846 -291880 -214136 -196077 -143486 -171175 -180281 -321812 -126859 -165037 -232963 -292551 -182705
16835 -182705 -158882 -98398 -132872 -69311 -72400 -180014 -341427 -362040 -235152 -260390 -322893
16824 -322893 -209837 -161698 -130268 -313863 -423061 -355285 -251212 -245715 -261407 -129652 -104023
16813 -104023 -117569 -13700 77118 171737 99135 51281 92598 -72462 -23559 34760 71754
16802 71754 5698 -162771 -173451 -272354 -315091 -164445 -123421 -87210 -113248 -121459 -191876
16791 -191876 -148889 -161079 67967 24868 -34745 -36136 -181820 -110054 153504 185919 -28814
16780 -28814 -129120 -140824 -132020 -11699 -26927 -7608 -38752 -41046 -130939 -104805 -237506
16769b37506j06147n1261J24300K26022j7719j60910j51627l9892K25752m231
16759a93219l0965J29598K28372J51580n2606j90760j66175j05460J40666Q5681
16749c288l8880K1289l0933K6063k9715K9410k3729R4253J25444J834j65995L7436
16737D3189r6962N3417m4879l53J9449j22702m722Q7356l0365r2552m7384M3040
16725a93468o4148J38572J3800o7043j0586J03861Q7598O2096j51319j12963j45707
16714c39307Q4295n3829J44010K9759n6534J39461K8502o7604j7417p6582l1906
16703b17152o9213j51913m2032M7035o228O1133K21857K50677M2685J20007j36979
16692A19877n2360J67779q4977j08619j03983R1973j29929J75110K8278j20414
$$ plain form
16769 -237506 -343653 -394914 -270614 -44592 -62311 -223221 -374848 -414740 -188988 -193219
16759 -193219 -224184 -94586 133786 285366 232760 42000 -124175 -229635 -88969 -3288
16749 -3288 -42168 -20879 -51812 -25749 -55464 -26054 -49783 44470 169914 171748 5753 43189
16737 43189 -53773 -356 -45235 -45588 -26139 -148841 -153563 -66207 -96572 -189124 -236508 -193468
16725 -193468 -257616 -119044 -105244 -172287 -182873 -79012 8586 70682 -80637 -193600 -339307
16714 -339307 -255012 -308841 -164831 -135072 -191606 -52145 -23643 -91247 -108664 -185246 -217152
16703 -217152 -286365 -438278 -480310 -433275 -439503 -378370 -156513 94164 136849 256856 119877
16692 119877 67517 235296 150319 41700 -62283 29690 -100239 74871 103149 -17265
16682a7265J1457n879K4104N8815j6756p299l8288o2117j95885j4561n8831N6056
16670b66449J79352J92798o1776l92995q9156P8066Q8660K1491J33093Q6081j17488
16659a48323J52778L2016l4008O6989k51049k19828M2880K04033J37419P6457
16649E9364l607j0503j81002l6244k0713M4582K8662J5558O0188k8969j42058
16638b14742J34631L2087J3917N8442j70996R8414K57309o9977k24022K5670J15674
16627E6407J33795J64183j08804l05469P2624R9982r8997J10178r5547j16454
16617h8102k131R0933L6053o6717q6934K5498K10123o2547p1160l9749m8336N8677
16605d4392J29319j34377P7736L862k2661j27102j33058l6613P4766L2265j9697
$$ plain form
16682 -17265 -5808 -11687 12417 71232 54476 47177 8889 -53228 -249113 -263674 -322505 -266449
16670 -266449 -87097 105701 43925 -349070 -438226 -360160 -271500 -250009 -116916 -30835 -148323
16659 -148323 4455 36471 2463 69452 -181597 -401425 -358545 -154512 -17093 59364
16649 59364 55757 45254 -135748 -171992 -192705 -148123 -119461 -103903 -43715 -72684 -214742
16638 -214742 -80111 -48024 -34107 24335 -146661 -48247 209062 139085 -84937 -59267 56407
16627 56407 190202 354385 245581 -59888 12736 112718 13721 123899 28352 -88102
16617 -88102 -90233 700 36753 -29964 -116898 -91400 118723 56176 -14984 -54733 -103069 -44392
16605 -44392 84927 -49450 28286 32148 9487 -117615 -250673 -287286 -212520 -180255 -199952
16594a99952j56093J30748K06773j07266j46195P2734n6102Q987J31984J56309
16584D1927N7873K4784J20046q5605k00770j54350J48002Q919J8506J89853O9335
16573B38520M7510k39422k40817m7571J03745P7942n9877l1164M4273R9142j1413
16562a9132m2656j16512j47161k430J57678p3363j75143n7573J79600J43848N2752
16551a00092l3405K405P3139J01902J13784m7665j0693j42199K9130k9525P4189
16540C0970J31199l5156M471j06050N819J15425M3282k57259k4303R1956P9750
16529H0104k04915k03633m5843Q9342K8925K0036O115j9568r0867K2113J28021
16518a90170K9628k7001p9814P0580Q6216L5986j7790Q6502R5581n8097J14758
$$ plain form
16594 -199952 -356045 -225297 -18524 -125790 -271985 -199251 -255353 -246366 -114382 41927
16584 41927 99800 124584 244630 159025 -41745 -196095 -48093 -39174 -20668 169185 238520
16573 238520 286030 46608 -194209 -241780 -138035 -60093 -119970 -151134 -106861 -7719 -19132
16562 -19132 -61788 -178300 -325461 -327891 -170213 -243576 -418719 -476292 -296692 -152844 -100092
16551 -100092 -133497 -131092 -57953 43949 157733 110068 99375 -42824 -13694 -43219 30970
16540 30970 162169 127013 131484 25434 31253 146678 189960 -67299 -91602 354 80104
16529 80104 -124811 -328444 -374287 -284945 -256020 -235984 -229869 -249437 -340304 -318191 -190170
16518 -190170 -160542 -187543 -267357 -196777 -110561 -74575 -92365 -5863 89718 31621 146379
16507A46379m4281L5870j60825k85086m4422J98621K4413K7351j41031J37922
16497a05089R9212j56282N3301K5088J861l1676Q332O4734J8420j3051m3337k6520
16485a05007J52570K64778j96627j38260j18361k15695M7790L4057N0290K6584
16475a97881J44539N148n5609L9735p6263j83620p3709P6653J62516N3756K8170
16464g6565r661O5464Q7245m2831K737j23225r8589J8688J20818P1567r5270j05596
16452a85218n3770K0945J56649M0064q6900k58843q5714J79622R3564K8610M9628
16441a01363M3397j13302K5229N2272p04K6913M5469j41681J7335o8847L5416
16430a79866n8608J92400J09524J019j23966j20291R0632j30347k91373R0115
$$ plain form
16507 146379 102098 137968 -22857 -307943 -352365 -153744 -129331 -101980 -243011 -105089
16497 -105089 -5877 -162159 -108858 -83770 -81909 -113585 -105253 -40519 -22099 -35150 -78487 -105007
16485 -105007 47563 312341 115714 -22546 -140907 -356602 -308812 -274755 -224465 -197881
16475 -197881 -53342 -48194 -103803 -64068 -140331 -323951 -397660 -321007 -158491 -104735 -76565
16464 -76565 -86226 -20762 66483 23652 26389 -96836 -195425 -176737 -55919 15648 -79622 -185218
16452 -185218 -238988 -218043 -61394 -21330 -108230 -367073 -452787 -273165 -179601 -150991 -101363
16441 -101363 -57966 -171268 -146039 -93767 -94471 -67558 -22089 -163770 -146435 -215282 -179866
16430 -179866 -238474 -46074 63450 64469 -59497 -179788 -89156 -219503 -510876 -420761
16420d20761J62682J86870M1834k2283n0727j91404J34340P1200J8682L4482R3899
16409E8814p7628j02151l6433R7035M2996m4470L7567j02484j0329J38026j00186
16398i9243j16360J12025k9937O6188J86557p283j35052j29167j16584j499N0769
16387b19586o237J37473J51283n2306n746p7365j00066p628Q2194j7845P8511
16376c7318J28998o1208k8099n9240j99798q1072O4277N644j998o5025O1875j2343
16364b85307k8503k3086P6253J08113J09034M8310p2235J1695J14940j21957j51965
16353b14708m1980M715Q8383J01997J64444J46903j49812m4593j33771o3699J42007
16342a14J79761K5172m8979p3500j10589q6274L4717K11782p3369r9566p1956
$$ plain form
16420 -420761 -258079 -71209 -29375 -51658 -102385 -293789 -159449 -88249 -69567 -35085 58814
16409 58814 -18814 -120965 -157398 -60363 -17367 -61837 -24270 -126754 -137083 943 -99243
16398 -99243 -215603 -103578 -133515 -67327 119230 111947 -23105 -152272 -268856 -270355 -219586
16387 -219586 -225823 -88350 62933 10627 4881 -72484 -172550 -180178 -97984 -115829 -37318
16376 -37318 91680 30472 2373 -56867 -256665 -337737 -273460 -267816 -269814 -334839 -272964 -285307
16364 -285307 -313810 -336896 -260643 -152530 -43496 4814 -67421 -55726 59214 -62743 -214708
16353 -214708 -256688 -251973 -163590 -61593 102851 249754 99942 55349 -78422 -142121 -114
16342 -114 179647 204819 155840 82340 -28249 -114523 -79806 131976 58607 -40959 -112915
16331a12915j6070J45755l148j50908q1539J52155q6721j57673k9934k6167J9308
16320c47857l2296K8890O7305J81815J7945K3664M5098O4244M4065m7975j3846
16309C1052j410j22858m6585R3521L0412j05854L1015n0523j3009k28268r8520
16298d81027M7129O7333l1107J86398L305j36826k0310K15790Q3174k72267j04628
16287d43036J51979q8551O8858J49939m5620J1073N0274R4518J754Q6810P0134
16276A08132p7092j37322j79763p2271K9634P8950J00730K05965l4838l05798
16266b83673J8461J27484R1633K8403M7112J82422j04450q5498j7027K02478J07497
16255C14842o1532j77991j50611r6334o1766J72654J28888n6281j18086l7962
$$ plain form
16331 -112915 -128985 16770 13622 -137286 -218825 -66670 -153391 -311064 -340998 -367165 -347857
16320 -347857 -380153 -351263 -283958 -102143 -84198 -60534 -15436 48808 92873 44898 31052
16309 31052 29642 -93216 -139801 -46280 -15868 -121722 -90707 -141230 -154239 -382507 -481027
16298 -481027 -433898 -366565 -397672 -211274 -207969 -344795 -365105 -149315 -66141 -338408 -443036
16287 -443036 -291057 -379608 -310750 -160811 -206431 -195358 -145084 -50566 -48812 37998 108132
16276 108132 31040 -106282 -286045 -358316 -328682 -249732 -149002 56963 22125 -283673
16266 -283673 -265212 -137728 -46095 -17692 29420 211842 107392 21894 4867 207345 314842
16255 314842 253310 75319 -75292 -171626 -233392 -60738 68150 11869 -106217 -144179
16245a44179J33259J34235q6695n3458O1074k6292o5079j31001j77584N4275J80220
16234a21225N1769M3526j03560o0265N2549J00530j23210L6046K7361J0849q9869
16223a75499j8303l2627k6639n7597J41547J90265r175p8356Q3725l5969k37216
16212b55844o1510J9764k5585M4670L3478L0976Q2844L728J36482J52901K6615
16201A88519r6259M6940p4736j98292J35858J54443n6343j48119j59598r3470
16191c01057K53109J36226Q3927k48060k42136q4726N4254J38472J255j0789J24785
16180i4740J51863j63672m6196L9181m8403O4163L1107K7025m0233p1252J34490
16169a6667q474m0757p5223M6519k0270p1187J38351O4017O0160j70985j96071
$$ plain form
16245 -144179 -10920 123315 36620 -16838 44236 17944 -47135 -178136 -355720 -301445 -121225
16234 -121225 -69456 -25930 -129490 -189755 -137206 -36676 -159886 -123840 -96479 -85630 -175499
16223 -175499 -193802 -226429 -253068 -310665 -169118 21147 11972 -66384 17341 -18628 -255844
16212 -255844 -317354 -297590 -323175 -278505 -245027 -214051 -131207 -127479 9003 161904 188519
16201 188519 92260 139200 64464 -133828 2030 156473 100130 -47989 -207587 -301057
16191 -301057 -47948 88278 172205 -75855 -317991 -402717 -348463 -209991 -208736 -219525 -94740
16180 -94740 57123 -106549 -152745 -113564 -161967 -97804 -66697 -39672 -79905 -151157 -16667
16169 -16667 -25141 -65898 -141121 -94602 -114872 -186059 -47708 16309 76469 -94516 -290587
16158b90587j840J94101m0140q3959l6685l2862O8896j6507K17351K41069p7879
16147A40958R6771N0554L2607j08606r9839j73165R878J7612l6277M458o3738
16136a28787O4108k0510k35684j49046M270P5751N992J8238J03865J81745K7201
16125e2857j1653r176k1696j14406j79995m8747K32448J72712j17180j37900K0419
16114b68031L6197j5864J99420J54421O1874j67821j64068M1788J36722j19512
16104a04874j37243J36729k174j83946Q7922J13510Q8327K3152O7396J5792J23348
16093B27939m3532P7266n7668K134K7950J4676P5833j0420p767O5825o1822k7636
16081B82778l4571l1108R8357O6662j86318k36109j98443L8833K03910L7797n4411
$$ plain form
16158 -290587 -292427 -98326 -138466 -222425 -259110 -291972 -223076 -239583 -22232 218837 140958
16147 140958 237729 288283 320890 212284 112445 -60720 -50842 -33230 -69507 -65049 -128787
16136 -128787 -64679 -85189 -320873 -469919 -465649 -389898 -383906 -365668 -261803 -80058 -52857
16125 -52857 -64510 -73686 -95382 -209788 -389783 -438530 -206082 -33370 -150550 -288450 -268031
16114 -268031 -231834 -247698 -48278 106143 168017 196 -163872 -122084 14638 -104874
16104 -104874 -242117 -105388 -107562 -291508 -203586 -90076 -1749 21403 88799 104591 227939
16093 227939 184407 261673 204005 206139 234089 248765 324598 314178 306411 372236 310414 282778
16081 282778 248207 217099 315456 382118 195800 -40309 -238752 -199919 3991 41788 -12623
16070a2623O4056O5294l9847p9485P587M0661n0867j11307J59682j746j3297Q7448
16058A15556L8237J18152n8337j61811j90466q3703J2128q6158R2613M3152k5526
16047a86163J4662J30331P9895l3770j1006j07372m7267r0050o2563m1166K28269
16036a26200J38278J64407q5236k17804j17771P3198J86511J74485j24009j45706
16026g9847J14363k7007j03654J43110J68808R0282m9272m8852j3674p6874j28697
16015a1314N5421j0533P6962m1166j46416j02907J27215r8737R3892o1819O7820
16004e1582M5464R7387M6700K05855J9755k32377k73435j31365r4275J0926J68993
15993a87954R0719n9977J17515J15655m5335m9854k11409p9416K9559K980J07342
$$ plain form
16070 -12623 51433 116727 76880 -2605 4982 45643 -5224 -116531 43151 41405 28108 115556
16058 115556 153793 271945 213608 51797 -138669 -222372 -210244 -296402 -203789 -160637 -186163
16047 -186163 -171501 -41170 38725 4955 -6051 -113423 -160690 -250740 -313303 -354469 -126200
16036 -126200 12078 176485 91249 -126555 -244326 -171128 15383 189868 65859 -79847
16026 -79847 34516 7509 -96145 46965 215773 306055 256783 207931 194257 117383 -11314
16015 -11314 44107 33574 110536 69370 -77046 -179953 -52738 -151475 -57583 -119402 -51582
16004 -51582 -6118 91269 137969 343824 363579 131202 -142233 -273598 -367873 -356947 -187954
15993 -187954 -97235 -157212 -39697 75958 30623 -19231 -230640 -310056 -280497 -277517 -170175
15982a70175m4653j61026J78435J43879J6036n1311o1740R7889J28223r3947K61
15971a8129n8590N5944Q6690J04011n6972j21808k586m5370o7694p859J03722
15960b8641Q8212o2710j0642J20192j58736j10300L09853J78040k84163k99204
15950b58099k0708j6705Q5594N2835q7690J18792L7290l2953j2190M6456Q6990
15939c88q8600n5963R2687Q9524p989K7254K1200n2155k41861k5429j07892J98441
15927a51171J57046l0081o3737j07000J59563P4052j69671O3926J3873L4511j0004
15916b8693k9983r851n1301j25604R9929j166J3127J03448j27538j61848L9960
15905b79520O6913n8924K94073M4207p0746j65293L3451Q0481J33036L6233N6257
$$ plain form
15982 -170175 -214828 -375854 -197419 -53540 -37504 -88815 -150555 -52666 75557 -18390 -18129
15971 -18129 -76719 -20775 65915 169926 112954 -8854 -11440 -56810 -124504 -132363 -28641
15960 -28641 59571 -3139 -13781 106411 -52325 -162625 147228 325268 41105 -258099
15950 -258099 -278807 -295512 -209918 -157083 -244773 -125981 -88691 -121644 -133834 -87378 -388
15939 -388 -88988 -144951 -52264 37260 29271 56525 77725 25570 -216291 -241720 -349612 -151171
15927 -151171 5875 -24206 -87943 -194943 -35380 38672 -130999 -67073 -53200 -18689 -28693
15916 -28693 -58676 -68527 -119828 -245432 -145503 -146669 -133542 -30094 -157632 -319480 -279520
15905 -279520 -212607 -271531 22542 66749 -3997 -169290 -135839 -55358 77678 113911 170168
15894A70168l3051q9312k2158J73476l6018K425q4503j39006P6411o2064P8882
15883C5250J37835K9888O9500r628L0902M6654J09070K7327k8476K20221J74537
15872H43080N0010J76113N7129J1412J00276Q1800L19825O3296k4410J7956O907
15861A703394j57234k27125j69815j21317M2819j55097l00296l3626N5401q9471
15851E47633q6872n4354N0633k31488j58585j02466J5865p8837j14487M1368O8595
15840a02995L0111j83497J1052n1068l2677J03083K0091L8637R2676J12029M9991
15829H7433j07113r0360N5939J18224K10719R4889q4125j16407k25559k2773k3698
15818a02831j06433J43191J05236J7798m2232K3257k4019j15008k5760O7963m6716
$$ plain form
15894 170168 137117 47805 25647 199123 163105 165530 81027 -57979 18432 -43632 35250
15883 35250 173085 202973 272473 262845 293747 340401 449471 476798 448322 668543 843080
15872 843080 893090 1069203 1126332 1137744 1238020 1319820 1639645 1702941 1678531 1696487 1703394
15861 1703394 1546160 1319035 1149220 1027903 1070722 915625 615329 581703 637104 547633
15851 547633 460761 406407 457040 225552 66967 -35499 -19634 -98471 -212958 -171590 -102995
15840 -102995 -72884 -256381 -245329 -296397 -329074 -225991 -205900 -167263 -74587 37442 87433
15829 87433 -19680 -110040 -54101 64123 274842 369731 285606 169199 -56360 -79133 -102831
15818 -102831 -209264 -66073 39163 56961 14729 37986 13967 -101041 -126801 -58838 -105554
15807a05554J32316m4838N1991J57422j21959j62109o6018j80577J08677J82881
15797d7768L4915j17884l3351K3923j14916Q219O7163j9157J2984O1257n5042
15786a79657K9856M2710o2425J46192N2836L5035q1584R212J43011r1500n2999
15775i313r0999R5113J11914Q5815N4794j76251p9305j52763j10486j6951K5560
15764b62872J30540L1320N4319J4370n6542L9016L0251m5766J09961q3745j63848
15753b02996N5482P2029n7952R8301M0462J2650L7426L0556j34317j40333m8328
15742b37020o3413P3346O999K32770Q6585r5934j25001K8137J34910j39702M7864
15731e0459J77846J43353J21090N5666m0141k6135q4746j9654K8604J16647K8698
$$ plain form
15807 -105554 26762 -18076 33915 191337 69378 -92731 -158749 -339326 -230649 -47768
15797 -47768 -12853 -130737 -164088 -140165 -255081 -246862 -179699 -198856 -185872 -124615 -179657
15786 -179657 -149801 -107091 -169516 -23324 29512 64547 -17037 -7825 135186 43686 -9313
15775 -9313 -100312 -5199 106715 192530 247324 71073 -8232 -160995 -271481 -288432 -262872
15764 -262872 -132332 -101012 -46693 -32323 -88865 -49849 -19598 -65364 44597 -39148 -202996
15753 -202996 -147514 -75485 -133437 -35136 5326 17976 55402 85958 -48359 -188692 -237020
15742 -237020 -300433 -227087 -220088 12682 99267 3333 -121668 -93531 41379 -98323 -50459
15731 -50459 127387 270740 391830 447496 407355 381220 296474 276820 305424 422071 450769
15720D50769j84693r7595J34138o2764j02499q377k0320o5347J2151m8155k4071
15709a6763Q0043n4782j13073l3649P2469P5135P6821k00982j26921J8701P3534
15698a49467J08828Q9163k089j24311k3199j57M8498L1724N917q0681q8878N2983
15686a31669J92157q2578k10372r2176L5739J92838L4963j64513O0198K34300
15676F8887o9259R1843J75087j982m1271J8903Q872m8682j06660n95m6369Q1046
15664A29820Q5307P7871P454K1323j46244q3008J14820J4084j7481k16206r5691
15653a07951P4857P0101J01900J16218j6074l8796j26818L2591J86175J02706
15643C94909k8758L0005j49988n3739R506R0582n9431j13305O7017K94304k33478
$$ plain form
15720 450769 266076 168481 302619 239855 137356 128979 108659 43312 55463 7308 -16763
15709 -16763 63280 8498 -104575 -138224 -65755 9380 86201 -114781 -241702 -223001 -149467
15698 -149467 -40639 48524 46435 -77876 -101075 -101232 -52734 -21010 -15093 -95774 -184652 -131669
15686 -131669 60488 -22090 -232462 -324638 -288899 -96061 -61098 -225611 -165413 68887
15676 68887 -372 91471 266558 264576 223305 242208 251080 202398 95738 95143 48774 129820
15664 129820 215127 292998 300452 321775 175531 92523 207343 221427 203946 -12260 -107951
15653 -107951 -33094 37007 138907 255125 239051 200255 73437 106028 292203 394909
15643 394909 366151 396156 246168 192429 201935 292517 233086 119781 186798 481102 247624
15632B47624k03172q7015P5366j14657M537J65326J84955J58583o1842n7806r8117
15621B13782j09924M2916j69854r1770j01488O5008J85300N7970M9516o7811M9117
15610A22762k5713k0481J32703J2308J6185R1680j2493l1310j47143n3412j4461
15599G0625J48441O7462p1913k18176p0914J38243J3815J03288K0013j20088N9272
15588A40068J13436K4641K8101l8611m3052L4354l551j19678J51197J02738J00227
15577D89870N6656j497j55005k11496j34517J9357q2355j4894J89748J52689k66192
15566D2364k18420J01321J5475Q2564Q8129j03813k35737m7851P3052L02407J50523
15555B50014J040Q2865N7633l7941j5645m1529O9990l7522J3261J25575J55216
$$ plain form
15632 247624 44452 -42563 32803 -81854 -77317 88009 272964 431547 369705 311899 213782
15621 213782 103858 146774 -23080 -114850 -216338 -151330 33970 91940 141456 73645 122762
15610 122762 97049 76568 209271 221579 237764 329444 316951 285641 138498 85086 70625
15599 70625 219066 286528 214615 -3561 -74475 63768 77583 180871 200884 80796 140068
15588 140068 253504 278145 306246 267635 224583 258937 255386 135708 286905 389643 489870
15577 489870 546526 545029 390024 178528 44011 63368 -18987 -33881 155867 308556 42364
15566 42364 -176056 -74735 -59260 23304 111433 7620 -228117 -275968 -202916 99491 250014
15555 250014 251054 333919 391552 353611 337966 296437 366427 328905 342166 467741 622957
15544F22957j05435j23276M9260k1285R4958R9120Q9693q68o0820k9412O8444
15533F83336M8427n1371k823q3825j42894Q9080J0572P9581k08887P8523K92323
15522G92042l9116K0499J35303Q2838k22032N6504J78154j18078q2672o4450l239
15511G35753M4964J88239J56301n2134o3151j22350j9991l1371P9061L89863O2208
15500A367392r475Q3400L1817j16121M0551J87922J38232m7347l0552k9334J43448
15489A759933j72784j05575j02645J17479J28174J18768O4866j2729K04219J30544
15479B130250j53932K9771J56942K3201j01817J19293K41473J85901M3661J47345
15469B822088J64303L8322J97112L2315Q6346M7597J75026M39203K77474J38071
$$ plain form
15544 622957 517522 394246 443506 422221 517179 616299 705992 705124 644304 614892 683336
15533 683336 731763 680392 677569 593744 450850 539930 550502 630083 421196 499719 792042
15522 792042 752926 773425 908728 991566 769534 826038 1004192 886114 803442 738992 735753
15511 735753 780717 968956 1125257 1073123 1009972 887622 867631 836260 915321 1305184 1367392
15500 1367392 1357917 1441317 1473134 1357013 1397564 1585486 1723718 1676371 1645819 1616485 1759933
15489 1759933 1587149 1481574 1378929 1496408 1624582 1743350 1808216 1795487 1999706 2130250
15479 2130250 1976318 2006089 2163031 2186232 2084415 2203708 2445181 2631082 2674743 2822088
15469 2822088 2986391 3024713 3221825 3254140 3340486 3388083 3563109 4002312 4279786 4417857
15459D417857K07915O9120L9271J72041L29331K95446K10438J93952L12937M56206
15449F704514M15974L64094M39890M80952M30047O14415P78360Q01849Q51915
15440A1882010Q83317R35541J174138J401994J585110J750369K221141K362428
15432B4196048K605457L034387L503483L992397M505172N345648O049218O916831
15424F0148641Q095487R706402J1744892J4492019J7825087K1823548K6434227
15417A70270303L1404869L5795933L8823636M0133090L8684428L4169177K6545165
15410D15826601J6577293N030087p277899j8505521k7673519l4125069l7707737
15403C12144236l8618433l6884486l3498572k9204061k4661409k0384792j6609560
$$ plain form
15459 4417857 4625772 4694892 4734163 4906204 5235535 5530981 5741419 5935371 6248308 6704514
15449 6704514 7120488 7484582 7924472 8405424 8835471 9449886 10228246 11030095 11882010
15440 11882010 12765327 13700868 14875006 16277000 17862110 19612479 21833620 24196048
15432 24196048 26801505 29835892 33339375 37331772 41836944 47182592 53231810 60148641
15424 60148641 68244128 77950530 89695422 104187441 122012528 143836076 170270303
15417 170270303 201675172 237471105 276294741 316427831 355112259 389281436 415826601
15410 415826601 432403894 437433981 430156082 411650561 383977042 349851973 312144236
15403 312144236 273525803 236641317 203142745 173938684 149277275 128892483 112282923
15396A12282923j3481334j1228736r509521q189047p175326o201332n692054m911082
15388D5894491m216572l726597l326736l029713k502869k299300j931155j682164
15380B3179385j542456j400276j268580j187694r19735r63213q16329q95557q99301
15371A3286244p82390o65132m22083o33454n83195m82295m57922l52460l59926
15362H547387l98289m82129m16403l64893k97516k62864n3287k62646j48484j89204
15352E671672k15460k68477m05702k79655q7230m4515j77466j43885j97467l67490
15342C484325j85947q4146n628R0792l6644j40629k30604O7443q3480k24307n8418
15331B592757J402k5860k0186j65502r1330j48171j09459r0943J13075P0165j56820
$$ plain form
15396 112282923 98801589 87572853 78063332 69874285 62698959 56497627 50805573 45894491
15388 45894491 41677919 37951322 34624586 31594873 29092004 26792704 24861549 23179385
15380 23179385 21636929 20236653 18968073 17780379 16860644 15897431 15081102 14185545 13286244
15371 13286244 12503854 11838722 11416639 10783185 10199990 9717695 9259773 8907313 8547387
15362 8547387 8149098 7666969 7250566 6885673 6588157 6325293 6272006 6009360 5860876 5671672
15352 5671672 5456212 5187735 4782033 4502378 4415148 4370633 4193167 4049282 3851815 3484325
15342 3484325 3298378 3214232 3208604 3299396 3262752 3122123 2891519 2958962 2875482 2651175 2592757
15331 2592757 2594159 2568299 2548113 2382611 2291281 2143110 2033651 1942708 2055783 2125948 1969128
15320A969128P317K5520m5150N889J38960N9387L1330k64373j94924p4681j91854
15309A466549k9502m2408J76265j28090O152J06281j8476q164k9621Q4432k8598
15298A554820j092Q0596j8088k71703j15268j47451j95143j01783K71046J57465
15288A213399J53963p789j09884j01378p4305k46189p4235K10873J79219j88106
15278I55568j74965J01578J2664o6037j17985J31922J04088o4101r6627n136l3453
15267G47516J9428O6139n8873q4093p9397J15674O0816J45813l31K4533k08331
15256G48894j7219J22990M6566j06021j41741R96p8470j26003J08409J55730K9761
15245G43892m86n4553n8159j03296k8839j1917j1607p2669N0369J18603r7686
$$ plain form
15320 1969128 1976445 2001965 1956815 1962704 2101664 2161051 2192381 1928008 1733084 1658403 1466549
15309 1466549 1437047 1394639 1570904 1442814 1448966 1555247 1536771 1528607 1498986 1583418 1554820
15298 1554820 1553728 1634324 1616236 1344533 1229265 1081814 886671 784888 1055934 1213399
15288 1213399 1367362 1359573 1249689 1148311 1074006 827817 753582 964455 1143674 955568
15278 955568 780603 882181 894845 828808 710823 842745 946833 882732 786105 780969 747516
15267 747516 766944 833083 774210 690117 610720 726394 787210 933023 932692 957225 748894
15256 748894 731675 854665 901231 795210 653469 654465 575995 449992 558401 714131 743892
15245 743892 743406 688853 630694 527398 498559 486642 475035 402366 452735 571338 473652
15234D73652o5178R1096m1329J05079O407p7448j19856j18291J38101J0748N9508
15223D62489l8568n20J8949J7433l7569O3835j0246j14480L8776J21431o6545
15212D54985m3702j6757p7219Q7950P3848k4497j5324O8815k03010j99231n2429
15201E3429J49750J37378L6028j07280m208m3436R4035P2800J94611J73760O7529
15190H24396l9865l54114k02613p7293q4818J48779J41021m7216k4967j1182N3001
15179C25129P0624j12450j20087q7647J07706P1470R2273O6641J14310J6605p0196
15168D74378M9780n2001j865J266J0296J04667j16119j29869R2771k0700P6278
15157D88882M1652o018r0075J90068J11773j78822k49860M6605r2494j80652J52601
$$ plain form
15234 473652 408474 499570 458241 563320 569727 492279 372423 254132 392233 402981 462489
15223 462489 423921 423401 442350 459783 422214 486049 475803 361323 400099 521530 454985
15212 454985 411283 394526 317307 405257 479105 454608 439284 508099 305089 105858 53429
15201 53429 203179 340557 376585 269305 265097 221661 315696 388496 583107 756867 824396
15190 824396 784531 430417 227804 150511 65693 214472 355493 308277 283310 272128 325129
15179 325129 395753 283303 163216 75569 183275 254745 347018 413659 527969 544574 474378
15168 474378 524158 472157 470292 471558 481854 586521 470402 340533 433304 412604 488882
15157 488882 530534 524516 434441 624509 736282 557460 307600 354205 261711 81059 233660
15146B33660j0334l91j01687k6224J21071N1340J38665j07670k06670P3168P9190
15135B44118J1199J76088j8702r4512Q4912j42137p6889l6965L0945R0785k3439
15124B45403p4473P2170r9606j16530J22036Q3034N4854o8029j21725Q7478N7958
15113B42570M5030k51849j28320o8544k5821M2317N3493J01083k906J41888J61725
15102C10666j773r2092r6524m4793n2580J26363r5779K7843l8170K6364M6261
15091A15786l1480j46587J39324J99096N5499K8559o2161j5109l4025P0534L879
15080C23315j72919J07190j04581P535R2360r500L2480R9890R9405l5717j42448
15069B97010j72621j74437p2508J48613K08426o9930j86339j06498J38757J23988
$$ plain form
15146 233660 223326 222935 121248 95024 216095 267435 406100 298430 91760 164928 244118
15135 244118 255317 431405 412703 318191 403103 260966 184077 147112 178057 268842 245403
15124 245403 170930 243100 143494 26964 149000 232034 286888 218859 97134 184612 242570
15113 242570 287600 35751 -92569 -161113 -186934 -144617 -91124 9959 7053 148941 310666
15102 310666 308893 216801 120277 75484 22904 149267 53488 81331 43161 69525 115786
15091 115786 84306 -62281 77043 276139 331638 360197 298036 282927 248902 319436 323315
15080 323315 150396 257586 153005 160540 252900 243400 275880 375770 475175 439458 297010
15069 297010 124389 -50048 -122556 26057 234483 164553 -21786 -128284 10473 134461
15059A34461m3826p4629J10998k5906j39908p6427r461l9527R5861q853L218J69661
15047I5662N6521k3114p507N6475k9210j51232J47258J66465K7263j34415o2616
15036A41550k3758O412R1921j190R4494J03426k2004j61570q268m2579O7531L5826
15024B81791M7144p9936q3419k49204k32288k972K85238q1253N0439K84340O6822
15013B86702l28070O4837J57710L8221j38367j65073P6269O3378J22209M6367
15003B24183j38828k0339L4323q8969R8877N8997j44891K8595q9373J59616R4140
14992B16331j53965p7876K02445K5337J3930J16893k8478M3532p4865J04207J19175
14981E06666j34857j45867r1032O5928J8880j66665p4261O2839N4581j41201K08270
$$ plain form
15059 134461 90635 16006 127004 101098 -38810 -115237 -124698 -164225 -68364 -77217 -73999 95662
15047 95662 152183 129069 121562 178037 148827 -2405 144853 311318 338581 204166 141550
15036 141550 117792 124204 216125 214935 309429 412855 390851 229281 221013 178434 245965 281791
15024 281791 328935 248999 165580 -83624 -315912 -318884 -33646 -114899 -64460 219880 286702
15013 286702 -41368 23469 181179 219400 81033 -84040 -7771 55607 177816 224183
15003 224183 85355 65016 99339 10370 109247 168244 23353 51948 -37425 122191 216331
14992 216331 62366 -15510 186935 212272 226202 343095 314617 358149 283284 387491 506666
14981 506666 371809 225942 134910 200838 219718 53053 -21208 41631 96212 -44989 163281
14970A63281J55815Q2909j76271j6632L03204J02842j57851K7384J77501N2098
14960G14280M9871Q5924Q9741J33944J90749Q7912J49005J30859O2594J93971
14950A888850J97107j33501j96862m0124k5719j5493j44297j35113j85627j06036
14940A103185L6864r5691k08517L6222j1806k35809j87411J00815J12901o3162
14930E87591j59823q1465l9658k7898P2806n5730l4020k02891o1357O3744m5515
14919A5784J28914J49106j39894p6476j49811j56277P5542J64549J62988J55968
14909C30393r7489j77986Q6739k7377m8068j29181O3770M4696j7319r8865J46128
14898G5441J6751q0923L2730P6560K49680n460k06688j70712R8294j31917n9775
$$ plain form
14970 163281 319096 402005 225734 209102 512306 615148 457297 484681 662182 714280
14960 714280 764151 850075 939816 1073760 1264509 1352421 1501426 1632285 1694879 1888850
14950 1888850 2085957 1952456 1755594 1715470 1689751 1674258 1529961 1394848 1209221 1103185
14940 1103185 1140049 1044358 835841 872063 860257 624448 437037 537852 650753 587591
14930 587591 427768 346303 306645 278747 351553 295823 261803 58912 -2445 61299 15784
14919 15784 144698 293804 153910 77434 -72377 -228654 -153112 11437 174425 330393
14909 330393 232904 54918 141657 114280 66212 -62969 801 45497 28178 -70687 75441
14898 75441 92192 11269 43999 120559 370239 364779 158091 -12621 85673 -46244 -106019
14887a06019J17669n341M7500K2355O9662m3689k52591j07258P9373J62500J00266
14876H4427l2043R9337n7042L8895J6490O562q56J3993P4085J678J6560J8003
14864B80089q1902q9913l6472J1516K8215j49721L3055P0227L7020O1935l4181
14853A29868O163j61635l9309n0210Q5990o4956m4147L6803m8171J17086j78049
14842b10567M3988l6378N4722J70570R4283M362m5450j5285n1579n1266l2030
14831g4630L2866N2716r4157k54242p7532J11642N2322K0355K971k17504m7930
14820d93123J71038K51788J44072j24448J824J7997J20902J14837l2051n9038
14810A13798j9288q9623q2714K12636R0024j90622j49134K9664l0073L9277K94657
$$ plain form
14887 -106019 11650 6309 53809 76164 145826 102137 -150454 -257712 -178339 -15839 84427
14876 84427 52384 151721 94679 133574 150064 156626 155770 169763 243848 245526 262086 280089
14864 280089 198187 108274 71802 83318 111533 -38188 -5133 65094 102114 164049 129868
14853 129868 136031 -25604 -64913 -115123 -29133 -94089 -138236 -101433 -149604 -32518 -210567
14842 -210567 -166579 -202957 -148235 22335 116618 120980 75530 60245 8666 -42600 -74630
14831 -74630 -41764 10952 -83205 -337447 -414979 -303337 -251015 -230660 -227689 -445193 -493123
14820 -493123 -322085 -70297 73775 -50673 -48849 -30852 90050 204887 172836 113798
14810 113798 94510 4887 -77827 134809 224833 34211 -114923 -85259 -115332 -76055 218602
14799B18602M0631j78250j72130J7262J31097L5380J14883j58849r5621J2524
14789c4471O1775j2701K742J63577L5333j19962n9803O9618K6789N4049J51895
14778C38841j3988j9872r9448o3051q6788P0037n4088J3397j35811q0712Q2607
14767d8876K8577k8768j38321m4645L5834p2278K9949O9822J8131p9847R1668
14756a38754K38091K4938j23406p0438R8101p5254l1209J27888R5378r0037j63106
14745a07808P8645N8372p8051j13808p9624Q4385r1658Q6436J62193o464o8855
14734g6237o85P3838N0896j32986K538J09205M0464p8784n8406O1200J52862J32605
14722B76510J10355j36244j73953q5123R6857p2257m3521j3662l0480n0367P7279
$$ plain form
14799 218602 259233 80983 -91147 -73885 57212 92592 207475 48626 -46995 -34471
14789 -34471 27304 14603 17345 180922 216255 96293 36490 106108 132897 186946 338841
14778 338841 324853 304981 205533 142482 55694 125731 71643 85040 -50771 -131483 -48876
14767 -48876 -20299 -49067 -187388 -232033 -196199 -268477 -238528 -168706 -150575 -230422 -138754
14756 -138754 99337 124275 869 -69569 28532 -46722 -77931 49957 145335 55298 -107808
14745 -107808 -29163 29209 -48842 -162650 -242274 -157889 -249547 -163111 -918 -7382 -76237
14734 -76237 -76922 -3084 47812 -85174 -82636 26569 67033 -11751 -70157 -8957 143905 276510
14722 276510 386865 250621 76668 -8455 88402 16145 -27376 -41038 -71518 -121885 -44606
14711d4606q9999K4447l2138q6297O9160J47658K6475Q4009K13132j57143n6453
14700I8245L3048j00729j9275L5423Q0229J9737J40637N3050j59385j62853J0045
14689B8172J49090K4675k56247L3223J6576p7126O5893R6866P6140P5602J7288
14678B50152L4585j00307L0043K1838m3419k9943j46226k9253M1771j6884j53991
14667a41634m7358N7571O5620Q390L505M303k69n3411K4858j4158n2059j27883
14655b72525K8592J13720P0554m2597O3375j4614o6601J18482J16039j04883n1332
14644d1790p5290L471k6821o5122N5317K6462r396o3587K3111j1951p7714K05875
14632e7435J44007j10331j77090L7502J50084k8762K3589k1007m5070K1419J92253
$$ plain form
14711 -44606 -134605 -110158 -142296 -228593 -159433 -11775 14700 98709 311841 154698 98245
14700 98245 131293 30564 11289 46712 126941 146678 287315 340365 180980 18127 28172
14689 28172 177262 201937 -54310 -21087 -4511 -81637 -15744 81122 157262 232864 250152
14678 250152 284737 184430 214473 236311 192892 162949 16723 -12530 29241 12357 -141634
14667 -141634 -188992 -131421 -65801 -57411 -53906 -49603 -49872 -103283 -78425 -92583 -144642 -272525
14655 -272525 -243933 -130213 -59659 -102256 -38881 -53495 -120096 -1614 114425 9542 -41790
14644 -41790 -117080 -113609 -140430 -205552 -150235 -123773 -133169 -196756 -173645 -185596 -263310 -57435
14632 -57435 86572 -23759 -200849 -163347 -13263 -42025 -18436 -39443 -84513 -63094 129159
14621A29159p0779N7254r1376j52423O8975K17108J23600L6008k23454j26468
14611c2396k7587N7852m775J35155J58399P6221j30812O9356Q9473o6665j20768
14600B03453q0190j10181n679O3125j8369q0560l1521J0692n3387r7782l1249
14589b31648K5999J42688J73367M7973Q8660j0348K8173P5423j19729k45461j2321
14578c7224P3543r0389K6635r3453q50K03633J1357J04436N6569q8683J49428
14567C15002l7745l38739j36496J0335j560M2150r747P8480K4451O8535O2035
14556G6701J6253j7001n4813r8780Q9059J22106l7763p5008k07404P1040J90483
14545G4873M5618j34939J0408J32114J26208n6385j3700m2431k7001R906P0590
$$ plain form
14621 129159 58380 115634 24258 -128165 -59190 157918 281518 317526 94072 -32396
14611 -32396 -59983 -2131 -6906 128249 286648 362869 232057 301413 390886 324221 203453
14600 203453 123263 13082 7403 70528 52159 -28401 -59922 -49230 -102617 -200399 -231648
14589 -231648 -205649 -62961 110406 158379 247039 236691 264864 340287 220558 -24903 -37224
14578 -37224 36319 -54070 -27435 -120888 -121738 81895 93252 197688 254257 165574 315002
14567 315002 277257 -61482 -197978 -187643 -189203 -147053 -156800 -78320 -53869 14666 76701
14556 76701 92954 75953 21140 -77640 11419 133525 95762 20754 -186650 -115610 74873
14545 74873 120491 -14448 -4040 128074 254282 197897 184197 141766 114765 124671 195261
14534A95261m1061K563Q3168r9396o6833j69440j34354J2860J20212J82167R9423
14523A84570J97302K6805j48280j01025j10261k48337J5106K22074P8191J2053
14513A28198Q7171j5542l8933j66766j48664K2625k25670l3535J24833j0126K76123
14502b86R0053q4967k9356J78269J50942K4691n3181j71983k08324J04661P8007
14491G8526L9583p9763P4453O9430j69497k98913l130J76774J68370M3023R0688
14480A89544n9896R385Q4958r8807n2716N5241n0728k2532N0448M9652k7432l0924
14468I6193l2096J89610M7962j41262o7172j52971N4244Q4324n863J22042l9081
14457A55930L5246j92487Q4737O5403N8251j89621j78686J15060l4879n5357J08964
$$ plain form
14534 195261 154200 156763 239931 140535 73702 -95738 -230092 -217232 -97020 85147 184570
14523 184570 381872 408677 260397 159372 49111 -199226 -184120 37954 116145 128198
14513 128198 215369 199827 160894 -5872 -154536 -131911 -357581 -391116 -266283 -276409 -286
14502 -286 89767 4800 -24556 153713 304655 329346 276165 104182 -104142 519 78526
14491 78526 118109 38346 112799 182229 12732 -286181 -289311 -112537 55833 98856 189544
14480 189544 129648 139033 223991 125184 72468 127709 76981 54449 104897 154549 127117 96193
14468 96193 64097 253707 301669 160407 93235 -59736 -5492 78832 72969 195011 155930
14457 155930 191176 -1311 83426 148829 207080 17459 -161227 -46167 -81046 -136403 -27439
14446b7439P6386K413L0512J00532n5116m1099P1676M328j7176j62464n4892k1830
14434i4169K65737L737r0430k03869k7047J70922J5638k04590m2989M6982J34471
14423b5607J61518l1918m6790K9417J3833p334M6589j08135p3474L8463N1462
14412D8024L1662L0158l7220p2316j73131p4274O1574J11546q2780q7657O0516
14401a83898J26126K19857M0334q6451j48753j08517j2409k17741L6427K49428
14391h5597N7601n4492K7573P8952J09566M0205j24933o8064J28904O8600j28066
14380E0249j33457O1416J56077J98322j84756j29731j10195K8460J08535j21133
14370g6213q3711j00422J34298J47535K46595k6671l6273L5717r3768j10532p2632
$$ plain form
14446 -27439 48947 51360 81872 182404 127288 86189 157865 162193 145017 -17447 -72339 -94169
14434 -94169 171568 175305 84875 -118994 -146041 24881 40519 -164071 -207060 -160078 -25607
14423 -25607 135911 103993 57203 86620 100453 93119 139708 31573 -41901 -3438 48024
14412 48024 79686 109844 72624 308 -172823 -247097 -185523 -73977 -156757 -244414 -183898
14401 -183898 -57772 162085 202419 115968 -32785 -141302 -153711 -371452 -335025 -85597
14391 -85597 -27996 -82488 -54915 24037 133603 173808 48875 -19189 109715 178315 50249
14380 50249 -83208 -21792 134285 332607 147851 18120 -92075 -63615 44920 -76213
14370 -76213 -159924 -260346 -126048 21487 268082 241411 205138 240855 147087 36555 -36077
14359c6077j03450J27612j3375n3784k9070n2426O6166O9009r7185Q2873K29014
14348A89307J52416j34539k26648j12204M8420L772j2559p7488Q5852J25761J7423
14337E9513L3946Q9023p4067Q899J8267o0035j35367q7040p6521m2842L7418J82744
14325d6062J9547k0028p5818o6623j5745n889q417m0777P0954l3177K02802Q6403
14313F7170m2776M6702K9045k1260l04900n1933J53286J44804J17606o7604k7650
14302D2490j21209j46619m822O8980J10405p286J08058r1758P328O5847N0474
14291H1888N1363j2033J07048q255n8148l2906m2426o8996J0015M8330J95507
14280B71387K25366l8082L6207J51548o4891Q3604J8785r1922R6252L4051j57426
$$ plain form
14359 -36077 -139527 -11915 -25290 -79074 -108144 -160570 -94404 -25395 -122580 -39707 189307
14348 189307 341723 207184 -19464 -131668 -83248 -79476 -92035 -169523 -83671 42090 59513
14337 59513 93459 182482 108415 117314 135581 75546 -59821 -146861 -223382 -266224 -228806 -46062
14325 -46062 -26515 -46543 -122361 -188984 -204729 -210618 -219035 -259812 -188858 -222035 -19233 67170
14313 67170 24394 71096 100141 78881 -226019 -277952 -124666 20138 137744 70140 42490
14302 42490 -78719 -225338 -230160 -161180 -50775 -58061 49997 -41761 -34433 31414 81888
14291 81888 133251 121218 228266 220011 161863 128957 86531 17535 27550 75880 271387
14280 271387 496753 458671 494878 646426 581535 665139 683924 592002 688254 722305 564879
14269E64879j41020j25956l6071K1715q3499k16630j3094N1507j8835j3324J4512
14258D184Q515Q119M3905j97019o9674o294K04937l5607M6364J11731O1143J47435
14246C27739K0205k63034k03521J41036K8258l6717j15697j0268m861K17656P4700
14235A75496p6784r4348M357q3701J3614J62371Q9539L8653k6923m0320m4095
14224A17859Q3618q3568j20879q6945j17195o695J48786j1332N8393M2454R8477
14213A22973K19304r6361M187J1652j4366K2553P6300M2089m6234l3269m8582
14202B60246j59204K7543k6050Q1474r5782j55925p2944m2404J41617N1078k35175
14191b25526j96136j3428O0329J51257O1916l5997L4049J21222Q0828j93097j52173
$$ plain form
14269 564879 423859 297903 261832 283547 200048 -16582 -29676 21831 2996 -10328 4184
14258 4184 12699 20818 64723 -132296 -201970 -208264 -3327 -38934 7430 119161 180304 327739
14246 327739 347944 84910 -118611 22425 50683 13966 -101731 -111999 -116860 100796 175496
14235 175496 98712 4364 8721 -74980 -61366 101005 190544 229197 202274 161954 117859
14224 117859 201477 117909 -2970 -89915 -207110 -213805 -65019 -76351 -17958 24496 122973
14213 122973 342277 245916 250103 261755 247389 269942 346242 388331 342097 308828 260246
14202 260246 101042 128585 102535 184009 88227 -67698 -140642 -183046 -41429 9649 -225526
14191 -225526 -421662 -435090 -374761 -223504 -161588 -197585 -163536 -42314 38514 -154583 -306756
14180c06756O6678K49431O8011p1208L0160L5678m6655k8083p7994j75345M9935
14169b06148J09492R4121L0297K4981R8542L7631k31766k5960J20348J12911L3256
14158A97705l0815J38118L3499R3708M6799j48596k30147k61231n3011P3226n6165
14147a96910j28283J09140j6893p543n4317O4467O3288L004j36488o1260K10962
14136a50833J03694R736j8825L5523J46518R1719j69101j9430j7761R1487m5078
14125E7649j2230J74420K0050l4088q4040j8821Q0736l762J25640l5386o7051
14114B03117j68046j03178q5199J27155R6169L1660j3007p7660N9531L8448O1955
14103A70945j18432M8980J45114K9485j34776M4888j31805j17855J13957r7186
$$ plain form
14180 -306756 -240078 9353 77364 6156 36316 71994 25339 -2744 -80738 -256083 -206148
14169 -206148 -96656 -2535 27762 52743 151285 188916 -42850 -68810 51538 164449 197705
14158 197705 166890 305008 338507 432215 479014 330418 100271 -160960 -213971 -140745 -196910
14147 -196910 -325193 -216053 -232946 -240489 -294806 -230339 -167051 -164047 -300535 -361795 -150833
14136 -150833 -47139 -37403 -56228 -20705 125813 217532 48431 29001 11240 102727 57649
14125 57649 45419 219839 239889 205801 121761 102940 183676 179914 305554 270168 203117
14114 203117 35071 -68107 -153306 -26151 70018 101678 88671 11011 70542 108990 170945
14103 170945 52513 101493 246607 276092 141316 186204 54399 -63456 50501 -46685
14093d6685j17111N3221L3372J05508J00215K0035J04520j10356k83428j13481
14083b54190q7795J94333J27222j32134K6993R9071p3301p4276J00339J52430
14073G8692O2486m9131j37454q7686m0457J53985J10763l9408P1149j70492N2762
14062E209J08052j8018J7446M7717J00473k86169o4511l8622q7919k1001N9554
14051a77789K1287J0448J01720K3299O4681l0725N3269k2840J8736J47993k8335
14040A81744j8791o4846N222N1116J0868m5316j22798k00717L240K81079K40909
14029C21710O1340r0847m4644j04707o4766L7996l490J41397J9065n3311O4835
14018B84578o2730P677o2818J1253R3165q0105N0841l5492j79248j47662o0435
$$ plain form
14093 -46685 -163796 -110575 -77203 28305 128520 148555 253075 142719 -140709 -254190
14083 -254190 -341985 -147652 -20430 -152564 -125571 -26500 -99801 -174077 -73738 78692
14073 78692 141178 92047 -45407 -133093 -173550 -19565 91198 51790 122939 -47553 5209
14062 5209 113261 95243 112689 160406 260879 -25290 -89801 -128423 -216342 -237343 -177789
14051 -177789 -156502 -146054 -44334 -21035 43646 12921 66190 43350 62086 210079 181744
14040 181744 162953 98107 103329 154445 165313 119997 -2801 -203518 -200278 80801 321710
14029 321710 383050 292203 247559 142852 78086 116082 112592 253989 273054 219743 284578
14018 284578 221848 229525 166707 177960 271125 191020 241861 206369 27121 -120541 -180976
14007a80976k3487J04997j14331K1026n5428N3804L2120L4214o2395O4881j0730
13996a36305Q306P1008R6445L1582m4868j31104N4462O3686L2331J3472K6196
13985H5211j84115J0336J55580n7804P8875j45957q7182M8132N4041p8600q8635
13974b10118j0688k0966J24599J1996J2210M294r8394j6887n7780K1447M8665
13963a91622m8430j2332J01257J03305M3368Q2689Q6469J11829r1315l00158k1913
13952a36853K17326J10668j26842M4594r0593K3317J15671O739j11652q3089M5264
13941A4550P0106L0890Q1482l5620J519J5663j38861j596J93576q8258r3216R6276
13929A46511j5649j3252j05886m2592P077R9384N6725j0565k61552O1415K56846
$$ plain form
14007 -180976 -204463 -99466 -213797 -192771 -248199 -194395 -162275 -128061 -190456 -125575 -136305
13996 -136305 -127999 -56991 39454 71036 26168 -104936 -50474 13212 45543 59015 85211
13985 85211 -98904 -88568 67012 9208 88083 -57874 -145056 -96924 -42883 -121483 -210118
13974 -210118 -220806 -241772 -117173 -105177 -92967 -88673 -187067 -203954 -261734 -240287 -191622
13963 -191622 -240052 -252384 -151127 -47822 -4454 78235 164704 276533 185218 -114940 -136853
13952 -136853 80473 191141 64299 108893 18300 41617 157288 164027 52375 -30714 14550
13941 14550 84656 115546 197028 161408 162927 178590 39729 38133 231709 143451 50235 146511
13929 146511 130862 117610 11724 -30868 -23791 75593 132318 121753 -139799 -78384 178462
13918A78462K78404N5760j17913k32893j8424Q1839J28381q7846j31473m6539
13908H7758p2220n127L7705m9344q66j22952k10729K0184Q7989J16910J11851
13897A159M2024J21907N136q8658j04963l1162J74690K9006j02515J14754m3967
13886A17411k32029J63821K0543j05441L3980J9621k3677p8896J63492J02408
13876A81233M238P0036P9058j1968j36361k804j49079o9329P4602j01498P7313
13865A5441J15012K13318j08410j66359m6685j08523O6595P5927j8055J5928J80549
13854B34738J21431M0077j08390j90837j76963j6427J27176J20701J3603K1866
13844A86975N4413J77539M4687n5644o9839k3936r8275M1063L2178q7768N985
$$ plain form
13918 178462 456866 512626 394713 161820 143396 225235 353616 265770 134297 87758
13908 87758 15538 10411 48116 -1228 -2094 -125046 -335775 -315591 -227602 -110692 1159
13897 1159 43183 165090 170226 81568 -23395 -54557 120133 149139 46624 161378 117411
13886 117411 -114618 49203 69746 -35695 -1715 17906 -5771 -84667 78825 181233
13876 181233 185471 255507 334565 322597 186236 183432 34353 -34976 39626 -61872 15441
13865 15441 130453 343771 235361 69002 22317 -86206 -19611 56316 38261 54189 234738
13854 234738 356169 396246 287856 97019 -79944 -96371 30805 151506 165109 186975
13844 186975 241388 418927 463614 407970 338131 314195 215920 256983 289161 201393 207378
13833B07378K16086R5621j06121q3243j55034o226j6300J17681J22161J2074m620
13822C99457r1538j00594j86271M0955q2642j92818p0084J09390K04831P4869
13812A05555q7821j1257o7816l2956N3730J30228k7266K39363j18392k10009l0056
13801e6697j9066j30747K8935K44981J59060l4581j17637j14069R2854J29208
13791A82241Q9862j12260K1409k2065K7929L2609n140Q7440p2301J2720L0434
13780B72878q2817p9911j30723M1251N5919r1119j56347N3230N6711n8253p4123
13769a93304q5464j2620N1703J26859j4580J62626m6733R0762O873j8456P4943
13758A42609R9244o4708o4479K9190L9722j17695q85l0827j3029o5944j57634
$$ plain form
13833 207378 423464 519085 412964 329721 174687 168461 152161 269842 392003 404077 399457
13822 399457 307919 207325 21054 62009 -20633 -213451 -283535 -174145 30686 105555
13812 105555 17734 6477 -61339 -94295 -40565 89663 62397 301760 183368 -26641 -56697
13801 -56697 -75763 -206510 -177575 67406 226466 191885 74248 -39821 53033 182241
13791 182241 272103 159843 181252 159187 187116 219725 214585 302025 229724 242444 272878
13780 272878 190061 110150 -20573 20678 76597 -14522 -170869 -117639 -60928 -119181 -193304
13769 -193304 -278768 -291388 -239685 -112826 -127406 35220 -11513 79249 86122 67666 142609
13758 142609 241853 177145 112666 141856 181578 63883 62998 32171 19142 -46802 -204436
13747b04436J31296J65890P2609O252j10611L7796K5677p600n7249J83355P0781
13736C13760J5375Q4059j09310j86425L2705J30000n7524r1183l2719l07951j06971
13725c16184J38203M0357j6620R875R3435J06395J19084l9266L3086l2658j62368
13714b6661q7771j09345j5462M4244J30450N1786r7318p1566J70800N6196j70723
13703a25370O0080j2942j20238n6071P3534j05826J67144J72273k2094p9507P7960
13692B8943l303K2617O184R3981J00643p8422l10205j20449K7497N3699K41614
13681F2799J56899j49693R8002j53525j35736J30163P6871l047K0960r698j10114
13670a6119j43712J89921Q0364r8325m332Q0859j7910r6119J13738L3222o0548
$$ plain form
13747 -204436 -73140 92750 165359 171611 61000 98796 124473 116873 59624 242979 313760
13736 313760 329135 413194 303884 117459 150164 280164 222640 131457 98738 -209213 -316184
13725 -316184 -177981 -137624 -154244 -144369 -50934 55461 174545 135279 168365 135707 -26661
13714 -26661 -114432 -223777 -239239 -194995 -64545 -12759 -110077 -181643 -10843 45353 -125370
13703 -125370 -65290 -78232 -198470 -254541 -181007 -286833 -119689 52584 30490 -49017 28943
13692 28943 25640 48257 54441 148422 249065 170643 -139562 -260011 -232514 -178815 62799
13681 62799 219698 70005 168007 14482 -121254 8909 85780 82733 103693 93995 -16119
13670 -16119 -159831 30090 110454 12129 7797 88656 70746 -25373 88365 121587 61039
13659F1039L5699N2105m5212l8374R3870J42683j85014j67111K8046J80088J22270
13648B80089j01977n8445P4418o1203j07690O8760J31896J40020r1944j29192
13638A44732n0511J24436P5225k01577o2170R77r8126P6889M8822P3866J20947
13627B53510o5571q12K0691j36085O0772J04706o3635P800k0893k9716J5541R0685
13615B36993P760r2858K1797P8268j11053O267L5105n7097n6217j31043j8510
13604h0588L0550K1062K4038q3012q844O6802l3176O8744J49669J07947J00606
13593C63798r7179n1305j52386j05542p5585O7192K03653J27285K446r664j85054
13582H7659j76115p2353N2750J32343K14179q4930q2909J72433L8685n7686n7912
$$ plain form
13659 61039 96738 148843 103631 65257 159127 301810 116796 -50315 -22269 157819 280089
13648 280089 178112 119667 194085 132882 25192 93952 225848 365868 273924 144732
13638 144732 94221 218657 293882 92305 30135 31112 -67014 9875 58697 132563 253510
13627 253510 187939 187127 207818 71733 132505 237211 173576 181376 160483 130767 146308 236993
13615 236993 244753 151895 173692 251960 140907 147174 182279 125182 68965 -62078 -80588
13604 -80588 -50038 -28976 -4938 -87950 -96794 -29992 -63168 5576 155245 263192 363798
13593 363798 266619 215314 62928 -42614 -118199 -51007 152646 279931 282377 272713 87659
13582 87659 -88456 -160809 -108059 24284 238463 153533 70624 243057 281742 224056 166144
13571A66144r50p188O4847m2993K5557L6455j5688r4918j22262K63081J94222
13560D66307j0180j71274j52529K2873j0548k36050r4220o2674N4410L08893K11433
13549C26441J954p7835n1131r5049m3935j476K2503l3531j12058M8721J53064
13538A37668q4826l2749J68177J30631j13583m6856J62651J79453r528m11760
13528G9278j12385J01751J28906J40802M2263r2973J8472M8491o5095J75334n055
13517D59789j2684k8451K8703k33759K6319j72281m5718R4723J60735m299m0802
13506B32275l4391J75530r5319j09173j14517r453J51008n3159p4067m3912J70086
13495A94908n8488j7073J73540N6222j52117l2120q0091L5105L5495J89288L5535
$$ plain form
13571 166144 165194 158006 222853 179860 205417 241872 226184 131266 9004 272085 466307
13560 466307 456127 284853 132324 155197 144649 -91401 -185621 -248295 -193885 115008 326441
13549 326441 328395 250560 199429 104380 60445 58969 81472 47941 -64117 -15396 137668
13538 137668 52842 20093 188270 318901 205318 158462 321113 500566 491038 79278
13528 79278 -33107 68644 197550 338352 380615 287642 306114 354605 289510 464844 459789
13517 459789 447105 418654 447357 213598 239917 67636 21918 116641 277376 273077 232275
13506 232275 197884 373414 278095 168922 54405 44952 195960 142801 68734 24822 194908
13495 194908 136420 119347 292887 349109 196992 164872 84781 119886 155381 344669 380204
13484C80204p4958j45612q2537j9091j02435j45033L8375J59262J07476P5742
13474A91393J22524J38085m2984j89337k30829P1830K38821j24296j47897J37959
13464A65269J42775N618P5038p526o0147J3865L8399j59548k9512q5589M2661
13453A41303o4624l4408J86336K562l501J32969k40019N1843J62021L5439j61240
13442B08681o2600q994o9534O1344J80281o4722r2785K66763P8795M98j23644
13431C74083q7807O0614j94976j00490P9188K6589K7699J90689R7894k18170k00550
13420E4763K449J0171J31221j916o5219p0387P5503P4721L7253n267L8924J497
13408B83713Q3715p8191r8811N7861k9903l3634J22095N6841m0324j06009j08258
$$ plain form
13484 380204 305246 159634 77097 58006 -44429 -189462 -151087 8175 115651 191393
13474 191393 313917 452002 409018 219681 -11148 60682 299503 175207 27310 165269
13464 165269 308044 313662 388700 381174 321027 334892 373291 213743 184231 98642 141303
13453 141303 76679 42271 228607 231169 227668 360637 120618 172461 334482 369921 208681
13442 208681 146081 137087 67553 128897 309178 244456 151671 418434 497229 497727 374083
13431 374083 286276 346890 151914 51424 130612 157201 184900 375589 473483 255313 54763
13420 54763 57212 67383 198604 196688 131469 61082 136585 211306 248559 243292 282216 283713
13408 283713 367428 289237 190426 248287 218384 184750 306845 363686 323362 217353 109095
13397A09095j18582J30826L68518q9616k35030n5532P4810J17803K3017m2033
13387B83276n2859P0396J765j96782j52315r6633m007J49320J19046k9574n2200
13376C9433P0600M8065o2812j7722J04356J55297L3888r7916j58943m9601Q869
13365G3514n6596M1805j6760k17415J52255J99886O0606m841j215p5084J50697
13354C06852r2803Q5297L34616O9134j19594l1053j84404r0089n0975j35421J46795
13343B38355J69085J04719m1282j14284j54453J18736J04446k7727q9655L6441
13333C44381O1737j0859j11101J9074K9781M2289j13900p4317N2267N892l9732
13322B05512M2352J21591R971M7621Q2449p4831q1300k05010m1358l0334O64m1832
$$ plain form
13397 109095 -9487 121339 489857 400241 165211 109679 184489 302292 325309 283276
13387 283276 230417 300813 302578 105796 -46519 -143152 -147159 2161 121207 91633 39433
13376 39433 110033 158098 95286 77564 181920 337217 371105 273189 114246 64645 73514
13365 73514 16918 58723 41963 -175452 -23197 176689 237295 232454 231239 156155 306852
13354 306852 214049 299346 633962 703096 583502 552449 368045 277956 226981 91560 238355
13343 238355 407440 512159 470877 356593 202140 320876 425322 397595 307940 344381
13333 344381 406118 395259 284158 303232 333013 375302 261402 187085 239352 245244 205512
13322 205512 247864 369455 379426 427047 509496 434665 353365 148355 106997 76663 77327 35495
13310C5495l7232J76454J56196M7665j9386N9538j27401j38266L9788J1578Q0315
13299B84744j43487j37167q3076J61614j9622J4362J60931Q997j07970l7287j7304
13288H4735Q1378L8707K9058J12618l8373J11813j7435q286j09656L5994P0947
13277C91500L5176q4857j20293j12892k7330j6728O5696J24271L3729m294q6288
13266A97690r1456O4235n2195J1074J11P4859K9470m7138R175J06923Q0371R1286
13254D74405M1856p6871k59335k8573J96115P4633j7791j005n9781n0114k678
13243B90861o0142P0177O1729k4780l6349J76118J04687q1007k18619m205K00585
13232D79055M5289j16100n6376J68238L8992k17053J27266K27751q0934O2380
$$ plain form
13310 35495 -1737 174717 330913 378578 359192 418730 291329 153063 192851 204429 284744
13299 284744 141257 4090 -78986 82628 63006 77368 238299 247296 139326 102039 84735
13288 84735 166113 204820 233878 346496 308123 419936 402501 394215 284559 320553 391500
13277 391500 426676 341819 221526 108634 81304 64576 130272 254543 288272 283978 197690
13266 197690 106234 170469 118274 129348 129459 204318 233788 186650 195825 302748 383119 474405
13254 474405 516261 439390 180055 151482 347597 422230 404439 403434 343653 293539 290861
13243 290861 230719 300896 362625 337845 301496 477614 582301 501294 282675 278470 479055
13232 479055 524344 408244 351868 520106 559098 342045 469311 697062 616128 678508
13222F78508j06464j85258q162j4913j4907n9677L7440J23876M9048O1291j15500
13211D45282O6316J19536N1418k49636j65354R5986J11431j34399j05378o8748
13201A66454K3766j3985J92690J84735j07775k0371o048m0373j17787K5901O5519
13190C52726O6031p8469L993P0375l286r5230J5683Q5261P5307o5237N628R2495
13178E25277K4481L9234J24837k25267k74143q6464j36466K03154K26797N2209
13168D73649n6315M6919P5019q2927q2281n6320j31168j45850j55294Q8075K62989
13157B36496J56329J66941J54837j03838j33222j40553p8915P5227J0858k852
13147C41308K9961N0650J8967j6724j49449R1947L9461q6355n5196k182j27116
$$ plain form
13222 678508 572044 386786 378624 363711 348804 289127 326567 450443 499491 560782 445282
13211 445282 511598 631134 682552 432916 267562 363548 474979 340580 235202 166454
13201 166454 190220 176235 368925 553660 445885 425514 419466 379093 261306 287207 352726
13190 352726 418757 340288 344281 414656 411370 316140 331823 417084 492391 427154 432782 525277
13178 525277 549758 588992 713829 488562 214419 127955 -8511 194643 421440 473649
13168 473649 417334 464253 539272 456345 374064 317744 186576 40726 -114568 -26493 236496
13157 236496 392825 559766 714603 610765 477543 336990 258075 333302 344160 341308
13147 341308 371269 421919 440886 424162 274713 366660 406121 319766 264570 262388 135272
13136A35272K3741M0655M447J1808Q4574Q9752O8032O7559j54994j13044J74083
13125D31885L0944l9609N334L966M4750p6787j12758K9668n2733J19151J24179
13114E07990p578j43967j6361P0214m3782m5639J3150K10272J475M07q8952j3791
13102D43438K02835K3533j40319j05956j39196O7093O252Q5425j5370m0550K1835
13091D09020j1245J21637K0646N0034j11909r0186j03057j06069R0095O9774k4873
13080C13867j07363N7122R7284k3602n9950o0908L6641M123M7151K3951K844m5589
13068B85571L080o7076O1135q2156o2573J74596K29172k1727j12847K20431J22777
13057G50383o9331j21941J8183m1632J10067J1976n9625J4856j9470j04490m9932
$$ plain form
13136 135272 159013 199668 204115 215923 300497 390249 458281 525840 370846 257802 431885
13125 431885 462829 423220 428554 432520 477270 400483 287725 317393 264660 383811 507990
13114 507990 500412 356445 340084 410298 366516 320877 334027 544299 545774 546181 457229 443438
13102 443438 646273 669806 529487 423531 284335 351428 357680 443105 427735 387185 409020
13091 409020 397775 519412 540058 590092 478183 387997 284940 178871 268966 338740 313867
13080 313867 206504 263626 360910 337308 277358 216450 253091 257214 304365 328316 331160 285571
13068 285571 288651 221575 282710 200554 137981 312577 541749 520022 407175 627606 750383
13057 750383 681052 559111 577294 535662 645729 657705 598080 612936 593466 488976 439044
13046D39044l8269Q0749J14858k9625q6216L6145L5201k28056r7791J61954k422
13035C85572N1314j8243q1625l6395P8161M6990R4499M9516J11241j50376j1793
13024E18861N3037Q1723j340J8487j92439j6895j252n6451M0066P4889r3573j31547
13012B93566J59637Q8503M468j29095q2908J29980J56968j21992j41626J108k3594
13001C35015O5286J88009k5639n9071J7061j21579p8243J39990n7214j31849J42176
12990D13942Q4569r246m9617J4291M7775O7304J53180q6227J4132j484j25081
12979E23538n4627K6478Q3804n5968j84251q5539K0389p5580j07624j10376k9213
12968d8969P3264K22782o4553R4691J09902J50871K7494N82j26072l4883P4085
$$ plain form
13046 439044 400775 481524 596382 566757 480541 516686 551887 323831 226040 387994 385572
13035 385572 436886 418643 337018 300623 378784 425774 520273 569789 681030 530654 518861
13024 518861 571898 653621 652281 670768 478329 461434 460182 403731 443797 518686 425113 293566
13012 293566 453203 541706 546174 417079 334171 464151 621119 499127 357501 358609 335015
13001 335015 400301 588310 562671 503600 520661 399082 320839 460829 403615 271766 413942
12990 413942 498511 489265 439648 453939 501714 569018 722198 635971 650103 648619 523538
12979 523538 468911 495389 579193 523225 338974 253435 273824 198244 90620 -19756 -48969
12968 -48969 24295 247077 182524 277215 387117 537988 565482 566064 439992 405109 479194
12957D79194J44529J29330o7240J8157J75426m7012j55767j07396L8045K6072
12947F33338n5741L8236j59713j39514P0948j3032K6310N1050J71878O9685j75794
12936E17651j57289m688K4907J00414P4297n5023j15051J9436K42934J43065j24985
12925F65668j79646J7882P0426J8383l2246k23p2433N9319N4436j72139l2259
12914C97168M5772j2484K7814j1511M8542K0101r6237r2146J12441J21011J80752
12903G41223j82033k08772J02915L7578J21945k8861j6977n2871M7826M974Q469
12892E75416J8126R4958R4917o0548j30870j01789j3002K6003J57021J05596j7336
12881G48492j80662q4614r153R972N8546J74742J53842k27369j76500p401j0529
$$ plain form
12957 479194 623723 753053 685813 703970 879396 832384 676617 569221 607266 633338
12947 633338 577597 615833 456120 316606 387554 374522 400832 451882 623760 693445 517651
12936 517651 360362 355674 380581 480995 555292 500269 385218 404654 647588 790653 665668
12925 665668 486022 503904 574330 592713 560467 560244 487811 547130 601566 429427 397168
12914 397168 442940 430456 458270 446759 495301 515402 419165 327019 439460 560471 741223
12903 741223 559190 350418 453333 490911 612856 583995 567018 514147 561973 566947 575416
12892 575416 593542 688500 783417 722869 591999 490210 477208 503211 660232 765828 748492
12881 748492 567830 483216 474063 484035 542581 717323 871165 643796 467296 459895 449366
12870D49366J06171Q6494K7513M7667l4707L1490J75471J33482j17163o7891p8315
12859G59578j7454k2238R2493J54655L7162o2305p4986k4734j43994p9123l5082
12848E83972o581l6575M5221k0927M6254J43964Q8240O2114j26158K413q74j3855
12836G67208L689J69685k9823j07428K2074N1578O2598j10512k1501k7489Q2881
12825H62960q0912l3346J63997M98q7142j08192k37181k3430K56056K85312j5817
12814I82803Q4469J02765n6165j49975M4695j08279J8358j3932j94411o5192o2521
12803E82615r5168L7219M3607J46634J64390R4448j2369n6501j0473J68565j03530
12792I59437j37220J2318l8190j35N8914K2728K8511n1533j56948J04367M6561
$$ plain form
12870 449366 555537 642031 669544 717211 682504 713994 889465 1022947 905784 837893 759578
12859 759578 742124 719886 812379 967034 1004196 941891 866905 842171 698177 619054 583972
12848 583972 577391 540816 586037 565110 611364 755328 843568 905682 779524 781937 781063 767208
12836 767208 770897 940582 910759 803331 825405 876983 939581 829069 807568 780079 862960
12825 862960 782048 748702 912699 913197 826055 717863 480682 457252 713308 998620 982803
12814 982803 1067272 1170037 1113872 963897 1008592 900313 918671 904739 710328 645136 582615
12803 582615 487447 524666 568273 714907 879297 973745 961376 904875 894402 1062967 959437
12792 959437 822217 834535 796345 796210 855124 877852 906363 854830 697882 802249 848810
12781H48810J8988J6340R2170J1470N1605J7626N8660P510R121q0872j76284M6633
12769I21777K8254l1352J4111K2279p2205l2499J54600N7435m263n6025K968n4675
12757I50405j15832J10130J86150P8467q7809k3643N578N1338K8738k3487L7826
12746A197861j75251J12181L39291L4311m19814k20275K3359l354J70336M7650
12736A106295p3376q0278q8731p2225K45201R3338p1015m8704j73200m3710L66442
12725A160037K25289O2503P9466N1169L86460K51726L8203o5353j22725j85751
12715A881024j90575j18034j48033j64728n4883k66114P400J5798Q2853J9507
12705A064215j92663r1091N7416R8750P0680o6430K1029K10004j3810j58596N4938
$$ plain form
12781 848810 867798 884138 976308 987778 1039383 1057009 1115669 1123179 1132300 1051428 875144 921777
12769 921777 950031 918679 932790 955069 882864 850365 1004965 1062400 1058137 1002112 1005080 950405
12757 950405 834573 944703 1130853 1209320 1121511 1097868 1103446 1154784 1183522 1160035 1197861
12746 1197861 1022610 1134791 1474082 1508393 1088579 868304 891663 888309 1058645 1106295
12736 1106295 1032919 952641 863910 791685 1036886 1130224 1059209 1010505 837305 793595 1160037
12725 1160037 1385326 1447829 1527295 1578464 1964924 2216650 2254853 2189500 2066775 1881024
12715 1881024 1690449 1572415 1424382 1259654 1204771 938657 946057 961855 1044708 1064215
12705 1064215 871552 780461 837877 936627 1007307 940877 961906 1171910 1158100 999504 1054442
12694A054442P9454R1647r7780M2485k51814j40901J12419J68046J16361q8622
12684A085737j30082q8936J39864J06352R0129J3278j14982j4542k9821l7500
12674A019497p313J1129J47712K49863K95202j03291l82927p1245n4232k6194
12664A078201Q191J5026L7950J68799L7658j8150K06590q3942j56029O1017P6790
12653A432101k4006j12663p4593j56997J0630K01402J34519o5102J29202P3860
12643A548353p8590j17567q3756J13417J29636K18808p9603j38031j69470l242
12633A339955K2234J38721K72413j15123j76826k246K4606j5328l7488j05039
12623A345879J8501J0541m2827J88313J5654l5404N2763k3234R631r4991K6770
$$ plain form
12694 1054442 1133896 1225543 1127763 1170248 918434 777533 889952 1057998 1174359 1085737
12684 1085737 955655 866719 1006583 1112935 1203064 1216342 1101360 1086818 1056997 1019497
12674 1019497 1012184 1023313 1171025 1420888 1716090 1612799 1229872 1158627 1104395 1078201
12664 1078201 1086392 1101418 1139368 1308167 1345825 1327675 1534265 1450323 1294294 1355311 1432101
12653 1432101 1408095 1295432 1220839 1063842 1074472 1275874 1410393 1345291 1474493 1548353
12643 1548353 1469763 1352196 1268440 1381857 1511493 1730301 1650698 1512667 1343197 1339955
12633 1339955 1362189 1500910 1773323 1658200 1481374 1479128 1503734 1488406 1450918 1345879
12623 1345879 1364380 1374921 1332094 1520407 1536061 1500657 1553420 1530186 1539817 1444826 1471596
12612A471596N4834k2528j00888q1584K2374j3968P5324L7785J86299J13794j30393
12601A612645k12952P0596K5507l6894j3255k075L2989K9490R7477j1724j9340
12590A572464m0096L6049j18528J34102J17320N3567p429j77413N0160N665m5910
12579A579951O1969J46156p9663m3134L66K2617N0483J36687L5476K8231N322
12568A944461q952j64513p8625K01151J9486j81886J54793o1849l3168j02403
12558A688495l8226J00557m4030O7106J61491j8239r6656n2435J44680r7586J12946
12547A928103M6793j25387p5264N1306K6939l9616r0449N5968j3638M3659J29223
12536A937637l7399L0594M7547o3974k00224n6588N2815M2926P4380k8290J4893
$$ plain form
12612 1471596 1526430 1503902 1403014 1321430 1343804 1329836 1405160 1442945 1629244 1743038 1612645
12601 1612645 1399693 1470289 1495796 1458902 1445647 1443572 1476561 1506051 1603528 1591804 1572464
12590 1572464 1532368 1568417 1449889 1583991 1701311 1754878 1747449 1570036 1620196 1625861 1579951
12579 1579951 1641920 1788076 1708413 1665279 1665645 1688262 1738745 1875432 1910908 1939139 1944461
12568 1944461 1935509 1770996 1692371 1893522 1913008 1731122 1885915 1824066 1790898 1688495
12558 1688495 1650269 1750826 1706796 1773902 1935393 1917154 1820498 1768063 1912743 1815157 1928103
12547 1928103 1974896 1849509 1774245 1825551 1852490 1812874 1722425 1778393 1764755 1808414 1937637
12536 1937637 1900238 1930832 1978379 1914405 1714181 1657593 1710408 1753334 1827714 1799424 1814317
12525A814317J6542R8211J04203p6710j45198l7570O1966N6606m738J48418J18024
12514B154071P1001j78986k324P7084j53801j28625L0984j2009J27929J85221
12504B170545O3492J35713L6320q6582J5247K4956p8788q8605K29346J04766N2185
12493B578595j7270J172N286M6773j89710j47770j41894j6971R0467L9429j11997
12482B136110j13258p5307R2252J73691J51816J64697J03297n8586k9113R995
12472B555594p226j14229k9635J02094l812m8733j26526L1232j45667L3306K38391
12461B484789J60370R6368N421k19241j28828J76792L9144J12628r1385j11677
12451B524381j59716J2458J65838M3677n0593M2240J77474J1279J0747J72978
$$ plain form
12525 1814317 1830859 1929070 2033273 1956563 1811365 1773795 1835761 1892367 1887629 2036047 2154071
12514 2154071 2225072 2046086 2043762 2120846 1967045 1838420 1869404 1857395 1985324 2170545
12504 2170545 2234037 2369750 2406070 2319488 2334735 2359691 2280903 2192298 2421644 2526410 2578595
12493 2578595 2561325 2562497 2567783 2614556 2424846 2277076 2135182 2118211 2208678 2248107 2136110
12482 2136110 2022852 1947545 2039797 2213488 2365304 2530001 2633298 2574712 2545599 2555594
12472 2555594 2548368 2434139 2404504 2506598 2502786 2454053 2327527 2358759 2213092 2246398 2484789
12461 2484789 2645159 2741527 2746948 2527707 2398879 2575671 2614815 2727443 2636058 2524381
12451 2524381 2364665 2377123 2542961 2586638 2536045 2578285 2755759 2767038 2777785 2950763
12441B950763P0041l67294j06758J69701N8600Q2530Q0064p1101K04954l3591
12431C037909j78752j4695k6367J01618J199l7557J7438O6502p8769j6289J01007
12420B973244j0206m5656J58618l1871J7581j04252n1049J67085j73754N9684
12410B959424k570p4925Q3766N1519p0162k1578K294j7690O9107N6495m0126N1930
12398C047484r5464J33118J47435o1242L6588Q5449J1526R1769J31417j9794j42612
12387C365674j60257j5996Q7340J16983n7067K004N8656O6862K2495k3334J16132
12376C579492j37681j00390O4101J8362J23594J5416J5826j76586j17194L15275
12366C600215J55793P1816L0566k02791j18864j21481M2339J68195Q4881J30057
$$ plain form
12441 2950763 3020804 2653510 2546752 2716453 2775053 2857583 2937647 2866546 3071500 3037909
12431 3037909 2859157 2844462 2818095 2919713 2920912 2883355 2900793 2967295 2888526 2872237 2973244
12420 2973244 2963038 2917382 3076000 3044129 3061710 2957458 2906409 3073494 2899740 2959424
12410 2959424 2956854 2881929 2965695 3017214 2947052 2925474 2927768 2910078 2979185 3035680 2995554 3047484
12398 3047484 2952020 3085138 3232573 3171331 3207919 3293368 3304894 3396663 3528080 3508286 3365674
12387 3365674 3205417 3189421 3276761 3393744 3336677 3338681 3397337 3464199 3486694 3463360 3579492
12376 3579492 3441811 3341421 3405522 3423884 3547478 3562894 3578720 3402134 3284940 3600215
12366 3600215 3756008 3827824 3858390 3655599 3536735 3415254 3457593 3625788 3710669 3840726
12356C840726J00784j02018k18985J02998Q3383j32649j14899M3030J68577J0893
12346C781840p8902K9240j4564K5109r3961K191m3668J30264J36103L5439k4206
12335C884885P4196J07642N1123p995n8655j3156K1696O5703J0734K35369N4935
12324D426477j23535J6408P4964J30908l8750p2634q1840J00455O3895m2921J70232
12313D623659Q1374N7906J65839J31934m1974j56611n8694r8176j85829k6312
12303D493116L026q9398J45475K34154K03541N8981J49032J15634P1289l41770
12293E043080k39001J27328Q6556P0694o1226j9854O2084k5708m1728j0312J32333
12282E124246J67534J03677q3635j38160k0449J77145o1206O799j88370o9957
$$ plain form
12356 3840726 3941510 3839492 3620507 3723505 3806888 3674239 3559340 3602370 3770947 3781840
12346 3781840 3702938 3732178 3717614 3742723 3648762 3650953 3607285 3737549 3873652 3909091 3884885
12335 3884885 3959081 4066723 4117846 4109851 4051196 4038040 4059736 4125439 4136173 4371542 4426477
12324 4426477 4302942 4319350 4394314 4525222 4486472 4413838 4331998 4432453 4496348 4453427 4623659
12313 4623659 4705033 4762939 4928778 5060712 5018738 4862127 4803433 4705257 4519428 4493116
12303 4493116 4496142 4406744 4552219 4786373 4989914 5048895 5197927 5313561 5384850 5043080
12293 5043080 4804079 4931407 5017963 5088657 5027431 5007577 5069661 5043953 5002225 4991913 5124246
12282 5124246 5291780 5395457 5311822 5173662 5153213 5330358 5269152 5275951 5087581 5017624
12272E017624K34386K91535N6868k49387L1971J63981O4146p9228l1538J95127
12262E695485J25568K0410j35199k7843q5686J11171j5936J6780q9433M9096J0843
12251E675256n5857J12353J82088l3438j18771J04384L2640P8805M1237K8717
12241F047414Q0342j52510j32789K71659K47826l9642l1875O2239j68962m3198
12231F140504O7511J43110p8527l4073K08360J09088j11402q7983p4339J00338
12221F382587P3116J29858K6341j25994j29764j11446J16680J33007Q1393R7651
12211F673429K16352K853k45080k66049J72737Q5470K6669J61483j8043n678J26359
12200F930502K08090P1955n9155J4265k8221n1628N2793l0420p3214j23986Q5597
$$ plain form
12272 5017624 5252010 5543545 5600413 5351026 5382997 5546978 5611124 5531896 5500358 5695485
12262 5695485 5821053 5841463 5706264 5678421 5592735 5703906 5687970 5704750 5615317 5664413 5675256
12251 5675256 5619399 5731752 5913840 5880402 5761631 5866015 5898655 5977460 6018697 6047414
12241 6047414 6127756 5975246 5842457 6114116 6361942 6322300 6290425 6352664 6183702 6140504
12231 6140504 6208015 6351125 6272598 6238525 6446885 6555973 6444571 6356588 6282249 6382587
12221 6382587 6455703 6585561 6611902 6485908 6356144 6244698 6361378 6494385 6575778 6673429
12211 6673429 6889781 6892634 6647554 6381505 6554242 6639712 6666381 6827864 6809821 6804143 6930502
12200 6930502 7138592 7210547 7151392 7165657 7137436 7085808 7138601 7108181 7034967 6910981 6996578
12189F996578N5951J35541K03317j5841J745q2077r6157M0192J00681L0561Q512
12178G379003J8054P0589p0212k9419J46835R8283J27412o574J0597k5771J61147
12167G879944q0396k47609q4370J43524N3673Q3139k2638Q9800J09709P5558n8865
12156G941469j1884K7216j48109j13901R2139J76065l7953J481n8977J05953K0252
12145G993751q9579q1890Q8283J41662L2325M6753J1095N530j21476j06248J16618
12134H036824J60545K43542O173j11310l2861j49203R5938J93574j61163j98948
12124H083111Q4295N2015j02484j08099R312K41048K21062O5323L1741j44886
12114H432438k7285N7086K6161P5688P8227P5766j96023q962J17538P7321j15687
$$ plain form
12189 6996578 7052529 7188070 7391387 7375546 7377291 7295214 7199057 7239249 7339930 7370491 7379003
12178 7379003 7397057 7467646 7397434 7368015 7514850 7613133 7740545 7733971 7744568 7718797 7879944
12167 7879944 7799548 7551939 7467569 7611093 7664766 7747905 7725267 7815067 7924776 8000334 7941469
12156 7941469 7929585 7956801 7808692 7694791 7786930 7962995 7925042 7926523 7867546 7973499 7993751
12145 7993751 7904172 7822282 7910565 8052227 8084552 8131305 8142400 8147930 8026454 7920206 8036824
12134 8036824 8197369 8440911 8447084 8335774 8302913 8153710 8249648 8443222 8282059 8083111
12124 8083111 8167406 8219421 8116937 8008838 8018150 8259198 8480260 8545583 8577324 8432438
12114 8432438 8405153 8462239 8488400 8564088 8642315 8718081 8522058 8513096 8630634 8707955 8592268
12103H592268l2096O590R1209n5506k67223j81722J56997O2599L7774N4217p5678
12092H389429J8110O6646J54432J02197l1424q5876O2104K1569L3254p3100P6566
12081H733907J45140J63376o0876j02458J3361J88576j06862k55527n5436R7402
12071H760603k7111j36669j9685O0644J68864K56560K8250o2560k9861j74207
12061H824828j90705j6153J04661L5328N723J60129j74213k19340l1507K9575
12051H528326P7986J41738J3859J43070j54878j05833k4337K8572j7581j75678
12041H455244k7069M4266K3937m7695P0473l0377j1252O0968l4311j16816P6572
12030H463940l0756K9325Q7846J24310Q930j60736O3942J09206j19642n9526j14950
$$ plain form
12103 8592268 8560172 8566762 8657971 8602465 8335242 8153520 8310517 8373116 8410890 8465107 8389429
12092 8389429 8407539 8474185 8628617 8730814 8699390 8613514 8675618 8697187 8730441 8657341 8733907
12081 8733907 8879047 9042423 8981547 8879089 8892450 9081026 8974164 8718637 8663201 8760603
12071 8760603 8733492 8596823 8577138 8637782 8806646 9063206 9091456 9028896 8999035 8824828
12061 8824828 8634123 8617970 8722631 8757959 8763682 8923811 8749598 8530258 8498751 8528326
12051 8528326 8606312 8748050 8761909 8904979 8750101 8644268 8619931 8648503 8630922 8455244
12041 8455244 8428175 8472441 8496378 8448683 8519156 8488779 8477527 8538495 8504184 8387368 8463940
12030 8463940 8433184 8462509 8550355 8674665 8683595 8522859 8586801 8696007 8576365 8516839 8401889
12019H401889j06688J35880L7977j16292p619j13366M8798r0738j15685j19108
12009G955048J28732J25925r2296o9989r3453R6279j8027j6544q019j53456J604
11998G855804K36497P2506k1584q4582j01111k5560j36394k02532m897O3421Q8646
11987G740214K41639J38236J6840l452j80441R057p153p4466P3827q7031j29147
11976G738123N3741r8881k23086L5544l41L1152o77M8596L1170k8792J61321j087
11964G746783j22386J8093n586k7150j28349j90188Q6137J14160m0326k32959
11954G218229K0106q1288Q9218K3833r412k3173J8555n8814j45150j16989k5785
11943F909330j57567j12103J56492J30265n9891q7505j30546j33334k4075J30706
$$ plain form
12019 8401889 8295201 8431081 8469058 8352766 8345147 8231781 8280579 8189841 8074156 7955048
12009 7955048 8083780 8209705 8117409 8047420 7953967 8050246 8032219 8015675 8007656 7854200 7855804
11998 7855804 8092301 8164807 8143223 8058641 7957530 7931970 7795576 7593044 7588147 7651568 7740214
11987 7740214 7981853 8120089 8136929 8133477 7953036 7962093 7954940 7880474 7954301 7867270 7738123
11976 7738123 7791864 7692983 7469897 7505441 7505100 7536252 7535575 7584171 7615341 7586549 7747870 7746783
11964 7746783 7624397 7642490 7636904 7609754 7481405 7291217 7377354 7491514 7451188 7218229
11954 7218229 7238335 7157047 7246265 7270098 7260686 7237513 7256068 7197254 7052104 6935115 6909330
11943 6909330 6751763 6639660 6796152 6926417 6866526 6779021 6648475 6515141 6491066 6621772
11933F621772K12256O8951j03256j92567Q0199P0038L2153p81j53974q6247J6077
11922F564621m0077J7405O5391J3228n4873O4581O3209j75815j71193m7355q7142
11911F211980j43469j12976R1991J30537n8078P403O9957n2711j58375j55772
11901E830487k01606p5294P3623L4726j5818R0665P4401J2077j3833j37372n9454
11890E612602M7167J18968J01866j04591K4731P8940k4752j48391j49020j01749
11880E455771J51648P858k1844j3853J5349l5196j29702O9938J3591k18675j20726
11869E174159R2671R4873Q5003m0191k17301M2529J5491J5092k90581m5068J40402
11858E067079J6806K0964j4025k78320P5624Q9787R6470K5021O5733O5164j70308
$$ plain form
11933 6621772 6834028 6902979 6799723 6607156 6687355 6757393 6789546 6788765 6634791 6548544 6564621
11922 6564621 6524544 6541949 6607340 6620568 6565695 6630276 6693485 6517670 6346477 6299122 6211980
11911 6211980 6068511 5955535 6047526 6178063 6119985 6127388 6197345 6144634 5986259 5830487
11901 5830487 5628881 5553587 5627210 5661936 5646118 5736783 5811184 5823261 5809428 5672056 5612602
11890 5612602 5659769 5778737 5880603 5776012 5800743 5879683 5854931 5706540 5557520 5455771
11880 5455771 5607419 5615277 5593433 5579580 5594929 5559733 5430031 5499969 5513560 5294885 5174159
11869 5174159 5266830 5361703 5446706 5406515 5189214 5231743 5247234 5262326 4971745 4926677 5067079
11858 5067079 5083885 5104849 5090824 4812504 4888128 4977915 5074385 5099406 5165139 5230303 5059995
11847E059995j33287q7949P7323K1572r2010j48672l3691o7586N120N1401L6449
11836D688665J30663r8742j87072m7564k0218R3498j48043r8022p0484q3294K1592
11825D180979R922J01094n2857j43101j19358o0958K38901J20653r4081J23228
11815D304422J32974r4193j63j70856q7262p0046k2002k3131j4576j9268q2210
11804C853689q5772K4924J0157j2900R4828J84485J5878r7669k9362j92565k43053
11793C522640R882Q8489J48426K35425L2454j16608j56019k2947Q2921M0129m3168
11782C821624q1860j58550k01666j02413K4243O128K99228J83009j69150r7394
11772C523199j819J15216k5990j78222K6807K04701n0653j37192p7126J33615
$$ plain form
11847 5059995 4926708 4838759 4916082 4937654 4845644 4696972 4663281 4595695 4600815 4652216 4688665
11836 4688665 4819328 4720586 4533514 4485950 4465732 4559230 4411187 4313165 4242681 4159387 4180979
11825 4180979 4190901 4291995 4239138 4096037 3976679 3915721 4154622 4275275 4181194 4304422
11815 4304422 4437396 4343203 4343040 4172184 4084922 4014876 3992874 3969743 3955167 3935899 3853689
11804 3853689 3767917 3792841 3802998 3790098 3884926 4069411 4085289 3987620 3958258 3765693 3522640
11793 3522640 3532522 3621011 3769437 4004862 4037316 3920708 3764689 3741742 3824663 3864792 3821624
11782 3821624 3739764 3581214 3379548 3277135 3301378 3307506 3606734 3789743 3620593 3523199
11772 3523199 3521380 3636596 3610606 3432384 3459191 3663892 3613239 3476047 3398921 3532536
11762C532536J33863k19681j18159m287J10851l7947j24668j82523q8801N3000
11752C054184K20108J3739j05131O7883j21069m5017n8611J55084l0979k07022
11742B943169r9766k0441J38334K16648m2890l4767J7102p0457l839Q9333k1117
11731C111309r571m5951L3885j42855m6198L4954j80336n0416J75909L5596n9987
11720B856339K0333k19005l0500J5479J00717j62389j19281J4377L2335J06866
11710B615271M1757K0007J6693q4304j50105O7280R2821O0422p1135M5294n3730
11699B600271Q1000J0308o2394Q259Q0019p6248N0221N8993l7834j71937M3847
11688B584505m0007k43888L8123k2127L5517k0753l4686O1582k716m8672K1291
$$ plain form
11762 3532536 3666399 3446718 3328559 3324272 3435123 3397176 3272508 3089985 3001184 3054184
11752 3054184 3274292 3288031 3182900 3250783 3129714 3084697 3026086 3181170 3150191 2943169
11742 2943169 2843403 2822962 2961296 3177944 3135054 3100287 3117389 3046932 3043093 3132426 3111309
11731 3111309 3101738 3055787 3089672 2946817 2900619 2935573 2755237 2704821 2880730 2916326 2856339
11720 2856339 2876672 2657667 2627167 2642646 2743363 2580974 2461693 2476070 2508405 2615271
11710 2615271 2657028 2677035 2693728 2609424 2459319 2526599 2619420 2679842 2608707 2654001 2600271
11699 2600271 2681271 2691579 2629185 2637444 2717463 2641215 2691436 2750429 2712595 2540658 2584505
11688 2584505 2544498 2300610 2338733 2316606 2352123 2331370 2296684 2358266 2355550 2306878 2328169
11677B328169O2354p4162N5082Q1284P2803K4489q2528r6504N3849j04860m7455
11666B272521M5444j29387n170K6636j43026p3789k3628J06456J04166N7474j27808
11655B109889l4337J01190L5743n0408j34500M2152K701k7299M8263r5557k34846
11644A762991j87516N3768J12471J88167L5684p908P7354K5080j33082j25691
11634A801318P8946Q7135j72221j69696N64J32518K50921o4509n2053J3648L8498
11623A945069L4386l1075j16394q1300J34966P3069O0685o2301O813j22654j48708
11612A692556R61J14429o8203o1217k3117M913P0604P8913o8454k0642j1108j0033
11600A699602N6144J1973k6661r0787n7237P3549K60917p6031q9278j77939L0036
$$ plain form
11677 2328169 2390523 2316361 2371443 2452727 2525530 2550019 2467491 2370987 2424836 2319976 2272521
11666 2272521 2317965 2188578 2183408 2210044 2067018 1993229 1969601 2076057 2180223 2237697 2109889
11655 2109889 2075552 2176742 2212485 2162077 2027577 2069729 2072430 2045131 2093394 1997837 1762991
11644 1762991 1575475 1629243 1741714 1929881 1965565 1957657 2035011 2060091 1927009 1801318
11634 1801318 1880264 1967399 1795178 1625482 1626046 1758564 2009485 1944976 1892923 1906571 1945069
11623 1945069 1979455 1948380 1831986 1750686 1885652 1958721 2019406 1957105 1963918 1841264 1692556
11612 1692556 1693517 1807946 1739743 1678526 1655409 1660322 1730926 1809839 1741385 1720743 1709635 1699602
11600 1699602 1755746 1767719 1741058 1650271 1593034 1666583 1927500 1851469 1762191 1584252 1614288
11589A614288k9249Q5465J08975N1128J23123O6472J7087j16733k03262j51241
11579A566053N8391p0859Q165M9195j1723J8004m6368J5006j392K44r9337j95437
11567A289942K39767K61196p8290p5848L2885j29415k08773r4794K69768L8894
11557A545332l5785j5281l3861r2552N942K6494j11707K7956O4675M1898J36724
11546A559835k37440r5056K3043K26515M7336j09539k4880O6827Q8566j38824
11536A406383j50066j05362n1524J88014K1336L6931j8828N3297R8846j37866
11526A341161k00942J7420R749P4140K39510K7599L4288q2568j15000M0773n0337
11515A335793k4926N5422o0433k10551l9351J26679N5391m1899l03152l9024J83491
$$ plain form
11589 1614288 1585039 1670504 1779479 1830607 1953730 2020202 2037289 1920556 1717294 1566053
11579 1566053 1624444 1553585 1561750 1610945 1599222 1617226 1570858 1585864 1584472 1584716 1485379 1289942
11567 1289942 1529709 1790905 1712615 1636767 1669652 1540237 1331464 1236670 1506438 1545332
11557 1545332 1509547 1494266 1460405 1367853 1373795 1400289 1288582 1316538 1381213 1423111 1559835
11546 1559835 1322395 1227339 1250382 1476897 1524233 1414694 1389814 1456641 1545207 1406383
11536 1406383 1256317 1150955 1099431 1287445 1308781 1345712 1326884 1380181 1479027 1341161
11526 1341161 1140219 1157639 1167388 1241528 1481038 1508637 1542925 1460357 1345357 1386130 1335793
11515 1335793 1310867 1366289 1305856 1095305 1055954 1182633 1238024 1196125 892973 853949 1037440
11504A037440L6714n257q0138J09999J08976r7225q9840J9468o1244J12207J8248
11493A109348n8640O2987K24631J45824m4921m3927J40476l5564J3446k5595r3778
11482A394287k74985k29819J5571K1241Q4177J14263p4649K1630L3297n3216j57645
11471H94152k7149O9280K69909K2269j5853n027j21293j3485o5354j3940J33062
11460A126571J81582o4770j06062l23j59197r3424K384J9391j8631m029J72299
11449A055791m8532k3052P0207J3472O5598r086j52930m3243R0198O1302l7943
11438A041782j16844J91915M1464K2009o8778o8231O1190M1420O0652J08484J809
11427A316872j72729j21042j7267p1814j10783k7539N668K6628L4170j8763q7868
$$ plain form
11504 1037440 1074154 1068897 988759 1098758 1207734 1110509 1020669 1040137 978893 1091100 1109348
11493 1109348 1050708 1113695 1338326 1484150 1439229 1395302 1535778 1500214 1513660 1488065 1394287
11482 1394287 1119302 889483 905054 926295 1010472 1124735 1050086 1071716 1105013 1051797 894152
11471 894152 867003 936283 1206192 1228461 1212608 1207581 1086288 1072803 1007449 993509 1126571
11460 1126571 1308153 1243383 1137321 1136998 977801 884377 886761 906152 887521 883492 1055791
11449 1055791 1007259 984207 1054414 1067886 1133484 1124398 971468 928225 1018423 1079725 1041782
11438 1041782 924938 1116853 1158317 1180326 1111548 1043317 1104507 1145927 1206579 1315063 1316872
11427 1316872 1144143 1023101 1005834 934020 823237 795698 801366 827994 862164 843401 755533
11416G55533K8809P9706N2536Q1205Q024N3721m9963j32542J9994P3860p7271
11405H93612J9461J08247j00684p0385P2521M4940Q2376J39155j3412j19745j16211
11394I39875j89298j25030K4381p8453M5516J62242J26965j61475j10980J14057
11384G47800j6997j45226P3229O8564j36966j92707M6066O3902J03398l4375O6807
11373F43495j07131q1288O8191O1278J27791o8905k3074k6471J0669J22237L4680
11362G61472n9832J6967k0282m705l538p2541J90683J30761k4605q3799o6551
11351G64030r5354j40922n0153K3871K99812J23875j42720N5223o6205j13395
11341F58062m0491K9095N04k15518O535m4905j283J49496O8324q642P2478Q9929
$$ plain form
11416 755533 784342 864048 916584 997789 1005813 1059534 1009571 877029 897023 970883 893612
11405 893612 913073 1021320 920636 850251 922772 967712 1050088 1189243 1175831 1056086 939875
11394 939875 750577 625547 649928 571475 616991 779233 906198 744723 633743 747800
11384 747800 730803 585577 658806 727370 590404 397697 443763 507665 611063 576688 643495
11373 643495 536364 455076 523267 584545 712336 643431 620357 593886 604555 726792 761472
11362 761472 701640 718607 698325 693620 690082 617541 808224 938985 914380 830581 764030
11351 764030 668676 527754 477601 501472 801284 925159 782439 837662 771457 658062
11341 658062 617571 646666 647170 431652 438187 393282 391999 541495 609819 601177 673655 763584
11329G63584K8473m5657Q321P023R6183j03406L9751n4863j25065j48355p0383
11318C95606J41853J17800n2070Q9167J72948k55489k47147R6943J8636n7890
11308D20357M1725J76275K03270q360j77424l9913J23933j3684j79320n2253M243
11297D98849q1104J6335J24819N2382J4422M3702j02845J3488n080j4350r3877
11286D66741l2047J9740m1256O5559J7649J67836j04785N6753n3957K02071M1552
11275H05856j40941P2306o305r7834p576m5013P0318j4360P6082k0988O981m7368
11263F51158q198j24728K8364O3836L4297n219N0688n7607n2735j30032o9104
11252C80720J00458o850J4399p6859L1999k4836j42336j29458K16337K26134p3744
$$ plain form
11329 763584 792057 746400 754721 761744 857927 754521 794272 739409 614344 465989 395606
11318 395606 537459 655259 603189 692356 865304 609815 362668 459611 478247 420357
11308 420357 462082 638357 841627 833267 655843 615930 739863 726179 546859 494606 498849
11297 498849 417745 434080 558899 611281 625703 669405 566560 580048 574968 560618 466741
11286 466741 434694 454434 413178 478737 496386 664222 559437 616190 562233 764304 805856
11275 805856 664915 737221 730916 633082 625506 580493 650811 636451 712533 691545 698526 651158
11263 651158 642960 518232 546596 610432 644729 639510 690198 632591 579856 449824 380720
11252 380720 481178 474328 488727 411868 443867 419031 276695 147237 363574 589708 515964
11241E15964k2618p9488k594Q5369Q2165j3440l928j6656Q9653j32717j30531
11230C71179J8179J27245P2678r3331J53168K44914K9426j14320k22621j15653
11220D70864n611O6929M52j25378j30328o5038L8125Q1931j04280L5331r6268
11209A66729J76408K4442j15198N8056J77863K4095k18637k94321J47951J80362
11199C27750J8231N2724O4579M6705k4196j04503J62249l0842N4673J85855j61546
11188E91679o3649p988j29460O3558J43853l2324p7287j5528j00937R066M6716
11177D27699K721o6Q4286q1891P9642r1513k03142K8003J54062J64660k07324
11166C57137k79566K471J18481J55250j97762L1960K23339J07977J519j6635l8103
$$ plain form
11241 515964 493346 413858 411264 496633 578798 565358 561430 544774 634427 501710 371179
11230 371179 389358 516603 589281 495950 649118 894032 923458 809138 586517 470864
11220 470864 465253 532182 532634 407256 276928 211890 250015 331946 227666 262997 166729
11209 166729 343137 367579 252381 310437 488300 512395 293758 -563 147388 327750
11199 327750 345981 398705 463284 509989 485793 381290 543539 512697 567370 753225 591679
11188 591679 528030 520042 390582 454140 597993 565669 488382 472854 371917 380983 427699
11177 427699 430420 430354 514640 432749 512391 420878 217736 245739 399801 564461 357137
11166 357137 77571 80042 198523 353773 156011 187971 411310 519287 520806 504171 466068
11155D66068q3154K8719M4133l1261J7047n4244l4173r8637n7175N5615m7327
11144B05611n2108N3636J16403N0367P5134K1475j2088m0951O78P0059j25727
11133C62489k131j7651P2446J18914N7786L0171k68290m31483K03719K51427M3206
11122D20603n4663J0659l5133K6902N2275J66006l6052j7328j06496j22188p9407
11111B25178k54708J28645L09673O6569k38948K6082j1047k6690J00253r0670
11101B34337l7109J55184j7828j12067l1447o6260n9444j65425m2700J85521K42356
11090B85118J9989j32989l4233K65438L80085Q9947M0558k12292k02551P829j26941
11079C79958q1294j09657o2200M4765K06532N5886M6401n8001k01714k84694Q9695
$$ plain form
11155 466068 382914 411633 455766 424505 441552 387308 353135 254498 197323 252938 205611
11144 205611 153503 207139 323542 373909 449043 470518 458430 417479 418157 488216 362489
11133 362489 360358 342707 415153 534067 591853 622024 353734 -77749 125970 377397 420603
11122 420603 365940 376599 341466 368368 420643 586649 550597 533269 426773 304585 225178
11111 225178 -29530 99115 408788 475357 236409 262491 251444 224754 325007 234337
11101 234337 197228 352412 334584 222517 191070 124810 65366 -100059 -142759 42762 285118
11090 285118 305107 172118 137885 403323 783408 873355 913913 701621 499070 506899 379958
11079 379958 298664 189007 126807 171572 378104 433990 480391 422390 220676 -64018 25677
11068B5677J16435Q3640k6439J2037J89094K50008p7179j28373k6078q1814q3622
11057B53386J1366J6690J47531j9951r464L883l9047k8940p4252j09315K29463
11046C81350J08061j70959l6391R6273M7045J7725J18056J27339J93081m5702
11036H35878j86951Q6166L8639j4845O8541k1018j07003R9881K0008R4465L31797
11025A245558Q7030j8507J21903J8781j80721j33711n3614R487K36920J04853
11015A437979R5640L04757R8118j14107N5594k68k84223k94862j19510k383j16579
11004A060156j5526J38626K04128K6133J03924P9226M6534k06595k69984l04191
10994H62431j32536J71025n3088Q8171R5352O716m1064j16121j7595j82294l7979
$$ plain form
11068 25677 142112 225752 199313 211350 400444 650452 573273 444900 418822 337008 253386
11057 253386 264752 281442 428973 409022 399558 403441 364394 335454 261202 151887 381350
11046 381350 489411 318452 282061 378334 425379 443104 561160 688499 881580 835878
11036 835878 648927 735093 773732 758887 827428 806410 699407 799288 819296 913761 1245558
11025 1245558 1332588 1314081 1435984 1454765 1274044 1140333 1086719 1096206 1333126 1437979
11015 1437979 1533619 1838376 1936494 1822387 1877981 1877713 1593490 1298628 1179118 1176735 1060156
11004 1060156 1044630 1183256 1387384 1413517 1517441 1596667 1643201 1436606 1166622 862431
10994 862431 729895 900920 847832 936003 1031355 1038071 997007 880886 863291 680997 643018
10983F43018o1829r3827o158m6965M4716l7527K4901M3218o2412l8237j99516
10972B09382J35804J21997p2208j40650j02175q8082o2848n565J66650J59424
10962C21729p7241o1688r956j7583K2514l55l0025l4499J02341j02081o4343j70298
10950a21485J59704J56096J68798p0659j63532M3085J62499P4638j27233j93631
10940H8280q1687Q0610J61100M99n4081j29225j20012K3711J12783N9762n9350
10929H2390k1189K0338n498J25288K2983j82609p4846J6349J20839o322l7886
10918E9837q5427n1379K04772J39275j3763M4117j47649q1593L17450j6835l0764
10907C38041O983J01646O0971j37470o1695k4609j893J02625j1929J0748k392
$$ plain form
10983 643018 581189 487362 481204 434239 478955 441428 466329 509547 447135 408898 209382
10972 209382 345186 467183 394975 254325 152150 64068 1220 -4345 162305 321729
10962 321729 244488 182800 172844 155261 177775 177420 147395 112896 215237 113156 48813 -121485
10950 -121485 38219 194315 363113 292454 128922 172007 334506 409144 281911 88280
10940 88280 6593 87203 248303 248802 194721 65496 -54516 -30805 81978 141740 82390
10929 82390 61201 81539 76041 201329 224312 41703 -33143 -16794 104045 97723 59837
10918 59837 -25590 -76969 127803 267078 253315 297432 149783 68190 385640 368805 338041
10907 338041 345024 446670 507641 370171 308476 283867 281974 384599 372670 383418 381026
10896C81026J99254J25124Q6835j27030k38681P0888O4510Q0936j82085j20000
10886C40777j23305p9235l506K4063l6281Q8308M0112q4007j4832k0112l5817
10875I6165K0681j87297l7144K82729J34914k6490P8999j82194k39725m0897M3007
10864e7252J60616n7032M6800k7080J61738M8329K6072J50540m8329m3240o0280
10853C00882K065R8798j11208L6691j51640l7928P5318J845M4797j01309J59210
10842C17521j88698j20064J37486l9601j12719p5151J44475Q5409j31458m266
10832A2934J72817m8922k32112m0671J62932J17535j24220k160K54637j28044
10822A44726J5635P7951K0363J16256j5650k75655q1175P1669k8100j38134n0550
$$ plain form
10896 381026 580280 705404 792239 665209 426528 497416 561926 642862 460777 340777
10886 340777 217472 138237 134731 158794 122513 210821 250933 166926 152094 131982 96165
10875 96165 116846 -70451 -107595 175134 310048 283558 362557 180363 -59362 -100259 -57252
10864 -57252 103364 46332 93132 66052 227790 276119 302191 452731 404402 361162 300882
10853 300882 302947 401745 290537 327228 175588 137660 212978 214823 259620 158311 317521
10842 317521 128823 8759 146245 106644 -6075 -81226 63249 148658 17200 12934
10832 12934 185751 136829 -95283 -135954 26978 144513 20293 18133 272770 144726
10822 144726 160361 238312 258675 374931 359281 83626 2451 74120 46020 -92114 -142664
10811a42664K7873K06200Q1987j23321j11586J09510J00007q5586p4096K5211
10801A3535Q0035J3065k1609n7460J8976Q0919r8030k11530o9572J02690N2810
10790i6171k1815J29258k4567n113J07939k11700k22786N9433J74930J15573k1407
10779a6426k1690J89209J3388j65843k71322k2555J5627J06265K83505J90177
10769C00335m428l9175j26821K07049M6297j87199m7333M3344k3813L1280R1797
10758B91333J75449j97902j83864k82118O1405J48665L1271J54107j09903l7931
10748E0512p6810J38738n4617n2100J01884m3930k5812o2925K1423J49198n060
10737A40501q408j4840j37560J3831j80860N8687P6409M1529j31509N909J41353
$$ plain form
10811 -142664 -114791 91409 173396 50075 -61511 47999 148006 62420 -11676 13535
10801 13535 93570 106635 85026 27566 46542 127461 29431 -182099 -251671 -148981 -96171
10790 -96171 -117986 11272 -13295 -18408 89531 -122169 -344955 -285522 -110592 4981 -16426
10779 -16426 -38116 151093 164481 -1362 -272684 -295239 -279612 -173347 110158 300335
10769 300335 295907 256732 129911 336960 383257 196058 148725 192069 168256 199536 291333
10758 291333 466782 268880 85016 -197102 -135697 12968 44239 198346 88443 50512
10748 50512 -26298 112440 57823 5723 107607 63677 37865 -25060 -3637 145561 140501
10737 140501 132093 117253 -20307 -6476 -187336 -128649 -52240 -10711 -142220 -136311 5042
10726E042m6094m2814R2192o1935L6097P1333o5383N9334m0349J32170j16474
10715B3119j14667o0304N2933K65817J04905l0070j3026J4109p2489J02701L9711
10704C12739j46987k2037k29327m7993J46416K93850N5816o914j23388j69723
10694F2452r5293K11495Q2468j15802q2980k7107J70734j08077j68258K2614k6803
10683g4557J32563P7604L3067J56067l8802j87252j33387j47798m9160J835q9268
10672c19088R2232J83306J11435m4328J17505J44772L7268L231m0411L427j50101
10661A39248j17652j35426J0651J00738K78755J13974L8574m7430n9214L1623
10651C53841L20K4310K2820K00548K82486n4373L5290o551M5164l4992N3786R7599
$$ plain form
10726 5042 -41052 -83866 8326 -53609 -17512 53821 -11562 47772 7423 139593 23119
10715 23119 -91548 -151852 -98919 166898 271803 241733 228707 242816 170327 273028 312739
10704 312739 165752 143715 -85612 -133605 12811 306661 362477 355563 232175 62452
10694 62452 -32841 178654 261122 145320 62340 35233 205967 97890 -70368 -47754 -74557
10683 -74557 58006 135610 168677 324744 285942 98690 -34697 -182495 -231655 -229820 -319088
10672 -319088 -226856 -43550 67885 23557 141062 285834 323102 326333 285922 289349 139248
10661 139248 21596 -113830 -103179 -2441 276314 390288 428862 381432 322218 353841
10651 353841 354161 378471 401291 601839 884325 829952 865242 858691 903855 868863 922649 1020248
10639A020248o2939r068m4357q8242N3068K00541K13736K62135J28023J14821
10629A787966K45819L43219K87932L71999K92108M61927O82111O06088O17504
10620E696673Q41682Q11376O93554Q64167J452181K047575K619795L736591N110295
10611B3873889O967988R517814J2425286J4685158J5430139J2660323O830938
10604A02391535N72564l546678m156141j915612K479359Q296471J5242273K3172025
10596A42535796K9919739L0767090K2356547P192404q908618j8700318j8689459
10589A86473181j1842869k832045P627307J8784242L0235275L8263785L6696479
10582C03405355K1893860k062887k5190133l7394087l6029470k6582889j5327880
$$ plain form
10639 1020248 957309 948241 903884 815642 868710 1069251 1282987 1545122 1673145 1787966
10629 1787966 2033785 2377004 2664936 3036935 3329043 3790970 4473081 5079169 5696673
10620 5696673 6538355 7349731 8043285 8907452 10359633 12407208 15027003 18763594 23873889
10611 23873889 30841877 40359691 52784977 67470135 82900274 95560597 102391535
10604 102391535 102964099 99417421 95261280 93345668 95825027 104121498 119363771 142535796
10596 142535796 172455535 203222625 225579172 232771576 223862958 205162640 186473181
10589 186473181 174630312 171798267 179425574 198209816 228445091 266708876 303405355
10582 303405355 325299215 323236328 298046195 260652108 224622638 198039749 182711869
10575A82711869m372647N717118J4529894J9615213J7362170O197847j0245265
10568B31516199k4863865l1052489k8346003k1029963j3059873o470622j298849
10561A05394535K724742M586166K873410k049664q612957j3928000j5812864j4485005
10553F0690363j1586191q910265o616391n183384l842116k923992k367534j983011
10545A7277479j693145j235801j068538r94346j137878j020064p10019o72750
10537H744938m85230l62496m35439n00234n36823l36315l60464l53158k86730
10528E088049j81307j98531k54550m2913l7213j97091q7998p0472j46757k39975
10518C631242k52144k13783j84309j45308j21476J5458p5141k41965k47586p4704
$$ plain form
10575 182711869 178339222 184056340 198586234 218201447 235563617 241761464 231516199
10568 231516199 206652334 175599845 147253842 126223879 113164006 106693384 105394535
10561 105394535 108119277 112705443 115578853 113529189 104916232 90988232 75175368 60690363
10553 60690363 49104172 40193907 33577516 28394132 24552016 21628024 19260490 17277479
10545 17277479 15584334 14348533 13279995 12285649 11147771 10127707 9417688 8744938
10537 8744938 8259708 7897212 7461773 6961539 6424716 6088401 5727937 5374779 5088049
10528 5088049 4906742 4708211 4453661 4410748 4373535 4176444 4088446 4017974 3871217 3631242
10518 3631242 3379098 3165315 2981006 2835698 2714222 2729680 2654539 2412574 2164988 2090284
10508B090284o4153J4242M6042O8266J63772l45005k84171p1517J49734R3261
10498A860755j24586r9176j06908m2275J9237o4841O7543K3150k34735K7187J57561
10487A482912L3421p8009M1097n0660k27516j53289R1148J21869P8549j16742
10477A222780J53700k4907j86833j71529k22142K2529J44530M1700m8456q4809
10467H46563J2611r5342j15454l5253L711M5356J06661r0667K5232j66767J06307
10456F42958J00691p1252J10660j38826k1074M9474m7219M1411M3220l1511k1516
10445F57016J14763j07874j79300j19460K50320J19394J08259l5041p2046l6656
10435F99375l173N3471K9717R415r3946j32647J16527J82824K3649q3475j46619
$$ plain form
10508 2090284 2026131 2040373 2086415 2154681 2318453 1973448 1689277 1617760 1767494 1860755
10498 1860755 1736169 1636993 1530085 1487810 1507047 1442206 1509749 1532899 1298164 1325351 1482912
10487 1482912 1516333 1438324 1479421 1428761 1201245 1047956 1139104 1260973 1339522 1222780
10477 1222780 1376480 1351573 1164740 993211 771069 793598 938128 979828 931372 846563
10467 846563 859174 763832 648378 613125 616836 662192 768853 678186 703418 536651 642958
10456 642958 743649 672397 783057 644231 623157 672631 625412 666823 710043 678532 657016
10445 657016 771779 663905 484605 365145 615465 734859 843118 808077 736031 699375
10435 699375 696202 749673 779390 788805 694859 562212 678739 861563 885212 801737 655118
10424F55118p5398N5560Q2887J46882n7635r0115k61441Q0725J21218j35270j65837
10413C56694o0060L0885l7563K6872l0353L7197K09214M2894L4211j35150j13477
10402C61364j548N4588j8457j7236j8176p1901J7652Q5695K369k1375Q5427J587
10390D59989q268r6252K7872m3832P3978K6767M6379K6524j91276Q2196J82248
10379E86325Q1716L4405M0898j18707J1206K3342j68201j04718o4938J07971J10240
10368E39539m3337r4839J60433n8483j84674q184n7319q6842L9923M4714J3905
10357B64836r985P3058P0134p472N262R1184j36710j39821J49290N9148J1029
10346D29953m9454k6287j1265J4545J4522K6920l9427j21070O4060J0720k9613
$$ plain form
10424 655118 579720 635280 718167 865049 807414 717299 455858 536583 657801 522531 356694
10413 356694 296634 327519 289956 316828 286475 323672 532886 575780 609991 474841 361364
10402 361364 359816 414404 395947 378711 360535 288634 306286 391981 394350 372975 458402 459989
10390 459989 451721 355469 383341 339509 413487 440254 486633 513157 321881 404077 586325
10379 586325 668041 702446 743344 624637 635843 659185 490984 386266 321328 429299 539539
10368 539539 496202 401363 561796 503313 318639 310455 253136 166294 206217 250931 264836
10357 264836 254851 327909 398043 390571 395833 487017 350307 210486 359776 418924 429953
10346 429953 380499 354212 342947 357492 372014 398934 359507 238437 302497 313217 283604
10335B83604J2602L3457R1805O0628k9687n0840r3643K6192L4174O9580R8303
10324E36175n2839P869N1302n1117j01075N757r1513J99873J28817N7959M6275
10313G37483k23925j50898J05502O0O0283j45141j39444J22003Q3891m505R655
10302D54964n7005J3142j17705K4352J00520r2865j57568J67581J8643K8607o5926
10291C16740j5471j0129p7014k70313k19974J65249J41427R720J86358l3836m5085
10280A47672J62461R0242l8353j12678l6143l3316J00283n3847l9172j0525R0047
$$ plain form
10335 283604 296206 329663 421468 482096 452409 401569 307926 334118 368292 437872 536175
10324 536175 483336 491205 542507 491390 390315 396072 304559 504432 633249 691208 737483
10313 737483 513558 362660 468162 468222 528505 383364 243920 365923 449814 445309 454964
10302 454964 397959 411101 293396 317748 418268 325403 167835 335416 354059 382666 316740
10291 316740 301269 291140 214126 -56187 -276161 -110912 30515 40235 226593 192757 147672
10280 147672 310133 400375 362022 249344 213201 179885 280168 226321 187149 176624 266671
$$ [...]
##END NTUPLES=NMR SPECTRUM
##END=
