##TITLE=Analysis number 314251
Compound Code CC 43901
Book Reference 407/101
Project Code qc-cat
Chemist Name andyw
##JCAMPDX= 6.0         $$ Bruker NMR JCAMP-DX V2.0
##DATA TYPE= NMR SPECTRUM
##DATA CLASS= NTUPLES
##ORIGIN= Bruker BioSpin GmbH
##OWNER= NMR
$$ XWIN-NMR		Version 3.5
$$ Tue Oct 11 16:21:33 2005 GMT Daylight Time (UT+1h)  MAYBRIDGE\NMR@NMR_250MHZ
##.OBSERVE FREQUENCY= 250.131544655141
##.OBSERVE NUCLEUS= ^1H
##.ACQUISITION MODE= SIMULTANEOUS (DQD)
##.ACQUISITION SCHEME= undefined
##.AVERAGES= 16
##.DIGITISER RES= 18
##SPECTROMETER/DATA SYSTEM= dpx250
##.PULSE SEQUENCE= zg30
##.SOLVENT NAME= DMSO
##.SHIFT REFERENCE= (INTERNAL, DMSO, 0, 16.522)
##AUDIT TRAIL= $$ (NUMBER, WHEN, WHO, WHERE, WHAT)
$$ ##TITLE= Audit trail, XWIN-NMR		Version 3.5
$$ ##JCAMPDX= 5.01
$$ ##ORIGIN= Bruker BioSpin GmbH
$$ ##OWNER= NMR
$$ C:\u/data/dgb/nmr/ADRS/10720/pdata/1/auditp.txt
$$ ##AUDIT TRAIL=  $$ (NUMBER, WHEN, WHO, WHERE, WHAT)
(   1,<2005-10-11 16:21:15.00 +100>,<MAYBRIDGE\NMR>,<NMR_250MHZ>,
      <created by zg, POWCHK disabled, PULCHK disabled
       configuration hash MD5:
       62 19 C7 07 E1 42 D1 B7 37 6C 3D D0 77 39 F9 E6
       data hash MD5: 64K
       12 13 8A C5 4D CB B5 13 7F 16 23 5F 38 FA 5C EB>)
(   2,<2005-10-11 16:21:26.35 +100>,<MAYBRIDGE\NMR>,<NMR_250MHZ>,
      <Start of raw data processing
       ef LB = 0.3 FT_mod = 6 PKNL = 1 SI = 32K 
       data hash MD5: 32K
       53 9A 6D A5 FF 50 50 5B 50 9D 6D 9F 66 43 1D 40>)
(   3,<2005-10-11 16:21:27.89 +100>,<MAYBRIDGE\NMR>,<NMR_250MHZ>,
      <apk 
       data hash MD5: 32K
       94 99 14 4C 4E 50 7A F9 F6 95 2A D9 47 61 05 86>)
(   4,<2005-10-11 16:21:28.60 +100>,<MAYBRIDGE\NMR>,<NMR_250MHZ>,
      <abs ABSG = 5 
       data hash MD5: 32K
       AA B6 EE D2 A1 DA 43 6C 17 F7 64 6F 7E F3 DC E3>)
$$ ##END=
$$ 
$$ hash MD5
$$ A7 28 A6 1D A4 0E 05 47 FE E6 01 3E 00 2E DD 77
##$RELAX= 
##$RELAX= 
##$RELAX= 
##$RELAX= 
##$RELAX= 
##$RELAX= 
##$RELAX= 
$$ Bruker specific parameters
$$ --------------------------
##$DU= <C:\u>
##$EXPNO= 10720
##$NAME= <ADRS>
##$PROCNO= 1
##$TYPE= <nmr>
##$USER= <dgb>
##$AMP= (0..31)
100 100 100 100 100 100 100 100 100 100 100 100 100 100 100 100 100 100 
100 100 100 100 100 100 100 100 100 100 100 100 100 100 
##$AQSEQ= 0
##$AQ_mod= 3
##$AUNM= <au_zg>
##$AUTOPOS= <32 >
##$BF1= 250.13
##$BF2= 250.13
##$BF3= 250.13
##$BF4= 250.13
##$BF5= 500.13
##$BF6= 500.13
##$BF7= 500.13
##$BF8= 500.13
##$BYTORDA= 1
##$CFDGTYP= 0
##$CFRGTYP= 5
##$CHEMSTR= <none>
##$CNST= (0..31)
1 1 145 1 1 1 1 1 1 1 1 1 1 1 1 1 1 1 1 1 1 1 1 1 1 1 1 1 1 1 1 1 
##$CPDPRG= <>
##$CPDPRG1= <>
##$CPDPRG2= <>
##$CPDPRG3= <>
##$CPDPRG4= <mlev>
##$CPDPRG5= <mlev>
##$CPDPRG6= <mlev>
##$CPDPRG7= <mlev>
##$CPDPRG8= <mlev>
##$CPDPRGB= <>
##$CPDPRGT= <>
##$D= (0..31)
0 1 0 0 0 0 0 0 0 0.06 0 0 0 0 0 0 0.0002 0 0 0 0 0 0 0 0 0 0 0 0 0 0 
0 
##$DATE= 1129044074
##$DBL= (0..7)
120 120 120 120 120 120 120 120 
##$DBP= (0..7)
150 150 150 150 150 150 150 150 
##$DBP07= 0
##$DBPNAM0= <>
##$DBPNAM1= <>
$$ [...]
##$SUBNAM7= <"">
##$SUBNAM8= <"">
##$SUBNAM9= <"">
##$SW= 20.6930455092707
##$SWIBOX= (0..15)
0 0 3 0 0 0 0 0 0 0 0 0 0 0 0 0 
##$SW_h= 5175.983436853
##$TD= 65536
##$TD0= 1
##$TE= 295.16
##$TE2= 300
##$TE3= 300
##$TEG= 300
##$TL= (0..7)
0 120 120 120 120 120 120 120 
##$TP= (0..7)
150 150 150 150 150 150 150 150 
##$TP07= 0
##$TPNAME0= <>
##$TPNAME1= <>
##$TPNAME2= <>
##$TPNAME3= <>
##$TPNAME4= <>
##$TPNAME5= <>
##$TPNAME6= <>
##$TPNAME7= <>
##$TPOAL= (0..7)
0.5 0.5 0.5 0.5 0.5 0.5 0.5 0.5 
##$TPOFFS= (0..7)
0 0 0 0 0 0 0 0 
##$TUNHIN= 0
##$TUNHOUT= 0
##$TUNXOUT= 0
##$USERA1= <user>
##$USERA2= <user>
##$USERA3= <user>
##$USERA4= <user>
##$USERA5= <user>
##$V9= 5
##$VALIST= <valist>
##$VCLIST= <CCCCCCCCCCCCCCC>
##$VD= 0
##$VDLIST= <DDDDDDDDDDDDDDD>
##$VPLIST= <PPPPPPPPPPPPPPP>
##$VTLIST= <TTTTTTTTTTTTTTT>
##$WBST= 1024
##$WBSW= 4
##$XGAIN= (0..3)
0 0 0 0 
##$XL= 0
##$YL= 0
##$YMAX_a= 291982
##$YMIN_a= -423120
##$ZGOPTNS= <>
##$ZL1= 120
##$ZL2= 120
##$ZL3= 120
##$ZL4= 120
##$ABSF1= 16.522
##$ABSF2= -4.171173
##$ABSG= 5
##$ABSL= 3
##$ALPHA= 0
##$AQORDER= 0
##$ASSFAC= 0
##$ASSFACI= 0
##$ASSFACX= 0
##$ASSWID= 0
##$AUNMP= <proc_1d>
##$AZFE= 0.1
##$AZFW= 0.1
##$BCFW= 0
##$BC_mod= 0
##$BYTORDP= 0
##$COROFFS= 0
##$CY= 12.5
##$DATMOD= 1
##$DC= 0
##$DFILT= <>
##$DTYPP= 0
##$F1P= 14.0000005364418
##$F2P= -0.99999901652339
##$FCOR= 0.5
##$FTSIZE= 32768
##$FT_mod= 6
##$GAMMA= 0
##$GB= 0
##$INTBC= 1
##$INTSCL= 1
##$ISEN= 128
##$LB= 0.3
##$LEV0= 0
##$LPBIN= 0
##$MAXI= 10000
##$MC2= 0
##$MEAN= 0
##$ME_mod= 0
##$MI= 0
##$NCOEF= 0
##$NC_proc= -3
##$NLEV= 6
##$NOISF1= 0
##$NOISF2= 0
##$NSP= 0
##$NTH_PI= 0
##$NZP= 0
##$OFFSET= 16.522
##$PC= 1
##$PHC0= -77.1674
##$PHC1= 8.571527
##$PH_mod= 1
##$PKNL= yes
##$PPARMOD= 0
##$PSCAL= 4
##$PSIGN= 0
##$REVERSE= no
##$SF= 250.13
##$SI= 32768
##$SIGF1= 0
##$SIGF2= 0
##$SINO= 400
##$SIOLD= 32768
##$SREGLST= <1H.DMSO>
##$SSB= 0
##$STSI= 32768
##$STSR= 0
##$SW_p= 5175.98343685301
##$SYMM= 0
##$S_DEV= 0
##$TDeff= 65536
##$TDoff= 0
##$TI= <Analysis number 999999
Compound Code 99
Book Reference 9
Project Code 9>
##$TILT= no
##$TM1= 0
##$TM2= 0
##$TOPLEV= 0
##$USERP1= <user>
##$USERP2= <user>
##$USERP3= <user>
##$USERP4= <user>
##$USERP5= <user>
##$WDW= 1
##$XDIM= 32768
##$YMAX_p= 309825484
##$YMIN_p= -151900
$$ End of Bruker specific parameters
$$ ---------------------------------
##NTUPLES= NMR SPECTRUM
##VAR_NAME=  FREQUENCY,     SPECTRUM/REAL,   SPECTRUM/IMAG
##SYMBOL=    X,             R,               I
##VAR_TYPE=  INDEPENDENT,   DEPENDENT,       DEPENDENT
##VAR_FORM=  AFFN,          ASDF,            ASDF
##VAR_DIM=   32768,         32768,           32768
##UNITS=     HZ,            ARBITRARY UNITS, ARBITRARY UNITS
##FACTOR=    0.157963299565203, 1,           1
##FIRST=     4132.6476996994, 0,             0
##LAST=      -1043.33573715361, 0,           0
##MIN=       -1043.33573715361, -151900,     0
##MAX=       4132.6476996994, 309825484,     0
$$ Real data points
##PAGE= N=1
##DATA TABLE= (X++(R..R)), XYDATA
$$ [...]
$$ plain form
14576 71212 91449 72898 42815 17549 18935 28681 42294 8381 25018 23629 17124 1217
14564 1217 -30270 -48021 -7715 10239 -5916 660 -18788 -13851 28790 33110 47805 59436
14552 59436 10000 -2675 7739 3151 74237 63125 31196 30072 46694 39602 9348 -28150
14540 -28150 -36997 -17690 5107 22506 -12380 -30237 -50544 -41217 -15264 33612 21266 32575
14528 32575 12420 12031 -829 -22378 -42855 -37199 -1624 32826 60201 55500 64770 60775 58358
14515 58358 58861 9068 -36927 -25110 -18744 -49158 -22055 -5549 21493 773 11670 35709
14503 35709 -6012 11629 39844 4949 -15695 -40138 -8966 -48457 -52992 9874 58963 71928
14491 71928 38503 12489 36839 38642 -441 -18710 -18602 3051 37941 24957 16929 10297 24601
$$ packed form
14576G1212K0237j8551l0083k5266J386R746J3613l3913J6637j389o505j5907
14564A217l1487j7751M0306J7954j6155O576j9448M937M2641M320J4695J1631
14552E9436m9436j2675J0414m588P1086j1112l1929j124J6622p092l0254l7498
14540b8150q847J9307K2797J7399l4886j7857k0307R327K5953M8876j2346J1309
14528C2575k0155l89j2860k1549k0477N656L5575L4450K7375m701R270l995k417
14515E8358N03m9793m5995J1817O366l0414K7103J6506K7042k0720J0897K4039
14503C5709m1721J7641K8215l4895k0644k4443L1172l9491m535O2866M9089J2965
14491G1928l3425k6014K4350J803l9083j8269J08K1653L4890j2984q028o632J4304
$$ plain form
14478 24601 -33521 -40813 14763 40234 51683 38478 4219 8998 4898 -3725 11985 3410 9716
14465 9716 -953 1245 8197 19675 36108 39145 21949 26382 18040 35996 37143 28491 14363
14452 14363 18465 -123 -21373 -18650 -31497 -65110 -85473 -59067 -39855 -65699 -76211 -73755
14440 -73755 -40993 -18354 -17445 -41805 -34276 -35613 -22512 16872 28899 23301 17124 32947 -9734
14427 -9734 -17977 -27136 -56338 -57332 -7584 -24944 -45812 -1854 21888 31498 63086 64560 61234
14414 61234 47451 22011 -16738 -8006 -15957 -42572 -59801 -61549 -73301 -33276 -3134 15778
14402 15778 12395 5479 -1032 -4336 -9054 -23121 -9851 25682 39711 60718 46698 8558 -62211
14389 -62211 -51192 -65689 -63057 -65285 -80337 -61920 -25231 -33469 -11167 20876 18457 11356 34139
$$ packed form
14478B4601n8122p292N5576K5471J1449j3205l4259M779m100q623J5710q575O306
14465I716j0669K198O952J1478J6433L037j7196M433q342J7956J147q652j4128
14452A4363M102j8588k1250K723j2847l3613k0363K6406J9212k5844j0512K456
14440g3755L2762K2639R09k4360P529j337J3101L9384J2027n598o177J5823m2681
14427i734q243r159k9202r94M9748j7360k0868M3958K3742R610L1588J474l326
14414F1234j3783k5440l8749Q732p951k6615j7229j748j1752M0025L0142J8912
14402A5778l383o916o511l304m718j4067J3270L5533J4029K1007j4020l8140p0769
14389f2211J1019j4497K632k228j5052J8417L6689q238K2302L2043k419p101K2783
$$ plain form
14376 34139 24596 6937 -14479 -20586 -38781 -55093 -48151 -21883 -4333 4694 50900 81837
14364 81837 58423 -5685 -1711 27214 18880 -8859 6189 -5614 -63441 -50414 13295 64722
14352 64722 74595 88309 84739 46513 37698 8584 -9403 8379 21697 2565 -25659 -38943
14340 -38943 -22996 -29468 10049 34704 28973 21372 6039 -27292 -26795 -7020 21159 39803 33344
14327 33344 30443 47656 96564 99073 108698 86790 60915 30471 16472 37658 51537 13919
14315 13919 -13373 20214 72084 60588 35522 14043 -3855 -6555 -12090 21117 -7929 12976
14303 12976 -14690 -82969 -61620 -23394 -29315 -28437 38847 46933 6127 21614 63403 31283
14291 31283 15758 54789 77369 67154 54641 36462 22657 50350 65724 105633 98507 96808
$$ packed form
14376C4139r543j7659k1416o107j8195j6312O942K6268J7550R027M6206L0937
14364H1837k3414o4108L974K8925q334k7739J5048j1803n7827J3027O3709N1427
14352F4722R873J3714l570l8226q815k9114j7987J7782J3318j9132k8224j3284
14340c8943J5947o472L9517K4655n731p601j5333l3331M97J9775K8179J8644o459
14327C3344k901J7213M8908K509R625k1908k5875l0444j3999K1186J3879l7618
14315A3919k7292L3587N1870j1496k5066k1479j7898k700n535L3207k9046K0905
14303A2976k7666o8279K1349L8226n921Q78O7284Q086m0806J5487M1789l2120
14291C1283j5525L9031K2580j0215j2513j8179j3805K7693J5374L9909p126j699
$$ plain form
14279 96808 100043 73411 16666 -2042 -2203 29891 46019 57113 59249 38926 43970 77264 101821
14266 101821 95890 64732 50358 38920 26461 -3760 6569 23745 23522 46400 18279 10215
14254 10215 -15099 -25712 20367 18643 3733 -3249 -3339 4924 -1352 -10567 -56618 -84046 -63892
14241 -63892 -28935 -20049 -21606 -29910 -26520 -10656 26314 38616 14202 -19733 -9782 26570 47957
14228 47957 53933 54440 65297 37001 42733 62544 82245 39566 3471 -33368 -39829 -23586 -9882
14215 -9882 -4573 34828 67343 45876 46799 28472 34900 58166 40369 11259 -165 -3756 37652
14202 37652 12050 -10590 12652 -10431 -15349 2600 936 -41914 -49918 -41591 -33671 -50231 -53522
14189 -53522 -32918 -30551 -33467 -21784 -20145 -41461 -31191 -30533 -18812 -8461 -58097 -62740 -76831
$$ packed form
14279I6808L235k6632n6745j8708j61L2094J6128J1094K136k0323N044L3294K4557
14266A01821n931l1158j4374j1438j2459l0221J0329J7176k23K2878k8121q064
14254A0215k5314j0613M6079j724j4910o982r0Q263o276r215m6051k7428K0154
14241f3892L4957Q886j557q304L390J5864L6970J2302k4414l3935R951L6352K1387
14228D7957N976N07J0857k8296N732J9811J9701m2679l6095l6839o461J6243J3704
14215i882N309L9401L2515k1467R23j8327O428K3266j7797k9110j1424l591M1408
14202C7652k5602k2640K3242k3083m918J7949j664m2850q004Q327P920j6560l291
14189e3522K0604K367k916J1683J639k1316J0270O58J1721J0351m9636m643j4091
$$ plain form
14176 -76831 -50975 -44203 -24840 -13525 8810 -17039 -25302 -23039 -21385 -8026 -12500 -13995 -33717
14163 -33717 4937 29081 28998 23388 10196 -22647 -31544 9039 55061 21822 -5783 -39020 -10027
14150 -10027 4084 9237 19655 7802 -19427 -12558 -34808 -43017 -19382 -47705 -52205 -35832
14138 -35832 -23312 -9008 -10472 -28263 6070 42343 29873 18899 28777 62061 94546 83108
14126 83108 55891 10342 -17408 -30190 -36815 -51878 -23442 -846 -25832 -22044 -41889 -86840
14114 -86840 -104216 -53487 -38123 -33254 -7318 218 20049 51535 41321 42742 66583 61780
14102 61780 49786 46425 15466 -24016 -9030 31372 54001 63050 42592 -2887 -44551 -46016
14090 -46016 26777 -100 -31854 6182 17060 45214 55367 54784 49698 36786 13610 30380
$$ packed form
14176g6831K5856O772J9363J1315K2335k5849q263K263J654J3359m474j495j9722
14163c3717L8654K4144q3n610j3192l2843q897M0583M6022l3239k7605l3237K8993
14150a0027J4111N153J0418j1853k7229O869k2250q209K3635k8323m500J6373
14138c5832J2520J4304j464j7791L4333L6273j2470j0974R878L3284L2485j1438
14126H3108k7217m5549k7750j2782o625j5063K8436K2596k4986L788j9845m4951
14114h6840j7376N0729J5364M869K5936P536J9831L1486j0214J421K3841m803
14102F1780j1994l361l0959l9482J4986M0402K2629R049k0458m5479m1664j465
14090d6016P2793k6877l1754L8036J0878K8154J0153n83n086j2912k3176J6770
$$ plain form
14078 30380 6312 21855 16542 24812 -3973 -2873 24967 47155 67785 83508 75909 80854 55311
14065 55311 30243 21744 8347 -10608 -6914 13272 35791 32055 29468 29328 20632 52163 119002
14052 119002 123527 94704 83228 54619 51877 56358 103271 81885 49880 64646 29986 2725
14040 2725 6678 -10190 -45160 -37388 7132 16328 29739 4980 -9785 23229 40613 25785
14028 25785 242 2316 24385 27652 -14792 -63486 -61138 -59619 -52312 -8362 16543 21712 8635
14015 8635 19032 28152 106502 97266 69935 62080 22563 12149 17077 -5319 -11479 -12412 -7099
14002 -7099 -26755 -32377 -26456 -40669 -50045 -47869 -16243 -9181 -35737 -14273 -28921 14901 40983
13989 40983 31861 39617 13974 -31940 -57237 -79039 -81547 -62226 -9093 -10766 -51568 -40915
$$ packed form
14078C0380k4068J5543n313Q270k8785J100K7840K2188K0630J5723p599M945k5543
14065E5311k5068q499j3397j8955L694K0186K2519l736k587j40q696L1531O6839
14052A19002M525k8823j1476k8609k742M481M6913k1386l2005J4766l4660k7261
14040B725L953j6868l4970P772M4520R196J3411k4759j4765L3014J7384j4828
14028B5785k5543K074K2069L267m2444m8694K348J519P307M3950K4905N169j3077
14015H635J0397R120P8350r236k7331p855l9517j0414M928k2396o160r33N313
14002g099j9656n622N921j4213r376K176L1626P062k6556K1464j4648M3822K6082
13989D0983r122P756k5643m5914k5297k1802k508J9321N3133j673m0802J0653
$$ plain form
13977 -40915 25386 23405 -45214 -45932 -32100 10992 26132 7273 1378 -27220 -51826 -52528 -35339
13964 -35339 -27719 -47249 -23100 -24883 -42966 -14476 13324 26194 -2061 -19073 -2167 17884
13952 17884 2219 16524 -48928 -86775 -72397 -27400 -30507 -27721 25418 -19203 -64033 -60997
13940 -60997 -33434 -50091 -30560 -4032 15712 39056 45968 32904 5954 -25308 -26431 -30265
13928 -30265 -28575 47149 64270 28470 1484 -36310 -65063 -51228 -31619 -36463 -24709 -50435
13916 -50435 -17848 16343 23951 49445 43458 33161 52943 46376 33788 39256 -1453 -23510
13904 -23510 -27339 -41796 -55681 -51415 -24085 -8989 12672 -1771 -12528 1331 9619 -8700
13892 -8700 -9148 3703 13783 6018 8279 20151 -11298 9008 -26679 -53597 -62025 -64144 -44428
$$ packed form
13977d0915O6301j981o8619p18J3832M3092J5140j8859n895k8598k4606p02J7189
13964c5339P620j9530K4149j783j8083K8490K7800J2870k8255j7012J6906K0051
13952A7884j5665J4305o5452l7847J4378M4997l107K786N3139m4621m4830L036
13940f0997K7563j6657J9531K6528J9744K3344O912j3064k6950l1262j123l834
13928c0265J690P5724J7121l5800k6986l7794k8753J3835J9609m844J1754k5726
13916e0435L2587L4191P608K5494n987j0297J9782o567j2588N468m0709k2057
13904b3510l829j4457j3885M266K7330J5096K1661j4443j0757J3859Q288j8319
13892h700m48J2851J0080p765K261J1872l1449K0306l5687k6918q428k119J9716
$$ plain form
13879 -44428 -22998 -2082 -23127 -1691 4310 -30625 -18760 27898 40458 23664 17009 20116
13867 20116 11071 1540 11643 39256 60251 29444 -8922 -29743 -76569 -70932 -12269 -4221
13855 -4221 27442 15004 26137 -2760 -11620 48358 63626 38615 -1990 3444 -3632 14229
13843 14229 196 -33823 -33039 -43959 -27384 -13417 3527 -18248 -15515 11833 2410 -31650
13831 -31650 -39923 -9145 30996 50585 50132 44163 45810 -3493 -13839 -15608 -41533 -66807 -39419
13818 -39419 -23755 14379 -23830 -39280 -24443 -7068 -27916 -16326 -1657 -16715 -2550 -8659
13806 -8659 20610 34188 21709 18569 22593 3068 -827 29627 40919 3288 20742 23730 4394
13793 4394 11428 52202 65222 37827 19761 -2724 -7318 -35462 -13947 5323 48742 45007
$$ packed form
13879d4428K1430K0916k1045K1436O001l4935J1865M6658J2560j6794o655L107
13867B0116r045r531J0103K7613K0995l0807l8366k0821m6826N637N8663Q048
13855d221L1663j2438J1133k8897q860N9978J5268k5011m0605N434p076J7861
13843A4229j4033l4019P84j0920J6575J3967J6944k1775K733K7348r423l4060
13831c1650q273L0778M0141J9589m53n969J647m9303j0346j769k5925k5274K7388
13818c9419J5664L8134l8209j5450J4837J7375k0848J1590J4669j5058J4165o109
13806h659K9269J3578j2479l140M024j9525l895L0454J1292l7631J7454K988j9336
13793D394P034M0774J3020k7395j8066k2485m594k8144K1515J9270M3419l735
$$ plain form
13781 45007 47150 19970 10637 -9155 -57243 -60212 -35416 31730 40941 25933 13562 7742 -5916
13768 -5916 -28032 -35287 -16519 4968 -38891 -44864 8314 5295 -70112 -61298 -46235 -57889 -30570
13755 -30570 -39428 -19715 -34614 -97198 -61113 5145 10544 -16521 -51133 -13263 17966 31473
13743 31473 -628 39644 44565 20691 -11966 -17584 20025 14865 27776 30288 16475 34828
13731 34828 30530 20733 -11865 16464 33356 36776 23201 4838 15217 -3144 6789 1471 -39758
13718 -39758 -14416 -18489 -19646 3128 39470 43838 4418 -15774 -8697 -24917 -9184 -4361 32660
13705 32660 44862 39073 11534 -38022 -30802 -12714 -891 33390 36269 -1005 -7044 21639
13693 21639 72193 47659 28395 8896 -6581 -1732 -7464 3567 7139 14534 32567 68333
$$ packed form
13781D5007K143k7180r333j9792m8088k969K4796O7146R211j5008j2371n820j3658
13768e916k2116p255J8768K1487m3859n973N3178l019p5407Q814J5063j1654K7319
13755c0570q858J9713j4899o2584L6085O6258N399k7065l4612L7870L1229J3507
13743C1473l2101M0272M921k3874l2657n618L7609n160J2911K512j3813J8353
13731C4828m298r797l2598K8329J6892L420j3575j8363J0379j8361R933n318m1229
13718c9758K5342m073j157K2774L6342M368l9420k0192P077j6220J5733M823L7021
13705C2660J2202n789k7539m9556P220J8088J1823L4281K879l7274o039K8683
13693B1639N0554k4534j9264j9499j5477M849n732J1031L572P395J8033L5766
$$ plain form
13681 68333 34485 -15260 -46858 -33108 -30304 -10603 26038 82170 116208 81448 67101 58641
13669 58641 70363 75072 89176 82806 34859 -28037 -44747 -28090 31413 80534 54527 11636
13657 11636 -8568 -3635 -5207 -1797 -1802 -1875 -12120 -16090 1279 40253 65595 54886 -1655 16057
13643 16057 43841 42942 45415 83203 80545 115780 127491 80849 30631 21281 15045 19565 32455
13630 32455 24890 -43938 -66031 -35692 28061 23719 3517 -10496 -51781 -78285 -36516 -10072
13618 -10072 -11227 -43113 -56128 -43616 4456 -2905 -28221 -22375 -54650 -45672 -30724 -22302 -772
13605 -772 -5103 29699 36699 -44258 -38742 -7840 -33632 -7711 -6612 -15526 -26888 -24711 -18994
13592 -18994 -46530 -57804 -33413 -36588 -42176 -42196 -5216 39399 34063 -8219 3185 11907 32325
$$ packed form
13681F8333l3848m9745l1598J3750K804J9701L6641N6132L4038l4760j4347q460
13669E8641J1722M709J4104o370m7947o2896j6710J6657N9503M9121k6007m2891
13657A1636k0204M933j572L410np3j0245l970J7369L8974K5342j0709n6541J7712
13643A6057K7784q99K473L7788k658L5235J1711m6642n0218r350o236M520J2890
13630C2455p565o8828k2093L0339O3753m342k0202j4013m1285k6504M1769K6444
13618a0072j155l1886j3015J2512M8072p361k5316N846l2275Q978J4948Q422K1530
13605g72m331L4802P000q0957N516L0902k5792K5921J099q914j1362K177N717
13592a8994k7536j1274K4391l175n588k0L6980M4615n336m2282J1404Q722K0418
$$ plain form
13579 32325 31532 10592 1178 37638 7112 -14676 19691 37533 14039 33274 35900 57541
13567 57541 66630 57943 55352 73501 65617 23218 34196 78030 126060 84846 21632 34035
13555 34035 30710 24221 59164 77793 104497 135599 113106 88427 50513 -21639 -24242 17994
13543 17994 36156 64481 89036 95045 89447 75648 61179 -377 8153 48110 61537 62317 63881
13530 63881 81300 86887 89337 82801 71578 47217 26465 -16056 -44134 -24667 29190 47177
13518 47177 58813 81475 66321 7832 -11014 -3255 8787 58607 74980 48893 3182 -3548
13506 -3548 -17135 -16683 -38735 -9937 50098 86545 65857 48579 76348 101812 94215 60028
13494 60028 29479 44537 57218 36892 -14681 -27172 -12566 -10970 39842 34214 26779 24435
$$ packed form
13579C2325p93k0940r414L6460l0526k1788L4367J7842k3494J9235K626K1641
13567E7541R089q687k591J8149p884m2399J0978M3834M8030m1214o3214J2403
13555C4035l325o489L4943J8629K6704L1102k2493k4679l7914p2152k603M2236
13543A7994J8162K8325K4555O009n598j3799j4469o1556Q530L9957J3427P80J564
13530F3881J7419N587K450o536j1223k4361k0752m2521k8078J9467N3857J7987
13518D7177J1636K2662j5154n8489j8846P759J2042M9820J6373k6087m5711o730
13506c548j3587M52k2052K8798O0035L6447k0688j7278K7769K5464p597l4187
13494F0028l0549J5058J2681k0326n1573j2491J4606J596N0812n628p435k344
$$ plain form
13482 24435 30590 44776 22576 6601 35088 74489 95762 90444 110612 84995 37058 26300
13470 26300 7987 78164 118241 110253 83169 52624 64044 51352 32272 2576 22098 14936
13458 14936 124 45119 66237 86389 104059 112505 83146 9975 -13907 -7837 32484 35404
13446 35404 48443 42413 16315 -26804 5687 40855 43432 -11889 -25912 -26267 -22617 -46527 -45772
13433 -45772 -5399 -20989 -65526 -90986 -65596 13134 61039 61506 4022 5678 26456 36039
13421 36039 42399 84901 94835 119036 125865 79723 79131 68407 48864 72093 41537 27751 44520
13408 44520 46067 29158 -6025 11825 16895 -5632 -18657 12901 37380 21016 4829 -12063
13396 -12063 12412 30351 30485 37471 6749 35346 -7235 -18397 24283 10985 35464 96011
$$ packed form
13482B4435O155J4186k2200j5975K8487L9401K1273n318K0168k5617m7937j0758
13470B6300j8313P0177M0077p988k7084l0545J1420j2692j9080k9696J9522p162
13458A4936j4812M4995K1118K0152J7670Q446k9359p3171k3882O070M0321K920
13446C5404J3039o030k6098m3119L2491L5168K577n5321j4023l55L650k3910P55
13433d5772M0373j5590m4537k5460K5390P8730M7905M67n7484J656K0778R583
13421C6039O360M2502R934K4201O829m6142n92j0724j9543K3229l0556j3786J6769
13408D4520J547j6909l5183J7850N070k2527j3025L1558K4479j6364j6187j6892
13396a2063K4475J7939J34O986l0722K8597m2581j1162M2680j3298K4479O0547
$$ plain form
13384 96011 84861 49291 35591 72020 75857 45698 42014 74929 99238 83531 78612 84104
13372 84104 63638 529 -19405 -34835 -27312 15139 48363 38757 33432 60324 61133 70447 70743
13359 70743 36129 18644 56305 74006 48611 63817 14862 23712 78920 60346 32732 -10000
13347 -10000 -30723 -3978 -40101 -39780 -31921 -14574 -11289 -24875 -664 40567 64443 82763
13335 82763 60274 86210 100206 74534 46738 11904 -24832 -22626 23929 66894 49332 1286
13323 1286 -8895 -31388 -7474 49803 65525 28820 -19502 -31161 -29077 -12781 -6927 18103
13311 18103 24851 2161 -780 44182 39049 -10733 20370 26950 -4030 1358 9876 7493 2280
13298 2280 5386 -14011 9674 42094 36731 1953 -1153 7029 -17550 40572 51835 41320 57805
$$ packed form
13384I6011j1150l5570j3700L6429L837l0159l684L2915K4309j5707m919N492
13372H4104k0466o3109j9934j5430P523M2451L3224r606n325K6892Q09R314K96
13359G0743l4614j7485L7661J7701k5395J5206m8955Q850N5208j8574k7614m2732
13347a0000k0723K6745l6123L21P859J7347L285j3586K4211M1231K3876J8320
13335H2763k2489K5936J3996k5672k7796l4834l6736K206M6555M2965j7562m8046
13323A286j0181k2493K3914N7277J5722l6705m8322j1659K084J6296N854K5030
13311A8103O748k2690k941M4962n133m9782L1103O580l0980N388Q518k383n213
13298B280L106j9397K3685L2420n363l4778l106Q182k4579N8122J1263j0515J6485
$$ plain form
13285 57805 54463 60380 1501 -21820 10982 28907 28812 25755 70188 16403 -19236 -14932 -11994
13272 -11994 3128 5419 40273 40595 56219 7300 7467 11643 22992 26260 58265 73771 92352
13259 92352 43854 -5924 -13706 -14060 22073 56952 56903 47479 68972 51661 44750 60908 53868
13246 53868 49227 -8471 -6906 42318 73015 70721 88127 93067 49053 41868 41088 -3950 16816
13233 16816 27749 48535 61551 72990 66382 63973 56978 69876 44414 22610 25894 11470
13221 11470 17832 39946 30464 9063 16538 38972 70608 62977 61833 65844 46521 70401 91627
13208 91627 90339 66330 61331 43264 65062 72786 32561 19584 29244 44324 29350 12405
13196 12405 30701 15404 24334 25478 13618 22382 30325 44818 32306 53612 54359 22845 22893
$$ packed form
13285E7805l342N917n8879k3321L2802J7925r5l057M4433n3785l5639M304K938
13272a1994J5122K291L4854L22J5624m8919J67M176J1349L268L2005J5506J8581
13259I2352m8498m9778p782l54L6133L4879m9r424K1493j7311o911J6158p040
13246E3868m641n7698J565M9224L0697k294J7406M940m4014p185p80m5038K0766
13233A6816J0933K0786J3016J1439o608k409o995J2898k5462k1804L284j4424
13221A1470O362K2114r482k1401P475K2434L1636p631j144M011j9323K3880K1226
13208I1627j288k4009m999j8067K1798P724m0225j2977R660J5080j4974j6945
13196A2405J8296j5297Q930J144j1860Q764P943J4493j2512K1306P47l1514M8
$$ plain form
13183 22893 -12917 -2088 29626 67459 112706 125280 91573 47598 46392 60462 53603 72037
13171 72037 95717 91562 82349 46248 54895 52928 43507 27096 78663 156518 147253 105720 101220
13158 101220 80737 69787 57671 8430 839 10802 6866 30050 83710 81760 44678 31321
13146 31321 -6293 -14828 -6452 11529 6219 10878 25634 23666 -20849 -14417 34902 75166 78581
13133 78581 80038 57417 46177 38780 -4819 -5549 28449 47939 78677 102061 131563 129367 113349
13120 113349 130268 130168 131419 106960 68641 76747 69661 55875 44662 56757 58427 50921 59008
13107 59008 63198 65830 42663 33753 80736 81446 90365 66431 56930 89756 96300 118914 125620
13094 125620 151246 135904 94705 83713 101548 105120 92960 82972 57023 15149 34664 49905
$$ packed form
13183B2893l5810J0829L1714L7833M5247J2574l3707m3975j206J4070o859J8434
13171G2037K3680m155r213l6101Q647j967r421j6411N1567P7855r265m1533m500
13158A01220k0483j0950j2116m9241p591R963l936K3184N3660j950l7082j3357
13146C1321l7614q535Q376J7981n310M659J4756j968m4515O432M9319M0264L415
13133G8581J457k2621j1240p397m3599p30L3998J9490L0738K3384K9502k196j6018
13120A13349J6919j00J251k4459l8319Q106p086j3786j1213J2095J670p506Q087
13107E9008M190K632k3167q910M6983P10Q919k3934r501L2826O544K2614O706
13094A25620K5626j5342m1199j0992J7835L572j2160r988k5949m1874J9515J5241
$$ plain form
13082 49905 61907 27159 26758 36761 31505 12890 36978 29232 -18443 -24724 46769 90447 62021
13069 62021 51626 69274 104873 87655 45710 52477 60125 29280 -1444 -22464 11836 41295
13057 41295 62152 68795 56017 77035 63096 56721 42115 1206 7725 50384 69986 68937
13045 68937 91794 85136 79770 75123 90966 87280 36257 37941 58983 76695 82837 93835 75913
13032 75913 11854 -36763 -46332 -12448 27539 62354 73473 63778 66013 56801 73313 109738
13020 109738 111658 100599 82514 69206 47822 19267 37620 42326 9940 32689 65882 80032
13008 80032 82527 42956 57161 46817 41840 30372 13957 44146 93283 112117 119348 97882
12996 97882 91922 88382 52382 32325 67687 70522 74894 38955 63212 69553 95795 127578 124422
$$ packed form
13082D9905J2002l4748m01J0003n256j8615K4088p746m7675o281P1493M3678k8426
13069F2021j0395J7648L5599j7218m1945O767P648l0845l0724k1020L4300K9459
13057D1295K0857O643j2778K1018j3939o375j4606m0909O519M2659J9602j049
13045F8937K2857o658n366m647J5843l686n1023J684K1042J7712O142J0998j7922
13032G5913o4059m8617r569L3884L9987L4815J1119r695K235r212J6512L6425
13020A09738J920j1059j8085j3308k1384k8555J8353M706l2386K2749L3193J4150
13008H0032K495l9571J4205j0344m977j1468j6415L0189M9137J8834P231k1466
12996I7882n960l540l6000k0057L5362K835M372l5939K4257O341K6242L1783l156
$$ plain form
12983 124422 63987 14068 -20784 13986 67209 95192 95788 78860 64026 84406 91458 53572
12971 53572 31522 31920 69510 73669 100517 124590 173945 126578 75363 56779 36769 84059
12959 84059 97193 100060 105736 102289 46011 9461 43741 51773 68604 96590 87727 72799 70662
12946 70662 76666 63253 42133 55676 48792 30468 17204 12390 52886 71710 55087 52391
12934 52391 52539 85013 75794 76232 89971 94787 67862 86179 108842 104344 111260 105837 119340
12921 119340 119340 95140 60596 26931 22021 28987 18057 27319 44766 49701 73787 114195 111943
12908 111943 74851 66598 26860 4443 54353 67773 69224 57075 43989 67920 126276 123316
12896 123316 110449 80625 85259 122759 100319 85747 67268 21989 -20227 -36957 -22127 9337
$$ packed form
12983A24422o0435m9919l4852L4770N3223K7983N96j6928j4834K0380P052l7886
12971E3572k2050L98L7590M159K6848K4073M9355m7367n1215j8584k0010M7290
12959H4059J3134K867N676l447n6278l6550L4280Q032J6831K7986q863j4928k137
12946G0662O004j3413k1120J3543o884j8324j3264m814M0496J8824j6623k696
12934E2391J48L2474r219M38J3739M816k6925J8317K2663m498O916n423J3503
12921A19340%k4200l4544l3665m910O966j0930R262J7447M935K4086M0408k252
12908A11943l7092q253l9738k2417M9910J3420J451j2149j3086K3931N8356k960
12896A23316j2867k9824M634L7500k2440j4572j8479m5279m2216j6730J4830L1464
$$ plain form
12884 9337 48180 30175 -6464 17041 42613 37875 46981 66013 55421 45603 628 4491 43734
12871 43734 68128 82876 119829 145619 137587 153954 203228 203964 184760 184684 199689 213486 220982
12858 220982 207695 161423 145262 121577 127438 130722 110659 133095 150553 144494 159390 133577
12846 133577 125966 135797 126470 180706 178388 178507 214302 222181 209039 157626 134879 129764 138290
12833 138290 142404 114133 105021 145323 184719 150952 137157 156375 168123 194350 220384 225273
12821 225273 190476 187917 196137 180116 153934 136790 113678 111900 135936 108879 106058 140682
12809 140682 120648 115718 114193 105566 98588 87489 108013 113442 111964 148548 186768 200568 202815
12796 202815 172013 149994 171411 161374 143058 150388 185100 182306 201803 201134 163937 151085
$$ packed form
12884I337L8843j8005l6639K3505K5572m738R106J9032j0592r818m4975L863L9243
12871D3734K4394J4748L6953K5790q032J6367M9274P36j9204p6J5005J3797P496
12858B20982j3287m6272j6161k3685N861L284k0063K2436J7458o059J4896k5813
12846A33577p611R831r327N4236k318J19L5795P879j3142n1413k2747n115Q526
12833A38290M114k8271r112M0302L9396l3767j3795J9218J1748K6227K6034M889
12821B25273l4797k559Q220j6021k6182j7144k3112j778K4036k7057k821L4624
12809A40682k0034m930j525q627o978j1099K0524N429j478L6584L8220J3800K247
12796B02815l0802k2019K1417j0037j8316P330L4712k794J9497o69l7197j2852
$$ plain form
12784 151085 134245 123305 111889 111517 100769 71510 83424 101932 92862 104538 110153 99497
12772 99497 111888 150925 195848 188890 178336 118750 89327 87524 113928 121937 130269 162070
12760 162070 197004 206124 165116 158591 147402 153217 166107 175347 177741 135841 95393 97926 105949
12747 105949 183629 172200 161799 154931 141764 113503 116812 94511 58281 39869 69499 121719
12735 121719 140573 111002 94923 65490 69537 76907 103421 114269 137870 142038 130239 135897
12723 135897 98969 116497 137838 108075 68267 86301 123265 154793 132297 66830 19643
12712 19643 42859 81926 114398 112110 123743 162680 148736 150794 110918 102613 86268 94728
12700 94728 110346 98667 93397 70717 53214 84819 77043 71936 62380 56478 105529 98667 86266
$$ packed form
12784A51085j6840j0940j1416l72j0748k9259J1914J8508r070J1676N615j0656
12772I9497J2391L9037M4923o958j0554n9586k9423j803K6404Q009Q332L1801
12760A62070L4934R120m1008o525j1189N815J2890R240K394m1900m0448K533Q023
12747A05949P7680j1429j0401o868j3167k8261L309k2301l6230j8412K9630N2220
12735A21719J8854k9571j6079k9433M047P370K6514J0848K3601M168j1799N658
12723A35897l6928J7528K1341k9763l9808J8034L6964L1528k2496o5467m7187
12712A9643K3216L9067L2472k288J1633L8937j3944K058l9876q305j6345Q460
12700I4728J5618j1679n270k2680j7503L1605p776n107r556n902M9051o862j2401
$$ plain form
12687 86266 103972 122513 123897 151501 147045 162068 178998 142534 137527 178153 210127 170584
12675 170584 174895 188810 175347 170846 173951 162948 124123 85104 94636 104864 76364 54222
12663 54222 66519 64644 88475 107623 103146 114360 109412 153529 160649 143830 118823 125925 158201
12650 158201 165408 166353 137109 105532 99623 110213 115519 141565 128237 159671 222075 235793
12638 235793 252419 257530 274105 295249 268768 233400 187077 189490 256695 276109 270375 253945
12626 253945 229002 189430 154410 170388 199488 240496 266074 278526 270749 238290 200956 214433
12614 214433 228125 230810 212598 186363 191466 226334 228930 222621 228503 206404 201758 216352 203506
12601 203506 247740 288494 261828 193680 194922 200611 154326 152807 169191 204429 169981 139950
$$ packed form
12687H6266J7706J8541J384K7604m456J5023J6930l6464n007M0626L1974l9543
12675A70584M311J3915j3463m501L105j1003l8825l9019R532J0228k8500k2142
12663E4222J2297j875K3831J9148m477J1214m948M4117P120j6819k5007P102L2276
12650A58201P207R45k9244l1577n909J0590N306K6046j3328L1434O2404J3718
12638B35793J6626N111J6575K1144k6481l5368m6323K413O7205J9414n734j6430
12626B53945k4943l9572l5020J5978K9100M1008K5578J2452p777l2459l7334J3477
12614B14433J3692K685j8212k6235N103L4868K596o309N882k2099m646J4594j2846
12601B03506M4234M0754k6666o8148J242N689m6285j519J6384L5238l4448l0031
$$ plain form
12589 139950 149102 152653 118800 107878 142820 175732 184870 180812 167887 175493 171238 146385 154749
12576 154749 193912 218995 211384 214547 245997 262415 238452 205504 216443 225385 208710 223070
12564 223070 253795 254397 268737 236127 220645 240665 295991 283759 275646 299850 266839 257006
12552 257006 305615 317905 332935 317061 299877 299209 336858 331582 312159 305369 329393 356826
12540 356826 350611 345686 341655 395048 366621 347075 373814 333238 303230 364433 398336 369192
12528 369192 374064 401532 385395 387494 405188 413698 395070 378431 350512 376625 437910 480161
12516 480161 467275 457040 493021 515921 475264 453336 431738 443268 484444 485990 496017 506907
12504 506907 510179 560054 578870 574687 559334 558976 556908 519444 515261 552360 552913 548215 516595
$$ packed form
12589A39950R152L551l3853j0922L4942L2912R138m058j2925P606m255k4853Q364
12576A54749L9163K5083p611L163L1450J6418k3963l2948J0939Q942j6675J4360
12564B23070L0725O02J4340l2610j5482K0020N5326j2232q113K4204l3011r833
12552B57006M8609J2290J5030j5874j7184o68L7649n276j9423o790K4024K7433
12540C56826o215m925m031N3393k8427j9546K6739m0576l0008O1203L3903k9144
12528C69192M872K7468j6137K099J7694Q510j8628j6639k7919K6113O1285M2251
12516D80161j2886j0235L5981K2900m0657k1928k1598J1530M1176J546J0027J0890
12504E06907L272M9875J8816m183j5353l58k068l7464m183L7099N53m698l1620
$$ plain form
12491 516595 530919 585710 589238 595284 676239 727401 722128 697971 681091 695641 741737 760508
12479 760508 774358 788973 781659 835599 848851 860465 857595 915458 967995 1005197 980429 1020169
12467 1020169 1022813 1022359 1077199 1098157 1103432 1114675 1140861 1181836 1236591 1305366 1354025 1421793
12455 1421793 1481638 1575996 1686954 1766895 1799843 1862301 1955672 2026105 2155602 2308463 2417441
12444 2417441 2513553 2624242 2775709 2976001 3230937 3515266 3820623 4179136 4595855 5102060
12434 5102060 5715372 6391972 7152115 8052333 9113519 10339034 11644256 12992621 14287991
12425 14287991 15506853 16535122 17254572 17609113 17649578 17392791 16910083 16303507 15640687
12416 15640687 15063958 14504318 14021856 13632104 13392086 13276180 13280021 13395637 13684513 14206997
$$ packed form
12491E16595J4324N4791L528O046Q0955N1162n273k4157j6880J4550M6096J8771
12479G60508J3850J4615p314N3940J3252J1614k870N7863N2537L7202k4768L9740
12467A020169K644m54N4840K0958N275J1243K6186M0975N4755O8775M8659O7768
12455A421793N9845R4358J10958P9941L2948O2458R3371P0433J29497J52861J08978
12444B417441R6112J10689J51467K00292K54936K84329L05357L58513M16719N06205
12434E102060O13312O76600P60143R00218J061186J225515J305222J348365J295370
12425A4287991J218862J028269P19450L54541M0465k56787m82708o06576o62820
12416A5640687n76729n59640m82462l89752k40018j15906L841J15616K88876N22484
$$ plain form
12406 14206997 14924747 15851619 17044793 18412678 19872829 21423426 22845326 24055623
12398 24055623 25017131 25713758 26293482 26835392 27344991 27821489 28153274 28270187 28154349
12389 28154349 27814408 27259197 26502646 25613166 24778579 24027623 23481940 23128381 23025914
12380 23025914 23145634 23430496 23795000 24088934 24102521 23788201 23184341 22341290 21368814
12371 21368814 20350398 19498783 18819573 18358383 18077441 18062427 18362632 18921838 19748192
12362 19748192 20767690 21915192 23173835 24449640 25637338 26591226 27114018 27076277 26457459
12353 26457459 25303916 23792605 22069545 20291001 18559477 16905945 15392492 14025569
12345 14025569 12803593 11671600 10668795 9796486 9011609 8267281 7634730 7001752 6442359
$$ packed form
12406A4206997P17750R26872J193174J367885J460151J550597J421900J210297
12398B4055623R61508O96627N79724N41910N09599M76498L31785J16913j15838
12389B8154349l39941n55211p56551q89480q34587p50956n45683l53559j02467
12380B3025914J19720K84862L64504K93934J3587l14320o03860q43051r72476
12371B1368814j018416q51615o79210m61190k80942j5014L00205N59206Q26354
12362A9748192J019498J147502J258643J275805J187698R53888N22792l7741o18818
12353B6457459j153543j511311j723060j778544j731524j653532j513453j366923
12345A4025569j221976j131993j002805q72309p84877p44328o32551o32978n59393
$$ plain form
12336 6442359 5954234 5487317 5063710 4720340 4365484 4066780 3788460 3514015 3260994
12327 3260994 3081731 2898127 2700410 2578396 2420440 2275324 2194097 2129170 2048118 1945288
12317 1945288 1801402 1662273 1575302 1514212 1419656 1311407 1273264 1235748 1201706 1139079 1103923
12306 1103923 1070569 1046709 994835 986869 964659 983787 971286 914897 821334 766027 765577 774731
12294 774731 752160 757137 734282 699131 711796 726686 716325 719399 697558 687354 697430 679086
12282 679086 668256 646562 618130 597423 600386 628272 636842 608037 564096 580909 577181 547316
12270 547316 571120 528389 502944 490667 488206 474817 447145 448121 470938 492176 496304 493247
12258 493247 516200 516636 528906 537068 495892 470968 501017 514130 503367 497146 491295 448758
$$ packed form
12336F442359m88125m66917m23607l43370l54856k98704k78320k74445k53021
12327C260994j79263j83604j97717j22014j57956j45116q1227o4927q1052j02830
12317A945288j43886j39129q6971o1090r4556j08249l8143l7516l4042o2627l5156
12306A103923l3354k3860n1874p966k2210J9128j2501n6389r3563n5307m50R154
12294G74731k2571M977k2855l5151J2665J4890j0361L074k1841j0204J0076j8344
12282F79086j0830k1694k8432k0707K963K7886Q570k8805m3941J6813l728k9865
12270E47316K3804m2731k5445j2277k461j3389k7672R76K2817K1238M128l057
12258D93247K2953M36J2270Q162m1176k4924L0049J3113j0763o221n851m2537
$$ plain form
12246 448758 434763 464277 495677 424301 414290 438271 451396 449133 463512 475141 471580 508483
12234 508483 529884 536026 535311 530894 548016 608865 637077 703234 737156 735449 720881 725721 690946
12221 690946 664466 675294 677700 655420 665846 659910 665429 658286 653713 630563 653018 674446
12209 674446 667990 648607 679196 705606 719968 713045 688993 677465 683263 715392 734398 732780
12197 732780 719629 682814 657222 670230 651123 621224 647533 660241 687465 672043 687022
12186 687022 688649 667538 686545 712363 708930 692867 679678 657446 635607 620485 626932 630253
12174 630253 658792 694984 709356 704462 721169 755259 759348 771970 777153 785952 778710 762685
12162 762685 760118 780262 805738 817957 787625 784015 744393 709505 763666 797327 799085 832208
$$ packed form
12246D48758j3995K9514L1400p1376j0011K3981J3125k263J4379J1629l561L6903
12234E08483K1401O142p15m417J7122O0849K8212O6157L3922j707j4568M840l4775
12221F90946k6480J0828K406k2280J0426n936N519p143m573k3150K2455K1428
12209F74446o456j9383L0589K6410J4362o923k4052j1528N798L2129J9006j618
12197G32780j3151l6815k5592J3008j9107k9899K6309J2708K7224j5422J4979
12186F87022J627k1111J9007K5818l433j6063j3189k2232k1839j5122O447L321
12174F30253K8539L6192J4372m894J6707L4090M089J2622N183Q799p242j6025
12162G62685k567K0144K5476J2219l0332l610l9622l4888N4161L3661J758L3123
$$ plain form
12150 832208 844664 844071 849824 841654 810407 791753 845949 890829 893356 905616 946543 945464 958799
12137 958799 956266 952098 987631 1026182 1071867 1081950 1096432 1139736 1121347 1127023 1145102 1151912
12125 1151912 1123460 1135685 1173694 1201994 1256358 1294904 1334580 1391759 1373875 1391024 1458980
12114 1458980 1463957 1486767 1553784 1586136 1603793 1619055 1636106 1710436 1781779 1832780 1898874
12103 1898874 1938114 2007635 2124364 2264933 2338591 2414872 2572726 2662854 2757897 2887883
12093 2887883 3078292 3262825 3422653 3636511 3892212 4196589 4503548 4858292 5205577
12084 5205577 5552129 6022645 6599626 7281045 8033849 8873225 9831631 10911411 12155952
12075 12155952 13551344 15037454 16634796 18315356 19924902 21413609 22672974 23543408
$$ packed form
12150H32208J2456n93N753q170l1247j8654N4196M4880K527J2260M0927j079J3335
12137I58799k533m168L5533L8551M5685J0083J4482M3304j8389N676J8079O810
12125A151912k8452J2225L8009K8300N4364L8546L9676N7179j7884J7149O7956
12114A458980M977K2810O7017L2352J7657J5262J7051P4330P1343N1001O6094
12103A898874L9240O9521J16729J40569P3658P6281J57854R0128R5043J29986
12093B887883J90409J84533J59828K13858K55701L04377L06959L54744L47285
12084E205577L46552M70516N76981O81419P52804Q39376R58406J079780J244541
12075A2155952J395392J486110J597342J680560J609546J488707J259365Q70434
$$ plain form
12067 23543408 24070160 24249391 24046905 23604286 22959494 22211981 21473957 20781267 20210048
12058 20210048 19789679 19572791 19478628 19539037 19821257 20251496 20799918 21428335 22120317 22779844
12048 22779844 23318900 23627253 23711276 23710265 23669003 23642035 23669938 23829503 24142253 24549142
12038 24549142 25087837 25722128 26385387 27053065 27618570 28050716 28359323 28501803 28553855
12029 28553855 28520769 28332762 28107330 27757371 27312837 26628329 25721518 24687438 23565598
12020 23565598 22378501 21196668 20139264 19245946 18461568 17818035 17287424 16973897 16834244
12011 16834244 16763854 16796691 17020370 17309894 17693300 18109686 18543800 18965961 19346593 19558985
12001 19558985 19611940 19408018 18999832 18379058 17644813 16808408 15904738 14950069 13981575
$$ packed form
12067B3543408N26752J79231k02486m42619o44792p47513p38024o92690n71219
12058B0210048m20369k16888r4163O0409K82220M30239N48422O28417O91982O59527
12048B2779844N39056L08353Q4023j011m1262k6968K7903J59565L12750M06889
12038B4549142N38695O34291O63259O67678N65505M32146L08607J42480N2052
12029B8553855l3086j88007k25432l49959m44534o84508r06811j034080j121840
12020B3565598j187097j181833j057404q93318p84378o43533n30611l13527j39653
12011A6834244p0390L2837K23679K89524L83406M16386M34114M22161L80632K12392
12001A9558985N2955k03922m08186o20774p34245q36405r03670r54669r68494
$$ plain form
11992 13981575 13057153 12191628 11408089 10683920 10050950 9519369 9033705 8604653 8266734
11983 8266734 7939056 7575893 7307207 7074616 6842558 6674858 6518119 6387524 6291278 6195550
11973 6195550 6060483 5993258 5957556 5957407 5999229 6007741 5969041 5965102 5977371 6010036 6072675 6143849
11961 6143849 6243058 6389137 6497324 6598527 6745175 6863458 7021936 7201449 7398414 7587300
11951 7587300 7735770 7953666 8176313 8388153 8621236 8892679 9210628 9474335 9778049
11942 9778049 10120400 10445353 10780887 11162349 11562645 12013582 12480475 12919752 13384213
11933 13384213 13905220 14459019 15001780 15571526 16128816 16717464 17342561 18023742 18707944
11924 18707944 19349746 20006504 20678780 21357452 22015121 22672922 23314344 23893415 24415516
$$ packed form
11992A3981575r24422q65525p83539p24169o32970n31581m85664m29052l37919
11983H266734l27678l63163k68686k32591k32058j67700j56739j30595r6246r5728
11973F195550j35067o7225l5702j49M1822Q512l8700l939J2269L2665O2639P1174
11961F143849R9209J46079J08187J01203J46648J18283J58478J79513J96965J88886
11951G587300J48470K17896K22647K11840K33083K71443L17949K63707L03714
11942I778049L42351L24953L35534L81462M00296M50937M66893M39277M64461
11933A3384213N21007N53799N42761N69746N57290N88648O25097O81181O84202
11924A8707944O41802O56758O72276O78672O57669O57801O41422N79071N22101
$$ plain form
11915 24415516 24966658 25412221 25831024 26172959 26443570 26635969 26768112 26870870 26876472 26729207
11905 26729207 26527803 26274472 26001342 25651318 25252366 24761462 24267228 23762910 23196644
11896 23196644 22563953 21906894 21258535 20626197 20008246 19385949 18737853 18084217 17478481
11887 17478481 16921412 16372313 15776055 15145661 14588990 14064636 13588881 13104909 12602041
11878 12602041 12113843 11675893 11303191 10883459 10488521 10088323 9673197 9268764 8970971
11869 8970971 8711664 8409394 8123802 7831124 7582144 7350376 7077597 6838203 6586748
11860 6586748 6410015 6208423 5987712 5807451 5635024 5463028 5287023 5056723 4887364
11851 4887364 4760926 4619609 4490903 4365369 4250331 4125413 3980485 3877750 3792973 3668870
$$ packed form
11915B4415516N51142M45563M18803L41935K70611J92399J32143J02758N602j47265
11905B6729207k01404k53331k73130l50024l98952m90904m94234n04318n66266
11896B3196644o32691o57059o48359o32338o17951o22297o48096o53636o05736
11887A7478481n57069n49099n96258o30394n56671n24354m75755m83972n02868
11878A2602041m88198m37950l72702m19732l94938m00198m15126m04433k97793
11869H970971k59307l02270k85592k92678k48980k31768k72779k39394k51455
11860F586748j76733k01592k20711j80261j72427j71996j76005k30300j69359
11851D887364j26438j41317j28706j25534j15038j24918j44928j02735q4777j24103
$$ plain form
11841 3668870 3579918 3504963 3412970 3363221 3315835 3248707 3164621 3089137 3001329 2896678 2777344
11830 2777344 2718074 2638605 2558402 2522341 2466235 2408031 2373398 2326611 2289983 2232976 2176196
11819 2176196 2087394 2051430 2028205 1962807 1901256 1887330 1851897 1839823 1767027 1727592 1734910
11808 1734910 1733028 1726015 1674754 1664098 1608394 1531726 1482060 1476580 1500251 1492320 1466579 1432046
11796 1432046 1364527 1269699 1217444 1182203 1203260 1213121 1191064 1157431 1148110 1151318 1143838 1169136
11784 1169136 1183082 1135271 1094676 1086589 1093810 1098554 1047690 1027740 987598 984787 956795 986740
11772 986740 975840 922048 923707 936247 901701 873241 850161 836503 820038 829941 798758 766419
11760 766419 783556 759790 745239 784366 814150 795715 764388 752114 757645 754896 708047 657770
$$ packed form
11841C668870q8952p4955r1993m9749m7386o7128q4086p5484q7808j04651j19334
11830B777344n9270p9469q0203l6061n6106n8204l4633m6787l6628n7007n6780
11819B176196q8802l5964k3225o5398o1551j3926l5433j2074p2796l9435P318
11808A734910j882p013n1261j0656n5704p6668m9666n480K3671p931k5741l4533
11796A432046o7519r4828n2255l5241K1057R861k2057l3633r321L208p480K5298
11784A169136J3946m7811m0595q087P221M744n0864j9950m0142k811k7992K9945
11772I86740j0900n3792J659J2540l4546k8460k3080j3658j6465R903l1183l2339
11760G66419J7137k3766j4551L9127K9784j8435l1327j2274N531k749m6849n0277
$$ plain form
11748 657770 610331 598613 592537 615525 618062 604563 608865 620139 639325 650117 648962 660385
11736 660385 660052 599451 616699 603564 583063 571971 599256 604750 597335 580504 564299 547377
11724 547377 516851 477294 451556 460319 442630 438307 432604 458564 447969 401233 397353 379324
11712 379324 368612 393336 442410 453929 482694 469873 461459 477697 467426 459343 432578 413563
11700 413563 410203 414983 420982 439424 442529 444384 442462 397106 350629 322005 333463 360405 354899
11687 354899 305091 294078 301774 329024 320481 287917 299080 315418 347416 378122 353526 361397
11675 361397 389486 400990 341809 313677 309103 276220 257700 294889 331739 318310 317788 305023
11663 305023 308170 320994 341377 331226 342082 318333 275262 277508 309098 305601 321922 300660
$$ packed form
11748F57770m7439j1718o076K2988K537j3499M302J1274J9186J0792j155J1423
11736F60385l33o0601J7248j3135k0501j1092K7285N494p415j6831j6205j6922
11724E47377l0526l9557k5738Q763j7689m323n703K5960j0595m6736l880j8029
11712C79324j0712K4724M9074J1519K8765j2821q414J6238j0271q083k6765j9015
11700D13563l360M780N999J8442L105J855j922m5356m6477k8624J1458K6942n506
11687C54899m9808j1013P696K7250q543l2564J1163J6338L1998L0706k4596P871
11675C61397K8089J1504n9181k8132m574l2883j8520L7189L6850j3429n22j2765
11663C05023L147J2824K0383j0151J0856k3749m3071K246L1590l497J6321k1262
$$ plain form
11651 300660 257055 251127 292036 328138 308104 291732 273195 269235 252685 231926 268689 320965
11639 320965 338876 349848 313762 250527 247905 275060 266953 270143 274725 290155 278910 286244
11627 286244 343497 348252 343796 351278 337669 291683 280583 280564 301708 318283 323218 331242 324971
11614 324971 277954 268620 251325 211137 215804 232797 235852 285392 346653 306085 285778 257127
11602 257127 274631 323644 325997 328646 309490 267187 278394 295771 298507 304280 325285 359134
11590 359134 317670 310030 309466 291760 318804 300390 277892 263324 252477 296216 318781 285856
11578 285856 288423 285700 248248 221148 236440 257772 238671 208985 184255 198381 194271 212181
11566 212181 225607 197149 209117 217867 178370 162767 226775 267868 262725 279263 238212 218575
$$ packed form
11651C00660m3605n928M0909L6102k0034j6372j8537l960j6550k0759L6763N2276
11639C20965J7911J0972l6086o3235k622K7155q107L190M582J5430j1245P334
11627B86244N7253M755m456P482j3609m5986j1100j9K1144J6575M935Q024o271
11614C24971m7017r334j7295m0188M667J6993L055M9540O1261m0568k0307k8651
11602B57127J7504M9013K353K649j9156m2303J1207J7377K736N773K1005L3849
11590C59134m1464p640n64j7706K7044j8414k2498j4568j0847M3739K2565l2925
11578B85856K567k723l7452k7100J5292K1332j9101k9686k4730J4126m110J7910
11566B12181J3426k8458J1968Q750l9497j5603O4008M1093n143J6538m1051j9637
$$ plain form
11554 218575 192538 168168 160257 127211 131968 155709 184347 173544 150317 141958 133789 160010
11542 160010 166925 162230 184879 175750 105214 92202 143005 142999 148489 168804 149170 132544 118679
11529 118679 126541 87938 58417 50296 94948 110419 102822 93285 88848 79205 89939 80816 46346
11516 46346 95361 102032 96769 94877 108845 141183 147090 113877 101012 68912 79758 81833 103338
11503 103338 88123 115909 115180 98536 103755 73396 135123 175543 166987 149635 96621 72557
11491 72557 63227 72276 66184 78634 105314 138293 134203 96813 89982 78917 69860 79088 56354
11478 56354 56323 69539 66769 79689 104162 128557 90861 84503 75761 72358 57024 38415 83464
11465 83464 108905 129134 120769 139814 169112 144982 113053 78722 28770 66014 109035 103309
$$ packed form
11554B18575k6037k4370p911l3046M757K3741K8638j0803k3227q359q169K6221
11542A60010O915m695K2649r129p0536j3012N0803oN490K0315j9634j6626j3865
11529A18679P862l8603k9521q121M4652J5471p597r537m437r643J0734r123l4470
11516D6346M9015O671n263j892J3968L2338N907l3213j2865l2100J0846K075K1505
11503A03338j5215K7786p29j6644N219l0359O1727M0420q556j7352n3014k4064
11491G2557r330R049o092J2450K6680L2979m090l7390o831j1065r057R228k2734
11478E6354l1J3216k770J2920K4473K4395l7696o358q742l403j5334j8609M5049
11465H3464K5441K0229q365J9045K9298k4130l1929l4331m9952L7244M3021n726
$$ plain form
11453 103309 121324 93507 82666 99031 130274 101741 78558 67250 88171 70810 55824
11442 55824 43676 30715 49765 95146 103253 62509 30848 16956 50639 59205 37737 52146
11430 52146 70744 43597 954 1769 12781 34881 66866 24416 21334 29754 53757 106328
11418 106328 101338 75510 22488 11351 17338 43588 46253 58195 72678 105700 119345 108588
11406 108588 97646 113043 113910 111971 125294 152305 151019 122732 108820 79800 88275 116236
11394 116236 139044 142886 97493 112468 136867 164877 163040 128055 85212 66278 64748 63447
11382 63447 95327 146503 147670 141609 107536 99171 140924 115833 120163 121787 89854 64740 58957
11369 58957 59304 82122 69471 35797 47403 45626 25560 42654 46706 37862 51336 22821 22758
$$ packed form
11453A03309J8015k7817j0841J6365L1243k8533k3183j1308K0921j7361j4986
11442E5824j2148j2961J9050M5381Q107m0744l1661j3892L3683Q566k1468J4409
11430E2146J8598k7147m2643Q15J1012K2100L1985m2450l082Q420K4003N2571
11418A06328m990k5828n3022j1137N987K6250K665J1942J4483L3022J3645j0757
11406A08588j0942J5397Q67j939J3323K7011j286k8287j3912k9020Q475K7961
11394A16236K2808L842m5393J4975K4399K8010j837l4985m2843j8934j530j301
11382F3447L1880N1176J167o061l4073q365M1753k5091M330J624l1933k5114n783
11369E8957L47K2818j2651l3674J1606j777k0066J7094M052q844J3474k8515o3
$$ plain form
11356 22758 53515 38460 8195 5542 16568 40894 6165 -551 -1611 33024 109843 126842
11344 126842 95223 63977 29437 28842 33737 41528 20024 2273 44433 55740 42750 68763
11332 68763 87694 85839 57763 92580 127508 89252 67147 71901 56219 35285 53483 42301
11320 42301 10892 30263 38976 26954 4040 -16893 -13436 -22651 -4724 -2100 -18985 -20391 -29386
11307 -29386 -17443 16732 830 -45465 -6188 20042 10115 18 56053 83346 52919 69973
11295 69973 38622 19955 31503 57910 78746 94362 111038 68079 54435 26070 24472 11976
11283 11976 4256 43709 52199 2973 14415 38070 82498 67990 73082 70453 62193 54934 50974
11270 50974 14638 30420 -5910 -45890 -51716 -69864 -79976 -53492 -24104 31579 51040 24650
$$ packed form
11356B2758L0757j5055l0265k653J1026K4326l4729o716j060L4635P6819J6999
11344A26842l1619l1246l4540n95M895P791k1504j7751M2160J1307j2990K6013
11332F8763J8931j855k8076L4817L4928l8256k2105M754j5682k0934J8198j1182
11320D2301l1409J9371Q713j2022k2914k0933L457r215J7927K624j6885j406q995
11307b9386J1943L4175j5902m6295L9277K6230r927j0097N6035K7293l0427J7054
11295F9973l1351j8667J1548K6407K0836J5616J6676m2959j3644k8365j598j2496
11283A1976p720L9453Q490m9226J1442K3655M4428j4508N092k629q260p259l960
11270E0974l6336J5782l6330l9980n826j8148j0112K6484K9388N5683J9461k6390
$$ plain form
11258 24650 23129 44931 78340 49643 51867 66502 24587 -16719 -30422 36386 45630 13977
11246 13977 14082 78105 128052 128711 159710 170635 170716 116208 103761 11500 12985 34463 38830
11233 38830 65960 82224 34331 14181 25422 56106 52791 14001 -11782 -37651 -21051 -21082
11221 -21082 -6654 39856 40446 22025 12690 -8733 31481 31586 56213 51565 34923 2231 10387
11208 10387 -30152 -26686 18630 44961 65381 79833 89065 68224 22650 -1235 2627 21405
11196 21405 14909 2832 -54681 -18594 33458 48687 69335 87369 46788 45198 57095 36008
11184 36008 70894 122816 121071 58901 26029 -5638 31585 62644 30723 2073 -18257 -28160
11172 -28160 -25443 -609 -6096 -8088 -54312 -62147 -43045 -20364 -3166 23073 86997 119134
$$ packed form
11258B4650j521K1802L3409k8697K224J4635m1915m1306j3703O6808R244l1653
11246A3977J05O4023M9947O59L0999J0925Q1n4508j2447r2261J485K1478M367
11233C8830K7130J6264m7893k0150J1241L0684l315l8790k5783k5869J6600l1
11221b1082J4428M6510N90j8421r335k1423M0214J05K4627m648j6642l2692Q156
11208A0387m0539L466M5316K6331K0420J4452R232k0841m5574k3885L862J8778
11196B1405o496j2077n7513L6087N2052J5229K0648J8034m0581j590J1897k1087
11184C6008L4886N1922j745o2170l2872l1667L7223L1059l1921k8650k0330r903
11172b8160K717K4834n487j992m6224p835J9102K2681J7198K6239O3924L2137
$$ plain form
11160 119134 116470 78976 46525 61909 103236 131505 107006 53858 23803 6761 40808 67895
11148 67895 66893 77959 57381 12454 37100 32269 53684 78166 38141 31215 16074 10203
11136 10203 -18824 -6755 15039 26216 58781 57838 30480 49951 53468 30311 7157 24809
11124 24809 52142 33451 57172 95783 73365 37608 26826 26865 36584 33786 3598 -22156 7240
11111 7240 22590 13989 53459 86735 88902 72731 62353 45795 40997 39006 71618 101535 71464
11098 71464 68905 82106 73700 50227 48608 34099 -20460 -15 18403 74061 70526 52480
11086 52480 65991 60029 69724 33216 36340 27051 6859 -14723 5519 38698 53649 59001 44897
11073 44897 24156 15898 47758 57809 52266 18506 6601 13085 14613 59212 84329 29029
$$ packed form
11160A19134k664l7494l2451J5384M1327K8269k4499n3148l0055j7042L4047K7087
11148F7895j002J1066k0578m4927K4646m831K1415K4482m0025o926j5141n871
11136A0203k9027J2069K1794J1177L2565r43k7358J9471L517k3157k3154J7652
11124B4809K7333j8691K3721L8611k2418l5757j0782L9R719k798l0188k5754K9396
11111G240J5350q601L9470L3276K167j6171j0378j6558m798j991L2612K9917l0071
11098G1464k559J3201q406k3473j619j4509n4559K0445J8418N5658l535j8046
11086E2480J3511n962R695l6508L124r289k0192k1582K0242L3179J4951N352j4104
11073D4897k0741q258L1860J0051n543l3760j1905O484J528M4599K5117n5300
$$ plain form
11061 29029 31148 47066 67238 50701 15954 17777 41191 48988 36883 -12166 -10215 10557
11049 10557 35624 23139 14505 -3412 -11638 -25696 5276 44460 52247 35386 72316 91193
11037 91193 96756 102818 77661 89880 92628 98129 131108 141014 129476 140141 166986 181052 190144
11024 190144 222163 254314 271418 243807 205980 201702 204498 257346 314485 313268 300277 297073
11012 297073 307301 304427 278191 282319 248908 208719 229006 241662 272719 277749 251967 268113
11000 268113 224179 166938 156270 178474 199245 179052 130784 120556 161356 190527 155555
10989 155555 156658 152232 86284 47170 67918 104726 139867 148340 118251 62970 89451 72178
10977 72178 68060 41258 28066 43813 63472 58179 71896 45937 19397 23232 22982 18920 29464
$$ packed form
11061B9029K119J5918K0172j6537l4747J823K3414P797j2105m9049J951K0772
11049A0557K5067j2485q634j7917q226j4058L0972L9184P787j6861L6930J8877
11037I1193N563O062k5157J2219K748N501L2979R906j1538J0665K6845J4066R092
11024A90144L2019L2151J7104k7611l7827m278K796N2848N7139j217j2991l204
11012B97073J0228k874k6236M128l3411m0189K0287J2656L1057N030k5782J6146
11000B68113m3934n7241j0668K2204K0771k0193m8268j0228M0800K9171l4972
10989A55555J103m426o5948l9114K0748L6808L5141Q473l0089n5281K6481j7273
10977G2178m118k6802j3192J5747J9659n293J3717k5959k6540L835k50m062J0544
$$ plain form
10964 29464 14958 24022 -9403 -36102 -35355 -1244 38534 56150 67449 70235 56446 62262 64160
10951 64160 47557 37604 29616 29714 51191 12859 -16965 -22277 -10923 30305 47778 41683 33730
10938 33730 11719 18029 57133 50451 22544 23613 -10405 3979 18794 15844 68755 84506
10926 84506 83445 100732 48868 30413 26167 3727 -17909 -665 -35045 -14739 -2865 -4383
10914 -4383 1581 26019 41814 18926 24684 29711 46476 66223 75404 78826 122357 104199 72972
10901 72972 64293 37819 11048 -934 20637 5746 -3352 -15323 -14005 8758 40646 80453
10889 80453 50722 39050 -4343 -8960 14904 47696 37898 20255 22858 7773 14707 8315 25378
10876 25378 47062 46394 43665 43191 56242 88593 35336 27589 30529 30638 27007 28298 3790 -18586
$$ packed form
10964B9464j4506R064l3425k6699P47L4111L9778J7616J1299K786j3789N816J898
10951F4160j6603r953p988R8K1477l8332k9824n312J1354M1228J7473o095p953
10938C3730k2011O310L9104o682k7907J069l4018J4384J4815k950N2911J5751
10926H4506j061J7287n1864j8455m246k2440k1636J7244l4380K0306J1874j518
10914d383N964K4438J5795k2888N758N027J6765J9747R181L422M3531j8158l1227
10901G2972q679k6474k6771j1982K1571j4891r098j1971J318K2763L1888L9807
10889H0453k9731j1672m3393m617K3864L2792r798j7643K603j5085O934o392J7063
10876B5378K1684o68k729m74J3051L2351n3257p747K940J09l631J291k4508k2376
$$ plain form
10862 -18586 -8222 16488 40645 12484 5650 14289 3332 16945 23296 61146 87719 86187
10850 86187 56760 33937 -9088 -18105 18730 61421 78732 87207 65534 72797 74192 36511
10838 36511 11855 24223 29358 72460 82277 83273 96251 98491 63961 52076 76863 66944 42537
10825 42537 38592 26916 -866 5583 57445 74743 58841 51723 60839 36237 33909 40501 17043
10812 17043 -17649 -14678 12236 55150 65711 13633 33318 29208 28832 33622 25468 6985 16036
10799 16036 -18826 31425 58025 79730 76006 35537 1237 -2243 3681 23634 42046 45667
10787 45667 23721 -4399 839 9370 29345 30496 24114 8603 11124 843 3965 -31662 -15949
10774 -15949 -803 19737 75470 71489 67010 47619 24451 14068 -6308 -2788 11596 24389
$$ packed form
10862a8586J0364K4710K4157k8161o834Q639j0957J3613O351L7850K6573j532
10850H6187k9427k2823m3025r017L6835M2691J7311Q475k1673P263J395l7681
10838C6511k4656J2368N135M3102R817R96J2978K240l4530j1885K4787r919k4407
10825D2537l945j1676k7782O449N1862J7298j5902p118R116k4602k328O592k3458
10812A7043l4692K971K6914M2914J0561n2078J9685m110l76M790q154j8483R051
10799A6036l4862N0251K6600K1705l724m0469l4300l480N924J9953J8412L621
10787D5667k1946k8120N238Q531J9975J151o382j5511K521j0281L122l5627J5713
10774a5949J5146K0540N5733l981m479j9391k3168j0383k0376L520J4384J2793
$$ plain form
10762 24389 4480 4422 10302 30783 17367 32980 63451 80281 77966 59149 81174 58660 78533
10749 78533 115129 128319 113886 87050 94100 49313 18242 38960 2827 11374 50892 70573
10737 70573 85097 67733 78675 106985 123262 132415 98138 75529 121220 129980 86003 102273
10725 102273 135728 117656 106339 104511 101637 146767 171379 131540 160645 216480 236523 215783
10713 215783 207360 181681 179904 259468 343548 376433 427389 468489 438623 424095 385520 380041
10701 380041 375536 348325 328574 289170 304677 281552 261802 252394 254003 241073 243547 253892
10689 253892 246998 231098 231096 230331 216587 208823 191856 184979 190063 253694 248614 272644 278385 251581
10675 251581 190066 172259 150889 136394 187147 238278 270231 265246 230972 230942 232511 250442
$$ packed form
10762B4389j9909n8N880K0481j3416J5613L0471J6830k315j8817K2025k2514J9873
10749G8533L6596J3190j4433k6836P050m4787l1071K0718l6133Q547L9518J9681
10737G0573J4524j7364J0942K8310J6277R153l4277k2609M5691Q760m3977J6270
10725A02273L3455j8072j1317j828k874M5130K4612l9839K9105N5835K0043k0740
10713B15783q423k5679j777P9564Q4080L2885N0956M1100k9866j4528l8575n479
10701C80041m505k7211j9751l9404J5507k3125j9750r408J609j2930K474J0345
10689B53892o894j5900kp65j3744p764j6967o877N084O3631n080K4030N741k6804
10675B51581o1515j7807k1370j4495N0753N1131L1953m985l4274l0J569J7931
$$ plain form
10663 250442 271557 271054 208323 218673 217495 222915 154591 118613 168867 243416 281084 291450
10651 291450 287607 289349 256014 222800 263970 229996 251284 310469 356604 384357 412926 430379
10639 430379 482968 510376 546529 545878 554280 596700 661942 723596 785653 873749 930465 970067
10627 970067 1050389 1158464 1249274 1367921 1561152 1713326 1819427 1940099 2179913 2556270
10617 2556270 2996128 3575541 4323520 5302330 6631851 8312603 10417094 12839187 15234814
10608 15234814 17238254 18391313 18599519 18165214 17647875 17524196 18000438 19334993 21732151
10599 21732151 25236942 29639956 34160719 37709788 39196663 38370913 36208160 33937153
10591 33937153 32414304 32116284 33307241 36128663 40590503 46111215 51541304 55130882
$$ packed form
10663B50442K1115n03o2731J0350j178N420o8324l5978N0254P4549L7668J0366
10651B91450l843J742l3335l3214M1170l3974K1288N9185M6135K7753K8569J7453
10639D30379N2589K7408L6153o51Q402M2420O5242O1654O2057Q8096N6716L9602
10627I70067Q0322J08075R0810J18647J93231J52174J06101J20672K39814L76357
10617B556270M39858N79413P47979R78810J329521J680752K104491K422093K395627
10608A5234814K003440J153059K08206m34305n17339j23679M76242J334555K397158
10599B1732151L504791M403014M520763L549069J486875q25750k162753k271007
10591C3937153j522849k98020J190957K821422M461840N520712N430089L589578
$$ plain form
10583 55130882 55421867 52308348 47409697 42542942 38747559 36261422 35273819 35877640
10575 35877640 37741625 40409292 42932411 44014737 42850573 39562593 35356675 31354444
10567 31354444 28150969 25846288 24370864 23643326 23494002 23643874 23640400 23062668 21575487
10558 21575487 19314433 16704801 14224654 12082573 10380812 8944129 7782135 6856640
10550 6856640 6139979 5511658 4986943 4538305 4076720 3678899 3320303 3001767 2710409
10541 2710409 2440771 2194964 1974135 1775239 1605320 1447181 1323311 1229206 1130756 1045412
10531 1045412 956224 884228 866821 821096 769060 685709 606603 553594 521506 476965 441943
10520 441943 418422 387395 381639 369588 307617 281101 225247 217503 237606 288931 274148 234230
$$ packed form
10583E5130882K90985l113519m898651m866755l795383k486137r87603O03821
10575C5877640J863985K667667K523119J082326j164164l287980m205918m002231
10567C1354444l203475k304681j475424p27538j49324J49872l474n77732j487181
10558B1575487k261054k609632k480147k142081j701761j436683j161994r25495
10550F856640p16661o28321n24715m48638m61585l97821l58596l18536k91358
10541B710409k69638k45807k20829j98896j69919j58139j23870r4105r8450q5344
10531A045412q9188p1996j7407m5725n2036q3351p9106n3009l2088m4541l5022
10520D41943k3521l1027n756j2051o1971k6516n5854p744K0103N1325j4783l9918
$$ plain form
10508 234230 236075 257420 245284 256242 267005 258991 233139 221547 190597 192305 167760 164817
10496 164817 144234 127617 131747 151659 160853 141142 120562 162029 196523 176097 120846 142497
10484 142497 139918 119976 134505 156107 165151 168107 187834 227195 271527 331443 326045 374140
10472 374140 407908 426033 447433 447826 406875 365581 310681 255878 220263 207870 166373 195639
10460 195639 192031 158819 165518 157380 175949 226945 196384 154643 128014 117875 103125 98157
10448 98157 66313 87734 100199 95827 95020 93809 100978 117519 62695 31949 27023 55738 63270
10435 63270 79661 74585 65978 31628 27102 50162 48687 60887 64892 59522 91191 77187 62601
10422 62601 57450 57691 12174 3702 -7709 -926 12479 15960 -6446 -27348 -20740 332 12117
$$ packed form
10508B34230J845K1345j2136J0958J0763q014k5852j1592l0950J708k4545k943
10496A64817k0583j6617M130J9912R194j9711k0580M1467L4494k0426n5251K1651
10484A42497k579j9942J4529K1602R044K956J9727L9361M4332N9916n398M8095
10472C74140L3768J8125K1400L93m0951m1294n4900n4803l5615j2393m1497K9266
10460A95639l608l3212O699q138J8569N0996l0561m1741k6629j0139j4750m968
10448I8157l1844K1421J2465m372q07j211P169J6541n4824l0746m926K8715P532
10435F3270J6391n076q607l4350m526K3060j475J2200M005n370L1669j4004j4586
10422F2601n151K41m5517q472j1411O783J3405L481k2406k0902O608K1072J1785
$$ plain form
10409 12117 -13363 -10759 6265 12176 -12573 -33792 -29086 -10248 4197 32105 20754 13800
10397 13800 62163 64881 68073 76869 59689 58610 42747 48132 47341 28116 20794 23687 55058
10384 55058 45273 44092 71077 62123 31225 23447 55602 53539 50252 47541 66911 59828 41878
10371 41878 46093 65266 48458 27757 44337 29009 11835 36766 44548 56298 71340 64035
10359 64035 13982 34963 34120 -9779 -47272 -3627 22054 -1668 -24412 -22165 13053 28443
10347 28443 -5431 -10725 14065 39363 76675 110246 95240 65285 24878 -14730 -45730 -43034
10335 -43034 -14407 -32490 -40929 -29446 -55642 -48768 10230 49126 29126 8324 2792 2222 25995
10322 25995 66217 62004 54544 3042 -24902 4450 78332 64441 33042 24191 38769 9316
$$ packed form
10409A2117k5480K604J7024N911k4749k1219M706J8838J4445K7908j1351o954
10397A3800M8363K718L192Q796j7180j079j5863N385p91j9225p322K893L1371
10384E5058r785j181K6985q954l0898p778L2155k063l287k711J9370p083j7950
10371D1878M215J9173j6808k0701J6580j5328j7174K4931P782J1750J5042p305
10359F4035n0053K0981q43m3899l7493M3645K5681k3722k2744K247L5218J5390
10347B8443l3874n294K4790K5298L7312L3571j5006k9955m0407l9608l1000K696
10335d3034K8627j8083q439J1483k6196O874N8998L8896k0000k0802n532n70K3773
10322B5995M0222m213p460n1502k7944K9352P3882j3891l1399q851J4578k9453
$$ plain form
10310 9316 -7359 11489 1654 21224 38988 26442 6228 36524 34270 45792 47535 51914 27598
10297 27598 19367 38815 39003 40580 35401 14841 12082 30430 36015 40864 33699 11947 -63195
10284 -63195 -87517 -30301 14244 30027 38161 29972 35794 31273 -4216 -21618 13113 23643
10272 23643 40423 24540 -2564 5036 27319 2130 -9204 16233 32607 9819 34324 15072
10260 15072 10281 -517 -9059 -21685 -16930 -28718 -8449 30599 64036 67268 48103 44051 36671
10247 36671 17198 -469 4631 -10429 -3175 3696 2492 -41473 -47722 23388 25276 43127 31619
10234 31619 33886 14714 -23463 -35304 -69504 -65782 -66363 -48434 -18922 16294 -8214 1084 21484
10221 21484 25761 -4927 -12118 31364 8887 -2290 31275 59007 86056 30856 -20285 -45431
$$ packed form
10310I316j6675J8848r835J9570J7764j2546k0214L0296k254J1522J743M379k4316
10297B7598q231J9448J88J577n179k0560k759J8348N585M849p165k1752p5142
10284f3195k4322N7216M4545J5783Q134q189N822m521l5489j7402L4731J0530
10272B3643J6780j5883k7104P600K2283k5189j1334K5437J6374k2788K4505j9252
10260A5072m791j0798q542j2626M755j1788K0269L9048L3437L232j9165m052p380
10247C6671j9473j7667N100j5060P254O871j204m3965o249P1110J888J7851j1508
10234C1619K267j9172l8177j1841l4200L722n81J7929K9512L5216k4508R298K0400
10221B1484M277l0688p191M3482k2477j1177L3565K7732K7049n5200n1141k5146
$$ plain form
10209 -45431 -32689 -21467 -19427 -14566 -17223 -20538 -53297 -33258 -20392 -36659 8589 34332
10197 34332 31581 32344 41671 41696 67094 30513 20137 5802 26817 43471 38495 16677 30743
10184 30743 32382 16367 25519 14022 32116 55162 61402 62634 71735 96521 64747 15488 42183
10171 42183 94930 119412 102395 67379 69898 87395 81770 85324 136935 217609 221944 177414
10159 177414 188279 214164 236676 209179 184659 188577 214836 205290 235885 250911 295777 339347
10147 339347 336172 338153 334162 265780 218985 189104 215749 198951 178084 179810 172260 186663
10135 186663 200231 173749 170938 176225 204090 176585 138728 137657 125264 119363 143733 155100
10123 155100 126701 86069 87495 83544 106097 76922 14686 -38984 -48313 -31030 -14170 -17422
$$ packed form
10209d5431J2742J1222K040M861k657l315l2759K0039J2866j6267M5248K5743
10197C4332k751P63R327K5K5398l6581j0376j4335K1015J6654m976k1818J4066
10184C0743J639j6015R152j1497J8094K3046O240J232R101K4786l1774m9259K6695
10171D2183N2747K4482j7017l5016K519J7497n625L554N1611Q0674M335m4530
10159A77414J0865K5885K2512k7497k4520L918K6259r546L0595J5026M4866M3570
10147C39347l175J981l991o8382m6795k9881K6645j6798k0867J726p550J4403
10135A86663J3568k6482k811N287K7865k7505l7857j071j2393n901K4370J1367
10123A55100k8399m0632J426l951K2553k9175o2236n3670r329J7283J6860l252
$$ plain form
10111 -17422 -20234 -17695 22048 61899 71370 59863 51289 22928 10939 38326 29674 -13866 17372
10098 17372 16567 -20559 -28599 -40448 -40789 -10749 21574 20447 8201 -795 9547 -1762 -34484
10085 -34484 -23376 -13515 25322 28568 40399 79695 115486 140242 78677 22080 -20835 -24645
10073 -24645 -23228 -9768 -22504 -46205 -14741 -23779 -24001 17037 4438 4852 -10353 -41604 -30265
10060 -30265 8211 14654 -7391 8487 -4488 -17869 33647 43401 25129 1830 -17374 -4482
10048 -4482 9037 18542 17946 24223 -251 2963 15585 12842 18044 40316 18680 33550 47842
10035 47842 54427 56192 50746 51884 56941 51366 53213 51103 53746 62082 52720 54372 29714 24363
10021 24363 17688 11575 24400 30419 18035 19514 -12795 -22406 -51435 -44938 -52003 2168 12192
$$ packed form
10111a7422k812K539L9743L9851R471j1507q574k8361j1989K7387q652m3540L1238
10098A7372q05l7126q040j1849l41L0040L2323j127j2246q996J0342j1309l2722
10085c4484J1108R861L8837L246J1831L9296L5791K4756o1565n6597m2915l810
10073b4645J417J3460j2736k3701L1464r038k22M1038j2599M14j5205l1251J1339
10060c0265L8476O443k2045J5878j2975j3381N1516R754j8272k3299j9204J2892
10048d482J3519R505n96O277k4474L214J2622k743N202K2272k1636J4870J4292
10035D7842O585J765n446J138N057n575J847k110K643Q336r362J652k4658n351
10021B4363o675o113J2825O019j2384J479l2309r611k9029O497p065N4171J0024
$$ plain form
10008 12192 14439 -11619 15119 13014 -5537 -13862 -5256 6705 11758 -31051 -21238 24108 18201
9995 18201 4779 6198 -11582 16396 22994 3563 16782 63140 75349 52063 -760 8461
9983 8461 35646 21210 18233 -26451 -60227 -68103 -37130 -24043 -37662 -59018 -101087 -110244 -56706
9970 -56706 -69813 -68034 -81621 -63439 -344 24188 -10343 -19710 4854 17081 -43862 -89826
9958 -89826 -57329 -5912 7253 -14553 -50371 -48107 -30245 -5759 -5052 -24979 -22847 -20764 4941
9945 4941 27025 32549 53778 31476 18581 44717 25708 -12012 -25601 -12382 -7883 25242
9933 25242 72820 113489 106571 83740 52100 -2226 -38362 -64642 -51798 -32004 -23443 -13627
9921 -13627 17152 21267 35412 25513 7613 -1189 6781 -13579 6918 -1989 -4580 10636 -14755
$$ packed form
10008A2192K247k6058K6738k105j8551q325Q606J1961N053m2809R813M5346n907
9995A8201j3422J419j7780K7978O598j9431J3219M6358J2209k3286n2823R221
9983H461K7185j4436k977m4684l3776p876L0973J3087j3619k1356m2069r157N3538
9970e6706j3107J779j3587J8182O3095K4532l4531r367K4564J2227o0943m5964
9958h9826L2497N1417J3165k1806l5818K264J7862K4486P07j9927K132K083K5705
9945D941K2084N524K1229k2302j2895K6136j9009l7720j3589J3219M499L3125
9933B5242M7578M0669o918k2831l1640n4326l6136k6280J2844J9794Q561R816
9921a3627L0779M115J4145r899j7900q802P970k0360K0497q907k591J5216k5391
$$ plain form
9908 -14755 -46975 -36279 -20559 -5270 -37206 -59453 -54427 -68453 -76639 -51682 -19992 -9203
9896 -9203 -9309 -15923 -23677 -12474 12187 -3456 -8850 1463 10140 -6923 -27055 -39050 -25080
9883 -25080 -14397 -131 5192 -8398 -32452 -15479 11745 69543 94659 44223 11331 17418
9871 17418 7742 -12352 -6103 13524 32551 29001 42465 53497 29516 21591 -2649 -61825 -47328
9858 -47328 6669 -9780 -37625 -37349 -18982 -40997 -39366 10326 10366 -9298 -21206 -21046 -17863 -26144
9844 -26144 -24933 -28246 -31922 -65240 -73020 -81836 -70487 -11080 37048 48656 19224 6398 -40759
9831 -40759 -55079 -35453 -7151 6647 18817 1980 9805 3690 -4924 -1836 5600 31923 16664
9818 16664 5950 -5778 -36240 -34931 -50225 -83804 -50561 -2216 24307 28930 42521 39545
$$ packed form
9908a4755l2220J0696J5720J5289l1936k2247N026j4026q186K4957L1690J0789
9896i203j06o614p754J1203K4661j5643n394J0313Q677j7063k0132j1995J3970
9883b5080J0683J4266N323j3590k4054J6973K7224N7798K5116n0436l2892O087
9871A7418r676k0094O249J9627J9027l550J3464J1032k3981p925k4240n9176J4497
9858d7328N3997j6449k7845K76J8367k2015J631M9692M0j9664j1908J60L183q281
9844b6144J211l313l676l3318p780q816J1349N9407M8128J1608k9432j2826m7157
9831d0759j4320J9626K8302J3798J2170j6837P825o115q614L088P436K6323j5259
9818A6664j0714j1728l0462J309j5294l3579L3243M8345K6523M623J3591k976
$$ plain form
9806 39545 -16544 -69623 -68683 -77645 -89844 -58930 -25132 -13010 -27367 -32865 -17170 26943 33296
9793 33296 5494 -28051 -56637 -89709 -75099 -40224 -43335 -14946 42247 33851 9697 31131
9781 31131 37644 -4671 -42781 -51419 -19590 -2747 -48414 -51312 -48874 -60337 -88506 -98562 -95489
9768 -95489 -61918 -28790 -14108 -324 -3741 -36752 -43390 -41456 -51826 -37394 -21105 -43695
9756 -43695 -22396 -22187 -32300 -85864 -71880 -46651 -55027 -47608 -4748 28302 70232 67458 75127
9743 75127 68520 37128 6000 -19372 -35629 -3419 24828 4387 -28478 -17317 15334 -10491
9731 -10491 -50457 -39311 -14504 -14621 -7249 6391 86465 122284 93233 90701 83158 38871 9082
9718 9082 -20138 -39284 -61327 -25492 -10364 -23481 -74936 -90329 -93949 -76208 -74984 -65539 -76980
$$ packed form
9806C9545n6089n3079R40q962j2199L0914L3798J2122j4357n498J5695M4113O353
9793C3296k7802l3545k8586l3072J4610L4875l111K8389N7193q396k4154K1434
9781C1131O513m2315l8110q638L1829J6843m5667k898K438j1463k8169j0056L073
9768i5489L3571L3128J4682J3784l417l3011o638J934j0370J4432J6289k2590
9756d3695K1299K09j0113n3564J3984K5229q376P419M2860L3050M1930k774P669
9743G5127o607l1392l1128k5372j6257L2210K8247k0441l2865J1161L2651k5825
9731a0491l9966J1146K4807j17P372J3640Q0074L5819k9051k532p543m4287k9789
9718I082k9220j9146k2043L5835J5128j3117n1455j5393l620J7741J224R445j1441
$$ plain form
9705 -76980 -88500 -115557 -110724 -74535 -2948 14955 -3457 -59188 -53354 -52355 -75451 -53471 -32572
9692 -32572 -16369 6090 23331 13606 -513 -43675 -22557 3198 29394 61830 76326 39094
9680 39094 5405 -7649 40235 54803 33200 22366 43085 35645 33220 28790 8255 -16443
9668 -16443 15317 -14648 -14370 -28515 -42199 12454 36241 47169 54569 8620 8017 28436 34947
9655 34947 28326 22358 46247 42261 30046 37521 41852 88034 102263 148986 237056 271595 238202
9642 238202 147525 95746 81853 103367 87650 21617 3246 2652 2378 19811 9723 -19219
9630 -19219 33771 75223 60335 40852 48025 38640 8549 -2354 -4928 331 -20264 -4160 -37260
9617 -37260 -30935 -3412 19408 30621 9237 -39607 -36601 -19515 -14427 30577 45771 25159
$$ packed form
9705g6980j1520k7057M833L6189P1587J7903j8412n5731N834R99k3096K1980K0899
9692c2572J6203K2459J7241r725j4119m3162K1118K5755K6196L2436J4496l7232
9680C9094l3689j3054M7884J4568k1603j0834K0719p440k425m430k0535k4698
9668a6443L1760k9965K78j4145j3684N4653K3787J0928P400m5949o03K0419O511
9655C4947o621n968K3889l986j2215P475M331M6182J4229M6723Q8070L4539l3393
9642B38202r0677n1779j3893K1514j5717o6033j8371n94k74J7433j0088k8942
9630a9219N2990M1452j4888j9483P173r385l0091j0903k574N259k0595J6104l3100
9617c7260O325K7523K2820J1213k1384m8844L006J7086N088M5004J5194k0612
$$ plain form
9605 25159 54490 50589 19127 17897 15179 7450 25456 58417 98645 106336 84559 21813 -25585
9592 -25585 -27138 10184 44578 27856 37673 8872 15889 35662 38118 23221 -15763 -13748 7199
9579 7199 12640 -23127 -46086 -40402 -16050 -26685 -40281 -70760 -48760 -46327 -59714 -34215 6892
9566 6892 4907 -37998 -26150 -14004 -52453 -66257 -50569 -65132 -100091 -72036 -49077 -44041
9554 -44041 -29345 -30153 -55746 -11101 39143 12773 -7477 10740 19260 2414 -19268 -38620
9542 -38620 -49712 -33061 -20305 -25882 -27459 -64750 -32925 4552 29815 19254 -21489 -11372
9530 -11372 -6431 27602 64976 27930 7544 -17697 2076 71699 67091 47594 33124 70193
9518 70193 95414 80719 58734 26999 40793 60109 32099 -5364 12903 61192 52814 23005
$$ packed form
9605B5159K9331l901l1462j230k718p729J8006L2961M0228P691k1777o2746m7398
9592b5585j553L7322L4394j6722R817k8801P017J9773K456j4897l8984K015K0947
9579G199N441l5767k2959N684K4352j0635j3596l0479K2000K433j3387K5499M1107
9566F892j985m2905J1848J2146l8449j3804J5688j4563l4959K8055K2959N036
9554d4041J4696q08k5593M4645N0244k6370k0250J8217Q520j6846k1682j9352
9542c8620j1092J6651J2756n577j577l7291L1825L7477K5263j0561m0743J0117
9530a1372M941L4033L7374l7046k0386k5241J9773O9623m608j9497j4470L7069
9518G0193K5221j4695k1985l1735J3794J9316k8010l7463J8267M8289q378k9809
$$ plain form
9506 23005 22702 13695 -12308 -11391 28587 50146 33893 43268 28431 33356 35337 45984 16405
9493 16405 -10297 -20927 -1369 -6127 -5720 19863 23284 55571 87631 82788 71188 28169 5043
9480 5043 18707 38644 39848 21839 32051 38749 34236 41069 69139 64473 48496 68685 23940
9467 23940 14975 -6084 8015 -28099 -36839 -21829 -2689 29265 12119 -41 2566 5494 36960
9454 36960 42015 22796 3543 32279 1708 -42098 -35243 -23351 8644 -21703 -543 1186
9442 1186 47321 24663 37318 62511 91152 25110 -1339 18135 47603 65341 88583 39908
9430 39908 30259 20737 47498 55190 36554 16325 -20032 10544 12597 18064 23395 -9094 2447
9417 2447 -11268 -38783 -19559 17726 35471 30228 22543 56870 67725 101208 98791 60437 40211
$$ packed form
9506B3005l03r007k6003R17L9978K1559j6253R375j4837M925J981J0647k9579
9493A6405k6702j0630J9558m758M07K5583L421L2287L2060m843j1600m3019k3126
9480E043J3664J9937J204j8009J0212O698m513O833K8070m666j5977K0189m4745
9467B3940q965k1059J4099l6114q740J5010J9140L1954j7146j2160K607K928L1466
9454C6960N055j9219j9253K8736l0571m3806O855J1892L1995l0347K1160J729
9442A186M6135k2658J2655K5193K8641o6042k6449J9474K9468J7738K3242m8675
9430C9908r649r522K6761P692j8636k0229l6357L0576K053N467N331l2489J1541
9417B447j3715k7515J9224L7285J7745n243p685L4327J0855L3483k417l8354k0226
$$ plain form
9404 40211 -1787 4928 29065 6858 -52238 -56181 -38763 9860 12750 26608 29786 20459 21376
9391 21376 36545 40568 63044 77927 58079 58445 76551 43184 9712 24305 53613 77747
9379 77747 77743 65314 11402 -16788 -16400 -4239 24208 30113 10185 26721 6742 35603 78192
9366 78192 68104 47581 47618 77887 61150 60298 49391 22015 11071 -34702 -34114 -19366 7918
9353 7918 -660 -7229 29808 58397 68388 58619 33849 12886 15731 6496 -21433 -13090 -1292
9340 -1292 5265 23317 17788 23902 57931 48549 37426 45703 33336 18612 17949 1863 16717
9327 16717 11239 -161 -42497 -4784 50763 96190 105512 68024 28115 20749 33795 62021
9315 62021 81420 58123 30946 41812 58156 74600 75728 75861 66369 41562 52114 81216 80757
$$ packed form
9404D0211m1998O715K4137k2207n9096l943J7418M8623K890J3858L178r327R17
9391B1376J5169M023K2476J4883j9848L66J8106l3367l3472J4593K9308K4134
9379G7747mj2429n3912k8190L88J2161K8447N905j9928J6536j9979K8861M2589
9366G8192j0088k0523L7L0269j6737q52j0907k7376j0944m5773N88J4748K7284
9353G918q578o569L7037K8589R991r769k4770k0963K845r235k7929Q343J1798
9340a292O557J8052n529O114L4029r382j1123Q277j2367j4724o63j6086J4854
9327A6717n478j1400m2336L7713N5547M5427R322l7488l9909p366J3046K8226
9315F2021J9399k3297k7177J0866J6344J6444J128J33r492k4807J0552K9102m59
$$ plain form
9302 80757 63232 20698 37503 95815 107193 112309 159581 184513 157473 124998 114702 147784
9290 147784 145708 161425 139357 133127 124198 204630 280392 311695 333161 422616 477877 523284
9278 523284 574154 658551 732075 834126 959909 1048086 1113113 1142441 1149947 1076864 1022727
9267 1022727 945909 860960 784382 700863 620216 584710 566623 515869 468459 408093 376092
9256 376092 372755 337300 317524 300854 297370 266227 199209 190453 148646 148101 182800 186301 158746
9243 158746 155272 163657 189134 165852 144083 119847 82585 85560 110536 114867 94924 103514 115542
9230 115542 99597 69057 70235 103332 93967 39780 7283 58000 106573 141424 138949 95513
9218 95513 90816 86914 83891 88283 84873 141336 175178 143940 102714 111182 142280 172331 155762
$$ packed form
9302H0757j7525m2534J6805N8312J1378N116M7272K4932k7040l2475j0296L3082
9290A47784k076J5717k2068o230q929Q0432P5762L1303K1466Q9455N5261M5407
9278E23284N0870Q4397P3524J02051J25783Q8177O5027K9328P506p3083n4137
9267A022727p6818q4949p6578q3519q0647l5506j8087n0754m7410o0366l2001
9256C76092l337l5455j9776j6670l484l1143o7018q756m1807n45L4699L501k7555
9243A58746l474Q385K5477k3282k1769k4236l7262K975K4976M331j9943Q590J2028
9230A15542j5945l0540J178L3097r365n4187l2497N0717M8573L4851k475m3436
9218I5513m697l902l023M392l410N6463L3842l1238m1226Q468L1098L0051j6569
$$ plain form
9205 155762 118793 77732 61247 -12793 -16406 30878 66487 45615 85129 120173 117100 88967
9193 88967 61069 47047 71015 40243 30543 13937 9229 2656 18064 39138 44469 -8482 8473
9180 8473 27881 -21761 -56309 -41908 -7977 -31073 -2142 7497 4103 43801 45397 33875 61893
9167 61893 84628 75354 32778 -7235 -13190 8090 -2747 -15325 -17741 -20861 4255 18162 36220
9154 36220 35328 49236 72498 98538 119264 132128 88765 64066 47267 39080 53523 80772
9142 80772 78215 91386 94346 113953 112564 104030 81172 101343 92525 105018 137199 195906 194808
9129 194808 232480 256545 273714 263775 278570 262062 236754 218323 175254 160258 133395 95488
9117 95488 83587 81171 95624 119616 115375 104005 70592 72669 101170 118324 140638 160928
$$ packed form
9205A55762l6969m1061j6485p4040l613M7284L5609k0872L9514L5044l073k8133
9193H8967k7898j4022K3968l0772r700j6606m708o573J5408K1074N331n2951J6955
9180H473J9408m9642l4548J4401L3931k3096K8931R639l394L9698J596j1522K8018
9167F1893K2735r274m2576m0013n955K1280j0837j2578k416l120K5116J3907J8058
9154C6220q92J3908K3262K6040K0726J2864m3363k4699j6799q187J4443K7249
9142H0772k557J3171K960J9607j389q534k2858K0171q818J2493L2181N8707j098
9129A94808L7672K4065J7169r939J4795j6508k5308j8431m3069j4996k6863l7907
9117I5488j1901k416J4453K3992m241j1370l3413K077K8501J7154K2314K0290
$$ plain form
9105 160928 180935 157089 132070 83906 73609 95863 108573 127731 135673 147556 145454 207726
9093 207726 195251 123679 133080 137514 123703 96982 101979 108253 104548 43660 45509 66000 100357
9080 100357 53793 -22914 -23128 7988 29403 -13815 -76332 -92848 -112254 -110621 -90393 -96110
9068 -96110 -122198 -102343 -37515 -12284 35560 88765 118730 141445 176317 190216 228827 272054
9056 272054 241800 203759 202840 188809 193843 219782 236109 206609 182143 199132 226733 190436
9044 190436 242634 305587 328294 330138 292337 249385 220787 246147 259818 229008 242834 259091
9032 259091 291077 291294 268207 272668 271846 237816 236056 263300 265685 234867 214265 219096 206306
9019 206306 223200 212480 240908 241409 225915 278391 273967 313108 338122 357709 398000 424276
$$ packed form
9105A60928K0007k3846k5019m8164j0297K2254J2710J9158P942J1883k102O2272
9093B07726j2475p1572R401M434j3811k6721M997O274l705o0888J849K0491L4357
9080A00357m6564p6707k14L1116K1415m3218o2517j6516j9406J633K0228n717
9068i6110k6088J9855O4828K5231M7844N3205K9965K2715L4872J3899L8611M3227
9056B72054l0254l8041r19j4031N034K5939J6327k9500k4466J6989K7601l6297
9044A90436N2198O2953K2707J844l7801m2952k8598K5360J3671l0810J3826J6257
9032B59091L1986K17k3087M461q22l4030j760K7244K385l0818k0602M831j2790
9019B06306J6894j0720K8428N01j5494N2476m424L9141K5014J9587M0291K6276
$$ plain form
9007 424276 431449 424500 437576 464214 452004 451388 458084 468788 461762 493457 480681 477065 450027
8994 450027 471875 455192 455831 459064 443630 459674 522338 527929 520581 537859 580900 609498 612256
8981 612256 620820 600878 583421 613300 627135 645396 661824 700455 708862 710737 693214 678143
8969 678143 721257 728416 785600 847831 887418 888077 857159 863046 860528 862830 808535 788883 775468
8956 775468 751203 762631 778977 775590 763952 774886 770421 823498 842474 862964 899773 941077
8944 941077 1003114 1018522 1003225 1040323 1081454 1133491 1176614 1196686 1267400 1321575 1350686 1392533
8932 1392533 1424247 1426648 1484563 1559510 1623218 1685344 1730126 1782573 1871457 1947741 2055077
8921 2055077 2142760 2210746 2304758 2399528 2498020 2569481 2666214 2793442 2918294 3057588 3262323
$$ packed form
9007D24276P173o949J3076K6638j2210o16O696J0704p026L1695j2776l616k7038
8994D50027K1848j6683O39L233j5434J6044O2664N591p348J7278M3041K8598K758
8981F12256Q564j9942j7457K9879J3835J8261J6428L8631Q407J875j7523j5071
8969F78143M3114P159N7184O2231L9587O59l0918N887k518K302n4295j9652j3415
8956G75468k4265J1428J6346l387j1638J0934m465N3077J8976K0490L6809M1304
8944I41077O2037J5408j5297L7098M1131N2037M3123K0072P0714N4175K9111M1847
8932A392533L1714K401N7915P4947O3708O2126M4782N2447Q8884P6284J07336
8921B055077Q7683O7986R4012R4770R8492P1461R6733J27228J24852J39294K04735
$$ plain form
8910 3262323 3480020 3686070 3875368 4123393 4394622 4662950 4962121 5341995 5719369 6182642
8900 6182642 6662721 7193966 7763520 8403939 9120543 9978163 11019157 12233361 13686553
8891 13686553 15409876 17436854 19776409 22556798 25748563 29473907 33787875 38938004
8883 38938004 45480652 54143011 65833040 81960660 104225026 134552598 174219086
8876 174219086 221449685 268343562 301770215 309825484 289783326 252128302 211259719
8869 211259719 175181708 145969220 123153797 105679449 92357598 82275334 74586711
8862 74586711 68541167 63356918 58379179 53330403 48188951 43235210 38689346 34590838
8854 34590838 30994833 27872376 25115170 22726081 20584623 18661226 16966532 15485493
$$ packed form
8910C262323K17697K06050J89298K48025K71229K68328K99171L79874L77374M63273
8900F182642M80079N31245N69554O40419P16604Q57620J040994J214204J453192
8891A3686553J723323K026978K339555K780389L191765L725344M313968N150129
8883C8938004O542648Q662359J1690029J6127620K2264366L0327572L9666488
8876A74219086M7230599M6893877L3426653Q055269k0042158l7655024m0868583
8869B11259719l6078011k9212488k2815423j7474348j3321851j0082264p688623
8862G4586711o045544n184249m977739n048776n141452m953741m545864m098508
8854C4590838l596005l122457k757206k389089k141458j923397j694694j481039
$$ plain form
8846 15485493 14213254 13079095 12024793 11065209 10213337 9460087 8796537 8240112 7647963
8837 7647963 7090837 6605988 6164157 5723409 5308307 4946776 4620796 4258462 3885301 3611616
8827 3611616 3373026 3156884 2967232 2787126 2638508 2532681 2450504 2351816 2190015 2050590
8817 2050590 1967110 1862164 1785888 1724715 1659048 1604144 1556788 1487816 1464145 1407765 1367188
8806 1367188 1328606 1278847 1199479 1151970 1156850 1139047 1107822 1026406 1009870 1028373 1006432 995637
8794 995637 992955 1000866 961938 923266 862262 821087 767658 730230 696568 666077 661607 661632 612970
8781 612970 562252 552597 532959 522883 552723 557384 537980 528898 531459 479673 475620 487218 486148
8768 486148 448316 424188 440143 409339 388361 375386 369990 375150 344991 321771 331772 400167
$$ packed form
8846A5485493j272239j134159j054302r59584q51872p53250o63550n56425n92149
8837G647963n57126m84849m41831m40748m15102l61531l25980l62334l73161k73685
8827C611616k38590k16142j89652j80106j48618j05827q2177r8688j61801j39425
8817B050590q3480j04946p6276o1173o5667n4904m7356o8972k3671n6380m0577
8806A367188l8582m9759p9368m7509M880j7803l1225q1416j6536J8503k1941j0795
8794I95637k682P911l8928l8672o1004m1175n3429l7428l3662l0491m470K5m8662
8781F12970n0718r655j9638j0076K9840M661j9404r082K561n1786m053J1598j070
8768D86148l7832k4128J5955l0804k0978j2975n396N160l0159k3220J0001O8395
$$ plain form
8756 400167 458276 463977 449618 423456 389837 403113 429618 422662 438659 467969 470306 481317
8744 481317 446534 440334 420724 391796 401720 354065 351294 338680 297645 278815 300394 320583
8732 320583 314659 326563 321748 310559 284872 255962 276790 275278 277605 272442 263642 328936 382446
8719 382446 378154 335468 329795 315122 295285 242046 228041 227655 215058 217705 176171 146171 157275
8706 157275 167056 133485 147235 154227 173868 195156 172337 152102 115547 141849 168029 168643
8694 168643 146146 156434 137629 90923 86366 78002 111094 124284 122486 208984 299503 355082
8682 355082 345781 315750 311266 330750 328357 319878 315629 303461 282876 236877 223689 272974 279629
8669 279629 250085 241854 252199 203992 201617 184192 214267 257574 249847 201546 206391 233075
$$ packed form
8756D00167N8109N701j4359k6162l3619J3276K6505o956J5997K9310K337J1011
8744D81317l4783o200j9610k8928R924m7655k771j2614m1035j8830K1579K0189
8732C20583n924J1904m815j1189k5687k8910K0828j512K327n163q800O5294N3510
8719C82446m292m2686n673j4673j9837n3239j4005l86j2597K647m1534l0000J1104
8706A57275R781l3571J3750O992J9641K1288k2819k0235l6555K6302K6180O14
8694A68643k2497J0288j8805m6706m557q364L3092J3190j798Q6498R0519N5579
8682C55082r301l0031m484J9484k393q479m249j2168k0585m5999j3188M9285O655
8669B79629k9544q231J0345m8207k375j7425L0075M3307p727m8301M845K6684
$$ plain form
8657 233075 241449 231426 212220 202936 177541 169305 145537 174454 179385 146055 113909 103480
8645 103480 76545 106371 130226 141377 149488 138568 111438 66662 70233 72338 97634 96467
8633 96467 41412 30377 74519 112926 144460 118009 142004 117669 62526 22772 52395 44837
8621 44837 16551 56225 61692 71212 110952 148099 149305 130052 144846 148424 138901 147760 126375
8608 126375 139192 140930 143526 130467 95345 125659 163683 190447 191126 156872 118232 76169
8596 76169 55785 84801 133338 115828 97378 96615 108267 92943 96967 114190 99730 83498
8584 83498 111594 148672 152352 161968 148096 168748 192661 184315 147750 164079 173843 139950 143292
8571 143292 150806 158994 140805 135709 157197 158792 138054 132352 107161 96556 78766 56669 23916
$$ packed form
8657B33075Q374j0023j9206r284k5395q236k3768K8917M931l3330l2146j0429
8645A03480k6935K9826K3855J1151Q111j0920k7130m4776L571K105K5296j167
8633I6467n5055j1035M4142L8407L1534k6451K3995k4335n5143l9754K9623p558
8621D4837k8286L9674N467R520L9740L7147J206j9253J4794L578r523Q859k1385
8608A26375J2817J738K596j3059l5122L0314L8024K6764O79l4254l8640m2063
8596G6169k0384K9016M8537j7510j8450p63J1652j5324M024J7223j4460j6232
8584H3498K8096L7078L680R616j3872K0652K3913q346l6565J6329R764l3893L342
8571A43292P514Q188j8189n096K1488J595k0738n702k5191j0605j7790k2097l2753
$$ plain form
8558 23916 -29971 -27292 -2382 26138 56102 32382 37148 77377 63062 75450 72269 100956
8546 100956 90921 41023 14911 -7631 -44380 3127 51768 53496 20499 -22944 -15980 -17101
8534 -17101 -45708 -56910 -46931 10593 39220 45799 9345 1283 41645 81016 100465 111278
8522 111278 121238 121045 90458 67156 80350 105018 84001 71782 92519 142035 99332 90427
8510 90427 92666 65325 53326 22995 20715 10267 35613 51278 56963 72613 85123 51636
8498 51636 57511 100727 97979 97674 120564 113282 96028 102305 114975 120419 126576 162263 165864 194624
8484 194624 226239 258775 306479 347318 373103 417338 472572 524790 615909 741872 833643
8473 833643 897506 991708 1088862 1108467 1076888 1048149 1005965 943916 874934 798024 723216 649344
$$ packed form
8558B3916n3887K679K4910K8520K9964k3720M766M0229j4315J2388l181K8687
8546A00956j0035m9898k6112k2542l6749M7507M8641J728l2997m3443O964j121
8534a7101k8607j1202R979N7524K8627O579l6454q062M0362L9371J9449J0813
8522A11278R960j93l0587k3302J3194K4668k1017j2219K0737M9516m2703q905
8510I0427K239k7341j1999l0331k280j0448K5346J5665N685J5650J2510l3487
8498E1636N875M3216k748l05K2890p282j7254O277J2670N444O157L5687L601K8760
8484A94624L1615L2536M7704M0839K5785M4235N5234N2218R1119J25963R1771
8473H33643O3863R4202R7154J9605l1579k8739m2184o2049o8982p6910p4808p3872
$$ plain form
8461 649344 602721 540337 501001 434583 376139 347314 297405 275291 244441 219533 224466 235907
8449 235907 237263 214497 156064 90401 68057 53573 62554 102230 136756 169116 176767 167279
8437 167279 151227 118891 70688 66657 39380 39236 17653 6058 13093 55506 44598 39890 41596
8424 41596 63693 32108 20984 10073 29285 25392 13945 30119 55927 47343 46311 72663
8412 72663 73537 66702 46815 55012 22886 11022 24644 34195 9414 7282 3939 13478 10770 31920
8398 31920 30799 -4214 -14193 -20786 -26193 -25711 -76100 -42272 -13017 -37088 2130 -3229 -10302
8385 -10302 2834 -28826 4437 33790 48585 83118 115186 97414 34878 -17262 -33866 -41018
8373 -41018 -38926 -66110 -40439 -39298 -15794 -22048 -50207 -30108 -9835 -30746 13232 -3508
$$ packed form
8461F49344m6623o2384l9336o6418n8444k8825m9909k2114l0850k4908M933J1441
8449B35907J356k2766n8433o5663k2344j4484Q981L9676L4526L2360P651r488
8437A67279j6052l2336m8203m031k7277j44k1583j1595P035M2413j0908m708J706
8424D1596K2097l1585j1124j0911J9212l893j1447J6174K5808q584j032K6352
8412G2663Q74o835j9887Q197l2126j1864J3622R551k4781k132l343R539k708K1150
8398C1920j121l5013r979o593n407M82n0389L3828K9255k4071L9218n359p073
8385a0302J3136l1660L3263K9353J4795L4533L2068j7772o2536n2140j6604p152
8373d1018K092k7184K5671J141K3504o254k8159K0099K0273k0911M3978j6740
$$ plain form
8361 -3508 -9342 10011 10967 -11468 -18226 -42552 -13285 42891 23390 10009 7637 -3936 40226
8348 40226 40307 26012 17229 633 -10781 -45531 -58336 -33267 9028 52530 75081 89423 119016
8335 119016 126359 119721 96870 89223 95550 81373 31944 3566 15982 -31867 -62846 -101006
8323 -101006 -82355 -45754 -4231 -41062 -27934 3598 11023 30363 29974 11494 8826 -532 2310
8310 2310 6794 21138 -16592 -1636 25875 14354 12744 -5531 -11568 -9837 -39204 -52302 -46440
8297 -46440 -36217 2562 -10488 -20346 -7380 1509 43508 94694 85155 44772 39986 63291 40711
8284 40711 33859 49458 31410 86225 86267 60611 24088 30381 -7796 28138 48427 3551 -16800
8271 -16800 -2199 17531 13147 12403 11987 18024 9582 472 10792 -6136 -44320 -31297 -35551 -32156
$$ packed form
8361c508n834J9353R56k2435o758k4326K9267N6176j9501j3381k372j1573M4162
8348D0226Q1j4295q783j6596j1414l4750j2805K5069M2295M3502K2551J4342K9593
8335A19016P343o638k2851p647O327j4177m9429k8378J2416m7849l0979l8160
8323a01006J8651L6601M1523l6831J3128L1532P425J9340l89j8480k668r358K842
8310B310M484J4344l7730J4956K7511j1521j610j8275o037J731k9367j3098N862
8297d6440J0223L8779j3050r858J2966Q889M1999N1186r539m0383m786K3305k2580
8284D0711o852J5599j8048N4815M2k5656l6523O293l8177L5934K0289m4876k0351
8271a6800J4601J9730m384p44m16O037q442r110J0320j6928l8184J3023m254L395
$$ plain form
8257 -32156 15271 26412 44800 33826 29486 5189 -8273 -9271 -31450 -50693 -65119 -40578
8245 -40578 -22285 -32239 21630 43898 33763 53647 35177 19735 34186 22843 27958 21649
8233 21649 46897 41817 42466 51924 106592 93342 85923 21546 19481 39243 6432 -1160 3427
8220 3427 23411 45792 43516 15864 28813 24865 -24506 -51819 -34086 -26162 40615 66313 67524
8207 67524 53973 36299 45550 25105 -12046 -339 9286 13088 34316 66870 61716 42492 -2467
8194 -2467 -4365 -3003 -28875 -30019 4865 -6972 -18488 -14991 -10515 -39677 -62533 -73050 -87435
8181 -87435 -86439 -81580 -50663 -13099 -24340 -26593 10483 1407 28067 40032 53964 25225 27448
8168 27448 58916 72692 43204 32794 29860 14699 -24848 -6637 -395 -8440 -36929 -17067
$$ packed form
8257c2156M7427J1141J8388j0974m340k4297j3462r98k2179j9243j4426K4541
8245d0578J8293r954N3869K2268j0135J9884j8470j5442J4451j1343N115o309
8233B1649K5248n080O49R458N4668j3250p419o4377k065J9762l2811p592M587
8220C427J9984K2381k276k7652J2949l948m9371k7313J7733P924O6777K5698J211
8207F7524j3551j7674R251k0445l7151J1707R625L802K1228L2554n154j9224m4959
8194b467j898J362k5872j144L4884j1837j1516L497M476k9162k2856j0517j4385
8181h7435R96M859L0917L7564j1241k253L7076r076K6660J1965J3932k8739K223
8168B7448L1468J3776k9488j0410k934j5161l9547J8211O242q045k8489J9862
$$ plain form
8156 -17067 -7208 -27756 -43542 -75047 -72593 -44989 -28616 -19109 -12827 -64822 -60984 -47738 -57343
8143 -57343 -90813 -87537 -50577 -18570 7681 -1828 6732 -18171 -34599 12178 13572 -32592 -9664
8130 -9664 20900 44569 -2650 -36425 4732 55003 25125 -6739 -10531 8074 15887 31495
8118 31495 56810 16120 -14544 -15520 -6240 -36063 -49588 -84518 -75318 -91758 -91271 -10125 29111
8105 29111 26983 -19834 -34704 -30860 -77905 -87793 -92456 -88453 -73363 -89008 -98230 -61047 -44825
8092 -44825 -60918 -78261 -52890 -6660 -8445 3981 -8904 5635 -6966 -17301 -32920 -57408
8080 -57408 -50512 -47254 -25710 -21303 19708 29705 4402 5296 6611 -14931 -24756 -12228 -26874
8067 -26874 -77090 -54754 -23213 2565 -15463 -31186 -18953 -29507 -36776 -18757 -36320 -35772
$$ packed form
8156a7067R859k0548j5786l1505K454K7604J6373R507O282n1995L838J3246r605
8143e7343l3470L276L6960L2007K6251r509Q560k4903j6428M6777J394m6164K2928
8130i664L0564K3669m7219l3775M1157N0271k9878l1864l792J8605P813J5608
8118C1495K5315m0690l0664r76R280k9823j3525l4930R200j6440M87Q1146L9236
8105B9111k128m6817j4870L844m7045r888m663M003J5090j5645r222L7183J6222
8092d4825j6093j7343K5371M6230j785J2426j2885J4539j2601j0335j5619k4488
8080e7408O896L258K1544M407M1011R997k5303Q94J315k1542r825J2528j4646
8067b6874n0216K2336L1541K5778j8028j5723J2233j0554p269J8019j7563N48
$$ plain form
8055 -35772 -70168 -65183 -38904 -30323 -4955 -14492 -5920 -5205 -34334 -36864 8500 -3080 -46720
8042 -46720 -66650 -20318 -36887 -17076 -18497 -53950 -41044 9000 6927 9712 39238 25617
8030 25617 2206 45930 79653 104052 62650 56653 33492 -3302 722 -1128 -20060 -3489
8018 -3489 1057 -37830 -48396 -40929 -8367 13146 5687 47740 42057 37528 7534 -27013 -18192
8005 -18192 -19436 -44078 -24827 -21280 9575 57003 72899 57131 15090 37659 22508 26471
7993 26471 13146 4257 2006 -8513 29136 8590 24720 18656 -6997 -9876 -22744 -13336 13709
7980 13709 45756 35047 5201 13887 -7311 -59531 -42085 -5477 -7174 -23774 -30125 1159
7968 1159 16725 8261 -13494 -31957 -2128 24260 33948 79914 79787 40477 -1786 -985 -43792
$$ packed form
8055c5772l4396M985K6279Q581K5368r537Q572P15k9129k530M5364j1580m3640
8042d6720j9930M6332j6569J9811j421l5453J2906N0044k073K785K9526j3621
8030B5617k3411M3724L3723K4399m1402n997k3161l6794M024j850j8932J6571
8018c489M546l8887j0566P467L2562K1513p459M2053n683m529k9994l4547Q821
8005a8192j244k4642J9251L547L0855M7428J5896j5768m2041K2569j5151L963
7993B6471j3325q889k251j0519L7649k0546J6130o064k5653k879j2868R408K7045
7980A3709L2047j0709k9846Q686k1198n2220J7446L6608j697j6600o351L1284
7968A159J5566q464k1755j8463K9829K6388R688M5966j27l9310m2263Q01m2807
$$ plain form
7955 -43792 -76465 -68643 -60423 -39803 -64583 -35040 5970 -5638 -28576 -20266 -37964 -42872 -2488
7942 -2488 17246 39322 2308 -36188 -53439 1921 22255 -9656 -14969 -4580 11885 8633
7930 8633 17218 8813 -16306 -16635 -35319 -55347 -22890 -8772 4281 -7742 -7035 1256 14859
7917 14859 -9344 -67243 -81430 -53050 -2245 -2197 -51750 -72311 -62231 -34045 -38683 -57807 -34320
7904 -34320 -27244 -28242 -33049 -27502 -63349 -54680 -54711 -49555 -27309 -40034 -54256 -32568 7317 4542
7890 4542 -25968 -72471 -72904 -31392 524 -3204 -20647 -25300 24649 32986 31381 39890 16678
7877 16678 -2456 -28437 -56165 -49451 -8436 -26851 -25960 -9488 -2189 -32522 -23965 -8243 1405
7864 1405 -26393 -61574 -62828 -37887 -31769 -44717 -6758 36140 17455 -3092 -11099 -21908 -11853
$$ packed form
7955d3792l2673P822Q220K0620k4780K9543M1010j1608k2938Q310j7698m908M0384
7942b488J9734K2076l7014l8496j7251N5360K0334l1911n313J0389J6465l252
7930H633Q585q405k5119l29j8684k0028L2457J4118J3053j2023P07Q291J3603
7917A4859k4203n7899j4187K8380N0805M8m9553k0561J0080K8186m638j9124K3487
7904c4320P076r98m807N547l5847Q669l1N156K2246j2725j4222K1688L9885k775
7890D542l0510m6503m33M1512L1916l728j7443m653M9949Q337j605Q509k3212
7877A6678j9134k5981k7728O714M1015j8415Q91J6472P299l0333Q557J5722R648
7864A405k7798l5181j254K4941O118j2948L7959M2898j8685k0547q007j0809J0055
$$ plain form
7851 -11853 25114 -8402 -40180 -42348 16243 3645 -78 -20529 -27773 -9074 4555 45097
7839 45097 65539 70816 78473 44069 -17186 -84339 -67879 -21599 -1092 -30649 -73609 -67758
7827 -67758 -46061 -88670 -98578 -68964 -46143 -23678 2504 1383 -19697 14406 21755 18030 18297
7814 18297 -4119 -22460 -35904 -25980 -33926 -6674 -565 -1788 -27269 -66321 -42613 -29224 -49339
7801 -49339 -10452 -17092 -71694 -74910 -36468 2052 6092 6280 136 -688 -2019 -15669 -50960 -54012
7787 -54012 -47056 -36235 -23750 -4634 -36788 -66073 -67690 -66838 -34518 -16806 -40498 -55532 -32076
7774 -32076 789 -11395 -22814 -51448 -42138 4856 9497 -9915 -12167 -6246 -6714 -38263 -14610
7761 -14610 13739 31495 27719 31479 42188 26247 25160 -7510 4070 -11976 -11926 -5139 -11971
$$ packed form
7851a1853L6967l3516l1778k168N8591j2598l723k0451p244J8699J3629M0542
7839D5097K0442N277P657l4404o1255o7153J6460M6280K0507k9557m2960N851
7827f7758K1697m2609r908K9614K2821K2465K6182j121k1080L4103P349l725K67
7814A8297k2416j8341j3444R924p946K7252O109j223k5481l9052K3708J3389k0115
7801d9339L8887o640n4602l216L8442L8520M040J88o144q24j331j3650l5291l052
7787e4012O956J0821J2485J9116l2154k9285j617Q52L2320J7712k3692j5034K3456
7774c2076L2865j2184j1419k8634R310M6994M641j9412k252N921m68l1549K3653
7761a4610K8349J7756l776L760J0709j5941j087l2670J1580j6046N0O787o832
$$ plain form
7748 -11971 -10044 -39626 -44845 -49845 -36343 -30137 -39987 -52665 -51633 -41543 -34388 2903 20037
7735 20037 -2183 -3266 5810 -15840 -22733 -36285 -57826 -34730 -12212 -16809 -46185 -62648 -31984
7722 -31984 -15608 22300 44650 39438 -3153 -40165 -45998 -39186 2167 20126 -19577 -43805
7710 -43805 -26233 -6154 -6283 -22720 -23796 -2826 -10284 32665 13461 -26539 -87154 -50812 -33629
7697 -33629 -5933 -28031 -36096 20259 29628 -5863 6928 15011 -38969 -19465 -8019 -24454
7685 -24454 -46803 -71019 -12926 -10858 -24072 -35694 -51582 -27018 -10665 -8940 34419 20052
7673 20052 -18997 -18392 -17133 8862 10660 -17048 -30893 2721 34383 9202 -1517 14087 5753
7660 5753 -23634 -56340 -40771 -9463 -13987 10340 18683 19956 -6005 -36144 -14666 -8481 -39645
$$ packed form
7748a1971J927k9582n219n000J3502O206r850j2678J032J0090P155L7291J7134
7735B0037k2220j083R076k1650o893j3552k1541K3096K2518m597k9376j6463L0664
7722c1984J6376L7908K2350n212m2591l7012n833O812M1353J7959l9703k4228
7710d3805J7572K0079j29j6437j076K0970p458M2949j9204m0000o0615L6342J7183
7697c3629K7696k2098q065N6355R369l5491J2791Q083n3980J9504J1446j6435
7685b4454k2349k4216N8093K068j3214j1622j5888K4564J6353J725M3359j4367
7673B0052l9049O05J259K5995J798k7708j3845L3614L1662k5181j0719J5604q334
7660E753k9387l2706J5569L1308m524K4327Q343J273k5961l0139K1478O185l1164
$$ plain form
7647 -39645 -71944 -55666 -10243 -4675 -30278 -45433 -55943 -75390 -73829 -25489 19196 -47440
7635 -47440 -82293 -58716 -94029 -131316 -88982 -42526 -4139 -36886 -67211 -25065 -30380 -13263
7623 -13263 -48229 -76858 -32962 24034 37347 475 -37166 -45143 -23036 -16321 19726 61013
7611 61013 19310 -25358 -17940 -8187 -9342 -3618 8499 13207 -1698 -54463 -54530 -5675 23196
7598 23196 44591 18763 -11264 -37272 -45169 -9715 -7379 27913 39945 22972 43600 29808
7586 29808 17188 9713 13700 18776 9911 31842 61114 22601 -37589 -87650 -105960 -71236 -58964
7573 -58964 -16090 -25679 -15625 -10607 -9428 -24686 -44117 -30449 12410 12430 -21817 -32567 -28529
7560 -28529 -8767 46339 33545 -13613 1810 14005 25625 5192 4876 5793 12229 23605 2572
$$ packed form
7647c9645l2299J6278M5423N568k5603j5155j0510j9447J561M8340M4685o6636
7635d7440l4853K3577l5313l7287M2334M6456L8387l2747l0325M2146n315J7117
7623a3263l4966k8629M3896N6996J3313l6872l7641p977K2107O715L6047M1287
7611F1013m1703m4668P418R753j155N724J2117M708j4905n2765o7M8855K8871
7598B3196K1395k5828l0027k6008p897L5454K336L5292J2032j6973K0628j3792
7586B9808j2620p475L987N076q865K1931K9272l8513o0190n0061j8310L4724J2272
7573e8964M2874r589J0054N018J179j5258j9431J3668M2859K0l4247j0750M038
7560b8529J9762N5106j2794m7158J5423J2195J1620k0433l16R17O436J1376k1033
$$ plain form
7547 2572 9762 -7291 2900 35689 53040 36174 4776 8838 -24855 -12048 -10624 -15713 -52487
7534 -52487 -16006 -47930 -58045 -38502 -12071 9981 28974 7639 -54393 -40606 -29301 -29427
7522 -29427 -22227 -37231 -48425 -45726 -28252 1645 -9854 -19641 3669 16568 42742 47136 33143
7509 33143 2148 4344 464 -35449 -34051 -3210 1122 12098 2701 -18608 -41001 -52818 -65709
7496 -65709 -63747 -72652 -47578 -44153 -41763 -55263 -55594 -21782 -7352 -9218 -1240 12836 -1928
7483 -1928 -23981 -33664 -50807 -67793 -70324 -50735 -82017 -103177 -95889 -95940 -46784 -8576 -27086
7470 -27086 -19998 33261 69437 31144 -10670 -32186 -19243 -7770 20344 51834 93347 70053
7458 70053 23446 30714 43625 26970 21052 4655 16744 8226 3722 -5372 -19643 -30932 -39006
$$ packed form
7547B572P190j7053J0191L2789J7351j6866l1398M062l3693J2807J424n089l6774
7534e2487L6481l1924j0115J9543K6431K2052J8993k1335o2032J3787J1305j26
7522b9427P200j5004j1194K699J7474K9897j1499r787K3310J2899K6174M394j3993
7509C3143l0995K196l880l5913J398L0841M332J0976r397k1309k2393j1817j2891
7496f5709J962q905K5074L425K390j3500l31L3812J4430j866P978J4076j4764
7483a928k2053r683j7143j6986k531J9589l1282k1160P288n1M9156L8208j8510
7470b7086P088N3259L6176l8293m1814k1516J2943J1473K8114L1490M1513k3294
7458G0053m6607P268J2911j6655n918j6397J2089q518m504r094j4271j1289q074
$$ plain form
7445 -39006 -55491 -77712 -29366 17 -8508 -11353 23260 27675 -12783 -31112 -23180 -23189 -11896
7432 -11896 -21355 -15443 28624 22278 -25149 -13087 45742 49384 -9995 -42547 -54443 -79059 -95811
7419 -95811 -80130 -36728 4398 -2306 -17409 -24111 50479 77086 37013 -29388 -7493 21628
7407 21628 -3439 -9889 -5963 444 -14276 -24705 -26769 -23520 -35925 -40540 -2629 13335 -58564
7394 -58564 -71566 -53822 -28220 19752 42981 26148 10287 24082 10289 -64013 -81062 -71136
7382 -71136 -20997 -30507 -27930 -24008 1795 -25346 -40037 13586 -3169 -39589 -80993 -37976
7370 -37976 921 10160 25210 19645 10169 26410 -26600 -72994 -78851 -66417 -16092 -12477 -16928
7357 -16928 4608 4801 -17843 -25328 15810 21189 -10658 -38229 -45669 -36070 -9089 -4364 -9316
$$ packed form
7445c9006j6485k2221M8346K9383q525k845L4613M415m0458j8329P932rJ1293
7432a1896r459N912M4067o346m7427J2062N8829L642n9379l2552j1896k4616j6752
7419i5811J5681M3402M1126o704j5103o702P4590K6607m0073o6401K1895K9121
7407B1628k5067o450L926O407j4720j0429k064L249j2405m615L7911J5964p1899
7394e8564j3002J7744K5602M7972K3229j6833j5861J3795j3793p4302j7049R926
7382g1136N0139r510K577L922K5803k7141j4691N3623j6755l6420m1404M3017
7370c7976L8897R239J5050n565r476J6241n3010m6394n857J2434N0325L615m451
7357a6928K1536J93k2644p485M1138N379l1847k7571p440R599K6981M725m952
$$ plain form
7344 -9316 -34293 -18733 -38931 -69819 -90124 -99068 -67210 -68776 -51889 -9394 17123 3264
7332 3264 26671 29707 42272 7811 30520 31395 -6630 -28592 -7442 4407 18071 33627 35947
7319 35947 7000 21106 -12024 -58502 -48151 -38525 -59441 -57940 -32624 -15333 -8641 10296
7307 10296 32467 38794 19369 41469 84596 41286 -29060 -41677 -53956 -27127 -4923 -21397
7295 -21397 -21271 -10552 -3974 9238 5083 -57419 -81425 -60452 -56770 -57198 -70577 -50489 -23630
7282 -23630 -2491 -8274 8601 17464 -17311 -48598 -10037 -12267 -18110 -5797 6122 -15802 -19474
7269 -19474 11027 780 5197 -16040 -7750 -6523 -12800 -13193 3440 -20740 -90158 -89343 -52020
7256 -52020 -2140 -9556 -45807 -59246 -46088 -11078 -221 -5527 23432 23602 -645 4740 14440
$$ packed form
7344i316k4977J5560k0198l0888k0305q944L1858j566J6887M2495K6517j3859
7332C264K3407L036J2565l4461K2709Q75l8025k1962K1150J1849J3664J5556K320
7319C5947k8947J4106l3130m6478J0351R626k0916J501K5316J7291O692J8937
7307A0296K2171O327j9425K2100M3127m3310p0346j2617j2279K6829K2204j6474
7295b1397J26J0719O578J3212m155o2502k4006K0973L682m28j3379K0088K6859
7282b3630K1139n783J6875Q863l4775l1287L8561k230n843J2313J1919k1924l672
7269a9474L0501j0247M417k1237Q290J227o277l93J6633k4180o9418Q15L7323
7256e2020M9880p416l6251j3439J3158L5010J0857n306K8959J70k4247N385R700
$$ plain form
7243 14440 -18087 21808 59007 47913 73132 81884 33768 37569 70728 73509 43104 30535
7231 30535 44688 39094 24108 13492 -15315 -38017 -73851 -58539 -27968 -20065 -42421 -40689
7219 -40689 -21869 -27503 -27430 -26209 -50376 -62318 -17001 17283 11652 53078 65585 79139 46045
7206 46045 -6905 -7758 -20601 -55182 -65061 -29907 -25211 -32188 -18768 -75347 -103203 -65849 -64319
7193 -64319 -36127 -18794 -8453 13549 14088 1660 25290 42469 26347 16998 34698 45710
7181 45710 27708 10896 7915 -8814 -17514 -19107 -24269 -24017 -58827 -77750 -50146 -22469 6240
7168 6240 -8823 2129 7893 7571 -53056 -46409 -26773 -46722 -50612 -41427 -37241 10935 56097
7155 56097 87748 74354 85465 103194 47057 3098 -28707 3374 -3625 -30892 -54535 -15696
$$ packed form
7243A4440l2527L9895L7199j1094K5219Q752m8116L801L3159K781l0405j2569
7231C0535J4153n594j4986j0616k8807k2702l5834J5312L0571P903k2356J732
7219d0689J8820n634P3J221k4167j1942M5317L4284n631M1426J2507J3554l3094
7206D6045n2950q53j2843l4581r879L5154M696o977J3420n6579k7856L7354J530
7193f4319K8192J7333J0341K2002N39j2428K3630J7179j6122r349J7700J1012
7181D5710j8002j6812k981j6729q700j593n162K52l4810j8923K7604K7677K8709
7168F240j5063J0952N764l22o0627O647J9636j9949l890R185M186M8176M5162
7155E6097L1651j3394J1111J7729n6137m3959l1805L2081o999k7267k3643L8839
$$ plain form
7143 -15696 394 11815 23914 53293 71943 75092 51209 18338 823 14367 3842 -7264
7131 -7264 -35643 -39844 -20422 47323 42502 5069 -15581 -27347 -7465 15071 47646 42403 29902
7118 29902 4123 10969 37310 29891 11512 -4149 11124 945 2442 -15408 -32572 -11561
7106 -11561 -49334 -69400 -49049 4092 45319 28985 -3740 4624 29976 -656 -27569 -33344
7094 -33344 -34119 -33848 -32375 -38502 -48485 -24427 -2528 -3628 -1148 -20015 -34916 -32897 -30572 -42183
7080 -42183 -37513 -29501 -11103 -22016 -37120 -1279 -2581 -1536 -9084 -7175 -4006 6584 -2667
7067 -2667 1025 4223 23177 1479 -55734 -67854 -60289 -51037 -55167 -25373 -32297 -39701 -51420
7054 -51420 -23551 10032 -17059 -6863 27261 38702 20795 6523 4360 11926 -7006 -47262
$$ packed form
7143a5696J6090J1421J2099K9379J8650L149k3883l2871j7515J3544j0525j1106
7131g264k8379m201J9422O7745m821l7433k0650j1766J9882K2536L2575n243j2501
7118B9902k5779O846K6341p419j8379j5661J5273j0179J497j7850j7164K1011
7106a1561l7773k0066K0351N3141M1227j6334l2725Q364K5352l0632k6913n775
7094c3344p75K71J473o127r983K4058K1899j100K480j8867j4901K019K325j1611
7080d2183M670Q012J8398j0913j5104L5841j302J045p548J909L169J0590r251
7067b667L692L198J8954k1698n7213j2120P565R252m130K9794o924p404j1719
7054e1420K7869L3583k7091J0196L4124J1441j7907j4272k163P566j8932m0256
$$ plain form
7042 -47262 -75465 -70098 -29346 -15800 -10806 -34361 -32271 -16903 -14227 -5678 -51092 -50606 -27028
7029 -27028 -26755 -55743 -55886 -50897 -42969 -27329 -44465 -31197 -13940 -21591 18069 34326 7778
7016 7778 -12260 2993 1774 -10457 -59512 -43505 -26887 -36921 25802 6530 -42651 -66374
7004 -66374 -95087 -73526 -28453 -21376 -19775 -59989 -63002 -44652 -49158 -35137 -42846 -21621 -5178
6991 -5178 -19052 -34443 -31657 -26002 -16043 -4803 20060 24194 4962 -6129 -5892 -23149 -66245
6978 -66245 -80146 -56897 -3226 -22748 -43931 -23558 -38707 -85166 -91703 -66958 -49320 -21488
6966 -21488 -47491 -42980 -37132 -77311 -42432 -47258 -45515 -39603 -28629 10774 31924 16755 35032
6953 35032 64772 46786 29798 31294 -3062 -24876 -17418 -59178 -54866 -28515 6385 -25293
$$ packed form
7042d7262k8203N367M0752J3546M994k3555K090J5368K676Q549m5414M86K3578
7029b7028K73k8988j43M989P928J5640j7136J3268J7257p651L9660J6257k6548
7016G778k0038J5253j219j2231m9055J6007J6618j0034O2723j9272m9181k3723
7004f6374k8713K1561M5073P077J601m0214l013J8350m506J4021p709K1225J6443
6991e178j3874j5391K786N655R959J1240K4863M134j9232j1091K37j7257m3096
6978f6245j3901K3249N3671j9522k1183K0373j5149m6459o537K4745J7638K7832
6966b1488k6003M511N848m0179L4879m826J743N912J0974L9403K1150j5169J8277
6953C5032K9740j7986j6988J496l4356k1814P458m1760M312K6351L4900l1678
$$ plain form
6941 -25293 -51186 -30622 -15205 -27446 -27896 -44832 -33792 -25950 -32043 -51076 -21506 2123 -17850
6928 -17850 -25833 -45999 -88244 -103259 -48955 -39203 12301 4585 29796 21897 -8167 15705 17210
6915 17210 -24320 -20047 -1775 1947 -1800 -29517 -2948 33671 7252 -25722 1863 -16793
6903 -16793 -33515 3587 31267 21031 7586 -17253 -41768 -32904 14783 48819 43680 32361
6891 32361 27319 19264 -16307 -12248 14625 2183 -44773 -6342 67610 68991 68447 -11771 -31393
6878 -31393 -30503 -50301 -37127 -19436 27017 80011 48873 57292 47631 14916 3042 -9717 1077
6865 1077 36238 37571 42720 54682 12652 -5809 37139 11523 -16697 -50529 -91328 -48198
6853 -48198 -12200 -12274 -20939 -23793 31917 38279 20455 -12806 -7711 -24810 -37677 7648 -4161
$$ packed form
6941b5293k5893K0564J5417j2241m50j6936J1040P842o093j9033K9570K3629j9973
6928a7850p983k0166m2245j5015N4304R752N1504p716K5211p899l0064K3872J505
6915A7210m1530M273J8272L722l747k7717K6569L6619k6419l2974K7585j8656
6903a6793j6722L7102K7680j0236j3445k4839k4515Q864M7687L4036n139j1319
6891C2361n042q055l5571M059K6873j2442m6956L8431P3952J381n44q0218j9622
6878c1393Q90j9798J3174J7691M6453N2994l1138Q419r661l2715j1874j2759J0794
6865A077L5161J333N149J1962m2030j8461M2948k5616k8220l3832m0799M3130
6853d8198L5998p4q665k854N5710O362j7824l3261N095j7099j2867M5325j1809
$$ plain form
6840 -4161 -39553 -12485 -7747 6812 15420 43404 34131 15507 10006 -2850 31556 40599 21516
6827 21516 14487 -24838 -1881 154 10443 34099 5955 47376 16496 5824 45746 63875
6815 63875 17498 2283 -3383 9988 -20356 -48680 -62301 -73299 -84933 -81927 -81253 -22899 -29815
6802 -29815 -21282 3446 35302 22277 32740 31857 -23264 -36611 -21440 -6471 -2546 -13419 12483
6789 12483 -11041 -3486 16899 -33542 -60364 -31739 -4061 -32760 -20692 -7206 -8673 -46653
6777 -46653 -72528 -81151 -22945 -1718 -13978 -27726 -25787 -29197 -6941 -11390 10803 19628 -8383
6764 -8383 -13864 -13453 -31492 -11617 18771 17264 24279 49272 36212 58162 87817 83153 74107
6751 74107 38244 -24256 -53237 -52102 -50419 -24636 -21350 -39391 -67316 -43066 -34681 -24509 4801
$$ packed form
6840d161l5392K7068M738J4559Q608K7984r273j8624n501j2856L4406R043j9083
6827B1516p029l9325K2957K035J0289K3656k8144M1421l0880j0672L9922J8129
6815F3875m6377j5215n666J3371l0344k8324j3621j0998j1634L006O74N8354o916
6802b9815Q533K4728L1856j3025J0463q83n5121j3347J5171J4969L925j0873K5902
6789A2483k3524P555K0385n0441k6822K8625K7678k8699J2068J3486j467l7980
6777d6653k5875q623N8206K1227j2260j3748J939l410K2256m449K2193Q825k8011
6764h383n481M11j8039J9875L0388j507P015K4993j3060K1950K9655m664r046
6751G4107l5863o2500k8981J135J683K5783L286j8041k7925K4250Q385J0172K9310
$$ plain form
6738 4801 19447 -18713 -18097 -11386 -2841 -24821 -76345 -70868 -21493 -15430 -29872 -35623 -38299 -26894
6724 -26894 18350 87461 87068 57407 13886 -53686 -29501 17325 14268 27003 9765 -30283
6712 -30283 -16884 -51855 -86736 -81771 -54345 -35373 -61657 -74141 -66719 -32114 -10479 -22031
6700 -22031 -7387 2896 5730 -20474 -3147 3794 -26111 -28496 -25992 -56552 -24200 15762 22812
6687 22812 3334 -30599 -41538 -67761 -114038 -89128 -20337 4051 -1090 9938 29498 -8229
6675 -8229 -40318 -27357 4581 40260 2777 -30507 -18760 37404 72626 81141 49649 35486
6663 35486 7446 3056 28539 50555 25025 -19908 -16270 10690 19344 23813 53535 53721 27828
6650 27828 5612 -39898 -36599 -30108 -13909 2208 37898 20566 -3449 5521 11711 776 -5136
$$ packed form
6738D801J4646l8160O16O711Q545k1980n1524N477M9375O063j4442n751k676J1405
6724b6894M5244O9111l93k9661m3521o7572K4185M6826l057J2735j7238m0048
6712c0283J3399l4971l4881M965K7426J8972k6284j2484P422L4605K1635j1552
6700b2031J4644J0283K834k6204J7327O941k9905k385K504l0560L2352L9962P050
6687B2812j9478l3933j0939k6223m6277K4910O8791K4388n141J1028J9560l7727
6675h229l2089J2961L1938L5679l7483l3284J1747N6164L5222Q515l1492j4163
6663C5486k8040m390K5483K2016k5530m4933L638K6960Q654M469K9722J86k5893
6650B7828k2216m5510L299O491J6199J6117L5690j7332k4015Q970O190j0935n912
$$ plain form
6637 -5136 -20522 -25702 -19597 -17819 -26842 -49231 -35967 -16010 -4780 46754 30842 29078 40613
6624 40613 40876 6726 -20019 -24363 11093 -10942 -43366 -53603 -32009 40365 63353 34676
6612 34676 34231 22822 11637 -5212 8837 12516 -6872 17738 -8025 -15800 -19931 -13188 -4676
6599 -4676 14705 -45103 -23426 22615 6024 -3708 -6856 -12003 -13331 -13032 -30123 -12134 26125
6586 26125 58440 17402 -38089 -47873 -53695 -41732 -20669 -22437 -32272 -13321 -3119 -34554 -66177
6573 -66177 -35630 -27040 -43858 -29474 -34646 -1857 -27298 -41510 4541 57140 22789 -23348
6561 -23348 -12586 -21802 -23594 -19051 -18515 -40862 -54077 -45308 -10999 35662 51216 37238 26160
6548 26160 -18203 -46217 -59452 -56512 23061 63963 93729 67994 49926 17164 32597 48429
$$ packed form
6637e136j5386n180O105J778r023k2389J3264J9957J1230N1534j5912j764J1535
6624D0613K63l4150k6745m344L5456k2035l2424j0237K1594P2374K2988k8677
6612C4676m45j1409j1185j6849J4049L679j9388K4610k5763p775m131O743Q512
6599d676J9381n9808K1677M6041j6591r732l148n147j328K99j7091J7989L8259
6586B6125L2315m1038n5491r784n822J1963K1063j768r835J8951J0202l1435l1623
6573f6177L0547Q590j6818J4384n172L2789k5441j4212M6051N2599l4351m6137
6561b3348J0762r216j792M543N36k2347j3215Q769L4309M6661J5554j3978j1078
6548B6160m4363k8014j3235K940P9573M0902K9766k5735j8068l2762J5433J5832
$$ plain form
6536 48429 35677 18718 16469 -19047 22353 72311 115295 96638 42504 33999 51195 78354
6524 78354 73298 80503 126000 107342 125400 91452 59596 68772 22697 10145 21486 59364
6512 59364 87625 100093 77110 89989 92707 101282 71604 53759 60301 55328 79795 56494 38134
6499 38134 -4502 -43063 -65260 -59928 -13801 -20314 -49495 -9302 -9962 -9421 -10003 -16529 4715 52758
6485 52758 21938 -11583 -12396 -7760 -40493 -36778 -28280 -23430 -19970 -29834 -30557 -69225 -44913 -38463
6471 -38463 1212 6463 560 -22378 -71365 -88823 -84240 -111343 -80804 -38918 -43073 -75397 -27947
6458 -27947 542 5939 20961 22364 10496 8004 -19657 -315 29555 74127 69539 8457 -5069
6445 -5069 1974 -76093 -100740 -114840 -108057 -37076 -4907 -14392 -14833 -17326 -6447 -17207 -14348
$$ packed form
6536D8429j2752j6959k249l5516M1400M9958M2984j8657n4134q505J7196K7159
6524G8354n056P205M5497j8658J8058l3948l1856R176m6075j2552J1341L7878
6512E9364K8261J2468k2983J2879K718Q575k9678j7845O542m973K4467k3301j8360
6499C8134m2636l8561k2197N332M6127o513k9181M0193o60N41n82o526K1244M8043
6485E2758l0820l3521q13M636l2733L715Q498M850L460r864p23l8668K4312O450
6471c8463L9675N251n903k2938m8987j7458M583k7103L0539M1886m155l2324M7450
6458b7947K8489N397J5022J403j1868k492k7661J9342K9870M4572m588o1082j3526
6445e069P043p8067k4647j4100O783P0981L2169r485m41k493J0879j0760K859
$$ plain form
6432 -14348 4798 43480 61496 19958 -28392 -39760 -24030 -17803 -22434 -16319 7408 92028
6420 92028 30235 -14389 -17190 -32808 -37896 -22866 -27974 -21912 -39356 -30390 -1215 7942 11902
6407 11902 35122 29191 17928 16622 8594 5343 15245 18619 13994 3456 3059 3600 -45676 -54662
6393 -54662 -35301 -35236 -25492 -10022 -14680 -43543 -65315 -48587 -52780 -58961 -70288 -81005 -93500
6380 -93500 -87520 -86999 -72897 -51109 -57053 -79979 -65860 -29519 -14639 -43108 -54923 -57324 -50606
6367 -50606 -15903 81579 84675 40150 20953 -2429 -11551 7438 -3293 25417 26972 9217
6355 9217 -6680 -9681 -23582 -14896 4056 10172 9846 -24887 -37365 -45644 -44884 -18339 7592 11821
6341 11821 20083 48859 7896 -20162 -8835 -14889 -17038 16896 5178 23186 -18030 -16912 -3833
$$ packed form
6432a4348J9146L8682J8016m1538m8350j1368J5730O227m631O115K3727Q4620
6420I2028o1793m4624k801j5618n088J5030n108O062j7444Q966K9175R157L960
6407A1902K3220n931j1263j306q028l251R902L374m625j0538l97N41m9276q986
6393e4662J9361O5R744J5470m658k8863k1772J6728m193o181j1327j0717j2495
6380i3500N980N21J4102K1788n944k2926J4119L6341J4880k8469j1815k401O718
6367e0606L4703R7482L096m4525j9197k3382r122J8989j0731K8710J555j7755
6355I217j5897l001j3901Q686J8952O116l26l4733j2478q279P60K6545K5931M229
6341A1821Q262K8776m0963k8058J1327o054k149L3934j1718J8008m1216J118J3079
$$ plain form
6328 -3833 5994 -3505 -26056 -70780 -44276 -3470 -8154 -3724 2905 -22660 -11544 -31741 -63422
6315 -63422 -77985 -70507 -47322 -18462 21285 52255 25953 7157 25465 29679 7999 -21533
6303 -21533 -21080 -18474 -34238 -68995 -44465 -8382 1117 -38532 -81116 -52609 -11912 -4726 10593
6290 10593 -4251 -10114 33098 70173 51229 37046 65131 49521 33206 42579 35305 35028 31337
6277 31337 38214 60163 45915 36928 15482 1395 31 -39175 -43592 -23952 -19873 -33170 -26736
6264 -26736 1672 -23233 -26115 -22983 -35569 -32078 -43189 -49760 -70613 -71461 -52367 1417 22657
6251 22657 20919 19988 -7055 -10155 -46578 -47514 -33449 -41612 -47281 -48724 -60567 -68138 -80313 -65510
6237 -65510 -46800 -66167 -57415 -62785 -30129 -23718 -31798 -19920 -36759 4669 3957 -40732 -20815
$$ packed form
6328c833R827r499k2551m4724K6504M0806m684M430O629k5565J1116k0197l1681
6315f3422j4563P478K3185K8860L9747L0970k6302j8796J8308M214k1680k9532
6303b1533M53K606j5764l4757K4530L6083R499l9649m2584K8507M0697P186J5319
6290A0593j4844n863M3212L7075j8944j4183K8085j5610j6315R373p274k77l691
6277C1337O877K1949j4248q987k1446j4087j364l9206m417J9640M079j3297O434
6264b6736K8408k4905k882L132j2586L491j1111o571k0853q48J9094N3784K1240
6251B2657j738r31k7043l100l6423r36J4065q163n669j443j1843p571j2175J4803
6237f5510J8710j9367Q752n370L2656O411q080J1878j6839M1428p12m4689J9917
$$ plain form
6224 -20815 -1113 -7778 -21195 -22157 -14463 -32140 -51318 -48041 -5818 -27293 -78383 -67116 -49678
6211 -49678 -22344 -48686 -72104 -82031 -66009 -55274 -51792 -18023 2754 -35432 -69671 -33234
6199 -33234 2955 16282 17713 5062 3051 35059 -5559 -25946 -1478 -23952 -48940 -23023
6187 -23023 7417 7334 9261 -30356 -50584 -34097 -22321 -10996 -45607 -71675 7506 76196 78544
6174 78544 35621 -14544 -49188 -67571 -41597 -35448 -83734 -115549 -83953 -57617 -13708 12192
6162 12192 13006 26237 34974 26053 14206 -7839 11236 11051 34466 28877 12484 -17688 -46345
6149 -46345 -111413 -110473 -27137 -4847 -26677 -19454 16564 -13514 -21531 -1977 -13879 -56211 -81260
6136 -81260 -87160 -87720 -82618 -47396 1712 -24800 -57578 -71926 -113293 -88435 -47178 -22325 -5960
$$ packed form
6224b0815J9702o665j3417r62P694j7677j9178L277M2223k1475n1090J1267J7438
6211d9678K7334k6342k3418r927J6022J0735L482L3769K0777l8186l4239L6437
6199c3234L6189J3327J431j2651k011L2008m0618k0387K4468k2474k4988K5917
6187b3023L0440q3J927l9617k0228J6487J1776J1325l4611k6068P9181O8690K348
6174G8544m2923n0165l4644j8383K5974O149m8286l1815L1596K6336M3909K5900
6162A2192Q14J3231Q737q921j1847k2045J9075j85K3415n589j6393l0172k8657
6149d6345o5068R40Q3336K2290k1830P223L6018l0078q017J9554j1902m2332k5049
6136h1260n900n60N102L5222M9108k6512l2778j4348m1367K4858M1257K4853J6365
$$ plain form
6123 -5960 -9683 -32244 -55743 -53257 -37526 -16037 15481 18577 7225 -2997 -25613 -33930 -25612
6110 -25612 -17963 -7743 -2367 -29907 8782 12433 -23140 2959 -14377 -49664 -83509 -80575 -50786
6097 -50786 -8228 2488 -2772 12778 21761 37382 19066 -22178 -13881 9999 24805 26129 15703
6084 15703 28830 12833 -748 -14374 -5751 -5150 -27411 -51745 -55041 -67974 -60051 -13349 -2247
6071 -2247 15401 -13604 -17692 -14803 1051 22684 5049 -24425 -56742 -84380 -43486 -10304
6059 -10304 -12065 31687 45752 13247 5052 15753 28024 28915 27599 -10500 -30103 4010 -4592
6046 -4592 -9367 20641 21321 -9466 11244 49821 34030 18786 10620 -35082 -53467 925 14525
6033 14525 9159 36813 60838 74624 91697 63240 21410 -3032 -4934 12314 4525 -11440
$$ packed form
6123e960l723k2561k3499K486J5731K1489L1518L096j1352j0222k2616q317Q318
6110b5612P649J0220N376k7540L8689L651l5573K6099j7336l5287l3845K934K9789
6097e0786M2558J0716n260J5550Q983J5621j8316m1244Q297K3880J4806J324j0426
6084A5703J3127j5997j3581j3626Q623O01k2261k4334l296j2933P923M6702J1102
6071b247J7648k9005m088K889J5854K1633j7635k9474l2317k7638M0894L3182
6059a0304j761M3752J4065l2505q195J0701J2271Q91j316l8099j9603L4113q602
6046d592m775L0008O80l0787K0710L8577j5791j5244q166m5702j8385N4392J3600
6033A4525n366K7654K4025J3786J7073k8457m1830k4442j902J7248p789j5965
$$ plain form
6021 -11440 -621 12188 28649 40701 7373 -42393 -10253 42877 22668 41934 38286 29265
6009 29265 23837 22496 8709 1888 5762 18105 26178 12902 -4394 8339 25991 -7873 -21037
5996 -21037 -40980 -71026 -68486 6833 31635 3899 -15952 -26416 3991 -3797 -23872 -22863
5984 -22863 -15971 -26793 -42947 -72320 -44282 12031 8528 12155 1090 -5439 7513 2012 -19494
5971 -19494 -18281 -24429 -9731 -14888 -9303 20894 48609 20369 -48292 -39931 -29331 -41530 -25119
5958 -25119 -16537 -44513 -44459 -14614 -38203 -22115 -1585 10776 15036 -49953 -69007 -60401 -16717
5945 -16717 -4763 24624 32393 9035 -26645 -99822 -100366 -27941 589 6922 15480 -5660 -45262
5932 -45262 -52333 -58852 -60950 -73406 -74445 -38730 4719 -3897 -54600 -67704 -73032 -65209 -45812
$$ packed form
6021a1440J0819J2809J6461J2052l3328m9766L2140N3130k0209J9266l648r021
6009B9265n428j341j3787o821L874J2343Q073j3276j7296J2733J7652l3864j3164
5996b1037j9943l0046K540P5319K4802k7736j9851j0464L0407p788k0075J009
5984b2863O892j0822j6154k9373K8038N6313l503L627j1065o529J2952n501k1506
5971a9494J213o148J4698n157N585L0197K7715k8240o8661Q361J0600j2199J6411
5958b5119Q582k7976N4K9845k3589J6088K0530J2361M260o4989j9054Q606M3684
5945a6717J1954K9387P769k3358l5680p3177n44P2425K8530O333Q558k1140l9602
5932d5262p071o519k098j2456j039L5715M3449q616n0703j3104n328P823J9397
$$ plain form
5919 -45812 -25517 -22236 -18354 -11068 -35331 -42052 -46442 -26025 -290 33 -3769 28744 29485 16105
5905 16105 22814 -3700 -36690 -2160 41624 44485 27680 9858 -14466 -61599 -72184 -48638
5893 -48638 -65121 -90895 -88883 -35665 -11887 5891 10329 -9348 -11498 -30780 -53084 -80947
5881 -80947 -109851 -69129 -12796 10088 -4746 -5846 -27944 -29327 783 17636 17923 4853 -28392
5868 -28392 -47871 -25018 -12792 -4029 -7076 15090 10104 2534 19820 -1029 -21272 -10878 -1676
5855 -1676 -5735 -117 -48729 -39441 22056 17708 24909 9850 7156 3961 8067 -11485 -37029 -24729
5841 -24729 -3391 -5081 -28103 -68639 -58750 -94905 -71247 -11619 -33430 -31389 -16701 -38071
5829 -38071 -32769 -30673 -6191 -32141 -23375 -14878 -11234 8711 28029 17383 -4117 -7023 -5250
$$ packed form
5919d5812K0295L281L882P286k4263o721m390K0417K5735L23l802L2513P41j3380
5905A6105O709k6514l2990L4530M3784K861j6805j7822k4324m7133j0585K3546
5893d8638j6483k5774K012N3218K3778J7778M438j9677k150j9282k2304k7863
5881h0947k8904M0722N6333K2884j4834j100k2098j383L0110J6853K87j3070l3245
5868b8392j9479K2853J2226Q763l047K2166m986p570J7286k0849k0243J0394R202
5855a676m059N618m8612R288O1497m348P201j5059k694l195M106j9552k5544J2300
5841b4729K1338j690k3022m0536R889l6155K3658N9628k1811K041J4688k1370
5829c8071N302K096K4482k5950Q766Q497L644J9945J9318j0646k1500k906J773
$$ plain form
5816 -5250 20146 16967 -5170 9470 42156 44742 9722 317 -11505 -32709 -17149 -11085 -50630
5803 -50630 -13397 -11085 -26317 -41315 -42596 -43731 -32440 -23906 -18611 -19424 -2657 -19315 -8159
5790 -8159 16261 13012 8389 4981 6276 -9959 -31630 -14500 -44248 -47129 -33584 -5849 33997
5777 33997 27623 -12190 -15060 7779 40326 46798 17246 50487 87969 78221 56003 57272 9870
5764 9870 -32580 -38641 -4317 -45139 -56738 -49526 -53126 -64061 -32626 -1313 -20004 -49206 -63032
5751 -63032 -50857 32137 38730 36302 3995 -88 32362 57302 66556 30311 40455 27542 45570
5738 45570 31906 36422 72260 98510 70927 47898 23417 1973 11625 21866 63115 78430
5726 78430 64823 90080 69606 43909 12471 -5162 -10542 -23390 -51331 -28293 -21991 -13446
$$ packed form
5816e250K5396l179k2137J4640L2686K586l5020r405j1822k1204J5560O064l9545
5803e0630L7233K312j5232j4998j281j135J1291Q534N295q13J6767j6658J1156
5790h159K4420l249m623l408J295j6235k1671J7130k9748k881J3545K7735L9846
5777C3997o374l9813k870K2839L2547O472k9552L3241L7482r748k2218J269m7402
5764I870m2450o061L4324m0822j1599P212l600j0935L1435L1313j8691k9202j3826
5751f3032J2175Q2994O593k428l2307m083L2450K4940R254l6245J0144j2913J8028
5738D5570j3664M516L5838K6250k7583k3029k4481k1444R652J0241M1249J5315
5726G8430j3607K5257k0474k5697l1438j7633n380j2848k7941K3038O302Q545
$$ plain form
5714 -13446 -10642 -32133 -33411 -40824 -17354 -36272 -93944 -68925 -64593 -26255 28976 33551 35895
5701 35895 28975 1043 -32977 -49782 -37871 -37802 -53346 -35521 4830 19753 20997 26700 42065
5688 42065 44707 12398 24387 46121 55626 22413 -1114 -3667 20524 22779 13563 6662 14145
5675 14145 7553 12245 -4050 -5352 -24999 -13407 -26090 -31714 15450 26389 1386 4743 19108
5662 19108 39269 24671 41334 46719 54505 66364 31997 -29423 -37279 -33844 -20044 -27377 -14780
5649 -14780 -3323 2598 -14228 -3592 -14767 21936 53839 46731 27581 -10008 -12758 -19887 -58552
5636 -58552 -51442 -38159 17853 -17341 -68071 -74685 -45163 -42641 -21165 -51806 -26656 -25033 -49902
5623 -49902 -66575 -76084 -46607 -49098 -22776 14343 32811 55652 25668 -27525 -18500 -256
$$ packed form
5714a3446K804k1491j278p413K3470j8918n7672K5019M332L8338N5231M575K344
5701C5895o920k7932l4020j6805J1911O9j5544J7825M0351J4923J244N703J5365
5688D2065K642l2309J1989K1734R505l3213k3527k553K4191K255r216o901P483
5675A4145o592M692j6295j302j9647J1592j2683n624M7164J0939k5003L357J4365
5662A9108K0161j4598J6663N385P786J1859l4367o1420p856L435J3800p333J2597
5649a4780J1457N921j6826J0636j1175L6703L1903p108j9150l7589k750p129l8665
5636e8552P110J3283N6012l5194n0730o614K9522K522K1476l0641K5150J623k4869
5623d9902j6673r509K9477k491K6322L7119J8468K2841k9984n3193R025J8244
$$ plain form
5611 -256 -17194 -82538 -100766 -79785 -80680 -86160 -87013 -66277 -43678 -55344 -74844 -41601 -16281
5598 -16281 -27391 -42761 -45853 -5919 24351 -4887 -46562 -67889 -71974 -57055 -12151 -29638
5586 -29638 -59492 -71567 -54793 -59024 -81868 -76616 -76238 -12904 -20172 -52957 -60483 -44195 -15960
5573 -15960 15487 16811 -2548 160 45555 29021 -8746 -14067 13784 35804 3943 -26249
5561 -26249 3461 11662 -7869 -7160 -3784 -26144 -51218 -73790 -73501 -96641 -79629 -60365 -23039
5548 -23039 13455 -29709 -54725 -49331 -49019 -34245 -27474 -48088 -15046 14083 16927 23079 2415
5535 2415 -24937 -49160 -48745 -34038 -22268 -46720 -58602 -67759 -48777 -47032 -50483 -34448 -652
5522 -652 15857 -17739 -38188 -24177 -14338 -681 16401 11368 -13727 -30228 -16728 -40726 -53710
$$ packed form
5611b56j6938o5344j8228K0981q95n480q53K0736K2599j1666j9500L3243K5320
5598a6281j1110j5370l092L9934L0270k9238m1675k1327m085J4919M4904j7487
5586b9638k9854j2075J6774m231k2844N252L78O3334p268l2785p526J6288K8235
5573a5960L1447J324j9359K708M5395j6534l7767n321K7851K2020l1861l0192
5561b6249K9710Q201j9531P09L376k2360k5074k2572K89k3140J7012J9264L7326
5548b3039L6494m3164k5016N394L12J4774O771k0614L3042K9129K844O152k0664
5535B415k7352k4223M15J4707J1770k4452j1882r157J8982J745l451J6035L3796
5522f52J6509l3596k0449J4011R839J3657J7082n033k5095j6501J3500k3998j2984
$$ plain form
5509 -53710 -37682 -28104 5401 15231 32052 38252 5979 11751 17200 -9082 -13451 -5165 -3755
5496 -3755 -37158 -56787 -60169 -34101 -60246 -43339 -11871 -20083 -12067 5997 4754 9046 61823
5483 61823 52834 19472 17705 -13255 -27688 -9134 -16391 -45643 -42069 -23825 -46047 13026 28982
5470 28982 23172 -26846 -30663 -68256 -74947 -26216 27143 13851 -12361 -9327 14354 47096 50646
5457 50646 -1132 -38746 -89109 -92910 -78796 -58078 -23125 -4176 1618 -4068 -24249 -55786
5445 -55786 -73023 -78960 -66961 -101440 -107207 -72302 -38884 -12104 -14135 -37761 -15338 -21713 -46437
5432 -46437 -94794 -97155 -68495 -10324 28953 -21041 -56671 -56026 -41622 1329 19478 -10933
5420 -10933 -10900 -3544 -25446 -30355 -30364 -76202 -91652 -32301 28312 48144 -10457 -20748 -4619 -19890
$$ packed form
5509e3710J6028R578L3505R830J6821O200l2273N772N449k6282m369Q286J410
5496c755l3403j9629l382K6068k6145J6907L1468q212Q016J8064j243M292N2777
5483F1823q989l3362j767l0960j4433J8554p257k9252L574J8244k2222N9073J5956
5470B8982n810n0018l817l7593o691M8731N3359j3292k6212L034K3681L2742L550
5457E0646n1778l7614n0363l801J4114K0718L4953J8949N794n686k0181l1537
5445e5786j7237n937J1999l4479n767L4905L3418K6780k031k3626K2423o375k4724
5432d6437m8357k361K8660N8171L9277m9994l5630O45J4404M2951J8149l0411
5420a0933L3P356k1902m909rm5838j5450N9351O0613J9832n8601j0291J6129j5271
$$ plain form
5406 -19890 -1846 -8221 -13514 3893 12690 21766 -4416 11036 34057 34793 59922 58966 52564 49346
5392 49346 5524 -30624 -25130 5120 -1596 -4144 -16763 -24504 22666 28635 -14080 -56765 -73292
5379 -73292 -55730 -58318 -25500 11820 35387 39743 33988 36915 42109 44753 39074 45833 29340
5366 29340 14773 14424 33877 16688 -30165 -26055 -25573 -51640 -67908 -26279 -5202 -6288 -1884
5353 -1884 -3731 488 23803 63068 36448 -18640 -29916 -20124 -16061 9340 2213 -20303 -6114
5340 -6114 -2015 -32069 -59659 -60997 -16890 -34699 -60782 -63540 -68266 -7438 22190 8544 25595
5327 25595 15297 -4067 -12002 -20810 15813 33468 46247 42912 29955 35442 15083 -20405 -17703
5314 -17703 -17835 9513 18993 -1097 38684 41691 27387 56163 16954 -6915 11375 17555 -20038
$$ packed form
5406a9890J8044o375n293J7407Q797R076k6182J5452K3021P36K5129r56o402l218
5392D9346m3822l6148N494L0250o716k548j2619p741M7170N969m2715m2685j6527
5379g3292J7562k588L2818L7320K3567M356n755K927N194K644n679O759j6493
5366B9340j4567l49J9453j7189m6853M110M82k6067j6268M1629K1077j086M404
5353a884j847M219K3315L9265k6620n5088j1276R792M063K5401p127k2516J4189
5340f114M099l0054k7590j338M4107j7809k6083k758m726O0828K9628j3646J7051
5327B5595j0298j9364p935q808L6623J7655J2779l335j2957N487k0359l5488K702
5314a7703j32K7348R480k0090L9781L007j4304K8776l9209k3869J8290O180l7593
$$ plain form
5301 -20038 -2060 8262 10689 11387 10956 20764 15582 -13231 -31915 -41273 -34685 -38065 -5542 25063
5287 25063 35167 36452 44450 6296 -36305 -31080 -54268 -47027 -15238 6691 31483 20075 -936
5274 -936 -847 4697 -19434 -68045 -68879 -52910 -29272 -27444 -4046 13407 48604 53532 52504 11921
5260 11921 -3943 15555 9814 902 8131 -11726 -49167 -30486 -22051 -12247 -7106 -16833 -26573
5247 -26573 -35123 13706 9385 -13905 5856 43928 17462 -21873 -40348 -25773 -3693 12628
5235 12628 22344 13791 -8920 -1010 2894 19400 6114 30628 56982 96669 81995 41252 62623
5222 62623 86172 95732 72697 84764 84501 50077 47845 35520 4364 24902 39493 13481 -2048
5209 -2048 11771 10508 -7522 -12879 -29296 -25908 9746 21580 -5308 -41865 -24616 -2271 -17571
$$ packed form
5301b0038J7978J0322K427O98m31R808n182k8813j8684r358O588l380L2523L0605
5287B5063J0104J285P998l8154m2601N225k3188P241L1789K1929K4792j1408k1011
5274i36Q9N544k4131m8611q34J5969K3638J828K3398J7453L5197M928j028m0583
5260A1921j5864J9498n741q912P229j9857l7441J8681Q435R804N141r727r740
5247b6573q550M8829m321k3290J9761L8072k6466l9335j8475J4575K2080J6321
5235A2628R716q553k2711P910L904J6506j3286K4514K6354L9687j4674m0743K1371
5222F2623K3549R560k3035J2067k63l4424k232j2325l1156K0538J4591k6012j5529
5209b048J3819j263j8030n357j6417L388L5654J1834k6888l6557J7249K2345j5300
$$ plain form
5196 -17571 8604 7869 17846 29989 31538 28120 8074 2011 30957 24326 14222 10984 -14202
5183 -14202 -33292 -13550 7297 21920 5792 4510 11896 -6085 -5453 20289 31994 32956 -14271
5170 -14271 -823 25649 -6921 -19051 17012 24757 -8743 -14287 -22368 -25036 -17156 -23968 -20004
5157 -20004 13266 36974 44204 16153 13759 16066 -2594 -28985 -31852 -46433 -41436 -30185 -28096
5144 -28096 -4314 23974 20006 -7785 7225 -18552 -16718 -19759 -4549 -2832 29824 65803 67025
5131 67025 62375 23542 -11726 -14278 39348 63020 58539 42903 -832 -14761 -28858 -27973 -8177
5118 -8177 26173 20405 1719 -13449 -9341 21792 1691 382 18015 39713 7224 -21099 -363
5105 -363 55440 74900 15422 -13672 21170 73730 37929 -28055 -28486 -27378 -24607 3572 658
$$ packed form
5196a7571K6175p35R977J2143J549l418k0046o063K8946o631j0104l238k5186
5183a4202j9090J9742K0847J4623j6128j282P386j7981O32K5742J1705R62m7227
5170a4271J3448K6472l2570j2130L6063P745l3500n544q081k668P880o812L964
5157b0004L3270K3708P230k8051k394K307j8660k6391k867j4581M997J1251K089
5144b8096K3782K8288l968k7791J5010k5777J834l041J5210J717L2656L5979J222
5131F7025m650l8833l5268k552N3626K3672m481j5636m3735j3929j4097Q85J9796
5118h177L4350n768j8686j5168M108L1133k0101j309J7633K1698l2489k8323K0736
5105c63N5803J9460n9478k9094L4842N2560l5801o5984m31J108K771K8179k914
$$ plain form
5092 658 13276 66016 65688 68407 72205 39741 -21030 -43965 -17150 38912 47528 13127 9081
5079 9081 25509 -1237 -15719 12351 26701 20315 21615 16963 3158 -22441 -927 13943 -19566
5066 -19566 -6510 -14811 -4043 -23799 -28347 -8589 18287 14502 -4857 4456 11527 35528 -15076
5053 -15076 -4368 36611 37656 19430 1550 23364 2344 -14379 18162 38605 -22224 -55240
5041 -55240 -33729 -9608 9458 -7975 -16729 5364 20536 18644 -15285 -45407 -24125 -16981
5029 -16981 -31098 -12656 12877 -4108 -20700 -49011 -75117 -51335 -18517 25762 69049 64105
5017 64105 22434 29465 62 -28327 -69762 -54953 -25562 -33275 -32813 6671 19457 36588 60108
5004 60108 109166 103969 59664 44296 45719 46512 -10696 23406 57721 70906 52273 26418 -3675
$$ packed form
5092F58J2618N2740l28K719L798l2464o0771k2935K6815N6062Q616l4401m046
5079I081J6428k6746j4482K8070J4350o386J300m652j3805k5599K1514J4870l3509
5066a9566J3056q301J0768j9756m548J9758K6876l785j9359R313P071K4001n0604
5053a5076J0708M0979J045j8226j7880K1814k1020j6723L2541K0443o0829l3016
5041e5240K1511K4121J9066j7433q754K2093J5172j892l3929l0122K1282P144
5029a6981j4117J8442K5533j6985j6592k8311k6106K3782L2818M4279M3287m944
5017F4105m1671P031k9403k8389m1435J4809K9391p713M62L9484J2786J7131K3520
5004F0108M9058n197m4305j5368J423P93n7208L4102L4315J3185j8633k5855l0093
$$ plain form
4991 -3675 26629 69395 -15105 -30531 -485 13111 7039 -2540 14155 25021 29063 46368 -16712
4978 -16712 -57091 -55326 -8595 10060 18246 4022 -22885 -64758 -72717 -45975 -13073 -13408 3950
4965 3950 1821 -13120 -10022 -20116 -34615 -73949 -116804 -76353 -69222 -66023 -46823 10490 14300
4952 14300 -1619 -15310 -11386 -8606 -5554 -36752 -44211 -27251 18474 23053 5582 -8346 -5502
4939 -5502 -42036 -57511 -45006 -26473 -27909 -17775 -11528 -6526 19962 65569 67319 9108 31211
4926 31211 21139 -25682 -34283 -22650 -14030 13721 24855 7029 37204 16040 30321 26565
4914 26565 -18703 -29694 -4592 7938 9232 -17115 -46020 -25771 -4226 12963 1494 -24737
4902 -24737 -45419 -35774 -13259 -5188 -3305 20259 -11509 -19410 8377 37116 23970 7800 14426
$$ packed form
4991c675L0304M2766q4500j5426L0046J3596o072r579J6695J0866M042J7305o3080
4978a6712m0379J765M6731J8655Q186j4224k6907m1873p959K6742L2902l35J7358
4965C950k129j4941L098j0094j4499l9334m2855M0451P131L199J9200N7313L810
4952A4300j5919j3691L924K780L052l1198p459J6960M5725M579j7471j3928K844
4939e502l6534j5475J2505J8533j436J0134O247N002K6488M5607J750n8211K2103
4926C1211j0072m6821q601J1633Q620K7751J1134j7826L0175k1164J4281l756
4914B6565m5268j0991K5102J2530J294k6347k8905K0249K1545J7189j1469k6231
4902b4737k0682R645K2515Q071J883K3564l1768p901K7787K8739j3146j6170O626
$$ plain form
4889 14426 4156 19795 25824 12282 1053 32013 35228 3541 -20274 -62238 -63734 -49975
4877 -49975 -44958 -46746 -42096 -33789 -21540 -26482 -10193 -30735 -34291 -19314 -14069 -29250 -12993
4864 -12993 14667 -3601 -26975 -36471 -62611 -115685 -89176 -53032 -765 -7159 -50369 -90814
4852 -90814 -110706 -82438 -44785 -1584 -11573 -33547 -24294 -12712 3469 14341 2439 -10303
4840 -10303 -16320 9215 21976 7757 24102 2973 -17011 8274 41559 44970 49139 39845 13931
4827 13931 1842 -8655 -21413 -20486 19975 -41505 -67375 -23730 25688 72562 36356 14017
4815 14017 -40044 -45121 -13023 20932 21981 43707 3070 -9139 -19683 -26141 7489 -6192
4803 -6192 -6022 1649 23807 -35088 -20472 43565 47640 30631 14138 5404 -2336 -26184 -31333
$$ packed form
4889A4426j0270J5639O029j3542j1229L0960L215l1687k3815m1964j496J3759
4877d9975N017j788M650Q307J2249m942J6289k0542l556J4977N245j5181J6257
4864a2993K7660j8268k3374r496k6140n3074K6509L6144N2267o394m3210m0445
4852i0814j9892K8268L7653M3201r989k1974R253J1582J6181J0872j1902j2742
4840a0303o017K5535J2761j4219J6345k1129j9984K5285L3285L411M169r294k5914
4827A3931j2089j0497j2758R27M0461o1480k5870M3645M9418M6874l6206k2339
4815A4017n4061n077L2098L3955J049K1726m0637j2209j0544o458L3630j3681
4803f192J70P671K2158n8895J4616O4037M075j7009j6493q734p740k3848n149
$$ plain form
4790 -31333 -45174 -66618 -65167 -44349 -10684 20393 22287 7001 2044 2714 -23520 26096 68263
4777 68263 40523 18296 7677 16795 16774 2535 -34586 -30295 -19412 -36160 15902 2989 -33688
4764 -33688 -52869 -80854 -53881 -92106 -73867 -61277 -54463 -46601 -14566 10486 -3457 4010
4752 4010 14981 13956 -13292 -103417 -111587 -89194 -60589 -33518 -15116 -29328 -29549 -30354 -85258
4739 -85258 -71547 -32931 -8301 19395 47954 8097 19911 21789 -166 8319 24225 21322
4727 21322 19096 -1305 -9011 -29967 -52563 -51506 -11595 -6264 -18910 -31943 -32748 -42508 -42640 -38108
4713 -38108 -43532 -53519 -58369 -41478 -26790 -28853 -12298 30595 27130 58642 57685 5103 -26497
4700 -26497 -10017 17785 39929 22883 22442 -22200 -23534 -5481 -9727 -23920 15842 24573 27799
$$ packed form
4790c1333j3841k1444J451K0818L3665L1077J894j5286m957O70k6234M9616M2167
4777F8263k7740k2227j0619R118k1j4239l7121M291J0883j6748N2062j2913l6677
4764c3688j9181k7985K6973l8225J8239J2590O814P862L2035K5052j3943P467
4752D010J0971j025k7248r0125q170K2393K8605K7071J8402j4212k21q05n4904
4739h5258J3711L8616K4630K7696K8559l9857J1814J878k1955Q485J5906k903
4727B1322k226k0401p706k0956k2596J057L9911N331j2646j3033q05r760j32M532
4713c8108n424r987m850J6891J4688k063J6555M2893l465L1512r57n2582l1600
4700b6497J6480K7802K2144j7046m41m4642j334J8053m246j4193L9762Q731L226
$$ plain form
4687 27799 32701 2998 -10186 37446 60830 16591 -11304 -5804 -5990 -36191 -3966 42872 44340
4674 44340 38217 39448 22742 7694 21143 9460 21869 41815 45101 52098 8767 -21722 -14684
4661 -14684 1949 4642 -7474 -21089 -53547 -33836 -8791 15621 42411 13708 -33195 -26039
4649 -26039 -33370 -54462 -52395 -50417 -31970 -30450 -19005 5931 16668 -2602 -14485 -4947 4978
4636 4978 -6127 -11528 5949 -3923 56990 94224 92598 49993 -8211 -808 -5335 46128 45298
4623 45298 60595 45111 4001 6706 10718 28943 146 -1029 63961 96183 79688 7980
4611 7980 17821 5564 3061 22699 30570 21431 36835 63195 46237 -16589 -35617 -49508 -34501
4598 -34501 -24275 -7092 -15033 -10702 23862 39251 39360 49406 63273 14085 -4064 -3996 -9418
$$ packed form
4687B7799M902k9703j3184M7632K3384m4239k7895N500j86l0201L2225M6838J468
4674D4340o123J231j6706j5048J3449j1683J2409J9946L286O997m3331l0489P038
4661a4684J6633K693j2116j3615l2458J9711K5045K4412K6790k8703m6903P156
4649b6039p331k1092K067J978J8447J520J1445K4936J0737j9270j1883R538R925
4636D978j1105n401J7477r872O0913L7234j626m2605n8204P403m527N1463q30
4623D5298J5297j5484m1110K705M012J8225k8797j175O4990L2222j6495p1708
4611G980R841j2257k503J9638P871r139J5404K6360j6958o2826j9028j3891J5007
4598c4501J0226J7183p941M331L4564J5389J09J0046J3867m9188j8149O8n422
$$ plain form
4585 -9418 -47463 -18444 -28111 -55458 -57428 -62578 -81352 -69563 -8999 38529 48006 43766 36536
4572 36536 50273 41932 39472 38595 27639 3114 -10875 -20202 27264 39183 -12216 -30680 -3209
4559 -3209 -20900 -53295 3110 14582 -16408 -36380 -25769 -39571 -53481 -64686 -23103 14604
4547 14604 56218 46507 10855 3586 -6128 -5922 -19301 -7099 -50975 -68097 -45549 -4415 -22452
4534 -22452 -5850 1010 15858 52563 11245 -8562 -20863 -10235 32254 34186 5118 -29106
4522 -29106 -50116 -26817 19430 42800 37019 9561 6101 15912 71214 94415 91303 34948 42961
4509 42961 41935 70524 34689 4312 22426 44337 69999 66795 46946 19054 1724 15658
4497 15658 33405 46150 54680 36939 -3230 -3537 11617 -5563 -16215 -26110 5820 -3245 -34122
$$ packed form
4585i418l8045K9019r667k7347j970n150j8774J1789O0564M7528R477m240p230
4572C6536J3737q341k460q77j0956k4525j3989r327M7466J1919n1399j8464K7471
4559c209j7691l2395N6405J1472l0990j9972J0611j3802j3910j1205M1583L7707
4547A4604M1614r711l5652p269r714K06j3379J2202m3876j7122K2548M1134j8037
4534b2452J6602O860J4848L6705m1318j9807j2301J0628M2489J932k9068l4224
4522b9106k1010K3299M6247K3370n781k7458l460R811N5302K3201l112n6355Q013
4509D2961j026K8589l5835l0377J8114K1911K5662l204j9849k7892j7330J3934
4497A5658J7747J2745Q530j7741m0169l07J5154j7180j0652r895L1930r065l0877
$$ plain form
4484 -34122 -18039 -8990 -6103 -22012 -39364 -58322 -76469 -41739 -7921 -22359 -26360 -8647
4472 -8647 -18814 -18463 20705 52142 53691 73325 57619 25038 17632 2497 -21166 -11295 27344
4459 27344 -1836 -48018 -44610 -30439 7801 59717 65261 -8494 -32789 -16564 -2279 29130
4447 29130 48526 33190 43114 68139 74046 40600 24696 -11103 -42177 -19533 -13436 -39184
4435 -39184 -37890 -23385 -63179 -50901 -49512 -35573 -5389 -9094 -36702 -58960 -53853 -39074 9187
4422 9187 54336 67924 75292 28746 14729 -7129 10847 62902 61508 50409 311 -3029 -5559
4409 -5559 -35752 -57131 -45731 6151 11749 -2579 14616 -7011 -12818 -34858 -38904 -43315 -13081
4396 -13081 -18457 -16130 -12990 -4385 2755 -4048 -1672 19427 180 -2458 5103 2665 -43136 -44325
$$ packed form
4484c4122J6083R049K887j5909j7352j8958j8147L4730L3818j4438m001J7713
4472h647j0167L51L9168L1437J549J9634j5706l2581p406j5135k3663R871L8639
4459B7344k9180m6182L408J4171L8240N1916N544p3755k4295J6225J4285L1409
4447B9130J9396j5336R924K5025N907l3446j5904l5799l1074K2644O097k5748
4435c9184J294J4505l9794J2278J389J3939L0184l705k7608k2258N107J4779M8261
4422I187M5149J3588P368m6546j4017k1858J7976N2055j394j1099n0098l340k530
4409e559l0193k1379J1400N1882N598j4328J7195k1627n807k2040m046m411L0234
4396a3081n376K327L140Q605P140o803K376K1099j9247k638P561k438m5801j189
$$ plain form
4382 -44325 -21686 18526 47810 43872 18807 28391 44509 39133 9248 -4053 -236 5549 1114
4369 1114 -26524 -13201 28353 72599 91186 84136 74927 63177 46194 11962 -44036 -64816
4357 -64816 -66259 -9202 34537 25069 18485 10655 -3953 20687 21038 -857 -26648 -84716 -64902
4344 -64902 -28756 -4659 19551 -9269 -28956 -5509 56357 78626 57576 34729 -18055 -6913
4332 -6913 15174 31842 27225 27432 -5442 19197 41615 34984 53836 46208 27031 21952 17933
4319 17933 -13189 -751 7695 19526 -9245 23105 52726 26165 42549 56078 48172 13333
4307 13333 10386 35234 80975 87622 59474 14980 -10261 6034 25796 29226 -25898 -51391
4295 -51391 -27892 -35935 -48632 -71707 -64324 -59164 -63665 -33691 -2441 3833 -29885 -25276 -22300
$$ packed form
4382d4325K2639M0212K9284l938k5065R584J6118n376k9885j3301L817N785m435
4369A114k7638J3323M1554M4246J8587p050r209j1750j6983l4232n5998k0780
4357f4816j443N7057M3739r468o584p830j4608K4640L51k1895k5791n8068J9814
4344f4902L6146K4097K4210k8820j9687K3447O1866K2269k1050k2847n2784J1142
4332f913K2087J6668m617K07l2874K4639K2418o631J8852p628j9177n079m019
4319A7933l1122J2438Q446J1831k8771L2350K9621k6561J6384J3529p906l4839
4307A3333k947K4848M5741O647k8148m4494k5241J6295J9762L430n5124k5493
4295e1391K3499q043j2697k3075P383N160m501K9974L1250O274l3718M609K976
$$ plain form
4282 -22300 -42071 -70968 -74111 -89644 -100884 -83778 -35328 855 726 -37550 -35082 -249 -14357
4269 -14357 2536 -11402 7724 2337 -10051 -32987 -28667 -35624 -53370 -75357 -50132 10246
4257 10246 17581 3233 -24017 -14195 8879 2068 -45398 -53988 -27234 -37747 -33149 -26850 -31900
4244 -31900 -8310 27269 13991 -45925 -46591 -32032 -19919 -6552 -713 -3669 -1982 -21632 -8759
4231 -8759 21523 32443 40602 34034 21237 -11330 13113 56792 30594 10122 27374 24667 34580
4218 34580 45289 35909 23908 17439 13260 6223 -17780 16961 -6181 13757 30949 -5958 -29218
4205 -29218 -55672 -34931 -17157 -61934 -32761 -5428 596 -8850 -48408 -37986 -19663 1255
4193 1255 7884 27931 18281 18629 28593 51258 62587 -805 -46263 -22691 6090 23714 26317
$$ packed form
4282b2300j9771k8897l143j5533j1240J7106M8450L6183j29l8276K468L4833j4108
4269a4357J6893j3938J9126n387j2388k2936M320o957j7746k1987K5225O0378
4257A0246P335j4348k7250R822K3074o811m7466q590K6754j0513M598O299n050
4244c1900K3590L5579j3278n9916o66J4559J2113J3367N839k956J687j9650J2873
4231h759L0282J0920Q159o568j2797l2567K4443M3679k6198k0472J7252k707R913
4218C4580J0709r380j2001o469m179p037k4003L4741k3142J9938J7192l6907k3260
4205b9218k6454K0741J7774m4777K9173K7333O024r446l9558J0422J8323K0918
4193A255O629K0047r650L48R964K2665J1329o3392m5458K3572K8781J7624K603
$$ plain form
4180 26317 14315 4086 16746 -4623 -12675 11984 11057 4514 -23674 -30708 -16174 17142 -1023
4167 -1023 -12891 -20379 -37323 -56827 -28611 -23971 -83997 -24642 19686 14293 41731 47905 60207
4154 60207 101592 110733 72278 32053 38673 65460 72337 47840 21075 32758 68627 60674 33405
4141 33405 52695 48183 17799 -3397 -12255 -23799 -41989 -48046 -46113 -40745 -32268 -54253 -57716
4128 -57716 -55301 -36652 28495 26792 9360 26333 8527 -36803 -8562 7219 -19200 3986
4116 3986 -5962 -16085 4133 4615 27336 52576 17500 -31499 -30204 -12860 -9106 -24610 -36527
4103 -36527 -17238 -8904 29692 29910 36411 48805 16545 -20538 -7933 8545 -13381 -25193 -15142
4090 -15142 -15729 -45798 -7785 56550 96041 74541 69931 56116 44499 21627 7968 14944 42565
$$ packed form
4180B6317j2002j0229J2660k1369q052K4659r27o543k8188p034J4534L3316j8165
4167a023j1868p488j6944j9504K8216M640o0026N9355M4328n393K7438O174J2302
4154F0207M1385R141l8455m0225O620K6787O877k4497k6765J1683L5869p953k7269
4141C3405J9290m512l0384k1196q858j1544j8190o057J933N368Q477k1985l463
4128e7716K415J8649O5147j703j7432J6973j7806m5330K8241J5781k6419K3186
4116C986r948j0123K0218M82K2721K5240l5076m8999J295J7344L754j5504j1917
4103c6527J9289Q334L8596K18O501J2394l2260l7083J2605J6478k1926j1812J0051
4090a5142n87l0069L8013O4335L9491k1500m610j3815j1617k2872j3659O976K7621
$$ plain form
4077 42565 48294 42544 2700 14786 35947 33894 23895 -3351 -41320 -43031 -61844 -98295 -75429
4064 -75429 -36444 -40116 -18656 -10720 1997 -12691 1686 -10737 8439 46715 37411 2547
4052 2547 16943 22465 5995 -29345 -91898 -74234 -47477 -26451 -17141 44442 79475 42922
4040 42922 47603 14958 20044 67998 49646 20407 32200 31607 36098 14345 -8743 -10639 23203
4027 23203 50053 25399 23612 32326 19779 30254 20713 6580 9875 22882 6866 -12867 8582
4014 8582 37191 44903 35824 35854 54449 82602 61857 42018 4993 -27034 -31124 -58660 -52160
4001 -52160 -33046 -24327 -12983 -27243 -6775 20564 28744 17513 17816 -14585 2046 6496 -16242
3988 -16242 -51873 -88753 -33846 21641 -292 -33121 4402 28110 8510 -22241 -5030 2281
$$ packed form
4077D2565N729n750l9844J2086K1161k053r999k7246l7969j711j8813l6451K2866
4064g5429L8985l672K1460P936J2717j4688J4377j2423J9176L8276r304l4864
4052B547J4396N522j6470l5340o2553J7664K6757K1026R310O1583L5033l6553
4040D2922M681l2645N086M7954j8352k9239J1793n93M491k1753k3088j896L3842
4027B3203K6850k4654j787Q714j2547J0475r541j4133L295J3007j6016j9733K1449
4014H582K8609P712r079L0J8595K8153k0745j9839l7025l2027m090k7536O500
4001e2160J9114Q719J1344j4260K0468K7339Q180j1231L03l2401J6631M450k2738
3988a6242l5631l6880N4907N5487k1933l2829L7523K3708j9600l0751J7211P311
$$ plain form
3976 2281 23486 691 -25492 -6122 -17418 -1251 -35403 -58789 -60388 -23947 -10997 -6266
3964 -6266 -17754 -4719 -16077 -47269 -25051 47857 33816 -40279 -44195 -31869 -7865 -5975
3952 -5975 16047 45772 19916 -2608 31050 65717 73428 39108 -12424 7630 36615 20526
3940 20526 30168 13264 -24851 -29166 -10390 2701 30421 50274 57155 28468 -19160 -23375 -53781
3927 -53781 -54346 -63945 -46443 -64422 -42479 -11832 22155 33060 -46066 -31486 -13716 10775
3915 10775 30226 49318 69407 39807 1353 -15820 355 22776 26912 971 7950 5991
3903 5991 -20406 -5845 -19934 -38882 -35391 -52032 -43741 -51666 -82201 -102594 -104243 -73818 -15790
3890 -15790 5223 -23736 -24325 -15492 -19681 15368 -8912 -8202 -32024 -30252 -13877 -31676 -30636
$$ packed form
3976B281K1205k2795k6183J9370j1296J6167l4152k3386j599L6441J2950M731
3964f266j1488J3035j1358l1192K2218P2908j4041p4095l916J2326K4004J890
3952e975K2022K9725k5856k2524L3658L4667P711l4320n1532K0054K8985j6089
3940B0526R642j6904l8115m315J8776J3091K7720J9853O881k8687m7628m215l0406
3927e3781n65r599J7502j7979K1943L0647L3987J0905p9126J4580J7770K4491
3915A0775J9451J9092K0089k9600l8454j7173J6175K2421M136k5941O979j959
3903E991k6397J4561j4089j8948L491j6641Q291p925l0535k0393j649L0425N8028
3890a5790K1013k8959n89Q833m189L5049k4280P10k3822J772J6375j7799J040
$$ plain form
3877 -30636 -33696 -30211 -71267 -73862 -59530 -46069 -30529 -33804 -50372 -51543 -60754 -40850 -17589
3864 -17589 -35712 -69589 -52280 -42024 -59795 -57228 -80392 -85230 -74364 -51106 -27389 -4902
3852 -4902 33857 34830 -13077 -20656 -16855 -24353 -64462 -65025 -29852 66118 76463 77146 65587 74591
3838 74591 44143 -21197 -49069 -41567 -28297 -60583 -85760 -21722 -3002 -29282 -22964 -21777
3826 -21777 -30921 -15337 -64545 -86460 -62767 -36633 -63502 -56732 -75988 -105753 -79782 4442
3814 4442 22566 -31834 -34352 -31013 -22518 8762 29936 29474 296 5798 -7413 -59542 -96903
3801 -96903 -99768 -84452 -89485 -51602 -47537 -27437 -20612 30059 39012 41772 56779 31973 12138
3788 12138 -12751 -30364 -22831 -29971 -59681 -67186 -42507 -17149 5061 5346 12536 10918 40529
$$ packed form
3877c0636l060L485m1056k595J4332J3461J5540l275j6568j171r211J9904K3261
3864a7589j8123l3877J7309J0256j7771K567k3164m838J0866K3258K3717K2487
3852d902L8759R73m7907p579L801p498m0109n63L5173R5970J0345O83j1559R004
3838G4591l0448o5340k7872P502J3270l2286k5177O4038J8720k6280O318J187
3826b1777r144J5584m9208k1915K3693K6134k6869O770j9256k9765K5971Q4224
3814D442J8124n4400k518L339Q495L1280K1174m62k9178N502j3211n2129l7361
3801i6903k865J5316n033L7883M065K0100O825N0671Q953K760J5007k4806j9835
3788A2138k4889j7613P533p140k9710p505K4679K5358K2210K85P190j618K9611
$$ plain form
3775 40529 71110 70808 91012 64240 29061 13616 -22092 -60026 -21498 -27121 -26953 -17345 -26119
3762 -26119 4670 15121 6687 5528 -21685 -64022 -79726 -70125 -66287 -43732 -17520 -54369 -30387
3749 -30387 -14091 -51467 27108 -1900 -46736 -61264 -57449 -10751 3797 -51552 -58686 -29703
3737 -29703 -243 -34902 -43082 -49115 -21468 629 21113 -4413 -24797 -29887 -33348 -49311 -26791
3724 -26791 -15721 -17063 -43389 -19073 -33204 -15621 -12948 -24921 -50415 -81249 -46579 -34802
3712 -34802 4674 2723 -35358 -293 14491 16462 9496 -16229 -58947 -60828 -28842 33547 41732
3699 41732 50047 41808 17974 5761 -16039 5177 46268 7166 -1460 7067 -9666 -24271 6342
3686 6342 13930 3693 -14785 -343 16401 1601 -24246 -51351 -32519 -972 22448 -3611
$$ packed form
3775D0529L0581l02K0204k6772l5179j5445l5708l7934L8528n623J68R608q774
3762b6119L0789J0451q434j159k7213m2337j5704R601L838K2555K6212l6849K3982
3749c0387J6296l7376P8575k9008m4836j4528L815M6698J4548n5349p134K8983
3737b9703K9460l4659q180o033K7647K2097K0484k5526k0384n090l461j5963K2520
3724b6791J1070j342k6326K4316j4131J7583K673j1973k5494l0834L4670J1777
3712c4802L9476j951l8081L5065J4784J971o966k5725m2718j881L1986O2389Q185
3699D1732Q315q239k3834j2213k1800K1216M1091l9102q626Q527j6733j4605L0613
3686F342P588j0237j8478J4442J6744j4800k5847k7105J8832L1547K3420k6059
$$ plain form
3674 -3611 -16686 5971 33190 47908 34810 2811 -15035 -14020 8702 54702 51321 72964
3662 72964 68730 39794 43822 54852 14089 3002 -13688 -33989 -65980 -64764 -30643 -34339 5315
3649 5315 14345 -1604 -37499 -45629 -19331 -21240 -2601 35098 101125 82454 75376 72525 30154
3636 30154 39789 24105 -830 -13984 -46856 -56891 -34788 -58232 -66880 -37922 -17733 -58000
3624 -58000 -90132 -43134 -17123 -17931 -10776 -16561 -34960 -16646 -31525 -65276 -17942 24818 43886
3611 43886 52525 11063 -7365 -4604 40043 36451 41943 52206 75000 55632 24638 20769 12850
3598 12850 19347 25833 8129 22547 45852 -1085 -41050 -59857 -39385 -27837 -3536 44699
3586 44699 50997 35107 44869 35705 89644 97627 59224 40899 59664 72850 82862 53964 22154
$$ packed form
3674c611j3075K2657K7219J4718j3098l1999j7846J015K2722M6000l381K1643
3662G2964m234k8936M028J1030m0763j1087j6690k0301l1991J216L4121l696L9654
3649E315R030j5949l5895q130K6298j909J8639L7699O6027j8671p078k851m2371
3636C0154R635j5684k4935j3154l2872j0035K2103k3444q648K8958K0189m0267
3624e8000l2132M6998K6011q08P155n785j8399J8314j4879l3751M7334M2760J9068
3611D3886Q639m1462j8428K761M4647l592N492J0263K2794j9368l0994l869p919
3598A2850O497O486j7704J4418K3305m6937l9965j8807K0472J1548K4301M8235
3586D4699O298j5890R762r164N3939P983l8403j8325J8765J3186J0012k8898l1810
$$ plain form
3573 22154 -23072 -40100 -763 -30017 -57247 -66575 -1882 20143 23452 -15512 -21961 6379
3561 6379 43705 46950 9476 -20504 -10675 20964 28089 25721 26471 28001 41496 39272 29773 -10724
3547 -10724 -34034 -4898 -25095 -49021 -3359 20654 -24934 -68217 -47462 -30283 -47455 -27539
3535 -27539 -10600 -29139 -42688 1015 -5868 -13333 -15217 -1731 32727 55366 60408 40023 21921
3522 21921 -18764 -25371 -23476 -40369 -31551 -30270 -21441 -2106 -17341 -26051 -27593 -550 18086
3509 18086 24240 39606 43846 54702 17572 -40530 -26502 -49443 -45058 -36494 -45546 -20866 61733
3496 61733 114506 110640 71209 54672 26091 36459 63725 17324 -44546 -42657 4440 25597
3484 25597 12582 32618 29241 31209 32039 43178 -5646 -11129 -18787 -31229 -27233 -25841 8081
$$ packed form
3573B2154m5226j7028L9337k9254k7230r328O4693K2025L309l8964o449K8340
3561F379L7326L245l7474k9980R829L1639P125k368P50J530J3495k224r499m0497
3547a0724k3310K9136k0197k3926M5662K4013m5588m3283K0755J7179j7172J9916
3535b7539J6939j8539j3549M3703o883p465j884J3486L4458K2639N042k0385j8102
3522B1921m0685o607J895j6893Q818J281Q829J9335j5235q710j542K7043J8636
3509A8086O154J5366M240J0856l7130n8102J4028k2941M385Q564r052K4680Q2599
3496F1733N2773l866l9431j6537k8581J0368K7266m6401o1870J889M7097K1157
3484B5597j3015K0036l377J968Q30J1139m8824n483p658j2442L996J392L3922
$$ plain form
3471 8081 -7703 -34763 -22414 -59858 -67363 -30076 -29754 -33589 -3301 25090 -8573 17779 6102
3458 6102 -14902 -9388 -27188 -41637 -45291 -37019 -70129 -102539 -66116 -32367 -14791 -40377 -44059
3445 -44059 -53844 -75243 -67587 -49487 -42707 -23638 2408 50608 41741 -4188 -8878 37897 -11023
3432 -11023 -35764 -4452 -71 -21286 -4344 11379 6984 37274 50375 14339 -25205 -39759
3420 -39759 -28810 21279 -20985 -33868 1172 23167 34193 43444 40062 38265 71788 57603
3408 57603 1515 -8490 21997 10049 -9814 -1941 57448 78793 30549 21105 53635 89115
3396 89115 69190 45183 72945 74957 90008 76269 53074 36037 15523 43129 48159 23175
3384 23175 20542 -5 -52605 -24563 59103 45972 6684 16219 28906 23423 30233 39210 17712
$$ packed form
3471H081j5784k7060J2349l7444p505L7287L22l835L0288K8391l3663K6352j1677
3458F102k1004N514j7800j4449l654Q272l3110l2410L6423L3749J7576k5586l682
3445d4059r785k1399P656J8100O780J9069K6046M8200q867m5929m690M6775m8920
3432a1023k4741L1312M381k1215J6942J5723m395L0290J3101l6036l9544j4554
3420c9759J0949N0089m2264j2883L5040K1995J1026R251l382j797L3523j4185
3408E7603n6088j0005L0487j1948j9863P873N9389K1345m8244r444L2530L5480
3396H9115j9925k4007K7762K012J5051j3739k3195j7037k0514K7606N030k4984
3384B3175k633k0547n2600K8042Q3666j3131l9288R535J2687n483O810Q977k1498
$$ plain form
3371 17712 -12673 -28571 -12662 -11501 3526 55780 82607 35365 27475 28463 17455 19162 4281
3358 4281 -12103 -165 3354 19414 -14070 -55329 -25310 -28395 -31547 -4066 9300 31652 60124
3345 60124 67678 39481 35772 61222 72392 90657 75932 47865 27138 18997 -21204 -80323
3333 -80323 -57224 -52693 -18423 -4575 7826 16634 35911 30943 -8699 -41310 17928 65213
3321 65213 55090 -11598 -3834 21560 6536 -20820 -27749 -17788 -38114 -95056 -86096 -94374 -56756
3308 -56756 -13863 -23523 -21801 -30040 -26580 3000 2519 -17767 -26607 -11210 22382 21920 -1173 -23721
3294 -23721 -15005 6477 4938 23953 3396 4097 -1384 -2858 32803 26374 13563 -14663 -27159
3281 -27159 -21508 -28330 -23485 -11556 25508 15173 -29278 -61985 -59382 -7536 -7720 17750 20083
$$ packed form
3371A7712l0385j5898J5909J161J5027N2254K6827m7242p890R88j1008J707j4881
3358D281j6384J1938L519J6060l3484m1259L0019l085l152K7481J3366K2352K8472
3345F0124P554k8197l709K5450J1170J8265j4725k8067k0727q141m0201n9119
3333h0323K3099M531L4270J3848J2401Q808J9277m968l9642l2611N9238M7285
3321F5213j0123o6688P764K5394j5024k7356o929R961k0326n6942Q960q278L7618
3308e6756M2893r660J722q239L460K9580m81k0286q840J5397L3592m62k3093k2548
3294b3721Q716K1482j539J9015k0557P01n481j474L5661o429j2811k8226j2496
3281b7159N651o822M845J1929L7064j0335m4451l2707K603N1846j84K5470K333
$$ plain form
3268 20083 7771 25066 23685 14658 11902 5836 -14142 -19841 11126 25495 42866 54637 15648
3255 15648 -12761 15513 40311 4137 -12174 9171 -12920 -34767 -26427 -25933 -16233 13230 50043
3242 50043 46011 17619 10758 15431 13960 -3141 -14733 -9644 77073 79339 83738 86837 76552
3229 76552 52322 18634 27945 -1837 -21722 -22983 2334 44218 47292 7614 -16647 -8124 4539
3216 4539 2358 -29108 -14643 9750 -30375 -14169 -8022 24024 31570 30292 4075 13341 49963
3203 49963 72631 20213 19626 26925 -8425 -21779 -22492 2622 -31364 -49276 -27105 12016 -5394
3190 -5394 -21770 17893 40041 -18007 -27411 -27324 -54423 -73814 -48279 -17512 -35010 -48819 -8879
3177 -8879 57024 44161 3024 11461 -5865 -34960 -82226 -91024 -23695 17481 -887 -11508
$$ packed form
3268B0083j2312J7295j381r027k756o066j9978n699L0967J4369J7371J1771l8989
3255A5648k8409K8274K4798l6174j6311K1345k2091k1847Q340M94R700K9463L6813
3242E0043m032k8392o861M673j471j7101j1592N089Q6717K266M399L099j0285
3229G6552k4230l3688R311k9782j9885j261K5317M1884L074l9678k4261Q523J2663
3216D539k181l1466J4465K4393m0125J6206O147L2046P546j278k6217R266L6622
3203D9963K2668n2418n87P299l5350j3354p13K5114l3986j7912K2171L9121j7410
3190e394j6376L9663K2148n8048r404Q7k7099j9391K5535L0767j7498j3809L9940
3177h879O5903j2863m1137Q437j7326k9095m7266q798O7329M1176j8368j0621
$$ plain form
3165 -11508 -50682 -25245 15113 -28676 -49110 -30496 5952 6027 -35026 -25594 -19780 -34078 -38414
3152 -38414 -21759 12388 29912 1352 -18773 -4111 810 -17476 -43922 -53756 -63407 -71975 -27545
3139 -27545 -12162 -7554 17308 -31752 -53877 -47543 -29729 38987 20887 -40757 -22572 55873
3127 55873 51165 49981 7832 23708 53922 80422 70021 46500 1054 4973 26222 -4237
3115 -4237 2372 -19668 -9563 13934 42167 26300 1048 18274 28577 47192 34422 48611
3103 48611 31013 2578 13373 4235 -3318 -14542 -44351 -64915 -39009 2183 40990 39007
3091 39007 -7322 4453 31330 13608 -376 -3143 -3141 -8676 -7997 -1474 -6252 7505 15558 31991
3077 31991 58160 38988 34495 7406 -48425 -31351 24322 51461 21237 -6403 -9978 -33246
$$ packed form
3165a1508l9174K5437M0358m3789k0434J8614L6448P5m1053R432N814j4298m336
3152c8414J6655L4147J7524k8560k0125J4662M921j8286k6446r834r651q568M4430
3139b7545J5383M608K4862m9060k2125O334J7814O8716j8100o1644J8185P8445
3127E5873m708j184m2149J5876L0214K6500j0401k3521m5446L919K1249l0459
3115d237O609k2040J0105K3497K8233j5867k5252J7226J0303J8615j2770J4189
3103D8611j7598k8435J0795r138p553j1224k9809k0564K5906M1192L8807j983
3091C9007m6329J1775K6877j7722j3984k767Kn535O79O523m778J3757Q053J6433
3077C1991K6169j9172m493k7089n5831J7074N5673K7139l0224k7640l575k3268
$$ plain form
3065 -33246 -54912 -75350 -61822 -10434 11631 9246 1143 -18844 -31985 -40704 -40855 -59027 -30583
3052 -30583 -20758 -44618 -111893 -91875 -59613 -42477 5134 16516 36726 60651 34191 21215
3040 21215 -9365 -36475 -10222 11050 -37594 -72860 -57846 -9909 -6794 -14112 -17401 4091
3028 4091 50536 37342 -19378 -11883 -25276 -23884 1557 14820 14198 41144 13974 -31908 -57756
3015 -57756 -73201 -20423 4583 30253 48698 50351 34340 80483 97729 77973 6615 -32451
3003 -32451 -46550 -26002 10467 17379 46802 36738 -1989 -30103 -25636 -59983 -56581 -16170
2991 -16170 33156 61434 57995 45023 14645 -20577 -31394 -1388 12796 -12170 -5290 15105
2979 15105 -7098 -28405 7877 24032 45536 33020 26952 20816 2552 1140 -26111 -32103 6674
$$ packed form
3065c3246k1666k0438J3528N1388K2065k385q103j9987j3141q719j51j8172K8444
3052c0583R825k3860o7275K0018L2262J7136M7611J1382K0210K3925k6460j2976
3040B1215l0580k7110K6253K1272m8644l5266J5014M7937L115p318l289K1492
3028D091M6445j3194n6720P495j3393J392K5441J3263o22K6946k7170m5882k5848
3015e7756j5445N2778K5006K5670J8445J653j6011M6143J7246j9756p1358l9066
3003c2451j4099K0548L6469O912K9423j0064l8727k8114M467l4347L402M0411
2991a6170M9326K8278l439j2972l0378l5222j0817L0006J4184k4966O880K0395
2979A5105k2203k1307L6282J6155K1504j2516o068o136j8264j412k7251n992L8777
$$ plain form
2966 6674 44455 54510 33702 13383 -18709 -47362 -25303 -32654 -58559 -27839 -3092 -32874
2954 -32874 -29913 -42584 -41777 -42001 -51293 -54167 -16007 -3381 13093 14704 -20073 -19549 -12807 -3292
2940 -3292 -46021 -34324 -45737 -38842 -12219 -8511 11504 13740 8535 12182 -1765 1031 8521
2927 8521 33417 -3343 9862 49196 22228 25487 58304 56481 63579 82511 68769 38045 35513
2914 35513 6794 5160 -6914 22095 -3667 -32812 -49547 -38556 -60420 -51397 -56112 -48719 -29378
2901 -29378 1662 40188 20073 8359 12570 15967 21674 2795 209 43370 69635 56849 16570
2888 16570 12582 -16136 -29715 -13183 -44311 -37602 -7536 -1551 5132 6736 -19826 -20344 -18230
2875 -18230 -37909 -27069 -25559 -1674 44501 51987 53338 47347 -2909 -34321 19702 15211 24707
$$ packed form
2966F674L7781J0055k0808k0319l2092k8653K2059p351k5905L0720K4747k9782
2954c2874K961j2671Q07k24r292k874L8160J2626J6474J611l4777N24O742R515
2940c292m2729J1697j1413O895K6623L708K0015K236n205L647j3947K796P490
2927H521K4896l6760J3205L9334k6968L259L2817j823P098J8932j3742l0724k532
2914C5513k8719j634j2074K9009k5762k9145j6735J0991k1864R023m715P393J9341
2901b9378L1040L8526k0115j1714M211L397N707j8879k586M3161K6265j2786m0279
2888A6570l988k8718j3579J6532l1128O709L0066N985O683J604k6562n18K114
2875a8230j9679J0840J510K3885M6175P486J351n991n0256l1412N4023m491R496
$$ plain form
2862 24707 16431 31410 48361 46301 47902 47796 25922 -10888 -36854 -7252 10720 -21710 -19279
2849 -19279 -14804 -52377 -9898 -21824 -58898 -92680 -72449 -39474 -4959 2046 17797 38436
2837 38436 10354 40570 81628 50097 64767 46393 16411 9405 36029 43430 53416 69861
2825 69861 94188 98267 93027 64674 38121 10672 -21665 -17494 3843 32846 32539 17395 41105
$$ packed form
2862B4707q276J4979J6951k060J601j06k1874l6810k5966K9602J7972l2430K431
2849a9279M475l7573M2479j1926l7074l3782K0231L2975L4515P005J5751K0639
2837C8436k8082L0216M1058l1531J4670j8374k9982p006K6624P401R986J6445
2825F9861K4327M079n240k8353k6553k7449l2337M171K1337K9003l07j5144K3710
$$ [...]
##END NTUPLES=NMR SPECTRUM
##END=
