##TITLE=Analysis number 316559
Compound Code cc 43904
Book Reference 407/105/2
Project Code adrs
Chemist Name andyw
##JCAMPDX= 6.0         $$ Bruker NMR JCAMP-DX V2.0
##DATA TYPE= NMR SPECTRUM
##DATA CLASS= NTUPLES
##ORIGIN= Bruker BioSpin GmbH
##OWNER= nmr
$$ XWIN-NMR		Version 3.5
$$ Thu Jan 19 14:45:15 2006 GMT Standard Time (UT+0h)  MAYBRIDGE\nmr@NMR_250MHZ
##.OBSERVE FREQUENCY= 250.131544655141
##.OBSERVE NUCLEUS= ^1H
##.ACQUISITION MODE= SIMULTANEOUS (DQD)
##.ACQUISITION SCHEME= undefined
##.AVERAGES= 16
##.DIGITISER RES= 18
##SPECTROMETER/DATA SYSTEM= dpx250
##.PULSE SEQUENCE= zg30
##.SOLVENT NAME= CDCl3
##.SHIFT REFERENCE= (INTERNAL, CDCl3, 0, 16.522)
##AUDIT TRAIL= $$ (NUMBER, WHEN, WHO, WHERE, WHAT)
$$ ##TITLE= Audit trail, XWIN-NMR		Version 3.5
$$ ##JCAMPDX= 5.01
$$ ##ORIGIN= Bruker BioSpin GmbH
$$ ##OWNER= nmr
$$ C:\u/data/dgb/nmr/ADRS/14960/pdata/1/auditp.txt
$$ ##AUDIT TRAIL=  $$ (NUMBER, WHEN, WHO, WHERE, WHAT)
(   1,<2006-01-19 14:44:20.19 +000>,<MAYBRIDGE\nmr>,<NMR_250MHZ>,
      <created by zg, POWCHK disabled, PULCHK disabled
       configuration hash MD5:
       62 19 C7 07 E1 42 D1 B7 37 6C 3D D0 77 39 F9 E6
       data hash MD5: 64K
       51 47 C0 7B 42 5C 1A 1F 93 4D 24 AB 8E 03 D3 74>)
(   2,<2006-01-19 14:44:45.75 +000>,<MAYBRIDGE\nmr>,<NMR_250MHZ>,
      <Start of raw data processing
       ef LB = 0.3 FT_mod = 6 PKNL = 1 SI = 32K 
       data hash MD5: 32K
       5D 6F C2 24 00 3A CF 8D 1B A9 B4 D2 EF 1B 44 16>)
(   3,<2006-01-19 14:44:49.62 +000>,<MAYBRIDGE\nmr>,<NMR_250MHZ>,
      <apk 
       data hash MD5: 32K
       A5 14 01 C7 85 5A 6B 17 43 98 4B 71 1A 4A E2 92>)
(   4,<2006-01-19 14:44:50.48 +000>,<MAYBRIDGE\nmr>,<NMR_250MHZ>,
      <abs ABSG = 5 
       data hash MD5: 32K
       00 C3 3A A3 1A 16 35 81 40 68 41 71 7A 7B 38 90>)
$$ ##END=
$$ 
$$ hash MD5
$$ A2 DA 8E 17 34 42 D9 9A E0 E4 B8 39 2F A5 56 26
##$RELAX= 
##$RELAX= 
##$RELAX= 
##$RELAX= 
##$RELAX= 
##$RELAX= 
##$RELAX= 
$$ Bruker specific parameters
$$ --------------------------
##$DU= <C:\u>
##$EXPNO= 14960
##$NAME= <ADRS>
##$PROCNO= 1
##$TYPE= <nmr>
##$USER= <dgb>
##$AMP= (0..31)
100 100 100 100 100 100 100 100 100 100 100 100 100 100 100 100 100 100 
100 100 100 100 100 100 100 100 100 100 100 100 100 100 
##$AQSEQ= 0
##$AQ_mod= 3
##$AUNM= <au_zg>
##$AUTOPOS= <55 >
##$BF1= 250.13
##$BF2= 250.13
##$BF3= 250.13
##$BF4= 250.13
##$BF5= 500.13
##$BF6= 500.13
##$BF7= 500.13
##$BF8= 500.13
##$BYTORDA= 1
##$CFDGTYP= 0
##$CFRGTYP= 5
##$CHEMSTR= <none>
##$CNST= (0..31)
1 1 145 1 1 1 1 1 1 1 1 1 1 1 1 1 1 1 1 1 1 1 1 1 1 1 1 1 1 1 1 1 
##$CPDPRG= <>
##$CPDPRG1= <>
##$CPDPRG2= <>
##$CPDPRG3= <>
##$CPDPRG4= <mlev>
##$CPDPRG5= <mlev>
##$CPDPRG6= <mlev>
##$CPDPRG7= <mlev>
##$CPDPRG8= <mlev>
##$CPDPRGB= <>
##$CPDPRGT= <>
##$D= (0..31)
0 1 0 0 0 0 0 0 0 0.06 0 0 0 0 0 0 0.0002 0 0 0 0 0 0 0 0 0 0 0 0 0 0 
0 
##$DATE= 1137681855
##$DBL= (0..7)
120 120 120 120 120 120 120 120 
##$DBP= (0..7)
150 150 150 150 150 150 150 150 
##$DBP07= 0
##$DBPNAM0= <>
##$DBPNAM1= <>
$$ [...]
##$SUBNAM7= <"">
##$SUBNAM8= <"">
##$SUBNAM9= <"">
##$SW= 20.6930455092707
##$SWIBOX= (0..15)
0 0 3 0 0 0 0 0 0 0 0 0 0 0 0 0 
##$SW_h= 5175.983436853
##$TD= 65536
##$TD0= 1
##$TE= 294.16
##$TE2= 300
##$TE3= 300
##$TEG= 300
##$TL= (0..7)
0 120 120 120 120 120 120 120 
##$TP= (0..7)
150 150 150 150 150 150 150 150 
##$TP07= 0
##$TPNAME0= <>
##$TPNAME1= <>
##$TPNAME2= <>
##$TPNAME3= <>
##$TPNAME4= <>
##$TPNAME5= <>
##$TPNAME6= <>
##$TPNAME7= <>
##$TPOAL= (0..7)
0.5 0.5 0.5 0.5 0.5 0.5 0.5 0.5 
##$TPOFFS= (0..7)
0 0 0 0 0 0 0 0 
##$TUNHIN= 0
##$TUNHOUT= 0
##$TUNXOUT= 0
##$USERA1= <user>
##$USERA2= <user>
##$USERA3= <user>
##$USERA4= <user>
##$USERA5= <user>
##$V9= 5
##$VALIST= <valist>
##$VCLIST= <CCCCCCCCCCCCCCC>
##$VD= 0
##$VDLIST= <DDDDDDDDDDDDDDD>
##$VPLIST= <PPPPPPPPPPPPPPP>
##$VTLIST= <TTTTTTTTTTTTTTT>
##$WBST= 1024
##$WBSW= 4
##$XGAIN= (0..3)
0 0 0 0 
##$XL= 0
##$YL= 0
##$YMAX_a= 479737
##$YMIN_a= -469915
##$ZGOPTNS= <>
##$ZL1= 120
##$ZL2= 120
##$ZL3= 120
##$ZL4= 120
##$ABSF1= 16.522
##$ABSF2= -4.171173
##$ABSG= 5
##$ABSL= 3
##$ALPHA= 0
##$AQORDER= 0
##$ASSFAC= 0
##$ASSFACI= 0
##$ASSFACX= 0
##$ASSWID= 0
##$AUNMP= <proc_1d>
##$AZFE= 0.1
##$AZFW= 0.1
##$BCFW= 0
##$BC_mod= 0
##$BYTORDP= 0
##$COROFFS= 0
##$CY= 12.5
##$DATMOD= 1
##$DC= 0
##$DFILT= <>
##$DTYPP= 0
##$F1P= 14.0000005364418
##$F2P= -0.99999901652339
##$FCOR= 0.5
##$FTSIZE= 32768
##$FT_mod= 6
##$GAMMA= 0
##$GB= 0
##$INTBC= 1
##$INTSCL= 1
##$ISEN= 128
##$LB= 0.3
##$LEV0= 0
##$LPBIN= 0
##$MAXI= 10000
##$MC2= 0
##$MEAN= 0
##$ME_mod= 0
##$MI= 0
##$NCOEF= 0
##$NC_proc= -2
##$NLEV= 6
##$NOISF1= 0
##$NOISF2= 0
##$NSP= 0
##$NTH_PI= 0
##$NZP= 0
##$OFFSET= 16.522
##$PC= 1
##$PHC0= 236.1448
##$PHC1= 6.632976
##$PH_mod= 1
##$PKNL= yes
##$PPARMOD= 0
##$PSCAL= 4
##$PSIGN= 0
##$REVERSE= no
##$SF= 250.13
##$SI= 32768
##$SIGF1= 0
##$SIGF2= 0
##$SINO= 400
##$SIOLD= 32768
##$SREGLST= <1H.CDCl3>
##$SSB= 0
##$STSI= 32768
##$STSR= 0
##$SW_p= 5175.98343685301
##$SYMM= 0
##$S_DEV= 0
##$TDeff= 65536
##$TDoff= 0
##$TI= <Analysis number 999999
Compound Code 99
Book Reference 9
Project Code 9>
##$TILT= no
##$TM1= 0
##$TM2= 0
##$TOPLEV= 0
##$USERP1= <user>
##$USERP2= <user>
##$USERP3= <user>
##$USERP4= <user>
##$USERP5= <user>
##$WDW= 1
##$XDIM= 32768
##$YMAX_p= 409737492
##$YMIN_p= -46199
$$ End of Bruker specific parameters
$$ ---------------------------------
##NTUPLES= NMR SPECTRUM
##VAR_NAME=  FREQUENCY,     SPECTRUM/REAL,   SPECTRUM/IMAG
##SYMBOL=    X,             R,               I
##VAR_TYPE=  INDEPENDENT,   DEPENDENT,       DEPENDENT
##VAR_FORM=  AFFN,          ASDF,            ASDF
##VAR_DIM=   32768,         32768,           32768
##UNITS=     HZ,            ARBITRARY UNITS, ARBITRARY UNITS
##FACTOR=    0.157963299565203, 1,           1
##FIRST=     4132.6476996994, 0,             0
##LAST=      -1043.33573715361, 0,           0
##MIN=       -1043.33573715361, -46199,      0
##MAX=       4132.6476996994, 409737492,     0
$$ Real data points
##PAGE= N=1
##DATA TABLE= (X++(R..R)), XYDATA
$$ [...]
15316b454P890p417p159J137J2134O604j1185L82P090p357j7495r348O940N373
$$ -2454 5436 -1981 -9140 -8003 4131 10735 -450 -68 7022 -335 -17830 -27178 -20238 -14865
15302a4865M50Q326P522O962r189k13O798R325o957j0612R92m083q193O007O313
$$ -14865 -14415 -6089 1433 8395 -794 -1007 5791 15116 8159 -2453 -1461 -5544 -13737 -7730 -1417
15287a417O036N046L677J4728o319r871N58J0218J485k661O863j5644j4559p369
$$ -1417 4619 9665 13342 28070 21751 11880 12438 22656 24141 21480 28343 12699 -1860 -9229
15273i229N12R887J4869M011n120j561l240k0969j4364L256kK409m49n990R686
$$ -9229 -8717 1170 16039 20050 14930 13369 10129 -10840 -25204 -21948 -21950 -19541 -19990 -25980 -16294
15258a6294P392m837N196R932m565l652M38J88J1790J220k733L65L217m054p55
$$ -16294 -8902 -13739 -8543 1389 -3176 -6828 -6390 -6202 5588 6808 4075 4440 7657 3603 2848
15243B848J2252J983j2662q541M269J0756l511j0318k766R586q709k331Q701J1964
$$ 2848 15100 17083 4421 -4120 149 10905 7394 -2924 -5690 3896 -4813 -7144 1557 13521
15229A3521j88j7880J04k887l335J064P521O064r224P002J7385P105j2558j9415
$$ 13521 13333 -4547 -4443 -7330 -10665 -9601 -2080 3984 -5240 1762 19147 26252 13694 -5721
15215e721j0203o184k699l39J2144J5842n514M424P277J0270o982j5986k666N207
$$ -5721 -15924 -22108 -24807 -25146 -13002 2840 -2674 1750 9027 19297 12315 -3671 -6337 -1130
15201a130j3138k672K438m564R956L166M526j224j772O581n464L604K355R016
$$ -1130 -14268 -16940 -14502 -19066 -9110 -5944 -1418 -2642 -4414 2167 -3297 307 2662 11678
15187A1678L629k2q347j4780n764o841k61O14J519o507P181P14K623M09p391n877
$$ 11678 15307 15285 6938 -7842 -13606 -20447 -20708 -20094 -18575 -25082 -17901 -17187 -14564 -14155 -21546 -27423
15171b7423M938n619O263J0968Q263n137J3253O644n28O095n653l347n351m766
$$ -27423 -22485 -28104 -21841 -10873 -2610 -7747 5506 12150 11622 17717 12064 8717 3366 -1400
15157a400p02l26Q776J729j7545j6741q837J318J3468J4667O116K124n836RJ5509
$$ -1400 -2102 -2428 6348 8077 -9468 -26209 -35046 -33728 -20260 -5593 523 2647 -3189 -3180 12329
15142A2329K776l679m394j4302j328j178L575m158N914J2987l730j0041J515m251
$$ 12329 15105 11426 7032 -7270 -8598 -9776 -6201 -10359 -4445 8542 4812 -5229 -3714 -7965
15128g965n135r2O879Q727m738j741j0459j2164J8519J0658j226o853J196K161
$$ -7965 -13100 -13192 -6313 2414 -2324 -4065 -14524 -26688 -8169 2489 1263 -5590 -4394 -2233
15114b233M689J6777l986j0246n027p685m869J0025Q844K090j0422j2704k514
$$ -2233 2456 19233 15247 5001 -26 -7711 -12580 -2555 6289 8379 -2043 -14747 -17261
15101a7261J0810P228j2808O730k924n672O367J2048Q8j0229n651J4715J1435
$$ -17261 -6451 777 -12031 -5301 -8225 -13897 -7530 4518 4606 -5623 -11274 3441 14876
15088A4876L635j9555j3328p484L790M405J2372n145J822j1266j33M675j0216
$$ 14876 18511 -1044 -14372 -21856 -18066 -13661 -1289 -6434 -4612 -15878 -16011 -11336 -21552
15075b1552o36J020m75O71L66K818P091M878L60j0646m726L810O033l351k507
$$ -21552 -22188 -21168 -21643 -20972 -20606 -17788 -10697 -5819 -5459 -16105 -20831 -17021 -10988 -14339 -16846
15060a6846K960Q034Q816p032p6L17o775p157L757J940J3778P718j4992l884J1253
$$ -16846 -13886 -5852 2964 -4068 -4144 -3827 -10602 -17759 -14002 -12062 1716 9434 -5558 -9442 1811
15045A811q29j1298L601l815n593q624Q861J9106j2272m837J895K893n114m452
$$ 1811 982 -10316 -6715 -10530 -16123 -24747 -15886 3220 -9052 -13889 -11994 -9101 -14215 -18667
15031a8667L125M072k886q210J274O139L660r24j320o404k1870n29Q729J7013
$$ -18667 -15542 -11470 -14356 -22566 -21292 -15153 -11493 -12417 -13737 -20141 -42011 -42540 -33811 -16798
15017a6798M646L334j2823J369R15L440J0403k483O43J872N949m84j4299j8913
$$ -16798 -12152 -8818 -21641 -20272 -19357 -15917 -5514 -7997 -7354 -5482 467 -17 -14316 -33229
15003c3229K304J0421L135R111J6210J7873q572r187j2545m231Q275J3851J326
$$ -33229 -30925 -20504 -17369 -8258 7952 25825 17253 8066 -4479 -8710 -435 13416 14742
14990A4742K128L076o342j0268k359R66l874r67L64O280L9P18j500j81p115o562
$$ 14742 16870 19946 13604 3336 977 1943 -1931 -2898 -2534 3746 3785 4503 3003 2822 -4293 -10855
14974a0855O726O990j77j860m327l12k645J387N700M009N621J070M209j2969j8674
$$ -10855 -4129 2861 2684 824 -3503 -3815 -6460 -5073 627 4636 10257 11327 15536 2567 -16107
14959a6107j1423J865J0397O263R388O824j1684r722o446p233m431p50k928Q074
$$ -16107 -27530 -25665 -15268 -9005 383 7207 -4477 -14199 -20645 -27878 -32309 -33059 -35987 -27913
14945b7913J5654J4349q38P35P279j1962l060M767r558l097k989M449Q290k342
$$ -27913 -12259 2090 1252 1987 9266 -2696 -5756 -989 -10547 -13644 -16633 -12184 -3894 -6236
14931f236o215L808J1920K435l074j941K421j855j657j903m608n898j613J2573
$$ -6236 -12451 -8643 3277 5712 2638 697 3118 1263 -394 -2297 -6905 -12803 -14416 -1843
14917a843k961J770P651K063L159l412N073n11O277k096l888k88j3495R393k571
$$ -1843 -4804 -3034 4617 6680 9839 6427 11500 10989 17266 15170 11282 10994 -2501 6892 4321
14902D321p739k778P657N855m768m910Q204k414L98L896m945r328L073N592J940
$$ 4321 -3418 -6196 1461 7316 2548 -2362 5842 3428 3826 7722 2777 -6551 -3478 2114 4054
14887D054n234j170O21J5872Q073k628j1590j2125n369j324N503k364J4269L131
$$ 4054 -1180 -2350 -1729 14143 22216 19588 7998 -4127 -9496 -10820 -5317 -7681 6588 9719
14873I719m236n769o66R30r487M410N488K682M549N007m176q54j0240R09m481
$$ 9719 5483 -286 -952 -22 -9509 -5099 389 3071 7620 12627 8451 7597 -2643 -1734 -6215
14858f215m543k978p27k2209J89N752L595K2869M850N510Q80N325J400q023q479
$$ -6215 -10758 -13736 -14463 -36672 -36483 -30731 -27136 -4267 583 6093 6973 12298 13698 5675 -2804
14843b804J4507k91K668o059q945m285k929N658M49J2286J3527k480j4408m307
$$ -2804 11703 11412 14080 8021 -924 -5209 -8138 -2480 -2031 10255 23782 21302 6894 2587
14829B587j1519m402K270K62J1112l900k780l603J3252J7700k851r539p097n642
$$ 2587 -8932 -13334 -11064 -10802 310 -3590 -6370 -9973 3279 20979 18128 8589 1492 -4150
14815d150k936P1n12O300o80J1140q158p147J5364K925m692p602n7L066m001k026
$$ -4150 -7086 -7015 -7527 -1227 -1907 9233 1075 -6072 9292 12217 7525 -77 -134 2932 -1069 -3095
14799c095M838n918m469j553R068O60L598J874J0581l497j3835l483l95j3142
$$ -3095 1743 -4175 -8644 -10197 -1129 -469 3129 5003 15584 12087 -1748 -5231 -5626 -18768
14785a8768l222J2377J1833M565P108j888k335J795k447j190L618o263j5166L790
$$ -18768 -21990 -9613 2220 6785 13893 12005 9670 11465 9018 7828 11446 5183 -9983 -6193
14771f193K2678n506m848j0028r345L016j1569J2394L722r013j0695R935J8453
$$ -6193 16485 10979 6131 -3897 -13242 -10226 -21795 -9401 -5679 -14692 -25387 -15452 3001
14758C001J363j1977q347l402L966l601j79k425n063Q543K57J513m670M306K489
$$ 3001 4364 -7613 -15960 -19362 -15396 -18997 -19176 -21601 -26664 -18121 -17864 -16351 -21021 -16715 -14226
14743a4226J0019Q67j1280q756Q407P071N821Q141O70K692R232J2839j0146q690
$$ -14226 -4207 -3340 -14620 -23376 -14969 -7898 -2077 6064 6734 9426 18658 31497 21351 12661
14729A2661j151K80j05J1113k921n382j1124j0902j295o580j0850k115R407N850
$$ 12661 11510 11790 11685 22798 19877 14495 3371 -7531 -8826 -15406 -26256 -28371 -18964 -13114
14715a3114M800K585O89P546K494k04j970N658j0766j5571k910k85R687J912J6677
$$ -13114 -8314 -5729 -5040 2506 5000 4796 2826 8484 -2282 -17853 -20763 -21048 -11361 -9449 7228
14700G228J233m694P61j66l802o349L545l708l289J8823n827o897N850j077l265
$$ 7228 8461 3767 4528 4362 560 -5789 -2244 -5952 -9241 9582 3755 -3142 2708 1631 -1634
14685a634q517j864m025p968J732J1922j732k238R331J0071J19n931K221k204
$$ -1634 -10151 -12015 -16040 -24008 -22276 -10354 -12086 -14324 -4993 5078 5197 -734 1487 -717
14671g17j761j0358O8J448j2596m931P356k636J4138M788J618q524N672K0720
$$ -717 -2478 -12836 -12768 -11320 -23916 -28847 -21491 -24127 -9989 -5201 -3583 -12107 -6435 14285
14657A4285p267p105o796o809n99j0696m330j144J6207J579J728Q035J827O384
$$ 14285 7018 -87 -6883 -13692 -14291 -24987 -29317 -30461 -14254 -12675 -10947 -2912 -1085 5299
14643E299k811k89l236j7733m834N050j526r89J843M176Q610P708L056l273r978
$$ 5299 2488 2199 -1037 -18770 -23604 -18554 -20080 -21069 -19226 -15050 -6440 1268 4324 1051 -8927
14628h927K51J6385N022j0218j8466O985Q017j157K130l26N050N837M41o666J01
$$ -8927 -8676 7709 12731 2513 -15953 -8968 -951 -2108 22 -304 4746 10583 11024 4358 4459
14613D459J6270j4651j6319r300j652J0817N890R96L094j6236k984J3178J6184
$$ 4459 20729 6078 -10241 -19541 -21193 -10376 -4486 -3490 -396 -16632 -19616 -6438 9746
14600I746l754M053O292n299j0382J1497K023O79K526q331L61M954O166L79p499
$$ 9746 5992 10045 16337 11038 656 12153 14176 14855 17381 9050 9411 14365 20531 20910 13411
14585A3411j2151j0650O319J2469K789q443o3r793j2302Q728j876j608J086K027
$$ 13411 1260 -9390 -3071 9398 12187 3744 3681 -6112 -18414 -9686 -11562 -13170 -12084 -10057
14571a0057M228R915O379l218j0752o225J0030m69O394P131n345n856K731P382
$$ -10057 -5829 4086 10465 7247 -3505 -9730 300 -169 6225 13356 8011 2155 4886 12268
14557A2268L189n727r429n04l186L698J3215q201j3653n000J662m486J914R159
$$ 12268 15457 9730 301 -203 -3389 309 13524 5323 -8330 -13330 -11668 -16154 -14240 -5081
14543e081j556L72N349j719N055p821n86N759M404P551o928M074L008m205L478
$$ -5081 -6637 -6265 -916 -2635 2420 -5401 -5987 -228 4176 11727 4799 8873 11881 7676 11154
14528A1154o595N107Q448m960j3101p820Q019L503k693p072n77n339L559K169
$$ 11154 4559 9666 18114 13154 53 -7767 252 3755 1062 -6010 -6587 -11926 -8367 -6198
14514f198r66j3034L084N458Q99N956J4929M968J0M973j264p805l424o462M32
$$ -6198 -7164 -20198 -17114 -11656 -10757 -4801 10128 15096 15106 20079 18815 11010 7586 1124 1556
14499A556M959J0716N329K276r466q85l389j1658j47P81J437j814J1109J2093
$$ 1556 6515 17231 22560 24836 15370 14485 11096 -562 -709 72 1509 -305 10804 22897
14485B2897j184q530p017J077J048j731R221m905j6145j935N494L309n795J541
$$ 22897 21713 13183 6166 7243 8291 6560 15781 10876 -5269 -7204 -1710 1599 -4196 -2655
14471b655q47j03J1464N55o252j0669m238P208k239J1456N269j1781m324N429
$$ -2655 -3502 -3605 7859 8414 2162 -8507 -12745 -5537 -7776 3680 8949 -2832 -7156 -1727
14457a727O106o10l329l818L580J430q92n49Q453k981j5775q882J319J6104P848
$$ -1727 4379 3769 440 -3378 202 1632 740 191 8644 5663 -10112 -18994 -17675 -1571 6277
14442F277K164k760j7491k550J467R183O574k050L169N562O41m811M657k076L771
$$ 6277 8441 5681 -11810 -14360 -12893 -3710 2864 814 3983 9545 10186 5375 10032 7956 11727
14427A1727r446Q20R489K427q313m415r758O13M579P719n53k57l362n416o297
$$ 11727 2281 3101 12590 15017 6704 2289 -7469 -6856 -2277 5442 4889 4632 1270 -4146 -10443
14412a0443p12k17L081n5k483Q650m840N528M940j352J49J05k676j785K337O688
$$ -10443 -11155 -11372 -8291 -8346 -10829 -2179 -7019 -1491 3449 2097 2246 2351 -325 -2110 227 6915
14396F915K484l189r484p28J5891R150Q58M1l130m333r945Q63K549p867l719q98
$$ 6915 9399 6210 -3274 -4002 11889 21039 21897 21938 18808 14475 4530 5393 7942 75 -3644 -4542
14380d542K590j0282J2290J200Q603m739r440l886k506l706J561k100N785p450
$$ -4542 -1952 -12234 56 1256 9859 5120 -4320 -8206 -10712 -14418 -12857 -14957 -9172 -16622
14366a6622J48n382m105J0932j236m349R117L266j662L053Q405j24K197N243n280
$$ -16622 -16474 -21856 -25961 -15029 -16265 -20614 -11497 -8231 -9893 -6840 1565 1441 3638 8881 3601
14351C601L16l936J3478n436m951j0048p393j460N517J757Q866J357n478k864
$$ 3601 3917 -19 13459 8023 3072 -6976 -14369 -15829 -10312 -8555 311 1668 -3810 -6674
14337f674N691n205l749O617p030q296j2039K347Q252p694J3365R853O012p555
$$ -6674 -983 -6188 -9937 -3320 -10350 -18646 -30685 -28338 -20086 -27780 -14415 -4562 1450 -6105
14323f105j729J275j4093m154k136J0942O328J030p67O601l697q110n728M598
$$ -6105 -7834 -6559 -20652 -24806 -26942 -16000 -9672 -8642 -9409 -2808 -6505 -14615 -20343 -15745
14309a5745J6276Q618m78n460j0460J469K231r481p947J0876J427O444L311L468
$$ -15745 531 9149 8671 3211 -7249 -5780 -3549 -13030 -20977 -10101 -8674 -2230 1081 4549
14295D549R953j94n667m62j2582j8159r105J0298P52o87J879J0928P934j713J53
$$ 4549 14502 14308 8641 8179 -4403 -22562 -31667 -21369 -20617 -21304 -19425 -8497 -563 -2276 -2123
14280b123J369n665l950j973P726J1265j0048j1499n692p740Q965K849J2400j470
$$ -2123 -754 -6419 -10369 -12342 -4616 6649 -3399 -14898 -20590 -28330 -19365 -16516 -4116 -5586
14266e586O52P526p138p087j746k136n338j819O333j850q09r051q974J1142J6972
$$ -5586 -4934 2592 -4546 -11633 -13379 -15515 -20853 -22672 -16339 -18189 -18998 -28049 -37023 -25881 -8909
14251h909J3596J4086n937j5402r085j614O077p280n249N310R127M233m686l071
$$ -8909 4687 18773 12836 -2566 -11651 -13265 -7188 -14468 -19717 -14407 -5280 -1047 -5733 -8804
14237h804o69P127m142l780K074J367j6326m616J1952P857J651r52j697N720l594
$$ -8804 -9473 -2346 -6488 -10268 -8194 -6827 -23153 -27769 -15817 -7960 -6309 -7261 -8958 -3238 -6832
14222f832J1728J4520J232k868n320o770L936P597k61p251l027P598L062l291
$$ -6832 4896 19416 20648 17780 12460 5690 9626 17223 16962 9711 6684 14282 17344 14053
14208A4053L572r45L932l445L20j734j978L603j0681l119L562j1761j2816L472
$$ 14053 17625 16680 20612 17167 17487 15753 13775 17378 6697 3578 7140 -4621 -17437 -13965
14194a3965J920J2489O89j4081m854K030P984O726P737J815r290n465J2807N264
$$ -13965 -12045 444 1133 -12948 -17802 -15772 -7788 -1062 6675 8490 -800 -6265 6542 11806
14180A1806j90j136Q81o525j4662l621M457Q795o89n268P271o548J435Q600m588
$$ 11806 11616 10480 11361 4836 -9826 -13447 -8990 -195 -884 -6152 1119 -5429 -3994 4606 18
14165A8J1329J1631k515j703j2951j4229K404P331P01O658r669r139l503L872
$$ 18 11347 22978 20463 18760 5809 -8420 -6016 1315 2016 8674 -995 -10134 -13637 -9765
14151i765j0065j428j357k240L780k972J546N678k048N62J924R375J0797J485
$$ -9765 -19830 -21258 -22615 -24855 -21075 -24047 -22501 -16823 -18871 -18309 -16385 -7010 3787 5272
14137E272l965k54l04N224L652p697j0672K380J2249K001n946L198Q731J955L56
$$ 5272 1307 1053 749 5973 9625 1928 -8744 -6364 5885 7886 1940 5138 13869 15824 16180
14122A6180j0177j069k477K931m672R497p464K770q768L216kr408J0721M748j1550
$$ 16180 6003 4934 2457 5388 716 10213 2749 5519 -3249 -33 -35 -9443 1278 6026 -5524
14107e524O224O998P797J0219j1589q709m616j3973k469J0097J3122o977j2924
$$ -5524 700 7698 15495 25714 14125 5416 800 -13173 -15642 -5545 7577 600 -12324
14094a2324m157O660K360N269o052k692J3275p73J637N060l966M038k704r035
$$ -12324 -16481 -9821 -7461 -2192 -8244 -10936 2339 1566 3203 8263 4297 8335 5631 -3404
14080c404j679p971l665J1472J2100j980j0890j026R932j114l935N339Q645K794
$$ -3404 -5083 -13054 -16719 -5247 6853 4873 -6017 -7043 2889 1775 -2160 3179 11824 14618
14066A4618j6097j2499O398r0Q209k816q334m240J0717J860P16N747l122p761
$$ 14618 -1479 -13978 -7580 -7670 539 -2277 -10611 -14851 -4134 -2274 -1558 4189 1067 -6694
14052f694P391N292q439p311m793J0094L750j41j048O020O492k531J1826M482
$$ -6694 697 5989 -2450 -9761 -14554 -4460 -710 -851 -1899 4121 10613 8082 19908 24390
14038B4390O609n899q462O73m953p248K952j1605p16J5158L047j0530p398q204
$$ 24390 30999 25100 16638 17311 12358 5110 8062 -3543 -4259 10899 13946 3416 -3982 -12186
14024a2186J0745J7271q412q552J923k979K83k072N01J1656j690K743o708L223
$$ -12186 -1441 15830 7418 -1134 789 -2190 -1907 -3979 -3478 8178 6488 9231 2523 5746
14010E746r013Q18O039O1q225q921j989L359K063M877J999q596l682l208p908
$$ 5746 -3267 -2449 3590 3651 -4574 -13495 -15484 -12125 -10062 -5185 -3186 -11782 -15464 -18672 -26580
13995b6580j167J2289J1541J0682N21o567j457r545K970o162j212p61m33L705
$$ -26580 -27747 -15458 -3917 6765 7286 719 -738 -10283 -7313 -13475 -14687 -15448 -15881 -12176
13981a2176K118n677O791Q886Q074K508O59q699K369j511r241R361P79q561q269
$$ -12176 -10058 -15735 -8944 -58 8016 10524 11183 2484 4853 3342 -5899 3462 4241 -4320 -12589
13966a2589K313L074J3373N460J7K192J119l480o951q088j841K95R095J302R691
$$ -12589 -10276 -7202 6171 11631 11648 13840 14959 11479 4528 -3560 -5401 -5106 3989 5291 14982
13951A4982r069r109m712O836j950q409J170R486N114j675p206O551R613n547
$$ 14982 5913 -3196 -7908 -1072 -3022 -11431 -10261 -775 4339 2664 -4542 2009 11622 6075
13937F075M268J597q53o965M489L664k43Q665N739j7004l063M928j0305M349R75
$$ 6075 10343 11940 11087 4122 8611 12275 12032 20697 26436 9432 6369 11297 992 5341 6316
13922F316k91o84p600J618o409p210P92J1084P51m846Q72J4992m857l975qk044
$$ 6316 6025 5341 -2259 -641 -7050 -14260 -13468 -2384 -1633 -6479 -5607 9385 4528 553 545 -1499
13906a499K314K385m618m548J2813M307j7242J00K935j030J3362K59j997N654
$$ -1499 815 3200 -1418 -5966 6847 11154 -6088 -5988 -3053 -4083 9279 9538 7541 13195
13892A3195j077j3212j2299l39O160j836n638K602P565j0015n948N697n323l267
$$ 13195 12118 -1094 -13393 -13732 -7572 -9408 -15046 -12444 -4879 -14894 -20842 -15145 -20468 -23735
13878b3735J1480K592O312j999L037M300r56K083L28J401r49p475r663K856Q282
$$ -23735 -12255 -9663 -3351 -5350 -2313 1987 1031 3114 3442 4843 3894 -3581 -13244 -10388 -2106
13863b106K974q350R649R413j1989j2322m489P49J1724J1183p183J1405K024r685
$$ -2106 868 -7482 2167 11580 -409 -12731 -17220 -16471 -4747 6436 -747 10658 12682 2997
13849B997K862Q235k200r498L554j2460r165Q867O702l532K76P830j2376j3975
$$ 2997 5859 14094 11894 2396 5950 -6510 -15675 -6808 -106 -3638 -3362 4468 -7908 -21883
13835b1883P534R501r609j2073j868P694Q066P855l423j1055K386J3737R73Q90
$$ -21883 -14349 -4848 -14457 -26530 -28398 -20704 -12638 -4783 -8206 -19261 -16875 -3138 -2165 -1275
13821a275p151M79J169j2239o202J5766J0137p2k508J715N43R222p058O7m175
$$ -1275 -8426 -7947 -6778 -19017 -25219 -9453 684 612 -1896 -181 362 9584 2526 2593 -1582
13806a582j2624L831O657P362J100m464m739J380j621k369k168j334j6478q932
$$ -1582 -14206 -10375 -3718 3644 4744 280 -4459 -3079 -4700 -7069 -9237 -10571 -27049 -35981
13792c5981M47N483J5773J0717L331K738R46j661k883l287M60L991Q244j4840
$$ -35981 -35534 -30051 -14278 -3561 -230 2508 3454 1793 -1090 -4377 -3917 74 8318 -6522
13778f522l539J994J309j714P104O272L537N344p650p696M68p795N532J1910Q774
$$ -6522 -10061 -8067 -6758 -8472 -1368 4904 8441 13785 6135 -1561 -1093 -8888 -3356 8554 17328
13763A7328p322j1977k393R16J1696K968j298M779o291n599O337j4643r380J33
$$ 17328 10006 -1971 -4364 -3448 8248 11216 9918 14697 8406 2807 9144 -5499 -14879 -14746
13749a4746J9072Q855K915j452n723l976j0129n811j716n515J2178J2643K526
$$ -14746 4326 13181 16096 14644 8921 4945 -5184 -10995 -12711 -18226 -6048 6595 9121
13736I121j910P971O119k918q393n971J51j2947o468L593o194Q09J1548o833K063
$$ 9121 7211 15182 21301 18383 9990 4019 4170 -8777 -15245 -11652 -17846 -17037 -5489 -12322 -10259
13721a0259P043P596k552j981P907P420O578j2138j4072p08l751J4286m259j78
$$ -10259 -3216 4380 1828 -153 7754 15174 21752 9614 -4458 -5166 -8917 5369 1110 932
13707I32J4890J5999n924j7302n205p865j539M785p36N894Q517M864j659j3453
$$ 932 15822 31821 25897 8595 3390 -4475 -6014 -1229 -1965 3929 12446 17310 15651 2198
13693B198j0524J759n060p213J546m571K334O457O456r998M025N564R418K233
$$ 2198 -8326 -6567 -11627 -18840 -17294 -21865 -19531 -13074 -6618 -16616 -12591 -7027 2391 4624
13679D624O865K936m452p822q085P099R415J3769N192q562J018l359P98n509j3054
$$ 4624 11489 14425 9973 2151 -5934 1165 10580 24349 29541 20979 21997 18638 19436 13927 873
13664H73L727J847j814L658P718o544j5292J3356J143k768R869O87p255k225M851
$$ 873 4600 6447 4633 8291 16009 9465 -5827 7529 8672 5904 15773 16460 9205 6980 11831
13649A1831L447R867J53n161J095O443j7804j1229M863p545K71O182J7306M258
$$ 11831 15278 25145 25298 20137 21232 27675 9871 -1358 3505 -4040 -3769 2413 19719 23977
13635B3977k0734p212q770m801P776l854N951k048L52M199N830K523J5882r01
$$ 23977 3243 -3969 -12739 -17540 -9764 -13618 -7667 -9715 -9363 -5164 666 3189 19071 18170
13621A8170o906r159q794k374P18j776R68L600l426q05J418R935L910O047o442
$$ 18170 11264 2105 -6689 -9063 -8345 -10121 -9153 -5553 -8979 -9784 -8366 1569 5479 11526 5084
13606E084n010m209O473Q349R898O446j4724j3972j563Q056L855M011k742o602
$$ 5084 74 -4135 2338 10687 20585 27031 12307 -1665 -3228 4828 8683 12694 9952 3350
13592C350m127o741j7348j0410J2448J2958N876P43N838J77k848J944Q99j2667
$$ 3350 -777 -7518 -24866 -35276 -22828 -9870 -3994 -3251 2587 2764 -84 1860 2759 -9908
13578i908j4481M910K086r12P335k575N900J1494p211n555J1391N548M493M689
$$ -9908 -24389 -19479 -17393 -18305 -10970 -13545 -7645 3849 -3362 -8917 2474 8022 12515 17204
13564A7204o927k470o399r053m98p86O0n619J604J3658M044m828j226L543N450
$$ 17204 10277 7807 1408 -7645 -8143 -8929 -8869 -14488 -12884 774 4818 -10 -1236 2307 7757
13549G757Q821n349j0772L507J3262J964j3184r566L847L161j462o975k820J3320
$$ 7757 16578 11229 457 3964 17226 19190 6006 -3560 287 3448 1986 -4989 -7809 5511
13535E511K253p969k397O530M072j0367p697P88L288J391O576N678l971L215N330
$$ 5511 7764 -205 -2602 3928 8000 -2367 -10064 -9276 -5988 -4597 1979 7657 3686 6901 12231
13520A2231M263n738j9302o11l351L866J5195P0p912j1390O324n556j966K016
$$ 12231 16494 10756 -8546 -9157 -12508 -8642 6553 6623 -1289 -12679 -6355 -11911 -13877 -11861
13506a1861k423N146M816O085k73O116m116j2812m84O405p676p54L814O90Q9O180
$$ -11861 -14284 -9138 -4322 1763 1490 7606 3490 -9322 -9806 -3401 -11077 -11831 -8017 -7327 -7238 -1058
13490a058J1426p60o159j1343n787o511R518P511M120l84p74j067j174l848K860
$$ -1058 10368 9608 3449 -7894 -13681 -20192 -10674 -3163 957 573 -201 -1268 -2442 -6290 -3430
13475c430J0013J167k086p487L536R703N180J3933m171j5910j0839n845p914r192
$$ -3430 6583 7750 5664 -1823 1713 11416 16596 30529 26358 10448 -391 -6236 -14150 -23342
13461b3342j889j790q94k078n563N443J2581J3633L750k269j0355P075Q877q236
$$ -23342 -25231 -27021 -27915 -29993 -35556 -30113 -17532 -3899 -149 -2418 -12773 -5698 3179 -5057
13447e057j9741l464l756N091J1844J1122k475M39K41j804j240P096J975l251
$$ -5057 -24798 -28262 -32018 -26927 -15083 -3961 -6436 -5997 -5756 -7560 -8800 -1704 271 -2980
13433b980j978K392J484R070N839p851K549O406L505J183p032q660J527M554n516
$$ -2980 -4958 -2566 -1082 7988 13827 5976 8525 14931 18436 19619 12587 3927 5454 10008 4492
13418D492M929J4029o109j76p175q411o41j276m9P07J944L556l828N7M622J1487
$$ 4492 9421 23450 17341 17165 9990 1579 938 -338 -387 320 2264 5820 1992 2049 6671 18158
13402A8158K789n720l612q98J497j4579l138J938j318J0698l344J150L473l003
$$ 18158 20947 15227 11615 10717 12214 -2365 -5503 -3565 -4883 5815 2471 3621 7094 4091
13388D091r20N336K796o247O677K178m002Q200n329q232K533J767J725r422p345
$$ 4091 3171 8507 11303 5056 11733 13911 9909 18109 12780 4548 7081 8848 10573 1151 -6194
13373f194J2019o635M987N660K241M581P198n282n189J526r401L242L640j6971
$$ -6194 5825 -810 4177 9837 12078 16659 23857 18575 13386 14912 5511 8753 12393 -4578
13359d578l283R941j75R556J56N735m990p913p375j3048K67k812o324J0443R380
$$ -4578 -7861 2080 1905 11461 11617 17352 12362 4449 -2926 -15974 -15707 -18519 -24843 -14400 -5020
13344e020K66O228m450N354J0649o929j411P192K408k2388j3832J3096J2723N151
$$ -5020 -4754 1474 -2976 2378 13027 6098 4687 11879 14287 -8101 -21933 -8837 3886 9037
13330I037r083j3000J0073J026k0501J6419Q795O189p472o768q534j2353J132
$$ 9037 -46 -13046 -2973 -1947 -22448 -6029 2766 8955 1483 -5285 -13819 -26172 -25040
13317b5040P206o792K882J1876N298k430k036O086N033n27l160p841k736M764
$$ -25040 -17834 -24626 -21744 -9868 -4570 -7000 -9036 -2950 2083 1556 -1604 -9445 -12181 -7417
13303g417j494r467J0710N132L254J984p376k402j575L420Q917q01J831j729j1197
$$ -7417 -8911 -18378 -7668 -2536 718 2702 -4674 -7076 -8651 -5231 3686 2885 4716 2987 -8210
13288h210Q74Q938O391l256m051R985l251q746N428O657J519k691J25M231L984
$$ -8210 -7336 1602 7993 4737 686 10671 7420 -1326 4102 10759 12278 9587 9712 13943 17927
13273A7927P39q568j1704l652R144J4319J001k662n08J322p412p89O218J0665
$$ 17927 18666 10098 -1606 -5258 3886 18205 19206 16544 16036 17358 9946 9157 15375 26040
13259B6040M173m801k110o015j3027j2752p657L060J2235J5353l511j4876k497
$$ 26040 30213 25412 23302 17287 4260 -8492 -16149 -13089 -854 14499 10988 -3888 -6385
13246f385J2512N39o749j165L902K201j637N711O843J0305o21p096j1473K652
$$ -6385 6127 6666 -83 -1248 2654 4855 3218 8929 15772 26077 25456 18360 6887 9539
13232I539k499k861K54M734l184n690J029r43J0124P00R046n929j5698P87J9800
$$ 9539 7040 4179 4433 9167 5983 293 1322 379 10503 11203 20249 14320 -1378 -591 19209
13217A9209J2372l470j4330o132P034L384J4423k995j2443q006J3890k338j1397
$$ 19209 31581 28111 13781 7649 14683 18067 32490 29495 17052 9046 22936 20598 9201
13204I201l552P275r898L771M765n804K636J832j1851N454J0123R89K367m058
$$ 9201 5649 12924 3026 6797 11562 5758 8394 10226 -1625 3829 13952 14941 17308 13250
13190A3250J294P243j480r176J342q262n751m14M21N02P792O879O340m232p936
$$ 13250 14544 21787 20307 11131 12473 4211 -1540 -1954 -1533 -1031 6761 13640 19980 15748 7812
13175G812n678j603j550N330o01N109P933o835j2383r36o968Q701J3792r77M203
$$ 7812 2134 531 -1019 4311 3710 8819 16752 9917 -2466 -3402 -10370 -1669 12123 11146 15349
13160A5349r016J274J0628Q711j4357o722J115M147o56k557O794M511j2419m324
$$ 15349 6333 7607 18235 26946 12589 5867 6982 11129 10473 7916 14710 19221 6802 2478
13146B478Q278p149r738J0974J753q680n919K632R364N017K654j966J775k04M643
$$ 2478 10756 3607 -6131 4843 6596 -2084 -8003 -5371 3993 9010 11664 9698 11473 11269 15912
13131A5912k641j868K107P459p912o121J0142n054j336k878P557M34k887n783
$$ 15912 13271 11403 13510 20969 13057 6936 17078 12024 10688 7810 15367 15801 12914 7131
13117G131q933L814j385K272N204J0490m185k043j8489k712M764K0709K610j7306
$$ 7131 -1802 2012 627 2899 8103 18593 14408 12365 -6124 -8836 -4072 16637 19247 1941
13103A941j2825K190M237P643K215j716J471M443K701M899q352q124n047k598
$$ 1941 -10884 -8694 -4457 3186 5401 3685 5156 9599 12300 17199 8847 723 -4324 -6922
13089f922J893M495J0416l65j25l908k961Q226Q72m128Q209J0096k664m073l620
$$ -6922 -5029 -534 9882 9517 9392 5484 2523 10749 11621 7493 15702 25798 23134 19061 15441
13074A5441j528M797r929j972j020M510J1M158M965k734k655L589j6038n986M013
$$ 15441 13913 18710 8781 6809 5789 10299 10310 14468 19433 16699 14044 17633 1595 -4391 -378
13059c78M879J4868J3220N174n879p082J3595J1964l24j932j6871r704Q734o306
$$ -378 4501 19369 32589 37763 31884 24802 38397 50361 50037 48105 31234 21530 30264 23958
13045B3958m060Q12J2890k876q187L792n75j8238j0209J0022J8352k517p764M631
$$ 23958 19898 20710 33600 30724 22537 26329 25754 7516 -2693 7329 25681 23164 15400 20031
13031B0031J4544Q733L079n193N509k06Q44J274j97Q721J066J810J2457K4745
$$ 20031 34575 43308 46387 41194 46703 46497 47341 48615 48418 57139 58205 60015 72472 97217
13017I7217J7176l146M956L847J3215J0769M031j2017q673N380q428j9553k4755
$$ 97217 114393 111247 116203 120050 133265 144034 148065 136048 127375 132755 124327 104774 80019
13004H0019r370L604l043j321J2373N727R45J543M406M891J2089J1781M593J3014
$$ 80019 70649 74253 71210 69889 82262 87989 88934 90477 94883 99774 111863 123644 128237 141251
12990A41251J7996K2190j062j0351j3273j2629J810K647J1874K5844P117Q53l440
$$ 141251 159247 181437 180375 170024 156751 144122 145932 148579 160453 186297 193414 194267 190827
12977A90827j871j1760p043l310M01q162j7152Q479J3895m56j2866q714M230K347
$$ 190827 188956 177196 170153 166843 167244 159082 141930 150409 164304 163848 150982 142268 146498 148845
12963A48845p498j1292k1503j1857o604J116L501J2449N309M221P550Q265J915
$$ 148845 141347 130055 108552 96695 90091 91207 94708 107157 112466 116687 124237 132502 134417
12950A34417J0898J5566J8354R347J4087P645Q454j4217j3375q913k6843k5480
$$ 134417 145315 160881 179235 188582 202669 210314 218768 204551 191176 182263 155420 129940
12938A29940o928r814o623l076o00j716q854j2669j2396j2343m014J092L025P263
$$ 129940 123012 113198 106575 103499 102899 101183 92329 79660 67264 54921 50907 51999 55024 62287
12924F2287k299M915N243K24n046J864q565O79l753J360J6900k202l479n511R212
$$ 62287 59988 64903 70146 70370 65324 67188 58623 59302 55549 56909 73809 71607 68128 62617 71829
12909G1829N402r378j0797r178j1281K000N166K874o224j723L778K473q790j124
$$ 71829 77231 67853 57056 47878 36597 38597 43763 46637 40413 38690 42468 44941 36151 35027
12895C5027R80N535M02p963o722K51m856K2524P768q385o294L663o560j199L497
$$ 35027 36007 41542 41944 33981 27259 27510 22654 45178 52946 44561 38267 41930 35370 34171 37668
12880C7668j0024m070O684J0207K492p634K911M739r45q88p093K103m076o06J3978
$$ 37668 27644 23574 30258 40465 42957 35323 38234 42973 42028 41140 34047 36150 32074 31468 45446
12865D5446k74m972j0748o496J5757P267j5335P054J0258j0361j0340L712Q364
$$ 45446 45172 40200 29452 22956 38713 45980 30645 37699 47957 37596 27256 30968 39332
12852C9332p910Q04j975j361N607N84l040m75j3244N186M511L917M485m161L929
$$ 39332 31422 32226 30251 28890 34497 35081 32041 31566 18322 23508 28019 31936 36421 32260 36189
12837C6189O222P515M66k992Q177j234K056j085q190o015l173k591Q547J76Q120
$$ 36189 42411 49926 50392 47400 55577 54343 56399 55314 47124 41109 37936 35345 43892 44068 52188
12822E2188K095J1645q489j2420L141O869N407R223J0119m05j6548j830J3394
$$ 52188 54283 65928 57439 45019 48160 55029 60436 69659 79778 79373 62825 60995 74389
12809G4389R653n23m877j5008p040K825k738K351M047q929Q613M777J0907j145
$$ 74389 84042 83519 78642 63634 56594 59419 56681 59032 63079 54150 62763 67540 78447 77302
12795G7302K033p378p094r467N107p536o251Q905Q967K973L395j387m702Q454
$$ 77302 79335 71957 64863 55396 60503 52967 46716 55621 64588 67561 70956 69569 64867 73321
12781G3321J3217J669j6597n950j0232j398Q229R939J412P132o882j1766O570
$$ 73321 86538 88207 71610 65660 55428 54030 62259 72198 73610 80742 73860 62094 68664
12768F8664J1691K238J1399M366n302j3646M569L863l974K31N318J398K666Q891
$$ 68664 80355 82593 93992 98358 93056 79410 83979 87842 83868 84099 89417 90815 93481 102372
12754A02372J438n005m678K692J177q4M951p468p841N861J3394M924k399N985
$$ 102372 103810 98805 94127 96819 97996 97912 102863 95395 87554 93415 106809 111733 109334 115319
12740A15319j596K368M220L004J1552J5949K0834L3754K9973P0989R9076J40101
$$ 115319 113723 116091 120311 123315 134867 150816 171650 205404 235377 306366 405442 545543
12728E45543K04067J57526l1049q5801j02289j36800j22854p9704n4124l8880
$$ 545543 749610 907136 876087 790286 687997 551197 428343 348639 294515 255635
12718B55635k7833j7315q223l868J383P339L771N164R42O006n943j3657J0942
$$ 255635 227802 210487 202264 198396 199779 207118 210889 216053 216995 223001 217058 203401 214343
12705B14343P248k717j1989j0277o49J684k799q844j979Q101k365J119o471Q641
$$ 214343 221591 218874 206885 196608 195959 197643 194844 186000 184021 192122 189757 190876 184405 193046
12691A93046K7263L4889J4990j1650P79N888N577J2468P569K304j3144j0313N970
$$ 193046 220309 255198 270188 258538 259317 265205 270782 283250 290819 293123 279979 269666 275636
12678B75636J0489P264j661j549o480J74O097R197P872j293j2415l908K0044J1008
$$ 275636 286125 293389 291728 290179 283699 283873 289970 299167 307039 305746 293331 289423 309467 320475
12664C20475J5527J0103r637q140n975J2372J0710N72P528J2877Q910N68M422
$$ 320475 336002 346105 336468 328328 322353 334725 345435 346007 353535 366412 375322 375890 380312
12651C80312P508R25K6952K2355J0832M02P46K383Q409J3011p559k926j2323j4172
$$ 380312 387820 388745 415697 438052 448884 449286 450032 452415 460824 473835 466276 463350 451027 436855
12637D36855r142N473K762j535P486M616o370J923j794M367k104J0282J7057M233
$$ 436855 427713 433186 435948 434413 441899 446515 440145 442068 440274 444641 442537 452819 469876 474109
12623D74109L108O393K6725K2440O097L376K2916J9495R011J7032L0168L2714
$$ 474109 477217 483610 510335 532775 538872 542248 565164 584659 593670 610702 640870 673584
12611F73584K0464K3210L3738M1500L4751M5532O2427N7152N5041N4458P3052
$$ 673584 694048 717258 750996 792496 827247 872779 935206 992358 1047399 1101857 1174909
12600A174909Q1076Q2609P7714R5238J15292J30561J64946J78713K13362K66831
$$ 1174909 1255985 1338594 1416308 1511546 1626838 1757399 1922345 2101058 2314420 2581251
12590B581251L13650L77919M54475N67345O88041Q43196J055122J341493J655521
$$ 2581251 2894901 3272820 3727295 4294640 4982681 5825877 6880999 8222492 9878013
12581I878013K010457K281302K370560K185448J747268J085437K81883n33618
$$ 9878013 11888470 14169772 16540332 18725780 20473048 21558485 21840368 21306750
12573B1306750j217463j658283j858551j859476j699225j436559j149463q71377
$$ 21306750 20089287 18431004 16572453 14712977 13013752 11577193 10427730 9556353
12565I556353o10867l78115j62527N9892K76150M93774P57526J086739J491913
$$ 9556353 8945486 8567371 8404844 8464736 8740886 9234660 9992186 11078925 12570838
12556A2570838J955019K417505K670230K534605K029472J417785R59881P67718
$$ 12570838 14525857 16943362 19613592 22148197 24177669 25595454 26555335 27323053
12548B7323053Q09190R75389J050756Q76490L74278l55095j146891j790897k178765
$$ 27323053 28132243 29107632 30158388 31034878 31409156 31054061 29907170 28116273 25937508
12539B5937508k284297k123695j770486j309310p73537j73382M52724J006759
$$ 25937508 23653211 21529516 19759030 18449720 17676183 17502801 17955525 18962284
12531A8962284J367568J336041Q00986r3194r94454j630341j896729j848922j597801
$$ 18962284 20329852 21665893 22466879 22373685 21379231 19748890 17852161 16003239 14405438
12522A4405438j192926p43856l27788Q4955M93276Q99483J347178J881994K435151
$$ 14405438 13212512 12468656 12140868 12225823 12719099 13618582 14965760 16847754 19282905
12513A9282905L020959L501861L632079L159934K021102M10070j283182k687379
$$ 19282905 22303864 25805725 29437804 32597738 34618840 35028910 33745728 31058349
12505C1058349l581488l916403l792233l385686k872109k348369j884003j486596
$$ 31058349 27476861 23560458 19768225 16382539 13510430 11162061 9278058 7791462
12497G791462j187053r55690p63310o01599m94879m20844l61663l07124k46126
$$ 7791462 6604409 5648719 4885409 4283810 3788931 3368087 3006424 2699300 2453174
12488B453174k13587j86567j64460j53628j30884j12078q5146p0714p3517o9450
$$ 2453174 2239587 2053020 1888560 1734932 1604048 1491970 1406824 1336110 1262593 1193143
12478A193143n4815o3333o0881m1794l9241k3376j6587l1973l5992k3232k1349
$$ 1193143 1138328 1074995 1014114 972320 933079 909703 893116 861143 825151 801919 780570
12467G80570k5388k7759k1529j3386j8079o378j3317j9231k369q673k4135k3444
$$ 780570 755182 727423 705894 692508 674429 668051 654734 635503 633134 624461 600326 576882
12455E76882k7101r389k7681k0324o410N99j1220l340m802n681j2847l39J461
$$ 576882 549781 540392 512711 492387 485977 486576 475356 472016 467214 461533 448686 448347 449808
12442D49808L271J3755P127J6748J1962j078l980j885P46O095j2557p527K801
$$ 449808 453079 466834 473961 490709 502671 501593 497613 495728 496474 502569 490012 482485 485286
12429D85286j1444j2539k9305n181j6805j3669N382R730K687j0443k743k968J625
$$ 485286 473842 461303 431998 426817 410012 396343 401725 411455 414142 403699 400956 397988 399613
12416C99613R235Q827M344j8557r143Q907J0498P989K0743K0712J3813K1473K6881
$$ 399613 408848 417675 422019 403462 394319 403226 413724 421713 442456 463168 476981 498454 525335
12403E25335L5926M5850M9263M7911M5002L7236K5974M010j4911m1042m6865m4480
$$ 525335 561261 607111 656374 704285 749287 786523 812497 816507 801596 760554 713689 669209
12391F69209n8871n0019l6106k6896j6586k3221j4101L660N967K7196K4883L0899
$$ 669209 610338 560319 524213 497317 480731 457510 443409 447069 453036 480232 505115 536014
12379E36014M2367N8005O0643M1530r45k5768m9051o1905m7997m5555m5369l1463
$$ 536014 578381 636386 697029 738559 737614 711846 662795 600890 552893 507338 461969 430506
12367D30506k3578j1520j5359k711q659r297r891m670k761P033L529R175l818
$$ 430506 406928 395408 380049 377338 368679 359382 349491 344821 342060 349093 352622 361797 357979
12354C57979J968K842l867J875L024j516J464L081O444L689N79q051j3395J170
$$ 357979 359947 362789 358922 360797 363821 362305 363769 366850 373294 376983 377562 369511 356116 357286
12340C57286J4717L570m005j828J0064K5976J0778K852J6260J0067N805J6812
$$ 357286 372003 375573 371568 369740 379804 405780 416558 419410 435670 445737 451542 468354
12328D68354K3066J3871R301n426J3135K1955K0705J3569R560J3030J1339J1796
$$ 468354 491420 505291 514592 509166 522301 544256 564961 578530 588090 601120 612459 624255
12316F24255J3905J6985J9223K5393L5143L5577J9976K64K2063L0545L0635K5481
$$ 624255 638160 655145 674368 699761 734904 770481 790457 790721 812784 843329 873964 899445
12304H99445L4989M7281N3131M5164M8761N8709N7744O0360P2630Q2249Q7815
$$ 899445 934434 981715 1034846 1080010 1128771 1187480 1245224 1305584 1378214 1460463 1548278
12293A548278R2434J04279J11821J13182J39039J47502J63742J98130K19578K53268
$$ 1548278 1640712 1744991 1856812 1969994 2109033 2256535 2420277 2618407 2837985 3091253
12283C091253K91402L04305L70099M30997M98336N94332O93719Q07405R67938
$$ 3091253 3382655 3686960 4057059 4488056 4986392 5580724 6274443 7081848 8049786
12274H049786J166248J389527J675917J993070K311109K590259K745037K653752
$$ 8049786 9216034 10605561 12281478 14274548 16585657 19175916 21920953 24574705
12266B4574705K269110J593428P16592k01087j034072j653693k010121k120966
$$ 24574705 26843815 28437243 29153835 28952748 27918676 26264983 24254862 22133896
12258B2133896k028047j790118j493561j143251q13625m97897j58529J84962M96005
$$ 22133896 20105849 18315731 16822170 15678919 14865294 14367397 14208868 14393830 14889835
12249A4889835Q28595J072040J182505J134438R06552N19317J16977k25614m44727
$$ 14889835 15718430 16790470 17972975 19107413 20013965 20533282 20650259 20424645 19979918
12240A9979918m57760l37181q8531K34348N73197R07478J200857J386774J449601
$$ 19979918 19522158 19184977 19096446 19330794 19903991 20811469 22012326 23399100 24848701
12231B4848701J334318J072323O94987K66779j11254l83391n57203o48580p25140
$$ 24848701 26183019 27255342 27950329 28217108 28105854 27722463 27165260 26516680 25791540
12222B5791540q78050j101489j381558j620455j759889j785358j692554j510465
$$ 25791540 24913490 23812001 22430443 20809988 19050099 17264741 15572187 14061722
12214A4061722j276688j011778p49519n11473l05439j07458P6203K75511M86724
$$ 14061722 12785034 11773256 11023737 10512264 10206825 10099367 10175570 10451081 10937805
12205A0937805O75414Q46826J026366J157943J232652J155865R54313O14464J85020
$$ 10937805 11613219 12460045 13486411 14644354 15877006 17032871 17987184 18601648 18786668
12196A8786668k93388p85426j188349j460635j621305j608643j512376j370685
$$ 18786668 18493280 17707854 16519505 15058870 13437565 11828922 10316546 8945861
12188H945861j208266j030417q67052p21989o18073n06147m23736l66076l13398
$$ 8945861 7737595 6707178 5840126 5118137 4500064 3993917 3570181 3204105 2890707
12179B890707k56739k17985j99475j77663j40424j33571j03423q5159p7996q9390
$$ 2890707 2633968 2415983 2216508 2038845 1898421 1764850 1661427 1576268 1498272 1408882
12169A408882q3295o8477n9343o5553n1890m8120n6842o1984m0571k0359k0014
$$ 1408882 1325587 1257110 1197767 1132214 1080324 1032204 975362 913378 872807 852448 832434
12158H32434l6079l4400l8345l3409l0706j8523r601j3931j5006j9961l3191k2886
$$ 832434 796355 761955 723610 690201 659495 640972 631371 617440 602434 582473 549282 526396
12146E26396j8584q637k592j2061j9154r186O832L689k0235j8007n16M190l700
$$ 526396 507812 499175 496583 484522 465368 456182 463014 466703 446468 428461 427945 432135 428435
12133D28435P299J1317l040L578J6077R08R761m398p086j128k0163n938p21j066
$$ 428435 435734 447051 444011 447589 463666 464574 474335 469937 462851 461723 441560 435622 434901 433835
12119D33835j5813j6175j8644k2860k2070o580j1902L361p780O708Q213K164k183
$$ 433835 418022 401847 383203 360343 338273 331693 319791 323152 315372 322080 330293 332457 330274
12106C30274m982n12J527j4703j2766k07r293j2857q967j0534O26J3722L685L501
$$ 330274 325292 324780 326307 311604 298838 298631 289338 276481 267514 256980 257606 271328 275013 278514
12092B78514O193L877p592j0882K120Q197J8020O876p960j0719m423o413p829
$$ 278514 284707 288584 280992 270110 272230 280427 298447 305323 297363 286644 282221 275808 267979
12079B67979j1779j6966j0749o176m223j9762j2812j0935P532M366j0386J994
$$ 267979 256200 239234 228485 222309 218086 198324 185512 174577 182109 186475 176089 178083
12067A78083L984l846J876K383J0647M002P329q77j997k3622j4648J015R807k875
$$ 178083 182067 178221 180097 182480 193127 197129 204458 203581 201584 177962 163314 164329 174136 171261
12053A71261j2624j2513j0959j9753J47J2547K324N939L432j0921j1331j1785
$$ 171261 158637 146124 135165 115412 115559 128106 130430 136369 139801 128880 117549 105764
12041A05764L984l327r359o092M853R952j878j6912j0038n199j19J2033K83j374
$$ 105764 109748 106421 97062 90970 95823 105775 103897 86985 76947 71748 71629 83662 83945 82571
12027H2571j013k324j0090j9391j6071O656J1850J3300m165M529l339o992M731
$$ 82571 81558 79234 69144 49753 33682 40338 52188 65488 61323 65852 62513 55521 60252
12014F0252P634J0509Q192R394j577K566J814N140J1316k796p056J174j1415j0669
$$ 60252 67886 78395 86587 95981 94404 96970 98784 103924 115240 112444 105388 106562 95147 84478
12000H4478m916K560O64K847p665j4385n624O090r578j6498k117J6025K818N386
$$ 84478 79562 82122 82786 85633 77968 63583 57959 64049 54471 37973 35856 51881 54699 60085
11986F0085l74j1844j0179J0355J7363k642J0991M452m911j4022n117j447K569
$$ 60085 59711 47867 37688 48043 65406 62764 73755 78207 73296 59274 54157 52710 55279
11973E5279r843M835K0583n74J2514J0001q515k0753q786N949j5839q794P221
$$ 55279 45436 50271 70854 70280 82794 92795 84280 63527 54741 60690 44851 36057 43278
11960D3278J3348k849n641j3652N49J554N712J7299J023q021j1629P6J2112j0477
$$ 43278 56626 53777 48136 34484 35033 36587 42299 59598 60621 52600 40971 41047 53159 42682
11946D2682o640k301J2334R169l628q35K641N476k1302j1866L627k694J4074L198
$$ 42682 36042 33741 46075 55244 51616 50781 53422 58898 37596 25730 29357 26663 40737 43935
11932D3935k424j0165P835M879k866m022m179j3212r11L930J897o304j888M174
$$ 43935 41511 31346 39181 44060 41194 37172 32993 19781 18870 22800 24697 18393 16505 20679
11918B0679J0714J1477j2151k019M676J73K87o55l560j9427l13P800j630m363
$$ 20679 31393 42870 30719 28700 33376 33549 33836 33181 29621 10194 9881 17681 16051 11688
11904A1688l904j1149k634J0093O927N983R838N931n073k565O520l098j654j815
$$ 11688 7784 -3365 -5999 4094 11021 17004 26842 32773 27700 25135 31655 28557 26903 25088
11890B5088j4941J719j180k170P101K324M448r543p985L609O165k557k20j197
$$ 25088 10147 11866 10686 8516 15617 17941 22389 12846 4861 8470 14635 12078 11858 10661
11876A0661J1844M547O67k558o30k230l333L285J393j0680L610J0298J2L172j2710
$$ 10661 22505 27052 27719 25161 24531 22301 18968 22253 23646 12966 16576 26874 26886 30058 17348
11861A7348j1919J6640J4939j2373n121j047K032M041N261j7517l399J954M209
$$ 17348 5429 22069 37008 24635 19514 18467 20499 24540 29801 12284 8885 10839 15048
11848A5048R213J4693J313J219j927l02N514k070j2207j63O507p164q630M214
$$ 15048 24261 38954 40267 41486 39559 39257 44771 42701 30494 30331 36838 29674 21044 25258
11834B5258j675J3139O590J645J8024J530o154O808L731J2220K1656J0131L368
$$ 25258 23583 36722 43312 44957 62981 64511 58357 65165 68896 81116 102772 112903 116271
11821A16271J7287J9345J2568J190q200m634j6674k2183j0034o405j1983p66M02
$$ 116271 133558 152903 165471 166661 158461 153827 137153 114970 104936 98531 86548 85782 86184
11808H6184q044Q21o351L016J4363J7542m732l451L330N368j63O705J1943O951
$$ 86184 78140 78961 72610 75626 89989 107531 102799 99348 102678 108046 107883 114588 126531 133482
11794A33482R429j5669k2556R153J9460P605l535k849J1733P357J3692k477l905
$$ 133482 142911 127242 104686 113839 133299 140904 137369 134520 146253 153610 167302 164825 160920
11781A60920p062L778q351j796l11M635q046l906n354j1201r230k1405k2704Q511
$$ 160920 153858 157636 149285 147489 147178 151813 143767 139861 134507 123306 114076 92671 69967 78478
11767G8478J5244N111L895j4378j2498N952M191n320O716Q439J1434M591Q171
$$ 78478 93722 98833 102728 88350 75852 81804 85995 80675 87391 95830 107264 111855 120026
11754A20026M196n068k479k829n617m281m405q611J101k97l897j3838j7819n404
$$ 120026 124222 119154 116675 113846 108229 103948 99543 90932 92033 91736 87839 74001 56182 50778
11740E0778j053l604j6149j4191L349J2677O325p422m852r378n322J6366j4598
$$ 50778 49725 46121 29972 15781 19130 31807 38132 30710 25858 16480 11158 27524 12926
11727A2926o719n598k012K0945j981j0257J23M342k285l389K786p130m846J5483
$$ 12926 6207 609 -1403 19542 17561 7304 7427 11769 9484 6095 8881 1751 -3095 12388
11713A2388K44L445j3679p065P909J3563J7712m243j3417j0419m282l511N897
$$ 12388 12632 16077 2398 -4667 3242 16805 34517 30274 16857 6438 2156 -1355 4542
11700D542J2047O528q528N6r591j2837L112O105k958j0041n869m154J0598N333
$$ 4542 16589 23117 14589 14645 5054 -7783 -4671 1434 -1524 -11565 -17434 -21588 -10990 -5657
11686e657p645O240J2009J1429J5999J1809o070j7187q50m797j3916l368n9O803
$$ -5657 -13302 -7062 4947 16376 32375 44184 38114 20927 20077 15280 1364 -2004 -2063 4740
11672D740o581l670L659Q042J5788j1600j5422m083J9437p639m919J0523j094
$$ 4740 -1841 -5511 -1852 6190 21978 10378 -5044 -9127 10310 2671 -2248 8275 7181
11659G181j3889n589k982J740J1265K407P487k031K384k874J338p233K013j367
$$ 7181 -6708 -12297 -15279 -13539 -2274 133 7620 5589 7973 5099 6437 -796 1217 -150
11645a50q640n994m686P583Q414j776J1898k306J138J3468n70P328R890m950j2416
$$ -150 -8790 -14784 -19470 -11887 -3473 -5249 6649 4343 5481 18949 18379 25707 35597 30647 18231
11630A8231r988r351L959M690m328q62O520M367r166o970O614l643L249K533l71
$$ 18231 8243 -1108 2851 7541 3213 2351 8871 13238 4072 -2898 3716 73 3322 5855 5484
11615E484k787N22J601p282J747J8m737j9373l793J306K1688M26j026J692K796
$$ 5484 2697 3219 4820 -2462 -715 -697 -5434 -24807 -28600 -27294 -5606 -5180 -6206 -4514 -1718
11600a718P5n520j954j070O573J3915J6170n321j3951r712n285M70R182P554q250
$$ -1718 -1643 -7163 -9117 -10187 -3614 10301 26471 21150 7199 -2513 -7798 -7328 1854 9408 1158
11585A158j0395K36J2328K536j010l023n785M169Q456M202l486r303K832O680
$$ 1158 -9237 -9001 3327 5863 4853 1830 -3955 214 8670 12872 9386 83 2915 9595
11571I595m356J2757Q514l336j4153l143l148J3302J643k163m033j236p433j3716
$$ 9595 5239 17996 26510 23174 9021 5878 2730 16032 17675 15512 11479 10243 2810 -10906
11557a0906k045O727j790M618l607n847m692Q633L539J217j899M963P119k589
$$ -10906 -12951 -6224 -8014 -3396 -7003 -12850 -17542 -8909 -5370 -4153 -6052 -1089 6030 3441
11543C441p844K560k390k070J88M380k968n854M139J1799j2476o288K74P165l833
$$ 3441 -4403 -1843 -4233 -6303 -6115 -1735 -4703 -10557 -6418 5381 -7095 -13383 -13109 -5944 -9777
11528i777n105J177p091j074J2258J1153J0948n180p725n259O438O346m123O009
$$ -9777 -14882 -13705 -20796 -21870 -9612 1541 12489 7309 -416 -5675 763 7109 2986 8995
11514H995R460M96r649n848O294Q567p763R998l258j3865L612m835K219P788J2691
$$ 8995 18455 18951 9302 3454 9748 18315 10552 20550 17292 3427 7039 2204 4423 12211 24902
11499B4902n160q064j2942n572m384O281P141k405N779m455k3117O50R091P908
$$ 24902 19742 11678 -1264 -6836 -11220 -4939 2202 -203 5576 1121 -21996 -21346 -12255 -4347
11485d347J7074M239k555p132K047o11p762L933M51k800O688l645J0362j2372
$$ -4347 12727 16966 14411 7279 9326 8715 953 4886 5337 2537 9225 5580 15942 3570
11471C570o823l59j556j2692M234J1153J4361P102J029o765m633l839N891N772
$$ 3570 -3253 -3612 -5168 -17860 -13626 -2473 11888 18990 20019 13254 8621 4782 10673 16445
11457A6445n94j0643l960J5901p84L238K656n612N297j6979j9232p529M824O488
$$ 16445 15851 5208 1248 17149 16365 19603 22259 16647 21944 4965 -14267 -21796 -16972 -10484
11443a0484Q315q063o501N914R669J2937N702j0647M76Q74l736j4177j7908N806
$$ -10484 -2169 -10232 -16733 -10819 -1150 11787 17489 6842 7318 8192 4456 -9721 -27629 -21823
11429b1823M375J807n38J2945Q953O45j3038k778O558k049O41o861K903M171J539
$$ -21823 -17448 -15641 -16179 -3234 5719 6364 -6674 -9452 -2894 -4943 -4302 -11163 -8260 -4089 -2550
11414b550r270r818j598J4208R304k990j161L129J512q271O770Q304Q736l11r821
$$ -2550 -11820 -21638 -23236 -9028 276 -2714 -3875 -746 766 -7505 -735 7569 16305 15994 6173
11399F173m589o264k792q628N108l616L85J575r90o602N359J5302L395l548r03
$$ 6173 1584 -4680 -7472 -16100 -10992 -14608 -14223 -12648 -13638 -20240 -14881 421 3816 268 -635
11384f35n777Q940j0854j1286J1604N457L457j0614L087P253j0016j2450l558
$$ -635 -6412 2528 -8326 -19612 -8008 -2551 906 -9708 -6621 632 -9384 -21834 -25392
11371b5392j261M094M42P475J6910M452p611q514j0949k560R948j625m710J3090
$$ -25392 -26653 -22559 -22117 -14642 2268 6720 -891 -9405 -20354 -22914 -12966 -14591 -19301 -6211
11357f211M934l401M580r765k84J5250O083l337K530j493o262j2280j0938J5522
$$ -6211 -1277 -4678 -98 -9863 -10147 5103 11186 7849 10379 8886 2624 -9656 -20594 -5072
11343e072J1648j1818n597J1200N121L099j306r435P980j249m599l249p59k842
$$ -5072 6576 -5242 -10839 361 5482 8581 7275 -2160 5820 4571 -28 -3277 -4036 -6878
11329f878L829L728L228Q415p425j9103O229J1265P132k344p021r092j753o25
$$ -6878 -3049 679 3907 12322 4897 -14206 -7977 3288 10420 8076 1055 -8037 -9790 -10415
11315a0415O943L243L780N491l80o156m54J612N578L196M601n884R34o497N378
$$ -10415 -3472 -229 3551 9042 8662 2506 2052 3664 9242 12438 17039 11155 12089 5592 10970
11300A0970o842n703n471N007R834L243j0889m148O656P875l282j1274P921k417
$$ 10970 4128 -1575 -7046 -2039 7795 11038 149 -3999 2657 10532 7250 -4024 3897 1480
11286A480n250k948J117j580o97j1089O275J1936j460p827J1751Q548P181j2042
$$ 1480 -3770 -6718 -5601 -7181 -7878 -18967 -12692 -756 -2216 -10043 1708 10256 17437 5395
11272E395j0632j640k730J4317M591j108r852n856L374J2143R540j3039j2240
$$ 5395 -5237 -6877 -9607 4710 9301 8193 -1659 -7515 -4141 8002 17542 4503 -7737
11259g737J1607N16q63N976m241k253J4981l549q495o584J322J848N780p233m448
$$ -7737 3870 4386 3523 9499 5258 3005 17986 14437 5942 -642 680 2528 8308 1075 -3373
11244c373M546R130J284m718j123Q71J822o466n792j915P088p69j3696M658J3746
$$ -3373 1173 10303 11587 6869 5746 6617 8439 1973 -3819 -5734 1354 585 -13111 -8453 5293
11229E293J154n79j1103l705k831Q70K652m29J066M775J062L426m742l460j910
$$ 5293 6447 5868 -5235 -8940 -11771 -10901 -8249 -8678 -7612 -2837 -1775 1651 -3091 -6551 -8461
11214h461m38q561M392P66m377L818r5O985J3613o635j562k260m932K555l60N915
$$ -8461 -8899 -17460 -13068 -12302 -16679 -12861 -12956 -5971 7642 1007 -555 -2815 -7747 -5192 -5552 363
11198C63K5N298J283k181L108J492q62J741L39K50N263o278P36n252n295q678
$$ 363 388 5686 6969 4788 7896 9388 8526 10267 10606 10856 16119 9841 10577 5325 30 -8648
11182h648p346J2219J2834q512p585r302p740J3766j525n3J588M056K971K401
$$ -8648 -15994 -3775 9059 547 -7038 -16340 -24080 -10314 -11839 -11892 -10304 -6248 -3277 -876
11168h76M869M705j2920M25P425k308M832J4644N140l136j1285j166Q95o271J1143
$$ -876 3993 8698 -4222 -3797 3628 1320 6152 20796 25936 22800 11515 10349 11244 4973 16116
11153A6116M34J361K321M559j6866l000M066o598r929o734M931l873J158J0484
$$ 16116 16550 17911 20232 24791 7925 4925 8991 2393 -7536 -14270 -9339 -13212 -12054 -1570
11139a570K514j0641r219N548J9388L576j5257q996R30J5521N129m862N469M974
$$ -1570 944 -9697 -18916 -13368 6020 9596 -5661 -14657 -13727 1794 6923 2061 7530 12504
11125A2504L345j684r538j3710r296L416P601N782j254N49K293o336P442Q653
$$ 12504 15849 14165 4627 -9083 -18379 -14963 -7362 -1580 -2834 -2285 8 -6328 1114 9767
11111I767Q848j1594r283j4050J882l399J0356K175n914N3N617J0216J2289M36
$$ 9767 18615 7021 -2262 -16312 -14430 -17829 -7473 -5298 -11212 -11159 -5542 4674 16963 17399
11097A7399Q69m548l154Q206n090p673r132o798J774M823m468k561j704R718j0330
$$ 17399 18268 13720 10566 18772 13682 6009 -3123 -9921 -8147 -3324 -7792 -10353 -12057 -2339 -12669
11082a2669L804R887J1557j411j8907O409J1720k101j635p15q805n914R049j19
$$ -12669 -8865 1022 12579 11168 -7739 -1330 10390 8289 6654 5939 -2866 -8780 269 150
11068A50n666J6784k043q660m679n892O625K810q018M710k331p692K467J1396
$$ 150 -5516 11268 9225 565 -4114 -10006 -3381 -571 -8589 -3879 -6210 -13902 -11435 -39
11054c9J0091n492p684J0278p933K542K061p242m762o035k047P321k794r470K321
$$ -39 10052 4560 -3124 7154 -779 1763 3824 -3418 -8180 -14215 -16262 -8941 -11735 -21205 -18884
11039a8884J6249K182n026J938N704P273j4n383Mk960l208j78j369p41J054P130
$$ -18884 -2635 -453 -5479 -3541 2163 9436 9422 4039 4043 1083 -2125 -2303 -3672 -4413 -3359 3771
11023C771L706j0196r547N218O992O18n387J91J3890l851L315L787l247l767n57
$$ 3771 7477 -2719 -12266 -7048 -56 562 -4825 -4634 9256 5405 8720 12507 9260 5493 4936
11008D936m829L75o758J930R97j772M886P605j2396j888K218j161O025m255j535
$$ 4936 107 482 -6276 -4346 -3349 -5121 -235 7370 -5026 -6914 -4696 -5857 168 -4087 -5622
10993e622r135J294k319j416M435J3262J2257k144j6998m340j878P494P794j821
$$ -5622 -14757 -13463 -15782 -17198 -12763 499 12756 10612 -6386 -10726 -12604 -5110 2684 863
10979H63m963J144J3704j0041j774j086k35j1084j1150j2656J5357R607j459N124
$$ 863 -4100 -2956 10748 707 -1067 -2153 -2388 -13472 -24622 -37278 -21921 -12314 -13773 -8649
10965h649P358K521N770m551l704m877M615l530j674l978J4967O288j205k922
$$ -8649 -1291 1230 7000 2449 -1255 -6132 -1517 -5047 -6721 -10699 4268 10556 9351 6429
10951F429j418N907N851q883j7990j1116J123n043j907k141N143J3055K063L61
$$ 6429 5011 10918 16769 7886 -10104 -21220 -20097 -25140 -27047 -29188 -24045 -10990 -8927 -8566
10937h566K255K841K414j7633j1661j205K89J5295M019k721O734J3980o607o942
$$ -8566 -6311 -3470 -1056 -18689 -30350 -31555 -31266 -15971 -11952 -14673 -7939 6041 -566 -7508
10923g508m179l330l618R250j460m766k493R618J1925k828j2438M846J5076n222
$$ -7508 -11687 -15017 -18635 -9385 -10845 -15611 -18104 -8486 3439 611 -11827 -6981 8095 2873
10909B873q850L233o878n377N342J893J341P218M371M261p88j0102l43l531J803
$$ 2873 -5977 -2744 -9622 -14999 -9657 -7764 -6423 795 5166 9427 8639 -1463 -1806 -5337 -3534
10894c534j927J557K407o833J292j080j596p776O653J0551o822m124O898N153
$$ -3534 -5461 -3904 -1497 -8330 -7038 -8118 -9714 -17490 -10837 -286 -7108 -11232 -4334 819
10880H19j116k639n829j770R200J2078O414q360j5467M02j195R00O622Q61J3412
$$ 819 -297 -2936 -8765 -10535 -1335 10743 17157 8797 -6670 -6268 -7463 -6563 59 920 14332
10865A4332j939j0987p554L231J5955N92j0340k330O757R503m011K021O314j0023
$$ 14332 12393 1406 -6148 -2917 13038 13630 3290 960 7717 17220 13209 15230 21544 11521
10851A1521o759o138R283J3308n677o68Q897j368k933k3907j3929P215K708O248
$$ 11521 4762 -1376 7907 21215 15538 14870 23767 22399 19466 -4441 -18370 -11155 -8447 -2199
10837b199J0245j1823M979M120j25j5880m796j217K122j046O735m803N859J416
$$ -2199 8046 -3777 1202 5322 5197 -10683 -15479 -16696 -14574 -15620 -8885 -13688 -7829 -6413
10823f413j3504M828N525J481q246k855N000o283o76J5261N197p993j1579J522
$$ -6413 -19917 -15089 -9564 -8083 -16329 -19184 -14184 -20467 -21143 -5882 -685 -8678 -20257 -18735
10809a8735Q365o367l796P621P771P291q917j2255k642R039l291r152l99J1655
$$ -18735 -10370 -16737 -20533 -12912 -5141 2150 -6767 -19022 -21664 -12625 -15916 -25068 -25467 -13812
10795a3812J2143m582K362J217K355j4709L21J0596J569K407n422j2388m965J7375
$$ -13812 -1669 -6251 -3889 -2672 -317 -15026 -14705 -4109 -2540 -133 -5555 -17943 -22908 -5533
10781e533O172r970k22L433K430P586N138P24k416Q932o986j061p897m778J953
$$ -5533 639 -9331 -9553 -6120 -3690 3896 9034 9758 7342 16274 9288 8227 330 -4448 -2495
10766b495k770r457k182J3107M652l634K853R854N504n943p391k558j0865l703
$$ -2495 -5265 -14722 -16904 -3797 855 -2779 74 9928 15432 9489 2098 -460 -11325 -15028
10752a5028L722k133M337N302n627j226J585r492Q653J1838P168o89J0095J1482
$$ -15028 -11306 -13439 -9102 -3800 -9427 -10653 -9068 -18560 -9907 1931 9099 8410 18505 29987
10738B9987j655j3699L92K35k293N816j1829p852P517j5932n724K042P989J6187
$$ 29987 28332 14633 15025 15260 12967 18783 6954 -898 6619 -9313 -15037 -12995 -5006 11181
10724A1181M11n225j0208m902n715l347l271M485Q662l505l162j1477j2910Q75
$$ 11181 11592 6367 -3841 -8743 -14458 -17805 -21076 -16591 -7929 -11434 -14596 -26073 -38983 -38108
10710c8108K364K297J0999J340J3255M838j694j338N190P615L703P542K411n424
$$ -38108 -35744 -33447 -22448 -21108 -7853 -3015 -4709 -6047 -857 6758 10461 18003 20414 14990
10696A4990j967o391p596m813Q595L181q040N455J468r81j4011l487l487o729
$$ 14990 13023 6632 -964 -5777 2818 5999 -2041 3414 4882 3901 -10110 -13597 -17084 -23813
10682b3813o534l210J0570J1898P403K940K002j0663j311R193n243M25Q58J3742
$$ -23813 -30347 -33557 -22987 -11089 -3686 -746 1256 -9407 -10718 -1525 -6768 -6343 -5485 8257
10668H257J5537o122j9520q527o464N472J3180R41j0720j3572j1924p814J3441
$$ 8257 23794 17672 -1848 -10375 -16839 -11367 1813 2754 -7966 -21538 -33462 -41276 -27835
10655b7835J0673J7180k270j3410q396p124J2087m51O09N741L699p688Q63m836
$$ -27835 -17162 18 -2252 -15662 -24058 -31182 -19095 -19546 -18937 -13196 -9497 -17185 -16322 -21158
10641b1158o659J0610Q883Q017j605n545J106O077N925r197m465O109J1342k951
$$ -21158 -27817 -17207 -8324 -307 -1912 -7457 -6351 -274 5651 -3546 -8011 -1902 9440 6489
10627F489n018N485O288P098q864j5816M793l661J2796N330N875p234o630l82
$$ 6489 1471 6956 13244 20342 11478 -4338 455 -3206 9590 14920 20795 13561 6931 6549
10613F549N035J580k91j7243P053P810j620m377k015k899m922k344N385k024J5847
$$ 6549 11584 13164 12873 -4370 2683 10493 8873 4496 2481 -418 -5340 -7684 -2299 -4323 11524
10598A1524O713p778r727j2404m251J473n469R830j589L782m139k368l264m173
$$ 11524 18237 10459 732 -11672 -15923 -14450 -19919 -10089 -11678 -7896 -12035 -14403 -17667 -21840
10584b1840J3563J970P197l265k654J322P001j1299p072p55R289K586k599P479
$$ -21840 -8277 -6307 890 -2375 -5029 -3707 3294 -8005 -15077 -15832 -6543 -3957 -6556 923
10570I23j833L711L22O367J2180l064r253r294j603l940j289R385m647j051K698
$$ 923 -910 2801 3123 9490 21670 18606 9353 59 -1544 -5484 -6773 2612 -2035 -3086 -388
10555c88J5779j0609j9083r505Q725K802o774l838Q910J2688P985L019Q464J979
$$ -388 15391 4782 -14301 -23806 -15081 -12279 -19053 -22891 -13981 -1293 6692 9711 18175 20154
10541B0154j1732j7083q377O676J680M940l325n309n308m553P634N956k578P716
$$ 20154 8422 -8661 -17038 -10362 -8682 -3742 -7067 -12376 -17684 -22237 -14603 -8647 -11225 -3509
10527c509j712J054j929N504J368j590O434j0465p900j43q151O857P592M623M043
$$ -3509 -5221 -4167 -6096 -592 776 -814 5620 -4845 -12745 -12888 -21039 -14182 -6590 -1967 2076
10512B076J780P068J856j7375k668O36N046N473L87k324o020K873J0687K31o244
$$ 2076 3856 10924 12780 -4595 -7263 -6627 -1581 3892 4279 1955 -4065 -1192 9495 9726 3482
10497C482J976j570j3715l772l852R947J3612Q518K588j6461j386Q616n17k507
$$ 3482 5458 3888 -9827 -13599 -17451 -7504 6108 14626 17214 753 -633 7983 7466 4959
10483D959m799O18o62P999M888j196J0103m560q814p347K106J1559q700j6027
$$ 4959 160 778 116 8115 13003 11807 21910 17350 8536 1189 3295 14854 6154 -9873
10469i873m086J0806N466M821p609M77j715k667Q9Q246J400Q874k228j1459q343
$$ -9873 -13959 -3153 2313 7134 -475 2 -1713 -4380 -4291 3955 5355 14229 12001 542 -7801
10454g801R569P816j063L755k954o421j540O965O527o110j2526j329N892o441
$$ -7801 1768 9584 8521 12276 9322 2901 1361 8326 14853 8743 -3783 -5112 780 -5661
10440e661P068l77j0368m706K661J3659M965j3593m160j081P414P574J3128j120
$$ -5661 1407 1030 -9338 -14044 -11383 2276 7241 -6352 -10512 -11593 -4179 3395 16523 15403
10426A5403p033j379R320o148j1856k0r412o370J0136J2159O293n493q342l672
$$ 15403 8370 6991 16311 10163 -1693 -1713 -11125 -17495 -7359 4800 11093 5600 -2742 -6414
10412f414j5059N496k30J5919J721n109j6264O169M754J1817P686J805j3561m155
$$ -6414 -21473 -15977 -16207 -288 1433 -3676 -19940 -13771 -9017 2800 10486 12291 -1270 -5425
10398e425n90j68p523L037Q501q350l949L855L686K1215Q207l083n133J1237O292
$$ -5425 -6015 -6183 -13706 -10669 -2168 -10518 -14467 -10612 -6926 14289 22496 19413 14280 25517 31809
10383C1809j2546r62l063j2708j3872q185R418J0576j0028n656J3481j884p03
$$ 31809 19263 18301 15238 2530 -11342 -19527 -10109 467 -9561 -15217 -1736 -3620 -4323
10370d323J725p69o611p79J0928L87j2119p119M013P441J882q393p315K381J8663
$$ -4323 -2598 -3367 -9978 -10757 171 558 -11561 -18680 -14667 -7226 -5344 -13737 -21052 -18671 -8
10355hj35p456j1245J1238R519Q251J23j77r932m717L335m899j238L033K205M768
$$ -8 -143 -7599 -18844 -7606 1913 10164 10287 10110 178 -4539 -1204 -6103 -7341 -4308 -2103 2665
10339B665j391K449M293Q945m112m658m982P438R958J1288K4512L3124J2813L6781
$$ 2665 1274 3723 8016 16961 12849 8191 3209 10647 20605 31893 56405 89529 102342 139123
10325A39123K8436P817P011P992q2n561j8306k2335k0412k0639l0507l1941j5145
$$ 139123 167559 175376 182387 190379 190297 184736 166430 144095 123683 103044 72537 40596 25451
10312B5451J300p818j9364Q132j532q826j653R32q295M23Q910J1462O678O328
$$ 25451 26751 18933 -431 7701 6169 -2657 -4310 -3378 -11673 -11250 -2340 9122 15800 22128
10298B2128k098o110j5002k902J1432P160M640K162k501n911q536K078o17j1083
$$ 22128 20030 13920 -1082 -3984 7448 14608 19248 21410 18909 12998 4462 6540 5923 -5160
10284e160j733J3276K677j7909l019J2882K559L860k884j711Q408J913J32q373
$$ -5160 -6893 6383 9060 -8849 -11868 1014 3573 7433 4549 2838 11246 13159 13291 4918
10270D918n13q350P681R19r094m144L702L54j2825k842j745J58O595N271j10O08
$$ 4918 4405 -3945 3736 4655 -4439 -8583 -4881 -4527 -17352 -20194 -21939 -21781 -15186 -9915 -10025 -9417
10254i417P566O810K71o826l702n168j052R376P929O62l96J794L764Q810m028
$$ -9417 -1851 4959 5230 -1596 -5298 -10466 -11518 -2142 5787 6449 6053 7847 11611 20421 16393
10239A6393j4105j3959Q298J696m800K646j328j2155J4875J3864j829N831Q35
$$ 16393 2288 -11671 -3373 -1677 -6477 -3831 -5159 -17314 -2439 11425 9596 15427 16262
10226A6262r046m917p840j118R623N964j2378O313M977L54n307j2006j535J1107
$$ 16262 7216 2299 -5541 -6659 2964 8928 -3450 2863 7840 8194 2887 -9119 -10654 453
10212D53J3786j685j3003j3087K547N044l517J3940J680l515K831P212j973o900
$$ 453 14239 12554 -449 -13536 -10989 -5945 -9462 4478 6158 2643 5474 12686 10713 3813
10198C813l519r623M516P478R974O573n098l827j4398J1920M780K712k744N027
$$ 3813 294 -9329 -4813 2665 12639 19212 14114 10287 -4111 7809 12589 15301 12557 17584
10184A7584o706k193m946L860M661P309o695k015n38j2120l476m860l786J1375
$$ 17584 10878 8685 3739 7599 12260 19569 12874 10859 10321 -1799 -5275 -10135 -13921 -2546
10170b546J2996O12O759J3372j2830k2824k99j401J2683M966j0928p8J4078p353
$$ -2546 10450 11062 17821 31193 18363 -4461 -4760 -6161 6522 11488 560 482 14560 7207
10156G207r463J0104R421n137m399J729J406j4609L455l956M785J2794J0434m316
$$ 7207 -2256 7848 17269 12132 7733 9462 10868 -3741 -286 -4242 543 13337 23771 19455
10142A9455p475p155j1984J4432O122P207P162P006j4615q863j158J431m072o950
$$ 19455 11980 4825 -7159 7273 13395 20602 27764 34770 20155 11292 10134 11565 7493 543
10128E43m844j548M028L076K159J87j8423p44J2465j751m228p898N182N571K879
$$ 543 -4301 -5849 -1821 1255 3414 3601 -14822 -15566 -3101 -4852 -9080 -16978 -11796 -6225 -3346
10113c346r19K619k161N228m43k2782r923K23J0514J1503O8J0161R026Q534m868
$$ -3346 -4265 -1646 -3807 1421 978 -21804 -31727 -31504 -20990 -9487 -9419 742 9768 18302 13434
10098A3434j5786R650P051r084j5800j0179l814R156l118o854N57J1515M878Q819
$$ 13434 -2352 7298 14349 5265 -10535 -20714 -24528 -15372 -18490 -25344 -24787 -13272 -8394 425
10084D25N772j0208p84J4862O945o135N019l853r803j410L944P38p131K894k236
$$ 425 6197 -4011 -4795 10067 17012 10877 15896 12043 2240 830 4774 5512 -1619 1275 -961
10069i61J908o36m143q760m842k36N560N853j1318J5581R208m340m110l342m242
$$ -961 947 311 -3832 -12592 -17434 -17670 -12110 -6257 -17575 -1994 7214 2874 -1236 -4578 -8820
10054h820m786j982J3012p343j371J3479J7540p259p183K784n229r40Q910p788
$$ -8820 -13606 -15588 -2576 -9919 -11290 2189 19729 12470 5287 8071 2842 1902 10812 3024
10040C024q177P737K692J788J1475j324r610j832q320j448J2155P31N483M874
$$ 3024 -5153 2584 5276 7064 18539 17215 7605 5773 -2547 -3995 8160 8891 14374 19248
10026A9248j2672j0085k141N235K092m863j604j0717J14J7542M062j1816N462
$$ 19248 6576 -3509 -5650 -415 1677 -3186 -4790 -15507 -15393 2149 6211 -5605 -143
10013a43L690q908o775P11J66J451J1496n29r156n398J1453J6744J327L45q571
$$ -143 3547 -5361 -12136 -11425 -11259 -9808 1688 1159 -7997 -13395 -1942 14802 16129 16474 7903
9998G903l511j821L437R844n401r113j915J3859M397K479q77n425n452k968K81
$$ 7903 4392 2571 6008 15852 10451 1338 -577 13282 17679 20158 19281 13856 8404 5436 5717
9983E717M419Q480K913k569j3884P6l349J842l946p59J944N093p266j2563M939
$$ 5717 10136 18616 21529 18960 5076 5152 1803 3645 -301 -1060 884 5977 -1289 -13852 -8913
9968h913J5456K357P299q697P341L192j1585k998J1786j729n342K892n08O236
$$ -8913 6543 8900 16199 7502 14843 18035 6450 3452 15238 13509 8167 11059 10551 16787
9954A6787o331r669n039J6875J8677k214r122l050j4611n89j190R44M347K993
$$ 16787 10456 787 -4252 12623 31300 29086 19964 16914 2303 1714 524 1468 5815 8808
9940H808j0756l984J5361P378j2217K093j2155k734O582N982q406p935K048Q564
$$ 8808 -1948 -5932 9429 16807 4590 6683 -5472 -8206 -1624 4358 -4048 -11983 -9935 -1371
9926a371k108J470j728k648j087J0843L540l906p593J582m826O741o547j5473
$$ -1371 -3479 -2009 -3737 -6385 -7472 3371 6911 3005 -4588 -3006 -7832 -1091 -7638 -23111
9912b3111Q070O157j260O208J2554p029N32k770M272O756p843l234R099J685P575
$$ -23111 -15041 -8884 -10144 -3936 8618 1589 2121 -649 3623 10379 2536 -698 8401 10086 17661
9897A7661j0326p419P603m133n312J868J60l549l742l057Q016J890p771m112N832
$$ 17661 7335 -84 7519 3386 -1926 -58 102 -3447 -7189 -10246 -2230 -340 -8111 -12223 -6391
9882f391P325P105M346M207K958j0101N633P688l15j1861o810J0278j660j2210
$$ -6391 934 8039 12385 16592 19550 9449 15082 22770 22455 10594 3784 14062 12402 192
9868A92r573Q959P402O576k655n281n280J052q056r123P624M167M991O894P948
$$ 192 -9381 -422 6980 13556 10901 5620 340 1392 -6664 -15787 -8163 -3996 995 7889 15837
9853A5837J5217J2375l005j295j2102n672m284l183j266Q408J224J513j966r497
$$ 15837 31054 43429 40424 39129 27027 21355 17071 13888 12622 21030 22254 23767 21801 12304
9839A2304j506m179P256m048j677k360K617K012j637j4426L525M122j933k704
$$ 12304 10798 6619 13875 9827 8150 5790 8407 10419 8782 -5644 -2119 2003 70 -2634
9825b634J592M93L156k747q393P31j144j1870J982J1568Q960R606R49O70p510
$$ -2634 -1042 -549 2607 -140 -8533 -7802 -8946 -20816 -18834 -7266 1694 11300 12249 12919 5409
9810E409o161L890N09R3J618K600j3253N81O365k192K34M177M360L17j4286r285
$$ 5409 -752 3138 3647 3740 5358 7958 -5295 -4714 1651 -541 -307 3870 8230 8547 -5739 -15024
9794a5024J4128K558j8100J138J8114N476m032O0l798j939n552k076r598K0685
$$ -15024 -896 1662 -16438 -15300 2814 8290 4258 4318 520 -1419 -6971 -9047 -18645 2040
9780B040J2249j0114q218j24K43J582n472r277J439J3456J437m457R45m688L4
$$ 2040 14289 4175 -4043 -4167 -3924 -2342 -7814 -17091 -15652 -2196 -759 -5216 -4271 -8959 -8925
9765h925l559J312r660l160J3802K0667n759j1715K368K698P690R738J392j5609
$$ -8925 -12484 -11172 -20832 -23992 -10190 10477 4718 -6997 -4629 -1931 5759 15497 16889 1280
9751A280n587J744k984P876N736j0830q558P476J4181Q303j521P82M245l895j1894
$$ 1280 -4307 -2563 -5547 2329 8065 -2765 -11323 -3847 10334 18637 17116 17898 22143 18248 6354
9736F354j5921l287k866L516Q229L375n987k292j606J436J4927K81j4754m256
$$ 6354 -9567 -12854 -15720 -12204 -3975 -600 -6587 -8879 -10485 -9049 5878 6159 -8595 -12851
9722a2851J1485R462r844p113L509P969K170O95k293p629N478O408J0452J847
$$ -12851 -1366 8096 -1748 -8861 -5352 2617 4787 5482 3189 -4440 1038 7446 17898 19745
9708A9745j1294n959L736k650J245p420j2590P947J4313P283j369k155J17Q216
$$ 19745 8451 2492 6228 3578 4823 -2597 -15187 -7240 7073 14356 12987 10832 10949 19165
9694A9165o659j3476m305J8034Q916q010j0156O405M849j81N286n760l876m814
$$ 19165 12506 -970 -5275 12759 21675 13665 3509 9914 14763 14582 19868 14108 10232 5418
9680E418m797N744N960m646p243K615J2866Q517P879j25r917l233l80p521n622
$$ 5418 621 6365 12325 7679 436 3051 15917 24434 32313 32188 22271 19038 18658 11137 5515
9665E515p475O58J3567J465L095K389j385j0839J959N271k015J0304m57o023k230
$$ 5515 -1960 -1302 12265 13730 16825 19214 17829 6990 8949 14220 12205 22509 22052 16029 13799
9650A3799j0755l830L65J1696L442j3708n337N812R859P858o482j1824l728J0066
$$ 13799 3044 -786 -421 11275 14717 1009 -4328 1484 11343 19201 12719 895 -2833 7233
9636G233M279r473n75J4042j344l146n90k381J214k805P051k883j9941L920O92
$$ 7233 11512 2039 1464 15506 14162 11016 10426 8045 9259 6454 13505 10622 -9319 -5399 -4707
9621d707J128j262j5231m82P788J3300J0266J011P453K887r777Q407p167k705
$$ -4707 -3579 -4841 -20072 -20554 -12766 534 10800 11811 19264 22151 12374 20781 13614 10909
9607A0909p251M140O427n310M183J142j77O60r000j1298q273J0055N799q83n2
$$ 10909 3658 7798 14225 8915 13098 14240 14063 14723 5723 -5575 -13848 -3793 2006 1123 1071
9592A071R619O002p103M18O147j1846k781n083R460p983k910l571N307k467m399
$$ 1071 10690 16692 9589 10007 16154 4308 1527 -3556 5904 -2079 -4989 -8560 -3253 -5720 -10119
9577a0119j326P222J9410J3317j4471j8184n346J5357K0188J557n769p78N454
$$ -10119 -11445 -4223 15187 28504 14033 -4151 -9497 5860 26048 27605 21836 21058 26512
9564B6512o797j4226k856J0928J0097J394j0433p083Q297k70P674R319j4727k166
$$ 26512 19715 5489 2633 13561 23658 25052 14619 7536 15833 15563 23237 32556 17829 15663
9550A5663m934K228N516n927j2209j0111M838Q060R98O361R368m587q182j4816
$$ 15663 10729 12957 18473 12546 337 -9774 -4936 3124 4122 10483 19851 15264 7082 -7734
9536g734o43J2844l589n382p94j096N484J2722Q945K627n242k152q18N57J3424
$$ -7734 -8377 4467 878 -4504 -5298 -6394 -910 11812 20757 23384 18142 15990 15172 15729 29153
9521B9153J2713r295m841j0028m757o765R77k0Q383j087M00Q180l852J289l160
$$ 29153 41866 32571 27730 17702 12945 6180 7157 7137 15520 14433 14833 23013 19161 20450 17290
9506A7290o410L700L912J820q892K431j614j935N670M432l444m617m413K743o413
$$ 17290 10880 14580 18492 20312 11420 13851 12237 10302 15972 20404 16960 12343 7930 10673 4260
9491D260O252J6731N217Q61m354o96p280k907m78m401o303p351j082J5762K1251
$$ 4260 10512 27243 32460 33321 28967 28271 20991 18084 17606 13205 6902 -449 -1531 14231 35482
9476C5482J0270j505o526r478j6326j3523J2572J5064J529M318K268R63j7l034
$$ 35482 45752 44247 37721 28243 11917 -1606 10966 26030 27559 31877 34145 35108 35091 32057
9462C2057k707l194R43J915j3219j2735L79J8578J4402J867m439r774n070J200
$$ 32057 29350 26156 27099 29014 15795 3060 3439 22017 36419 38286 33847 24073 19003 20203
9448B0203M488J336m830r398J5445k353j5724r356N892J0403P507J2574K958n024
$$ 20203 24691 26027 21197 11799 27244 24891 9167 -189 5703 16106 23613 36187 39145 34121
9434C4121l968k326J578o079j2607k997p665o717P058J568j2649k090P095Q677
$$ 34121 30153 27827 29405 23326 10719 7722 57 -6660 398 1966 -10683 -12773 -5678 2999
9420B999J4974L33K832O913L656O054o60r458l086J520l174J519K658O436P501
$$ 2999 17973 18306 21138 28051 31707 37761 37101 27643 24557 26077 22903 24422 27080 33516 41017
9405D1017L675L667j1327l304p678q746P739j463k238K682j144P101O512P362
$$ 41017 44692 48359 37032 33728 26050 17304 25043 23580 21342 24024 22880 29981 36493 43855
9391D3855j3797j7465n178P495O694J2819o32o792J4691O631P960K503R512L929
$$ 43855 30058 12593 7415 14910 21604 34423 33791 26999 41690 48321 56281 58784 68296 72225
9377G2225M594M222J6223J7794J3599J0326M524M194L142J3032J8355J6497K6939
$$ 72225 76819 81041 97264 115058 128657 138983 143507 147701 150843 163875 182230 198727 225666
9364B25666N3436N5478O5203P3363Q6594J13420J39741J52929J35773J08014Q8550
$$ 225666 279102 334580 399783 473146 559740 673160 812901 965830 1101603 1209617 1298167
9353A298167L6084p610n6536r2753j12222j25269j42073j21314j07873r6726q0609
$$ 1298167 1334251 1326641 1270105 1177352 1065130 939861 797788 676474 568601 471875 391266
9342C91266o2535l9630m2197m5023k2010j4981l0012j3491O876n82j7989J340
$$ 391266 328731 289101 246904 201881 179871 164890 134878 121387 128263 127681 109692 111032
9330A11032Q324o758m462j1297l629m294o749L702Q904l975o852j113j0593l903
$$ 111032 119356 112598 108136 96839 93210 88916 82167 85869 94773 90798 83946 82833 72240 68337
9316F8337j507p628L148J1044l389k829q688o833n049J4033Q561Q360R622K857
$$ 68337 66830 59202 62350 73394 70005 67176 58488 51655 46606 60639 69200 77560 87182 90039
9302I0039l091n682m850j697M749J0356J7470M624L404M370P171o05o27R427J1790
$$ 90039 86948 81266 76416 74719 79468 89824 107294 111918 115322 119692 126863 126258 125631 135058 146848
9287A46848R045Q942J905n520J0947R074K483O648J4602J5557J3325J287J7360
$$ 146848 155893 164835 166740 161220 172167 181241 183724 190372 204974 220531 233856 235143 252503
9274B52503K8049K9192J6875L5986M0977M0632M7815Q5800R9727J31783J51579
$$ 252503 280552 309744 326619 362605 403582 444214 492029 577829 677556 809339 960918
9263I60918J74656K44226L65108N49050Q76259J534140K838571M546744L135394
$$ 960918 1135574 1379800 1744908 2293958 3170217 4704357 7542928 12089672 15225066
9254A5225066j309952k164190k105607k571919k293951j533042r74628o34972
$$ 15225066 13915114 11750924 9645317 7073398 4779447 3246405 2271777 1636805
9246A636805m00599k73293j91444j42829r6775n6594m4786m1938k8359l7197k0216
$$ 1636805 1236206 962913 771469 628640 531865 475271 430485 388547 360188 322991 302775
9235C02775l1223l5765k9061k8146j0244J4078n042j3070n641J0517j734o13j4046
$$ 302775 271552 235787 206726 178580 168336 182414 177372 164302 158661 169178 167444 166831 152785
9222A52785n983L490M018O868J0402J2J780J0272L814J6998L3085L2117L7652
$$ 152785 146802 150292 154310 161178 171580 171592 173372 183644 187458 204456 237541 269658 307310
9209C07310M4124K0623M441k4655l5205k4101l8281l4567k3687l403j0040l686
$$ 307310 351434 372057 376498 351843 316638 292537 254256 219689 196002 192599 182559 178873
9197A78873k216j8847j1990j581l795p36m917j2301j9520j2662j6704j4054N396
$$ 178873 176657 157810 145820 144239 140444 139708 134791 122490 102970 90308 73604 59550 64946
9184F4946J6600o57P771J0046q699q177n323k592l46M62Q650M193q562q890J772
$$ 64946 81546 80889 88660 98706 90007 81830 76507 73915 73569 74031 82681 86874 78312 69422 71194
9169G1194M66n45O172N831K73k07J4926K8480R959n540o563n471m535J0795P087
$$ 71194 71660 71115 77287 83118 83391 83184 98110 126590 136549 131009 124446 118975 114440 125235 132322
9154A32322O467p082N24K0158K3200j675r938j683j3736k4737j5734j1492j4674
$$ 132322 138789 131707 132231 152389 175589 173914 163976 162293 148557 123820 108086 96594 81920
9141H1920j3760J6484J3219p16j0488m972P221J385J574j80K0098J8220J1305
$$ 81920 68160 84644 97863 97147 86659 81687 88908 90293 91867 91687 111785 130005 141310
9128A41310n883p502j131P682k28j0484K87J3975J9077P169N481Q481j0783m889
$$ 141310 135427 127925 126794 134476 134248 123764 124051 138026 157103 164272 169753 178234 167451 162562
9114A62562Q566P913K6843J1290k8542l7901k3581p911n467j90R705J6908N862
$$ 162562 171128 179041 205884 217174 188632 150731 127150 119239 113772 113582 123287 140195 146057
9101A46057L220r66j0082J8767J8432J7431m721k488j736P536J7924K2041J0709
$$ 146057 149277 148311 138229 156996 175428 192859 188138 185650 183914 191450 209374 231415 242124
9088B42124J1962L1100L0816M5642P0584P0394L5732k1975m5522l6657l5232j9770
$$ 242124 254086 285186 316002 361644 432228 502622 538354 516379 470857 434200 398968 379198
9076C79198j6085j6964k5906j4484j7318k947q067J871M032P596J1578J6110m583
$$ 379198 363113 346149 320243 305759 288441 285494 277427 279298 283330 290926 302504 318614 314031
9063C14031k1413j6389l566K444K8104J9147K961M147J6373K8081K0676J3080
$$ 314031 292618 276229 272663 275107 303211 322358 325319 329466 345839 373920 394596 407676
9051D07676J0426O359M185M368J5889j704J0682J8807K6281K3479J3634K2167
$$ 407676 418102 424461 428646 433014 448903 447199 457881 476688 502969 526448 540082 562249
9039E62249J7052J8384J7699J9656Q819J5899J1308K2110J1440j746q794o977
$$ 562249 579301 597685 615384 635040 643859 659758 671066 693176 704616 702870 694076 687099
9027F87099N637L1006L9235N2757N1604N4989O9357P4288P0694N1354P1729J28822
$$ 687099 692736 723742 762977 815734 867338 922327 991684 1065972 1136666 1188020 1259749 1388571
9015A388571K01093K20290K13090J57306N5947k2300o2855p6651p1467o0683l2960
$$ 1388571 1589664 1809954 2023044 2180350 2236297 2213997 2151142 2074491 2003024 1942341 1909381
9004A909381J1967K0327P530J7997K8977L5019L0670L3537O0637Q6038J10854
$$ 1909381 1921348 1941675 1949205 1967202 1996179 2031198 2061868 2095405 2156042 2242080 2352934
8993B352934J29000J44819J55399J75312J92667K07195K16811K07359K46211K91393
$$ 2352934 2481934 2626753 2782152 2957464 3150131 3357326 3574137 3781496 4027707 4319100
8983D319100L70067M30986M85761N18673N31022N87794O70355P76015R04960J073980
$$ 4319100 4689167 5120153 5605914 6124587 6655609 7243403 7913758 8689773 9594733 10668713
8973A0668713J299861J562661J933040K397601K874174L245534L359900L470962
$$ 10668713 11968574 13531235 15464275 17861876 20736050 23981584 27341484 30812446
8965C0812446M210397N603341P680612J0827029J5813734K4043737L7783926O0632223
$$ 30812446 35022843 40626184 48306796 59133825 74947559 98991296 136775222 197407445
8957A97407445R0463404R3842108K8024535l5670004n0652465n8913693o4337168
$$ 197407445 287870849 381712957 409737492 374067488 323415023 264501330 200164162
8950B00164162n4625745l9508545k7441531j8684054j2578864q577465o004516
$$ 200164162 145538417 106029872 78588341 59904287 47325423 38747958 32743442
8943C2743442m255993l130237k756092k683072k475343k243416k017057j770216
$$ 32743442 28487449 25357212 22601120 19918048 17442705 15199289 13182232 11412016
8935A1412016j524152j256265j012807q27139o94233n40328l95280l29119l12960
$$ 11412016 9887864 8631599 7618792 6791653 6097420 5557092 5161812 4832693 4519733
8926D519733k84916k55861k50374k33190k09908j82849j47213j56261j46819j22861
$$ 4519733 4234817 3978956 3728582 3495392 3285484 3102635 2955422 2799161 2652342 2529481
8916B529481j09416j05441r4623j01294j29535j13044q3650r4041j01235o8694
$$ 2529481 2420065 2314624 2220001 2118707 1989172 1876128 1792478 1698437 1597202 1528508
8906A528508n3168o5064m1562k2522m0264n4792o5391m8926k0182k1688q858L220
$$ 1528508 1475340 1410276 1368714 1346192 1305928 1251136 1185745 1136819 1116637 1094949 1086091 1089311
8894A089311k2472k4439k8705m9036n9388j5131j4507j2272j1438k732K159r593
$$ 1089311 1066839 1042400 1013695 964659 905271 890140 875633 863361 851923 849191 851350 841757
8882H41757k9591l9366m3878k3176l0624l4882r335Q197J0881L4814M5202N1349
$$ 841757 812166 772800 728922 705746 675122 640240 630905 639102 649983 684797 729999 781348
8870G81348P6636Q7830O4819Q397o1129q4151q1937q1755p0739m7148l9091l2756
$$ 781348 857984 945814 1010633 1019030 957901 873750 791813 710058 639319 592171 553080 520324
8858E20324k6532m330J0236j0878k1910m926j2401R218K3504O451o998j2142k5508
$$ 520324 493792 489462 499698 488820 466910 461984 449583 458801 482305 488756 481758 469616 444108
8845D44108k7529k2711o623j4424k2200p978p421j2377j477J32m703p912j6624
$$ 444108 416579 393868 387245 372821 350621 342643 335222 322845 321368 321500 316797 308885 292261
8832B92261j0066K3813j4503n9704n0248m1597R495K6504K0240K2941J7777P939
$$ 292261 282195 306008 291505 231801 181553 139956 149451 175955 196195 219136 236913 244852
8820B44852N336J2200L053q510q250k2175j0026M342J9268k280N945N281j4283
$$ 244852 250188 262388 265441 256931 248681 226506 216480 220822 240090 237810 243755 249036 234753
8807B34753j7147N232J7580m558l925J2540k046j5268m0737l6928q334J0861m959
$$ 234753 217606 222838 240418 235860 231935 244475 242429 227161 186424 149496 141162 152023 147064
8794A47064n536k730p162l135Q419J1050j365j309J0884p713J573k970l812Q626
$$ 147064 141528 138798 131636 128501 136920 147970 146605 145296 156180 148467 150040 147070 143258 151884
8780A51884J1571J0578R541J3054j435k0114j5275r396M436J6392J8194J4155
$$ 151884 163455 174033 183574 196628 195193 175079 159804 150408 154844 171236 189430 203585
8768B03585N08j6790j3583j0601j7224l4244l1770p854K7444q578j0591q692k698
$$ 203585 204093 187303 173720 163119 145895 111651 79881 72027 99471 90893 80302 71610 68912
8755F8912L787P4j2766J963N511l920L391q25R366R833K0470J3647K153m896m561
$$ 68912 72699 72773 60007 61970 67481 63561 66952 66127 75493 85326 105796 119443 121596 116700 112139
8740A12139O884L169p713j760L380J957O234n891l267m673K203Q594P770o251
$$ 112139 119023 122192 114479 112719 116099 118056 124290 118399 115132 110459 112662 121256 129026 122775
8726A22775K231M842L237n021j9688j8891j3151m257k144r914l928J2527q375
$$ 122775 125006 129848 133085 128064 108376 89485 76334 72077 69933 60019 56091 68618 60243
8713F0243m789J5171K902Q29J0907j99m116r950J8191J4910j0718M496N749k885
$$ 60243 55454 70625 73527 74356 85263 85064 80948 70998 89189 104099 93381 97877 103626 100741
8699A00741J395K455k485q629j0214p749J130n115o645J451m464J0337J0019n899
$$ 100741 102136 104591 102106 93477 83263 75514 76644 71529 64884 66335 61871 72208 82227 76328
8685G6328J699M707J108J0634N185r903j8613l889M090l79j414m100J1089Q15
$$ 76328 78027 82734 83842 94476 99661 89758 71145 67256 71346 70967 69553 65453 76542 77357
8671G7357j2918N987O952M953j0019R08K0094J1628n759j0982L567N939P583M944
$$ 77357 64439 70426 77378 82331 72312 73220 93314 104942 99183 88201 91768 97707 105290 110234
8657A10234M738J7958J7121L223j0981k3882j4487j2467j7803j6451j7727Q01
$$ 110234 114972 132930 150051 153274 142293 118411 103924 91457 73654 57203 39476 40277
8645D0277J1713M297J0251Q805k481M70n704p352o257O540o450j220q119n167
$$ 40277 51990 56287 66538 75343 72862 73332 67628 60276 54019 60559 54109 52889 44770 39603
8631C9603m466J490M095Q905P715K596J5316J3057L872q397P41l305r221o592
$$ 39603 35137 36627 40722 49627 57342 59938 75254 88311 92183 83786 84527 81222 72001 65409
8617F5409L156M549K440K869p83n631J704J3742O856M565R023Q389J4673K696
$$ 65409 68565 73114 75554 78423 77640 72009 73713 87455 94311 98876 107899 116288 130961 133657
8603A33657l638k061k919m275J859n084o735O48k91q49O754R819j57j903p682
$$ 133657 130019 127958 125039 120764 122623 117539 110804 111452 111161 110312 117066 126885 126728 124825 117143
8588A17143j024N1j0459j407n603j369P390K820k82J2736J1358q562l870O367
$$ 117143 116119 116170 105711 104304 98701 97332 104722 107542 107260 119996 131354 122792 118922 125289
8574A25289M969m418L911j14O578J2034J6184P716J4258K2364J3494K1578L0155
$$ 125289 130258 125840 129751 129637 136215 148249 164433 172149 186407 208771 222265 243843 273998
8561B73998M7499P4199R7546R9546J14327J36410J46585J38567J22075Q6617M9445
$$ 273998 321497 395696 493242 592788 707115 843525 990110 1128677 1250752 1337369 1386814
8550A386814q356n0260q8779j29562j59467j54733j21772j12470q9544q0881p5556
$$ 1386814 1378458 1328198 1239419 1109857 950390 795657 673885 561415 471871 390990 315434
8539C15434n6506l9379k9995l0027j5024j2555j2731q185r080j0101K031l6L08
$$ 315434 258928 219549 189554 159527 144503 131948 119217 111032 101952 91851 93882 93846 94154
8526I4154q978r648p89n63o880k490j2100j441M993Q074j4039o877k692M520K63
$$ 94154 85176 75528 74739 74176 67296 64806 52706 51265 56258 64332 50293 43416 40724 45244 45507
8511D5507M855j4788j6213l27N794J334K516o807n368P53j90P03k711N564l04
$$ 45507 50362 35574 19361 19034 24828 26162 28678 21871 16503 17256 17066 17769 15058 20622 20318
8496B0318j6259N07J2980R369L48J1711J0446J1661j48k5591j5983K575K761L321
$$ 20318 4059 4566 17546 26915 27263 38974 49420 61081 60933 35342 19359 21934 24695 28016
8482B8016j3662j0309Q995k174j084J2137q24O135O280Q082k2518r993k116L665
$$ 28016 14354 4045 13040 10866 9782 21919 21095 27230 33510 41592 19074 9081 6965 10630
8468A0630N975j2319L219P365m431L104J226P09R145P408p84o904n938m436p866
$$ 10630 16605 4286 7505 14870 10439 13543 14769 15478 24623 32031 31247 24343 18405 13969 6103
8453F103N561J1411M403O79K926N990j65j603J1837J0932j6098j2413k852J17
$$ 6103 11664 23075 27478 28157 31083 37073 36908 35305 47142 58074 41976 29563 26711 26828
8439B6828p256R282J0508o24j4370j7082P404J5051o11j548J53P289P971p782
$$ 26828 19572 28854 39362 38738 24368 7286 14690 29741 29130 27582 27735 35024 42995 35213
8425C5213j7552l816O179j0241n616p610M125N275N323k631J1455M138j1263j107
$$ 35213 17661 13845 20024 9783 4167 -3443 682 5957 11280 8649 20104 24242 12979 11872
8411A1872Q991J1622j934n640P189m290m187j726M09O772l364o192o317L444L627
$$ 11872 20863 32485 30551 24911 32100 27810 23623 21897 22306 29078 25714 19522 13205 16649 20276
8396B0276n453L18K601r83k563J994L487Q643m623k0002L247O15J141n511r319
$$ 20276 14823 15141 17742 16759 14196 16190 19677 28320 23697 3695 6942 7557 8698 3187 -6132
8381f132M969L029k722k886Q283r66N799J935J937O062m867O017m35m218l744
$$ -6132 -1163 1866 -856 -3742 4541 3575 9374 11309 13246 19308 14441 20458 20023 15805 12061
8366A2061j594o496M683J7466J8403k097q948m621m390j3521j5752J1256R353
$$ 12061 10467 3971 8654 26120 44523 42426 33478 28857 24467 10946 -4806 6450 15803
8353A5803l813j868j1797J332K612M54k442M723M582p782j523j69P970Q994l090
$$ 15803 11990 10122 -1675 -343 2269 2723 281 5004 9586 1804 281 112 8082 17076 13986
8338A3986J5n999M111O362k979j320J397j654j667Q569j44L813r891r894n679
$$ 13986 14001 8002 12113 18475 15496 14176 15573 13919 12252 20821 20677 24490 14599 4705 -974
8323i74M295R276l424j0193N191P330o23j136p093p438P68O744L312J66J484l705
$$ -974 3321 12597 9173 -1020 4171 11501 10878 9742 2649 -4789 -4021 2723 6035 6201 7685 3980
8307C980J391L111L289K459o129K399K530K801O365o001j6038Q925R195m859n546
$$ 3980 5371 8482 11771 14230 8101 10500 13030 15831 22196 16195 157 9082 18277 13418 7872
8292G872O393P893l164R04O272L108j5337l529K70K192K014O656j864n801M3L017
$$ 7872 14265 22158 18994 19898 26170 29278 13941 10412 10682 12874 14888 21544 19680 13879 13922 16939
8276A6939K934j740l90J0669J0031j0232n352m134K768j5123n870J3261J3600
$$ 16939 19873 18133 17743 28412 38443 28211 22859 18725 21493 6370 500 13761 27361
8263B7361k475j381p237j549j141k689k944M738o782j0566N225J643R364k802
$$ 27361 24886 23505 16268 14719 13578 10889 7945 12683 5901 -4665 560 2203 11567 8765
8249H765l113J1569J0883n466r517n328J332O171j24p636q41P635n768O116l24
$$ 8765 5652 17221 28104 22638 13121 7793 9125 15296 15172 7536 6695 14330 8562 14678 14354
8234A4354j5279k852Q605J0984n881l390O294J2447N000l511p366O617J0818P675
$$ 14354 -925 -3777 4828 15812 9931 6541 12835 25282 30282 26771 19405 26022 36840 44515
8220D4515P698j7886j3490o358m170j486J2413N089Q61j8825M411o691m815J0486
$$ 44515 52213 34327 20837 14479 10309 8823 21236 26325 27186 8361 12772 6081 1266 11752
8206A1752J4206o569j0852o458j776l147p246m616k751P79J6705K604p149M388
$$ 11752 25958 19389 8537 2079 303 -2844 -10090 -14706 -17457 -16678 27 2631 -4518 -130
8192a30Q37l00L654O515j3179j8654j222K2511J941l657Q969M13k741p012m597
$$ -130 707 407 4061 10576 -2603 -21257 -22479 32 1973 -1684 7285 7698 4957 -2055 -6652
8177f652J0013k038R036P097k871K820l839J507k36J544m613j0280Q06M254L262
$$ -6652 3361 1323 10359 17456 14585 17405 13566 15073 14837 16381 11768 1488 2294 6548 9810
8162I810l465r306l150J5829J2529r60n642j1030n607m50J768n303l394N568o00
$$ 9810 6345 -2961 -6111 9718 22247 21287 15645 4615 -992 -1442 326 -4977 -8371 -2803 -3403
8147c403r19Q449k027J3983J1132k714L922K775j4923R64j329p169P849m811l87
$$ -3403 -4322 4127 2100 16083 27215 24501 28423 31198 16275 17239 15910 8741 16590 11779 11392
8132A1392n732K538o500n728Q905K094L233N717M016p872N739m834Q341l981p767
$$ 11392 5660 8198 1698 -4030 4875 6969 10202 15919 19935 12063 17802 12968 21309 17328 9561
8117I561l561p143L687R481J0294l00N744M270j614j7734n629m360n012l392J5317
$$ 9561 6000 -1143 2544 12025 22319 22019 27763 32033 30419 12685 7056 2696 -2316 -5708 9609
8102I609n221J0848J9441l89p692J592l643q957o481k065j4109K466K0307j0330
$$ 9609 4388 15236 34677 34288 26596 28188 24545 15588 9107 7042 -7067 -4601 15706 5376
8088E376k535M782J973j0638L766N577m857J977M467r891p73N192O25p91L177
$$ 5376 2841 7623 9596 -1042 2724 8301 3444 5421 9888 -3 -776 4416 5041 4250 7427
8073G427M159j6047j323P188R104l104K362k103n851J480J3133j695j1886j442
$$ 7427 11586 -4461 -5784 1404 10508 7404 9766 7663 1812 3292 16425 14730 2844 1402
8059A402N08K257N828J2998N201K282j5856j5985J00K152R300K896J0553k272
$$ 1402 1910 4167 9995 22993 28194 30476 14620 -1365 -1265 887 10187 13083 23636 21364
8045B1364o748r346j6745n057J1459J2520J4469J4745O716n282Q487J2242r333
$$ 21364 14616 5270 -11475 -16532 -5073 7447 21916 36661 43377 38095 46582 58824 49491
8032D9491j0877n313L597j0606o157O396O104J222j3267k309J5282P776P606L856
$$ 49491 38614 33301 36898 26292 20135 26531 32635 33857 20590 18281 33563 41339 48945 52801
8018E2801r785j5866l568N751k173n832M817N932J7807k288q273K29M942q341
$$ 52801 43016 27150 23582 29333 27160 21328 26145 32077 49884 47596 39323 39552 44494 36153
8004C6153j6052J20P886R413k966N68j0823J697P832L131j355k284J8789J4037
$$ 36153 20101 20221 28107 37520 34554 35122 24299 25996 33828 36959 35604 33320 52109 66146
7990F6146J8403K5431J423j2996j0789j2032k479r340k2565j1808L966o893J1315
$$ 66146 84549 109980 111403 98407 87618 75586 73107 63767 41202 29394 33360 26467 37782
7977C7782L4328J5534N42j8504j7616q572m260j2640k0964l863m610n94N681R873
$$ 37782 72110 87644 88186 69682 52066 43494 39234 26594 5630 1767 -2843 -3437 2244 12117
7963A2117L087k987k342J807N33O397J3421M301l333j160Q071j0602m871k312
$$ 12117 15204 12217 9875 11682 12215 18612 32033 36334 33001 31841 39912 29310 24439 22127
7949B2127J0137J9948J0430Q054K731j660l121l815j0827j900m216L026O815P372
$$ 22127 32264 52212 62642 70696 73427 71767 68646 64831 54004 52104 47888 50914 57729 65101
7935F5101J0152K481l724m490l488p673k2855k2265L536m23j53O005N100p028
$$ 65101 75253 77734 74010 69520 66032 58359 35504 13239 16775 16352 16199 22204 27304 20276
7921B0276m191j120p022q280J648k228Q891J7715P429j5478j376M526j015O23
$$ 20276 16085 14965 7943 -337 1311 -917 7974 25689 33118 17640 16264 20790 19775 20398
7907B0398J2106p837j2699n730k550P420j993Q517n0j1733q841o22M973J4506
$$ 20398 32504 24667 11968 6238 3688 11108 9115 17632 17582 5849 -2992 -3614 1359 15865
7893A5865O335K381L960p900j3149l796m433R1N246O88l780l72O335l451O65J2094
$$ 15865 22200 24581 28541 20641 7492 3696 -737 -646 4600 5288 1508 1136 7471 4020 4685 16779
7877A6779n89o892j2140q184O072m99Q849J581L116p619L868j1139J382O534P505
$$ 16779 16190 9298 -2842 -11026 -4954 -5453 3396 4977 8093 474 4342 -6797 -5415 1119 8624
7862H624l708q863M615K447n06O014L279m807O573J8894l521j6339j1183R782
$$ 8624 4916 -3947 668 3115 2609 8623 11902 7095 13668 32562 29041 12702 1519 11301
7848A1301P539j5515j1999O388N827j3502l109L844J6446M346j0068p950P577
$$ 11301 18840 3325 -8674 -2286 3541 -9961 -13070 -9226 7220 11566 1498 -6452 1125
7835A125j853M673L914j0778N365m805M790J3649L4j2465o728q265m024L234M771
$$ 1125 -728 3945 7859 -2919 2446 -2359 2431 16080 16114 3649 -3079 -11344 -15368 -12134 -7363
7820g363Q076K176L306m436o619J326M984p374K484L385j566N225N944l451j916
$$ -7363 713 2889 6195 1759 -4860 -3534 1450 -5924 -3440 -55 -1621 3604 9548 6097 4181
7805D181k188r997J719n957R63J8178O426n832N333m539m730Q90m564n605K443
$$ 4181 1993 -8004 -6285 -12242 -11279 6899 13325 7493 12826 8287 3557 4447 -117 -5722 -3279
7790c279n640o81j302J1163R372r291P06J2014L05l380k0250j0024Q792j326o914
$$ -3279 -8919 -9600 -10902 261 9633 342 1048 13062 13367 9987 -10263 -20287 -11495 -12821 -19735
7775a9735M769J5989J4045j7709j0951L205k182m623j303J1647L332L566k87p798
$$ -19735 -14966 1023 15068 -2641 -13592 -10387 -12569 -17192 -18495 -6848 -3516 50 -237 -8035
7761h035n253P94p87j188J881K30k085K715j3096p76J7057J0946Q294j3803K876
$$ -8035 -13288 -12494 -13281 -14469 -12588 -12358 -14443 -11728 -24824 -25600 -8543 2403 10697 -3106 -230
7746b30J2134P415p614k388L764O481O952N072q876j2380j995j4649k577J7052
$$ -230 11904 19319 11705 9317 13081 19562 26514 31586 22710 10330 8335 -6314 -8891 8161
7732H161J2647m195N689P997j667r516o046k96m603J192P845P137k144O453r453
$$ 8161 20808 16613 22302 30299 28632 19116 13070 12774 8171 9363 17208 24345 22201 28654 19201
7717A9201j4239O56N32p112m0N095N404M534j1785l010n750m128M894j213p574
$$ 19201 4962 5618 6150 -962 -1002 4093 9497 14031 2246 -764 -6514 -10642 -5748 -6961 -14535
7702a4535P050N204j935r280L415L240k744L697R223m404j1541Q033J6346k358
$$ -14535 -7485 -2281 -4216 -13496 -10081 -6841 -9585 -5888 3335 -1069 -12610 -4577 11769 9411
7688I411K350P767j5325k5558J0134M199P581Q683O098O749P156J258k316M447
$$ 9411 11761 19528 4203 -21355 -11221 -7022 559 9242 15340 22089 29245 30503 28187 32634
7674C2634l211j1094j5143l638n408J446J4928K86o816J438j122L840L746M397
$$ 32634 29423 18329 3186 -452 -5860 -4414 10514 10800 3984 5422 4300 8140 11886 16283
7660A6283L731l653M00N563J005p113j2671N109O280K12o674j7516m413q150j733
$$ 16283 20014 16361 16761 22324 23329 16216 3545 8654 14934 15146 8472 -9044 -13457 -21607 -23340
7645b3340R360R894L946p483R702M056q815O502m400l24J056M350j4555P973p105
$$ -23340 -13980 -4086 -140 -7623 2079 6135 -2680 3822 -578 -902 154 4504 -10051 -2078 -9183
7630i183J710J1435R93j1552K108J1307n092l106M747o443M654K101Q508O360
$$ -9183 -7473 3962 4955 -6597 -4489 6818 1726 -1380 3367 -3076 1578 3679 12187 18547
7616A8547L529N103k145r53q428P60o457M673m799j593j0499m489O932l155l298
$$ 18547 22076 27179 25034 24081 15653 16413 9956 14629 9830 8237 -2262 -6751 181 -2974 -6272
7601f272J3722N655n227n899j0170j1870R79L558l278O694J5497l384m22Q724
$$ -6272 7450 13105 7878 1979 -8191 -20061 -19082 -15524 -18802 -12108 3389 5 -417 8307
7587H307M279M742j0252k333j14l178m033K93n912P342J325r0P492L117l494j974
$$ 8307 12586 17328 7076 4743 4629 1451 -2582 -2289 -8201 -859 466 376 7868 10985 7491 5517
7571E517l808o328Q346J683p893k21k567P345O36j970L024k378m635Q585O373
$$ 5517 1709 -4619 3727 5410 -2483 -2704 -5271 2074 2710 740 3764 1386 -3249 5336 11709
7556A1709r677k139j6799M35J5680J294k164M830l09j3270n903L672O31k294J515
$$ 11709 2032 -107 -16906 -16471 -791 503 -1661 3169 2860 -10410 -16313 -12641 -12010 -14304 -12789
7541a2789o763j92J6705M458j958o844P528K639R21p114J242R054j940j1603j257
$$ -12789 -19552 -19744 -3039 1419 -539 -7383 145 2784 3705 -3409 -2167 6887 4947 -6656 -7913
7526g913K766P54J639N387l52j4837N42o322n320r803N894J2906K2383J45p319
$$ -7913 -5147 -4393 -2754 2633 2281 -12556 -12014 -18336 -23656 -33459 -27565 -14659 7724 7869 550
7511E50m860k009l782k92K364P704K530j0375r968J999K58j183J3665J586n90
$$ 550 -4310 -6319 -10101 -10393 -8029 -325 2205 -8170 -18138 -16139 -15881 -17064 -3399 -1813 -2403
7496b403L197p02K292j3979j0674J555J3571J8550j260j5853k876J4028O851l644
$$ -2403 794 92 2384 -11595 -22269 -20714 -7143 11407 10147 -5706 -8582 5446 12297 8653
7482H653L939l069n313K289L058q140N99o39o323r820N096J7128J288l986K334
$$ 8653 12592 9523 4210 6499 9557 1417 2016 1377 -4946 -14766 -9670 7458 8746 4760 7094
7467G094P1j80l756j611O262Q279J640j2474j1213J334Q733r99o89M509r17l253
$$ 7094 7165 6985 3229 1618 7880 16159 17799 5325 -5888 -4554 4179 3180 2491 7000 6083 2830
7451B830K945r94n721m990Q305m758m726O31R758N29J0429m259r726j2883J1035
$$ 2830 5775 4781 -940 -5930 2375 -2383 -7109 -6478 3280 3809 14238 9979 253 -12630 -1595
7436a595J6350k048j747M667m842j2416p912J635K321k107R165q947r282Q809
$$ -1595 14755 12707 10960 15627 10785 -1631 -9543 -7908 -5587 -7694 1471 -7476 -16758 -7949
7422g949J662r547j939J1137Q796r140p911J590L706Q671r855j3595k484J3076
$$ -7949 -6287 -15834 -17773 -6636 2160 -6980 -14891 -13301 -9595 -924 -10779 -24374 -26858 -13782
7408a3782J5266M083n077k555L394M277P128K837m360j3420j5342J568o214K58
$$ -13782 1484 5567 490 -2065 1329 5606 12734 15571 11211 -2209 -17551 -15983 -22197 -21939
7394b1939R900J947K442J63n522P265K912N726m415l529r102l49k803M27J1784
$$ -21939 -12039 -10092 -7650 -7487 -13009 -5744 -2832 2894 -1521 -5050 -14152 -14501 -17304 -16877 -5093
7379e093N022q994l617P529m56K781L369M485k505j0093j551J5582l513M455j871
$$ -5093 -71 -9065 -12682 -5153 -5609 -2828 541 5026 2521 -7572 -9123 6459 2946 7401 5530
7364E530k174j0230j121J0764Q379j62j0257r658J3141J7890o477p237k481L064
$$ 5530 3356 -6874 -7995 2769 11148 10986 729 -8929 4212 22102 15625 8388 5907 8971
7350H971q8K979l13n758o278l704K36K648p03o58l663N53N789m498R69K206P480
$$ 8971 8883 11862 11549 5791 -487 -4191 -3955 -1307 -2010 -2668 -6331 -5778 11 -4487 -3518 -1312 6168
7333F168j284j1414k511j0782J0325O952m613n819r204R733R923m434k885J213
$$ 6168 4884 -6530 -9041 -19823 -9498 -2546 -7159 -12978 -22182 -12449 -2526 -6960 -9845 -8632
7319h632L141q912k72l716o196j197J3511J440m454J746P409j1176l245K574P121
$$ -8632 -5491 -14403 -14675 -18391 -24587 -25784 -12273 -10833 -15287 -13541 -6132 -17308 -20553 -17979 -10858
7304a0858l631L046J2461O496Nn390j0057n765j751P063o31K011M216m841O178
$$ -10858 -14489 -11443 1018 7514 7519 2129 -7928 -13693 -15444 -8381 -9012 -7001 -2785 -7626 -1448
7289a448L669K867j948K716P98j2308J288K933J1276m841r069j664L755J3407
$$ -1448 2221 5088 3140 5856 6654 -5654 -4366 -1433 9843 5002 -4067 -5731 -1976 11431
7275A1431O617j0557j3294j3040R381Q238R510p161k712J3659J050j0104l005
$$ 11431 18048 7491 -5803 -18843 -9462 -1224 8286 1125 -1587 12072 13122 3018 13
7262A3m629l787o89J44j2801J1251J7689k756j2469L1p264J5637J741m464L060
$$ 13 -4616 -8403 -9092 -8948 -21749 -10498 7191 4435 -8034 -8003 -15267 370 2111 -2353 707
7247G07K2372p94n644n123q688m687j5538q619N817k516M593O928N343l92n43
$$ 707 23079 22285 16641 11518 2830 -1857 -17395 -26014 -20197 -22713 -18120 -11192 -5849 -6241 -6784
7232f784r242M188J3625q424J3264O05j0846n344o97J3404P116r636j531l892
$$ -6784 -16026 -11838 1787 -6637 6627 7232 -3614 -8958 -9655 3749 10865 1229 -302 -4194
7218d194j088Q407P095J0602K478l042n216j1734j7651Q4M338J0623L554j071
$$ -4194 -5282 3125 10220 20822 23300 20258 15042 3308 -14343 -14259 -9921 702 4256 3185
7204C185l17J2938j3857j5438Q32j904K850K329N810m545l278K223l941R078N702
$$ 3185 2868 15806 1949 -13489 -12657 -14561 -11711 -9382 -3572 -8117 -11395 -9172 -13113 -4035 1667
7189A667L124m299n125M430p303j0080k501P816J0222P975Q55L546n707m958O567
$$ 1667 4791 492 -4633 -203 -7506 -17586 -20087 -12271 -2049 5926 6781 10327 4620 -338 6229
7174F229l960j230j4366r293K2644Q162J199N59m310k794m216N416P561K082N772
$$ 6229 2269 1039 -13327 -22620 24 8186 9385 9944 5634 2840 -1376 4040 11601 13683 19455
7159A9455r727m441l596L688p057J995n379n430J1685N41J769P462L388N75l134
$$ 19455 9728 5287 1691 5379 -1678 317 -5062 -10492 1193 1734 3503 10965 14353 14928 11794
7144A1794M101j473m960j0122r469P824j537l277M594l483n516M309P927J7173
$$ 11794 15895 14422 9462 -660 -10129 -2305 -3842 -7119 -2525 -6008 -11524 -7215 712 17885
7130A7885J045j0418l865m332k928j405J0341L126J0332L07p801L67M913j290
$$ 17885 18930 8512 4647 315 -2613 -4018 6323 9449 19781 20088 12287 12654 17567 16277
7116A6277j0942m092n94O688M21q974j870K3000k762j0905l502O70o389m692j123
$$ 16277 5335 1243 649 7337 7758 -1216 -3086 19914 17152 6247 2745 3415 -2974 -7666 -8789
7101h789L208P278j146o319J0328j257N580k22M904j5254j851J4749j21m058l167
$$ -8789 -5581 1697 551 -5768 4560 3303 8883 8661 13565 -1689 -3540 11209 11088 7030 3863
7086C863N051o282n810M212p14J0638J4068n923o195P885r90o634J620r268L324
$$ 3863 8914 2632 -3178 1034 320 10958 25026 19103 12908 20793 19803 13169 14789 5521 8845
7071H845p607q047j358P541J2137o16j2884R342q232J965L080M344n040L71L284
$$ 8845 1238 -6809 -8167 -626 11511 10895 -1989 7353 -879 1086 4166 8510 3470 3841 7125
7056G125l455n782m380q296R448J3330L648o391p146L837j005l549R15j1169j335
$$ 7125 3670 -2112 -6492 -14788 -5340 7990 11638 5247 -1899 1938 933 -2616 -1701 -12870 -14205
7041a4205p157J499O549J585P918k364R564O25l086P047M5j792M79m20n992R424
$$ -14205 -21362 -19863 -13314 -11729 -3811 -6175 3389 4014 928 7975 8020 6228 6707 6287 295 9719
7025I719J8108N728j4553j0082k6227L137J6638J0158L852j818j2193L266p222
$$ 9719 27827 33555 19002 8920 -17307 -14170 2468 12626 16478 14660 2467 5733 -1489
7012a489p571R79L836R857R66L501L126j837j0177R285l889j221o657n117K882
$$ -1489 -9060 -8081 -4245 5612 6578 10079 13205 11368 1191 10476 6587 5366 -1291 -6408 -3526
6997c526j408J613m271j154P034J0899p617L499R588o782o748Q926M774l519P543
$$ -3526 -4934 -3321 -7592 -8746 -1712 9187 1570 5069 14657 7875 1127 10053 14827 11308 18851
6982A8851l33j6899k640r941k185P445p221k180K526R51J441J0422R807j0887
$$ 18851 18518 1619 -1021 -10962 -13147 -5702 -12923 -15103 -12577 -11626 -10185 237 10044 -843
6968h43q697l181L065P616J2521P04r916m511j634l929j122J1854P71n926j6993
$$ -843 -9540 -12721 -9656 -2040 10481 11185 1269 -3242 -4876 -8805 -9927 1927 2698 -3228 -20221
6953b0221k256Q542m062k186Q184n839N850P406K727j584q648l723m885J0610
$$ -20221 -22477 -13935 -17997 -20183 -11999 -17838 -11988 -4582 -1855 -3439 -12087 -15810 -20695 -10085
6939a0085j910o365M375k955J9978M379j2821r071J1169J2407L572j3334j9332
$$ -10085 -11995 -18360 -13985 -16940 3038 7417 -5404 -14475 -3306 9101 12673 -661 -19993
6926a9993n541Q138J189J4050J8874o131k4338k641N376j100K477j054N693K01
$$ -19993 -25534 -17396 -16207 -2157 16717 10586 -13752 -16393 -11017 -12117 -9640 -10694 -5001 -4800
6912d800M587K0147J429j4002q690L188l752J229M701Q492m396L265L045j2558
$$ -4800 -213 19934 21363 7361 -1329 1859 -1893 -664 4037 12529 8133 11398 14443 1885
6898A885r65L306o100k670L817k267P072m613N743n64o896p747l032l610k26n297
$$ 1885 920 4226 -1874 -4544 -727 -2994 4078 -535 5208 4644 -2252 -9999 -13031 -16641 -16867 -22164
6882b2164j0370J5087K4141Q254l835j7997L712Q081q001m454j882L800k154m860
$$ -22164 -32534 -17447 6694 14948 11113 -6884 -3172 4909 -3092 -7546 -9428 -5628 -7782 -12642
6868a2642l97N560Q652m784k986K441J2743j826O212N312J063P110K34N367k867
$$ -12642 -13039 -7479 1173 -3611 -6597 -4156 8587 6761 12973 18285 19348 26458 26692 32059 29192
6853B9192j8379p174j611J2230M597j0946q956R37J37N865J908p267R905m667
$$ 29192 10813 3639 2028 14258 18855 7909 -1047 -110 27 5892 7800 533 10438 5771
6839E771j0731Q794m91M363L142j0542K324J3414n133o543n673m308L086J488
$$ 5771 -4960 3834 3343 7706 10848 306 2630 16044 10911 4368 -1305 -5613 -2527 -1039
6825a039l834m82J164l004j7934k683O537m027J1961J9715P529j0423n617m995
$$ -1039 -4873 -5355 -4191 -7195 -25129 -27812 -21275 -25302 -13341 6374 13903 3480 -2137 -7132
6811g132J94L511K927m374J06p315K768J7371L474j0997r414R708N241J254p541
$$ -7132 -6938 -3427 -500 -4874 -4768 -12083 -9315 8056 11530 533 -8881 827 6068 7322 -219
6796b19j367P263p491K995L812O76l00j1354N97M52o68J209M352q632j0543J634
$$ -219 -1586 5677 -1814 1181 4993 5669 5369 -5985 -5388 -4936 -5604 -4395 -43 -8675 -19218 -17584
6780a7584K881L858J0713l206N170J2774n226J018Q567k596j3877J0726K1281
$$ -17584 -14703 -10845 -132 -3338 1832 14606 9380 10398 18965 16369 2492 13218 34499
6767C4499M77o030j7393k7247o43J3669N49M829J3579L844m987j2618j765M170
$$ 34499 34976 28946 11553 -15694 -16337 -2668 -2119 2710 16289 20133 15146 2528 763 4933
6753D933j0833l125j542r472K470R336m34P112P465l084r766J659N546m071k1
$$ 4933 -5900 -9025 -10567 -20039 -17569 -8233 -8667 -1555 5910 2826 -6940 -5281 265 -3806 -3827
6738c827J3575J0774K630j357k767j4292j0277J452O464J3587n284o476n931j274
$$ -3827 9748 20522 23152 21795 19028 4736 -5541 -4089 2375 15962 10678 4202 -1729 -3003
6724c003k994j4357Q041j257P76J1474k988j1033J322J5476P138l504j8472L217
$$ -3003 -5997 -20354 -12313 -13570 -12794 -1320 -4308 -15341 -14019 1457 8595 5091 -13381 -10164
6710a0164J2074O738m856r535j144J0552Q722M376m115j3189j36k065M450n659
$$ -10164 1910 8648 3792 -5743 -6887 3665 12387 16763 12648 -541 -677 -2742 1708 -3951
6696c951q188J4171r81j1316R59q71j398j620L641M025L959J2132l077K481K452
$$ -3951 -12139 2032 1051 -10265 -9306 -10177 -11575 -13195 -9554 -5529 -1570 10562 7485 9966 12418
6681A2418m574l949M509O031q723j3336j676M117K320J0760l867J982q046m189
$$ 12418 7844 3895 8404 14435 5712 -7624 -9300 -5183 -2863 7897 4030 6012 -2034 -6223
6667f223J5034l023k0093o500R778J1027L564O052M016q302m915J094k063j0577
$$ -6223 8811 5788 -14305 -20805 -11027 0 3564 9616 13632 5330 415 1509 -554 -11131
6653a1131n568P160J957k682J6787M061j2291K196N412M765p092M16m756l925
$$ -11131 -16699 -9539 -7582 -10264 6523 10584 -1707 489 5901 10666 3574 3990 -766 -4691
6639d691o225j3491r678R681J6612M746O760M077j443m149m275J232j1370r360
$$ -4691 -10916 -24407 -34085 -24404 -7792 -3046 3714 7791 6348 2199 -2076 -844 -12214 -21574
6625b1574l532J4676p05P793j2274M562j544n480K482K886m973J2326L720J1029
$$ -21574 -25106 -10430 -11135 -3342 -15616 -11054 -12598 -18078 -15596 -12710 -17683 -5357 -1637 9392
6611I392L177j143r875j1256J0598O081j3244j9510L013P782Q435M302p534n100
$$ 9392 12569 11426 1551 -9705 893 6974 -6270 -25780 -22767 -14985 -6550 -2248 -9782 -14882
6597a4882L39L84l787J1385R401J0526o938q534j793J384N922K35p046l445o585
$$ -14882 -14543 -14159 -17946 -6561 2840 13366 6428 -2106 -3899 -2515 3407 3642 -3404 -6849 -13434
6582a3434J369N813K04N856P511R177O571K548p280j2219j7154m069J124l46J207
$$ -13434 -12065 -6252 -6048 -192 7319 16496 23067 25615 18335 6116 -11038 -15107 -13983 -14329 -13122
6567a3122J1134M79n639J2837Q873n002q774N78q36J104J508P029J038l687l712
$$ -13122 -1988 -1509 -7148 5689 14562 9560 786 1364 528 1632 3140 10169 11207 7520 3808
6552C808j5821Q203J6478J0249Q02o483o095j5961j3914P281N13n842L296n182
$$ 3808 -12013 -3810 12668 22917 23719 17236 11141 -4820 -18734 -11453 -10940 -16782 -13486 -18668
6538a8668L697K1619N095o052n701m637J2283O088m234q071o825j049L044J095
$$ -18668 -14971 6648 11743 5691 -10 -4647 7636 13724 9490 1419 -5406 -6455 -3411 -2316
6524b316P991n197k729Q861J501N311r98j2030m328O681M051J697k638j0019N426
$$ -2316 5675 478 -2251 6610 8111 13422 12424 394 -3934 2747 6798 8495 5857 -4162 1264
6509A264J5035p269p600j6194j4435J6957J5102O058N086M630j843j3998k161
$$ 1264 16299 9030 1430 -14764 -29199 -12242 2860 8918 14004 18634 16791 2793 632
6496F32j3263L539J1791R391M694j0701j7461O750O436j514O711J0472Q742M937
$$ 632 -12631 -9092 2699 12090 16784 6083 -11378 -4628 1808 294 7005 17477 26219 31156
6482C1156j3917l32j4238j3843J175n302m226M674L648m156l395L089J0803L248
$$ 31156 17239 16907 2669 -11174 -9999 -15301 -19527 -14853 -11205 -15361 -18756 -15667 -4864 -1616
6468a616k464l951k110m138L12k60Q579J1059r637k76N084K007N335k925O472
$$ -1616 -4080 -8031 -10141 -14279 -13967 -14227 -5648 5411 -4226 -4502 582 2589 7924 4999 11471
6453A1471oK585r309M114L423j200j1828q199J2894J700M092Q040q198k1644j071
$$ 11471 11465 14050 4741 8855 12278 11078 -750 -8949 3945 5645 9737 17777 9579 -12065 -13136
6438a3136L960J812r072J1085o85n737L925p48P672R301K829j1214j18J326j269
$$ -13136 -9176 -7364 -16436 -5351 -6036 -11773 -7848 -8596 -924 8377 11206 -8 -126 1200 -69
6423f9l314l452o095J016J7052J3846j160n806j229j3371j8129J972N745J601
$$ -69 -3383 -6835 -12930 -11914 5138 18984 17824 12018 10789 -2582 -20711 -18739 -12994 -11393
6409a1393O652N873M251k700J108K598j0189o620J984p246o163M632J1769J1143
$$ -11393 -4741 1132 5383 2683 3791 6389 -3800 -10420 -8436 -15682 -21845 -17213 -5444 5699
6395E699L608k579Q13M52o357p954r742n933N337K0810J587j592o861L089n646
$$ 5699 9307 6728 7541 7993 1636 -6318 -16060 -21993 -16656 4154 5741 4149 -2712 377 -5269
6380e269p082O354J0277J4808K91r595o858p959K640M377j40p93P57j5721j493
$$ -5269 -12351 -5997 4280 19088 19379 9784 2926 -5033 -2393 1984 1844 1051 1808 -13913 -15406
6365a5406J9463K112k494K493j0574j0945J4005J8249l356j3659o398p012K580
$$ -15406 4057 6169 3675 6168 -4406 -15351 -1346 16903 13547 -112 -6510 -13522 -10942
6352a0942O84N721R487j7315j3252l044o048J2842J9211K602k495j602K244O403
$$ -10942 -10258 -4537 4950 -12365 -25617 -28661 -34709 -21867 -2656 -54 -2549 -4151 -1907 4496
6338D496n226o961L826l0l777R32K920j0687P001N472n768R879J4239q46o631
$$ 4496 -730 -7691 -3865 -3895 -7672 -6740 -3820 -14507 -7506 -2034 -7802 2077 16316 15470 8839
6323H839j3846o391k955J974P921N505J3082N306O996j0740j1854q31r30q03M338
$$ 8839 -5007 -11398 -14353 -12379 -4458 1047 14129 19435 26431 15691 3837 3006 2076 1273 5611
6308E611J6401O886q794j6095j0750R60Q260K249N634P128P683m713k3169p93
$$ 5611 22012 28898 20104 4009 -6741 -5781 2479 4728 10362 17490 25173 20460 -2709 -3502
6294c502P193j3443L257J5139J5354N6j462K853L753o713k3835j740n91K326k697
$$ -3502 3691 -9752 -6495 8644 23998 24054 22592 25445 29198 22485 -1350 -3090 -3681 -1355 -4052
6279d052j848L450L086M625m613m137J0312J1103J716k287J272r433m725M425
$$ -4052 -5900 -2450 636 5261 648 -3489 6823 17926 19642 17355 18627 9194 4469 8894
6265H894l529n024L911j451J46l355k695J547n76j038n597R006O538q052j0040
$$ 8894 5365 341 4252 2801 2947 -408 -3103 -1556 -2132 -3170 -8767 239 6777 -1275 -11315
6250a1315m972Q6p984N308J1099L917N685J790r521J2737O07o5k3613j711J3745
$$ -11315 -16287 -16201 -24185 -18877 -7778 -3861 1824 3614 -5907 6830 7437 7372 -16241 -17952 -4207
6235d207K435M230R774M859r267j2405K210J5193K106l71j489L96q227k89j069
$$ -4207 -1772 2458 12232 17091 7824 -4581 -2371 12822 14928 14557 13068 13464 5237 4948 3879
6220C879K639j197j1469M786k411k660L224j728j952q090O677P184J2819J387
$$ 3879 6518 5321 -6148 -1362 -3773 -6433 -3209 -4937 -6889 -14979 -8302 -1118 11701 13088
6206A3088J783q565j6635j2303L840K1641J562q137l990k923m691O909O354J6068
$$ 13088 14871 6306 -10329 -22632 -18792 2849 4411 -3726 -7716 -10639 -15330 -8421 -2067 14001
6192A4001J4702k08m850k3220k1662o256J6737J616o044n400O770p860m170J4565
$$ 14001 28703 28495 23645 425 -21237 -27493 -10756 -9140 -15184 -20584 -13814 -21674 -25844 -11279
6178a1279l197q128j2437R445J4624m507k992J0317R798J3890J5574j1483j7231
$$ -11279 -14476 -22604 -35041 -25596 -10972 -15479 -18471 -8154 1644 15534 31108 19625 2394
6165B394j2869j700J738N118K48J566Q673j525j785p776L22J5600J7377o065j5017
$$ 2394 -10475 -12175 -10437 -5319 -5071 -3505 5168 3643 1858 -5918 -5596 10004 27381 21316 6299
6150F299K470J613M41N322J185o723M316K821j2814l588L625P218q075j6573l124
$$ 6299 8769 10382 10823 16145 17330 10607 14923 17744 4930 1342 4967 12185 4110 -12463 -15587
6135a5587J77J352L816J431Q461L463j099k538M345K827O030K414j5790J387o962
$$ -15587 -15410 -14058 -10242 -8811 -350 3113 2014 -524 3821 6648 12678 15092 -698 689 -6273
6120f273R02p22j376O285Jj480k077k182K171J3944m165o703L22P689n044k193
$$ -6273 -5371 -6093 -7469 -1184 -1183 -2663 -4740 -6922 -4751 9193 5028 -1675 -1353 6336 1292 -901
6104i01p791p594n34J0521M722l042L58L01P912j893n989o699N136O988q35M746
$$ -901 -8692 -16286 -16820 -6299 -1577 -4619 -4261 -3960 3952 2059 -3930 -10629 -5493 1495 660 5406
6088E406P05O030r70k89N006M131m222p241r516j9570p956J4205J1605M269m763
$$ 5406 6111 12141 11171 10882 15888 20019 15797 8556 -960 -20530 -28486 -14281 -2676 1593 -3170
6073c170R115J369l083o682L891r70P31m0r739R010Q939k141q04p126r976p755
$$ -3170 5945 7314 4231 -2451 1440 470 1201 1161 -8578 432 9371 7230 6426 -700 -10676 -18431
6057a8431j91L343J429J3686M435N557j839j635k845p408j1631o56N935n508J4002
$$ -18431 -18622 -15279 -13850 -164 4271 9828 7989 6354 3509 -3899 -15530 -16186 -10251 -15759 -1757
6042a757J2094N330J725o442m705j519j0631K55m296m06o629Q544Q186k390q145
$$ -1757 10337 15667 17392 10950 6245 4726 -5905 -5650 -9946 -10352 -16981 -8437 -251 -2641 -10786
6027a0786n522O251K293o039o261k368n451r82q113P38N463O744j696J2123N911
$$ -10786 -16308 -10057 -7764 -13803 -20064 -22432 -27883 -28865 -36978 -36240 -30777 -24033 -25729 -13606 -7695
6012g695j137J1261O075m373k95M570j1079l087N97l088M181j3087J5508J5196
$$ -7695 -8832 2429 8504 4131 3836 8406 -2673 -5760 -5163 -8251 -4070 -17157 -1649 13547
5998A3547J616k545K443j1335j1851J1170M525K97N502n327k402N032j6662r791
$$ 13547 15163 12618 15061 3726 -8125 3045 7570 7867 13369 8042 5640 10672 -5990 -15781
5984a5781M142R374j2822p043R349R550Q878l157J997r315p278j0044M25J6387
$$ -15781 -11639 -2265 -15087 -22130 -12781 -3231 5647 2490 4487 -4828 -12106 -22150 -21725 -5338
5970e338J7388K50p612K444o781o022l175L556m309Q443J548m60K829N273K108
$$ -5338 12050 12300 4688 7132 351 -5671 -8846 -5290 -9599 -1156 392 -68 2761 8034 10142
5955A0142o733n216L897m78j3000l258m175P040J944K90Q210N766o353j039l670
$$ 10142 3409 -1807 2090 1612 -11388 -14646 -18821 -11781 -9837 -9547 -1337 4429 -1924 -2963 -6633
5940f633o094J5402N846P060m162k0131q70P811N707K311n122O459M035q60m75
$$ -6633 -12727 2675 8521 15581 11419 -8712 -9582 -1771 3936 6247 1125 7584 11619 10759 10284
5925A0284J058l469l525J5493J5529j5434j0419M648j2946j8263P850K0029J6231
$$ 10284 11342 7873 4348 19841 35370 19936 9517 14165 1219 -17044 -9194 10835 27066
5912B7066n740j2084k1466j3484J4584J7195M356J76O420j108j14K050k690n480
$$ 27066 21326 9242 -12224 -25708 -11124 6071 10427 10603 17023 15915 15801 17851 15161 9681
5898I681n868q696N242K819J003k449P949K110l669J373J4635p661k0958p183
$$ 9681 3813 -4883 359 3178 4181 1732 9681 11791 8122 9495 24130 16469 -4489 -11672
5884a1672P282K803R635J3660p315k849j197n487P065o555j8364j3437Q238J0218
$$ -11672 -4390 -1587 8048 21708 14393 11544 10347 4860 11925 5370 -12994 -26431 -18193 -7975
5870g975J2401k997k0979r657J5235J4607R227o356L87J29m682q124J0863N551
$$ -7975 4426 1429 -19550 -29207 -13972 635 9862 3506 3893 4022 -660 -8784 2079 7630
5856G630j829j434K49N328l095J518K293J1301M378j2863j9131o840j0406o626
$$ 7630 5801 4367 4616 9944 6849 8367 10660 21961 26339 13476 -5655 -12495 -22901 -29527
5842b9527l018k329J0356L651j131l113P297N289Q259o640J473Q683J6278R479
$$ -29527 -32545 -34874 -24518 -20867 -21998 -25111 -17814 -12525 -4266 -10906 -9433 -750 15528 25007
5828B5007J73j123m564o594Q893R21p674j5390j1002m050N634K982o230l169P543
$$ 25007 25180 24057 19493 12899 21792 22713 15039 -351 -11353 -15403 -9769 -6787 -13017 -16186 -8643
5813h643m797m663R602O197k384l671O032P367M315k822L680P775p289r46q388
$$ -8643 -13440 -18103 -8501 -2304 -4688 -8359 -2327 5040 9355 6533 10213 17988 10699 9753 1365
5798A365r758K683q594M117J715J199J949J3469J1174J71j3147M877K973R393
$$ 1365 -8393 -5710 -14304 -10187 -8472 -7273 -5324 8145 19319 19490 6343 11220 14193 23586
5784B3586o936j770l152k249M332j2881k810r636L773O725j0224k464Q723m92
$$ 23586 16650 14880 11728 9479 13811 930 -1880 -11516 -7743 -1018 -11242 -13706 -4983 -5475
5770e475r57k767k59R44L087L057R201M55J184k0455m715Q378J454R500j431O38
$$ -5475 -6432 -9199 -9458 -8514 -5427 -2370 6831 7286 8470 -11985 -16700 -8322 -6868 2632 1201 1839
5754A839p320L848P984j109O451O515j0335p193n923l795j782R689L523K56J7814
$$ 1839 -5481 -1633 6351 5242 11693 18208 7873 680 -5243 -9038 -10820 -1131 2392 2648 20462
5739B0462N460m990K988j0408o530j4531j0972J8444J2881j634p786p155m495
$$ 20462 25922 20932 23920 13512 6982 -7549 -18521 -77 12804 11170 3384 -3771 -8266
5726h266P488k354P092J164j2491P533J0953q33j6821r34n98R123J984J815J2716
$$ -8266 -778 -3132 3960 5124 -7367 166 11119 10286 -6535 -7469 -8067 1056 3040 4855 17571
5711A7571l745K988J960n260k643k205N61M042P749q988K969M541j1464j1736
$$ 17571 13826 16814 18774 13514 10871 8666 9227 13269 21018 12030 14999 19540 8076 -3660
5697c660j1624P634J8463M624j2535M689M288r192L207k260Q260P776k0j0545
$$ -3660 -15284 -7650 10813 15437 2902 7591 11879 2687 5894 3634 11894 19670 19650 9105
5683I105j955J0834J891p745m160K645j8504l968l039K854N311m419l961p016
$$ 9105 7150 17984 19875 12130 7970 10615 -7889 -11857 -14896 -12042 -6731 -11150 -15111 -22127
5669b2127P989q16M061J609n440K344N136J2567j10l676P275N39j3738q522N471
$$ -22127 -14138 -14954 -10893 -9284 -14724 -12380 -7244 5323 5213 1537 8812 9351 -4387 -12909 -7438
5654g438O358J1040K638L68O023j5918J266J2062j820p458o871m522M379J6261
$$ -7438 -1080 9960 12598 12966 18989 3071 4337 16399 14579 7121 250 -4272 107 16368
5640A6368J1932J370p105m697j3647l734J0526l841l188L999J184q786q158N05
$$ 16368 28300 29670 22565 17868 4221 487 11013 7172 3984 7983 9167 381 -7777 -7272
5626g272N835N123l59l57q869J2481J226q643J199P147J4564O275j2815o670j837
$$ -7272 -1437 3686 3327 2970 -5899 6582 7808 -835 364 7511 22075 28350 15535 8865 7028
5611G028M844J672o945j1580O812k257J6124N753j370o401j3623j0976k089m350
$$ 7028 11872 13544 6599 -4981 1831 -426 15698 21451 20081 13680 57 -10919 -13008 -17358
5597a7358K545J3750R740o74p424q248j098n011m51J3831p794j1841l685J1289
$$ -17358 -14813 -1063 8677 8003 579 -7669 -8767 -13778 -14229 -398 -8192 -20033 -23718 -12429
5583a2429j947j156J852L296M79P920r472k699Q742O74J1618L685o929K009r824
$$ -12429 -14376 -15532 -13680 -10384 -9905 -1985 -11457 -14156 -5414 -4740 6878 10563 3634 5643 -4181
5568d181p11J2338K884k1090j6184O245R209J0328Q644O702k292p834n739l484
$$ -4181 -4892 7446 10330 -10760 -26944 -20699 -11490 -1162 7482 14184 11892 4058 -1681 -5165
5554e165L720o860K191j526M583j856r518M264J2894l588O2J1020k12K019j317
$$ -5165 -1445 -8305 -6114 -7640 -3057 -4913 -14431 -10167 2727 -861 -799 10221 10009 12028 10711
5539A0711j7591P879m900j347L732R092J2871J758j4719j1682J124P370J24K148
$$ 10711 -6880 999 -3901 -5248 -1516 7576 20447 22205 7486 -4196 -3072 4298 4422 6570
5525F570m333j0569j469P127P387O522O600n781m192K418L612n869m236j99l034
$$ 6570 2237 -8332 -9801 -2674 4713 11235 17835 12054 7862 10280 13892 8023 3787 3588 554
5510E54j1533o426N81J0728R507k572o498r600O89J959Q837l392J547J2250J5735
$$ 554 -10979 -17405 -16824 -6096 3411 839 -5659 -15259 -14570 -12611 -3774 -7166 -5619 6631 22366
5495B2366P09K30l435j2018J301M986r171n449P880m560k672R188o466j4046j4148
$$ 22366 23075 23305 19870 7852 9153 14139 4968 -481 7399 2839 167 9355 2889 -11157 -25305
5480b5305M086J4566J9650J3036p273j9406o591P948q418n290L975N07j3765l689
$$ -25305 -21219 -6653 12997 26033 18760 -646 -7237 711 -7707 -12997 -9022 -8515 -22280 -25969
5466b5969R165K261L264K50p29j819j188q79l32O402Q773J823K793p181M703l46
$$ -25969 -16804 -14543 -11279 -11029 -11758 -13577 -14765 -15644 -15976 -9574 -801 1022 3815 -3366 1337 991
5450I91J9393j1224n292K693J183j112J259O135o763j1291j1539j2213m09J468
$$ 991 20384 9160 3868 6561 7744 6632 7891 14026 7263 -4028 -15567 -27780 -28189 -26721
5436b6721J4110J7391K436L199j568J731p104j0128L373J1443L323n663J399P616
$$ -26721 -12611 4780 7216 10415 8847 10578 3474 -6654 -3281 8162 11485 5822 7221 14837
5422A4837J333k67Q35k012j2561j993j674K229N070m858n010p516K298J4488K157
$$ 14837 16170 15903 16738 14726 2165 172 -1502 727 5797 939 -4071 -11587 -9289 5199 7356
5407G356J545j135J464k800j269M707n610j974K797K646k558m476R94O787J464
$$ 7356 8901 7766 9230 6430 5161 9868 4258 2284 5081 7727 5169 693 1687 8474 9938
5392I938j6907q105J1541J4140M860j030J2056m812k1657q500J382k933jm439
$$ 9938 -6969 -15074 -3533 10607 15467 14437 26493 21681 24 -8476 -7094 -10027 -10028 -14467
5378a4467M425N282Q248M917R712Q166l02O8j834r646l226J5276q719j3404m682
$$ -14467 -10042 -4760 3488 8405 18117 26283 25981 26049 24215 14569 11343 26619 17900 4496 -186
5363a86P759l635k89n203o789J1761J896K28O099l595j2093M064k137K611l515
$$ -186 7573 3938 3649 -1554 -8343 3418 5314 5542 11641 8046 -4047 17 -2120 491 -3024
5348c024J284N884R019q55o848Q52l54J227R207N290q648o498J108N459p201n619
$$ -3024 -1740 4144 13163 12308 5460 6312 5958 7185 16392 21682 13034 6536 7644 13103 5902 283
5332B83O613J5515R430j3176k5445j5424M237J4260N001q770o383L401J1469J1623
$$ 283 6896 22411 31841 18665 -6780 -22204 -17967 -3707 1294 -7476 -13859 -10458 1011 12634
5318A2634Q27j2678p676L027N596N255J1836p40j0888j3057q639M338N011K630
$$ 12634 13461 783 -6893 -3866 1730 6985 18821 18081 7193 -5864 -14503 -10165 -5154 -2524
5304b524P975J0901j526m449q777J583K858p212l304P854j0501m71j56r700o746
$$ -2524 5451 16352 14826 10377 1600 3183 6041 -1171 -4475 3379 -7122 -7593 -7749 -17449 -24195
5289b4195N900l537q628L170J6874P228J696K002j1625j875P544K476K799k373
$$ -24195 -18295 -21832 -30460 -27290 -10416 -3188 -1492 510 -11115 -12990 -5446 -2970 -171 -2544
5275b544L46K362n580p099Q848R814k291m353K494M916q103n058K331L183M429
$$ -2544 -2198 164 -5416 -12515 -3667 6147 3856 -497 1997 6913 -1190 -6248 -3917 -734 3695
5260C695m965o03Q443j728j437N87J3709J3315j0178r785m487j0273j3145J3892
$$ 3695 -1270 -1873 6570 4842 3405 3992 17701 31016 20838 11053 6566 -3707 -16852 -2960
5246b960R615m363j0338O876N561L538r029j3149N048P086N646J1313l146j993
$$ -2960 6655 2292 -8046 -1170 4391 7929 -1100 -14249 -9201 -2115 3531 14844 11698 9705
5232I705K2n042q065j4822o294P782q5K067J821O129O579K045n046N3k098J059
$$ 9705 9727 4685 -3380 -18202 -24496 -16714 -16799 -14732 -12911 -6782 -203 1842 -3204 -3151 -5249 -4190
5216d190J600j609M072J0817j267K240q46j1894j0162P807p650j0227j753R417
$$ -4190 -2590 -4199 -127 10690 9423 11663 10817 -1077 -11239 -3432 -11082 -21309 -23062 -13645
5202a3645m524l6l246L883K0534N994m931p055j940k854J6630j208j7407j664
$$ -13645 -18169 -18205 -21451 -17568 2966 8960 4029 -3026 -4966 -7820 8810 7602 -9805 -11469
5188a1469P86N723J3521J2289K198j2493l134P492M500j3980l151l892j3815J198
$$ -11469 -10683 -4960 8561 20850 23048 10555 7421 14913 19413 5433 2282 -1610 -15425 -14227
5174a4227Q566J861J3022K354j1446o890L869O960K087k904n669j427j0591j4442
$$ -14227 -5661 -3800 9222 11576 130 -6760 -2891 4069 6156 3252 -2417 -3844 -14435 -28877
5160b8877J0210R96r515j437J8382J1993L842j5740k679N901n310R75J2337k483
$$ -28877 -18667 -17671 -27186 -28623 -10241 1752 5594 -10146 -12825 -6924 -12234 -11259 1078 -1405
5146a405l915L746j650q970p172Q387k900l914J030R511M368r86J1870J7110k750
$$ -1405 -5320 -1574 -3224 -12194 -19366 -10979 -13879 -17793 -16763 -7252 -2884 -3870 8000 25110 22360
5131B2360j8180K235O576o252j2015P15k839o02J7724J327N751J0279l839q604
$$ 22360 4180 6415 12991 6739 -5276 -4561 -7400 -8002 9722 11049 16800 27079 23240 14636
5117A4636j074K655l841K440J377o401L423K530o12j3464o672N024k449j169j141
$$ 14636 13562 16217 12376 14816 16193 9792 13215 15745 15133 1669 -5003 21 -2428 -3597 -4738
5102d738j3669o890L656R112L915m897j310k98P092P73q5k73J867q83K205J0639
$$ -4738 -18407 -25297 -21641 -12529 -8614 -13511 -14821 -15119 -8027 -7254 -7339 -7612 -5745 -6628 -4423 6216
5086F216o333o88J902p781o713N09Q805l578m210n614K898J3295L392K523m930
$$ 6216 -117 -805 1097 -6684 -13397 -12888 -4083 -7661 -11871 -17485 -14587 -1292 2100 4623 -307
5071c07p195J2587j910j1507L129j29o535m321L522K173J685j686k799P904J173
$$ -307 -7502 5085 3175 -8332 -5203 -5332 -11867 -16188 -12666 -10493 -8808 -10494 -13293 -5389 -4216
5056d216Q239K233j2121j4771J001J2683Q423j9041q986K092k771L288M218j010
$$ -4216 4023 6256 -5865 -20636 -19635 -6952 1471 -17570 -26556 -24464 -27235 -23947 -19729 -20739
5042b0739J2609R816p695l675J31j628P479J3796m961j1605j295P393j3789k1
$$ -20739 -8130 1686 -6009 -9684 -9553 -11181 -3702 10094 5133 -6472 -7767 -374 -14163 -14184
5028a4184K974R00n536p336K610P356O796m552L453q39l958P094K680J1341k467
$$ -14184 -11210 -10310 -15846 -23182 -20572 -13216 -6420 -10972 -7519 -8358 -12316 -5222 -2542 8799 6332
5013F332j3991o051R89L621n51N672k0213m949J1725k134R669o92q283m153m864
$$ 6332 -7659 -13710 -12721 -9100 -9651 -3979 -24192 -29141 -17416 -19550 -9881 -10573 -18856 -23009 -27873
4998b7873J6952Q399L234q172P542N413o194q779r807M809R276J2461N423q419
$$ -27873 -10921 -2522 712 -7460 82 5495 -699 -9478 -19285 -14476 -5200 7261 12684 4265
4984D265k437k315K453L252N744l903m602m706J54J509M067j155N682L177r693
$$ 4265 1828 -487 1966 5218 10962 7059 2457 -2249 -2095 -586 3481 2326 8008 11185 1492
4969A492j1295L556J6830J0637j1911j5168m868L0j468K122j1547m823N877J1145
$$ 1492 -9803 -6247 10583 21220 9309 -5859 -10727 -10697 -12165 -10043 -21590 -26413 -20536 -9391
4955i391o910J380J6779m527j03M016n241k613J4527K88j0436j455J341K175n468
$$ -9391 -16301 -14921 1858 -2669 -2772 1244 -3997 -6610 7917 8205 -2231 -3686 -2345 -170 -5638
4940e638R90J561q440J154J0087j37K11O249N531j0553r453J1870M570q841L611
$$ -5638 -4648 -3087 -11527 -10373 -286 -423 -212 6037 11568 1015 -8438 3432 8002 -839 2772
4925B772l177R199o191Q90M488L539M671K336p164j6680j4258l674j06R028k288
$$ 2772 -405 8794 2603 3493 7981 11520 16191 18527 11363 -5317 -19575 -23249 -23355 -14327 -16615
4910a6615K872J0669n436O624J0713J634J315j736l782n808N446m36P937K033
$$ -16615 -13743 -3074 -8510 -1886 8827 10461 11776 10040 6258 450 5896 5460 13397 15430
4896A5430j8249j4320L945j779N00Q498q089m334O270J4793L188j612k801q737
$$ 15430 -2819 -17139 -13194 -14973 -14473 -5975 -14064 -18398 -12128 2665 5853 4241 1440 -7297
4882g297J6293k828J668q392k2244l413N570M797R33M142L449k446j995O41l238
$$ -7297 8996 6168 7836 -556 -22800 -26213 -20643 -15846 -14913 -10771 -7322 -9768 -11763 -11122 -14360
4867a4360j6588k202J6855M461J56J2630J5009n759j064j361j078K107j971j0109
$$ -14360 -30948 -33150 -16295 -11834 -11678 952 15961 10202 9138 7777 6699 8806 6835 -3274
4853c274q396N162M713o745Q00J8869J7794j0062j5426j55j979k371m545j344
$$ -3274 -11670 -6508 -1795 -8540 -7740 11129 28923 18861 3435 3280 1301 -1070 -5615 -6959
4839f959n586j72J4032J2736L761j0468p884L872N699Q83J494k596r809k049n888
$$ -6959 -12545 -12717 1315 14051 17812 7344 -540 3332 9031 9914 11408 8812 -997 -3046 -8934
4824h934Q568O843k087m88L262M298m774l716m398l302N860J934k173p061O644
$$ -8934 -366 6477 4390 3902 7164 11462 6688 2972 -1426 -4728 1132 3066 893 -6168 476
4809D76O671n927P317L169j832k471O700N858n82R88k020M763K113j3954r177
$$ 476 7147 1220 8537 11706 9874 7403 14103 19961 19379 20367 18347 23110 25223 11269 2092
4794B092J662N646k452J826j407J458K048L429n158N71j0413j0254K516J4587
$$ 2092 3754 9400 6948 8774 7367 8825 10873 14302 9144 9715 -698 -10952 -8436 6151
4780F151m118p314J060N619p552M138R45K02r78n019l532J528M603r631o450j695
$$ 6151 2033 -5281 -4221 1398 -6154 -2016 -1071 -869 -1847 -6866 -10398 -8870 -4267 -13898 -20348 -22043
4764b2043L845R265P879N670m793p943j42L020J421m60O098J0499l180l961j326
$$ -22043 -18198 -8933 -1054 4616 -177 -8120 -8262 -5242 -3821 -4281 1817 12316 9136 5175 3849
4749C849k0j742q117o217r939O989J1612Q725j0967j2420M618J3406n896N685
$$ 3849 3829 2087 -6030 -12247 -22186 -15197 -3585 5140 -5827 -18247 -13629 -223 -6119 -434
4735d34J2041O79k86n255j5511K818j995R394M93j3973n018M006R156l000j0375
$$ -434 11607 12286 12000 6745 -8766 -5948 -7943 1451 1944 -12029 -17047 -13041 -3885 -6885 -17260
4720a7260J202k792K790o830J1936L377o463m32L229O123J2338o721p162n815
$$ -17260 -16058 -18850 -16060 -22890 -10954 -7577 -14040 -14472 -11243 -5120 7218 497 -6665 -12480
4706a2480J14J9317l60r176o0Q196m082n906J182k203m156K131o50K981m055L283
$$ -12480 -12366 6951 6591 -2585 -2645 5551 1469 -4437 -3255 -5458 -9614 -7483 -8133 -5152 -9207 -5924
4690e924R523Q82n308M290L59m649O301j0634l161K649M775O198J039n33p667
$$ -5924 3599 4481 -827 3463 3822 -827 5474 -5160 -8321 -5672 -897 5301 6340 5807 -1860
4675a860m940r859l253K40l978J4922J0443P586p011n881p421M666N665O312M99
$$ -1860 -6800 -16659 -19912 -19672 -23650 -8728 1715 9301 2290 -3591 -11012 -6346 -681 5631 6130
4660F130m773l446K069J4006o297j4330j1790J594R702J4887O8J547j7469l3787
$$ 6130 1357 -2089 -20 13986 7689 -6641 -18431 -16837 -7135 7752 7820 9367 -8102 -41889
4646d1889J5201K7566J7248q689M827Q517K886k063j5941k451j001M89r576M320
$$ -41889 -26688 878 18126 9437 14264 22781 25667 23604 7663 5212 4211 4700 -4876 -556
4632e56N41k688o409M408n456L186L241N505r68q948R695Q477j08m948j0840o807
$$ -556 -15 -2703 -9112 -4704 -10160 -6974 -3733 1772 804 -8144 1551 10028 9920 4972 -5868 -12675
4616a2675j460L540K970n37R177j3K834p202J704J7708m708j913K201k708j0615
$$ -12675 -14135 -10595 -7625 -8162 1015 1002 3836 -3366 -1662 16046 11338 9425 11626 8918 -1697
4601a697J193K825j0707n66Q695l531n750J412L206m499j1541J1834J1120P466
$$ -1697 -504 2321 -8386 -8952 -257 -3788 -9538 -8126 -4920 -9419 -20960 -9126 1994 9460
4587I460Q640o007j1383j964l524l188m746K133k456J736J925J107K249J253J855
$$ 9460 18100 12093 710 -1254 -4778 -7966 -12712 -10579 -13035 -11299 -9374 -8267 -6018 -4765 -2910
4572b910n742j1303l764R968K710P665Q975j0067j026J1678N465q137q560m223
$$ -2910 -8652 -19955 -23719 -13751 -11041 -3376 5599 -4468 -5494 6184 11649 3512 -5048 -9271
4558i271J1360M879j328K692l787k483P307J0550q105r846l508j668M185J41m324
$$ -9271 2089 6968 5640 8332 4545 2062 9369 19919 11814 1968 -1540 -3208 977 1118 -3206
4543c206j406o720k564P712P256L311o394o879K044J0223O09R60L443O26o10j2290
$$ -3206 -4612 -11332 -13896 -6184 1072 4383 -2011 -8890 -6846 3377 3986 4946 8389 9015 8405 -3885
4527c885l00J097O898J0252M846m088q641j256K149o233m308R58O541N552k3323
$$ -3885 -4185 -3088 3810 14062 18908 14820 6179 4923 7072 839 -3469 -2511 4030 9582 -13741
4512a3741j1249J6377m19k447m267l626p72r276Q221J2318N753n6k10J3949J0604
$$ -13741 -24990 -8613 -9032 -11479 -15746 -19372 -20144 -29420 -21199 -8881 -3128 -3184 -3394 10555 21159
4497B1159o122j2106m817N5j505L602rM510L469m324m178r07R645n225j814L524
$$ 21159 15037 2931 -1886 -1831 -3336 266 257 4767 8236 3912 -266 -1173 8472 3247 1433 4957
4481D957N87p530J108K744K53J0149p422L269J1104j6316k496K400L225o569q568
$$ 4957 5544 -1986 -878 1866 2119 12268 4846 8115 19219 2903 407 2807 6032 -537 -9105
4466i105m288Q379L746l771o529r822N503M597o779P715J3265m632M116p986j2641
$$ -9105 -13393 -5014 -1268 -5039 -11568 -21390 -15887 -11290 -18069 -10354 2911 -1721 2395 -5591 -18232
4451a8232L678K894R938J6026J437j7001j790P483L45j0648N69R620N387J675
$$ -18232 -14554 -11660 -1722 14304 15741 -1260 -3050 4433 4778 -5870 -5301 4319 9706 11381
4437A1381K165r675o195p217n017n370j572O122j964p947q72R94O86l68J989J2553
$$ 11381 13546 3871 -2324 -9541 -14558 -19928 -21500 -15378 -17342 -25289 -26161 -25167 -24481 -24849 -22860 -10307
4421a0307K011m350j2592J0090R18P91J1192n509j441K797J4230M827K331k2243
$$ -10307 -8296 -12646 -25238 -15148 -14230 -13439 -2247 -7756 -9197 -6400 7830 12657 14988 -7255
4407g255n114n39j793L773R523k425n972q024o776M882J227J0386j0383j3055
$$ -7255 -12369 -12908 -14701 -10928 -1405 -3830 -9802 -17826 -24602 -19720 -18493 -8107 -18490 -31545
4393c1545j727O524J423l182J8749j066m380L847L4j1975q574J4997J0518N1j3613
$$ -31545 -33272 -26748 -25325 -28507 -9758 -10824 -15204 -11357 -11323 -23298 -31872 -16875 -6357 -6306 -19919
4378a9919k178J1499K1832N637K91j4233r28M459j0360o167m89k495K865L601
$$ -19919 -22097 -10598 11234 16871 17162 2929 2001 6460 -3900 -10067 -10556 -13051 -10186 -6585
4364f585J686j1746j260L273M39L646Q421K625Q544l797q023L63J3266Q314o249
$$ -6585 -4899 -16645 -17905 -14632 -14193 -10547 -2126 499 9043 5246 -2777 -2414 10852 19166 12917
4349A2917O161O436M58j1846l027p595K203Q006l122N489j0733j0522m581m716
$$ 12917 19078 25514 25972 14126 11099 3504 5707 13713 10591 16080 5347 -5175 -9756 -14472
4335a4472N458o005P340L442O464M09m505q39L766L659n272L298J3108j3334j1893
$$ -14472 -9014 -15019 -7679 -4237 2227 2636 -1869 -2708 1058 4717 -555 2743 15851 2517 -9376
4320i376j4163J3876J1761J0884O145j1660j9561j6066m080J3021J5761L413J0347
$$ -9376 -23539 -9663 2098 12982 19127 7467 -12094 -28160 -32240 -19219 -3458 -45 10302
4307A0302J0806j291k0042k2194J0262J1179q822j3115K580J3703J661n691l064
$$ 10302 21108 19817 -225 -22419 -12157 -978 -9800 -22915 -20335 -6632 -4971 -10662 -13726
4294a3726P008l657l220Q812r132n415J2312J2077k939m367j3670k722K585j771
$$ -13726 -6718 -10375 -13595 -4783 -13915 -19330 -7018 5059 2120 -2247 -15917 -18639 -16054 -17825
4280a7825p90j977P702M791O566l401o920k065j2329qM969K809O551O796K728
$$ -17825 -18615 -20592 -12890 -8099 -1533 -4934 -11854 -13919 -26248 -26256 -21287 -18478 -11927 -5131 -2403
4265b403n13j324N358J2473Q76p577m796q94j59j94L204k857K003j729K602M537
$$ -2403 -2916 -4240 1118 13591 14467 6890 2094 1200 1041 847 4051 1194 3197 1468 4070 8607
4249H607O73k436P661k134j73p170j1891j1362k623O788Q88j1183m870l226J3873
$$ 8607 9280 6844 14505 12371 12198 5028 -6863 -18225 -20848 -14060 -13172 -24355 -29225 -32451 -18578
4234a8578Q582P098L341l03Q669M07O170J467k0281j73k498L600n184n500K572
$$ -18578 -9996 -2898 443 140 8809 9216 15386 16853 -3428 -3601 -6099 -2499 -7683 -13183 -10611
4219a0611R161K056k147K587O053j611L63J616o211o085l379j601m075j1087L848
$$ -10611 -1450 606 -1541 1046 7099 5488 5851 7467 1256 -4829 -8208 -9809 -13884 -24971 -21123
4204b1123J6333M873J1006J182l730l445O772K633M885k602l214k1189m106J7613
$$ -21123 -4790 83 11089 12271 8541 5096 11868 14501 19386 16784 13570 -7619 -11725 5888
4190E888P797k779J701j6810L903j231q634M829M096k192M620R743m92o982o189
$$ 5888 13685 10906 12607 -4203 -300 -1531 -10165 -5336 -1240 -3432 1188 10931 10439 3457 -2732
4175b732m909J489L459M695K071o848J0891P461n923o782j0141M387N46j0154
$$ -2732 -7641 -6152 -2693 2002 4073 -2775 8116 15577 9654 2872 -7269 -2882 -2336 -12490
4161a2490J0911J1895P355p842L681M390Q145j1504k1761o342O768P060J3253
$$ -12490 -1579 10316 17671 9829 13510 17900 26045 14541 -7220 -13562 -6794 266 13519
4148A3519k977j2731n429o047r76P815M634M370J820O341N94n005k077p561K19
$$ 13519 10542 -2189 -7618 -13665 -14641 -6826 -2192 2178 3998 10339 10933 5928 3851 -3710 -3491
4133c491r44K473J3030L22m331j0367K369N801p672q517J3739l832j0939M279
$$ -3491 -4435 -1962 11068 11390 7059 -3308 -939 4862 -2810 -11327 2412 -1420 -12359 -8080
4119h080P94p858J0508k171o998O119L781q37p391j449J1956Q051j728n108r458
$$ -8080 -7286 -15144 -4636 -6807 -13805 -7686 -3905 -4742 -12133 -13582 -1626 6425 4697 -411 -9869
4104i869j968K864J508O009k157j4203K547J7870q359o25J5384J1061q076q273
$$ -9869 -11837 -8973 -7465 -1456 -3613 -17816 -15269 2601 -5758 -6383 9001 20062 11986 3713
4090C713j883J682p206K041J4524n084m535P878j281k717N738q488M82R92Q145
$$ 3713 1830 3512 -3694 -1653 12871 7787 3252 11130 9849 7132 12870 4382 4864 5856 14001
4075A4001K17j5532j1077P897P590r833l981N088R851J704m036j3848m821o935
$$ 14001 14218 -1314 -12391 -4494 3096 -6737 -10718 -5630 4221 5925 1889 -11959 -16780 -23715
4061b3715J2853R143Q596k416m772q227K549N642K908j1437q805J3919k612k884
$$ -23715 -10862 -1719 6877 4461 -311 -8538 -5989 -347 2561 -8876 -17681 -3762 -6374 -9258
4047i258j635R129J2236K864j2540o598p985n81j0311M872J0279N197J027j0994
$$ -9258 -10893 -1764 10472 13336 796 -5802 -13787 -14368 -24679 -19807 -9528 -4331 -3304 -14298
4033a4298j876R066K369o32p194M990J4149n896j2509R07J270Q930L401J614N673
$$ -14298 -16174 -7108 -4739 -5371 -12565 -7575 6574 678 -11831 -10924 -9654 -724 2677 4291 9964
4018I964O214J6664q82k1107j4895M181M1j2253P18Q171J2499j131p110L265J59
$$ 9964 16178 32842 31960 10853 -4042 139 180 -12073 -11355 -3184 9315 8184 1074 4339 4498
4003D498m859o501K916O991m974O423N292r800r029J745P113m640n553L722N133
$$ 4498 -361 -6862 -3946 3045 -1929 4494 9786 -14 -9043 -7298 -185 -4825 -10378 -6656 -1523
3988a523Q446N799J259p830L088R574o596j0283j1446K290J893j0496N247J0960
$$ -1523 6923 12722 13981 6151 9239 18813 12217 1934 -9512 -7222 -5329 -15825 -10578 382
3974C82O182n529O736L243p699q402j3007q00M407Q321M0K568J946l17k685j0999
$$ 382 6564 1035 7771 11014 3315 -5087 -18094 -18894 -14487 -6166 -6126 -3558 -1612 -1929 -4614 -15613
3958a5613K666P645k747J0997N810p737q76q558J85L862J4235L616j714n502J094
$$ -15613 -12947 -5302 -8049 2948 8758 1021 145 -8413 -8228 -4366 9869 13485 11771 6269 7363
3943G363O201R70n047j3546J938J1086L162n740r381n7N800p133o982l636M58
$$ 7363 13564 14534 9487 -4059 -2121 8965 12127 6387 -2994 -3051 2749 -4384 -11366 -15002 -14544
3928a4544R924J7614m632j1172k41N710J775k652P331J464j0313m965j734M525
$$ -14544 -4620 12994 8362 -2810 -3051 2659 4434 1782 9113 10577 264 -4701 -6435 -1910
3914a910q175j1430J3612J288l732O876R9M308j1171m43O402K660M898M769r869
$$ -1910 -10085 -21515 -7903 -6615 -10347 -3471 -3372 936 -10235 -10678 -4276 -1616 3282 8051 -1818
3899a818n323J2981j8m963L0q759j2733j908J0732j22K509O70n574k960O957J0300
$$ -1818 -7141 5840 5822 859 889 -7870 -20603 -22511 -11779 -11901 -9392 -8722 -14296 -17256 -10299 1
3883AK874o087P324J60j0130n312O680j882Q66k849M229L219K927n178j1052M775
$$ 1 2875 -3212 4112 4272 -5858 -11170 -4490 -6372 -5506 -8355 -4126 -907 2020 -3158 -14210 -9435
3867i435J5772J1925m231p157L551K758j0303k947n276j634J1023L008l581N83
$$ -9435 6337 18262 14031 6874 10425 13183 2880 -67 -5343 -6977 4046 7054 3473 4056
3853D056M643K566k238O360j0075j0283j1979l366J1819J4388k30l703n551O78
$$ 4056 8699 11265 9027 15387 5312 -4971 -16950 -20316 -8497 5891 5661 1958 -3593 -2915
3839b915m937r452k086J5372Q654l082R3N619k307K746r740j2374l11J1277m511
$$ -2915 -7852 -17304 -19390 -4018 4636 1554 1647 7266 4959 7705 -2035 -14409 -14720 -3443 -7954
3824g954q904K350J6686q262k1323K512J6423J6460L217k187j4239j3432n517
$$ -7954 -16858 -14508 2178 -6084 -27407 -24895 -8472 7988 11205 9018 -5221 -18653 -24170
3811b4170R736J0706j832l406j546l596P641O348p02L525P363L762n399m992j676
$$ -24170 -14434 -3728 -5560 -8966 -10512 -14108 -6467 -119 -821 2704 10067 13829 8430 3438 1762
3796A762q271n138K872M901m820j316Q961J4674k411r055p349K003J3830R693
$$ 1762 -6509 -11647 -8775 -3874 -8694 -10010 -1049 13625 11214 2159 -5190 -3187 10643 20336
3782B0336N217o480p311K657r23o351n880J32L586K113o606J1945O808j0668k72
$$ 20336 25553 19073 11762 14419 13496 7145 1265 1397 4983 7096 490 12435 19243 8575 8303
3767H303p99j2321j342M451K146O191n184k105m501k905o575L935R163l361J3784
$$ 8303 7504 -4817 -6159 -1708 438 6629 1445 -660 -5161 -8066 -14641 -10706 -1543 -4904 8880
3752H880J4169j343M6L958j3939K147J0385m585j4782M99l256O204J6132o41j8746
$$ 8880 23049 21706 21752 25710 11771 13918 24303 19718 4936 5435 2179 8383 24515 23874 5128
3737E128j2153j4641M387J1973K681L456l719n841L211O883N51j2931k100L019
$$ 5128 -7025 -21666 -17279 -5306 -2625 831 -2888 -8729 -5518 1365 1916 -11015 -13115 -10096
3723a0096j817l068N923R419p649l86J513J514Q619N540k946O74j39p949l49j1822
$$ -10096 -11913 -14981 -9058 361 -7288 -7674 -6161 -4647 3972 9512 6566 7240 7101 -848 -1197 -13019
3707a3019n436p61P296L1987J3501o288o823j3531q691J1755R156j2593J119R801
$$ -13019 -18455 -19216 -11920 20067 33568 27280 20457 6926 -1765 9990 19146 6553 7672 17473
3693A7473L779j0584P449N872p76l449Q71j5074n89p09k012P147o789j1303M382
$$ 17473 21252 10668 18117 23989 23213 19764 20635 5561 4972 4263 2251 9398 2609 -8694 -4312
3678d312K899n899q114n689j0243J1023J7750M057N918J426l871l334j147K064
$$ -4312 -1413 -7312 -15426 -21115 -31358 -20335 -2585 1472 7390 8816 4945 1611 464 2528
3664B528r576l748O64P603Q095o285J155n41j0980m326p709R512J1098J2300L088
$$ 2528 -7048 -10796 -10132 -2529 5566 -719 436 -105 -11085 -15411 -23120 -13608 -2510 9790 12878
3649A2878l760P318m932j093j8j2251o162J015m259J337Q39n428q785J354R515
$$ 12878 9118 16436 11504 10411 10393 -1858 -8020 -7005 -11264 -9927 -9088 -14516 -23301 -21947 -12432
3634a2432J3661R082l974M832r42j4421J0689J1446K619l594K445r490j1876J91
$$ -12432 1229 10311 6337 11169 10227 -4194 6495 17941 20560 16966 19411 9921 -1955 -1764
3620a764O733L431j189r30P366j157j2988O61L256N687L568M708q627j4590k555
$$ -1764 4969 8400 7211 6281 13647 12490 -498 163 3419 9106 12674 17382 8755 -5835 -8390
3605h390J1059k559j4273N06P931n142m815n167K112R029p602K884M272M427J1634
$$ -8390 2669 110 -14163 -13657 -5726 -10868 -15683 -20850 -18738 -9709 -17311 -14427 -10155 -5728 5906
3590E906N973n316R65m659p305K230N76K838j082P640J1365N081j2939o547Q984
$$ 5906 11879 6563 7528 2869 -4436 -2206 -1630 1208 126 7766 19131 24212 11273 4726 13710
3575A3710O434R471j785j5897p290q881K585R033M160l832J0883j4147q742o291
$$ 13710 20144 29615 27830 11933 4643 -4238 -1653 7380 11540 7708 18591 4444 -4298 -10589
3561a0589K104J1069Q210j081n190K465p458o982o989o44R89O066M653O141Q122
$$ -10589 -8485 2584 10794 9713 4523 6988 -470 -7452 -14441 -15085 -14096 -8030 -3377 2764 10886
3546A0886O814r733q278O017n079L476m495L841p170L995m698j4761M378K568
$$ 10886 17700 7967 -311 5706 627 4103 -392 3449 -3721 274 -4424 -19185 -14807 -12239
3532a2239q153N013L245M521J2395p868j1745L364o37j087K154J446M950j2749
$$ -12239 -20392 -15379 -12134 -7613 4782 -3086 -14831 -11467 -12104 -13191 -11037 -9591 -4641 -17390
3518a7390P4N980K91L104P122J7390K528j071o464J932P140q08j1084j3741k098
$$ -17390 -17316 -11336 -11045 -7941 -819 16571 19099 18028 11564 13496 20636 19828 8744 -4997 -7095
3503g095l100P023m708J594J1920K972J931L219l765L191K382J531j2732j4862
$$ -7095 -10195 -3172 -7880 -6286 5634 8606 10537 13756 9991 13182 15564 17095 4363 -10499
3489a0499J610j1043L540K1518J2837m029o827j3441P570L499L800j1727o742
$$ -10499 -8889 -19932 -16392 5126 17963 13934 7107 -6334 1236 4735 8535 -3192 -9934
3476i934j543L110P334r612p347N95J3158L980J179n913J4096n218K115j59q692
$$ -9934 -11477 -8367 -1033 -10645 -17992 -17397 -4239 -259 920 -4993 9103 3885 6000 5841 -2851
3461b851r006k598j953M841P274L190N489l173j6563l009l98M374O635J703J6039
$$ -2851 -11857 -14455 -16408 -11567 -4293 -1103 4386 1213 -15350 -18359 -18757 -14383 -7748 -6045 9994
3446I994M770j5787j495k774k183l634m83p134m624L554N080J0574R529p69J245
$$ 9994 14764 -1023 -2518 -5292 -7475 -11109 -11592 -18726 -23350 -19796 -14716 -4142 5387 4618 5863
3431E863M04J756q920r362K532N860L532j6348p701O550M163l440p445K139k294
$$ 5863 6267 8023 -897 -10259 -7727 -1867 1665 -14683 -22384 -15834 -11671 -15111 -22556 -20417 -22711
3416b2711J6111N04p931m346J7617J4939N566r523p27k303O516m671n377J789
$$ -22711 -6600 -6096 -14027 -18373 -756 14183 19749 10226 9499 7196 13712 9041 3664 5453
3402E453L20Q896q297P25J340M027M850n967p283J986J7213K054p202j6957q067
$$ 5453 5773 14669 6372 7097 8437 12464 17314 11347 4064 6050 23263 25317 18115 1158 -6909
3387f909Q486O007R260q17j6596M02r314m075k031j349O494Q080P49m726p522
$$ -6909 1577 7584 16844 16027 -569 -167 -9481 -13556 -15587 -16936 -10442 -2362 -1613 -6339 -13861
3372a3861l129J0165O706j041R97l530j312m099j045P774M420j590q471o556k882
$$ -13861 -16990 -6825 -119 -1160 -163 -3693 -5005 -9104 -10149 -2375 2045 455 -8016 -14572 -17454
3357a7454L329R968J671q122n993P573K367L804j535l36R160O673k240J305l441
$$ -17454 -14125 -4157 -2486 -10608 -16601 -9028 -6661 -2857 -4392 -4728 4432 11105 8865 10170 6729
3342F729o00k830m640J885k702p862j864Q468N130K931o386N035M640p695m176
$$ 6729 6129 3299 -1341 544 -2158 -10020 -11884 -3416 1714 4645 -1741 3294 7934 239 -3937
3327c937n703n522L239r17J14m641j213R197J3054P771l217p44R654O113k824
$$ -3937 -9640 -15162 -11923 -12840 -12726 -17367 -18580 -9383 3671 11442 8225 7481 17135 23248 20424
3312B0424K94m912n1j128l206j7367k131Q070j871K730Q406J0081N197o095j6082
$$ 20424 20718 15806 15755 14627 11421 -5946 -8077 -7 -1878 852 9258 19339 24536 18441 2359
3297B359q880R39Q752j126K146N959O87J324J646l71j3086J050l37k894N54j447
$$ 2359 -6521 -5582 3170 2044 4190 10149 10836 12160 13806 13435 349 1399 1062 -1832 -1278 -2725
3281b725R01J270J1937N139k851l12j615l829K083p328o872M831k977q397O573
$$ -2725 -1824 -554 11383 16522 13671 13359 11744 7915 9998 2670 -4202 629 -2348 -10745 -4172
3266d172M605j2941m732p26K056j3481j367L782N849J1951N885M851j776N411
$$ -4172 433 -12508 -17240 -17966 -15910 -29391 -30758 -26976 -21127 -9176 -3291 1560 -216 5195
3252E195P96K012r04j9184j1057j135K614k148L214J479M999M419O767l414O356
$$ 5195 5991 8003 7099 -12085 -23142 -24277 -21663 -23811 -20597 -19118 -14119 -9700 -2933 -6347 9
3237Ir59o698o12M024N653k739n863k056l547J378N403K342k450K502m724L888
$$ 9 -950 -7648 -8260 -4236 1417 -1322 -7185 -9241 -12788 -11410 -6007 -3665 -6115 -3613 -8337 -4449
3221d449J633n00l77Q481P434j715O565l441q905m689N981J1081J606K060L144
$$ -4449 -2816 -3316 -3693 4788 12222 10507 17072 13631 4726 37 6018 17099 18705 20765 23909
3206B3909n137m90j418m650j0815P288M832J165k405l390O059q864j2944j158
$$ 23909 18772 18282 16864 12214 1399 8687 13519 14684 12279 8889 14948 6084 -6860 -8018
3192h018Q90m878j823M531P964K224J1238O509l366j0732J737j478R344L986j2408
$$ -8018 -7128 -12006 -13829 -9298 -1334 890 12128 18637 15271 4539 6276 4798 14142 18128 5720
3177E720q855j3367p56Q110j203k624N169J1711j0943j7680O16J5029N06J935
$$ 5720 -3135 -16502 -17258 -9148 -10351 -12975 -7806 3905 -7038 -24718 -24102 -9073 -8567 -6632
3163f632K882r46J851k044k979N655K462M266j145n085o676q897p16J1101N055
$$ -6632 -3750 -4696 -2845 -4889 -7868 -2213 249 4515 3370 -1715 -8391 -17288 -18004 -6903 -1848
3148a848J1048N566o067o06n414j3302K989J0363N27O339R209k945k595Q85M525
$$ -1848 9200 14766 8699 8093 2679 -10623 -7634 2729 3256 9595 18804 15859 13264 14149 18674
3133A8674L601j347k4380n881r83J484o454L877J2901j422j2446J104O984k094
$$ 18674 22275 20928 -3452 -9333 -10316 -8832 -15286 -11409 1492 70 -12376 -11272 -4288 -6382
3119f382m242L641P896O242k699k804l057m814O818L586J368j959m919m309J346
$$ -6382 -10624 -6983 913 7155 4456 1652 -1405 -6219 599 4185 5553 3594 -1325 -5634 -4288
3104d288P00m823L880L183K882k0533m208P831M324L407J305j995o565P986p88
$$ -4288 -3588 -8411 -4531 -1348 1534 -18999 -23207 -15376 -11052 -7645 -6340 -8335 -14900 -6914 -7702
3089g702P487J2967M705j1337r262j922j0200J362K2914K767j4944m534r580L106
$$ -7702 -215 12752 17457 6120 -3142 -5064 -15264 -13902 9012 11779 -3165 -7699 -17279 -14173
3075a4173K432K367L952n503m579j0820L579L885R947M566l768j4203J2994N907
$$ -14173 -11741 -9374 -5422 -10925 -15504 -26324 -22745 -18860 -8913 -4347 -8115 -22318 -9324 -3417
3061c417K227k858l095K324m5l640L511N203Q430n178j6083L264J1437K241n047
$$ -3417 -1190 -4048 -7143 -4819 -4864 -8504 -4993 210 8640 3462 -12621 -9357 2080 4321 -726
3046g26k375P157K584k618m8k581O05M348L734l390p612L199M06q276R96m674
$$ -726 -3101 4056 6640 4022 3974 1393 1998 6346 10080 6690 -922 2277 2683 -5593 -4597 -9271
3030i271K452M62N543J4834m499m646K780j601j8043r413L936J1556J1167r35
$$ -9271 -6819 -6357 -814 14020 9521 4875 7655 6054 -11989 -21402 -17466 -5910 5257 4322
3016D322k020m003q2J776J431m498l680n143p206J2901L243p379Q462r265r392
$$ 4322 2302 -1701 -1783 -7 1424 -3074 -6754 -11897 -19103 -6202 -2959 -10338 -1876 -11141 -20533
3001b0533L447J2334J7916r746K251L624r311p807r704m194O843q984m429P084
$$ -20533 -17086 -4752 13164 3418 5669 9293 -18 -7825 -17529 -21723 -14880 -23864 -28293 -21209
2987b1209J5684K00J964N353K748l594k500K702R763Q433J2336n389q377o676
$$ -21209 -5525 -5325 -3361 1992 4740 1146 -1354 1348 11111 19544 31880 26491 18114 11438
2973A1438J100m297q379J0756l368k460n910j0111K729P891R288K707o367r147
$$ 11438 12538 8241 -138 10618 7250 4790 -1120 -11231 -8502 -611 8677 11384 5017 -4130
2959d130J3396M24r290L124M069M211l014m711n662j820R896J8113o464j8636
$$ -4130 9266 9690 400 3524 7593 11804 8790 4079 -1583 -3403 6493 24606 18142 -494
2945d94l161K861p335k128m110J0460n648j2692Q368J622m593o799p139Q826J7948
$$ -494 -3655 -794 -8129 -10257 -14367 -3907 -9555 -22247 -13879 -12257 -16850 -23649 -30788 -21962 -4014
2930d014L351j674l859p649l580N958J6116N413m21j1476j3298L19L22L179K497
$$ -4014 -663 -2337 -6196 -13845 -17425 -11467 4649 10062 9641 -1835 -15133 -14814 -14492 -11313 -8816
2915h816n49N069j767N647J852O489P451m424M66m399L282q337k109Q692k614
$$ -8816 -9365 -4296 -6063 -416 1436 7925 15376 10952 11418 7019 10301 1964 -145 8547 5933
2900E933m895J1625m851K60J066k72j0022O067K353j563Q870k570n215j6889L53
$$ 5933 1038 12663 7812 8072 9138 8866 -1156 4911 7264 5701 14571 12001 6786 -10103 -9750
2885i750M714o723P569K009j1265L956J7111N995o940k379o476o644k893j916
$$ -9750 -5036 -11759 -4190 -2181 -13446 -9490 7621 13616 6676 4297 -2179 -8823 -11716 -13632
2871a3632K65l101P331N426J9987J0341j2470j2578k542p813l216l58k909N639
$$ -13632 -13367 -16468 -9137 -3711 16276 26617 14147 1569 -973 -8786 -12002 -12360 -15269 -9630
2857i630J024J6268N483j7087m661O871P18k137P52Q587J1523p290q560r512m543
$$ -9630 -8606 7662 13145 -3942 -8603 -1732 -1014 -3151 -2399 6188 17711 10421 1861 -7651 -12194
2842a2194j563J2437J0437r89m100J890M698J175k492L83r677j5113J1935K828
$$ -12194 -13757 -1320 9117 8128 4028 5918 10616 11791 9299 9682 5 -15108 -3173 -345
2828c45O11O526N171j0923j3582J3254J3094P899j233K604j3553j408o613r097
$$ -345 266 6792 11963 1040 -12542 712 13806 21705 20472 23076 9523 8115 1502 -7595
2814g595m361J42J1968n779j344L314K758j117j2272m11R462N124j2163j173Q107
$$ -7595 -11956 -11814 154 -5625 -6969 -3655 -897 -2014 -14286 -14697 -5235 -111 -12274 -13447 -5340
2799e340q155l769J7178J1289O155k878q375k795m145O69Q334j55J2235M493o988
$$ -5340 -13495 -17264 -86 11203 17358 14480 6105 3310 -835 -166 8168 8013 20248 24741 17753
2784A7753q912n909K021J558J418l088p142N00k691P460M372m445m140j2614n21
$$ 17753 8841 2932 4953 6511 7929 4841 -2301 -1801 -4492 2968 7340 2895 -1245 -13859 -14380
2769a4380N846L070l251O386L965p111m985r35L024J301j0930K461J0228k770
$$ -14380 -8534 -5464 -8715 -2329 1636 -5475 -10460 -11395 -8371 -7070 -18000 -15539 -5311 -8081
2755h081P540p78K433N903l347k745m895O553R09j4894K959J0371j152l911L51
$$ -8081 -541 -1319 1114 7017 3670 925 -3970 2583 3492 -11402 -8443 1928 776 -3135 -2784
2740b784N83j1984M968K285L043k715R036l455l455m771m764p135k063J0847o552
$$ -2784 -2201 -14185 -9217 -6932 -3889 -6604 2432 -1023 -4478 -9249 -14013 -21148 -23211 -12364 -18916
2725a8916O186J4508P191J801n168p182n21r509J1004J0455M314m218n072m362
$$ -18916 -12730 1778 8969 10770 5602 -1580 -2101 -11610 -606 9849 14163 9945 4873 511
2711E11k100o797O361r985P531J6467j9726r695J2412K334m616J141O75J51M493
$$ 511 -1589 -8386 -2025 -12010 -4479 11988 -7738 -17433 -5021 -2687 -7303 -6162 -5487 -5336 -843
2696h43M714m326p141n611k934J1343l703j384N586k0859m042K879J1721N241
$$ -843 3871 -455 -7596 -13207 -16141 -4798 -8501 -9885 -4299 -25158 -29200 -26321 -14600 -9359
2682i359M546L782L998O261P463M510m114k428K970k911q43j1551j3797J931M398
$$ -9359 -4813 -1031 2967 9228 16691 21201 17087 14659 17629 14718 13875 2324 -11473 -9542 -5144
2667e144N497L221J0337J3224K300n888j0476j689j083j3419q129J0992Q000r586
$$ -5144 353 3574 13911 27135 29435 23547 13071 11382 10299 -3120 -11249 -257 7743 -1843
2653a843j570J1011l153r816j1731O369J1232M453J0642J114n904l776P51O565
$$ -1843 -3413 7598 4445 -5371 -17102 -10733 499 4952 15594 16708 10804 7028 7779 14344
2639A4344r544k541m713p041p33k508m22J0521O331n324q861P192J3647J633j972
$$ 14344 4800 2259 -2454 -9495 -10228 -12736 -13158 -2637 3694 -1630 -10491 -3299 10348 11981 10009
2624A0009l488p52m580M211q205l68j679M130q717N609L022n295r168P896J2836
$$ 10009 6521 5769 1189 5400 -2805 -3173 -4852 -722 -9439 -3830 -808 -6103 -15271 -7375 5461
2609E461J0757m061o639L15R651N449n715l058r241k447Q753M185k870n91q72
$$ 5461 16218 12157 5518 5833 15484 20933 15218 12160 2919 472 9225 13410 10540 9949 9077
2594I077k753m834j5088O783K321n186j318O409K599m33O316k658m296j388J392
$$ 9077 6324 1490 -13598 -6815 -4494 -9680 -10998 -4589 -1990 -2423 3893 1235 -3061 -4449 -3057
2579c057l383r512P580K827J275j0120o49L011N575M64P342m681K919r55k082
$$ -3057 -6440 -15952 -8372 -5545 -4270 -14390 -15039 -12028 -6453 -5989 1353 -3328 -409 -1364 -3446
2564c446L432n35o393m666r549j4427O631J7462J8237N573o64n771p35O789j908
$$ -3446 -14 -549 -6942 -11608 -21157 -35584 -28953 -11491 6746 12319 11655 5884 5149 11938 10030
2549A0030n688M427N064j9091q330P312R576M229K580o222p715l587R47P80k019
$$ 10030 4342 8769 13833 -5258 -13588 -6276 3300 7529 10109 3887 -3828 -7415 -6468 -5688 -7707
2534g707o88l193N673m814M097N390j87L361o20l404p162j523J2797J0715q572
$$ -7707 -8395 -11588 -5915 -10729 -6632 -1242 -1429 1932 1312 -2092 -9254 -10777 2020 12735 4163
2519D163p232K282R403N805J1511O393j2686m389M058r704O740k052j5669n341
$$ 4163 -3069 -787 8616 14421 25932 32325 19639 15250 19308 9604 16344 14292 -1377 -6718
2505f718l558L853o570J675K195J109N707P961O477m474j5189k93Q566J1807J0377
$$ -6718 -10276 -6423 -12993 -11318 -9123 -8014 -2307 5654 12131 7657 -7532 -7825 741 12548 22925
2490B2925k588j9122o692K361L122J4538p190q238m316m040O007N33R20J914M851
$$ 22925 20337 1215 -5477 -3116 6 14544 7354 -884 -5200 -9240 -3233 -2700 -1780 134 4985
2475D985m79L185K648m033L242l152r660l246j0612J627o07m446P038j445J939
$$ 4985 4506 7691 10339 6306 9548 6396 -3264 -6510 -17122 -15495 -16102 -20548 -13510 -14955 -13016
2460a3016R232p593m161L324Q1j0096Q913K706j05M686k880P014O163m754N37
$$ -13016 -3784 -11377 -15538 -12214 -12133 -22229 -13316 -10610 -10715 -6029 -8909 -1895 4268 -486 51
2445E1R002O178J0385n30K026p732j3578j504n010n963j39O818j476M14J904r099
$$ 51 9053 15231 25616 25086 27112 19380 5802 4298 -712 -6675 -6814 4 -1472 -1058 846 -8253
2429h253p893J0343Q097q1N833q63L835K477j1980p364L710R08j1700k784Q440
$$ -8253 -16146 -5803 2294 2213 8046 7183 11018 13495 1515 -5849 -2139 -1231 -12931 -15715 -7275
2414g275Q038O562j119M239R708q406p397m287J0869O108j139k6592j765J5007
$$ -7275 763 7325 6206 10445 20153 11747 4350 63 10932 17040 15901 -10691 -12456 2551
2400B551k563j1100Q667M413Q93n174J217l189j002R821j66n492P137m311K056
$$ 2551 -12 -11112 -2445 1968 2861 -2313 -1096 -4285 -5287 4534 4368 -1124 6013 1702 3758
2385C758p700P443M579o967Q858M97j0460K647o911M627J2969l097R81j980p529
$$ 3758 -3942 3501 8080 1113 9971 10468 8 2655 -4256 371 13340 10243 11224 9244 1715
2370A715q042p724O112P218P089q182j0664J2765J7205L937q133j0812n67J763
$$ 1715 -6327 -14051 -7939 -721 6368 -1814 -12478 287 17492 21429 13296 2484 1917 3680
2356C680p844q882p500P493m244N371K599p278Q373J0799r490j2077m426P5M893
$$ 3680 -4164 -13046 -20546 -13053 -17297 -11926 -9327 -16605 -8232 2567 -6923 -19000 -23426 -23351 -18458
2341a8458J1942M467k45L706M639k383j4986l645J247n583j779O019P45L779J2744
$$ -18458 -6516 -2049 -2294 1412 6051 3668 -11318 -14963 -13716 -19299 -21078 -15059 -14314 -10535 2209
2326B209L68N313n32m581k923j0823J0156J7817O597j1567j7618J359M799Q581
$$ 2209 2577 7890 7358 2777 -146 -10969 -813 17004 23601 12034 -5584 -4225 574 9155
2312I155R36n726R966K871m874j4674j2131r010j922J6890J1199p758p423J8362
$$ 9155 10091 4365 14331 17202 12328 -2346 -14477 -23487 -25409 -8519 2680 -5078 -12501 5861
2298E861L697m789N461p652q782P194O687q194J384J349J2622n921l985n118r9
$$ 5861 9558 4769 10230 2578 -6204 990 7677 -517 867 2216 14838 8917 4932 -186 -285
2283b85P253P182m056n24j0955j8Q984N606j328M348j2981m248J2020q080l150
$$ -285 6968 14150 10094 9570 -1385 -1403 7581 13187 11859 16207 3226 -1022 10998 2918 -232
2268b32J897J192r126l958M971o140q119Q533j3454N35J4606N956K849O403j015
$$ -232 1665 2857 -6269 -10227 -5256 -11396 -19515 -10982 -24436 -23901 -9295 -3339 -490 5913 4898
2253D898O035o870k963R855k781l492P262N556J596n074o976q77r399J0354L881
$$ 4898 10933 4063 1100 10955 8174 4682 11944 17500 19096 14022 7046 6169 -3230 7124 11005
2238A1005j3044j1091j854Q452O626O923j0684R23Q597j4109n981J203R741J629
$$ 11005 -2039 -13130 -14984 -6532 94 7017 -3667 -2744 5853 -8256 -14237 -13034 -3293 -1664
2224a664P599m72J358J2119O715R46n950m133r298j5475M042O756j116OR80O768
$$ -1664 5935 5463 6821 18940 25655 26601 20651 16518 7220 -8255 -4213 2543 1427 1433 2413 9181
2208I181o842J517o826j1606j605Q574l337k902J2518M289m708m126R560K426
$$ 9181 2339 3856 -2970 -14576 -16181 -7607 -10944 -13846 -1328 2961 -1747 -5873 3687 6113
2194F113p394M304P839j2215p253K0748R390r082m310Q85j0017k185O212L013
$$ 6113 -1281 3023 10862 -1353 -8606 12142 21532 12450 8140 9025 -992 -3177 3035 6048
$$ [...]
##END NTUPLES=NMR SPECTRUM
##END=
