##TITLE=Analysis number 314843
Compound Code cc 43909
Book Reference 407/99
Project Code adrs
Chemist Name andyw
##JCAMPDX= 6.0         $$ Bruker NMR JCAMP-DX V2.0
##DATA TYPE= NMR SPECTRUM
##DATA CLASS= NTUPLES
##ORIGIN= Bruker BioSpin GmbH
##OWNER= NMR
$$ XWIN-NMR		Version 3.5
$$ Thu Oct 27 12:49:25 2005 GMT Daylight Time (UT+1h)  MAYBRIDGE\NMR@NMR_250MHZ
##.OBSERVE FREQUENCY= 250.131544655141
##.OBSERVE NUCLEUS= ^1H
##.ACQUISITION MODE= SIMULTANEOUS (DQD)
##.ACQUISITION SCHEME= undefined
##.AVERAGES= 16
##.DIGITISER RES= 18
##SPECTROMETER/DATA SYSTEM= dpx250
##.PULSE SEQUENCE= zg30
##.SOLVENT NAME= CDCl3
##.SHIFT REFERENCE= (INTERNAL, CDCl3, 0, 16.46)
##AUDIT TRAIL= $$ (NUMBER, WHEN, WHO, WHERE, WHAT)
$$ ##TITLE= Audit trail, XWIN-NMR		Version 3.5
$$ ##JCAMPDX= 5.01
$$ ##ORIGIN= Bruker BioSpin GmbH
$$ ##OWNER= NMR
$$ C:\u/data/dgb/nmr/ADRS/11460/pdata/1/auditp.txt
$$ ##AUDIT TRAIL=  $$ (NUMBER, WHEN, WHO, WHERE, WHAT)
(   1,<2005-10-27 12:48:53.32 +100>,<MAYBRIDGE\NMR>,<NMR_250MHZ>,
      <created by zg, POWCHK disabled, PULCHK disabled
       configuration hash MD5:
       62 19 C7 07 E1 42 D1 B7 37 6C 3D D0 77 39 F9 E6
       data hash MD5: 64K
       6C F0 E3 18 8A 21 49 22 E7 A7 68 77 FD B2 12 33>)
(   2,<2005-10-27 12:49:08.00 +100>,<MAYBRIDGE\NMR>,<NMR_250MHZ>,
      <Start of raw data processing
       ef LB = 0.3 FT_mod = 6 PKNL = 1 SI = 32K 
       data hash MD5: 32K
       EB 3A E9 B6 6E BE 69 D8 A1 1B 81 AA B3 C5 F9 43>)
(   3,<2005-10-27 12:49:13.02 +100>,<MAYBRIDGE\NMR>,<NMR_250MHZ>,
      <apk 
       data hash MD5: 32K
       E8 3F D3 00 28 70 B3 11 11 76 DA F5 9A FE A4 4E>)
(   4,<2005-10-27 12:49:14.72 +100>,<MAYBRIDGE\NMR>,<NMR_250MHZ>,
      <abs ABSG = 5 
       data hash MD5: 32K
       B3 97 4C 9E 32 92 6E 0C 24 E1 7F 00 8D 50 01 91>)
$$ ##END=
$$ 
$$ hash MD5
$$ FF D1 89 CA 29 27 F7 5B D8 64 2F 83 BD BA 2C 9E
##$RELAX= 
##$RELAX= 
##$RELAX= 
##$RELAX= 
##$RELAX= 
##$RELAX= 
##$RELAX= 
$$ Bruker specific parameters
$$ --------------------------
##$DU= <C:\u>
##$EXPNO= 11460
##$NAME= <ADRS>
##$PROCNO= 1
##$TYPE= <nmr>
##$USER= <dgb>
##$AMP= (0..31)
100 100 100 100 100 100 100 100 100 100 100 100 100 100 100 100 100 100 
100 100 100 100 100 100 100 100 100 100 100 100 100 100 
##$AQSEQ= 0
##$AQ_mod= 3
##$AUNM= <au_zg>
##$AUTOPOS= <46 >
##$BF1= 250.13
##$BF2= 250.13
##$BF3= 250.13
##$BF4= 250.13
##$BF5= 500.13
##$BF6= 500.13
##$BF7= 500.13
##$BF8= 500.13
##$BYTORDA= 1
##$CFDGTYP= 0
##$CFRGTYP= 5
##$CHEMSTR= <none>
##$CNST= (0..31)
1 1 145 1 1 1 1 1 1 1 1 1 1 1 1 1 1 1 1 1 1 1 1 1 1 1 1 1 1 1 1 1 
##$CPDPRG= <>
##$CPDPRG1= <>
##$CPDPRG2= <>
##$CPDPRG3= <>
##$CPDPRG4= <mlev>
##$CPDPRG5= <mlev>
##$CPDPRG6= <mlev>
##$CPDPRG7= <mlev>
##$CPDPRG8= <mlev>
##$CPDPRGB= <>
##$CPDPRGT= <>
##$D= (0..31)
0 1 0 0 0 0 0 0 0 0.06 0 0 0 0 0 0 0.0002 0 0 0 0 0 0 0 0 0 0 0 0 0 0 
0 
##$DATE= 1130413732
##$DBL= (0..7)
120 120 120 120 120 120 120 120 
##$DBP= (0..7)
150 150 150 150 150 150 150 150 
##$DBP07= 0
##$DBPNAM0= <>
##$DBPNAM1= <>
$$ [...]
##$SUBNAM7= <"">
##$SUBNAM8= <"">
##$SUBNAM9= <"">
##$SW= 20.6930455092707
##$SWIBOX= (0..15)
0 0 3 0 0 0 0 0 0 0 0 0 0 0 0 0 
##$SW_h= 5175.983436853
##$TD= 65536
##$TD0= 1
##$TE= 296.16
##$TE2= 300
##$TE3= 300
##$TEG= 300
##$TL= (0..7)
0 120 120 120 120 120 120 120 
##$TP= (0..7)
150 150 150 150 150 150 150 150 
##$TP07= 0
##$TPNAME0= <>
##$TPNAME1= <>
##$TPNAME2= <>
##$TPNAME3= <>
##$TPNAME4= <>
##$TPNAME5= <>
##$TPNAME6= <>
##$TPNAME7= <>
##$TPOAL= (0..7)
0.5 0.5 0.5 0.5 0.5 0.5 0.5 0.5 
##$TPOFFS= (0..7)
0 0 0 0 0 0 0 0 
##$TUNHIN= 0
##$TUNHOUT= 0
##$TUNXOUT= 0
##$USERA1= <user>
##$USERA2= <user>
##$USERA3= <user>
##$USERA4= <user>
##$USERA5= <user>
##$V9= 5
##$VALIST= <valist>
##$VCLIST= <CCCCCCCCCCCCCCC>
##$VD= 0
##$VDLIST= <DDDDDDDDDDDDDDD>
##$VPLIST= <PPPPPPPPPPPPPPP>
##$VTLIST= <TTTTTTTTTTTTTTT>
##$WBST= 1024
##$WBSW= 4
##$XGAIN= (0..3)
0 0 0 0 
##$XL= 0
##$YL= 0
##$YMAX_a= 584791
##$YMIN_a= -515716
##$ZGOPTNS= <>
##$ZL1= 120
##$ZL2= 120
##$ZL3= 120
##$ZL4= 120
##$ABSF1= 16.46004
##$ABSF2= -4.233133
##$ABSG= 5
##$ABSL= 3
##$ALPHA= 0
##$AQORDER= 0
##$ASSFAC= 0
##$ASSFACI= 0
##$ASSFACX= 0
##$ASSWID= 0
##$AUNMP= <proc_1d>
##$AZFE= 0.1
##$AZFW= 0.1
##$BCFW= 0
##$BC_mod= 0
##$BYTORDP= 0
##$COROFFS= 0
##$CY= 12.5
##$DATMOD= 1
##$DC= 0
##$DFILT= <>
##$DTYPP= 0
##$F1P= 14.0000005364418
##$F2P= -0.99999901652339
##$FCOR= 0.5
##$FTSIZE= 32768
##$FT_mod= 6
##$GAMMA= 0
##$GB= 0
##$INTBC= 1
##$INTSCL= 1
##$ISEN= 128
##$LB= 0.3
##$LEV0= 0
##$LPBIN= 0
##$MAXI= 10000
##$MC2= 0
##$MEAN= 0
##$ME_mod= 0
##$MI= 0
##$NCOEF= 0
##$NC_proc= -2
##$NLEV= 6
##$NOISF1= 0
##$NOISF2= 0
##$NSP= 0
##$NTH_PI= 0
##$NZP= 0
##$OFFSET= 16.46004
##$PC= 1
##$PHC0= 73.04167
##$PHC1= 4.859824
##$PH_mod= 1
##$PKNL= yes
##$PPARMOD= 0
##$PSCAL= 4
##$PSIGN= 0
##$REVERSE= no
##$SF= 250.130015495706
##$SI= 32768
##$SIGF1= 0
##$SIGF2= 0
##$SINO= 400
##$SIOLD= 32768
##$SREGLST= <1H.CDCl3>
##$SSB= 0
##$STSI= 32768
##$STSR= 0
##$SW_p= 5175.98343685301
##$SYMM= 0
##$S_DEV= 0
##$TDeff= 65536
##$TDoff= 0
##$TI= <Analysis number 999999
Compound Code 99
Book Reference 9
Project Code 9>
##$TILT= no
##$TM1= 0
##$TM2= 0
##$TOPLEV= 0
##$USERP1= <user>
##$USERP2= <user>
##$USERP3= <user>
##$USERP4= <user>
##$USERP5= <user>
##$WDW= 1
##$XDIM= 32768
##$YMAX_p= 387108289
##$YMIN_p= -140299
$$ End of Bruker specific parameters
$$ ---------------------------------
##NTUPLES= NMR SPECTRUM
##VAR_NAME=  FREQUENCY,     SPECTRUM/REAL,   SPECTRUM/IMAG
##SYMBOL=    X,             R,               I
##VAR_TYPE=  INDEPENDENT,   DEPENDENT,       DEPENDENT
##VAR_FORM=  AFFN,          ASDF,            ASDF
##VAR_DIM=   32768,         32768,           32768
##UNITS=     HZ,            ARBITRARY UNITS, ARBITRARY UNITS
##FACTOR=    0.157963299565203, 1,           1
##FIRST=     4117.14984484646, 0,            0
##LAST=      -1058.83359200655, 0,           0
##MIN=       -1058.83359200655, -140299,     0
##MAX=       4117.14984484646, 387108289,    0
$$ Real data points
##PAGE= N=1
##DATA TABLE= (X++(R..R)), XYDATA
$$ [...]
15304a3215O697k632J221O112j154j1258m628K32n899l392M606j631n04l91J0602
15289a5234J138K16N734N093Q472Q695l469j3636p213k476j169L923J0116Q515
15275H705l918j0187M53J40o494k270J844K614J746k905K171R567M537k294j62
15260C547R577N704j0316q09l818q267r130r615J081L007Q240p583j041l447m4
15245b2914N918O504Q543p60n427N924J1324l053m203o235l096q903o44L801K125
15230a1096P364Q192k348p006q46n581n325J1274L200j0449k560J4732k726n198
15216h373R129j036n903J532k885p837j1333L488P307J094l517m452M147J1026
15202g613J789K371M392N283n486j3640r388M452n2m312j382J913j1604r525J0952
$$ plain form
15304 -13215 -6518 -9150 -7929 -1817 -2971 -14229 -18857 -18625 -24524 -27916 -23310 -24941 -25445 -25836 -15234
15289 -15234 -14096 -13880 -8146 -3053 5419 14114 10645 -2991 -10204 -12680 -13849 -9926 190 8705
15275 8705 4787 -5400 -4947 -4807 -11301 -13571 -11727 -9113 -7367 -10272 -8101 1466 6003 3709 3547
15260 3547 13124 18828 8512 7703 3885 -4382 -13512 -23127 -22046 -19039 -10799 -18382 -19423 -22870 -22914
15245 -22914 -16996 -10492 -1949 -2709 -8136 -2212 9112 6059 1856 -4379 -7475 -16378 -17022 -13221 -11096
15230 -11096 -3732 4460 2112 -4894 -5740 -11321 -16646 -5372 -2172 -12621 -15181 -449 -3175 -8373
15216 -8373 756 -280 -6183 -4651 -7536 -15373 -26706 -23218 -15911 -14817 -18334 -22786 -18639 -7613
15202 -7613 -5824 -3453 939 6222 736 -12904 -22292 -17840 -17892 -22204 -23586 -21673 -33277 -42802 -31850
15187c1850J5049J4879L716j7216j1038N452Q393j24l541m362K129J970N409M819
15173f315J692r09J525j03P80J257J694o502K421O737J973n386m214p103O235
15158f218Q62o03J741M387k631j2166m7p57l516N716N541j307k589N37J2734n055
15142c371q722L289J0636j218m813j0287q863N01L069L712o693l917J2467J2395
15128a815m76N920J708l356l247M301J724l470J178n598l225J336j069n717N58
15113a1248J328n536L166J1220P697l669o973k22l569m563K700o041n716R209
15099a2217M119M317O350n071p817n44J2527N549j049j618n252J569L66j1221
15085i992k672O236j241m354m872k907j2088n87R428J1477R062J061k047k132
$$ plain form
15187 -31850 -16801 -1922 1794 -15422 -26460 -21008 -12615 -12739 -16280 -20642 -18513 -16543 -11134 -6315
15173 -6315 -4623 -5532 -4007 -4110 -3330 -2073 -379 -6881 -4460 2277 4250 -1136 -5350 -12453 -6218
15158 -6218 -5356 -5959 -4218 169 -2462 -14628 -14675 -15432 -18948 -13232 -7691 -8998 -11587 -11050 1684 -3371
15142 -3371 -12093 -8804 1832 614 -4199 -14486 -23349 -22848 -19779 -16067 -22760 -26677 -14210 -1815
15128 -1815 -2291 3629 5337 1981 -1266 3035 4759 1289 2467 -3131 -6356 -5020 -6089 -11806 -11248
15113 -11248 -9920 -15456 -12290 -1070 6627 2958 -4015 -4237 -7806 -12369 -9669 -15710 -21426 -12217
15099 -12217 -8098 -3781 2569 -2502 -10319 -10863 1664 7213 6164 4546 -706 863 1229 -9992
15085 -9992 -12664 -6428 -7669 -12023 -16895 -19802 -31890 -32477 -23049 -11572 -2510 -1449 -3496 -5628
15071e628M485n032n204j0735O005R094Q564K169k205q53o133m234Q348M839l041
15056D39n674J784l348m212k688j504o355J509M763n07J0203M82o843N239m57
15041g169n458L34j158J975P525k227m423J031o470n918O180O451J0716K121R08
15026D418j2821n279N9J581q0R52N105N498L587K067J1425P636l070J796j600
15011B1274j3271r660j6262j41J4577Q373R141L20r521q598n90O340J3500j030
14997A4452n438n546O397N008K925n265j6040j2416K367M342N170k21K440P458
14983E633q097P92j0412k469K100L099K131O19J549m97O263K797o422j4322m828
14968b2064P581K304k922j1948K17O152j103O116J8899K648l815l419k467P378
$$ plain form
15071 -5628 -1143 -6175 -11379 -22114 -16109 -7015 1549 3718 1513 660 -5473 -9707 -1359 3480 439
15056 439 -5235 -3451 -6799 -11011 -13699 -15203 -21558 -20049 -15286 -15793 -5590 -5108 -11951 -6712 -7169
15041 -7169 -12627 -12293 -13451 -11476 -3951 -6178 -10601 -9570 -16040 -21958 -15778 -9327 1389 3510 4418
15026 4418 -8403 -13682 -13623 -12042 -12122 -11170 -6065 -567 3020 5087 16512 24148 21078 22874 21274
15011 21274 8003 -1657 -17919 -18060 -3483 4890 14031 14351 4830 -3768 -4358 1982 15482 14452
14997 14452 9014 3468 9865 14873 17798 12533 -3507 -15923 -13556 -9214 -4044 -4265 -1825 5633
14983 5633 -2464 -1672 -12084 -14553 -12453 -9354 -7223 -6604 -5055 -5552 711 3508 -2914 -17236 -22064
14968 -22064 -14483 -12179 -15101 -27049 -26832 -20680 -21783 -15667 3232 5880 2065 -1354 -3821 3557
14954C557L759p826q962m397L477N396J790J561J354J773l879m001n09j058j680
14939i645p141j587P309L281L934J243k934k921o155l116K729q208P253J0898
14925e060m466J271J3515P015k170j1535n004r473k704Q689L161N087P919o939
14911f94j4257O094o22o777K912l030J415P006m526J374O419p80l309N28N715
14896b532r13l747n226m553Q45j548n745O075J005Q082N823n808k76r250j499
14881a9267P398P330n854n402M162K37J2340j051j0096l22J649K06l291L272J138
14866g551M113O842R146j0758p976L63L383M572M370M412O424r019r87L447r595
14851A186j2225O33P689O89P991J1125l882k59j394r512p793p631R71K133M900
$$ plain form
14954 3557 7316 -510 -9472 -13869 -10392 -4996 -3206 -1645 -291 1482 -2397 -6398 -6907 -7965 -9645
14939 -9645 -16786 -18373 -11064 -7783 -3849 -2606 -5540 -8461 -14616 -17732 -15003 -23211 -15958 -5060
14925 -5060 -9526 -8255 5260 12275 10105 -1430 -6434 -15907 -18611 -9922 -6761 -1674 6245 -694
14911 -694 -14951 -8857 -9479 -16256 -13344 -16374 -14959 -7953 -12479 -11105 -4686 -5466 -8775 -8247 -2532
14896 -2532 -3445 -7192 -12418 -16971 -16126 -17674 -23419 -17344 -16339 -8257 -2434 -8242 -8518 -17768 -19267
14881 -19267 -11869 -4539 -10393 -15795 -11633 -11396 944 -107 -10203 -10525 -8876 -8670 -11961 -8689 -7551
14866 -7551 -3438 3404 12550 1792 -6184 -5821 -2438 2134 6504 10916 17340 8321 7334 10781 1186
14851 1186 -11039 -10406 -2717 -2028 5963 17088 13206 12947 11553 2041 -5752 -13383 -12412 -10279 -5379
14836e379R516O663Q502j330L816M569m160p350j1395n082L097J2770K571p265
14822I543j325J3173P088n489O247k319o107l242l841m039m673o870L198n572
14808d228l836O732m550l562l0R36O385l211l083N056j1066jl733k380j423O491
14792a5503K581L573P223q44K669N760J889P95l913J819l803j2262K057n61K492
14777f028j99l381m638n588M177J733o376J6167K013q903m191L411N153q777N925
14762i502J0126j2389m417K632R047O490o307m18n176j981j130k443J023k868
14748a7313J0971N882J170n512l739m653m908K626M48q85O122l812l515J4427
14734b691M122o834N205M073k798l598m16K169k710J042j966p515o80P912N691
$$ plain form
14836 -5379 4137 10800 19302 17972 21788 26357 22197 14847 3452 -1630 1467 14237 16808 9543
14822 9543 8218 21391 28479 22990 29237 26918 20811 17569 13728 9689 5016 -1854 1344 -4228
14808 -4228 -8064 -1332 -5882 -9444 -9474 -8538 -2153 -5364 -8447 -3391 -14457 -14458 -18191 -20571 -21994 -15503
14792 -15503 -12922 -9349 -2126 -2970 -301 5459 7348 8143 4230 6049 2246 -10016 -7959 -8520 -6028
14777 -6028 -6227 -9608 -14246 -19834 -15657 -13924 -20300 -4133 -2120 -11023 -15214 -11803 -6650 -15427 -9502
14762 -9502 624 -11765 -16182 -13550 -4503 1987 -4320 -4738 -9914 -11895 -13025 -15468 -14445 -17313
14748 -17313 -6342 -460 710 -4802 -8541 -13194 -18102 -15476 -15028 -15913 -9791 -13603 -17118 -2691
14734 -2691 1431 -5403 -198 3875 1077 -2521 -2937 -768 -3478 -2436 -4402 -11917 -12597 -4685 1006
14719A006r247m781P501L104q658q335n440M88Q475N19O840k642p987j400M002
14704a6555Q676J1948M033j1008o822k644J994k314J546n68K504J1942q76j2393
14690a0537o825K098P869K054L92n9l073p205J734L3J1399P27n580j6833K400
14675b1406K098K069R771R997p30n91J574j2076L525O876r117l20R228m83M644
14660E059o332l366o485L775k8j638K899M334o209J372P597L231l603p519q530
14645a5443j473L377O078j03p687m90O84K123K146j553p57J711N708M725J013
14630E9k101p059k332l068n82P971K009n311M749K325r11j3842J628J1839L838
14615g88m317M740n070p000n442j770J955P874O38m678o123K345K012k564P306
$$ plain form
14719 1006 -8241 -13022 -5521 -2417 -11075 -19410 -24850 -24362 -15887 -15368 -8528 -11170 -19157 -20557 -16555
14704 -16555 -7879 4069 8102 -2906 -9728 -12372 -10378 -12692 -11146 -11714 -9210 2732 1856 -10537
14690 -10537 -17362 -15264 -7395 -5341 -4949 -5008 -8081 -15286 -13552 -13519 -2120 -1393 -6973 -23806 -21406
14675 -21406 -19308 -17239 -7468 2529 1799 1208 2782 -9294 -5769 1107 -8010 -8330 898 415 5059
14660 5059 -1273 -4639 -11124 -7349 -7377 -9015 -6116 -1782 -7991 -6619 978 4209 606 -6913 -15443
14645 -15443 -16916 -13539 -7461 -7564 -15251 -15741 -15057 -12934 -10788 -12341 -13098 -11387 -5679 -954 59
14630 59 -2042 -9101 -11433 -14501 -15083 -7112 -5103 -10414 -5665 -3340 -4251 -18093 -16465 -4626 -788
14615 -788 -5105 -365 -5435 -12435 -17877 -19647 -17692 -9818 -9180 -13858 -19981 -17636 -15624 -18188 -10882
14600a0882O005P08P69J881q397Q60N431j456n678N97L830J0603J278K382J2092
14585B0023n418j4345n824J705p099K675K077J664O615k399p055j0092k060P270
14571a2263J0009K446J709l205j0373j653J2344N879l069P407O650o093o785R485
14557A2488o53p727J0458O316l347j38N242N897J122O396J6290K4429K6568K2908
14543A26249J8748N87j0631k3543l3181l4338j0161j4502L41o433j5444m133Q510
14530B069N623L080p180j539L844J415m833q370K423J040j0508j111J799Q007
14516d241j3181Q52L940O380J0106L213l211p007k206J201L254K39R33j813j582
14501c123O349O808N417l999O51n199j3694p751M852m674l411J303N607l94K833
$$ plain form
14600 -10882 -4877 -4169 -3400 -1519 -9916 -9056 -3625 -5081 -10759 -10162 -6332 4271 5549 7931 20023
14585 20023 14605 260 -5564 -3859 -10958 -8283 -6206 -4542 2073 -326 -7381 -17473 -19533 -12263
14571 -12263 -2254 192 1901 -1304 -11677 -13330 -986 4893 1824 9231 15881 9788 3003 12488
14557 12488 11835 4108 14566 20882 17535 17397 22639 28536 29658 36054 52344 76773 103341 126249
14543 126249 144997 145584 134953 111410 78229 43891 33730 19228 19569 13136 -2308 -6441 2069
14530 2069 7692 10772 3592 2053 5897 7312 2479 -5891 -3468 -2428 -12936 -14047 -12248 -4241
14516 -4241 -17422 -16570 -12630 -6250 3856 7069 3858 -3149 -5355 -4154 -900 -661 272 -1541 -3123
14501 -3123 3226 10034 15451 11452 12103 6904 -6790 -14541 -9689 -14363 -17774 -16471 -10864 -11258 -8425
14486h425L063J075O550N637q366N08l500J985N041R179r76l811n062j6792O249
14471g645J5164l326m457L506p712j4420o022R026N657J887k493j671j055Q59
14457a2702k066n304P869K005k830p23L883J3158L20k79r078P8m138O869O284
14442C346O533J0218m893k1208j693J887O75N045J712j0619j4853L263P390J4501
14428A304J741p316o25L67R035J745J975J215P345l73n471J45m36L285j0778p961
14412d803k607N798j296M05k752j034N856P43o05l527J724P000j832j1643k724
14397a1297k226K280M96Q10m136M366n05l483P006J0431K685M071k856o736l321
14382b415K27p850k742M204k694M266J1507K918l954l451O738N91J778o448l029
$$ plain form
14486 -8425 -5362 -4287 2263 7900 -466 42 -3458 -1473 3568 12747 11771 7960 2898 -13894 -7645
14471 -7645 7519 4193 -264 3242 -4470 -18890 -24912 -15886 -10229 -8342 -10835 -12506 -13561 -12702
14457 -12702 -14768 -20072 -12203 -10198 -13028 -13751 -9868 3290 3610 3331 -5747 -5669 -9807 -2938 3346
14442 3346 9879 20097 15204 -6004 -7697 -5810 -5135 -90 1622 -8997 -23850 -20587 -13197 1304
14428 1304 3045 -4271 -4896 -4529 4506 6251 8226 9441 16786 16413 10942 11087 10651 13936 3158 -4803
14412 -4803 -7410 -1612 -2908 -2503 -5255 -6289 -433 310 -295 -3822 -2098 4902 3070 -8573 -11297
14397 -11297 -13523 -11243 -10747 -9937 -14073 -9707 -10212 -13695 -6689 3742 6427 10498 7642 906 -2415
14382 -2415 -2188 -10038 -12780 -8576 -11270 -7004 4503 7421 3467 16 6754 7345 9123 2675 -354
14367c54M284q510K741m965j389K143L958K364L862K858j5347q270N316L00P385
14352c624P003R90m209j2511p538J323M146o588O924R2j0541J4816N824p259L160
14337g992L995n296q389J3010O376K110J339l175j912J549n30j448m697O375M412
14322E727l87k600J682n509k066P002K194l596O591O333L162m632O575J6981R111
14307D6568j2452n423k840m028n624J20n41R167k14q844l075P477k053N155j558
14292B1835p794K82J0338P682M230j304q024M640J2462q47L801Q907N555J86J220
14277F3169L945N200J4375R178K286J282J1921K984J080P405Q541N889J5571R312
14263A62138j714J965N752J0400K310M514m063l266j5549M67N587m812k727K161
$$ plain form
14367 -354 3930 -4580 -1839 -6804 -8193 -6050 -2092 272 4134 6992 -8355 -16625 -11309 -11009 -3624
14352 -3624 3379 4369 160 -12351 -19889 -18566 -14420 -21008 -14084 -13992 -24533 -9717 -3893 -11152 -7992
14337 -7992 -3997 -9293 -17682 -4672 1704 3814 5153 1978 66 1615 1085 -363 -5060 1315 5727
14322 5727 5340 2740 4422 -1087 -3153 3849 6043 2447 9038 15371 18533 13901 20476 37457 46568
14307 46568 34116 28693 25853 21825 16201 16321 15780 24947 24733 15889 12814 20291 18238 23393 21835
14292 21835 14041 14323 24661 32343 36573 35269 27245 31885 44347 43500 47301 56208 61763 61949 63169
14277 63169 67114 72314 86689 95867 98153 99435 111356 114340 115420 122825 131366 137255 152826 162138
14263 162138 160424 162389 168141 178541 180851 185365 181302 178036 162487 162954 168541 163729 161002 163163
14249A63163n338o876j3001j4558j0338K248j0287m930K662M299R65K626q341
14236A02294J267L352m905r772p593j0995m131K42J528r024m457M296j267m000
14222E6835P469n003j0603j6225j719q59l037o047K222k6J390j627P006l947n007
14207B0822j7M836l651p983m796j3440K01Q594J0007J1793L609o728j3886l68
14193H993o796J786q48q155n99J363L582K750N700P582N627o851j1066m344l053
14178d329J48k111P442m018m327J2082J2725R445r686q156r632O01J5639p873
14164G950k322K698O728n678L58n128L492J3333p764R97J6118n523j0165j0549
14150D545q38L05N237j346k486J1380m883l324j0271n643M475J58M225Q006K819
$$ plain form
14249 163163 157825 150949 137948 123390 113052 115300 105013 100083 102745 107044 108009 110635 102294
14236 102294 103561 106913 102008 92236 84643 73648 69517 69759 71287 62263 57806 62102 60835 56835
14222 56835 64304 59301 48698 32473 30754 29895 26858 20811 23033 23007 24397 22770 29776 25829 20822
14207 20822 20805 25641 21990 14007 9211 -4229 -4028 4566 14573 26366 29975 23247 9361 8993
14193 8993 2197 3983 3135 -5020 -5619 -4256 -674 2076 7776 15358 20985 14134 3068 -1276 -4329
14178 -4329 -4181 -6292 1150 -2868 -7195 4887 17612 27057 17371 9215 -417 184 15823 7950
14164 7950 5628 8326 15054 9376 9734 4606 8098 21431 13667 14664 30782 25259 15094 4545
14150 4545 3707 4012 9249 7903 5417 16797 11914 8590 -1681 -7324 -2849 -2691 1534 9540 12359
14135A2359m1J874M685r814o789l162J0020K290p093k418L584L030J0175l900
14121A4800n379J0206o462L215J517j206O972q73r414p07k650p179j117N48R211
14106A1482m53j713q546M01M036N686k18m650J229K099p183p010o811p474l488
14091b2613J200Q72J138L558J1369P130M604Q130P804p165q449O593L869K304
14077B0344k725j198r455r599N695J6501M21n071n416Q699M05R261j546o060k564
14062A7692M655L154K237J91Q507o637m111p576o376o176l129J1499L829m046
14048A3713l82K921l477j338l636l758K854j632O660N033M07J00j165k606o070
14033G624q306k868L049L908M162O341J133p690l880K750M417o013J669q74M350
$$ plain form
14135 12359 12318 14192 18877 9063 2274 -888 9132 11422 4329 1911 5495 8525 18700 14800
14121 14800 9421 19627 13165 16380 17897 16691 23663 22790 13376 12669 10019 2840 1723 2271 11482
14106 11482 11029 9316 770 1171 5207 10893 10675 6025 7254 9353 2170 -4840 -11651 -19125 -22613
14091 -22613 -21413 -20541 -19403 -15845 -4476 2654 7258 15388 23192 16027 7578 14171 18040 20344
14077 20344 17619 16421 6966 -2633 3062 19563 19984 14913 9497 18196 18601 27862 26316 20256 17692
14062 17692 22347 25501 27738 27929 36436 29799 25688 18112 11736 5560 2431 13930 17759 13713
14048 13713 13331 16252 12775 11437 7801 4043 6897 5265 11925 16958 17365 17465 16300 13694 7624
14033 7624 -682 -3550 -501 3407 7569 13910 15043 7353 3473 6223 10640 4627 6296 5422 9772
14018I772l872q813k448O709k450n482q756j0166K730P462J0586J371K262M164
14004C069O526o699k477Q16n417O31J086M37J474J0100M339q920o43j312K961
13989E971J042J155l095J193K459P317o187o699l578L274O674J285K721k630k964
13974G938J001m317j582r069k30R30k7M705R433M142J798o00l986P296J3704m705
13958B6431M151K078J207k852r455m526j063Q17o795O762L707K993r28l789J889
13943B0627q09j064J803R607J1045K636o642l555l93R309J1084N223Q37Q221N641
13928G3570k195j435m738P049Q838O70j363P102n08m622n10J482J9289M879M982
13913A12490O468R065k373O11N777R126l17M767Q495k067n148M158R146Q021j309
$$ plain form
14018 9772 5900 -2913 -5361 1348 -1102 -6584 -15340 -25506 -22776 -15314 -4728 -3357 -1095 3069
14004 3069 9595 2896 419 1235 -4182 -3551 -2465 -2028 -554 9546 13885 4965 4322 3010 5971
13989 5971 7013 8168 5073 6266 8725 16042 9855 3156 -422 2852 9526 10811 13532 10902 7938
13974 7938 8939 4622 3040 -6029 -6259 -5329 -5356 -651 8782 12924 14722 14122 10136 17432 31136 26431
13958 26431 30582 32660 33867 31015 21560 17034 15971 16788 9993 16755 20462 23455 22527 18738 20627
13943 20627 19818 18754 20557 30164 41209 43845 37203 33648 33255 42564 53648 58871 59708 67929 73570
13928 73570 71375 69940 65202 72251 81089 81759 80396 87498 86990 82368 81858 83340 102629 107508 112490
13913 112490 118958 128023 125650 126261 132038 141164 140847 145614 154109 152042 146894 151052 160198 168219 166910
13898A66910K990J1024N434m763J6801J0219O825J0159M306P99J3554Q556M525
13885B57339J4082K0552J0720J5392R645O456J0635J2126J6191J3931R384J2781
13873D09234K1331K1733K5615L0681K3531J1220K7688L6203K8585L6280L3215
13862G05316M3648M5592M9889M7006N1248O0086P6568P2282P6097Q5696Q5903
13851A399331R7019J13842J19487J22619J28794J52143J74646J85712J94420K17615
13841B905628K39081K65794K85530L17265L47151L68705M10862M47942M79638
13832F067596N38263N78290O25326O75640P38188Q00666Q62366R23707R65453
13823A2775495J033140J091005J136754J173250J187433J199313J177948J147689
$$ plain form
13898 166910 169900 180924 186358 181595 198396 208615 215440 225599 229905 230704 244258 252814 257339
13885 257339 271421 291973 302693 318085 327730 334186 344821 356947 373138 387069 396453 409234
13873 409234 430565 452298 477913 508594 532125 543345 571033 607236 635821 672101 705316
13862 705316 748964 794556 844445 891451 942699 1002785 1079353 1151635 1227732 1313428 1399331
13851 1399331 1496350 1610192 1729679 1852298 1981092 2133235 2307881 2493593 2688013 2905628
13841 2905628 3144709 3410503 3696033 4013298 4360449 4729154 5140016 5587958 6067596
13832 6067596 6605859 7184149 7809475 8485115 9223303 10023969 10886335 11810042 12775495
13823 12775495 13808635 14899640 16036394 17209644 18397077 19596390 20774338 21922027
13815B1922027J059395R36012P70921N88376L96215J81362m8712k97009n19235
13806B4989352o99078q71048j017746j127989j187359j233574j254558j241367
13798A6356633j215989j169566j119071j049298r73233r12259q50353p73534p10464
13789G582866o52545n87726n30393m88531m47040m13727l78554l39010l06086
13780C439254k71276k36111k18880k05362j88146j81052j67523j45251j25071
13771A700582j12344j08387r9288q7263q8747p4225o4037o5059o5019n4281n9138
13760H22794n1401l0277l9913m6984l7574l5424k6728l0462l1134k4228k9990
13749D38679k7372k2972j0215j1451j2607j9985j9435j9092k2093j3394o687r625
$$ plain form
13815 21922027 22981422 23917434 24688355 25276731 25672946 25854308 25805596 25508587 24989352
13806 24989352 24290274 23419226 22401480 21273491 20086132 18852558 17598000 16356633
13798 16356633 15140644 13971078 12852007 11802709 10829476 9917217 9066864 8293330 7582866
13789 7582866 6930321 6342595 5812202 5323671 4876631 4462904 4084350 3745340 3439254
13780 3439254 3167978 2931867 2712987 2507625 2319479 2138427 1970904 1825653 1700582
13771 1700582 1588238 1479851 1380563 1293300 1204553 1130328 1066291 1001232 936213 881932 822794
13760 822794 771393 741116 701203 654219 616645 581221 554493 524031 492897 468669 438679
13749 438679 411307 388335 378120 366669 354062 334077 314642 295550 273457 260063 253376 243751
13737B43751p290o691q602p103n342j0545p940n204n349n722r858j940r276q02
13723A52087o904n827r889j919K858J523o090o005O684l037j4946j0478p68m971
13709I2318L631J0815l999m106n402k928k395K838l648l73k740L565p944l511
13695G6121n22j124q478o036j1495J686R447M62q413O745R704J2526n69K121L421
13680H5596l379j3695n320R995l214q107l626m789L718Q924P598n879K449j2736
13666E7535n799o711m640j84K988O341M308q51n904M121Q562l12q881k197M090
13651E2466R557j571j0276r78K160J5365Q259j1931p078n105o355j76P46n463
13637C9620l808j806P8k034j88m377K673J1116P247L447J965O71R702o787j1278
$$ plain form
13737 243751 236461 229770 221168 214065 208723 198178 190238 185034 179685 173963 164105 162165 152889 152087
13723 152087 145183 139356 129467 127548 130406 131929 125839 119834 126518 123481 108535 98057 97289 92318
13709 92318 95949 106764 102765 98659 93257 90329 87934 90772 87124 86751 84011 87576 79632 76121
13695 76121 75599 74475 65997 59961 48466 50152 59599 60061 51648 58393 68097 80623 80054 82175 85596
13680 85596 82217 68522 63202 73197 69983 61876 58250 53461 57179 66103 73701 67822 70271 57535
13666 57535 51736 45025 40385 40201 43189 49530 53838 52987 47083 51204 59766 59454 50573 48376 52466
13651 52466 62023 60452 50176 49198 51358 66723 74982 63051 55973 50868 44513 44337 45083 39620
13637 39620 35812 34006 34084 32050 31862 27485 30158 41274 48521 51968 53933 54604 64306 57519 46241
13622D6241l828M990Q725M708j1724l910L904q62J082K314p095K432O725o777
13608D6925L203R25o028m567m394j226K380P447q135j5762o458m743K975L879
13594A6421P62l024P234J1000J886n516J586o504j4856K583l815j3310J72J3961
13580H580Q38k940L967N176L616J819o757j2888k871N082O705J3351K286l151
13566B2813n011j838m701k412L670m980o115Q780N883K158q081j63n195Q511N855
13551A9174m053L066P105K557j2428m115P841q80K892Q645k339j0015p246J253
13537A1457J0037n521L969n73k590R154n32j424o842N173l188n228K75k248n45
13522A1374P809p143r190n992R839Q850o419l392q99j0046l188L983L787N005
$$ plain form
13622 46241 42413 47403 56128 60836 49112 45202 49106 48244 49326 51640 44545 46977 53702 46925
13608 46925 50128 51053 45025 40458 36064 34838 37218 44665 36530 20768 14310 9567 12542 16421
13594 16421 17183 14159 21393 32393 34279 28763 30349 23845 8989 11572 7757 -5553 -5381 8580
13580 8580 9418 6478 10445 15621 19237 21056 14299 1411 -1460 3622 10327 23678 25964 22813
13566 22813 17802 15964 11263 8851 12521 7541 1426 10206 16089 18247 10166 10003 4808 13319 19174
13551 19174 15121 18187 25292 27849 15421 11306 19147 18267 21159 29804 27465 17450 10204 11457
13537 11457 21494 15973 19942 19369 16779 25933 25401 23977 17135 22308 19120 13892 14167 11919 11374
13522 11374 19183 12040 2850 -3142 6697 15547 9128 5736 4837 -5209 -8397 -4414 -627 4378
13508D378j718N3M302j341j177j398J947J047j0363o303q75L650K536P542O093
13493H373L854m146J579L589M735J029m731O948N081k995l842j7331o070p72O52
13478d047J2194J794l071l82r507L811l745M383J2750K733j148m944p964q364
13464e507j826Q354L106O491l760j5264j89l495k74Q336P319L824O373R38J756
13449A6182o005j381p25J541J1900J098r221j459j147K645L103l559p067m635
13435A270M356K962L677k900o581p830N360J585l059m25M05K181R28j496p97N178
13419D814Q754K543k43j1597j1796J137Q086l550O3j603l433J56J948N36J0753
13404F568l854l675j932l443k575k256k081O851J0199N172o088K341J6697M025
$$ plain form
13508 4378 2660 2713 7015 5674 4497 3099 5046 6093 -4270 -10573 -11448 -7798 -5262 2280 8373
13493 8373 12227 8081 9660 13249 17984 19013 14282 21230 26311 23316 19474 2143 -3927 -4699 -4047
13478 -4047 8147 9941 6870 6488 -3019 792 -2953 1430 14180 16913 15765 10821 2857 -5507
13464 -5507 -7333 1021 4127 10618 6858 -8406 -8595 -12090 -12364 -4028 3291 7115 13488 14426 16182
13449 16182 10177 8796 8071 9612 21512 22610 13389 11930 10783 13428 16531 12972 5905 1270
13435 1270 5626 8588 12265 9365 2784 -5046 314 1899 -1160 -1585 -1180 1001 1929 433 -364 4814
13419 4814 13568 16111 15868 4271 -7525 -6388 1698 -1852 -1789 -3392 -6825 -6669 -4721 -4185 6568
13404 6568 2714 -961 -2893 -6336 -8911 -11167 -13248 -6397 3802 8974 2886 5227 21924 25949
13390B5949q128m358M706j588j805J2428M283n44L406J188P005j042k746k88l800
13375C4666L905j442k034J3269Q160k785R32R317Q022K234j2302M32J8714J4844
13361I5932j38J955L797J3260J5790R690O302n450q538P13L462j2405j9772K226
13347A06824Q242o189k1113o768k497n402o772o700q125l677n989j566K298K241
13333D4807m770j51K706j0335j4013N634O70m046j497K392O11P27j0799J319l81
13318A2874N290J370N796p69j1011l015K197p229K391o24K380O446k778k836k936
13303G546r17N533j216p441K960M471k28n899m088P319n586o630P857Q469q957
13288C193R671k12o871j117k959J555l958n755k477N623J211o182n592O444j362
$$ plain form
13390 25949 17821 13463 18169 16581 14776 27204 31487 30943 34349 35537 42542 41500 38754 38466 34666
13375 34666 38571 37129 35095 48364 56524 53739 54671 63988 72010 74244 61942 62374 81088 95932
13361 95932 95794 97749 101546 114806 130596 140286 146588 141138 132600 133313 136775 124370 104598 106824
13347 106824 115066 108877 87764 80996 78499 73097 66325 59625 51500 47823 41834 40268 42566 44807
13333 44807 40037 39886 42592 32257 18244 23878 24548 20502 19005 21397 22008 22735 11936 13255 12874
13318 12874 18164 19534 25330 24561 13550 10535 12732 5503 7894 7270 9650 16096 13318 10482 7546
13303 7546 6629 12162 10946 3505 6465 10936 10708 4809 721 8040 2454 -4176 3681 12150 3193
13288 3193 12864 12652 5781 4664 1705 3260 -698 -6453 -8930 -3307 -2096 -8278 -13870 -7426 -8788
13273h788m305N558O727L234O698M728J118j481j658J321K889J040l889J354P656
13258B2202j0887o545O948N994o580l670m767j016m49m075m849l40k710k339L648
13243i435P464n672L617O861j528j947j807m386Q070L194j447M2N299L606J444
13228A3375l479j507L246K211O277o827L799J276j982m136q636J592n029o764
13214f584k33O988R416j0992m503j554M559K74l634J304O838P78j69o89o637k337
13198g175R397r07p348O264N787M195l806j0802Q102Q836l849j215L568J425L964
13183A6436R603J1154J0607k204r730j3541q157k055O65q541l319P473l225j189
13169C977N084q403p963l203n163P475Q361O19l864k299Q219j145P31J885M067
$$ plain form
13273 -8788 -13093 -7535 -808 2426 9124 13852 14970 13489 11831 13152 16041 17081 13192 14546 22202
13258 22202 11315 4770 11718 17712 11132 7462 2695 1679 1230 -2845 -7694 -8034 -10744 -13083 -9435
13243 -9435 -1971 -7643 -4026 2835 1307 -640 -2447 -6833 1237 4431 2984 3026 8325 11931 13375
13228 13375 9896 8389 11635 13846 20123 13296 17095 18371 16389 12253 3617 5209 180 -6584
13214 -6584 -6817 171 9587 -1405 -5908 -7462 -2903 -2629 -6263 -4959 1879 2657 2488 1799 -4838 -7175
13198 -7175 2222 1315 -6033 231 6018 10213 6407 -4395 3707 12543 8694 7479 11047 12472 16436
13183 16436 26039 37193 47800 45596 35866 22325 14168 12113 12778 4237 918 8391 5166 3977
13169 3977 9061 658 -7305 -10508 -15671 -8196 165 784 -3080 -5379 2840 1695 2426 4311 8378
13154H378l171j743J307m62P940n42j2483q296J583O435P167Q312j281M573J6221
13139C3938J7443K1476K3374J7140j920j5023k4585k2094k3120p590l754n765
13127I520j1711p472k50O136J0782o485m063J153K903J2770N198K394l886k900
13113A4089k104k544q164l764M565k64Q368J1711P050k079j096l07j705n803l814
13098A4139J659N235J6000K2253J5074J029Q156J2405J1605j0761k4435k0439
13086E1920k1261j4076m771o715N566p261j0961p4M528M71O119OJ507N877M361
13071A5236J581J219j0612M125L827o411o544k398l828o478j39Q978K837l550
13057b157J207k756n094Q712Q379N59k917k796J869J2504P845P122q08p20j2235
$$ plain form
13154 8378 5207 3464 4771 4309 12249 11707 -776 -9072 -7489 -1054 6113 14425 13144 17717 33938
13139 33938 51381 72857 96231 113371 111451 96428 71843 49749 26629 19039 15285 9520
13127 9520 -2191 -9663 -9913 -3777 7005 520 -3543 -2390 513 13283 18481 20875 16989 14089
13113 14089 11985 9441 1277 -2487 2078 1814 10182 21893 28943 26864 25768 25461 23756 17953 14139
13098 14139 15798 21033 37033 59286 74360 75389 83545 95950 107555 96794 72359 51920
13086 51920 30659 16583 11812 5097 10663 3402 -7559 -7633 -3105 -2634 3485 3491 4998 10875 15236
13071 15236 16817 18036 7424 11549 15376 8965 2421 23 -3805 -10283 -10422 -1444 1393 -2157
13057 -2157 -950 -3706 -8800 -88 8291 8850 5933 3137 5006 17510 25355 32477 31669 30949 18714
13042A8714l402k067O339N688m306l575n102j754m867o280R080J935k129L015
13028A1289K213l449K980N080n029k217K776L366L028j936j2778q587n077O841
13014a500K323N522j389m627o261N814O224n772j0751M815O417M161M026m646
13000D356L208Q40L443O505J753l712q440k368K240K22M52n86M599j3033j1442
12985a1963L505l31k034p77j621R931N255J6275P258n099l116p255K72j4194l562
12970g456J2352J267L829J309p363K552P199k428m305L699N512N382n131o935
12956I483j0861K978k739k59N249L132M605o209m20k650M509P951J256n256p569
12941C200k739R990O663o197n610j443R827o281m296M913m912o569K234J614l585
$$ plain form
13042 18714 15312 13245 19584 25272 20966 17391 12289 10535 5668 -612 8468 10403 8274 11289
13028 11289 13502 10053 13033 18113 13084 10867 13643 17009 20037 18101 5323 -3264 -8341 -1500
13014 -1500 823 6345 4956 329 -5932 -118 6106 334 -10417 -5602 815 4976 9002 4356
13000 4356 7564 8404 11847 18352 20105 16393 7953 5585 7825 8047 8499 7913 12512 -521 -11963
12985 -11963 -8458 -8789 -10823 -11600 -13221 -3290 1965 18240 25498 20399 17283 10028 10300 -3894 -7456
12970 -7456 4896 6163 9992 11301 3938 6490 13689 11261 6956 10655 16167 21549 16418 9483
12956 9483 -1378 1600 -1139 -1398 3851 6983 11588 5379 4959 2309 6818 14769 16025 10769 3200
12941 3200 461 10451 17114 10917 5307 3864 13691 7410 3114 8027 3115 -3454 -1220 394 -3191
12926c191J095P239P888n037n967O114O002K308l153j4442m493J3325j327o698
12912c37p136l61K680P343J717j951j1982P75K285O096J1806O201J424o836r00
12897A0824r338j0249K494Q402M858k065m687j974R222J1078j392p986p470Q392
12883A0109J3122K61n104l799m776l535M628P909K472j902q819l575N09N909j1176
12868B233j4389M034J760J1747J1581n281m795J3970L401q186m708k463L871m557
12854H218K307L674o414j1286N00M961M320l127o236L333R568m363k041K990J85
12839F589L093j533k469k17N849K741k733k975o045K205N745M339p005o615j684
12824g15J748J2963J965R67R215M618O890J0582J304r705j1681l973j0050k434
$$ plain form
12926 -3191 -2096 5143 13031 7994 2027 8141 14143 16451 13298 -1144 -5637 7688 6361 -337
12912 -337 -7473 -7834 -5154 2189 3906 1955 -10027 -9252 -6967 -871 10935 17136 18560 11724 10824
12897 10824 1486 -8763 -6269 2133 6991 4926 239 -1735 7487 18565 17173 9187 1717 10109
12883 10109 23231 23492 18388 14589 9813 6278 10906 18815 21287 19385 10566 6991 7500 13409 2233
12868 2233 -12156 -8122 -6362 5385 16966 11685 6890 20860 24261 16075 11367 8904 12775 8218
12854 8218 10525 14199 7785 -3501 -3001 1960 6280 3153 -3083 250 9818 5455 3414 6404 6589
12839 6589 9682 8149 5680 5463 11312 14053 11320 8345 2300 4505 10250 14589 7584 969 -715
12824 -715 1033 13996 15961 16928 26143 30761 37651 48233 49537 39832 28151 24178 14128 11694
12810A1694m90j695L459k624N877J418k181j662O355M812N16j135p10k724j0409
12795A0501n847M697P840j0349j7646K678Q510r76N899N460m001n260j072L361
12781C795J3932m110l945j5182j2691Q10M536P379L500K790L976P496M692R110
12767B6088N299m913o444l641N63K540P351K09L29M637m290n594o10L304O604
12752C1432M480N110Q266l829L103N728N49J0258Q093J0725J0282J1005J2769
12739A17971J5559J0022R782J5858J8331J0910K5027L4572L7052N4878Q0769Q8643
12727E19374J43171K00124K67260K94414L05173L88213L37434j58403n79166n50762
12717A166832l69976k33237j46934r7304o3963m0357m2185k7453j1828j5402j4493
$$ plain form
12810 11694 11204 9509 12968 10344 16221 17639 15458 13796 20151 24963 25479 24344 23634 20910 10501
12795 10501 4654 9351 17191 6842 -10804 -8126 384 -592 5307 10767 6766 1506 434 3795
12781 3795 17727 13617 9672 -5510 -18201 -17391 -12855 -5476 -1976 814 4790 12286 16978 26088
12767 26088 31387 26474 20030 16389 16952 19492 26843 27052 27381 32018 27728 22134 21524 24828 31432
12752 31432 35912 41022 49288 45459 48562 54290 54839 65097 73190 83915 94197 105202 117971
12739 117971 133530 143552 153334 169192 187523 198433 223460 258032 295084 349962 430731 519374
12727 519374 662545 862669 1129929 1424343 1729516 2117729 2455163 2296760 1717594 1166832
12717 1166832 796856 563619 416685 319381 255418 215061 172876 145423 133595 118193 103700
12706A03700k1187p584m276r451p407L291m183O76N747j971m630L990l234n936
12692D7545l230J272j820l229k766j1336P403M663J911K666K594P452L454r845
12678D6734q455q391M95K387J838N501J0336R318M965m059J317P657J8864K031
12664I0538N785l257k258J1147J7139J6388M169j84J1972m9J701O93r059j0025
12650A34700n458L789r937j1534p387N703J7880J8350J7695J6028J3186J6903
12638B09918J8618J5672J3689J3306n456P676J5108j114J29o794n285Q776J2719
12625B96962L601j3141j7217j1493j9512j8046r549K229j577j6100j0862k240
12613A83055J4185J0439N137J672J1N0K083L992R663O735j0066k949O057J6200
$$ plain form
12706 103700 82513 74929 70653 61202 53795 57086 52903 53579 59326 57355 52725 56715 53481 47545
12692 47545 44315 45587 43767 40538 37772 26436 33839 38502 40413 43079 45673 53125 56579 46734
12678 46734 38279 29888 30383 32770 34608 40109 50445 59763 64728 60669 61986 69643 88507 90538
12664 90538 96323 93066 90808 101955 119094 135482 139651 139467 151439 151390 153091 153784 144725 134700
12650 134700 129242 133031 123094 111560 104173 109876 127756 146106 163801 179829 193015 209918
12638 209918 228536 244208 257897 271203 265747 273423 288531 287417 287546 280752 275467 284243 296962
12625 296962 300563 287422 270205 258712 239200 221154 211605 213834 212257 196157 185295 183055
12613 183055 197240 207679 212816 214488 214499 214549 216632 220624 230287 237022 226956 224007 230064 246264
12599B46264L660P279J7538J2102J8508K574m579j4255n973l818P62p944j3071
12586B59047j2251j6588k608q507j3206j3485r145q301j3281j0661j3418p987
12574A29609j1094j859N830J041J1024Q076J3044K4695J1144L081J0544N583p31
12561B09987r266n206p109j5920j9280k2884j2209j4176j3693n723o697j4500
12549F3324m626J394N735N059q8k023l219N936Q253M31m037N712n886o423L319
12534G2861K201k491n500q593K948M846N540N085k050L42L516n079K419M347j799
12519G8593m371o527r53L282j2233o116J5181N088j290N180p937o197J1080N477
12505G8257o363l699m535o273N344Q561M030R503p36j0842n968j168p227J168
$$ plain form
12599 246264 249924 257203 274741 286843 305351 307925 303346 289091 283118 279300 280062 272118 259047
12586 259047 246796 230208 227600 219093 205887 192402 183257 174956 161675 151014 137596 129609
12574 129609 118515 116656 122486 123527 134551 142627 155671 180366 191510 194591 205135 210718 209987
12561 209987 200721 195515 188406 172486 153206 130322 118113 103937 90244 84521 77824 63324
12549 63324 58698 60092 65827 70886 70798 68775 65556 71492 79745 80176 76139 81851 75965 69542 72861
12534 72861 75062 72571 67071 58478 61426 66272 71812 76897 74847 75189 78705 73626 76045 80392 78593
12519 78593 74222 67695 66742 70024 57791 51675 66856 71944 70654 75834 67897 61700 72780 78257
12505 78257 71894 68195 63660 57387 62731 71292 75322 84825 84089 73247 67279 66111 58884 60052
12491F0052Q685K91J259p075p03Q893l807k080J7657J535j2320j1018j830N360
12477F4899p10r64J0316P242K70J0314K457M512j229k916P194M374L539J0454
12463A19752J0249N919O142J1293K1833J0259J8688K7995K8510K6681K3949J4257
12451C25527R600K502n001J671o002k1866j5726j1716j0490l938k356p479k014
12438B52712J1802M522P498J4112K1478L9835K8720L1183M3991N6574M3201M0591
12426E96219M8363K9181K2146J852p115j2772j8950k7732k3465l2349k9764k8554
12414E17060l5271l0766j8013k3205n298J0350J1694J2404J3207O638J4862J4620
12402D88282o193j9468j4314j5716k0928j6282j4502k206J1829K1454K4222K0575
$$ plain form
12491 60052 68737 69028 70287 63212 62509 71402 67595 65515 83172 84707 72387 61369 59539 64899
12477 64899 64189 63225 73541 80783 81053 91367 93824 98336 97107 94191 101385 105759 109298 119752
12463 119752 130001 135920 142062 153355 175188 185447 204135 232130 260640 287321 311270 325527
12451 325527 335127 337629 332628 334299 328297 306431 290705 278989 268499 264561 262205 254726 252712
12438 252712 264514 269036 276534 290646 312124 351959 380679 411862 455853 512427 555628 596219
12426 596219 644582 673763 695909 697761 690646 677874 658924 631192 607727 575378 545614 517060
12414 517060 481789 451023 433010 409805 404507 414857 426551 438955 452162 458800 473662 488282
12402 488282 482089 462621 448307 432591 411663 395381 380879 378673 390502 411956 436178 456753
12390D56753K6008M9839M0637L5791K3639m491k1615m5063n5419o2661n9657n8372
12378C25389m4715l3144k1212j7067k4932j4486j5866o353l101j3192j2901j0055
12366A08365j2348o423n597k399R217K1061J9770J1956J8514J4613o229j0005
12354A60495r566j8437j5104q328n360l068l274p108J802K417P479L899j713j4346
12340H9788K108P985N549l746Q162M431q418q541N103M682m97m244m462j07J3669
12325A11462J2408J2651J0616J0283r65N275J1354L996j2629m936N61J087q846
12312A52317j2422j1198o249o748k873m496m442j0245n024M991R051J0455K2545
12299A35662J7011L1543M1976M1615L6800K4364K1917J7330R901N858M179N913
$$ plain form
12390 456753 482761 532600 573237 609028 632667 628176 606561 561498 506079 443418 383761 325389
12378 325389 280674 247530 226318 209251 184319 169833 153967 147614 144513 131321 118420 108365
12366 108365 96017 89594 83997 81598 90815 111876 131646 143602 162116 176729 170500 160495
12354 160495 150929 132492 117388 109060 103700 100632 97358 90250 92052 94469 101948 105847 104134 89788
12340 89788 91896 99881 105430 101684 109846 114277 105859 97318 102421 107103 106606 102362 97900 97793 111462
12325 111462 123870 136521 147137 157420 156455 161730 173084 177080 164451 159515 160076 161163 152317
12312 152317 139895 128697 122448 115700 112827 108331 103889 93644 88620 93611 102662 113117 135662
12299 135662 152673 184216 226192 267807 304607 328971 350888 368218 378119 383977 388156 394069
12287C94069n135l44P176J981J225J0407J2268J2149J305M146J753O294R354R321
12273D65969O414Q910R789K3481K8041K2910J9949J4725K3576K4624L0506L5514
12261G14408L9169L5602M3117L3766L5302L6003L7458M1622M2106N3849N0285
12250A162687N4136O3218O6704P8125Q7476J04650J15191J18121J26518J17758
12240B094584Q7811N9922L3103L1373J5721J3222L2470N4024N8755P4297R0073
12229B645355J06799J13757J08609R7243P7977P4967Q6246R7080J29479J53900
12219C691412J82523K19763K58446K74276K82359K98188K83166K60196K22441
12210E972770K16142K29963K55195L06501L75711M68741N64890O48048P34294
$$ plain form
12287 394069 388934 388590 395766 397747 398972 409379 421647 433796 435101 439247 441000 447294 456648 465969
12273 465969 472383 481293 491082 514563 542604 565514 585463 600188 623764 648388 678894 714408
12261 714408 753577 789179 832296 866062 901364 937367 974825 1016447 1058553 1112402 1162687
12250 1162687 1216823 1280041 1346745 1424870 1512346 1616996 1732187 1850308 1976826 2094584
12240 2094584 2182395 2242317 2275420 2306793 2322514 2335736 2368206 2422230 2480985 2555282 2645355
12229 2645355 2752154 2865911 2974520 3071763 3149740 3224707 3310953 3408033 3537512 3691412
12219 3691412 3873935 4093698 4352144 4626420 4908779 5206967 5490133 5750329 5972770
12210 5972770 6188912 6418875 6674070 6980571 7356282 7825023 8389913 9037961 9772255
12201I772255P86411Q13592P56517O52905N42128M57549M92244O21853Q08625
12192A5704079J043137J312008J604997J925832K284343K687723L191210L800661
12184C3553990M567248N545968O781661Q302362J0156385J2327836J4700266J6964262
12176A12899978J8714093J9412241J8526402J5409683R696371J778536p054953
12169A89382351j4890923k0007829k1908679k1426661j9588298j6929692j3962439
12162F0667830j1122602q719686o808689n331136m203229l324210k635590k099769
12154A6422919j668309j324042j011400p55707n48187l76226k32993j27534j04202
12145A0274319j52721k84145m71496o43253p14730o93030o11868n04434l98077
$$ plain form
12201 9772255 10558666 11372258 12128775 12781680 13323808 13781357 14273601 14895454 15704079
12192 15704079 16747216 18059224 19664221 21590053 23874396 26562119 29753329 33553990
12184 33553990 38121238 43667206 50448867 58751229 68907614 81235450 95935716 112899978
12176 112899978 131614071 151026312 169552714 184962397 194658768 196437304 189382351
12169 189382351 174491428 154483599 132574920 111148259 91559961 74630269 60667830
12162 60667830 49545228 40825542 34016853 28685717 24482488 21158278 18522688 16422919
12154 16422919 14754610 13430568 12419168 11663461 11115274 10739048 10506055 10378521 10274319
12145 10274319 10121598 9837453 9365957 8722704 8007974 7314944 6703076 6198642 5800565
12136E800565k95148k25141j86295j55241j38165j50997j88047k16313k34941
12127D010277k59247k74775k60021k30584k04290j75012j53642j27889j07884
12118B216933r1588o9924o4958m8550l4898l0958k5398l0048j9288J591K0019
12107A822933J2966J4065O894j4513l5978o3665r4905j16974j37154j35473j27151
12096A131045j11061r3127q0207o3781m9926l4697l1622k3376k5543l1037j4553
12085E72115j4902k8669k2304j4685k943p068j6716j1337O996N513k721r271q537
12072D45471j8491k3374j0354K160K996p738j3970j4524o044o360j4457p167j889
12059C26259j6500j9672j2256k2328k3644k3899p702K494k561o627O959J5111
$$ plain form
12136 5800565 5505417 5280276 5093981 4938740 4800575 4649578 4461531 4245218 4010277
12127 4010277 3751030 3476255 3216234 2985650 2781360 2606348 2452706 2324817 2216933
12118 2216933 2125345 2055421 1990463 1941913 1907015 1876057 1850659 1820611 1801323 1802914 1822933
12107 1822933 1835899 1849964 1856858 1842345 1806367 1742702 1647797 1530823 1393669 1258196 1131045
12096 1131045 1019984 926857 846650 782869 732943 698246 666624 643248 617705 586668 572115
12085 572115 557213 528544 506240 491555 488612 481544 464828 453491 460487 466000 463279 454008 445471
12072 445471 426980 403606 393252 395412 398408 390670 376700 362176 356132 349772 335315 328148 326259
12059 326259 309759 290087 277831 255503 231859 207960 200258 202752 200191 193564 200523 215634
12047B15634J7020K2837M3552L7327L7871K8259R524P633Q422q483k6840k1643
12035C71113o020j3402j4694k1574n634m206j7485j0690j5832o017l025J709J87
12022B54430p154j7354o515K135M537O977J1264Q381q639j298m587o098N327j307
12008B40099o125o273n792n778j800l898o554j467J0637J101p474K709N379L35
11994B15099j336p144j3548j0092p904r177r385m985J124J4331J3801P042K420
11981A90246J1142J8326R019Q765p755r853M180p446r561j1758r936k137o427
11968A76805j2663J836n700m764m148m266O324Q28m310j3114j1196m814p235n068
11954A08515r665o075k112n919k717K546p693J419J4639j469j318L966J0362Q273
$$ plain form
12047 215634 232654 255491 299043 336370 374241 402500 412024 419657 428079 419596 392756 371113
12035 371113 365093 351691 336997 315423 309789 305583 288098 277408 261576 255559 252534 254243 254430
12022 254430 247276 229922 223407 225542 230079 237056 248320 256701 248062 246764 242177 236079 241406 240099
12008 240099 233974 227701 221909 216131 214331 210433 203879 202412 213049 214150 206676 209385 214764 215099
11994 215099 213763 206619 193071 182979 175075 165898 156513 151528 152652 166983 180784 187826 190246
11981 190246 201388 219714 228733 237498 229743 219890 224070 216624 207063 195305 185369 183232 176805
11968 176805 164142 165978 160278 155514 151366 147100 153424 154252 149942 136828 125632 120818 113583 108515
11954 108515 98850 92775 90663 84744 82027 84573 76880 78299 92938 91469 90151 94117 104479 112752
11940A12752q318k0651k460L564n686p203l164O308N421J562K817n293n004r171
11926F5474O936J040k97P657O276L364N231Q358j4j937J81k720p683j9308m600
11911F7958o322p010K433K894L22L269M3M1N428R92k863k299m588M635O409K994
11895G4336l514K028O089J770N667O474m234j1261r244L846l139n045m125m934
11881E4714k721j481M090n450k806J0760K731l220l974p546l210K498R099J0384
11867F3868J421l065r002R668N486N338l984q445j5811J071k707j5428L376O769
11853C8555q67m467n276J622m048q19M582N111mj914J363J446P113R166n822j2554
11837C3187n285p671N000O877J426L126O153Q732o385K926j426j6066J185P049
$$ plain form
11940 112752 104434 83783 81323 84887 79201 71998 68834 75142 80563 82125 84942 79649 74645 65474
11926 65474 72410 73450 73153 80810 87086 90450 95681 104039 104025 102088 102269 99549 91866 72558 67958
11911 67958 61636 54626 57059 59953 60275 63544 63587 63628 69056 70048 67185 64886 60298 64933 71342 74336
11895 74336 70822 72850 78939 80709 86376 92850 88616 77355 68111 71957 68818 63773 59648 54714
11881 54714 51993 50512 54602 49152 46346 57106 59837 56617 52643 45097 41887 44385 53484 63868
11867 63868 65289 62224 53222 62890 68376 73714 69730 61285 45474 46545 43838 28410 31786 38555
11853 38555 37688 33221 27945 29567 25519 24700 29282 34393 34389 32475 33838 35284 42397 51563 45741 33187
11837 33187 27902 20231 25231 32108 33534 36660 42813 51545 45160 48086 46660 30594 31779 38828
11823C8828N653P330p263L568K328j2529K256L698N58p327K207M612j400K663
11809D5182J5014K748N947k864m138Q165r669j0613q051k332j986j53m533K089
11795C4806J1656R853N856j616J835M764p270Q7O39M651J1254J3488O073J715
11781I7791q605M761J8425N306O765Q824K732J5245R108J2886J8184J5729J3502
11768B20653J1307k773o282n704k4774k0015L248P441Q556J0887J3238N612R908
11755B31302J6692K7140J6308M831o030j3442j1063n786r093j2206j911j1152
11743B25590j1144j0072J138M636J7553K0241J5481P702K542Q612J970n920j745
11730B76584k719j5261j5999p832l894K486m61K076J1104p140q382j1482K322
$$ plain form
11823 38828 44481 51811 44548 48116 50444 37915 40171 43869 44427 37100 39307 43919 42519 45182
11809 45182 60196 62944 68891 66027 61889 70054 60385 49772 41721 39389 37403 37250 32717 34806
11795 34806 46462 56315 62171 60555 62390 67154 59884 59971 60610 65261 76515 90003 96076 97791
11781 97791 89186 93947 112372 117678 124443 133267 135999 151244 160352 173238 191422 207151 220653
11768 220653 231960 229187 222905 217201 192427 172412 175660 183101 191657 202544 215782 221394 231302
11755 231302 247994 275134 291442 296273 290243 276801 265738 259952 250859 238653 236742 225590
11743 225590 214446 204374 205512 210148 227701 247942 263423 271125 273667 282279 284249 278329 276584
11730 276584 273865 258604 242605 234773 230879 233365 232904 234980 246084 238944 230562 219080 221402
11717B21402K137j1489j9219o788r871J391J328j1349n442r874j6116j4866j1978
11704A09266o014Q005M666J0602L677J693K709o410j5824q308J899J081M065J1483
11690A22590R696L735M522L194m410K734o766j4879q402r536j2358m743q870r92
11676G5515K45k1268j7440k789O41K60M288R155o522l454r43K332K050k008M744
11661D4806K568m725o955J845k090n290l694Q154L006p34K62o952m959J686n773
11646B1155m592N18j901n267J213J0598k646M385Q178N222K623r342N304P467
11632D2915p559o331K19n282K158M881K031M152k847o702j763L423q5o874R50
11617B3286O045K912l923j685K494k397K400l738J045k16j4439K248j025q173
$$ plain form
11717 221402 223539 212050 192831 186043 176172 177563 178891 167542 162100 152226 136110 121244 109266
11704 109266 103252 111257 115923 126525 130202 131895 134604 128194 112370 104062 105961 107042 111107 122590
11690 122590 132286 136021 140543 143737 139327 142061 135295 120416 112014 102478 90120 85377 76507 75515
11676 75515 75760 54492 37052 34263 34904 35164 39452 48607 42085 38631 37688 40020 42070 40062 44806
11661 44806 47374 42649 35694 37539 35449 30159 26465 34619 37625 36891 37153 30201 25242 26928 21155
11646 21155 16563 17081 15180 9913 11126 21724 19078 23463 31641 36863 39486 30144 35448 42915
11632 42915 35356 29025 29244 23962 26120 31001 33032 37184 34337 27635 25872 29295 29210 22336 23286
11617 23286 29331 32243 28320 26635 29129 26732 29132 25394 26439 26223 11784 14032 13007 4834
11603D834N320Q287K539R775O129n035o181j330p604R020p511m740J6971J5270
11589D5744p770j6134j316M610N234k634j3004j1183J420J425L48K403O578J1771
11575B7492r675K46M5l490N254R010o140r435n385J829J789q761J503M305p079
11560A508M563o88L843j649O756N338Q841j979m436k47R04q599n824m770M051
11545G612R332J369l786k836o913K209N793m166m9o90j100M219N584p075m85R914
11529A8932J388j871N20k137j791n893N871M648j657j1045o862M870Q910O322
11515B0205q5M477L63n718J056j70K201k676o082p607o678k31o331l925j00Q030
11499c271J0729l214k715N97k329J124J951J096l278J282K974R40O039J84o1j1804
$$ plain form
11603 4834 10154 18441 20980 30755 36884 31849 25668 24338 16734 25754 18243 13503 30474 45744
11589 45744 37974 21840 20524 25134 30368 27734 14730 3547 4967 6392 6740 9143 15721 27492
11575 27492 17817 18063 18108 14618 19872 28882 22742 13307 7922 9751 11540 2779 4282 8587 1508
11560 1508 6071 5383 9226 7577 14333 19671 28512 26533 22097 21850 22754 14155 8331 3561 7612
11545 7612 16944 18313 14527 11691 4778 6987 12780 8614 8565 7875 6775 10994 16578 9503 9018 18932
11529 18932 20320 18449 18969 16832 15041 9148 15019 19667 18010 6965 103 4973 13883 20205
11515 20205 20120 24597 24960 19242 20298 20128 22329 19653 13571 5964 -714 -945 -7276 -11201 -11301 -3271
11499 -3271 7458 4244 1529 2126 -203 921 2872 3968 690 1972 4946 5886 11925 12109 12048 244
11483B44R005J0404o245o826l767Q92N369j160L60M791O852l281k933o275q153
11468g23L248L276o119M043O620N879M480j204k420k745r73k628l502L539L332
11453A4103L557Q33r564j0075n178O98n349j166J3614j328k622O947J0972r346
11439F096j1058q851P104Q410n418n854K937N785j648l90R638R147M96j1726m241
11424D27o543J8K805k9j146L703l604j1915l855P178R818J1267J103m908j0985
11409f666k661M755M964L541p843j598l238M642k602M88k530j2225P01K929R782
11394g561J3084n463n24L226k048k356J1740P16n743O168n89n301k666n931M79
11379b769n659J401J1790N826m414n207q538M455m81k916L393K662Q423l109j1653
$$ plain form
11483 244 9249 19653 13408 6582 2815 3707 9076 7916 8276 13067 19919 16638 13705 7430 -723
11468 -723 2525 5801 -318 3725 10345 16224 20704 19500 17080 14335 13362 10734 7232 10771 14103
11453 14103 17660 18493 8929 -1146 -6324 -5626 -10975 -12141 1473 145 -2477 4470 15442 6096
11439 6096 -4962 -13813 -6709 1701 -3717 -9571 -6634 -849 -2497 -2887 6751 15898 16394 4668 427
11424 427 -6116 -6098 -3293 -3322 -4468 -765 -4369 -16284 -20139 -12961 -3143 8124 9227 4319 -6666
11409 -6666 -9327 -4572 392 3933 -3910 -5508 -8746 -4104 -6706 -6218 -8748 -20973 -20272 -17343 -7561
11394 -7561 5523 60 -464 2762 714 -1642 10098 10814 5071 11239 10650 5349 2683 -3248 -2769
11379 -2769 -8428 -7027 4763 10589 6175 968 -7570 -3115 -3596 -6512 -3119 -457 7966 4857 -6796
11364f796j4156Q814J1731L690K834O771o04k1045n239J2211J2638k828p253J02
11350H70j653o11p660P663J6787J651k494k961k875N266K42p947j136l243r63
11335I36R068J622j3747Q276j1154j3526l157P321J3929J0312P200j971j2641
11322B468n124R171J0289o938q750L889P202l390N74m99j0022j818j65j664J119
11307c658J6421J2584m824j5273O03N188r903l293n67m084L128q38k747m153p360
11292a8776k071J5870J2254k266k118l777r795j1192M361N619O494M601K870o305
11278d231j2N97M85N189l053O677J669n25J62J635N796J1464K380j0959j1337
11263E937j919K213m216o832R96J0286J102j269J454O820l358n798n371n651j492
$$ plain form
11364 -6796 -20952 -12138 -407 3283 6117 12888 12284 -8761 -14000 -1789 10849 8021 768 870
11350 870 -783 -1394 -9054 -1391 15396 17047 14553 11592 8717 13983 14225 6278 5142 1899 936
11335 936 10004 11626 -2121 6155 -4999 -18525 -21682 -14361 -432 9880 17080 15109 2468
11322 2468 -2656 6515 16804 9866 1116 5005 12207 8817 9391 8892 -1130 -2948 -3113 -4777 -3658
11307 -3658 12763 25347 20523 5250 5853 11041 1138 -2155 -2722 -6806 -3678 -4516 -7263 -11416 -18776
11292 -18776 -20847 -4977 7277 5011 2893 -884 -10679 -21871 -17510 -11891 -5397 -796 2074 -4231
11278 -4231 -4243 -3646 -3161 2028 -1025 5652 7321 6796 6958 8593 14389 25853 28233 17274 5937
11263 5937 4018 6231 2015 -4817 -3821 6465 7567 6298 7752 14572 11214 5416 45 -5606 -7098
11248g098M488r218R21J2981J492J748k745L9K088m976j531K246N84m171j048
11233d200j681J504K870J502k09q627J237o271Q86J0765R455M199k139O01q98
11218H994m825k412J796k150M159j123n32n234N274L313l994m919n363J1229n15
11203C698K049N13p193J942m048o123O260O869R2k8l207n335P40K715Q812M330
11187A2086o423o972J668K402k032N82k427K729M530Q976n282k08O426k108K101
11172A6048K14O979j781j680j1107j022l960p551L334l685N446R597m271O98J343
11157H602n964k278P78R060q266l089M050M783m580j8355p695M928K819r134J443
11142b2898J5594P056K622j066p601J0670M497j0281O500M317N144k606l779j116
$$ plain form
11248 -7098 -2610 -11828 -10907 2074 3566 5314 2569 2608 4696 -280 -1811 435 1019 -3152 -4200
11233 -4200 -5881 -4377 -1507 -5 -214 -8841 -7604 -13875 -12989 -2224 7231 11430 9291 9892 8994
11218 8994 4169 1757 3553 1403 5562 4439 3907 -1327 3947 7260 3266 -1653 -7016 4213 3698
11203 3698 5747 6260 -933 1009 -3039 -9162 -2902 3967 4059 4031 824 -4511 -3771 -1056 7756 12086
11187 12086 5663 -1309 359 2761 729 1311 -1116 1613 6143 15119 9837 9629 16055 13947 16048
11172 16048 16262 23241 21460 19780 8673 7651 3691 -3860 -526 -4211 1235 10832 6561 7259 8602
11157 8602 2638 360 1138 10198 1932 -1157 2893 7676 3096 -15259 -22954 -18026 -15207 -24341 -22898
11142 -22898 -7304 -248 2374 1308 -6293 4377 8874 -1407 5093 9410 14554 11948 8169 7053
11128G053q790r037N003N701m416n367j435m088M658k59N279L869O576p629M32
11113b450J083l417o894k281M307K393M3m03O021Q908q739o833O5p30R459j006
11097d74p320M038n536j352q550r090L529J3133R305N174l23q799m758J257l198
11082a2964o076o42M285K721K230J3616L608j170k934j1523P37K059l896r337
11068a9286P9K554m635n34N887Q734n226n969p625R409K2271P403k46l013m426
11053E377m599p62J430N987N380j838o985p755r268M886L979o9J1358k303O50
11038E468k681J009N74k452o245J997M428m50q106O76K332N497j344n249Q322
11023C776P830j0802j571L199M980r580k323l17k479j2025j941O087K084j561
$$ plain form
11128 7053 -1737 -10774 -5771 -70 -4486 -9853 -11288 -15376 -10718 -10977 -5698 -1829 4747 -2882 -2450
11113 -2450 -1367 -4784 -11678 -13959 -9652 -7259 -7216 -7619 -1598 7310 -1429 -8262 -8197 -8927 532 -474
11097 -474 -7794 -3756 -9292 -10644 -19194 -28284 -24755 -11622 -2317 2857 2534 -6265 -11023 -9766 -12964
11082 -12964 -19040 -19682 -15397 -12676 -10446 3170 6778 5608 2674 -8849 -8112 -6053 -9949 -19286
11068 -19286 -19207 -16653 -21288 -21822 -15935 -7201 -12427 -18396 -26021 -16612 5659 13062 12816 9803 5377
11053 5377 778 16 1446 7433 12813 10975 3990 -3765 -13033 -8147 -4168 -4237 7121 4818 5468
11038 5468 2787 3796 4370 1918 -4327 -2330 2098 1648 -6458 -5782 -3450 2047 703 -4546 3776
11023 3776 11606 804 -767 2432 7412 -2168 -4491 -4808 -7287 -19312 -21253 -15166 -13082 -14643
11009a4643L609J1158o799m125q21l665J017l894J590M289O248P542O00J93K398
10994D697K519R06k768J790j766O866p689r144M041k321r51J351n670K771o470
10979a1838L304L108p964n592R213L765k775N130N681M848l468l569J153q438
10965g442m391N668N074J183L774q300l947L746k924O400J232o110p906j179m526
10950a9648N186J4947M565O10n467r228n048j420j422K826P888j46k47K378J717
10935b509O700M750l051q610L923M990k490k044l376O727J0847O116n299n008
10921A1666r34n011n221L655L623O586m47q318k270n037m223J3823P271m818q451
10906A894mJ223l433N1m924J730J1853K352m630O310m341j0125l400k39l291K885
$$ plain form
11009 -14643 -11034 124 -6675 -10800 -11621 -15286 -14269 -18163 -16573 -12284 -6036 1506 2106 2299 4697
10994 4697 7216 8122 5354 7144 5378 12244 4555 -4589 -548 -2869 -3820 -2469 -8139 -5368 -11838
10979 -11838 -8534 -5426 -13390 -18982 -9769 -6004 -8779 -3649 2032 6880 3412 -157 996 -7442
10965 -7442 -11833 -6165 -1091 92 3866 -4434 -8381 -4635 -7559 -1159 73 -6037 -13943 -15122 -19648
10950 -19648 -14462 485 5050 5660 193 -9035 -14083 -15503 -16925 -14099 -6211 -6357 -6604 -4226 -2509
10935 -2509 4191 8941 5890 -2720 1203 6193 3703 1659 -1717 5010 15857 21973 16674 11666
10921 11666 10732 5721 500 4155 7778 14364 13917 5599 3329 -1708 -5931 7892 15163 10345 1894
10906 1894 1890 3113 -320 -269 -5193 -3463 8390 10742 6112 12422 8081 -2044 -5444 -5683 -8974 -6089
10890f089l022P525M960n875J837j009n454k566K474M156j808J710N765R323q19
10875A1108q809O46l816N40O224K091j887j071m293L929J906j2636q396l372O131
10860a1705K970J978K437L728j913Pl892J0710P128o071K698n728r056n823J597
10845a0935k623N438P226N054L672k360j1538p872m589N899o82L982l545k110
10831a4983Q689P624k932k059J033j359q964J10J781L905k057q896O443k407m998
10816a9070J1929J0583m108K707P946r90K331J971O747J071m560n796q419m18
10802A924k094k046M053q35r039n865o417p11N180Q069O252o44O37j748k601l110
10786h995N972j25o987K429O818k523L702n835k333P06N575M269K442l066k767
$$ plain form
10890 -6089 -9111 -1586 3374 -2501 -664 -1673 -7127 -9693 -7219 -3063 -4871 -3161 2604 11927 11108
10875 11108 2299 2945 -871 -331 5893 7984 6097 5026 733 4662 6568 -6068 -14464 -17836 -11705
10860 -11705 -8735 -6757 -4320 -592 -2505 -2498 -6390 4320 11448 5377 8075 2347 -6709 -12532 -10935
10845 -10935 -13558 -8120 -894 4160 7832 5472 -6066 -13938 -18527 -12628 -13310 -9328 -12873 -14983
10831 -14983 -6294 1330 -1602 -3661 -2628 -3987 -12951 -12841 -11060 -7155 -9212 -18108 -11665 -14072 -19070
10816 -19070 -7141 3442 -666 2041 9987 8997 11328 13299 20046 21117 16557 10761 2342 1924
10802 1924 -170 -2216 1837 1002 -8037 -13902 -20319 -21030 -15850 -7781 -1529 -2173 -1536 -3284 -5885 -8995
10786 -8995 -3023 -3148 -10135 -7706 -888 -3411 291 -5544 -7877 -7171 -1596 2673 5115 2049 -718
10771g18J611K768Q414m170q484J347o988K564j28O27N108Q50k726L547P375J0966
10755B1963K206r599j6877q202o758Q187Q991l814j972Q2k189k649Q190J783m51
10740a109Q432K046q529j945k74n916K257R512k75L06j1230J408j882o555l585
10725a7339O534N147N997O740P62j1067k412K274Q203K128l192j4141k505R799
10711c072J6031L294n142K173K41k853K972j014n631o250P53L390J066m418j178
10696C62l464R783m041j4288p475j347J498Q132Q137O379j2602J24K707P603J3591
10681A5099K080o680j0740j630j107k769K713K759k500J71K336k97P596N734N527
10666A8292J959p558j3519n823J1554k023n526m922L212O05j56J149j422J419
$$ plain form
10771 -718 893 3661 12075 7905 -579 768 -6220 -3656 -3784 -3157 1951 2801 75 3622 10997 21963
10755 21963 24169 14570 -2307 -10509 -17267 -9080 -89 -3903 -5875 -5793 -7982 -10631 -2441 -658 -1109
10740 -1109 7323 9369 840 -1105 -1379 -7295 -5038 4474 4199 4505 -6725 -5317 -7199 -13754 -17339
10725 -17339 -10805 -5658 339 7079 7841 -3226 -5638 -3364 4839 6967 3775 -10366 -12871 -3072
10711 -3072 12959 16253 11111 13284 13525 10672 13644 12630 6999 749 1502 4892 5958 1540 362
10696 362 -3102 6681 2640 -11648 -19123 -20470 -18972 -10840 -2703 3676 -8926 -8802 -6095 1508 15099
10681 15099 17179 10499 -241 -1871 -2978 -5747 -3034 -275 -2775 -2604 -268 -565 7031 12765 18292
10666 18292 20251 12693 -826 -6649 4905 2882 -2644 -7566 -4354 -3749 -3905 -2756 -4178 -2759
10652b759Q277J776K816J536j330J218j009O132k703p029p055K899j722m510R19
10637b544N884n357J220k904j2712K474N222l153q781M390L204P722P924L648
10623F237p136O47j0143k365J830q972P66J0413Q47l228O362j119K266l62Q796
10608D839M634j0685o164L78P913J2123K699r275o95q216l964Q762L171r461M
10593c937N45j407Q336o553o58L231j293J591J0303P50M595o462q902o153P327
10578A313k184M312J005M67L905k552j2298N030R019l095o306M663m561K56m279
10563e305M616p00o289N509K901k777m563m491O426N697M451m830l850L358m02
10548b49Q920N34M988m102k679J453J737K421M591q53n005p798k416J721M804
$$ plain form
10652 -2759 5518 7294 10110 11646 10316 11534 10525 16657 13954 6925 -130 2769 1047 -3463 -2544
10637 -2544 3340 -2017 -797 -3701 -16413 -13939 -8717 -11870 -20651 -16261 -13057 -5335 2589 6237
10623 6237 -899 -252 -10395 -12760 -10930 -19902 -19136 -8723 -7876 -11104 -4742 -5861 -3595 -3957 4839
10608 4839 9473 -1212 -7376 -6998 915 13038 15737 6462 5767 -2449 -6413 2349 5520 -3941 -3937
10593 -3937 -3392 -4799 3537 -3016 -3674 -443 -1736 -145 10158 10908 15503 9041 139 -6014 1313
10578 1313 -871 3441 4446 4913 8818 6266 -6032 -1002 8017 4922 -1384 3279 -1282 -1026 -5305
10563 -5305 -689 -1389 -7678 -2169 732 -2045 -6608 -11099 -4673 1024 5475 645 -3205 153 -249
10548 -249 8671 9205 14193 10091 7412 8865 10602 13023 17614 16761 11756 3958 1542 3263 8067
10533H067j860j266j269l672M490J0019o56K236j429r202q926j716P7p466k073
10518a4646L618l275M651J7372K838O03J589q377m423J95K547J464k696l836L152
10503G76L020K871Q697n267j817j020k657j87m421J922Q648j82m487J283l492
10488C687n474m52l613n028Q639R746O95j2101K412M416N477K28l391J982J717
10473H940o34L962O386j812j1867K27l843r863m29O392l739q856j882J0541K227
10458d250L369N215j790M820k082j4622j458K189O898n653L565p474n839R849
10444g263N720K256l806P499K903L036j966O26m979r610n874m294j800p062J0780
10429a3834J4354O673j320k589k230k885n416j29P545J4767N111j3901n606L825
$$ plain form
10533 8067 6207 4941 3672 0 4490 14509 13853 16089 14660 5458 -3468 -5184 -5107 -12573 -14646
10518 -14646 -11028 -14303 -9652 7720 10558 11161 12750 4373 -50 145 2692 4156 1460 -2376 776
10503 776 3796 6667 15364 10097 8280 7260 4603 4416 -5 1917 10565 10383 5896 7179 3687
10488 3687 -1787 -2239 -5852 -10880 -2241 7505 8200 -3901 -1489 2927 8404 8632 5241 7223 8940
10473 8940 8306 12268 18654 16842 4975 5202 1359 -8504 -8933 -2541 -6280 -15136 -17018 -6477 -4250
10458 -4250 -881 4334 2544 7364 5282 -9340 -10798 -8609 -1711 -7364 -3799 -11273 -17112 -7263
10444 -7263 -1543 713 -3093 4406 7309 10345 8379 9005 4026 -5584 -11458 -15752 -17552 -24614 -13834
10429 -13834 520 7193 5873 3284 1054 -1831 -7247 -7376 169 14936 20047 6146 540 4365
10415D365J215R8l81k263r986o813R965J1344J3452k641j5332Q152Q530l658j0677
10400E370m861J820J12m490M567N328L071m806k145j782j557K999j707j1268L462
10385e887J0311N213j842m600j232O278l912L439n250p334Q018k012k847O614
10371D957l821J706k5J252J908l556j488J3913N840K384m056l912l317j5535n257
10356i007K130J1223M159p457j279J094j994L287Q779q955m522P234m4k508k512
10341c72k034O960J684j580r28o248m291O775K168n342J1567Q099j407l273k199
10326I579o834m869M89K159J136L443k278j4445q926N255j233q64L739J297O64
10311a1688k283P253R206L072r082j328l721k937L588P091l744N938P282M88o694
$$ plain form
10415 4365 5580 5678 5297 3034 -6952 -13765 -3800 7544 20996 18355 3023 11175 19705 16047 5370
10400 5370 509 2329 2441 -2049 2518 7846 10917 6111 3966 2184 627 3626 1919 -9349 -5887
10385 -5887 4424 9637 7795 3195 1963 8241 4329 7768 2518 -4816 3202 1190 -1657 4957
10371 4957 1136 2842 2817 4069 5977 2421 933 14846 20686 23070 19014 15102 11785 -3750 -9007
10356 -9007 -6877 4346 8505 1048 -231 863 -1131 2156 10935 1980 -2542 4692 4648 2140 -372
10341 -372 -2406 4554 6238 4658 3730 -2518 -6809 -34 2134 -3208 8359 16458 15051 11778 9579
10326 9579 2745 -2124 -1635 524 1660 5103 2825 -11620 -20546 -15291 -16524 -17388 -13649 -12352 -11688
10311 -11688 -13971 -6718 2488 5560 -3522 -4850 -8571 -11508 -7920 -829 -4573 1365 8647 9135 2441
10296B441L542O335K361k086j062M66N264q99q554m825o810k15j984l582J0287
10281F79P815r346L915J0596j596n710n223l748J223l376o593L065j206l561n297
10266a8363L809K141Q762O458p007L706J103P383M680J191P11j854j0157m037
10252a474m071Q751K432l140k289M63N503K738J072J066j0908o42l413K564p18
10237b066M100L018R79R319M730m499n669m91J047l919Q529R71J381J016n40n758
10221A2148J217p88J0692m509J950J0122K518j3686J279N234k588J006j251R194
10207C2538k655j985n981J112J4582q80q989J7207J1325J2649R067L6339M1556
10194A55885M5532N5320M6886K8424J5901L4470M605n8886n0051l3876l5775m4512
$$ plain form
10296 2441 5983 12318 14679 12593 11531 11997 17261 16362 7808 2983 -3827 -4042 -6026 -9608 679
10281 679 8494 -852 3063 13659 12063 6353 1130 -2618 -1395 -4771 -11364 -8299 -9505 -13066 -18363
10266 -18363 -14554 -12413 -3651 2807 -4200 -494 609 7992 12672 13863 14574 12720 2563 -1474
10252 -1474 -5545 3206 5638 2498 209 672 6175 8913 9985 11051 143 -499 -3912 -1348 -2066
10237 -2066 2034 5052 6031 15350 20080 15581 9912 9421 10468 6549 15078 16049 17430 18446 17906 12148
10221 12148 13365 12577 23269 18760 20710 30832 33350 19664 20943 26177 23589 24595 23344 32538
10207 32538 29883 27898 21917 23029 37611 36731 27742 44949 56274 68923 77990 114329 155885
10194 155885 201417 256737 303623 332047 347948 382418 387023 328137 278086 244210 208435 163923
10182A63923n5218l2802j5642j1672l007j3360p975L869M099q609J356n813j985
10169A7164L652J215m136p374p66J226L728k123l788l995M109O170k243P294N333
10154B5466p506o134j18k630p308N171P684N90K18K013R643n989o702j517O37
10139A3518j489j1992m512K684P518p079p376P052O08J034K012J871K57O09J16
10124D831N830l366k226Q84j132l741l537k40J2542N593m722L921p89k532N946
10109A7262K497k95P27l921k328J083j282q714l174k420l6P741M74k410q9l355
10093A760O734M06N641r59k064K830l052K926L624Q812J902r956o987m961k560
10078D096R858P896o510n993j236n05L127k383j328J365p225n344k864n682Q922
$$ plain form
10182 163923 108705 75903 60261 48589 45582 32222 24247 28116 32215 23606 24962 19149 17164
10169 17164 20816 22031 17895 10521 9755 10981 14709 12586 8798 4803 8912 15082 12839 20133 25466
10154 25466 17960 11826 11708 9078 1770 6941 14625 15215 15433 17446 27089 21100 14398 12881 13518
10139 13518 12029 37 -4475 -1791 5727 -1352 -8728 -1676 -1068 -34 1978 3849 4106 4715 4831
10124 4831 10661 7295 5069 5953 4821 1080 -2457 -2697 9845 15438 10716 14637 13848 11316 17262
10109 17262 19759 19464 20191 16270 13942 15025 13743 5029 1855 -565 -601 7140 7614 5204 5115 1760
10093 1760 8494 8900 14541 13582 11518 14348 11296 14222 17846 26658 28560 18604 11617 6656 4096
10078 4096 13954 21850 15340 9347 8111 7606 10733 8350 7022 8387 1162 -4182 -7046 -12728 -3806
10063c806M863o351Q972Q595K340o753j221o01k878p777J066M699o518N238Q13
10048F81l397j0858l337J2936J2571J0285M165m136j6324M209J8839q206n610
10035A1818M258J179n953j86l416n467N604j137N289K493K635j656p641J457J5800
10020B5077l996n649J100n497P384L081p102o624J244j490J0902K752m254j51
10006A6777m296m562K121n28m419j033m535k397N549J4415J461m911k619p288
9992C735k113M256l70R084J952o214m486j155k823j470M273J490J439K30O288
9977A4116M893m540k658J483p003m049R012P284N408r90m460n428K442N62k487
9962A3585l251n591k126N881J1866j623j039J1818k637p234K884N789l814l24
$$ plain form
10063 -3806 1057 -5294 3678 12273 14613 7860 6639 6038 3160 -4617 -3551 1148 -5370 -132 681
10048 681 -2716 -13574 -16911 -3975 8596 18881 23046 18910 2586 6795 25634 17428 11818
10035 11818 16076 17255 11302 11116 7700 2233 7837 6700 11989 14482 17117 15461 7820 9277 25077
10020 25077 21081 15432 16532 11035 18419 21500 14398 7774 9018 7528 18430 21182 16928 16777
10006 16777 12481 7919 10040 9512 5093 4060 -475 -2872 2677 17092 18553 13642 11023 3735
9992 3735 1622 5878 5508 14592 16544 10330 5844 4689 1866 396 4669 6159 7598 7828 14116
9977 14116 19009 14469 11811 13294 6291 2242 11254 18538 23946 22956 18496 13068 15510 16072 13585
9962 13585 10334 4743 2617 8498 20364 18741 17702 29520 26883 19649 22533 28322 24508 24184
9948B4184J2057J14j0360J84j115k333k004r877L073M896P007P955n082j4340
9934A4359p395R748J0593N578m082o813r713p541M96K922l146m02j441K398L930
9919I491K077P71L571n43l811L393K588p06J0437J15j290K235l390K757k111Q99
9903B6483k253n664K515m832j506K732K776K504J393J550O387j70m691M669L175
9888C5068N133n088j138L288L340P769j664j661N176Q588j351l053N481J3298
9874G3186N243j99l778n219j409j4521m777j041m425l807j043N24M355n463m873
9859C2753M176M901M936L311K389J4129J7271q813j0025o573M645l77k966N56
9845F0313J145J0565R660J5265P545L277M242Q111K953J5945J2817L3436M7980
$$ plain form
9948 24184 36241 36355 25995 26179 25064 22731 20727 10850 13923 18819 25826 33781 28699 14359
9934 14359 6964 16712 27305 32883 28801 21988 12275 4734 5230 8152 5006 4604 3163 5561 9491
9919 9491 11568 12339 15910 15367 11556 14949 17537 16831 27268 27383 26093 28328 24938 27695 25584 26483
9903 26483 24230 18566 21081 16249 14743 17475 20251 22755 24148 25698 32085 31915 27224 31893 35068
9888 35068 40201 35113 33975 37263 40603 48372 46708 45047 50223 58811 57460 54407 59888 73186
9874 73186 78429 78230 74452 69233 67824 53303 48526 47485 43060 39253 38210 38734 43089 37626 32753
9859 32753 36929 41830 46766 50077 52466 66595 83866 75053 65028 58455 63100 62723 59757 60313
9845 60313 61458 72023 81683 96948 104493 107770 112012 120123 123076 139021 151838 185274 233254
9832B33254N3614O3111P8934R6860R3868J5791j11355j48870r7354n9293l2178
9821A86382j0320q145j5790J366R550m967j346L064j078J104J286O716N440J713
9807A74975Q004L651j090R382M066O393J0566M075k87N94N820J5987J4291J3511
9793B69938J2129J3548P743R85J2838J3412J1270M173P624J8000J5066O174K0963
9780D13863J9736K5336K3544J9550K1633K2148K3305K6250J6903L4591L6728K3742
9768G07329K9640L9794L5939L5288K8948L1701L9532M8922O0861N1132N1791O1510
9756A222387O5367O0720O0522N9524P7628Q7617Q1736O4345R2667R0505R3273
9745B056291J04333R8162J06597J12894J17481J14279J21007J27845J24501J19556
$$ plain form
9832 233254 286868 349979 428913 525773 619641 635432 524077 375207 277853 218560 186382
9821 186382 176062 167917 152127 153493 163043 158076 156730 159794 158716 159820 161106 167822 173262 174975
9807 174975 182979 186630 185540 194922 198988 205381 215947 220022 219735 220329 226149 242136 256427 269938
9793 269938 282067 295615 303358 304343 317181 330593 341863 346036 353660 371660 386726 392900 413863
9780 413863 433599 458935 482479 502029 523662 545810 569115 595365 612268 646859 683587 707329
9768 707329 736969 776763 812702 847990 876938 908639 948171 997093 1057954 1109086 1160877 1222387
9756 1222387 1287754 1348474 1408996 1468520 1546148 1633765 1715501 1779846 1872513 1963018 2056291
9745 2056291 2160624 2258786 2365383 2478277 2595758 2710037 2831044 2958889 3083390 3202946
9735C202946J34605J49109J53275J53287J48237J50943J59243J67731J79626J82647
9725D781649J79168J78394J79388J85922J76930J72195J72028J69490J60143J46827
9715F502134J36539J26981J09903R0143O3252L0307J5826j1889m2062o5379q3816
9704F871939j07917j29423j51984j58956j67616j69655j70619j84743j93192j84494
9694E253340j90762j92394j79134j68251j64361j65798j61513j55736j48808j48418
9684C578165j43326j23127j31482j34030j22886j09482j08724j08090j04247j00775
9674B391996r7744q2755p8080p4441r1201q1399p4058p6342q0532p1055o2666
9663A521723o0537o6102n9507n5785m9587n0886m7786m0411m3130l7909l1941
$$ plain form
9735 3202946 3337551 3486660 3639935 3793222 3941459 4092402 4251645 4419376 4599002 4781649
9725 4781649 4960817 5139211 5318599 5504521 5681451 5853646 6025674 6195164 6355307 6502134
9715 6502134 6638673 6765654 6875557 6965700 7028952 7059259 7075085 7063196 7021134 6955755 6871939
9704 6871939 6764022 6634599 6482615 6323659 6156043 5986388 5815769 5631026 5437834 5253340
9694 5253340 5062578 4870184 4691050 4522799 4358438 4192640 4031127 3875391 3726583 3578165
9684 3578165 3434839 3311712 3180230 3046200 2923314 2813832 2705108 2597018 2492771 2391996
9674 2391996 2294252 2211497 2133417 2058976 1967775 1886376 1812318 1735976 1655444 1584389 1521723
9663 1521723 1461186 1395084 1335577 1279792 1230205 1179319 1131533 1091122 1047992 1010083 978142
9652I78142m1007m3428l6115k8605l3497l3967k8895j3586k4395k4191k8135k1155
9640F21166k6710k9785k4989j2827j1290r260j3213j1850j1919j4643j1000k0755
9628D22925n934n032j4444j3057j4777J550j184j9112j6546j4821p093Q149p16
9615C19908j1319n145o480k118l610J88l029j6536k049O716j0756r201p356k605
9601B46608o89n082r975J313j925r143J87k10n543m051j2212l989m224m476J4870
9586B01459N903q077L074P85p819l752L568P569k964L211L040k465n181p870k033
9571A88448J394o238q354J2132J989k867j011J264l375p08l318o311o720l14q48
9556A65163l996j295l344m695M984L642m787m226L557P91j2135k898J2881P998
$$ plain form
9652 978142 937135 893707 857592 828987 795490 761523 732628 719042 694647 670456 642321 621166
9640 621166 594456 564671 539682 526855 515565 506305 493092 481242 469323 454680 443680 422925
9628 422925 416991 411959 397515 384458 369681 371231 370047 350935 334389 319568 312475 320624 319908
9615 319908 308589 303444 296964 294846 291236 291424 288395 271859 269810 276526 265770 256569 249213 246608
9601 246608 245919 240837 230862 232175 230250 221107 221294 221084 215541 211490 199278 195289 191065 186589 201459
9586 201459 207362 199285 202359 203144 195325 191573 195141 202710 199746 202957 205997 203532 198351 190481 188448
9571 188448 189842 183604 175250 187382 189371 186504 185493 186757 183382 182674 179356 173045 166325 166011 165163
9556 165163 161167 159872 156528 151833 156817 160459 155672 151446 155003 155794 143659 140761 153642 161640
9542A61640m135r884j528L488k006m548N748n205j885l09O112J256J633j569m244
9527A44564l321o0L560L888m156L984J2650j544j119O132k898k995K544m02j0490
9512A50337k858K678N21Q827R026j411m200M58k076m07l621k420O765n900M618
9497A60337J2001l028J0p131j930Q884K863l249J375J0576l125q568n957J010
9483A64068K160L637L763M272M968L607J114o103o726M394J0291M862J842L28
9469A96477j473m309M924O148O961J1511M718m16p31m556k920J613R025J2869
9455B39841M077N218m210K228L979k810L38r7j326K655K158L176M330O046Q420
9440B74023R530L629M605J0337L319R30N314J4740M243K177J288R574R354J182
$$ plain form
9542 161640 157505 147621 146093 149581 147575 143027 148775 143570 141685 141376 147488 148744 150377 148808 144564
9527 144564 141243 141183 144743 148631 144475 148459 161109 159565 158446 164578 161680 158685 161229 160827 150337
9512 150337 147479 150157 150678 159505 168531 167120 162920 163378 161302 160895 157274 154854 161619 155719 160337
9497 160337 172338 169310 169320 162189 160259 169143 172006 168757 170132 180708 177583 169015 163058 164068
9483 164068 166228 169865 173628 177900 182868 186475 187589 181486 174760 179154 189445 194307 196149 196477
9469 196477 195004 190695 195619 201767 208728 220239 224957 224541 223810 219254 216334 217947 226972 239841
9455 239841 243918 249136 244926 247154 251133 248323 248661 248564 247238 249893 252051 255227 259557 265603 274023
9440 274023 283553 287182 291787 302124 305443 306373 311687 326427 330670 332847 334135 343709 353063 354245
9426C54245L037P178J0588J6349O344p453L18J0951P586J0120P213J0218O419
9413D43113K3573J3054J6597L1408L5889L4397M4390L8838m860l6018m0929k1919
9401E77533j1682r035k673O68R549J3585J1440J7897M566J462P001m807m105J1305
9387F22704R267p663j192l248j921J500K792J598p575j664k027j071j388o000
9373F04112r931r800L038j40n608j4376p372Q84k42n731N906j3049j2342N337
9359E40686m030k910P039L377O395J0035J2370J6911K8849K7845L2361L6307O0611
9346G75846P9898R8514J09349J13222J16018J06631Q4633N3574P680n2183r1347
9335A401835j13654j26366j40686j39428j33048j16479q8257o7712n1761l7023
$$ plain form
9426 354245 357282 364460 375048 391397 397741 390288 390606 401557 409143 419263 426476 436694 443113
9413 443113 466686 479740 496337 527745 563634 598031 642421 681259 676399 640381 599452 577533
9401 577533 565851 556816 554143 554811 564360 577945 589385 607282 611848 613310 620311 615504 611399 622704
9387 622704 631971 624308 623116 619868 617947 619447 622239 623837 616262 614598 612571 611500 610112 604112
9373 604112 594181 584381 587419 587279 581671 567295 559923 560807 560565 554834 560740 547691 535349 540686
9359 540686 536656 533746 540785 544162 550557 560592 572962 589873 618722 646567 678928 715235 775846
9346 775846 855744 954258 1063607 1176829 1292847 1399478 1484111 1537685 1545365 1493182 1401835
9335 1401835 1288181 1161815 1021129 881701 748653 632174 543917 476205 424444 387421
9325C87421k9640l1270k2966j4855j9474k1116j9892q768p930J988j942q876j2983
9312A89697j4703n557m091j1512k227p754p351o407J68L774j365K075P02j4471
9298A20978o947m12M368o754q608k612N518M241o308n01j933p923J044J378P826
9283A03355l453r128p031P303N800O058P987p675p560n114j298q851M49J077J86
9268H2105J819Q432j659r587J056Q509k33J620Q494R19K302j389L005n816J025
9253A00602k515j4421q688q907j7333n392J0974J0519l99k755m908o465P386l458
9239E4240K502J6592K638M711K047l00j141n678j6806q508o870l455P03o381p875
9224B6419j192P509Q008K375Q733M969p799j2600O464J6433P909P764p32o097
$$ plain form
9325 387421 357781 326511 303545 288690 269216 248100 228208 219440 211510 213498 211556 202680 189697
9312 189697 174994 169437 165346 153834 151607 143853 136502 130095 130263 134037 132672 134747 135449 120978
9298 120978 114031 113619 117987 111233 102625 100013 105531 109772 103464 102963 101030 93107 94151 95529 103355
9283 103355 99902 90774 83743 91046 96846 102904 110891 103216 95656 90542 89244 80393 80842 81919 82105
9268 82105 83924 92356 90697 81110 82166 90675 90442 92062 100556 101475 103777 102388 105393 99577 100602
9253 100602 98087 83666 74978 66071 48738 43346 54320 64839 64440 61685 56777 50312 57698 54240
9239 54240 56742 73334 75972 80683 82730 82430 81289 75611 58805 50297 43427 39972 40675 34294 26419
9224 26419 25227 32736 40744 43119 51852 56821 49022 36422 42886 59319 67228 74992 74260 68163
9210F8163Q21R08K495R756N924l775Q202R19J74J9467K8679K8314K5208J5756
9196B11011O440K4649K3816j772j419j1922j1772q678k7118l5685k9595j1484
9184A26471K805j4297j0112R349J9577P116J548l708j4566j4934j5820j9699q069
9171F5661l187P841R616j07J164P183J2021O968M42n115k332J0796n053j8310
9157H7588p285q168j0512k404p072o996M228K404m808r971p644m814m214k387
9143A7945J3491R132N107M336q131j1549j5173j1141j7572k1143k9416j8721j1504
9130i4339K1684Q2272R0076N9783N988k3259l2693k3149j4810k1301j4597P946
9118D3601J4085J2203M156l26k571m709K516o159q464r016J4406N780k858J425
$$ plain form
9210 68163 68984 69892 72387 82143 88067 84292 92494 93413 93587 113054 141733 170047 195255 211011
9196 211011 217451 242100 265916 264144 262725 250803 239031 230353 203235 167550 137955 126471
9184 126471 129276 114979 104867 114216 133793 140909 142457 138749 124183 109249 93429 73730 65661
9171 65661 62474 70315 79931 79824 80988 88171 100192 107160 107602 102487 100155 110951 105898 87588
9157 87588 80303 72135 61623 59219 52147 45151 49379 51783 46975 37004 29360 24546 20332 17945
9143 17945 31436 40568 45675 50011 41880 30331 15158 4017 -13555 -34698 -64114 -82835 -94339
9130 -94339 -72655 9617 99693 159476 165464 142205 109512 86363 71553 50252 35655 43601
9118 43601 57686 69889 74045 73719 71148 66439 68955 62796 54332 45316 59722 65502 62644 64069
9104F4069l816k603L984L136K199Q553J1321K160j2055p478J2967K5217K8048
9091A35702K0821Q375k455n615j8987j7143k912m265O880N702p904k601o826j0390
9077I8382j7270j7434j2527j8210k2076k5345j6287k4022j4559L2341P7649J15726
9065A56368J32726Q3622K6629P349J1445l888j3105j9189j1373j2154j5472j514
9053C41444K349O569l365p320o775K244N555j493J449N296J5682J5543J0604J9429
9039D07211K1785J3677R143J3003J6028l269K508K4230K7478L3217K9562K9642
9027F24215J3762J9798Q410m929m249N611L7388L5575K9095K3860J3667J414m668
9014G98949J2351L3146J5799K319j0644L939K9029M6596M1197L5543N8160N4702
$$ plain form
9104 64069 60253 57650 61634 64770 66969 75522 86843 89003 76948 69470 82437 107654 135702
9091 135702 156523 164898 162443 156828 137841 120698 117786 113521 120401 126103 118199 115598 108772 98382
9077 98382 81112 63678 51151 32941 10865 -14480 -30767 -54789 -69348 -37007 40642 156368
9065 156368 289094 372716 399345 406694 418139 414251 401146 381957 370584 358430 342958 341444
9053 341444 343793 350362 346997 339677 332902 335146 340701 339208 340657 345953 361635 377178 387782 407211
9039 407211 428996 442673 451816 464819 480847 477578 480086 504316 531794 565011 594573 624215
9027 624215 637977 657775 666185 661256 657007 662618 700006 735581 764676 788536 802203 803617 798949
9014 798949 811300 844446 860245 862564 851920 855859 884888 931484 972681 1008224 1066384 1121086
9002A121086M3783M9338M0196M0702N6655N3275M5912M3044L6402K7665L8326
8991A596384N9313Q3171J17591J07600R0219R0158R7049J01349J11325J25442
8981B579601J38848J53841J63045J90453K52605K93136L03395L07964L25800L47393
8971E056081L89573M46829N09305N58429O13549O95397Q38459R96086J167748
8962A1271456J359086J569545J797960K103016K457238K800745L110356L391892
8954B9861294L721322M214917M863653N430154O192606P967855J1065860J5763488
8946H9081149K3011922L2985758M2155745M5927475M8672550N7840330M7433360
8939C87108289j5452902p6826483q5285239o3998850m2229890k7260361j7957806
$$ plain form
9002 1121086 1164869 1214207 1254403 1295105 1351760 1405035 1450947 1493991 1530393 1558058 1596384
8991 1596384 1655697 1738868 1856459 1964059 2054278 2144436 2241485 2342834 2454159 2579601
8981 2579601 2718449 2872290 3035335 3225788 3478393 3771529 4074924 4382888 4708688 5056081
8971 5056081 5445654 5892483 6401788 6960217 7573766 8269163 9107622 10103708 11271456
8962 11271456 12630542 14200087 15998047 18101063 20558301 23359046 26469402 29861294
8954 29861294 33582616 37797533 42661186 48091340 54283946 62251801 73317661 89081149
8946 89081149 112093071 145078829 187234574 233162049 281834599 339674929 387108289
8939 387108289 371655387 294828904 209543665 145544815 103314925 76054564 58096758
8932E8096758j2198147q449266n966099m330090l232344k458508k039660k107603
8924A7315041k241971k034499j652039j293392j067109r32873q14002o88652n91538
8915E998966n19178m44247m13857l97259l53683k78785k27507k05710k00701j88851
8905B769188j51333j32844j09716q0819o8436q7124j12372j13524j15392j06231
8895A691397q7562p8361p0128o8153n9268l2332k0520k8283o1077p6617p1856
8884A037240m6559l0385j9676k1188k1447j1383q063j5603K965K0235K1605J8768
8872I26509N777m818j2184l688L172P012L1176P4217J35168K12608K96064L65723
8860B036736M13009N43538O10828N0045p17639q64572o05875l73835k26579j28831
$$ plain form
8932 58096758 45898611 37449345 31483246 27153156 23920812 21462304 19422644 17315041
8924 17315041 15073070 13038571 11386532 10093140 9026031 8093158 7279156 6590504 5998966
8915 5998966 5479788 5035541 4621684 4224425 3870742 3591957 3364450 3158740 2958039 2769188
8905 2769188 2617855 2485011 2375295 2294476 2226040 2138916 2026544 1913020 1797628 1691397
8895 1691397 1603835 1525474 1455346 1387193 1327925 1295593 1275073 1246790 1185713 1109096 1037240
8884 1037240 990681 960296 940620 919432 897985 886602 878539 862936 865901 886136 907741 926509
8872 926509 932286 927468 915284 911596 914768 921780 952956 1027173 1162341 1374949 1671013 2036736
8860 2036736 2449745 2993283 3604111 3654156 2936517 2071945 1466070 1092235 865656 736825
8850G36825p6028n0136l3900j4956k1050k9023k1468k2325k5781j2811r469n667
8838D14211p545j7685j5943j2789k1318k0542O23q416j8888k1281k2056p735r621
8825B31015k6691l2395j2679j3553j9114k1634k8527m4005m566O9485N9284N8405
8813B15025J03541J14699Q2359M0085r987l1745n2841m8124l0303k0479k4367
8802C37863k4508j7083j0881n615r440m718j0043n565r823j0353n165o730n731
8789B12208r023J903J6664J6101K7287J3018N918R9m507j5653j1396J867j6293
8776B38193r437j1295p230L368R53r469j602j567N07R884o098j1970m493J697
8762A91441M908M898M347q730j3449k5594l3776j8928P24J2927K1439L8991N4538
$$ plain form
8850 736825 660797 610661 576761 561805 540755 511732 490264 467939 442158 429347 419878 414211
8838 414211 406666 388981 373038 360249 338931 318389 319012 310596 291708 270427 248371 240636 231015
8825 231015 204324 171929 159250 145697 126583 104949 76422 32417 27851 97336 156620 215025
8813 215025 318566 433265 515624 555709 545722 513977 461136 413012 382709 362230 337863
8802 337863 313355 296272 285391 279776 270336 265618 255575 250010 240187 229834 224669 217939 212208
8789 212208 203185 205088 221752 237853 265140 278158 284076 284175 279668 264015 252619 254486 238193
8776 238193 228756 217461 210231 213599 214552 205083 203481 201914 202421 212305 206207 194237 189744 191441
8762 191441 196349 201247 205594 196864 183415 157821 124045 105117 105841 118768 140207 179198 233736
8749B33736M3070L1272R416k0135l0604k9235l0904j6984j3380j0444Q109O948
8737A80865K978n006q031p462K322j058J314p960o341j1460j6844q220M9p874
8723A07272j1093j4036j6166k167k766q084n89Q540J2782J0265M629L418P776
8710I9781m46j867k308n909m148m849j0189q876p616K285P482R142P799K439P120
8695H9840N946k834Q891J893j859L345L543P140K695q739j3405J971p464j1847
8681G9116j6820m290l614N952Q419J057m158L799R732K813k310J707n315o71Q564
8666H3981K089M144M846j081m531P79o41K61J3036m319j377M135n668o833n863
8651H2958l645o119l962l08q47p285l084N833Q515K798L537r962q064O764J0293
$$ plain form
8749 233736 276806 308078 317494 297359 266755 237520 206616 189632 176252 165808 173917 180865
8737 180865 183843 178837 170806 163344 165666 164608 165922 157962 151621 140161 123317 115097 115146 107272
8723 107272 96179 82143 65977 63810 61044 52960 52371 60911 73693 83958 88587 92005 99781
8710 99781 99335 97468 95160 89251 85103 80254 70065 61189 53573 55858 63340 72482 80281 82720 89840
8695 89840 95786 92952 101843 103736 101877 105222 108765 115905 118600 109861 96456 98427 90963 79116
8681 79116 62296 58006 54392 60344 68763 69820 65662 69461 79193 82006 79696 81403 76088 75417 83981
8666 83981 86070 90214 95060 93979 89448 90227 89586 89847 102883 98564 97187 101322 95654 88821 82958
8651 82958 79313 73194 69232 68924 68077 60792 57708 63541 72056 74854 78391 68429 60365 67129 77422
8636G7422K738K972R429K4462K5154K5815K2489J8524p53m3360n0485l4390k1523
8623E8494Q88N581n861J438L666R538J936O50J66r444m635m327L56P479M967k716
8607F8176K881J453p979p86J0970O56L976J3625K768P824M619Q940j760m366J3961
8592A24958J0065J7627K2305J0770K3855M2538N0786M2953O7304O2584m2684q1173
8580C51888n2212k6488q805m267j5056r168q573j2712k2934j9347j8362j8144
8568A35820j6695n004K880M792J44q831k746P944j446M644J0180J4996K2556J3953
8554A83187K8406K2477J5272K4366K8898L5917M0869M9629N6641O9422R1937J06049
8542G53070J31601J44027J31450J31440J11663M0387k9975p2311j02852j31415
$$ plain form
8636 77422 80160 83132 92561 117023 142177 167992 190481 209005 208252 164892 114407 80017 58494
8623 58494 59382 64963 59102 60540 64206 73744 75680 76330 76496 67052 62417 58090 58446 65925 70892 68176
8607 68176 71057 72510 64531 63745 74715 75371 79347 92972 95740 103564 108183 117123 115363 110997 124958
8592 124958 135023 152650 174955 185725 209580 252118 302904 345857 413161 475745 433061 351888
8580 351888 299676 273188 264383 260116 245060 235892 227319 214607 191673 172326 153964 135820
8568 135820 119125 114121 117001 121793 121937 113106 110360 118304 116858 121502 131682 146678 169234 183187
8554 183187 211593 234070 249342 273708 302606 338523 379392 429021 485662 555084 647021 753070
8542 753070 884671 1028698 1160148 1291588 1403251 1443638 1413663 1341352 1238500 1107085
8532A107085j43654j47397j26579j15241j04011p5670o3171n3973m7890l0560
8522A98939j9876k6842j9307p533m022j6319k529m651o842o852k397N24j7598
8509F4695j8722j58M490N931k203j4693J218O33l430j591k989o336J723r825l360
8494A5383K25L17J539M149J578p245k440k437J084M275R035O050o078r851m668
8479A0916k5029l0569k3332k0282l0688k1315R142K7471L1279K7318K3342K0834
8467i13J1583P876p409K977K892r29K821Q702O618l053O960n24m045l798j2674
8452A7084P999j37p612m51M850L969l374n344o030M799K683j627O224Q309L244
8437C4586p967j937N891P516p089j1301m360P518Q127j0704j1030K063J1751N869
$$ plain form
8532 1107085 963431 816034 689455 574214 470203 394533 331362 277389 229499 198939
8522 198939 179063 152221 132914 125381 121359 105040 102511 97860 91018 84166 81769 82293 64695
8509 64695 45973 45815 50305 56236 54033 39340 40558 41191 37761 36170 33181 26845 28568 18743 15383
8494 15383 15608 15925 17464 21613 23191 15946 13506 11069 12153 16428 25463 31513 25435 15584 10916
8479 10916 -14113 -44682 -68014 -88296 -118984 -140299 -131157 -103686 -72407 -45089 -21747 -913
8467 -913 10670 18546 11137 14114 17006 16077 18898 27600 34218 31165 38125 37601 33556 29758 17084
8452 17084 25083 24946 17334 16883 21733 25702 22328 16984 10954 15753 18436 16809 23033 31342 34586
8437 34586 26619 24682 30573 38089 31000 19699 15339 22857 30984 20280 9250 11313 23064 28933
8423B8933j187M243r996n810L332q6Q014m862J821J641M988L483j0276m298M708
8408B4648L357q027J776R190J0871J322n049k119j114Q87r1j2568K326K156M611
8393C2176l558m481K240l589R3p805p642l38j095M567M294n251M686K716j036
8378A5977N825J982l320p639m706m375R044O126j317P618J1273p966n203m69l627
8363A9223J2094P852p856m303Q81n033O296o74m781o079M813k143P984M561L322
8348C6157J668p111r769O499L308J333n420j4904n915J779K333Q633L088o849
8334A4830o642P161O57R54K96q53J31k250n116j422R635n937L700j771j823j729
8318I821l960m072N070J773p3L22m698N300o26J210L569L817M151L576j085l729
$$ plain form
8423 28933 27746 31989 21993 16183 19515 19429 27443 22581 24402 26043 31031 34514 24238 19940 24648
8408 24648 28005 19978 21754 30944 41815 43137 38088 35969 34855 35742 35651 23083 25409 27565 32176
8393 32176 28618 24137 26377 22788 22881 15076 7434 7096 6001 10568 14862 9611 14297 17013 15977
8378 15977 21802 23784 20464 12825 8119 3744 12788 18914 17597 25215 36488 28522 23319 22850 19223
8363 19223 31317 39169 31313 27010 27891 22858 29154 28480 23699 17620 22433 20290 28274 32835 36157
8348 36157 37825 30714 20945 27444 30752 32085 26665 11761 5846 7625 9958 18591 21679 14830
8334 14830 8188 15349 16006 16960 17256 16403 16534 14284 9168 7746 17381 11444 15144 13373 11550 9821
8318 9821 5861 1789 6859 8632 8559 8881 4183 9483 8857 10067 13636 17453 21604 25180 24095 20366
8302B0366m672n335K401L951m136J0584N799l485p225q190n772M309m417o387
8288b209R922k512j100P152n71j0081o446K739N840Q186l990k651o665N394O107
8273I115K371J214m901j705p638j365Q434P893K862M655J54N344o385j5811k877
8258A360K709N89K724L875O660L6l044N242n148l618P553R507J946P192o28j1956
8242B4999K020L018q907q996j0293q314r56N145M533L71N139Q715o696l895M871
8227A0754J1150L389p077q271k87o77P965M884K308j765p466n563N533l872n419
8212E586n630o233K707N528P517K646O429k255m814N018J841j5887k438N818P126
8197A2959L038J36N30n706j926O853P291n704k284p904j825k117p92J1701J2308
$$ plain form
8302 20366 15694 10359 12760 16711 12575 23159 28958 25473 18248 10058 4286 8595 4178 -2209
8288 -2209 7713 5201 4101 11253 10682 601 -5845 -3106 2734 10920 6930 4279 -2386 3008 9115
8273 9115 11486 12700 7799 6094 -1544 -2909 5525 13418 16280 20935 21089 26433 20048 4237 1360
8258 1360 4069 4658 7382 11257 17917 17953 14909 20151 15003 11385 18938 28445 30391 37583 36955 24999
8242 24999 27019 30037 21130 12134 1841 -6473 -7429 -2284 2249 2620 7759 16474 9778 5883 10754
8227 10754 21904 25293 18216 9945 9658 8981 16946 21830 24138 22373 14907 9344 14877 11005 5586
8212 5586 -44 -6277 -3570 1958 9475 12121 18550 16295 11481 16499 18340 2453 15 5833 12959
8197 12959 15997 16133 16663 10957 9031 15884 23175 17471 15187 7283 5458 3341 2549 14250 26558
8182B6558J665j3428n492j785L822l005p255l922K409J605j475n66j779k965n593
8167a1206L511O438k641k648L046P968Q524K157M94j502r434j0906j0057j801
8153a8057R369K634L019K689l300n699J3569J1278R125r344j6637n616k618J0852
8139A264M621m455o511J434R502J1885J2536M781l632l624M910q09k854m738k990
8124B1320k601p488N531Q91L291O726Q045k311j2349k410J049O50L7m075J624
8109A7930r77l93j868k394M359M259l534K847O76o566m947j135L001k272o501
8094B485O859J362n196P114k850o041j22K139l18o936j0119o601L707P981Q488
8079A952J2350m954o316p838J027J390l904j0254l695J1754Q355J0075N506l447
$$ plain form
8182 26558 28223 14795 9303 7518 11340 8335 1080 -2842 -433 1172 -303 -869 -2648 -5613 -11206
8167 -11206 -7695 -1257 -3898 -6546 -3500 4468 12992 15149 15643 14141 4707 -6199 -16256 -18057
8153 -18057 -8688 -6054 -3035 -346 -3646 -9345 4224 15502 24627 15283 -1354 -6970 -9588 1264
8139 1264 5885 1430 -5081 -3647 5855 17740 30276 35057 31425 27801 32711 31902 29048 24310 21320
8124 21320 18719 11231 16762 17653 20944 27670 35715 33404 21055 18645 19694 20344 20381 16306 17930
8109 17930 16953 16560 14692 12298 16657 20916 17382 20229 20905 14339 9392 8257 11258 8986 2485
8094 2485 9344 10706 5510 12624 9774 3733 3611 5750 5432 -1504 -11623 -18224 -14517 -6536 1952
8079 1952 14302 9348 3032 -4806 -3779 -2389 -6293 -16547 -20242 -8488 -133 9942 15448 12001
8065A2001p828J36N420M008n151l935K478j48k102O037k36p06P2N619l628j2573
8049e36M878J2340P878o25j0835k493K604K602O912Q263J820M423m703j5465m644
8034A2419K909L307l463J4467J19k503N177K749j1196j4181K425l736P403L190
8020A9086j427L582o233K948O153M505K91l455M898P10k424r67k380L189r60k816
8004B4700L491L678n887k597J024M826J575k203M644l970K610J1047K352J49M11
7989D5850K97k336L766L197q250Q99M537N105j2629q522k612q53j172J805K927
7974C2009N489q942j2666n713M918m671K767K763l089o729k15N354k38k840Q518
7959A6715R225r425K133J3558K145l378N981l413l029o480n251K529N009M613
$$ plain form
8065 12001 4173 4309 9729 13737 8586 4651 7129 6981 4879 10916 10680 9974 10046 15665 12037 -536
8049 -536 4342 16682 24560 23935 13100 10607 13211 15813 22725 30988 32808 37231 32528 17063 12419
8034 12419 15328 18635 15172 29639 29758 27255 32432 35181 23985 9804 12229 8493 15896 19086
8020 19086 17659 21241 15008 17956 24109 28614 28905 25450 30348 31058 28634 27667 25287 28476 27516 24700
8004 24700 28191 31869 25982 23385 24409 29235 30810 28607 33251 29281 31891 42938 45290 45439 45850
7989 45850 46147 43811 47577 50774 42524 43423 47960 53065 40436 31914 29302 28449 27277 29082 32009
7974 32009 37498 28556 15890 10177 15095 10424 13191 15954 12865 6136 5921 11275 11037 8197 16715
7959 16715 25940 16515 18648 32206 34351 30973 36954 33541 30512 24032 18781 21310 26319 30932
7945C0932p34N287P841k577j3357p783O637m526M590m088P492O572j0222j3810
7931A2254P572P969P267j0596p681K461L80R16j95j302m754j1096O836Q073R626
7916B7730K710p822j5380p784P803J1731J3532r976L973O44o394Q80M027l286
7902B2388q191Q010Q45l816L384l335o365L816q183k833l40N57M772J23p60l964
7886F108L184L140M699n803k523P357K920O517q904j2053m111p78K048L367o84
7871D484m221L503M058n241m886L159P409N649l839O272K601n344k970R303J327
7856B1264L392m419j0055l261O418k338q670m915L1N71n56K20P499P022l094l106
7840F003n088k629L089R122Q217M862l325j7502n673j476k270M709m963J637R406
$$ plain form
7945 30932 30198 35485 43326 40749 27392 19609 26246 21720 26310 22222 29714 36286 26064 12254
7931 12254 19826 27795 35062 24466 16785 19246 19626 20542 20347 19045 14291 3195 10031 18104 27730
7916 27730 30440 22618 7238 -546 7257 18988 32520 22544 26517 27161 20767 21647 25674 22388
7902 22388 14197 22207 23052 19236 22620 19285 12920 16736 8553 5720 5380 5937 10709 10832 10072 6108
7886 6108 9292 12432 17131 11328 8805 16162 19082 25599 16695 4642 531 -247 1801 5168 4484
7871 4484 263 3766 7824 2583 -2303 856 8265 13914 10075 16347 18948 13604 10634 19937 21264
7856 21264 24656 20237 10182 6921 13339 11001 2331 -2584 -2553 -1982 -2538 -2318 5181 12203 9109 6003
7840 6003 915 -1714 1375 10497 18714 23576 20251 2749 -2924 -4400 -6670 -1961 -6924 -5287 4119
7825D119J120N776L288j0479n347K527R296J3884r556m557M106j480q655m438
7811c96j1357p825J2701M843m964L607O030P42N554K571o731n415p0j891M131
7796A530J146J0019M508k02M747M24l056j0893K593M176o637j0488k5Q428N788
7781A2058r04m372k892P87J127j31n380n066J0296L041n296m17n203q492N234
7766e610N633P791L151N125l269p654J0181k328m204K65p070m016J424M775L070
7751G264m059o650m128j108J2849J638j258m013q261p0k64p097L16Q80J021N315
7735g625m595r65O772j499J632O833j57p337L22K431N698M85m831m588j2344n754
7719b5522M478K431n445P772J4516l856p950M403P970o344k935O377M96N125K284
$$ plain form
7825 4119 5239 11015 14303 3824 -1523 1004 10300 24184 14628 10071 14177 12697 4042 -396
7811 -396 -11753 -19578 -6877 -2034 -6998 -3391 2639 3381 8935 11506 4775 -640 -710 -2601 1530
7796 1530 2676 12695 17203 17001 21748 22172 19116 8223 10816 14992 8355 -2133 -2158 6270 12058
7781 12058 11154 6782 3890 4677 5804 5673 293 -4773 5523 8564 3268 2851 -2352 -10844 -5610
7766 -5610 23 7814 10965 16090 12821 5167 15348 13020 8816 9081 2011 -2005 -581 4194 7264
7751 7264 3205 -3445 -7573 -8681 4168 5806 4548 535 -7726 -7796 -8060 -15157 -14841 -13961 -12940 -7625
7735 -7625 -12220 -13185 -6413 -7912 -6280 553 396 -6941 -6619 -4188 1510 1995 -2836 -7424 -19768 -25522
7719 -25522 -21044 -18613 -24058 -16286 -1770 -5626 -13576 -9173 -1203 -7547 -10482 -4105 -3609 1516 3800
7704C800o113j772J3218J210j1896o973L728N054j962K285J192l882O352P687
7690A1928K471j023l859q508m028k718K355J059j123L900L845N62n80L137m008
7675C410l146l531m354M07P197O639q477p833n761j816l271J1746j133n10M005
7660f428k110O738Q33J248p939n88R799J0839L256j176q293j548j3456M0J583
7645g202j499k47o83p745r588J2462Q389Q87M161L991j705j1786L24J3976J1494
7630A5229o191j0830K888M525K984k731K385J1740J821o717k13J276J144L590
7616B0900j0162j4967k939K646j224k721K68M070j87K19K771m629k861Q345J1937
7601A1466L205j1677o665Q272r37j579Q7p382L463N701q088j564k068K060L120
$$ plain form
7704 3800 -2313 -4085 9133 10343 -1553 -8526 -4798 256 -1706 579 1771 -2111 4241 11928
7690 11928 14399 13376 9517 1009 -3019 -5737 -3382 -2323 -3446 454 4299 4861 4281 7418 3410
7675 3410 264 -3267 -7621 -7214 -17 6622 -1855 -9688 -15449 -17265 -20536 -8790 -9923 -10433 -6428
7660 -6428 -8538 -1800 -967 281 -7658 -8246 1553 12392 15648 14472 6179 4631 -8825 -8785 -7202
7645 -7202 -8701 -8948 -9631 -17376 -26964 -14502 -6113 -5226 -1065 2926 1221 -10565 -10241 3735 15229
7630 15229 9038 -1792 1096 5621 8605 5874 8259 19999 21820 15103 14890 16166 17310 20900
7616 20900 10738 -4229 -7168 -4522 -5746 -8467 -8199 -4129 -4316 -4097 -1326 -5955 -8816 -471 11466
7601 11466 14671 2994 -3671 4601 3664 2085 2172 -5210 -1747 3954 -4134 -5698 -7766 -5706 -2586
7586b586p198k446M202Q964N672L212j918K619l871o351k320p65p776O500J0683
7571F621j873j913o871K660Q04q547J854O336L883o261k201M005j3797j383R692
7556f991O989L677n87j1843o876J0587Q155L518l153L256n301r374k862K542O683
7541a580p065O782N004j460n16k330P916M527M177p569j4397m362J194K655P187
7526A63J034q246J348J0394j332p75J339J0572K932q846n601p17J261k345R45
7511B126n235k775j560K365M910o431l046q337M496R722P369Q836o281q985m18
7496c244l57R70P869L488m344L436L415P75p981o201O412j9645p732O220N230
7481a1689P128j689M736O155k248p138J976L137L508L518L684M5o985j4241r802
$$ plain form
7586 -2586 -9784 -12230 -8028 936 6608 9820 7902 10521 6650 299 -2021 -2786 -10562 -4062 6621
7571 6621 4748 2835 -4036 -1376 -572 -9119 -7265 -929 2954 -3307 -5508 -1503 -15300 -16683 -6991
7556 -6991 -2 3675 3088 -8755 -15631 -5044 3111 6629 3476 6732 1431 -7943 -10805 -8263 -1580
7541 -1580 -8645 -1863 3141 1681 1165 -1165 6751 11278 15455 7886 -6511 -10873 -9679 -7024 163
7526 163 1197 -7049 -5701 4693 3361 2586 3925 14497 17429 8583 2982 2265 3526 1181 2126
7511 2126 -3109 -5884 -7444 -5079 -169 -6600 -9646 -17983 -13487 -3765 3604 12440 6159 -2826 -3244
7496 -3244 -3601 -2631 5238 8726 4382 7818 11233 12008 4027 -2174 4238 -15407 -23139 -16919 -11689
7481 -11689 -4561 -6250 -1514 4641 2393 -4745 -2769 368 3876 7394 11078 11123 4138 -10103 -19905
7466a9905l325O721K991M760J1310K525r48p194J043J361j302M344J2096l773
7452A0704m262p992l549M039m9p644j998n516K460nL32O589l149o28m711n275
7436b0654M858N156N451N913J938l814r65L799L113L40r61L399L409L077J707
7421A5766n595q480j828p18r979j2920Q426J1284L751p862J317p75L912K848j084
7406a937l775J3150J5013o153j0013k545N09l886k787j405k00M697K30Q5O497
7391G480j396p31l788j124M073k295k603M003p178j0082M029Q641j235J1394J1253
7376B0441n154j2408J88N97j1733m231o97q279N398R661r6K092Q904K400j824
7361E259l615m146J053P341P64K455J997q058o798k661k926J451R88n59J356L608
$$ plain form
7466 -19905 -23230 -16509 -13518 -8758 2552 5077 4129 -3065 -2022 -661 -1963 2381 14477 10704
7452 10704 6442 -1550 -5099 -1060 -1109 -8753 -10751 -16267 -13807 -13812 -13480 -6891 -10040 -10668 -15379 -20654
7436 -20654 -15796 -10640 -5189 724 2662 -1152 -2117 1682 4795 5135 4174 7573 10982 14059 15766
7421 15766 10171 1691 -137 -855 -10834 -23754 -15328 -4044 -293 -8155 -6838 -7613 -3701 -853 -1937
7406 -1937 -5712 7438 22451 16298 6285 3740 4249 363 -2424 -3829 -4029 668 898 983 7480
7391 7480 6084 5353 1565 441 4514 2219 -384 3619 -3559 -13641 -9612 -971 -2206 9188 20441
7376 20441 15287 2879 3067 3664 -8069 -12300 -12997 -21276 -15878 -6217 -6313 -4221 4683 7083 5259
7361 5259 1644 -2502 -1449 5892 6656 9111 11108 3050 -3748 -6409 -9335 -7884 -6896 -7455 -6099 -2491
7345b491P737K13j280J639K825K622p816k021L344q37l803m223o236K299l121
7330a1149N818Q725k10k482M217J64q635r16M175M140j611l630O780Q35N445k368
7314I298j8351j804J153n023o78J019P44o764J579j227m295L941k987J0828J41
7299a2426K829M147l907J1542P333o981j411o111p137J904j461R060O403m035
7285b51m268m641L569K274L06k734J432L933N362m330o13J812J719J454n704j159
7269a839k933o746N363J9710L374l626m728j0000k404q598Q553P149j0096O195
7255f26N876j0919m791K361J0099K319K108l346N793n636p791j0371k326N198
7241a2052M356n565L273J0064l601K16l447j901K586R75k939l484L669P062K397
$$ plain form
7345 -2491 5246 5459 4179 5818 8643 11265 3449 1428 4772 3935 132 -4091 -10327 -8028 -11149
7330 -11149 -5331 3394 3184 702 4919 5083 -3552 -4468 -293 3847 2236 -1394 5386 6221 11666 9298
7314 9298 -9053 -10857 -9704 -14727 -15405 -14386 -13642 -20406 -18827 -20054 -24349 -20408 -23395 -12567 -12426
7299 -12426 -9597 -5450 -9357 2185 9518 2537 1126 -4985 -12122 -10218 -11679 -2619 3784 -251
7285 -251 -4519 -9160 -5591 -3317 -3011 -5745 -4313 -380 4982 652 39 1851 3570 5024 -680 -1839
7269 -1839 -4772 -11518 -6155 13555 16929 13303 8575 -1425 -3829 -12427 -3874 3275 -6821 -626
7255 -626 5250 -5669 -10460 -8099 2000 4319 6427 3081 8874 3238 -4553 -14924 -17250 -12052
7241 -12052 -7696 -13261 -9988 76 -3525 -3309 -6756 -8657 -6071 -5096 -8035 -11519 -7850 -788 1609
7226A609n972P85J3318n968r069j706K418J851J0552K32l975j2659j0917j46J2309
7211g338P299K4L819M869l186m456M257J626j0628r244j028k130K441R547J62
7196c966P599j259J419N91k921l459k724J053L79L72K397M994Q900l619l574J400
7180G582l264O70N622m268k694j028l617J955P887K099L160P41k098j3030k66
7165e49l831n363j041k69N657O285J031J110N690J0037l199j0374k927l12J650
7150C595K76n904J277J511J585r562o651J706L787J62n891L572Q391J679j63M759
7134D129o367k857M414o327k730k059k659J002R269M405J2360K642M143p963l195
7119H207m627j005L007k543J503k200N016L541p974L973k067p062j652K062j236
$$ plain form
7226 1609 -4363 -3578 9740 3772 -5297 -7003 -4585 -2734 7818 8050 4075 -8584 -19501 -19647 -7338
7211 -7338 -39 -15 3804 8673 5487 1031 5288 6914 -3714 -12958 -13986 -16116 -13675 -4128 -3966
7196 -3966 3633 2374 3793 4384 1463 -1996 -4720 -3667 -3288 -2916 -519 4475 13375 9756 6182 7582
7180 7582 4318 4988 10610 6342 3648 2620 -997 958 8845 10944 14104 14845 12747 -283 -549
7165 -549 -4380 -9743 -10784 -11053 -5396 889 1920 3030 8720 18757 15558 5184 2257 1945 3595
7150 3595 3871 -2033 -756 755 2340 -7222 -13873 -12167 -8380 -8218 -14109 -10537 -2146 -467 -630 4129
7134 4129 -2238 -5095 -681 -7008 -9738 -11797 -14456 -13454 -4185 220 12580 15222 19365 11402 8207
7119 8207 3580 2575 5582 3039 4542 2342 7358 10899 2925 6898 4831 -2231 -3883 -1821 -3057
7104c057L34J594r03J671M458r737n758J039N363k114r600j563J2850J3047J662
7089I286L09l535q662N217J3158m140J759m470l962j761J1870P743p03k336n468
7074A4305n015j356o463l411l39k772o09L80j316M515J0178j053r553r487l13
7059a2309J170N272q44m172j587K219k988M04P109N71L187L250k803n11l577l645
7043i254N938k520j767N828P258J420o492j1924k20J83K410j35j812R94R861j694
7027a926n524J0004R482K518j4430q207L542K114k781r045l38O305k210J469L751
7012e276m218p852O713J2906n349m367p202O570R314o017l364O701q389n536J2777
6997b589R282l808n540n065O447K8m186j814M088R886J734p501k585j54J597J709
$$ plain form
7104 -3057 -2723 -1129 -2032 -361 4097 -5640 -11398 -10359 -4996 -7110 -16710 -18273 -5423 7624 9286
7089 9286 9595 6060 -2602 2615 15773 11633 13392 8922 4960 3199 15069 22812 22109 19773 14305
7074 14305 9290 7934 1471 -1940 -2279 -5051 -5660 -5280 -6596 -2081 8097 7044 -2509 -11996 -12309
7059 -12309 -11139 -5867 -6711 -10883 -12470 -10251 -13239 -12835 -5726 -5155 -1968 1282 -1521 -2032 -5609 -9254
7043 -9254 -3316 -5836 -7603 -1775 5483 6903 411 -11513 -11733 -11550 -9140 -9275 -11087 -10093 -232 -1926
7027 -1926 -7450 2554 12036 14554 124 -8083 -4541 -2427 -5208 -14253 -14591 -8286 -10496 -9027 -5276
7012 -5276 -9494 -17346 -10633 2273 -3076 -7443 -14645 -8075 1239 -4778 -8142 -1441 -9830 -15366 -2589
6997 -2589 6693 2885 -2655 -7720 -1273 -1245 -5431 -7245 -3157 6729 8463 962 -1623 -1777 -180 1529
6981A529q113k848J998P654N913k450o090n86J1325o06m983O093M638l655L863
6966A3682l671j713p91n459K180K683k19R4j924K772M152M36O595o330p128p986
6950b627K718n254m516O512O265k279L991j101j340p249l459m71K296P682p856
6935f688l475N589J008k184M67Q43M607J140N382k33r31k020m280L626O501J311
6919A0663J021q977K53J2621p357j1004n103m624Q972P413L883m78r754M513M27
6904B469j724K687L10M080O50o015o585K738M64R49M268L705K759m89m602M581
6888A0245k782j597N661J391m071p418j6473j6354R378J007M62Q167P394L04k245
6873f931L825L778m505K025l426j0632K848L101L548P221N437R15J09n051L484
$$ plain form
6981 1529 -6584 -9432 -7434 220 6133 3683 -2407 -2993 8332 7726 2743 8836 13474 9819 13682
6966 13682 10011 8298 7507 2048 4228 6911 6692 6786 4862 7634 11786 12222 18817 12487 5359 -2627
6950 -2627 91 -5163 -9679 -3167 3098 819 4810 3709 2369 -4880 -8339 -8810 -6514 1168 -6688
6935 -6688 -10163 -4574 -3566 -5750 -5283 -4440 167 1307 6689 6456 5525 3505 -775 2851 9352 10663
6919 10663 11684 2707 2960 15581 8224 -2780 -7883 -12507 -3535 3878 7761 7283 -2471 2042 2469
6904 2469 745 3432 3742 7822 8472 2457 -4128 -1390 -926 23 4291 7996 10755 10266 5664 10245
6888 10245 7463 5866 11527 12918 8847 1429 -15044 -31398 -22020 -21013 -20551 -12384 -4990 -4686 -6931
6873 -6931 -3106 672 -3833 -1808 -5234 -15866 -13018 -9917 -6369 852 6289 7204 7313 2262 5746
6858E746j578m562j1026M70N543R875M942o474j3638l12P561j553j6211m747M204
6843b1760L555K181N334K292N83p759J828Q575J105n307M996k27n434o4N380P050
6827B328M442J673J743J863L763P907n559O973o521j5432j942J521K32N206R115
6812A7312P966r086o799j24J1776r95q646j021J585J357k115m702O89j062k466
6797C669R98n77k618J466R044k934j252K388q62l961N330m570q2o939n504L80
6781f024K76J323k60O126O942M17p86m250n585J749J787O154M936O211N101l263
6765B0854j1115k96O711l05k398P52O895J511O069p586k387L36N422K400J401
6750B8264l755l515k777k59P449J004K984J559k533J5465J8782J6952Q789K981
$$ plain form
6858 5746 4168 -394 -11420 -10950 -5407 4468 9410 2936 -10702 -11014 -3453 -5006 -21217 -25964 -21760
6843 -21760 -18205 -16024 -10690 -8398 -7815 -15574 -13746 -5171 -4066 -9373 -4377 -4604 -10038 -10102 -4722 2328
6827 2328 6770 8443 10186 12049 15812 23719 18160 25133 18612 3180 1238 2759 2991 8197 17312
6812 17312 25278 16192 9393 9269 21045 20050 11404 10383 11968 13325 11210 6508 7197 6135 3669
6797 3669 4667 4090 1472 2938 11982 9048 7796 10184 9322 5361 10691 6121 6039 -900 -6404 -6024
6781 -6024 -5748 -4425 -4685 1441 8383 8800 8014 3764 -1821 -72 1715 7869 12805 19016 24117 20854
6765 20854 9739 9443 16154 15849 13451 14203 21098 22609 28678 21092 18705 19041 24463 26863 28264
6750 28264 24509 20994 18217 17958 25407 26411 29395 30954 28421 43886 62668 79620 88409 91390
6736I1390J596O959J3509L5153M2328M3341L1501J879j5994k084O887j8355k2345
6723B15765o748Q374P074J0359K2717J9139L9778M5114O0846O9216P2823J06223
6711F70680J68800K44273L46744M68930N55698N70529N95503O79263K72991p49981
6701C823430j225500r48370n70707l27890k06627j41594r7417n8336m0440l2491
6691A74058k2243j2353p106j5413j9672m064J0545K0365M780Q266Q49J1478m103
6678A45387k5385k6607j6679j7557j5250j0720l765K857L257O086O348P314J1398
6665F6684J3303J7525j1367k6388j8362o047q642q983j8137r759j659m419J1467
6652d784O730J991o360K486N66p660K257M128o286N160J767J063P679N380m541
$$ plain form
6736 91390 92986 99945 113454 148607 190935 234276 265777 267656 251662 249578 256465 238110 215765
6723 215765 209017 217391 224465 234824 257541 276680 316458 361572 422418 491634 564457 670680
6711 670680 839480 1083753 1430497 1899427 2455125 3025654 3621157 4300420 4573411 3823430
6701 3823430 2597930 1649560 1078853 750963 544336 402742 305325 246989 206549 174058
6691 174058 151815 139462 132356 116943 97271 93207 103752 124117 128897 137163 138012 149490 145387
6678 145387 120002 93395 76716 59159 43909 33189 29424 32281 35538 41624 47972 55286 66684
6665 66684 79987 97512 86145 59757 41395 35348 26706 17723 -414 -10173 -11832 -16251 -4784
6652 -4784 1946 3937 -2423 63 629 -7031 -4774 -646 -6932 -1772 -5 1058 8737 14117 9576
6637I576q462j023m113K117j145n442l943q25J0889m250R12J0133R038q54m343
6622H265O82r04j0331o47J7o422K863P244J878j0946k067q88O456J1501l150n940
6606b389L939L540P725o109j1031j1389p66J1844J2799q636o11L752o483m423
6592h238N01O214P95n609o341J962k080l283R202K828l109O017N368n938m848
6577f559P82K29m0o716M39N682l703M709N007o813o015O801Q688M69p629J008
6561c661R865k279m000J142k22n978N551K86J625m62l634Q68n102p409l46j560
6545a5316m029p59k065m5P293O032P67m417N439Q990J984L93k060j2559O772J5146
6529A1566n72j1230n286o690L234Q594K303p044n023l77m729n705R383M408K415
$$ plain form
6637 9576 1114 91 -4022 -1905 -3050 -8492 -12435 -13260 -2371 -6621 -5709 4424 13462 12608 8265
6622 8265 8947 8043 -2288 -2935 -2918 -9340 -6477 767 2645 -8301 -10368 -11256 -4800 6701 3551 -2389
6606 -2389 1550 5090 12815 6706 -4325 -15714 -16480 -4636 8163 -473 -1084 2668 -3815 -8238
6592 -8238 -7737 -1523 -728 -6337 -12678 -10716 -12796 -16079 -6877 -4049 -7158 -1141 4227 -1711 -6559
6577 -6559 -5777 -5548 -5588 -12304 -11865 -6183 -9886 -5177 -170 -6983 -12998 -6197 2491 2960 -4669 -3661
6561 -3661 6204 3925 -75 1067 845 -5133 418 704 2329 1867 -1767 -899 -6001 -13410 -13756 -15316
6545 -15316 -19345 -20104 -22169 -22214 -14921 -8889 -8122 -12539 -7100 1890 3874 4267 2207 -10352 -3580 11566
6529 11566 10994 -236 -5522 -12212 -8978 -384 1919 -5125 -10148 -10525 -15254 -20959 -11576 -7168 -4753
6514d753J822n067j263N991P798n00j63O527J720j3141L63M564K194p915q237
6499a0060Q98O610j841j549p404o459n577J1658O768L464m141n779J746O737K013
6484b916Q557M337j785n010J872q814o700L341O591o771Q72J264M637p986K566
6469e945N260O928J0269m168p639J666J952K170q802k264q015m008P789j571l808
6454a0186R024o548k107O277L483J146j778j335k329k582M24O738L962q260l097
6439g168M762j555j976K342J242R89p452J2870R937J474L094m397m037j738L676
6424A2063o085k583j635l554n656j403J0307P833q463N33J2790r19j3660l914
6410d346L596P585q437j365P646Q856M01o621p972j3019N294R997O931r60L603
$$ plain form
6514 -4753 -2931 -7998 -9261 -3270 4528 4028 3865 10392 12112 -1029 -666 3898 6092 -1823 -10060
6499 -10060 -9162 -2552 -4393 -5942 -13346 -19805 -25382 -13724 -6956 -3492 -7633 -13412 -11666 -4929 -2916
6484 -2916 5641 9978 8193 3183 5055 -3759 -10459 -7118 -527 -7298 -6426 -5162 -525 -8511 -5945
6469 -5945 -685 6243 16512 12344 4705 6371 8323 10493 1691 -573 -8588 -12596 -4807 -6378 -10186
6454 -10186 -1162 -7710 -9817 -3540 -57 1089 -689 -2024 -4353 -6935 -6511 227 4189 -4071 -7168
6439 -7168 -2406 -3961 -5937 -3595 -2353 -1364 -8816 4054 13991 15465 18559 14162 10125 8387 12063
6424 12063 5978 3395 1760 -1794 -7450 -8853 1454 9287 824 1357 14147 13228 -432 -4346
6410 -4346 -750 6835 -1602 -2967 4679 13535 13936 7315 -657 -13676 -8382 1615 8546 7586 11189
6395A1189j429K021m059L99L514m925n283l213n365l002M309M224R05Q175n575
6380A885R783K224k665o340r338m132k678m175K778K253k381K171M952n314P0
6365a0907J0934J0796P165o34o839j172j627l882n416l602J488j88r91J094O697
6350B916j274J017o690p299L866L053j714k348R551j285L107L73l405R087l071
6335E884k740k11P019J3990N464o298o524M917L231k271k205k728m817o393l258
6320C060M945J0294j702k506n731q74o730j312N686J799R556P392L471k337j0291
6305A4720o076n637k427m36P535n699r172J976L102r1O088j638j5996l543P954
6290i340l35M59k267m562K683R213k565K192N472p3j4889K155L166r305j939L978
$$ plain form
6395 11189 9760 11781 7722 8121 11635 6710 1427 -1786 -7151 -10153 -5844 -1620 -715 7460 1885
6380 1885 11668 13892 11227 4887 -4451 -8583 -11261 -15436 -12658 -10405 -12786 -10615 -5663 -10977 -10907
6365 -10907 27 10823 17988 17354 10515 9343 7716 3834 -1582 -5184 -3696 -3884 -4875 -3781 2916
6350 2916 1642 2659 -4031 -11330 -7464 -4411 -6125 -8473 1078 -207 2900 3273 -132 8955 5884
6335 5884 3144 2933 9952 23942 29406 23108 16584 21501 24732 22461 20256 17528 12711 6318 3060
6320 3060 8005 18299 16597 14091 8360 7486 756 -556 5130 6929 16485 23877 27348 25011 14720
6305 14720 8644 3007 580 144 7679 1980 -7192 -5216 -2114 -2205 3883 2245 -13751 -17294 -9340
6290 -9340 -9675 -9216 -11483 -16045 -13362 -4149 -6714 -4522 950 877 -14012 -11857 -8691 -17996 -19935 -15957
6274a5957R182K981m608m417n992j647m523k72L658M091k946j216O03N648Q177
6259g238K509O92J4747j20M42n872j687l331m156O861L674j1040o618m033o370
6244b1540O192L479O223R322N173P552M817o931m440L478j596j3521L377p51j383
6229e49k693p401m998l804J341J8517J866q764j352K394N073l854K213R864J4291
6214B2144l902j4483n047L326m013q521p442O606k63l972q05M007J293K879k631
6199a0824O498J766K966j774N381j257J463K82m12j600j0322j622L132J030k752
6184h045n084N040M101O082K297k548J864L814m825q108J908k425q75J2576O841
6169A2613Q294P352k857k236M371m383j8369m189j681M20R586l363j2794m296
$$ plain form
6274 -15957 -6775 -3794 -8402 -12819 -18811 -20458 -24981 -25253 -21595 -17504 -20450 -21666 -21063 -15415 -7238
6259 -7238 -4729 -4037 10710 10590 11032 5160 3473 142 -4014 2847 6521 -4519 -11137 -15170 -21540
6244 -21540 -15348 -11869 -5646 3676 8849 16401 21218 14287 9847 13325 11729 -1792 1585 834 -549
6229 -549 -3242 -10643 -15641 -19445 -18104 413 2279 -6485 -7837 -5443 -370 -4224 -2011 7853 22144
6214 22144 18242 3759 -1288 2038 -1975 -10496 -17938 -11332 -11595 -15567 -16372 -12365 -11072 -8193 -10824
6199 -10824 -4326 -2560 406 -1368 4013 2756 4219 4501 4089 2489 -7833 -9455 -6323 -5293 -8045
6184 -8045 -13129 -8089 -3988 2094 4391 1843 3707 7521 2696 -5412 -3504 -5929 -6804 5772 12613
6169 12613 20907 28259 25402 23166 27537 23154 4785 596 -1085 -665 8921 5558 -7236 -11532
6155a1532J702M424n542J730J71j740L854L447J700N663q09R436M371r87o647
6140I241j3486j0021Q740P407m241j1650n659l435J0859J2748j3319r456P641
6127a4631J2166M946p276N746Q348l158p766J905j198P110j05m791r703K409O249
6112B51n091M19l735l708k089J2199k267j0772L843R164q58n032k260o14K869
6097g681N425M119l957p601n458Q580N164P559K973j2874o305Q550j370o228M230
6082d874k77l457n480N102R28k159J0129J1961k547l344j3111o937K862K713K573
6067e918l836P077M373K137J796O390l529o112J545K841O29n678o191J109k744
6052f111j3387q705M026M779J1270N929L841L162J181k610R528j0502j2543l339
$$ plain form
6155 -11532 -9830 -5406 -10948 -9218 -9047 -10787 -6933 -3486 -1786 3877 3068 12504 16875 15888 9241
6140 9241 -4245 -14266 -5526 1881 -2360 -14010 -19669 -23104 -12245 503 -12816 -22272 -14631
6127 -14631 -2465 2481 -4795 951 9299 6141 -1625 280 -918 6192 6087 1296 -8407 -5998 251
6112 251 -4840 -4421 -8156 -11864 -13953 -1754 -4021 -14793 -10950 -1786 -2644 -7676 -9936 -10550 -7681
6097 -7681 -2256 1863 -2094 -9695 -15153 -6573 -1409 6150 9123 -3751 -10056 -1506 -2876 -9104 -4874
6082 -4874 -5151 -8608 -14088 -8986 -8058 -10217 -88 11873 9326 5982 -7129 -14066 -11204 -8491 -5918
6067 -5918 -9754 -2677 1696 3833 5629 12019 8490 2378 3923 6764 7393 1715 -4476 -3367 -6111
6052 -6111 -19498 -28203 -24177 -19398 -8128 -2199 1642 4804 5985 3375 12903 2401 -10142 -13481
6038a3481J706L508J118j165K220j093k355J0848M019J533j2599p325Q429K569
6024b068L189l467o362q223J718J563k590M077Q342J174j1773l981J0888Q448
6010I35P150J792q39q28k250o226m518J973K305q280k456O346k650L888O349R234
5994A1925r626o278q290K696N911P744j68n906O169K041j2877q006k182J1150
5980e697N035k390p381M25p034P988J711k275N943P973j247J719J479J505J186
5965H940m559j59J129N634q936J531J239j1622O97M946k006k387M623L065m30
5950A705m392M868n669m829M06O143N872o574o992o552M049M997N094M246M56
5935B828K273J272K441k398n598l923n397l219j1211K634J0707J083Q737L445
$$ plain form
6038 -13481 -11775 -8267 -7149 -8314 -6094 -7187 -9542 1306 5325 6858 -5741 -13066 -4637 -2068
6024 -2068 1121 -2346 -8708 -16931 -15213 -13650 -16240 -12163 -3821 -2647 -14420 -18401 -7513 935
6010 935 8085 9877 9038 8210 5960 -266 -4784 -2811 -506 -8786 -11242 -4896 -7546 -3658 2691 11925
5994 11925 2299 -3979 -12269 -9573 -3662 4082 3914 -1992 4177 6218 -6659 -14665 -16847 -5697
5980 -5697 -662 -3052 -10433 -10008 -17042 -9054 -7343 -9618 -3675 4298 3051 4770 6249 7754 8940
5965 8940 4381 4222 5351 10985 2049 3580 4819 -6803 -6106 -1160 -3166 -5553 -930 2135 1705
5950 1705 -2687 2181 -3488 -8317 -7911 -1768 4104 -2470 -9462 -16014 -11965 -6968 -1874 2372 2828
5935 2828 5101 6373 8814 6416 818 -3105 -8502 -11721 -22932 -20298 -9591 -8508 229 3674
5921C674J321k876o438m599N163P95n118k052K260j243L409M965M613K684l661
5906B897r083j501N742l72l851k926l90j0674P24P728P395p23j827K669K840j768
5890c120J613p708j74M348L049m093N021L972M101l038r520n149N42O363j202
5875d995M843M904J292L973j0122q373K831r2j2J311j2559m452R232J799N720
5860d700M779p36q288R570J4158L553j669k608m021n623L472m471l621K611J581
5845C987Q085k269o049j320m270k702p692l708R054j839L065J130L292J405K02
5830C71l025M333L564L716n226p193l312r76J499N005Q843k480j636l263k599
5815b379r19l652j1136l316J0934N504j672L768J652N404N301J65o53k101o250
$$ plain form
5921 3674 4995 2119 -4319 -8918 -3755 -2960 -8078 -10130 -7870 -9113 -5704 -739 3874 6558 2897
5906 2897 -6186 -7687 -1945 -2317 -6168 -9094 -9484 -20158 -19434 -11706 -4311 -5034 -6861 -4192 -1352 -3120
5890 -3120 -1507 -9215 -9389 -5041 -1992 -6085 -1064 2908 7009 3971 -5549 -10698 -10156 -3793 -4995
5875 -4995 -152 4752 6044 10017 -105 -8478 -5647 -5739 -5751 -4440 -16999 -21451 -12219 -10420 -4700
5860 -4700 79 -657 -8945 625 14783 18336 16667 14059 10038 4415 7887 3416 -205 2406 3987
5845 3987 12072 9803 3754 2434 -1836 -4538 -12230 -15938 -6884 -8723 -5658 -4528 -1236 169 371
5830 371 -2654 1679 5243 8959 3733 -3460 -6772 -7748 -6249 -1244 7599 5119 3483 220 -2379
5815 -2379 -3298 -6950 -18086 -21402 -10468 -4964 -6636 -2868 -1216 4188 9489 9654 9001 6900 650
5800F50q555o345R36J294K582l353l094P195K45k611J050P691n30K140k839j848
5784e392L526k729p78M870j498r671j5551J0646P327k931O797K593o409j20L828
5769e492Q245P628n409q118j0332n649j371J0089P085K580J840K864J0383M271
5755A8614P68l822o813j5137j0073O694N896j756K122L246j109K243q036K163
5741e000K681K45l919o336L39N864L024k200j697j4056k109J906O580N974O514
5726b190O012M335n362j2184J572O284O587j991K240m470o04K360J2528P458J479
5711B4054K652L735j246l627J215j2735j4149Q19m296N180K839m673q571m724
5697a3527J0832N768m631j206n679j990M468J2067R62p221J66L269j620K81L637
$$ plain form
5800 650 -7905 -14250 -13314 -12020 -9438 -12791 -15885 -8690 -8445 -11056 -10006 -2315 -2845 -705 -3544 -5392
5784 -5392 -1866 -4595 -5373 -503 -2001 -11672 -27223 -16577 -9250 -12181 -5384 -2791 -9200 -9320 -5492
5769 -5492 2753 10381 4972 -3146 -13478 -19127 -20498 -10409 -3324 -744 1096 3960 14343 18614
5755 18614 19382 15560 8747 -6390 -16463 -9769 -3873 -5629 -3507 -261 -1370 873 -7163 -5000
5741 -5000 -2319 -2074 -5993 -12329 -11990 -6126 -3102 -5302 -6999 -21055 -23164 -21258 -14678 -8704 -2190
5726 -2190 3822 8157 2795 -9389 -7817 -1533 5054 3063 5303 833 229 2589 15117 22575 24054
5711 24054 26706 30441 29195 25568 26783 14048 -101 718 -3578 1602 4441 -232 -8803 -13527
5697 -13527 -2695 3073 -1558 -2764 -8443 -10433 -5965 6102 7064 -157 9 3278 1658 1939 5576
5682E576M621L2l822J526l816q271q965m035P958J4587O524o653r434j0494J754
5667a2912N951J0771M427k899n367k43o028M0K006L114j318M424J660Q86k519
5652A993l004j092l569R53L514O76o366j314L301M836M208N06j0756R310R166
5637A2362n180p967k194N917L285j425l279L525L425k663l559O58K069m252N896
5622F618K446j802l10m278j4104j29J266P317N354p357j2354O303J3428j0174
5608g776p427K554J2999J068l380P963J738m628L220L01j1272P70q82j2505j415
5593a8672J856O11Q131L826m741k815J1165N366m181k400M144J4157K271q278
5579A0440j0160q228R584L129o469Q065M877o221n689K877o160m163J137N211
$$ plain form
5682 5576 10197 10229 6407 7933 4117 -4154 -13119 -17154 -9196 5391 11915 5262 -4172 -14666 -12912
5667 -12912 -6961 3810 8237 5338 -29 -272 -6300 -6260 -4254 -1140 -2458 1966 3626 4512 1993
5652 1993 -1011 -2103 -5672 -4719 -1205 -529 -6895 -8209 -4908 -72 4136 4642 -6114 3196 12362
5637 12362 7182 -785 -2979 2938 6223 4798 1519 5044 8469 5806 2247 2905 4974 722 6618
5622 6618 9064 7262 6952 2674 -11430 -11559 -10293 -2976 2378 -4979 -17333 -11030 2398 -7776
5608 -7776 -15203 -12649 350 1418 -1962 6001 7739 3111 6331 6632 -4640 -3870 -4752 -17257 -18672
5593 -18672 -16816 -16205 -8074 -4248 -8989 -11804 -639 4727 546 -1854 2290 16447 18718 10440
5579 10440 280 -7948 1636 4765 -1704 6361 11238 5017 -672 2205 -3955 -8118 -6981 -1770
5565a770Q279l080j032O577o707p174q89k38J917J378n737J2896J2449m854n451
5550F564j3122j521k996K490l555P233Q323L606r07l982j0937q050J613M127M9
5535a1065K81L03K989M443l490N009k06m989j775Q628L247r464n529o453m966
5520b3037P92J4146J0412l6O669O859r362k268J0446k752r818m352j1954r017
5506b3272P144o09O139N285K313M414k410J671N04N293j1807r606P137R95r622
5491a6431n414J4814N444j906j5007l893N553R269L334L147o450p500L013N457
5477f570P673q120Q6O729m849l59P372p76o721N605l19m269J46n130P829O569
5461D896P675N942K883k990j4087p968R82r85j472K56J963n587n118k217K485
$$ plain form
5565 -1770 6509 3429 2397 8974 2267 -4907 -5796 -6034 -4117 -2739 -8476 4420 16869 12015 6564
5550 6564 -6558 -8079 -11075 -8585 -12140 -4907 3416 7022 6115 2133 -8804 -16854 -15241 -11114 -11065
5535 -11065 -10784 -10481 -7492 -3049 -6539 -1530 -1736 -6725 -8500 128 3375 -6089 -11618 -18071 -23037
5520 -23037 -22245 -8099 2313 2277 8946 15805 6443 4175 14621 11869 2051 -2301 -14255 -23272
5506 -23272 -16128 -16737 -10598 -5313 -3000 1414 -996 675 1179 6472 -5335 -14941 -7804 -6809 -16431
5491 -16431 -21845 -7031 -1587 -3493 -18500 -22393 -16840 -7571 -4237 -1090 -7540 -15040 -12027 -6570
5477 -6570 1103 -7017 -6931 -202 -5051 -5410 1962 1186 -5535 70 -249 -4518 -4372 -9502 -1673 4896
5461 4896 12571 18513 21396 18406 4319 -3649 -2667 -3652 -5124 -4868 -2905 -8492 -13610 -15827 -13342
5446a3342L679L947k339O781J0730m613m190m420j659m209q335k802J832m65R300
5431a0105N080n953L212M734M369K724J094J051k173k386p959n896o21L890J1357
5416B418l00j443k953L135P777K90J722j0714q398M031K368k572j958p38K402
5401d933Q355N121p165j2589O132R503m667n272j054J572J1771l661k135K620
5387C598K638j3809p328j042M930Q697J870L238M133O5m58L633r611m078J87K80
5371c057K159n147q348P382J1041J389l557Q38m13k305n845n288L057O956L637
5356B499J386r654j1898q0O338N244l743Q074r98p814P74k386N046N483M832J609
5340D712l826K582N05l619K108k954o09R27Q790J987j1558j3900k059l910L515
$$ plain form
5446 -13342 -9663 -5716 -8055 -1274 9456 4843 653 -3767 -5426 -9635 -17970 -20772 -18940 -19405 -10105
5431 -10105 -5025 -10978 -7766 -3032 1337 4061 5155 6206 4033 1647 -6312 -12208 -12829 -8939 2418
5416 2418 2118 675 -2278 857 8634 8924 10646 -68 -8466 -4435 -2067 -4639 -6597 -7335 -4933
5401 -4933 3422 8543 1378 -11211 -5079 4424 -243 -5515 -6569 -4997 6774 3113 978 3598
5387 3598 6236 -7573 -14901 -15943 -11013 -2316 -446 2792 6925 6990 6532 10165 554 -3524 -3337 -3057
5371 -3057 -898 -6045 -14393 -7011 4030 5419 1862 2700 2287 -18 -5863 -11151 -8094 -1138 2499
5356 2499 3885 -5769 -17667 -17747 -11409 -6165 -9908 -1834 -2832 -10646 -9872 -12258 -7212 -1729 3103 4712
5340 4712 886 3468 3973 354 2462 -492 -1101 -174 8616 10603 -955 -14855 -16914 -20824 -17309
5325a7309P595l460j0955k588N611k548n39O20P693K545P121J939M391M505M097
5310H718n504j2545j0169L289J3894M518l262n854K532J837J641m64P848N649
5296A2128j881j447r540m104K513L350j779j0055n167P433J189k882P968M846
5282B572o946o311J2298M843n103p21J389R299j676o886l383j940L718Q802n101
5267D854n015o486j511R259l358O58Q223L379J489o50M978o147j4755N04j252
5252e830m501N314n428K831N845l554M740o44n291r118j0646j134J0664J6638
5238a14K23j086n854j5419j121Q952L848m922q747M642l658P555R921R297Q65
5223D382l65k755Q677L407l357p471m502j091o351j482M001k073l498K465k250
$$ plain form
5325 -17309 -9714 -13174 -24129 -26717 -21106 -23654 -24193 -23573 -15880 -13335 -6214 -4275 116 4621 8718
5310 8718 3214 -9331 -19500 -16211 -2317 2201 -1061 -6915 -4383 -2546 -905 -1369 6479 12128
5296 12128 10247 8800 -740 -4844 -2331 1019 -760 -10815 -15982 -8549 -7360 -10242 -2274 2572
5282 2572 -4374 -10685 1613 6456 1353 632 2021 11320 9644 2758 -625 -2565 1153 9955 4854
5267 4854 -161 -6647 -8158 1101 -2257 -1599 6624 10003 11492 10842 15820 9673 -5082 -4578 -5830
5252 -5830 -10331 -5017 -10445 -7614 -1769 -5323 -583 -1227 -6518 -15636 -26282 -27416 -16752 -114
5238 -114 109 -977 -6831 -22250 -23371 -14419 -10571 -15493 -24240 -19598 -23256 -15701 -5780 3517 4382
5223 4382 4017 1262 9939 13346 9989 2518 -1984 -3075 -9426 -10908 -6907 -8980 -12478 -10013 -12263
5208a2263L803O896O404O108r228p160L721N873j742J0889m083m842P545L514
5194A5435j8209q223L655k258M215M656L142M377o129m416m156j0472J0775J1489
5180C881o381k07j485M542J0345r461j0646J043r45M321Q483k757l466m877L58
5165g252L483J304K509R191L867q042J273L521n133p592o946m24K688n703l707
5150a6963p60M790k862J3896Q735O16m535p304k502Q71K525R491n591m692O907
5135B622J1605r40j3285o9R409n468r063k563P503M124N94j869m23j2660K583
5120g900J1509J270o827n159j625o65J520j709j109o594k95R998R729j694l612
5105c163P54k356K749J713j2l315p114k805M122N244P214m710l072J678l79m878
$$ plain form
5208 -12263 -8460 -1564 4840 10948 1720 -5440 -1719 4154 2412 13301 9218 4376 11921 15435
5194 15435 -2774 -10997 -7342 -9600 -5385 -729 2413 6790 661 -3755 -7911 -18383 -7608 3881
5180 3881 -2500 -2707 -4192 350 10695 1234 -9412 -8369 -9314 -4993 3490 733 -2733 -7610 -7252
5165 -7252 -3769 -2465 44 9235 13102 5060 6333 9854 4721 -2871 -9817 -10241 -7553 -13256 -16963
5150 -16963 -17723 -12933 -15795 -1899 6836 7452 2917 -4387 -6889 -6018 -3493 5998 407 -4285 2622
5135 2622 14227 13287 2 -67 9342 3874 -5189 -7752 -249 3875 4469 2600 2177 -10483 -7900
5120 -7900 3609 4879 -1948 -7107 -8732 -9397 -7877 -9586 -10695 -17289 -17584 -7586 2143 449 -3163
5105 -3163 -2409 -4765 -2016 -303 -315 -3630 -10744 -13549 -9427 -4183 3031 -1679 -4751 -3073 -3452 -8330
5089h330k88K744k179J0134K770l803l958J515N040l054q262p102q88l396O00
5074a8457m366O127O991Q011R598M557m651q150j1195m047P40m322j3139P766
5060b4537J2007Q131K745l807O917j135m820j22k264N955o304q093M034n76k61
5045a2130N058n535P991J0177l055q679J130n538k685R156R974K993r911q906
5031i960m243J0136N526p79l178J1997M469k73l371j0123j3203J16j016M469J697
5016g736k112J745J4633M266L074o747n414r412J463p07R67J2928J594o996q218
5001f672Q98l129L679N267Q638P536M065r347o648K133j953K183N371r197p027
4986d203l923K670j572o932K457J3596l84K042J847o227q103l040P878j698K826
$$ plain form
5089 -8330 -8618 -5874 -8053 2081 4851 1048 -2910 -1395 3645 591 -7671 -14773 -15661 -19057 -18457
5074 -18457 -22823 -16696 -9705 -1694 7904 12461 7810 -340 -11535 -15582 -14842 -19164 -32303 -24537
5060 -24537 -12530 -4399 -1654 -5461 1456 321 -4499 -4621 -6885 -930 -7234 -15327 -11293 -11869 -12130
5045 -12130 -7072 -12607 -4616 5561 2506 -6173 -5043 -10581 -13266 -4110 5864 8857 -1054 -9960
5031 -9960 -14203 -4067 1459 680 -2498 9499 13968 13695 10324 201 -13002 -12886 -13902 -9433 -7736
5016 -7736 -9848 -8103 6530 10796 13870 7123 1709 -7703 -6240 -6947 -5980 6948 8542 1546 -6672
5001 -6672 -5774 -8903 -5224 43 8681 16217 20282 10935 4287 6420 4467 6650 12021 2824 -4203
4986 -4203 -8126 -5456 -7028 -13960 -11503 2093 1709 3751 5598 -629 -8732 -11772 -3894 -5592 -2766
4971b766j738m52k997J2397J0902M095j1831q259M107m36k101j197K461K284L378
4956G847L120j909Q38l350k790j12Q12L06K46j5239m088m801J4025Q900k06j005
4940B594N179m039k058n341L063m772m041M345M291J392J2412k367J209L935l752
4925A2050k758n229p344k957K158k745j617Q116K861o329p733m541o347P584J1569
4910c262P867l549l718o806q151J0266L502m804j757n132m504M160J2760J2239
4896I111L868j342m651p763o054l495P26o323m770L00N367L594R39O02k473o24
4880a2988J356j023K237J0488M176p812k750n099J631q951L203P738j74J1486
4866C518K927j1378j1031q571R57L756L711P437R896k515r793Q02N300P035k229
$$ plain form
4971 -2766 -4504 -4956 -7953 4444 15346 19441 7610 -649 3458 3022 921 -276 2185 4469 7847
4956 7847 10967 9058 9896 6546 3756 3644 4456 4762 5008 -10231 -14319 -19120 -5095 3805 3599 2594
4940 2594 7773 3734 1676 -3665 -602 -5374 -9415 -5070 -779 613 13025 10658 11867 15802 12050
4925 12050 9292 4063 -3281 -6238 -4080 -6825 -8442 -326 2535 -3794 -11527 -16068 -22415 -14831 -3262
4910 -3262 4605 1056 -2662 -9468 -17619 -7353 -3851 -8655 -10412 -15544 -20048 -15888 -3128 9111
4896 9111 12979 11637 6986 -777 -6831 -10326 -9600 -15923 -20693 -20393 -15026 -11432 -10493 -9891 -12364 -12988
4880 -12988 -11632 -12655 -10418 70 4246 -3566 -6316 -11415 -9784 -18735 -15532 -7794 -7968 3518
4866 3518 6445 -4933 -15964 -24535 -23578 -19822 -16111 -8674 1222 -1293 -11086 -10284 -4984 2051 -178
4851a78J40r987P838N99O285J0059J922K461n596j5183n502j517l807Q193O910
4836B637K215N174j503R60j757M964l7j357q966j0048K78L562M297Q880K461q480
4820C280j682m022j68k372n908J543J089L848o75K358J237M141M837L304j3591
4805b781J615J105P38p97l388O393J742m872p435n589O955K442j319k068j334
4790h593j826M171J1653O180p710n765p949n346N065J0087k553k131J1923J428
4776H634j0151m363k121l18n937N315J1664o290q142M861J178l961p078n96j079
4761a8384M155N932O5l679N018J902n954M507M44M088q876J521O641O332J627
4746E339r34J66K757j0057r567O701J603Q24j013l960L721j942p695K664Q651
$$ plain form
4851 -178 -38 -10025 -2187 -1588 4697 14756 16678 19139 13543 -1640 -7142 -8659 -12466 -4273 2637
4836 2637 4852 10026 8523 9483 7726 12690 12653 11296 2330 -7718 -7440 -3878 419 9299 11760 3280
4820 3280 1598 -2424 -2592 -4964 -10872 -9329 -8240 -4392 -5067 -2709 -1472 2669 7506 10810 -2781
4805 -2781 -1166 -61 677 -120 -3508 2885 4627 -245 -7680 -13269 -6314 -3872 -5191 -7259 -8593
4790 -8593 -10419 -6248 5405 11585 3875 -1890 -9839 -15185 -10120 -33 -2586 -4717 7206 8634
4776 8634 -1517 -5880 -8001 -8319 -14256 -8941 2723 -3567 -11709 -6848 -5670 -9631 -16709 -17305 -18384
4761 -18384 -14229 -8297 -8232 -11911 -6893 -4991 -10945 -6438 -5994 -1906 -10782 -9261 -2620 3712 5339
4746 5339 4405 4571 7328 -2729 -12296 -5595 -3992 -3168 -4181 -8141 -4420 -6362 -14057 -11393 -2742
4731b742K478k285N521M823Q704K611j3204k747l14K726m391q972n249o358P776
4716a1623J3433J0985l237q104l676J256l36n850k614l287k438Q77k501l689R185
4701a1619N659j804M928j1898q799L852M156P165Q160M768L931k850K939k939
4687E649l075j1274k93J088o992n38J476j434o90N254j594K612P276K217m212
4672d530p576L564K609r878L694O608M461R928j891r893n581m058P39K080L078
4657f646P130Q26l750M753N079k75k673q833r174q331P434L790q333p874Q754
4642a8123P208K071k028r811q949Q260P340M269J3331p083o234k416K901M587
4628d677L76J883k423r98j258l029n11J0495J580j2088Q415O370L616l393m842
$$ plain form
4731 -2742 -264 -2549 2972 7795 16499 19110 5906 3159 2845 5571 1180 -7792 -13041 -19399 -11623
4716 -11623 1810 12795 9558 1454 -2222 -966 -1302 -7152 -9766 -13053 -15491 -14614 -17115 -20804 -11619
4701 -11619 -5960 -7764 -2836 -14734 -23533 -19681 -15525 -8360 -200 4568 8499 5649 8588 5649
4687 5649 2574 -8700 -8993 -7905 -14897 -15435 -13959 -15393 -16083 -10829 -12423 -9811 -2535 -318 -4530
4672 -4530 -12106 -8542 -5933 -15811 -12117 -5509 -1048 8880 6989 -2904 -8485 -12543 -11804 -9724 -6646
4657 -6646 484 1310 -2440 2313 7392 7117 4444 -4389 -13563 -21894 -14460 -10670 -19003 -26877 -18123
4642 -18123 -10915 -8844 -10872 -20683 -29632 -21372 -14032 -9763 3568 -3515 -9749 -12165 -9264 -4677
4628 -4677 -4301 -2418 -4841 -5839 -7097 -10126 -10637 -142 1438 -10650 -2235 4135 7751 4358 -484
4613d84k950L999j557n217P486M955j79j478m314M513k941K613j0175k029O377
4598a381P646K327m920n496l764K555L618P05K600O081j124r468K300M85K90M713
4582G167Q78l169o209m440m83k741n186n103M816N525J883k506O765N084N61n305
4566b463J247j567j236J374o23O329J0703p763j3033k602J870j187l287O070K638
4551c530M765l097r922N952N534j271q235k68J3192O501o613m699M000o115k471
4536f277L539O542J535k045j2429O065L479p125J757J136o608m581R367j27r012
4521a4784K666M914j29l786O575J117n555r468O979J0604J703N54L073K60j1009
4506f286L762P425l179j301q192J519J395l305P605O405q572j0844n502N351P696
$$ plain form
4613 -484 -3434 565 -992 -6209 1277 6232 6053 4575 261 4774 1833 4446 -5729 -7758 -1381
4598 -1381 6265 8592 3672 -1824 -5588 -3033 585 1290 3890 9971 8847 -621 1679 2164 2454 7167
4582 7167 8045 4876 -1333 -5773 -6256 -8997 -14183 -19286 -14470 -8945 -7062 -9568 -2803 2281 2842 -2463
4566 -2463 -1216 -2783 -4019 -2645 -3268 3061 13764 6001 -7032 -9634 -7764 -8951 -12238 -6168 -3530
4551 -3530 1235 -1862 -11784 -5832 -298 -1569 -9804 -10072 3120 9621 3008 -1691 2309 -3806 -6277
4536 -6277 -2738 3804 5339 3294 -9135 -3070 409 -6716 -4959 -3823 -10431 -15012 -5645 -5772 -14784
4521 -14784 -12118 -7204 -7333 -11119 -4544 -3427 -8982 -18450 -11471 -867 836 1390 4463 4723 -6286
4506 -6286 -2524 4901 1722 421 -7771 -6252 -4857 -8162 -557 5848 -2724 -13568 -19070 -13719 -6023
4491f023j046r131j348m163N134K888q342L087O064N222R255J0070j201n620r772
4476d926K469K964P501Q632r64J659K728O982n406p697j182M037j231o427m213
4461D926L801l591l211p859l543k915N899n12k758N190P887Q486p130j0345J528
4446d147M530m264j2774J0769N807k362P43P102j0949j2166j667J1874O787J1913
4432A1196J86J968Q207J771j1875j3038P16P18L733o935j97P889R860k796r315
4417B088k987L730L037M265p513j0946K186N419k959J951N195O814J0376R964
4403C0620l339j0332o413n36r9n536l0j0115o633k127J040K336J5948R497j0107
4388D174p650l103J763N128p064j104J1387P311j405j1781l484O284L328J408
$$ plain form
4491 -6023 -7069 -16200 -17548 -21711 -16577 -13689 -22031 -18944 -12880 -7658 1597 11667 10466 4846 -4926
4476 -4926 -2457 507 8008 16640 15676 17335 20063 27045 21639 13942 12760 16797 15566 9139 4926
4461 4926 8727 5136 1925 -5934 -9477 -12392 -6493 -7005 -9763 -4573 3314 11800 4670 -5675 -4147
4446 -4147 383 -3881 -16655 -5886 -79 -2441 -1698 5404 -5545 -17711 -19378 -7504 -717 11196
4432 11196 11382 13350 21557 23328 11453 -1585 -869 -151 3582 -3353 -3550 4339 14199 11403 2088
4417 2088 -899 2831 5868 10133 2620 -8326 -6140 -721 -3680 -1729 3466 10280 20656 30620
4403 30620 27281 16949 10536 10000 9901 4365 4335 -5780 -12413 -14540 -13500 -11164 4784 14281 4174
4388 4174 -3476 -6579 -4816 312 -6752 -7856 3531 10842 9437 -2344 -5828 456 3784 5192
4374E192K028J046r675j8168m419q93n326M929J1692N970j672M181P879M068M46
4359G278m701k876l632P01l814r78L089N996O926j1724p670M781P579K357m71
4344B841l678r944O075Q031p984K535Q933m755k28L67j750k59Q15j116k568J854
4328h31K18m626K96O722J0830l824p549L381R720p53n54j0620j085L012P47o069
4312i85M643J1325q480J404j109J384o084P472m379j6622N247M622o255L612L300
4297i05k269M308P689m026M219k56R162j748p703L435q854J61J819j1708j357
4282h033m715m901R3P342L993Q246j651K713N454q547p117O01J2973K902j3923
4267d570j3080j61Q751j331j423J0j4K008N169k803o157J663N014N322J803K4
$$ plain form
4374 5192 7220 8266 -1409 -19577 -23996 -24889 -30215 -25286 -13594 -7624 -9296 -5115 2764 6832 7278
4359 7278 2577 -299 -3931 -3230 -7044 -8022 -4933 1063 7989 -3735 -11405 -6624 955 3312 2841
4344 2841 -837 -10781 -4706 3325 -4659 -2124 6809 2054 1826 2193 443 184 999 -117 -2685 -831
4328 -831 -613 -5239 -4943 1779 12609 8785 1236 4617 14337 13584 13030 2410 1325 4337 5084 -985
4312 -985 3658 14983 6503 7907 6798 8182 2098 9570 5191 -11431 -6184 -1562 -7817 -4205 -905
4297 -905 -3174 1134 8823 4797 9016 8760 17922 16174 8471 11906 3052 3213 5032 -6676 -8033
4282 -8033 -12748 -17649 -17556 -10214 -6221 2025 374 3087 8541 -6 -7123 -6522 6451 9353 -4570
4267 -4570 -17650 -17811 -9060 -10391 -11814 -11804 -11818 -9810 -4641 -7444 -13601 -11938 -6924 -1602 201 225
4251B25O167K736j29M150M275J520k0215j1278J1687P274l844q795R22P641L34
4236B670l982N781l500k794N019N008n60K541j828o005O885m354l47q894L313
4221a047q37m443K332K122k277L40n655p971o087l197J311P453k742Q326O842
4206e530j312M539L505m885q891O810Q191j093K576n847J538L465j7052j1740
4192b5726Q092Q059N60K776R576l105L03l116L739K010q734k652R209N508Q15
4177G314p786k71Q686j219k992K543K978n059k584N380j0695l954L71o158l717
4162a7163N993J1034p54k230K540p526n268L844N865j3778o606L853P425R004
4148c767l974p16m379M839M143P964j744j950L613O549j078p386j0778K823R99
$$ plain form
4251 225 6392 9128 8999 13149 17424 18944 -1271 -12549 -862 6412 2568 -6227 -5305 2336 2670
4236 2670 -1312 4469 969 -1825 3194 8202 7642 10183 8355 2350 9235 4881 4534 -4360 -1047
4221 -1047 -1884 -6327 -3995 -1873 -4150 -3810 -9465 -17436 -23523 -26720 -25409 -17956 -20698 -12372 -5530
4206 -5530 -6842 -2303 1202 -3683 -12574 -5764 2427 1334 3910 -1937 -399 3066 -13986 -25726
4192 -25726 -17634 -9575 -9015 -6239 3337 232 535 -2581 1158 3168 -5566 -8218 991 6499 7314
4177 7314 -472 -743 7943 6724 3732 6275 9253 4194 1610 6990 -3705 -7659 -7288 -13446 -17163
4162 -17163 -11170 -136 -890 -3120 -580 -8106 -13374 -9530 -3665 -17443 -24049 -20196 -12771 -3767
4148 -3767 -7741 -8457 -12836 -7997 -3854 4110 2366 416 4029 10578 9500 2114 -8664 -5841 -4842
4133d842L266M739n307k948k245l903N621k31K494k825j0156J0136M795r415J542
4118i279L807M288k243l738L665L632j3383k712R770O619m100J831Q884m398q660
4103f017L848k299R98K991l70k50Q168R221p269m933j948N833o769m781l502O550
4087e29Q423M895l761k547l27o040o23M54N709J929M522K341K111j475j1201j1902
4071h021K940O529J4844J3200n990m533o654l135n462j2126Q564Q369N542j873
4057A2194o071J000j033l296o523k513K582j130M528O458J516j449m8J0345j106
4042A5454l671k398P95p845K806O937l086p904M489n68p901P574L394P5l373K86
4026E064l193K410l99O83N969K263j1604p670R957k406k889K785J51K729p77j675
$$ plain form
4133 -4842 -1576 3163 -2144 -5092 -7337 -11240 -5619 -5850 -3356 -6181 -16337 -6201 -1406 -10821 -9279
4118 -9279 -5472 -1184 -3427 -7165 -3500 132 -13251 -15963 -6193 426 -3674 -1843 7041 2643 -6017
4103 -6017 -2169 -4468 -3470 -479 -849 -1099 7069 16290 9021 4088 2140 7973 1204 -3577 -7079 -529
4087 -529 7894 12789 9028 6481 6154 114 -509 -55 5654 7583 12105 14446 16557 15082 3881 -8021
4071 -8021 -5081 1448 16292 29492 23502 18969 12315 9180 3718 -8408 156 8525 14067 12194
4057 12194 6123 7123 6090 2794 -3729 -6242 -3660 -4790 -262 6196 7712 6263 6215 16560 15454
4042 15454 11783 9385 10180 2335 5141 12078 8992 1088 5577 5009 -2892 4682 8076 8151 4778 5064
4026 5064 1871 4281 3882 4565 10534 12797 1193 -6477 3480 1074 -1815 970 1121 3850 3073 1398
4010A398O768o743j2194R47j321j057J1873J1344j370l862N790K227m864j792
3996G144j878q574k12l759j126j978J935Q203K056q017N048P92J452m750L060
3981f04M597l616q669N9O072Q8J433K108N459K82n360M827J137k520l506l304
3965a517p081L574Q911r01q759m892k82m668N896P532L466K206M94m734N661Q517
3949A3423j266p603l273j103r596J94K462N740K572l670N174L699M698r598k062
3934b09J397N549o463K156p666q627K455N204J495o353K749K30M358L897n301
3919e129n174p749m311J4746J2336j643n760P665m54k216n60N527k534n19l402
3904H23O423L938n104l073p07j919J018m035M267m492j413L706k092k169p6l78
$$ plain form
4010 1398 8166 1423 -10771 -9824 -11145 -12202 -329 11015 9645 5783 11573 13800 8936 7144
3996 7144 5266 -3308 -3520 -7279 -8405 -10383 -8448 -245 1811 -6206 -1158 -366 1086 -3664 -604
3981 -604 3993 377 -8292 -8233 -2161 -2073 -640 1468 6927 7209 1849 6676 7813 5293 1787 -1517
3965 -1517 -8598 -5024 3887 2986 -5773 -10665 -10947 -15615 -9719 -2187 1279 3485 3979 -755 4906 13423
3949 13423 12157 4554 1281 178 -9418 -9224 -6762 -1022 1550 -2120 3054 6753 11451 1853 -209
3934 -209 1188 6737 274 2430 -5236 -13863 -11408 -6204 -4709 -11062 -8313 -8083 -3725 172 -5129
3919 -5129 -10303 -18052 -22363 -7617 4719 3076 -2684 4981 4527 2311 1751 7278 4744 4225 823
3904 823 7246 11184 6080 3007 2300 381 1399 -2636 1631 -2861 -4274 -568 -2660 -4829 -4905 -5283
3888e283J312K502M552m98j1605p704K206O439K482M775l990k737P303k361K451
3873a56l543k321j73M073M226j049K70Q590o306n861k827N554M157J248p060q391
3857i569J624R49O776l613k710q96N274J742n565L497N810L08j280L909p2m255
3841A929o798p075J345K095M482j681l514K878R307J1077j1567j0548P174P478
3827F582p8p704n697L86j606l004l524K917J0862k54r38J943l085r25k797M329
3811b593O532k328K424Q36n2n210K469N142o569n228L686J120m317O331J0091
3796A2334J484j3505O461J0125o463p808m137o39o70l607J033j074L90R564N452
3781H940j0815p743k738P499p21j4377n459J978L524n759P249N757J248k367L417
$$ plain form
3888 -5283 -3971 -1469 3083 2585 -9020 -16724 -14518 -8079 -5597 -822 -4812 -7549 -246 -2607 -156
3873 -156 -3699 -6020 -6193 -2120 2106 1057 1327 9917 3611 -2250 -5077 477 4634 5882 -1178 -9569
3857 -9569 -7945 -6996 -220 -3833 -6543 -7439 -2165 -423 -5988 -2491 3319 3627 2347 6256 6184 1929
3841 1929 -4869 -11944 -10599 -8504 -4022 -5703 -9217 -6339 2968 14045 2478 -8070 -896 6582
3827 6582 6504 -1200 -6897 -6511 -8117 -11121 -14645 -11728 -866 -1120 -2058 -115 -3200 -4125 -6922 -2593
3811 -2593 3939 1611 4035 4871 4819 -391 2078 7220 651 -4577 -891 229 -4088 2243 12334
3796 12334 13818 313 6774 16899 10436 2628 -1509 -2148 -2818 -6425 -5392 -6466 -6076 3488 8940
3781 8940 -1875 -9618 -12356 -4857 -5578 -19955 -25414 -23436 -19912 -25671 -18422 -12665 -11417 -13784 -10367
3766a0367R343J457K017L114j2020n595Q422J1632k802o294q747k034K738R549
3752D13N837j922k684k263K557M684n40n006j1539R163L707l310R718L422j2316
3737g9l094l618r964K660J4257M625K9m816m610k719r70M442k091M598J472j251
3721a129m450o077Q398O328o446P45n590K927j485n44j515J337l877j42Q01O780
3705c939J3629l736n554m249M33l84l005J546m7m324q41j645J022k234P392N722
3689b14L157J37p624K572J0382N400o282m430k951R76n140j402M937q47l267j533
3673f129O490N367n943k578Q417j131q910j0420l009m046J832R509N901k794M498
3658b946Q805M76r1r299J392J2257p07m697o342j6888O02R835O728j4529m106
$$ plain form
3766 -10367 -1024 433 2450 5564 -6456 -12051 -3629 8003 5201 -1093 -9840 -11874 -9136 413
3752 413 6250 4328 1644 -619 1938 6622 6082 1076 -10463 -1300 2407 -903 8815 12237 -79
3737 -79 -3173 -6791 -16755 -14095 162 4787 4816 0 -4610 -7329 -8299 -3857 -5948 -1350 122 -1129
3721 -1129 -5579 -11656 -3258 3070 -3376 -2631 -8221 -5294 -6779 -7323 -8838 -7501 -11378 -11520 -10719 -3939
3705 -3939 9690 5954 400 -3849 -3416 -3800 -6805 -5259 -5306 -9630 -10471 -12116 -11094 -13328 -5936 -214
3689 -214 2943 3080 -4544 -1972 8410 13810 7528 3098 147 1123 -4017 -5419 -482 -1329 -4596 -6129
3673 -6129 361 5728 -215 -2793 5624 4493 -4417 -14837 -17846 -21892 -20060 -10551 -4650 -7444 -2946
3658 -2946 5859 6335 6244 -3055 -1663 10594 9887 5190 -1152 -18040 -17438 -7603 -875 -15404 -19510
3643a9510K776n3j003l972N952R417R4M292m17J761j631j401J227K201p611k253
3627a0131J1253J1568n977j643j0626m400L769n734M845J0743J650j737j811j437
3613C32M326j66M046O948n20j7923p865P400O459Q26k32m719q288N047J896L540
3597A107N361r850q913m875Q568Q845N22K764j135n923n093q632M067K123K067
3582h997q455L936R145m338l103m00K500L763r375J116J150K555j414L355m351
3567a2913R024k230K582O306j042q379p273J848N48l982o766J225q58P372J820
3552a2718N243o45K82M079K292k495J841O11k617k929K573P101j10Q109M210p945
3536F882r398j4707N354R278n665j3830q196L138J389J586M327J2260K948p22
$$ plain form
3643 -19510 -16734 -16787 -17790 -21762 -15810 -6393 -6299 -2007 -2424 -663 -2294 -3695 -2468 -267 -7878 -10131
3627 -10131 1122 12690 6713 5070 -5556 -9956 -6187 -11921 -7076 3667 5317 3580 1769 332
3613 332 4658 4492 8538 15486 14966 -2957 -10822 -3422 3037 3863 3631 -1088 -9376 -4329 -2433 1107
3597 1107 6468 -3382 -12295 -17170 -8602 243 765 3529 2394 -3529 -8622 -17254 -13187 -11064 -8997
3582 -8997 -17452 -13516 -4371 -8709 -11812 -12212 -9712 -5949 -15324 -14208 -13058 -10503 -11917 -8562 -12913
3567 -12913 -3889 -6119 -3537 2769 1727 -6652 -13925 -12077 -11529 -15511 -22277 -21052 -21910 -14538 -12718
3552 -12718 -7475 -8120 -7838 -3759 -1467 -3962 -2121 -1510 -4127 -7056 -4483 2618 2508 10617 14827 6882
3536 6882 -2516 -17223 -11869 -2591 -8256 -22086 -30282 -27144 -25755 -24169 -19842 -7582 -4634 -5356
3522e356n854n871J0979M686M255J595m337K483N37k838M656k402o824m776n95
3507i662m231l313M941K0108K86m241p89n290j977L910k176j79O336L830l033
3492D520q194J208K911j1202j640R657K903j1135j0371R120P779K669o913j167
3478i855Q223j554m223k098j046k800p471m091L690Q450Q213R501n115o186K560
3463c802j459M463m624O156j94o247q067M602O668m009q403M54K885M192P965
3448E80k880k594k743n8P227k72k13j942q815J410O909L692l350J210o872m507
3432a3218J141M340N659q24o534l2K149j095M534Q154J687L856q453j0656J298
3417g994M450J2215L472o572m562N442p082j0205R677O238J897M013l459j0928
$$ plain form
3522 -5356 -11210 -17081 -6102 -1416 2839 4434 97 2580 3117 279 4935 2533 -4291 -9067 -9662
3507 -9662 -13893 -17206 -12265 7843 8129 3888 3099 -2191 -4168 -258 -2434 -2613 3723 7553 4520
3492 4520 -3674 -2466 445 -10757 -12397 -2740 163 -10972 -21343 -12223 -4444 -1775 -8688 -9855
3478 -9855 -1632 -3186 -7409 -9507 -10553 -13353 -20824 -24915 -21225 -12775 -4562 4939 -176 -6362 -3802
3463 -3802 -5261 -798 -5422 734 540 -5707 -13774 -9172 -2504 -6513 -14916 -14462 -11577 -7385 580
3448 580 -2300 -4894 -7637 -7695 -468 -740 -953 -2895 -11710 -10300 -3391 301 -3049 -1839 -8711 -13218
3432 -13218 -12077 -7737 -2078 -2902 -9436 -9468 -7319 -8414 -3880 4274 5961 9817 1364 -9292 -7994
3417 -7994 -3544 8671 12143 5571 1009 6451 -631 -10836 -1159 5079 6976 10989 7530 -3398
3403c398K272K868M978N198n573n98N535j0330q855R691N963L063l502k478n29
3388D305K572m952p45q292k793M356O664r318m538J938R170M886k878p414r397
3373a6436o815K410J700O616M050m653n053M119O216p10l286M081m16K107J2093
3358F023n665L788K752l246M045J749N5m731m240k578K297o15P143j480l917k775
3342a395O22K401L486m470n40k943O358J399j386j848n900J367M188K672l845
3327A66O002J878j1728n205O05P529P904n222K689N438n880J12J3135j345l862
3312A2216K904r9o585o400o85m591Q287J1984L719p884n449j342J227l891m894
3297a483j977k609l741j707J0936j365L80n933L966j463K756N197m350o993r07
$$ plain form
3403 -3398 -1126 1742 6720 11918 6345 5747 11282 952 -7903 1788 7751 10814 7312 4834 4305
3388 4305 6877 1925 1180 -7112 -9905 -5549 1115 -8203 -12741 -10803 -1633 3253 375 -7039 -16436
3373 -16436 -23251 -20841 -19141 -12525 -8475 -13128 -18181 -14062 -7846 -8556 -11842 -7761 -8177 -6070 6023
3358 6023 358 4146 6898 3652 7697 9446 9501 4770 530 -2048 249 -366 6777 5297 1380 -1395
3342 -1395 -773 1628 5114 644 104 -2839 3519 4918 3532 1684 -4216 -2849 1339 4011 166
3327 166 6168 8046 -3682 -8887 -8282 -753 7151 1929 4618 10056 4176 4288 17423 16078 12216
3312 12216 15120 15021 8436 2036 1351 -3240 5047 17031 20750 12866 7417 6075 7302 3411 -1483
3297 -1483 -3460 -6069 -9810 -11517 -581 -1946 -1566 -7499 -3533 -4996 -2240 2957 -1393 -8386 -9293
3282i293N953P96L763J529J0536M159j6954k793J2155l116n663l69O453K703m342
3267E517Q3M077M209k63n889j6006P89j857j614r35M148J484K119j64k07Q234
3251C725J0150L643l985J496P744q353j6748l950N978n720q171N734Q140K926
3237B609K055o078M165j378p75K34k938l839p129J703J613K383O006J173q168
3222h364q66k132j517L855J2799j090q548p42M887J1239M365j903n761K08l071
3207C359K953N35L163M064j664q711j355p12o885K040Q269J5071n612m555j176
3192H784J663K471j5141j0251k832O817J2227r713o112L277K775J1225L343j944
3178F589k796n501j0346l350o812J1440l198l96M657L090K008q350p910k193L780
$$ plain form
3282 -9293 -3340 -2544 1219 2748 13284 17443 489 -2304 9851 6735 1072 703 7156 9859 5517
3267 5517 5600 9677 13886 13623 7734 -8272 -7483 -9340 -10954 -11889 -7741 -6257 -4138 -4302 -4509 3725
3251 3725 13875 17518 13533 15029 22773 14420 -2328 -6278 -300 -6020 -14191 -8457 -317 2609
3237 2609 4664 -1414 2751 1373 598 832 -2106 -5945 -13074 -11371 -9758 -7375 -1369 -196 -8364
3222 -8364 -9230 -11362 -12879 -9024 3775 2685 -5863 -6605 -1718 9521 13886 11983 6222 6430 3359
3207 3359 6312 6847 10010 14074 12410 3699 2344 1632 -5253 -3213 5056 20127 14515 9960 8784
3192 8784 10447 12918 -2223 -12474 -15306 -8489 3738 -5975 -12087 -8810 -6035 5190 8533 6589
3178 6589 3793 -1708 -12054 -15404 -22216 -10776 -13974 -14370 -9713 -6623 -4615 -12965 -20875 -23068 -19288
3163a9288O428O524O186l136j151j223J4127J24n181o789m158l435p183M363J1787
3148b005J1226R138n392j3573r408J958M006k208l332j463L479M94Q033n72o70
3133b89j2072n210L059O441m583j270J875N652m05J68J237j0616l174K1732l229
3118f84j2154M022k987K684N840l183J1337N31j1122r852P527Q286j50O68l147
3103b384J415N29k339M747L230J593J071j4844r657j974J3206J3550L214l911
3089G446q540M026N218N718k477m895p452L481j500m845k685J3206J2337J265
3075B0303j3871r849j398J0111J539J313K008L490k844n835k733j580M171J113
3061E938k793P60k009j1073K735N902R1k374M69n534M925K903j426m880j407J0601
$$ plain form
3163 -19288 -12860 -6336 -150 -3286 -4437 -5660 8467 8591 3410 -3379 -7537 -10972 -18155 -13792 -2005
3148 -2005 9221 18359 12967 -606 -10014 -8056 -4050 -6258 -9590 -11053 -7574 -7080 953 381 -289
3133 -289 -12361 -17571 -14512 -8071 -12654 -13924 -12049 -6397 -6802 -6634 -5397 -16013 -19187 2545 -684
3118 -684 -12838 -8816 -11803 -9119 -3279 -6462 4875 5406 -5716 -15568 -8041 245 95 763 -2384
3103 -2384 -969 -440 -2779 1968 5198 6791 7862 -6982 -16639 -18613 -5407 8143 11357 7446
3089 7446 -1094 2932 8150 13868 11391 6496 -956 2525 1025 -3820 -6505 6701 19038 20303
3075 20303 6432 -3417 -4815 5296 6835 8148 10156 13646 10802 4967 2234 654 4825 5938
3061 5938 3145 3905 1896 -9177 -6442 -540 -449 -2823 -2354 -7888 -2963 -60 -1486 -6366 -7773 2828
3045B828N421m82r00L23O232p853Q40j379o187L961Q151k720j0472n311l996J1899
3029C55N282n424o652j839Q37J195J2619K763r797k204J338M236j015l886R432
3014G240N366L926q851k805n107L741J57K026m000k667o433P38l279N068L987
2999h93L234n441o24M833O307n085k441P108n634j139M9p92n161j0278k19P942
2983h234J03l67N811p561n130K158P442M978K628K180p000k992L999N624Q433
2968A2072K086j884K323N660l610j4367m720n288l622L957J0354O032l391j0469
2954d867m939L038o793N354P798L120o287n036Q917J5808Q362k582n521j955k445
2939A1972l953K639r63j420l279K599j727r105p27M038P076o40p966P72K721l302
$$ plain form
3045 2828 8249 7767 6867 7190 13422 5569 6409 5030 -1157 2804 10955 8235 -2237 -7548 -11544 355
3029 355 5637 213 -6439 -8278 -7441 -6246 6373 9136 -661 -2865 -1527 2709 1694 -2192 7240
3014 7240 12606 16532 7681 4876 -231 3510 3667 5693 1693 -974 -7407 -6669 -9948 -4880 -893
2999 -893 2341 -3100 -3724 1109 7416 2331 -110 6998 1364 225 274 -518 -5679 -15957 -16176 -8234
2983 -8234 -8131 -8498 -2687 -10248 -15378 -13220 -5778 -800 1828 4008 -2992 -5984 -1985 3639 12072
2968 12072 14158 12274 14597 20257 16647 2280 -2440 -7728 -11350 -7393 2961 8993 5602 -4867
2954 -4867 -9806 -6768 -13561 -8207 -409 2711 -3576 -8612 305 16113 24475 21893 16372 14417 11972
2939 11972 8019 10658 9695 8275 4996 7595 5868 -3237 -3964 74 7150 6510 -1456 -684 2037 -1265
2923a265p101n502M005O817L427l496n47n211r365J326l34Q266N279j496k524
2908g721N753N410M641O960M553r137n492L555O427P901M56j442j2099l531o211
2893B3l333R267K832m827n827R84p932m372J201O035J444J053M710O810O830m666
2877A0232l990n918L034M64p5L62k804k596m195o961n761K405L510R811K861K031
2861B410L415o254K054Q529J2021q304j6547l841J301m254K518j219K660l228
2847h739O021l18j24K317P474l203k280k449M061J1683K475n737o691J021p896
2832b385o446J0591l127j1067o494n972J070R30J0754L504o06m519K778L957J300
2817e732K866O846j473j1324l219l614j593m221p4R175K849J936k589j490k792
$$ plain form
2923 -1265 -8366 -13868 -9863 -3046 381 -3115 -3662 -8873 -18238 -16912 -17246 -8980 -3701 -5197 -7721
2908 -7721 -1968 3442 8083 15043 19596 10459 4967 8522 14949 22850 23306 21864 9765 6234 23
2893 23 -3310 5957 8789 3962 -1865 -881 -8813 -13185 -11984 -5949 -4505 -3452 1258 8068 14898 10232
2877 10232 6242 324 3358 3822 3747 4109 1305 -1291 -5486 -12447 -18208 -15803 -12293 -2482 379 2410
2861 2410 5825 -429 1625 10154 22175 13871 -2676 -6517 -5216 -9470 -6952 -8171 -5511 -8739
2847 -8739 -2718 -3036 -3160 -843 6631 3428 1148 -1301 2760 14443 16918 11181 4490 5511 -2385
2832 -2385 -8831 1760 -1367 -12434 -18928 -24900 -23830 -22900 -12146 -8642 -9248 -13767 -10989 -7032 -5732
2817 -5732 -2866 3980 2507 -8817 -12036 -15650 -17243 -21464 -21538 -12363 -9514 -7578 -10167 -11657 -14449
2802a4449J402J1140P92O96p578o427M567k979L553m514L972L533n256L296Q211
2787d1M337n02j566J007k768O178n92p107k878j096q874L347J0763n181N098k850
2771b725J651j193J882M631N517K20r660p71k764j874j781n12j451N582O287K390
2755E429l449K429l354M72J1205J893M120L622L801j7445j4878p092o81J531N725
2740f672K328j223j588P85O246J328r194M618K201q026O80J2028l214r858j0495
2725b0056L555J3171L474P615K523j809p622j1854L131K210J96m74R216P501j635
2710I142n217p818o23p35L769J200O631Q515K533j2359l728m74m091P378n65K114
2694E672p869j1517Q40M396N370p34N30n149n656q270J365Q665L800q91k303L668
$$ plain form
2802 -14449 -13047 -1907 -1115 -419 -7997 -14424 -9857 -12836 -9283 -13797 -9825 -6292 -11548 -8252 -41
2787 -41 4296 3794 2228 3235 467 6645 6053 -1054 -3932 -5028 -13902 -10555 208 -4973 125 -2725
2771 -2725 -1074 -2267 -385 4246 9763 9983 323 -448 -3212 -5086 -6867 -7379 -8830 -3248 3039 5429
2755 5429 1980 4409 1055 1527 12732 14625 18745 22367 26168 8723 -6155 -13247 -13928 -12397 -6672
2740 -6672 -4344 -5567 -7155 -6370 -124 1204 -7990 -3372 -1171 -9197 -8517 3511 297 -9561 -20056
2725 -20056 -16501 -3330 144 7759 10282 8473 851 -11003 -7872 -5662 -5466 -5940 3276 10777 9142
2710 9142 3925 -3893 -4516 -5251 -1482 -282 6349 14864 17397 5038 1310 836 -3255 4123 3558 5672
2694 5672 -2197 -13714 -12874 -8478 -3108 -3842 -3312 -8461 -14117 -22387 -21022 -12357 -8557 -9448 -11751 -8083
2678h083P767l8L058j0063M841J3639K565q527o215q848P395j424M617R21L044
2663D649k006j674m836J832M183n852O631l631o267k982Q905N048K514o349l146
2648b981j930M156J499J141m643m755K822J6087K134r648J085L541m353k228r202
2633g275J039N990j560j795m438j96j941m330M827J3379n756N33q14l758p092
2618a3187n976R795J4547K058J377J012j0316l585J599p664J381J6265Q738q579
2604G465p797o772n636L983Q312j679n808O11L932L800M357K223J760p932m916
2589d097K955K904K482l418l392P81Q253L300j1183n798q453O912O020m280N952
2574a062P562J852L093j0866l696J0726Q62o061l108j0073k79M301R994P582m873
$$ plain form
2678 -8083 -316 -354 2704 -7359 -2518 11121 13686 5159 -1056 -9904 -2509 -3933 684 1605 4649
2663 4649 2643 969 -3867 -2035 2148 -3704 2927 -704 -6971 -9953 -1048 4000 6514 165 -2981
2648 -2981 -4911 -755 744 1885 -2758 -7513 -4691 11396 13530 3882 4967 8508 4155 1927 -7275
2633 -7275 -6236 -246 -1806 -3601 -8039 -8235 -10176 -14506 -9679 3700 -2056 -1523 -2337 -6095 -13187
2618 -13187 -19163 -9368 5179 7237 8614 9626 -690 -4275 -2676 -10340 -8959 7306 16044 7465
2604 7465 -332 -7104 -12740 -8757 -445 -2124 -7932 -7321 -3389 411 4768 6991 8751 819 -4097
2589 -4097 -1142 1762 4244 826 -2566 -1785 6468 9768 -1415 -7213 -15666 -8754 -2734 -7014 -1062
2574 -1062 6500 8352 11445 579 -3117 7609 8471 2410 -698 -10771 -11050 -6749 3245 10827 5954
2559E954M58K861k142m338m8k05l520K428l8n870q35J204O94k53k491M914L131
2542A904J850K90l807m918o105j287p15Q713L808j884j061n460j793m00O479K584
2526a802J233N697j4817j555J0285L683Q595m457l533n607L992M353j0839K920
2512a852Q188J078J454l678o060m652J186M989q078J38j298J0294O929p561j24
2497I53P306K292j210J467K592n410m801j2109q48J207m009o045R73M898O739
2482f005M368m86p272q130j349K53N122K217K695O78l95M910P092O787K702l085
2466A0102j1396k884J3509J350N320n364j9236L381J2260n509j902r513J252R437
2452H07K296r213M821J969J576N336k023j8241l933P044N443L97K537n802N287
$$ plain form
2559 5954 6412 9273 7131 2793 2745 2540 -980 1448 1410 -4460 -5295 -4091 -3397 -3650 -6141 -1227 1904
2542 1904 3754 4044 237 -4681 -10786 -12073 -12788 -4075 -267 -2151 -3212 -8672 -10465 -10865 -4386 -1802
2526 -1802 -569 5128 -9689 -11244 -959 2724 11319 6862 3329 -2278 1714 6067 -4772 -1852
2512 -1852 6336 7414 8868 5190 -870 -5522 -4336 653 -7425 -7287 -8585 1709 8638 1077 953
2497 953 8259 10551 9341 10808 13400 7990 3189 -8920 -9768 -8561 -12570 -18615 -17642 -12744 -6005
2482 -6005 -1637 -2123 -9395 -17525 -18874 -18621 -13499 -11282 -8587 -7909 -8304 -3394 3698 10485 13187 10102
2466 10102 -1294 -4178 9331 10681 16001 10637 -8599 -5218 7042 1533 -369 -9882 -8630 807
2452 807 3103 -6110 -1289 680 2256 7592 5569 -12672 -16605 -9561 -4118 -3721 -1184 -6986 -1699
2437a699k467o847J769L647J328J979K878l031J648L424j2192r01l193l321J059
2422a5919N237P340J235J2736K029r846L749m843M833P484n265l548l720K219
2408C721O711n603L76K142j769q514M042o209p30P612l11K697l124P900J20m07
2392H654M880m127p301q327L977M372N608J0188k294j2561L128M998m40j91n233
2377E331n567l478R601R125o22l258j185n576j0308L74o700r783L450K073O94
2362a5829Q414n57j0483j027J4694O859L15L767j658K997k99j410M26o600O09
2347B18J711n470r921O040OL402j319L555R25M406O794O798Q32o115K094L330
2331A7286j0261o401K425N957j636q989M856K551K169l69K71j240k668N83j42
$$ plain form
2437 -1699 -4166 -11013 -9244 -5597 -4269 -2290 588 -2443 -795 2629 -9563 -10464 -13657 -16978 -15919
2422 -15919 -10682 -3342 -2107 10629 12658 2812 6561 1718 6551 14035 8770 5222 1502 3721
2408 3721 10432 4829 5205 7347 5578 -2936 1106 -5103 -5833 1779 1468 4165 1041 8941 9061 8654
2392 8654 13534 9407 2106 -6221 -2244 2128 7736 17924 15630 3069 6197 11195 10755 10564 5331
2377 5331 -236 -3714 5887 15012 14390 11132 9947 4371 -5937 -5563 -12263 -22046 -18596 -16523 -15829
2362 -15829 -7415 -7972 -18455 -19482 -4788 2071 2386 6153 4495 7492 7193 5783 6209 -391 218
2347 218 1929 -3541 -13462 -7422 -7416 -4014 -5333 -1778 -853 3553 10347 17145 17977 11862 13956 17286
2331 17286 7025 624 3049 9006 7370 -1619 3237 5788 7957 7588 7859 6619 3951 4534 4392
2316D392o309J665K687p70N294j726K797J0415j0025j4697K629L497J5468K628
2302A7945o537M41q707j0019k791J752K218m132k61Q136j0092K346j26r655n832
2287b5314l912J059M993P598Q357o725n80O954J540m500Q900P220O29j942m274
2272CL53o550n534l57J3733J1287j456j934Q50k843j527K706O244l697J8m042
2256G254j331N829K461n144m90J615n889K235P618k887k150K647p179j738O310
2241I161j382l591l363r945k509p04Q371O729q338j281n761K260M615j373J984
2226e127m652M428R205K683j095K240j5941Q655M415p576m52R654O249l083l299
2211F304l094k650J24q617J15J0617l115L079L994r219r382M273K831L453Q455
$$ plain form
2316 4392 -1917 -252 2435 1665 6959 5233 8030 18445 8420 -6277 -3648 -151 15317 17945
2302 17945 11408 11849 3142 -6877 -9668 -7916 -5698 -9830 -10091 -1955 -12047 -9701 -9827 -19482 -25314
2287 -25314 -29226 -28167 -23174 -15576 -7219 -13944 -14524 -7570 -6030 -10530 -1630 5590 6219 4277 3
2272 3 356 -6194 -11728 -12085 1648 12935 11479 9545 10395 7552 6025 8731 14975 11278 11296 7254
2256 7254 5923 11752 14213 9069 8579 10194 4305 6540 14158 11271 9121 11768 4589 2851 9161
2241 9161 7779 4188 825 -9120 -11629 -12333 -3962 2767 -5571 -6852 -12613 -10353 -5738 -7111 -5127
2226 -5127 -9779 -5351 3854 6537 5442 7682 -8259 396 4811 -2765 -3217 6437 12686 9603 6304
2211 6304 3210 560 684 -7933 -7818 2799 -316 2763 6757 -2462 -11844 -7571 -4740 -1287 7168
2196G168L82n61p555l998P006O185o423n494K340j596k353N186l304r09Q070N862
2180A0006j0180o750L976k260o017m388N017j096k577l577O702J2408M950n245
2166I69J142L408p338j549N607K693J1R164M737O269j367q845o82n571l104o039
2150d95Q408K311j2444m368n26j711k950Q197M630J583K37N024J888r906l230
2135c352O48j0477L207Q867K518m33L933Q343m563o503P9K953m035J282l450P234
2119F251l29j2893J683R351P834l747k848m077l806m119J429K739Q289Kq404K479
2103a66J1624j0704l463O193K165m509J5k981m850K347O275M712M235M118n858
2088I153k312n168l534O411L876J176k478M326N992l40r402k605j16L625j1495
$$ plain form
2196 7168 7550 6989 -566 -4564 2442 8627 2204 -3290 -950 -2546 -4899 287 -3017 -3926 4144 10006
2180 10006 -174 -6924 -2948 -5208 -11225 -15613 -10596 -11692 -14269 -17846 -11144 1264 6214 969
2166 969 2111 5519 -1819 -3368 2239 4932 4943 14107 18844 25113 23746 14901 14219 8648 5544 -495
2150 -495 7913 10224 -2220 -6588 -7114 -8825 -11775 -3578 1052 2635 2872 7896 9784 -122 -3352
2135 -3352 -2704 -13181 -9974 -1107 1411 978 4911 13254 8691 2188 2267 5220 1185 2467 -983 6251
2119 6251 5922 -6971 -5288 4063 11897 8150 5302 1225 -2581 -6700 -5271 -2532 5757 5759 -2645 -166
2103 -166 11458 754 -2709 3484 5649 1140 1155 -1826 -6676 -4329 1946 6658 10893 15011 9153
2088 9153 6841 1673 -1861 4550 8426 9602 7124 11450 17442 17102 7700 5095 4979 8604 -2891
$$ [...]
##END NTUPLES=NMR SPECTRUM
##END=
