##TITLE=Analysis number 314706
Compound Code cc 43939
Book Reference 407/95
Project Code adrs
Chemist Name andyw
##JCAMPDX= 6.0         $$ Bruker NMR JCAMP-DX V2.0
##DATA TYPE= NMR SPECTRUM
##DATA CLASS= NTUPLES
##ORIGIN= Bruker BioSpin GmbH
##OWNER= NMR
$$ XWIN-NMR		Version 3.5
$$ Mon Oct 24 14:46:34 2005 GMT Daylight Time (UT+1h)  MAYBRIDGE\NMR@NMR_250MHZ
##.OBSERVE FREQUENCY= 250.131544655141
##.OBSERVE NUCLEUS= ^1H
##.ACQUISITION MODE= SIMULTANEOUS (DQD)
##.ACQUISITION SCHEME= undefined
##.AVERAGES= 16
##.DIGITISER RES= 18
##SPECTROMETER/DATA SYSTEM= dpx250
##.PULSE SEQUENCE= zg30
##.SOLVENT NAME= CDCl3
##.SHIFT REFERENCE= (INTERNAL, CDCl3, 0, 16.4512)
##AUDIT TRAIL= $$ (NUMBER, WHEN, WHO, WHERE, WHAT)
$$ ##TITLE= Audit trail, XWIN-NMR		Version 3.5
$$ ##JCAMPDX= 5.01
$$ ##ORIGIN= Bruker BioSpin GmbH
$$ ##OWNER= NMR
$$ C:\u/data/dgb/nmr/ADRS/11310/pdata/1/auditp.txt
$$ ##AUDIT TRAIL=  $$ (NUMBER, WHEN, WHO, WHERE, WHAT)
(   1,<2005-10-24 14:45:54.41 +100>,<MAYBRIDGE\NMR>,<NMR_250MHZ>,
      <created by zg, POWCHK disabled, PULCHK disabled
       configuration hash MD5:
       62 19 C7 07 E1 42 D1 B7 37 6C 3D D0 77 39 F9 E6
       data hash MD5: 64K
       8C C7 EB 93 DE C6 50 23 61 F9 84 42 26 37 A4 C5>)
(   2,<2005-10-24 14:46:12.13 +100>,<MAYBRIDGE\NMR>,<NMR_250MHZ>,
      <Start of raw data processing
       ef LB = 0.3 FT_mod = 6 PKNL = 1 SI = 32K 
       data hash MD5: 32K
       C9 B7 84 F0 78 76 EB 35 E7 AE 43 D9 B2 A9 BB 47>)
(   3,<2005-10-24 14:46:16.88 +100>,<MAYBRIDGE\NMR>,<NMR_250MHZ>,
      <apk 
       data hash MD5: 32K
       D0 B4 29 E1 EA 5F B2 82 BF 6C F5 5D 9D 65 CF 50>)
(   4,<2005-10-24 14:46:18.57 +100>,<MAYBRIDGE\NMR>,<NMR_250MHZ>,
      <abs ABSG = 5 
       data hash MD5: 32K
       7C 18 4A F0 2B E6 2F 62 BF 1B B6 65 56 3F 29 94>)
$$ ##END=
$$ 
$$ hash MD5
$$ 7F 86 55 F1 BC CD D8 5B AB B6 41 BE E8 D0 89 B6
##$RELAX= 
##$RELAX= 
##$RELAX= 
##$RELAX= 
##$RELAX= 
##$RELAX= 
##$RELAX= 
$$ Bruker specific parameters
$$ --------------------------
##$DU= <C:\u>
##$EXPNO= 11310
##$NAME= <ADRS>
##$PROCNO= 1
##$TYPE= <nmr>
##$USER= <dgb>
##$AMP= (0..31)
100 100 100 100 100 100 100 100 100 100 100 100 100 100 100 100 100 100 
100 100 100 100 100 100 100 100 100 100 100 100 100 100 
##$AQSEQ= 0
##$AQ_mod= 3
##$AUNM= <au_zg>
##$AUTOPOS= <25 >
##$BF1= 250.13
##$BF2= 250.13
##$BF3= 250.13
##$BF4= 250.13
##$BF5= 500.13
##$BF6= 500.13
##$BF7= 500.13
##$BF8= 500.13
##$BYTORDA= 1
##$CFDGTYP= 0
##$CFRGTYP= 5
##$CHEMSTR= <none>
##$CNST= (0..31)
1 1 145 1 1 1 1 1 1 1 1 1 1 1 1 1 1 1 1 1 1 1 1 1 1 1 1 1 1 1 1 1 
##$CPDPRG= <>
##$CPDPRG1= <>
##$CPDPRG2= <>
##$CPDPRG3= <>
##$CPDPRG4= <mlev>
##$CPDPRG5= <mlev>
##$CPDPRG6= <mlev>
##$CPDPRG7= <mlev>
##$CPDPRG8= <mlev>
##$CPDPRGB= <>
##$CPDPRGT= <>
##$D= (0..31)
0 1 0 0 0 0 0 0 0 0.06 0 0 0 0 0 0 0.0002 0 0 0 0 0 0 0 0 0 0 0 0 0 0 
0 
##$DATE= 1130161552
##$DBL= (0..7)
120 120 120 120 120 120 120 120 
##$DBP= (0..7)
150 150 150 150 150 150 150 150 
##$DBP07= 0
##$DBPNAM0= <>
##$DBPNAM1= <>
$$ [...]
##$SUBNAM7= <"">
##$SUBNAM8= <"">
##$SUBNAM9= <"">
##$SW= 20.6930455092707
##$SWIBOX= (0..15)
0 0 3 0 0 0 0 0 0 0 0 0 0 0 0 0 
##$SW_h= 5175.983436853
##$TD= 65536
##$TD0= 1
##$TE= 295.16
##$TE2= 300
##$TE3= 300
##$TEG= 300
##$TL= (0..7)
0 120 120 120 120 120 120 120 
##$TP= (0..7)
150 150 150 150 150 150 150 150 
##$TP07= 0
##$TPNAME0= <>
##$TPNAME1= <>
##$TPNAME2= <>
##$TPNAME3= <>
##$TPNAME4= <>
##$TPNAME5= <>
##$TPNAME6= <>
##$TPNAME7= <>
##$TPOAL= (0..7)
0.5 0.5 0.5 0.5 0.5 0.5 0.5 0.5 
##$TPOFFS= (0..7)
0 0 0 0 0 0 0 0 
##$TUNHIN= 0
##$TUNHOUT= 0
##$TUNXOUT= 0
##$USERA1= <user>
##$USERA2= <user>
##$USERA3= <user>
##$USERA4= <user>
##$USERA5= <user>
##$V9= 5
##$VALIST= <valist>
##$VCLIST= <CCCCCCCCCCCCCCC>
##$VD= 0
##$VDLIST= <DDDDDDDDDDDDDDD>
##$VPLIST= <PPPPPPPPPPPPPPP>
##$VTLIST= <TTTTTTTTTTTTTTT>
##$WBST= 1024
##$WBSW= 4
##$XGAIN= (0..3)
0 0 0 0 
##$XL= 0
##$YL= 0
##$YMAX_a= 313989
##$YMIN_a= -399499
##$ZGOPTNS= <>
##$ZL1= 120
##$ZL2= 120
##$ZL3= 120
##$ZL4= 120
##$ABSF1= 16.45115
##$ABSF2= -4.242022
##$ABSG= 5
##$ABSL= 3
##$ALPHA= 0
##$AQORDER= 0
##$ASSFAC= 0
##$ASSFACI= 0
##$ASSFACX= 0
##$ASSWID= 0
##$AUNMP= <proc_1d>
##$AZFE= 0.1
##$AZFW= 0.1
##$BCFW= 0
##$BC_mod= 0
##$BYTORDP= 0
##$COROFFS= 0
##$CY= 12.5
##$DATMOD= 1
##$DC= 0
##$DFILT= <>
##$DTYPP= 0
##$F1P= 14.0000005364418
##$F2P= -0.99999901652339
##$FCOR= 0.5
##$FTSIZE= 32768
##$FT_mod= 6
##$GAMMA= 0
##$GB= 0
##$INTBC= 1
##$INTSCL= 1
##$ISEN= 128
##$LB= 0.3
##$LEV0= 0
##$LPBIN= 0
##$MAXI= 10000
##$MC2= 0
##$MEAN= 0
##$ME_mod= 0
##$MI= 0
##$NCOEF= 0
##$NC_proc= -3
##$NLEV= 6
##$NOISF1= 0
##$NOISF2= 0
##$NSP= 0
##$NTH_PI= 0
##$NZP= 0
##$OFFSET= 16.45115
##$PC= 1
##$PHC0= -70.6144
##$PHC1= 4.554736
##$PH_mod= 1
##$PKNL= yes
##$PPARMOD= 0
##$PSCAL= 4
##$PSIGN= 0
##$REVERSE= no
##$SF= 250.130017720082
##$SI= 32768
##$SIGF1= 0
##$SIGF2= 0
##$SINO= 400
##$SIOLD= 32768
##$SREGLST= <1H.CDCl3>
##$SSB= 0
##$STSI= 32768
##$STSR= 0
##$SW_p= 5175.98343685301
##$SYMM= 0
##$S_DEV= 0
##$TDeff= 65536
##$TDoff= 0
##$TI= <Analysis number 999999
Compound Code 99
Book Reference 9
Project Code 9>
##$TILT= no
##$TM1= 0
##$TM2= 0
##$TOPLEV= 0
##$USERP1= <user>
##$USERP2= <user>
##$USERP3= <user>
##$USERP4= <user>
##$USERP5= <user>
##$WDW= 1
##$XDIM= 32768
##$YMAX_p= 336751585
##$YMIN_p= -139274
$$ End of Bruker specific parameters
$$ ---------------------------------
##NTUPLES= NMR SPECTRUM
##VAR_NAME=  FREQUENCY,     SPECTRUM/REAL,   SPECTRUM/IMAG
##SYMBOL=    X,             R,               I
##VAR_TYPE=  INDEPENDENT,   DEPENDENT,       DEPENDENT
##VAR_FORM=  AFFN,          ASDF,            ASDF
##VAR_DIM=   32768,         32768,           32768
##UNITS=     HZ,            ARBITRARY UNITS, ARBITRARY UNITS
##FACTOR=    0.157963299565203, 1,           1
##FIRST=     4114.92666467324, 0,            0
##LAST=      -1061.05677217977, 0,           0
##MIN=       -1061.05677217977, -139274,     0
##MAX=       4114.92666467324, 336751585,    0
$$ Real data points
##PAGE= N=1
##DATA TABLE= (X++(R..R)), XYDATA
$$ [...]
19300 13194 1278 -21770 -40951 -37012 -32264 -22265 -5569 -8236 -11318 -5630 -11406 -15576 26077
19287 26077 16236 6386 7475 27422 60838 83884 47025 -3634 -26465 -39810 -49405 -21454
19275 -21454 14186 2934 -44384 -13946 -14229 -23527 -43778 -23482 -13069 -10874 -19729 -40420 -2965
19262 -2965 23979 26956 -8320 3543 -1532 15125 8312 6499 22300 14255 2141 -9859 -10722
19249 -10722 -10722 -14568 3104 -5390 -22973 -58380 -73869 -38330 -43622 -62611 -44841 2573 2151
19236 2151 -20831 -20963 -31890 1904 36099 52296 21448 44349 55660 28677 13775 -26543
19224 -26543 -48015 -45752 -18593 -26943 -33830 -62003 -70113 -27977 -5854 -25855 -40939 -14218
19212 -14218 -11098 -17592 -17340 -7774 12051 13203 4787 -23371 -9839 -27036 -36485 -30492 -29796 -19700
19198 -19700 -22474 -32042 -38029 -26609 -49619 -47934 2056 4617 -6184 11097 32908 24005 4794
19185 4794 -13039 34892 47280 51921 62074 51495 22808 -1948 -27248 -9122 35045 45414
19173 45414 6105 2759 -24588 -42526 -34063 -29213 -52576 -49276 -43775 -68887 -87582 -80865 -85787
19160 -85787 -63377 -51143 -70627 -48091 -17010 1857 -18695 -14302 -5487 -6677 34033 25424
19148 25424 17701 6070 -18614 8089 38303 41201 279 -4955 26487 19839 2116 32583
19136 32583 53177 44572 57760 91873 126794 135092 134130 126162 101369 85722 71977 74767 90901
19123 90901 87106 62038 65660 75575 91241 84920 79094 85487 109981 115893 132043 124175 144716
19110 144716 165961 156826 153209 136799 145295 135396 116516 95707 41376 41264 34716 54978 62224
19097 62224 71955 121935 111825 71007 48097 55397 95719 99671 109635 88896 88963 96964 99675
19084 99675 79994 79058 59444 75942 80528 41108 25210 28160 33481 44587 51997 78483 132823
19071 132823 152473 152332 177751 182391 162331 172311 203899 204149 223790 228922 219818 243893 261570
19058 261570 238773 223291 262655 334216 403365 454117 523874 632502 717461 785796 918433
19047 918433 1077381 1256978 1538350 1926435 2448897 3248292 4390508 5921513 7466195
19038 7466195 8306232 8008671 6861646 5685175 4804186 4298115 4113656 4144997 4457620
19029 4457620 5153694 6253463 7573974 8626710 8772982 7887993 6486858 5180517 4260475
19020 4260475 3579599 3080788 2682073 2395056 2200214 2042231 1917465 1819587 1729181 1653117
19010 1653117 1606801 1542703 1419189 1292305 1227729 1171625 1083857 1017251 1015929 1042361 1086568
18999 1086568 1126852 1150824 1199437 1285224 1350109 1409852 1509031 1717502 1986359 2287249 2800025
18988 2800025 3520250 4571523 6009388 7645714 8805081 8833117 7808124 6509456 5470938
18979 5470938 4796813 4457885 4359183 4564223 5147030 6185428 7616070 8942643 9443991
18970 9443991 8721752 7216460 5713322 4589355 3804900 3229233 2786217 2466581 2234423
18961 2234423 2038725 1870106 1745448 1614388 1516893 1394517 1280414 1174606 1046613 942613
18951 942613 872514 811409 768379 694578 660463 643295 597408 519808 489765 463339 453796 404115
18939 404115 368367 374345 357667 350612 334495 307328 278373 266742 249608 223411 198087 200946
18927 200946 228338 224179 168194 115727 162374 188749 152966 143906 163904 158098 133636 115768
18915 115768 121985 114326 102030 97880 98797 107901 125466 124737 131490 122946 101278 78818 61168
18902 61168 59274 75005 91931 76555 56046 42651 63895 82093 68113 77731 81004 70251
18890 70251 88246 98065 82790 45121 38424 7924 5518 69238 105483 89644 82958 94360
18878 94360 98190 114550 120665 98505 94694 75294 53442 86152 97107 70360 49918 67412
18866 67412 91889 94644 104481 88964 52462 41841 29733 65611 95392 58505 61151 32138
18854 32138 37186 55554 20049 8287 -1325 1342 63259 101281 69183 78464 63649 57995 70118
18841 70118 87827 80390 67419 89325 44396 -9059 -12738 21811 68083 44778 13626 -16349
18829 -16349 -4600 9294 21716 3627 -8506 15800 39909 67681 80502 37545 40221 35046
18817 35046 22856 41322 79954 79901 98119 79774 71572 67695 54174 25714 37133 81872 86085
18804 86085 57828 54195 73494 78578 87033 86841 97363 78023 62413 42214 8088 29666 41528
18791 41528 20473 33710 33094 69596 76019 36468 35264 37494 25833 19333 18366 64256 75772
18778 75772 71946 67893 72106 76606 79869 107460 115666 140619 185795 212706 265021 327511 316254
18765 316254 252205 189972 151706 122474 114925 95269 93997 128029 114631 89881 79642 87480
18753 87480 121240 127145 73789 36302 15483 54652 90609 132729 159829 207857 187295 154600
18741 154600 145912 109197 109295 133890 122558 116616 92525 78360 94371 86736 80028 61622 89424
18728 89424 78149 67323 98238 109904 94980 65185 72203 73687 71221 83770 89899 65252
18716 65252 75054 84645 126246 98289 79218 78222 110193 133790 121515 112464 107530 105109 90065
18703 90065 111452 132453 127355 95416 41415 40832 66109 59205 54209 57767 65267 55912 61133
18690 61133 64712 103264 135794 168618 196393 176226 189223 188177 148529 89908 48544 40249
18678 40249 73932 92537 104335 78985 87599 51188 24781 41217 22544 41867 36489 52293
18666 52293 36135 27046 45236 40951 29900 21410 12238 -3312 10075 -14850 -21506 10574 50018
18653 50018 43642 51712 53233 35048 5640 -5251 -14237 -37242 -2958 49857 44934 16266 10882
18640 10882 18513 21734 50811 27000 14577 -1867 -11073 9091 -3503 -14014 -30000 -26765
18628 -26765 -33162 -21433 3505 -29377 -47616 -48070 -10097 -15983 -18168 -1927 -14520 -13420 -9731
18615 -9731 -631 -12479 -18791 -12150 -25526 -2211 10209 -11356 -19017 -24412 -2313 7961 -9046
18602 -9046 -26906 -38988 -25357 18432 64672 41173 4074 -25570 -25213 -38092 -19264 26
18590 26 11179 29270 15920 256 14969 -2240 5891 20621 -2155 31841 46448 18869
18578 18869 15462 24381 -7199 -28741 -15576 4365 -3007 -4785 18170 33606 37476 23668 7298
18565 7298 34644 58844 10352 -30034 -38030 -49848 -44412 -16153 31603 27673 29383 29201 32691
18552 32691 20229 -5470 -27039 -38091 -31480 -26288 -25377 -7589 4971 -10488 -22876 -27540 -14653
18539 -14653 -4456 -8391 -3699 254 28288 36214 50700 58776 43877 74705 84801 95943 94098
18526 94098 95061 92527 82865 68287 65611 76492 87020 45427 35007 33844 39977 61499 74812
18513 74812 53165 40828 19112 12155 33301 60721 32310 9963 30887 35028 12309 -31770
18501 -31770 -32234 -3686 8558 38855 53219 41709 26504 45984 54126 26421 31236 47114
18489 47114 70719 86029 74281 78373 139301 145072 122489 105078 107165 85402 81466 90704 63568
18476 63568 57355 81593 106416 107818 108240 92889 91803 70203 66309 76642 70921 81182 81780
18463 81780 99810 101234 69597 45505 51296 40324 41012 65720 83511 80343 54040 55236 32814
18450 32814 39735 38653 50767 65603 83434 62572 57326 67344 66007 18184 -605 16794
18438 16794 21836 37200 28200 -3613 7398 40381 64480 70473 62276 74349 48613 53031 61439
18425 61439 70621 47961 37421 49601 86290 119413 108697 91257 61845 55197 66033 60139
18413 60139 41199 12921 2378 32244 53226 23615 5191 -7264 30331 40074 41763 80451
18401 80451 79103 30696 16284 2328 -17344 -5710 19449 37938 76398 117629 85825 22206
18389 22206 20944 20765 2221 17173 12984 28363 42941 58495 51688 39880 53390 43160 38427
18376 38427 27876 50323 80208 88808 88718 70876 71994 47726 45698 45523 79299 104551 86031
18363 86031 121762 104846 59478 65188 52506 48412 78882 109279 136488 125163 94931 72675
18351 72675 57351 46972 56149 87219 94699 101924 73592 81877 64389 59678 78946 76874 78633
18338 78633 69971 63645 89819 119071 118409 126227 109759 92693 67019 12636 -27111 -39239 -23257
18325 -23257 -6434 11783 12812 20015 28419 30925 7632 47550 53067 36796 31124 53275 32390
18312 32390 26149 41816 43885 62610 78640 74418 82776 67335 76767 106581 120550 94208 98652
18299 98652 101316 69086 55524 46008 45494 28182 43853 56039 50356 71835 52163 23111 14366
18286 14366 3746 10015 20295 72864 83321 109805 106745 68859 9126 12781 37022 65342
18274 65342 59451 57415 59002 73180 85002 82608 81441 69172 70666 70302 3600 -45129 -67695
18261 -67695 -53878 -36142 -14562 -8797 -2853 -5452 -22435 -35292 -55013 -59714 -41777 -22302
18249 -22302 -15516 -7474 25549 186 -22516 -29533 -19778 -3728 26433 2598 -20430 -3467
18237 -3467 27807 30741 27812 31468 20473 23643 54440 45495 36656 -20354 -66931 -59678 -14706
18224 -14706 -19391 -29663 12942 27603 42796 34062 48678 59900 58971 53639 68269 76096 29825
18211 29825 6530 18769 1179 -21880 -43746 -23106 16962 22596 16977 21176 14438 11181 25114
18198 25114 35472 45269 33940 12741 35667 41950 11788 -17287 -2750 8324 -32723 -28285
18186 -28285 10123 38071 12181 -41722 -33725 -29638 -28938 -4640 -6602 24041 13042 -6220 21232
18173 21232 18290 7164 -4171 22418 15966 20858 34584 25792 30535 25469 21174 36581 67855
18160 67855 37493 23568 12881 -11741 -7595 -7121 6282 19067 50953 65113 97641 109339
18148 109339 109334 114952 93073 78261 79342 111573 133231 149469 130923 142146 201326 228512 240882
18135 240882 253633 298522 376107 367922 367320 386474 426282 456259 546612 674190 810263 1003985
18123 1003985 1185442 1387231 1663910 2003801 2475114 3065250 3721250 4558617 5709159
18114 5709159 7418526 10261867 15276548 24661006 40381276 54985826 56937424 44130953
18106 44130953 28991202 19990597 14857417 11703326 9596603 8103599 7053695 6350455
18098 6350455 5843370 5461140 5265390 5168555 5032581 4628040 4151398 3705858 3239526 2849226
18088 2849226 2535850 2233777 1976389 1760597 1598311 1482980 1380611 1268038 1137848
18079 1137848 1017944 942799 849950 786877 749339 712345 650250 589653 564257 539958 469306
18068 469306 426795 422693 388517 378496 351426 324788 329926 328278 284336 230252 200511 189286
18056 189286 172023 187576 171405 168832 170183 132472 121082 111454 94379 98607 62393 75699
18044 75699 106809 115578 97718 81428 44956 35993 14571 22001 29639 52205 80763 102237
18032 102237 119828 120729 108526 100622 55469 58520 85245 56739 72647 99767 143327 123601
18020 123601 117978 90698 75849 66271 78670 96654 90185 71281 69897 72135 92942 106774
18008 106774 89727 51612 13961 15073 25001 32728 40805 44843 15767 1546 -5641 -38916 -31769
17995 -31769 -22525 1596 21378 38929 44738 47088 49505 33482 11716 19315 51851 73372 101515
17982 101515 110757 115196 97849 92708 75389 71969 83773 56587 33849 41450 48048 41494 37317
17969 37317 53825 64552 24087 11770 47795 38824 47127 38004 12371 27107 51075 57358
17957 57358 16665 3075 22373 27600 4701 40130 62680 30656 17069 -4858 -5678 -24411
17945 -24411 -16856 6483 7189 1928 9613 18868 5973 29668 44168 74858 116826 114307 89307
17932 89307 71072 69664 82113 60084 63933 55239 54556 31418 37796 4084 5587 12206 1641
17919 1641 -2576 25742 47296 66420 70560 65237 44336 57456 71946 77084 69413 71855 55213
17906 55213 -15824 -27073 -7104 14031 12901 43785 41781 39268 39028 62206 59374 70858 42830
17893 42830 52636 61383 24398 21508 11736 -11221 -21615 26478 25256 9041 -5411 -5909 11145
17880 11145 5914 -18374 13041 38460 49047 76249 92256 103760 93753 72822 46497 37414
17868 37414 36709 4828 6662 5893 -12716 38706 79932 84662 62364 52057 54743 48125 50442
17855 50442 82472 138799 159543 134778 86777 88930 36637 12367 5654 39495 12250 -10452
17843 -10452 -27547 -29573 -22912 11804 46474 46350 49674 56583 49487 -6601 -23342 5370 38179
17830 38179 13628 -43431 -24860 10945 8398 28560 10469 -5830 -37503 -25318 -5101 28385
17818 28385 -4835 -17804 -28532 -19000 -15068 509 -5688 -31072 3820 26682 10392 -8264
17806 -8264 20123 7767 -15817 -6471 -20470 -6723 3871 7527 -691 -15131 8218 9657 -8769
17793 -8769 16406 10344 -7919 -22015 -23113 -7568 8805 34481 46549 25228 -19686 -30587
17781 -30587 -41943 -74471 -95656 -88425 -76060 -29492 -33438 -50260 -47716 -74610 -69600 -60569 -52344
17768 -52344 -27438 7017 27489 26184 18041 -3940 -30446 -30817 -26944 -2447 -18968 -14327 21318
17755 21318 42918 24184 11894 -24618 -49262 -28034 -8009 -3049 15726 5037 5542 25901
17743 25901 41518 36728 16535 -6302 -2568 6414 -21413 -18070 644 -4294 -21199 5179 12782
17730 12782 -3857 -6544 7835 -36755 -55643 -79497 -87490 -33941 -10392 -6958 -3851 9036
17718 9036 29814 20946 4520 -45953 -51212 -58546 -56904 -5029 -10098 -40890 -44632 -13367 9914
17705 9914 6629 -7067 -26323 -32072 -20939 -6168 -3353 24382 44675 47431 19499 -19394 -57601
17692 -57601 -45205 -25932 -47389 -70879 -47127 -42541 -35652 -12783 293 2293 -44209 -33393
17680 -33393 -26353 -22782 -3717 5299 8814 -17504 -41144 -48543 -41485 -12071 -27750 -24219 -2401
17667 -2401 48462 31088 14545 31226 29021 23242 34939 24146 31085 16045 -6584 -16960
17655 -16960 -17797 -10874 -18365 -19927 -19045 -58744 -75446 -60455 -34520 -14117 -31738 -50593 -53031
17642 -53031 -39720 -16210 16505 -714 -12364 -16957 9828 1124 -26044 -18939 -3077 -1439
17630 -1439 -552 -16705 -55180 -53100 -74632 -73627 -54822 -44048 -25079 -14054 170 -21030 -10125
17617 -10125 -17534 -7077 -4379 8397 12145 -20272 -46721 -63979 -62124 -31257 13232 22168 -471
17604 -471 -11918 -17874 -20103 -27670 -590 -9831 -14678 12635 16994 12421 -36988 -60615 -60278 -20650
17590 -20650 -9755 -17011 -8157 2716 -11502 -34008 18 49315 95144 86988 64566 38581
17578 38581 -3357 10391 16300 -2142 23016 26964 14843 2312 20482 52610 55725 62444
17566 62444 30868 7301 -11511 -36016 -25928 -10002 -3648 1052 -31171 -37049 -37128 -34355 -7687
17553 -7687 12923 -30915 -32085 -20051 -26543 -9193 -11759 -15980 16048 -1670 -41355 -65655 -49903
17540 -49903 -51989 -25292 12260 491 -16852 -18270 -15045 -31829 -892 -359 -10346 -21843 -20108
17527 -20108 -20894 -2066 17057 36593 3819 -15826 -21700 -7430 -12573 -5681 35544 84835 124709
17514 124709 102706 51953 -3133 -18179 -37768 -22582 -9819 -12273 -28335 -39443 -26270 -31054
17502 -31054 814 15818 8715 -1663 4540 11203 -12545 -21115 -529 30816 7715 -8351
17490 -8351 -13089 -11851 6843 20924 -7190 -20094 -47565 -27056 -32609 -42447 -71683 -60980 -3486
17477 -3486 10952 -2304 19765 -14121 -28119 -17890 1295 6962 -13206 -24167 -2177 9367
17465 9367 -3245 -14149 1548 -10300 -9952 248 -10273 4071 -189 -1277 -6358 9626 -3723
17452 -3723 -30408 -13769 -14532 -23232 -40134 -8148 44652 97219 190448 290370 347559 319960
17440 319960 229492 156963 124550 113727 88947 65008 69328 90640 64581 25072 51949 39648
17428 39648 15364 23776 27290 39850 46647 36375 30859 32250 -1514 29164 53365 12288 12785
17415 12785 32395 -8842 -43162 -48675 -48872 -14111 11611 15826 42094 22928 9285 6145 2918
17402 2918 2195 -263 16572 24511 5844 -28612 -32747 -25001 22579 59859 61065 48437 51058
17389 51058 26545 3989 -19018 -2726 4713 -22573 2534 -13528 -36314 -35140 -49908 -47067
17377 -47067 -38770 -49805 -51585 -38505 -27888 9565 29155 37696 34734 21278 24592 -10 -21906
17364 -21906 -47506 -52601 -61692 -51695 -74838 -66172 -41221 -12506 -9431 14065 20263 19174 -828
17351 -828 -15346 -35800 -40823 -13827 803 14681 8798 6496 47353 57355 24621 -22521 -20377
17338 -20377 15548 37128 -1182 -26540 -15583 -9515 -14098 -5731 -41878 -19308 23601 33919
17326 33919 36854 32592 -14364 -15837 -10416 -15475 -972 499 -18196 -6644 -16503 -44066 -67425
17313 -67425 -31972 -13613 -21804 -896 -1784 4946 -7310 -29212 -41838 -46633 -56825 -64766 -24145
17300 -24145 3714 -4712 -2996 -36980 -34305 -1619 1983 -29842 -16652 -7436 1686 20607 14616
17287 14616 795 -16783 2931 11011 19898 34951 15176 6934 36056 35514 13344 31454 44282
17274 44282 54545 61334 86558 101296 108793 130025 133436 109909 77837 36202 23339 44676
17262 44676 59279 40924 15912 -15323 -8625 5011 19648 8715 33943 48138 37678 50155
17250 50155 56271 65487 76163 24662 8389 13071 15202 27535 23852 64946 62814 56614 39650
17237 39650 10248 -23910 -34950 -2441 20526 15963 -10595 -16983 -5470 -10541 -30532 -35941
17225 -35941 -3692 29659 21347 48085 53803 44201 29579 54191 82981 68095 64852 84614
17213 84614 56242 29868 32322 36512 22977 17190 -2945 -15426 -30893 -23294 -14548 23218 65710
17200 65710 58054 46756 33387 43903 36979 25956 58402 62285 29486 16853 3613 -16269
17188 -16269 -10301 197 -4748 29726 88299 86632 78063 56320 28432 38339 75123 66263 57769
17175 57769 66915 97735 92132 125127 152636 174694 149713 108780 100398 105911 123201 116477 131597
17162 131597 133889 119012 110961 118084 119362 97103 74703 105577 106804 101224 105021 89135 119498
17149 119498 120832 100503 102049 114172 78924 58994 76037 96414 96013 94124 87884 87964 81082
17136 81082 79062 57423 43252 25679 54805 127040 151973 140593 133750 135600 167278 165599
17124 165599 117803 89451 89402 75323 57398 95063 95062 112671 112589 129296 132636 151941 175234 194731
17110 194731 200333 233826 270443 260620 267780 297484 325482 341349 316488 318348 316738 291198
17098 291198 267827 307346 320035 318650 345957 351869 341708 341297 380950 417210 438768 460871
17086 460871 483935 553732 624038 681165 735118 786881 842535 931070 1041506 1216367 1453083
17075 1453083 1781912 2167431 2664697 3409417 4431760 5758811 7309403 8833474 9818773
17066 9818773 10084137 9976681 10011298 10350676 10611144 10335405 9401289 8039566 6653563
17057 6653563 5499109 4646454 3975056 3508792 3184554 2916338 2698274 2466309 2294981
17048 2294981 2158537 1986421 1810848 1682966 1573948 1441555 1303092 1214679 1113809 1019703
17038 1019703 969590 929411 875345 828202 792717 783927 798487 850180 908972 925200 955272
17027 955272 966714 1016659 1105328 1212997 1331934 1484693 1728422 2068015 2486421 3041940
17017 3041940 3849699 4932086 6305813 7810262 9045365 9639599 9648623 9491623 9621634
17008 9621634 9981432 10102517 9570566 8360843 6931452 5664482 4730106 4026587 3506873
16999 3506873 3101118 2777729 2550274 2319127 2106064 1943168 1820335 1698077 1567607
16990 1567607 1428042 1327992 1214973 1055441 958108 901156 815428 731424 652768 592729
16980 592729 559173 492284 455988 449928 419538 379409 352529 327851 302824 250296 257434 253693
16968 253693 241971 261149 259954 225559 210282 227406 214553 213488 176439 158849 143307 146961
16956 146961 166048 174122 165604 138876 98485 80739 79167 94876 106301 116356 112194 109574
16944 109574 94388 98418 119598 107726 84336 64550 74536 78435 78095 73197 66452 22535 -15604
16931 -15604 14940 61425 69357 82287 100675 64936 58577 64334 62864 44487 24271 82997
16919 82997 96351 20076 7692 17388 27679 11474 -7729 16327 13484 857 -4039 40004
16907 40004 58322 48939 16480 24837 46437 45166 32370 53803 50817 46315 38192 78359 37710
16894 37710 29654 28645 58917 39106 14688 21706 79664 106962 69692 31074 18120 -11613
16882 -11613 -48075 -53371 -30974 5687 19674 13687 2129 8699 -4179 3810 -7075 -1145 7611
16869 7611 11224 -12974 -15222 21073 36939 53743 485 -22200 1431 51616 56085 46519 -8431
16856 -8431 -16130 50791 56084 60690 45840 25786 21879 21698 12111 14925 33490 47453 54184 15848
16842 15848 -14326 11868 18807 23445 5432 -31044 -32202 -26543 -22787 -13366 -37150 -41941 -20462
16829 -20462 19482 48401 53443 36497 18104 -943 5943 -21669 -11116 12738 44551 25552
16817 25552 -27241 -57287 -36070 -5908 13855 -14663 -23293 11091 21334 -21138 -35680 -16599
16805 -16599 34183 45567 49014 33266 10220 9721 -3666 12759 37134 -11472 -28795 -19792
16793 -19792 -29574 11473 28847 29057 38896 13939 -19152 -3794 37639 35062 20517 15834 45277
16780 45277 60213 40003 45690 32293 26794 32285 49419 41523 44679 74254 39196 18213 36081
16767 36081 73472 50306 5155 5327 -30050 -34273 -25095 -11037 -2517 31069 48807 47655 36829
16754 36829 50 -1620 -12874 -50159 -45537 -46371 -38888 -58371 -67271 -53473 -43163 -43883 -30475
16741 -30475 -7637 -3699 -2197 4211 7172 15609 12027 14107 350 -5142 24375 52296 43807
16728 43807 6992 -18943 -24572 3187 33161 8113 -20200 -13230 -4195 -32700 -44189 -19760
16716 -19760 1073 -19864 2443 5880 -15178 -3977 -2686 -33317 -12773 10089 8579 -2704
16704 -2704 -19863 -14591 8055 38494 32653 -10163 -31715 -39544 -50022 -47575 7035 9119 29427
16691 29427 54648 65106 52852 15323 -20847 -12125 -12363 3604 -5042 -12580 -11981 -18945 -19431 -22135
16677 -22135 -6955 28427 45668 42533 -4870 -15096 -5612 -20199 -16341 -26853 -24134 -15153 20154
16664 20154 44995 27674 -3221 -12838 18250 52995 66337 43368 36785 27111 33627 38433 62392
16651 62392 92849 73007 11165 -17393 12281 17437 4279 -14792 -29873 -46781 -32050 -39818
16639 -39818 -29078 -34063 -36896 -18880 11939 39345 48276 -6683 -28858 -24692 -26885 -18886 20434
16626 20434 45099 44370 25180 22726 20430 30315 39303 46240 33629 -22088 -17591 -6146 -1643
16613 -1643 788 27600 39946 21913 16016 -11542 -31059 -15350 -5836 -760 11007 -26781 -20816
16600 -20816 6447 12341 27558 43463 8456 -9540 -44709 -44266 -25709 -26800 2287 13890
16588 13890 58261 52657 43125 43986 30478 -11160 -15343 -7650 -9817 -23251 -29666 -30473 -21283 -18803
16574 -18803 -22846 -6279 5540 18875 2467 -12414 -743 -11137 -17173 724 5490 22273
16562 22273 38684 32498 15139 33890 53580 51619 58423 27690 6130 22641 51221 57749
16550 57749 62550 39415 55925 63979 73211 88517 81796 45401 36678 16692 7126 32755 60233
16537 60233 57405 26642 12960 31645 19922 -699 2655 4094 17936 36311 34347 9935
16525 9935 -4629 14811 29952 7268 -29980 -68959 -60855 -19191 10087 3133 3883 4588 10797
16512 10797 25612 -2731 -5788 16661 22007 7600 18334 45798 64734 7613 5130 53621
16500 53621 101144 97825 78373 62640 67124 32093 75067 98978 82199 43545 18961 -18035
16488 -18035 -25095 -17320 -36399 -49860 -66691 -44943 -23826 -23578 -40551 -44841 -44306 -10543 33447
16475 33447 43618 73402 72392 40468 51505 46348 36258 8827 -5190 -1188 -34479 -41452
16463 -41452 -65037 -47422 -4352 -2874 -19001 5495 7607 -16986 4882 -2138 -20389 -4084
16451 -4084 25748 21313 19491 12827 19033 22570 20036 27077 52063 41782 33081 -7609 -44456
16438 -44456 -58039 -50959 -23830 -8481 6396 -25394 -33817 -27599 -30326 -57701 -47873 -17268 -31220
16425 -31220 -54641 -31014 -27008 -48049 -37750 -30392 -16396 -1559 12534 16239 44369 46322
16413 46322 20911 -14330 -8765 -18639 -38486 -57519 -42803 -7446 -21960 -41907 -37974 -11526
16401 -11526 -19476 -20393 -9444 -11985 -18212 -13974 -774 23241 42658 13826 -3886 -5729 -34350
16388 -34350 -74911 -72152 -36220 31108 36164 10970 -18243 -69262 -74900 -47405 -6997 12397
16376 12397 11365 -31606 -38245 -20654 -27461 -15143 -15305 -43154 -56606 -47407 -29206 -35518 -27740
16363 -27740 7640 -11195 -30746 -44437 -21419 13860 11924 2149 -15911 -31458 -31179 -39648 -69237
16350 -69237 -46412 -48115 -30209 -28096 -7216 34597 38809 -1467 -9490 37491 57102 22946
16338 22946 -19399 -3827 -16234 10436 26555 7523 -23531 -47062 -22318 2197 27693 621
16326 621 -2700 -11097 -13725 -14135 -23579 -5569 9376 -2750 -6225 -6221 -9927 -20359 -138 -6203 -15258
16311 -15258 -23050 -27740 -21036 -7898 21561 28333 -10582 -35886 -40332 -41992 -12643 -10971 -12308
16298 -12308 -17313 -30031 -28733 -21821 -31104 5563 -11645 -9380 -1341 -15659 -24262 -14776 -26523
16285 -26523 -7927 6088 16874 32656 20445 -4618 -14309 -23276 -1304 -12022 -19113 -36925
16273 -36925 -31329 -5585 8793 -1204 -12205 -3404 12063 20873 9578 154 -15279 3944 16364
16260 16364 1995 13332 41043 38286 78084 73460 55640 40969 11869 22369 12394 -16409
16248 -16409 -29970 -34312 -37162 -60053 -50403 -30289 -30120 -15526 -3999 26450 30845 -11658 -36194
16235 -36194 -35009 -23465 -3918 -12742 -31742 -11413 19793 60054 59810 29174 22933 35349 41782
16222 41782 52548 23108 -1554 14920 16487 3294 -20779 12929 65846 69006 21005 35723
16210 35723 26240 27019 27461 14424 17011 -31541 -36346 -39001 -38164 -19584 -43288 -57270 -41533 -31456
16196 -31456 5983 33272 33689 33626 1155 -13209 -32218 -45751 -46088 -35859 -1407 -14136 -41706
16183 -41706 -80751 -95270 -84605 -46816 -5899 26265 13275 -33185 -32893 -43196 -26434 -6283
16171 -6283 13681 35661 26624 9521 20458 10312 18604 25022 11887 11968 -2269 -8966 4799
16158 4799 21924 11714 -9334 3605 2822 -24582 -37202 -37010 -27774 -16380 -45705 -86471 -111705
16145 -111705 -102768 -97154 -45870 -16705 4104 29195 24791 -11410 -34088 -49115 -62424 -41493
16133 -41493 -44018 -28862 -26996 -22648 -24284 -33279 -36793 -59458 -48994 -13675 -15857 7591 15730
16120 15730 -41010 -69815 -67481 -40464 708 -9766 -15757 -7493 7659 24481 11635 -16883
16108 -16883 -30455 -7352 1630 20249 18247 1548 11338 29632 26844 29442 62959 33086 15204
16095 15204 -25111 -42485 -28432 -21473 -310 11426 18634 24458 27 -6374 -27891 -14798
16083 -14798 21087 29930 25728 -2107 -24118 -19045 -13594 -20144 -41481 -57036 -43429 -51933 -64268
16070 -64268 -39395 8882 48576 31419 -114 -16020 -2646 -14691 -11197 -3539 4537 12245
16058 12245 30215 2185 -13479 4701 9895 8315 -23250 -35063 -35681 -44697 -31967 -13841 -6322
16045 -6322 9392 34746 19084 -12428 -21875 -8124 -11080 2133 9254 5527 6825 -23842 -42252
16032 -42252 -16659 -4698 -4025 -22644 -5260 41281 56146 4372 -12826 -14743 -13119 -9033 -13424
16019 -13424 23734 24713 8485 -18082 -38043 -6430 7793 4055 -10706 -17298 -42357 -67441
16007 -67441 -88103 -75653 -52299 -28218 -20543 -45983 -53541 -46168 -46872 -73319 -70571 -43219 -1137
15994 -1137 23324 10016 -11380 -31915 -54758 -44999 -42864 -35691 -31027 -11051 8268 15007 -3541
15981 -3541 -15085 -15951 -47604 -49140 -34760 -27212 -28978 -37180 -38941 -3116 30153 -27483 -39104
15968 -39104 -31881 -37896 -75556 -63957 -46185 -57765 -17772 2249 8996 57035 32789 -26586
15956 -26586 -47029 -56171 -51882 -34813 -47468 -32080 16182 40417 47554 67506 91287 69117
15944 69117 27733 -200 -8567 -43177 -29034 -2692 -18263 9999 25801 17298 7515 -7027
15932 -7027 9640 32172 28690 -10590 -42931 -60815 -19428 6968 -12245 -22612 -957 -37287
15920 -37287 -36797 -11742 -1714 -15747 -56426 -76282 -74048 -43257 -16747 -6551 15727 23510
15908 23510 21169 11848 5373 18960 -2759 4140 7320 26915 23421 10516 1120 2258 -5712
15895 -5712 -542 25601 2643 -16742 -62902 -60610 -52714 -36199 -50331 -28470 19668 20947 20677
15882 20677 22218 -17363 -29867 -32361 -40458 16575 43448 57841 61630 19924 5901 17235
15870 17235 50887 61225 47153 21737 32937 46837 36408 27527 39024 17520 52848 48360
15858 48360 7236 -7048 -3067 -21010 -27412 -26576 -10715 4837 -8036 -10774 -5495 -10824 -4973
15845 -4973 -5225 -7634 -3562 -21872 -48892 -53704 -44730 -30093 -13408 -5229 -27863 -29622 -26598 11037
15831 11037 22971 20937 3771 10456 29700 -39 -16121 -9106 3686 7109 4777 11137 15481
15818 15481 -1360 930 -5613 -29492 -33105 -13216 -1178 4436 -4000 -23766 -10354 8294 34456
15805 34456 32825 12503 1987 14327 -20644 -44604 -50009 -28265 18688 30378 17727 -5845
15793 -5845 304 8983 -22165 -18184 -490 4559 18301 5007 -6330 4870 13311 25097 7626
15780 7626 -14716 -20735 -24752 -43433 -29870 -29675 -22192 -32885 -44725 -11162 -4420 -3040 32847
15767 32847 1256 -8925 -6002 -22638 -25088 -35472 -37723 -4157 36828 30536 19086 10511 3874
15754 3874 906 23140 5692 38851 40485 19806 10802 -2339 23893 41712 47512 36550 43912
15741 43912 58172 52064 34699 38341 22682 -11946 331 -15416 -14386 -34614 -14813 18982
15729 18982 13269 -4147 12655 -1204 -5573 -37542 -15939 -7857 -41191 -46944 -29236 -4949
15717 -4949 11956 32338 -9915 -21640 -15838 3280 4322 -16091 -14142 14963 39895 43695 32272
15704 32272 11345 -17349 -50898 -55245 -35628 -40850 -53763 -50788 -20896 -18890 -15930 40035 56539
15691 56539 25609 10733 4670 31823 44483 24458 4033 18029 41993 53431 50109 17462
15679 17462 10074 20039 34878 37066 10838 28866 23045 41396 21157 -6246 -22963 -25595 -6916
15666 -6916 -28472 -49467 -28718 2961 -36681 -43950 -59175 -40105 -21890 -27825 -39666 -64939
15654 -64939 -37652 -35192 -31399 -25455 7999 18293 -17525 -44129 -30099 -10841 -10890 -616 18032
15641 18032 -9138 42577 65946 25639 -5295 -44079 -69519 -27990 27112 16668 -26555 -45757
15629 -45757 -39455 -27125 -9232 42032 50793 30275 14124 34414 59225 86662 82352 66285
15617 66285 45540 42934 27714 16665 43341 34634 17859 10435 5070 8447 25643 19114 -8231
15604 -8231 -14346 -20681 -29010 -28339 -13395 -23353 -14028 -22359 -48623 -50086 -21646 -49952 -22913 19575
15590 19575 5853 -32096 -48259 -16555 -18786 -29463 -55521 -63604 -55675 -52215 -16394 9873
15578 9873 14713 16627 31707 -9381 -29521 -36105 -37267 -44558 -25274 -8048 -4487 -21635 -23400
15565 -23400 -48305 -50499 -39766 -47268 -29595 -32601 -22516 10589 49829 47917 733 -1793 6504
15552 6504 3700 5739 28552 18890 -9328 -24406 -38310 -33120 -29036 -37704 -32079 -49172 -34636
15539 -34636 -6316 2922 -844 -18045 -10379 -37987 -31004 3012 20419 -14377 -26170 -14387
15527 -14387 -18126 -24001 -34499 -29843 913 14860 21943 24419 -5873 -7192 -23234 -46165 -30935
15514 -30935 -22548 -2081 179 -25280 -18145 -4981 -1843 -2476 11528 -4168 -36761 -4253 -4345
15501 -4345 -23196 -20189 -15613 17971 15105 9944 -9697 -22623 17673 36819 34550 32780 950
15488 950 -11407 -9488 13600 -10237 -9017 11482 -6303 -28036 -55589 -36939 -49034 -32967
15476 -32967 -5768 2838 5295 16847 16695 17305 -8860 -54395 -60344 -43541 -57917 -70723 -69602
15463 -69602 -49137 -46824 -20600 24083 27997 -12028 -22896 -10298 -51494 -41435 -45338 -28643
15451 -28643 -17500 12266 43883 55688 22396 -2499 -7589 -8480 2374 15191 -11070 -5475
15439 -5475 -8237 -10967 -31255 -10180 7023 4723 -19731 -27509 -28474 -37797 -14222 -21868 -18508 -19318
15425 -19318 493 12434 485 28909 38531 22901 9143 51946 35579 8601 -19911 -28411
15413 -28411 -5073 7128 -22549 -37642 -17774 30795 32339 -3563 -28782 -27605 -19516 -34290
15401 -34290 -27907 -29202 -32903 -28830 -30412 -17807 -34268 -41364 -14608 13000 -8865 16803 3633
15388 3633 -14867 -23374 -1500 -18617 -33762 -50749 -37867 -34677 -16734 -20373 -14633 6038 5795
15375 5795 2776 -8280 470 13528 -17224 -15739 -26780 -37786 -37005 -48722 -31498 -23311 -11021
15362 -11021 -1581 22513 16605 763 -8917 12958 25774 933 -26776 -30084 -33704 -55875 -25309
15349 -25309 -19544 -3907 11957 -9255 -13879 2783 35759 41043 1047 -24839 -44967 -62632
15337 -62632 -27273 -18745 1920 12171 19659 29814 22134 39581 42529 10538 -19035 -18076 -12125
15324 -12125 -36621 -19754 39825 40265 32093 4237 -6068 -651 -16379 -16892 -15924 -715 -19246
15311 -19246 -21590 11197 25659 21116 -3215 -40820 -71791 -58935 -32407 -12071 28830 33573
15299 33573 38062 24568 29437 33955 10754 -2737 -13195 -17595 -39235 -24146 -13832 -4575 25261
15286 25261 22416 -22502 -33721 -8550 -15515 -6028 -7103 -28985 -41629 -33541 -15619 -15807 -169
15273 -169 170 -57935 -70466 -43301 -14258 19474 15356 24228 31933 1459 -8146 29372 -7696
15260 -7696 -45956 -61296 -69665 -63672 -41605 -31333 -47881 -71956 -35328 13174 7706 -26743
15248 -26743 -33252 -16719 -11643 22489 14541 12962 25819 -6194 -60954 -39549 -10289 17073
15236 17073 19386 -2013 -17210 -54800 -84349 -79524 -76233 -69846 -28356 -9565 -13124 -21133 -50036
15223 -50036 -39087 -47285 -17924 2705 2534 -21059 -10889 384 24653 23352 -5006 -8296 -14366
15210 -14366 3029 3395 -28613 -79608 -109852 -107876 -92162 -130447 -108997 -96492 -87137 -68523
15198 -68523 -61337 -25183 -139 -1676 -270 13439 2467 -14352 -11197 -28570 -45325 -72837
15186 -72837 -72716 -65372 -57064 -32536 5325 11369 -13663 -11495 27327 14165 -11477 -18607 -36562
15173 -36562 -38223 -52673 -33782 -22361 -41854 -45469 -20065 -43094 -78364 -36728 -12169 5204
15161 5204 -9228 -15415 -18456 -49930 -76977 -87902 -77730 -41156 -19389 -34168 -60973 -52893
15149 -52893 -46514 -70758 -79717 -52985 -34532 -18977 -15905 -13687 -12745 2308 48173 80468 90932
15136 90932 90215 62202 28340 29718 27267 -14746 -41000 -61737 -52744 -20691 -5606 -7161 -8746
15123 -8746 26209 33171 28191 -1685 -5282 -6039 1954 29527 46638 37382 25719 -13268 -39946
15110 -39946 -46430 -72463 -62154 -55821 -59010 -44208 -16295 -272 -7656 -31912 -32998 -23699 -39840
15097 -39840 -36980 -16042 14925 -8294 -42536 -22494 -20971 -26385 -18095 -31836 -73161 -74554 -69241
15084 -69241 -73516 -56423 -53403 -41385 -47612 -54939 -61268 -56432 -38635 -8968 -23905 -33515 -27494
15071 -27494 -25528 -43800 -46716 -20482 -20967 -37728 -17102 -46474 -7970 37894 36833 4792 14886
15058 14886 2038 -3293 -22833 -21963 -26613 -37981 -33064 7798 12695 -2324 -950 1964 -8660
15045 -8660 -24638 -37394 -34230 -44573 -44923 -22964 -45407 -55202 -38082 -23284 -21627 -34103 -41241
15032 -41241 -3305 -251 -18366 -19428 -12576 6710 19635 2034 34445 27763 2630 -3895 -28374
15019 -28374 -48860 -16664 17032 9414 1316 -8179 -13001 2121 -11723 6096 6753 16054 -7407
15006 -7407 -18839 -53789 -49034 -54741 -62169 -51998 -40082 -24728 -13093 -15932 -39195 -46950 -18877
14993 -18877 -35387 -41302 -13692 -19280 217 40279 23237 5414 -22274 -60053 -46537 -5526
14981 -5526 3423 8681 -9393 -6411 -3962 35166 78413 89285 68497 23707 828 29148 40816
14968 40816 30093 21984 50966 53209 43353 22232 4718 24296 41201 15794 5624 21363
14956 21363 7341 -10625 -9892 24279 3035 905 -661 -15519 13665 18056 -6895 -29869 -22473
14943 -22473 -5208 -28431 -29977 6239 8244 8803 26782 33305 17738 8602 20782 20103 -11038
14930 -11038 -13016 -32211 -981 -794 7441 14528 16160 37450 28714 -3659 -9052 -2723 -9321 8767
14916 8767 43242 59213 49547 45977 -6844 -38753 -56176 -65637 -57669 -28590 -21882 -34907 -59864
14903 -59864 -20815 13814 4587 -19392 -20756 -8256 -9099 -14519 18855 49518 35850 -8977 -11370
14890 -11370 20124 30992 -11097 -34436 -45562 -36453 -29027 14941 -14062 -47860 -41368 -36036
14878 -36036 -8724 24903 55877 22423 -13144 14079 1246 8199 -2703 -9532 -4890 -26088
14866 -26088 -34474 -33817 -5650 5794 -8875 4080 7884 8453 26164 13675 -4847 -262 33528
14853 33528 33589 35724 40552 25397 13888 16666 12786 13290 14115 18464 5525 13194 34963 8940
14839 8940 -14348 -19920 -26945 -18162 -19265 -25154 -40464 -22557 -6449 -9266 -15619 4678 -10126
14826 -10126 -18339 31670 3861 -14181 7612 11302 -35275 -61906 -20069 -9286 -10183 -12380 -28830
14813 -28830 -48905 -50330 -60028 -21802 6504 -27300 -33205 -46962 -18320 8017 9665 -15380
14801 -15380 -19561 -18882 -48800 -37676 -10075 -1162 16631 -1151 -29434 -45672 -21527 -15710 -24176
14788 -24176 -21609 -45283 -62686 -57118 -37128 -14903 -31365 -68309 -86784 -41173 2686 13248
14776 13248 10237 31504 48184 36632 10634 2535 -17373 -40820 -29768 -2257 11554 36213
14764 36213 61468 40745 3952 -20550 -9261 -21493 -18036 -18136 -8205 4199 238 32655 52450
14751 52450 39564 56142 54452 17874 11953 -553 -18036 -27263 -24827 -45852 -76852 -72456 -29747
14738 -29747 -38219 -50955 -37801 -30150 -13764 -3472 -32081 -47363 -28471 -8529 3723 10966
14726 10966 22109 -17595 -71844 -58590 -21605 -29921 -25867 -19680 -30365 -30149 -17561 15362 31712
14713 31712 48814 18192 17916 33175 22673 13553 -14334 -249 6211 25937 2496 -26990
14701 -26990 -34764 -11994 -20734 -29621 -18622 -30488 -4032 -5 -1651 -1941 -39690 -77960 -99685
14688 -99685 -76538 -38188 -27954 -46930 -29230 -24526 -19258 -18518 545 -7297 -5508 15709 -14648
14675 -14648 -38747 -38013 -16728 -15533 -26657 1699 -20372 -28669 5453 -1495 -7358 -9521 13102
14662 13102 30103 -11977 -31205 -9341 5524 -11331 -23812 -6157 -16484 -34096 -36181 -23691
14650 -23691 4775 -1786 -3144 8933 -7318 -28322 -28511 -19767 -8878 16753 29794 16070 23657
14637 23657 26050 -9207 -30035 -17832 -25668 -38572 -28980 -19136 -6908 -15920 9007 33345 32856
14624 32856 13686 -39397 -30842 10372 27406 -3256 -3319 -38620 -66296 -11774 8941 -26613
14612 -26613 -20951 -19444 -51636 -37700 -23229 -38595 -33929 -6255 16883 247 2490 -1794 -1541
14599 -1541 -1399 5036 15412 -988 -11579 -40998 -63907 -58650 -46195 -47747 -69727 -53465 -37918
14586 -37918 -42313 -34726 15090 32395 23765 -4029 -11802 -8817 -9762 -6151 -12252 -36950 -73613
14573 -73613 -70269 -50008 -79567 -77325 -64494 -31356 -6048 -9208 10756 36730 874 -30895
14561 -30895 -35506 -40328 -23935 -27857 -51159 -74773 -68814 -12730 -10377 -6104 -3545 12139 -4316
14548 -4316 -27483 -38994 -11338 13117 16739 1418 5303 41563 32596 17002 -11128 -7133 12744
14535 12744 22046 -3522 -5863 7839 -11372 2437 9964 -13515 -9637 -24097 -9969 -5580 -4817
14522 -4817 9896 16317 14761 37192 44888 24273 -11057 -28102 -35326 -28298 -5306 11858 15951
14509 15951 53418 54132 36040 34415 -4107 -22114 -263 36084 33741 12046 11896 97 -5795
14496 -5795 -6523 15370 35519 45537 21634 -23523 -35386 -18498 19643 45752 75024 47163
14484 47163 24893 6411 9225 -22588 -9133 17401 -9450 -15862 -23055 336 35305 25074
14472 25074 984 42071 48764 39016 27102 59271 59175 27725 17175 7576 -22731 -8744 4387
14459 4387 2885 23122 16845 14640 1309 -27185 1073 -4772 -28067 8762 -7330 -16106 -44275
14446 -44275 -67000 -43931 -56739 -71186 -66560 -89045 -99462 -89477 -89745 -119348 -109009 -95304
14434 -95304 -73362 -47137 -61416 -46507 -39801 -46003 -34429 -61903 -63538 -38588 -46000 -23373
14422 -23373 -29773 -19188 -6613 -4916 40471 46755 27722 30412 24659 14800 10309 -12173 -30172
14409 -30172 -36980 -41884 -46739 -4801 18081 14356 15721 21240 2426 3835 25807 25638 32555 10339
14395 10339 -6963 -15053 -23608 -3509 3999 -7027 -11881 -4079 -19214 -39934 -33024 -19927 38274
14382 38274 76052 76733 27681 9223 16459 43646 46895 29621 18229 20699 9022 -37462 -33708
14369 -33708 7969 16056 435 13595 9032 31080 38865 12838 -2698 -14118 -3306 -7312
14357 -7312 -34609 -54524 -35339 -54099 -40125 -39002 -22023 -4634 16378 13551 -10790 5568
14345 5568 -7826 -1571 42289 27676 3858 -8684 -14100 -18952 -46817 -22410 33515 40633 37514
14332 37514 9239 -11266 -16319 -6414 2208 23207 40387 56628 68104 74602 30050 -31812
14320 -31812 -41103 -52928 -49352 16629 46456 30872 -39782 -57492 -21678 -19660 8658 -13018
14308 -13018 -37141 -25815 13698 30000 23433 26166 7796 -38585 -30582 -28651 -34626 -27501 -1003
14295 -1003 9723 -5627 6590 26202 17753 1756 11827 5747 36421 46310 26406 14842
14283 14842 2669 -20656 -25289 -11429 7688 -8192 -27622 -39247 -41263 -77001 -52977 -21212
14271 -21212 1181 14527 -12398 -45884 -44708 -52323 -25024 -31524 -55468 -59648 -62791 -36379 -40561
14258 -40561 -39251 -18541 -23296 -3218 35012 45965 28088 12131 11803 -3068 -4031 -14470 -31427
14245 -31427 -26549 -15231 8441 16707 6014 -14915 8027 32035 25308 -12204 -36717 -2873
14233 -2873 -1663 -1946 4924 -13383 -8205 13076 35582 47508 43077 30919 23379 15521 28148
14220 28148 45060 76995 52223 42241 22354 7073 -16129 -15741 -152 8209 -19045 -19142 3140
14207 3140 10970 -9679 -50417 -56788 2446 -17308 -17180 -4522 8889 9738 21848 50269 54925
14194 54925 14112 21830 13709 -28485 -47270 -37050 -28980 -36925 -33407 -29470 -27031 -5776 46788
14181 46788 32415 29275 7565 -21557 -3815 31046 17048 27683 52619 52081 53545 14443
14169 14443 -9112 11035 17889 15500 26274 19029 32992 28479 -12268 -49629 -45452 -38682 -32784
14156 -32784 -33197 -42057 -54717 -36896 -13388 -35714 -51550 -46524 -24069 -13919 -29845 -41420
14144 -41420 -16911 -2173 4603 8496 20726 512 -7326 -3259 -5715 -39042 -33027 -11191 -4154
14131 -4154 10699 30536 5980 1999 16624 38707 64352 89798 91782 38005 -207 -3683
14119 -3683 -9045 13068 30565 43515 29551 -37075 -61750 -39390 -10193 5537 56179 47402
14107 47402 2366 -40696 -39936 -36657 -28809 -31431 -9515 28516 2955 -33499 -56628 -16933 25386
14094 25386 11890 7977 -8831 -41547 -32694 -23388 -35560 -25531 -15633 2393 20492 20930 10449
14081 10449 -3185 -29141 -50976 -57109 -37227 -21112 -30287 -30830 -5276 35629 34306 39647 23989
14068 23989 -2356 -17129 8832 28889 10433 -7024 -9044 -15118 18329 44642 14869 -20003
14056 -20003 -3445 19767 9537 15209 39908 24087 19372 17634 43892 49450 28149 16561
14044 16561 -14003 -15511 7885 21844 9488 -2125 -12008 5255 15199 38626 36081 23611
14032 23611 -18814 -37298 -35152 -40474 -54785 -60602 -43801 -37625 -9915 8440 -10873 -33042
14020 -33042 -16654 23992 40222 14104 -6166 -5019 23201 16137 17928 18924 -6290 8913 -12094
14007 -12094 -33280 -4960 -12313 -33342 -27950 -20789 -20189 -18165 -5760 9339 -3029 -26384 -4793
13994 -4793 -2361 2513 -1924 15194 -2162 -22717 -40599 -63430 -36589 -13329 276 21427
13982 21427 9385 -14315 -45528 -52742 -46985 -34308 -20338 -18070 -38695 -34931 -10004 -38483
13970 -38483 -19529 -48931 -47864 -29242 -42928 -29366 -9464 665 19317 48093 50200 75746
13958 75746 76153 41869 6111 -29150 -14785 -6424 16454 -7868 -45176 -39033 -9248 20262
13946 20262 -28890 -35814 -34261 -14828 -12518 -44106 -4615 2876 -12659 -6991 20035 64290 75290
13933 75290 48101 66379 28023 -15841 -33769 -31576 3601 5981 15651 4840 -48778 -39090
13921 -39090 4243 -12101 9915 23999 23544 21459 9995 -20747 -41863 -47755 482 48614
13909 48614 9533 -4603 11918 7542 6790 25940 56546 65271 28893 28546 18643 -18072 -49476
13896 -49476 -36656 1775 26092 18064 12028 -6005 8443 18273 23441 18585 -20675 -24532 -24174
13883 -24174 -16021 -14652 -26949 -38168 -31176 -22507 -14306 9644 47553 18918 6518 13517 48921
13870 48921 33872 -885 25202 41742 33612 37205 32177 34297 33908 28587 -7173 -30840 -17505
13857 -17505 22342 29174 20499 8396 -7672 -17416 8696 18286 5965 -10502 -36269 -32280 -20639
13844 -20639 -11094 2131 2047 -4096 -20846 -21135 8862 -3643 -6109 -1728 326 26975 -6134 -47173
13830 -47173 -39574 -22759 23442 50195 36545 23227 27977 44240 39470 19286 -3589 -19083
13818 -19083 -26561 -32433 -34715 -45317 -49813 -66727 -57518 -39064 -48357 -23158 -8362 -17630 -9291
13805 -9291 -14431 -26465 -30935 -29676 2962 31679 38877 45872 44230 12841 21306 24822 35974
13792 35974 44531 4096 -41417 -22504 -22814 -29500 -23055 -18707 -18091 7796 2991 -2249 -5900 -12607
13778 -12607 5524 25249 30747 18479 9673 41975 43309 58690 8339 -41048 -38036 -1924
13766 -1924 28864 13684 -992 5294 39535 35017 26023 -3638 11427 35162 36141 50604 9263
13753 9263 11329 15228 -2783 -4746 1225 62982 87980 92458 47596 41998 37680 37878 57635 71542
13739 71542 61000 55915 33337 5394 -13007 -5551 18488 23577 1913 12525 56216 54112
13727 54112 22284 18104 53829 44931 -5901 -22645 2663 38948 83896 77475 72472 110995
13715 110995 78983 60870 31046 24755 21332 45689 61682 54631 17300 -30946 -51652 -39440
13703 -39440 -22839 -658 19052 21465 67914 72219 57095 50695 20046 -10655 -28225 -17543
13691 -17543 12071 -12575 -23602 2195 16178 -4519 -17224 1247 19107 19011 41716 83490
13679 83490 72150 53518 68409 61402 35074 -5994 -3772 11352 18678 19365 13048 39536 56756
13666 56756 58893 68799 72810 67280 69395 45862 34522 52949 49884 50949 38567 45569 54885
13653 54885 56342 26428 2038 3120 13506 2899 -1937 -2685 47 -3803 7487 18298 36102
13640 36102 8161 -5948 21009 8816 12356 4489 13012 21119 3192 6200 10931 19861 62439
13627 62439 74783 53940 43163 60875 50318 37815 17179 5300 11290 -4464 -3101 23771
13615 23771 56557 53865 34425 23065 18183 -7310 -11502 10878 170 -4162 -9689 -3127 11363
13602 11363 -23618 -63616 -75671 -89367 -86558 -60717 -48682 -3464 -13831 -35972 -51348 -38517
13590 -38517 -35059 -9707 17742 28783 12925 23353 37148 59782 69678 68994 75411 56565 45324
13577 45324 26155 3166 27339 34248 9893 17276 16400 7268 5458 6431 361 25617 35303 37358
13563 37358 47361 29853 -542 -31970 -54131 -33859 651 2427 -9566 5654 2386 27526
13551 27526 20813 30862 33849 25888 22751 41926 39728 33876 37899 35148 29360 10174 39002
13538 39002 60964 55027 -672 -38820 -20033 7241 6439 23993 38827 1423 -3208 -4503 -60632
13525 -60632 -70099 -53714 -23864 7255 4208 -1706 -10300 -5527 5121 11317 -7514 -22662 -25054
13512 -25054 -25563 -51897 -40512 -16845 -33683 -13995 10130 34117 25719 23465 20596 24469 25081
13499 25081 -12840 -40316 -55186 -38855 -2346 -32146 -24575 -18483 3642 21733 12873 8817
13487 8817 2528 -11055 11179 53781 70949 65798 80423 93999 104425 85846 49692 31995
13475 31995 41586 46603 38530 22174 -9059 -9477 -4035 7065 25164 24550 6755 15268 9265 44994
13461 44994 48762 24603 15689 12525 -13327 5145 26433 27367 26289 31138 66595 77580 64883
13448 64883 54302 46333 32167 21550 30374 6400 8075 -7744 -13956 -10986 445 -367 12070
13435 12070 57854 67632 115456 115689 64279 23120 33243 39363 23738 37395 54760 52625 62101
13422 62101 58234 40166 19830 -1299 17203 23338 8187 5385 -1786 -8357 -24271 -9892 13570
13409 13570 -8956 -4089 11334 -4705 22433 36875 55211 64128 40282 -8307 -33433 -51109
13397 -51109 -61753 -32689 -1202 5736 -6330 -10692 12339 38371 42549 41050 4875 1330 12795
13384 12795 3765 1610 16436 30779 53881 88301 154917 215727 198018 144239 106993 85489
13372 85489 76079 79794 80209 34697 26568 10890 27374 35097 8705 -7247 7685 15624 -3186
13359 -3186 13779 36401 23662 9219 2951 9974 11052 12937 24170 21549 9563 5680 11304
13346 11304 36133 60746 64582 44092 47621 47748 64971 72769 52940 33247 48721 66122 52103
13333 52103 48842 51597 32327 28946 50288 87820 118530 84411 50526 56951 79520 78232 49492
13320 49492 45845 60054 94107 128831 207890 246866 262548 229742 179426 142071 96297 44878
13308 44878 35351 35499 26900 24655 27666 31548 56938 48387 45926 74515 33217 41256 53016 74968
13294 74968 81141 73336 57811 33106 23747 20842 7834 10102 -7099 14201 63435 78234 63184
13281 63184 83123 79072 47195 61459 65221 31937 13777 21564 32341 26103 23160 10071 -1677
13268 -1677 3820 3479 13077 22697 22986 -9255 -36425 -27960 -14165 19049 27323 28621 15244 3259
13254 3259 20819 35588 16435 -937 5294 -1275 -14907 -8934 15425 34975 56202 70439
13242 70439 67755 53456 12685 6840 6867 3854 -11257 3849 21947 13166 -3609 -6785 -11925
13229 -11925 -31393 -34911 -13868 -1820 135 -17953 -25206 -17697 -87 5636 33458 31568 15949
13216 15949 -299 5953 30924 37762 43601 35001 42912 19052 -12467 -405 -12709 -24283 -5176
13203 -5176 6043 34028 15512 -20182 -40131 -39614 -17460 -45912 -50539 -65146 -11053 6116
13191 6116 3747 25434 47440 67256 64483 40944 33651 41468 24697 2945 -34880 -46951 -28963
13178 -28963 7084 8525 -10336 -6151 -3448 16028 27809 9628 -1536 17660 28865 -1715
13166 -1715 -21321 -20134 -5479 -12097 -40353 -72243 -73199 -61805 -62937 -38490 -68880 -71826 -35431
13153 -35431 -30099 -14491 -36577 -45121 -14845 -11060 -32830 -36425 -25586 -10941 -20732 -34990 -39330
13140 -39330 -28766 -13857 -2591 712 26055 36551 30699 22184 11748 641 21847 31116
13128 31116 40465 48641 16860 -5549 13422 7858 -20328 -13639 686 6645 33416 33407 38525 18313
13114 18313 -16760 -34120 -37620 -58916 -65138 -66875 -73395 -65343 -39995 -6524 5667 6692 -10635
13101 -10635 26310 23560 20812 1928 20437 48817 1331 16133 43760 3067 -15287 -18736
13089 -18736 2485 13377 23599 -5459 133 8576 -25175 -22944 2746 2070 -7629 1727 -26735
13076 -26735 -11370 7403 27937 28584 652 -10740 -4206 -9279 -18390 -15568 -27314 -40885 -19373
13063 -19373 -45394 -28277 -6254 -26987 -35449 -28314 -25573 -16065 -11975 -11406 -32718 -17270 -28943
13050 -28943 -35665 -15229 -20201 -25215 -15591 4240 29403 -1250 -36154 -27110 -50604 -41620 -22606
13037 -22606 14109 27479 15375 10900 38407 27834 -21150 -22164 -14806 -24556 -20620 369 7594
13024 7594 -1154 -13798 -31180 -61144 -47548 -47116 -50332 -61345 -26951 -8238 -4168 -18720 -9250
13011 -9250 36373 58374 62711 34877 16740 -13158 -11620 -9674 -4896 -36147 -69522 -51252 -39599
12998 -39599 -40305 -32190 -49984 -47297 -23601 29317 38207 14111 -16286 -30601 -49312 -46804 -14710
12985 -14710 -2969 -9398 -33531 -36432 -23529 -16465 -10616 -11909 -18034 -10188 -23297 -17751 -2961
12972 -2961 36637 14252 1273 -27685 -26347 -30267 -12878 18693 17452 -9815 -15044 -25237 -10063
12959 -10063 9730 -5509 -16712 -43095 -44558 -23621 7247 21548 29766 24952 9548 -127
12947 -127 14049 25686 -3675 660 -18608 -36559 -35298 -39568 -37729 -29025 -6883 20126 14713
12934 14713 18649 35183 39048 27887 13803 10238 3172 -31733 -62483 -85146 -74285 -59941
12922 -59941 -9826 5529 1280 21040 35459 7404 19389 11512 3485 -17937 -57385 -92133
12910 -92133 -66109 12696 25128 -26119 -24298 -2424 -27370 -22209 17014 5310 -2184 1494
12898 1494 28464 -3590 -3039 10250 13420 -19726 -22768 -50652 -43841 7440 -780 -28126 -9302
12885 -9302 14057 6387 1282 8159 -10425 -22891 -4993 -5678 14084 37254 43388 5950 -59499
12872 -59499 -76587 -33485 -15163 9581 17099 10405 19006 19474 18137 -9528 -22571 -16908 1239
12859 1239 16026 46412 45117 33154 25928 36450 21822 2893 -17567 -52322 -20997 23337
12847 23337 112 11199 41798 64568 59651 73783 27194 30671 47776 51865 26178 38080
12835 38080 27332 15296 -4364 7903 38203 26420 44767 59951 65388 26813 7862 44129
12823 44129 59751 47590 34736 39539 58061 59500 69906 42234 22352 33705 16902 4048
12811 4048 16093 47428 45835 18927 13984 23015 30903 -9757 10041 66325 90654 48862 42499
12798 42499 48367 45010 63826 71344 68503 37591 14000 8279 31510 31149 34002 -2249 7073
12785 7073 56583 90398 117160 103039 87644 102958 123479 135226 155444 151813 104713 58446
12773 58446 48053 70970 100698 118116 155398 169715 144655 125651 93645 85132 76711 110891
12761 110891 137444 147509 130743 108466 121371 127761 155014 168257 170267 141764 71191 39668
12749 39668 51324 92388 115627 122154 126369 129984 78842 57862 68636 88128 103207 119951
12737 119951 140611 141061 93246 72930 74794 58098 26987 54122 63295 74600 75343 87087 111214
12724 111214 137254 129497 111811 130424 111336 90671 131582 155743 147417 116294 116181 154211
12712 154211 126301 79062 66247 53273 43656 21732 8108 15567 21016 8976 -18639 -27215
12700 -27215 -15158 -14511 14194 27762 50616 92744 61793 49163 56668 53940 36398 24997
12688 24997 41972 53371 49248 59719 34548 56204 52902 65713 67650 55114 42420 40880
12676 40880 61533 69816 98332 106354 84201 60829 51621 74523 91092 116843 111763 116980 118923
12663 118923 132926 112406 100638 106814 91252 83559 80229 75778 64894 44936 53710 55465 70557
12650 70557 93072 97649 136079 140139 140491 159624 161785 158935 158155 158169 160423 148964 173762 201180
12636 201180 178889 179054 207459 188954 143279 123682 81182 53494 75405 111342 111644 140254
12624 140254 152600 130033 131062 119240 94355 97144 81658 74808 93883 101632 128022 136994
12612 136994 153292 175927 190431 174574 164246 153084 160926 165440 181344 196038 202423 175844
12600 175844 175178 177214 174247 181020 200631 220375 193815 161198 135284 118956 114531 96795 103527
12587 103527 93365 52192 62560 82086 111715 102012 84962 38859 42070 53199 52959 51995 56471
12574 56471 48267 54979 69065 69284 38096 95346 106015 82193 114526 132725 131099 125497 127042
12561 127042 130006 120005 111011 72080 73810 78304 76992 75570 83051 99802 90339 92672 92622 84339
12547 84339 69330 68103 92548 96396 106177 93749 103113 116362 116992 82878 65836 51931 50449
12534 50449 32426 34771 77195 89553 68361 75324 68714 71256 90559 75619 62763 71268 85939
12521 85939 47538 45779 75910 99594 88587 47221 41006 55481 48645 46498 60904 41945
12509 41945 40064 52310 52546 57864 70201 60007 25062 12710 44191 70397 89095 106274
12497 106274 114396 100390 88885 80353 81562 79743 85246 85671 93896 103869 102809 120374 103507
12484 103507 68775 62970 77475 62027 84059 92159 81114 76331 64391 99395 127727 147189
12472 147189 134298 136803 108945 91404 137843 158694 173070 200308 187315 157335 142503 148490
12460 148490 159858 154801 129876 136355 173880 195664 182734 153355 160488 157682 156787 182240 200555
12447 200555 173492 158723 149725 126427 127535 151738 171895 169518 158958 164886 180265 165574
12435 165574 168919 192282 199831 252730 263329 225549 200106 206500 205013 234215 247462 212350
12423 212350 201685 236613 261252 308727 330272 330929 325290 310215 339213 350653 368044 381448
12411 381448 405800 400358 374042 333554 346948 345237 350191 392387 444361 436079 403875 399833
12399 399833 416459 435099 452742 472534 484796 515214 548136 564809 594991 589450 576268 612827
12387 612827 651808 698924 724310 788256 821584 809182 828257 886047 911253 943506 979173
12376 979173 1053096 1146240 1210826 1288232 1386766 1557039 1694365 1849781 2067958 2300901
12366 2300901 2552817 2924454 3383551 3921551 4560201 5256943 6000308 6699139 7308080
12357 7308080 7769201 8043994 8156866 8227242 8320025 8505972 8752317 9037684 9282034 9432186
12347 9432186 9439953 9334818 9146405 8908028 8716025 8583467 8522504 8558275 8729071 9065164
12337 9065164 9502819 10140618 11014031 12109495 13395162 14873635 16444654 17978738 19217839
12328 19217839 19926398 20045402 19680554 19022143 18239929 17555248 17079908 16746087 16543312
12319 16543312 16362753 16137086 15901445 15581361 15231369 14932348 14746071 14733430 14932670
12310 14932670 15403125 16129344 17100779 18247342 19426359 20352729 20745784 20598654 19993935
12301 19993935 19138090 18346258 17799615 17628270 17803958 18435069 19529933 20967720 22700776
12292 22700776 24643149 26478268 27949187 28916146 29318194 29268532 28891833 28214582 27201476
12283 27201476 25836211 24124876 22198719 20211338 18252166 16478549 14851121 13436856
12275 13436856 12239456 11249053 10356870 9575957 8916940 8300033 7731537 7239382 6791336
12266 6791336 6394126 6030166 5703266 5417294 5151712 4926268 4732647 4577436 4436492
12257 4436492 4377879 4400170 4426883 4485094 4578299 4712527 4893848 5109554 5309523 5435261
12247 5435261 5462215 5401775 5342122 5344975 5380585 5493064 5657113 5887279 6197032 6584240
12237 6584240 7068612 7644465 8313945 9114317 10077179 11162227 12374594 13774255 15333558
12228 15333558 16976965 18622682 20178828 21563766 22803202 23834458 24602990 25135321
12220 25135321 25360712 25306894 24955302 24295550 23438975 22544168 21657476 20867988 20295226
12211 20295226 19983880 19844317 19875659 20075715 20347530 20557238 20673179 20597054 20324405 19837767
12201 19837767 19221446 18545437 17873454 17298534 16880671 16581969 16427235 16408559 16470556 16587557
12191 16587557 16752150 16894384 17056128 17254099 17514158 17793094 18152097 18571086 18977210
12182 18977210 19289847 19463223 19375802 18941587 18220854 17358912 16375214 15378222 14425610
12173 14425610 13544785 12795696 12190041 11672503 11247208 10974238 10804894 10679680 10595535
12164 10595535 10591685 10603250 10574616 10534884 10425646 10232837 10071709 9894428 9706963 9557729
12154 9557729 9440270 9261394 9051630 8768878 8418180 7957114 7415398 6884694 6333557
12145 6333557 5759443 5278516 4845512 4429453 4093200 3828607 3548702 3299703 3103890
12136 3103890 2949718 2773781 2552111 2345868 2226687 2132234 1992931 1866518 1730587 1624547
12126 1624547 1512597 1431227 1356548 1283242 1263629 1225862 1156391 1100047 1067502 1035715 1011025
12115 1011025 986195 952729 922683 890640 853587 806915 742073 676679 635331 642960 657126
12104 657126 639682 631012 627196 615685 597570 595329 546279 495037 478750 496230 481760 479569
12092 479569 493101 493490 498387 451205 398965 404064 413976 375588 356665 379051 416778 378649
12080 378649 351882 326516 301875 307837 332845 317399 328227 345845 329998 320967 305732 299415
12068 299415 272278 231949 221107 241528 254446 266685 270066 272204 290001 274827 220403 237059
12056 237059 241304 223190 203997 238694 293975 283826 242856 257382 265103 216830 207671 159403
12044 159403 119273 130368 157828 164388 155199 167049 172687 188171 189417 189266 175635 181421 193590
12031 193590 177608 165776 183319 216053 168730 122877 119971 97497 104505 117593 132879 129399
12019 129399 92491 90918 97422 133910 141945 128685 135612 160165 169905 160587 141418 107613 94300
12006 94300 110099 102258 96797 114538 132695 136234 115958 119678 147447 101031 91421 128316 123508
11993 123508 74548 75524 93073 80758 49563 59546 99155 120411 124769 105995 90596 109573
11981 109573 116218 99175 81043 77253 114296 132324 140500 136933 136265 132680 116339 169594 231803
11968 231803 256475 283856 293465 317645 307130 301218 290753 281949 259992 226700 217347 226775
11956 226775 197325 151567 146525 123869 89496 122551 170384 171857 159705 135995 116804 137291
11944 137291 177103 191501 182854 163143 169249 156269 144809 147937 122369 110276 131838 188358
11932 188358 240599 282152 306836 288503 258214 242517 253836 258097 258596 264433 231181 189599
11920 189599 177507 185502 216255 234324 213035 179374 168450 207548 205330 197715 199642 199034 179818
11907 179818 204974 228172 220569 231191 236618 239591 226065 230443 241501 254562 261138 254995 230547
11894 230547 198284 141222 147922 126185 141828 151476 166706 180444 177499 185596 200412 193690
11882 193690 210297 216740 193342 183317 177148 185593 202701 194203 164764 166314 188008 201860
11870 201860 200292 215882 197361 173093 180985 179466 183007 167005 170617 183798 177333 150276 144226
11857 144226 136464 143833 164301 160971 151360 117892 102825 90361 100549 105284 110536 73721 53243
11844 53243 83498 71469 64417 47459 34914 60795 73689 85346 108147 154142 143112 135444
11832 135444 139828 129279 104874 119310 123379 85849 71861 40633 26112 21852 4322 -4337
11820 -4337 -10714 1153 -20225 -28900 -7283 19087 38655 16023 -15804 -16658 23999 23298 10158
11807 10158 14105 -4065 1903 1804 5306 4565 -11603 -49840 -33027 -26559 -33385 -29583 -15543 -8258
11793 -8258 -3344 29400 41477 53592 17829 21664 31766 90905 125068 116353 102644 79162
11781 79162 87378 74949 65775 55821 67403 67596 99258 128768 137456 108226 84294 51487 44770
11768 44770 68792 62123 50017 69535 75097 63699 61902 95920 102765 111762 112477 87542 85890
11755 85890 77272 85896 113452 110457 127946 118087 94588 100710 102444 148659 141609 150683 128719
11742 128719 120349 112281 123543 112933 83991 79472 47499 41418 60593 72530 73946 85511
11730 85511 103235 106079 111111 66551 35221 40917 28225 20072 46226 48860 42095 58920 76884
11717 76884 60801 55712 84755 101934 110970 112778 81252 79935 70797 58063 56032 64130 87642
11704 87642 99205 59727 48197 64312 62486 62752 37800 -14228 -5193 26596 55833 38445
11692 38445 27776 36478 20870 -9539 -32278 -25922 23910 39802 47104 42412 42896 67548 74677
11679 74677 67438 52938 30157 -3467 -23130 -15626 8884 2122 -19761 9739 30013 22395
11667 22395 710 23390 5672 -14941 5176 18413 18788 -9748 -17545 -22373 9334 13640 -22215
11654 -22215 -18307 1077 16460 9216 -32132 -25590 21313 11888 -12333 -38519 1677 51854
11642 51854 65271 48353 58909 37042 17306 32680 66420 83217 70283 42212 18041 -16173
11630 -16173 -58630 -68504 -41154 -22295 -20989 -22581 -39430 -26095 -16526 -7394 -34155 -12928 18044
11617 18044 -628 4567 15225 7316 -16438 -29073 -16023 147 39437 49435 69605 78621
11605 78621 58765 22204 6383 -5796 2024 13306 215 10785 50500 4100 -2479 15203
11593 15203 14029 -12043 -1515 -8547 -38410 -56406 -18031 -6255 -10846 34908 64466 19273
11581 19273 -1019 24173 23278 1105 3079 15161 33086 46955 81969 89070 76335 39018
11569 39018 -4379 -36874 -30374 28984 39447 -3873 -16295 21792 14545 -19385 -6315 16099
11557 16099 40733 60641 29275 4639 -11140 -23833 -20417 11767 40268 26544 31498 43914
11545 43914 51318 29968 37830 55282 41254 33781 -3300 -3636 36073 42733 33251 -11557 -30594
11532 -30594 -13565 -18247 -12315 8213 13703 33307 33159 26354 17862 -34142 -34418 -3761 -7317 -14007
11518 -14007 -19754 -17938 -1370 -12490 -6046 17487 44405 41427 52599 64459 75274 75586 54480
11505 54480 -425 -16844 -5326 -22099 -43784 -3190 33891 47237 36307 60936 63030 85002
11493 85002 93839 50290 27379 29782 73004 41291 42329 55646 6242 -10037 1436 18671
11481 18671 3289 -11680 6263 -23783 -6617 31108 14626 14112 6916 19277 8455 -28975
11469 -28975 -44529 -45488 -38032 -66074 -48719 8513 14952 4634 -3054 -15274 16639 41142 48637
11456 48637 31283 23954 -6568 6267 59198 11686 -19223 -1958 11415 3807 -12524 -34714
11444 -34714 -34014 -16522 32206 27173 1964 15478 -14801 -49995 -18124 7721 13480 20577 -5464
11431 -5464 -26593 -17077 -15819 -8392 -12253 -7580 -16456 -29093 -35295 -25382 -46489 -77723 -87534 -78551
11417 -78551 -67792 -52597 -61053 -52662 -58868 -4084 65315 63697 24136 -6404 5184 -650 6594
11404 6594 20799 32560 4579 -26382 -29287 -14512 5953 -8079 -9008 -16171 1706 25317 897
11391 897 -12766 3695 14092 25702 26366 25741 38550 14491 -12206 -668 18214 10322 -11142
11378 -11142 -9250 -7507 3301 9774 33840 53255 75991 53068 6042 -12297 -7997 -13205 -24295
11365 -24295 -36848 -26470 -7329 -21528 -16474 -29601 -61391 -64115 -47281 -41599 -27080 -22101
11353 -22101 -14460 -2536 16567 17153 20343 31149 23100 19201 33370 57345 73948 53250 13987
11340 13987 5706 16252 26410 45077 66457 69471 55179 41473 18101 -23736 -38127 -25784
11328 -25784 -26821 -34759 -18865 2763 29655 16564 340 1774 -9486 7676 29035 -1568
11316 -1568 8782 23500 21038 37633 34066 17008 19984 32141 39296 39132 53861 54615 62824 61722
11302 61722 37290 13902 14679 15978 56586 55068 53332 56800 47142 62881 37706 10706 7884
11289 7884 12363 25269 32741 15372 28151 17357 -1896 -32673 -25510 -22196 -14383 -14492 -9174
11276 -9174 33576 56192 32669 16896 -6687 -1060 23784 23380 19796 13918 20228 23365 62220
11263 62220 73844 56367 39559 8511 -6118 -11801 24127 20997 -6044 -7832 -4079 295 -27316
11250 -27316 -42187 -29173 -25139 7502 13305 -7073 7488 15067 -762 -11887 12241 -10157
11238 -10157 -8483 12233 17048 11530 3176 -4536 3761 -37029 -62836 -31795 -32773 -17509 15062
11225 15062 5160 797 -7935 -13583 1007 -6404 -32986 -16868 4158 -26243 -24507 -13283 -19786
11212 -19786 12632 15517 19715 37438 42056 21047 55614 85195 75855 19931 -14944 -37375
11200 -37375 -58318 -62428 -22588 -9766 20577 39672 50399 27770 1808 28790 9767 -25600
11188 -25600 -43777 -40452 -2276 22508 27884 1154 -2922 -34993 -18214 4645 604 8870 5411
11175 5411 -9257 -16731 -4364 -15979 -40904 -9834 34411 65628 71507 62994 24146 1989
11163 1989 -22070 -46900 -54301 -34647 -38646 -42829 -16783 -5733 -13518 -7065 -3673 -36986 -74343
11150 -74343 -68963 -63171 -43126 363 4690 -24770 -8431 -21629 -12922 13740 50568 36200
11138 36200 -5357 -31787 -18094 -9450 -5765 5305 25564 -5579 -11085 -37225 -50657 -68424
11126 -68424 -70361 -51034 -31434 -26341 -44033 -19910 14414 28911 -647 -42639 -36356 -34884
11114 -34884 -47808 -45336 -28574 -2349 -1196 -41730 -43814 -35128 -8011 -14814 -19816 -27464 -15756
11101 -15756 1634 4477 14087 -4062 -20814 -931 11496 18066 16681 807 13760 17013 16111
11088 16111 17945 7639 32318 19408 13203 21405 51457 43337 23202 -289 -3370 -5558 15582
11075 15582 32703 30919 29629 20743 683 541 24399 369 -34455 -18355 -12489 -22400 -25704
11062 -25704 -17206 139 31067 23055 8160 6651 27559 36739 32487 32064 29627 1737 -23839
11049 -23839 -31394 -44310 -47171 -38635 -22187 8435 5184 5150 -618 -32048 -57939 -43937 -34109
11036 -34109 -39806 676 11017 6128 40647 21057 -15577 -16053 -12853 -20830 -33559 -13052 951
11023 951 18792 3863 10217 -24143 -37679 -29503 -27075 -6407 -16259 -2629 -4212 21076 13225
11010 13225 5676 -17707 -21518 -45724 -31048 4966 -12222 -34187 -28482 -14932 -9205 -24514
10998 -24514 -31540 -15789 1802 13346 -8880 -10588 11565 56802 63859 40673 41804 33050 29858
10985 29858 13812 -2225 -4636 -10522 -6505 -36670 -57295 -63668 -55075 -32022 -46498 -52168 -12027
10972 -12027 5018 4842 21948 26411 15543 -10688 -50926 -16723 226 -24837 -30188 -36279 1964
10959 1964 7586 1055 26348 9624 -22684 -9339 8422 20654 11003 -9574 -21427 -46440
10947 -46440 -30974 7112 25138 28197 5900 -7849 -23432 -46378 -31328 -34253 -40643 -26909
10935 -26909 -6970 -11256 -18762 -21738 -50855 -54523 -59009 -54788 -73010 -46200 -11932 -11143 -19420
10922 -19420 -28798 -653 7870 7593 772 -20800 -50501 -44071 -57906 -39007 -3323 -361 -36273
10909 -36273 -85747 -57158 617 -19949 -64061 -68964 -63278 -36920 -26905 -24733 -58581 -53818
10897 -53818 -55964 -69771 -61783 -62448 -58222 -58699 -35620 -29929 -32311 -8095 25188 19180 1202 -8636
10883 -8636 33307 75035 48323 -2810 -1314 2662 27876 24402 -35176 -33079 -9430 29850 54221
10870 54221 17531 -10853 -26796 -20941 33221 54830 47244 8956 5843 -21013 -20883 -11347 -9440
10857 -9440 -2585 -22675 -5591 20051 23924 -27487 -33317 14687 25771 24362 9048 8274 20489
10844 20489 15544 29299 35394 -17354 -30224 -35253 -52736 2151 32320 23514 -2323 -44457
10832 -44457 -20663 29846 75317 75242 66643 77527 47709 39585 16292 5323 14595 -5979 -3503
10819 -3503 25490 35274 26512 23686 -20362 -28050 -18259 10685 34746 1320 -1611 -2152 707 14558
10805 14558 4504 -22179 -1160 -7667 -31031 -61634 -2850 7467 16480 4800 1428 -6995
10793 -6995 -21548 -4491 -4608 -13684 -17785 -11232 -6854 8511 -4889 -121 -16535 -26621 -26047 -3815
10779 -3815 1779 6287 -278 2268 10223 26803 52196 60441 36659 37387 40434 39180 78233 67663
10765 67663 67861 56868 54637 65543 80973 72140 85135 91017 74225 84545 127438 143917 199980
10752 199980 258766 219148 123110 50095 45554 35195 26390 25879 35175 28801 38366 49043 41033
10739 41033 51599 53073 55129 45419 -1629 -26258 -20056 18700 33988 55763 63753 79316 107160
10726 107160 87096 70947 71383 43955 -28522 -29679 7635 14154 -1120 -6874 -7142 6269 16223
10713 16223 46296 62847 63692 33751 46208 19221 -43742 -48955 -23045 -15022 29387 74313
10701 74313 31308 -35232 -36710 -6945 8449 -12915 -18769 -6034 49965 73351 27731 11355
10689 11355 38553 17682 -1620 17325 5829 14731 43292 59061 48083 -5604 -32975 -45926
10677 -45926 -47777 -36396 -36807 -20285 -13364 -21590 646 20017 33358 31947 25321 -19708 -46017
10664 -46017 -52659 -39954 -13772 -24264 -7078 -13803 -22411 -20221 -11395 -27513 -28657 2711 9885
10651 9885 14596 513 -613 -664 -14326 -34999 -20387 -3315 -38762 -46483 17950 17033 36267
10638 36267 69871 60544 2781 -12567 1269 21229 27497 35874 42844 8364 -10469 -19520 -23021
10625 -23021 4087 10445 25281 680 -52627 -60893 -13362 26437 31499 -1290 -33816 -51676
10613 -51676 -47660 -18685 8413 -23209 -58451 -64081 -24604 11878 28256 39607 27540 30624
10601 30624 34903 55693 43052 -3048 20426 55306 48479 32826 47937 48454 15588 3198
10589 3198 -937 10054 -16862 -57286 -51974 -41478 -12114 8618 -4144 -36656 -44866 -51350 -19359
10576 -19359 -27425 -37289 -42116 -79148 -89446 -48627 -12953 11883 26200 44541 48956 10605
10564 10605 -7190 11929 613 -11024 -50182 -41244 -5167 -4429 -44883 -51266 -39009 -45591 -53068
10551 -53068 -57292 -44591 -31376 -23867 14305 10783 -5384 8491 23658 16716 28742 11606
10539 11606 -11011 -17789 235 26100 54601 70954 52218 -24613 -49080 -26911 4472 -3687
10527 -3687 -12371 9838 -228 10746 15870 23619 46232 52620 18289 -17579 -18964 15309 9018
10514 9018 11582 7880 1503 -29380 -36827 -9154 10611 -11997 -3310 13881 -1954 -12395 3645
10501 3645 32947 52814 35958 9247 -21386 -20646 -11561 -16729 -5662 -1790 -15579 -37433 -42611
10488 -42611 -21049 -27173 -6575 1646 -17748 -30790 -6486 1574 12218 27172 23508 8752
10476 8752 -8467 -15276 -49475 -27295 19909 -8928 -59457 -48396 -17240 -10844 -487 8840
10464 8840 -20593 -19862 -8085 24631 38989 -7348 -7939 -2764 18882 9282 -2365 12700 -18089
10451 -18089 -32830 -18679 8971 -9008 -25575 -32537 -35209 -44178 -38134 -36951 -33841 -30352 -3793
10438 -3793 19331 9829 -9953 -41327 -29545 -5674 415 4587 1734 -3528 14984 50585 30082
10425 30082 7814 6799 10394 524 -23908 -30236 -7729 10262 -52093 -89390 -88700 -67948 -58995
10412 -58995 -68931 -72685 -45482 -20026 10654 23163 -18321 -40934 -41253 -17493 -4875 -16292
10400 -16292 2071 34369 40119 9695 -16687 -26372 -17508 21405 29822 34282 17774 -8534 7143
10387 7143 20817 4624 7581 36224 23238 11167 -10957 -21273 -22928 -32254 -45627 -34683
10375 -34683 -61582 -72067 -80968 -49942 -26625 -34766 -18115 -20358 9022 18606 -2600 -20842
10363 -20842 -21451 -22879 -11798 25850 61112 60878 29645 15484 -11913 791 18332 -14387 -3852
10350 -3852 22995 25809 46354 32309 411 -10210 -26603 -29056 -15724 29356 58819 28961
10338 28961 -6851 -14008 -24662 -27056 -26429 -11884 -4847 -16520 -748 13194 -4226 -43676 -40696
10325 -40696 -21237 -30554 -10359 -11389 -25831 -18722 -19379 -42863 -59891 -34767 -10750 -33532 -24054
10312 -24054 19603 8394 -14288 12482 23002 15313 -23997 -6478 18378 15509 6856 968
10300 968 -1455 -11895 -51040 -43101 -37143 -38475 -66693 -52079 -39582 -11757 -36322 -61308 -78117
10287 -78117 -56290 -18456 -5574 14478 -3584 2822 5983 23635 28015 9423 -30723 -44063
10275 -44063 -48385 -10258 -10862 -13601 -22995 -31167 -19125 -224 -3970 4066 29880 13331 1430
10262 1430 1302 -4676 596 -28435 -9423 29345 45324 47253 35749 20964 -3546 -12089 -1192
10249 -1192 38953 29427 8947 -4323 -27526 -40442 -37203 -12792 -11832 -40839 -42906 -14837 2024
10236 2024 -7369 -11466 3842 -11067 -26964 -22062 -29317 -19878 -4066 -32284 -41492 -30105 -7728
10223 -7728 -1021 2491 -54901 -53751 13638 40798 36307 25148 20776 -26561 -2777 23903 -10743
10210 -10743 -52287 -46697 -14083 7555 19828 1771 -15107 -25865 -1347 14113 -12618 -18472
10198 -18472 -12018 -12898 -2959 -22108 -3874 1903 2095 -8197 34136 21348 -13692 -9981 -29170
10185 -29170 -45922 -27464 -709 -6787 3809 12757 20661 328 -3155 -3770 14659 41137 13428
10172 13428 13372 -8559 -38276 -60208 -57500 -27746 -37848 -29274 -31907 -23096 -13236 -22418 -19587 -19026
10158 -19026 -41131 -9184 -3089 10217 11560 -6497 -927 -9865 -27304 -50342 -20605 -17297 -17479
10145 -17479 -9440 2306 3871 -20551 -42089 -38970 -41721 -51841 -29215 -29588 -33126 -41558 -38581
10132 -38581 -16448 26406 44343 7793 -3850 -37043 -49194 -39920 -29356 -22282 -32294 -9432
10120 -9432 26281 -10769 -14650 4015 -17866 -44345 -29038 -19716 -38758 -21213 3010 17875
10108 17875 6027 10721 40083 6072 -16539 -20684 -15066 -3273 10421 25931 17187 -1604
10096 -1604 -27578 -13906 -19188 -22359 -22911 1820 5658 14577 -13728 -20948 -23743 -37055 -24879
10083 -24879 -13726 -3072 -20581 4211 2063 -10298 -30899 -54611 -35283 -33454 -66188 -59955
10071 -59955 -37783 -44599 -48760 -17011 -18537 -16278 -27408 -15683 -8703 132 273 -9319 6091
10058 6091 -11791 -24989 -4623 3935 22776 2883 -5323 2019 21637 28149 -10020 -43476 -61892
10045 -61892 -61685 -16170 22104 -10251 -10430 -16100 -40901 -34371 -35579 -42157 -30335 26436 57555
10032 57555 22050 19069 17317 -41322 -62613 -81589 -54725 -62210 -72026 -43063 -13956 2249
10020 2249 9738 9255 20607 7289 19993 2319 -188 33686 19832 23067 -5470 -22051 9118
10007 9118 12266 4280 14601 -1466 -28153 -7673 -11058 -44145 -51075 -49406 9989 49880 39983
9994 39983 22929 13577 3813 15234 11108 3277 -14936 25845 -4229 -33778 14964 12471 32842
9981 32842 45959 25738 -2394 -3304 -26315 -1241 43038 29152 17888 -34374 -36572 -17474
9969 -17474 7008 28240 6319 1361 -1919 2201 -16814 -26065 -17097 -4817 -10351 -21816 1467
9956 1467 -14353 -25934 -10240 -8790 -54 -19773 -12343 3564 -10202 -8791 7872 33368 22254
9943 22254 21412 33168 23884 29645 8952 -33682 -34934 -44256 -57696 -47236 -16676 -24594 -10649
9930 -10649 9417 11675 -24094 -38045 -20225 -10109 6428 17458 2785 -9349 -27811 -37905
9918 -37905 -31460 -49837 -35301 33 -7181 -24047 -21712 -18972 -18747 -326 17596 9065 13317
9905 13317 7447 30637 28908 45083 55044 55745 33878 6888 17468 37582 40074 40000 37988 31429
9891 31429 32194 36188 18780 30110 12750 -23163 -3801 -1331 -12325 6758 4559 26449 12294
9878 12294 -4173 310 10740 28981 17134 2401 34036 47939 50820 41645 21688 -7473
9866 -7473 -23047 -19621 6578 -9075 -24572 -8826 -14943 -2168 32346 31552 30812 14495 -4958
9853 -4958 -5004 -31127 -46517 -36658 -56845 -75624 -53001 -55372 -36185 -2963 -1345 -13196 -9627
9840 -9627 -7880 -54922 -48680 -26572 2116 39273 60077 40686 18169 -23197 -36150 -27709 -9968
9827 -9968 -32112 -42717 -37909 23074 74187 71603 48968 32971 -2216 -18493 -30569 -26550 8362
9814 8362 44558 55123 61086 34626 25999 51834 43504 27648 39714 35080 6706 6680 -10146
9801 -10146 -27758 -9941 -9412 -10902 -10489 17555 19462 28231 17500 21542 58613 47243 27502
9788 27502 11914 -6861 -42872 -34593 -25884 -28415 -33139 -27330 -33348 -16326 18839 24056 9516
9775 9516 1834 10242 17334 29474 44039 10218 1083 -3069 20757 46487 55975 45924 20617
9762 20617 16989 45263 51027 17143 -11363 -24767 -36614 -19981 -8415 -14719 -21501 -14950 -10898
9749 -10898 -3384 13612 10432 1015 14335 8825 -14749 -15741 -16233 -5749 -1655 -14053 -41035 -22183
9735 -22183 18129 40162 48584 32758 64931 74021 69121 36891 14713 30182 36062 -285 18507
9722 18507 66184 53269 33222 4385 -24698 -28168 -24477 -3983 14802 25256 8382 -11627
9710 -11627 -26325 -40100 -25143 -32335 -43526 -40001 -22749 -60510 -47990 -32361 -31327 16503
9698 16503 47019 48367 19541 -17163 -55046 -20341 -5464 -31521 -65049 -49020 -54831 -51441
9686 -51441 -24422 7076 28774 27744 8484 -6632 584 8335 -5198 -7767 17924 30315 31201
9673 31201 20834 29207 17069 -4237 -3718 20703 36823 47190 55558 70794 49699 42371 45426
9660 45426 50404 34911 5638 -21516 -29308 -7929 20946 -12812 -26214 -39358 -72221 -65528
9648 -65528 -23609 -7975 9154 7225 -59265 -71566 -75644 -68581 -64475 -4764 23052 7542 31762
9635 31762 38449 34558 26696 9066 17795 5561 -26021 -11202 -26882 -38793 -26396 -36194 -27874
9622 -27874 5882 21366 14185 9381 -19376 -45085 -18628 3819 21321 9528 -14310 -17149
9610 -17149 -4563 -14616 -2408 -20675 -46593 -31476 -968 28617 36394 -8792 5616 10615
9598 10615 -12553 -45093 -57060 -25081 2911 1561 17871 9210 16065 16331 12595 39562 35537
9585 35537 31030 18715 7676 -6330 -14377 1464 7144 27118 591 -8595 16736 43699 40926
9572 40926 13851 32107 11701 5936 1414 2294 6396 27122 23299 -11370 -18834 -3659 40911
9559 40911 14048 -24539 -24616 -6066 -11601 -12535 -26578 -22057 -31772 -26933 -1612 15062 42563 53477
9545 53477 58768 61906 16831 -16580 -39783 -3296 23412 29178 49088 42665 9240 9902 42962
9532 42962 5910 -32510 -18304 7562 12015 17141 22857 25283 10988 30216 36086 40996 13193
9519 13193 24010 24888 28904 37599 26145 19478 18813 4881 -4703 -5387 -20794 -41876 -36302 -9452
9505 -9452 10452 -17041 14513 48064 37203 39653 31497 27717 8063 -15517 11877 6264 -11443
9492 -11443 6570 44074 35472 14949 4986 -4272 9516 -2604 -2119 -1484 6134 -25125 -60150
9479 -60150 -45142 -21123 20963 52878 51815 51197 19844 24519 29645 46339 37705 13434 -1133
9466 -1133 -3532 -5129 34338 109101 104730 62745 84060 57256 55339 60880 76488 51167 37555
9453 37555 31484 32518 35831 -355 1318 -36039 -23090 12599 45214 37005 60429 75184 39180
9440 39180 48237 82283 66493 41600 15592 15584 31582 3712 1346 3786 -7022 7717 17881
9427 17881 -4955 -7286 -8267 -14040 -2964 22928 -2069 -8612 -7181 -7991 -6972 18506 3562 -7781
9413 -7781 -18325 -25847 9092 26489 31911 47003 47064 16811 3016 7912 36593 46463 57375
9400 57375 37481 21089 13929 11254 -20971 -24222 -12988 -3840 24143 31577 31572 67784 95548 81173
9386 81173 37036 2351 14400 27608 21332 41725 66581 80369 106609 121606 106447 91807
9374 91807 66238 73811 108164 135577 136570 132862 141477 184363 233173 243888 261070 253952 276980
9361 276980 369587 514619 591402 682673 738061 796736 884943 953352 974791 975348 957202 904007
9349 904007 832345 782885 679015 581542 497549 415434 348626 356179 340115 279292 226904 218610
9337 218610 238471 273083 236787 180895 146167 146782 164550 169972 150428 115569 114612 122772 108079
9324 108079 103399 115960 116537 124426 100135 74851 67628 53874 67607 108146 95957 78526 82620
9311 82620 99519 101522 114814 87940 62947 50533 48606 20273 4607 61419 58131 40574
9299 40574 26493 42987 30544 5631 -7183 39232 68996 50764 42495 33065 24468 47633
9287 47633 54633 56589 41111 44191 36040 22035 5031 -5189 -13601 19569 66864 80137 62666
9274 62666 56443 63937 49494 9684 13528 64861 100491 112408 119311 99167 92598 110662 98576
9261 98576 96557 97698 86706 71193 66420 50412 60528 83326 55525 33666 59571 102859
9249 102859 127450 118244 111087 96934 97950 81119 70903 71958 65741 66497 70850 64222 68234 72544
9235 72544 94976 67772 87947 92640 72597 50572 61960 50815 67865 87648 88611 88685 67791
9222 67791 85049 102463 120708 102484 88369 76950 104955 121441 174064 230017 271088 304488
9210 304488 372251 418611 374442 322918 292811 234825 218804 231822 244318 254065 250692 233734
9198 233734 208743 191226 205546 207341 204659 204317 213536 233091 243095 201173 224341 232262 251189
9185 251189 293660 290270 300113 327207 358842 358940 347058 353700 358460 357654 407422 466767 536852
9172 536852 540529 502687 513979 565804 603534 663969 754652 843907 965886 1101080 1266339
9161 1266339 1489050 1701952 2022180 2422918 2923782 3536887 4290609 5363164 6925784
9152 6925784 9165048 12226654 15720823 18491079 19129403 17339525 14332427 11391484
9144 11391484 9098814 7439863 6248217 5344806 4678893 4208998 3843817 3577414 3326586
9135 3326586 3092438 2906645 2717048 2491668 2303433 2116180 1936772 1712015 1534516 1437670
9125 1437670 1322339 1216631 1165790 1141158 1093104 1054334 1009810 955304 917475 914190 895157
9114 895157 872641 818621 776423 745334 730589 735191 759163 789746 823123 912215 1009905 1117409
9102 1117409 1213409 1304061 1391250 1443498 1473290 1460051 1410638 1351481 1264747 1171264 1080654
9091 1080654 977665 925440 882721 817202 766107 695165 657269 658507 693364 680348 640240
9080 640240 601507 585268 559689 518362 468176 449785 402763 371783 373543 375581 385207 387982
9068 387982 396382 380894 375296 400434 434912 422598 408243 422506 402372 416789 403861 416209
9056 416209 441859 446099 420724 375566 359729 371846 362938 414828 458706 448053 469593 504973
9044 504973 527862 519912 524459 540293 565065 568668 557277 541555 562732 574085 555416 558809
9032 558809 578322 583918 575361 570575 600761 655954 716394 753720 775127 745627 719156 729237
9020 729237 764551 816782 830011 872279 928947 990881 1057219 1144719 1242985 1359970 1415274
9009 1415274 1424045 1421518 1416709 1393959 1377950 1387291 1375762 1370111 1364691 1399048 1460774 1545993 1653177
8996 1653177 1742158 1832090 1921599 2015025 2112303 2234047 2371633 2536582 2688939 2833101
8986 2833101 3017346 3259643 3526864 3821349 4186082 4649771 5183191 5710789 6293141 6963099
8976 6963099 7775185 8779864 10061424 11744282 13841703 16331519 19053209 21845195
8968 21845195 24677309 27677609 31132580 35403385 41032556 48619727 59003512 73534977
8960 73534977 94602482 126070156 172118768 230740278 282190908 297588867 268015598
8953 268015598 214712224 165714625 129604620 104390117 86600811 73788260 64436995
8946 64436995 57630665 52762678 49276309 46763470 44703448 42369274 39326622 35747267
8938 35747267 32117009 28689364 25632820 22912277 20561417 18517361 16746795 15230889
8930 15230889 13945472 12842735 11803963 10841685 9954734 9163454 8460211 7817683 7227479
8921 7227479 6702685 6269023 5834161 5438630 5065966 4745819 4486628 4223695 3974202 3756891
8911 3756891 3522001 3315518 3123804 2951113 2780150 2609351 2447947 2264038 2115079 1983395
8901 1983395 1836939 1720492 1666672 1632532 1560848 1496839 1434258 1342579 1275234 1214126 1189633
8890 1189633 1177538 1131056 1060142 1056894 1047062 1071408 1126095 1086034 1040232 1005652 993654 984700
8878 984700 1012654 1006149 966113 911689 848874 818297 766412 747607 743584 745879 751896 813698
8866 813698 859255 899839 900307 853555 881451 916917 919956 909635 889348 854224 775695 691808
8854 691808 626785 588828 565829 576986 582908 552365 509238 523086 534783 516975 520776 509884
8842 509884 500115 498064 512481 548865 576445 596373 588835 607731 658242 746594 767832 784063
8830 784063 795051 800784 799862 776461 741658 708238 672965 675987 647378 646755 661899 651348 611394
8817 611394 603995 636575 659131 641796 656881 678337 691408 732447 741450 729611 763622 776276
8805 776276 790558 776767 772634 774426 783002 770819 711798 653330 647054 631016 612442 634875
8793 634875 628765 645247 685315 738978 755887 745528 755649 795326 852592 856239 864803 858539
8781 858539 849692 855976 864020 856653 860837 870983 866262 877705 930752 961956 995683 989821 1010930
8768 1010930 1033812 1033457 1066053 1086850 1122880 1149425 1194016 1253008 1255402 1273139 1316828 1361866
8756 1361866 1385398 1412703 1481469 1506312 1529566 1581273 1643069 1688447 1738797 1779114 1820188
8745 1820188 1937354 2088964 2213619 2377870 2513905 2631674 2772428 2878761 3034064 3212321
8735 3212321 3439172 3666638 3862518 4102980 4420082 4731401 5061357 5476152 5970446 6490048
8725 6490048 7077197 7793502 8594084 9468734 10505470 11714195 13133358 14883615 17019759
8716 17019759 19614103 22747930 26500665 30840854 35796443 41394030 47908071 55774026
8708 55774026 65767623 79094385 97541272 123543066 160145495 209321297 267041138
8701 267041138 317043230 336751585 316572992 269707362 218819110 176453376 144405867
8694 144405867 120695982 103160238 90155594 80445344 73197592 67628063 63183429 59451805
8686 59451805 55860201 51968210 47669422 43239232 39015124 35136152 31638091 28534619
8678 28534619 25770321 23348626 21274172 19472942 17869557 16427423 15138708 13984163
8670 13984163 12915774 11945433 11030943 10215935 9512747 8858337 8252000 7727277 7247691
8661 7247691 6793432 6377450 6016160 5647089 5307236 5001355 4741438 4459375 4178629 3903402
8651 3903402 3648109 3416427 3210460 3009474 2813004 2643766 2504518 2394388 2312738 2248211
8641 2248211 2144986 2038351 1976428 1869490 1798768 1781348 1711754 1674152 1613437 1566747 1505619
8630 1505619 1458339 1436128 1397407 1376592 1383993 1364975 1352489 1318993 1318497 1383970 1446503 1485039
8618 1485039 1472142 1370686 1248756 1122420 1076105 1048234 1016925 997250 958794 959992 969315
8607 969315 956339 933849 931727 932078 937191 932891 895258 854999 839062 804812 772355 763433 746021
8594 746021 764966 750672 713422 732682 732779 704463 709233 657812 640418 662042 671081 696436 708382
8581 708382 695101 715195 761796 847080 993350 1152718 1306459 1333765 1189504 1045357 947918
8570 947918 877727 832062 790462 759748 761213 746582 742390 786549 808265 820895 915450 1020089
8558 1020089 1108829 1171593 1243230 1316259 1389162 1471730 1519463 1535324 1494070 1456573 1417759
8547 1417759 1295301 1144236 994698 878340 760213 668400 636964 625845 528365 443731
8537 443731 447422 457123 457251 430553 400986 361341 370569 394870 439224 426553 390865 348559 297242
8524 297242 268889 242375 241041 252059 261617 255485 263008 244923 260972 295344 311776 307830 276622
8511 276622 256972 255536 233548 189731 143923 139644 190061 201118 186219 199747 204907 166033
8499 166033 198195 256864 284031 289511 252085 223566 228015 233043 224351 218540 208189 185180 166537
8486 166537 201944 203889 190018 161337 133244 125044 132725 135189 117049 65150 51248 78597
8474 78597 75964 56243 72398 89907 108415 81671 65857 52274 51233 81526 117888 144237
8462 144237 169724 176768 161895 146453 144150 157236 106469 74625 87960 113435 139238 122473
8450 122473 140365 177294 164447 156272 169144 195531 212855 187046 122119 127178 140430 132877
8438 132877 137296 131640 122985 121249 133793 117658 133360 150363 168831 146103 120926 105117
8426 105117 96335 90249 82519 104510 107747 134384 97944 78753 79041 73527 81041 99168 105144
8413 105144 108825 82561 86447 78989 75379 87114 94585 93669 95307 107861 125937 91003 76587
8400 76587 69898 61689 70040 79442 74087 85114 94883 101312 108608 108136 103705 100642 104602 118123
8386 118123 116060 124510 75477 47381 76046 99597 83652 83377 98433 95112 92955 110292 106033
8373 106033 102839 98034 86524 73756 86190 96862 79788 80742 105999 113442 97704 79499 79223
8360 79223 100597 112109 102855 88125 97878 79613 70349 56391 50895 15262 20087 46763 73955
8347 73955 70918 78450 81347 92225 83035 57924 65296 70278 52053 42928 88974 128572 90411
8334 90411 83281 93658 97156 63164 59656 68379 60167 53658 92822 84662 52492 55063 55369 67445
8320 67445 73581 111528 152202 149561 156054 145481 108828 104300 160496 222919 279265 321015 366410
8307 366410 406440 451837 509053 567661 682994 769727 910807 1037151 1127742 1179376 1220350
8296 1220350 1236163 1211391 1145543 1058440 926292 804708 711370 637122 556781 506430 461131
8285 461131 428472 389898 332939 310702 310882 307184 259659 250710 261813 240299 179047 140680
8273 140680 134094 115318 106074 121045 113213 146234 152460 148152 97497 69408 81590 88210 115283
8260 115283 108940 81004 70506 80508 81405 76752 70675 84157 81005 55116 57825 64125 92050
8247 92050 126476 110360 89526 89004 64175 60555 107322 135955 112764 136120 158133 137452
8235 137452 98731 74686 48523 29258 37116 6581 -35839 -26288 -44911 -31300 2454 13458
8223 13458 15071 10145 -2243 14515 2079 -35056 -20190 13713 24679 33573 44294 7378
8211 7378 16787 72442 96310 88315 45893 39271 58237 70294 79764 91360 87812 76931 57802
8198 57802 73721 76063 53899 53592 73318 65871 8846 -20276 -31049 -23067 -9225 11815 16508
8185 16508 23243 77028 115825 126028 102677 77546 83488 52558 14853 -37 19351 59695
8173 59695 66169 61555 39009 46109 44055 46239 81490 92322 85785 53165 73016 102788 66215
8160 66215 41976 28268 34003 62788 82982 83100 58273 51628 47560 47209 68868 53385 60724
8147 60724 83770 72788 51221 59767 31784 40345 65528 59126 51636 48182 40619 3757 -8813
8134 -8813 -30511 -22859 7821 13864 40791 24629 14312 5009 17933 33133 38873 38222 49079
8121 49079 62541 44647 28271 50928 61537 46709 40181 39203 43192 77573 50607 20881 -5530
8108 -5530 1948 333 23993 37039 68275 59077 54373 52067 36736 28763 1660 14647 21889
8095 21889 30897 11481 7253 21267 37657 45319 130 -5908 29910 38586 67222 85992 84060
8082 84060 52375 30857 33107 4021 -28310 -11024 20888 29120 75895 66940 62816 62644 90470
8069 90470 95185 76479 46034 43213 54368 97448 187143 243498 291827 277589 207902 133458
8057 133458 137975 113213 56859 21414 43333 41625 5575 -21897 -18663 1648 48437 79645
8045 79645 103880 94920 71847 72015 84991 72532 81401 102481 94479 69407 46361 26035 44814
8032 44814 55722 68830 87987 86025 87908 117806 137264 153986 162363 180427 221692 280878
8020 280878 375825 507457 677820 850574 936981 865973 698507 544000 394468 309039
8010 309039 231741 200732 158589 92889 66639 76170 107360 102327 83165 96230 101645 114016
7998 114016 112323 68925 75658 81132 44202 36911 33357 17255 -14387 -41672 -51369 -20091 -1683
7985 -1683 29529 56209 40638 38914 53917 55158 35401 19368 1117 -8953 -10001 -12122 6324
7972 6324 22221 17370 19783 29157 4329 -14088 -12811 -6217 22153 45702 78624 62224 37745
7959 37745 -2032 -33088 -18172 5663 37360 68160 80666 67943 56319 62025 92045 112726
7947 112726 115268 73708 55308 20156 -6003 15436 6107 31029 35422 27827 58555 75034
7935 75034 80227 98471 111707 90434 54550 30550 43270 45386 15607 34839 19284 1100
7923 1100 -3682 6589 11204 30686 2502 -13263 -22057 -16052 -12680 -176 72838 86140 86373
7910 86373 69266 68359 74472 79416 52575 20787 -3029 -3433 -20041 3857 -14056 -35366 -14810
7897 -14810 -25796 -7667 -767 9623 43171 50994 44954 52566 42388 18123 -5547 -6201 -49317
7884 -49317 -50156 -33025 -1492 33375 40090 9346 -11419 -20218 -21192 -5269 19750 11325 -15449
7871 -15449 -16589 -37741 -28010 -5983 610 2975 -3352 -31831 -8868 24578 28116 16155 7916
7858 7916 14279 29687 4448 -16201 -27740 -64528 -83126 -44268 -44083 -28348 2539 16693 4797
7845 4797 4868 -11264 -25758 948 1408 -2948 -2499 14292 31646 55699 61774 77452 40315 8713
7831 8713 6486 8472 2637 6637 -43188 -52021 -38447 -47893 -37289 -9298 11338 49959 63080
7818 63080 24362 9592 15233 -12150 -24133 -32311 1732 47392 44900 831 14469 -6414
7806 -6414 -5100 26569 15336 -17958 -33510 -36228 -46356 -29328 -7331 -21022 -36375 -59344
7794 -59344 -21543 -717 17705 -4752 -17664 -43775 -60494 -7307 10726 11095 -14683 -71964
7782 -71964 -84376 -64949 -51164 -7142 29246 31456 -11482 -10621 4131 -10239 -11728 -14924 -6247
7769 -6247 978 18366 6985 4644 20941 54316 62407 60414 57666 37519 45071 34170 11084
7756 11084 -5267 3819 29540 30250 35546 19247 32484 58521 29712 -15465 -45404 -36910 -13492
7743 -13492 -14397 -32006 -22093 -18541 17553 30720 43693 10418 -10579 12429 35616 23256 24376
7730 24376 17264 8447 -4481 33936 41452 31317 30494 -7546 7692 108 -32088 -34586 -10229
7717 -10229 16151 24690 25674 12962 -27392 -42495 9606 28209 27645 3882 -1043 -9324 -19512
7704 -19512 -23207 -8651 2001 18478 4168 -37402 -50980 -2990 43874 2677 -58007 -31142
7692 -31142 17885 14680 -1678 -8215 -5619 -11003 -25192 -20077 -14209 -29636 -33675 -26016 -18208 -20466
7678 -20466 -27361 -17809 -15881 10509 38398 16258 1867 8316 -9482 -7945 -15544 -25287 -11491
7665 -11491 -12203 -4346 27505 38933 5723 -1140 -12123 -30705 21288 68251 77821 74497 76517
7652 76517 29237 737 -8775 -32731 95 18851 15335 25932 24556 43617 66444 43852
7640 43852 3060 8064 1211 6317 18141 22551 19557 22658 17804 16759 41543 42126 52326 41371
7626 41371 53138 61105 11264 -27483 -15502 5446 30440 24006 50680 50458 23532 27538 18697
7613 18697 12670 38518 34772 26891 37155 -4181 -43442 -42463 1607 36971 14426 3307 -1429
7600 -1429 -22465 -16592 -4335 1034 -21875 -5001 46046 55482 59032 39730 35466 4595 -24548
7587 -24548 -36595 -27507 13087 28883 25168 30815 56502 41820 24234 36490 34696 5935 3207
7574 3207 -8499 6949 -9695 5636 5693 40306 51614 59094 36082 34518 19560 -14209 -8620
7561 -8620 10696 44613 55205 18864 -820 8180 14267 7383 13018 -16956 -21174 -20725 -30422 24959
7547 24959 47551 47908 47527 35075 40601 21072 40931 42625 6942 8226 7014 783 -9406 4981
7533 4981 14966 -5496 -2346 11628 -11327 -4856 11903 31611 46474 38667 288 -27923 -2551
7520 -2551 -29689 -21293 -5948 1850 6953 1310 2640 -3275 166 26535 15352 14594 -4949 -15055
7506 -15055 10901 -5360 -24990 -29221 -41035 -7157 -15217 -13673 12596 9879 4929 46760 48781
7493 48781 38581 27931 -20234 -24577 -44668 -46291 -58687 -45425 -28418 -29399 -41536 -32410 -17963
7480 -17963 5169 -633 15636 26497 -18035 -62128 -53325 17655 36822 35546 32940 54051 63600
7467 63600 31332 17115 -19278 -26047 -16769 22847 9300 17688 25572 7949 9056 -15678 -45448
7454 -45448 -67391 -63947 -22244 -15860 -5206 4211 22764 -14428 -39926 -21083 -19853 -30261 -37641
7441 -37641 -32368 2320 13703 33448 41876 31683 34052 8013 -12170 2214 31894 42113
7429 42113 58666 35923 26615 23051 -13021 -9531 8063 9359 -14892 -22268 -27152 -5617 31255
7416 31255 43804 47641 44615 34277 19126 30589 16755 9489 1585 -38 -25755 -65548 -58746
7403 -58746 -46157 -48860 -44420 -48214 -55179 -69934 -79093 -42958 -1458 19862 -447 -28984 -44524
7390 -44524 -8025 -3623 -11645 -24894 -51717 -63185 -58687 -37516 -17323 -15433 -9068 17144 -1644
7377 -1644 31899 17683 21038 21593 -25988 -44187 -3292 -11860 -19890 -14043 -22549 -21070 -29240 -29626
7363 -29626 -8292 907 -5603 3742 -20027 -5349 -1179 8899 30286 28868 30416 39596 11532
7350 11532 9292 24100 -5872 2630 -1116 7785 12698 -14068 -37530 -31500 8142 -12686 -28306
7337 -28306 -4620 -2006 13521 -60 6235 -444 -10396 497 -19077 -46386 -43555 -12430 -679
7324 -679 -15411 13593 18616 -7163 -34157 -34439 -52824 -30039 -27973 -37528 -32861 -49375 -42644 -56664
7310 -56664 -49160 4561 14397 -639 -22990 -30794 -9549 16690 40563 60084 44697 20561
7298 20561 6407 315 12023 -1989 23061 38378 8701 -2305 178 -1246 -15438 12348
7286 12348 28321 42260 43377 29564 2185 -11458 -48352 -55469 -48434 -34617 -12936 19335
7274 19335 9994 -12379 -9579 -6149 -26557 -39049 -34552 -60983 -61830 -59618 -17956 18608 18750 -1824
7260 -1824 -680 -15261 -37513 -62479 -49919 -10615 23333 26688 44060 35549 31631 50929 48457
7247 48457 20303 8466 -26660 -55436 -66566 -68122 -32781 -25953 -40210 -24459 -11484 -4064
7235 -4064 7000 10480 -10091 -21015 -24692 -23206 5174 27741 36137 16980 -8372 -6677 16794
7222 16794 -125 -14321 -22264 -57002 -18327 10353 18754 -14251 -33099 -10887 -20784 6905
7210 6905 -17322 -40933 4083 13244 -6758 -7704 -12161 -3790 7981 9991 23488 14042 17062 4311
7196 4311 -20752 -32029 -29091 -11931 15000 42407 62626 44780 20183 -436 -5655 39807
7184 39807 63198 17831 -24454 -17509 -2809 6695 -4656 -9800 -7888 7249 26390 6035 38032
7171 38032 74987 31862 35709 34035 26502 4235 -13409 6467 19254 14551 12671 9978 6849
7158 6849 -4294 4052 5485 -1504 3966 -5472 -12112 -1427 -5013 -48695 -60713 -62480 -68333 -71039
7144 -71039 -97580 -103359 -55973 -42323 -45085 -79690 -77992 -49456 -12058 -12594 -36943 -23391 11888
7131 11888 23649 19568 4853 -5922 -22233 -31973 -48906 -75015 -76442 -46587 -46151 -20708 -5831
7118 -5831 -4813 -6911 -38267 -54165 -38698 -28184 -29083 -51853 -33617 -12297 -19764 -11826 -21321
7105 -21321 -26609 7983 -22048 -42695 -38096 3612 23016 4716 14435 5562 -316 -3854 5720
7092 5720 -9760 -56772 -80589 -88643 -62234 -63112 -78564 -58741 -29519 -38183 -45317 -20662 -33821
7079 -33821 -50926 -10799 7464 19495 37817 13990 6456 6241 -22784 -27982 -21745 -21639 -9883
7066 -9883 -25869 -6701 12320 -139 -16917 -18873 -6633 -11518 -57470 -52794 -20033 -12793 -27816
7053 -27816 -40546 -41844 -21806 -1495 -2096 -16237 -46017 -49530 -31745 -11110 -11470 201 25197
7040 25197 17592 14036 15119 3972 -39923 -44331 -37481 -45808 -3768 -9977 -21693 9056 14490
7027 14490 13099 785 7509 27312 41156 29647 24487 -6018 -11156 7735 -7365 -16333 12432
7014 12432 8250 -6910 -17092 -32981 -1525 13793 9039 27003 17496 4500 879 -46165 -61889
7001 -61889 -41694 -5083 460 -4438 3308 -9062 2619 25477 36363 22986 12060 9149 3344
6988 3344 -2348 160 15389 30967 26965 4139 17753 25695 12732 4615 22971 34405 38219
6975 38219 33729 26727 2172 -6324 -15220 -17325 -25789 -32157 -35149 -45346 -21791 -2171 4264 -15747
6961 -15747 -24454 -34714 -13141 -13230 -24170 -56964 -53065 -43063 -18932 -24634 -18358 30295 35996
6948 35996 32365 29329 34195 25269 25882 45062 7913 10100 9840 3902 -5943 -3910 1613 1473 -13904
6933 -13904 -11645 -11275 8291 20151 38366 31956 10713 6695 29527 7733 8314 25005 16840
6920 16840 17946 43407 43833 50 -9427 1214 21547 32134 13202 -7621 9948 38455 64476
6907 64476 89701 76221 28379 9928 8210 -15936 -30716 -25463 -42295 -76382 -87618 -62020
6895 -62020 -49757 -51252 -29528 -40584 -35960 -14290 -11534 -2808 -14313 -2934 -20764 -34922 -33206
6882 -33206 -48765 -53036 -7551 43592 61153 36055 -18652 -14953 -598 607 6092 2327 20875
6869 20875 16481 2501 3096 -23159 -48413 -19646 -30571 -62844 -23693 -7357 22200 7737
6857 7737 2989 -4104 4046 25842 21178 22371 19095 2727 1667 -3863 11796 26799 9539 10395
6843 10395 10861 16645 -10512 -29317 -52444 -66729 -56533 -33978 -20663 -32330 -47636 -38594 -12430
6830 -12430 -2973 -4434 -22490 -41563 -28994 -40620 -72490 -108366 -115009 -61143 -70524 -73243 -63265
6817 -63265 -45355 15641 33954 -2933 -34693 -53326 -63361 -74210 -68437 -52679 -34556 -8216
6805 -8216 19659 17295 -19245 -25841 -28664 -37230 -34319 -21512 -5596 -2878 -2735 -5730 -3576 -6744
6791 -6744 -28319 -56118 -60222 -49731 -27182 -11021 -4278 492 7061 7018 -12450 -5228 3293 10756
6777 10756 16343 -18234 -33637 -11346 11257 -3572 -42365 -49690 -49376 -54012 -40317 -27646 -39672
6764 -39672 -23571 -20738 -22170 -25232 3144 -4333 -8636 3749 22425 -8048 -52373 -29408 22156
6751 22156 -6951 -58867 -32868 -9801 13867 18278 19396 -25019 -19088 8795 48495 69173
6739 69173 69026 39112 45789 84577 95150 63505 40906 37891 72782 73950 100603 114173 91620
6726 91620 90343 91766 104027 142983 212910 366369 550618 763119 982250 1019134 856378
6715 856378 625763 471716 378731 331381 288617 247127 198989 161597 138585 128626 113785
6704 113785 104728 120352 114344 106859 109637 85427 65704 65994 115364 137485 110338 89605 72111
6691 72111 67597 61186 47257 34903 67763 62181 43977 47607 23850 -1482 -10288 15869 42149
6678 42149 53093 43323 24871 17866 7714 35757 39572 -1577 -30948 -38517 -58959 -43633 -39779
6665 -39779 -37386 -6578 15403 37138 9581 28331 30069 12236 -404 -10002 -4126 -23768 -21387
6652 -21387 -12788 1682 11194 -8507 -7850 -31277 -13977 7001 30637 13053 -18620 -25428 -15575
6639 -15575 1485 -3783 -1290 -13024 -2291 5501 -23290 -17282 10628 4439 10672 -11755 -46543
6626 -46543 -45250 -25532 -30259 -3984 2513 -25052 -23811 -46805 -61924 -56652 -38790 -21967 -19463
6613 -19463 -15203 11985 9420 -7194 -22263 -6326 -7776 -10310 -27896 -46197 -42442 -16063 28
6600 28 -10185 -35544 -56384 -43686 -34200 -8595 10244 -1068 -15721 -42202 -22543 25906 12907
6587 12907 -13416 5431 18350 -6079 -29942 -44163 -35886 -38204 -63721 -49079 -11692 21520
6575 21520 21306 -3136 242 -8965 -7397 18784 8347 446 -5945 -1106 18498 34329 -4523
6562 -4523 -14163 -7985 8638 -10540 4250 -139 -3297 -47932 -35942 -15269 -14407 3631 17526
6549 17526 10076 -31946 -54129 -20209 6650 -19465 -36020 -15208 15553 29717 52446 12686
6537 12686 -1186 3228 421 10016 -15241 -34786 -33392 -57668 -36680 -34547 -77828 -87246 -49615
6524 -49615 -15637 11306 31758 4575 -7174 -11465 -18131 -19651 11637 35267 21984 -7478
6512 -7478 -3816 -19199 -9518 -3319 431 -9346 -39812 -24604 -18061 -26316 -27206 -24053 -11202 -17814
6498 -17814 -21147 -31888 -26015 -24082 -30004 -17017 -12875 -39493 -36514 -26677 -20327 -18096 -16096 -15800
6484 -15800 1123 15446 35275 9676 -18710 -25633 -12383 -10424 2032 -580 670 -24335 -35576
6471 -35576 -22360 -10122 19118 261 -20123 18679 59035 22091 -555 -10391 -29245 -45132
6459 -45132 -41034 -23212 -6017 -7131 17239 57060 24625 18696 12475 -22408 -17584 7905 16226
6446 16226 -28054 -44569 -17581 5224 -5872 -1863 22410 20282 23119 27763 33435 58540 51881
6433 51881 19736 -4416 -13510 -6764 -15918 -32221 -38744 -39405 -12630 -14587 -31310 -4313 12626
6420 12626 16653 15174 -3695 -15618 -31038 -30174 -27710 -11648 14018 -1479 -43357 -45204 -31677
6407 -31677 -30122 -4004 -701 -26897 -28506 13198 40648 20139 14324 -125 -17632 -27559 -31918
6394 -31918 -6334 6246 13902 4452 -21337 -26653 -32737 8758 24511 24450 28349 -14178 -23353 -34252
6380 -34252 -18906 -15899 -20665 -6236 -6457 -35901 -28774 -10652 29510 54561 33196 3221 -16371
6367 -16371 9457 30399 59003 67631 50499 36106 9083 -11756 -43514 -46152 -20950 8396
6355 8396 11761 -9758 -16442 -9032 1207 1052 17353 14803 21608 7616 -23588 -38003 -26216
6342 -26216 -19621 -8082 14169 2731 17150 23308 45252 57117 6279 -9544 -14655 1285
6330 1285 1602 -487 -3168 -2934 15918 24935 31020 28273 16527 -8358 -9191 6330 41714 42805
6316 42805 58553 41362 14704 5595 1272 -6634 -11384 9660 33542 24070 18175 23878 31738
6303 31738 21758 -8723 -33043 -33398 7844 32895 39329 2456 4862 17936 1981 -11596 6062
6290 6062 -11729 -28893 -14580 1561 15926 27580 19613 20482 -7092 -18736 -27161 -16217 9455
6277 9455 -14494 -14869 -5688 -6696 -20408 -13341 43596 54067 27135 2281 9300 41847 18645
6264 18645 -10410 -8555 6618 30043 37327 46891 25147 -6758 -7104 -6011 2859 26675 56989
6251 56989 61776 25957 -22692 -2631 17773 15130 39475 37147 9203 -1009 -15742 -36424
6239 -36424 -1697 20768 -1192 4440 29253 30897 30704 -8823 6673 32371 13189 -29609 -69281
6226 -69281 -73815 -53754 -28081 -19759 -24471 -41500 -16119 -7448 -38109 -57919 -49700 -21784 23943
6213 23943 11721 -18397 -17529 -7943 -43157 -72499 -49533 -58823 -80812 -59697 -49216 -79313 -58499
6200 -58499 -9467 -23528 7915 11213 -22256 -11912 -16150 -6321 886 -16003 -6622 10129 -7210
6187 -7210 -6893 -13951 -38324 -18512 -47227 -54508 -8053 1455 -15552 -18765 16900 2190 396
6174 396 7450 -7324 -14039 -25198 6288 31376 -9828 -36825 -8449 30933 36189 13218 16384
6161 16384 19518 10308 30238 55002 49370 60959 45260 971 -17356 -33049 -43285 -49568 4480
6148 4480 8946 1082 -3725 2159 49208 60540 23038 -7209 2026 -16154 -39923 -16236 -10917
6135 -10917 -2290 -4917 17528 43179 25883 12476 640 -96 7363 -29379 -22136 27680 24857
6122 24857 24643 46050 17706 -27474 -44315 -42587 -35696 -30970 -45504 -10029 11305 34437 8593
6109 8593 -1591 -32569 -29770 -17637 20335 20013 24399 15427 7913 2378 -38350 -58901 -45432
6096 -45432 -33831 -11073 -9241 -11785 9216 -11747 7287 14959 17427 25720 2542 -43378 -20592
6083 -20592 -11202 4135 9458 -14897 -20037 13300 42652 40614 41399 54684 42387 5686 -14621
6070 -14621 11222 54141 65646 71459 66593 57547 42846 -9955 -39384 -8335 16497 -4963
6058 -4963 14491 8531 27564 10143 -27742 -10566 11499 10177 6317 -7167 -11504 -34986 -22271
6045 -22271 602 -23872 -17659 -15466 10778 18577 -8507 -20646 8311 21781 1140 8203 27169
6032 27169 24728 16817 3182 -13579 -34199 -40187 -17756 -9823 12531 -436 -18975 -43137 -33597
6019 -33597 -22729 -43359 -34339 25293 65026 45157 29395 19912 6487 -7868 -4204 -10613 -5287
6006 -5287 -37022 -40831 -49778 -25912 -26431 -8442 17085 22691 10951 44527 22630 14485 2357
5993 2357 4644 32548 23772 -5526 -6059 11214 10589 -35629 -10432 32565 59116 66086 30038
5980 30038 963 1777 16035 45376 63685 40827 17815 -5499 29075 31470 4281 -5232 -1675
5967 -1675 13650 -34973 -30927 -11372 -12304 22905 50750 22750 -6360 -20016 -12221 5071 23319
5954 23319 26091 -9044 -22036 -36255 -20277 6536 43023 27203 -2414 26818 46386 21250
5942 21250 26083 1847 -18521 -15812 6514 1792 -12414 -25211 -33308 -45136 -51374 -44481 -26743
5929 -26743 14366 7003 -11585 6169 24496 19396 -6143 -18216 5715 39216 34149 -351
5917 -351 -10814 -13202 20581 65257 35563 -22914 -64599 -41386 -4005 -2407 21010 -8235 -41207
5904 -41207 -43177 -808 38785 29359 -9713 -40622 -56976 -124221 -139274 -107194 -64707 -67391
5892 -67391 -62377 -72465 -81043 -58697 -40758 -47122 -6424 9422 -1097 16491 6908 9092 914
5879 914 38191 79104 70395 61700 84029 46559 -25634 -61770 -80878 -46548 5832 17359 -18981
5866 -18981 3185 2277 12351 8218 -3344 18302 7223 2156 16061 28838 11268 -11303 12887
5853 12887 19918 -28698 -61418 -65407 -53376 -48087 -39366 -45411 -57633 -50676 -38689 -36811 -23791
5840 -23791 982 3629 3515 -30535 -72016 -82119 -87138 -59186 -48962 -26192 -26003 -53342 -66350
5827 -66350 -28545 -41490 -24955 -14872 -26184 -19321 9290 17297 -7557 -21838 -29540 -20987 310
5814 310 -5735 -22486 -37215 -21169 -27450 -19047 7502 -4037 -14213 -15991 -8883 1443 -12258
5801 -12258 -24365 -20250 -914 -31737 -30193 -14130 -5511 12206 -10577 -17890 -37976 -49524 -11844
5788 -11844 24518 15971 -4496 -7652 -14077 -26445 5068 16296 18302 -3464 -12047 -34122 -11954
5775 -11954 31776 38097 42754 2606 -295 16532 14951 7287 17975 9118 7547 -5943 -56549
5762 -56549 -33427 -11793 -15943 -7756 -26284 -23031 -21515 -22592 -37230 -41475 -40108 -78597 -70921
5749 -70921 -60515 -28453 8630 9695 -495 6650 -815 18258 34438 41436 36922 -2109 -9008
5736 -9008 -13956 -6371 -14945 -29881 -35331 -36175 -30823 -19386 12620 26149 26385 17263 2567 4369
5722 4369 54126 61378 7314 -13226 -6355 -23764 -8024 28938 52719 56395 53316 35438 52529
5709 52529 34274 14409 -13641 -37953 -41287 -16999 -7172 22828 19215 30488 45953 37824 10093
5696 10093 22855 21739 2093 -2784 -988 4152 4079 -244 16936 -7515 -24529 -33263 -20292 -35806
5682 -35806 -17409 -3119 -8096 -7265 1378 18298 8370 -5112 -20652 -44750 -43251 -5373 26468
5669 26468 58399 44712 17424 -4814 1230 33118 25161 7768 -13766 12701 9031 -6666
5657 -6666 1172 2658 8116 -14535 -28427 -24228 -33114 -8904 6444 38818 18971 -17594 -33828
5644 -33828 -7823 16862 -7539 -7036 -833 -1308 500 22691 -8969 -59240 -61250 -31094 -7272
5631 -7272 5256 -22238 -26719 -43876 -81506 -69616 -45593 -26621 -32607 -38974 -522 10727 33458
5618 33458 7341 -17418 -33363 -64776 -72463 -29315 -41261 -51676 -37635 -19895 -22474 -3362
5606 -3362 20413 19329 -20532 -50074 -18093 12871 22148 1018 -17633 -11081 -8186 -50836 -84898
5593 -84898 -84637 -68026 -70157 -41110 10914 17320 13841 12042 19381 -7115 -19047 -5812 3946
5580 3946 3890 -9667 7397 15518 -3574 -10828 -22952 -51247 -23277 -1187 18031 2545 21087
5567 21087 44475 31346 11970 -1785 5396 43875 22835 11946 -9960 -16234 -44694 -53591
5555 -53591 -18998 33212 62661 41302 25970 13579 6902 33853 55029 57222 7820 1954
5543 1954 17386 11257 1916 -24873 -48613 -47729 -27679 -2215 -18575 -28890 -11270 -20250 -14551
5530 -14551 -5807 -21654 -38009 -26887 -4335 -10246 -25421 -25264 -21157 13217 20410 42775 49412
5517 49412 61654 39579 -4970 -7810 1933 -12011 -17800 -34023 -36535 3681 23107 41659 47300
5504 47300 33010 12145 36124 24902 -26099 -14046 -2594 -32522 -34022 -16508 28270 60168
5492 60168 38601 -6412 -40735 -42136 -6025 6559 32221 35483 28940 34531 19481 24249 4835
5479 4835 -17380 15679 50130 50408 84113 101718 81338 41467 41587 24153 -1389 10706 15641
5466 15641 21313 19806 -4631 -17673 -17077 -33066 10583 14812 14 -2214 -5450 5685 -1441
5453 -1441 21909 66673 61186 7482 -24518 -17809 7247 30133 49336 36603 43913 48253 -8262
5440 -8262 -5781 12743 32822 16254 -2444 -14492 -24784 -22233 -10617 48893 69830 31600
5428 31600 -7906 16040 737 -17317 -15341 -31308 -21365 -50273 -41253 -41636 -32079 -8603 -314
5415 -314 2633 12390 27210 -362 8779 22924 42319 50869 38590 32279 8515 7131 16552 29726
5401 29726 14436 60 -9313 -1906 11391 17562 30053 50722 48084 29411 23183 27356 29721
5388 29721 17164 -11053 -10879 -53687 -29931 -7610 374 8838 -4480 -15846 5426 14121 -20644
5375 -20644 -29856 -24885 -4395 -2327 -7164 -20222 -35820 -17715 15882 10197 6555 -7258 -3286
5362 -3286 -2874 16743 10983 4547 -20003 -41290 -38004 -57407 -31495 -36976 -12656 14852 35146
5349 35146 34922 44253 34237 6397 3725 34239 33475 -17008 -54519 -66415 -24988 -26020 -32226
5336 -32226 8126 70622 76986 26491 9933 3111 8519 16845 6273 -10178 -25908 -7212 -1162
5323 -1162 -37639 -41708 -30231 -43115 -18665 13364 45299 27690 25648 2118 -9392 11084
5311 11084 35684 9150 -9199 -7850 -22274 -18497 -14713 -3997 7987 10809 16787 -3704 -9214
5298 -9214 -17687 5641 28146 13369 -36787 -46521 -4959 44983 59001 54592 42569 39054 41576
5285 41576 9383 970 9424 4112 -9402 670 29056 6444 -10759 4197 25884 44010
5273 44010 50396 24919 78276 97887 84694 96927 95657 51327 39323 50827 71090 54107
5261 54107 46769 17817 6892 23098 58452 46000 16401 766 10415 24321 27462 23290 15629
5248 15629 34417 5072 27805 59314 41511 30463 -9659 -52659 -40782 -26790 -16627 -24176
5236 -24176 -36430 -65473 -34780 7388 -707 14045 18724 -11672 9706 4705 -23832 -23181 -15302
5223 -15302 958 8661 6434 5126 -13159 -21642 -6082 16256 52115 53169 44662 35032 27363
5210 27363 17785 25391 32922 19053 -25462 -45711 -48474 -19709 -9820 -16886 4922 28954 74089
5197 74089 59840 19094 149 -3957 -11647 -47983 -52335 -1752 25284 29907 -8937 -44325 -51251
5184 -51251 -41662 -53555 -41129 -13263 17363 31358 13527 -14697 -19314 -20236 -38194 -25044 -20610
5171 -20610 -26242 -28441 -23042 -23693 -17516 11490 43202 46603 13828 -8351 -28400 -32339 -36696 -31986
5157 -31986 -21371 5237 -22164 -56087 -48242 -27399 -3806 38953 25083 23273 44617 32840
5145 32840 13837 -7267 -17515 -7413 3329 -14444 -11806 6630 -2093 -30910 269 6740
5133 6740 27799 35028 17291 39660 53531 37495 -10265 -53122 -23238 -9626 11778 34701
5121 34701 27348 17184 3210 2244 14577 -12960 -26646 -16130 -3721 19875 8492 -18995
5109 -18995 10484 10357 -15997 -15345 4988 6304 20996 18439 8301 -1415 -39664 -62188 -60731
5096 -60731 -33519 -19568 1944 -5462 6653 36998 -795 -43644 -58984 -59586 -25811 4393
5084 4393 -20512 -51264 -59358 -73658 -59680 -49928 -16717 -20996 -27839 -12868 9999 11903 361
5071 361 12897 -160 -23116 -28123 -19251 -13254 -9639 -18281 -35676 -37356 -32933 -44475 -50670 -64798
5057 -64798 -33883 -638 12552 3314 -4327 13505 44707 40902 36442 20883 -8736 -18690 -52243
5044 -52243 -59300 -19014 -7044 -20501 -28141 -44687 -44358 -25703 -22643 -33916 -74681 -78891 -52590
5031 -52590 -42531 -14248 -38546 -66492 -89974 -70407 -35294 -43799 -68499 -49526 -36429 -19228
5019 -19228 7019 18422 -17832 -30800 -3174 12529 26622 -4456 -41249 -28177 -19484 -12699
5007 -12699 -45922 -49914 -37067 -49700 -53277 -30575 -13148 -5715 -24928 -21217 -23671 -25888 -11732
4994 -11732 5018 31908 23617 11116 -9634 6934 -25538 -36309 -44728 -30761 -15686 -1964
4982 -1964 -3947 -22064 -44423 -47947 -37568 -12306 2488 -6787 9324 1771 -126 -23930 -8820
4969 -8820 -2581 14943 10906 27828 60929 40598 -118 14038 14790 -12903 5961 4088 10408
4956 10408 -17222 -61209 -56651 -47638 -26320 9046 21147 663 -19626 -6532 21276 12257
4944 12257 -755 -19810 -12619 -32146 -31218 -31024 -18651 -10527 -30609 -34562 -50580 -30731 -14613
4931 -14613 -2995 32529 50913 25231 -35576 -51625 -31603 -8912 -22354 -9777 17155 11447
4919 11447 -764 -18027 -27109 -19725 -26072 -28574 -21584 16754 58336 58108 54974 40873 -17112
4906 -17112 -9481 20132 19017 27436 14564 -934 -20792 -18748 -11538 -17692 -27454 -36549 -41071 -15171
4892 -15171 10847 -3021 -362 4470 -24401 3709 51497 60328 35871 14204 6744 -16631 -28099
4879 -28099 -12613 15334 -24411 -13639 -1270 6621 -28055 -45121 -36149 -13457 -12547 -1147 -4461
4866 -4461 -9012 -15405 -16600 -26389 -39214 -73996 -96097 -100772 -114175 -82649 -65649 -54518 -89801
4853 -89801 -110014 -92015 -65823 -35410 -19090 -24244 -37005 -24837 -17313 -36774 -20500 -37390
4841 -37390 -49532 -31389 -12728 -24058 -33887 -25219 -32726 -18537 -4883 13244 16345 19910 21644
4828 21644 25386 46134 9251 -33519 -10333 -15737 -4242 6345 -2346 -10126 -26435 -43388 -13602
4815 -13602 -31234 -47398 -37519 -5734 8545 16338 -15329 -36220 -52431 -44695 -34997 -30815 13380
4802 13380 41862 53842 61042 18157 -37120 -70932 -65708 -72717 -39688 -23593 -14772 -2242 10276
4789 10276 -5165 -2692 19002 58727 31380 18336 18790 16969 -15022 -18883 -26544 -23111 -16628
4776 -16628 -33496 -26063 10005 -19208 -56459 -61441 -25519 15005 27949 -6823 -11716 -3653 -38417
4763 -38417 -51007 -47401 -38741 -40612 -41772 -23789 -21516 -20114 -35251 -53869 -49058 -61342 -48723
4750 -48723 -41369 -51700 -69084 -48564 -64961 -59050 -20897 -11629 -23594 -10346 -8460 -13111 -1927
4737 -1927 -4106 4305 -2694 5327 51793 75701 30618 15556 -7666 -11324 -29858 -23102 -14079
4724 -14079 -14036 -20678 -29751 -26497 -13055 -7864 -41936 -31841 -15732 5401 -4340 -21776 -30702 -31765
4710 -31765 8888 21848 -12027 -24334 -14538 -9758 -19838 -9772 -26435 -41195 -9147 -11310
4698 -11310 2116 -15866 -43905 -8317 35819 28933 18526 -1540 -18020 -49774 -49801 -22784 -29414
4685 -29414 -7314 11599 8224 9115 18399 10317 -15043 -10286 9779 28123 31708 39471 37859 46996
4671 46996 88958 108475 104066 94215 65919 80569 54137 2326 -23025 -11988 818 -23224
4659 -23224 -46944 -39110 -68314 -59694 -47000 -32399 -19193 -7327 -2643 -12543 1248 -28581 -57596
4646 -57596 -54525 -72299 -87056 -51329 -20030 -16864 -18705 -56629 -45708 -26663 20926 41845
4634 41845 33533 -7086 -18148 -10539 -13936 -8082 -3059 22396 29097 19356 -9099 -19434 -6913
4621 -6913 3027 -7181 -12102 -9440 6814 16480 13441 19086 -4125 -38171 -41749 -28962 -19685 -13294
4607 -13294 9022 28470 22117 3273 -13296 -43151 -4976 32438 22856 15031 40574 54839
4595 54839 60759 58632 42514 15776 -34981 5089 561 3457 31685 45072 46477 5670 -9325
4582 -9325 -23148 -19043 18919 34956 7363 32587 31155 47572 73025 61153 11414 15399 1599
4569 1599 -38604 -55179 -51593 -46925 -50160 -27849 -15783 2702 -15517 -49791 -25884 2174 -9003
4556 -9003 -14708 -5814 28089 54858 55086 47509 32179 21094 33158 19226 8413 -12359 -24442
4543 -24442 -48698 -54093 -19949 -38227 -66954 -95254 -82758 -68354 -58579 -44104 -23715 -4829
4531 -4829 -2408 -18573 -25544 -12063 -11763 -17485 -21956 -36835 -33850 -17273 9794 -6946 129 15156
4517 15156 31414 19138 28697 24652 15490 27370 18605 2269 7534 12756 30741 40174 20493
4504 20493 867 -12692 -27213 -51323 -43092 -24000 -10522 -39958 -37583 -47055 -27367 -23369 -15653
4491 -15653 -2737 6710 -7692 -9561 10587 62808 51715 -2178 -25388 -26318 -35864 2374 7862
4478 7862 -15264 9330 30056 20369 -1499 -19781 1394 49563 28216 -4421 -8560 -30439
4466 -30439 -29764 -3281 14410 20608 17967 27651 13789 14965 9011 28793 -3393 -58580 -51137
4453 -51137 -34660 -14580 -16690 -16711 -4874 -27802 -33472 -5745 25687 43748 38163 13934 -5723
4440 -5723 -12018 6283 14944 19156 10577 -14155 -57480 -22876 6793 33759 33722 11673 1559
4427 1559 -3651 -21970 -20759 -21470 1782 20570 -10062 -3787 -3317 9338 26791 31688 16559 10837
4413 10837 40761 78473 77409 25686 -22055 -27923 -13886 4001 -30510 -52011 -40216 -25757
4401 -25757 2267 -13609 -22406 -21843 -39226 -33753 -12901 -14730 -33005 -8966 14623 22064 -1182
4388 -1182 -28717 -43269 -32363 -15859 1397 20481 -867 -39787 -72619 -79577 -83712 -38953
4376 -38953 -32808 -34294 -30057 -46512 -29326 -21815 -23566 -16463 -34744 -34323 -16929 14506 -7038
4363 -7038 -15895 929 -13568 -16795 25576 50543 14021 11526 35632 64155 35123 3830 -2430
4350 -2430 27994 -1153 -41447 -33114 -22600 -38618 -51651 -28776 -58763 -46542 -11543 -15756
4338 -15756 -9042 -3125 -1226 -3222 6649 -3827 11423 14951 11766 -12625 -33821 -13080 -9825
4325 -9825 -82676 -82066 -52082 -54864 -31502 -28296 -17174 -41091 -29571 -3392 -12886 -19419 -36198
4312 -36198 -54815 -42820 -24335 -13199 -29516 -49733 -48305 -22698 -22692 9859 4874 -8283 23979
4299 23979 48958 59865 44267 38126 30436 44864 39059 20746 -1485 30535 48350 35612
4287 35612 6768 270 14471 -692 -8909 -25186 -42249 -62344 -35581 -38950 -14176 -5253 -33361
4274 -33361 -15538 -24370 -32177 -8752 3029 -28030 444 32918 18647 11775 -23302 -66099
4262 -66099 -46313 -7122 6708 -25954 -22725 -3443 6548 17552 29492 18324 -19561 -15744
4250 -15744 -37850 -53677 -44659 -40798 -62001 -44505 -16774 -24110 -19325 -7619 -2756 -11657 -13677
4237 -13677 3998 23401 55908 62372 23146 1981 -12992 -14608 2730 24569 13370 -20546
4225 -20546 -21168 25983 26453 -2601 34489 49773 45844 17740 29518 31839 13359 11286 26803
4212 26803 -8161 -27126 -21592 16258 26547 -5754 -6420 7855 52070 64639 -3479 -29807
4200 -29807 -10225 9248 16224 6052 18057 36964 37696 39997 30968 54994 45621 15884 9279
4187 9279 291 7079 9146 -6267 9055 11426 708 19027 48948 34803 31182 26987 2939
4174 2939 -4874 -22481 -27515 -34203 -10640 -8462 -4412 -4999 10640 24917 27023 2668 -31737 -46100
4160 -46100 -62259 -15132 -24283 -43870 -46745 -45938 -40566 -57900 -65100 -20772 5243 34373 32608
4147 32608 12298 22419 541 -19989 -32476 -19884 -23295 -24230 -49054 -50921 -27149 -32190 -52705
4134 -52705 -54310 -40876 -14616 -599 -12924 -36322 -42805 -32786 -32513 -45771 -36249 4039 -2036
4121 -2036 4767 10351 -4970 -11783 -9451 -35876 -38247 -37120 -35636 -18795 12557 7693 4156 -9681
4107 -9681 -2454 9683 -37309 -26541 1285 -24626 -2205 5653 20686 27839 8761 -3010 -5666
4094 -5666 32649 41424 26982 7725 9039 6289 14719 -3293 25157 20163 31790 63838 58393
4081 58393 40458 44764 29699 20494 -34238 -64661 -33395 -12796 -23240 -48743 -71403 -45570
4069 -45570 -989 23447 15482 28379 36254 26050 8012 42672 34232 6688 -13904 5327
4057 5327 12986 -9372 -19526 10335 17614 5727 2606 2039 -11290 -7091 -14846 -721 25063
4044 25063 22893 22087 32653 28406 27138 -2931 -5968 -20314 -38515 -28487 -32065 -62382 -69042
4031 -69042 -53705 -38363 14574 22590 31915 18240 28916 16101 7354 8276 24775 24828 31199 32736
4017 32736 14958 -29878 -36963 -18369 10238 15906 3633 20541 16865 179 16257 5584
4005 5584 -5755 -25135 -50084 -55415 -39997 12624 15114 16970 19698 7717 32639 24810 15734
3992 15734 2332 -2898 -4081 -6543 -23135 -26510 -30714 -39818 -17405 -29690 -4589 18813 25736
3979 25736 16396 7310 35639 44669 30926 16406 9422 12300 40230 37172 23280 273 -42579
3966 -42579 -28070 -35479 -27550 31999 42532 32637 27621 61351 30763 33983 31970 34119 43131
3953 43131 48428 -2880 -20660 -49551 -31694 -7434 9801 6772 -8475 549 4552 2290 -7708
3940 -7708 -13318 -8834 6326 -16686 -32829 -32814 -59338 -73710 -45846 -8201 10991 6470 10411
3927 10411 -11987 -4234 17693 28577 14110 10290 28114 53678 64031 45986 49343 49859 54709
3914 54709 48852 14679 32277 38083 13403 -6612 -40096 -51309 -16734 -22615 -37164 -49690
3902 -49690 -42579 -4412 -605 -23774 -9849 24191 43085 19719 7030 13847 11263 -18536 -42008
3889 -42008 -64793 -61457 -46603 -29049 -26973 -5778 -579 15892 14064 -17898 -33379 -21908 21441
3876 21441 34266 62179 58811 42317 51948 47274 17928 -28827 -64655 -59797 -58837 -42121 -30886
3863 -30886 -10712 853 -4670 -9487 -23816 -12238 -26327 1138 14234 11841 -3589 -23628
3851 -23628 -14935 -20269 -21281 3618 32023 25060 42782 60843 53112 43149 30567 3428 -31413
3838 -31413 -35248 -2075 19665 20537 -16652 -9760 -1866 24383 34945 17426 -5979 -21309 -22199
3825 -22199 -2101 6505 2345 -14627 -11420 -22015 -30746 -28158 -43249 -32057 -10658 12716 25123
3812 25123 12955 30840 46790 25343 18456 18566 18999 18677 19727 20210 61213 68639 60334 73818
3798 73818 64425 39691 65167 68952 27587 28139 36024 26887 66981 87847 82947 37761 11696
3785 11696 4736 2213 54081 100870 77942 67387 64384 25112 -5146 612 10253 55910 69698
3772 69698 43749 -170 -17 14783 27613 22915 25958 22767 5361 6228 -7168 -63445 -33732
3759 -33732 -36514 -39396 -61374 -53791 -61877 -57156 -62992 -91195 -48841 -36038 -20297 -6011 1776
3746 1776 9558 -4535 -9233 4766 5604 10307 37651 43140 69294 76494 82421 105056 66702 46929
3732 46929 2929 -2762 5097 -4998 -18242 -10901 -16219 -29091 -23176 -27419 -10567 -11217 -33124
3719 -33124 -51737 -39839 -7396 -25024 -29582 -25623 -3312 24193 45220 51987 51735 36173 49875
3706 49875 86328 78277 75066 64450 38473 30603 38831 46610 69660 70291 45705 56280 20768
3693 20768 -22113 -42712 8491 32331 21734 28377 7944 144 16421 22937 28305 11456 -3722
3680 -3722 -12892 -14410 -5014 6586 5448 -4181 -13947 -30273 -6717 25078 -8488 -27783 -26344
3667 -26344 -6172 -9250 -37330 -31827 -14346 10707 -1723 -13913 -22662 -15234 -18383 -5980 52228
3654 52228 21340 -3487 -3718 -667 14150 11559 3609 5141 11209 -6079 -27296 -38862 -29086
3641 -29086 -34911 -34232 -19804 -22831 4546 6665 -34580 -26592 1205 12884 11445 1377 11555
3628 11555 -3205 -31458 -42698 -18298 10637 54026 80525 45766 29550 41352 76260 52679
3616 52679 29604 32935 43691 35949 21596 14772 9704 37478 -4467 -49277 -35562 -23639 -43511
3603 -43511 -81548 -88555 -66581 -53166 -51759 -33377 3048 9037 3696 -522 -18356 -16625 10767
3590 10767 -14133 -33991 -13898 13522 9504 -22625 -161 -26343 -37487 -12731 9190 21765
3578 21765 6457 -12129 -8253 -24141 -33948 -28795 -3136 30837 13021 -3635 -2365 3924 18692
3565 18692 40846 36654 12249 12950 13602 -26575 -35049 -29640 -8806 -18466 -34867 -32207 -46040 -30086
3551 -30086 -15240 35715 19685 -15555 -9512 11129 42922 63728 36799 39287 79801 95975
3539 95975 72713 54482 43093 21027 13776 -8589 -14129 -16709 -17830 -13349 9846 -7395 -25475
3526 -25475 -52904 -57066 -35379 -31317 -54877 -44083 -15051 -10101 18911 52400 32253 17748
3514 17748 10010 26775 14577 13812 7858 21034 23435 31834 2609 9761 18336 17031 37030 26129
3500 26129 10242 18760 27397 37302 50724 53439 58348 46517 31546 14914 34005 48602 44765
3487 44765 -3041 17031 25564 7497 -16151 -35592 -36139 -161 35500 31580 48391 59506 73196
3474 73196 61707 58620 41266 60463 36765 31732 71780 65568 58609 24111 2954 19091 28601
3461 28601 39966 19720 10441 3753 17587 42564 40674 39288 41725 51607 57303 27049 2075
3448 2075 1940 -30023 -13578 11831 -23165 -16119 30510 55354 20549 129 -18214 -15561 5953
3435 5953 15417 18070 4882 -36486 -22342 -12928 -61 9367 -17095 -30748 -41727 -44852 -47599
3422 -47599 -16429 -15271 -13433 -9578 5108 29024 19562 -4467 -625 5452 17514 26718 13503
3409 13503 -18815 -8525 -9278 -8716 -19092 -9436 29572 49912 13189 1901 31062 28503 2732
3396 2732 -9926 11360 18386 771 -11133 2948 456 -18768 -47942 -20205 -211 6938 -1099
3383 -1099 -13593 2234 -10669 -10916 -28976 -37271 -33751 -30178 -6601 -6744 2983 -2446 -30398 -11753
3369 -11753 7024 28326 51643 54329 24893 21907 8438 -16101 -18142 -25834 -921 4159 -12687
3356 -12687 13052 40263 47202 33690 52734 53592 41100 5074 -12624 -20961 5372 22258 54923
3343 54923 93906 76755 65021 69884 75298 46612 16038 -9529 10604 28007 34125 21947
3331 21947 12627 3364 -10898 14363 38536 18766 3902 -15733 -25343 -11902 3550 30712
3319 30712 27607 -785 21745 19371 2699 -3223 6919 24423 12432 5245 31164 14318 9036
3306 9036 22056 6302 23485 46046 59305 33928 21064 6867 -1789 -10156 -13404 -35416 -33872
3293 -33872 -44226 -42452 -24892 -31475 -18643 -4772 -2046 8279 -1053 -8428 -13685 -28240 -16218
3280 -16218 -13521 29688 -7958 -29649 -22820 9471 862 3337 8385 -9228 31107 38889 15971
3267 15971 9877 13965 -5079 -15186 638 -30880 -44743 24538 50998 41952 30329 22051 15886
3254 15886 36288 47197 59053 56723 38687 26231 -8431 -11363 22156 30918 35335 40092 52940
3241 52940 80540 67854 42955 9193 -7638 -17819 15840 16329 3027 28806 64603 39032
3229 39032 -3332 11472 32053 3339 -28776 -45474 20039 46309 38944 38025 27425 25255 60957
3216 60957 83409 71875 51502 21753 1315 11725 10665 20160 -206 14419 28240 15940
3204 15940 5886 33260 38687 19882 24536 530 -32957 -33668 4475 5581 5895 40545 50590
3191 50590 45275 61133 56266 33030 -19605 -24015 3536 1906 -10601 -52143 -66744 -79341 -70431
3178 -70431 -57202 -18027 -103 -10377 -4333 280 13206 18578 2663 6649 13152 31495 65411
3165 65411 33163 -28623 -21965 -1973 7106 -22918 -49574 -52431 -50953 -69727 -74683 -62319 -25646
3152 -25646 -55771 -69478 -63386 -39393 -29005 -18629 -4405 13013 -34167 -57753 -30998 -15802
3140 -15802 23060 30166 40290 51926 37778 14721 -5851 3635 10672 33987 36491 26944 11658
3127 11658 21031 -9800 -26108 -2881 15630 15644 16428 10824 -22786 -22161 -9299 5958 38030 34247
3113 34247 16394 -11610 6024 -7662 -561 -1162 8475 36017 51196 82022 9136 871 33489
3100 33489 25651 13771 23961 34149 -7317 -44056 -26967 -36184 -37531 -38214 -34832 -24967 2758
3087 2758 -248 -30326 -44516 -14502 9126 7645 -18226 -42812 -21049 -6817 -13611 -38980 -22174
3074 -22174 1585 -4812 -6073 -19793 18275 27686 25888 21360 -14716 -19718 -25957 -7033 -3397
3061 -3397 19080 6289 -22553 -22177 -21709 16104 -3659 -23111 -25246 -10143 17996 27066 32547
3048 32547 36195 16776 34283 49951 46002 -8986 -41131 -27299 -21857 -23449 4262 28673 19042
3035 19042 4075 11892 4166 4610 -18881 -59796 -28121 -1066 -4206 -40083 -32354 -28415 14820
3022 14820 34525 -4923 -24999 19866 37720 72142 45651 -1679 -11356 -6674 -22855 -28502
3010 -28502 -35731 -32997 -10325 -7520 -25123 -1470 8423 -589 16020 26473 19374 6302 30069
2997 30069 27286 -9411 -35288 2801 43987 33480 13731 -14354 -26955 -11766 -21987 -37596
2985 -37596 -33168 2714 33340 28533 20686 53414 38323 39163 58992 54517 10498 -9525 19913
2972 19913 6164 711 2776 2800 11556 28975 28558 18558 14134 -7484 -8077 11076 -13258 -68271
2958 -68271 -84999 -28617 20483 14350 50830 57905 78067 60350 -1218 -14088 -18721 -12580 -9349
2945 -9349 35 50904 83620 71632 31648 34156 55636 67516 36892 -94 -24228 -43581
2933 -43581 -28508 -16759 -22966 -5831 -23111 -18028 -8010 -10650 -14522 -9886 -11462 18493 20006
2920 20006 9554 24493 -4164 -9473 12985 10372 -4769 -2978 -10587 10430 8528 8144 1924
2907 1924 52571 75758 73392 42862 3247 9321 18624 46744 45571 5862 -33931 -37447 -40304
2894 -40304 -74620 -56673 -20627 -6494 -4214 -6554 -1241 34291 67881 77941 55159 -2298
2882 -2298 -13396 19342 14086 386 -6257 -19964 2045 5780 4321 -4131 -22574 -61682 -64552
2869 -64552 -19259 -19528 -15133 -19253 -5454 27061 27155 -2892 -16246 -31629 -36469 -10025 -1799 3849
2855 3849 -40070 -38150 -16898 -26784 -11472 9061 19051 10627 3868 -23734 -30067 -36310 -45712 -54742
2841 -54742 -39126 -8758 6556 -19349 -32262 -13484 -6196 20580 44592 41424 68194 88338
2829 88338 48920 18974 -5302 -24486 -1043 -19943 -15803 -905 5282 -12551 -4765 33733
2817 33733 26489 -13118 -5546 422 -21592 -32684 -23645 -25817 -36459 -44475 -10743 -2978 -9594
2804 -9594 -20856 -29167 -18468 11407 43199 46984 5675 -22478 2208 -596 -9583 -3952 6895
2791 6895 49138 68539 59142 35460 5586 -8874 -40604 -43395 -23227 -324 4656 2949 3786
2778 3786 -28675 -55062 -62264 -38497 -1425 16357 -10784 -598 -2184 -8673 -11203 -9465 -22423
2765 -22423 -21213 -1691 19885 13014 10377 12966 -32897 -41054 -14319 10864 3834 -12794 -29538
2752 -29538 -471 -16362 -28208 -38167 -29824 -17468 -37588 -34766 -40705 -22233 12453 39918 47507
2739 47507 22269 43137 10139 -21945 -9299 10488 9120 5518 19840 20887 -6107 -14478 -33283
2726 -33283 359 863 -8757 7567 2765 32783 37727 18231 -8559 -4427 23885 18643 -6597
2713 -6597 -2468 26357 41833 54794 71091 61477 27778 22266 56753 43024 50879 64210 47137
2700 47137 25249 21852 60414 79568 49701 57560 61851 -1405 -18323 -18460 -42853 -48159 -43578
2687 -43578 -29949 18950 32854 31066 6457 11404 40903 4702 -35835 -36895 -10667 21406
2675 21406 2328 18594 18903 50688 70551 61769 19833 -10703 -8851 4189 6860 10192 14946
2662 14946 27315 36391 23379 20558 44426 14155 -14466 465 -14926 -8735 25419 12546
2650 12546 -2200 16386 7270 6389 23841 46171 28307 10018 34660 41867 46582 47588 26826
2637 26826 27583 56871 9019 210 26914 20124 7559 13557 27601 15863 -2279 33837 21548
2624 21548 53396 61665 26586 24348 16881 25400 23211 36634 79359 86309 75750 32943 -4644
2611 -4644 -16533 -15809 -2272 1284 16341 -7497 -13439 -2394 24915 8390 -873 -2757 18718
2598 18718 34263 25421 7976 -21965 -5700 -8698 3660 36273 33601 7918 -9088 -23664
2586 -23664 -11548 -6155 10388 33610 15951 19400 28025 2570 1980 -4818 -52475 -90927 -40318
2573 -40318 782 -8038 -8594 -15483 -27399 -11480 4625 17948 17018 17235 30429 35196 7124 26312
2559 26312 19647 3579 6409 -2 12110 -1010 -5122 -29305 -15504 -4539 25154 49096 71457
2546 71457 64818 43821 17731 35046 43974 12270 -24345 -19833 14358 21390 9376 -18091 -34300
2533 -34300 -61587 -65104 -48634 -46003 -2352 33487 62749 61516 19609 -474 7113 13214 -16521
2520 -16521 -26187 -37837 -29079 -6127 -20481 -32108 -27964 -43952 -34417 -18752 -17632 -42740 -50195
2507 -50195 -40644 -15036 -27582 -9804 29058 25821 -19055 653 48590 94377 90028 61854
2495 61854 7057 -9800 7698 2027 -11765 -18181 -30103 -33226 -37604 -23040 -19843 -2837 -21478
2482 -21478 -31285 -719 37106 2597 -24758 -36436 -45840 -37041 -25479 -18526 -19984 -21821 -26606
2469 -26606 -37136 -21531 -11146 -8371 19870 41620 42723 31594 11998 5148 19296 37367
2457 37367 34798 9998 13113 40434 49054 24129 30279 12258 -1941 19239 29913 48336 36202
2444 36202 32885 18832 19968 40664 48043 30578 4862 -4268 -2673 4212 13824 4011 -4115 24495
2430 24495 62798 65810 12406 -45899 -43549 -31814 -5472 -29786 10426 24598 10378 -1332
2418 -1332 9230 17832 33588 38914 50599 29667 1296 16595 9651 583 29616 -6060 -5501
2405 -5501 10179 23478 22450 25052 31062 41069 12822 -748 14844 23452 12400 -12844 -5414
2392 -5414 21457 9351 -10762 -23571 -18077 14612 18317 -5232 -12947 -6406 -19085 -31054 -43314
2379 -43314 -39375 -31826 -13663 -5388 -30620 -21866 -36276 -37666 9589 7143 22298 25941 33217
2366 33217 52568 50342 11320 6041 -2766 19900 9402 -1301 -9340 -3477 19234 14917 -23212
2353 -23212 -52995 -35201 -37605 -48545 -56431 -50408 -33658 -7284 -31972 -25920 -26714 -24270 -35522
2340 -35522 -23751 -11684 934 5404 16686 7920 20822 10969 -22534 -25343 -6236 29454 23273
2327 23273 1318 -5656 -33109 -39915 -52394 -32673 -11435 -15109 15736 32561 28414 -5916 -25163
2314 -25163 4572 8163 18078 8386 649 -5636 -33166 -41707 -30949 -34464 -36159 -33846 -10682 -50740
2300 -50740 -83947 -96869 -94372 -65223 -25318 -6950 -32874 -4000 5700 -27915 -25382 6249
2288 6249 25991 7281 -8094 -19988 7404 25243 36057 23101 -8432 -20979 -9147 -27905
2276 -27905 -20761 -34042 -15662 -45203 -76170 -62663 -37462 12803 30938 23441 12368 -14048
2264 -14048 -17801 -23409 -42079 -48278 -29047 8401 12736 9658 -13280 -30800 -26292 5320 -36404
2251 -36404 -33791 -31198 -27654 -15540 -40754 -55019 -49130 1964 10467 4856 -12042 2349 5770
2238 5770 -18176 12113 49252 36213 22671 -4583 -37728 -51220 -43155 -20847 -8812 15632
2226 15632 2994 9019 14916 268 -15790 -10916 -13554 -42560 -41467 -12364 4412 -18084 -30723
2213 -30723 -15381 -11677 -12980 -8591 -18862 -737 9566 -5988 -11709 -21534 603 12972 30623
2200 30623 11522 37883 32396 23742 24403 15774 3685 25970 23295 11273 24429 27113 8113
2187 8113 2779 37951 31116 13814 51772 86943 108699 98951 31047 24935 39669 31883 38827
2174 38827 60151 43603 27586 23178 17674 21417 9037 12182 16890 23934 17568 14145 -12767
2161 -12767 -15995 -18531 -4522 40751 23829 28800 33757 30806 64062 46554 21197 19571 11782
2148 11782 1675 -18473 -45198 -43664 -11022 7069 31984 18310 -14982 -24909 -23805 -36444
2136 -36444 -27522 -25344 -43991 -44533 -23713 -51901 -84275 -54721 -16946 1807 13098 -40731 -81565
2123 -81565 -62877 -30078 -1255 -11736 15141 24248 -27955 -43879 -48230 -39455 2714 8380 -1578
2110 -1578 -28842 -25374 4234 26760 11472 -3102 6164 25407 52252 62983 34733 -5515
2098 -5515 -17419 -13688 -51256 -36246 -5711 -30362 -14631 4531 11559 7926 1731 8112 3634
2085 3634 14630 -20970 -28188 -26475 -7502 9251 20562 -5045 -28824 -16732 9387 23527
2073 23527 37339 23970 -1265 18917 19464 -15414 -12701 -15677 -35392 -41935 -49450 -34588 972
2060 972 -2780 -16552 10781 25905 22019 -3711 19718 -6809 -14971 8442 10428 5310 29891
2047 29891 1803 -20786 -19971 -46225 -64152 -9987 13372 37403 24508 27465 52465 55466 6403
2034 6403 -7071 -6789 -12198 -1472 6973 31690 48497 33957 34811 33725 28672 18699 7787 -12561
2020 -12561 -19199 -35582 12475 4540 -40375 -49975 -40822 -31898 -44212 -18052 5315 4386 43034
2007 43034 19001 -30254 -17098 46174 59142 42033 35992 24942 12274 21107 18243 4178
1995 4178 -11343 2246 26010 5390 1829 7995 32059 50136 37430 -6877 4366 5820 -12277
1982 -12277 6514 -11321 -40479 -33809 -31535 -19304 -5871 -4287 3890 -13509 -28471 -41206 -11469
1969 -11469 -19119 -22219 -20874 -27721 -45270 -53158 -52836 -40432 -7600 3294 3132 11392 34055 15109
1955 15109 -28396 -42626 -33109 -19893 -8334 12313 6180 -20436 -26673 -34515 -28021 -14477 33927
1942 33927 51286 19534 17894 -4692 1182 15682 -11042 -28066 -8508 39039 63727 53202
1930 53202 27327 -9026 -37520 -46662 -39256 -2720 5114 2505 18133 -829 -30163 -41691 -35048
1917 -35048 -22270 -21826 5811 3881 -9860 -12518 -32290 -39242 -19505 -11905 -1867 12437 23019
1904 23019 44608 56355 49960 -5063 -12440 -5279 2496 22213 -5291 18299 36263 15724 -5838
1891 -5838 -53234 -62648 -53550 1322 22713 -6055 -15932 1421 -21227 -44056 -19409 6715 -30902
1878 -30902 -14712 -26231 -33711 -37372 -24002 -4993 11976 -5427 20253 7520 -17822 -45767
1866 -45767 -22133 8789 -2442 -3334 16294 39578 32037 37432 -12135 -63375 -44074 -36555 -18838
1853 -18838 6047 4174 -28178 -54176 -28965 24242 33472 -24031 -58649 -72893 -44182 16483
1841 16483 58787 49886 46109 54070 40406 20081 11100 -16120 16408 42943 53863 33930 19481
1828 19481 21818 7318 3062 5853 -48754 -20457 2362 -15832 -19992 -11443 -18395 978 52930
1815 52930 68571 71584 58532 65903 23864 -32230 -65566 -56751 -48890 -8805 -5386 -15758 -372
1802 -372 2793 5162 4707 14041 10399 -14540 -24275 4582 17492 4212 -6787 -3231 8861 21199
1788 21199 33774 11425 6819 -15667 -456 -13113 22338 49308 74340 80093 28545 11568
1776 11568 3812 -5945 -15627 -12319 -15594 -26383 -41022 -21990 43190 93505 92057 66683 45465
1763 45465 31740 5231 33825 63441 48229 35604 17821 11451 883 -18384 -1673 36058
1751 36058 38766 9304 4971 24996 19679 9013 11480 -2460 -12770 1069 -17058 -31379 -32838
1738 -32838 -37793 -27547 -31141 -41972 -42218 -44122 -14972 35450 72721 55300 10973 -2263 -33525
1725 -33525 -38879 -29632 -26542 -50669 -62996 -51621 -51586 -38598 -23544 -13817 1502 -9898 -14882
1712 -14882 -12284 -18339 -11910 -5049 -11140 3902 5185 12849 44290 57880 51842 29728 26544 43690
1698 43690 21030 6585 15367 36439 39318 26698 30393 5731 13755 17977 -2377 -9932 -19095
1685 -19095 3735 -37930 -30528 -7050 -5102 17777 17435 42785 63624 72285 50298 31112 20583
1672 20583 28642 22689 6339 13097 2869 -5917 -2655 17570 32129 672 -6706 -1501 -28783
1659 -28783 -66885 -76411 -11274 21455 66801 85688 58377 15713 4002 -15633 -36713 6914
1647 6914 29210 19784 29757 46714 38642 12387 -24490 -5729 16846 10110 -37319 -56028 -68332
1634 -68332 -75922 -87609 -90952 -57647 -28536 -15846 -10709 -8473 -172 -22725 -30385 212 19888
1621 19888 32722 55923 30404 -690 3126 30647 32122 17956 1947 -6206 -25093 -25708 -32614
1608 -32614 -39553 -25515 -24735 -31626 -18608 16346 33817 1401 -36179 -47225 -57716 -25645 -5265
1595 -5265 1134 -12572 -15939 -22221 -17883 -7769 -1556 14908 19593 14166 24096 35223 28881 70959
1581 70959 85645 79416 75281 29074 6032 -37150 -68800 -64416 -15538 -27580 -41405 -56619
1569 -56619 -83720 -80529 -50348 -46345 -65445 -40334 -30371 -36276 -41927 -38232 -27708 -36998 -892
1556 -892 23662 37354 46580 40747 5112 -4031 -822 10079 -42316 -37068 -33428 -10724 14328
1543 14328 9771 11388 -5466 17977 36970 9407 -2648 5748 9124 1383 13162 7440 -10551
1530 -10551 -35847 -62206 -31056 -28625 -3517 13189 -10780 -6848 -20259 -11262 1002 -16144
1518 -16144 -16837 -19296 -26913 -13302 45897 37414 19024 27635 10220 13796 11022 1556 -20034 -8706
1504 -8706 -1139 -3825 870 -7803 16174 -1014 -5675 -2232 -18741 -16173 12963 33986 26078 1661
1490 1661 15797 22144 -1871 -53267 -35708 -15793 -28590 -45172 -16621 3939 47831 46388
1478 46388 37629 15923 29816 37791 29585 -2214 -20623 -18312 -36683 -39990 -4821 -5430 4665
1465 4665 9021 22301 6862 -10845 -24899 14994 20778 18712 3167 -5817 -9288 -38261 -55331
1452 -55331 -25324 4433 9668 19251 35155 45269 24852 -3829 -32701 -3809 25688 2332
1440 2332 1155 11475 36666 26692 2332 -1779 13743 25832 24137 23574 25019 31334 9369 -16721
1426 -16721 726 34407 17947 9218 52065 47906 -784 -15348 -17293 -825 8068 10990 11378
1413 11378 23050 7881 -20037 -37658 4997 5926 -896 6861 24976 23009 -4398 -41886 -29501
1400 -29501 3787 31479 34706 20694 25043 4837 -32611 -18891 15919 29948 31528 3938
1388 3938 316 15031 2432 2367 -20346 -80841 -54916 -2682 28474 55293 54815 6699 -5488
1375 -5488 8357 14889 18834 23074 -14955 -10012 25369 50730 66513 50968 -9684 -49704 -36007
1362 -36007 -50459 -58577 -23385 -22609 -34643 -33018 -37310 -22644 5886 21050 22708 14939 12240
1349 12240 27380 30316 36000 28195 27223 39336 48965 49704 41330 8986 15631 22876 31442 45140
1335 45140 42717 44419 52763 47785 48853 22752 1174 -3414 1943 -16544 -30256 -32615 -10207
1322 -10207 -5840 23841 30048 6666 -21487 -25159 -17906 -29166 -49395 -27167 -9225 12871 13355
1309 13355 -309 -11837 -1785 9668 26044 18027 10031 4301 1065 2259 68 -5123 -8358
1296 -8358 -5752 3520 -7605 -4714 4 11523 36019 28414 18406 17038 1322 3947 -11136
1283 -11136 -9799 -17265 -22961 -4797 20718 19562 18639 23856 47273 20860 -10623 -32061 6795
1270 6795 40908 23573 4931 3855 -7903 -17618 -22605 -20445 -23397 -7719 -11189 -22509 -18596
1257 -18596 -18418 4897 33690 56520 56837 32450 17107 27795 43115 53337 33888 2143 -25190
1244 -25190 -40168 -34275 -2317 8599 17295 36178 44365 39432 -366 -10513 -4486 46084 38858
1231 38858 40416 40034 -2063 -9945 -9028 -430 -19330 -9926 -25721 -29844 -37912 -3996 5292 -8188
1217 -8188 -19947 5481 12307 -2198 -1625 4159 28637 35923 34728 29592 -5572 -9344 -8821 -24866
1203 -24866 935 15171 27690 29520 7234 3346 32157 35662 36688 20896 33653 24151 -16386
1190 -16386 -3336 -306 -30764 -28393 -9473 -814 -23915 -40823 -19324 18024 27625 20604 3064
1177 3064 -1409 948 -5152 -22372 -2155 35724 21601 -1606 17437 21462 10317 293 -23980
1164 -23980 -28484 -20565 -38066 -48850 -8966 10132 -24172 -59128 -57051 -54428 -42729 -17459 -10905
1151 -10905 -36021 -23712 -9616 -19589 11525 -551 -21940 -2146 11837 15910 671 -42988
1139 -42988 -47800 -21652 -19587 -18946 -2570 4087 21412 7829 12386 32626 25119 35822 13715
1126 13715 -33036 -28089 31369 50158 34077 5669 -8882 -8026 12562 32442 16618 -6740
1114 -6740 -18119 -5624 -22368 -20234 -19499 3335 12408 -31140 -12745 -2207 -1574 -28557 -26400
1101 -26400 -28672 -12882 -5342 -5436 7993 10895 11612 32788 26250 2186 -10441 -38458 -33767 -62819
1087 -62819 -57356 -7530 49380 54976 21768 27955 16797 -6501 -10838 -20584 -12396 -19773 -5713
1074 -5713 -7176 12351 -11187 -28488 -12801 -1477 10548 21794 10284 7983 -926 -1690 2700
1061 2700 8321 -848 32940 4377 -14853 1459 46750 36650 11147 -20765 -44139 -37485 -4246
1048 -4246 39239 45025 2782 -19968 -5649 30641 46848 54054 45171 43158 24259 9933 15009
1035 15009 28907 40975 23555 12189 -22989 -12128 26495 27585 14613 37477 51893 44292
1023 44292 18255 2938 -16674 -36537 -22732 -4727 -1189 12352 746 18545 1092 -21065
1011 -21065 5078 11419 -7197 -24519 -11466 -6950 -9461 -10200 -7489 29786 54753 33859 25730
998 25730 49286 67739 34274 7686 19649 41228 38390 24709 46926 39087 38585 32827 7129
985 7129 24997 40078 41161 34963 19846 30212 27661 43261 44957 43934 51705 64964 81655
972 81655 58614 5942 -34225 -17511 13756 13545 29026 2607 -23041 -39563 -65724 -39529
960 -39529 -6952 2462 20688 6660 -37689 -67717 -35454 4301 -11829 -3853 3253 19198 29778
947 29778 45127 14135 -30608 -36791 -20977 -41184 -15376 -20557 -49906 -49690 -40136 -33337 -13129
934 -13129 -3611 4079 -811 6463 13203 15396 9535 -10201 -21115 -29541 -21760 -37531 -33355 -5716
920 -5716 -9089 -25934 -59711 -66423 -54192 -34268 -17896 -19042 -38830 -25017 -39533 -30998 -23291
907 -23291 -18784 20625 -11573 -45087 -35469 -8957 2665 25272 34683 51429 55912 25133 7847
894 7847 29165 11434 -2540 -16036 572 -7257 6821 20431 37200 13513 2054 -39525
882 -39525 -41284 -35995 -13446 20552 2636 -8155 -2142 -49394 -64179 -34155 27479 33719 10481
869 10481 -5758 -6889 10538 8378 19903 12200 -12728 2113 -14408 -15196 -14249 -5773 -24608 -14002
855 -14002 -2344 -3036 -44631 -45981 -52831 -26730 -20647 -7981 -1786 33224 78202 77259 37175 33355
841 33355 14065 41774 37814 7084 -21088 -67874 -65318 -2989 33550 13995 -16673 -29605
829 -29605 -28547 -13244 -112 -19825 -13018 -1332 47822 98142 97509 48296 -3670 -3715 15866
816 15866 24316 16582 5385 3302 -1931 16516 13481 3692 20683 45032 26639 -11504 -35450
803 -35450 -72342 -71907 -38223 -35090 -31382 -10939 24224 77749 45179 7736 20727 14232 3314
790 3314 -4904 5212 -26242 -31641 -6648 14292 17981 33526 77568 75612 49507 37707 9007
777 9007 -5007 2748 9682 -3099 6721 25327 16359 1046 -16443 -34729 -32703 -69443 -43210
764 -43210 12129 6874 9923 47150 51643 49924 31732 -8706 -18919 -31976 -38734 -22811 18040
751 18040 32756 28680 47157 45421 23224 27020 26520 11892 8711 41400 41598 59862 65387 23339
737 23339 -8644 4096 -903 21440 21833 -7287 -14261 -17676 -6147 42067 78139 73681 57616
724 57616 37544 32683 56749 64490 31595 24158 28479 20310 -16175 -12566 -12525 -26212 -15584 21351
710 21351 18592 -19488 -34197 -10392 -24163 -16844 7318 12718 10297 12361 31989 9676 -29893
697 -29893 -6603 24991 36770 60115 63383 35502 -3044 -15806 3297 28010 59850 59267 52692
684 52692 30528 8909 3579 9740 14185 25283 17464 22077 -8566 -31243 459 26218 31544
671 31544 70632 102637 96588 72606 46399 1227 -11975 -26080 -22533 20062 30126 22927 50267
658 50267 37229 1333 -26449 -28099 17584 45449 25348 10838 22279 7597 20275 -1563
646 -1563 -13482 4878 -17790 -9793 -30040 -29807 -61759 -70533 -30880 -12750 21254 26863 -6906
633 -6906 -15479 6338 52889 64111 32799 24235 27303 61471 52849 52369 59817 56423 53199 38962
619 38962 58720 63774 39050 24158 29994 31752 29673 11070 -4649 -12134 -31558 -62162 -64566
606 -64566 -65369 -38452 -29712 13993 18421 3155 -11265 -25413 -8673 -34 -7518 -10304 -16291 -12919
592 -12919 -2414 1256 4554 464 -26566 -56789 -45356 -36664 -20143 -5322 33774 33212 -18428
579 -18428 -26357 -6863 -24766 -4577 2151 -29059 -42457 -1225 20693 43174 35096 19805 -2772
566 -2772 4935 -12433 -29027 21 20375 48662 61903 45312 -3159 -27798 -29322 3455 5734
553 5734 26718 30198 32053 26060 20971 -9276 2332 9645 -28273 -34221 -6516 -19726 -21178 12135
539 12135 39806 42210 -27639 -69718 -39075 -11036 -17546 -11303 5933 6596 -26890 -38514 -8321
526 -8321 31968 20893 15220 -2104 -6833 -18731 -10465 1250 36403 41813 30099 26384 34440
513 34440 25174 4780 -1494 -16769 -42831 -47064 -51667 -12467 -841 789 -2472 -15504 -21888
500 -21888 -9788 7887 32217 32489 27545 11847 8270 16034 4518 -5271 -8684 24165 55995
487 55995 48918 32010 30081 14207 25825 74377 101801 64727 21286 17762 31454 40425 16625
474 16625 3799 -3698 3376 -4576 -7146 21804 38123 42450 33538 6732 16213 34458 41354 27048
460 27048 43652 64646 50715 10938 30088 38340 36269 29530 56001 56757 29861 53380 75858
447 75858 64631 29164 27757 30837 20718 178 -1998 -6361 1170 -4258 -8940 5569 958 2405
433 2405 17635 4895 31823 23882 18140 55021 46206 36573 13962 6656 -6315 -51107 -74713
420 -74713 -66683 -47781 -17539 -7425 -32914 -31682 -2444 16038 23237 50523 43754 31262 24348
407 24348 16825 -4715 14207 18972 2082 10847 5452 21410 31347 32848 34019 36119 11353 -5818
393 -5818 14244 16570 2086 -141 3088 -5192 -1949 42751 43713 36723 6388 169 14865 24299
379 24299 44040 70082 83013 62954 71727 70018 48062 27050 39063 53269 17836 7153
367 7153 31121 23395 40484 55077 59991 60017 37834 10069 2545 34556 22252 9940 13828 9324
353 9324 16239 -1081 -23676 -38007 -37706 -31859 -23740 -46288 -3840 15303 19486 11504 34307 43494
339 43494 46479 35203 28837 22764 19268 49418 22506 13081 10729 21024 14186 -6791 5080
326 5080 4304 19337 39452 8869 7421 40444 52311 25510 -13584 -29306 3683 -1937 -14935
313 -14935 -7473 24435 50662 30567 1217 6885 -288 -14443 -17218 -4947 7418 -8388 2480
300 2480 10651 4124 8835 10994 18558 28478 3610 -31686 -29462 -24859 -1877 3497 -6160 -24460
286 -24460 -48018 -39678 -6782 11490 -13257 -8491 4549 723 862 -14360 -587 10442 15627
273 15627 16694 -2669 -7300 -23666 -17528 -12010 -12492 -5098 -12021 -21699 -32369 -5258 12612 8660
259 8660 -16766 3199 60655 72260 74879 77812 73055 62050 40611 18507 28804 35074 45712
246 45712 21387 -3167 -22601 -8692 -16907 -17724 1485 27152 36287 27124 8473 5743 -6585
233 -6585 -15602 -18750 17995 44875 6174 -26750 -29489 -24160 32998 42995 12844 -17007 1960
220 1960 19649 16558 22964 24234 8661 7619 27138 25315 32417 45516 27390 21450 28619 28170
206 28170 25463 15158 12364 33882 65479 30262 1543 8460 25483 5623 7100 5865 46178
193 46178 50077 30937 49293 36575 14169 6699 1740 4859 33959 53116 28530 -4648 -10168
180 -10168 26446 22911 -5168 3641 10714 3340 -296 4003 24620 12838 -1433 8907 25868
167 25868 19381 3383 65 8224 8105 23494 52334 56253 35523 16628 1886 -7631 1686 5434
153 5434 -42613 -41410 -24868 -10075 9242 25487 21975 21691 28250 33432 16199 13826 6855 9025
139 9025 21614 20160 16239 24116 15172 -11450 -5658 6277 6538 20873 27823 20092 14132 -10771
125 -10771 -11000 2130 -5122 -9167 -5332 -2235 -14463 -7881 -8745 -22116 -19723 -12957 -5917 -27962
111 -27962 -21809 7866 5910 32294 71371 66866 44469 46703 21645 29179 52807 44220 33518
98 33518 39898 41276 14217 2144 -12491 -17262 -6202 14616 13083 13492 37514 48200 43096 30475
84 30475 36254 38835 18200 13316 21437 5203 -9683 -14610 -34251 -38452 -22617 -20657 -19109 15626
70 15626 40132 15082 -1042 2517 4663 21864 21994 11288 21204 46356 50892 58802 56623 49981
56 49981 38837 24833 23873 42494 52841 37707 4565 11690 25319 31472 6210 -21840 -12873
43 -12873 6022 21908 18732 19142 -6226 -17135 -2819 9021 30050 25971 7268 -8648 -23617
30 -23617 -7656 27446 43868 53288 27486 16111 46756 59561 24276 -5149 -9522 -6435 14414
17 14414 17405 11386 -4015 3991 24019 35749 42190 38941 24771 11350 18151 97 554 -11682
3 -11682 -1018 -9913 -21711
0 -21711
$$ Imaginary data points
##PAGE= N=2
##DATA TABLE= (X++(I..I)), XYDATA
32767 45098 39001 41811 54658 40527 42452 44282 41714 39650 59361 69053 62292 38163 39538
32754 39538 36207 26383 15116 27146 39600 50251 49410 33934 30953 28808 26685 26750 8484 25747
32740 25747 51042 67840 64738 84809 72088 56106 62489 49392 36453 10627 15237 26111
32728 26111 21247 35562 67933 58846 30588 15640 87 6274 18734 45556 53676 24085
32716 24085 18186 29281 28474 41377 49376 26291 27338 24253 6426 5391 10050 28592 26354
32703 26354 11726 -2241 1566 -1453 15067 43760 47092 57279 50483 67968 63723 71201 76523
32690 76523 75594 54469 37125 53527 76447 98042 91147 90596 79953 71394 86577 85052 82881
32677 82881 63590 44769 33151 47434 60289 67408 71057 77112 99556 104410 91456 87759 85883
32664 85883 60624 64873 71233 89962 103924 83088 98682 99958 91785 91007 85629 65730 67814
32651 67814 67181 64796 85396 111231 121382 113824 101264 112282 106500 116987 114311 102593 75843
32638 75843 90588 117923 120088 95725 91104 75124 60491 71204 93843 79139 84323 77254
32626 77254 89826 100531 87139 101063 143000 153385 163269 163758 181435 178250 158756 144831
32614 144831 129597 115927 107592 101905 109686 117665 118038 109570 112486 76244 79617 109922 118833
32601 118833 112996 120759 118576 119948 123710 125816 133392 133513 104045 68235 63117 106094 158268
32588 158268 146667 142940 156587 136007 121759 138370 174781 184276 139340 115715 91963 117564
32576 117564 154948 155803 117704 122452 125618 124776 131462 133979 145569 158741 186515 158147 125178
32563 125178 156286 150383 159936 161996 153782 153573 147997 144067 139386 152351 161169 162295 166509 204219
32549 204219 190330 157379 164168 174306 173707 168410 147837 175141 179067 168166 172904 188647 176432
32536 176432 194645 172389 158574 147114 151917 162288 147128 138121 101230 134257 150701 162700
32524 162700 197663 192529 175018 164741 162245 150062 161132 148406 142576 183052 211479 185375
32512 185375 168016 150124 184176 199028 196579 177258 188677 203958 204367 218965 220296 212201
32500 212201 209693 215092 199172 169243 165889 194220 206965 223360 187609 174172 188600 186204
32488 186204 178014 178530 171754 184434 197196 183788 183181 188605 179175 172252 165009 173755 195794 192606
32474 192606 208489 214250 208047 204053 192461 186258 181649 174758 164882 190780 226689 229071 222362
32461 222362 211144 157470 147888 140266 137959 157681 170834 184947 219704 212537 232748 239622
32449 239622 234411 213051 197374 190519 188465 188550 199635 202896 227060 242177 220391 185720 211115
32436 211115 219755 237100 210634 185165 177174 218458 252150 257815 247484 253147 239454 212783
32424 212783 208223 223882 221890 202216 192084 211317 207372 207372 216616 228378 209101 195155 205358
32411 205358 198474 211827 232679 254204 237137 241513 257577 243388 220894 227434 237223 211010
32399 211010 187337 218912 213698 175610 177373 181510 190215 197625 199432 205672 193364 195606 204789
32386 204789 234308 241029 228168 229746 247999 236812 216983 195179 172352 166818 205749 230264
32374 230264 244360 239292 234334 231373 231837 224057 212837 240293 252542 267044 283381 273232 276498
32361 276498 277919 280588 288422 274874 252042 254976 249188 253393 249819 256897 284763 259783 265709
32348 265709 275786 246366 216648 194789 174737 160748 196295 234850 236593 225617 226082 222657
32336 222657 214865 232481 250755 243085 233174 243494 228895 208850 215052 209096 185768 216100
32324 216100 220817 218952 245756 239348 231162 258495 256955 288156 262729 226369 204249 196013 204227
32311 204227 214400 241570 277463 294435 278997 281886 256376 236061 194081 200872 238595 266933
32299 266933 293555 305415 254360 231185 238946 268480 262730 233706 234358 248973 231313 278808
32287 278808 293448 253718 226064 187239 176332 194809 248626 242259 231417 249058 256642 268285
32275 268285 275025 252643 236590 234110 246667 257726 277793 247895 167112 176972 226947 218239
32263 218239 197115 212766 208204 224505 224275 212071 215548 251203 254503 252037 231520 228153 211900
32250 211900 208348 200349 182793 196678 223569 252379 220256 207786 200410 203293 218475 224632
32238 224632 246368 277085 273178 258261 263885 270362 253094 235903 221985 239275 255048 231441
32226 231441 223361 231815 234128 225373 249289 258016 258099 264470 239488 231237 231811 257436 291176 275479
32212 275479 256802 256329 256910 250172 261022 275016 296205 286757 271591 240561 220759 236143 238884
32199 238884 234932 225471 216371 214950 213355 205183 214349 228330 250422 274670 299183 300198 290195
32186 290195 259285 255154 253727 247504 241832 245277 227712 218476 227886 203125 214050 233142 247217
32173 247217 265418 284239 260370 219684 231739 246564 233074 224455 220280 216856 207779 196141
32161 196141 177195 193172 240044 239343 275242 297502 258635 229570 222760 239393 239553 210337
32149 210337 200754 233244 258909 265684 284886 284770 260193 258501 263365 254254 248604 214098 210295
32136 210295 236702 245284 226851 214364 240924 269570 242713 216386 195653 167334 197927 230773
32124 230773 255623 270876 257392 277132 271506 237482 264217 257137 247019 238742 240434 242182
32112 242182 230824 193586 193076 209876 222027 219411 233293 230915 244036 266920 238712 248584
32100 248584 271714 243065 237264 240589 253216 270260 299438 268112 248570 236426 217888 239691
32088 239691 250434 291502 315215 311128 311217 332203 343986 310649 298858 283362 273308 287551
32076 287551 265246 259313 274113 269401 264698 246130 229728 266631 289594 301172 312857 294557
32064 294557 284119 285720 282697 260756 225856 229453 265828 231133 243745 272374 270861 267319
32052 267319 280348 265856 262991 261037 254395 236014 192796 182583 198966 201780 217742 257662
32040 257662 256592 230484 219490 229789 259048 289723 276411 285362 307179 297050 233586 199443
32028 199443 231887 223799 234866 252324 223243 223948 222463 210832 238556 274629 242372 239870
32016 239870 257882 267228 277137 290790 273402 243807 204373 155331 196956 243368 275404 304972
32004 304972 303964 275748 258733 245579 247281 252089 238843 250548 276156 278457 246449 219843
31992 219843 225719 222230 220638 222240 229868 231015 220206 213711 227350 258567 245788 247821 278333
31979 278333 303748 302599 240334 204378 194968 220989 247198 266963 280858 259461 249992 267399
31967 267399 280049 265802 247543 247562 261252 270242 268621 272505 289720 281577 240281 244846 243081
31954 243081 230100 231896 246882 249777 269257 290216 282798 255195 229934 214284 196716 176179
31942 176179 187966 199829 201642 204246 236763 250656 251648 259003 228772 224184 223859 238589 263734
31929 263734 253955 239551 230503 214312 208767 250808 278411 270710 275511 267691 260770 238810 271414
31916 271414 279237 281531 279747 300398 286996 276728 261200 241375 261991 264738 239844 222871
31904 222871 241114 243078 260289 268237 251136 246778 263145 251975 225837 233422 228192 218332 235158
31891 235158 240864 241790 245963 237311 229142 221836 223921 251812 265833 251084 215018 204000 218738
31878 218738 191269 193184 227752 231245 226472 227695 241446 252182 235398 221241 227456 238855
31866 238855 234940 264382 284027 288048 296798 308924 306754 317312 298432 251250 251082 260629 235301
31853 235301 237828 246996 232243 246660 225975 187966 210650 226675 217133 223906 253103 272701
31841 272701 299427 310583 272373 249457 264219 263473 292297 313686 286890 246926 253147 274631
31829 274631 288221 278206 276088 303062 321632 301571 260741 239894 242967 242354 237587 256400
31817 256400 298200 302947 277428 267587 280474 284611 279855 270500 256071 280025 313893 299032
31805 299032 295610 284167 250187 236362 214041 220956 266519 288463 270747 268738 281873 265267
31793 265267 269016 294511 303716 268577 241212 255692 255101 250030 216648 225431 276245 295513 293349
31780 293349 251042 224489 224796 212031 202430 227247 274671 308419 298397 281549 288014 298237
31768 298237 306913 291289 284461 294936 281163 300140 324082 298074 262850 244792 271086 279163
31756 279163 245927 227466 229791 262686 251641 252316 294325 296817 299180 256711 235179 253540
31744 253540 270610 255348 261144 269552 295903 265138 251284 257115 275299 281710 287167 256200
31732 256200 256571 244043 232033 222348 237590 238030 239506 236397 228794 252670 239899 244896 243226
31719 243226 242634 275325 290808 278313 273224 235932 244765 249136 265134 276511 268916 250157 241220
31706 241220 249328 273586 287560 304470 310622 282392 277157 296541 317652 310471 319602 309358
31694 309358 254661 230506 234586 278528 246401 217806 230069 222207 203020 182589 212950 233002
31682 233002 230607 207880 204144 216635 240639 254522 238791 251499 241818 216637 218017 241610
31670 241610 255582 240071 251753 261982 286357 266106 238576 231790 203341 207939 221359 222626
31658 222626 252219 272561 257762 269014 243904 243178 257065 258713 274532 274642 253370 233565
31646 233565 224315 212215 207757 216820 220272 206632 198611 206708 228892 285592 302754 282252 293307
31633 293307 280141 269235 266568 249949 247926 263660 255707 233627 219941 234107 249736 244771
31621 244771 232611 248297 300094 292404 267441 285964 334563 348762 287057 264386 282662 283546
31609 283546 293763 312790 308914 294780 317448 312350 299052 280816 305799 306219 273337 272414 267935
31596 267935 271579 311610 326411 335992 358979 338680 342246 310294 268006 255139 260835 265256
31584 265256 263859 264976 290367 261547 242831 246623 282781 313890 326404 305274 271443 254075
31572 254075 287328 273402 238962 219047 235490 278630 276311 290286 281520 292875 298581 298498 268762
31559 268762 260859 291645 333138 336140 295702 280333 264001 273688 291542 315837 308154 271000
31547 271000 276830 291050 263202 251761 276653 290146 296886 313589 297318 262651 281159 281122
31535 281122 307156 335963 298016 264700 250128 253188 253242 216947 253837 280898 242762 234082
31523 234082 262360 261260 280672 309119 319034 320683 312263 262022 214648 202853 200972 200205 250117
31510 250117 270361 284100 314441 337622 333499 299629 235536 211409 199205 166442 147798 160316
31498 160316 194416 232310 229432 231446 248505 246834 245949 284094 280204 279880 282881 277257 282130 278347
31484 278347 279651 261083 276738 322375 313166 315395 326117 315893 305037 305400 330109 321040 288861
31471 288861 238613 220275 223845 241261 266686 256639 255906 276745 274631 269288 265928 253499 246503
31458 246503 241411 227722 249043 256387 240598 237024 217290 227668 274482 293887 263056 270181
31446 270181 318002 341519 339417 311747 287176 282299 273261 245111 261112 277936 253344 248111
31434 248111 266405 265662 261919 284008 255654 253494 276765 269844 249217 249186 238667 250430 253177
31421 253177 247955 278962 266094 271607 309666 315681 328856 303031 309946 293813 269377 272014
31409 272014 284012 306004 281833 277742 294367 293838 266353 261039 251419 234507 262747 280150
31397 280150 268545 291043 327057 311125 284111 265871 249257 247771 259328 273181 301915 264827
31385 264827 246268 256689 270718 242085 246869 257875 268633 253736 243200 255111 287736 286884
31373 286884 258473 236000 210626 226671 237521 245718 261059 279045 276538 255646 234270 228722
31361 228722 237161 253370 260720 256986 251989 264384 283159 304783 334110 355516 361705 330849
31349 330849 320758 299684 286577 261345 262749 270654 282931 287503 281576 307779 293389 279098
31337 279098 287076 288383 289522 286143 313726 324041 287609 230922 224869 207163 173332 166562 188056
31324 188056 198417 227493 239790 227316 238579 245466 266749 234627 231023 249824 246795 246561
31312 246561 244984 230708 258812 281255 285279 272193 255913 252393 256661 254977 257530 275248 260494
31299 260494 249849 243720 240079 220807 224126 239182 245430 223624 229512 257800 248681 217424 228914
31286 228914 257205 261801 245794 215862 249699 297441 314825 311473 292907 284337 297632 255347
31274 255347 220601 244329 290420 313762 292757 248442 248874 283668 305999 320581 333682 331350
31262 331350 297514 271914 250531 224828 222006 249009 225496 206719 202553 221060 244758 242712
31250 242712 254748 271625 246597 190751 191857 199249 225560 232771 203052 202134 207425 233437 212471
31237 212471 238626 267509 258900 239745 247116 272145 252119 246198 266878 271632 265684 291590
31225 291590 293944 281606 267609 275996 274207 249891 228480 264343 291582 271268 247524 250068
31213 250068 265280 269867 273401 272780 239972 213962 235072 247066 232267 253742 266740 235842
31201 235842 257262 281919 286509 284383 258717 242251 255271 271460 223598 183738 186259 228359
31189 228359 256788 260562 251946 252135 297640 331445 314706 305877 285550 236757 216660 235013
31177 235013 206438 196617 222785 244643 258366 257838 304626 285551 270693 288167 269341 270313
31165 270313 274188 286961 306511 308676 300884 275018 268483 266166 269588 238269 203053 223968 266545
31152 266545 267604 298461 286283 292300 302826 281094 276481 306769 330782 322992 281275 245038
$$ [...]
##END NTUPLES=NMR SPECTRUM
##END=
