##TITLE=Analysis number 313873
Compound Code cc 44402
Book Reference 382/122/1
Project Code adrs
Chemist Name simons
##JCAMPDX= 6.0         $$ Bruker NMR JCAMP-DX V2.0
##DATA TYPE= NMR SPECTRUM
##DATA CLASS= NTUPLES
##ORIGIN= Bruker BioSpin GmbH
##OWNER= NMR
$$ XWIN-NMR		Version 3.5
$$ Mon Sep 26 09:51:15 2005 GMT Daylight Time (UT+1h)  MAYBRIDGE\NMR@NMR_250MHZ
##.OBSERVE FREQUENCY= 250.131544655141
##.OBSERVE NUCLEUS= ^1H
##.ACQUISITION MODE= SIMULTANEOUS (DQD)
##.ACQUISITION SCHEME= undefined
##.AVERAGES= 16
##.DIGITISER RES= 18
##SPECTROMETER/DATA SYSTEM= dpx250
##.PULSE SEQUENCE= zg30
##.SOLVENT NAME= CDCl3
##.SHIFT REFERENCE= (INTERNAL, CDCl3, 0, 16.4468)
##AUDIT TRAIL= $$ (NUMBER, WHEN, WHO, WHERE, WHAT)
$$ ##TITLE= Audit trail, XWIN-NMR		Version 3.5
$$ ##JCAMPDX= 5.01
$$ ##ORIGIN= Bruker BioSpin GmbH
$$ ##OWNER= NMR
$$ C:\u/data/dgb/nmr/ADRS/9940/pdata/1/auditp.txt
$$ ##AUDIT TRAIL=  $$ (NUMBER, WHEN, WHO, WHERE, WHAT)
(   1,<2005-09-26 09:50:33.38 +100>,<MAYBRIDGE\NMR>,<NMR_250MHZ>,
      <created by zg, POWCHK disabled, PULCHK disabled
       configuration hash MD5:
       62 19 C7 07 E1 42 D1 B7 37 6C 3D D0 77 39 F9 E6
       data hash MD5: 64K
       6A B3 C2 5B 76 8B 27 00 C4 73 25 FA 63 4B E0 39>)
(   2,<2005-09-26 09:50:51.55 +100>,<MAYBRIDGE\NMR>,<NMR_250MHZ>,
      <Start of raw data processing
       ef LB = 0.3 FT_mod = 6 PKNL = 1 SI = 32K 
       data hash MD5: 32K
       3C B7 A2 F9 A7 1E E0 E3 2A EA D0 38 A8 4C DF 8F>)
(   3,<2005-09-26 09:50:56.44 +100>,<MAYBRIDGE\NMR>,<NMR_250MHZ>,
      <apk 
       data hash MD5: 32K
       97 4C C6 59 15 A6 25 5D 5E EA D3 8B E2 7E C0 39>)
(   4,<2005-09-26 09:50:57.67 +100>,<MAYBRIDGE\NMR>,<NMR_250MHZ>,
      <abs ABSG = 5 
       data hash MD5: 32K
       4D 66 97 89 2F E1 B6 92 19 3C 36 06 84 40 2C 11>)
$$ ##END=
$$ 
$$ hash MD5
$$ AA EA 2B 17 4B CC F9 92 1E E7 12 61 8F 84 B0 F0
##$RELAX= 
##$RELAX= 
##$RELAX= 
##$RELAX= 
##$RELAX= 
##$RELAX= 
##$RELAX= 
$$ Bruker specific parameters
$$ --------------------------
##$DU= <C:\u>
##$EXPNO= 9940
##$NAME= <ADRS>
##$PROCNO= 1
##$TYPE= <nmr>
##$USER= <dgb>
##$AMP= (0..31)
100 100 100 100 100 100 100 100 100 100 100 100 100 100 100 100 100 100 
100 100 100 100 100 100 100 100 100 100 100 100 100 100 
##$AQSEQ= 0
##$AQ_mod= 3
##$AUNM= <au_zg>
##$AUTOPOS= <6 >
##$BF1= 250.13
##$BF2= 250.13
##$BF3= 250.13
##$BF4= 250.13
##$BF5= 500.13
##$BF6= 500.13
##$BF7= 500.13
##$BF8= 500.13
##$BYTORDA= 1
##$CFDGTYP= 0
##$CFRGTYP= 5
##$CHEMSTR= <none>
##$CNST= (0..31)
1 1 145 1 1 1 1 1 1 1 1 1 1 1 1 1 1 1 1 1 1 1 1 1 1 1 1 1 1 1 1 1 
##$CPDPRG= <>
##$CPDPRG1= <>
##$CPDPRG2= <>
##$CPDPRG3= <>
##$CPDPRG4= <mlev>
##$CPDPRG5= <mlev>
##$CPDPRG6= <mlev>
##$CPDPRG7= <mlev>
##$CPDPRG8= <mlev>
##$CPDPRGB= <>
##$CPDPRGT= <>
##$D= (0..31)
0 1 0 0 0 0 0 0 0 0.06 0 0 0 0 0 0 0.0002 0 0 0 0 0 0 0 0 0 0 0 0 0 0 
0 
##$DATE= 1127724631
##$DBL= (0..7)
120 120 120 120 120 120 120 120 
##$DBP= (0..7)
150 150 150 150 150 150 150 150 
##$DBP07= 0
##$DBPNAM0= <>
##$DBPNAM1= <>
$$ [...]
##$SUBNAM7= <"">
##$SUBNAM8= <"">
##$SUBNAM9= <"">
##$SW= 20.6930455092707
##$SWIBOX= (0..15)
0 0 3 0 0 0 0 0 0 0 0 0 0 0 0 0 
##$SW_h= 5175.983436853
##$TD= 65536
##$TD0= 1
##$TE= 294.16
##$TE2= 300
##$TE3= 300
##$TEG= 300
##$TL= (0..7)
0 120 120 120 120 120 120 120 
##$TP= (0..7)
150 150 150 150 150 150 150 150 
##$TP07= 0
##$TPNAME0= <>
##$TPNAME1= <>
##$TPNAME2= <>
##$TPNAME3= <>
##$TPNAME4= <>
##$TPNAME5= <>
##$TPNAME6= <>
##$TPNAME7= <>
##$TPOAL= (0..7)
0.5 0.5 0.5 0.5 0.5 0.5 0.5 0.5 
##$TPOFFS= (0..7)
0 0 0 0 0 0 0 0 
##$TUNHIN= 0
##$TUNHOUT= 0
##$TUNXOUT= 0
##$USERA1= <user>
##$USERA2= <user>
##$USERA3= <user>
##$USERA4= <user>
##$USERA5= <user>
##$V9= 5
##$VALIST= <valist>
##$VCLIST= <CCCCCCCCCCCCCCC>
##$VD= 0
##$VDLIST= <DDDDDDDDDDDDDDD>
##$VPLIST= <PPPPPPPPPPPPPPP>
##$VTLIST= <TTTTTTTTTTTTTTT>
##$WBST= 1024
##$WBSW= 4
##$XGAIN= (0..3)
0 0 0 0 
##$XL= 0
##$YL= 0
##$YMAX_a= 341069
##$YMIN_a= -305210
##$ZGOPTNS= <>
##$ZL1= 120
##$ZL2= 120
##$ZL3= 120
##$ZL4= 120
##$ABSF1= 16.4468
##$ABSF2= -4.246372
##$ABSG= 5
##$ABSL= 3
##$ALPHA= 0
##$AQORDER= 0
##$ASSFAC= 0
##$ASSFACI= 0
##$ASSFACX= 0
##$ASSWID= 0
##$AUNMP= <proc_1d>
##$AZFE= 0.1
##$AZFW= 0.1
##$BCFW= 0
##$BC_mod= 0
##$BYTORDP= 0
##$COROFFS= 0
##$CY= 12.5
##$DATMOD= 1
##$DC= 0
##$DFILT= <>
##$DTYPP= 0
##$F1P= 14.0000005364418
##$F2P= -0.99999901652339
##$FCOR= 0.5
##$FTSIZE= 32768
##$FT_mod= 6
##$GAMMA= 0
##$GB= 0
##$INTBC= 1
##$INTSCL= 1
##$ISEN= 128
##$LB= 0.3
##$LEV0= 0
##$LPBIN= 0
##$MAXI= 10000
##$MC2= 0
##$MEAN= 0
##$ME_mod= 0
##$MI= 0
##$NCOEF= 0
##$NC_proc= -2
##$NLEV= 6
##$NOISF1= 0
##$NOISF2= 0
##$NSP= 0
##$NTH_PI= 0
##$NZP= 0
##$OFFSET= 16.4468
##$PC= 1
##$PHC0= -74.70519
##$PHC1= 4.223762
##$PH_mod= 1
##$PKNL= yes
##$PPARMOD= 0
##$PSCAL= 4
##$PSIGN= 0
##$REVERSE= no
##$SF= 250.130018807898
##$SI= 32768
##$SIGF1= 0
##$SIGF2= 0
##$SINO= 400
##$SIOLD= 32768
##$SREGLST= <1H.CDCl3>
##$SSB= 0
##$STSI= 32768
##$STSR= 0
##$SW_p= 5175.98343685301
##$SYMM= 0
##$S_DEV= 0
##$TDeff= 65536
##$TDoff= 0
##$TI= <Analysis number 999999
Compound Code 99
Book Reference 9
Project Code 9>
##$TILT= no
##$TM1= 0
##$TM2= 0
##$TOPLEV= 0
##$USERP1= <user>
##$USERP2= <user>
##$USERP3= <user>
##$USERP4= <user>
##$USERP5= <user>
##$WDW= 1
##$XDIM= 32768
##$YMAX_p= 319756353
##$YMIN_p= -106634
$$ End of Bruker specific parameters
$$ ---------------------------------
##NTUPLES= NMR SPECTRUM
##VAR_NAME=  FREQUENCY,     SPECTRUM/REAL,   SPECTRUM/IMAG
##SYMBOL=    X,             R,               I
##VAR_TYPE=  INDEPENDENT,   DEPENDENT,       DEPENDENT
##VAR_FORM=  AFFN,          ASDF,            ASDF
##VAR_DIM=   32768,         32768,           32768
##UNITS=     HZ,            ARBITRARY UNITS, ARBITRARY UNITS
##FACTOR=    0.157963299565203, 1,           1
##FIRST=     4113.83845134329, 0,            0
##LAST=      -1062.14498550972, 0,           0
##MIN=       -1062.14498550972, -106634,     0
##MAX=       4113.83845134329, 319756353,    0
$$ Real data points
##PAGE= N=1
##DATA TABLE= (X++(R..R)), XYDATA
$$ [...]
19756F065343L35445J041445J957775K585902J885812J18087j702843k208524
19748A0078442j503596n48110M22714J325172J597660P61477o33483j679385j565034
19739H255857p50534L03757J448665K043319J152028o40381k289114k494495j797031
19730E232071j106010o77778m04756k42850j28634l1561O7204J43703K43955L42660
19720C438004M71139O85620J127109J836644K904822L662458K630114N05474j346189
19711A5915195r23525R53205J926552R26463r75326k148585j251158N59405J582002
19702A6564228N63535j587964l430297l351117k382967j571490j019646o40715
19694C143567l85630j31459J22158M27366N85671L30443k03672o99065p84218
$$ y = [6065343, 6400788, 7442233, 9400008, 11985910, 13871722, 13989809, 12286966, 10078442, 8574846, 8026736, 8449450, 9774622, 11372282, 12133759, 11500276, 9820891, 8255857, 7505323, 7809080, 9257745, 11301064, 12453092, 11812711, 9523597, 7029102, 5232071, 4126061, 3448283, 3043527, 2800677, 2672043, 2640482, 2707686, 2851389, 3095344, 3438004, 3909143, 4594763, 5721872, 7558516, 10463338, 14125796, 16755910, 17261384, 15915195, 14991670, 15944875, 17871427, 18797890, 17822564, 15673979, 14422821, 14982226, 16564228, 17127763, 15539799, 12109502, 8758385, 6375418, 4803928, 3784282, 3143567, 2757937, 2626478, 2748636, 3176002, 3761673, 4092116, 3888444, 3189379, 2405161]
19685B405161n70343l64765k35216j46644j35872j25276j01358r2732l8455n2636
19675E41864m9772n8472m6818l7892k5422j1137o968L809k564Q648R059M9341
19663C73676R7104J49121J29399M4735o4175j34297j40074j09538p2857n1416
19653B21678k7342j9510j4160j2639k798L665j7139M826o573n344k995j648r868
19640A10153j3574l795Q892m625j1480k05O44L80j1104K425R47J6580P564M438
19626A07240J527q175j7273J795l207j6218j1863q100M706P577L876l293J2676
19613G1268J2189j462k247M806k274O737J7479K0434j43o874j853N135Q794O095
19599A38084N859O36K3742J7628k0747j8957k0463r520q811j0715r442p717J576
$$ y = [2405161, 1834818, 1470053, 1234837, 1088193, 952321, 827045, 725687, 632955, 594500, 541864, 492092, 433620, 386802, 348910, 323488, 312351, 305383, 309192, 306628, 315276, 324335, 373676, 470780, 619901, 749300, 794035, 729860, 595563, 455489, 345951, 273094, 221678, 194336, 174826, 160666, 148027, 145229, 148894, 131755, 136581, 130008, 124664, 121669, 120021, 110153, 96579, 92784, 101676, 97051, 85571, 85366, 86010, 86390, 75286, 77711, 78658, 95238, 102802, 107240, 108767, 100592, 83319, 85114, 81907, 65689, 53826, 45726, 50432, 58009, 61885, 58592, 71268, 83457, 81995, 79748, 84554, 82280, 89017, 106496, 126930, 126787, 119913, 118060, 123195, 131989, 138084, 143943, 144579, 168321, 185949, 165202, 146245, 125782, 116262, 107451, 96736, 87294, 79577, 81153]
19586H1153Q489j872j2806J3029K1643P054j185j3464j9108j7367j7291k3248
19574B5027m967J2573N855l659N452p769N016Q79p90N020J1491q889O989n687
19560D6541k756K4929J5040J9910J9285J8152N100k5801j2484k3256j3265l670
19548F7725J8095J5843J3768J4236J9951k0650k4536j5607j4734J6596J6054j1085
19536I5656j5180n639r795n678k3719o365j60k374L440j038q381P662J3497m075
19522C7851K746N29l217J8967M032r706Q848J3474J0205J8804J5246L270q493
19509A12556J888P083J1996M1032M5382O8019O0464L5029J7364J8485J441L3627
19497D54366N7552M5065M2578K8666l8314q4550q1746p6322l6345j2751j0529
$$ y = [81153, 89642, 87770, 74964, 87993, 109636, 116690, 115505, 102041, 82933, 65566, 48275, 25027, 20060, 32633, 38488, 34829, 40281, 32512, 37528, 38407, 37617, 42637, 54128, 45239, 52228, 46541, 43785, 68714, 83754, 103664, 122949, 141101, 146201, 120400, 107916, 84660, 71395, 67725, 85820, 101663, 115431, 129667, 149618, 128968, 104432, 88825, 74091, 90687, 106741, 95656, 80476, 74837, 65042, 59364, 35645, 29280, 29120, 26746, 30186, 29148, 20767, 28429, 41926, 37851, 40597, 41126, 37909, 56876, 60908, 51202, 60050, 73524, 83729, 102533, 117779, 121049, 112556, 114444, 121527, 133523, 174555, 219937, 287956, 348420, 383449, 400813, 419298, 420739, 454366, 511918, 556983, 599561, 628227, 589913, 505363, 423617, 347295, 310950, 298199, 287670]
19486B87670K3211L6535k702l7143n4464n3568l6279k8738l3620r065r944j5996
19474F5897l191o629l239J627J4131O155M630j1508k771m301M011J5977P207O657
19460I4653P920K970Q14j2042K6565L7293L2721O7424P3689P8611P4702O0475
19448E45795J7796J184K447m212k6693l039O897N358k4521l3420l3478j4216L4052
19435D73950j2043n1525p2382p1505o5474m6948k8959k1593j3529j7506o636p751
19423E8099k381M074j3622j0950L130N115M459j1727n611o286M315M94j3086q373
19409G650M749J8329P160q535k933m571k3320K626K0284Q632K929j153N495P42
19395C8084K835J5928L116M389O20K800q143o284q707l655K252L961p520j1900
$$ y = [287670, 310881, 347416, 344714, 307571, 253107, 199539, 163260, 134522, 100902, 91837, 81893, 65897, 62706, 56077, 52838, 54465, 68596, 74751, 79381, 67873, 65102, 60801, 64812, 80789, 87996, 94653, 102573, 105543, 106357, 94315, 120880, 158173, 190894, 258318, 332007, 410618, 485320, 545795, 563591, 564775, 567222, 563010, 536317, 533278, 540175, 545533, 521012, 487592, 454114, 439898, 473950, 461907, 410382, 338000, 266495, 201021, 154073, 125114, 103521, 89992, 72486, 65850, 58099, 55718, 59792, 46170, 35220, 38350, 43465, 47924, 36197, 30586, 24300, 28615, 29109, 16023, 7650, 12399, 30728, 37888, 29353, 26420, 21849, -1471, 1155, 21439, 30071, 33000, 31847, 37342, 38084, 40919, 56847, 59963, 64352, 64972, 67772, 59629, 53345, 44638, 40983, 43235, 47196, 39676, 27776]
19381B7776L603R644m219r244r322m43M237Q692k297j5874j1204p149M189J3053
19367A1442p875m210R900K192J5429M021N436K252m402q532p752P519k882k785
19353A9753P444O083k2982j5462J6840J7964O554j4924J993J1558J5798Q207o396
19340E2430k4471o14m960p731K94Q851J7401N493k67R301j4620j1628J1984O527
19326D7990Q964O611O167j4600j8445j0072l245l583K068j1737J553j3429J42
19313a616N434J2895K0052J980j0530l151J7064K078m917j4203K704Q855L613
19300D0258J1700j323o101J91l386j326P299k282m783J656K597J540l789K035
19286D4286L671N719l092m752K196J5042M875k231M531n996m879O706L732O822
$$ y = [27776, 31379, 41023, 36804, 27560, 18238, 17795, 22032, 30724, 28427, 12553, 1349, -5800, -1611, 11442, 3567, -643, 9257, 11449, 26878, 30899, 36335, 38587, 34185, 25653, 17901, 25420, 22538, 19753, 27197, 33280, 10298, -5164, 11676, 29640, 36194, 21270, 23263, 34821, 50619, 58826, 52430, 27959, 27345, 22385, 14654, 14948, 23799, 41200, 46693, 46426, 55727, 41107, 29479, 41463, 47990, 56954, 63565, 69732, 55132, 36687, 26615, 23370, 19787, 21855, 10118, 11671, -1758, -1616, 3818, 16713, 36765, 38745, 28215, 25064, 42128, 44206, 39289, 25086, 27790, 36645, 40258, 51958, 50635, 44534, 44725, 41339, 40013, 47312, 45030, 40247, 41903, 44500, 46040, 42251, 44286, 47957, 53676, 50584, 45832, 48028, 63070, 67945, 65714, 70245, 64249, 59370, 66076, 69808, 76630]
19272G6630p133j1260r121K176N016M860O286m90l914M529O97j245K290o51R4
19257F8764l2Q85j2227J5130n493j0128l363M138P852P102O641M558q912K467
19243G7382R573O852q667j949K0045J6282J8692l258j1465M521J4970J8096O389
19230A67463j0397k0059k7387j0944R874J6631L451J5835K2974J303Q818m583
19218A72979k2877j4259r273k331q821k3991p787m896N946J1l369l334l132J6523
19204I1389N780q161j8454J2518L678o926P507J1945O942q12n126k0255r747k617
19190F7661N528L535R395n828J922K981n353K2811L2009K7086L0919N508k560
19177A95614l716j3729j3780p311J1705N577j0891J63n570k0121l7888q932L821
$$ y = [76630, 69497, 58237, 49116, 51292, 56308, 61168, 67454, 66964, 63050, 67579, 68276, 67031, 69321, 68670, 68764, 68732, 69617, 57390, 72520, 67027, 56899, 53536, 57674, 65526, 72628, 79269, 83827, 74915, 77382, 86955, 93807, 85140, 83191, 103236, 119518, 138210, 134952, 123487, 128008, 142978, 161074, 167463, 157066, 137007, 109620, 98676, 108550, 125181, 128632, 144467, 167441, 168744, 177562, 172979, 150102, 135843, 126570, 124239, 115418, 91427, 83640, 78744, 84690, 84701, 81332, 77998, 74866, 91389, 97169, 89008, 70554, 83072, 86750, 79824, 87331, 99276, 106218, 105406, 100280, 80025, 70278, 67661, 73189, 76724, 86119, 80291, 82213, 85194, 79841, 102652, 134661, 161747, 192666, 198174, 195614, 191898, 178169, 164389, 157078, 168783, 174360, 163469, 163632, 158062, 137941, 100053, 91121, 94942]
19164I4942K333q727p46J0034J1500q29J625K388l813N104P413j470l697m126
19150A11931J1627J0540N273P480j118J937L947n063Q525J8570R975K237Q797
19137A94658J6355J3833J2169J84L1655Q0264J15050J17633Q7233J4299o4475
19126F18858r3265q2201p4706m1142n563N534O135M638J8896J6212K8845L2601
19114D34842M7116M6516N5585O2164N3393O5272P6610Q9905J29243J59380K12266
19103A432292L04228M71818O33296N95057K84278j50658l68097k88191j06971
19094B807052Q2872K52216M46280P36805J251180J989233K881896K936190J602456
19085A4986180k85758j311276n21675J000132J770840R23540o57306j664317q14016
$$ y = [94942, 97275, 88548, 87802, 97836, 109336, 108507, 110132, 112520, 108707, 113811, 121224, 119754, 116057, 111931, 123558, 134098, 139371, 146851, 145733, 147670, 151617, 146554, 155079, 173649, 183624, 185861, 194658, 211013, 224846, 237015, 237199, 268854, 349118, 464168, 581801, 669034, 683333, 618858, 525593, 443392, 368686, 327544, 321981, 327515, 333650, 338288, 357184, 373396, 402241, 434842, 481958, 528474, 584059, 646223, 699616, 764888, 841498, 931403, 1060646, 1220026, 1432292, 1736520, 2208338, 2841634, 3436691, 3720969, 3570311, 3202214, 2914023, 2807052, 2889924, 3142140, 3588420, 4325225, 5576405, 7565638, 10447534, 13383724, 14986180, 14700422, 13389146, 12867471, 13867603, 15638443, 16561983, 15904677, 14240360, 13426344]
19076A3426344P64648J117276k16592k166867l178248k647584j792509j126332
19068D180136p03573m26070k34057j43803q9833l5363M5349J16568K24003L85688
19058C319045O43334J066225J732870K393295K216781R02822p62256j630898j174038
19049H707180j67220Q86125J647919J328265P8071j286347j661892j029093q1791
19040H421217R78541K107998K484262J304443p43199k413359k489227j701024
19032G949652r08633k82783K96607J015853J952524L058613L245788J720531n64484
19023A7483668j954109j167962N77631J600274O63577j429331l276637l359410
19015I137701k464362j642322j070159p22684m93988k92221j69296r4906n8270
$$ y = [13426344, 14190992, 15308268, 15091676, 12924809, 9746561, 7098977, 5306468, 4180136, 3476563, 3050493, 2816436, 2672633, 2582800, 2547437, 2592786, 2709354, 2933357, 3319045, 3962379, 5028604, 6761474, 9154769, 11371550, 12274372, 11512116, 9881218, 8707180, 8539960, 9426085, 11074004, 12402269, 12480340, 11193993, 9532101, 8503008, 8421217, 9399758, 11507756, 13992018, 15296461, 14553262, 12139903, 9650676, 7949652, 7041019, 6758236, 7054843, 8070696, 10023220, 13081833, 16327621, 18048152, 17483668, 15529559, 14361597, 14939228, 16539502, 17203079, 15773748, 12497111, 9137701, 6673339, 5031017, 3960858, 3238174, 2744186, 2451965, 2282669, 2187763, 2129493]
19006B129493r731P3002J72319L08028N33590P24864N11930o9238p00688q94490
18996B779079o97229m73336l16450k25590j66359j21611q2029o0607j3571L5390
18986F57687O1505J13072J55167P8302l9135j59465j50972j32874r3112n5298
18976D34877n1677j5455n465r741k2894l66M360P503K7657L1672M0691P0979N6858
18963E68999L758l0572l8311j5226k477K4490R8290J50043J28751M3771m7930
18952H83586j12593r1185m4600j2055n153k3470o5065q5670o3424j8798k8961
18941C32612m5805k2484r373l603K1522K2957j458j1980j6295k3862j7099k1734
18929B03398n426J1803K8045j0492j8219q007j4402m713o310p138j0734k108l768
$$ y = [2129493, 2119762, 2192764, 2365083, 2673111, 3206701, 3931565, 4443495, 4374257, 3673569, 2779079, 2081850, 1608514, 1292064, 1066474, 900115, 778504, 696475, 635868, 622297, 657687, 719192, 832264, 987431, 1065733, 1026598, 867133, 716161, 583287, 490175, 434877, 383200, 367745, 362280, 352539, 329645, 329279, 333639, 341142, 368799, 400471, 441162, 512141, 568999, 572757, 542185, 503874, 488648, 486171, 510661, 608951, 758994, 887745, 931516, 883586, 770993, 679808, 635208, 623153, 618000, 594530, 529465, 443795, 380371, 361573, 332612, 286807, 264323, 254950, 251347, 272869, 295826, 294368, 282388, 266093, 242231, 225132, 203398, 197972, 209775, 237820, 227328, 209109, 201102, 186700, 181987, 175677, 168539, 157805, 155697, 151929]
18916A51929O472j0992q281k1628m978N38K314M874R047l453j080J1994N907l459
18902A39204J5049L4856L067n288n456j4854r881N849m56r314j4688o659N459
18889A36888J592j3190n640q504n714k531r50J0924P269K27N853j712j0937m786
18875A08789J276o307L920K981k897j7671j4730q482r557r429R663J239o504m825
18861D7466J594J2214J4852j9328j5757q388m512p063P000R390L020P236N04J6631
18847F4859P810R215o18j3209k668Q901J8829M887j0243l435n578r064J391J787
18833G2864K056j4134j3975p510O011j365j2182Nn463q243k389J4551J2182K5933
18819F8341N792j7526k2236p666P221K1371M814r304m527J2748p04p227k195p800
$$ y = [151929, 158401, 147409, 139128, 117500, 112522, 113060, 115374, 120248, 129295, 125842, 124762, 136756, 142663, 139204, 154253, 189109, 192176, 186888, 181432, 166578, 156697, 162546, 162090, 152776, 138088, 131429, 136888, 138480, 125290, 119650, 111146, 105432, 102901, 101951, 112875, 120144, 120371, 126224, 124512, 113575, 108789, 110065, 103758, 107678, 110659, 107762, 90091, 75361, 66879, 57322, 47893, 57556, 58795, 52291, 47466, 49060, 61274, 76126, 56798, 41041, 32653, 28141, 21078, 28078, 37468, 40488, 47724, 48228, 64859, 72669, 81884, 81266, 68057, 65389, 74290, 93119, 98006, 87763, 84328, 78750, 69686, 71077, 72864, 74920, 60786, 46811, 39301, 45312, 43947, 31765, 31770, 26307, 18064, 15675, 30226, 42408, 68341, 74133, 56607, 34371, 26705, 33926, 55297, 60111, 50807, 46280, 59028, 58324, 51097, 48902, 41102]
18805D1102N281j1718j2262q270L967P625J568Q639J0933l459j8298n284J2119
18792C1943j2284j6606N439R521J0854K656L855J281L423K867j6109k358J6333
18779D0815K552n559p41J487n309N173J0244P546R364Q387J3108J1893L0443M5683
18765A75086M2182j2447m6530m4654k6298j1529o699k3825n074K35k833j0820
18753B6794r465N960L232M190K540k244N092n287j2160L822J928j4957J0309N577
18739B5331J184n072o399J751Q279o738J8506J5847o245o00J8277M971q813O776
18725F7055O763r819p793N666Q454n448j2635k4297p244J8085m111K0478J3675
18712F8829k732j770j7021N531J3035p648J008K397P614K04q968j4554r02J3490
$$ y = [41102, 46383, 34665, 22403, 14133, 18100, 25725, 27293, 35932, 46865, 43406, 25108, 19824, 31943, 19659, 3053, 8492, 18013, 28867, 31523, 35378, 36659, 40082, 42949, 26840, 24482, 40815, 43367, 37808, 37067, 38554, 33245, 38418, 48662, 56208, 65572, 73959, 87067, 98960, 129403, 175086, 217268, 204821, 158291, 113637, 87339, 75810, 69111, 45286, 40212, 40447, 37614, 26794, 17329, 23289, 26521, 30711, 33251, 31007, 36099, 30812, 18652, 22474, 24402, 9445, 19754, 25331, 26515, 21443, 15044, 16795, 25074, 18336, 36842, 52689, 46444, 45844, 64121, 69092, 60279, 67055, 73818, 63999, 56206, 61872, 70326, 64878, 52243, 27946, 20702, 38787, 34676, 55154, 68829, 66097, 64327, 47306, 52837, 65872, 58224, 59232, 61629, 69243, 69447, 60479, 45925, 45023, 58513]
18698E8513j988j3932k672J3521K1036n92p155O844j1117p624O237J52L403r441
18684E5185o07L277Q782K3449R921j9985n56N461j2923p897m67m038l829p426
18670D8347R513P866m894O661l882M391O239K624M374n908M762K324R694q334
18656H3777o610J4124K1474J223k0362j7514M971M386L073J533q690j0863p6R173
18642G9619N938N575r04o292J2433K3081L613k568j0657k626J2454q98k2185j2699
18628H3884p433J055K5539r564j4464J7819Q116p001j540R747l335q704j7777
18615G6342r395J5981l731n063r843K899n517K991M828p89J0158J8456K443O304
18601A06064R522Q177Q722O059l652j191O865K351J897j575k787j3100L630j4229
$$ y = [58513, 56525, 42593, 39921, 53442, 74478, 73886, 66731, 73575, 62458, 54834, 61071, 61223, 64626, 55185, 54578, 57855, 66637, 90086, 100007, 80022, 79466, 84927, 72004, 64107, 63640, 59602, 55773, 48347, 57860, 65726, 60832, 67493, 63611, 68002, 74241, 76865, 81239, 75331, 80093, 82417, 92111, 83777, 77167, 91291, 112765, 113988, 93626, 76112, 81083, 85469, 88542, 90075, 81385, 70522, 70446, 79619, 85557, 91132, 90228, 83936, 96369, 119450, 123063, 120495, 109838, 107212, 119666, 118768, 96583, 83884, 76451, 77506, 103045, 93481, 79017, 96836, 104952, 97951, 96411, 106158, 102823, 94119, 76342, 66947, 82928, 79197, 74134, 64291, 67190, 61673, 64664, 69492, 68703, 78861, 97317, 99760, 106064, 115586, 123763, 132485, 138544, 134892, 133701, 140566, 142917, 144814, 143239, 140452, 127352, 130982, 116753]
18587A16753M52R429m950j3887K094J0L534J788J0097J1628K354K988k171j6279
18573A23840j1651N044J5787n288j3651J6591J7402P640j0409M203Q534Q74J3211
18560A72127l557Q942J396J960j7367m20p946m961l564O883R638j0037k3723q816
18546A20555M28k64J829K94M206o341L3408M811J265K5811M64j607n054J064O762
18531A87631J0187N772p516p103o221p298N939J3910K7101J6315J5174N551N602
18518B65044j4670n044Q546R266M130r273K29K5695J7034M948K1751L8358L6791
18505D02805K1430L8321K0163J4368r60m148Q136J0338L1067J4340n746J6774
18493E66888L3731K1530J6353O6357R1972J23168J59912K73567M24921N85427
$$ y = [116753, 117205, 126634, 121684, 107797, 109891, 109901, 113435, 115223, 125320, 136948, 139302, 142290, 140119, 123840, 112189, 117233, 133020, 127732, 114081, 130672, 148074, 155714, 145305, 149508, 158042, 158916, 172127, 168570, 177512, 178908, 180868, 163501, 163081, 155135, 150174, 146610, 153493, 163131, 153094, 129371, 120555, 120983, 120719, 122548, 122842, 127048, 120707, 154115, 158926, 160191, 186002, 186466, 184859, 179805, 180869, 187631, 197818, 203590, 196074, 188971, 182750, 175452, 181391, 195301, 222402, 238717, 253891, 259442, 265044, 250374, 245330, 253876, 263142, 267272, 257999, 258228, 283923, 300957, 305905, 327656, 366014, 402805, 424235, 462556, 482719, 497087, 496127, 491979, 500115, 510453, 541520, 555860, 550114, 566888, 600619, 622149, 638502, 704859, 796831, 919999, 1079911, 1353478, 1778399, 2363826]
18483B363826O04438L49689o1101l74456l79626k16845l7906J60880L68644O72324
18473C449867J108701J501570J402507N48186o14417j381858j411273j052036
18465C551247p06458m72045l03251j80950q8959m3689N47K8956M0941O4445R2955
18454A983739J44990K26880L04705M09766N65827P16621P61958O90940N89641
18445F395067O90773J214319K155873L552372M999168N171203K996787o29700
18437B6545862l503902l988003k785002j205125L45127K096088M356224P136944
18429B8998213Q729447O350852L41750o076912q716884p522489n083072l002944
18421A4017961j788611j370180j326224j228963q97787n03964k21636k3372J41846
$$ y = [2363826, 2968264, 3317953, 3256852, 2882396, 2502770, 2285925, 2248019, 2408899, 2777543, 3449867, 4558568, 6060138, 7462645, 8010831, 7396414, 6014556, 4603283, 3551247, 2844789, 2372744, 2069493, 1888543, 1799584, 1755895, 1756442, 1785398, 1826339, 1890784, 1983739, 2128729, 2355609, 2660314, 3070080, 3635907, 4352528, 5114486, 5805426, 6395067, 7085840, 8300159, 10456032, 14008404, 19007572, 24178775, 27175562, 26545862, 23041960, 19053957, 16268955, 15063830, 15408957, 17505045, 21861269, 28998213, 37727660, 44078512, 44420262, 38343350, 29626466, 22103977, 17020905, 14017961, 12229350, 10859170, 9532946, 8303983, 7406196, 6902232, 6680596, 6657224, 6799070]
18412F799070L85391O89645J131624J825446K953501M761741P013780Q055477
18404C3615675O600389L467157l16488l628664o400320p709577o784920m891733
18396A3951519l223316k051115j273891p67925m03386j09975J64047M46730P45612
18387G478300J083830J301859J227694J147749J487544K803904N063135P399451
18379B8993466P454189L981128j783294o241244p262017n841303l751506j932198
18371A3617221l49414J270714L019375L966965K461337r01834m217919n041344
18363A3825101l890044k549560j580258r57287o04420m76276m78454m73987m01624
18354B413191l43772k51028j73350j16294m7371k4560O535K8771M5477P2490J06387
$$ y = [6799070, 7184461, 7874106, 9005730, 10831176, 13784677, 18546418, 25560198, 33615675, 40216064, 43683221, 43366733, 39738069, 33337749, 25628172, 18843252, 13951519, 10728203, 8677088, 7403197, 6635272, 6231886, 6121911, 6285958, 6732688, 7478300, 8562130, 9863989, 11091683, 12239432, 13726976, 16530880, 21594015, 28993466, 36447655, 40428783, 38645489, 32404245, 25142228, 19300925, 15549419, 13617221, 13267807, 14538521, 17557896, 21524861, 23986198, 23084364, 18866445, 13825101, 9935057, 7385497, 5805239, 4847952, 4243532, 3767256, 3288802, 2814815, 2413191, 2069419, 1818391, 1645041, 1528747, 1481376, 1456816, 1463351, 1492122, 1537599, 1610089, 1716476]
18343A716476J62936K48790L25748M39081O47215J039667J418139J106137J53920
18334G258109r38109j407821j137758p92833n30426l02467j22503O1649K73342
18325B361183M33177K89936q4624m88343n86714m73138l28705k24662j50861j12919
18315F34330q7655o0676l1499m507j9971m3643k2056K711l55j2740P906m095j196
18302C56554l776N21k694q60m77R338L0537M2311K3419O4011R3213R7751Q2709
18289G92557K7724k6984m2243M019N4429M8392J1000K636q383J313J0762k832
18277H72390l9182l2751k0760l753k4311p6135j17792j04790q8614p8814m7087
18266B38401j7635j6619k422r516j2099j2297q709l184J2046R017j7605r822j8731
$$ y = [1716476, 1879412, 2128202, 2453950, 2893031, 3540246, 4579913, 5998052, 7104189, 7258109, 6320000, 4912179, 3774421, 2981588, 2451162, 2148695, 2026192, 2087841, 2361183, 2794360, 3084296, 2999672, 2511329, 1924615, 1451477, 1122772, 898110, 747249, 634330, 546675, 485999, 454500, 449993, 430022, 386379, 364323, 367034, 366679, 353939, 361845, 357750, 356554, 352778, 353299, 350605, 349745, 349268, 358606, 389143, 431454, 454873, 518884, 612097, 709848, 792557, 820281, 793297, 751054, 755073, 809502, 857894, 868894, 871530, 863147, 864460, 875222, 872390, 833208, 800457, 779697, 775944, 751633, 675498, 557706, 452916, 364302, 285488, 238401, 220766, 204147, 201725, 192209, 180110, 167813, 159104, 155920, 167966, 176983, 159378, 149556, 130825]
18253A30825J0941N896K259O605N409J0794L591l907J2806K3308M0054M8895L3956
18240C31432N933q354j9690n18J8650K4863K4810Q1516Q3309L6792k6500m2564
18228E09679m1192o583J7706K2478P195j3943p0239r2995o7046m7684k6456k0039
18216A70881k2359j7543j3476p174j3421r079j5386o868N159l876j0703Q545j0947
18203E3753o525L0576K2990O442Q864M888j00k752k81R032O634J9030M2513M6473
18189B41537M8127J1155j9431m1660l3327O3J063K1239J443j5392k7942l3921
18177A52954k6435k142j1343r833q008j4116p401Q468K852L282r62j1080M806
18164H1042J2694J0496Q489O123L872m838L686K3124L748J9911N214n67R509K0479
$$ y = [130825, 141766, 147662, 149921, 156526, 161935, 172729, 176320, 172413, 185219, 208527, 248581, 297476, 331432, 337365, 329011, 309321, 308803, 327453, 352316, 377126, 458642, 541951, 578743, 552243, 509679, 468487, 461904, 479610, 502088, 509283, 495340, 425101, 332106, 265060, 217376, 190920, 170881, 148522, 130979, 117503, 110329, 96908, 87829, 72443, 65575, 70734, 66858, 56155, 64700, 53753, 47228, 77804, 100794, 107236, 116100, 120988, 120888, 118136, 117855, 126887, 133521, 152551, 195064, 241537, 289664, 300819, 281388, 239728, 206401, 206464, 207527, 228766, 230209, 214817, 186875, 152954, 126519, 124377, 113034, 103201, 95193, 81077, 73676, 82144, 84996, 88278, 87316, 76236, 81042, 93736, 104232, 112721, 118844, 122716, 117878, 121564, 144688, 148436, 168347, 173561, 172994, 182503, 202982]
18150B02982p91l119Q327o51K1955K7318O426j384j3446j7508j5660l914p564
18137B02971J5393K5553K0489K4920R294J9043M1724K7691K4336K2712L4905O1370
18125E30401N7148M3447Q2890R4337J27345J65042K06614K25704K62662L04946
18115B100536L69224N21084P41209J144219J977242L451166N815049P031879L809392
18106B6961000j524607o410899o366166m276004k611675j583097j011009o82798
18098B494745m96214l67633k67497k16184j69250j16986p3035o1969l4045n3080
18088F38852n7832o1045o3817o4168m9329m3031m1211k6488k4470l2215j2071
18077A63175j5791M935J2679J7649K170j487o236r119L730L243j7160p002j1641
$$ y = [202982, 202191, 199072, 207399, 206748, 228703, 256021, 262447, 261063, 247617, 230109, 214449, 210535, 202971, 218364, 243917, 264406, 289326, 298620, 317663, 359387, 387078, 411414, 434126, 469031, 530401, 587549, 630996, 713886, 808223, 935568, 1100610, 1307224, 1532928, 1795590, 2100536, 2469760, 2990844, 3732053, 4876272, 6853514, 10304680, 16119729, 23151608, 26961000, 25436393, 19025494, 12659328, 8383324, 5771649, 4188552, 3177543, 2494745, 1998531, 1630898, 1363401, 1147217, 977967, 860981, 787946, 725977, 691932, 638852, 581020, 519975, 456158, 391990, 342661, 299630, 258419, 231931, 207461, 175246, 163175, 147384, 152319, 164998, 182647, 184817, 183330, 177094, 167975, 171705, 174948, 157788, 150786, 139145]
18064A39145j10M281J1464l595J7022L9273L8954N7587O6010N8932N7941J2602
18052D99506n882j0707k0503l4317l2747m9470m3551m7504k4422k3486k8319j2687
18040A65911k8530l3815j5668j005k1547k0584r19j985j0719J3922J3674j1680
18028D7055j1530j7439K49O420J3009p068J306Q913N22j3986m675l399l163J4218
18014C0432m600J37J4031o204j614J7237J1620k611j442R639J9770K1267J4596
18001A22258O239J536L4618M0656L5427K7547L5271L1569M7892O1751O8272N7992
17989E71028M7267N6384M6462L3737J1018p515Q33r82k8822m4194n3565o2732
17977E68919o6750p6221p8680n9212l7215m6016l0612k0235o142M288q477j6655
$$ y = [139145, 139035, 143316, 154780, 151185, 168207, 207480, 246434, 304021, 370031, 428963, 486904, 499506, 493624, 482917, 462414, 428097, 395350, 345880, 302329, 254825, 230403, 206917, 178598, 165911, 137381, 103566, 87898, 86893, 65346, 44762, 43843, 41858, 31139, 45061, 58735, 47055, 35525, 18086, 18335, 24755, 37764, 30696, 32002, 40915, 41437, 27451, 22776, 19377, 16214, 30432, 25832, 25969, 40000, 33796, 32182, 49419, 61039, 58428, 56986, 66625, 86395, 107662, 122258, 128497, 130033, 164651, 205307, 240734, 268281, 303552, 335121, 383013, 444764, 513036, 571028, 618295, 674679, 721141, 754878, 765896, 758381, 759214, 758232, 729410, 685216, 631651, 568919, 502169, 425948, 347268, 288056, 250841, 204825, 174213, 153978, 147836, 152124, 143647, 126992]
17965A26992j652J599J6225J8192J0316O793M177j346J2565m88J3965K2938K3845
17952B54121J2080n633Q47m483J7646Q997R670J2475J7007J5666K2917M001k0676
17939C44635N428P398R758J4473l626R258j1671j7197k9252l0503k0358j2642
17927B65701j5722j6566j2206k5504l3751k7924j4368J4035K5959Q527K670j4868
17915A55983j2255m279j2489M615r533j0050o765N83j157n894n410P579O232j2544
17901I4616Q661Q517O173R26o191k0654j8030K230K744J080q177j045J3779L486
17887H8115k808L859N062M194K388K608L352j0128o088p730O728R170j2427M146
17873I0441R331l773m544J1586J6713k632O073M2q927j8699J922Q536l134j3300
$$ y = [126992, 125340, 126939, 143164, 161356, 171672, 178465, 182642, 181296, 193861, 193373, 207338, 230276, 254121, 266201, 260568, 261415, 256932, 274578, 283575, 293245, 305720, 322727, 338393, 361310, 365311, 344635, 350063, 357461, 367219, 381692, 378066, 387324, 375653, 358456, 329204, 298701, 278343, 265701, 249979, 233413, 221207, 195703, 161952, 134028, 119660, 133695, 159654, 168181, 170851, 155983, 143728, 139449, 126960, 131575, 122042, 111992, 105227, 105810, 104653, 98759, 93349, 100928, 107160, 94616, 103277, 111794, 117967, 118893, 112702, 92048, 74018, 76248, 78992, 80072, 71895, 70850, 84629, 88115, 85307, 89166, 94228, 98422, 100810, 103418, 106770, 96642, 90554, 82824, 89552, 98722, 86295, 90441, 99772, 95999, 91455, 103041, 119754, 117122, 123195, 123237, 114310, 95611, 97533, 106069, 102935, 89635]
17859H9635j3777O254P143N116p699l29p12k3374l7198k6226L447O428o572r467
17845g331m387J3467j990q11J2460r668j4104J0621J3260J1224k851j471l485
17832A4934R845M590J1453K1217J6624N330p192j0578j6691j0272K6033P508j1148
17819F1653r039k7830k3178k134k1954j804K4734M33j627R457N479k36o891Q300
17805A5363j6445L862M095m282o991J187Q737N422r962j3965J1778J1193o748
17792C244o184m263O401m75k6626n243m760J4418O248r879M37O198j5915l151
17778c9550J9502j699o742J3725K6598n976o987o941p126O858J0702p888J064
17765d460P997M916k960m663j0234n66q030Q675p336q940L800O061R267q268J0509
$$ y = [89635, 75858, 82112, 89255, 94371, 86672, 86343, 85631, 62257, 25059, -1167, 2280, 8708, 2136, -7331, -11718, 1749, -241, -1052, 11408, 1740, -12364, -1743, 11517, 22741, 19890, 18419, 14934, 24779, 29369, 40822, 62039, 78663, 83993, 76801, 66223, 49532, 39260, 65293, 72801, 61653, 52614, 24784, 1606, -528, -22482, -24286, 448, 881, -746, 8711, 14190, 13954, 7063, 15363, -1082, 2780, 6875, 2593, -4398, -3211, 5526, 10948, 986, -12979, -1201, 9992, 3244, -2940, -7203, -802, -1277, -27903, -33146, -37906, -23488, -17240, -27119, -26682, -20484, -36399, -39550, -20048, -21747, -28489, -14764, 11834, 5858, -1129, -8070, -15196, -8338, 2364, -5524, -4460, 3537, 8453, 5493, 830, -9404, -9970, -18000, -9325, -16661, -25601, -21801, -15740, -6473, -14741, -4232]
17750d232j757j1552q506k522N581J0178K665j0784j0445l789Q070J0359J797
17737a4937j533n291L474m153M763m098Q502J0771o674r962P021J5333J1551o401
17723H366j1938p445m807l687M460p902p59O120m750p495M971L306J616O393J0678
17708b873j515j4319j0450P701R070k1009r233L490R571l505L626J400N954l424
17694b5516Q222l837j532J3828J9134Q81k2911m125J1508J0040j7493p314N937
17681a3178j700L019J5938r275j8070r865k36k56J3857M850j5176k0330R22J424
17667d8076M984m40J1736J6034L467n022J0532k055r657Q224K919r026o047j0638
17653c3065m895r71J0236J6639J7438p863j3794q787j46R872L855j0155P318J480
$$ y = [-4232, -5989, -17541, -26047, -28569, -22988, -12810, -10145, -20929, -31374, -35163, -27093, -16734, -14937, -16470, -21761, -18287, -22440, -17677, -21775, -13273, -2502, -9176, -19138, -12117, 3216, 14767, 8366, -3572, -11017, -15824, -19511, -15051, -22953, -23712, -17592, -22342, -29837, -24866, -21560, -19944, -13551, -2873, -4388, -18707, -29157, -21456, -12386, -33395, -42628, -39138, -29567, -33072, -29446, -28046, -22092, -25516, -17294, -21131, -22663, -8835, 10299, 11180, -11731, -15856, -4348, 5692, -11801, -19115, -13178, -14878, -11859, 4079, -5196, -23266, -33131, -33367, -33623, -19766, -14916, -30092, -50422, -49500, -48076, -43092, -43532, -31796, -15762, -12295, -17317, -6785, -8840, -18497, -10273, -7354, -16380, -22427, -33065, -37960, -38931, -28695, -12056, 5382, -2481, -16275, -25062, -25208, -15336, -11481, -21636, -14318, -12838]
17639a2838M316j5561j2040j0042N887N892J2639K2201p18q552O458r754j1743
17626b3855J770J8733r67j5748j2456R416J0387o898r51J1495p311n445j1215
17613c3045R560k740j4975r349J1535K5110J1724O926K011n797o344j3178p681
17600b6243m10O552K913M687r679L875R815K360k876Q222M697k128m737o171P811
17585a312l203n398l06P83L299J3195K1842j2302j7617j0090J270O364l234j56
17571f865M75m633l549k466N629j087P51N465j1249j2575P90o969m728N237O622
17556b9152J3187J2661q781J035J389M396m797q031n621q787J3016J0873q541
17543a7153p059L681P001O66o044q77J1953l312O05M216k037L276j460j3557P198
$$ y = [-12838, -8522, -24083, -36123, -46165, -40278, -34386, -21747, 454, -264, -8816, -2358, -12112, -23855, -22085, -3352, -4319, -20067, -32523, -23107, -12720, -19618, -20569, -9074, -16385, -21830, -33045, -23485, -26225, -41200, -50549, -39014, -13904, -2180, 4746, 6757, 960, -5384, -18562, -26243, -26653, -20101, -17188, -12501, -22180, -18305, -8490, -6130, -9006, -784, 3913, 1785, -2952, -9123, -1312, -4515, -9913, -10219, -9436, -6137, 7058, 28900, 16598, -1019, -11109, -9839, -3475, -6709, -6865, -6390, -11023, -14572, -17038, -11409, -12496, -11745, -6280, -17529, -30104, -29314, -36283, -41011, -35774, -29152, -15965, -3304, -12085, -11050, -9661, -5265, -10062, -18093, -23714, -32501, -19485, -8612, -17153, -24212, -20531, -13530, -12864, -18908, -19785, -7832, -11144, -10539, -6323, -8360, -5084, -6544, -20101, -12903]
17528a2903N118n405j5687j2252q285M227q056J273J639r61O966o902J1153R300
17514c0775L317J1655P91j3554q270K250l033j1840O047K2201M75m31j5925k1971
17500e9063p240M962Q321J5605R804J2761O387k0306l935Q362j0135N985M300
17487b4192K344O836l24Q302l908M679P70J851m445L111J3097j7056o600M619
17473a0916J1906r104p799l220k10m722L899R842j119k820L039Q487l443j2980
17459a9160l97L795K247j233J3112R759k567j7573O579J6997J2610J507p034k1062
17445b420j852K6941M4537M3201K4188L518l9821m8785k5003n918r728r444Q291
17432G705j602l029J3121o087j3485r333j9444o965J6644J2318n651j1036q331
$$ y = [-12903, -7785, -13190, -28877, -41129, -49414, -45187, -53243, -51970, -50331, -51292, -44326, -51228, -40075, -30775, -27458, -15803, -15012, -28566, -36836, -34586, -37619, -49459, -43412, -21211, -20736, -21167, -37092, -59063, -66303, -61341, -53020, -37415, -27611, -14850, -8463, -28769, -32704, -24342, -34477, -28492, -24192, -21848, -15012, -15336, -7034, -10942, -6263, -5493, -3642, -8087, -4976, 8121, -8935, -15535, -10916, 990, -8114, -15913, -19133, -19343, -24065, -20166, -10324, -11443, -14263, -11224, -2737, -6180, -19160, -19557, -15762, -13515, -14748, -1636, 8123, 5556, -12017, -5438, 11559, 24169, 25676, 18642, -2420, -4272, 22669, 67206, 110407, 134595, 138113, 98292, 49507, 24504, 18586, 8858, -586, 7705, 6103, 3074, 16195, 10108, -3377, -12710, -32154, -39119, -22475, -10157, -15808, -26844, -35175]
17419c5175J5061J6942M780j1263P31m856l259J768Q803M050p456j2577r897l286
17405c5634k648M422J5299P348R69q281j4991r084J0579J0871J209k51M318K03
17391a5671K462n643n791K245n884o828k561r237K921q36J1834J2334o840j2251
17377c9746j354j2046N201J3807J7168N213j417j2034q207J0832N460J3233m452
17364h342o923k436m394M309j2365m367J8008M305M249Q335o094j2562k104N382
17350a4999n511P791k931j1819J2015O246k533L162m247k097K098j1125q378m240
17336c6568P024J6109r415r862j975J5912P547J1479j1826o128k974j975P038
17323a5614j87R680k514p115j7316n789k91M60J1505J2252J4250O349K808m514
$$ y = [-35175, -20114, -3172, 1608, -9655, -8924, -13780, -17039, -15271, -6468, -2418, -9874, -22451, -32348, -35634, -38282, -33860, -18561, -11213, -10244, -18525, -33516, -42600, -32021, -21150, -19941, -20192, -15874, -15671, -13209, -18852, -24643, -22398, -28282, -35110, -37671, -46908, -43987, -44823, -32989, -20655, -27495, -39746, -41100, -53146, -47945, -34138, -16970, -11757, -13174, -25208, -33415, -22583, -17123, -3890, -8342, -15265, -17701, -22095, -17786, -30151, -34518, -16510, -12205, -7956, 379, -5715, -18277, -20381, -14999, -20510, -12719, -15650, -27469, -15454, -9208, -11741, -8579, -12826, -14923, -12825, -23950, -32328, -36568, -29544, -13435, -22850, -32712, -34687, -18775, -11228, 251, -11575, -17703, -20677, -22652, -15614, -15801, -6121, -8635, -15750, -33066, -38855, -39146, -38686, -27181, -14929, -679, 5670, 8478, 3964]
17309C964r368j0068r337r61P569j3388p100M837q066q73L401k083r814P162O606
17294c7519J3040J6887l997L19J3276J904r275j3673J5861M459m164K1082Q079
17281B6279k0446j4991O095R748N965j2997j6075l080L112L879J1963q970J277
17268h241N727j5612k4313O314O523J3990O473r273j7864Q273J459r556l96K6200
17254a0296K2412j213j2500j781j4198j9001k331K0444p893r609J6742J1345Q527
17241F48o980j0429L250J824o790j4697P21M570P457k561P38K556N848Q84P89
17226a2172M466Q482k185o249K948j568R938J527j129j5911j762j1939p043M186
17212b8411J6416Q371j9938l81J0766Q447J1904q167j5976o29O427r756k870j2803
$$ y = [3964, -5404, -15472, -24809, -25770, -18201, -31589, -38689, -33852, -41918, -42791, -39390, -41473, -51287, -44125, -37519, -24479, -7592, -11589, -11270, 2006, 3910, -5365, -19038, -3177, 1282, -2882, 18200, 26279, 5833, -9158, -3063, 6685, 12650, -347, -16422, -19502, -16390, -12511, -548, -9518, -8241, -2514, -18126, -42439, -36125, -29602, -15612, -9139, -18412, -36276, -28003, -26544, -36100, -36496, -10296, 12116, 10903, -1597, -3378, -17576, -36577, -38908, -18464, -26357, -35966, -19224, -7879, 648, -6332, -16761, -13511, -11687, -18477, -33174, -32453, -27883, -20426, -22987, -22249, -19693, -13845, -12961, -12172, -7706, 776, -1409, -7658, -4710, -6278, 3660, 5187, 4058, -11853, -13615, -25554, -32597, -28411, -11995, -3624, -23562, -23943, -13177, -4730, 7174, -993, -16969, -17598, -11171, -20927, -23797, -36600]
17198c6600l994q70o32K1137R030p010q154q20q33J4390j010q342M069P181J0413
17183b045M781j6360L339J6525n233j3116P287J1376J219j2341j6167r230N924
17170b4041J2433J4318J441J1081N598k113j710M099l148j5662j0723J3334o213
17157a306J0848O766n286j3041j2244O373N484l0231k47J1916R790J1566j592
17144a204K544L35j211J426j1980m221L454J941Q015o006j0980M905L576L080
17130f326O697J895J4223L692k0777j8686M067J2354l627j0243o679J9337R124
17117E051K579L160o151r19r194j56J0291n04Q280M300r382l228N480n414j2474
17102h281p145J2685N969j0606J2945r530k6357M16N23J0377M512Q963j2692n385
$$ y = [-36600, -40594, -41464, -42096, -20959, -11929, -18939, -27093, -27913, -28746, -14356, -15366, -23708, -19639, -12458, -2045, 2736, -13624, -10285, 6240, 1007, -12109, -4822, 6554, 7773, -4568, -20735, -29965, -24041, -11608, 2710, 4151, 15232, 20830, 18717, 17007, 21106, 17958, 2296, -8427, 4907, -1306, 9542, 16308, 11022, -2019, -14263, -7890, -2406, -32637, -32884, -20968, -11178, 388, -1204, 1340, 1675, 464, 1890, -10090, -14311, -10857, -8916, -901, -6907, -17887, -12982, -9406, -6326, 371, 2266, 16489, 20181, -596, -19282, -15215, -2861, -6488, -16731, -23410, -4073, 5051, 7630, 10790, 4639, 3720, -5474, -5630, 4661, 4157, 12437, 16737, 7355, 4127, 9607, 4193, -8281, -15426, -2741, 3228, -7378, 5567, -3963, -30320, -29904, -29381, -19004, -14492, -5529, -18221, -23606]
17088b3606Q199Q879M461m591k740l179j0566r973k3J8291K2006O509l874M77
17074A0270m863j1466N686p845n570k489J1757K2375M950j9415j6599O19K07j4197
17060b6580N040M294Q851K707M573k93j365K8627L558j0777o606L194o167j368
17046G688j3907j0347K702R241J9998m803j0428Q997o634j3580q039j0547k813
17033c2472n339O917P680r334n712J1763N676M524N899J3133N079k841q04J255
17019E424J3905J335j7090j5518J581O392m892m194P286R607R204q826j2538k420
17005a0744m048L106r650p774K949p221J6508p293j955P133Q317R407P63J65j043
16990a380j5019j0477Q286N503J9593L799R027k0018k4321M101J2849O498P469
$$ y = [-23606, -15407, -6528, -2067, -6658, -9398, -12577, -23143, -33116, -33139, -14848, 7158, 13667, 9793, 10270, 5407, -6059, -373, -8218, -13788, -16277, -4520, 17855, 22805, 3390, -13209, -12590, -12383, -26580, -21540, -17246, -8395, -5688, -1115, -1408, -2773, 25854, 29412, 18635, 12029, 15223, 9056, 7688, -6219, -16566, -13864, -4623, 15375, 10572, 144, 9141, 2507, -11073, -19112, -29659, -32472, -37811, -30894, -23214, -32548, -38260, -26497, -20821, -16297, -10398, 2735, 7814, 4973, 4169, 5424, 19329, 20664, 3574, -11944, -10363, -3971, -8863, -13057, -5771, 3836, 13040, 4214, -8324, -10744, -14792, -11686, -21336, -29110, -26161, -33382, -16874, -24167, -26122, -18989, -10672, -1265, -502, -337, -1380, -16399, -26876, -18590, -13087, 6506, 10305, 19332, -686, -25007, -20906, -8057, -1559, 5910]
16977E910p286k3494k480J7091J2553K85j2132j0428J8751J1608j6475j4273l865
16964b4235q112P050O753j5208J957J792r07J4845L103j5787P041M143m034l339
16950b4938Q260o47N723p30J0692K784k271j5026Q06N808J1198O9j1258j2327
16936b1857j2469J1531J1033R253J3938j1855j6726k899J218M015n588o892L684
16923b3614J6669J2831l197O590j0757j4843j0572j3466K5415J5030n544o210
16911a1668P42j4081r132P785P939L220j578j1801r923Q499J082L696R243J7300
16897A323P438k2088j278R404k180p375j547R003K0105J2959n290j3352q976o769
16883h623q713r128J2705l660M478L412J82j798O120k99p071q035n885O767J1378
$$ y = [5910, -1376, -24870, -27350, -10259, 2294, 2579, -9553, -19981, -1230, 10378, -6097, -20370, -24235, -32347, -25297, -18544, -33752, -31795, -30003, -30910, -16065, -12962, -28749, -21708, -17565, -21599, -24938, -16678, -17325, -11602, -12332, -1640, 1144, -1127, -16153, -15347, -9539, 1659, 1728, -9530, -21857, -34326, -22795, -11762, -2509, 11429, -426, -17152, -20051, -18833, -14818, -20406, -27298, -23614, -6945, 5886, 2689, 9279, -1478, -16321, -26893, -40359, -14944, 86, -5458, -11668, -10926, -25007, -34139, -26354, -18415, -15195, -16773, -28574, -38497, -29998, -28916, -25220, -15977, 1323, 8761, -13327, -14605, -5201, -7381, -14756, -16303, -7300, 12805, 25764, 20474, 7122, -1854, -8623, -17336, -26464, -13759, -17419, -12941, -9529, -9347, -11145, -5025, -5324, -12395, -20430, -26315, -19548, -8170]
16868h170O43p438J7812P34l140j968J018k813l660J3267n946j3815J784J1246
16854d46p737n664M28J0406m778J481r261m814o520J0743L647O303M381j732o002
16839i565r346O407K3558r077j6141j698R835l555K604R885j0783j4230k565J0630
16825a4041J1643k758j0551q329Q506N652J1405m290q787j0141p02P784N167j1238
16811b0680k000L023K5277p033m752K309j01P162O819n455n527k918j2086N074
16797a0888K991L537O569J0751N515M640q296j1146n925O321K95k009p746L722
16783a669j302p484o845J630j518J9459m58m410j1180r555q05K2684K3668m366
16769A7849j9781j4677N778J9857l631j0715j7198J0504R231l752Q044L561J0470
$$ y = [-8170, -7527, -14965, 2847, 3581, 441, -1527, -509, -3322, -6982, 6285, 339, -13476, -11692, -446, -8183, -13847, -13419, -3013, -7791, -6310, -15571, -20385, -26905, -16162, -12515, -6212, -1831, -3563, -9565, -18911, -12504, 11054, 1977, -14164, -15862, -6027, -9582, -6978, 2907, -7876, -22106, -24671, -14041, -2398, -5156, -15707, -24036, -15530, -9878, 1527, -2763, -11550, -21691, -22393, -14609, -9442, -20680, -22680, -19657, 5620, -1413, -6165, -3856, -3957, 3205, 10024, 4569, -958, -3876, -15962, -10888, -7897, -4360, 2209, 12960, 18475, 23115, 14819, 3673, -2252, 4069, 4364, 2355, -5391, -1669, -2971, -10455, -17300, -15670, -17188, 2271, 1813, -2597, -13777, -23332, -24137, -1453, 22215, 17849, -1932, -16609, -10831, 9026, 5395, -5320, -22518, -12014, -2783, -6535, 1509, 5070, 15540]
16756A5540O031r838K884p733j1002q749L913J008N969M162n105j1010r593n048
16742b8571k593M441J5216j674k224O51Q659J3746O699j0070L267L398o180j970
16728B795l11N582p043r301l385R736L769J0113l904j3297j5109K463J0271o492
16714a4113J408L262N345J3051K469j0833R39M053j074o893r101r539j3438J2212
16700b2252J0975j6423N655J7611Q452o730m507J0106M904o184J695o270l836
16687f804n290m21K5602l194j0480r851N692Q866M73J3858R604l864k463J430
16673B3158N609j3012p474j2526o780j4159n506J2766O389J4j160J0132J7273
16660A4724j16j0432J3m182P136j2290N51j4927j6426J1683K2428j094j7066j6269
$$ y = [15540, 21571, 11733, 14617, 6884, -4118, -12867, -8954, -7946, -1977, 2185, -2920, -13930, -23523, -28571, -31164, -26723, -11507, -13181, -15405, -14754, -6095, 7651, 14350, 4280, 7547, 10945, 4765, 2795, 2484, 8066, 1023, -8278, -11663, -1927, 1842, 11955, 8051, -5246, -20355, -17892, -7621, -14113, -12705, -9443, -4098, 8953, 11422, 589, 1528, 5581, 4507, -2386, -11487, -21026, -34464, -22252, -11277, -27700, -22045, -4434, 4018, -2712, -7219, 2887, 7791, 1607, 3302, -2968, -6804, -12094, -12515, 13087, 9893, -587, -10438, -4746, 4120, 4593, 18451, 28055, 24191, 21728, 23158, 28767, 15755, 8281, -4245, -11025, -25184, -30690, -17924, -11535, -11521, -12681, -2549, 14724, 14608, 4176, 4189, 7, 7143, -5147, -4596, -19523, -35949, -24266, -1838, -2932, -19998, -36267]
16646c6267j714J0966m234K589J2361L787O702j594q884O357J5731q114L581J237
16632B504m577P806M248j271K517n590l55l059j6235M088J5626r257j271j2606
16618a7432n107K3229j613j2473j1576L133O295J0632R764j127j1078k3356P611
16605b3098J5222k358k259L103p883L020m128P760O929q499M262o131j775o880
16591b2715P153R353m147J232k47j6543L825J7562P806p740j2637l615J399K952
16577a6362O866J2504P152Q861k3538j7419r028J0157K288J2501J9479p542J832
16564G751j2093N519m618j7976j125q193J5750J4045O783P508k0571l144Q68j0921
16550b0417j557O69J0957J2910p99j0789j1701p003J3973Q624o780L108o93j562
$$ y = [-36267, -37981, -27015, -31249, -28660, -16299, -12512, -5810, -7404, -16288, -9931, 5800, -2314, 1267, 2504, -2073, 5733, 9981, 8710, 11227, 5637, 5282, 2223, -14012, -9924, 5702, -3555, -4826, -17432, -22539, 690, -923, -13396, -24972, -21839, -15544, -4912, 4852, 3725, -7353, -30709, -23098, -7876, -10234, -12493, -9390, -17273, -14253, -18381, -10621, -3692, -12191, -7929, -14060, -15835, -22715, -15562, -6209, -10356, -9124, -9371, -25914, -22089, -4527, 3279, -4461, -17098, -20713, -19314, -16362, -9496, 3008, 10160, 19021, -4517, -21936, -30964, -20807, -18519, -6018, 13461, 5919, 7751, -4342, 1177, -3441, -21417, -22542, -30735, -14985, -940, 5843, 13351, -7220, -10364, -9496, -20417, -21974, -21305, -10348, 2562, 1763, -9026, -20727, -27730, -13757, -5133, -11913, -8805, -9498, -11060]
16536a1060M872M330R094n654M175o314n251K502n585N788J5820J607j4157n367
16522e200o968Q566J4693m31j9402j1981j3857j0963Q889J1948O493K510r890
16509b5593j0950J2244J9769j404M386J522O371j958r513r12M745J1138p27k708
16495F410n428j4342K533O292L86J0094o482j601N172j562p294K2485Q010j1764
16481A2909j4381j3319n544P571O334K969n022j0992J0265o09r680j841P968J237
16467a2135J0353j3237O198J2656n168p217J4846Q152n834j6929p778o720j3778
16454c6591J2390j940n916j5090j475J3847p59p078J0137o086J2035J5584N68
16441a0374p129k833nK0802l459j1811j179Q963Q05o108j0503l873K903L99l199
$$ y = [-11060, -6188, -1858, 7236, 1582, 5757, -557, -5808, -3306, -8891, -3103, 12717, 14324, 167, -5200, -12168, -3602, 11091, 10660, -8742, -20723, -34580, -45543, -36654, -24706, -18213, -15703, -25593, -36543, -24299, -4530, -5934, -1548, -26, 6345, 4387, -5126, -6038, -1293, 9845, 9118, 6410, 982, -13360, -10827, -4535, -4149, 5945, -537, -2138, 3034, 1472, -5822, 16663, 24673, 12909, -1472, -14791, -20335, -12764, -6430, -3461, -8483, -19475, -9210, -9819, -19499, -21340, -13372, -12135, -1782, -15019, -8821, 3835, -1333, -8550, 6296, 14448, 8614, -8315, -16093, -22813, -36591, -24201, -26141, -32057, -47147, -48622, -34775, -35534, -42612, -32475, -38561, -26526, -10942, -10374, -17503, -20336, -20341, 461, -2998, -14809, -15988, -7025, -6220, -12328, -22831, -26704, -23801, -23402, -26601]
16426b6601J0326j257m5L682N287r618J274k817q834J5385J0655m586l21J1438
16412C968O430N61N901L72j3379m306n178J1043L654j3452q733p308K301k456
16398b0582j8641n562K0088J9764J8421n793m677R355K07j2178k1364n198J3113
16385a3047O939J2592j2352j7873L647P401k750n538O515k39m049J354l536J4346
16371f590J0853l623O280n101N703M917p008R09j4240k0260l724M475K436r139
16357c4112Q559Q339N984o316p759j2043J2226Q912K561K894k51O054O874j671
16343B51J1817j178J912L566j8007j7267n545n802J0124J3541n062m653M963o112
16329a7452p376p578L557L119J5404K428m890O081Q010p86r748l854K410m940
$$ y = [-26601, -16275, -17532, -17577, -13895, -8608, -18226, -16952, -19769, -28603, -13218, -2563, -7149, -7470, 3968, 10398, 10959, 16860, 17232, 3853, -453, -5631, 5412, 9066, -4386, -13119, -20427, -18126, -20582, -39223, -44785, -24697, -4933, 13488, 7695, 3018, 12373, 12580, 402, -20962, -26160, -13047, -6108, 6484, -5868, -23741, -20094, -12693, -15443, -20981, -14466, -14705, -18754, -17400, -20936, -6590, 4263, 640, 6920, 1819, 7522, 12439, 5431, 6340, -7900, -28160, -31884, -27409, -24973, -34112, -25553, -17214, -11230, -17546, -25305, -37348, -25122, -16210, -13649, -10755, -11006, -4952, 1922, 251, 12068, 10890, 12802, 16368, -1639, -18906, -24451, -30253, -20129, -6588, -11650, -16303, -11340, -17452, -24828, -32406, -28849, -25730, -10326, -7898, -12788, -6707, 1303, 517, -9231, -13085, -10675, -15615]
16315a5615M150J7061J194q67m4j1666q114M497J921R144J0487N13j2650K758
16301B769m730j8o048q068K111p655k498J0689O660j513k164m767o366J1575K2341
16286A2318j037l017J0425j41N476J298j1332j4209j3726O784K3090m006o195
16273E728n757j873r475j2071P143l282o370MN332p43j030J2677J1491M180j3182
16258g228p102O674L13K202J5978P605j9109j538k105k147M53j689l002j739L334
16243i100N183j3674l313m300J5903Q048p510k0515j679O328O215J5864P107J1026
16229A5583N233q758j8838j0521O686J2632Q808K163n846J2197k548j4640J030
16216C181j2363J333L758L981l918j0310j5018J1684J5124N240J0590l169j3510
$$ y = [-15615, -11465, 5596, 6790, 5923, 5879, -5787, -13901, -9404, -7483, 1661, 12148, 12661, 11, 2769, -1961, -1979, -8027, -16095, -13984, -21639, -24137, -13448, -6788, -8301, -10465, -15232, -21598, -10023, 12318, 11281, 8264, 18689, 18548, 24024, 25322, 13990, -219, -13945, -7161, 15929, 11923, 5728, -29, -1902, -11377, -23448, -16305, -19587, -25957, -25953, -20621, -21364, -22394, -9717, 1774, 5954, -7228, -14330, -7656, -7343, -5141, 10837, 18442, -667, -2205, -4310, -6457, -6004, -7693, -10695, -12434, -9100, -3917, -17591, -20904, -25204, -9301, -1253, -8763, -29278, -30957, -24629, -18414, -2550, 4557, 15583, 20816, 12058, -6780, -17301, -10615, 2017, 10825, 12988, 7142, 19339, 16791, 2151, 3181, -9182, -7849, -4091, -110, -4028, -14338, -29356, -17672, -2548, 2692, 13282, 10113, -3397]
16203c397l618j1332k987J012M784K380J7060R437p25n890P361o587J699k0150
16189a0953O60N966k966o779r90Q504P795k68M90M503M076L260K765j2724Q455
16174A1794N060N662k83j3437j1403j446j1638O425R887j5565j6845K681K0167
16161h941P993j4308q142k277J2581J8114m289k1209l357O800R225J308O061R740
16147I299M982o791j3153k740j115Q05J3820k545k793J3518o101K630n97n835
16133C384J795L281o59l047n425j6082k2564J2979J1071J2699p092N762Q134r258
16119e022R548M2n844K348n221o1J2640J519J8080j958j6455k422n922k2892Q496
16104a3124O772N298L755k173J315M446o836o266n63N013Q155J7255O949J757
$$ y = [-3397, -7015, -18347, -21334, -20322, -15538, -13158, 3902, 13339, 12614, 6724, 14085, 7498, 9197, -10953, -10293, -4327, -7293, -14072, -15062, -6558, 1237, 969, 1459, 5962, 10038, 13298, 16063, 3339, 11794, 16854, 22516, 22233, 8796, -2607, -4053, -15691, -9266, 621, -14944, -31789, -29108, -8941, -948, -15256, -23398, -25675, -13094, 5020, 731, -20478, -23835, -17035, -7810, -6502, -441, 9299, 14281, 7490, -5663, -8403, -9518, -8713, 5107, 2562, -231, 13287, 7186, 9816, 9219, 3384, 5179, 8460, 7801, 4754, -671, -16753, -39317, -26338, -15267, -2568, -9660, -3898, 4236, -5022, 4526, 4568, -1276, 1072, -4149, -4210, 8430, 9949, 28029, 26071, 9616, 7194, 1272, -21620, -13124, -6352, -1054, 2701, 528, 1843, 6289, -547, -6813, -7376, -2363, 5792, 23047, 29996, 31753]
16090C1753J0510j1130j0640L3j4679r600J918L784J082r861j1362m000J4285
16077g907r29j1782n152K1444K8944K147j7707q321L184m300P319r302n638O543
16063a457J7132J106o55j302N838Q327q507m642k0306q916J0685j471L590J368
16049G90j3955q593m426K475J1475J1094M228o062r768l788J1283J0413J0563
16036A5729j1626j7417j4973N397L315m401L460n519n36J2881J115N612J8705
16023A1742m83j2454J795r43j0792L177O538K195N601o619j3305O007K2809M661
16009A9929j5893j4995n095p217j0665P07O227O602l02L144L308Q098p669j2125
15995b5946K230L813J4384Q279o865O400Q135k870p215J028M10j2754n047J0428
$$ y = [31753, 42263, 31133, 20493, 20526, 5847, -3753, -1835, 1949, 3031, -6830, -18192, -22192, -7907, -8836, -20618, -25770, -4326, 24618, 26765, 9058, 737, 3921, -379, 6940, -2362, -8000, -1457, 15675, 16781, 16126, 14824, 20662, 28989, 20482, 15840, -4466, -13382, -2697, -4168, -578, 790, -13165, -21758, -26184, -23709, -12234, -1140, 3088, -2974, -12742, -16530, -5247, 5166, 15729, 4103, -13314, -28287, -22890, -19575, -23976, -20516, -26035, -26571, -13690, -12575, -6963, 11742, 11259, -1195, 600, -343, -11135, -7958, -1420, 775, 6376, -243, -13548, -7541, 15268, 19929, 4036, -10959, -16054, -23271, -33936, -33229, -27002, -20400, -20702, -17558, -14250, -6152, -13821, -25946, -23716, -19903, -5519, 2760, -4105, 2295, 10430, 7560, 345, 1373, 1783, -10971, -16018, -5590]
15981e590k821J6345Q159o299j2706M241n274j3291j795j3594Q836K1972j36j0972
15967a2925K657k531m829O977P733J1390p236q859p23n941l519M964M158J0866
15953B182J4476Q588j1212j0380o421n690r298j0295O242k206J5917J7381r52
15940H332n517Q274j2391L330o54N708L933r820m780L94O198R311J4110O902j2079
15925B1251q836j1235Q52Q491R064p222N66o602l124j293K047m830O809j0030
15911d092r008J4369O729J0078k603j1092j2148j0173K99Q506o902j643J0278
15898g402P398L266k121k078j6608j0719J6855J0483l319l009j1874M997Q743
15885e388j330r373Q911m854k254J4284L515Q67n844O049O964j668j2710q412
$$ y = [-5590, -8411, 7934, 16093, 9794, -2912, 1329, -3945, -17236, -19031, -32625, -23789, -1817, -1953, -12925, -10268, -12799, -17628, -10651, -2918, 8472, 1236, -7623, -8346, -14287, -17806, -12842, -8684, 2182, 16658, 25246, 14034, 3654, -2767, -8457, -17755, -28050, -21808, -24014, -8097, 9284, 8332, 2815, 11089, -1302, 2028, 1374, 7082, 11015, 1195, -3585, -3191, 3007, 12318, 26428, 33330, 21251, 12415, 1180, 2032, 10523, 19587, 12365, 12931, 6329, 3205, 1912, 3959, -871, 5938, -4092, -13100, 1269, 7998, 18076, 15473, 4381, -7767, -17940, -17641, -9135, -16037, -17680, -7402, -4, 3262, 1141, -937, -17545, -28264, -11409, -926, -4245, -7254, -19128, -14131, -5388, -6718, -16091, -7180, -12034, -14288, -4, 3511, 4378, -1466, 4583, 11547, 9879, -2831, -11243]
15871a1243P737J3144j4420K104J4520m42o254j626j3716m481N611q538J9387
15858A783n23j3879j927L249J6276l42l733r754q221m848J2828K813J929M280
15844f9J7696R863j3624j6104o437j621m306O569n225k029Q475K914J0708M95
15830G305k88k583J478J2285j1235K677J0457q863j1330J031J2526j5975r481
15817a1996Q434j951L193J331r200j1970j0078J4345J1057k89k681P69n630K507
15803a2159N876o907K619J0426l196o30l323M0m332J6279K49j2864J1422q89q94
15788A717N641L459n061o56k2m091n915p319J4178P107o726m256j7732j5344J8044
15773a6976K7398Q736L586j4118N303q471n032K683J5271K918l170m817R336Q75
$$ y = [-11243, -3506, 9638, -4782, -2678, 11842, 11400, 5146, 3520, -10196, -14677, -9066, -17604, 1783, 1260, -12619, -14546, -11297, 4979, 4637, 904, -8850, -17071, -21919, -9091, -6278, -4349, -69, 17627, 27490, 13866, -2238, -8675, -10296, -14602, -8033, -13258, -15287, -6812, -3898, 6810, 7305, 7017, 4434, 5912, 18197, 6962, 9639, 20096, 11233, -97, 934, 13460, -2515, -11996, -3562, -5513, -2320, -989, -10189, -22159, -32237, -17892, -6835, -7124, -9805, -9036, -14666, -12159, -6283, -13190, -10571, -145, -3341, -3971, -7294, -7254, -11586, 4693, 4942, -7922, 3500, 2611, 1717, 7358, 10817, 5756, 5100, 5078, 987, -4928, -12247, 1931, 9038, 2312, -1944, -19676, -35020, -16976, 10422, 19158, 22744, 8626, 13929, 5458, 426, 3109, 18380, 21298, 18128, 13311, 22647, 23522]
15759B3522j3804q595M764k965k251J0511q402K889j3490j3665K521N896J718
15746a1351O049J1558J2248O464j1110o651M554k440M4o828r364J3613m302j0689
15732h205j52K080j0047n394J3450K1296j454M930J831q797o744o9J2817Q566
15718B4108l996m820j0162j3397j0062K0575O601j959K076J643m063o105m576
15705d137k083J1620N648j487M974p85N638k954r606j6562N08o232m208L913J8419
15690B666j4595O674m766P66R73j1097r674L528m382P699J0227K718P050K4625
15676B2412n605q464m348M380l656O62J171m916J4239R460j2143l143j1971p883
15662i805P634p248j127J7105J951l732l608j3590n140M065K6567r112j29K282
$$ y = [23522, 9718, 1123, 5887, 2922, 671, 11182, 2780, 5669, -7821, -21486, -18965, -13069, -11351, -5302, 6256, 18504, 24968, 13858, 7207, 11761, 9321, 9365, 2537, -6827, 6786, 2484, -8205, -8357, -6277, -16324, -21718, -8268, 13028, 11574, 16504, 18335, 9538, 2794, 2725, 15542, 24108, 20112, 15292, 5130, -8267, -18329, 2246, 8847, 6888, 8964, 10607, 6544, 439, -4137, -6220, 5400, 11048, 9561, 14535, 13750, 19388, 16434, 6828, -9734, -9226, -15458, -19666, -15753, 2666, -11929, -5255, -10021, -9255, -8282, -19379, -29053, -25525, -29907, -22208, -11981, -9263, -2213, 22412, 16807, 8343, 3995, 8375, 4719, 5381, 6552, 1636, 15875, 25335, 13192, 10049, -1922, -9805, -2171, -9419, -10546, 6559, 8510, 4778, 1170, -12420, -17560, -13495, 13072, 3960, 3831, 6113]
15648F113R405j047j0348j841P423P635R615q106j319N48m999q340j5900j170
15634a2331J1503K957L538R960k80j9219k337J8262R002k051N798j0526J3425
15621B7701J39j3816l333J0033j381j340l497j1221r232L536P026j216L626Q979
15607A6004Q813o050k387k48n687j4745J514M496J5083Q683M794q930m666j4230
15593B444j8382M280m192P837J4857N232k971p059K91Q86j0008o076Q371o148
15579a0638p31J1102R761N082J33O837m922l437j3072o890n90k107l805M209J1190
15564B122n192j2111q806M330Q213J2854k0553l556L471J3732J5151J822M17K318
15550A4212q909m801n293j706k385j2647J3923k672O37o589j8779j446J3221Q839
$$ y = [6113, 15518, 14471, 4123, 2282, 9705, 17340, 26955, 18849, 17530, 18078, 13079, 4739, -11161, -12331, -828, 2129, 5667, 15627, 15347, -3872, -6209, 12053, 21055, 19004, 24802, 14276, 27701, 27840, 14024, 10691, 20724, 19343, 18003, 14506, 3285, -5947, -2411, 4615, 3399, 7025, 16004, 24817, 18767, 16380, 16132, 10445, -4300, -2786, 1710, 16793, 25476, 30270, 21340, 16674, 2444, -15938, -11658, -15850, -8013, 6844, 12076, 9105, 2046, 2337, 3223, -6785, -12861, -4490, -10638, -11369, -267, 9494, 14576, 14709, 21546, 16624, 13187, 115, -6775, -7365, -9472, -13277, -9068, 2122, -3070, -15181, -23987, -19657, -11444, 1410, -19143, -22699, -19228, -5496, 9655, 11477, 11894, 14212, 5303, 502, -4791, -6497, -8882, -21529, -7606, -10278, -9641, -16230, -35009, -36455, -23234, -14395]
15536a4395J2893L544L965L839R772O007p402p315q30j903j4383N96J1910J0204
15522A6502J236l113m913n672L69J44R087M474j8376j6376n287K6423k597N597
15508G498K2777P493j8216l5423R140R909J48J347P27J6004L444k4943m650J2091
15494G346J927p478r534q509l555M308J103L888L322J7141J6145p849p012j0789
15480D54j794J644J111J1420L162K354K247P86q703j483k576j2050q916j0442
15466b2786j821j0367P946J1538M44q977L372Q949L330L524O956J4331J77j7884
15452a268j4671O899J4901N482j1167j0577r771k701k484J4921O921k405P06N817
15438F03m066l357K991n696j594o070Q818K973k625r75L455L172K013k473N04
$$ y = [-14395, -1502, 2042, 6007, 9846, 19618, 25625, 18223, 10908, 10078, 8175, -6208, -5612, 6298, 16502, 17738, 14625, 9712, 4040, 4409, 4553, 13640, 18114, -262, -16638, -21925, 4498, 1901, 7498, 30275, 37768, 19552, -15871, -6731, 3178, 3326, 4673, 5400, 21404, 24848, -95, -4745, 7346, 9273, 1795, -7739, -16248, -19803, -15495, -14392, -10504, -7182, 9959, 26104, 18255, 11243, 454, -1340, 304, 1415, 12835, 15997, 18351, 20598, 21384, 12681, 11198, 8622, -3428, -12344, -22786, -24607, -34974, -27028, -15490, -15046, -24023, -20651, -11702, -8372, -4848, 2108, 16439, 16616, -1268, -15939, -9040, 5861, 11343, 176, -10401, -20172, -22873, -25357, -10436, -3515, -5920, -5214, 603, -3463, -6820, -3829, -9525, -11119, -17189, -8371, -5398, -8023, -8998, -5543, -2371, -358, -2831, -2327]
15423b327l325K845Q739J540l805N564P65L600l167k293R252N302j684L23p565
15408A3764j2314J0964r119O916J6765J478j089j5012j1268j190J4363r41P300
15395B0617N556m397r118M416Q029L127p072j9151j7282k1J762o650r099R664
15381a9619l26j1077q414K2188J9003O566L206R19O7M171j9205M863R485q779
15367C048N332J7594J2120p159n500j0485n790J724J1742O177n929J6447P353
15354D6674M770j0737k0192j2202L29O178R81P000m920k519n64M262l588r592
15340E880J902l346O139O676m470p376n373K70M57J1195J2325q815j9073j191
15326d800O303K407j3304j985k50J3779K1189P710j7223j0577j3135l887k580
$$ y = [-2327, -5652, -2807, 5932, 7472, 3667, 9231, 9996, 13596, 10429, 8136, 17388, 22690, 21006, 21329, 13764, 1450, 12414, 3295, 10211, 26976, 28454, 27365, 12353, 1085, -105, 14258, 13317, 20617, 26173, 21776, 12658, 17074, 25103, 28230, 21158, 2007, -15275, -15296, -13534, -20184, -29283, -19619, -19945, -31022, -39436, -17248, 1755, 8321, 11527, 12446, 12513, 16684, -2521, 2342, 11827, 3048, 8380, 25974, 38094, 30935, 25435, 14950, 9160, 10884, 22626, 28803, 22874, 39321, 46674, 51444, 40707, 20515, 8313, 8642, 14820, 15801, 22801, 17881, 15362, 14798, 19060, 15472, 5880, 7782, 4436, 10575, 17251, 12781, 5405, 32, 302, 759, 11954, 24279, 15464, -3609, -4800, 1503, 3910, -9394, -11379, -11629, 2150, 23339, 31049, 13826, 3249, -9886, -13773, -16353]
15313a6353J7778m690n769M495l58q382o20J7714N700O61k622L924m468j317P41
15298F434m141J946J7314J2353o763j6359j1024M292l025l540j266R823q418j742
15284d116m696k316O56k591m953J517J0493M172j954O59J2214J81M542o172j4200
15269f564m199J558N600K497l161r605Q360k411p61m17J73J270k136J031k184
15254a0949j68M871m461j157k485Q35P730J2537J284J930k176m539j018k286l266
15239c318J226J868r26j44J493R201j2157l719L953R177j2942k760J3202J9022
15225B3176J908j8365o199J4953n335k0582o446K1668R233K745m548o436j4113
15212h341q943P888J1375k415j1392P417O557J1852m757j1314o722l61M254q127
$$ y = [-16353, 1425, -3265, -9034, -4539, -4897, -13279, -13899, 3815, 9515, 10176, 7554, 11478, 7010, 5693, 6434, 2293, 4239, 21553, 33906, 27143, 10784, -240, 4052, 1027, -2513, -3779, 6044, -2374, -4116, -8812, -11128, -10472, -13063, -18016, -16499, -6006, -1834, -3788, -3129, 9085, 9266, 13808, 7636, -6564, -10763, -9205, -3605, -1108, -4269, -13874, -5514, -7925, -8686, -9103, -8930, -7660, -9796, -8765, -10949, -11117, -6246, -10707, -11864, -14349, -13514, -5784, 6753, 8037, 9967, 7791, 3252, 2234, -52, -3318, -2092, -224, -1150, -1294, 199, 9400, -2757, -6476, -2523, 6654, -6288, -9048, 4154, 23176, 25084, 6719, 520, 15473, 10138, -10444, -16890, 4778, 14011, 16756, 12208, 5772, -8341, -17284, -9396, 1979, -436, -11828, -4411, 2146, 13998, 9241, -2073, -8795, -9156, -4902, -13029]
15198a3029K747J5294J0439m531m031r385L286k117j7695k011K1737L59n774L18
15184d393j3235M733J4000Q082m942p708Q007J1009J2193m859M405j537j4631
15171A1124j0095l855k196N114M619P015P860k525j0519L483K16J2567J3054j4808
15157B1054m095L345m648Q799k1397k0405l292K4147J1935j0148O31o185L430
15144C171J2169j01l931r357q020P767R237q68J5752q614K516L746q445k6437
15130a1415n652J0120L522L4158m799m39j2323j7051r100p023J933J2745j717
15117g041j320J7978k77r467O395N599L197j3198l096O378r062k2619n829Q568
15103b3794M99J945J731N621J4164J075j0370O555J3982j0022J765j1944r837
$$ y = [-13029, -10282, 5012, 15451, 10920, 6889, -2496, 790, -1327, -19022, -21033, 704, 1063, -4711, -4393, -17628, -12895, 1105, 9187, 4245, -3463, 4544, 15553, 27746, 22887, 27292, 25755, 11124, 1029, -2826, -5022, 92, 4711, 11726, 19586, 17061, 6542, 10025, 10241, 22808, 35862, 21054, 16959, 20304, 15656, 24455, 3058, -17347, -20639, 3508, 15443, 5295, 5926, -259, 3171, 15340, 15239, 11308, 1951, -6069, 1698, 10935, 10067, 25819, 17205, 19721, 23467, 15022, -11415, -17067, -6947, -3425, 30733, 25934, 25495, 13172, -3879, -12979, -20002, -18069, -5324, -7041, -8361, 9617, 9340, -127, 6268, 11867, 15064, 1866, -1230, 5148, -3914, -26533, -32362, -23794, -23295, -21350, -19619, -13998, 166, 1241, -9129, -2574, 11408, 1386, 3151, -8793, -18630]
15090a8630J042J553M788P417J0111q313L891K5429L618j3008o91j0167n223n016
15076c199K736N179k796j368L741q34j529p14L430K744l753m266q623K653J5239
15061H640M417p958M23P327o224J4027R62o716p523j6407N826J3303J1476j3103
15047H470k0230N702j7487j0998J4607J3390J2669j2412n497M070R058J4261O12
15034A6215N945o52k395k023j8764j0997M872j980J731l901Q85N942o2J551R032
15019E399J659r77m100L84L141j838J062Ql401J795L99P267Q043k967j0256n129
15003D89q62k837j013K586m653p665o608P967j4122J5050K6162J3948l874j0229
14989A4339l011n679q883N568l168r616P000P720j1109M919J6519l411p789p492
$$ y = [-18630, -17588, -16035, -11247, -3830, 6281, -2032, 1859, 27288, 30906, 17898, 17207, 7040, 1817, -3199, -463, 4716, 1920, 552, 4293, 3459, 1930, 1216, 4646, 7390, 3637, -629, -9252, -6599, 8640, 13057, 5099, 5522, 12849, 6625, 20652, 21614, 14898, 7375, -9032, -3206, 10097, 21573, 8470, -11760, -6058, -23545, -34543, -19936, -6546, 6123, -6289, -11786, -7716, 1342, 15603, 16215, 22160, 21508, 19113, 17090, -1674, -12671, -7799, -9779, -8048, -11949, -11064, -5122, -5184, -3633, 5399, 7058, 6081, 1981, 2365, 5506, 3668, 4730, 4738, 1337, 3132, 3531, 10798, 18841, 15874, 5618, 489, -373, -3210, -4223, -1637, -6290, -13955, -20563, -12596, -26718, -11668, 14494, 28442, 24568, 14339, 11328, 5649, -3234, 2334, -834, -10450, -3450, 4270, -6839, -1920, 14599, 11188, 3399, -4093]
14975d093N232p728O418K8050K1507J418l0492j8694M050l212l209j7722o48M791
14961a4332J1849O844k36j420O629j57j3342J1658P392N096L373Q826M819j2452
14947B4547j3313M464L268m141r01N924R449M323j6020r700j0090K753J1455o482
14933E536n401N072Q559J1108Q948M237j4987j4513K848R776J05k815n856l907
14919H710k317K346m368L79M073m09p801j8828J3622J8040l412p101O188J2870
14905B1992m77j0478k0543J9328J3804j0175o252N176j5872n220J4818J4206j852
14892A8455j2901j5243o845J2064K1229l377L297k624k315k256J3853L040o40
14879B5737r011O08q20L279N307l777l846r68K990O200N509M272j4105q022M420
$$ y = [-4093, 1139, -6589, -171, 27879, 49386, 50804, 20312, 1618, 5668, 2456, -753, -18475, -19123, -14332, -2483, 4361, 4125, 2705, 9334, 9177, -4165, 7493, 14885, 19981, 23354, 32180, 36999, 24547, 11234, 15698, 18966, 14825, 13924, 19848, 29297, 33620, 17600, 7900, -2190, 563, 12018, 5536, 135, 5207, 13766, 24874, 33822, 38059, 23072, 8559, 11407, 21183, 21288, 18473, 12617, 8710, 6393, 8739, 4371, 4750, 8823, 8414, 613, -18215, -4593, 13447, 10035, 2934, 9122, 21992, 21515, 11037, -9506, 9822, 23626, 13451, 7199, 12375, -3497, -8717, 6101, 20307, 18455, 5554, -9689, -16534, -4470, 16759, 13382, 16679, 14055, 11740, 9484, 23337, 26377, 25737, 16726, 17334, 16514, 19793, 25100, 21323, 17477, 16509, 19499, 25699, 31208, 35480, 21375, 13353, 17773]
14864A7773R864R658P080j2597n182O096j1863k564n281j826J2300j3384l519
14851F555m392J5888J6803j4424j0919o101m818Q480J0443R2l621m737l24m010
14837D915j925J142R042J0434J0302J693j0987l413l495J5461L298J296j0231
14824B7532j0661M182j4923r010J0009J0848q285j1014M136j0499j4001J878Q933
14811a0875K1354l669l798J5394O587o630M688j3366l0417Q24J0577O156N248
14798B073J1335P639O252R383l891j7199k0913j5462J047R990J0028p342K916
14785d144K5331J6208M791j2790k922L834m120q410j174J7677m603k906J00k408
14771B4464p37o088r06J2058r287l378m620K717p505M307j250K164j902J680M376
$$ y = [17773, 27637, 37295, 44375, 31778, 26596, 32692, 20829, 18265, 12984, 11158, 23458, 10074, 6555, 2163, 18051, 34854, 20430, 9511, 3410, -1408, 7072, 17515, 17607, 13986, 9249, 8925, 4915, 2990, 4132, 13174, 23608, 33910, 35603, 24616, 21203, 17708, 33169, 36467, 37763, 27532, 16871, 21053, 6130, -2880, 7129, 17977, 9692, -1322, 2814, -7685, -21686, -19808, -10875, 10479, 6810, 3012, 18406, 24993, 18363, 23051, 9685, -20732, -19908, -9331, -3175, 2073, 13408, 21047, 27299, 36682, 32791, 15592, -5321, -20783, -19736, -9746, 282, -7060, -4144, 21187, 37395, 42186, 29396, 26474, 30308, 26188, 17778, 16604, 34281, 29678, 26772, 26872, 24464, 23727, 17639, 16733, 28791, 19504, 16126, 11506, 14223, 6718, 11025, 9775, 11939, 10037, 11717, 16093]
14756A6093n9o624o951J0232j4126j4565N978M663n546o300J4971J2997J7421
14743B8184K661n357j2753k819k239p688j434r7P786J5441J6778j5842m519R160
14729B7262J1757l981K11j6545j8692j0737N875n485o908J6658P005k060j5024
14716a0664P123J0158J4121R620l706j6403p803Q93K4114J3393q569j4841P596
14703B5032N271J9106j2814k5511j4463K187j545O363K839k236o760j2516J4035
14690a012R965M475K2662N763p450r180J0777k795M910j508n848m946k379k489
14676B0945j7685j014P124J1827l245j1835p452Q201j966K464J2560J2017M646
14663C6587n733j6621o111n952M225r706j5545R227N619J450L778K291P180J2858
$$ y = [16093, 16034, 9410, 2459, 12691, -1435, -16000, -10022, -5359, -10905, -17205, -2234, 10763, 28184, 30845, 25488, 12735, 9916, 7677, -11, -1445, -1542, 6244, 21685, 38463, 22621, 18102, 27262, 39019, 35038, 35249, 18704, 12, -10725, -4850, -10335, -17243, -585, 6420, 4360, -10664, -3541, 6617, 20738, 30358, 26652, 10249, 2446, 3339, 27453, 40846, 32277, 17436, 25032, 30303, 49409, 36595, 11084, -3379, -1192, -2737, 3626, 6465, 4229, -2531, -15047, -1012, 8953, 13428, 36090, 41853, 34403, 25223, 36000, 33205, 38115, 36607, 30759, 25813, 23434, 20945, 3260, 2246, 9370, 21197, 17952, 6117, -1335, 6866, 4900, 7364, 19924, 31941, 36587, 30854, 14233, 8122, 2170, 6395, -3311, -18856, -9629, -4010, -2560, 1218, 3509, 10689, 23547]
14649B3547j5554j5176J1072P334j3875N38J3762p093n268l628J3135M220j4966
14636a952P845p880J102P321P22J3369Q579j0894L727j768j6886k420n96j995
14622a726J5515L35K94J4697K065j2596J123p640J212q811L421K687M164N088
14608A9828J7468j672k0166j5804m299M815R506M489K838m786J329N50o818j860
14594E418p650j0398J7560L860n102j372J4704J564l52J0566J1163J495q380K00
14580C3276r752J1019j0982n972P307L174M446R926j7402j6605l641j350J6m160
14566g00J6412J4221K714m754J079J1450r714o141R948L894Q098n693Q469M282
14552E3565o281p157k245m081O263K787r586j6434j670J5068L787m652j7187o805
$$ y = [23547, 7993, -7183, 3889, 11223, -2652, -2114, 11648, 4555, -713, -4341, 8794, 13014, -1952, 5893, -1987, -885, 6436, 7158, 20527, 29106, 18212, 21939, 20171, 3285, 865, 269, -1726, 13789, 14124, 14418, 29115, 31180, 18584, 19707, 12067, 13279, 4468, 7889, 10576, 14740, 19828, 37296, 35624, 15458, -346, -4645, 170, 9676, 14165, 17003, 12217, 13546, 14096, 7278, 5418, -2232, -12630, 4930, 8790, 3688, 2316, 17020, 18584, 18232, 28798, 39961, 41456, 33076, 33276, 23524, 34543, 23561, 17589, 24896, 28070, 32516, 42442, 25040, 8435, 4794, 3444, 3460, -700, 15712, 29933, 32647, 27893, 28972, 40422, 30708, 24567, 34515, 38409, 46507, 40814, 49283, 53565, 47284, 40127, 37882, 33801, 40064, 42851, 33265, 16831, 15161, 30229, 34016, 29364, 12177, 5372]
14538E372N699J2852N35l671r038N475J4445M955K518j854o597j2985j2383J20
14524E443J8957r64j652P273n361K50n350n321N127J1866j1681K309q74K0135
14510D0157J624q402K563J1586j2969j0053j7397K822j420J0551N975n32J62o886
14496A7781j3740l467Q411L145k265M002R060J237l168j881Q522R381k3o70j0535
14481B5790m797K147l660N369P188j0131p664J0589K899M830J0487J64K981K52
14467D6444l898p595K575o595K537k242o824K570k286O559P41o06j0531M375N082
14452C0306J1196k798n812O999m514J0831K889P36r072n389j04Q648j2836j1268
14438A9812j4540M389J1918n128J4059n969j511L712k961Q804p901j7339q229
$$ y = [5372, 11071, 23923, 24458, 20787, 11749, 17224, 31669, 36624, 39142, 37288, 30691, 17706, 5323, 5443, 24400, 23436, 21784, 29057, 23696, 23946, 18596, 13275, 18402, 30268, 18587, 20896, 20022, 40157, 41781, 33379, 35942, 47528, 34559, 24506, 7109, 9931, 8511, 19062, 25037, 24505, 24667, 17781, 4041, 574, 8985, 12130, 9865, 13867, 22927, 24164, 20996, 19115, 27637, 37018, 36995, 36325, 25790, 20993, 23140, 19480, 24849, 32037, 21906, 14242, 24831, 27730, 32560, 43047, 43211, 46192, 46444, 42546, 34951, 37526, 30931, 33468, 31226, 24402, 26972, 24686, 31245, 31986, 31380, 20849, 25224, 30306, 41502, 38704, 32892, 39891, 35377, 46208, 49097, 49833, 40761, 35372, 35268, 43916, 31080, 19812, 5272, 9661, 21579, 16451, 30510, 24541, 23030, 26742, 23781, 32585, 24684, 7345, -884]
14425h84p670j0612K0752R162p379P097k922j3780K456O732J0222K6574j0836
14412B8912j818J4159k087p374j183j7762q165J1044j151L621o173L294J2794
14399B8111L197m732j2698o727l177K581K458k574l463n252J6854M777N70L419
14385B3344p34P625Q228q617K80n008J0758K774k639j2563o37J149M406K604j6079
14370A4891j0232N832N395j427L092M771m663P34O154J5525r41J0271j2667j1436
14356B5299Q326J5813J805j1522J011k656j0194k274k489Q164r751j1296J5229
14343B5465N602J8569J1662k0962j7605j1143L08P022J2908J3542R781q395m702
14330D2052m664j0163o313O667n935J21l604M300p459m943Q438L507J6446Q350
$$ y = [-884, -8554, -19166, 1586, 10748, 3369, 10466, 7544, -6236, -3780, 2952, 13174, 39748, 28912, 27094, 41253, 39166, 31792, 30609, 12847, 4682, 15726, 14575, 18196, 12023, 15317, 28111, 31308, 26576, 13878, 7151, 3974, 6555, 9013, 6439, 2976, -2276, 14578, 19355, 19925, 23344, 22610, 30235, 38463, 29846, 30126, 25118, 35876, 38650, 36011, 23448, 22811, 23960, 28366, 30970, 14891, 4659, 10491, 15886, 14459, 17551, 22322, 17659, 18393, 24547, 40072, 39131, 49402, 36735, 25299, 33625, 49438, 51243, 39721, 40732, 38076, 27882, 25608, 23119, 31283, 21532, 10236, 25465, 31067, 49636, 61298, 40336, 22731, 11588, 11896, 18918, 31826, 45368, 55149, 46754, 42052, 37388, 27225, 20912, 27579, 21644, 21765, 18161, 22461, 15002, 10059, 18497, 22004, 38450, 46800]
14316D6800K767q324q600r691O127P97j200j4332m00O097J7937p243j0694J4997
14302C5038Q818m582j0008j8376P30J1742J3904K921r814Q165k020J417q976J146
14288C0105J4440J2152R468j0891j9108J332n023J6751J98L886p236l234n168
14275C7672R4O753k496p821L027n157j2577k7J6713J2275m11p573M570J2208p580
14260D9670q487l564m287J1763j540L042j7280j4916m6J6618K0549L415j7172
14247C7765j0296K976L290J0345K909k586J2172J30k0898j6743L639J6657q980
14234C0380n754j1321q5m041Q412M934J7249J9102m966j8793j4982J2132J5701
14221D7968k013o773K46n847p472o059p446L994J043M427K491m817P386J5023
$$ y = [46800, 49567, 41243, 32643, 22952, 29079, 29876, 28676, 14344, 13944, 20041, 37978, 30735, 20041, 35038, 43856, 39274, 29266, 10890, 11620, 23362, 37266, 40187, 30373, 38538, 36518, 37935, 28959, 30105, 44545, 56697, 66165, 55274, 36166, 37498, 32475, 49226, 49424, 53310, 46074, 42840, 37672, 37766, 44519, 42023, 34202, 37229, 32072, 19495, 19468, 36181, 48456, 48045, 40472, 45042, 57250, 49670, 41183, 37619, 33332, 45095, 43555, 46597, 29317, 14401, 14355, 30973, 51522, 54937, 37765, 27469, 30445, 33735, 44080, 46989, 44403, 56575, 56705, 35807, 19064, 22703, 39360, 30380, 24626, 13305, 13220, 9179, 17591, 22525, 39774, 58876, 53910, 35117, 20135, 32267, 47968, 45955, 39182, 39428, 33581, 26109, 20050, 12604, 16598, 17641, 22068, 24559, 19742, 27128, 42151]
14207D2151N222r97K008N604j3506k1377k566j514J4211O102L688O052P375N333
14193E7786Q27K847p1j6073n169Q058J3783P558J189j555J81m534l680j6434l939
14178D0774K882M768m190J2236K272M674j530J2436m728M655o470k3360j5215
14165B9204R19J7023J1296R971J1991J9191j585J599j130R930J6202J8145J755
14152A44511J1002l710l723L9751M7367M4116O2625Q6011J34082K18938L42354
14141A123324L51154J77484j01878l19874l55933k55937j77358j16225o2398m3556
14131B18803m8171k3499j3074k5838j6626P855Q386k248j3455j2981N058M119
14119H8329J410N268m217L689j143O34n548o772q621M041Q850m85p976n471J4356
$$ y = [42151, 47373, 46376, 48384, 53988, 40482, 19105, 16539, 15025, 29236, 35338, 39026, 45078, 52453, 57786, 58613, 61460, 61389, 45316, 40147, 48205, 61988, 69546, 70735, 69180, 69361, 64827, 61147, 44713, 40774, 43656, 48424, 44234, 56470, 58742, 63416, 61886, 74322, 69594, 74249, 67779, 44419, 29204, 30123, 47146, 58442, 68413, 80404, 99595, 98010, 99609, 98479, 108409, 124611, 142756, 144511, 155513, 151803, 148080, 187831, 235198, 279314, 341939, 427950, 562032, 780970, 1123324, 1474478, 1651962, 1550084, 1230210, 874277, 618340, 440982, 324757, 262359, 218803, 170632, 147133, 134059, 108221, 91595, 99450, 107836, 105588, 92133, 79152, 84210, 88329, 89739, 95007, 90790, 94479, 93336, 93970, 88422, 81650, 73029, 77070, 85920, 85435, 77459, 71988, 86344]
14104H6344J0453p741j7187k82j0365J982R677j9952N221N974R433O05k130m136
14090F7896J315N615j2831j0382q754M995J7316j097q714L330p777R269J3865
14077G4046P959o094l909Q192J377j3443n797M885J293p010j5437J882P226J5858
14063G1028k0261j1902K0834K4347j3276p07n044j0538J1799j0798j2647P056
14051D9891M912J1733J3612L589j6461j3702K224Q2j3083O588R509J3297L200
14038G5391j2354j646J0743j2260j2771J970J3154K0739K770j1797j4987p150
14026E1802M233K2121j1712l838j4160l689j695Q601j159p860J678J511J395J7177
14012F4405J968J3935N978j900p888j1652j2386q940O266j074J4074K4895K637
$$ y = [86344, 96797, 89056, 71869, 71587, 61222, 63204, 72881, 52929, 58150, 64124, 73557, 74162, 72032, 67896, 69211, 74826, 61995, 51613, 42859, 47854, 65170, 64073, 55359, 58689, 50912, 60181, 74046, 82005, 75911, 72002, 80194, 81571, 68128, 62331, 67216, 68509, 61499, 46062, 47944, 55170, 71028, 50767, 38865, 59699, 84046, 70770, 70063, 65019, 54481, 66280, 55482, 42835, 49891, 54803, 66536, 80148, 83737, 67276, 53574, 55798, 55880, 42797, 49385, 58894, 72191, 75391, 63037, 61391, 72134, 59874, 47103, 49073, 62227, 82966, 85736, 73939, 58952, 51802, 56035, 78156, 66444, 62606, 48446, 44757, 43062, 51663, 50504, 42644, 44322, 45833, 47228, 64405, 66373, 80308, 86286, 84386, 76498, 64846, 52460, 43520, 49786, 48712, 62786, 87681, 90318]
13999I0318j3134K348O398J5196k533p681r958L616N239j078P36J0110r644m35
13985H9498n154j3442O329K3696J9245j840j7125J823K609r438q631q384J459
13972H0645J7664K147Q090N221M162l5487o907O766R414P066L218J5781l376r55
13958A13449j162M548K0505N633m98J310J4713J6935M611K4053L0960J8231K1382
13945B74670N8652N5575J5250l6652l5123q821k0779k6362m0057n6432m7692k5448
13933A06781l750j373m039j4086k488J1947O811o05j459J1204K0680J901j7049
13920A14475Q660K1143J4750J8236L872n707M905R043N023j0672q881k266P498
13907A80079m288j8105j9371J611J3764J0028L30j592j0882K705R393P472j583
$$ y = [90318, 77184, 79532, 85930, 101126, 98593, 90912, 80954, 84570, 89809, 88731, 89467, 99577, 89933, 89498, 84344, 70902, 77231, 100927, 120172, 118332, 101207, 103030, 105639, 96201, 87570, 79186, 80645, 98309, 100456, 108546, 113767, 117929, 82442, 75535, 82301, 91715, 98781, 101999, 117780, 114404, 113449, 112287, 116835, 137340, 142973, 142475, 143785, 158498, 175433, 180044, 204097, 235057, 253288, 274670, 333322, 388897, 404147, 367495, 332372, 323551, 302772, 276410, 236353, 179921, 132229, 106781, 103031, 101658, 97619, 83533, 81045, 92992, 99803, 99198, 97739, 108943, 129623, 131524, 114475, 123135, 144278, 159028, 177264, 181136, 175429, 180334, 189377, 194400, 183728, 174847, 172581, 180079, 175791, 157686, 138315, 139926, 153690, 163718, 164048, 162456, 151574, 154279, 163672, 171144, 169561]
13894A69561K3764j0552K833K3558J9701K2936J0360m012q118j1942N29O8j3507
13881B25179k8849j8748j3091m305J0406L0193J3761P540l622o045K6403Q274
13869B47096L731J1267J0819J4817J989q831J0379k556q117Q819K5090L4268J7449
13856C66220L1363L1346L7403N8436O1665O1757P6218Q2773J06017J38992J76930
13845A229120K23213L06919M38170O03050Q53466J195105J409316J097191J59520
13836G515070q93894j391806j266595r62372o93947m89211l52754k54611j87828
13827A022052j45895j12293r0854n8986m1268k1797k9450l1444k7192o3139p8488
13816C21246m7134k7839k0690r936q845n547j833m596n954R92K1603K0599L3436
$$ y = [169561, 193325, 182773, 185606, 209164, 228865, 251801, 262161, 258149, 250031, 238089, 238618, 238686, 225179, 196330, 177582, 164491, 160186, 170592, 200785, 214546, 222086, 218464, 212419, 238822, 247096, 250827, 262094, 272913, 287730, 289719, 280888, 291267, 288711, 280594, 289413, 314503, 348771, 366220, 397583, 428929, 466332, 524768, 586433, 648190, 724408, 807181, 913198, 1052190, 1229120, 1452333, 1759252, 2197422, 2800472, 3653938, 4849043, 6258359, 7355550, 7515070, 6621176, 5229370, 3962775, 3000403, 2306456, 1817245, 1464491, 1209880, 1022052, 876157, 763864, 673010, 614024, 572756, 550959, 521509, 490065, 462873, 399734, 321246, 274112, 246273, 225583, 215647, 206802, 201255, 199422, 194826, 188872, 189864, 211467, 232066, 265502]
13803B65502K4702m845Q52K6563J1123p611J7803K9679L220q945l9947j6099j6060
13790B85937n121J5896M554j6688k0758r34O565N797J2386J3080K2980p70P08
13777C23632l729K433K8211K1243O535J8319Q585K0117R569J2330K0934J8730
13765D86909J1662M388J4333J2517L622L0136L3097L5647M3108J2903J0329r552
13753F89099J3527L8358K5412J7820J4861K3367L1510M1579L5358K1489L4829
13742I87209L7386M3619M7075M6613L0300J7243M2740L3175M9901O4289N2873
13731A452423Q7045Q0738O7944O8979P3853Q0940R4809J11172J33399J53169J58335
13720B562806J51690J60056K03407K25220K76299L45913M09314M65318N01780
$$ y = [265502, 290204, 285359, 286211, 312774, 323897, 316286, 334089, 363768, 366988, 358043, 318096, 301997, 285937, 280816, 296712, 301266, 284578, 263820, 262886, 269451, 275248, 287634, 300714, 323694, 322924, 323632, 319903, 322336, 350547, 371790, 378325, 396644, 405229, 425346, 434915, 447245, 468179, 486909, 498571, 502959, 517292, 529809, 533431, 563567, 596664, 632311, 675419, 688322, 698651, 689099, 702626, 740984, 766396, 784216, 799077, 822444, 853954, 895533, 930891, 952380, 987209, 1024595, 1068214, 1115289, 1161902, 1192202, 1209445, 1252185, 1285360, 1335261, 1399550, 1452423, 1539468, 1620206, 1688150, 1757129, 1830982, 1911922, 2006731, 2117903, 2251302, 2404471, 2562806, 2714496, 2874552, 3077959, 3303179, 3579478, 3925391, 4334705, 4800023, 5301803]
13711E301803N66859O65580P72236Q50652R90057J239600J596885J993826K403492
13702A6380990K832751L356249M037852M941117O282030Q394647J1832268J8111277
13694G6169181K9557496M8080997O8933232O7758109K9257338k6544187o6874323
13687B26337843o7629153m9117716l1996926k0632986j3987047j0006529p361922
13680B5605564n548094m113353l006828k217993j677516j290879j030153q67176
13672E853572p38193n93871m79011l82219l18657k58920k04932j79902j76685
13663B521182j81672j86735j61278j42302j35129r4982q2001q2179q8401q2660
13653A283843q1482j02563q8860o8473n5404m7105l9411k8585n3328o6918m0020
$$ y = [5301803, 5868662, 6534242, 7306478, 8157130, 9147187, 10386787, 11983672, 13977498, 16380990, 19213741, 22569990, 26607842, 31548959, 37830989, 46225636, 58057904, 76169181, 105726677, 153807674, 222740906, 290499015, 319756353, 293212166, 226337843, 158708690, 109590974, 77594048, 56961062, 42974015, 32967486, 25605564, 20057470, 15944117, 12937289, 10719296, 9041780, 7750901, 6720748, 5853572, 5115379, 4521508, 4042497, 3660278, 3341621, 3082701, 2877769, 2697867, 2521182, 2339510, 2152775, 1991497, 1849195, 1714066, 1619084, 1537083, 1454904, 1366503, 1283843, 1202361, 1099798, 1010938, 942465, 887061, 839956, 800545, 771960, 718632, 651714, 611694]
13642F11694j8964k6255j8945m2256k7661k2416j5198j0678j3352r430J375P691
13630D15605j6576r496L933r944k1605l6992j3428L190J5732K047J4776K0276
13618C67518K3417O624m384j2076j2898O282j3223j1012j9574j5903j3121j7339
13606B84311P311R66J1632P610j7488k1955j9372p908J718j2003m104r401p015
13593B14302j3828j047J714j8459J754n436j6282k303J1542P77j0466k746J3727
13580A73249J0394N999n421q888k483K630P599J9030K2803K6486P500r236J688
13567B51350K7757K5527P744o664m320l2119m3297l6270j7096k5175j8871j8649
13555A09917j0365l288L465l259j7097j0523j1448j6951r706J4585j8418k8773
$$ y = [611694, 592730, 566475, 547530, 505274, 477613, 455197, 439999, 429321, 415969, 406539, 407914, 415605, 399029, 389533, 393466, 383522, 361917, 324925, 311497, 314687, 330419, 332466, 347242, 367518, 390935, 397559, 393175, 381099, 368201, 374483, 361260, 350248, 330674, 314771, 301650, 284311, 291622, 292588, 304220, 311830, 294342, 272387, 253015, 245107, 246825, 234822, 230718, 221317, 214302, 200474, 199427, 201141, 182682, 184436, 179000, 162718, 160415, 171957, 172734, 162268, 159522, 173249, 183643, 189642, 184221, 175333, 172850, 175480, 183079, 202109, 224912, 251398, 258898, 249662, 251350, 279107, 304634, 312378, 305714, 301394, 269275, 225978, 189708, 172612, 147437, 128566, 109917, 99552, 96264, 99729, 96470, 79373, 68850, 57402, 40451, 30745, 45330, 26912, -1861]
13543a861k5621k1499n672j5779k4789j1413M758L0833P1146N6191P167R780J6503
13530H9744J811l765K104j609j6998j6596l025R618J3290K8002K1569p574l567
13517A13004q748l1125j9961k4261q788O832l159k218o580q993o88n264K589R769
13503A2409J1544j98Q514J5225k3151m1683j5135j7836j8127j2539j2397O283
13491h7091J3141R849O344J4188o812J931J0015K33K474N69K462Q545L42N04J7694
13476e612L877k222P501j1866k0603k2880j869J4348j358L723J6201n971j0918
13463c7649j340l424J2548J9532J4446j279J2076K292q068Q165P377k098n70N744
13449B7752l437J0685M250J6960l370j8377j841J1104j1802M243j6575j5137J0888
$$ y = [-1861, -27482, -48981, -54653, -70432, -95221, -106634, -101876, -71043, 103, 56294, 63461, 73241, 89744, 91555, 87790, 89894, 88285, 71287, 54691, 51666, 61284, 74574, 102576, 124145, 116571, 113004, 104256, 73131, 53170, 28909, 20121, 26953, 23794, 21576, 14996, 6003, 5315, 51, 2640, 12409, 23953, 23755, 32269, 47494, 24343, -17340, -32475, -50311, -68438, -80977, -93374, -87091, -73950, -64101, -57757, -43569, -50381, -48450, -38435, -38202, -35728, -35159, -32697, -24152, -23810, -23306, -5612, -1735, -3957, 3544, -8322, -28925, -51805, -53674, -39326, -40684, -36961, -20760, -26731, -37649, -38989, -42413, -29865, -10333, 4113, 2834, 14910, 17202, 9134, 17299, 24676, 22578, 22008, 27752, 24315, 35000, 39250, 56210, 52840, 34463, 32622, 43726, 31924, 36167, 19592, 4455, 15343]
13436A5343r583k2219k2091M304Q158L049q59o147L335P876J2040j0281m885L4
13422b1926o586j4448j2714O055J3375J719K641J916j3424J271J4548O887m41
13409b1127L486J969r11P774N514j5263J176p118r440J612L892J0973K161n435
13395b0737M428l10j40o638M246n36M921J1791R170R558R329J9218N307q010o18
13380D0979r482k2179j538K00J364J142N323K504o153k1067r387o044O72K24K43
13365b3199J552k143N395O254Q430p996O204L768r594j2555M164K467q835O202
13351a9886J3369K022N361K560k351k576l67J147l499j809r9j0353O806M523r690
13336a4842j3598L729L589J8405J0392o316L70r826L082m344l424k594P992L595
$$ y = [15343, 5760, -16459, -38550, -34246, -26088, -23039, -23898, -30045, -26710, -18834, -6794, -17075, -21960, -21926, -28512, -42960, -55674, -49619, -36244, -34525, -31884, -29968, -43392, -42121, -27573, -20686, -21127, -17641, -15672, -16583, -8809, -3295, -18558, -17382, -24500, -33940, -32328, -28436, -17463, -15302, -20737, -16309, -16619, -16759, -23397, -19151, -19687, -14766, -2975, 6195, 15753, 25082, 44300, 49607, 41597, 40979, 31497, 9318, 7780, 7980, 9344, 10486, 15809, 18313, 12160, -8907, -18294, -24338, -23666, -23442, -23199, -21647, -23790, -18395, -12141, -3711, -11707, -5503, -1735, -11329, -23884, -19720, -17253, -26088, -19886, -6517, -4495, 866, 3426, 1075, -1501, -1868, -721, -4220, -6029, -6128, -16481, -9675, -5152, -14842, -28440, -24711, -21122, -2717, 7675, 1359, 1729, -8097, -5015, -9359, -12783, -15377, -7385, -3790]
13322c790R552J2161j4668n301j381q159J0913P741j6772n698q825L333n046j4452
13308d0392o467J6343q77J4046J6659N106O65j0435K403N202p558k579Q382p277
13294f779j4345k807M178J0303J7495j0392o955O151J2169n883o991J9641j556
13281A4229j2275N7l391l570r332k990Q247o092j33K1507M195o846R916J9790
13267C3312m909j1648k611m167r507m124q580J940N537J9279R413o099J3453K3532
13253E4821L381q333J3851J6760R417k301O779P312Q504R543J8129K1386L1157
13240A90406N5752O1826Q5053J53515K46733L45256L25126J42752j39516l21258
13230A145645l16462k48969j73419j14020o9156m0486n5075m1796j4198j0638
$$ y = [-3790, 5762, 17923, 3255, -2046, -3427, -11586, -673, 7068, -9704, -15402, -24227, -20894, -25940, -40392, -46859, -30516, -31393, -17347, -688, 4418, 5083, -5352, -2949, 2253, -5305, -7884, 498, -6779, -21124, -23931, -19753, -9450, 8045, -2347, -9302, -3151, 9018, 3135, -3856, 15785, 14229, 1954, 2011, -1380, -4950, -14282, -17272, -9025, -15117, -15250, 6257, 10452, 3606, 13522, 33312, 28403, 16755, 14144, 9977, 470, -3654, -12234, -10294, -4757, 14522, 23935, 17836, 31289, 54821, 58202, 49869, 63720, 80480, 89897, 87596, 94375, 101687, 110191, 119734, 137863, 159249, 190406, 246158, 307984, 393037, 546552, 793285, 1138541, 1463667, 1606419, 1466903, 1145645, 829183, 580214, 406795, 292775, 223619, 183133, 128058, 86262, 72064, 61426]
13220F1426k20R5o306j3507j2252r857j7366l391P396k408Q025N322j0402j2007
13206e452K25Q606j0815J816J446J1477M561k372j4772K757J4526j0662K862Q459
13192A2662J6760m789l3247j4342P606m737O893J0284M049n600o921K378R051
13179D7p357N991M241j5727J662L936N290L229N117o529O34N241j7857l302J1397
13164c987O241Q980J937j7249J0134R949L833q527o37j43m297O223j6173n313
13150i029j2621J0156K823j7140j7166K9115L7165K138K23r196q508j111Q15m446
13136C218j0750m569K702J1275O221J351J3518J0700j8321j5874r767P30n415
13123a4981K254N592M655r224j220j636l337J0010L686Q284P9P044L411K252R771
$$ y = [61426, 61206, 61301, 54995, 41488, 29236, 19379, 2013, -1378, 6018, 3610, 11635, 16957, 6555, -5452, -5227, 3379, -7436, -5620, -4174, 7303, 11864, 9492, -5280, -2523, 12003, 1341, 4203, 12662, 29422, 24633, -8614, -22956, -15350, -20087, -13194, -2910, 1139, -4461, -11382, -9004, 47, -7310, -1319, 2922, -12805, -11143, -7207, -1917, 1312, 6429, -100, 534, 5775, -12082, -15384, -3987, 2254, 11234, 13171, -4078, 6056, 16005, 19838, 11311, 10674, 10531, 6234, 12457, -3716, -9029, -21650, -11494, -8671, -25811, -42977, -13862, 23303, 25441, 25664, 16468, 7960, 6849, 7664, 3218, -7532, -12101, -9399, 1876, 8097, 9448, 22966, 33666, 15345, -529, -10296, -9566, -14981, -12727, -7135, -2480, -11704, -12924, -14560, -17897, -7887, -4201, 4083, 4162, 11206, 14617, 16869, 26640]
13108B6640m595J253q608j1663j0151J982J5522j385j0194p231o443j1154J4214
13095a1813J3839J480M76J917j578P876J162J3201J1289j0104n531r161j9073
13082f020j3890J1323J6569M846r965j546L457N260o11O198k91j0724o684m842
13068f920P185k328Q325K515o076j0705j9870r993R974L924J050O371k254O612
13054a2190J3263J3714p180N228o079o382j4512J340J6759J6046k283r625k3279
13041a5180j1396K7061J342J4187K988j8059J620l374q723P401l36Q877j0034
13028c626o556M691j2389j085J2586P164K352M67O817J0975J3001Q665K0110J6403
13014G9575K4916q223m0856k7897k5757j9936J897R099j0416L724k953Q361Q466
$$ y = [26640, 22045, 23298, 14690, 3027, -7124, -5142, 10380, 8995, -1199, -8430, -14873, -26027, -11813, 2026, 3506, 3982, 5899, 4321, 12197, 13359, 26560, 37849, 27745, 22214, 13053, -6020, -19910, -8587, 7982, 12828, 2863, 1317, 4774, 10034, 9423, 15621, 15330, 4606, -2078, -6920, 265, -2063, 6262, 8777, 2701, -8004, -27874, -37867, -27893, -23969, -22919, -16548, -18802, -12190, 1073, 14787, 7607, 12835, 6756, 374, -14138, -12798, 3961, 20007, 17724, 8099, -15180, -26576, 485, 1827, 16014, 19002, 943, 2563, -811, -9534, -2133, -2469, 6408, -3626, -10182, -5491, -17880, -18965, -6379, 785, 3137, 3604, 10421, 21396, 34397, 43062, 63172, 79575, 104491, 96268, 55412, 27515, 1758, -18178, -16281, -7182, -17598, -13874, -16827, -8466, 0]
13001@P220J3214P701j0041r152O155r286j8136M353O271l749O191K420p417K871
12986a385J673m575q743l380nM438l540J81R801j12M279J393l342o073Q509n478
12970f359j7760o67N352P760J2534k000j676P556N687J42K67k485j9158j6203
12956b7010N263J0983L491r044K732K4777K6630n291r936k1063r772p939M659
12943a1520J404k979K6074J6840J4492n126k4316j4652O753J5427R95Q589L992
12930C5973p61p697j9029r533J8576L468J0774L25r165n222k731j0769j7520K576
12916a0735Q581L212K375J767n323J770Q573j1241j2545Q155K8181J1238j5796
12903A8212k086J2498m245n698j4113K47P058J055j2120j686J2204n621q213L798
$$ y = [0, 7220, 20434, 28135, 18094, 8942, 15097, 5811, -12325, -7972, -1701, -5450, 741, 3161, -4256, -1385, 288, -4287, -13030, -16410, -16415, -11977, -15517, -15336, -5535, -5647, -1368, 25, -3317, -9390, -881, -6359, -24119, -24786, -19434, -11674, 860, -1140, -2816, 4740, 10427, 10569, 10836, 8351, -10807, -27010, -21747, -10764, -7273, -16317, -13585, 11192, 37822, 32531, 22595, 1532, -8240, -16179, -11520, -10116, -13095, 12979, 29819, 44311, 39185, 14869, 217, 6970, 22397, 23392, 31981, 35973, 35212, 27515, 8486, -1047, 17529, 20997, 31771, 32096, 22931, 17709, 14978, 4209, -13311, -10735, -2154, 1058, 3433, 5200, -123, 1647, 10220, -1021, -13566, -5411, 22770, 34008, 18212, 16126, 28624, 24379, 18681, 4568, 4815, 11873, 12928, 808, -878, 11326, 5705, -2508, 1290]
12889A290J1731R747j4497j4523L952M431j131Q521M399p464N396N46r824j873
12875G01j049Q170J2186j3734n721M389n507R724p407n404o295Q979K830l196
12861a334n527J353Q886K727r91M654R659R66l652Q25n50j2309j077Q355J5459
12846B7444k813p0j2820k0762o094r576j320K0725K1080J442N690o841m602j709
12832I774p271j2384J0049J1906P420O755j3246M633J8557j0889k3775j3942L976
12819h437R890q46m112j341Q597l895j0364J1683J1950l533M691J8455r163j6355
12805G220N76M150M139k790l826N719N218J397r489j0731K206L695j750n666k514
12790b446Q470J1895R102N064j3094j2398M823R36n491J862j1865J1369O855O525
$$ y = [1290, 13021, 22768, 8271, -6252, -2300, 2131, 1000, 9521, 13920, 6456, 11852, 12398, 2574, 701, -348, 7822, 20008, 6274, 553, 4942, -565, 9159, 1752, -3652, -9947, -968, 1862, -1334, -6861, -5508, 3378, 6105, 5114, 9768, 19427, 20393, 16741, 17566, 17016, 4707, 3630, 11985, 27444, 24631, 24561, 11741, -9021, -15115, -24691, -26011, -5286, 15794, 17236, 22926, 16085, 11483, 9774, 2503, -9881, 168, 12074, 19494, 26249, 13003, 17636, 36193, 25304, 1529, -12413, -8437, 1453, 607, -3505, -4846, 3751, -144, -10508, 1175, 13125, 9592, 14283, 32738, 23575, 7220, 7796, 11946, 16085, 13295, 9469, 15188, 20406, 21803, 12314, 1583, 3789, 7484, 5734, 68, -2446, 6024, 17919, 27021, 32085, 18991, 6593, 11416, 12352, 6861, 8723, -3142, 8227, 15082, 21607]
12776B1607P438j0543k4K1531o910j140P454j060M643j371k59j6841J68j147j5880
12761G666q661J2345N525l753r627J4224K782l428k873p709j1479J6682j746o253
12747C695N685M411j851n196M136n566j4206Q578J779J5734P131l145Q58l967
12733A8076K817J5335K702k51l159q518m26J253P289M140j6190j1269J5877m89
12719B7187q663P040M44k0284n781Q697K373N302R74O835J5338j2962n096O701
12705B8105m356n328n899j8457N604L963m517j921M670L198m56o846M322J1334
12691A3416R856q196J675L943n736o526p937K602n597J2546K0345J4881j2573
12678C2699j7369o09O08K805L052r230j7051r819M709K2485J3119p583p812l494
$$ y = [21607, 29045, 18502, 18478, 40009, 33099, 31959, 39413, 38353, 42996, 41625, 41366, 24525, 24693, 23546, 7666, -995, 11350, 16875, 13122, 3495, 17719, 20501, 17073, 14200, 6491, -4988, 11694, 9948, 3695, 9380, 13791, 11940, 6744, 10880, 5314, -8892, -314, 1465, 17199, 24330, 21185, 22043, 18076, 20893, 36228, 38930, 38679, 35520, 27002, 26576, 27829, 35118, 39258, 23068, 11799, 27676, 27187, 18524, 25564, 26008, 5724, -57, 8640, 11013, 16315, 17289, 24124, 39462, 26500, 21404, 28105, 23749, 18421, 12522, -5935, -331, 3632, -885, -2806, 1864, 5062, 4606, -2240, 2082, 13416, 23272, 15076, 16751, 20694, 14958, 8432, 495, 3097, -2500, 10046, 30391, 45272, 32699, 15330, 14721, 15329, 18134, 21186, 11956, -5095, -14914, -10205, 12280, 25399, 17816, 10004, 6510]
12664F510N98K638J308P410M426l580m165j0447l436R076J7545n811n957K138
12650A8253M261N213J1688j1218q821q018j0197m3J5204J0032M878o200n486P660
12636B7206Q871o720j3247Q181M890J919j0415Q46N971q159O233M591J400J0594
12622D2161k303j7562j0681R004M75K773j246J2208O723j4534n52M221q393R896
12608C2190J4591M696j737L667N986l755j3536j0890P032N968l186p991L752n238
12594C1549j5168J1445M893q619O27J218o047P351K005J3620L004J4247L590j3453
12580E0262n56K194j1776j0467O4K0M228O469n328O613M458K5j1315k189P826
12565D0528k912J530k031k473R294P44k0289r915J2385J6439P600p649n605J28
$$ y = [6510, 7108, 9746, 11054, 18464, 22890, 19310, 15145, 4698, 1262, 10338, 27883, 22072, 16115, 18253, 22514, 27727, 39415, 28197, 19376, 11358, 1161, 1118, 16322, 26354, 31232, 25032, 19546, 27206, 36077, 29357, 16110, 24291, 29181, 31100, 20685, 21531, 27502, 19343, 25576, 30167, 31567, 42161, 39858, 22296, 11615, 20619, 21094, 23867, 22621, 34829, 41552, 27018, 26466, 30687, 22294, 32190, 46781, 51477, 49740, 53407, 59393, 55638, 42102, 31212, 38244, 44212, 41026, 33035, 36787, 31549, 16381, 27826, 32719, 24100, 24727, 25945, 19898, 27249, 29254, 42874, 45878, 60125, 63715, 50262, 49706, 51900, 40124, 29657, 29721, 29741, 33969, 40438, 35110, 41723, 46181, 46206, 34891, 32702, 40528, 37616, 39146, 37115, 34642, 43936, 44680, 24391, 14476, 26861, 43300, 50900, 43251, 37646, 37774]
12551C7774l117m873J4857r997M928L689L258J940n105J6883P858J268o032J50
12537F3481q184j204m774l298O774r412j425r240N7K153j987J744J922K576n979
12522C3204R812L129q831O604N341j4922L144j0718l345K8678J8697j0756k1632
12509C8405j0934K586P823Q648m164J0987J9699J939j2041k157L123Q12j0059
12496E4667M236m463M799J0485m72j0320j1157P873J738N902L060k370j2939j0449
12482D0590N477K07Q151J5474k927j8831Q277L768j0083j174o605k809J407J3426
12468E4348l79k764p319J942j077O566N847Q322J400J2860J73j8007k8590p701
12454B5621J8000K1804P947m958k7367P71J6116J4760K849r193l592j098o122
$$ y = [37774, 34657, 29784, 44641, 34644, 39572, 43261, 46519, 48459, 43354, 60237, 68095, 69363, 63331, 63481, 55297, 54093, 49319, 46021, 52795, 43383, 41958, 32718, 32775, 34928, 32941, 34685, 36607, 39183, 33204, 43016, 46145, 37314, 43918, 49259, 34337, 37481, 26763, 23418, 52096, 70793, 60037, 38405, 27471, 30057, 37880, 46528, 42364, 53351, 73050, 74989, 62948, 60791, 63914, 64726, 54667, 58903, 54440, 59239, 69724, 69252, 58932, 47775, 55648, 57386, 63288, 66348, 63978, 51039, 40590, 46067, 46274, 54425, 69899, 66972, 48141, 56418, 60186, 50103, 48929, 42324, 39515, 40922, 54348, 53969, 51205, 43886, 45828, 44751, 51317, 57164, 65486, 66886, 79746, 79919, 61912, 33322, 25621, 43621, 65425, 73372, 68414, 41047, 41818, 57934, 72694, 75543, 66350, 62758, 61660, 55538]
12441E5538p51K502q964m090j097m44O685J5572R888m656N258J722j346M903P035
12426H7755j0207j1092j287N292N743L956j800j0395j1145O208L635J7812P49
12413H5224p064l905j87J0207l10k730r55j4530p065p14Q351q784j3822O931P013
12398E7660M382L865k751o327P586N656m806q03M389M008l699l047M912L670p194
12383F7501R957n526j6033j0455L565N059J753r198j49O339J3209o319m092Q556
12369F4167O385j143nJ345q825n906R139J2303j528j0813j3840J0775J1973m862
12355F9165r573J0891r220k7J0859P314n869o95J1581J1928j239M160J773o457
12341I4591k421m953j0885N616j0364r82Q264N996j0214O787M733r62j283j1916
$$ y = [55538, 54787, 57289, 48325, 44235, 43138, 42694, 49379, 64951, 74839, 70183, 75441, 77163, 75817, 80720, 87755, 77548, 66456, 65169, 70461, 76204, 80160, 78360, 67965, 56820, 63028, 66663, 84475, 85224, 78160, 74255, 74068, 84275, 83965, 81235, 80280, 65750, 58685, 57971, 66322, 57538, 43716, 50647, 57660, 62042, 65907, 63156, 56829, 64415, 70071, 65265, 64462, 68851, 72859, 69160, 66113, 71025, 74695, 67501, 77458, 71932, 55899, 45444, 49009, 54068, 55821, 46623, 46474, 52813, 66022, 59703, 55611, 64167, 70552, 69409, 69404, 70749, 61924, 56018, 65157, 77460, 75932, 65119, 51279, 62054, 74027, 69165, 59592, 70483, 61263, 61236, 72095, 79409, 73540, 72845, 84426, 96354, 95115, 99275, 101048, 94591, 92170, 87217, 76332, 81948, 71584, 70602, 78866, 84862, 74648, 81435, 86168, 85206, 83923, 72007]
12327G2007j5104K244K883J1321P549n002r700J603o345r216K0058J8410n622
12314H5086j3759k855Q867N61o251n366J9536J3571j253m602J579N061j972j1043
12300H7160j3511o298R808o442m637Q132R343R182n806j7325j0639O882R737O228
12286H1814K528N188o06l983m424r407p633N152R137L517L006N166q542j0837
12272G0076M122Q205O047n884p960j7375o230K5000J1999o737j4994p020R035
12259F8284J0522L07r239O266M274n941P940N163m538M9J5481K0055r683j7466
12245I1474j1974K06P579J5338J623o954L270j3701j669J422Q380M317m638k564
12231I2109l496R194P164l201n205j953r582L992K0590j0697q229o767j18K824
$$ y = [72007, 56903, 59147, 62030, 73351, 80900, 75898, 66198, 67801, 61456, 52240, 72298, 90708, 85086, 71327, 68472, 77339, 77900, 71649, 66283, 85819, 99390, 98137, 93535, 95114, 100175, 98203, 87160, 73649, 67351, 77159, 70717, 66080, 74212, 83555, 92737, 86931, 69606, 58967, 65849, 75586, 81814, 84342, 89530, 88924, 84941, 80517, 71110, 63477, 68629, 77766, 81283, 84289, 89455, 80913, 70076, 74198, 82403, 88450, 82566, 74606, 57231, 51001, 76001, 88000, 81263, 66269, 59249, 68284, 78806, 79113, 69874, 76140, 80414, 74473, 82413, 87576, 83038, 83087, 98568, 118623, 108940, 91474, 79500, 79706, 87285, 102623, 104246, 97292, 100562, 86861, 85192, 86614, 94994, 99311, 94673, 92109, 88613, 97807, 104971, 101770, 96565, 94612, 85030, 89022, 109612, 98915, 90686, 83919, 83801, 86625]
12217H6625o866k427J6175K369Q396o993j2538J0268L289j077P060J1942q732
12204A07491k0052j1853J5319J3750n083n912R172J4073k0563j3768J0445K3242
12192A16261M695n168j5496j2687J6452L004l767M192J6305l114m902q366k6024
12179H1385j966J0791J357p532q273J141K1132L819J74r49K193J0331Q31l797
12165A10637M955j4771L088P802p734N466P774k638j693n720r99Q642M335P70
12151A19914M960n254l884q305k155R715M307J0719O198p079L291N429j1282M174
12137A30748J1641M007N438J928k346o087j5131P689k18j7196J374l864K80P044
12123A25307O441k420m868j672j1633K171J3591L262m855k951N654O495K0800
$$ y = [86625, 79759, 77332, 93507, 95876, 104272, 97279, 84741, 95009, 98298, 97221, 104281, 116223, 107491, 87439, 75586, 90905, 104655, 99572, 93660, 102832, 116905, 96342, 82574, 93019, 116261, 120956, 115788, 100292, 87605, 104057, 107061, 103294, 107486, 123791, 120677, 115775, 107409, 81385, 79419, 90210, 91567, 84035, 75762, 76903, 98035, 101854, 102028, 101079, 103272, 113603, 114434, 110637, 115592, 100821, 103909, 111711, 103977, 109443, 117217, 114579, 112886, 107166, 106167, 114809, 119144, 119914, 124874, 119620, 115736, 107431, 105276, 114991, 119298, 130017, 136215, 129136, 132427, 137856, 126574, 130748, 142389, 146396, 151834, 153762, 151416, 145329, 130198, 137887, 137669, 120473, 121847, 117983, 118263, 125307, 131748, 129328, 124460, 122788, 111155, 113326, 126917, 130179, 125324, 122373, 128027, 134522, 155322]
12110A55322J8339J167M079j1644j4240q067m405R444J540J476l949j6999j7563
12097A14500O569N837q22J6792L0054K0327q544k364k153k593K339R744L112Q58
12083A93656j0178j1005q179o310j492O986n56o96L283J0556O213j418j3945j0828
12069A56087j2783O067K586j0520j2267J0973Q3M397O07p578M810l662m840L26
12055A34286L483j07p205m585k420n619m343q278Q826J2217N480q470l105O713
12041A26873J7196J7400o010j0894M108J1208j3439k80j747K17m125m286n751
12028A30470O578J8489R76r573l58k50L514n652k743j1552l344L669J2305P599
12014A50128j556M668l532K678l847p474n066j111k919j0448K391J7624j0927
$$ y = [155322, 173661, 174828, 178907, 167263, 153023, 144956, 140551, 149995, 151535, 153011, 149062, 132063, 114500, 121069, 126906, 126084, 142876, 172930, 193257, 184713, 182349, 180196, 177603, 179942, 189686, 192798, 193656, 183478, 172473, 164294, 157984, 156492, 163478, 162922, 162226, 165509, 176065, 182278, 180860, 166915, 156087, 143304, 149371, 151957, 141437, 129170, 140143, 140226, 144623, 145230, 137652, 142462, 138800, 133960, 134286, 137769, 137662, 130457, 125872, 123452, 117833, 113490, 105212, 114038, 126255, 131735, 123265, 120160, 126873, 144069, 161469, 155459, 144565, 148673, 159881, 146442, 146162, 144415, 144632, 140507, 136221, 130470, 137048, 155537, 156513, 146940, 146582, 146332, 149846, 144194, 141451, 129899, 126555, 130224, 142529, 150128, 148572, 153240, 149708, 152386, 148539, 141065, 135999, 134888, 131969, 121521, 123912, 141536, 130609]
12001A30609j0593R44J4335K8260O900j2104q368n442K450K054n635l222j626
11988A38562k317q459Q201k079K554N122N038K1208J2952j2593p647q240j4333
11975A37969N805R797j0651m655J2402j746r094l045N565K299L382O395o185J622
11961A49860Q598m154q856p663n693N136O952P715Q510p661k2894j6570Q511O661
11947A28452O649M632N566O5k884r429o843m181N708J3568J731p436K662m217
11933A34043J2353J2530r595j1175M144R706l888j2347l020R757K678j1378l075
11920A30733j288L896K0839k157j0452P341J1600j0241q876P616p096k0441j8871
11907A02603J2818J1015P377o587P089r690o804J2813K57m525L647J0556k236
$$ y = [130609, 120016, 120960, 135295, 163555, 170455, 158351, 149983, 144541, 146991, 149045, 143410, 140188, 138562, 136245, 127786, 135987, 133908, 136462, 141584, 146622, 167830, 180782, 168189, 160542, 152302, 137969, 143774, 153571, 142920, 138265, 150667, 148921, 139827, 136782, 142347, 144646, 148028, 154423, 148238, 149860, 158458, 154304, 145448, 137785, 132092, 137228, 144180, 151895, 160405, 152744, 129850, 113280, 121791, 128452, 135101, 139733, 145299, 145364, 142480, 133051, 126208, 122027, 127735, 141303, 143034, 135598, 138260, 134043, 146396, 158926, 149331, 138156, 142300, 152006, 148118, 135771, 132751, 142508, 145186, 133808, 130733, 129445, 133341, 154180, 152023, 141571, 148912, 160512, 150271, 141395, 149011, 141915, 121474, 102603, 115421, 126436, 133813, 127226, 134315, 124625, 117821, 130634, 130891, 126366, 130013, 140569, 138333]
11894A38333k643P683P804O412k873p972j788J5524J7018l587k3265k3340k317
11881A24989J4029O645J5618L141J4533j0198j1000M963J081q57q192q312k820
11868A43620j0643n923M417J4379J7886J0409N45l842j9052r744O805J3505q946
11855A53416r815m84J3084M096R216J6097o962j4426r14J683j2367L875O755o628
11841A56626l648O156R12O84q159m779o25j731J3181Q975J025j3440R54O57l88
11826A56400O791p839J63j4099l865L423o31J1055k112j2185N242O420O120M074
11812A58957l368J1755k773n926j3440m514J3888m097J0538k289j683M627N883
11799A67558j081k537j6214r286j113J4639O368k316J1397j785m931j0113N736
$$ y = [138333, 135690, 143373, 151177, 157589, 154716, 146744, 144956, 160480, 177498, 173911, 150646, 127306, 124989, 139018, 145663, 161281, 164422, 178955, 168757, 157757, 162720, 163801, 162944, 154752, 146440, 143620, 132977, 127054, 131471, 145850, 163736, 174145, 174690, 170848, 151796, 142052, 148857, 162362, 153416, 143601, 143117, 156201, 160297, 169513, 185610, 178648, 164222, 163308, 164991, 152624, 156499, 163254, 156626, 152978, 159134, 160046, 160730, 152571, 147792, 147167, 145436, 158617, 167592, 168617, 155177, 156131, 156788, 156400, 163191, 155352, 155515, 141416, 137551, 140974, 140343, 151398, 149286, 137101, 142343, 148763, 154883, 158957, 155589, 167344, 164571, 158645, 145205, 140691, 154579, 150482, 161020, 158731, 157048, 161675, 167558, 166477, 163940, 147726, 138440, 137327, 151966, 158334, 156018, 167415, 165630, 160699, 150586, 156322]
11786A56322K1893K278Q385L720N267P119o433n321m908P001L830n643K807J7382
11772B13699O082J1624J615j3112L196q643j8261k003R818M351j2715p070o1m767
11758A83753M235q935R82K838O685Q961j2927k770L136n300o116m187j0023R890
11744A70222J2747k45k282n630Q24o857n810O739L820K113p794q767j0562J166
11730A49684J8593J5179P1P574M793k824M944k3184k928r675j069j0267O22J907
11716A53420q441N645K8088P440n005j4325r899J6697Q288j1110j1165m191J4867
11703A70309J4982j3374j7727P106o467j0391q028j5947J1742P426M781K2185
11691A66597J3996l079j6732L220m185L354L303k475m912j5366m398k962j0949
$$ y = [156322, 178215, 180493, 188878, 192598, 197865, 204984, 198551, 193230, 188322, 195323, 199153, 193510, 196317, 213699, 219781, 231405, 233020, 219908, 223104, 214461, 196200, 194197, 204015, 208366, 195651, 188581, 188520, 183753, 187988, 179053, 180035, 182873, 189558, 198519, 185592, 182822, 185958, 180658, 174542, 170355, 160332, 170222, 182969, 182724, 180442, 174812, 175636, 168779, 162969, 169708, 173528, 175641, 167847, 159080, 148518, 149684, 168277, 183456, 183527, 191101, 195894, 193070, 198014, 174830, 171902, 162227, 161158, 150891, 151513, 153420, 144979, 150624, 178712, 186152, 181147, 166822, 156923, 173620, 181908, 170798, 159633, 155442, 170309, 185291, 171917, 154190, 161296, 154829, 144438, 136410, 120463, 132205, 139631, 144412, 166597, 180593, 177514, 160782, 164002, 159817, 163171, 166474, 163999, 159087, 143721, 139323, 136361, 125412]
11678A25412L557N960j585n741p048J413L805p356O916p0l593N193M40Q699J920
11663A37922l075q6J127N214J1205M591j7524j012j3364m886J2414j220K687J1781
11649A45774o509q075k2976R723K886J0819O694m954j4123m624j3979O128J3723
11636A20507J0922q897k743O538j4917j1740K372J2934l559J779J3311J4597K415
11623A43519m343p589p774R94J0452j620j427l86J558K0259k17p143J387o438
11609A41232p576J1791K4302K2739r059o289j419r611o066M780j514l713L149
11596A62746k982j5084k87n149j2087k716k744m065p190k621J4242M811p581K446
11582A21739J201J5029q017r081l749R959L633j0834j724m640R642L225P297K963
$$ y = [125412, 128969, 134929, 133344, 127603, 120555, 121968, 125773, 118417, 125333, 125263, 121670, 126863, 127303, 136002, 137922, 134847, 134761, 135888, 141102, 152307, 156898, 139374, 138362, 124998, 120112, 132526, 131306, 133993, 145774, 139265, 131190, 108214, 117937, 120823, 131642, 138336, 133382, 119259, 114635, 100656, 106784, 120507, 131429, 122532, 119789, 126327, 111410, 99670, 102042, 114976, 111417, 113196, 126507, 141104, 143519, 139176, 131587, 123813, 124807, 135259, 133639, 132212, 131826, 133384, 153643, 153426, 146283, 147670, 141232, 133656, 145447, 169749, 192488, 183429, 177140, 175721, 166110, 160044, 164824, 163310, 159597, 162746, 159764, 144680, 144393, 139244, 127157, 124441, 121697, 117632, 110442, 107821, 122063, 126874, 119293, 121739, 122940, 137969, 129952, 120871, 117122, 127081, 130714, 119880, 118156, 113516, 123158, 126383, 133680, 136643]
11568A36643n902p907J549J1932l056j1967J008N817p129J6397o820l565p384
11555A19616l667K060M921k987J608m152L458J6499K3272J0636J2318K5659K4345
11542B33586K5001L1610M469l3408m4102l8303k1142k3226j1315j3181q134K1178
11530A23033J7444p111j6616k953J0756J3448k960o12j286r755p892q807l129
11517A03560Q894P599j523j285o580l279j1611j3980J354L49j266N644J1298R772
11503A08946m108j2021L084p557L460k25q122j2113l487J3814m69M35j0496O613
11489G7754P024M769P437k0578j5591L985p203l106J279K210m868J090J4722R639
11475G8563j460o475n74K0398Q666j2854k776Q92n730J1758J1511M143o321J2973
$$ y = [136643, 130741, 122834, 124383, 136315, 133259, 121292, 122300, 128117, 120988, 137385, 130565, 127000, 119616, 115949, 118009, 122930, 119943, 121551, 117399, 120857, 137356, 160628, 171264, 183582, 209241, 233586, 258587, 290197, 294666, 261258, 217156, 178853, 157711, 134485, 123170, 109989, 101855, 123033, 140477, 133366, 116750, 113797, 124553, 138001, 135041, 134429, 133143, 123388, 115496, 106689, 103560, 112454, 120053, 118530, 117245, 110665, 107386, 95775, 81795, 83149, 83498, 82232, 87876, 99174, 108946, 104838, 92817, 95901, 88344, 91804, 91579, 83457, 71344, 67857, 81671, 81202, 81637, 71141, 77754, 84778, 89547, 96984, 76406, 60815, 64800, 57597, 54491, 55770, 57980, 53112, 54202, 68924, 78563, 77103, 70628, 70054, 90452, 99118, 86264, 83488, 84380, 78650, 90408, 101919, 106062, 99741, 112714]
11461A12714K4765J0017j7581q872J201j059r10q902l133j1167j22q556K801J0857
11447A02053L057j5097j0205j466j9135j4055l201j46M644R857J1160Q774m12
11434G5828l317j0249L642O756J1561K210J02j6130M295P667J0440n232j8896
11421F8677p710J318L315L093m335N223Q203M663j7236n60O575M360j2482m133
11407E8971j3045K1550j816j2686r972l149M232J2283P632l851M722j500o276
11394E7095n200M796k722j831o017J6069K8617l894J166M410j0968j6802k9069
11381C5650l656K1398P504N529l59K111J3721J7424q802j7421j3564k18O089J6011
11367H1417n639j447M70Q005J5208q697r143q842j0677J142M811k44r215j1782
$$ y = [112714, 137479, 147496, 129915, 121043, 122244, 121185, 120275, 111373, 108240, 97073, 96951, 88395, 91196, 102053, 105110, 90013, 79808, 78342, 59207, 45152, 41951, 41805, 46449, 56306, 67466, 76240, 75828, 72511, 62262, 65904, 72660, 84221, 86431, 86533, 70403, 74698, 82365, 92805, 87573, 68677, 60967, 62285, 65600, 68693, 64358, 69581, 77784, 82447, 65211, 64651, 71226, 75586, 63104, 58971, 45926, 67476, 65660, 52974, 43002, 39853, 44085, 56368, 64000, 60149, 64871, 63371, 57095, 51895, 56691, 53969, 52138, 46121, 62190, 90807, 86913, 88079, 92489, 81521, 64719, 35650, 31994, 53392, 60896, 66425, 66066, 68177, 81898, 99322, 90520, 73099, 59535, 59317, 65406, 81417, 75778, 74331, 74801, 82806, 98014, 89317, 80174, 71332, 60655, 61797, 66608, 66364, 57149, 45367]
11353D5367N275N885r092J4094K0123k706j3731o982J5615J0894q311j4067m019
11340E8345o79j2000j590P926Q308J8583J857q717m170j1125P452r484r855p470
11326C7381N375o243l860L854p060N977K6811O158j6343J456J7927q104Q53J755
11312F5937j248p258j2038j231P401L50J0663O590L27R234j1116j0542r589j0383
11298C7097k980m742j4419J2238Q437J8474J0299R79r803O204m064n586j6216
11285C5918M996O359m19K5424K0562J3567P418l292q082N55j1784k1195j2423
11272E7604j0852j3931J3221O282N951m769p741N201M168n497l116J4788O713
11259F8022R027j1316j6409J5108R498j3008k5916r235L461M415J1275N081k26
$$ y = [45367, 50642, 56527, 47435, 61529, 81652, 78946, 65215, 58233, 73848, 84742, 76431, 62364, 58345, 57666, 45666, 44076, 52002, 60310, 78893, 80750, 72033, 67863, 56738, 64190, 54706, 44851, 37381, 42756, 36513, 32653, 36507, 29447, 35424, 62235, 68393, 52050, 53506, 71433, 63329, 64182, 65937, 64689, 57431, 45393, 44162, 51563, 51913, 62576, 69166, 69493, 78727, 67611, 57069, 47480, 37097, 34117, 29375, 14956, 27194, 35631, 54105, 64404, 65383, 55580, 61784, 57720, 52134, 35918, 40914, 47273, 46854, 72278, 92840, 106407, 113825, 110533, 102451, 103006, 91222, 70027, 57604, 46752, 32821, 46042, 52324, 58275, 53506, 45765, 50966, 55134, 49637, 46521, 61309, 68022, 77049, 65733, 49324, 64432, 73930, 60922, 35006, 25771, 29232, 33647, 44922, 50003, 49777]
11246D9777l648M532n630q735j0267q594Q372R350K911M087m177j1039M678M129
11232C5746J911Q162L056r457n817m401J3709J955n717n196J4825K1152M131j2834
11218F1225k0920n914M47J138O34J2332L703j0204M784Q527K385k777K570K0401
11204G8331r04k1917q316P826L004J0996q999j8480r683J7258K319L796o49J0042
11190F4624j071j138P209l921j1585k889K944o023J6893J2038K158j0428j6124
11177E2687j4811k401J1350K7380K2828O142L88J876j0953j0041j0663l824l906
11164F6052J2381o95o396p962J0286J4751K367K238P116N794p567k581k0135j0445
11150F5204N993M783j4564q990J0435J5278p909j0567Q242o414r623M847N72J23
$$ y = [49777, 46129, 50661, 45031, 36296, 26029, 17435, 25807, 35157, 38068, 42155, 37978, 26939, 31617, 35746, 37657, 45819, 48875, 39418, 33601, 29200, 42909, 44864, 39147, 33951, 48776, 69928, 74059, 61225, 40305, 34391, 34838, 35976, 36610, 48942, 52645, 42441, 47225, 55752, 58137, 55360, 57930, 78331, 77427, 55510, 47194, 55020, 58024, 69020, 60021, 41541, 31858, 49116, 51435, 55231, 54582, 64624, 63553, 62415, 69624, 65703, 54118, 51229, 54173, 48150, 65043, 77081, 79239, 68811, 52687, 37876, 35475, 46825, 74205, 97033, 103175, 103563, 105439, 94486, 84445, 73782, 69958, 66052, 78433, 77738, 71342, 63380, 73666, 88417, 90784, 93022, 100138, 105932, 98365, 95784, 75649, 65204, 71197, 75980, 61416, 52426, 62861, 78139, 70230, 59663, 67905, 61491, 51868, 56715, 57287, 57410]
11136E7410n008j1464O551J2557J4710n013J164j5710q636m200M635L086O260
11123E6342K315p929j2519p820j2044J9167J8736M077j1905J335l871o086J5393
11110E5191J0764r337j3741J836o462j2485j2642Q382M843J1238m05P360R393
11097E3935Q06N272j923j9456K411K188n665k96K493k90P283j0194j0173N31J4798
11082D1720R558o508q657m560r117r5k142j868M259l374p30K3606j2650r836J9317
11067C8923O666J599j0662o629K702K6q666K231n774O241j641q730q578O4K6690
11052C4462J3945M85J2529j2111j828J3782j2067j5694J320j0368M781m975N039
11039B9300N241O998l954N806O802n88n782P71m06n025M131q897k281J0643N997
$$ y = [57410, 52402, 40938, 47489, 60046, 74756, 69743, 70907, 55197, 46561, 42361, 46996, 50082, 56342, 58657, 50728, 38209, 30389, 18345, 37512, 56248, 60325, 48420, 49755, 45884, 39798, 55191, 65955, 56618, 42877, 44713, 38251, 25766, 13124, 21506, 26349, 37587, 37182, 44542, 53935, 54741, 60013, 58090, 38634, 41045, 43233, 37568, 37272, 39765, 39475, 46758, 36564, 26391, 26922, 41720, 51278, 44770, 36113, 31553, 22436, 22341, 20199, 18331, 22590, 19216, 18486, 42092, 29442, 19606, 38923, 45589, 47188, 36526, 29897, 32599, 32625, 23959, 26190, 20416, 26657, 25016, 16286, 7708, 7772, 34462, 48407, 48892, 61421, 49310, 47482, 61264, 49197, 33503, 34823, 24455, 29236, 24261, 29300, 34541, 41539, 37585, 43391, 50193, 49605, 43823, 44594, 44188, 39163, 43294, 34397, 32116, 42759, 48756]
11024D8756R15J3885o97p231j4070m639l910j1933p101J6077J0948N46j3907J079
11010B8718N792J1534J679j805j1184j5344J1996K803o002Q44P596L020m615N657
10996D0689Q575J0638P143L752n520j5950K059J339k587J685j3716Q647l737j9976
10982B3041J1209Q869J1560J1198J2979N403j574J4018J3988J0650Q471J789J5769
10969A47370N998j0062j6308k6675J7028J0355J0988J8660l130q039L461p51n107
10956A43788j264R336J190J6403J8659J7810K217M990l65K556J9514K1099L614
10943B59547M51j2389n165p424J706J2139l90j4542o525n550p041j0096J86j915
10929B02992r634r577L539J949n977j0528j1348n798j2548j1195M934q333L152
$$ y = [48756, 49671, 63556, 62859, 55628, 41558, 36919, 33009, 21076, 13975, 30052, 41000, 41546, 27639, 28718, 34510, 46044, 47723, 45918, 34734, 19390, 31386, 34189, 28187, 29031, 36627, 39647, 35032, 40689, 49264, 59902, 67045, 70797, 65277, 49327, 51386, 52725, 50138, 51823, 38107, 46754, 43017, 23041, 34250, 43119, 54679, 65877, 78856, 84259, 82685, 96703, 110691, 121341, 129812, 131601, 147370, 153368, 143306, 126998, 100323, 117351, 127706, 138694, 157354, 154224, 146185, 149646, 148895, 143788, 142524, 151860, 153050, 169453, 188112, 205922, 208139, 213129, 212764, 215320, 234834, 255933, 259547, 259998, 247609, 242444, 235020, 236726, 248865, 248475, 233933, 227408, 221858, 214817, 204721, 204907, 202992, 193358, 183781, 187320, 189269, 183292, 172764, 161416, 155618, 143070, 131875, 136809, 128476, 131628]
10916A31628q260o036J054j5459M222Q083K962L018q426j7433j7771o893l931
10903F6758q980N266o865K162k685p464O37K931J3157R075k444J410J502p397
10889F7063j275j2754j301r916o697n82N302Q556n592l00n998p698M96O081q710
10874B6675k891m708m022j189J7232J8933l491m036m719k3640j3035j3j4165l251
10860a6320J1433J0851R641J634o6j5553Q34J2052j24k344o788o124Q11R397K1417
10845C0751j0747r747Q539j706l138J1546N437j2243q346J1545J4079Q934q170
10832C6734k2954j5563K944J8211J8503p575j3295M824j6954j3650p392l35J8335
10819A833J9390O783j2251J446J0350R18m188N711M261Q360M208j4972j2744R73
$$ y = [131628, 123368, 117332, 118386, 102927, 107149, 115232, 118194, 121212, 112786, 95353, 77582, 70689, 66758, 57778, 63044, 56179, 58341, 55656, 48192, 48829, 51760, 64917, 73992, 71548, 72958, 74460, 67063, 65788, 53034, 51733, 41817, 35120, 34538, 39840, 48396, 42804, 42504, 36506, 28808, 29304, 35385, 26675, 23784, 19076, 15054, 13865, 31097, 50030, 46539, 42503, 37784, 14144, 1109, 1096, -13069, -16320, -4887, 5964, 15605, 17239, 17173, 1620, 2454, 14506, 14382, 12038, 5250, -874, -63, 9334, 30751, 20004, 10257, 18796, 17090, 13952, 25498, 30935, 18692, 10346, 21891, 35970, 44904, 36734, 13780, -1783, 1161, 19372, 37875, 30300, 17005, 21829, 4875, -8775, -16167, -16502, 1833, 21223, 28006, 15755, 17201, 27551, 28469, 24281, 29992, 34253, 42613, 46821, 31849, 19105, 20078]
10805B0078L2406N588k3188m81j384p966j6182j2554M365J023J3681R069m965
10792A9490J343R171J64m96j6852j0874K7095O315Q05n213j3698j1595j172R071
10778A3554O903J3312N364j3532k497K0792R374O338N89J909M42j2073j099M778
10764E4154p465m991j16K181n211l918q010R428J0507j244j2638j2008R859J3107
10750D3635O36k074j494n67j2337P14L488P644l033K445J4771Q320o177p208j0556
10735C8207j0437J864O085j447p46L392N84m055r254j1214M144J1645l174r225
10721A6369J9788J9688J1910N029j4362j2860p289j0593j4669o305p10m199K816
10708D613L417J3029k905K216M644M262j4419N827J4400M301L270j575L612P330
$$ y = [20078, 52484, 58072, 34884, 34403, 33019, 25053, 8871, -3683, 682, 1705, 15386, 24455, 19490, 20833, 30004, 30168, 29672, 12820, 1946, 29041, 35356, 36161, 30948, 17250, 5655, 4483, 13554, 20457, 33769, 39133, 25601, 23104, 43896, 53270, 59608, 60197, 62106, 62548, 50475, 49376, 54154, 46689, 41698, 41582, 43763, 38552, 34634, 26624, 36052, 46559, 45315, 32677, 20669, 30528, 43635, 44271, 42197, 40703, 40136, 27799, 28513, 32001, 39645, 36612, 39057, 53828, 62148, 55971, 48763, 38207, 27770, 29634, 35719, 34272, 33526, 36918, 37502, 33447, 24193, 12979, 17123, 28768, 25594, 16369, 36157, 55845, 67755, 72784, 58422, 45562, 38273, 27680, 13011, 6706, 5996, 1797, 4613, 8030, 21059, 18154, 20370, 25014, 29276, 14857, 20684, 35084, 39385, 42655, 41080, 44692, 52022]
10694E2022J454k1817j6932J1509O072R176K517n331j6795K327J0380j208j465
10681C1909J085m534p512J0270p00p203m306p363L283L20J5016J413j5568m115
10667A1995J0844N15m603L731L170L248K462M39n895J3211K3197m857k5634j5377
10653A6446J131m776m944l606J6790l811q512L022J6490P922M144M43j1588j1093
10639A8058q933j7894q90J286K230r29J3704j086j6490J3321N048l650Q457P691
10625A9923J5666N952n432k705L177K405l956k0881j3517R365l63j825J0573K942
10611B1324p668m831n221j5005J1318J3018p11m421j0596j4320o098k211J1054
10598a4368J0564J7614N668Q283L416j287p305M773L27j1353k141Q678J8304O624
$$ y = [52022, 53476, 31659, 14727, 26236, 32308, 41484, 44001, 38670, 21875, 24202, 34582, 33374, 31909, 32994, 28460, 20948, 31218, 30518, 23315, 19009, 11646, 14929, 15249, 30265, 31678, 16110, 11995, 22839, 23354, 18751, 22482, 25652, 28900, 31362, 31801, 25906, 39117, 62314, 57457, 31823, 16446, 17577, 12801, 7857, 4251, 21041, 17230, 8718, 11740, 28230, 36152, 40296, 40739, 29151, 18058, 9125, -8769, -9659, -8373, -6143, -7072, 6632, 5546, -10944, 2377, 7425, 3775, 12232, 19923, 35589, 41541, 36109, 33404, 36581, 38986, 35030, 14149, 632, 9997, 9634, 7809, 18382, 21324, 13656, 8825, 3604, -11401, -83, 12935, 12224, 7803, -2793, -17113, -23211, -25422, -14368, -3804, 13810, 19478, 27761, 31177, 29890, 22585, 27358, 27685, 16332, 14191, 22869, 41173, 47797]
10584D7797j2040o466p661k999P977L540j2316M110K543j61j2150p434L154M666
10570A2560L837M147l364p414j1795R385N302m040K178k530r34J185j424j1973
10556d880J1098J2928R050r491N41j922m56l264K205n015J0999P180p144q855
10542A2974p606K114Q945o194l460l027M253p826R17Q60M044p392j7793N115K3079
10527I003J597r993K135l82L006J9571J6815l767J02J1815r061j4999m111Q005
10513B9736O55n7j8249m720N831o022q679l07M292J0135O058q019J075m032K866
10498A0563j4347P694M005L443o089j0963l40o24J8000J2682m698j4546o3n570
10484h53M084J2520J1907or955P450l308J883K76k5425n215J9189J3362o422j553
$$ y = [47797, 35757, 29291, 21630, 18631, 26608, 30148, 17832, 21942, 24485, 24324, 12174, 4740, 7894, 12560, 16397, 20544, 17180, 9766, -2029, 7356, 12658, 8618, 10796, 8266, 7332, 8517, 7093, -4880, 6218, 19146, 28196, 18705, 19246, 17324, 16868, 13604, 15809, 10794, 21793, 28973, 21829, 12974, 5368, 7482, 16427, 10233, 6773, 3746, 7999, 173, 1090, 1950, 5994, -1398, -19191, -14076, 9003, 10600, 607, 2742, 2360, 5366, 24937, 41752, 37985, 38087, 49902, 40841, 25842, 21731, 29736, 30391, 30334, 12085, 7365, 13196, 7174, -1505, -1812, 2480, 12615, 18673, 10654, 11729, 7697, 10563, -3784, 3910, 7915, 11358, 5269, -5694, -6034, -6658, 11342, 24024, 19326, 4780, 4717, -853, 3231, 15751, 27658, 27652, 17697, 25147, 21839, 23722, 23998, -1427, -6642, 12547, 25909, 19487, 17934]
10469A7934l68R289k683j7004j631K444J4651j9507j4209j4981J1418J6030M469
10456E852r13J7932K913O321p379o425l567p202J94J611P083m883j4422R98J3863
10441A1976M664k286L628o548K11K181j0389L621J380J2762n160j3651O46J1644
10427A4679m852r937J475L016J3592p890O188m940n350o04J1455P707K176L425
10413C0140m841N548j0948q699N709r734m398q672q296J0560N653M873k380o227
10399a712P112K673N125N184m253K921p09K325J2398j413j845N7j6031L130O355
10384B1317o362P635J059K513j866o89l263L967j141L984r108nl697k651M090
10369A5783L284J4077J3733P994o810M417j2767j1829j6321J0566Q681J6458K2471
$$ y = [17934, 17566, 26855, 24172, 7168, 5537, 7981, 22632, 3125, -11084, -26065, -14647, 1383, 5852, 4939, 22871, 25784, 32105, 24726, 18301, 14734, 7532, 7726, 9337, 16420, 11537, -2885, -1887, 11976, 16640, 14354, 17982, 11434, 11645, 13826, 3437, 7058, 8438, 21200, 16040, 2389, 3035, 14679, 9827, -110, 1365, 4381, 17973, 10083, 16271, 11331, 5981, 5377, 16832, 24539, 26715, 30140, 25299, 30847, 19899, 11200, 16909, 7175, 2777, -5895, -14191, -3631, 2022, 6895, 4515, -1712, 5400, 8073, 13198, 18382, 14129, 17050, 16341, 18666, 31064, 29651, 27806, 27863, 11832, 14962, 21317, 14955, 22590, 23649, 26162, 24296, 23607, 20344, 24311, 23170, 27154, 18046, 18041, 14344, 11693, 15783, 19067, 33144, 46877, 54871, 48061, 52478, 39711, 27882, 11561, 22127, 30808, 47266, 69737]
10356F9737Q960J0570J2323Q991J568Q372J3019J7292L6108J8599L0674M7317
10344B83530M5935M9930J11773J67097J87693K04518K05303K30262J99487J46764
10334A832292O0861j7960o3160j27694j73104k10922k27950j96004j79846j69472
10324E27041j35422r0428o2860o2417l8373l0634j1484j7897J451J3170L469j4849
10312H0767k8806q079m049j698q238J1250j1458j7745m304K103j0372J935J0397
10299A1703R792M456l13l1j8498o813J128M693K817j207R554L853L767m212j2464
10284H225n89P092k274L891j0663l661q291P735L52r764j5236J4634J2088M87
10270D026j1421o016k045n124J1747R706r06m392M600J2931L680j4727k211j0809
$$ y = [69737, 78697, 89267, 101590, 110581, 112149, 120521, 133540, 150832, 186940, 205539, 236213, 283530, 329465, 379395, 491168, 658265, 845958, 1050476, 1255779, 1486041, 1685528, 1832292, 1893153, 1875193, 1812033, 1684339, 1511235, 1300313, 1072363, 876359, 696513, 527041, 391619, 301191, 238331, 175914, 137541, 106907, 95423, 77526, 78977, 92147, 95616, 80767, 51961, 43882, 39833, 38135, 29897, 41147, 29689, 11944, 7640, 9743, -629, 1306, 11703, 21495, 25951, 25638, 25607, 7109, 296, 1424, 6117, 8934, 7727, 17281, 21134, 24901, 20689, 8225, 7636, 14728, 12454, 16345, 5682, 2021, -6270, 1465, 1817, -7947, -23183, -8549, 3539, 4026, -7395, -13411, -15456, -20580, -8833, 873, -33, -4425, 175, 13106, 16786, 2059, -152, -10961]
10256a0961p975J2233K438j2809K384k396O232J9411K096J3398j1646q125m799
10243e19m213M371J0642M74j0329j3981r587n703Q873J4135J1280P779J73m743
10229H652j761M610m611n190J350J4229J1597r763j3809j718J9635J7489M205
10216D4915j1655r555j01p608o649k627L839r953n98M410p097J596N223P15r520
10201d665o663j2856J58J7080N604J2855j624q025r141k095N914J386P034J402
10187F364j2443K022M287m966J0011N048l389n445k575J706R98K0334k463r665
10173I824l912k729K067J2523j316q611q011l992k0939J645Q821L47l352O935
10159a0700J201P03N419M7m786j0425j3484J6490K5831J0282q454j4333q885J6602
$$ y = [-10961, -18936, -6703, -4265, -17074, -14690, -17086, -10854, 8557, 10653, 24051, 12405, 4280, -519, -4732, -361, 10281, 10755, 426, -13555, -23142, -28845, -19972, -5837, 5443, 13222, 13395, 8652, 6891, 11501, 6890, 1700, 3050, 17279, 28876, 19113, 5304, 3586, 23221, 40710, 44915, 33260, 23705, 23604, 15996, 9347, 6720, 10559, 606, 8, 4418, -2679, -1083, 4140, 4855, -4665, -11328, -24184, -24026, -6946, -1342, 11513, 9889, 1864, -7277, -9372, -3458, -2072, 4962, 6364, -6079, -4057, 230, -4736, 5275, 10323, 6934, 1489, -1086, 620, 1618, 21952, 19489, 9824, 5912, 3183, 5250, 17773, 16457, 7846, -165, -4157, -25096, -23451, -14630, -14283, -17635, -10700, -9499, -8796, -3377, -3330, -8116, -18541, -32025, -15535, 10296, 20578, 12124, -2209, -11094, 5508]
10145E508J1591l104l454r475k1080L571Q751M90O985l4o244J0186Q232q835q476
10130e388L091K4o462n787N026J7145m632k800j1160J7618J6504j4241k0455j1692
10116b3209R019J1195j3171O767J0573j7158q161k583J8877J4903J4699j6539
10104E212o947m222j795j633o202L549Q892K914m313k316Q16o312j5983k796O235
10089b4901q327K7J229k125J4369J5675N284m175m772M759L733r437o504N909
10075i256p678j1869R991J7641p188l813M710n275L371Q282k221J3072J8131R48
10061B8846j70J0148j4085j4362j24o537r887Q421k353O095N789j3751j1249P237
10047e982R95K070J0037j468q893j3622j055J4509J2649q952l577j952L270r07
$$ y = [5508, 17099, 13995, 10541, 1066, -20014, -16443, -7692, -7202, -217, -251, -6495, 3691, 11923, 3088, -5388, -2297, -2273, -8735, -14522, -9496, 7649, 3017, 217, -10943, 6675, 23179, 8938, -11517, -23209, -14190, -2995, -16166, -9399, 1174, -15984, -24145, -26728, -7851, 7052, 21751, 5212, -1735, -5957, -7752, -9385, -15587, -12038, -3146, -232, -4545, -6861, -6045, -12357, -28340, -31136, -24901, -33228, -33201, -31972, -34097, -19728, -4053, 1231, -2944, -7716, -2957, 776, -8661, -15165, -9256, -16934, -28803, -18812, -1171, -8359, -12172, -7462, -12737, -9366, -1084, -3305, 9767, 27898, 28846, 28676, 38824, 24739, 10377, 10253, 3716, -6171, 2250, -103, 5992, 11781, -1970, -13219, -5982, -4987, -2917, 7120, 5652, -3241, -16863, -17918, -3409, 9240, 288, -3289, -5241, -1971, -2878]
10033b878J522q595j0681R972K5557J1706o086j5693j4536O87J4872j868r030
10020e051P651K0042J3349j7570l210J255j761j6132p315J4892O538J725k682
10007A1731q144j5450n738R350J2649p952K781M100l10N201O035O06m475j266
9993I118R16J0958R02j196N467K7874J635j7411j6519l724n226j4948J549j2922
9979a3527q82L930j777m904K0519N83o343J1836L259p817m475l794L395R991j713
9964H281k1578P214K2527R858o783k183n460j0762j2333o350p71r30n005J1620
9950a2655O635N723Q561o227O416L457r111m196L232L01J92N120L892k612n127
9935C601M290m585L236j360o040N902o908j0893Q271q220r73J864R734q7j907
$$ y = [-2878, -1356, -9951, -20632, -10660, 14897, 26603, 20517, 4824, -9712, -9025, 5847, 3979, -5051, 2600, 22642, 35991, 18421, 15211, 16466, 14705, -1427, -8742, 6150, 12688, 14413, 11731, 3587, -11863, -17601, -8251, 4398, -3554, -773, 3327, 3017, 8218, 14253, 14859, 10384, 9118, 10034, 20992, 21894, 20698, 26165, 54039, 55674, 38263, 21744, 18020, 12794, -2154, -605, -13527, -14409, -10479, -12256, -17160, 3359, 3942, -2401, 9435, 12694, 4877, 402, -3392, 3, 9994, 8281, -13297, -6083, 16444, 26302, 19519, 17336, 11876, 1114, -11219, -17569, -18340, -19270, -24275, -12655, -6020, -297, 8264, 2037, 8453, 11910, 2799, -1397, 1835, 2136, 2328, 7448, 11340, 8728, 3601, 7891, 3306, 6542, 5182, -858, 5044, -1864, -12757, -4486, -12706, -13679, -11815, -2081, -2168, -4075]
9920d075L282M734m642j6710j2737N589N78P724R72M960R505j9686j0516Q728
9906b2294O095Q401r359j6772J0032J8676L728m899J0345j1059N454J1168N48
9893A0064K356J547R244N873j0559j8583l700n265r565J0118K046O690K581j0771
9879g924k695K1333J5007j126k1917o367l163M456Q025p625q73m263M104J8594
9865A5566j0763j8754k0736k55K0734O444j5187Q758J5140J0357J8478J3253o199
9852C6836k2609j0630J253J2728N318l437l217k1640l077M833l810J5274J3630
9839B1452j1716k1007o962J942J4520O160J4846K551j0323k314J881N513M402
9826B0945l319m853p2j2949N95o367q7k292R334Q558n242J244l635r768L287J1377
$$ y = [-4075, -793, 3941, -701, -17411, -30148, -24559, -23981, -16257, -15285, -10325, -820, -20506, -31022, -22294, -16199, -7798, -17157, -33929, -23897, -5221, -1493, -6392, 3953, -7106, -1652, 9516, 10064, 12420, 13967, 23211, 29084, 18525, -58, -3758, -9023, -18588, -8470, -6424, 266, 2847, -7924, -10619, 10714, 25721, 24595, 2678, -3689, -6852, -2396, 5629, -1996, -2869, -7132, -3028, 15566, 4803, -13951, -34687, -34942, -14208, -7764, -22951, -14193, 947, 11304, 29782, 43035, 36836, 14227, 3597, 4850, 17578, 22896, 19459, 16242, -5398, -8475, -3642, -7452, 7822, 21452, 9736, -11271, -18233, -16291, -1771, 4389, 19235, 21786, 11463, 9149, 11030, 16543, 20945, 17626, 12773, 12701, -248, 347, -6020, -6107, -8399, 935, 9493, 4251, 5495, 1860, -7908, -4621, 6756]
9810F756L983j0821m905J8388J6756j784q061j488k477p805K00k566j0853n21
9796e198L680l928P954J47r973j17k040J874J0058q07o084p466r37J2686J1683
9781A1532R114j0781p441L49j1562l153K3108l563j9763mk945N869K280q486l361
9766a8807r386n627j1125J3187O390M435j977n157J6916J6828r965p494J9596
9753G814P80J043p746j6853R430N847l76k904j0938N865Q144N420j472j603L275
9738E726m076P897J2771n9j3342j3660L063o6N765o267p963O882N113M846N962
9723A2592p120n389M683l322R041k023j172J0492L009j3407k4572l872J618R057
9709a0385n901j5059J4594K0310O461j3066k873l774Q159O148j1514j570R399
$$ y = [6756, 10739, -82, -4987, 13401, 30157, 28373, 20312, 18824, 16347, 8542, 8742, 6176, -4677, -5198, -1518, -5446, 2508, 2655, -7318, -7435, -9475, -7601, 2457, 1650, -4434, -11900, -12837, -151, 11532, 20646, 9865, 2424, 2773, -8789, -11942, 11166, 7603, -12160, -12164, -15109, -9240, -6960, -15446, -18807, -28193, -33820, -44945, -31758, -25368, -20933, -22910, -28067, -11151, 5677, -4288, -11782, 7814, 8594, 9637, 1891, -14962, -5532, 315, -61, -2965, -13903, -8038, 106, 5526, 4054, 2451, 5726, 1650, 9547, 22318, 22259, 8917, -4743, -1680, -1746, 4019, -2248, -10211, -3329, 1784, 6630, 12592, 5472, 83, 4766, 1444, 10485, 8462, 7290, 17782, 20791, 7384, -17188, -21060, -19442, -10385, -16286, -31345, -16751, 3559, 10020, -3046, -5919, -9693, -1534, 4614, -6900, -8470, 929]
9696I29L639R86p910n565J868J669p292J2979L66m946K0094r169j4713Q872L986
9681E793j3237K293L852L641j2280j3156j1294o081J2148O673P136N023m384n58
9667a4431J7135Q458o695j538l472k279j621j726L721K3782j3230j0666j780j233
9653e575K35O967J3639n611k919j640o62k281J922L703r176m251n669P464Q042
9638D188q61p506o99q672r51n379p974j400K335J0877J0927j0633j4569J5497
9624a4820K3672n01j3535j748j067K404q202J0191K3594L921j4488j1854q587
9611a1020j0834J5955N756l021k757m536N86K698N591o670l149M306o474O56J0314
9596b599n580k104M36J2374k658r453k74j2360l511Q763M840P641o650j2169J681
$$ y = [929, 4568, 5554, -2356, -7921, -6053, -4384, -11676, 1303, 1669, -3277, 16817, 7648, -7065, 1807, 5793, -7444, -5151, -1299, 2342, -9938, -23094, -34388, -40469, -28321, -21648, -14512, -9489, -13873, -14431, 2704, 11162, 4467, 2929, -543, -2822, -4443, -6169, -2448, 21334, 8104, -2562, -4342, -5575, -5340, 1627, 15266, 9655, 6736, 5096, 4434, 2153, 4075, 7778, -1398, -5649, -11318, -3854, 4188, 3327, -4179, -4878, -13550, -14501, -19880, -27854, -29254, -26919, -16042, -5115, -15748, -30317, -14820, 8852, 8351, -5184, -6932, -7999, -5595, -13797, -3606, 19988, 23909, 9421, -2433, -11020, -21854, -5899, -143, -3164, -5921, -10457, -9871, -7173, -1582, -8252, -11401, -7095, -13569, -12913, -2599, -8179, -10283, -9847, 2527, -131, -9584, -9858, -22218, -25729, -16966, -12126, -4485, -11135, -23304, -21623]
9581b1623L562o367r331O770K3192R330l943m766K113r744j8656p967J3805R618
9567a4007J913j740k531M720J5159m881o837j356R060j244m368m675k756J0622
9553b921q967l342O476o65K329J0868J5148K571j6215M07Q198r658q72Q176k140
9538I393k494k35J960k0639m429K622o7N413P736L337Q958j851r263r757O744
9523b572O9j0174K678n88L886J402M049O984J5985Q090m192j5316m363L524q751
9508G11j3188n593Q52J2006q625j0550M890M12N41k922R357N335J0370J3075j5209
9493A462j3331r123K767J9562k548J708J9093k174j0689l613N100j9j949n991
9479B55j954M928k309m978l878M886M725Q592j3620R436J7153k6191k0621J043
$$ y = [-21623, -18061, -24428, -33759, -26989, -3797, 5533, 1590, -3176, -1063, -10807, -29463, -37430, -23625, -14007, -12094, -13834, -16365, -11645, 3514, -1367, -8204, -9560, -500, -1744, -6112, -10787, -13543, -2921, -11888, -15230, -8754, -9419, -7090, 3778, 18926, 21497, 5282, 5689, 13887, 4229, 3357, 11533, 9393, 6899, 6664, 8624, -12015, -16444, -13822, -13889, -8476, -740, 2597, 11555, 9704, 441, -9316, -2572, -2503, -12677, -9999, -10587, -6701, -5299, -1250, 5734, 21719, 29809, 25617, 10301, 5938, 9462, 711, -12477, -18070, -17218, -5212, -13837, -24387, -19497, -19085, -18544, -21466, -12109, -6774, 3596, 16671, 1462, -11869, -20992, -18225, 1337, -1211, 497, 19590, 17416, 6727, 3114, 8214, 8195, 6246, 255, -1699, 3229, 920, -4058, -7936, -3050, 1675, 10267, -3353, 6083, 23236, -2955, -23576, -22533]
9465b2533J4228j0605l122O226K227Q5J1908M954N951L126p050M592r392m028
9451c433J496J0315K886l0081R1O954L383j0280p477M171j395L027R030k46R681
9436a878O307p721m656K874j558l638m295p701k373J0570J9412O777o723l990
9422A407o403m017Q789n582r023M932P505R53j762L09l755K529J4242P16j6816
9407e976R762Q996k700m806M66n408m072N479O612q072j0960M972P498J992j060
9392B723O343l23l901j036j1647K164q102o843J823R103K597O843n304l933N807
9377c686J1010o597J544J8122M053k915k512r466j7813q203P462O108j295J5010
9363A0822L099R740K320o737j0786r193j2054r15P947J1231j1852r976R818L59
$$ y = [-22533, -8305, -18910, -22032, -15806, -13579, -13494, -1586, 3368, 9319, 12445, 5395, 9987, 595, -3433, -1937, 8378, 11264, -18817, -18726, -11772, -8389, -18669, -26146, -21975, -23370, -20343, -11313, -11559, -1878, 4429, -3292, -7948, -5074, -6632, -10270, -14565, -22266, -24639, -14069, 5343, 12120, 5397, 1407, -4996, -9013, -224, -5806, -14829, -9897, -2392, -1439, -3201, -2892, -6647, -4118, 10124, 10840, -5976, 3786, 12782, 10082, 5276, 5742, 334, -3738, 1741, 8353, 281, -10679, -5707, 1791, 3783, 2723, 9066, 8743, 4842, 3806, -7841, -5677, -13779, -20622, -18799, -9696, -7099, -256, -5560, -9493, -3686, 7324, 727, 2271, 20393, 24446, 21531, 19019, 9553, -8260, -16463, -9001, -2893, -4188, 10822, 13921, 23661, 25981, 19244, 8458, -735, -12789, -13704, -5757, 5474, -6378, -16354, -6536, -6177]
9349f177m778j6107O236J292K031R045K448K763J5836j9030l005R471M606j225
9335C406j2429k939j532j947p58O257M707L952o632P886O217P961P63k335M943
9320A7520p909j48J918q511o02l298P415l783o216P215N520l568j5730l811P461
9305f527J7085K632j1534P357N155j5478r733j3707l1J371Q077M014j142p799
9291b0260O716m95O473o925p861j694J4638n365l613M360r95O357o700o219N179
9276a6404J5982M033p318q546J366J611J396J725J5931M901j0463n178J192q87
9262f59P266M203O444J1202q073j5392k945K969r38o245r587j1788P740J0983
9248d820j292k273j700O984O982O705K75K515J073Q53M500k758k1084N478j6067
$$ y = [-6177, -10955, -27062, -20826, -19534, -17503, -8458, -6010, -3247, 12589, -6441, -9446, 25, 4631, 3406, -9023, -11962, -13494, -15441, -16199, -9942, -5235, -1283, -7915, -29, 6188, 14149, 14912, 12577, 17520, 9611, 9463, 11381, 2870, 2268, -1030, 6385, 2602, -3614, 3601, 9121, 5553, -10177, -13988, -6527, 10558, 13190, 1656, 9013, 14168, -1310, -11043, -24750, -24781, -23410, -15333, -11319, -12461, -20260, -13544, -14039, -7566, -14491, -22352, -24046, -9408, -14773, -18386, -14026, -15021, -8664, -15364, -21583, -16404, -422, 3611, -3707, -12253, -10887, -9276, -7880, -6155, 9776, 14677, 4214, -964, 228, -659, 6607, 10810, 17254, 28456, 20383, 4991, 2046, 5015, 4077, -2168, -11755, -23543, -15803, -4820, -6112, -8385, -10085, -3101, 3881, 10586, 10861, 13376, 14449, 15302, 19802, 17044, -4040, 1438, -14629]
9233a4629k7184L738J5872O849J4350O449l641r133J510J2774k474j414Q41j6226
9219a2318j0508R873O771O563p304q456j941K829o129N925K1466P28o458J2020
9205A3061q004O830J0537k1654j6980j014Q455O357J0589K246n032r540P47j1333
9191a4735M002Q897n203k322O527J8495j2034r392M935O783k21N191N740q788
9177G875j9044m188o655J7003R527m001j36L566P734m765j3425j2627q239n482
9163c2857R797J1538J6504P466J177p26R970m293j2748j0704J4997K382k0395
9150g892m602m777P891K097K701o020o382p716K88J2989J239m89R851N518L5J681
9134F412r934j191l316J656J3009R041m12m025Q943R797j489K74o403L099J851
$$ y = [-14629, -41813, -38075, -22203, -15354, -1004, 5445, 1804, -7329, -5819, 6955, 4481, 3067, 3908, -12318, -22826, -12953, -6182, 381, -6923, -15379, -17320, -14491, -20620, -14695, 6771, 7499, 1041, 13061, 5057, 11887, 22424, 770, -16210, -17224, -8769, -2412, 8177, 10423, 5391, -4149, -3402, -14735, -10733, -1836, -7039, -9361, -2834, 15661, 3627, -5765, -830, 5953, 5732, 10923, 16663, 7875, -11169, -15357, -22012, -5009, 4518, 517, 381, 3947, 11681, 6916, -6509, -19136, -27375, -32857, -23060, -11522, 4982, 12448, 13625, 12899, 22869, 18576, 5828, -4876, 10121, 12503, -7892, -12494, -17271, -9380, -7283, -4582, -10602, -16984, -24700, -24412, -11423, -10184, -10673, -822, 4696, 4731, 6412, -3522, -4713, -8029, -6373, 6636, 15677, 15265, 11240, 20183, 29980, 28491, 28765, 22362, 25461, 27312]
9119B7312m52k2747Q804J2803p183j025o383m123J634Q55q131j4704j5822n19
9105b9681J1625J5370q098Q798m775k979K3006K4214n16j4234j804m002l967j1411
9091A546m261K150M646M788L552q237K787n251K16j2220j1160k409K3606J6456
9077A6209n981j6008K631K5000q181l1943m3K645J8456j265p375L424J0467J4480
9063B2516j3803j5462k517J1629k203r50o999k534P355o14P704n006j727p919
9049a0530n330N106Q403J3480O598j9285J556J2656m661j0988J2396J0733l039
9036A7095K389q080r196k842j481p20j2244J502L379M150j2163j0129l803j265
9022c3408o820J6455J7956N575L898R673M77r357j691M201K840j0846K338K980
$$ y = [27312, 26860, 4113, 12917, 25720, 18537, 17512, 11129, 7006, 8640, 9495, 1364, -13340, -29162, -29681, -18056, -2686, -10784, -1986, -6761, -9740, 13266, 37480, 36964, 22730, 20926, 16924, 12957, 1546, -2715, -565, 4081, 8869, 12421, 4184, 6971, 1720, 1936, -10284, -21444, -23853, -247, 16209, 10228, -5780, -3149, 21851, 13670, -18273, -18316, -15671, 2785, 1520, -5855, -2431, 8036, 22516, 8713, -6749, -9266, 2363, 160, -790, -7789, -10323, -2968, -3582, 4122, -884, -2611, -10530, -15860, -10754, -2351, 11129, 17727, -1558, -2, 12654, 7993, -2995, 9401, 20134, 17095, 19484, 11404, 2208, -634, -2115, -2835, -15079, -13577, -10198, -6048, -18211, -28340, -32143, -33408, -40228, -23773, -5817, -242, 3656, 13329, 13806, 4449, 2758, 6959, 9799, -1047, 1291, 4271]
9008D271M453J269q207j5969Q902O951O986M089J721P18O069m797k996m314J728
8993A0874m966M56o785J701j1632o751J3514R243k0455o92N232m444L868J8249
8979G412j513j1022j6284N743j831J1584J5141p406j2545O600j5618o031N711
8966b0059N092l106J0497q400k2590r636J7225J7426L316O615j777R129R525L54
8952A3611k985m706J1361j13O31Q216n463l989m16p640l245j8246n326J0060L4
8937h216K544k449L847J188M543O264k0155o735Q014m422k219Q459J0004M955
8923E622M660J2022J5838P450k048m730j6611j7747j0081m409O133K965J6876
8910A5940J3316r072j7093o764r972J4730k083m995J109l511J18p505J1686Q076
$$ y = [4271, 8724, 9993, 1786, -14183, -5281, 1670, 8656, 12745, 14466, 15184, 21253, 16456, 13460, 9146, 10874, 5908, 6364, -421, 1280, -10352, -17103, -3589, 5654, -14801, -15493, -10261, -14705, -10837, 7412, 5899, -5123, -21407, -15664, -17495, -5911, 9230, 1824, -10721, -4121, -19739, -25770, -20059, -14967, -18073, -7576, -15976, -38566, -48202, -30977, -13551, -10235, -3620, -5397, 3732, 13257, 13611, 10626, 5920, 17281, 17168, 17799, 26015, 20552, 16563, 16147, 8507, 5262, -12984, -18310, -8250, -8216, -5672, -8121, -4274, -3086, 1457, 7721, -12434, -19169, -11155, -15577, -17796, -9337, 667, 5622, 10282, 22304, 38142, 45592, 43544, 38814, 22203, 4456, -5625, -10034, -3901, -936, 15940, 29256, 20184, 3091, -3673, -13645, 1085, -998, -5993, -4884, -8395, -8277, -15782, -4096, 3980]
8896C980M074M214P482j0913O059P117K332j0764q379n786J549Q661k822r586
8882b782o720j0449P082K251L183j0389J1137J2664J1991q004o500N218j3635
8869d953k830K261r563N969R642R692K8650M256j6909j3948j9388j031K0531k702
8855I677j5768L187J957O288k080n012k600l453j0905M476K602M776J6715N035
8841A4895m931r665j1009p618j026J5052l8p287N446J4689Q220l701r591k146
8827A290j3238k829j882l063K835O746l531J358J555j1330l656k706J3240R652
8813e559J5812q136l527n358l505J0946K368q492L378J0945r917q370j871p265
8799a8551l251J538J1773Q593m818M93l718m69j3007J3107J4039P011p279m161
$$ y = [3980, 8054, 12268, 19750, 8837, 14896, 22013, 24345, 13581, 5202, -584, 965, 9626, 6804, -2782, -9502, -19951, -12869, -10618, -7435, -17824, -6687, 5977, 17968, 9964, 3464, 8682, -4953, -7783, -5522, -15085, -9116, 526, 10218, 38868, 43124, 26215, 12267, -7121, -8152, 12379, 9677, -6091, -2904, -947, 5341, 3261, -1751, -4351, -7804, -18709, -14233, -11631, -6855, 9860, 14895, 9964, 299, -10710, -18328, -19354, -4302, -4340, -11627, -6181, 8508, 16728, 13027, 3436, 1290, -11948, -14777, -16659, -19722, -16887, -10141, -13672, -12314, -10759, -22089, -25745, -28451, -15211, -5559, 10253, 2117, -1410, -6768, -10273, 673, 3041, -5451, -2073, 8872, -1045, -9415, -11286, -18551, -21802, -20264, -8491, 102, -4716, -4223, -7941, -8410, -21417, -8310, 5729, 12740, 5461, 1300]
8785A300J0037P140K040j0363j1607j838J0184p342j4087J5622P917j0118j2575
8772a3690j0611k191N309k451O738R596j4906J092K292J286P043K389P302J4508
8758A3706j0717P889P575N64m212j1893j0152j5778q384l473J5560P020J1359
8745i36M065q405j2705j4114o56J3477J347N051J0643m37J207J673Q906N412o430
8730H098j009O020j5027n323J6558j0917j7446L316R772J6653o849r259j1749
8717a7162m0k810q662J2278K1005p788M160r3P116k566N161N729n478o092j1134
8702f376j3602N760o218J3726M853R254N686R133o525j2763j3380J6960N567l045
8688I030j2481J569Q667M966Q481N411Q068K645N9N72Q73R370j299j7932k0522
$$ y = [1300, 11337, 18477, 20517, 10154, -1453, -3291, 6893, -449, -14536, 1086, 9003, -1115, -13690, -24301, -26492, -21183, -23634, -16896, -7300, -22206, -21114, -18822, -17536, -10493, -8104, -802, 13706, 2989, 10878, 18453, 19017, 14805, 2912, -7240, -23018, -31402, -34875, -19315, -12295, -936, 3129, -5276, -17981, -32095, -32751, -19274, -17927, -12876, -2233, -2670, -1463, 210, 9116, 14528, 8098, 7089, 13109, -1918, -7241, 9317, -1600, -19046, -15730, -5958, 10695, 3846, -5413, -17162, -17202, -20012, -28674, -16396, 4609, -3179, 981, 888, 8004, 5438, 10599, 16328, 10850, 4758, -6376, -19978, -14218, -20436, -6710, -1857, 7397, 13083, 22216, 15691, 2928, -10452, 6508, 12075, 9030, -3451, -1882, 6785, 11751, 20232, 25643, 33711, 36356, 36415, 36987, 37860, 47230, 45931, 27999, 7477]
8673G477m111r311R194J5742m534q122q540J2743j078o726O111P110j4602j7502
8659a6149j5745R346J4256O006K1046N034n21k839j5288j6559Q26J7216J1712
8646A8341Q431M97o546m634l56J3691P642j3927L412J2663m512q075N319j980
8632B9966o270N224J153N6j5951K080J6879K0141O617n256j70k82j2689k734p503
8617C1261P902J065N788P137P956M109P948O162q123J0759j0703j4242N717J7221
8603G9957O679q217K616j1015j2611k2323o888J2290K1776o268o617n135J638
8590D5882J1207j614o324k0195l2906j315J0381K3740j2435j6028N838R182J298
8577A6711j5527L461O713j1972J268J4915J1323R029o474q926j137m386K694J224
$$ y = [7477, 3366, -5945, 3249, 18991, 14457, 6335, -2205, 10538, 9460, 2734, 8845, 15955, 1353, -16149, -31894, -22548, -8292, -2286, 18760, 23794, 23273, 20434, 5146, -11413, -10587, 6629, 18341, 26772, 27269, 20723, 16089, 15733, 29424, 37066, 23139, 26551, 39214, 34702, 26627, 31946, 29966, 23696, 28920, 30073, 30129, 14178, 16258, 33137, 53278, 59895, 54639, 54469, 54187, 41498, 38764, 31261, 39163, 40228, 46016, 53153, 61109, 65218, 73166, 79328, 71205, 81964, 71261, 57019, 62736, 79957, 86636, 78419, 81035, 70020, 57409, 35086, 28198, 40488, 62264, 55996, 49379, 44244, 45882, 57089, 55475, 49151, 28956, -3950, -5265, 5116, 28856, 16421, 393, 6231, 15413, 16711, 1184, 4645, 11358, -614, 654, 15569, 26892, 35921, 29447, 20521, 19384, 14998, 17692, 18916]
8563A8916r085p079Q856l395m764q300J087Q208N070P988L714m100j4950n815
8549c649P295j1047j5904n171Q129O690K823J2110J8608K207j4935l116Q030P316
8535A9386m77m596j4379J300O804J4034r642q607j1866J0766J0021P670M227p326
8521A7315j1014N683j0948j3602l389o407R323J00K58N127k224J5961J9578j2397
8507A3364j2984q105r315P771O651J0741r289p2j730J093N000Q662o880j5888
8493a0981J218N646n1K564J0008j7834j0693M683j3053N64l37j272O69M835J0885
8478a3149J1150P814k213j9274R44M109Q419r206r096N288J6176J323l028p681
8464h424N555J1301M20m189r153M72j8682n872R811O387l854l641J6472J0982
$$ y = [18916, 9831, 2752, 11608, 8213, 3449, -4851, -3764, 4444, 9514, 17502, 21216, 17116, 2166, -3649, 3646, -7401, -23305, -28476, -20347, -13657, -10834, 1276, 19884, 22091, 7156, 4040, 12070, 19386, 18909, 14313, -66, 1234, 8038, 22072, 12430, 3823, -8043, 2723, 12744, 20414, 24641, 17315, 6301, 11984, 1036, -12566, -15955, -22362, -13039, -12939, -12681, -7554, -9778, 6183, 25761, 13364, 380, -7725, -17040, -9269, -2618, 8123, -1166, -1238, -2968, -1875, 3125, 11787, 4907, -10981, -9763, -4117, -4168, -1604, 8404, -9430, -20123, -15440, -28493, -27929, -28266, -29538, -28869, -24034, -13149, -1999, 5815, 3602, -15672, -14728, -10619, -2200, -11406, -20502, -15214, 962, 2285, -743, -8424, -2869, 8432, 8852, 4663, -4490, -4018, -22700, -28572, -18761, -12374, -16228, -19869, -3397, 7585]
8450G585J3448j4092q099p327j3456Q562J6642K458j2348M732J1120q689m62L141
8436C215K403l707k5147l628Q296n56m925K602Q811R627O557L2k993l9K643J8734
8420B1925J1573q372j4136j1834j8494J957p79J0709K683J596M625j7807j0409
8407b6763J0724K329j1577r393J1227J5000J2967L957M831j1363q389q436J539
8394a3347J371j0550m258J7817K1453J887q438n556J0511N252k636K718n492j1282
8380e50m815O178l261R63M373M089O446J9552q111j1837k538q448J2502k46j624
8365A2673lj4141P87J957l638l203O782J0271j196M596l665L61o796m57J3669
8350A7997j5569k6760j1171J2954K3339J4402P930P283o20k1632j2435k422o862
$$ y = [7585, 21033, 6941, -1158, -8485, -21941, -13379, 3263, 5721, -6627, -1895, 9225, 536, 74, 3215, 5618, 1911, -23236, -26864, -18568, -19124, -24049, -21447, -12636, -3009, 3548, 3580, 587, 548, 3191, 21925, 33498, 25126, 10990, -844, -19338, -17381, -18160, -7451, -4768, -3172, 1453, -16354, -26763, -16039, -13710, -25287, -34680, -23453, -8453, 4514, 8471, 13302, 1939, -6450, -14886, -13347, -11976, -22526, -26784, -8967, 12486, 14373, 5935, 379, 10890, 16142, 13506, 16224, 10732, -550, -5365, 813, -2448, -1485, 2888, 6977, 13423, 32975, 24864, 13027, 10489, 2041, 14543, 14297, 12673, 12670, -1471, -684, 1273, -2365, -5568, 1214, 11485, 10289, 14885, 11220, 11581, 4785, 4328, 17997, 2428, -24332, -35503, -22549, 790, 15192, 23122, 30405, 29785, 8153, -4282, -6704, -13566]
8337a3566p86Q703J0912k882j495J2016j0625o354J672M704R093R5j692q348o093
8322d646M189L383k6215k750K286l403P361k594K839J4766J6603M80k2288l484
8308a3473m301l37M342J6820R830j0953J63l526p331j1293l791l263J4985L927
8294h201p802R886J2692r13k143k27o906J144P696J3020L694m147O427P126P723
8279C9069O640r608q008j0391k8359o988J672O004Q494P135q749q291M996J1586
8265E202M597j7178J882j41j142m360P590P035J2975J9706j0296j6188J2923k028
8251B0577o489n82K004J8898p90j0552N104l666k583o307J0163j60q301k5N776
8236B3067o366j1595j494J3510k192j3935j8963o981J4226M865O704o779l835
$$ y = [-13566, -14352, -5649, 5263, 2381, 886, 12902, 2277, -4077, -2405, 2299, 11392, 11487, 9795, 1447, -4646, -457, 2926, -23289, -26039, -23753, -27156, -19795, -22389, -19550, -4784, 11819, 12299, -9989, -13473, -17774, -18111, -13769, 3051, 12881, 1928, 2091, -1435, -8766, -20059, -23850, -27113, -12128, -8201, -16003, -6117, 6575, 5662, 3519, 3292, -3614, -2470, 5226, 18246, 21940, 17793, 24220, 31346, 39069, 45709, 36101, 28093, 17702, -10657, -17645, -15973, -9969, -1475, 5660, -3089, -11380, -6384, 5202, 9799, -7379, -5497, -5638, -6780, -11140, -3550, 3485, 16460, 36166, 25870, 9682, 22605, 20577, 14088, 13506, 15510, 34408, 33618, 23066, 28170, 24504, 21921, 15614, 25777, 25617, 17316, 17291, 23067, 16701, 5106, 3612, 17122, 14930, 995, -17968, -24949, -10723, -5858, 846, -5933, -9768]
8223i768n846L897J4785K563m001q133o67j850Q259M628j1139o227J9786R029
8209A5316k0356k5614m909o21J745J1213n62J1570K292j1282Q135O782j972K970
8195e293L064o286q373J089K1270J1619k346j8021j376j927J1285r816k1186J1057
8181a5240J7238P632N295r690k291j1937n843J0632J2424l936n464j1757n199
8168a8136Q298N72j640J1121P941j3207p23k124o183O543J8688p708Q346j862
8154I926n899j7367j6838M778K007J4226N588P395p846n267P742M499k412j864
8140a332L916l553l080M726P237M360M329k239j4268q064q332r17R314N838j5688
8125a7753R908K808n221l949L512K0005J0741K36p959J0208r169m5o525K950J289
$$ y = [-9768, -15614, -11717, 3068, 5631, 1630, -6503, -7170, -9020, -761, 3867, -7272, -13499, 6287, 15316, -5040, -30654, -35563, -36184, -34439, -23226, -23788, -12218, -9926, -21208, -13073, -6291, -8263, -5293, -2229, -8515, -16888, -15799, 5471, 17090, 14744, -3277, -4653, -6580, 4705, -5111, -26297, -15240, 1998, 9630, 14925, 5235, 2944, -8993, -14836, -4204, 8220, 4284, -1180, -12937, -18136, -9838, -9266, -10906, 215, 8156, -5051, -5774, -7898, -14081, -7538, 11150, 3442, 11788, 9926, 4027, -13340, -30178, -25400, -23393, -9167, -3579, 3816, -4030, -9297, -1555, 2944, 532, -1332, 2584, -969, -4049, 677, 7914, 12274, 16603, 14364, 96, -7968, -16300, -17217, -7903, -2065, -17753, -7845, -5037, -10258, -14207, -10695, 9310, 20051, 20287, 12328, 22536, 13367, 13322, 6797, 9747, 11036]
8110A1036n492L53j1723q193r689J4048R253l661j660J7380L298m841j1145o875
8096g911n326J1043J0358l819k1889l888R010M177m025M020k918Q737P897k505
8082B961q537j4756j92N731J9527O019j7077k503J2216J5160R05j20K933K953
8068B5220j0972j4112j3221M869J0493O079J752q929q115k0958Q988J6506J9667
8055A7267l850J0926M912n706p936j3081j354J0160M059p722N057M066m632l466
8041H700N908k730j621O304N588P287j7753j6244j2535O667O518j265o284M64
8027a0996P471J2581l538k089Q47J4395o710j6427L300L1442R77J1885q252r505
8013B5381J0799j991j1239K241J4622K690J3702l294J1908J9314p091j5143m683
$$ y = [11036, 5544, 5897, -5826, -14019, -23708, -9660, -407, -4068, -5728, 11652, 14950, 10109, -1036, -7911, -13237, -2194, 8164, 4345, -17544, -21432, -12422, -8245, -12270, -8250, -11168, -2431, 5466, 2961, -5576, -20332, -20524, -14793, 4734, 10753, -6324, -8827, 3389, 18549, 19454, 19334, 22267, 25220, 14248, 136, -13085, -8216, 2277, 8356, 10108, 1179, -6936, -27894, -18906, -2400, 17267, 13417, 24343, 29255, 23549, 15613, 2532, 1178, 11338, 15397, 7675, 12732, 16798, 12166, 8700, 14608, 11878, 10257, 16561, 22149, 29436, 11683, -4561, -17096, -10429, -3911, -5176, -11460, -10996, -3525, 9056, 5518, 3429, 4276, 18671, 11961, -4466, -1166, 30276, 31253, 43138, 34886, 25381, 36180, 34189, 22950, 25191, 39813, 42503, 56205, 52911, 64819, 84133, 77042, 61899, 57216]
8000E7216m460j5850R233j380n624J658o623J777J0021j6478j0668k650M671R092
7986B9935J1243j8362q220l223Q884q968m109j1990n479K0521K0668r053j3652
7973H195K151K367Q858J0892j0852l290L711J8126J9156n538j3522O762O337O018
7959E9371N847j5074j8931j5606j1005J9527N340R255M43M74j867J093n931p630
7945B5306N241j8917j959R5p6r810R49j125q058j152J029k945N658K197L696j468
7929a339O920n795o422Q063J6200L320J779J4443J4294p483o123n164o01l45j4107
7914A7640j040m819m794m261M106m120O18m752J0275M63j166k690p167j111n999
7899h817m635l600J7030Q536L147J0971P152j6779r938L10K149n434N85n359L816
$$ y = [57216, 52756, 36906, 46139, 44759, 39135, 40793, 34170, 35947, 45968, 29490, 18822, 16172, 20843, 29935, 41178, 22816, 14596, 11373, 20257, 11289, 7180, -4810, -10289, 10232, 30900, 21847, 8195, 10346, 12713, 21571, 32463, 21611, 18321, 22032, 40158, 59314, 53776, 40254, 47016, 53353, 59371, 65218, 50144, 31213, 15607, 4602, 24129, 29469, 38724, 39167, 39641, 37774, 38867, 32936, 25306, 30547, 11630, 9671, 9766, 9690, -120, 829, -296, -8354, -9506, -8477, -11422, -5764, -3567, 129, -1339, 5581, -214, -6636, 1427, 17627, 20947, 22726, 37169, 51463, 43980, 37857, 32693, 32092, 31747, 17640, 16600, 11781, 6987, 2726, 6832, 2712, 3330, -1422, 8853, 9316, 8150, 5460, -1707, -2818, -8817, -13452, -17052, -22, 8514, 11661, 22632, 29784, 13005, 3067, 3377, 5526, 92, 677, -4682, -866]
7884h66N478R169k974l241Q857p424j1399P912L265j1927k3322M484J6440M468
7870a080J3854j4203m461J718o87M086l403n893J652R158n731Q939J8843r423
7856A3369k4291M730J8208K286r684j1802K86K162j3859j2441p568k580J2212
7843b8972J0433J0315R052Q330L068p475j5038j2647o418j431k039K8077L011
7830a734j0403K260P141K552j1969N51N982j1248m833P520l741j0275N609P078
7816a5510J2042Q158L198j0828o924P94L481j2253j1786J0025J2967j2075o087
7803b4798J1297M667J0040M901L348p834p456p23O638n472k987J2398J0852l917
7789A0954k581L543q734j2693P523j3774p95P766o60j200j18r50J6246N920j6758
$$ y = [-866, 4612, 13781, 10807, 7566, 16423, 8999, -2400, 5512, 8777, -3150, -26472, -21988, -5548, -1080, 12774, -1429, -5890, -4172, -4859, -773, -4176, -10069, -8417, 741, -4990, 3949, 22792, 13369, -10922, -6192, 12016, 14302, 4618, -7184, -6898, -4736, -18595, -31036, -38604, -41184, -28972, -18539, -8224, 828, 9158, 12226, 4751, -10287, -22934, -29352, -30783, -32822, -4745, -1734, -12137, -9877, -2736, -184, -12153, -11602, -5620, -16868, -21701, -14181, -17922, -28197, -22588, -15510, -3468, 4690, 7888, -2940, -9864, -9070, -5589, -17842, -29628, -19603, -6636, -18711, -24798, -13501, -8834, 1206, 6107, 9455, 1621, -5835, -6558, 80, -5392, -8379, 4019, 14871, 10954, 8373, 11916, 3182, -9511, -1988, -15762, -16557, -8791, -9451, -10651, -10769, -11719, 4527, 10447, -6311]
7774f311o468R129o490Q254R689J960j3538J0165K637k0080r466J5707M696o20
7760g36k234k261j4467q292N580P78K18P022l810l294J2294J006J3276N830L59
7745A1269R906O05j4623j6239J044k153p794o739K452N864N850k82q990j389L297
7730a7922l600J1329k66j488Q617k63K401M654m90o871o798j5306j2480j5720
7716e4203K737L0590M1198P55j9915j2349r09K489l596p293o540N820j0019Q956
7702b2279R882J372K061O014L544M999O816o032q749K196J836r728p015j419q12
7687a7314k081N955n847J82J3755J2842P10O981o047N881k331j5192r382M844
7673g044K3165J1953n503L805M982j1659j2015m952l159O449L191m60k95q991
$$ y = [-6311, -12779, -3650, -10140, -1886, 7803, 9763, -3775, 6390, 9027, -11053, -20519, -4812, -116, -736, -2970, -5231, -19698, -27990, -22410, -21632, -21414, -14392, -18202, -21496, -9202, -8196, 5080, 10910, 11269, 21175, 21780, 7157, -9082, -8038, -10191, -17985, -24724, -22272, -16408, -10558, -10840, -19830, -21219, -17922, -21522, -10193, -10459, -11947, -3330, -3593, -1192, 3462, 2972, -3899, -10697, -26003, -38483, -54203, -51466, -20876, 20322, 21077, 1162, -11187, -12096, -9607, -13203, -20496, -27036, -21216, -31235, -22279, -12397, -11025, -8964, -2950, 594, 5593, 12409, 6377, -2372, -176, 1660, -8068, -15083, -16502, -17314, -19395, -13440, -19287, -19105, -5350, 7492, 8202, 15183, 9136, 15017, 12686, -2506, -11888, -7044, 16121, 28074, 22571, 26376, 31358, 19699, 7684, 2732, -427, 6022, 9213, 8753, 8458, -533]
7659e33j1887M971m892M108l598L915J4850j0057j4856j644L030M278l024q00
7645a6139n08j295M37j204J5199L771m551j6815j5654Q52J1500n761R717J8318
7631b133N388J7j0706j2967O003k812K688m806P004m71k177K923Q143O085Q11
7616B990O21L129q410K124M430K125l437p094q028J557o502N888q271O324L030
7601i524L579K221q60j1106j4552o649P296J0796P413k369j5956M675Q489J6227
7587c20Q14j0132P025O282K94j4414j0510m52N751J4392Q024N02M680J1363n360
7572A7939O370L090l054j5434L393M691r087k2196j9117O300o076l187N726o95
7558c1337j360M844P859L111p80k826l507R531P543j5875M286J1665R842J8824
$$ y = [-533, -12420, -7449, -12341, -8233, -11831, -7916, 6934, -3123, -17979, -19623, -16593, -12315, -15339, -16139, -16647, -17942, -17505, -18709, -3510, 261, -4290, -21105, -36759, -35907, -24407, -30168, -20451, -2133, 3255, 3272, -7434, -20401, -14398, -17210, -14522, -19328, -12324, -12795, -14972, -12049, -3906, 2179, 2990, 3611, 6740, -1670, 454, 4884, 7009, 3572, -3522, -11550, -9993, -16495, -10607, -18878, -12554, -9524, -5945, -3724, -4584, -15690, -30242, -36891, -29595, -18799, -11386, -13755, -29711, -25036, -16547, -320, 494, -9638, -2613, 3669, 3963, -10451, -20961, -21413, -15662, -1270, 6754, 7256, 11936, 23299, 17939, 24309, 27399, 24345, 8911, 12304, 16995, 7908, -14288, -33405, -27105, -33181, -36368, -30642, -31337, -32697, -27853, -19994, -16883, -17663, -20489, -23996, -14465, -6922, -22797, -18511, -6846, 2996, 21820]
7544B1820j7830q790K578J279O355j1432r562j1508P95K036r26J9517J4637J3131
7530B2100j0422o474L036K800j646j6053j366O023Q950O31J111j359M827K994
7516A5152k1360j2167K829J0068M187o368J040m900m606M013j0293O444J6329
7503C68m997p17o290o989J0969R328P2l737N892k869P002M771l365k332j4391
7488g285n620J7677o194p865l26O709O732r175r896M73l631K304N410M761k792
7473h718j6075k264J2774J477o913M618J2450K405N99k928M889M700n677J272
7459B609j913j538j6699j2554J4830J8437m946J1797m637o704o779l164n232m694
7445b1187J2846J9323Q1j204j6483p139O231q278q52K149M310P500J4541p32o363
$$ y = [21820, 3990, -4800, -2222, -943, 5412, -6020, -15582, -27090, -26295, -24259, -25185, -5668, 8969, 22100, 11678, 5204, 8240, 11040, 9394, -6659, -8025, -2002, 6948, 7579, 8690, 7331, 12158, 15152, -6208, -18375, -15546, -5478, -1291, -7659, -6619, -11519, -16125, -12112, -22405, -15961, 368, -4629, -5346, -11636, -18625, -7656, 1672, 1744, -1993, 3899, 1030, 8032, 12803, 9438, 7106, -7285, -12905, 4772, -1422, -9287, -9613, -2904, 3828, -5347, -15243, -14770, -18401, -16097, -10687, -5926, -8718, -24793, -27057, -14283, -12806, -19719, -15101, -2651, -246, 353, -2575, 2314, 7014, 1337, 2609, 696, -842, -17541, -30095, -15265, 3172, -1774, 10023, 5386, -1318, -8097, -11261, -16493, -21187, -8341, 10982, 11063, 9859, -6624, -13763, -7532, -15810, -16662, -14513, -10203, -2703, 11838, 11106, 4743]
7430D743k661R17R44j5823o399J1862K0045L860j7440n295j833J6386j116n266
7416B924l297J3695Q475j0313j3572J3837O307j4494j0024n458P376K915r993
7403a1622O564L392q940J606j252p588Q84N478N828O550M909j0440o822m89l983
7388a5925K6857j650j5279l138j2459R67N990m745l797J228n156J903Q138J8830
7374A764J5484o2j0447L592k382j6746j0713J4287R039K844J456n824j0520P41
7360g487mk864j1640O159J9135l221j0474R962J0061j478j3137j9756M698R518
7346a0528O025k924J023L660L990j46q604l928P925M056o957M160M862m262N242
7331C594j543j6467k159L791J8734P086j0005P81p677l522m96k763Q763m455M709
$$ y = [4743, 2082, 2999, 3943, -11880, -18279, -6417, 13628, 17488, 48, -5247, -7080, 9306, 8190, 2924, -373, 13322, 21797, 11484, -2088, 11749, 18056, 3562, -6462, -11920, -4544, -1629, -11622, -5058, -1666, -10606, -9000, -10252, -17840, -16956, -11478, -5650, 900, 5809, -4631, -11453, -11942, -15925, 10932, 9282, -5997, -9135, -21594, -20627, -14637, -19382, -23179, -21951, -27107, -25204, -17066, 1764, 17248, 17186, 6739, 10331, 7949, -8797, -19510, -5223, 3816, 6660, 8116, 2292, -8228, -7487, -7491, -10355, -21995, -15836, 3299, 78, -10396, -434, 9627, 8149, -4988, -24744, -20046, -10528, -4503, -7427, -6404, -2744, 1246, 1100, -7504, -11432, -3507, 549, -6408, -2248, 2614, -1648, 3594, 2051, -14416, -16575, -12784, 5950, 13036, 3031, 3812, -3865, -7387, -7883, -10646, -1883, -6338, -1629]
7316a629L799j281J821J34l417k457J236L898M400K184j8829j220J4794m042K80
7301c29J5424J631j4829P7O065j595n464j3429j0039l907J1734R163O377j1916
7287a1037m87p09K098L601J129L179j73j180K100k444P834j296r264JM613k770
7271d805R142L407Q5N012l14m383j739K294j2211p421K550o383j2135M046l192
7256b6047J7476J3712k813o660K141j4092j1671J864J969K375L285R499K190N330
7242a442J84N891Q614m857n769q988j2915J0524J1659j4560k950P793P343n215
7228d688j7604j178q846n850O287M601L992J1698P01L48J055N221L710p0P7M598
$$ y = [-1629, 2170, 889, 2710, 2844, -573, -3030, -1794, 2104, 6504, 8688, -10141, -11361, 3433, -609, -329, 15095, 16726, 1897, 1974, 8039, 6444, 980, -12449, -22488, -26395, -14661, -5498, 879, -11037, -11524, -12233, -10135, -6534, -5405, -2226, -2399, -3579, -1479, -3923, 3911, 2615, -6649, -6648, -2035, -4805, 4337, 7744, 7829, 12841, 12527, 8144, 6405, 8699, -3512, -10933, -8383, -14766, -26901, -22855, -26047, -8571, 5141, 2328, -4332, -2191, -16283, -27954, -26090, -24121, -21746, -18461, -8962, -6772, -1442, -1258, 4633, 13247, 8390, 2621, -6367, -19282, -8758, 2901, -11659, -14609, -6816, 527, -4688, -22292, -23470, -32316, -38166, -31879, -27278, -23286, -11588, -10887, -10539, -9484, -4263, -553, -623, -546, 4052]
$$ [...]
##END NTUPLES=NMR SPECTRUM
##END=
