##TITLE=Analysis number 316859
Compound Code cc 44404
Book Reference 382/166/1
Project Code adrs
Chemist Name simons
##JCAMPDX= 6.0         $$ Bruker NMR JCAMP-DX V2.0
##DATA TYPE= NMR SPECTRUM
##DATA CLASS= NTUPLES
##ORIGIN= Bruker BioSpin GmbH
##OWNER= nmr
$$ XWIN-NMR		Version 3.5
$$ Mon Jan 30 10:35:27 2006 GMT Standard Time (UT+0h)  MAYBRIDGE\nmr@NMR_250MHZ
##.OBSERVE FREQUENCY= 250.131544655141
##.OBSERVE NUCLEUS= ^1H
##.ACQUISITION MODE= SIMULTANEOUS (DQD)
##.ACQUISITION SCHEME= undefined
##.AVERAGES= 16
##.DIGITISER RES= 18
##SPECTROMETER/DATA SYSTEM= dpx250
##.PULSE SEQUENCE= zg30
##.SOLVENT NAME= CDCl3
##.SHIFT REFERENCE= (INTERNAL, CDCl3, 0, 16.4517)
##AUDIT TRAIL= $$ (NUMBER, WHEN, WHO, WHERE, WHAT)
$$ ##TITLE= Audit trail, XWIN-NMR		Version 3.5
$$ ##JCAMPDX= 5.01
$$ ##ORIGIN= Bruker BioSpin GmbH
$$ ##OWNER= nmr
$$ C:\u/data/dgb/nmr/ADRS/15360/pdata/1/auditp.txt
$$ ##AUDIT TRAIL=  $$ (NUMBER, WHEN, WHO, WHERE, WHAT)
(   1,<2006-01-30 10:35:06.17 +000>,<MAYBRIDGE\nmr>,<NMR_250MHZ>,
      <created by zg, POWCHK disabled, PULCHK disabled
       configuration hash MD5:
       62 19 C7 07 E1 42 D1 B7 37 6C 3D D0 77 39 F9 E6
       data hash MD5: 64K
       C9 6E CB 2E 3F 40 AB 95 79 61 F3 FA 8F 74 E5 16>)
(   2,<2006-01-30 10:35:18.44 +000>,<MAYBRIDGE\nmr>,<NMR_250MHZ>,
      <Start of raw data processing
       ef LB = 0.3 FT_mod = 6 PKNL = 1 SI = 32K 
       data hash MD5: 32K
       7D 54 D5 26 2C 51 0A D1 CD 23 6D C1 F2 92 4B 66>)
(   3,<2006-01-30 10:35:20.11 +000>,<MAYBRIDGE\nmr>,<NMR_250MHZ>,
      <apk 
       data hash MD5: 32K
       CC 59 70 2B F4 DA 68 8E 9A 5E 7E 47 C7 40 23 C8>)
(   4,<2006-01-30 10:35:20.83 +000>,<MAYBRIDGE\nmr>,<NMR_250MHZ>,
      <abs ABSG = 5 
       data hash MD5: 32K
       63 C5 FA D8 AF A2 E9 2C 66 D8 0B E9 20 DB 62 03>)
$$ ##END=
$$ 
$$ hash MD5
$$ 8F 74 77 4A 1A 1D DB 6D D6 3D C6 B7 76 81 23 9E
##$RELAX= 
##$RELAX= 
##$RELAX= 
##$RELAX= 
##$RELAX= 
##$RELAX= 
##$RELAX= 
$$ Bruker specific parameters
$$ --------------------------
##$DU= <C:\u>
##$EXPNO= 15360
##$NAME= <ADRS>
##$PROCNO= 1
##$TYPE= <nmr>
##$USER= <dgb>
##$AMP= (0..31)
100 100 100 100 100 100 100 100 100 100 100 100 100 100 100 100 100 100 
100 100 100 100 100 100 100 100 100 100 100 100 100 100 
##$AQSEQ= 0
##$AQ_mod= 3
##$AUNM= <au_zg>
##$AUTOPOS= <15 >
##$BF1= 250.13
##$BF2= 250.13
##$BF3= 250.13
##$BF4= 250.13
##$BF5= 500.13
##$BF6= 500.13
##$BF7= 500.13
##$BF8= 500.13
##$BYTORDA= 1
##$CFDGTYP= 0
##$CFRGTYP= 5
##$CHEMSTR= <none>
##$CNST= (0..31)
1 1 145 1 1 1 1 1 1 1 1 1 1 1 1 1 1 1 1 1 1 1 1 1 1 1 1 1 1 1 1 1 
##$CPDPRG= <>
##$CPDPRG1= <>
##$CPDPRG2= <>
##$CPDPRG3= <>
##$CPDPRG4= <mlev>
##$CPDPRG5= <mlev>
##$CPDPRG6= <mlev>
##$CPDPRG7= <mlev>
##$CPDPRG8= <mlev>
##$CPDPRGB= <>
##$CPDPRGT= <>
##$D= (0..31)
0 1 0 0 0 0 0 0 0 0.06 0 0 0 0 0 0 0.0002 0 0 0 0 0 0 0 0 0 0 0 0 0 0 
0 
##$DATE= 1138617305
##$DBL= (0..7)
120 120 120 120 120 120 120 120 
##$DBP= (0..7)
150 150 150 150 150 150 150 150 
##$DBP07= 0
##$DBPNAM0= <>
##$DBPNAM1= <>
$$ [...]
##$SUBNAM7= <"">
##$SUBNAM8= <"">
##$SUBNAM9= <"">
##$SW= 20.6930455092707
##$SWIBOX= (0..15)
0 0 3 0 0 0 0 0 0 0 0 0 0 0 0 0 
##$SW_h= 5175.983436853
##$TD= 65536
##$TD0= 1
##$TE= 293.16
##$TE2= 300
##$TE3= 300
##$TEG= 300
##$TL= (0..7)
0 120 120 120 120 120 120 120 
##$TP= (0..7)
150 150 150 150 150 150 150 150 
##$TP07= 0
##$TPNAME0= <>
##$TPNAME1= <>
##$TPNAME2= <>
##$TPNAME3= <>
##$TPNAME4= <>
##$TPNAME5= <>
##$TPNAME6= <>
##$TPNAME7= <>
##$TPOAL= (0..7)
0.5 0.5 0.5 0.5 0.5 0.5 0.5 0.5 
##$TPOFFS= (0..7)
0 0 0 0 0 0 0 0 
##$TUNHIN= 0
##$TUNHOUT= 0
##$TUNXOUT= 0
##$USERA1= <user>
##$USERA2= <user>
##$USERA3= <user>
##$USERA4= <user>
##$USERA5= <user>
##$V9= 5
##$VALIST= <valist>
##$VCLIST= <CCCCCCCCCCCCCCC>
##$VD= 0
##$VDLIST= <DDDDDDDDDDDDDDD>
##$VPLIST= <PPPPPPPPPPPPPPP>
##$VTLIST= <TTTTTTTTTTTTTTT>
##$WBST= 1024
##$WBSW= 4
##$XGAIN= (0..3)
0 0 0 0 
##$XL= 0
##$YL= 0
##$YMAX_a= 563491
##$YMIN_a= -607160
##$ZGOPTNS= <>
##$ZL1= 120
##$ZL2= 120
##$ZL3= 120
##$ZL4= 120
##$ABSF1= 16.45169
##$ABSF2= -4.241482
##$ABSG= 5
##$ABSL= 3
##$ALPHA= 0
##$AQORDER= 0
##$ASSFAC= 0
##$ASSFACI= 0
##$ASSFACX= 0
##$ASSWID= 0
##$AUNMP= <proc_1d>
##$AZFE= 0.1
##$AZFW= 0.1
##$BCFW= 0
##$BC_mod= 0
##$BYTORDP= 0
##$COROFFS= 0
##$CY= 12.5
##$DATMOD= 1
##$DC= 0
##$DFILT= <>
##$DTYPP= 0
##$F1P= 14.0000005364418
##$F2P= -0.99999901652339
##$FCOR= 0.5
##$FTSIZE= 32768
##$FT_mod= 6
##$GAMMA= 0
##$GB= 0
##$INTBC= 1
##$INTSCL= 1
##$ISEN= 128
##$LB= 0.3
##$LEV0= 0
##$LPBIN= 0
##$MAXI= 10000
##$MC2= 0
##$MEAN= 0
##$ME_mod= 0
##$MI= 0
##$NCOEF= 0
##$NC_proc= -2
##$NLEV= 6
##$NOISF1= 0
##$NOISF2= 0
##$NSP= 0
##$NTH_PI= 0
##$NZP= 0
##$OFFSET= 16.45169
##$PC= 1
##$PHC0= 245.8371
##$PHC1= 6.64431
##$PH_mod= 1
##$PKNL= yes
##$PPARMOD= 0
##$PSCAL= 4
##$PSIGN= 0
##$REVERSE= no
##$SF= 250.130017586188
##$SI= 32768
##$SIGF1= 0
##$SIGF2= 0
##$SINO= 400
##$SIOLD= 32768
##$SREGLST= <1H.CDCl3>
##$SSB= 0
##$STSI= 32768
##$STSR= 0
##$SW_p= 5175.98343685301
##$SYMM= 0
##$S_DEV= 0
##$TDeff= 65536
##$TDoff= 0
##$TI= <Analysis number 999999
Compound Code 99
Book Reference 9
Project Code 9>
##$TILT= no
##$TM1= 0
##$TM2= 0
##$TOPLEV= 0
##$USERP1= <user>
##$USERP2= <user>
##$USERP3= <user>
##$USERP4= <user>
##$USERP5= <user>
##$WDW= 1
##$XDIM= 32768
##$YMAX_p= 449555398
##$YMIN_p= -407106
$$ End of Bruker specific parameters
$$ ---------------------------------
##NTUPLES= NMR SPECTRUM
##VAR_NAME=  FREQUENCY,     SPECTRUM/REAL,   SPECTRUM/IMAG
##SYMBOL=    X,             R,               I
##VAR_TYPE=  INDEPENDENT,   DEPENDENT,       DEPENDENT
##VAR_FORM=  AFFN,          ASDF,            ASDF
##VAR_DIM=   32768,         32768,           32768
##UNITS=     HZ,            ARBITRARY UNITS, ARBITRARY UNITS
##FACTOR=    0.157963299565203, 1,           1
##FIRST=     4115.06167756715, 0,            0
##LAST=      -1060.92175928586, 0,           0
##MIN=       -1060.92175928586, -407106,     0
##MAX=       4115.06167756715, 449555398,    0
$$ Real data points
##PAGE= N=1
##DATA TABLE= (X++(R..R)), XYDATA
$$ [...]
19800C5397O095k0979l89O403n758n675M59L747O630K258O744K5510K8900M8343
19786A37685L9447J4833k2116m1608j9826j9108j3174O056J5449K3997J5632N971
19774A43238p141j6216m236J7275K7615Q135l8029k7822k5681j6289m132N65j0600
19761D6682j3609j2186m417K923j394l747K813m270q74R060O294M353K0456M93
19747E2577j0011j4096J116l380o348Q582O446j700j0431j1473j2492j524K655
19734g9N525J2987O25m585l771k224M739K406j4759j5951N315J2227J0037p668
19720D824j7493M664o206K094N009J0255J3185P149R59m832l014J5909k985o242
19706B3276Q014J135P789n288j4565p804N409O582M568o082R248J1952m740r669
$$ plain form
19800 35397 41492 20513 20124 26527 20769 15094 15553 19300 25930 28188 34932 60442 89342 137685
19786 137685 177132 191965 169849 128241 108415 89307 76133 82189 97638 121635 137267 143238
19774 143238 136097 119881 115645 132920 160535 168670 130641 102819 77138 60849 56717 57282 46682
19761 46682 33073 20887 16470 19393 17999 14252 17065 12795 11921 20981 27275 31628 52084 52577
19747 52577 42566 28470 29586 26206 19858 28440 34886 33186 22755 11282 -1210 -2734 -79
19734 -79 5446 18433 19058 14473 10702 8478 13217 15623 864 -15087 -9772 2455 12492 4824
19720 4824 -12669 -8005 -14211 -12117 -7108 3147 16332 23481 24440 19608 16594 32503 29518 23276
19706 23276 31290 32425 40214 34926 20361 12557 17966 24548 29116 23034 32282 44234 39494 29825
19692B9825j1853J15p365q175q271K927P450J5211K732l391j0324n44R438O851
19678B4626m547j5433M221L512N578M433o28j3285k647N340J81J1888J505q447
19664A6297O761M958J353M619l138k867K394q365j4180M715n886r600K1202J7293
19650C5556M387q47N799k505R914j5542j7244r354j2043p179J2218L2534K0199
19637E5893n572K227o907o558o855R462Q786j1467k4631J474J6219n377j0285
19624A6409J4700r827j0592J6527j993l613J7337k758r924N397K967j3600j0503
19611A0527M867J773P43Q830J431J3541J260j8116q433J0129k203K32o89j5377
19597H515j2123R317J2030J252j2689l27J8757J9704J7763j2873j5211k3634o70
$$ plain form
19692 29825 17972 18087 10722 2547 -5724 -2797 4653 19864 22596 19205 8881 8337 17775 24626
19678 24626 20079 4646 8867 12379 17957 22390 21762 8477 5830 11170 11351 23239 24744 16297
19664 16297 23058 28016 29369 33988 30850 27983 30377 22012 7832 12547 6661 -2939 18263 35556
19650 35556 39943 39096 44895 42390 52304 36762 19518 10164 -1879 -9058 3160 35694 55893
19637 55893 50321 52548 45641 39083 32228 41690 50476 39009 14378 15852 32071 26694 16409
19624 16409 31109 21282 10690 27217 25224 21611 38948 36190 26266 31663 34630 21030 10527
19611 10527 15394 17167 17910 26740 28171 41712 42972 24856 16423 26552 24349 24581 23892 8515
19597 8515 -3608 5709 17739 18991 6302 5975 24732 44436 62199 49326 34115 10481 9811
19584I811J2670L062Q424K1507P861N108M77k0318q451J3562k030o985j6510j6571
19570A1617J9739J2910J2467j594m93P037R22j3336M603J1443J8961L1227L552
19557A19055m51j2456j4210N480K0895J1289j3842j7321k5105j4176j6857L212
19545D5513k8126o190J5668P522O235l206J0269Q368L0120K8739K2558O733j2067
19532A32136n665j4689k3240j5927o294L936j194O924L3897J3274j0472j7944
19520I4742j5077p231j3026k964j3613o896J1644J2713M819k521k1842Q80J6662
19507E8290L3604K0905m411k3064k8724j3954J7805J6204J2024J7068K5353j1686
19495A19414j1889q36L666J6621K1008r06j7203k5182j9330j6912j3671p457M866
$$ plain form
19584 9811 22481 25543 33967 55474 63335 68443 68920 48602 40151 53713 51683 44698 28188 11617
19570 11617 31356 44266 56733 55139 54646 61683 62605 49269 53872 65315 84276 115503 119055
19557 119055 118604 106148 91938 97418 118313 129602 115760 98439 73334 59158 42301 45513
19545 45513 17387 11197 26865 34387 40622 37416 47685 56053 86173 114912 137470 144203 132136
19532 132136 126471 111782 88542 72615 66321 70257 69063 75987 109884 123158 112686 94742
19520 94742 79665 72434 59408 56444 42831 35935 47579 60292 65111 62590 40748 41628 58290
19507 58290 91894 112799 108388 85324 56600 42646 60451 76655 88679 105747 131100 119414
19495 119414 107525 106689 110355 126976 147984 147078 129875 104693 85363 68451 54780 47323 52189
19482E2189j075N721J4627K612R343J496J470Q32n013j1992J432l741Q005J0569
19468H6475RR89n715L269J0596m224k5996j3724j0973n549m801K1236M126n347
19454E0371j7007J577R901j7812p933N723J3681Q662O68L990j893Q109J4708j3260
19440E9485k8217M299J9824N172J1119J4258K1352Q553r851j2514L393J7985M745
19427A19603p371p356J0J2570M452k5768j3488L859K820J2344K4462K247j95n364
19413A22825j054j1570j3908N357o275m740J1785n457j3631R114p600j5401O315
19400G5760j655j473K2422K0266M869N227R112p859j413N134j217J5688R245N793
19386A59899L881m988K804R849l487K208J2978P493p760k848J4992J0903P501
$$ plain form
19482 52189 51114 56835 71462 74074 83417 84913 86383 87215 82202 70210 71642 67901 75906 86475
19468 86475 86484 87473 81758 85027 95623 91399 65403 51679 40706 35157 30356 51592 55718 50371
19454 50371 33364 34941 44842 27030 19097 24820 38501 47163 47831 51821 49928 58037 72745 59485
19440 59485 31268 35567 55391 60563 71682 85940 107292 115845 105994 93480 96873 114858 119603
19427 119603 112232 104876 104886 117456 121908 96140 82652 86511 89331 101675 126137 128384 128189 122825
19413 122825 121771 110201 96293 101650 95375 90635 102420 96963 83332 92446 84846 69445 75760
19400 75760 74105 72632 95054 115320 120189 125416 134528 126669 125256 130390 129173 144861 154106 159899
19386 159899 163780 158792 161596 171445 167958 170166 183144 190637 182877 180029 195021 205924 213425
19373B13425j2822j743J8078K2595N3966R9856J30370J35920O8132l3009j12992
19362E81776j47714q7539l1444k1600J3j4427R54J7118l026N697J9457J8454J84
19349C37903L3401M8184M0107N0611M6682M1848N8345Q0549J31934J44549J63625
19338A177738J76779K86155N57535R21268J001052L98158j03688m25656n26178
19329C463163k11581K5476K11275L89101P14583J411883K618292M357031M924595
19320A7903818K149109k99181j739379j953621O66976L459060K712334J19595
19312B3018711r71954j433608O90305J326260j214872k646867m270489m226869
19304A0270617k678867j538217r23147n94492m21681l11842k13771j32004m146
$$ plain form
19373 213425 200603 198860 216938 239533 293499 393355 523725 659645 727777 694768 581776
19362 581776 434062 346523 315079 293479 293492 279065 280019 297137 294111 299808 319265 337719 337903
19349 337903 371304 419488 459595 510206 556888 598736 657081 737630 869564 1014113 1177738
19338 1177738 1354517 1640672 2198207 3119475 4120527 4518685 4414997 3989341 3463163
19329 3463163 3251582 3277058 3488333 3877434 4592017 6003900 8622192 12979223 17903818
19320 17903818 20052927 19753746 18014367 16060746 16727722 20186782 22899116 23018711
19312 23018711 22046757 20613149 21303454 22629714 21414842 18767975 14497486 10270617
19304 10270617 7591750 6053533 5130386 4535894 4114213 3802371 3588600 3456596 3452450
19295C452450J63790L72073O63412J214418K349094L969650L767871P72300j137303
19286A5587755k785229l110146j660850k74967R99774K497357L577202K381357
19278A7212253K25914j023742j850945r15413J360893L379019K723148j59201
19270B0951926k041919l556721l397004k066825r81214j85718O73850K024710
19262A1421085M032916N241692K701643l90842k061540k836505m16568K839178
19254B0531059K780385o20966k712187m586215m639342l004625j773412j119162
19246D855535p77365n58344m00371k91573j77938j12222n1560o059J31000L92009
19236C003112Q35379J141143N07398k94894p67806j124531r00179n28563l12952
$$ plain form
19295 3452450 3616240 3988313 4651725 5866143 8215237 12184887 15952758 16725058 15587755
19286 15587755 12802526 9692380 8031530 7756563 8756337 11253694 14830896 17212253
19278 17212253 17438167 16414425 14563480 13648067 15008960 18387979 21111127 20951926
19270 20951926 18910007 15353286 11956282 9889457 8908243 8722525 9396375 11421085
19262 11421085 15454001 20695693 23397336 23006494 20944954 18108449 17691881 20531059
19254 20531059 23311444 22690478 19978291 15392076 10752734 7748109 5974697 4855535
19246 4855535 4078170 3519826 3119455 2827882 2649944 2537722 2486162 2480103 2611103 3003112
19236 3003112 3838491 4979634 5487032 5192138 4424332 3299801 2399622 1871059 1558107
19227A558107k24755j74016j32300j00068p2754p9152o3700j9589K7385M8758
19217G67916J03742J45381P1145k0866j03893j76879j61571j16541p7507n5629
19207C75298l7255l7096k3928K288j207j2205r637j7972j5649k5640j4322j7817
19195A64858j3483j4879j9922m51L339J8733K782j0137j3239q209J1098J0539
19183A31029j787N540K842J3864m021k3754p509p762j8282p06M647J564r588j4520
19169G1557K196o81k2480k3399L375K8597J8132K721p455O312J578p156m259j5132
19155E3906L541m803j6716J4070k633J11K4966l853O692r761R343j719L4k008
19141G1170R144J1113J3775M800k1322m335N665j171j89R743N959j2730l798L573
$$ plain form
19227 1558107 1333352 1159336 1027036 926968 854214 775062 711362 691773 719158 767916
19217 767916 871658 1017039 1088184 1067318 963425 786546 624975 508434 430927 375298
19207 375298 338043 300947 277019 279307 278100 265895 256258 238286 222637 196997 182675 164858
19195 164858 151375 136496 116574 116123 119462 138195 140977 130840 117601 109392 120490 131029
19183 131029 129242 134782 137624 151488 147467 123713 116204 108442 90160 89454 94101 95665 86077 71557
19169 71557 73753 73072 50592 27193 30568 59165 77297 80018 72563 78875 80453 73297 69038 53906
19155 53906 57447 52644 35928 49998 47365 47476 72442 68589 75281 65520 74863 73144 73178 71170
19141 71170 80314 91427 105202 110002 88680 84345 90010 88839 88650 98393 104352 91622 87824 91397
19127I1397R436l346j5365p746p981j5969r564L608J2172K235j497J987J5277
19114G4644J4004m750k882p957N136K565n545j623O283L4656l119m862J3454J4773
19100A34777J215P463l95J0256J2716O117K562N787O440J558m804J0542r47O319
19086A99606N793M488K3108M6417N4371P5143J35216J73636R2212k8638p9557
19075G01795j23691q6352l9693k3246J5307K8990N8238J15826J48460J80279L07871
19064A283784N46887R25614J001010L04283k16268o43242q14706n61763l13308
19055A512291j34049o8268m2390K1513R2718J14863J76313K71373M21357O64013
19045C029734J144613K088005L717914N139403L163213K10371j306758k369211
$$ plain form
19127 91397 100833 97487 82122 74376 66395 50426 40862 44470 56642 58877 57380 59367 74644
19114 74644 88648 83898 81016 73059 78195 80760 75215 73592 79875 114531 111412 106550 120004 134777
19100 134777 135992 143455 143060 153316 166032 172149 174711 180498 186938 188496 183692 194234 193287 199606
19086 199606 205399 209887 232995 279412 333783 408926 544142 717778 809990 781352 701795
19075 701795 578104 491752 452059 428813 444120 473110 531348 647174 795634 975913 1283784
19064 1283784 1830671 2756285 3757295 4061578 3845310 3202068 2387362 1825599 1512291
19055 1512291 1378242 1309974 1267584 1289097 1381815 1496678 1672991 1944364 2365721 3029734
19045 3029734 4174347 6262352 9980266 15119669 18282882 18493253 17186495 14817284
19037A4817284n32682K479046K913912l9837j816962l507599l715521k190227
19029H407414q92466P2809J094208K496449L942549K971295J41243j400717k688872
19020A4143912k029162J13475K114504K119792j11078j603865k850733k956927
19012H939918j844713r40522l55916J50582Q98393K208010L901463L337653J83351
19003A6478219j695852l395839l523987k123146j148971o71360l95759k30612
18995C292693j01114K9198J30617K32237L40007N40427R10470J687603L187190
18986A0249328N487347N696377K323704J161444J040797J670966K11944j764053
18978B6077854k904395l451894o08372K790872K381489j106630l021157m912356
$$ plain form
19037 14817284 14284602 16763648 19677560 19637723 17820761 14313162 10597641 8407414
19029 8407414 7514948 7587757 8681965 11178414 15120963 18092258 18233501 16832784 14143912
19020 14143912 12114750 12228225 14342729 16462521 16351443 14747578 11896845 8939918
19012 8939918 7095205 6154683 5798767 5949349 6847742 9055752 12957215 16294868 16478219
19003 16478219 14782367 11386528 7862541 5739395 4590424 3919064 3523305 3292693
18995 3292693 3191579 3220777 3351394 3583631 3923638 4464065 5374535 7062138 10249328
18986 10249328 15736675 21433052 23756756 24918200 25958997 27629963 27841907 26077854
18978 26077854 23173459 19721565 19113193 21904065 24285554 23178924 20157767 15245411
18970A5245411m626811k857720j644062r70738o25441l79896j32260J51748O14393
18961D774624J060396O80821k18840p57040j234704j098914o80612m39883l11151
18952A774697k31186j76985j18832j00698q5092r6306j01610q2362n8377m5239
18942F78010m3087m1145j5421j5689K0208N3743P9213J54780K42295K66031K43280
18931A622218K46409N9250o1850n3412n8665o5016J8869n0129j65158j37479q4064
18920A270973j2490o9117j37970j89421j99805j30045p7879m8391l0475l8171
18910C37209k8321k8463j8504k2809k809N38j3234l3201k0473Q69l924n961j349
18897A59568j454n778J5408j0473k4457J5001K2117L0469K2105J1819K4557M6813
$$ plain form
18970 15245411 10618600 7760880 6116818 5146080 4520639 4140743 4008483 4160231 4774624
18961 4774624 5835020 6515841 6297001 5539961 4305257 3206343 2525731 2085848 1774697
18952 1774697 1543511 1366526 1247694 1146996 1061904 965598 863988 781626 723249 678010
18942 678010 634923 593778 578357 562668 582876 636619 715832 870612 1112907 1378938 1622218
18931 1622218 1868627 1927877 1866027 1812615 1753950 1688934 1707803 1657674 1492516 1355037 1270973
18920 1270973 1258483 1189366 1051396 861975 662170 532125 454246 405855 375380 337209
18910 337209 308888 280425 261921 239112 236303 236841 223607 190406 169933 170802 166878 160917 159568
18897 159568 158114 152336 167744 157271 132814 147815 169932 200401 222506 234325 258882 305695
18885C05695M0518P5744J24523J89574J96266N7796j3947r0566j05843K502J19513
18874I01775K79242L73856J76004o5785k13985k91858j83378R793R7456j5221
18864A067899j24176j76207j89735j26397q0700k8567j4855p504L132j5222o534
18853C01134K7000K2140j4090l0095j8635J4118J1773m872L853J9427J938l8163
18841B95528l7983m0390j1429K1812J2427m601j6581o223j5811j5966j5702j8506
18829A46575n842k3106k0019P09J5443J2332j252r391r083j4084j8981q312k069
18816F2920J7745J4615K9491J5160J6464R393K1113L7244J1423q146j1645j4154
18804B01623Q292K6289L4271K4888J1509P656O572j1063r269p423K1280L7402
$$ plain form
18885 305695 346213 421957 546480 736054 932320 990116 976169 885603 779760 782262 901775
18874 901775 1181017 1554873 1730877 1665092 1451107 1159249 975871 985664 1083120 1067899
18864 1067899 943723 767516 577781 451384 370684 342117 327262 319758 322890 307668 301134
18853 301134 328134 350274 336184 306089 287454 301572 313345 308473 312326 331753 333691 295528
18841 295528 257545 217155 205726 227538 239965 235364 218783 212560 196749 180783 165081 146575
18829 146575 140733 117627 97608 98317 113760 126092 124840 115449 106366 92282 73301 64989 62920
18816 62920 80665 95280 124771 139931 156395 165788 186901 224145 235568 227422 215777 201623
18804 201623 209915 236204 270475 295363 306872 314528 321100 310037 300768 293345 314625 352027
18792C52027J4601l4172l1717j7651k9074j6903N503Q410k885m441j2499j5480
18780B15719l7756k1280k8260l0848j1984N32K549j1401M109J3206J46J9326K7686
18767A41744L1141J9846L1453M4119K1442j1083j8162k0969k299J2721K2926L4353
18755C07232J5139J528j8996k4741j1537j712j1285k7789k9123l1829l8029k6546
18743A02312q455J4330K3980K5082K3547J0143r868j3171l479J5469J4332L30
18731A94552j2422m0326l8082k9672J1160P421j4862J424q89j355n298R578m682
18718G6547l185o362L015o683J1692P468N396j38k966j9800N56J2056k819O189
18704H0966K37j5369j7465j9516o827L862M485J3703K3250Q769r381o173l692
$$ plain form
18792 352027 366628 332456 300739 283088 254014 237111 242614 251024 248139 243698 231199 215719
18780 215719 177963 156683 128423 97575 85591 86123 88672 77271 81380 94586 94732 114058 141744
18767 141744 172885 192731 224184 268303 289745 278662 260500 239531 237232 249953 272879 307232
18755 307232 322371 323899 304903 280162 268625 266913 255628 227839 198716 166887 128858 102312
18743 102312 93857 108187 132167 157249 180796 190939 181071 167900 164421 179890 194222 194552
18731 194552 182130 141804 103722 74050 85210 92631 77769 79193 78304 76949 71651 81229 76547
18718 76547 73362 67000 70015 63332 75024 82492 87888 87750 84784 64984 65540 77596 74777 80966
18704 80966 81203 65834 48369 28853 22026 25888 30373 44076 67326 76095 66714 60541 56849
18691E6849q133p794K0972K464k6299p723P099p218j2365m480r936N842J2710
18678B1988K1987J8827n442j4915m440P115k73j4230N251J8505p918j7567j1815
18665A7073J4779J3707J0156j4496k6835r328l59J045J9319K3627J5181J316j1857
18652E3328k056J1642R408j854p534r704j9491q635P522Q56J0861P493r59n563
18638D5314r688n15J0554J3012p145k357K305p511k0358L827K6825J0527O808
18625G1598N654j4926j1N25j2188r781m305J549K911L969J2240L999j220p815
18611E2199j969k956J566J3214m436k436j582J0880Q606p372j0j995O576L462
18597G3747N089j4199N399J6744N675K41r643L256L581n201m116k28j345n584
$$ plain form
18691 56849 48716 40922 61894 64358 38059 30336 37435 30217 17852 13372 3436 9278 21988
18678 21988 43975 62802 57360 42445 38005 45120 44847 30617 35868 54373 46455 28888 17073
18665 17073 31852 45559 55715 41219 14384 5056 4697 5742 25061 48688 63869 65185 53328
18652 53328 51272 62914 72322 70468 62934 53230 33739 25104 32626 33482 44343 51836 50877 45314
18638 45314 35626 35111 45665 58677 51532 49175 51480 43969 23611 27438 54263 64790 71598
18625 71598 77252 62326 62315 62840 50652 40871 36566 38115 41026 44995 57235 61234 60014 52199
18611 52199 50230 47274 48840 62054 57618 55182 53600 64480 73086 65714 65704 63709 70285 73747
18597 73747 78836 64637 70036 86780 92455 92696 83053 86309 89890 84689 80573 80345 79000 73416
18583G3416L542k697K973K558K084j0965K477n799j9769r094o224O73O008J2842
18569E2025K6548M130j383o245L340K404k0607j0770k935j1458k803o327N48J0972
18555C7439N202R277K7947J4319J7686J8105J0031J1567Q26K10J075M775J6067
18542A74526L30j3820r761j0983O831J2861m313k168p952j3474j5370q073j2873
18529I5761m507k436j5624k695K3962R667q555J1713Q924J6300J2220N443J0796
18516A60969Q699P200j4643j5209l656j1222j2536O676L8057L6412J8761J8667
18504B38175O71j1235j0798j5602J672L6934R7675J55316J09851L2239k6923q9288
18492E18687o7686l8560K2046Q3649J08002O3692k8766p3398r0114n6099l0527
$$ plain form
18583 73416 76958 74261 77234 79792 81876 70911 73388 67589 47820 38726 32502 33175 39183 52025
18569 52025 78573 82703 81320 75075 78415 80819 60212 49442 46507 35049 32246 25919 26467 37439
18555 37439 42641 51918 79865 94184 111870 129975 140006 151573 152399 152609 153684 158459 174526
18542 174526 174856 161036 151275 140292 147123 159984 155671 153503 145551 132077 116707 108634 95761
18529 95761 91254 88818 73194 70499 94461 104128 95573 107286 116210 132510 144730 150173 160969
18516 160969 169668 176868 162225 147016 143360 132138 119602 126278 164335 200747 219508 238175
18504 238175 238846 227611 216813 201211 202883 239817 337492 492808 602659 634898 607975 518687
18492 518687 451001 412441 434487 518136 626138 689830 661064 587666 497552 441453 410926
18481D10926k9422p270J9086M8556O8819M2848m2244p7326r1414o1092k3049J7833
18469B76251P576p61L519o8K3252M2181M9797N3110N1209L2145j5552k8812m4745
18456D49102l1595j512J4886J6675n22J7311N1377O4350Q9657R3156O1349j5375
18444H08859l0136n3548o9196n2156l0425k7505J2278O0406J16736P0412k3485
18433G82240m8519o7126p1083n5348m3204n3292l8976k2408j3093k0738l2215
18422C16238m331N192L855r634m745J6248K7967K1061J4685K4812R111l660n871
18409D10928M030L790J4766K1153J6752K3886K1859M7497Q6224J03956J46502
18398I01343K37934M21674P75782J292798J312978L96398l14602q31159j002817
$$ plain form
18481 410926 381504 374234 393320 441876 510695 553543 511299 433973 342559 281467 258418 276251
18469 276251 283827 283066 286585 286517 309769 351950 401747 454857 506066 538211 522659 493847 449102
18456 449102 417507 415995 430881 447556 447034 464345 515722 580072 669729 762885 824234 808859
18444 808859 778723 725175 655979 603823 573398 545893 558171 618577 735313 805725 782240
18433 782240 733721 666595 595512 540164 496960 443668 404692 382284 369191 348453 316238
18422 316238 311907 317099 320954 311320 306575 322823 350790 371851 386536 411348 420459 416799 410928
18409 410928 414958 418748 433514 454667 471419 495305 517164 564661 650885 754841 901343
18398 901343 1139277 1560951 2336733 3629531 4942509 5338907 5024305 4193146 3190329
18389C190329n72663j66425J67240N31937J108346K088577L126309K208691n7168
18380A1625173j371300k560709k414114j447348q17042m86803k52327j47766q2965
18371B044799n2017o9039q7754p2869m4847k1736L8744J24235J60534K17111L05441
18360B542602M50706P19781R66056R85196J079000J589210K813145N359284Q672991
18351B5177971Q152620K136147k504005o139524p042682m485196j934444j27200
18343A3233687J548248L725503P004896J0591806J0534468P736860K632301n464773
18335E1542996r079571r667188p886049m970760l275728k429129k181296j734225
18327A0319050j184431q24346n73131m06503j98946Q7831M98711J033256J883474
$$ plain form
18389 3190329 2617666 2451241 2618481 3150418 4258764 6347341 9473650 11682341 11625173
18380 11625173 10253873 7693164 5279050 3831702 3014660 2527857 2275530 2127764 2044799
18371 2044799 1992782 1923743 1835989 1763120 1718273 1696537 1735281 1859516 2020050 2237161 2542602
18360 2542602 2993308 3713089 4679145 5664341 6743341 8332551 11145696 16504980 25177971
18351 25177971 33330591 35466738 32962733 26823209 19780527 15295331 13360887 13233687
18343 13233687 14781935 18507438 25512334 36104140 46638608 54375468 57007769 51542996
18335 51542996 42463425 32796237 24910188 19939428 16663700 14234571 12053275 10319050
18327 10319050 9134619 8310273 7737142 7330639 7131693 7219524 7718235 8751491 10634965
18318A0634965L369926O054805J0440724J4344200J3284954P672086k103563j0187213
18310E3510884j2958899j2243446q459369n027388k968874j801035j113907p39319
18302H198647n05718l04526o8975K06938N64990R75590J491145K036866K259521
18293A4854478K617481M305507P910206J2555055J1355500L033653m465393j0270832
18285D1895655j1510804q121524m308747j631949N48955L108371N946368O099697
18277C2026022J634591k771185n836046p025259n245294l092821j739704j002229
18269F948075p49569o48674o05050n94187n31347m57331l67539k92326k02992
18260B499060j36272j18945q1757Q878R7245J69401K70167K60729J41289J22404
$$ plain form
18318 10634965 14004891 20059696 30500420 44844620 58129574 65801660 63698097 53510884
18310 53510884 40551985 28308539 19849170 14821782 11852908 10051873 8937966 8198647
18302 8198647 7692929 7388403 7319428 7526366 8091356 9066946 10558091 12594957 14854478
18293 14854478 17471959 21777466 29687672 42242727 53598227 56631880 52166487 41895655
18285 41895655 30384851 22263327 17954580 16322631 16871586 19979957 25926325 32026022
18277 32026022 33660613 30889428 25053382 18028123 12782829 9690008 7950304 6948075
18269 6948075 6198506 5549832 4944782 4350595 3819248 3361917 2994378 2702052 2499060
18260 2499060 2362788 2243843 2162086 2170964 2268209 2437610 2707777 2968506 3109795 3232199
18250C232199J81760M68841J138849K104659K465919J234073l55160j560450k218017
18241F692673j837661j097539n24621j26641L02922P63617Q18238K20246m05392
18232D805842q70790j048011q07775m78380k99141k13774j48145q5637m0361k8360
18222G85468m1810o9864o5149n5621l0025N040j3013n597j4096k8888l991L4654
18210D97108J2076o495Q794K6397K5280L4593Q2375J52818K47749K38377N3732
18199A372804p4453j97640k57545j69091p3633J3103J09759J97968K06895N6264
18189A184431o9132j70943j88203j10315k3632N2645J67562K20818J33842J3257
18179A210330q2607j65575j41369n4680O2263J92723K19919R2536q0767j75656
$$ plain form
18250 3232199 3413959 3882800 5021649 7126308 9592227 10826300 10471140 8910690 6692673
18241 6692673 4855012 3757473 3232852 3106211 3409133 4172750 4990988 5211234 4805842
18232 4805842 3935052 2887041 2079266 1600886 1301745 1087971 939826 854189 813828 785468
18222 785468 743658 673794 608645 553024 522999 528039 515026 509429 495333 466445 462454 497108
18210 497108 509184 502689 511483 537880 563160 597753 680128 832946 1080695 1319072 1372804
18199 1372804 1298351 1100711 843166 674075 600442 613545 723304 921272 1128167 1184431
18189 1184431 1115299 944356 756153 645838 622206 674851 842413 1063231 1197073 1210330
18179 1210330 1127723 962148 820779 766099 828362 1021085 1241004 1333540 1252773 1077117
18169A077117k54584k25676j44258p1289k3524j5755o673r019j1912m335j0338
18158B99754k7084p66L9840N7892M8831J8976k271j7981P913M2317J9851j7380
18146D69892m1715m9071k7922o715J6990P9359J10542J13358M4925j0984l6035
18135F62624m6621k7565K0191J03323J97964K59198K15156O7500o8624j60202
18125A222944j30022P742J51761K22342J43182K1387j10029j78212j49155n9807
18115A142133M3491J46256K41875L87012O09663R07649J452673K774847N667873
18106A3373472R927070O483212j245730l660599q137383o674253l340083j623831
18098E101875q72550n50079l96274l18412k53790k21366k37597k65894k70169
$$ plain form
18169 1077117 822533 596857 452599 381310 357786 342031 335358 326339 314427 310092 299754
18158 299754 272670 271904 311744 369636 418467 437443 435172 417191 425104 467421 487272 469892
18146 469892 428177 379106 351184 344469 361459 440818 551360 664718 709643 698659 662624
18135 662624 616003 588438 608629 711952 909916 1169114 1384270 1451770 1383146 1222944
18125 1222944 1092922 1100664 1252425 1474767 1617949 1639336 1529307 1351095 1201940 1142133
18115 1142133 1185624 1331880 1573755 1960767 2570430 3478079 4930752 7705599 13373472
18106 13373472 23300542 29783754 28538024 24877425 16740042 10065789 6725706 5101875
18098 5101875 4229325 3679246 3282972 2964560 2710770 2489404 2251807 1985913 1715744
18089A715744k01906j08247O139J8896l1099n4456r7928j09087p1327m1075l2173
18078I93481p6941r1533j27307j15318q4138p8662m2565k2980k7747j5288q728
18067C02274J7191K2971M5098L3473K4898k488l8838l2351o119N558K3813K0239
18055D15719p162k3262j3201M866L4644N9380O3047P8983O0054M795n270l2475
18043F40118m1309p7309p9577p6720n9567m2076l2319m4165j1845K149L1738K3538
18031B32656j529k9088k9727l5240n685M270q349j5975o4j0146P324J8043K5945
18018A52435J1738N846J7762K365j4278j4195j3245r676J3893M7853N4299L1773
18006B86570j9510k5436l0652k6863m564P103l972l2285j9570k4143q567M981
$$ plain form
18089 1715744 1513838 1405591 1411730 1430626 1399527 1345071 1247143 1138056 1066729 1025654 993481
18078 993481 916540 825007 697700 582382 498244 419582 377017 354037 326290 311002 302274
18067 302274 319465 342436 387534 421007 445905 443417 404579 372228 366109 371667 395480 415719
18055 415719 408557 385295 372094 376960 411604 470984 534031 613014 673068 677863 672593 640118
18043 640118 598809 521500 441923 365203 305636 263560 231241 187076 175231 177380 209118 232656
18031 232656 231127 202039 172312 137072 131387 135657 127308 111333 111269 101123 108447 126490 152435
18018 152435 164173 170019 187781 190146 175868 161673 148428 138752 152645 200498 254797 286570
18006 286570 267060 241624 210972 184109 179545 186648 182676 150391 130821 106678 98111 103092
17994A03092R378J7779K0860k0544r314O331l0j3667k7242j1824m486j1303j9177
17981C9853J0244J9990K6364K1896J0330N032p397p109j1020j2371o634N03k303
17968H7378k704o538n464j2863j5659j422j7757J8692J8264J0883R046k798R896
17955H8954o785r320M383k1456j7891n769j7435j2559M165M775p862k557R100
17942I743o96K208J0341k912r385p482q851J0539l560M613J9750J4096j5681j8297
17928D426J9445m520j1693M450l60N36m172J9711Q884j0066j4932O289R620l604
17914B4014N556J5576J7228k834j6164j4069Q617m120j1415J3374m764n115P887
17901C3771N86L328p932q532O537j6363m693N448j948j7289J4953P542k140J6905
$$ plain form
17994 103092 112470 130249 151109 130565 121251 127582 127552 113885 86643 74819 70333 59030 39853
17981 39853 50097 70087 96451 118347 128677 133709 126312 119203 108183 95812 89178 89681 87378
17968 87378 84674 78136 72672 59809 44150 42728 24971 43663 61927 72810 81856 79058 88954
17955 88954 82169 72849 77232 55776 37885 32116 14681 2122 6287 11062 3200 643 9743
17942 9743 9047 11255 21596 18684 9299 1817 -7034 3505 -55 4558 24308 38404 22723 4426
17928 4426 23871 19351 7658 12108 11748 12284 8112 27823 36707 26641 11709 17998 27618 24014
17914 24014 29570 45146 62374 59540 43376 29307 37924 33804 22389 35763 30999 25884 33771
17901 33771 34357 37685 29753 21221 27758 11395 6702 12150 10202 -7087 7866 15408 13268 30173
17887C0173J6336l765k1481Q966R769J50q023p109K368o531J5966M996K1844L8608
17873A02267K1394J0010m57j2492k4076j4255P605J9121J3432k181j8916l0086
17861G1366j8190q361r551j7211Q05L979j3229L61K698J0255N989K231j0841o500
17847A3801L244o067K505M936M584q88M720J0904K2015J9321K1882L1711K1667
17834A54335k281n297p92L1397K8216J4329o050k8526l6646j8777k239l830J0255
17821A34094L463j0767o471J1375M646q428j6861k8236j897L3633J1463n392n889
17808A14733o762k7726p491j7108l0401j5035M954L688J4552K075O896J0311P72
17795E3458K133J3998J6640P136J952J6710J4137o764m63m209P386K2710K6684
$$ plain form
17887 30173 46509 42744 21263 30229 39998 40148 32125 25016 27384 20853 36819 41815 63659 102267
17873 102267 123661 133671 133214 120722 96646 82391 89996 109117 122549 120368 101452 71366
17861 71366 53176 44815 35264 18053 18858 22837 9608 9969 12667 22922 28911 31142 20301 13801
17847 13801 17045 10978 13483 18419 23003 22115 26835 37739 59754 79075 100957 132668 154335
17834 154335 152054 146757 145965 177362 205578 219907 213857 185331 148685 129908 127669 123839 134094
17821 134094 137557 126790 120319 131694 136340 127912 111051 82815 80918 114551 126014 120622 114733
17808 114733 107971 80245 72754 55646 25245 10210 15164 18852 33404 35479 42375 52686 53458
17795 53458 55591 69589 86229 93365 95317 112027 126164 119400 118937 114728 122114 144824 171508
17782A71508j0166m496m983j2262R069K7049K3920P831l183j8529k7869k0550
17770A37339r199O653J4139K225l46l0760m4088j1485O99k5899j7679J1405P639
17757D0643M208j1055j8783O914q818K1549O42J944p914k8963n063J1560K5391
17744C2255J9317J836Q154J1566L0100J1742m913K022j3755K072J6254O131r884
17731A12897j2431j6229j6200j1505j1781k5569j290n824m17k629p156o462k656
17718g252J5336N135k370k695L950R634n792j159n370J0188p285j3090l028M44
17704c354j2429J0743k306l22Q022j1724Q00P201M96j2905J3756m640j5122J673
17690b0111k416j4331K337J5191Q087P834J9389O593m901K328J0403r231k851
$$ plain form
17782 171508 161342 156846 151863 139601 148670 175719 199639 207470 204287 185758 157889 137339
17770 137339 128140 134793 148932 151157 150811 120051 75963 64478 65177 39278 21599 33004 40643
17757 40643 44851 33796 15013 21927 13109 34658 35300 37244 29330 367 -4696 6864 32255
17744 32255 51572 53408 61562 73128 103228 114970 110057 112079 98324 100396 116650 122781 112897
17731 112897 100466 84237 68037 56532 44751 19182 17892 12068 11651 9022 1866 -4596 -7252
17718 -7252 8084 13219 10849 8154 12104 21738 15946 14787 9417 19605 12320 -770 -3798 -3354
17704 -3354 -15783 -5040 -7346 -7668 354 -11370 -10570 -3369 -2873 -15778 -2022 -6662 -21784 -20111
17690 -20111 -22527 -36858 -34521 -19330 -11243 -3409 15980 22573 17672 20000 30403 21172 18321
17677A8321Q856K723L039L565N808m632j0976k3655m072K55o279k971l115o724
17663a9857p53J4132J069q178j0582K556k090j1285J2159o410n794R356J3917
17650a1760k004j5919m932J6048p99p941J4541L328j971k631k739M643j280J8677
17636E261k842j6217L809J2051R297n75O332j3751p620j6741J1630J4642o618
17623a342j1473M716N94N848N392K776o611j6080j974J7988K727r859j685J0620
17609A637J7697K1515k7108k8112j1045J320K3430K0007k8859j2680J9839K3383
17597B1024J081M59o002j950j606m773J4395M928j0786l080j5494j1164p8l920
17583a6966J1403J5225j7790l893R54o420N240R019o760j0936q648P792J0658
$$ plain form
17677 18321 27177 29900 32939 36504 42312 37680 26704 3049 -1023 -768 -7047 -10018 -13133 -19857
17663 -19857 -20610 -6478 -5409 -13587 -24169 -21613 -23703 -34988 -22829 -29239 -35033 -25677 -11760
17650 -11760 -13764 -29683 -34615 -18567 -19366 -27307 -12766 -9438 -11409 -14040 -16779 -12136 -13416 5261
17636 5261 2419 -13798 -9989 2062 11359 10784 17116 3365 -4255 -20996 -9366 5276 -1342
17623 -1342 -12815 -8099 -7505 -1657 3735 6511 -100 -16180 -18154 -166 2561 -7298 -8983 1637
17609 1637 19334 40849 13741 -14371 -25416 -24096 -666 19341 -9518 -22198 -2359 21024
17597 21024 22105 22564 16562 14612 13006 8233 22628 27556 16770 13690 -1804 -12968 -13046 -16966
17583 -16966 -5563 9662 -8128 -12021 -11067 -17487 -12247 -3228 -9988 -20924 -29572 -21780 -11122
17570a1122O094q62l468l263r001L312n113J1270L003N480q099Q896P250M417
17556H794m849j6999j941N557Q673Q07J8277K593j2471j1529n28O497J706J3274
17542A7861j2944o943j3814O83J8302J1745j0850j5677m566R174k071n529L321
17529a1308q615k32O292o389m961Q521J7834J327r362j078n35Q250r374j1034
17515b0664J007K2229n157L982J162j4753j628N779J1586Q87o940k462j1212o313
17501b2497R075J0187k276k5084j06P643N398P331J0416M820R485l816m332N716
17487A1960o757r943p870R306O583n642L423j507l131q851o877J0902L106J317
17473c981q375q129J0397R870N887J1449Q744n915n360j1509q883Q46o821N285
$$ plain form
17570 -11122 -5028 -5890 -9358 -12621 -21622 -18310 -23423 -12153 -9150 -3670 -11769 -2873 4377 8794
17556 8794 3945 -13054 -14995 -9438 -765 42 18319 20912 8441 -3088 -3616 2881 4587 17861
17542 17861 4917 -2026 -15840 -15157 3145 14890 4040 -11637 -16203 -7029 -9100 -14629 -11308
17529 -11308 -19923 -20155 -13863 -20252 -25213 -16692 1142 2469 -6893 -7971 -8506 -256 -9630 -20664
17515 -20664 -19657 2572 -2585 1397 2559 -12194 -13822 -8043 3543 4430 -2510 -4972 -16184 -22497
17501 -22497 -13422 -3235 -5511 -30595 -30701 -23058 -17660 -10329 87 4907 14392 10576 6244 11960
17487 11960 5203 -4740 -12610 -3304 3279 -2363 1060 -447 -3578 -12429 -19306 -8404 -5298 -3981
17473 -3981 -12356 -20485 -10088 -218 5669 17118 25862 19947 14587 3078 -5805 -4959 -11780 -6495
17459f495J704k800l169n865K1459M581j8433j0604J0233o192q454l26J7879l120
17445i602J9795J8037m217K084K4791L3346L7871J4393o096l5434l6153l2792
17433B6023M380m844n234n767j1417m748L361M973l700n475O798q413p641j1061
17419b2765p59o392N249m420L421k626M206Q688j1087k586Q080Q933L29m655k792
17404a9176k449L016l480j96n721o04O294L7309R5k2654j0628J0719N405p262
17390i332j0964K609N178J3332N818j2068j6972J3348K0258L022j887l699N12
17377I155N124R795J9270q525j7502l077J1456K018N629k0232j9221J9612J3141
17364B6643n731j1053O431O935j6076n370K3756l657j4636l259R341r368j9836
$$ plain form
17459 -6495 -4791 -7591 -10760 -16625 4834 9415 -9018 -19622 -9389 -15581 -24035 -24361 -6482 -9602
17445 -9602 10193 28230 24013 26097 50888 84234 122105 136498 130402 94968 58815 26023
17433 26023 30403 25559 20325 14558 3141 -1607 1754 6727 3027 -2448 4350 -4063 -11704 -22765
17419 -22765 -23524 -29916 -24667 -29087 -25666 -28292 -24086 -15398 -26485 -29071 -20991 -12058 -11729 -16384 -19176
17404 -19176 -21625 -18609 -22089 -22285 -28006 -28610 -22316 14993 15088 -7566 -18194 -7475 -2070 -9332
17390 -9332 -20296 -17687 -12509 823 6641 -5427 -22399 -9051 11207 14229 12342 8643 9155
17377 9155 14279 24074 43344 34819 17317 14240 25696 27714 33343 13111 -6110 13502 26643
17364 26643 20912 9859 16290 23225 7149 1779 25535 21878 7242 3983 13324 3956 -15880
17351a5880J094q16J2077J400M14L084j2410N422L788o641q863k524m598J9951
17337d502K027l668J5914L2374J9836L763j2341r142j9051k456R214r647j9297
17324C024l661M147N082P564o751j187k2056j993m22N564n182k677J8736N464
17310E652j2684J400l20O848N835k907K835p633j1111J2445M261j0004J44j614
17296f853o289o793L081N617M14O28J5468K739p66o584q160j47rk019K478N158
17280b037m83q038k991J1658J0580L843M898K740J0995k1315q152R406N505q628
17266G981p934m13k736P192M639O910p287q863n509j2841j3408k726K5986J1837
17252B828r352J51J8851K445r26j2771j0313J359N275l237j1653J294n581J568
$$ plain form
17351 -15880 -14786 -15602 -3525 -2125 -1711 1373 -11037 -5615 -1827 -8468 -17331 -19855 -24453 -4502
17337 -4502 -2475 -6143 9771 42145 61981 65744 53403 44261 25210 22754 31968 22321 3024
17324 3024 -637 3510 8592 16156 9405 8218 -13838 -15831 -16253 -10689 -15871 -18548 188 5652
17310 5652 -7032 -5632 -5952 896 6731 3824 6659 -974 -12085 360 4621 -5383 -5239 -6853
17296 -6853 -13142 -19935 -16854 -11237 -10823 -10195 5273 8012 7246 662 -7498 -7645 -7654 -9673 -7195 -2037
17280 -2037 -2520 -10558 -13549 -1891 8689 12532 17430 20170 31165 9850 1698 11104 16609 7981
17266 7981 47 -366 -3102 4090 8729 15639 8352 -511 -6020 -18861 -32269 -34995 -9009 2828
17252 2828 -6524 -6373 12478 14923 13997 1226 -9087 -7728 -2453 -5690 -17343 -16049 -21630 -20062
17238b0062k662j754J6618Q056r045J0722m114j1006k854o160N184M475j6657
17225b9259K807K4833J9948o886j0481l065k1763r586J7193L754M402O648m721
17212f176J547K718j763p75k3069l067O564L921j3207n603J3918J3414L842r97
17198h733J970J0060N628m12K624j1086j978J0670j642l848P230K665j3045o580
17184f477j119J1453l709k730O59L869P325l407k0594m714J050M595O343j7243
17170b4699J512P713K2898O197j1675j956m504j5878j0205N271J7378J5127o848
17157C31m818M561J8271m79r630o566r95N251N196l398m610j5823L050o379k140
17142a8178K5068J1098n497k0446q921J1576M034J1398Q101k2238l728r269p97
$$ plain form
17238 -20062 -22724 -24478 -7860 196 -8849 1873 -2241 -13247 -16101 -22261 -17077 -12602 -29259
17225 -29259 -26452 -1619 18329 11443 962 -2103 -23866 -33452 -16259 -12505 -8103 -1455 -6176
17212 -6176 -4629 -1911 -3674 -4449 -27518 -30585 -24021 -20100 -33307 -38910 -24992 -11578 -7736 -8733
17198 -8733 -6763 3297 8925 8513 11137 51 -1927 8743 7101 3253 10483 13148 103 -6477
17184 -6477 -7596 3857 148 -2582 -1923 1946 9271 5864 -14730 -19444 -18394 -13799 -7456 -24699
17170 -24699 -23187 -15474 7424 13621 1946 -10 -4514 -20392 -30597 -25326 -7948 7179 331
17157 331 -4487 74 18345 17866 8236 1670 675 5926 11122 7724 3114 -12709 -9659 -16038 -18178
17142 -18178 6890 17988 12491 -7955 -16876 -5300 -1266 10132 18233 -4005 -7733 -17002 -17799
17129a7799J688l161J2243j893q770P548M640j2200k960K0253O150j2947n278
17116a2486N399J0491K2850P630N431k765k2708j5527j6272R0J0269K1965j1644
17103B723l872k206L165j1309j3842o756J2369O658j8125j3220J1718R432J3086
17090a0179J3362p224r227l180p123Q804o579j3970J1254K3450J0906j2502J1599
17077I391j0326j1230K571N054J0072M042n571p202L0470L524j5307p816j4797
17064g125Q101o868q358J046o968Q263J1313K443p10J342n09p134j4504K2046
17050B378K402r930L652l673j5563j601n574L245l294Q368n875k3734k483J8036
17036c3646J2184R792Q209R819p785P634R716k2937k5544J1110R160P545J702
$$ plain form
17129 -17799 -16111 -19272 -7029 -8922 -17692 -10144 -5504 -17704 -20664 -411 5739 -7208 -12486
17116 -12486 -7087 3404 26254 33884 39315 36550 13842 -1685 -17957 -17867 -7598 14367 2723
17103 2723 -1149 -3355 -190 -11499 -25341 -32097 -19728 -13070 -31195 -44415 -32697 -23265 -10179
17090 -10179 3183 -4041 -13268 -16448 -23571 -14767 -21346 -35316 -24062 -612 10294 -2208 9391
17077 9391 -935 -12165 -9594 -4540 5532 9574 4003 -3199 27271 30795 15488 7672 -7125
17064 -7125 976 -5892 -14250 -13204 -20172 -11909 -596 1847 1137 2479 1970 -5164 -19668 2378
17050 2378 4780 -5150 -1498 -5171 -20734 -22335 -27909 -24664 -27958 -19590 -25465 -49199 -51682 -33646
17036 -33646 -21462 -11670 -3461 6358 -1427 6207 15923 -7014 -32558 -21448 -12288 -4743 -3041
17023c041j534j0156p487J68p85N422L976o839J1025J5931k867N300o70j2732
17009d289k1017j0247j792J4071J4676o156R47J1058l581n809O641l66M707l738
16995d895K155m36r876K062r864o438N515j995J2273J114J7897Q875r01k709k52
16980A2525l686o291J617P626J4162j7519l922J2897m568r968j1787l785J3880
16967A181j6925o816K2803R298q718m767K885j1150J4535j4804j0257J0306P546
16954d883O916k836j4996j0705M351l254j652n621J3262K910k1241j1725q865
16941e8339J1406K2430J9204j422J553K842N191Q466j4354j941M245O558K208
16928H047O901r495o568r011N240P897p877K64L39N909q81j639n543L013m400
$$ plain form
17023 -3041 -4575 -14731 -22218 -22050 -22835 -17413 -13437 -20276 -9251 6680 3813 9113 8443 -4289
17009 -4289 -25306 -35553 -37345 -23274 -8598 -14754 -13807 -2749 -6330 -12139 -5498 -5864 -1157 -4895
16995 -4895 -2740 -3176 -13052 -10990 -20854 -27292 -21777 -23772 -11499 -10385 7512 16387 15486 12777 12525
16980 12525 8839 2548 4165 11791 25953 8434 4512 17409 12841 2873 -8914 -12699 1181
16967 1181 -15744 -22560 243 9541 823 -3944 -1059 -12209 2326 -12478 -22735 -12429 -4883
16954 -4883 2033 -803 -15799 -26504 -22153 -25407 -27059 -32680 -19418 -16508 -37749 -49474 -58339
16941 -58339 -46933 -24503 -5299 -6721 -5168 -2326 2865 11331 -3023 -4964 -719 5839 8047
16928 8047 14948 5453 -1115 -10126 -4886 3011 -4866 -4602 -4263 1646 765 -874 -6417 -3404 -7804
16913g804l911j1034o892m186J905M417J2401q295m534M162L798M394M733k558
16899a3404o273j4323J4055O480j7486o09J6873L796J5124l832l976r34n53P811
16885B749K809J445r270J1569J4964K623m126K886l332l300l575p78k1946j1772
16871a9054P44M147J9946J8813Q829k7987j1270J535N941J5555Q713q67j3326
16858A1719k39M847L686k136K506m253o821m796j1341j3702R997J447N688j5519
16844a8917q401Q03N866J0470J6412O415j1769L408J0392j6995k0754K672J2921
16831g477O829J9552J0612n821p828K594M734n465j4552J934j3560r940J0537
16818g851O901R157j511K888q084j03j982K069n109j6092R180R527j1453N247
$$ plain form
16913 -7804 -11715 -22749 -29641 -33827 -31922 -27505 -15104 -23399 -27933 -23771 -19973 -15579 -10846 -13404
16899 -13404 -19677 -34000 -19945 -13465 -30951 -31560 -14687 -10891 4233 401 -3575 -4509 -5062 2749
16885 2749 5558 7003 -2267 9302 24266 26889 22763 25649 22317 19017 15442 14664 -7282 -19054
16871 -19054 -18310 -14163 5783 24596 33425 5438 -5832 -4297 1644 17199 25912 25045 11719
16858 11719 11480 16327 20013 17877 20383 16130 9309 4513 -6828 -20530 -10533 -9086 -3398 -18917
16844 -18917 -27318 -26515 -20649 -10179 6233 12648 879 4287 14679 -2316 -23070 -20398 -7477
16831 -7477 -648 18904 29516 23695 15867 18461 23195 17730 3178 5112 -8448 -18388 -7851
16818 -7851 -950 8207 6696 9584 1500 1397 -585 1484 -3625 -19717 -10537 -1010 -12463 -7216
16804g216N498N965O571r802n80R76N493l594l215J7691j3634j7485N44R418K844
16789e26N1n503r246j021J7306J067J497L355O354j0231q279n973J700m5j3102
16774b2596J9278K927K045O302K013l014m817q808q293J8316k050p853l158Q564
16760a144O572o812O118j1988J863L795J1514l062k61J5698j1199l39L448l472
16746A0731l403M840O919p717k192j7658j3034Q58R927K4331P421j4349j2019
16733e345j796j772m093N973q301p950J1920J4153k062l927p480m434J544m799
16719a8369J5439J3031P644j0595j6820L395J549M217J0145j757l76o992j4296
16706a3785Q412Q918j3130j4775J256l863J9430P618P122l643r316p030J7440
$$ plain form
16804 -7216 -1718 4247 10818 1016 436 1412 6905 3311 96 17787 4153 -13332 -12788 -3370 -526
16789 -526 -475 -5978 -15224 -16245 1061 2128 3625 6980 13334 3103 -5176 -11149 -9449 -9494 -22596
16774 -22596 -3318 -391 1654 7956 9969 6955 2138 -6670 -14963 3353 1303 -6550 -9708 -1144
16760 -1144 5428 -1384 4734 -7254 -5391 -1596 9918 6856 6595 22293 11094 10755 14203 10731
16746 10731 7328 12168 19087 11370 9178 -8480 -21514 -20656 -10729 13602 21023 6674 -5345
16733 -5345 -7141 -8913 -13006 -7033 -15334 -23284 -11364 2789 727 -3200 -10680 -15114 -13570 -18369
16719 -18369 -2930 10101 17745 7150 -9670 -6275 -4726 -509 9636 7879 7503 511 -13785
16706 -13785 -5373 3545 -9585 -24360 -23104 -26967 -7537 81 7203 3560 -5756 -12786 4654
16693D654k302r525N526J6355O444j023q435q10o449J59k1389l563M772j861j2236
16678b9683M069J6444J0641O411M720L13j597P515P399J972M145q82j1483N49
16664B0533J431N132j7962q179p245N494J3963J127L801N949Q16N952M272j6258
16650A8826k3816J1320Q027j4163K0340Q715P573J2555p410n481N240j3553n389
16637B2784p932j5333J0456O972l413l12k4039j4849L527j250o287J5673n010
16624a9013j081K515Q664J2976m357j321J7432m821o012q609p166j0657P352K1478
16610G380k195k2922P244J711j1266r30J5977M030M549j6933j1462O059J0422
16597h336o124j5933N606J2815J164q537J298J6857P79o430j0041Q343Q042l808
$$ plain form
16693 4654 2352 -7173 -1647 14708 21152 20129 11694 10884 4435 4594 -16795 -20358 -15586 -17447 -29683
16678 -29683 -25614 -9170 1471 7882 12602 12915 11318 18833 26232 28204 32349 31467 19984 20533
16664 20533 21964 27096 9134 955 -6290 -796 13167 14294 18095 24044 24860 30812 35084 18826
16650 18826 -4990 6330 14357 194 20534 29249 36822 49377 41967 36486 41726 28173 22784
16637 22784 14852 -481 9975 16947 13534 13222 -10817 -25666 -22139 -23389 -29676 -14003 -19013
16624 -19013 -20094 -17579 -8915 4061 -296 -1617 15815 10994 4982 -3627 -10793 -21450 -14098 7380
16610 7380 5185 -17737 -10493 -8782 -20048 -20978 -5001 -971 3578 -13355 -24817 -18758 -8336
16597 -8336 -14460 -30393 -24787 -11972 -10808 -19345 -18047 -1190 -411 -6841 -16882 -8539 -497 -4305
16583d305j1278M447O712J1795m869n346l099p63o168l21J4984q852j8088l311
16569b8462L382L360k014O168P485O237j1227n327J192L584m327p46K749P836
16555a0110l881j759Q123J371J153J2227O218K571q566O292q626q858r72n965
16541a0782P259m112p812p967n392J0951Q735P43l108l701l898L444P70K3466
16527H596J3882M906j3721m937J531L178M982j5483M00K617j5768j2878Q186K1723
16513G214L208q980q636M051m082p012r392m929K981J6315n232J795N23K2912
16499A0736j3060k0422J1380J0561J0204j6177j7053K274R352j2859O086Q922
16487a0056j360m515o6l157K2340n87l2181q722M916L112R119K0296J84p265L117
$$ plain form
16583 -4305 -15583 -11136 -4424 7371 2502 -2844 -5943 -6706 -12874 -13195 1789 -7063 -25151 -28462
16569 -28462 -25080 -21720 -23734 -17566 -10081 -3844 -15071 -20398 -19206 -15622 -19949 -20695 -17946 -10110
16555 -10110 -13991 -15750 -7627 -6256 -5103 7124 13342 15913 7347 13639 5013 -3845 -4817 -10782
16541 -10782 -3523 -7635 -15447 -23414 -28806 -17855 -9120 -8377 -11485 -15186 -19084 -15640 -14870 8596
16527 8596 22478 27384 13663 8726 10257 13435 18417 2934 3334 5951 -9817 -22695 -14509 7214
16513 7214 10422 1442 -7194 -3143 -7225 -14237 -23629 -28558 -25577 -9262 -14494 -12699 -12176 10736
16499 10736 -2324 -22746 -11366 -805 9399 -6778 -23831 -21557 -12205 -25064 -18978 -10056
16487 -10056 -11416 -15931 -15997 -19154 3186 2599 -29582 -38304 -33388 -30276 -21157 -861 -677 -7942 -4825
16472d825R796N515l058k609K4446J0200r902J2726m924k4186l323J1371N14j5811
16458E930n362r028o114P81J637k020k578J2696k964J3966K904q676j2105N638
16444e295J8392O245j2054j8934L685M452j753r458k44n011J8989R204O266q277
16430F207M118L568J8948j487p380j716l440p595r912R51J257l09j678k401L127
16415B258O17P814P909k696r187M815J0685N499J896j4089j4172n534J2207N543
16401A3565Q80K469j1033n015J031m080R298n948m713N987J3974J4523O892K131
16387C9961j7664j5919j2029J4211j430p480p818J0698J0269J469L798k991j4721
16374C54k0364q611M770K4992k757p455L118n021L544J7746o631j1271m206J0294
$$ plain form
16472 -4825 4971 10486 7428 4819 29265 39465 29563 42289 37365 13179 9856 21227 21741 5930
16458 5930 568 -8460 -14574 -13793 -12156 -14176 -16754 -4058 -7022 6944 9848 1172 -10933 -5295
16444 -5295 13097 19342 7288 -11646 -7961 -3509 -5262 -14720 -14964 -19975 -986 8218 14484 6207
16430 6207 10325 13893 32841 31354 23974 22258 18818 11223 1311 2262 3519 3210 1532 -869 2258
16415 2258 2875 10689 18598 15902 6715 11530 22215 27714 29610 15521 1349 -4185 8022 13565
16401 13565 14445 16914 5881 866 1897 -2183 7115 1167 -3546 2441 16415 30938 37830 39961
16387 39961 22297 6378 -5651 8560 7130 -350 -8168 2530 12799 14268 18066 15075 354
16374 354 -20010 -28621 -23851 1141 -1616 -9071 -5953 -10974 -7430 10316 3685 -7586 -11792 -1498
16360a498P941J038n794o69n265k823J3228J2423K669J75k313j5388j2687j3444
16346b2407J1340J1768m822j2037q038R281J5322L110r350Q677J7048l801k0942
16333d851k809o784k315J2908n084j1080j3290M910K4253J7342o518n395j291
16320dJ898J5955J6123q970j2305j1782l37o965J236p496J728O962q288j744n316
16305a9305j0153J144J1033M284m479L630k437j973q832J309J2543K793J8293
16292G850j0312j9079J9127l764j0374M456l871K179M608N517n666M138l586R364
16278E87K0898J0221j2716n073k678P413J15n145n505q861N702J1152q739l58
16264G013k107J241n372m335J0281p135p160j44O057m108N696J0433l341R252
$$ plain form
16360 -1498 6443 7481 1687 1018 -4247 -7070 6158 18581 21250 21425 19112 3724 -8963 -22407
16346 -22407 -11067 701 -4121 -16158 -24196 -14915 407 3517 -5833 2844 19892 16091 -4851
16333 -4851 -7660 -14444 -16759 -3851 -8935 -20015 -33305 -28395 -4142 13200 6682 1287 -4
16320 -4 1894 17849 33972 25002 12697 915 578 -6387 -5151 -12647 -10919 -3957 -12245 -13989 -19305
16305 -19305 -29458 -28314 -17281 -12997 -17476 -13846 -16283 -18256 -27088 -25779 -13236 -10443 7850
16292 7850 -2462 -21541 -2414 -6178 -16552 -12096 -15967 -13788 -9180 -3663 -9329 -5191 -8777 587
16278 587 21485 31706 18990 13917 11239 18652 18767 13622 8117 -744 4958 16110 7371 7013
16264 7013 4906 6147 775 -3560 6721 -414 -7574 -7718 -1661 -5769 -73 10360 7019 16271
16250A6271Q939l835k9859m476J0646n466j1743o830j4590k033J6213K3737n054
16237h080n570J7689Q328R205p76j5214L607j0215l382M118R918l804Q30n371
16223A283l161J0518q728j964j1014L361J5520L62%P13q192j2248j1939J7666
16209g823J1970l239r425J3317m445k5575p253L644R80K537L475O150P884J9852
16195A2049M631j9903j6235m160l375N408J9921J1186j7190l765k104L201J198
16182i138K255J6685k080r390Q013J818J0987p245j5700n411O400j0604j6068
16169b9478M692J3301j6410o584J1605P970r22o058k2223N852K2796J9003p300
16156c756o959m261r107k193j1081J9807J2647k394R785K835j4582j3515R078
$$ plain form
16250 16271 25210 21375 -8484 -12960 -2314 -7780 -19523 -26353 -40943 -42976 -26763 -3026 -8080
16237 -8080 -13650 4039 12367 21572 20796 5582 9189 -1026 -4408 -290 9628 5824 6654 1283
16223 1283 -1878 8640 -88 -2052 -13066 -9705 5815 6177 6177 6890 -1302 -13550 -25489 -7823
16209 -7823 4147 908 -8517 4800 355 -25220 -32473 -28829 -27849 -25312 -21837 -15687 -7803 12049
16195 12049 16680 -3223 -19458 -23618 -26993 -21585 -1664 9522 -7668 -11433 -13537 -10336 -9138
16182 -9138 -6883 9802 7722 -1668 6345 8163 19150 11905 -3795 -9206 -2806 -13410 -29478
16169 -29478 -24786 -11485 -27895 -34479 -22874 -14904 -15826 -21884 -44107 -38255 -15459 3544 -3756
16156 -3756 -10715 -14976 -24083 -26276 -37357 -17550 -4903 -7297 2488 5323 -9259 -22774 -13696
16143a3696K119O398j0890N377j042o996l773J0632N538K728O821j9016j0223
16130b6023J7525m501l052R59j1571j950J1802l636Q152J6823q819l465J260R291
16116B795L831p133J984J691k231n595j0260k204J3017J6610j1121o129l26J442
16102c629P185L933q827o804J2826R068K749j1664o922p435J421Q80l409J634
16088h994M562R255r216m967n807K938j1895j1907p435o006n269J2972J5516J4824
16074a1429P608N50m955r415m947j703P444j74p79J3694k977n820P457o083R684
16059a845J2753J4021J0964j0717k518q706j3197m903j805L860J0613n856p181
16046d517O358N039j0510k782o343P323R297O489R106r144j0607l570J78j2274
$$ plain form
16143 -13696 -11577 -5179 -16069 -10692 -11734 -18730 -22503 -11871 -6333 -3605 3216 -15800 -26023
16130 -26023 -8498 -12999 -16051 -15092 -26663 -28613 -16811 -20447 -12295 4528 -4291 -7756 -6496 2795
16116 2795 6626 -507 1477 3168 937 -4658 -14918 -17122 -4105 12505 1384 -4745 -5071 -3629
16102 -3629 3556 7489 -1338 -8142 4684 13752 16501 4837 -2085 -9520 -8099 -7219 -10628 -8994
16088 -8994 -4432 4823 -4393 -9360 -15167 -12229 -24124 -36031 -43466 -49472 -54741 -41769 -26253 -11429
16074 -11429 -3821 -3271 -8226 -17641 -22588 -24291 -16847 -17021 -17800 -4106 -7083 -12903 -5446 -11529 -1845
16059 -1845 10908 24929 35893 25176 22658 13952 755 -4148 -5953 -2093 8520 2664 -4517
16046 -4517 1841 6880 -3630 -6412 -12755 -5432 3865 10354 19460 10316 -291 -3861 -3683 -15957
16032a5957o507O203j194J670o198k201r9m471j2057N013M737j626L998J3204
16018a5485R217Q829K710k837J041J8674P69j8015p933k171r536L620J0072q817
16004i862o084j061P403M68Q972n58r61O590j2927q519P750N622n114n359J1456
15989b184J2544M61n084j0533m296R13K720J9858o493j9408j1617q42J8502N230
15975b29J4230O81j0228J635m586j059J531q372K737J2872j5480J3260R383j1371
15961E004j3506Q160N33J2766q553r422J7912m045m86l3q642P022j1782o771L308
15946h535K481L0011l802N88j1721l339J0546M937R60j4651o948M827o784j0915
15932a2345k137J3880L89j2246j840N753j0288l72L752o149q236j9573J7323J790
$$ plain form
16032 -15957 -22464 -16261 -17455 -15785 -21983 -24184 -24283 -28754 -40811 -35798 -31061 -32687 -28689 -15485
16018 -15485 -6268 2561 5271 2434 3475 22149 22918 4903 -3030 -5201 -14737 -11117 -1045 -9862
16004 -9862 -15946 -17007 -9604 -9136 -164 -722 -1683 4907 -8020 -16539 -8789 -3167 -8281 -13640 -2184
15989 -2184 10360 10821 5737 -4796 -9092 -8179 -5459 14399 7906 -11502 -23119 -23961 -5459 -229
15975 -229 14001 14682 4454 6089 1503 444 1975 -6397 -3660 9212 -6268 6992 16375 5004
15961 5004 -8502 -342 191 12957 4404 -5018 12894 8849 8363 8330 -312 6710 -5072 -11843 -8535
15946 -8535 -6054 23957 20155 20743 9022 5683 16229 21166 22126 7475 527 5354 -1430 -12345
15932 -12345 -14482 -602 -213 -12459 -14299 -8546 -18834 -19206 -15454 -21603 -29839 -49412 -32089 -30299
15918c0299J39J867J1795j614P112o5J421J587q151J0390J1242q019j4603N425
15904a1773O130N192K355q844m124j1425Q593J3243N014l59O650r500p365P941
15890A728p940L333O466j2771J1675J3410J5006N398j5550k5072m462l704J2244
15877b39O356J4011j497r624j6811l316J1309J9912M566k892o259J0734P442O19
15863C4311M577J5417L3701M6639O1056Q6334N2713Q946k1169o9944q0517n9593
15851A12471l0223k1598j3668m261P993j337J792K82j3546j5603q527O685m98
15838A9962q409j0495M715N068K659Q05j0040L497P711p407n65j0057k6K58q533
15823a0857K2173L4275N214j885k9955j2990j6726j690J7660J73j6431O33O653
$$ plain form
15918 -30299 -30160 -28293 -16498 -18112 -11000 -11065 -9644 -8057 -16208 -5818 5424 -2595 -17198 -11773
15904 -11773 -5643 -451 1904 -6940 -11064 -22489 -13896 -653 4361 4002 10652 1152 -6213 1728
15890 1728 -6212 -2879 3587 -9184 2491 15901 30907 36305 20755 -4317 -8779 -12483 -239
15877 -239 6117 20128 18631 9007 -7804 -11120 189 20101 24667 21775 15516 26250 33692 34311
15863 34311 38888 54305 88006 134645 195701 282035 334748 343694 322525 252581 172064 112471
15851 112471 82248 60650 46982 42721 50714 49377 51169 51451 37905 22302 13775 20460 19962
15838 19962 11553 1058 5773 10841 13500 14305 4265 7762 15473 8066 7501 -2556 -2582 -2324 -10857
15823 -10857 11316 45591 50805 48920 18965 5975 -10751 -12441 5219 5392 -11039 -10406 -3753
15810c753r613j3805N463J2185j480J2231O809k18o713L056j836j2846N874O577
15796A931K632o326r78O819j1362M44L371j2130m37N342J4282J0830m048m300
15782F070m87n803j3887N725J0840k566m677k317q97j029J748Q489p99m158r639
15767a3387k890J480q90N341O891j6241r670K376J5228J180j2271p680n935J3793
15753b2675J3791J8941o609j7196R959n874m198M366R947M654j275k769j626K664
15739B100Q674J499J3061k439r761j7648M40p819j037M158p052N930L207j012
15725g699J2526j0209o65K897o173m554J623J7988O75j6913R728R681J755j9797
15711i137L51J2284J3472N409j6966j7275P355Q100N694j4502j791q80J0484R80
$$ plain form
15810 -3753 -13366 -27171 -21708 -9523 -11003 1228 8037 7819 1106 4162 2326 -10520 -4646 1931
15796 1931 4563 -1763 -2741 4078 -7284 -6840 -3469 -15599 -16036 -10694 3588 14418 10370 6070
15782 6070 5583 -220 -14107 -8382 2458 -108 -4785 -7102 -7999 -9028 -7280 1209 410 -3748 -13387
15767 -13387 -16277 -14797 -15687 -10346 -3455 -19696 -29366 -26990 -11762 -10582 -22853 -30533 -36468 -22675
15753 -22675 -8884 10057 3448 -13748 -3789 -9663 -13861 -9495 452 5106 3831 1062 -564 2100
15739 2100 10774 12273 25334 22895 13134 -4514 -4074 -11893 -12930 -8772 -15824 -9894 -6687 -7699
15725 -7699 4827 -5382 -6047 -3150 -9323 -13877 -12254 5734 6409 -10504 -776 8905 10660 -9137
15711 -9137 -8786 3498 16970 22379 5413 -11862 -4507 3593 9287 -5215 -7006 -7886 2598 3578
15697C578J569J1028r213j8648p652L161Q665J291m116p921J212J8503J4850J0040
15683B6347j1651m054P624j5833k0640j422J0107k612J2627m4q397O12L10P648
15669F22O708O48q224M617j135j0517O750J5404k061r614l350j3069k4830j504
15655c9555N481K8303J8972j5218J005K669l071Q250J0997m510P987P72j641q016
15641A2425j1731o145j1322l787L538l356m85O195J0107J4992J0668N712J177
15628B7988l918J8189l716k7966p31j720j2567r589L762l943K3274K3635k10k2208
15614A0280j2000M389k54l822n716M47J4646N809J4612q776j5761p37l798N103
15600D422J411j0556L780k307n738r247Q522J597J0698R768l913m48p004P11O885
$$ plain form
15697 3578 5147 16175 6962 -11686 -19338 -16177 -7512 -6221 -10337 -18258 -17046 1457 16307 26347
15683 26347 14696 10642 18266 2433 -18207 -19629 -9522 -12134 493 449 -7948 -7336 -7026 622
15669 622 7330 7978 -246 4371 3236 -7281 -531 14873 12812 3198 -152 -13221 -38051 -39555
15655 -39555 -34074 -5771 13201 -2017 -1012 1657 -1414 6836 17833 13323 21310 22082 20441 12425
15641 12425 694 -5451 -16773 -20560 -17022 -20378 -20863 -14668 -4561 10431 21099 26811 27988
15628 27988 24070 42259 38543 10577 9846 8126 -4441 -14030 -10268 -14211 9063 32698 32488 10280
15614 10280 -1720 2669 2415 -1407 -7123 -6676 7970 13779 28391 19615 3854 3117 -681 4422
15600 4422 5833 -4723 -943 -3250 -8988 -18235 -9713 -8116 2582 12350 8437 7989 985 1696 8581
15585H581J0478P095j6644j3521J211K438J4619Q97j451q388K335o95q21P67r839
15570b938n271J6980J5941Q7r311r637n881P259J2767L975J197j9566j2121O86
15556e833n344q141J0822K1395N336j6652j4076j0115R661Q011l794j601P107
15543c224J0788m90p420m955j2998K749P098K443M017R512J656j3498j489J1311
15529E500r37P441J0047j3101l513q40J0440O8m220k106q524j2159r571K135p311
15514b6651N03l962K012J3189O751Q453l287k866j754L845o019R175P946l549
15500C786J0160r512q288M860J1935O873k300j9795j3838J093l528O326K5910
15487A3682K127j394p16j6214q530L369J0351N90j7679k066j670J3618J8747P334
$$ plain form
15585 8581 19059 26154 9510 -4011 -2800 -362 14257 15154 13703 5315 7650 6955 6134 6901 -2938
15570 -2938 -8209 8771 24712 24799 15488 5851 -30 7229 19996 23971 25168 5602 -6519 -5833
15556 -5833 -11177 -19318 -8496 12899 18235 1583 -12493 -22608 -12947 -4936 -8730 -10331 -3224
15543 -3224 7564 7074 -346 -5301 -18299 -15550 -8452 -6009 -1992 7520 9176 -4322 -5811 5500
15529 5500 4563 12004 22051 8950 5437 4597 15037 15105 10885 8779 255 -11904 -21475 -19340 -26651
15514 -26651 -26148 -30110 -28098 -14909 -8158 295 -2992 -5858 -7612 -3767 -9786 -611 7335 3786
15500 3786 13946 4434 -3854 1006 12941 19814 17514 -2281 -16119 -15026 -18554 -12228 13682
15487 13682 15809 14415 13699 -2515 -11045 -7676 2675 3265 -14414 -16480 -18150 -4532 14215 21549
15473B1549j5823j3598p919k17L669k033M72Q567J7600k604l120P590k3949L351
15459f465J0468P440R446p07M585m943j2530Q714M743k9745j8399P614n348N298
15445a9829Q465J0036J2942q24j6450j8690N863P674J0818k133n481K640l449
15432h418J562J1422p760J0708N081N037J3185o914l532n411j566j0434o039j5546
15418a8625J959J2050K67p973K0057J8936q704j9082q889m77J6450k000L32R382
15404A3683J1883j1999k7737p132J882J697j698k256l58P895J7620M887O65p136
15390A896q551m786M146J8681J1063J0745J286k365o844p995j5589J004K357Q153
15376A3201K697k5404j038N733N195J2487J709j3070j766P694J7131O397k432
$$ plain form
15473 21549 5726 -7872 -15791 -16008 -12339 -14372 -13900 -5333 12267 9663 6543 14133 -9816 -6465
15459 -6465 4003 11443 20889 20182 24767 19824 7294 16008 20751 -8994 -27393 -19779 -25127 -19829
15445 -19829 -11364 -1328 11614 10790 -5660 -24350 -18487 -10813 5 -2128 -7609 -4969 -8418
15432 -8418 -6856 4566 -3194 7514 12595 17632 30817 23903 20371 14960 13394 2960 -3079 -18625
15418 -18625 -16666 -4616 -4349 -12322 7735 26671 17967 -1115 -10004 -10481 5969 3969 4301 13683
15404 13683 25566 13567 -14170 -21302 -19420 -17723 -19421 -21677 -22035 -14140 3480 8367 9032 1896
15390 1896 -6655 -11441 -7295 11386 22449 33194 34480 32115 25271 17276 1687 2691 5048 13201
15376 13201 15898 -9506 -10544 -4811 384 12871 14580 1510 -256 7438 24569 30966 28534
15363B8534k465n752J253j0830k1305m245K3645J270r304n631k543J664o558n04
15349a2771j6141k149O730J6071K081p755R839K1934k093j9973k870K677p525
15336a1945n440J1821k84l309o03j039j2506l421J4162Q823J515j2900j8312J328
15322c2110J5336J3871K292r434o876J8211J3627k627n755j3393N149L0956M787
15309C4034n98k316r011j9133j9658r033J6885K1490q695J325L985j400n027j0069
15295g221L790k118N331J7076J2925j948k6438n902o249j2850O053J708o132Q609
15281a3366O566O582J211M818j0098j1843J348J3146N748O676q440o899r048O020
15267g579P360J0930K386J516p681L935j0341j8833j1420J9134J257o044Q211
$$ plain form
15363 28534 26069 20317 21570 10740 -10565 -14810 8835 10105 801 -4830 -7373 -5709 -12267 -12771
15349 -12771 -28912 -31061 -24331 -8260 -6179 -13934 -4095 17839 15746 -4227 -7097 -4420 -11945
15336 -11945 -17385 -5564 -5848 -9157 -9760 -10799 -23305 -26726 -12564 -3741 -2226 -15126 -33438 -32110
15322 -32110 -16774 -2903 -611 -10045 -16921 1290 14917 12290 6535 -6858 -1709 29247 34034
15309 34034 33436 31120 22109 2976 -16682 -25715 -8830 12660 3965 5290 9275 7875 2848 -7221
15295 -7221 -3431 -5549 -218 16858 29783 27835 1397 -4505 -10754 -23604 -17551 -15843 -21975 -13366
15281 -13366 -6800 -218 993 5811 -4287 -16130 -14782 -1636 4112 10788 2348 -4551 -13599 -7579
15267 -7579 -219 10711 13097 14613 6932 10867 526 -18307 -29727 -10593 -9336 -15380 -7169
15254g169R318P463l949o166O975p555N944J0416o558j2879j0529L329p404m296
15240b3060o683J1700J0822J536l190J74J06j1416J1051J3764J6846R53j2106
15227A0497Q915K770k1579N852K77R406K490j5129j161j0615l267P512j966l702
15213i700K93N974l823k9388j0398J5149J7486K1290J103p074j2810q381L990
15200a6289L467Q924j918Q425Q020P925m594j5450N904K1175j080K340n225m672
15186A6952L169n630j1781L119O237N864j1889m053J291k071k0329K76R972K0806
15172A1933K4818j2944j5538p374J2764m73j6715k965M947J515o661q973Q273
15159g393J1441K297M695k415J676Q081j0049o223o052m155K617l641R794o951
$$ plain form
15254 -7169 2149 9612 5663 -503 6472 -1083 4861 15277 8719 -4160 -14689 -11360 -18764 -23060
15240 -23060 -29743 -18043 -7221 -5685 -8875 -8701 -8595 -20011 -8960 4804 21650 22603 10497
15227 10497 19412 22182 603 6455 6732 16138 18628 3499 2338 -8277 -11544 -4032 -5998 -9700
15213 -9700 -9407 -3433 -7256 -36644 -47042 -31893 -14407 6883 7986 912 -11898 -20279 -16289
15200 -16289 -12822 -3898 -5816 2609 10629 18554 13960 -1490 4414 25589 24509 26849 21624 16952
15186 16952 20121 14491 2710 5829 12066 17930 6041 1988 3279 1208 -19121 -18845 -8873 11933
15172 11933 36751 23807 8269 895 13659 13186 -3529 -6494 -1547 -32 -6693 -15666 -7393
15159 -7393 4048 6345 11040 8625 10301 18382 8333 2110 -3942 -8097 -5480 -9121 673 -6278
15145f278M118j66j2798j1919Q873Q529o03p062N665J3702p291r28J5347J0156
15131A9345K642j4377l992q059j7342j0917P338n692O085K4198J7522j186k049
15118A3516n876j5443o596N651R061k516j2312o625j3207J3064J9579J1425r370
15105C51k860l923O84m153l37J8453l827k3239J5124J0231l82Q80J3297J3918
15091C4217j0090O861n240l4789m342K4193K2439k201q572l664m951N126j0378
15078H609m309p108k6605P127k578P045P388o774j1059P990N94k422P131J7811
15064B840J0254J55j5519k5Q461q404k0195M92J0422P071J754Q861J547j01j7298
15049i685n681M588J2215J100N907K2776j255j3763j278o563j2823j4398Q842
$$ plain form
15145 -6278 -2160 -2326 -15124 -27043 -18170 -9641 -10244 -17306 -11641 2061 -5230 -6158 9189 19345
15131 19345 21987 7610 3618 -4441 -21783 -32700 -25362 -31054 -24969 -771 16751 15565 13516
15118 13516 7640 -7803 -14399 -8748 313 -2203 -14515 -21140 -34347 -21283 -1704 9721 351
15105 351 -2509 -6432 -5748 -9901 -10238 8215 4388 -18851 -3727 6504 6122 7002 20299 34217
15091 34217 24127 30988 25748 -9041 -13383 10810 33249 31048 22476 18812 13861 18987 8609
15078 8609 4300 -2808 -29413 -22286 -24864 -17819 -10431 -17205 -28264 -20274 -19680 -22102 -14971 2840
15064 2840 13094 13249 -2270 -2295 6166 -2238 -22433 -21941 -11519 -4448 -2694 6167 7714 7613 -9685
15049 -9685 -15366 -10778 1437 2537 8444 31220 29965 16202 14924 8361 -4462 -18860 -10018
15036a0018L353J1263j0766J2203J8258j3590k5610M847J783l504j503P401k550
15023h433L712r649J776M819j1586j9806R620Q813N505J9088K7506p691l5178
15010a1504l435J1194P34R401J2111M529n216n456R325P44j1818r860o200K86
14996e165J7555J5888l169k190j774j2309q423n083j071j31J2305M59m251o827
14982d186n932n249Q717J1051M294O051j756q921K352q730r721J9L236J510J65
14967g100L799o411N288k404K82k537j6492P754m297j493K454Q583m016J903J4579
14952a08J5971j0116j3951n311R402P151l03M955J8674N449j4746j7164n512K2767
14938A7158Q074P063p537o043q983q162L290m133K378j803K554n766k1393n37
$$ plain form
15036 -10018 -6665 4598 -6168 6035 24293 10703 -14907 -10060 -8277 -11781 -13284 -5883 -8433
15023 -8433 -4721 -14370 -12594 -7775 -19361 -39167 -29547 -20734 -15229 3859 31365 23674 -11504
15010 -11504 -14939 -3745 -3011 6390 18501 23030 17814 12358 21683 22427 10609 749 -5451 -5165
14996 -5165 12390 28278 25109 22919 21145 8836 413 -4670 -5741 -5872 6433 6892 2641 -4186
14982 -4186 -10118 -15367 -6650 4401 8695 14746 12990 4069 6421 -2309 -12030 -12011 -8775 -7265 -7100
14967 -7100 -3301 -9712 -4424 -6828 -6546 -9083 -25575 -17821 -22118 -23611 -21157 -12574 -16590 -14687 -108
14952 -108 15863 5747 -8204 -13515 -4113 3038 2735 7690 26364 31813 17067 -97 -5609 17158
14938 17158 25232 32295 24758 18715 9732 1570 4860 727 3105 1302 3856 -1910 -23303 -23840
14924b3840J4300k722J4629m708L30R248P043P16m297p962Q554O529n605P068
14910A9283N243m448r256L827P175r539j1815l778p880J0754M119P870M502j2044
14896D013o437k343k1882P916N810Q66J3534J145j0588j8384j0607k90K5193K9470
14882A7416n42j5618r382J2407q620Q779M865j3444n562N711J693j0315J0384
14869b228Q261j471j4110r628K225J0396R241j7379j0014P715J9091J1455o921
14856F633p215q678R803O871m52m877n191j6837k671M877R465O648m198K172J5448
14841A1798O709O251j4201m476K4550Q308p966q327N858k31O055q83j533J2814
14827D4726j0738j3198R184j111j6518r174p778J687l297J5498j859K38J2649
$$ plain form
14924 -23840 -9540 -12262 2367 -2341 -2011 7237 14280 14996 10699 2737 11291 17820 12215 19283
14910 19283 24526 20078 10822 14649 21824 12285 470 -3308 -11188 -434 3685 11555 16057 4013
14896 4013 -2424 -4767 -26649 -18733 -12923 -12057 1477 2622 -7966 -26350 -36957 -37247 -12054 17416
14882 17416 16874 1256 -8126 4281 -4339 4440 9305 -4139 -9701 -3990 -2297 -12612 -2228
14869 -2228 6033 4562 -9548 -19176 -16951 -6555 2686 -14693 -24707 -16992 2099 13554 6633
14856 6633 -582 -9260 543 7414 6962 2085 -3106 -19943 -22614 -17737 -8272 -1624 -5822 -3650 11798
14841 11798 18507 24758 10557 6081 30631 38939 30973 22646 28504 28273 34328 33445 31912 44726
14827 44726 33988 20790 29974 28863 12345 3171 -4607 -2920 -6217 9281 7422 7660 20309
14814B0309p114n170n303k3510k728L411j675k640J5097M933N208J2931P479m781
14800A6447r000r197P741q816j5321m438J6634Q395J9254Q459j2974l297k197
14787A1690n499R421J0662p046p649j9092j9765j3322J8522J2298n91K37R98M14
14773h722R274N728O719L362L629Q595p035M91j0354l74l267j2702K401O74q046
14758i627J7178R603o159J3664m856K73J62N048j214j48J2826r510n31k3585n887
14743b763j924M188o040J0301j389l094J3849J2166p853j0110M096J6096O437
14730C3960p040K627N584j4948l056j5901j4709L411J2568J4014l027q832k573
14717B078J1648J0167O651n156j5110j2627j4451K1495K4395p964q349P8j157
$$ plain form
14814 20309 13195 8025 2722 -20788 -23516 -20105 -21780 -24420 -9323 -4390 818 13749 21228 16447
14800 16447 7447 -1750 5991 -2825 -18146 -22584 -5950 2445 21699 30158 17184 13887 11690
14787 11690 6191 15612 26274 19228 11579 -7513 -27278 -40600 -22078 -9780 -10371 -10134 -9136 -8722
14773 -8722 552 6280 12999 16361 19990 28585 21550 22041 11687 11313 8046 -4656 -2255 -1581 -9627
14758 -9627 7551 17154 10995 24659 19803 20076 20238 25286 24072 23924 36750 27240 26709 3124 -2763
14743 -2763 -4687 -499 -6539 3762 2373 -721 13128 25294 17441 7331 11427 27523 33960
14730 33960 26920 29547 35131 20183 17127 1226 -13483 -10072 2496 16510 13483 4651 2078
14717 2078 13726 23893 30544 25388 10278 -2349 -16800 4695 29090 21126 12777 12855 11698
14704A1698k342R804q033n884N041N128o40o995j6168n391q15O254K95l087P305
14689c830j2635R212K1643l113n093q941k196J2228q900j0641n608N408L361p971
14675a7076J307o211K0487K724L043j403Q456q882J1932j0674j4183k090k24O795
14661e999Q480J0443Q151q525j1269j488J1441J5757M374m781k00p663p654j0203
14647H64N551P192q594J0496j1928N935J3322j3328j0241o725r967n23K2911J3091
14633A8056q00M931o648j6134j7998q004r604P944J7294J4049L413j0399j753
14620e653L812j962l943R636J1489N529j3419k4435p804M446Q23n566Q930K3848
14606E731J6041N047O933n923q060j7033j0386o171O539O604l752J6151J2902
$$ plain form
14704 11698 9356 19160 11127 5243 10284 15412 14772 7777 -8391 -13782 -14597 -8343 -8048 -11135 -3830
14689 -3830 -16465 -7253 14390 11277 6184 -2757 -4953 7275 -1625 -12266 -17874 -12466 -9105 -17076
14675 -17076 -15769 -21980 -1493 1231 4274 2871 11327 2445 14377 3703 -10480 -12570 -12794 -5999
14661 -5999 2481 12924 21075 12550 1281 -207 11234 26991 31365 26584 26384 18721 11067 864
14647 864 6415 13607 5013 15509 3581 9516 22838 9510 -731 -7456 -17423 -17946 4965 18056
14633 18056 17256 22187 15539 -595 -18593 -26597 -36201 -28257 -10963 3086 6499 -3900 -5653
14620 -5653 -1841 -3803 -7746 1890 13379 18908 5489 -18946 -26750 -22304 -21481 -27047 -18117 5731
14606 5731 21772 26819 33752 27829 19769 2736 -7650 -13821 -7282 -678 -4430 11721 24623
14593B4623r364K908j447M75Q39n847O446L008O847K767l838M116q615r916J622
14578A4624P046m572p443P888L797j0396o357l437O367n862Q453k846J366Q705
14564A7333R281j403q328k2877r434O72l460J3613J3007J475J8181J159m406J6862
14550D1675J936j4788j3542n141m345j5879R368p470j0799k255R045P858J4341
14537A0004J1143J714p761J360j1797l229R642r723k440m333p168r06J2822r571
14523a0243p75J3705R524o266m813r94J0569J1448j313o255J695m68P696Q719
14509C2229K654o138j0123J74M586J836j0387l308N703n204M205K1318j828r119
14495B6598k6119j3916j605J3602K705k32k376j766J327O017N931J681J5802p765
$$ plain form
14593 24623 15259 18167 16720 17195 18034 12187 18633 21641 28488 31255 27417 31533 22918 13002 14624
14578 14624 21670 17098 9655 17543 21340 10944 4587 1150 7517 1655 10108 7262 8628 17333
14564 17333 26614 25211 16883 -5994 -15428 -14756 -18216 -4603 8404 9879 28060 29219 24813 41675
14550 41675 43611 28823 15281 10140 5795 -10084 -716 -8186 -18985 -21240 -12195 -4337 10004
14537 10004 21147 22861 15100 16460 4663 1434 11076 1353 -1087 -5420 -12588 -13494 -672 -10243
14523 -10243 -11018 2687 12211 5945 1132 138 10707 22155 20842 14587 16282 15814 23510 32229
14509 32229 34883 28745 18622 18796 23382 25218 14831 11523 17226 12022 16227 37545 35717 26598
14495 26598 479 -13437 -15042 -1440 1265 1033 -1343 -3109 -1782 4235 10166 11847 27649 19884
14481A9884j3577r132k43j695J574R127j5372L025R33L801J8382r39p715j1151
14467c098j546J7321K205m012M002n746j3934j65j6237R641J6645J762L019N966
14453A5823Q516r898k836j691L549M235p592n411P304O705m695l959R397j890
14439A7557q321q733O601P562K438j241L819k906k640J4660M118O697J5548j6367
14425C8792k5149j3495L696j049m88O546J1593P136m426p589p22Q81L38q846J979
14410I197k0050j8426N440J4038K03Q137N278O822R29J299k016k579j0668R123
14396F727O541j4722K555K986L841j8259j1759J5991j407j0925M051J0888J4808
14383A1316j1532o736J8945l311l217O621P175O066J123m085j23q822j1294n470
$$ plain form
14481 19884 6307 -2825 -3068 -4763 -3189 5938 -9434 -6409 -5476 -1675 16707 15768 8053 -3098
14467 -3098 -4644 12677 14882 10870 14872 9126 -4808 -4973 -21210 -11569 5076 6838 9857 15823
14453 15823 24339 14441 11605 9914 13463 17698 10106 4695 11999 18704 14009 10050 19447 17557
14439 17557 9236 503 7104 14666 17104 15863 19682 16776 14136 28796 32914 39611 55159 38792
14425 38792 13643 148 3844 2795 2307 8853 20446 27582 23156 15567 14845 15726 16064 7218 9197
14410 9197 -10853 -29279 -23839 -9801 -9598 -1461 3817 10639 11568 12867 10851 8272 -2396 6727
14396 6727 13268 -1454 1101 4087 7928 -10331 -22090 -6099 -7506 -18431 -14380 -3492 11316
14383 11316 -216 -6952 11993 8682 5465 12086 19261 25327 26450 22365 22242 13420 2126 -3344
14369c344L923K972J4436R375l128j0543j6823p012P898L281J0222J8156M391
14356C3804K33M211q332k34O904r6o214p638o718j2900r717Q79O166M13l270N818
14340C309K3714N135j2499m813J1585N964j0874j2853j7634J868J441J0399J4434
14327A9176R83o669n99J2426m836J294M777M049N124L526j659R542m106l00r524
14312C3204j8136k410J0638J8228K6932Q47L373m471K2532J9294R514l390r496
14299A06659R767N854j4511K080k166j457j570o529K404J660k1801q202k662j500
14285F8026R260J325m521j3246J979p718q777j0038j173o547K996j178l308M999
14271C2079P960M758p11q615O013k582r658j698l799p62k49J2653J4846l688j7747
$$ plain form
14369 -3344 579 3551 17987 27362 24234 13691 -3132 -10144 -2246 1035 11257 29413 33804
14356 33804 34037 38248 29916 29682 36586 36490 30276 22638 15920 3020 -6697 -5818 348 761 -2509 3309
14340 3309 27023 32158 19659 14846 26431 32395 21521 8668 -8966 -7098 -5657 4742 19176
14327 19176 20159 13490 12891 25317 20481 21775 26552 30601 35725 39251 37592 47134 43028 42728 33204
14312 33204 15068 12658 23296 41524 68456 69303 72676 68205 90737 110031 119545 116155 106659
14299 106659 116426 122280 107769 109849 107683 106226 104656 98127 100531 102191 80390 72188 69526 68026
14285 68026 77286 78611 74090 60844 62823 55105 46328 36290 35117 28570 31566 30388 27080 32079
14271 32079 40039 44797 44086 35471 41484 38902 29244 27546 23747 22985 22736 35389 50235 46547 28800
14256B8800j0843J859Q070Q466J682K61j3369n247J4770J0049K035J0880o537
14243E0876j378p630J2677L462o561k4104k6334N752J5621J6265j9M793O273j0895
14229C8798j3193L914j976J385P187K0959J0994L8J252J2513n144j6494j4510
14216D5723R17j9245k770M213J1980P158K491J2217K1661L440P793K2557K4898
14203A43033L0686M5647O6052J41843K15588L39823N56563O04095J91158j73548
14193B160940m13611n48825l98960k28846j28892r5202o2298k7507k9818k4627
14183B02354k2816k5723j0942j4545j2669j6048k2916P020O083j8989q723o791
14171E5295M317K184o954j1923m491R620L875O904q69J3081N923j1038r494q467
$$ plain form
14256 28800 17957 19816 27886 36352 38034 38295 24926 19679 34449 44498 46533 57413 50876
14243 50876 49498 41868 54545 58007 51446 27342 1008 6760 22381 38646 38627 43420 49693 38798
14229 38798 25605 29519 27543 28928 36115 57074 68068 68106 69358 81871 76727 60233 45723
14216 45723 46640 27395 24625 28838 40818 47976 50467 62684 84345 87785 95578 118135 143033
14203 143033 173719 219366 285418 427261 642849 982672 1539235 2143330 2334488 2160940
14193 2160940 1747329 1198504 799544 570698 441806 346604 284306 256799 226981 202354
14183 202354 179538 153815 142873 128328 115659 99611 76695 83715 89798 70809 62086 55295
14171 55295 59612 61796 54842 42919 38428 48048 51923 58827 57958 71039 76962 65924 56430 47963
14157D7963j349O906R036k991q203l817J1018k814j4422q512l532q702j6057J2127
14143A6651L3518M411m428K752N763j7437J1050Q723k993l411J530Q58N477J51
14129F2615n894j7673M272K641J1110j0459l516m166J500k156Q720m596j2086
14116C0312j4600J372J5229Q553J0763k729l487J02j1645n246j4254j1483K4093
14103B6980J6884N777l063l674m789j7524M781L047R162k78m644J2825L436j8949
14089B9971L32m059k918O451K749J1550J5795J1202O505n170j7706j2418J3958
14076E6242K4663l165j3073J1250j0586j5453k20K4555J4587J4637K1195J5144
14064A39776M891K8873L1568K8080j7361n8266o2859p8754o5825j4073R381K7691
$$ plain form
14157 47963 46614 53520 62556 59565 51362 47545 58563 55749 41327 32815 29283 20581 4524 16651
14143 16651 50169 54580 50152 52904 58667 41230 52280 61003 58010 54599 56129 56987 62464 62615
14129 62615 56721 39048 43320 45961 57071 46612 43096 38930 40430 38274 46994 42398 30312
14116 30312 15712 17084 32313 40866 51629 48900 45413 45515 33870 28624 14370 2887 26980
14103 26980 43864 49641 46578 42904 38115 20591 25372 28419 37581 37303 32659 45484 48920 29971
14089 29971 30303 26244 23326 29777 32526 44076 59871 71073 77578 72408 54702 42284 56242
14076 56242 80905 77740 64667 75917 65331 49878 49658 74213 88800 103437 124632 139776
14064 139776 144667 173540 205108 233188 215827 157561 94702 15948 -49877 -63950 -54569 -26878
14052b6878L4739J9903l612o119J5780p13r379p647R246O901o998j4351k727p188
14038I57k224O720L828o068J1472j169R727o659M208K723r739j3273j3905q040
14024b1442J1115K7866K1843q697L263P940J4211n90P10J171k567j2064l4k658
14010D0067J4639R042L870J6674K6153L7097L7642N4651O1627p047m9697p1358
13998A73360o9916n2403j0976O586p786m895J9506P059l811N199R595K430n278
13985F8670r755l0091m238P683J8337J364j2290K041J2541o786q487J779j1596
13972B9172N744N022j636J310M452j3140R65m349r914k6669k8319r912J7470J9591
13958a0213J9727J7112N220N442L056J2238L599j2396j694L981J6069J3796J2864
$$ plain form
14052 -26878 7861 27764 24152 18033 33813 33100 23721 16074 25320 32221 25223 10872 8145 957
14038 957 -1267 5453 9281 3213 14685 13516 23243 16584 20792 23515 13776 503 -13402 -21442
14024 -21442 -10327 17539 39382 30685 33948 41888 56099 55509 56219 57390 54823 42759 42725 40067
14010 40067 54706 63748 67618 84292 110445 147542 185184 239835 301462 294415 244718 173360
13998 173360 103444 51041 40065 46651 38865 33970 53476 60535 56724 61923 71518 73948 68670
13985 68670 58915 28824 24586 32269 50606 51970 39680 41721 54262 47476 38989 40768 29172
13972 29172 34916 39938 38302 39612 44064 30924 31889 27540 17626 -9043 -37362 -47274 -29804 -10213
13958 -10213 9514 26626 31846 37288 40344 52582 56181 43785 42091 46072 62141 75937 88801
13945H8801J0666n24j004j505k1413l1644l1833p111J7953J1742j6305J1275l456
13932B5642p710Q454J8819J1819M419J525J5685P002K430l963J0869P778j3290
13919H9479q328j9415j60J7316O554P939M924K0082J4050J071R07L0406O3220
13906B28045Q6068J24096J17521K7983l6975j13990j29106o2429m8407j9794j0200
13895A62812k0979o102j072j0211j1425r81n897j9755j6455j5638k0739M955o83
13882C7830j9641r31k4846k2249Q937R705o540P3190J40245J02712O6119L0373
13870C94904j9983k9417j8804j4276j958k944n827J0674Q85k867m667J983r867
13857B97836o842J0179R101k95q423k1720k2006j4808p713N907O355r66Q438K041
$$ plain form
13945 88801 99467 98943 97939 96434 75021 43377 11544 4433 22386 34128 17823 29098 25642
13932 25642 17932 26386 45205 57024 61443 62968 78653 85655 88085 84122 94991 102769 89479
13919 89479 81151 61736 61576 78892 85446 93385 98309 118391 132441 133512 134419 164825 228045
13906 228045 314113 438209 555730 583713 546738 432748 303642 241213 192806 173012 162812
13895 162812 141833 135731 134659 124448 113023 112042 106145 86390 69935 54297 33558 38513 37830
13882 37830 18189 17258 -7588 -29837 -20900 -11195 -17735 55455 195700 298412 364531 394904
13870 394904 374921 345504 326700 312424 310466 307522 301695 312369 313254 310387 305720 307703 297836
13857 297836 290994 301173 310274 309979 301556 279836 257830 243022 235309 241216 247571 246605 255043 257084
13843B57084O415N459m46k641k0857k0965O002L8373M3393K7928j1428k4559J
13830C03759N307J3510J6844J5294M264L1234K8923J5935k1291J228P755J0255
13818D33017j7078l822K666K609J3760K6620J3655K442K6491L3494p039j871Q251
13805E33195P247J6503J4585M814p380N165O473N56J689J7953L1217K8322M3574
13792G03913M2991L7318L3036M6762P3804J18181J22275J06862J54682K06932
13782A646756K86878L65241L91943K56777N6857p0909j13742n3188L6040R5106
13772B897759J40119J85820K64119L55381M32469N14503N75581O68741P57821
13763F792313Q59441J065982J384059J834611K475048L428079M845261O780291
$$ plain form
13843 257084 263499 268958 268512 265871 245014 224049 230051 268424 311817 339745 328317 303758 303759
13830 303759 309066 322576 339420 354714 358978 390212 419135 435070 413779 415007 422762 433017
13818 433017 415939 412117 414783 417392 431152 457772 471427 473869 500360 533854 526815 524944 533195
13805 533195 540442 556945 571530 576344 568964 574129 580602 581158 582847 600800 632017 660339 703913
13792 703913 746904 784222 817258 864020 937824 1056005 1178280 1285142 1439824 1646756
13782 1646756 1933634 2298875 2690818 2947595 3004452 2933543 2819801 2766613 2802653 2897759
13772 2897759 3037878 3223698 3487817 3843198 4275667 4790170 5365751 6034492 6792313
13763 6792313 7651754 8717736 10101795 11936406 14411454 17839533 22684794 29465085
13755B9465085R615926J4106472K2121947L7697612O4730435J05824911J20513731
13748D04076119M5479279k7979276p4691091j08204373q3033703m7382777k6963485
13741H1300693j6685685j1453165q230334o084093m516955l247643k424801k461223
13733B6196794k827478k904874k951339k563805k018177j584652j235796j029838
13725I080835q63518p51705o62864n66677m78983m25063l90799l61704l40150
13716D239372l00502k44847k15862k00610j78638j53600j19609q8329p8680p4665
13706B584030r5744j14403j19412j38369j14497q9742p5390n9313n3473n9467
13696A664220l7686j286N6925J71401L69031O71380R68662P56420j734m87515
$$ plain form
13755 29465085 39081011 53187483 75309430 113007042 177737477 283562388 404076119
13748 404076119 449555398 421576122 346885031 238680658 155646955 108264178 81300693
13741 81300693 64615008 53161843 44931509 38847416 34330461 31082818 28658017 26196794
13733 26196794 23369316 20464442 17513103 14949298 12931121 11346469 10110673 9080835
13725 9080835 8217317 7465612 6802748 6236071 5757088 5332025 4941226 4579522 4239372
13716 4239372 3938870 3694023 3478161 3277551 3098913 2945313 2825704 2737375 2658695 2584030
13706 2584030 2488286 2373883 2254471 2116102 2001605 1911863 1836473 1777160 1723687 1664220
13696 1664220 1626534 1625248 1682173 1853574 2222605 2893985 3862647 4619067 4617333 4129818
13686D129818q72151q82927n98444l46631j97795j37693j09448q8690r0638q0621
13676G24780o2854m5060n2040m9410l5015j2427l0181L967J4071m616j5506k5696
13664D10013k8226j6142l1757j9127P458K6911Q790l110k1445k2089j2186K0734
13652C19824K4068K7949K2803N0272O8372J18590K30061L01502K41736M5929j55316
13641A295790k58800k68937j83869j27603q2287n3110o3707l6329k5305k6550
13631A69293l5713j7824l2568k4088k8717k6384j1426K4776R1995J28160J07991
13620C45495O8721J6494m1148l1410j4904k0724j9867j3575j6194k4370j7174
13609B31344r200k0161j0403L76j8146k0863j6505j0921o275k0490k0049k4633
$$ plain form
13686 4129818 3257667 2374740 1776296 1429665 1231870 1094177 984729 896039 805401 724780
13676 724780 661926 616866 564826 515416 480401 467974 437793 441760 455831 451215 435709 410013
13664 410013 381787 365645 333888 314761 322219 349130 357920 354810 333365 311276 299090 319824
13652 319824 343892 371841 394644 444916 513288 631878 861939 1163441 1405177 1451106 1295790
13641 1295790 1036990 768053 584184 456581 374294 321184 257477 221148 195843 169293
13631 169293 133580 115756 83188 59100 30383 3999 -7427 17349 109344 237504 345495
13620 345495 414216 430710 389562 358152 343248 322524 302657 289082 272888 248518 231344
13609 231344 222144 201983 191580 191956 173810 152947 136442 125521 119246 98756 78707 54074
13597E4074l4834m0034q2258j65008j32291o755Q7136J38479J09686N4223K4729
13586G147J3660K5468L3322K3473j2267k3491o628P666J1236K9122Q660j4386
13574A02982o55k4887j9538J8571K6288N524N374j5989J650J2747J600k74M195
13561A17588m61n497K3196P072k7575l8188l7240k9390j1965J2320J532N800K2527
13548C9719K2728J5285P275j9966j6183k2436j2071Q157K1768K1775J5387K8928
13536A10366K0824K0505J1207r303j6866J360k2301j4319p455k810J017L28J755
13523I4308J585P433J7385L9948Q3965P7145p218l2430o4603m6802l7567k5526
13511A07623j1687n474L158k915K1858K9333K9143K5031N1489R0301J58945J78327
$$ plain form
13597 54074 19240 -20794 -103052 -268060 -400351 -407106 -319970 -181491 -71805 -17582 7147
13586 7147 20807 46275 79597 103070 90803 67312 60684 68350 79586 108708 117368 102982
13574 102982 102327 77440 57902 76473 102761 108285 113659 97670 99320 112067 113667 113393 117588
13561 117588 117127 111630 134826 141898 114323 76135 38895 9505 -2460 9860 11392 17192 39719
13548 39719 62447 77732 85007 65041 48858 26422 14351 22508 44276 66051 81438 110366
13536 110366 131190 151695 162902 153599 136733 138093 115792 101473 94018 91208 92225 92553 94308
13523 94308 95893 103326 120711 160659 244624 321769 314551 282121 217518 170716 133149 107623
13511 107623 95936 90462 93620 90705 112563 141896 171039 196070 247559 337860 496805 675132
13499F75132N5947k7828j01405j56509j18159p0288n3461l3543l377j3453j5677
13488A37379o514r476j1479j4164o197j7242j8238K595L697J3092n117J541J2948
13475H2825J309R247O994N642J0332q362j0373j7879l044J226L646p00q223O836
13461G9476o386j1797R843J249l336j0207k8646j5236K4814J6585j810Q962j761
13448F1750r50j7499j1126O686L3868L0882K4187J695p797k1082p5572r1975n0998
13435a17931j3896J1585K6232R922N677J0829J2291K4265K587j2353j441J9034
13423b3199j896k732P870J2336m068l246O030K703O472N493k742j277J447J5090
13409A8281J5403j1707j5391p016p123K369O260n525j773K4787O061L643N369
$$ plain form
13499 675132 731079 703251 601846 445337 327178 256890 203429 169886 166509 153056 137379
13488 137379 130865 121389 109910 95746 89549 72307 54069 56664 60361 73453 68336 69877 82825
13475 82825 84134 93381 100375 106017 116349 107987 97614 79735 76691 77917 81563 80863 72640 79476
13461 79476 73090 61293 71136 72385 69049 58842 30196 14960 39774 56359 54549 63511 61750
13448 61750 60800 43301 32175 38861 72729 103611 127798 129493 121696 100614 25042 -66933 -117931
13435 -117931 -131827 -120242 -94010 -84088 -78411 -67582 -55291 -31026 -28439 -40792 -42233 -23199
13423 -23199 -25095 -27827 -19957 -7621 -11689 -14935 -8905 -6202 270 5763 3021 1744 3191 18281
13409 18281 33684 21977 6586 -430 -7553 -5184 1076 -4449 -6222 18565 24626 28269 33638
13396C3638k353l015J0929J0899m416n313K006J669j198j1971p607K665O798n425
13382B7306k2158j1483J406J4163L411R356l750L087K192l827q014P767J008k1398
13368i34j0526O669M402J16NJ2664R796P357O479J1921k0308l484L007N30k434
13353B5260N844J0604N921o722n639k995m265J442o17j9996o309R921J4521K1018
13339D7988O166j4410j2878L707J8884n440j6364q679Q213K533J214j0128R351
13326C0157Q678O9l401O416J588j1773r570o979K88m866P896R646m534j2335J4884
13311B6164Q738J2635J0424J4810J7871Q688n772J2844R392K0893M4268P7006
13299B57961J10227J82914L23367N18770O38125K89295j23203l75090n28850m23711
$$ plain form
13396 33638 31285 28270 39199 50098 45682 40369 42375 44044 42846 30875 23268 25933 32731 27306
13382 27306 5148 -6335 -4929 9234 12645 22001 18251 21338 23530 19703 11689 19456 20464 -934
13368 -934 -11460 -4791 -389 -273 -268 12396 22192 29549 36028 47949 27641 24157 27164 27694 25260
13353 25260 31104 41708 47629 40907 35268 32273 28008 29450 28833 8837 2528 12449 26970 47988
13339 47988 54154 39744 26866 30573 49457 44017 27653 18974 27187 29720 30934 20806 30157
13326 30157 38835 38904 35503 41919 43507 31734 22164 15185 15473 10607 18503 28149 23615 11280 26164
13311 26164 34902 47537 57961 72771 90642 99330 93558 106402 115794 136687 180955 257961
13299 257961 368188 551102 874469 1393239 2031364 2320659 2197456 1822366 1293516 869805
13289H69805k44629j31133p3549n5785p0441l5534k1764k6962k0985l0392l1521
13278A27110m0100j7770q563j7833K2508J8260L759n929k4395j2696k810o398
13266C5143J0536L523J4113O351l977l214o840j9627k076l604j7413n741M958
13253A2132O374J2196P219p022j8648o026K0154J1518k633n447j6771n099K809
13240A0756L390R694O98P12P093O503l1987j4820J11J0064L475J0918J6356J729
13226C4692l3686j6147L100j3054J4687Q33k174p11J9094R425o85J13P60l134
13212A3113k268p26n140l899r411o129J5482p474l436p738M313J7058O959P779
13198A8483q42q458J054j6739j0915P809j3449m457j553O027P930J292M05J2212
$$ plain form
13289 869805 625176 494043 420494 364709 294268 258734 236970 210008 189023 158631 127110
13278 127110 87010 69240 60677 42844 65352 83612 87371 81442 57047 44351 41541 35143
13266 35143 45679 49202 63315 69666 65689 62475 55635 36008 33932 30328 12915 7174 12132
13253 12132 18506 30702 37921 30899 12251 6225 26379 37897 35264 29817 13046 7947 10756
13240 10756 14146 23840 24538 25250 32343 38846 6859 -7961 -7850 2214 5689 16607 32963 34692
13226 34692 1006 -15141 -12041 -25095 -10408 -9575 -11749 -12460 6634 16059 15374 15487 16247 13113
13212 13113 10845 10119 4979 1080 -8331 -14460 1022 -6452 -9888 -17626 -13313 3745 10704 18483
13198 18483 17641 9183 10237 -6502 -17417 -9608 -23057 -27514 -29067 -23040 -15110 -13818 -13413 -1201
13184a201L760J0080L462o217k9J7038J0942p098J55j5179j0764N677J1002J813
13170B3441j4930j5578N834n071L521N753k07q47j953r011J851J5767o750n645
13156c825j122J6667N334p166J7184l215J816J7172j311n817j349o296n003p900
13142A5169k2279j5852O840J4790J7428N012j2834q457o73O309O361O369l098
13129A5085j4282m393r451l106m469Q681M182P008n558p01J0722O050l090J859
13115H537m463M788R85O171J249k2155j2406j990K0287J6927P705J563k2123j004
13101D071M593m899m876L646j0357j4280K984K6088N923j8059m186J860J2129
13088D637Q357P673m313j0512j2248P164J0837L753L097l751j991J4768J596l079
$$ plain form
13184 -1201 2559 12639 16101 9884 9855 26893 37835 30737 30892 15713 4949 10626 21628 23441
13170 23441 8511 -7067 -1233 -6304 -2783 2970 2763 1916 -37 -9048 -7197 8570 1820 -3825
13156 -3825 -4947 11720 17054 9888 27072 23857 25673 42845 41534 35717 34368 28072 23069 15169
13142 15169 -7110 -22962 -16122 -1332 16096 21108 8274 -183 -856 5453 11814 18183 15085
13129 15085 803 -3590 -13041 -16147 -20616 -11935 -7753 -745 -6303 -7004 3718 9768 6678 8537
13115 8537 4074 8862 9847 16018 17267 -4888 -17294 -19284 1003 17930 25635 27198 5075 4071
13101 4071 8664 3765 -1111 2535 -7822 -22102 -19118 6970 12893 -5166 -9352 -7492 4637
13088 4637 12994 20667 16354 5842 -6406 758 11595 15348 18445 14694 12703 27471 29067 25988
13074B5988n461j0635J1795J2125k905k3542l966J579N622M177J1093j1260j793
13061A2817l885M435K2558L897l00k707j5884n498r156m21J854K3703q787j6896
13047E730o441O316R429R923m309J2412r27k0976j0466N468J5381J1365j6846
13034A6059j5728K529P128J6952l676m436k3586R762K8310J3969l899r464k749
13021C1171m417J473N737j1302j1742m185l634M143P407J9317k583j7425j1610
13008B350L329p08k378M348J0083l823K312J0054j5253k0135j6314K446O038J2960
12994d691R892M709J6086J4541j835p869j0082l612J516M55j948m782Q899J0125
12980C1404m464Q02q101M377o182o943J3215N418M34m820j047j1309q511q257
$$ plain form
13074 25988 20527 9892 21687 33812 30907 7365 3399 4978 10600 14777 25870 14610 12817
13061 12817 8932 13367 35925 39822 39522 36815 20931 15433 6277 5856 7710 31413 22626 5730
13047 5730 -711 5605 15034 24957 20648 33060 32133 11157 691 6159 21540 32905 16059
13034 16059 331 2860 9988 26940 23264 18828 -4758 5004 33314 47283 43384 33920 31171
13021 31171 26754 28227 33964 22662 10920 6735 3101 7244 14651 33968 31385 13960 2350
13008 2350 5679 4971 2593 6941 17024 13201 15513 25567 10314 -9821 -26135 -23689 -17651 -4691
12994 -4691 5201 9910 25996 40537 38702 30833 20751 17139 18655 19110 17162 12380 21279 31404
12980 31404 26940 27742 19641 24018 17836 10893 24108 29526 29960 25140 24093 12784 4273 -3984
12966c984J0215J6963J314o114L69j634K782o158m702n926Q989o347N463m644
12952F586n573J691r154k999M082l222J6557J8670m325o99Q77j726N030j5665
12938A0130j5454j2167Q661j499j0104J8190L0523L309q537j8428Q76Q49K964
12925I313N284N614p548j3044O41J3348J0661o269m020l369o552K187O945q530
12911D661j0375l581J0590K2191j847q22Q020O207j8960j0165P690l890j164M051
12897A2606m833n869L502k22k3716Q753K192Q239J2472J764M91j1600q718J2236
12883G297Q832n081q628j6278O061J5748j595J293M321j6050J787J0943n30N509
12869A3629k80j6574q778K743J3804n825p507l750K057K766n294j2314r289R623
$$ plain form
12966 -3984 6231 23194 24508 18394 18763 17129 19911 13753 9051 3125 12114 5767 11230 6586
12952 6586 1013 2704 -6450 -9449 -5367 -8589 7968 26638 22313 21614 22491 20765 25795 10130
12938 10130 -5324 -17491 -8830 -10329 -20433 -2243 28280 31589 23052 4624 5500 6349 9313
12925 9313 14597 20211 12663 -381 260 13608 24269 18000 13980 10611 4059 6246 13191 4661
12911 4661 -5714 -9295 1295 23486 21639 20817 28837 35044 16084 5919 13609 9719 8555 12606
12897 12606 7773 1904 5406 5184 -18532 -9779 -7587 652 13124 14888 15379 3779 -4939 7297
12883 7297 16129 11048 2420 -13858 -7797 7951 6356 7649 11970 -4080 -2293 8650 8120 13629
12869 13629 13349 -3225 -12003 -9260 4544 -1281 -8788 -12538 -10481 -7715 -13009 -25323 -34612 -24989
12855b4989J0719Q070O457P36r317l509n009q17J3479J922j518N802J1154n317
12841G863m870K916r120m146K72j2352o836P493P813P833q086J973P923j2663
12827a3987j1630J2984J513o868m292k153J2309M458J4131K963m191K813p886
12814A64j0009j9038j0599J752m835J5050J8580N601p202j0500j622N655J2443
12801d560n085p449O108R407m561J808J0783N963j2269k469l177M148m665Q595
12787B577N94n558M726o308J40J1591J5390P439n201M071K077m973j9324J1860
12773A9101l468j3674j5885Q11L518p809J2375M17K136o39J2662p937q821O490
12759g23J5856K159p87j641O309P478J460j4159k11n187j1742j2226J186j536
$$ plain form
12855 -24989 -14270 -6200 257 993 -8324 -11833 -16842 -17659 -4180 -2258 -3776 2026 13180 7863
12841 7863 2993 5909 -3211 -7357 -7085 -19437 -26273 -18780 -10967 -3134 -11220 -9247 -1324 -13987
12827 -13987 -25617 -12633 -11120 -17988 -22280 -24433 -12124 -7666 6465 9428 5237 8050 164
12814 164 -9845 -28883 -39482 -37730 -42565 -27515 -8935 -3334 -10536 -21036 -22658 -17003 -4560
12801 -4560 -9645 -17094 -10986 -1579 -6140 -4332 6451 12414 145 -2324 -5501 -1353 -6018 2577
12787 2577 3171 -2387 2339 -3969 -3829 7762 23152 30591 25390 29461 31538 26565 7241 19101
12773 19101 15633 1959 -13926 -13115 -9597 -17406 -5031 -4614 -2478 -3117 9545 1608 -7213 -723
12759 -723 15133 17292 16505 14864 21173 28651 30111 15952 15741 10554 -1188 -13414 -12228 -13764
12745a3764l96R151O231n238J0217N390r56J8686Q554j3765m941L281j561j2730
12731H159j680j744o672j175J6888M490P194L988n439r783j2978O749R207J6839
12717C4043q450p460L491j090L449j2802j734J1670k42j2545j7147o440J3707
12704a550J5367J3210L607l053r547r885l112J3146P201r918k381l824m26J952
12690A0787k880m790Q274m413m879M035n108j6294j3042J2772J4875p655j1277
12677a9595P248O05r340j2741q472j1043K2523J4123J3627k68j2803O275J8704
12664H843J4074N078p324j8249j2712R196J517K920j966q21J881r361q142R692
12650e374n230r559M351J215J0011N523l425j4834l529L922l768r15J6336Q823
$$ plain form
12745 -13764 -14160 -5009 1222 -4016 6201 11591 10635 29321 37875 24110 19169 22450 20889 8159
12731 8159 6479 4735 -1937 -3112 13776 18266 25460 29448 24009 14226 1248 7997 17204 34043
12717 34043 25593 18133 21624 20534 23983 11181 9447 21117 20875 8330 -8817 -15257 -1550
12704 -1550 13817 27027 30634 27581 18034 8149 5037 18183 25384 15466 13085 9261 8835 10787
12690 10787 7907 3117 11391 6978 2099 6134 1026 -15268 -28310 -15538 -663 -8318 -19595
12677 -19595 -12347 -11742 -21082 -33823 -42295 -53338 -30815 -16692 -3065 -3333 -16136 -9861 8843
12664 8843 22917 27995 20671 2422 -10290 -1094 423 3343 1377 556 2437 -6924 -15066 -5374
12650 -5374 -10604 -20163 -15812 -14597 -4586 937 -2488 -17322 -20851 -16929 -20697 -21612 -5276 3547
12636C547m029n94j6194N661J2724l222O343k072K478n692q790j2648J665J3890
12622f933J3821n391n182o941o216P21J2203J2893J669J1680j876j7129r99n584
12608c264M323r740r583J701p591J1136r22J0623L798r800l029o1R265Q355j5115
12593i904p180J2445K0246p010k559n790n134N869J5224n140k283j4492K665M343
12579A300j3493J0223J992j025m753j8181J2106K6146J2521j0728q763n444N841
12566G742m393j8324J0789P904O132L264j5822P04K2457k95j0774j1286R528M991
12552A2617j3396j3713P198J1169J1216m577L741n435n742j354l311J550J2314
12539A2277j848j3017k651L501J6826L387j3809n907J7752o947j1882L726J0114
$$ plain form
12636 3547 -482 -1076 -17270 -11609 1115 -2107 4236 2164 4642 -1050 -9840 -22488 -20823 -6933
12622 -6933 6888 1497 -3685 -10626 -16842 -16121 -3918 8975 10644 22324 20448 3319 2320 -3264
12608 -3264 1059 -8681 -18264 -16563 -24154 -13018 -13940 -3317 481 -9319 -12348 -12409 -3144 5211 -9904
12593 -9904 -17084 -4639 15607 8597 6038 248 -4886 983 16207 11067 8784 -5708 -3043 1300
12579 1300 -12193 -1970 22 -1003 -5756 -23937 -11831 14315 26836 16108 7345 1901 7742
12566 7742 3349 -14975 -4186 3718 9850 13114 -2708 -2004 20453 20158 9384 -1902 7626 12617
12552 12617 -779 -14492 -7294 3875 15091 10514 14255 8820 3078 1724 -1587 -37 12277
12539 12277 10429 -2588 -5239 -1738 15088 18475 4666 -1241 16511 9564 -2318 1408 11522
12526A1522p062j2923j4855q020M010J7515k134L168Np021r633M372J0946N491
12512d619l950J510p172k1234M468J5106K1138J0448O343k1310p60m275k293k0428
12498b7028M788K2535N861n695J1054Q31J2252m529k2238l115k140J1291J8473
12485B2340J8951K8591J6303j227O64J3695J9902q445j0445j3833r695L916o953
12472G3764r182p46m267j1799n065j2966p974r568m168K028J652j4013j2961J0128
12458e137Q368q385j269R501N873L647j82m487P900n911j0129m120J2353J1903
12444A9925n3J988Q478N28o906p111l421j3759l488J7491J4405l134O267l54K55
12429C1111n979j7519j5371J0815k616r31j3710j1830J3994N027m304J694K603
$$ plain form
12526 11522 4460 -8463 -23318 -31338 -27328 -9813 -11947 -8779 -8774 -15795 -25428 -21056 -10110 -4619
12512 -4619 -8569 -7059 -14231 -35465 -30997 -15891 5247 15695 22038 728 -32 -4307 -6600 -27028
12498 -27028 -22240 295 6156 461 11515 12346 24598 20069 -2169 -5284 -7424 3867 22340
12485 22340 41291 69882 86185 84958 85622 99317 119219 110774 100329 86496 76801 80717 73764
12472 73764 64582 63836 59569 47770 42705 29739 21765 12197 8029 10057 11709 -2304 -15265 -5137
12458 -5137 3231 -5154 -6423 3078 8951 12598 12416 7929 15829 9918 -211 -4331 8022 19925
12444 19925 19872 21860 30338 30866 23960 16849 13428 -331 -3819 13672 28077 24943 31210 30856 31111
12429 31111 25132 7613 -7758 3057 441 -490 -14200 -26030 -12036 -7009 -11313 -9619 -7016
12416g016L878J1536k061j4495j0740O894J7937J830k6282k7250j000J5721J2688
12403a8360J300o606N81J2938J9178K350J1589j7335j0093N281L713O53j9709
12390a4520k451K37J5986K516j3210O986R511j1019k233J1417J0017j2830j0131
12377i724M902O542J914J2789L267J6117L733j3585k3287J797l170Q041m405J0273
12363A5204p570j9155j6653R358M777N015Q779j584q245k627R095J3603N80J162
12349A1739q93q249L777O961j0351k471q859J1697N017o395l423n428K821J8730
12335A4673K241k645l183j4399r638j105J3889M943q088j1024n904J211J1432
12322g597J1444j1321L405J1923J640j0745k0406L90K0167j716n253J0180J6729
$$ plain form
12416 -7016 -3138 8398 6337 -8158 -18898 -12004 5933 7763 -18519 -45769 -46769 -31048 -18360
12403 -18360 -17060 -23666 -23085 -10147 9031 11381 22970 5635 -4458 823 4536 5189 -14520
12390 -14520 -16971 -16734 -748 1768 -11442 -4456 5055 -5964 -8197 3220 13237 407 -9724
12377 -9724 -4822 1720 3634 16423 19690 35807 39540 25955 2668 4465 1295 9336 4931 15204
12363 15204 7634 -11521 -28174 -18816 -14039 -9024 -245 -1829 -10074 -12701 -3606 9997 10577 11739
12349 11739 10846 2597 6374 13335 2984 513 -8346 3351 8368 1973 -1450 -6878 -4057 14673
12335 14673 16914 14269 11086 -3313 -12951 -14056 -167 4776 -3312 -14336 -20240 -19029 -7597
12322 -7597 3847 -7474 -4069 7854 9494 -1251 -21657 -21267 -1100 -2816 -8069 2111 18840
12309A8840m016m899L308p663j327n569j2989P778J7389J5419P083j1162j8558
12296C634j0529j0078J1368Q33o388K005J8995O523J719j8524j5441N069n00K393
12282h921J5938J2437J444j3760j4291q947l959k701J2054J4005n145O843J05
12269E102J762o660O226P360R104k0839n439K0683j4672m621m235p420J495O58
12255a1496L911Q296q574m060P956K307o423j0898O751N916n220N197J6735k432
12241G966J670J0287J3840j5412m348j3564K601N025j3851j0514l356J2050L298
12228d308K676l935r023q63K1291M452o906k582J785j0308l12l087N902q098K357
12213a0959J1670N716j6933K806j2902n493K043L842q29O462L330J0720J2907
$$ plain form
12309 18840 14824 9925 13233 5570 4243 -1326 -14315 -6537 10852 26271 33354 22192 3634
12296 3634 -6895 -16973 -5605 -4772 -11160 -9155 9840 16363 18082 -442 -15883 -10814 -11314 -8921
12282 -8921 7017 19454 20898 7138 -7153 -16100 -20059 -22760 -10706 3299 -1846 4997 5102
12269 5102 6864 204 6430 13790 22894 2055 -3384 17299 2627 -1994 -6229 -13649 -12154 -11496
12255 -11496 -7585 711 -7863 -11923 -3967 -1660 -8083 -18981 -12230 -6314 -11534 -6337 10398 7966
12241 7966 9636 19923 33763 18351 14003 439 3040 8065 -5786 -16300 -19656 -7606 -4308
12228 -4308 -1632 -5567 -14590 -15453 5838 10290 3384 802 2587 -7721 -8033 -11120 -5218 -13316 -10959
12213 -10959 711 6427 -10506 -7700 -20602 -26095 -24052 -20210 -21039 -14577 -11247 -527 12380
12200A2380j230q5O003l368l768o316l67j0085q388p329J5323K6434R884J622
12186C0710l315j3676o118J0591l153N974L987m29m818j1798l828q434j0161M141
12172a0327L887n082M190J5474l673p059p405l833L230L276k990k781J3719m89
12158A37j575K119o965p444j5429L515J1232N273o765j2182k492m609R259Q005
12144a7921L570r840J0699o199l044L442J2768J503Q337k544q488P417J3601p463
12130E838l731o594j7383K23l838J280L000P30l666l86R166j1601o691J89J0013
12115b3451R900N808p539j3913Q917J8182P459k727o350M86j989j128Q853J942
12101D450j4091N559L138J7j2222k775J1234N926j687P46l807k6157J4149J4878
$$ plain form
12200 12380 11150 11065 17068 13700 9932 3616 3249 -6836 -15224 -22553 -7230 19204 29088 30710
12186 30710 27395 13719 7601 18192 15039 21013 25000 24571 19753 7955 4127 -4307 -14468 -10327
12172 -10327 -6440 -11522 -7332 8142 4469 -2590 -9995 -13828 -10598 -7322 -10312 -13093 626 137
12158 137 -1438 681 -6284 -13728 -29157 -25642 -14410 -9137 -15902 -28084 -30576 -35185 -25926 -17921
12144 -17921 -14351 -24191 -13492 -19691 -22735 -19293 -6525 -5022 3315 771 -7717 -300 13301 5838
12130 5838 2107 -4487 -21870 -21647 -25485 -24205 -21205 -20475 -24141 -24527 -15361 -26962 -33653 -33464 -23451
12115 -23451 -13551 -7743 -15282 -29195 -20278 -2096 5363 2636 -3714 -3228 -5217 -6345 2508 4450
12101 4450 -9641 -4082 -944 -927 -13149 -15924 -4690 1236 -451 295 -3512 -29669 -15520 -642
12087f42o281o01R421R045j1371J1153J1539j2398K799J1952n024r340j5138j9780
12073b4666O890O240J302j0327n089J5654K3486m031n970N913j35p517k6933j6807
12059d1990M962M216R817j1928j757Q347K031R310P393M893K984j302R677N484
12045A2137M5j798M083n325q554Q644Q707j3923Q01O20K163L000m900O83k569
12030C814R016r606n0M505q667k2167j0548o778K5560J6384J170j3631l414j888
12016a6300k748J092j2127L304J3277J0224j1041R448n628m023J3087J5256j79
12003A3642j0283j1786r641J1817J7152P253p98n39j5004j1584j4434K018J4639
11990g548M056j736R288J805p527j1226J2935k133j1070k922K640j859J5865m457
$$ plain form
12087 -642 -6923 -7524 1897 10942 -429 10724 22263 9865 12664 24616 19592 10252 -4886 -24666
12073 -24666 -17776 -11536 -10234 -20561 -25650 -9996 13490 9459 3489 9402 9267 1750 -25183 -41990
12059 -41990 -37028 -32812 -22995 -34923 -36680 -28333 -26302 -16992 -9599 -4706 -1722 -3024 6653 12137
12045 12137 12182 10384 14467 9142 588 9232 17939 4016 4817 5437 7600 10600 5700 6383 3814
12030 3814 12830 3224 3174 7679 -988 -23155 -33703 -40481 -14921 1463 2633 -10998 -14412 -16300
12016 -16300 -19048 -17956 -30083 -26779 -13502 -3278 -14319 -4871 -10499 -14522 -1435 13821 13642
12003 13642 3359 -8427 -18068 -6251 10901 18154 17356 16817 1813 -9771 -24205 -22187 -7548
11990 -7548 -3492 -5228 4060 5865 -1662 -12888 47 -2086 -13156 -16078 -13438 -15297 568 -3889
11976c889m502K297J420n2J6276K2225K604j8305N263P12J3412J1594k3559j2895
11962A2601o665K334m213r000p089q587J5704j98k977j636k106q351k04J1663
11948h724N405J0621R656L581p189k2207j8717J4484K6279R353m171j436m881
11935A2054j064l291j3543P430N080Q936j858j0974O526l149J555n193o17k700
11921h08r475L956Q186K233P201l055K039L601K871R692j5526j9871K531J1864
11907E439n373j1278J612J1361M299j3343j464o35J0630J605J478j69p83R299
11893A2678K011j505r793o801k106M760j5081Q16J5519J0040j8142m751K012J4108
11879C765l496l289L140j132N280q375j5032j4396M132J4469N878P040j2744p325
$$ plain form
11976 -3889 -8391 -6094 -4674 -4726 11550 33775 36379 18074 23337 24049 37461 49055 25496 12601
11962 12601 5936 8270 4057 -4943 -12032 -20619 -4915 -5113 -8090 -9726 -11832 -20183 -20387 -8724
11948 -8724 -3319 7302 16958 20539 13350 -8857 -27574 -13090 13189 22542 18371 16935 12054
11935 12054 10990 7699 -5844 1586 6666 15602 13744 2770 9296 6147 7702 2509 1892 -808
11921 -808 -10283 -6327 1859 4092 11293 8238 10277 13878 16749 26441 10915 -8956 -6425 5439
11907 5439 66 -11212 -9600 1761 6060 -7283 -8747 -9382 1248 2853 4331 4162 3379 12678
11893 12678 14689 13184 3391 -3410 -5516 -756 -15837 -15021 498 10538 -7604 -12355 -10343 3765
11879 3765 269 -3020 120 -1012 4268 -4107 -19139 -33535 -29403 -14934 -9056 -2016 -14760 -22085
11865b2085n606k263K003Q558J0486J778j817n446N353j1926j2496J5257O70k159
11851a9693J5371n317j5783J2167J7908j554k4248J925k117o652P690J1241K0107
11838A1045l143m77M109n955J521j6445j1803J7968P583J350p241L730J8683N264
11824B6189p60j4920j435l721j2629j8051J1883R836J023J1459J973q099o0M063
11810F751o051N7N321p64j4885n391l002j180J3942M899m727l0K70n249n466J24
11794a5381k145J8920K401p353o005j2694n064j135P709J9166k1011n579M751
11781b3420J3201Q937M730p547j0221j5614R536N0J7255J2282O56K141j5849j1365
11767a5228K455m396r354N40J3275n831k758N934q383j238k809l302J296K5945
$$ plain form
11865 -22085 -27691 -29954 -27951 -19393 -8907 -7129 -8946 -14392 -9039 -20965 -33461 -18204 -17534 -19693
11851 -19693 -4322 -9639 -25422 -13255 4653 3099 -21149 -19224 -21341 -27993 -20303 -9062 11045
11838 11045 7902 7425 11534 5579 7100 -9345 -21148 -3180 4403 5753 -1488 2242 20925 26189
11824 26189 25429 10509 9074 5353 -7276 -25327 -13444 -3608 -2585 8874 10847 2748 2688 6751
11810 6751 700 757 6078 5314 -9571 -14962 -17964 -19144 -5202 -303 -5030 -5060 -4790 -10039 -15505 -15381
11794 -15381 -17526 1394 3795 -3558 -9563 -22257 -27321 -28456 -20747 -1581 -22592 -28171 -23420
11781 -23420 -10219 -1282 3448 -4099 -14320 -29934 -20398 -20348 -3093 9189 9845 11986 -3863 -15228
11767 -15228 -12773 -17169 -26523 -25983 -12708 -18539 -21297 -15363 -23746 -24984 -27793 -31095 -29799 -3854
11753c854R949M966M252n574j5345k260O831n469Q885J41P35j901m455M1M2r294
11737a2310O351j143j25k481k1965j121L395j031J3155o623J463K4279n299o773
11723a0228M843k0180j783R843J8853R804l283k224L5L617N378n292r095j8506
11709a8218M827N710r893j7774m156K1055J7032J0043r201j1873p236J3929N303
11696d52J0744R145N629j5008j5794l133L852J8461n933P60k3016m818p310j3152
11682d0025J1336K5133K3271N087j3728K593k146j0548q896q812r126j379J8076
11669i164J8282R858j8196j4404o205J4836M616p292n850L627m075M007Q700K233
11655I73K153j7476j3490K0349J0644j0292j8343M124L594J525Q511n785k671
$$ plain form
11753 -3854 6095 11061 15313 9739 -5606 -7866 -1035 -6504 2381 2522 3257 1356 -3099 -3058 -3016 -12310
11737 -12310 -5959 -7102 -7227 -9708 -31673 -32794 -29399 -30430 -17275 -23898 -22435 1844 -3455 -10228
11723 -10228 -5385 -25565 -27348 -17505 1348 11152 7869 5645 5680 9297 14675 9383 288 -18218
11709 -18218 -13391 -7681 -17574 -35348 -39504 -18449 -1417 8626 -575 -12448 -19684 -5755 -452
11696 -452 10292 19437 25066 10058 -5736 -8869 -5017 13444 7511 8271 -14745 -19563 -26873 -40025
11682 -40025 -28689 -3556 19715 24802 11074 13667 11521 973 -7923 -16735 -25861 -27240 -9164
11669 -9164 9118 18976 780 -13624 -19829 -4993 -377 -7669 -13519 -9892 -13967 -9960 -1260 973
11655 973 3126 -14350 -27840 -7491 3153 -7139 -25482 -21358 -17764 -16239 -7728 -13513 -16184
11642a6184P375R772m686l803Q941r0m43j531r999N222q474L792j0005n896O376
11627a9633J4806j327M126k279j1641p380K955J2743l926p948N528J207R895J0027
11613G153o625N384J19j337j6518j7194j49K819m308J3432J283R040J5727l368
11599E458l392k821O099L968j504l098j4311j2700K400O772K492j493k045K25
11585a3950q450k561K2619L07j58n887n775n809L665J4471K892j5492n766k074
11571b1968j3012J4997J0945J1638K758j3259j5858q974Q976Q900M555N304j7143
11558b2141m318J747j184R095J7062N776R58K786k627n600j672j0780o046K790
11544a4154J3722l57o225p209m721K0913J963p157o814J1874O394l615k701j715
$$ plain form
11642 -16184 -8809 963 -3723 -7526 1415 1325 882 -649 -10648 -5426 -13900 -10108 -20113 -26009 -19633
11627 -19633 -4827 -6154 -2028 -4307 -15948 -23328 -20373 -7630 -11556 -19504 -13976 -12769 -2874 7153
11613 7153 528 5912 6031 4694 -11824 -29018 -29167 -26348 -30656 -17224 -15941 -6901 8826 5458
11599 5458 2066 -755 5344 9312 7808 4710 -9601 -22301 -19901 -13129 -10637 -12130 -14175 -13950
11585 -13950 -22400 -24961 -2342 -2035 -2193 -8080 -13855 -19664 -15999 -1528 1364 -14128 -19894 -21968
11571 -21968 -34980 -19983 -9038 2600 5358 -7901 -23759 -32733 -23757 -14857 -10302 -4998 -22141
11558 -22141 -26459 -24712 -25896 -16801 261 6037 6995 9781 7154 1554 -118 -10898 -16944 -14154
11544 -14154 -432 -789 -7014 -14223 -18944 1969 3932 -3225 -10039 1835 8229 4614 1913 198
11530A98j485L0n007n369k303p00J5836M944p158N795R442J157l201q057j5622
11515a1500n163j4115o707J306J2743J6242l511O703J585k799J330p522p251j217
11501a9876J6701O138q787m31J3498n998n142R7o733O821J642R199r953j760j368
11486e952L608j566J519l541R579o524o046p624J1058Q874N410k03k572K812j688
11471G144k1578L649o3n233K3435O947r276j3654o46J943O774K2718p342j8357
11457c539j3267j3252Q94N912P806J4733O95K55j5900k3397K754K2860N416R812
11443A782R789m087j8563K794M088K065K792k957j2904n882L092K627R845J2617
11429G098N750J1929P128m642j9342o474L630J221J378l885l891k458J1029o694
$$ plain form
11530 198 -1287 -1257 -6264 -11633 -13936 -14636 1200 6144 -1014 4781 14223 15380 12179 4122 -11500
11515 -11500 -16663 -30778 -37485 -36179 -23436 -7194 -10705 -4002 -2417 -5216 -3886 -11408 -18659 -19876
11501 -19876 -3175 2963 -5824 -6255 7243 1245 -3897 -3800 -10533 -3712 -2070 7129 -2824 -4584 -5952
11486 -5952 -2344 -3910 -2391 -5932 3647 -2877 -8923 -16547 -5489 3385 8795 8592 6020 8832 7144
11471 7144 -14434 -10785 -10848 -16081 7354 14301 5025 -8629 -9275 -7332 -558 22160 14818 -3539
11457 -3539 -16806 -30058 -29164 -23252 -15446 -713 -18 237 -15663 -39060 -36306 -13446 -8030 1782
11443 1782 11571 7484 -11079 -8285 -4197 -2132 660 -2297 -15201 -21083 -17991 -15364 -5519 7098
11429 7098 12848 24777 31905 27263 7921 1447 5077 6298 7676 3791 -100 -2558 8471 1777
11415A777j4033l56J1218K4100R390k4201j2667l712l750M267O888M233n455j2807
11401a5108K3690Q487k1218l59R847J222J048q617k002p073j748N443K520m29
11387d297p744k890j3498R145J3767P995o142p324j182P148N189L58q475Q870
11373I20J6251j1831j4597j3122M269J3436P680K8406P728k132L446j2497j2754
11360A5203n835q044q585p865L14m819O094J096J836R263J4803m835j5889j257
11346h520l3R657M188J0946j3841j757q565j9472J800J664L363J0725l519J3347
11332a7K469j4067L953J4846J648j3633j368O084J0666K772p940l438p977r193
11318a5195J3855J9288r588k1153Q187J2460N782J8211o540j2281j4285m348J5665
$$ plain form
11415 1777 -12256 -12612 -1394 22706 32096 7895 -4772 -8484 -12234 -7967 -1079 3154 -2301 -15108
11401 -15108 8582 17069 -4149 -4508 5339 6561 7609 -1008 -3010 -10083 -11831 -6388 -3868 -4297
11387 -4297 -12041 -14931 -28429 -19284 -5517 2478 -3664 -10988 -12170 -5022 167 525 -7950 920
11373 920 17171 5340 -9257 -22379 -18110 -4674 3006 31412 39140 37008 40454 27957 15203
11360 15203 9368 1324 -7261 -15126 -14812 -19631 -13537 -12441 -10605 -1342 13461 8626 -7263 -8520
11346 -8520 -8553 1104 5292 16238 2397 640 -7925 -27397 -25597 -23933 -20570 -9845 -13364 -17
11332 -17 2452 -11615 -7662 7184 8832 -4801 -6169 -85 10581 13353 5413 1975 -6002 -15195
11318 -15195 -1340 17948 8360 -12793 -4606 7854 13636 31847 25307 13026 -1259 -5607 10058
11305A0058J1566o633j5185j0222p252n058J109L273R707J5127m821p323K917
11292b737l906l505k990J3579r221j1064J3874k984Q674K096r791j8919q021K0384
11278a4531J8494l484Q876J3901Q237J2522P043k838j3420k5093m636p743J5916
11265A3244K14l418J913P062l492j387m170q064K187L275R402J5814o003j5643
11251A0934n877J1240r981j378P177M869r179o001J2972P477p890o008n615o030
11237c290l08j1271L264M169J4948l715k341J1278p796p349J5450M135q582p920
11223F72j2120p316l507k500O015l194P44J8093j300k271k211R914q865j1540
11209a9386j575M919J7580j631k591N254R217J7834k3002j4370J6869J2645p512
$$ plain form
11305 10058 21624 14991 -194 -10416 -17668 -22726 -21617 -18344 -8637 6490 1669 -5654 -2737
11292 -2737 -6643 -10148 -13138 441 -8780 -19844 -5970 -8954 -280 1816 -7975 -26894 -34915 -14531
11278 -14531 3963 479 9355 23256 31493 44015 51058 48220 34800 9707 5071 -2672 13244
11265 13244 13458 10040 11953 19015 15523 14136 9966 1902 4089 7364 16766 32580 26577 10934
11251 10934 5057 16297 6316 4938 12115 16984 7805 1804 14776 22253 14363 8355 2740 -3290
11237 -3290 -3598 -14869 -11605 -7436 7512 3797 1456 12734 4938 -2411 13039 17174 8592 672
11223 672 -11448 -18764 -22271 -24771 -18756 -21950 -21206 -3113 -4413 -6684 -8895 1019 -7846 -19386
11209 -19386 -20961 -16042 1538 -93 -2684 2570 11787 29621 6619 -7751 9118 21763 14251
11196A4251k3178k3475M51k921N222j4419o419L118K3626J3916P9J0405R11r402
11182g835p232j544O762Q785K5k788J8657L370r705j278j2497q00P227O207l142
11167D212m368K178K461j2816M428K2700J4562q940q886N759m851j7249m357j467
11153f634J3899o295q254J2763O866j0181J781M246M610k5167o799k046R962J9656
11139H407k758j4287K823J1061j683r54P318M465P255J0008q953j3085m410L308
11125H515p364r162o161j3201k528J4533J9894k979n758J6527q871j6951j1306
11112b4812m484J753M232n825M413l294j274J5780j922l635K513m860o78P573
11098a4520Q136l07P71K563L272M135q927l2876P275J8250l392N404J3745K639
$$ plain form
11196 14251 -8927 -32402 -31951 -34872 -29650 -44069 -50488 -47370 -23744 -9828 -9749 656 1567 -7835
11182 -7835 -15067 -16611 -9849 -1064 -1039 -3827 14830 18200 8495 7217 -5280 -6080 1147 7354 4212
11167 4212 -156 2022 4483 -8333 -3905 18795 33357 24417 15531 21290 16439 -810 -5167 -6634
11153 -6634 7265 970 -7284 5479 12345 2164 3945 8191 12801 -12366 -19165 -21211 -11249 8407
11139 8407 5649 -8638 -5815 5246 3563 2609 9927 14392 21647 31655 22702 9617 5207 8515
11125 8515 1151 -8011 -14172 -27373 -29901 -15368 4526 1547 -4211 12316 3445 -13506 -24812
11112 -24812 -29296 -27543 -23311 -29136 -24723 -28017 -29291 -13511 -15433 -19068 -16555 -21415 -22093 -14520
11098 -14520 -6384 -6691 -5920 -3357 -85 4050 -4877 -37753 -30478 -12228 -15620 -10216 3529 6168
11084F168M681m915j0654o668j867K785j06O039K761j0735O04M178M836k2350
11070b5243j4869P2J6649J4371J2208n703j0189n225l401j0204L123K525P712
11057a8174O298L552j225n880p495J4671N778o134k574m167L77l72K50R252k17
11042f060O319J2414N324J0726r552m450l777j422Jj6585j081R719P466R414j1997
11027F459j4973O19J7415K5062r203j3677n728j2743q157n251J0798K188q239
11014a5430J9491K771l93m985Q928K298k063n063k695l309m639Q075Q88k245o027
10999d398j7104j7018J6182K5947o661k4437j0383J8510P326m943l334J3258L282
10986c773j1897p591J2650P626P21r966J8567J0873J455j1101K836K319n422q020
$$ plain form
11084 6168 10849 5934 -4720 -11388 -13255 -10470 -10576 -4537 -1776 -12511 -11907 -7729 -2893 -25243
11070 -25243 -40112 -40040 -23391 -9020 3188 -2515 -12704 -17929 -21330 -31534 -28411 -25886 -18174
11057 -18174 -11876 -8324 -9549 -15429 -22924 -8253 -2475 -8609 -11183 -15350 -14973 -15345 -15095 -5843 -6060
11042 -6060 259 12673 17997 28723 19171 14721 10944 9522 9523 -7062 -8143 1576 9042 18456 6459
11027 6459 -8514 -7895 9520 34582 25379 11702 5974 -6769 -14926 -20177 -9379 -7191 -15430
11014 -15430 4061 6832 6439 1454 10382 12680 10617 5554 2859 -450 -5089 2986 3874 1629 -4398
10999 -4398 -21502 -38520 -22338 3609 -3052 -27489 -37872 -19362 -12036 -16979 -20313 -7055 -3773
10986 -3773 -15670 -23261 -10611 -2985 -2264 -12230 6337 17210 18665 7564 10400 12719 7297 -723
10972g23P013n51n450Q338J367J09j0899p411R495Q887m504q071p981j2587R60
10957b2008J78n876j050L942Q925J3198J1737R2l495K260L656M026n562j6722
10943f699P451L904N027j3716n979K90K920k676j024J3500n266r202L533J563
10929f374J5601o512q20m409j3132m883Q674p970K33K2054Q007r73j1009r319
10915a0832J1826k350k01k929p53p236J1971Q533l436O92R736R447L398j770p033
10900A9063j1776K40j4403M186k514j1374J1842J7116N032M513n773o833K93P291
10886A6903k1573n008k566J331q909J9443N391J1011q987k0627j0112J2701P401
10873c601M448N020k096r991q722j1966J0921J9722R037k364n114p089r559n145
$$ plain form
10972 -723 6290 5739 289 8627 9994 10103 -796 -8207 1288 10175 5671 -2400 -10381 -22968 -22008
10957 -22008 -21830 -27706 -28756 -24814 -15889 -2691 9046 9138 5643 7903 11559 15585 10023 -6699
10943 -6699 752 4656 9683 -4033 -10012 -9722 -6802 -9478 -10502 2998 -2268 -11470 -7937 -6374
10929 -6374 9227 2715 1895 -2514 -15646 -20529 -11855 -19825 -19592 2462 10469 9496 -1513 -10832
10915 -10832 994 -1356 -1557 -4486 -5239 -12475 -504 8029 4593 5285 15021 24468 27866 26096 19063
10900 19063 7287 7527 -6876 -2690 -5204 -16578 -4736 12380 17412 21925 16152 9319 9612 16903
10886 16903 -4670 -9678 -12244 -10913 -19822 -379 5012 16023 7036 -13591 -23703 -11002 -3601
10873 -3601 847 5867 3771 -6220 -14942 -26908 -15987 3735 12772 10408 5294 -1795 -11354 -16499
10859a6499K479j2399L704L936P561j302J768M953r98P651Q365K379M645J4698
10845C0941J0067O052m313p719l708Q236J2209m567j6613k4604n69j943J26j1319
10831g724o046K979J0824N643k296K37J2068j891j5240p136L600K514P02j371
10817c137J672P410J5379J200j4999o637J3071j2935j8860j0176N730J7078L145
10804b059K280j018J2767M726J0179m110j2492q154J8413K025l548n760q575P359
10790A2033j5320J213M453j222o847r339K743r490K43J5151M337M104k251k7698
10776b7890j0075J4572K3827K7175J566j7030j1278j645l863j205m132K0490J6003
10763B6515P432p61n790j0967j3776J4213Q628o159j2430K83J0602N61l417j6345
$$ plain form
10859 -16499 -14020 -26419 -22715 -18779 -11218 -12520 -10752 -5799 -6797 854 9219 11598 16243 30941
10845 30941 41008 47060 42747 35028 31320 39556 51765 47198 30585 5981 5412 3469 3595 -7724
10831 -7724 -13770 -10791 33 5676 3380 3617 15685 13794 -1446 -8582 -4982 -2468 -1766 -3137
10817 -3137 -1465 5945 21324 22524 7525 888 13959 1024 -17836 -28012 -22282 -5204 -2059
10804 -2059 221 -797 11970 16696 26875 22765 10273 2119 20532 22557 19009 13249 4674 12033
10790 12033 -3287 -2074 2379 1157 -5690 -15029 -12286 -21776 -21533 -6382 -2045 2059 -192 -27890
10776 -27890 -37965 -23393 434 27609 29175 12145 867 -778 -4641 -5846 -9978 10512 26515
10763 26515 33947 33186 27396 16429 2653 16866 25494 19335 6905 7188 17790 18351 14934 -1411
10749a411j2661Q896J6049L90P416P83m383q658m265L207R166k742j1566O351
10735F572J1446J2601J1115j6029q974R544j2805m919J1522j2401j2393P534K5348
10722B8161Q53j994k0837j5482O39N539J0643M041L588K54J8373l461k8406o333
10708d422M21j076o694k200N940j1001k407M914k672J935P737K402L061J0022
10694E960q978o665k081j502J3977J1941k097q534J930N729K005N791p324k0332
10680a0180P39Q948l790P288L2K238l83o091j7300m64O561j2345Q478L297r512
10665b2484N278J0784O160k484p00J3645j771J1257M763j5646j178R558m553q803
10651C826P661J0194j812o378M381o002j367j4560l018J1858m414q597p778N001
$$ plain form
10749 -1411 -14072 -5176 10873 11263 18679 19462 15079 6421 2156 5363 14529 11787 221 6572
10735 6572 18018 30619 41734 25705 16731 26275 13470 8551 20073 7672 -4721 2813 28161
10722 28161 29014 27020 6183 -9299 -8660 -3121 7522 11563 15151 15405 33778 30317 1911 -4422
10708 -4422 -4001 -5077 -11771 -13971 -8031 -19032 -21439 -16525 -19197 -17262 -9525 -7123 -4062 5960
10694 5960 -3018 -9683 -11764 -13266 711 12652 10555 2021 3951 9680 11685 17476 10152 -10180
10680 -10180 -9441 -493 -4283 3005 3037 5275 4892 -1199 -18499 -18963 -12402 -24747 -16269 -12972 -22484
10665 -22484 -17206 -6422 -262 -2746 -3446 10199 8428 19685 24448 8802 7624 17182 12629 3826
10651 3826 11487 21681 19869 13491 17872 11870 10503 -4057 -7075 4783 369 -8228 -16006 -11005
10637a1005o04l12o251j3317J5099J2115J5985n14j3397q950q02O452L421j474
10623c554L691m453j89J0065o078j419J7226K418j8585K689Q86j0865j3382n570
10609b7120L118R773j2190o866L895K568N148J0080L646k427j4274m645Q027N797
10595a5470l40j557K4691j594o099N57J0007P248j4275j4023o979R5O44N958O860
10580d277l075n254K552j2134l159O527r60j804R390r768J2621J5953l03m298
10566B011J4419J0759j8199p008m733p522L139r86Q715J6380o921j3282R8J294
10552a836l317k874L936R271O897j444K13j0752l986J6905M239j195Q39n619j0750
10537E27j3071m88k992n177J3976K732J285N121p315k413j840J0591O965j4178
$$ plain form
10637 -11005 -11609 -11921 -18172 -31489 -16390 -4275 11710 11196 -2201 -11151 -11953 -5501 -2080 -3554
10623 -3554 137 -4316 -4505 5560 -518 -1937 15289 17707 -878 1811 2697 -8168 -21550 -27120
10609 -27120 -24002 -14229 -26419 -33285 -29390 -26822 -21674 -11594 -7948 -10375 -24649 -29294 -21267 -15470
10595 -15470 -15810 -17367 7324 5730 -369 188 10195 17443 3168 -10855 -17834 -17739 -17095 -11137 -4277
10580 -4277 -7352 -12606 -10054 -22188 -25347 -18820 -19780 -21584 -12194 -21962 -9341 6612 6309 2011
10566 2011 16430 27189 8990 1982 -2751 -10273 -7134 -8120 595 16975 10054 -3228 -3130 -1836
10552 -1836 -5153 -8027 -4091 5180 12077 10633 10846 94 -3892 13013 17252 16057 16896 11277 527
10537 527 -12544 -13032 -16024 -21201 -7225 -4493 -3208 1913 -5402 -7815 -9655 936 7901 -6277
10523f277n854K449J1402O617N183o712l375r084J706M427j114j0143M601j843
10509h017j2558q658J5379J3406Q229N159k617o988J77j5327r718K145N865J2967
10495e56M681r933N862J24r495j436K298J1342M317K337K926r13k468r080J379
10480A385O523Q70j3320r787R549Q506j63r303q625O388o731p561Q073q466L28
10465b2334J6953k750J1741K592m15J5830Q744k4583j163J6087J0300P347p480
10452C0869j5878j6930k833n526n077j356k334R395O924J316o060N350k196N627
10438A291J7676o860o437q660j6773q195J5058M236N565J265R149L522k9833P178
10424a1818K9531M047o382M978o216j4394j3130N781P638J035L107j224l520j92
$$ plain form
10523 -6277 -12131 -9682 1720 8337 13520 6808 3433 -5651 -3945 482 -632 -10775 -6174 -8017
10509 -8017 -20575 -29233 -13854 -448 7781 12940 10323 3335 3512 -11815 -21533 -19388 -13523 -556
10495 -556 4125 -5808 54 178 -9317 -10753 -8455 2887 7204 9541 12467 11554 9086 6 1385
10480 1385 7908 8778 -4542 -14329 -4780 3726 3563 -5740 -14365 -7977 -14708 -22269 -14196 -22662 -22334
10465 -22334 -5381 -8131 3610 6202 5787 21617 30361 5778 4615 20702 31002 38349 30869
10452 30869 14991 -1939 -4772 -10298 -15375 -16731 -19065 -9670 -2746 -1430 -7490 -2140 -4336 1291
10438 1291 18967 12107 5670 -2990 -19763 -27958 -12900 -8664 -3099 -1834 7315 10837 -18996 -11818
10424 -11818 17713 21760 15378 20356 14140 -254 -13384 -7603 35 1070 4177 2953 -567 -759
10410g59m527o383n084J8367k626O969l590j5393J943J61L665m925K373J5492
10396E683J2759k566o549r900j3672K207M598O8j1153L905K180M910M820o082
10382h792k694N906R336P437R973j214j2300r539O02o461p373k099J0032Q668
10368A482r715l916R243J8989O22q127J9056r726j2187J045K443K443J5717M25
10354B7794N634o080j7252o794j152O017O42n234J57M265L71O516J720m267m897
10339G440j1730J3245K6135K346K192N501q160l317P998O709r379j2832l695J0194
10325C2647J5118O265r410q981j2011J551j379n846l160o637m394m73Q314j1239
10311C65J3762R629j278n863n381o446P710M160j45J17M243Q35o410j821r675
$$ plain form
10410 -759 -5286 -11669 -16753 1614 -1012 5957 2367 -13026 -11083 -10922 -7257 -12182 -9809 5683
10396 5683 18442 15876 9327 -573 -14245 -12038 -7440 -7372 -18525 -14620 -12440 -7530 -2710 -8792
10382 -8792 -11486 -5580 3756 11193 21166 19952 7652 -1887 -1285 -7746 -15119 -17218 -7186 1482
10368 1482 -8233 -12149 -2906 16083 16705 8578 27634 17908 5721 6766 9209 11652 27369 27794
10354 27794 33428 27348 10096 3302 2150 8167 8809 3575 3732 7997 8368 14884 16604 12337 7440
10339 7440 -4290 8955 35090 37436 39628 45129 36969 33652 41650 48359 38980 26148 22453 32647
10325 32647 47765 54030 44620 35639 23628 25179 23800 17954 14794 8157 3763 3290 11604 365
10311 365 14127 23756 22478 16615 11234 4788 12498 16658 16513 16630 20873 21708 15298 13477 3802
10296C802k943J762J6245P830o885l427Q270J6642J59k220j580l388R988P86k519
10281D2522r094k62q1j734n973j2097l094j579O588m974L900O400J1739J0895
10267D3156k0634k7866l930J2254J8312Q351q036j0139M200J0377m367o669j4912
10254I7P200K3617j7065k5440R757J0930R33j4546j5963J5827Q400M646m404L70
10240D359m771N921N417J2005m183j985j3804N123R35Q058k351r626J158O738
10226A2994j6315j4067N800J6594P099k099O869k15O020N644Q851o609j6276j5470
10212a180j1622n162P348J7199J2309r017N831Q638p438o968J9836O591R158l912
10198D1611j2739j4441p733j13K879L879k3323L426n347J3659O999J716j0079
$$ plain form
10296 3802 859 2621 18866 26696 19811 16384 24654 41296 41455 39235 37655 34267 44255 45041 42522
10281 42522 33428 33166 33085 31351 25378 13281 10187 8608 15196 10222 14122 20522 32261 43156
10267 43156 22522 -5344 -9274 2980 21292 29643 21607 11468 15668 26045 21678 15009 97
10254 97 7297 30914 13849 -11591 -1834 9096 10029 -4517 -20480 -4653 3747 8393 3989 4359
10240 4359 -412 5509 10926 22931 18748 16763 2959 8082 9017 17075 14724 5098 6256 12994
10226 12994 -3321 -17388 -11588 5006 12105 10006 16875 16660 22680 28324 37175 30566 14290 -1180
10212 -1180 -12802 -17964 -10616 6583 18892 9875 15706 24344 16906 9938 29774 36365 45523 41611
10198 41611 28872 14431 6698 6585 9464 13343 -9980 -6554 -11901 1758 8757 10473 394
10185C94O12J814M77o680n852k639J5350J1530P671j2904M37J0027q771J703R04
10170A4073k3981k31L059M49N268J0547J0021l585p327Q72L684o267Q441Q776
10156B3799L108j4182j2716j2267K196J1521R1o178j0355J843Q690J452M005Q125
10142I132Q108o983l144k513j1936o586n584J566J6080j39j6350K808J6877j14
10128A222p20K974k464M682J205j5482J0286J1021M254J4101l281r000r658j1997
10114b857Q261P168N236K361j694N830J3269K569j9004j5037j6796q997J6338
10101c353K1514K558r40Q261j261o916o020l248l125p856K021O627P457n128o374
10086D217l680J853p117R74J305N065J164o588o184M140o58o47n269m976p026
$$ plain form
10185 394 1006 2820 3297 -3383 -9235 -11874 3476 15006 22677 9773 10210 20237 11466 13169 14073
10170 14073 -9908 -10139 -7080 -6631 -1363 9184 19205 15620 8293 9165 12849 6582 15023 23799
10156 23799 26907 12725 9 -12258 -10062 1459 1550 -4628 -14983 -13140 -4450 -2998 1007 9132
10142 9132 17240 10257 7113 4600 -7336 -13922 -19506 -17940 -1860 -1999 -18349 -15541 1336 1222
10128 1222 502 3476 1012 5694 6899 -8583 1703 12724 16978 31079 27798 18798 9140 -2857
10114 -2857 5404 12572 17808 20169 18475 24305 37574 40143 21139 6102 -10694 -19691 -3353
10101 -3353 18161 20719 19779 28040 26779 19863 13843 10595 7470 -386 1635 8262 15719 10591 4217
10086 4217 537 2390 -4727 -3753 -2448 2617 3781 -2807 -8991 -4851 -5509 -6156 -11425 -16401 -23427
10071b3427J6311R825P746L884K774n538p882k063Q506J2423M589j870j2191l500
10057I587q265j5401L627K105J963k314o138k695N875J5087N586o903Q158R816
10043B0088n861j6781P085J1638K7982K1811L2772N1011N0476N4856K3486j1119
10031B67444j2717m1270n9059n0561m0642q642P99q568j8798j0940p222l79k74
10018I171l382N923O084o920m208J291m117j2033j0829J1547J6090M450q472q82
10004C713J8899n875j1916o990n411N710l413m824j60j532l909k249K618K597
9990a2742Q536N644P94K425Q513o191J985r697j3805J6370J952o631o856k705
9976a2408J02L780j0444q639J1189M390j3904m634K3780P397m62n030p909K732
$$ plain form
10071 -23427 -7116 2709 10455 14339 17113 11575 3693 1630 10136 22559 27148 25278 13087 9587
10057 9587 1322 -14079 -10452 -8347 -6384 -8698 -14836 -17531 -11656 3431 9017 2114 10272 20088
10043 20088 14227 -2554 4531 16169 44151 65962 98734 149745 200221 255077 278563 267444
10031 267444 254727 213457 154398 103837 63195 54553 55352 46784 27986 17046 9824 9445 9171
10018 9171 5789 11712 17796 10876 6668 7959 3842 -8191 -19020 -7473 8617 13067 4595 3713
10004 3713 22612 16737 4821 -2169 -7580 -1870 -5283 -10107 -10267 -11799 -15708 -17957 -15339 -12742
9990 -12742 -4206 1438 2232 4657 13170 6979 8964 -733 -14538 1832 3784 -2847 -9703 -12408
9976 -12408 -12306 -8526 -18970 -27609 -16420 -12030 -25934 -30568 -6788 609 147 -4883 -12792 -10060
9962a0060J2989m40j2212O586J2647O938r431j1031m80j159r463K012J8460O955
9948A2311k0509k1135m738j522J4507lj616J6005P282J659k079j0037k0099J3246
9934a6728J5469K086J1744M675q193j7051q541O436o009j813J3983N604k547j2103
9920a2988K382M373m586K308r01J3284l50R110k3497o338J796k611R929Q538r426
9905h977k947l78J4669J4135q123j8828J1746J5244N185o237n080M634M662r219
9891A0486L464J6028P431N819l700r059J37r97p617j7918o283Q019J6062L468
9877B5340q31J538j337r063o33Q091j6863k1694k270K711k482J1969J8342o925
9863E893q652J0366n776k084R655j4005l850J5742R742p582n403n38p413j1315
$$ plain form
9962 -10060 2929 2489 -9723 -3137 9510 16448 7017 -4014 -4494 -5653 -15116 -13104 5356 12311
9948 12311 -8198 -29333 -34071 -35593 -21086 -21089 -22705 -6700 582 2241 162 -9875 -29974 -16728
9934 -16728 -1259 827 12571 17246 9053 -7998 -16539 -10103 -16112 -17925 -3942 1662 -885 -12988
9920 -12988 -10606 -6233 -10819 -8511 -9412 3872 3522 12632 -10865 -17203 -15407 -18018 -8089 449 -8977
9905 -8977 -11924 -12302 2367 16502 8379 -10449 1297 16541 21726 15489 10409 15043 19705 10486
9891 10486 13950 29978 37409 43228 39528 30469 30606 29609 21992 4074 -2209 5810 21872 25340
9877 25340 24509 26047 24710 15647 15014 23105 6242 -15452 -17722 -15011 -17493 -5524 12818 5893
9863 5893 -2759 7607 1831 -253 9402 -4603 -8453 7289 17031 9449 4046 3508 -3905 -15220
9849a5220N207R797n75k4451k907n354P820J5962L248j932J1241n99j2867k173
9835a2803O458j0185L192K551J8606l629k795j8991j9382J1460K1284j07r391
9822a3732n694P543N057j867L428L311k527J434L788N813o48J799J1198K229P063
9807B8195j107k77k113p754j1157J681J9524J0987P758j7186j5287j3115l595
9794c446k492R934J1449n939O690M821j1142J3052J7442q195q792j789L936l960
9780B1569j842j0326j3058j0461j51Q800K697j1094k998M314R17j0731m190l5
9766b6589n87M16J4301N195J3158K524J0454J1160j547k0044j213J4800q775Q61
9752A4114p310j4850J418P419n441j420J5615Q908j0194j0130p230p271Q58J0732
$$ plain form
9849 -15220 -10013 -216 -791 -25242 -28149 -33503 -25683 -9721 -6473 -8405 2836 2237 -10630 -12803
9835 -12803 -6345 -16530 -13338 -10787 7819 4190 1395 -17596 -36978 -25518 -4234 -4341 -13732
9822 -13732 -19426 -11883 -6826 -8693 -5265 -1954 -4481 -3047 741 6554 5906 7705 18903 21132 28195
9807 28195 27088 26811 24698 16944 5787 7468 26992 37979 45737 28551 13264 149 -3446
9794 -3446 -5938 3996 15445 9506 16196 21017 9875 22927 40369 32174 23382 21593 25529 21569
9780 21569 19727 9401 -3657 -14118 -14269 -5469 -2772 -13866 -16864 -12550 -11633 -22364 -26554 -26589
9766 -26589 -27176 -26760 -12459 -7264 5894 8418 18872 30032 28485 8441 7228 22028 13253 14114
9752 14114 6804 -8046 -6628 791 -4650 -6070 9545 18453 8259 -1871 -9101 -16372 -15514 -4782
9738d782K398j3897p270k0267m809N702J9284k601Q131j867j2915N192J9240N826
9724b635l068p386r006j5492j1967P333J2866J1445K930J3106J4822j010j0550
9711A388M881P743l25j6175k632r416L892Q809j0067j5199j797O072J2898R304
9697f24O239l056n869j564n228q943M124J3063K21L276O746r761j0237Q362o120
9682i371K236n929J6649P39o434J690J3208M289q438k51O865K175j4202p352K844
9667a282j5346m698J1321M015P266o934Q62j3554q662l946O320j458O682R785
9653i629R564k27n523m913L154p17J2048J1365l308j4869k348j863O426j97M905
9638C868J8393N00q403q921L897k674j0653J0177N505p765p912J5052n294j7177
$$ plain form
9738 -4782 -2384 -16281 -23551 -43818 -48627 -42925 -23641 -26242 -18111 -19978 -32893 -27701 -8461 -2635
9724 -2635 -5703 -13089 -22095 -37587 -49554 -42221 -29355 -17910 -14980 -1874 12948 11938 1388
9711 1388 6269 14012 13687 -2488 -5120 -14536 -10644 -1835 -11902 -27101 -28898 -22826 -9928 -624
9697 -624 5615 2559 -3310 -4874 -10102 -19045 -14921 -1858 -1637 1639 8385 -1376 -11613 -3251 -9371
9682 -9371 -7135 -13064 3585 4324 -2110 -420 12788 17077 8639 8388 15253 17428 3226 -4126 -1282
9667 -1282 -16628 -21326 -10005 -5990 1276 -5658 -4796 -18350 -27012 -30958 -24638 -26096 -19414 -9629
9653 -9629 -65 -292 -5815 -10728 -7574 -8291 3757 15122 11814 -3055 -5403 -7266 -840 -1037 3868
9638 3868 22261 22761 14358 5437 9334 6660 -3993 6184 11689 3924 -3988 11064 5770 -11407
9624a1407O323K2023l605r352M238j8463M120P185N005N633R73M339Q247r52j2808
9609A1499K689Q870o700K561l939j7097n237j5138P377m097n663J2363J7276L643
9595H407m992j0353j6059J3972K964k482p638N546J280J2064m201k7611j3601
9582d2704J896J6340J1769R373p242L894K800J970Q37P114r953j37L973k653J23
9567b600n998P29l044M188J0041J0409J4610P222p218r984K208j6574j0674o501
9553a3186O907J3627L025n785J0036N47j2332n88k038J2858j5130N565o628r792
9539a2914L544M981L473k918P322J4657j8510k1393p312J7761K3811O524p814
9526A1212n735k040n067N500P112Q332J0499M104L705j2206j2231r622O304L047
$$ plain form
9624 -11407 -5084 16939 13334 3982 8220 -10243 -6123 1062 6067 11700 12673 17012 25259 24307 11499
9609 11499 14188 23058 16358 18919 14980 -2117 -7354 -22492 -15115 -19212 -24875 -12512 4764 8407
9595 8407 3415 -6938 -22997 -9025 -6061 -8543 -16181 -10635 -9355 2709 -1492 -29103 -42704
9582 -42704 -40808 -24468 -12699 -3326 -10568 -6674 -3874 -1904 -1067 6047 -3906 -4043 -70 -2723 -2600
9567 -2600 -8598 -7869 -10913 -6725 3316 13725 28335 35557 28339 18355 20563 3989 -6685 -13186
9553 -13186 -6279 7348 10373 4588 14624 15171 2839 2251 213 13071 -2059 3506 -3122 -12914
9539 -12914 -9370 -4389 -916 -3834 3488 18145 -365 -21758 -29070 -11309 12502 19026 11212
9526 11212 5477 3437 -1630 3870 10982 19314 29813 33917 37622 25416 13185 3563 9867 12914
9512A2914m380j3536K129j4442m53p61M73j104R696P938M246J4958J441r839k279
9497G001M347P375o015j2570m141J1367k453j5365j2789r832J3604L127j5990
9484c2334P692J0793P634N944O417J967Q233m449q344j2441q829k621j4420j2594
9470d7352J3522J9223P919M710L342J0909q206L87n806o47n292k937K2787J7679
9456C0238k079j5129j5621J585k432N559L752J665L08j8911J492K293j0516J7111
9442f85j0673K676Q822n213L205n486Q03J6887j434j4123n938K1839J2091K422
9428B5193j6477r856n059J3073J6102K1074l557j9058m598K170L076q971j340
9415A1772K882N040J973q069K831K479J280q03J685j2436K13J089L816p727o217
$$ plain form
9512 12914 8534 -5002 -2873 -17315 -17768 -18529 -18056 -19160 -9464 -1526 2720 17678 19119 9280 7001
9497 7001 11348 18723 12708 138 -4003 7364 4911 -10454 -23243 -33075 -19471 -16344 -32334
9484 -32334 -24642 -13849 -6215 -271 6146 8113 16346 11897 3553 -8888 -17717 -20338 -34758 -47352
9470 -47352 -33830 -14607 -6688 -1978 1364 12273 4067 4454 -1352 -1999 -7291 -10228 12559 30238
9456 30238 28159 13030 -2591 -1006 -3438 2121 5873 7538 7846 -11065 -9573 -7280 -17796 -685
9442 -685 -11358 -8682 140 -5073 -1868 -7354 -6551 10336 8902 -5221 -11159 10680 22771 25193
9428 25193 8716 -1140 -6199 6874 22976 44050 40493 21435 16837 19007 22083 13112 11772
9415 11772 14654 19694 21667 13598 16429 18908 20188 19385 21070 8634 8847 9936 13752 6025 -192
9400a92n949O75J9995J0564k147p386j8034j463J6807P797R605J7999O9j5805
9386C2535k9565k879J374M330M489K0844K2810J4214O964K073l255k2740j9357
9373C1837j5328J53J3638o357o627J081K652j851O92j1002P040k351k656L218
9359A4139k533J874L785N348Q419O805r537k1652O40Q491J0754R054O95j1064
9345B5218n432J3492Q905j0469m993R021m127J23J716R660K109J1144J1788O23
9331F8778m627N328p590j3758J4566M233P809j284j9330L227k303N202k084n836
9317E2331p127K0921J2671j8033j0489L480O821J0665J3416K5586M317p557K552
9304A09554M546K2056J4093J5065M380K65J0094p504N60K7116K0438K7050L1274
$$ plain form
9400 -192 -6141 -5466 14529 25093 22946 15560 -2474 -3937 12870 20667 30272 48271 48340 32535
9386 32535 2970 91 1465 5795 10284 31128 53938 68152 75116 77189 73934 51194 31837
9373 31837 16509 16662 30300 23943 17316 18397 21049 19198 19890 8888 15928 13577 10921 14139
9359 14139 11606 13480 17265 22613 31032 37837 28300 6648 7288 15779 26533 35587 36282 25218
9345 25218 19786 33278 42183 31714 26721 35742 31615 31738 33454 43114 45223 56367 68155 68778
9331 68778 64151 69479 61889 48131 62697 66930 74739 73455 54125 57352 55049 60251 58167 52331
9317 52331 45204 66125 78796 60763 50274 53754 60575 71240 84656 110242 114559 107002 109554
9304 109554 114100 136156 150249 165314 169694 169959 180053 172549 173109 200225 220663 247713 278987
9291B78987L3977M9874L6556L9845P1672O2247O7144Q2011J02937J36536J32172
9280A093958J53668J86674J81163J84750J75411J26888M6407l2756q7433j40690
9270A888040j69075j68594j65898j63625j41633j15412j07346r0462o1385p3045
9260F31565o2594n4533n4217l8234l5194l3524l1444k7822k5095j6700r346j7660
9248B25202j5903k0876k807j0874j1238m466O16j4045j6300M232M670j5895k2681
9235I9635l304J660J455P242k356j0456j2437j7242n043J343O914R709L252o486
9221G3886q462n314L614j0180j9947l342n717K915R229K616m420J010J8727Q888
9207F3503j5573j9217q372j3220K155n923J842P998L639k05q624p502m111p577
$$ plain form
9291 278987 312964 362838 399394 439239 510911 573158 640302 722313 825250 961786 1093958
9280 1093958 1247626 1434300 1615463 1800213 1975624 2102512 2148919 2116163 2028730 1888040
9270 1888040 1718965 1550371 1384473 1220848 1079215 963803 856457 765995 704610 631565
9260 631565 568971 514438 460221 421987 386793 353269 321825 294003 268908 252208 242862 225202
9248 225202 209299 188423 185616 174742 163504 159038 159654 145609 129309 133541 138211 122316 99635
9235 99635 96331 97991 99446 106688 104332 93876 81439 64197 59154 60497 67411 77120 80372 73886
9221 73886 65424 60110 63724 53544 33597 30255 24538 27453 36682 39298 34878 35888 54615 63503
9207 63503 47930 28713 20341 7121 9276 3353 5195 13193 16832 16627 8003 501 -3610 -11187
9193a1187L695J1258p131J1378K789p811J123L284N830L556N836P495J3627L012
9179D6754j8877r999L313J8026j6097j2821q651M961m664j716l206J221J136o37
9165a257j0949k106P602O774N154n572L3L13J149N73J2841k013j2271M074O789
9150A1134j392m030L693R494M587O16n548j8817J5627O603o986j0853L053N394
9136A2575J5737J5006N146K111m596j9147J3352L257j1717j8730J229P691m904
9123A7010j2596r936O289N873J3311j1822r660o599J3762J4255K0132j3740j8483
9110G796p843J055J6382K889l389p231m224J850J8505r239j7019k384J6342r537
9096C953N482R138j1912k65n616q999J7284R181j356j413j5287J842J7012J4729
$$ plain form
9193 -11187 -7492 3766 -3365 8013 10802 2991 4114 7398 13228 16784 22620 30115 43742 46754
9179 46754 27877 17878 21191 39217 23120 10299 1648 6609 1945 229 -2977 -1756 -620 -1257
9165 -1257 -12206 -14312 -6710 64 5218 -354 -321 -8 1141 1714 14555 12542 271 4345 11134
9150 11134 9742 5712 9405 18899 23486 24102 18554 -263 15364 21967 14981 4128 7181 12575
9136 12575 28312 43318 48464 50575 45979 26832 40184 43441 31724 12994 14223 21914 17010
9123 17010 4414 -5522 767 6640 19951 8129 -1531 -8130 5632 19887 40019 26279 7796
9110 7796 -47 1008 17390 20279 16890 9659 5435 7285 25790 16551 -468 -2852 13490 3953
9096 3953 9435 18573 6661 6396 780 -8219 9065 18246 16890 15477 190 2032 19044 33773
9082C3773m697n458J990L941J380O618j249p563j1442l570j530J617O797J3877
9068C4484M111j0265Q67J2820o444j5165P177p439j0628R867J9789K3218L960
9055F6352j3008j2549j531L027J192n159j5507M128J6887J4301L484j1467j157
9042D8993J6353j0429J887K7796K7799K2711k427R475L5038L2176K9718N7409
9030B96499J00852J30144K32294L68709O37115R99374R97214L30145k72494p34411
9020C085441r08484o82581m20302k55904j78275j05503n9011m9620l9252m2054
9010C44455l2414m4439m0810k4086N80K624j705o632j9137j8908J0649j3648n580
8997A50949K3569J6228r822J0990K2425L8689K8693L1899M1609N6506P4455J21249
$$ plain form
9082 33773 29076 23618 25608 29549 30929 37547 36298 28735 17293 13723 12193 13810 20607 34484
9068 34484 38595 28330 29197 42017 35573 20408 27585 20146 9518 19385 39174 62392 66352
9055 66352 53344 40795 39264 42291 43483 38324 22817 26945 43832 58133 61617 50150 48993
9042 48993 65346 54917 56804 84600 112399 135110 132683 142158 177196 209372 239090 296499
9030 296499 397351 527495 759789 1128498 1765613 2764987 3762201 4092346 3819852 3085441
9020 3085441 2176957 1494376 1074074 818170 639895 534392 475381 425761 386509 344455
9010 344455 312041 267602 226792 202706 203286 205910 204205 197573 178436 159528 170177 156529 150949
8997 150949 174518 190746 180924 191914 214339 253028 281721 313620 355229 411735 486190 607439
8985F07439J67645K10088L65281O47436J185148K006825K287531Q45107m58711
8976G863789j422934j976011j467608q79228n35656l29175j94180j34697j19245
8967H05055q4319p2398q0594n8244o3650n4339m9845n4862l8470l9847j5928j212
8955A91347J487o215n706j2639q526p620J2236J0363Q786O679J7428K9782L2657
8942B70059M1293N9032R2078J43637J99992L25959N33663Q35066R93045N36578
8932D030402j34856n82781q97330p72923n05562k95793j71922r8920p5455p7663
8922D17197m5848l3121l5719k4828k2517l7167k8127j6909k5221k2759j7487l722
8910A03772j7493j4867q764L842j7365q511J026J0209M866L684k339k2654k586
$$ plain form
8985 607439 775084 985172 1350453 1997889 3183037 5189862 7477393 8322500 7863789
8976 7863789 6440855 4464844 2997236 2118008 1582352 1253177 1058997 924300 805055
8967 805055 720736 648338 567744 509500 445850 391511 341666 286804 248334 208487 192559 191347
8955 191347 192834 186619 180913 168274 159748 152128 164364 174727 183513 190192 207620 237402 270059
8942 270059 311352 370384 462462 606099 806091 1132050 1665713 2500779 3493824 4030402
8932 4030402 3895546 3312765 2415435 1642512 1136950 841157 669235 570315 494860 417197
8922 417197 371349 338228 302509 277681 255164 217997 189870 172961 147740 124981 107494 103772
8910 103772 86279 71412 62648 66490 49125 40614 41640 51849 56715 60399 58060 35406 32820
8897C2820J886P793j6995n419J1777j603J0217R913n319l277J2210j477K678q74
8883E4330k1457p148m215M923q554k5697O494O272J398J1645K167J4219j291k7189
8869E897r347p975J3338p615Q446R504l82n751n057J8130l765k5710m261L80P320
8854f848K176L155J2250L141J0693r91l667j6341j635J088L795J2828N134J095
8840B5873k0020K204J0137p917L442K675k489M98j3781j499l53p347J4693J4918
8826B1034l147J411r502j0462p929R626k392q103p410j019Q813K1815l716j2756
8812c737j420J3728P573m868o665n292R092K157j0505m184R764j1619l910J1069
8798A183J2710o05K322J3327n003l259l46j5201r330j1403J0435O168P377o17
$$ plain form
8897 32820 34706 42499 25504 20085 31862 30259 40476 50389 45070 41793 54003 52526 55204 54330
8883 54330 32873 25725 21510 26433 17879 -7818 -1324 4948 6346 17991 20158 34377 33086 5897
8869 5897 -3450 -11425 1913 -5702 2744 12248 11866 6115 1058 19188 15423 -10287 -14548 -14168 -6848
8854 -6848 -4672 -1517 10733 13874 24567 23576 19909 3568 1933 3021 6816 19644 24778 25873
8840 25873 5853 8057 18194 10277 13719 16394 13905 14403 622 -877 -1230 -8577 6116 21034
8826 21034 17887 19298 9796 -666 -8595 1031 -1361 -9464 -16874 -17893 -9080 12735 9019 -3737
8812 -3737 -5157 8571 16144 11276 4611 -681 8411 10568 63 -4121 5643 -5976 -9886 1183
8798 1183 13893 13288 15610 28937 23934 20675 20329 5128 -4202 -15605 -5170 998 8375 7758
8784G758K453n155j791K102R92n347Q270J0553p405N377J1695L288M82J213p099
8769B7386j0948j3642R65L190N134M146j0682r119k366o510j0267O869Q928J182
8755e734m534k58J6877Q938J5431L982l0476r222R608J4724o98q135N513p648
8741H368J198l844j875M229j538J1038J4504k967j5042O68l408r141R312P688
8727A9190M844Q24r002K35R201k924j2084k281J8711j756p504M559O392o328j7125
8712D952l198J932P59p223q874M033r495J0535J2222Q02L260r897J1864R233l09
8697B0596J1524M947j4973J503K804M85N552k655n473J0682l041K522p451r910
8683A7112P828r803j4421j965K68L077J5549k423l401P37n560n460j4215m98L455
$$ plain form
8784 7758 10211 5056 3265 5367 6359 1012 9282 19835 12430 17807 29502 32790 33272 34485 27386
8769 27386 16438 2796 3761 6951 12085 16231 5549 -3570 -5936 -12446 -22713 -15844 -6916 -5734
8755 -5734 -10268 -10526 6351 15289 30720 34702 4226 -4996 4612 19336 18638 10503 16016 8368
8741 8368 9566 5722 3847 8076 6538 17576 32080 29113 14071 14739 11331 2190 11502 19190
8727 19190 24034 24858 15856 16091 25292 22368 10284 8003 26714 24958 17454 22013 28405 22077 4952
8712 4952 1754 3686 4445 -2778 -11652 -7619 -17114 -6579 5643 6445 9705 -192 11672 20905 20596
8697 20596 32120 37067 22094 23597 26401 26886 32438 29783 24310 34992 31951 34473 27022 17112
8683 17112 24940 15137 716 -1249 -981 2096 17645 15222 11821 12558 6998 1538 -12677 -13175 -9720
8668i720m054M580J4312R940L714L693l858j4373J372J713P568M855Q701R482
8654C7925j4124k4007K310J0208J5422n67l527j586r941k639R716j777M682P33
8640B2828m192n559r64P202k294j657m196n338m361J0366P406l361M651l595j705
8625A5231O667N144Q117O335l417j3125J1264J5414K264j9040p479n760j3834
8612G781J0570O415N377M638m819J5688N308q90j0433L883P443O062k548K039
8598E6514r31p948M426K656m043p44K819l120k832J2462J3923J5306J904J2109
8584A02501K6766P73P369J8125p079j1880j705k9537j8544J2771K7305l378k7172
8571I6315j4970k1159p643p471p850N207K563M232K094k5044j729K0675J9770
$$ plain form
8668 -9720 -13774 -9194 5118 15058 18772 22465 18607 4234 5606 7319 14887 19742 28443 37925
8654 37925 23801 -206 2104 12312 27734 27167 23640 22054 12113 9474 19190 17413 22095 22828
8640 22828 18636 13077 12113 19315 17021 15364 11168 5830 1469 11835 19241 15880 20531 16936 15231
8625 15231 21898 27042 35159 41494 38077 24952 36216 51630 53894 34854 27375 21615 7781
8612 7781 18351 24766 30143 34781 29962 45650 50958 50068 39635 43518 50961 57023 54475 56514
8598 56514 55583 47635 52061 54717 50674 49930 52749 49629 46797 59259 73182 88488 90392 102501
8584 102501 129267 130040 137409 155534 148455 136575 134870 105333 86789 99560 126865 123487 96315
8571 96315 81345 60186 52543 45072 37222 42429 44992 49224 51318 26274 24545 45220 64990
8558F4990p866q568j1663j3314n015r467J0627J5883k588m094r841j3044L725
8545I765R380m198J896M76N781L613j1271l428o6m052j1528J0511R220J5314Q084
8530C9497P230Q414j0239L321j0446q961J0048J8654q05j4120j5954M63Q910K0197
8516E6209k19j6725j2985j667O393j1330j7403o46J3722J4571R24k826k0483o789
8502G46J1932J9255N014j3422k4604j2250n654R489O895J360J072K946l174O445
8488F050Q468n641L707J1692p683j550o442J2841N154J332n581n466l584l712
8474I585n667k198m36o5m965k1035Q723K4811L488N119o627k792J1301L078j6439
8459E881j6632j1440J871P198J6030Q323J979r071j4814J128l452N621k89J8988
$$ plain form
8558 64990 57124 48556 36893 23579 18564 9097 19724 35607 33019 28925 19084 6040 9765
8545 9765 19145 14947 16843 17319 23100 26713 15442 12014 11948 7896 -3632 6879 16099 31413 39497
8530 39497 46727 55141 44902 48223 37777 28816 38864 57518 56713 42593 26639 27102 36012 56209
8516 56209 55990 39265 26280 24613 31006 19676 2273 1627 15349 29920 30844 28018 7535 746
8502 746 12678 31933 36947 23525 -1079 -13329 -18983 -9494 -2599 -1239 -167 2779 -395 6050
8488 6050 14518 8877 12584 24276 16593 15043 8601 21442 26596 27928 22347 16881 13297 9585
8474 9585 3918 1720 1284 1219 -3746 -24781 -16058 8753 12241 17360 10733 7941 19242 22320 5881
8459 5881 -10751 -22191 -20320 -13122 2908 11231 13210 4139 -10675 -9547 -12999 -7378 -7667 11321
8445A1321J6375m924j3183O603j831j0248j0723K217J3029J617j1907N292k97
8432C341r509m26J0721J0073r331j891o835p803J7187K5400K13m685r329j3626
8418C500r653n452Q070M284N912R464m433j5098K394J0675n796J173l285k948
8404a193K2031J4261p895j5125n302r659j4554k434K522Q477M89P454O192L439
8390H703J5354m806L881J189J870L614l869o158P541j5020L231J092j6561J571
8376A632J934j5571j8800L452J6012r988m080J0308K3486K121o243L841J4658
8363B2762J689m769p208r088n709N850O201M822J01L188k492J2419k358o841N676
8348B4243j0474n597O072J2100J257q325j0536l508J3975J7127j1437j2321j2872
$$ plain form
8445 11321 27696 22772 9589 16192 14361 4113 -6610 -4393 8636 10253 -1654 3638 3341
8432 3341 -6168 -6594 4127 14200 4869 2978 -3857 -11660 5527 30927 31140 26455 17126 3500
8418 3500 -6153 -11605 -3535 749 6661 16125 11692 -3406 -1012 9663 3867 5040 1755 -1193
8404 -1193 20838 35099 27204 12079 6777 -2882 -17436 -19870 -17348 -8871 -8382 -928 5264 8703
8390 8703 24057 19251 23132 24321 26191 29805 25936 19778 27319 12299 15530 16622 61 1632
8376 1632 3566 -12005 -30805 -27353 -11341 -21329 -25409 -15101 8385 10506 4263 8104 22762
8363 22762 24451 19682 12474 3386 -2323 3527 9728 14550 14651 17839 15347 27766 25408 18567 24243
8348 24243 13769 8172 14244 26344 27601 19276 8740 5232 19207 36334 24897 12576 -296
8335b96P27m895J4752J2045J2920j2724j9969R266R153m152q714q849J0502O514
8321A6280q327O744m937J272l241n860J975K898P519O713j0222J736q967j2868
8307i285q845O505q72P566j709L216J2575j541j609K75n46Q066N32K857o427k183
8291H575O989j639R10K898j4741M389Q860q867p118O158L405k773l017k018j1039
8276i028J0482m473j1436q342K800j1707q627J3274J7021K1986q26j1975n225
8263f076J7707O682R26K656j705o59p760q274p287j734O692L743J3037O617o499
8248A8066r543M289P253l82j0487p877j686j0899j5499J158O215J5628P21j997
8234e040J0469J1930n974j6278K347J3320r607l716J1906J7971j909k5408j2918
$$ plain form
8335 -296 431 -4464 10288 22333 35253 22529 2560 11826 20979 16827 8113 -736 9766 16280
8321 16280 7953 14697 9760 11032 7791 1931 3906 6804 14323 21036 10814 12550 3583 -9285
8307 -9285 -18130 -11625 -12497 -4931 -6640 -3424 9151 7610 6001 6276 5730 13796 14328 17185 10758 8575
8291 8575 15564 13925 14835 17733 2992 7381 16241 7374 256 6414 9819 7046 4029 2011 -9028
8276 -9028 1454 -3019 -14455 -22797 -19997 -31704 -40331 -27057 -10036 11950 11124 -851 -6076
8263 -6076 11631 18313 19239 21895 20190 19531 11771 3497 -3790 -5524 1168 4911 17948 24565 18066
8248 18066 8523 12812 20065 19683 9196 1319 -367 -11266 -26765 -25607 -19392 -3764 -3043 -5040
8234 -5040 5429 17359 11385 -4893 -2546 10774 1167 -2549 9357 27328 25419 11 -12907
8221a2907n364N060O134J6619J358j0952j0618j0430N766J179J4776q171k726
8208a0276R185p776j0779j2696K788J191P609J1792P407K268J0750n221k4142
8195a7900J0889J1413K888P25j0723l06o329J610L883N725P234j3709m094k957
8181a1651P195N206L442O774j0320o805j342n755k862J973l265N648r609K127
8167a9244j331p494K3485K1284L918r512r035o243l949J8086N83k046J680o359
8153C823p223J2443N0r104J5326O20j1875j7077L513K934o052M485N158M729J1363
8138A3113J592r902n962J023l969J779J6178J1956J0553m033j0736j0184j4001
8125b593p366J947K556j2525j0576J400L523Q069J1009o529R036J0336n278j2088
$$ plain form
8221 -12907 -18271 -13211 -7077 9542 10900 -52 -10670 -21100 -15334 -14155 621 -7550 -10276
8208 -10276 -1091 -8867 -19646 -32342 -29554 -28363 -20754 -8962 -1555 713 11463 6242 -17900
8195 -17900 -7011 4402 7290 8015 -2708 -3014 -9343 -7733 -3850 1875 9109 -4600 -8694 -11651
8181 -11651 -4456 750 4192 10966 646 -6159 -7501 -13256 -16118 -14145 -17410 -11762 -21371 -19244
8167 -19244 -20575 -28069 -4584 16700 20618 11106 2071 -4172 -8121 9965 10548 8502 10182 3823
8153 3823 -3400 9043 9093 -11 15315 15935 4060 -13017 -9504 -6570 -12622 -8137 -2979 1750 13113
8138 13113 14705 4803 -1159 -136 -4105 -2326 13852 25808 36361 32328 21592 11408 -2593
8125 -2593 -9959 -8012 -5456 -17981 -28557 -27157 -23634 -15565 -4556 -11085 -2049 8287 3009 -9079
8111i079m18L858O636N026k492R569r503k1203K369P491R301j638j0063k469o775
8096a9390K0130j251n373j366Q602J5571L079l359j1907J659j7289R074N836K39
8082D255M040L659m993l375K645M091r510j0014o092N030M388Q241J1460Q620
8068B2445n863r626m332j0289P380J6508q06j7910j4849K446M844J2417N669j2672
8054d638j4547P27j029M048J0866J0365Q178M932R3j5569j3330n549J2484J1623
8040H654k003K112J0625j183j3427R946L378j318J347j3625m825l027P546Q090
8026A2290L80r88K188P690l326k668j3988K758L793L738m036L988J4933O833o644
8011B6941j0620j4116J64O885O54j5704R910J3874O360j2557l234J732n952p284
$$ plain form
8111 -9079 -9497 -5639 997 6023 3531 13100 3597 -17606 -15237 -7746 1555 -83 -10146 -12615 -19390
8096 -19390 740 -511 -5884 -7250 1352 16923 20002 16643 4736 6395 -10894 -1820 4016 4255
8082 4255 8295 11954 6961 3586 6231 10322 812 -9202 -15294 -10264 -5876 2365 13825 22445
8068 22445 16582 6956 2624 -7665 -285 16223 15417 -2493 -17342 -14896 -10052 2365 8034 -4638
8054 -4638 -19185 -18458 -19487 -15439 -4573 5792 13970 18902 18995 3426 -9904 -15453 -2969 8654
8040 8654 6651 8763 19388 18205 4778 14724 18102 16784 18131 4506 -319 -3346 4200 12290
8026 12290 12670 11682 13870 21560 18234 15566 1578 4336 8129 11867 7831 11819 26752 33585 26941
8011 26941 16321 2205 2369 9254 9908 -5796 4114 17988 24348 11791 8557 10289 4337 -2947
7997b947m702M360J0426q072m830J430Q508J2440J2663j1215j4005L48M088Q144
7983A6636j830n710K066L321q406l531k085M320P577k161J280j6054j5904O872
7969a3609J5984R460L262m818k169o371m23J0050p652o914K0202o124j3603k88
7955c013J861q175q443J595J1409J3042l108M140m906J066j2596j94K7646K8473
7941D8797N390j3594j5541j6836j196Q866K1938j2600P408P961j6332m172j1465
7928H624M253K465r9p943Q407m015j8070k6855l186J2119J5055P545K896K429
7914C625M672q86R975R10L301M671j5734j8035k126J0854J2160r23n350K353M799
7899A4266J2208Q857m377o966Q789K599j2391j5947j2096L509P458K762m986n378
$$ plain form
7997 -2947 -7649 -3289 7137 -935 -5765 -4335 4173 16613 29276 18061 4056 4404 8492 16636
7983 16636 14806 9096 11162 14483 6077 2546 461 4781 12358 10197 11477 -4577 -20481 -13609
7969 -13609 2375 11835 15097 10279 8110 1739 1316 11366 3714 -3200 17002 10878 -2725 -3013
7955 -3013 -1152 -9327 -17770 -16175 -4766 8276 5168 9308 4402 5468 -7128 -7322 20324 48797
7941 48797 54187 40593 25052 8216 7020 15886 37824 25224 32632 40593 24261 20089 8624
7928 8624 12877 15342 15243 7300 15707 11692 -6378 -33233 -36419 -24300 -9245 -1700 1196 3625
7914 3625 8297 7411 17386 18296 21597 26268 10534 -7501 -9627 1227 13387 12464 7114 9467 14266
7899 14266 26474 35331 30954 23988 32777 35376 22985 7038 -5058 -1549 5909 8671 3685 -1693
7885a693M000j569J1985N458m384m659o633j1073J244N016m277r741l407n185
7871b4918l609n950J7184K7089j973m89L879J4726j410j6598j8667N890K036R86
7857a824J796O307J7151L998r012k0970k209P282J0344J2046n306j1781j4622
7844f800Q556P497J039n556r538q025L009Q580L990k936K78K99J0224r48n077
7829D592n231n634M975N0P262k4772k1270j5915J6623J2470J218J911j192l568
7815b8481R003m240L938K5897J6486P252j7326j0360j442r672k592R092J1343
7802H898M52k618l716j352J0347k225j7420j3920m004J6786O165m063l58J3009
7788E981q871J344J5304R685r521o177k6058q977J6698l89K1406n033k2231o087
$$ plain form
7885 -1693 2307 738 12723 18181 13797 9138 2505 -8568 -7324 -2308 -6585 -16326 -19733 -24918
7871 -24918 -28527 -34477 -17293 9796 7823 7334 11213 25939 24529 7931 -10736 -4846 -2810 -1824
7857 -1824 -28 6279 23430 27428 18416 -2554 -4763 2519 12863 24909 19603 7822 -6800
7844 -6800 1756 9253 10292 4736 -4802 -12827 -9818 -1238 2752 -184 94 393 10617 9669 4592
7829 4592 -639 -6273 -1298 -1248 6014 -18758 -40028 -55943 -39320 -26850 -25632 -23721 -24913 -28481
7815 -28481 -19478 -23718 -19780 6117 22603 29855 12529 2169 727 -8945 -11537 -2445 8898
7802 8898 9350 6732 3016 1664 12011 9786 -7634 -21554 -25558 -8772 -2607 -6670 -7028 5981
7788 5981 -2890 -1546 13758 23443 13922 7745 -18313 -27290 -10592 -10981 10425 5392 -16839 -22926
7774b2926J1849m359j095N529M289o230j1939O631N622J0337O471K0204R050j2967
7760B0466j2481j3220r446j1391p72J1073J725M971J608J7597K605J839r829R187
7746A3932J7634j3155j8120p947J205J639J3685n139k8749l575P992N900L783
7733a0915Q702R187k95J2553j1281l678N53m680j1793O782J9188J3884k1831j4035
7719g659R03J0648m119q466O354J4661p361j437p633J0810K638p576J6845L088
7705B1696j2294j2211j659N391p055o677N768k714K493J5905K690L964j6835r882
7691a1420J5820J7862j7509j611P893J4946k29j1833l456j1685l169K3593J6360
7678C5562j2026j2884k0001J692j5725l314M659N724K354q33P749R664J0M619
$$ plain form
7774 -22926 -11077 -15436 -16531 -11002 -6713 -12943 -24882 -18251 -12629 -2292 4179 24383 33433 20466
7760 20466 7985 -5235 -14681 -26072 -26844 -15771 -14046 -9075 -7467 10130 12735 14574 4745 13932
7746 13932 31566 18411 291 -7656 -6451 -4812 8873 3734 -25015 -28590 -20598 -14698 -10915
7733 -10915 -2213 6974 6679 19232 7951 4273 4826 146 -11647 -4865 14323 28207 6376 -7659
7719 -7659 -6756 3892 -227 -8693 -2339 12322 4961 3524 -4109 6701 9339 1763 18608 21696
7705 21696 9402 -2809 -4468 923 -6132 -12809 -7041 -9755 -7262 8643 11333 15297 -1538 -11420
7691 -11420 4400 22262 4753 3142 11035 25981 25752 13919 10463 -1222 -4391 19202 35562
7678 35562 23536 10652 -9349 -7657 -23382 -26696 -22037 -16313 -13959 -14792 -7043 2621 2631 7250
7664G250l064J4844R851j5312j2567k2231L922P819K834j4820o421K0163P689
7651d3q904p849L80k588J2322Q836P669L71j9497r546L735j0613l268R811m360
7636b3544L107J1841j0724q294J2221Q923N6m551j069J522J578K710K682J3610
7622A0068J4599j0971j6858O759L149j5929j7723q384K1469K2054m826m930k255
7609c778q616p495P134J6047N204L031L612l752o946O883m98L44k642k1487o758
7594a9717K24N971J1057J62J1095K512j1275k930M998j870m289L991Q926n03j878
7579F474K162J1272Q762m904k1527j6659L452J1958J3607o143n330o285N536J756
7565D131l187n061k233j6847j5344J0483P917J601l200J9656J0872M113P899m420
$$ plain form
7664 7250 4186 19030 28881 13569 1002 -21229 -17307 -9488 -6654 -21474 -27895 -7732 -43
7651 -43 -8947 -16796 -16416 -19004 -6682 2154 9823 10194 -9303 -18849 -15114 -25727 -28995 -19184 -23544
7636 -23544 -20437 -8596 -19320 -27614 -15393 -6470 -6414 -10965 -12034 -10512 -8934 -6224 -3542 10068
7622 10068 24667 13696 -3162 3597 6746 -9183 -26906 -35290 -13821 8233 3407 -1523 -3778
7609 -3778 -12394 -19889 -12755 3292 8496 11527 15139 11387 4441 11324 10826 11170 8528 -12959 -19717
7594 -19717 -19493 -13522 -2465 -2303 8792 11304 29 -2901 2097 227 -4062 -71 8855 8352 6474
7579 6474 8636 19908 28670 23766 2239 -14420 -10968 990 14597 8454 3124 -3161 2375 4131
7565 4131 944 -4117 -6350 -23197 -38541 -28058 -20141 -18540 -21740 -2084 8788 12901 20800 16380
7551A6380l645O361J746N493j773J1978P785k0592l2526j2025J3058j270O36R801
7537A407K597l09j5132k308J54N082R988K2533J4005q206j8070j4873p493Q40
7523i785l110l679P92r79o113q021M723j0419p682O925J0414J6362J5456Q809
7509A3693j0896L7O011j246j7872j592O755j332j2838J351K0608L643J0772P349
7495B4443n594P15j4666j9262j0449m118k717J5491J0176J9739J1829j1893r374
7482D320Q641n676M323l896m426O157K042r391P987M890L887q238j1754q800k565
7467a2499R21J584N284o685o361L018L720k30l068K234R365J1932J1887j2859
7453H243o375j132j744K787N828Q591q77R53m900j0026j0301l857J595p023L103
$$ plain form
7551 16380 12735 19096 20842 26335 24562 36540 44325 23733 -8793 -20818 -7760 -9030 -8394 1407
7537 1407 4004 3695 -11437 -13745 -13591 -8509 1479 24012 38017 29811 11741 -3132 -10625 -9785
7523 -9785 -12895 -16574 -15782 -16761 -22874 -30895 -26172 -36591 -44273 -37348 -26934 -10572 4884 13693
7509 13693 2797 2834 8845 7599 -10273 -11865 -5110 -6442 -19280 -17929 2679 6322 17094 24443
7495 24443 18849 19564 4898 -14364 -24813 -28931 -31648 -16157 -5981 13758 25587 13694 4320
7482 4320 12961 7285 11608 7712 3286 9443 11485 2094 10081 14971 18858 10620 -1134 -9934 -12499
7467 -12499 -11578 -9994 -4710 -11395 -17756 -14738 -11018 -11248 -14316 -12082 -2717 9215 21102 8243
7453 8243 1868 736 -1008 1779 7607 16198 15321 16274 11374 1348 -8953 -12810 -11215 -18238 -15135
7438a5135J3045J9975K345j7513K149R900J1319k616j3600L452n569k178N388
7425A0962j240p847J2909r510l552J1411J6028p374j3707k0090p914J5552j16
7412d488J7017K73j6896L046L821j5390q284l474R507J0825N997k398j3038l578
7398a7060r787k825O506L995R216k12Q759K0713L748l492L548j2052J408J0071
7384B2536n825j1183n236J021J3854k663j1879j0553m204J609p12J6473j76o191
7370c129j904N962K170P15p840j0959K425J9421j909j6966j3553R031j515J2143
7356e908R556K33j2402m533L393K78q779J4053Q879R263q042M624L984r699J394
7341F294K410M044r44j4392m216m683O045j0074J514o92J8258R120j0878j0437
$$ plain form
7438 -15135 -2090 17885 20230 2717 4866 14766 26085 23469 9869 13321 7752 5574 10962
7425 10962 9722 1875 14784 5274 1722 13133 29161 21787 8080 -12010 -19924 -4372 -4488
7412 -4488 12529 12802 -4094 -1048 2773 -12617 -20901 -24375 -14868 -4043 1954 -444 -13482 -17060
7398 -17060 -26847 -29672 -23166 -19171 -9955 -10167 -1408 19305 23053 19561 23109 11057 12465 22536
7384 22536 16711 5528 292 1313 15167 12504 625 -9928 -14132 -12523 -13235 3238 3062 -3129
7370 -3129 -5033 929 3099 3814 -4026 -14985 -12560 6861 4952 -12014 -25567 -16536 -18051 -5908
7356 -5908 3648 3881 -8521 -13054 -9661 -9383 -18162 -4109 4770 14033 5991 10615 14599 4900 6294
7341 6294 8704 12748 11804 -2588 -6804 -11487 -5442 -15516 -14002 -14694 3564 12684 1806 -8631
7327h631q530p065R06k244Q39N613J0374R923m496R489K841P575m382q186o028
7312b002J1833K849q230j1053n793j2003J800J7413k317n973J9597k141n429R646
7298H197N75j8443K225j1594N664J759j2030P842J1300J6520N536p690O75r692
7284H44l833Q54k870P215J387r232M241L347j417k992O254J4537j0349n486K555
$$ plain form
7327 -8631 -17161 -24226 -23320 -25564 -24725 -19112 -8738 1185 -3311 6178 9019 16594 12212 4026 -2002
7312 -2002 9831 12680 4450 -6603 -12396 -24399 -22599 -5186 -7503 -13476 6121 3980 -1449 8197
7298 8197 8772 -9671 -7446 -19040 -13376 -11617 -23647 -15805 -4505 12015 17551 9861 10536 844
7284 844 -2989 -2135 -5005 2210 3597 -5635 -1394 1953 536 -2456 3798 18335 7986 2500 5055
$$ [...]
##END NTUPLES=NMR SPECTRUM
##END=
