##TITLE=Analysis number 313851
Compound Code cc 44409
Book Reference 382/118/1
Project Code adrs
Chemist Name simons
##JCAMPDX= 6.0         $$ Bruker NMR JCAMP-DX V2.0
##DATA TYPE= NMR SPECTRUM
##DATA CLASS= NTUPLES
##ORIGIN= Bruker BioSpin GmbH
##OWNER= NMR
$$ XWIN-NMR		Version 3.5
$$ Fri Sep 23 12:26:11 2005 GMT Daylight Time (UT+1h)  MAYBRIDGE\NMR@NMR_250MHZ
##.OBSERVE FREQUENCY= 250.131544655141
##.OBSERVE NUCLEUS= ^1H
##.ACQUISITION MODE= SIMULTANEOUS (DQD)
##.ACQUISITION SCHEME= undefined
##.AVERAGES= 16
##.DIGITISER RES= 18
##SPECTROMETER/DATA SYSTEM= dpx250
##.PULSE SEQUENCE= zg30
##.SOLVENT NAME= DMSO
##.SHIFT REFERENCE= (INTERNAL, DMSO, 0, 16.5057)
##AUDIT TRAIL= $$ (NUMBER, WHEN, WHO, WHERE, WHAT)
$$ ##TITLE= Audit trail, XWIN-NMR		Version 3.5
$$ ##JCAMPDX= 5.01
$$ ##ORIGIN= Bruker BioSpin GmbH
$$ ##OWNER= NMR
$$ C:\u/data/dgb/nmr/ADRS/9910/pdata/1/auditp.txt
$$ ##AUDIT TRAIL=  $$ (NUMBER, WHEN, WHO, WHERE, WHAT)
(   1,<2005-09-23 12:25:51.17 +100>,<MAYBRIDGE\NMR>,<NMR_250MHZ>,
      <created by zg, POWCHK disabled, PULCHK disabled
       configuration hash MD5:
       62 19 C7 07 E1 42 D1 B7 37 6C 3D D0 77 39 F9 E6
       data hash MD5: 64K
       D6 0A 2E 07 C7 0E FE 53 F5 CB 2C 38 17 9D 3A 9B>)
(   2,<2005-09-23 12:26:03.39 +100>,<MAYBRIDGE\NMR>,<NMR_250MHZ>,
      <Start of raw data processing
       ef LB = 0.3 FT_mod = 6 PKNL = 1 SI = 32K 
       data hash MD5: 32K
       5A F3 A0 2C 39 C2 E9 40 7E 8C 40 01 FC F7 D5 7A>)
(   3,<2005-09-23 12:26:05.13 +100>,<MAYBRIDGE\NMR>,<NMR_250MHZ>,
      <apk 
       data hash MD5: 32K
       81 90 3D 7D B6 1B 71 13 55 5F C2 8F B4 74 90 5F>)
(   4,<2005-09-23 12:26:05.86 +100>,<MAYBRIDGE\NMR>,<NMR_250MHZ>,
      <abs ABSG = 5 
       data hash MD5: 32K
       F2 C4 6D 7C 39 A6 C7 4C E4 AE 1C 8E 5B 87 D0 28>)
$$ ##END=
$$ 
$$ hash MD5
$$ 22 38 B0 64 5A 59 5E 8F BC 5F 12 53 F4 C6 C6 A7
##$RELAX= 
##$RELAX= 
##$RELAX= 
##$RELAX= 
##$RELAX= 
##$RELAX= 
##$RELAX= 
$$ Bruker specific parameters
$$ --------------------------
##$DU= <C:\u>
##$EXPNO= 9910
##$NAME= <ADRS>
##$PROCNO= 1
##$TYPE= <nmr>
##$USER= <dgb>
##$AMP= (0..31)
100 100 100 100 100 100 100 100 100 100 100 100 100 100 100 100 100 100 
100 100 100 100 100 100 100 100 100 100 100 100 100 100 
##$AQSEQ= 0
##$AQ_mod= 3
##$AUNM= <au_zg>
##$AUTOPOS= <24 >
##$BF1= 250.13
##$BF2= 250.13
##$BF3= 250.13
##$BF4= 250.13
##$BF5= 500.13
##$BF6= 500.13
##$BF7= 500.13
##$BF8= 500.13
##$BYTORDA= 1
##$CFDGTYP= 0
##$CFRGTYP= 5
##$CHEMSTR= <none>
##$CNST= (0..31)
1 1 145 1 1 1 1 1 1 1 1 1 1 1 1 1 1 1 1 1 1 1 1 1 1 1 1 1 1 1 1 1 
##$CPDPRG= <>
##$CPDPRG1= <>
##$CPDPRG2= <>
##$CPDPRG3= <>
##$CPDPRG4= <mlev>
##$CPDPRG5= <mlev>
##$CPDPRG6= <mlev>
##$CPDPRG7= <mlev>
##$CPDPRG8= <mlev>
##$CPDPRGB= <>
##$CPDPRGT= <>
##$D= (0..31)
0 1 0 0 0 0 0 0 0 0.06 0 0 0 0 0 0 0.0002 0 0 0 0 0 0 0 0 0 0 0 0 0 0 
0 
##$DATE= 1127474750
##$DBL= (0..7)
120 120 120 120 120 120 120 120 
##$DBP= (0..7)
150 150 150 150 150 150 150 150 
##$DBP07= 0
##$DBPNAM0= <>
##$DBPNAM1= <>
$$ [...]
##$SUBNAM7= <"">
##$SUBNAM8= <"">
##$SUBNAM9= <"">
##$SW= 20.6930455092707
##$SWIBOX= (0..15)
0 0 3 0 0 0 0 0 0 0 0 0 0 0 0 0 
##$SW_h= 5175.983436853
##$TD= 65536
##$TD0= 1
##$TE= 295.16
##$TE2= 300
##$TE3= 300
##$TEG= 300
##$TL= (0..7)
0 120 120 120 120 120 120 120 
##$TP= (0..7)
150 150 150 150 150 150 150 150 
##$TP07= 0
##$TPNAME0= <>
##$TPNAME1= <>
##$TPNAME2= <>
##$TPNAME3= <>
##$TPNAME4= <>
##$TPNAME5= <>
##$TPNAME6= <>
##$TPNAME7= <>
##$TPOAL= (0..7)
0.5 0.5 0.5 0.5 0.5 0.5 0.5 0.5 
##$TPOFFS= (0..7)
0 0 0 0 0 0 0 0 
##$TUNHIN= 0
##$TUNHOUT= 0
##$TUNXOUT= 0
##$USERA1= <user>
##$USERA2= <user>
##$USERA3= <user>
##$USERA4= <user>
##$USERA5= <user>
##$V9= 5
##$VALIST= <valist>
##$VCLIST= <CCCCCCCCCCCCCCC>
##$VD= 0
##$VDLIST= <DDDDDDDDDDDDDDD>
##$VPLIST= <PPPPPPPPPPPPPPP>
##$VTLIST= <TTTTTTTTTTTTTTT>
##$WBST= 1024
##$WBSW= 4
##$XGAIN= (0..3)
0 0 0 0 
##$XL= 0
##$YL= 0
##$YMAX_a= 439219
##$YMIN_a= -551407
##$ZGOPTNS= <>
##$ZL1= 120
##$ZL2= 120
##$ZL3= 120
##$ZL4= 120
##$ABSF1= 16.5057
##$ABSF2= -4.187473
##$ABSG= 5
##$ABSL= 3
##$ALPHA= 0
##$AQORDER= 0
##$ASSFAC= 0
##$ASSFACI= 0
##$ASSFACX= 0
##$ASSWID= 0
##$AUNMP= <proc_1d>
##$AZFE= 0.1
##$AZFW= 0.1
##$BCFW= 0
##$BC_mod= 0
##$BYTORDP= 0
##$COROFFS= 0
##$CY= 12.5
##$DATMOD= 1
##$DC= 0
##$DFILT= <>
##$DTYPP= 0
##$F1P= 14.0000005364418
##$F2P= -0.99999901652339
##$FCOR= 0.5
##$FTSIZE= 32768
##$FT_mod= 6
##$GAMMA= 0
##$GB= 0
##$INTBC= 1
##$INTSCL= 1
##$ISEN= 128
##$LB= 0.3
##$LEV0= 0
##$LPBIN= 0
##$MAXI= 10000
##$MC2= 0
##$MEAN= 0
##$ME_mod= 0
##$MI= 0
##$NCOEF= 0
##$NC_proc= -2
##$NLEV= 6
##$NOISF1= 0
##$NOISF2= 0
##$NSP= 0
##$NTH_PI= 0
##$NZP= 0
##$OFFSET= 16.5057
##$PC= 1
##$PHC0= -90.07201
##$PHC1= 8.59372
##$PH_mod= 1
##$PKNL= yes
##$PPARMOD= 0
##$PSCAL= 4
##$PSIGN= 0
##$REVERSE= no
##$SF= 250.130004075493
##$SI= 32768
##$SIGF1= 0
##$SIGF2= 0
##$SINO= 400
##$SIOLD= 32768
##$SREGLST= <1H.DMSO>
##$SSB= 0
##$STSI= 32768
##$STSR= 0
##$SW_p= 5175.98343685301
##$SYMM= 0
##$S_DEV= 0
##$TDeff= 65536
##$TDoff= 0
##$TI= <Analysis number 999999
Compound Code 99
Book Reference 9
Project Code 9>
##$TILT= no
##$TM1= 0
##$TM2= 0
##$TOPLEV= 0
##$USERP1= <user>
##$USERP2= <user>
##$USERP3= <user>
##$USERP4= <user>
##$USERP5= <user>
##$WDW= 1
##$XDIM= 32768
##$YMAX_p= 278648155
##$YMIN_p= -101862
$$ End of Bruker specific parameters
$$ ---------------------------------
##NTUPLES= NMR SPECTRUM
##VAR_NAME=  FREQUENCY,     SPECTRUM/REAL,   SPECTRUM/IMAG
##SYMBOL=    X,             R,               I
##VAR_TYPE=  INDEPENDENT,   DEPENDENT,       DEPENDENT
##VAR_FORM=  AFFN,          ASDF,            ASDF
##VAR_DIM=   32768,         32768,           32768
##UNITS=     HZ,            ARBITRARY UNITS, ARBITRARY UNITS
##FACTOR=    0.157963299565203, 1,           1
##FIRST=     4128.57059758808, 0,            0
##LAST=      -1047.41283926493, 0,           0
##MIN=       -1047.41283926493, -101862,     0
##MAX=       4128.57059758808, 278648155,    0
$$ Real data points
##PAGE= N=1
##DATA TABLE= (X++(R..R)), XYDATA
$$ [...]
19232A3549P556R20l916k541p127M391R601O306L059k290O79m662o526r934j3633
$$ 13549 21105 22025 18109 15568 8441 12832 22433 28739 31798 29508 30187 25525 18999 9065 -4568
19217d568p215o671O188P891N054l221L958J164l947j1154L666J1199L108l741
$$ -4568 -11783 -18454 -12266 -4375 679 -2542 1416 2580 -1367 -12521 -8855 2344 5452 1711
19203A711o070R114J864o058L686K100j3125Q550M361K439J502p326J068J1722
$$ 1711 -4359 4755 6619 561 4247 6347 -6778 1772 6133 8572 10074 2748 3816 15538
19189A5538L980P497j055M990J7442k005R83L408m791p357q991K98r57Q30J514
$$ 15538 19518 27015 25960 30950 48392 46387 47370 50778 45987 38630 29639 29937 28980 29810 31324
19174C1324p098p691o608P86j0555j1435P24J0501J2872j0167r226p677J3239
$$ 31324 24226 16535 9927 10713 158 -11277 -10553 -52 12820 2653 -6573 -14250 -1011
19161a011J5290Q274j1946p639O278J0894N247R263P599k010j2979N365Q816P92
$$ -1011 14279 22553 10607 2968 9246 20140 25387 34650 42249 40239 27260 32625 41441 42233
19147D2233o748m122L60r941p885P591R451K667j0166j0162N415J0612l277j8672
$$ 42233 35485 31363 31723 21782 13897 21488 30939 33606 23440 13278 18693 29305 26028 7356
19133G356O46R934Q249P414R726l063o432k484o164K155J8201J2167o905j333
$$ 7356 8002 17936 26185 33599 43325 40262 33830 31346 25182 27337 45538 57705 50800 49467
19119D9467N755m971j0488M901m539N288J2085r322J046N243M765O453J9452J1511
$$ 49467 55222 50251 39763 44664 40125 45413 57498 48176 49222 54465 59230 65683 85135 96646
19105I6646J934j72J3703R876Q740J6367J7165Q328j288n656n000j1927q218o502
$$ 96646 98580 98408 112111 121987 130727 147094 164259 172587 171299 165643 160643 148716 140498 133996
19091A33996p076k975j0037j2803n293l389K143J754l542l783l33n267l552l138
$$ 133996 126920 123945 113908 101105 95812 92423 94566 96320 92778 88995 88662 83395 79843 76705
19077G6705N556l73r268j2780o252q523n376M790N207n801J1839K581j8956o437
$$ 76705 82261 81888 72620 59840 53588 45065 39689 44479 49686 43885 55724 58305 39349 32912
19063C2912J3966q816j4435L829P048R274J5490L821j496q938J4124J6053Q136
$$ 32912 46878 38062 23627 27456 34504 43778 59268 63089 61593 52655 66779 82832 90968
19050I0968P577O213O943L432R240P440J9710Q384N298j5318j2096K286R676J1121
$$ 90968 98545 104758 111701 115133 124373 131813 151523 159907 165205 149887 137791 140077 149753 160874
19036A60874J821j8361j7489n310o843j915J3672M5k858K446r524L72P873k515
$$ 160874 162695 144334 126845 121535 114692 112777 126449 126494 123636 126082 116558 116930 124803 122288
19022A22288j7336o653k494P523k128q00K526q75j3868r925j8324m365M061j0566
$$ 122288 104952 98299 95805 103328 101200 100400 102926 102051 88183 78258 59934 55569 59630 49064
19008D9064K637M722K252r933n250P949j01n563m156Q27k62l337L442M062N187
$$ 49064 51701 56423 58675 48742 43492 51441 51340 45777 41621 42448 42186 38849 42291 46353 51540
18993E1540m477j699N397K759n489N820J0951M127n430L61o421j0188m185p619
$$ 51540 47063 45364 50761 53520 48031 53851 64802 68929 63499 63860 57439 47251 43066 35447
18979C5447J1443R565P874Q881O747N139L715o287J1373J3809J4559N953l880
$$ 35447 46890 56455 64329 73210 79957 85096 88811 82524 93897 107706 122265 128218 124338
18966A24338k86k46m328p239l12K876n069j2143k962J4534l907j2063p216L633
$$ 124338 124052 123806 119478 112239 111927 114803 109734 97591 94629 109163 105256 93193 85977 89610
18952H9610M37K691J6874J7795M216k64j0004j805Q80L108J423O872J0080N345
$$ 89610 90047 92738 109612 127407 131623 131359 121355 119550 120430 123538 124961 131833 141913 147258
18938A47258J965N508N093R294N680J5308J3911K0890L2882L2464J7416K3459
$$ 147258 149223 154731 159824 169118 174798 190106 204017 224907 257789 290253 307669 331128
18926C31128K0016K2529L0261N5066O0195M9027J7152J8161K6105N1801P2307
$$ 331128 351144 373673 403934 459000 519195 568222 585374 603535 629640 681441 753748
18915G53748R8312R4848P9059R5033J36994J92314K99880M31299N78275Q13428
$$ 753748 852060 946908 1025967 1121000 1257994 1450308 1750188 2181487 2759762 3573190
18905C573190J282480K058328K958344K991321J444256k77806o56088N16797K712369
$$ 3573190 4855670 6913998 9872342 12863663 14307919 14030113 13374025 13890822 16603191
18896A6603191M621851M124080N81190l113381m374688l255078j048092Q14566
$$ 16603191 21225042 25349122 25930312 22816931 18442243 15187165 14139073 14953639
18888A4953639R38981r34836k733664l187562k580320j718947j127536p66443
$$ 14953639 15892620 14957784 12224120 9036558 6456238 4737291 3609755 2843312
18880B843312n35185l82547k68914j70622j02758p5327o9296r0068o7882j1158
$$ 2843312 2308127 1925580 1656666 1486044 1383286 1307959 1238663 1148595 1080713 1069555
18870A069555L2635M6605K9479m910m0690l3777n264M0623P5060Q4669O6744P5398
$$ 1069555 1102190 1148795 1178274 1173364 1132674 1098897 1093633 1134256 1209316 1293985 1360729 1436127
18858A436127J13701J87541K82952M11017N65495Q20606J257991K065334L171946
$$ 1436127 1549828 1737369 2020321 2431338 2996833 3817439 5075430 7140764 10312710
18849A0312710L530790K048310o5844q15071K11634K593130M878216M724606J155448
$$ 10312710 13843500 15891810 15825966 15010895 15222529 17815659 22693875 27418481 28573929
18840B8573929k988884m731200l786442j505449N90452R94374p58021k762397
$$ 28573929 25585045 20853845 17067403 15561954 16152406 17146780 16388759 13626362
18832A3626362l441480k908502j990258j316912r03812o28205m48069l24284k33565
$$ 13626362 10184882 7276380 5286122 3969210 3065398 2437193 1989124 1664840 1431275
18823A431275j51059j04064j06348j19183j02089p3149l6891j0419j9773o0285
$$ 1431275 1280216 1176152 1069804 950621 848532 775383 738492 728073 708300 648015
18813F48015o8864o8010l9363l4642k3694j8543l2343k7154l2557l3332k0665
$$ 648015 579151 511141 471778 437136 413442 394899 362556 335402 302845 269513 248848
18802B48848p324q926j0701j3422o419n815r901j854M129j0377k3445j6798j2272
$$ 248848 241524 232598 221897 208475 202056 196241 186340 184486 188615 178238 154793 137995 125723
18789A25723k670Q710P957j6117j0699q463j887L59J566L180j669K073p954M275
$$ 125723 123053 131763 139720 123603 112904 104441 102554 102913 104479 107659 105990 108063 100109 104384
18775A04384j3377j1346N487Q408P56q88m444j0551k6755k442N409J0943K902
$$ 104384 91007 79661 85148 93556 94312 93424 88980 78429 51674 49232 54641 65584 68486
18762F8486m569k383K798K267J192K387o397j986p671j246L302N279p014j659
$$ 68486 63917 61534 64332 66599 67791 70178 63781 61795 54124 52878 56180 61459 54445 52786
18748E2786K095M265n981j1956j0404k039O015M150K361J1539J6530k92p216N80
$$ 52786 54881 59146 53165 41209 30805 28766 34781 38931 41292 52831 69361 69069 61853 62433
18734F2433J71J366J734K918J1110O017l93Q993m270n000K87M830K654j7799j8704
$$ 62433 62604 63970 65704 68622 79732 85749 85356 94349 90079 85079 85366 90196 92850 75051 56347
18719E6347O379O890Q538n559q459m296j2323J0310P411M734l90j7258r001P098
$$ 56347 62726 69616 78154 72595 64136 59840 47517 57827 65238 69972 69582 52324 43323 50421
18705E0421l944p775j54Q704k600j592j3009j3943o847M605O088J5197K292r833
$$ 50421 46477 38702 38548 47252 44652 43060 30051 16108 9261 13866 19954 35151 37443 27610
18691B7610o887P105P251J3690j612j769J889J4742J3090L052P222l944L699L749
$$ 27610 20723 27828 35079 48769 47157 45388 47277 62019 75109 78161 85383 81439 85138 88887
18677H8887j889k251j968K661M575J244k001l264J0948m061j169q59Q228J2844
$$ 88887 86998 84747 82779 85440 90015 91259 89258 85994 96942 92881 91712 90853 99081 111925
18663A11925J7860J1562r574j8893k2817j491J2025J1413q118j6899j5738m088
$$ 111925 129785 141347 131773 112880 90063 88572 100597 112010 103892 86993 71255 67167
18651F7167J9004N525Q584M212k715j2020L656L570N107J9622K950o406j662k32
$$ 67167 86171 91696 100280 104492 101777 89757 93413 96983 102090 121712 124662 118256 116594 116362
18637A16362j378P492J681O355J414j745J3717J5468o464P636J5905P933J7611
$$ 116362 114984 122476 124157 130512 131926 130181 143898 159366 152902 160538 176443 184376 201987
18624B01987K3468L3079L9753K4838K0627L6687L4266M7849N9863M9185L4969
$$ 201987 225455 258534 298287 323125 343752 380439 414705 462554 522417 571602 606571
18613F06571K7456L8503K9023M2550P7417J13304J25774J27388J45747K24164
$$ 606571 634027 672530 701553 744103 821520 934824 1060598 1187986 1333733 1557897
18603A557897L25379N02420P63937J198136J954844K959166L228445J833376P6070
$$ 1557897 1883276 2385696 3149633 4347769 6302613 9261779 12490224 14323600 14399670
18594A4399670k74394J111743L647818M919449K380396k111671m234056l603499
$$ 14399670 14125276 15237019 18884837 23804286 26184682 24073011 19838955 16235456
18586A6235456j342727L28978q7713j946295k995560k887461k105691j381298
$$ 16235456 14892729 15221707 15133994 13187699 10192139 7304678 5198987 3817689
18578C817689r26142o23054l85133k43523j80414j54429j17060o4232m6164p191
$$ 3817689 2891547 2268493 1883360 1639837 1459423 1304994 1187934 1123702 1077538 1070347
18568A070347K5750N3005K9413J0677j1614n185K1347L5339L4678L3250J9987
$$ 1070347 1096097 1149102 1178515 1189192 1177578 1172393 1193740 1229079 1263757 1297007 1316994
18557A316994m790k3854L737M5812Q2440J30325J58827J99225K94343M24403O33758
$$ 1316994 1312204 1288350 1292087 1337899 1420339 1550664 1709491 1908716 2203059 2627462 3261220
18546C261220R52977J547609K585410L904321M050255J945958k80356m73075J533000
$$ 3261220 4214197 5761806 8347216 12251537 16301792 18247750 17967394 17494319 19027319
18537A9027319M741759O069647K566341k950578n372954m400037j562857L93141
$$ 19027319 23769078 29838725 32405066 29454488 24081534 19681497 18118640 18511781
18529A8511781k21390k418338l640291l478631k542065j696008j129060p38560
$$ 18511781 18290391 15872053 12231762 8753131 6211066 4515058 3385998 2647438
18521B647438m89360l32873k46055k03578j56660j31213j03498q0629m9576m3818
$$ 2647438 2158078 1825205 1579150 1375572 1218912 1087699 984201 903572 853996 810178
18511H10178n2644l7473m1041m7061l7603m6136l6091k5567k5205k2783j0517
$$ 810178 757534 720061 679020 631959 594356 548220 512129 486562 461357 438574 428057
18500D28057M325K0048N2571Q7583J36676J28381N5678o632M034J01438J95647
$$ 428057 432382 452430 505001 592584 729260 857641 913319 906687 910721 1012159 1207806
18489A207806K01092L9568j33073j91792j46750n8193J3759l8655j19897j55756
$$ 1207806 1408898 1448466 1315393 1123601 976851 918658 932417 893762 773865 618109
18479F18109j32962j09164p2554m2153l7891k0818j9086r136j654r377j1992J547
$$ 618109 485147 375983 303429 261276 223385 202567 183481 174345 172691 163314 151322 152869
18467A52869o965O420M236o696k0651j7710r060J3125M190J2119j788l022m529
$$ 152869 145904 152324 156560 149864 129213 111503 102443 115568 119758 131877 130089 127067 122538
18454A22538M714J878J2442R151Q11O082J2987K6563L4339M7045P1854J15726
$$ 122538 127252 129130 141572 150723 151534 157616 170603 197166 231505 278550 350404 466130
18442D66130J72141J82675J11796J6007m791P2351K04088K72585J69425r9066
$$ 466130 638271 820946 932742 948749 943958 1016309 1220397 1492982 1662407 1563341
18432A563341k44590k30664j11507j3278k245q6392j67263j79457j36353r3496
$$ 1563341 1318751 1088087 976580 963302 961057 874665 707402 527945 391592 298096
18422B98096o3025l8271l0254k0640j7763j6927j1994r388j0582o20o62n084p504
$$ 298096 235071 196800 166546 145906 128143 111216 99222 89834 79252 78632 77970 72886 65382
18409F5382j4581j7986j1091O097N589k420r551K300N322M58j383L53m210k365
$$ 65382 50801 32815 21724 27821 33410 30990 21439 23739 29061 29519 28136 28489 24279 21914
18395B1914P999L366n414L374J1784J1880J6882J5935N042J740m384M777J0763
$$ 21914 29913 33279 27865 31239 43023 54903 71785 87720 92762 94502 90118 94895 105658
18382A05658J7812J3710L676r414j0238m27o841j2653j104M755k824k1638k3439
$$ 105658 123470 137180 140856 131442 121204 120777 113936 101283 100179 104934 102110 80472 57033
18369E7033o685m596j343n354j1156n479l256N385O654J009J0267K710p638j1202
$$ 57033 50348 45752 44409 39055 27899 22420 19164 24549 31203 32212 42479 45189 37551 26349
18355B6349l230O318n516P528J3131L184l867p72M424J709M547o646m24L712n79
$$ 26349 23119 29437 23921 31449 44580 47764 43897 43125 47549 49258 53805 47159 46735 50447 49868
18340D9868J231L145N009J6271J4666R656k936J1713Q57R932K3165K1370K5243
$$ 49868 51099 54244 59253 75524 90190 99846 96910 108623 109480 119412 142577 163947 189190
18327A89190j2k7736k4788k1397j7291L147K098k500o079j6994k0697j3355r342
$$ 189190 189178 161442 136654 115257 97966 101113 103211 100711 94632 77638 56941 43586 34244
18314C4244M600n142N092J127o395j0400m00L001O90O067P045K113L71J1332p647
$$ 34244 38844 33702 38794 39921 33526 23126 22726 25727 26417 32484 39529 41642 42013 53345 45698
18299D5698J64L167N111k212M177R922J1881M469N441J6505n007l453k603j958
$$ 45698 45862 49029 54140 51928 56105 66027 77908 82377 87818 104323 99316 95863 93260 91302
18285I1302O469N170J810R756j67M711j900k523j2281j3357j6506j0206p344J815
$$ 91302 97771 102941 104751 114507 114340 119051 117151 114628 102347 88990 72484 62278 54934 56749
18271E6749n083n199k288j5441l518l798O377m0J796m286j1575R28K512J2174
$$ 56749 51666 46467 44179 28738 25220 21422 27799 27759 29555 25269 13694 14622 17134 29308
18257B9308L59p732L761J1293o70M96R440M939J1808J3959K6531K5308R290K7660
$$ 29308 29667 21935 25696 36989 36319 36815 46255 51194 63002 76961 103492 128800 138090 165750
18243A65750L06j9671k4228l636P857K0512k486o598j975o977r903j5244q732
$$ 165750 166056 146385 122157 118521 126378 146890 144404 137806 135831 128854 118951 103707 94975
18230I4975j672O928Q974J0729P947j3913r457k7618k1173J700l868L832J7734
$$ 94975 93303 100231 109205 119934 127881 113968 104511 76893 55720 57420 53552 57384 75118
18217G5118P037o645l876O912K062o434r217k3357j1774N884R902k088j399J428
$$ 75118 82155 75510 71634 78546 80608 74174 64957 41600 29826 35710 45612 43524 42125 43553
18203D3553l541J0006J3709p939J050q72R239J0580J4378J5360N856N315L035
$$ 43553 40012 50018 63727 55788 56838 55966 65205 75785 90163 105523 111379 116694 119729
18190A19729L186j0217k367J5379P617l203j0738k0661p401l383P91N747M3P859
$$ 119729 122915 112698 110331 125710 133327 130124 119386 98725 91324 87941 88732 94479 94522 102381
18176A02381O521j5742o913R402o436j2946l524j192J0984J116L010n385M004
$$ 102381 108902 93160 86247 95649 89213 76267 72743 71551 82535 83651 86661 81276 85280
18163H5280K452O850l148L417k59j0647j0741p045m99K709m02R961J6385O250
$$ 85280 87732 94582 91434 94851 94592 83945 73204 66159 65660 68369 67967 77928 94313 100563
18149A00563k977o930n268m576l21o326j4783P251l5p261J0720J3827p22r2P688
$$ 100563 97586 90656 85388 80812 80491 74165 59382 66633 66598 59337 70057 83884 83162 83070 90758
18134I0758J576P966J7420J1094K568P689J846P061J9072L5780J5275l271Q106
$$ 90758 92334 100300 117720 128814 131382 139071 140917 147978 167050 202830 218105 214834 222940
18121B22940J2854K3420K4335K7140L9672J6505q685l068P762P365J9011K2132
$$ 222940 235794 259214 283549 310689 350361 366866 358181 355113 362875 370240 389251 411383
18109D11383L6477L9928N3945O1272O3084O9743Q6884J50076K16775K93444M38303
$$ 411383 447860 487788 541733 603005 666089 735832 822716 972792 1189567 1483011 1921314
18098A921314O73002J071160J699013K538446K957140J951702j09476j523421
$$ 1921314 2594316 3665476 5364489 7902935 10860075 12811777 12702301 11178880
18090A1178880j580825n86902Q53367J987134J701545k47109k158348k824484
$$ 11178880 9598055 9011153 9864520 11851654 13553199 13306090 11147742 8323258
18082H323258k426092j689917j112981o99831m52906l00076j99749j61570j27528
$$ 8323258 5897166 4207249 3094268 2394437 1941531 1641455 1441706 1280136 1152608
18073A152608r2127n6730j7007K0463K7847J8707J4819K8796N4145Q3330J25098
$$ 1152608 1060481 1003751 986744 1007207 1035054 1053761 1068580 1097376 1151521 1234851 1359949
18062A359949J39796J85150K45161L18409M43237O45094R82381J593012K571636
$$ 1359949 1499745 1684895 1930056 2248465 2691702 3336796 4319177 5912189 8483825
18053H483825L695693L767464J737414r81953k296117j837662k60080J527304
$$ 8483825 12179518 15946982 17684396 16702443 14406326 12568664 12308584 13835888
18045A3835888K491567J569498o70662k137406j929670o04237M54376J56386j022215
$$ 13835888 16327455 17896953 17226291 15088885 13159215 12554978 13009354 13165740 12143525
18036A2143525j741429j538925n99295N96931J506566J243555l43426j824785
$$ 12143525 10402096 8863171 8263876 8860807 10367373 11610928 11267502 9442717
18028I442717k303780j949780j350097q76913n76464l79066k49816j78839j50292
$$ 9442717 7138937 5189157 3839060 2962147 2385683 2006617 1756801 1577962 1427670
18019A427670j40840j39795r3425n0910m382J2319J657j0502k368N359K3119M8454
$$ 1427670 1286830 1147035 1053610 1002700 998318 1010637 1012294 1001792 999424 1004783 1027902 1076356
18007A076356P5485J01017J60931K41248L62948N62657Q65200J400300K266033
$$ 1076356 1151841 1252858 1413789 1655037 2017985 2580642 3445842 4846142 7112175
17998G112175L192281L053738J156160j100399k047816j499319j02974J406567
$$ 7112175 10304456 13358194 14514354 13413955 11366139 9866820 9763846 11170413
17990A1170413K157782J160409j070064k655315k922279k280418j507075r35190
$$ 11170413 13328195 14488604 13418540 10763225 7840946 5560528 4053453 3118263
17982C118263n52872l45027k95138l06455k93740k40107j78173j32056q3991n6619
$$ 3118263 2565391 2220364 1925226 1618771 1325031 1084924 906751 774695 690704 634085
17972F34085m2042l2978k8067l9762k7750j0115j0584j5064k0526k5940k4955
$$ 634085 592043 559065 530998 491236 463486 453371 442787 427723 407197 381257 356302
17961C56302j4803r650K953O892m692j6229j1383M292J7942L3843M2042Q2522
$$ 356302 341499 331849 334802 341694 337002 320773 309390 313682 331624 365467 407509 490031
17949D90031J33357J81308J53080L7091q6159j18484q4508m089O6048J41858J04758
$$ 490031 623388 804696 957776 994867 908708 790224 705716 701627 767675 909533 1014291
17938A014291K552o5079o6587m2868k7047o7831j10717r8597n0676N934N4777
$$ 1014291 1016843 951764 885177 842309 815262 747431 636714 538117 487441 493375 548152
17927E48152O5412K6819m7860j01323j06757r1010n8296l8270k9963p927j2237
$$ 548152 613564 640383 592523 491200 384443 293433 235137 196867 166904 158977 146740
17916A46740j8084K802R436j413o263O080N24j391P128Q154K447J0632L230j2154
$$ 146740 128656 131458 140894 139481 133218 139298 139822 138431 145559 153713 156160 166792 170022 157868
17902A57868j4200N638J6834K728J5001M3627O9762J14467J37326J61116O5426
$$ 157868 143668 149306 166140 168868 183869 227496 297258 411725 549051 710167 775593
17891G75593m9659j04677r3673k8944K5625Q6930R0131J2703p7932j26095j22831
$$ 775593 725934 621257 527584 498640 524265 611195 701326 714029 636097 510002 387171
17880C87171r6405p0722m1544l0268j8894j0349j4913j1454j993m138n626K506
$$ 387171 290766 220044 178500 148232 129338 118989 104076 92622 90629 86491 80865 83371
17868H3371M597K543m45N759m38p973j0304O506J6351R38j0154j3636j162J6233
$$ 83371 87968 90511 90066 95825 95387 87414 77110 83616 99967 100905 90751 77115 75953 92186
17854I2186J520r940j528N105n723q343k571L669P017r096j2087q409N950K1332
$$ 92186 93706 83766 82238 87343 81620 73277 70706 74375 81392 72296 60209 51800 57750 79082
17840G9082M000O249K941J2558L14M025L114o711N859m007q749L90L471p20J066
$$ 79082 83082 89331 92272 104830 105144 109169 112283 105572 111431 107424 98675 99065 102536 101816 102882
17825A02882j432M6J302K863N149J7748K0643J0087P384J3011K4167J5835J8134
$$ 102882 101450 101496 102798 105661 110810 128558 149201 159288 166672 179683 203850 219685 237819
17812B37819K7792K2789K1542K0789N724K7950L1106L4093J1753j1479P68J2748
$$ 237819 265611 288400 309942 330731 336455 364405 395511 429604 441357 429878 430646 443394
17800D43394K1725K9975K9543L4990M6496O5129Q3262J07114J38552J96348K52566
$$ 443394 465119 495094 524637 559627 606123 671252 754514 861628 1000180 1196528 1449094
17789A449094L57312N09980P71726J197701J909727K981372L853780L055715N53791
$$ 1449094 1806406 2316386 3088112 4285813 6195540 9176912 13030692 16086407 16640198
17780A6640198j303139j301946K54333J851759J475028j009250l101319l588985
$$ 16640198 15337059 14035113 14289446 16141205 17616233 16606983 13505664 9916679
17772I916679k867744j939546j284483q72914o13027m30757l02231j95530j25352
$$ 9916679 7048935 5109389 3824906 2951992 2338965 1908208 1605977 1410447 1285095
17763A285095q3613n7398l0644j0297J1604J7822r369r163K2972L6500N4794P5991
$$ 1285095 1201482 1144084 1113440 1103143 1114747 1132569 1123200 1114037 1137009 1173509 1228303 1304294
17751A304294P6721R5855J28573K04410L00754M42486O68356J059686J730599
$$ 1304294 1381015 1476870 1605443 1809853 2110607 2553093 3221449 4281135 6011734
17742F011734K669031L111231J942093j29432j128966o57379P89326J757485J129054
$$ 6011734 8680765 11791996 13734089 13604657 12475691 11818312 12607638 14365123 15494177
17733A5494177l87112r44922p7025J445874J763944J64436j523595j689120l59001
$$ 15494177 15107065 14162143 14085118 15530992 17294936 17459372 15935777 14246657 13887656
17724A3887656J311518J393504o84134k757208l367326k787589j891005j237381
$$ 13887656 15199174 16592678 15908544 13151336 9784010 6996421 5105416 3868035
17716C868035q46464n95080m05689k65494j67789j19096r6984q4377p3164m6318
$$ 3868035 3021571 2426491 2020802 1755308 1587519 1468423 1371439 1287062 1213898 1167580
17706A167580k0653Pr279o517P406L5520Q9021J58524K21079K26261J60975J19992
$$ 1167580 1146927 1146934 1137655 1131138 1138544 1174064 1263085 1421609 1642688 1868949 2029924 2149916
17694B149916J73029L24333N89649R56459J438188K156014K687831J936111K4407
$$ 2149916 2322945 2647278 3236927 4193386 5631574 7787588 10475419 12411530 12435937
17685A2435937j197789j011928K21123J229231O90655j100070k321526k471561
$$ 12435937 11238148 10226220 10447343 11676574 12367229 11267159 8945633 6474072
17677F474072j902376j283348q59318n70756m05219k91784j88404j46367j13801
$$ 6474072 4571696 3288348 2429030 1858274 1453055 1161271 972867 826500 712699
17668G12699p9435o1619m5592l1899q862j5684K189K2244L9588O7610Q0551R6577
$$ 712699 633264 571645 526053 494154 485292 469608 471797 494041 533629 601239 681790 778367
17656G78367J15446Q2319m424o1583m8472j2206L8857N2544P611l4704p457O5298
$$ 778367 893813 976132 971708 910125 861653 849447 888304 940848 948459 913755 906298 971596
17644I71596O7288l248q0643j01753l9780L9281N6978K052j02747j65789j58106
$$ 971596 1038884 1035636 954993 853240 813460 852741 909719 911771 809024 643235 485129
17633D85129j11623q1729n5105l7551k0905j0991m428n401k279j7302p102j1378
$$ 485129 373506 291777 236672 199121 178216 167225 162797 157396 155117 137815 130713 119335
17621A19335l703L631j825p655P373j2497n168O350j804q265L683Q556J6739L4454
$$ 119335 115632 119263 117438 109783 117156 104659 99491 105841 104037 95772 99455 108011 124750 159204
17607A59204K3545L9255O7366J10841J34855J03123J2392n5283o5045j4962O2162
$$ 159204 182749 222004 289370 400211 535066 638189 650581 595298 530253 515291 577453
17596E77453N7525l4279r3457j08008r7242o0474l5017k7802j6313l115L504o685
$$ 577453 634978 600699 507242 399234 301992 241518 206501 178699 162386 159271 162775 156090
17584A56090j6078p715m945k126J6261p152o81r233l6368k0738j0304j5776Q626
$$ 156090 140012 132297 127352 125226 141487 134335 133654 124421 88053 67315 57011 41235 49861
17571D9861N203j2235j5579O923J3468K876J865J616r458j1835k0571q834n677
$$ 49861 55064 42829 27250 34173 47641 50517 52382 53998 44540 32705 12134 3300 -2377
17558b377P364J2143J692O06l744n687j897R091O544l466P755J3772O206J3337
$$ -2377 4987 17130 18822 19428 15684 9997 8100 17191 23735 20269 28024 41796 48002 61339
17544F1339R851n402l348j008J518l976J1281q248q334J3283J5157O567l790l469
$$ 61339 71190 65788 62440 61432 62950 58974 70255 62007 53673 66956 82113 88680 84890 81421
17530H1421p29k705K683q691P928O256P670j1137j2817l903j8185j1424j1288
$$ 81421 80692 77987 80670 71979 79907 86163 93833 82696 69879 65976 47791 36367 25079
17517B5079j042j023K814m330l854O833n790r912J907J38M0J575j392q524q731
$$ 25079 24037 23014 25828 21498 17644 24477 18687 8775 10682 10820 10860 12435 11043 2519 -6212
17502f212J5851R417N39J725m946q621j1702P234K1406J6613L78R740J0854O445
$$ -6212 9639 19056 19595 21320 16374 7753 -3949 3285 24691 41304 41682 51422 62276 68721
17488F8721N2r381j1659r139L412L878O152n711j5381j0033j342Q976l642o365
$$ 68721 68773 59392 47733 38594 42006 45884 52036 46325 30944 20911 19569 28545 24903 18538
17474A8538n785P97k124L135p70q01q385l132pP084J914k874r074l945R659l155
$$ 18538 12753 13550 11426 14561 13791 12990 4605 1473 1466 8550 10464 7590 -1484 -5429 4230 1075
17458A075n608q159q50O034K672k280j522k387J067M521N953k947n698P116J3600
$$ 1075 -4533 -12692 -13542 -7508 -4836 -7116 -8638 -11025 -9958 -5437 516 -2431 -8129 -1013 12587
17443A2587J0049Q781j017j6741j4768Q04J865K247k347k78Q071Q038k500j559
$$ 12587 22636 31417 30400 13659 -1109 -305 1560 3807 1460 1182 9253 17291 14791 13232
17429A3232J107J887M107q28k0496m661P295J0996j652J0317l219l303o411n91
$$ 13232 14339 16226 20333 19505 -991 -5652 1643 12639 10987 21304 18085 14782 8371 7780
17415G780P6Q830O789j3199L86k283Q495O791p871q540j2406p878P6j0342l320
$$ 7780 7856 16686 23475 10276 10662 8379 16874 23665 15794 7254 -5152 -13030 -12954 -23296 -26616
17400b6616J3329J0644M013P349l885o333k616q368o832J1144J0577m938p16P100
$$ -26616 -13287 -2643 1370 8719 4834 -1499 -4115 -12483 -19315 -8171 2406 -2532 -3248 3852
17386C852J7621k152j3134N31R200k32o439M263L995L099n441p732l859M020o837
$$ 3852 21473 19321 6187 6718 15918 15686 9247 13510 17505 20604 15163 7431 3572 7592 755
17371G55M720j871q775n195l558L706K321R112j282m098k101k736o777Q759Q453
$$ 755 5475 3604 -5171 -10366 -13924 -10218 -7897 1215 -67 -4165 -6266 -9002 -15779 -7020 1433
17356A433j593n314K531K46N813n839o441J2257J6837J227k485J601q341l234
$$ 1433 -160 -5474 -2943 -2697 3116 -2723 -9164 3093 19930 21157 18672 20273 11932 8698
17342H698p12M597n48L42J008n600k654q795J038N807j1428j5729M122P849R627
$$ 8698 7986 12583 12035 12377 13385 7785 5131 -3664 -2626 3181 -8247 -23976 -19854 -12005 -2378
17327b378Q031o043o630j6788n507M891J1772Q648q193n425P353l598k749j829
$$ -2378 5653 -390 -7020 -23808 -29315 -24424 -12652 -4004 -12197 -17622 -10269 -13867 -16616 -18445
17313a8445L083Q41R067M058k636P904m04J883o750k216O769P933L017p625l163
$$ -18445 -15362 -14521 -5454 -1396 -4032 3872 3468 5351 -1399 -3615 3154 11087 14104 6479 3316
17298C316n38J402j774j2460j866m624p09k643M172M941O92j988o691K776R972
$$ 3316 2778 4180 2406 -10054 -11920 -16544 -17253 -19896 -15724 -10783 -10091 -12079 -18770 -15994 -6022
17283f022M623M751O828R918J9984K532J0277J6353k540m527L729o156L915k338
$$ -6022 -1399 3352 10180 20098 40082 42614 52891 69244 66704 62177 65906 59750 63665 61327
17269F1327j7526q652j9001J981j1615j58N489j0163n444o737r549J558L431l58
$$ 61327 43801 35149 16148 18129 6514 6356 11845 1682 -3762 -10499 -20048 -18490 -15059 -15417
17255a5417Q887j707n115K263l982M216L971P167j721L996o57Q32K4939M371N221
$$ -15417 -6530 -8237 -13352 -11089 -15071 -10855 -6884 283 -1438 2558 1901 2733 27672 32043 37264
17240C7264o631p934K291J3913J4185J8785m30k046k602m927Q834J4748j1328
$$ 37264 30633 22699 24990 38903 53088 71873 71443 69397 66795 61868 70702 85450 74122
17227G4122j1070r740L075N183J4994L709n968M377n237J0194J003j4972p926
$$ 74122 63052 53312 56387 61570 76564 80273 74305 78682 73445 83639 84642 69670 61744
17214F1744j4462k5412j4772K397n423j1405j445J1345n577L318J4787K61j0542
$$ 61744 47282 21870 7098 9495 4072 -7333 -8778 2567 -3010 308 15095 15356 4814
17201D814N246k0674j0036J5704J1515o290K812L760K428M409L912L320L00q576
$$ 4814 10060 -10614 -20650 -4946 6569 279 3091 6851 9279 13688 17600 20920 21220 12644
17187A2644J69k56R004N944M536N608K707N955J5256J0860r231p756l591o417
$$ 12644 12813 12557 21561 27505 32041 37649 40356 46311 61567 72427 63196 55440 51849 45432
17173D5432o698l311r829p426N835K892q101j5942m035K133Q73N112J599l829
$$ 45432 38734 35423 25594 18168 24003 26895 18794 2852 -1183 950 1823 6935 8534 4705
17159D705q091J1059N378L732N32m749l128M413m937L025J438n918P614p456J195
$$ 4705 -3386 7673 13051 16783 17315 12566 9438 13851 8914 11939 13377 7459 15073 7617 8812
17144H812l091n180l332m25j1797k802M87j829Q170N462N985L96m622j1753K637
$$ 8812 5721 541 -2791 -3216 -15013 -17815 -17328 -19157 -10987 -5525 460 856 -3766 -15519 -12882
17129a2882o369J232N688J1037O771m740o05L872O781k038J541p8j5730k396Q20
$$ -12882 -19251 -18019 -12331 -1294 5477 737 132 4004 10785 8747 10288 10210 -5520 -7916 -7096
17114g096Q68j233k432j212N276p019n186J7573j1072l269J0037O613R91o743
$$ -7096 -6228 -7461 -9893 -11105 -5829 -12848 -18034 -461 -11533 -14802 -4765 1848 2839 -3904
17100c904L250M451K684O657P904j1464j2427j0357n10N592N964M939k1281j1316
$$ -3904 -654 3797 6481 13138 21042 9578 -2849 -13206 -13716 -8124 -2160 2779 -18502 -29818
17086b9818k639P066J3231J1891K559m325L622k880q780j608L195k579L934j042
$$ -29818 -32457 -25391 -12160 -269 2290 -2035 1587 -1293 -10073 -11681 -8486 -11065 -7131 -8173
17072h173n477j652r523J872K319j631J405J684l852j350J1257K5940L432j3283
$$ -8173 -13650 -15302 -24825 -22953 -20634 -22265 -20860 -19176 -23028 -24378 -13121 12819 16251 2968
17058B968k626J483n992m441M135o80o480r285j1170J740N092J4718m632j0004
$$ 2968 342 1825 -4167 -8608 -4473 -5153 -11633 -20918 -32088 -30348 -25256 -10538 -15170 -25174
17044b5174L72J4207P064j1776N868M429n853l372L975k799N698J0499M35j0390
$$ -25174 -24802 -10595 -3531 -15307 -9439 -5010 -10863 -14235 -10260 -13059 -7361 3138 3573 -6817
17030f817r588P28r168Q873J1282P818o009o755L625j151K242K637o289k594J974
$$ -6817 -16405 -15677 -24845 -15972 -4690 3128 -2881 -9636 -6011 -7162 -4920 -2283 -8572 -11166 -9192
17015i192J0695P042o047K986K049L177n106L591R11j0357J5803K0912p278k264
$$ -9192 1503 8545 2498 5484 7533 10710 5604 9195 10106 -251 15552 36464 29186 26922
17001B6922k779q299j0192l463k832n46l289n012L691N147j146q987j816m786
$$ 26922 24143 15844 5652 2189 -643 -1189 -4478 -9490 -5799 -652 -1798 -10785 -12601 -17387
16987a7387M892J780j6151L482j86P213J0680k885M397R717m319k1471J0479J2378
$$ -17387 -12495 -10715 -26866 -23384 -23570 -16357 -5677 -8562 -4165 5552 1233 -20238 -9759 2619
16973B619Q765l148j0800o534k873j787O579p042o874j597O587K204J1467n01
$$ 2619 11384 8236 -2564 -9098 -11971 -13758 -7179 -14221 -21095 -22692 -16105 -13901 -2434 -2935
16959b935j6377Q375P460k212K271L947k387j719j2525k730l023O084J1909K86
$$ -2935 -19312 -10937 -3477 -5689 -3418 529 -1858 -3577 -16102 -18832 -21855 -15771 -3862 -3576
16945c576r112j1043L467N275K424J945N111m81r026J204J092O836J1558j4338
$$ -3576 -12688 -23731 -20264 -14989 -12565 -10620 -5509 -5990 -15016 -13812 -12720 -5884 5674 -8664
16931h664L930K256M908j738n637j0783q310R06J983O245O489p286k231O109M090
$$ -8664 -4734 -2478 2430 692 -4945 -15728 -24038 -23132 -21149 -14904 -8415 -15701 -17932 -11823 -7733
16916g733J1310J456j2057r684P910Q224j749l126q452K598j0469N587L449M575
$$ -7733 3577 5033 -7024 -16708 -8798 -574 -2323 -5449 -13901 -11303 -21772 -16185 -12736 -8161
16902h161j503o033O964j339k703N579Q214O635k953k053m066j1006m154m320
$$ -8161 -9664 -15697 -8733 -10072 -12775 -7196 1018 7653 4700 2647 -1419 -12425 -16579 -20899
16888b0899L336N439l841N860K427R770M958J092L825j3981r40M727j493o765
$$ -20899 -17563 -12124 -15965 -10105 -7678 2092 7050 8142 11967 -2014 -2954 1773 280 -6485
16874f485j0043k717j054O524J0389k133J950K86k157n853j418k067O661Q50j530
$$ -6485 -16528 -19245 -20299 -13775 -3386 -5519 -3569 -3283 -5440 -11293 -12711 -14778 -8117 -7267 -8797
16859h797N087L413K244O132O884j1675j541J471l655K883j377n173J806l981
$$ -8797 -3710 -297 1947 8079 14963 3288 1747 3218 -437 2446 1069 -4104 -2298 -6279
16845f279n652L121P05N785O96l678m352J737j794J186j131L921O278j0058j712
$$ -6279 -11931 -8810 -8105 -2320 -1624 -5302 -9654 -7917 -9711 -8525 -9656 -5735 543 -9515 -11227
16830a1227l391R389j066q078J7097Q048Q410n659r029m861N028j6808n725Q463
$$ -11227 -14618 -5229 -6295 -14373 2724 10772 19182 13523 4494 -367 4661 -12147 -17872 -9409
16816i409n650J219R719L578K008L559n755p993n722l838o682J5757Q345M36q981
$$ -9409 -15059 -13840 -4121 -543 1465 5024 -731 -8724 -14446 -18284 -24966 -9209 -864 -428 -9409
16801i409l07J2422P706p297j3340m195R89L978N22j1754o530L348o066J910N69
$$ -9409 -9716 2706 10412 3115 -10225 -14420 -13431 -9453 -8931 -20685 -27215 -23867 -29933 -28023 -27454
16786b7454k43R201Q023N838r269k059M922q579k029Q747L141K638J1429J717
$$ -27454 -27697 -18496 -10473 -4635 -13904 -15963 -11041 -19620 -21649 -12902 -9761 -7123 4306 6023
16772F023l31l173j5584o672M822R111m813M358R05o106j211J230O506M063k961
$$ 6023 5692 2519 -13065 -19737 -14915 -5804 -10617 -6259 -5354 -11460 -12671 -11441 -4935 -872 -3833
16757c833k034K699l983k823n58p58l031p438l645m712o86K427J823n147O577
$$ -3833 -5867 -3168 -7151 -9974 -10532 -11290 -14321 -21759 -25404 -30116 -30802 -28375 -26552 -31699 -25122
16742b5122j358M051K810N079N892j2924k379J5641J5855L069j8183o088J462
$$ -25122 -26480 -22429 -19619 -14540 -8648 -21572 -23951 -8310 7545 10614 -7569 -13657 -12195
16729a2195Q024q279Q947J4441j0086r905Q421R084j0380k640L958m05M137m246
$$ -12195 -4171 -12450 -3503 10938 852 -9053 -632 8452 -1928 -4568 -610 -1015 3122 -1124
16715a124n685R45R317R73j0326N555M682P782K476j799j0732m687O522J526M065
$$ -1124 -6809 -5864 3453 4426 -5900 -345 4337 12119 14595 12796 2064 -2623 3899 5425 9490
16700I490m81p661p259l023p37O04R960O10k418m2L519n0q725p439J0859L664
$$ 9490 9009 1348 -5911 -8934 -9671 -9067 893 1503 -915 -957 2562 2512 -6213 -13652 -2793 871
16684H71m457m304J296j983J767M957N15M188k331j854K769L812k145n155Q886
$$ 871 -3586 -7890 -6594 -8577 -6810 -1853 -1338 2850 519 -1335 1434 5246 3101 -2054 6832
16669F832Q425M446p914j9220n542J534P883o522j05j182n930m388J210J9403
$$ 6832 15257 19703 11789 -7431 -12973 -11439 -3556 -10078 -10183 -11365 -17295 -21683 -20473 -1070
16655a070k9j457P57n211N562O979l378j1736o979m617j560l279Q702j780l007
$$ -1070 -1099 -2556 -1799 -7010 -1448 5531 2153 -9583 -16562 -21179 -22739 -26018 -17316 -19096 -22103
16640b2103K405L222M021l150j063N705J533j1269k863r49Q147N597P823Q829
$$ -22103 -19698 -16476 -12455 -15605 -16668 -10963 -9430 -20699 -23562 -24511 -16364 -10767 -2944 5885
16626E885J901M026k644j4929q86q757l855J0950J8868j266j1210L689q101k417
$$ 5885 7786 11812 9168 -5761 -6647 -15404 -19259 -8309 10559 9293 -1917 1772 -6329 -8746
16612h746j442L470J0547J5903P674O50j6751j0390l331Q478J634m030j1075m3
$$ -8746 -10188 -6718 3829 19732 27406 28056 11305 915 -2416 6062 7696 3666 -7409 -7452
16598g452L923M708p915L580r70J2333J3379m934r908J109J285J356j225m724
$$ -7452 -3529 1179 -6736 -3156 -4126 8207 21586 16652 6744 7853 9138 10494 9269 4545
16584D545N345J67p347j110j4563J503M237j495L277m418l562r782Q093J1747
$$ 4545 9890 10057 2710 1600 -12963 -11460 -7223 -8718 -5441 -9859 -13421 -23203 -15110 -3363
16570c363J610J3501L970n323p187j0200J98L777r87K647L274o625m737J0383
$$ -3363 -1753 11748 15718 10395 3208 -6992 -6794 -3017 -4004 -1357 1917 -4708 -9445 938
16556I38R44r847j0070m969N870j164o754L149R215o649n69J5390R964m259M16
$$ 938 1882 -7965 -18035 -23004 -17134 -18298 -25052 -21903 -12688 -19337 -19906 -4516 5448 1189 1605
16541A605k836j1120j5630Q04J8340K758l628N943P664p392r966m023m446o596
$$ 1605 -1231 -12351 -27981 -27177 -8837 -6079 -9707 -3764 3900 -3492 -13458 -17481 -21927 -28523
16527b8523J0203O455O914l384Q705M780j2561j1223J492J106Q328J70p03J108
$$ -28523 -18320 -11865 -4951 -8335 370 5150 -7411 -18634 -17142 -16036 -7708 -7538 -8241 -7133
16513g133N15O306k828m835l633M459O125J178N97o868r1o824o553k106J0611
$$ -7133 -6618 -312 -3140 -7975 -11608 -7149 -1024 154 751 -6117 -6208 -13032 -19585 -21691 -11080
16498a1080J7242M490o794j2014n416r840L76R515O58R534l729p149J9790Q021
$$ -11080 6162 10652 3858 -8156 -13572 -23412 -23036 -13521 -12863 -3329 -7058 -14207 5583 13604
16484A3604j5290j1364O963j05r898L73M456J3235n597r115j256M313J283L404
$$ 13604 -1686 -13050 -6087 -6192 -16090 -15717 -11261 1974 -3623 -12738 -13994 -9681 -8398 -4994
16470d994p765q62k683K774J1031n05N283p574j2264l161J780J0424J2537K985
$$ -4994 -12759 -13621 -16304 -13530 -2499 -3004 2279 -5295 -17559 -20720 -18940 -8516 4021 7006
16456G006l147o043M060M656j3648l829k069k120p93P891j616L872k824M068P111
$$ 7006 3859 -2184 1876 6532 -7116 -10945 -13014 -15134 -15927 -8036 -9652 -5780 -8604 -4536 2575
16441B575j664j4626j6622K658J0574Q209P781M520q603o27O990K984l07N688
$$ 2575 911 -13715 -30337 -27679 -17105 -8896 -1115 3405 -5198 -5825 1165 4149 3842 9530
16427I530R71j0749q755N702k191l532m011J597O728j3362p28P56k703q164J840
$$ 9530 10501 -248 -9003 -3301 -5492 -9024 -13035 -11438 -4710 -18072 -18800 -18044 -20747 -28911 -27071
16412b7071M192R991P790m33p633l460q046J1948J6140K898l04K174r726j4295
$$ -27071 -22879 -12888 -5098 -5531 -13164 -16624 -24670 -12722 3418 6316 6012 8186 -1540 -15835
16398a5835o575M430J003J4760P065p866J90k031m724Q665l300j2038N98R834
$$ -15835 -22410 -17980 -16977 -2217 4848 -3018 -2828 -4859 -9583 -918 -4218 -16256 -15658 -5824
16384e824J0415l26j885l092J1748J779q748k584k6j47l890k153j0549m361N575
$$ -5824 4591 4265 2380 -712 11036 12815 4067 1483 1457 1310 -2580 -4733 -15282 -19643 -14068
16369a4068J2835J4077M228o762j8359r613N161M587J0253k769K407k991q384
$$ -14068 -1233 12844 17072 10310 -8049 -17662 -12501 -7914 2339 -430 1977 -1014 -9398
16356i398m32p280l539J767K6671K039o521n955O594M29q168J0849o479o050k914
$$ -9398 -9830 -17110 -20649 -18882 7789 9828 3307 -2648 3946 4375 -3793 7056 577 -5473 -8387
16341h387N708K03o25J5027O039j3791q312o855r008O341l269R549J813j3111
$$ -8387 -2679 -2476 -3101 11926 17965 4174 -4138 -10993 -20001 -13660 -16929 -7380 -5567 -18678
16327a8678K8O623J879j913q477l196P132j736K942K464O701J0805l901o611k225
$$ -18678 -18650 -12027 -10148 -12061 -20538 -23734 -16602 -18338 -15396 -12932 -6231 4574 673 -5938 -8163
16312h163k119m01L340M268J433J5523M672j184m798Q574J9490O314p529L568
$$ -8163 -10282 -10683 -7343 -3075 -1642 13881 18553 17369 12571 21145 40635 46949 39420 42988
16298D2988o41p32j183L033N555J6380J2490n062o620o562J892Q561q28k566p919
$$ 42988 42347 41615 40432 43465 49020 65400 77890 72828 66208 59646 61538 70099 69271 66705 58786
16283E8786j6175N434M536J235o814M692m357q083j1236K310K274J3764O932p008
$$ 58786 42611 48045 52581 53816 47002 51694 47337 39254 28018 30328 32602 46366 53298 46290
16269D6290j1163j2015l698o352k19M849r282l808j5862j3936Q282N206q06J3251
$$ 46290 35127 23112 19414 13062 12843 17692 8410 4602 -11260 -25196 -16914 -11708 -12514 737
16255G37N928n214j1996M572N988m033n446N361M505K992J0471M697q973j4694
$$ 737 6665 1451 -10545 -5973 15 -4018 -9464 -4103 402 3394 13865 18562 9589 -5105
16241e105l098L345J0182N355J945j5395R479J8321o665j9063l847N439O55K289
$$ -5105 -8203 -4858 5324 10679 12624 -2771 6708 25029 18364 -699 -4546 893 1548 3837
16227C837J242l291N586n719l3L765j06j3942q790m651K249K300l992Q194K779
$$ 3837 5079 1788 7374 1655 1622 5387 5281 -8661 -17451 -22102 -19853 -17553 -21545 -13351 -10572
16212a0572p109p727n144M450J0951J2518l564k861m461L437P428j779j0727r094
$$ -10572 -17681 -25408 -30552 -26102 -15151 -2633 -6197 -9058 -13519 -10082 -2654 -4433 -15160 -24254
16198b4254O581m825n878J1703L651L246j208Q247N429m179l309q456o376o196
$$ -24254 -17673 -22498 -28376 -16673 -13022 -9776 -10984 -2737 2692 -1487 -4796 -13252 -19628 -25824
16184b5824J0125J2258K18l128l476o938m648O433r00j1590j912J293J1675m931
$$ -25824 -15699 -3441 -3223 -6351 -9827 -16765 -21413 -14980 -15880 -27470 -29382 -28089 -16414 -21345
16170b1345n740N727m823J20l110o154J1133J2077M212j822M352L719nm944p161
$$ -21345 -27085 -21358 -26181 -26061 -29171 -35325 -24192 -12115 -7903 -9725 -5373 -1654 -1659 -6603 -13764
16155a3764J06j622J0608O887N11K357k384P620j933j3455q093k818l862j59j40
$$ -13764 -13658 -15280 -4672 2215 2726 5083 2699 10319 8386 -5069 -13162 -15980 -19842 -20001 -20141
16140b0141R895Q934k387q252p096M616J2550m83m033k628o342M349J016j509
$$ -20141 -10246 -1312 -3699 -11951 -19047 -14431 -1881 -2364 -6397 -9025 -15367 -11018 -10002 -11511
16126a1511J84Q31M010R31R58O444M165j898l78o944J175j432J937n122O47k297
$$ -11511 -11327 -10496 -6486 -5555 -4597 1847 6012 4114 3736 -3208 -2033 -3465 -1528 -6650 -6003 -8300
16110h300o698K292J0699J0632N549N17j0139o873M601K891n617K261M559m378
$$ -8300 -14998 -12706 -2007 8625 14174 14691 4552 -2321 2280 5171 -446 1815 6374 1996
16096A996k1858l226R408L525N332l614J660O773K147j1624J1158R757l022O855
$$ 1996 -19862 -23088 -13680 -10155 -4823 -8437 -6777 -4 2143 -9481 1677 11434 8412 15267
16082A5267M792L292J7630J1082J4950J2180J8492K2760K252j5669j6080n094
$$ 15267 20059 23351 40981 52063 67013 79193 97685 120445 122697 107028 90948 85854
16070H5854r715j0434j5761j5763j2060o201m858m199P28r643O448l303n682L063
$$ 85854 76139 65705 49944 34181 22121 15920 11062 6863 7591 -2052 4396 1093 -4589 -1526
16056a526R07j3181k24M825k920K332N356J3673J0269k162m294l138j3312k065
$$ -1526 -619 -13800 -14024 -9199 -12119 -9787 -4431 9242 19511 17349 13055 9917 -3395 -5460
16042e460M986P953J1087n349j461j2745L776J0529l005j2839j153K855q951K643
$$ -5460 -474 7479 18566 13217 11756 -989 2787 13316 10311 -2528 -3681 -826 -9777 -7134
16028g134Q38N649O131L702l503p118R399k242j4544j638k707O047J484j165k825
$$ -7134 -6296 -647 5484 9186 5683 -1435 7964 5722 -8822 -10460 -13167 -7120 -5636 -6801 -9626
16013i626L718l663J101O787j3601j2681M347R553P842k615l845J5914m608p806
$$ -9626 -5908 -9571 -8470 -1683 -15284 -27965 -23618 -14065 -6223 -8838 -12683 3231 -1377 -9183
15999i183N303j4077o00J8028q17l616M711K871m500m60k772L37K407qK003o861
$$ -9183 -3880 -17957 -18557 -529 -1346 -4962 -251 2620 -1880 -2340 -5112 -4775 -2368 -2376 -373 -7234
15983g234l911k074k249j325j793O778n053J643j99k781K511P01l450R079n953
$$ -7234 -11145 -13219 -15468 -16793 -18586 -11808 -16861 -15218 -15417 -18198 -15687 -14986 -18436 -9357 -15310
15968a5310l078O403P0J967O515J2171j0424j1500M265R893J961n973o660j128
$$ -15310 -18388 -11985 -11915 -9948 -3433 8738 -1686 -13186 -8921 972 2933 -3040 -9700 -10828
15954a0828p680J4421K205K100n539m326n825l68K933J4480N791M668j7032j2282
$$ -10828 -18508 -4087 -1882 218 -5321 -9647 -15472 -15840 -12907 1573 7364 12032 -5000 -17282
15940a7282O71o351N666K905k060O184M636r803o725n08k636R926M329j309l479
$$ -17282 -16611 -22962 -17296 -14391 -16451 -10267 -5631 -15434 -22159 -22667 -25303 -15377 -11048 -12357 -15836
15925a5836o144J93l358n82P467J500j220n159P771n157K463J1248l33N07N870
$$ -15836 -21980 -21787 -25145 -25727 -18260 -16760 -17980 -23139 -15368 -20525 -18062 -6814 -7147 -6640 -770
15910g70m40J194o152n682K485k575R55O509m743M314K037q703J3704k050k810
$$ -770 -1210 -16 -6168 -11850 -9365 -11940 -10985 -4476 -9219 -4905 -2868 -11571 2133 83 -2727
15895b727N035p64n593kJ531J159n756K756R310L547o905p489K853J2390P371
$$ -2727 2308 1544 -4049 -4051 -2520 -1361 -7117 -4361 4949 8496 1591 -5898 -3045 9345 16716
15880A6716K436m008j0055j4760j262N258Q57M62L54K95p764r156o089j420M275
$$ 16716 19152 15144 5089 -9671 -10933 -5675 -4818 -4356 -4002 -3707 -11471 -20627 -26716 -28136 -23861
15865b3861J0657R389n324m137M335j4243j1244K1037J6998K717q50l340K982
$$ -23861 -13204 -3815 -9139 -13276 -8941 -23184 -34428 -13391 3607 6324 5474 2134 5116
15852E116m217M72j300O23M416J5662N97k2499o582L698P943P494Jn078r452L050
$$ 5116 899 1371 71 694 5110 20772 21369 -1130 -7712 -4014 3929 11423 11424 6346 -3106 -56
15836e6J0381q308m722m007L255l428j1506P639P846p855p778O001J511J030k610
$$ -56 10325 2017 -2705 -6712 -3457 -6885 -18391 -10752 -2906 -10761 -18539 -12538 -11027 -9997 -12607
15821a2607k805m301q268O925K351l48j790R359M659J537k247M006Q288L242p184
$$ -12607 -15412 -19713 -27981 -21056 -18705 -19053 -20843 -11484 -6825 -5288 -7535 -3529 4759 8001 817
15806H17j1607N931L11m99O202P64q282k531m623n032o653N236P496K848p438
$$ 817 -10790 -4859 -4548 -5047 1155 1919 -6363 -8894 -13517 -18549 -25202 -19966 -12470 -9622 -17060
15791a7060l500L292m63L754P867Q655J420N071j203O841n447o624k774m42l557
$$ -17060 -20560 -17268 -17731 -13977 -6110 2545 3965 9036 7833 14674 9227 2603 -171 -613 -4170
15776d170l003O371M967o809P307l831p471K972J8236j687j6937N101J4203K035
$$ -4170 -7173 -802 4165 -2644 4663 832 -6639 -3667 14569 12882 -4055 1046 15249 17284
15762A7284r630o450l934o07o571p133M42P482J0333P660O014k268q662j2719
$$ 17284 7654 1204 -2730 -3337 -9908 -17041 -16599 -9117 1216 8876 14890 12622 3960 -8759
15748h759k689m6q550q708j423Q174O762N011N760J317K749j2051K370m841L144
$$ -8759 -11448 -11494 -20044 -28752 -30175 -22001 -15239 -10228 -4468 -3151 -402 -12453 -10083 -14924 -11780
15733a1780N685N099K261q914N826R42l27o436j739P680j10l107O405K164L945
$$ -11780 -6095 -996 1265 -7649 -1823 -881 -1208 -7644 -9383 -1703 -1813 -4920 1485 3649 7594
15718G594n161j0678l380M714l270q51K252o859l935J2835O518K214M275L667
$$ 7594 2433 -8245 -11625 -6911 -10181 -11032 -8780 -15639 -19574 -6739 -221 1993 6268 9935
15704I935N504q362j2573k147N012p401J217Q273P793p636j0611j708K745J0978
$$ 9935 15439 7077 -5496 -7643 -2631 -10032 -8815 -542 7251 -385 -10996 -12704 -9959 1019
15690A019r733j1764R961R579o472o909R549q42q065K791p26Q250j17L361O243
$$ 1019 -8714 -20478 -10517 -938 -7410 -14319 -4770 -5612 -13677 -10886 -11612 -3362 -3479 -118 6125
15675F125p620o303Q715j845j4030J236O410k688l752j150m450P694N075O444
$$ 6125 -1495 -7798 917 -928 -14958 -13722 -7312 -10000 -13752 -14902 -19352 -11658 -6583 -139
15661a39l037j286o758k507m918J0205P291j2651j0414L394N811J2810J2798N531
$$ -139 -3176 -4462 -11220 -13727 -18645 -8440 -1149 -13800 -24214 -20820 -15009 -2199 10599 16130
15647A6130m993j0650J561m833j5046l530r35J154j269Q458J980o27O843M199
$$ 16130 11137 487 2048 -2785 -17831 -21361 -22296 -21142 -22411 -13953 -11973 -12600 -5757 -1558
15633a558M756N4O728o904j2348k924l094J0489J042p675l193N466p339j515O769
$$ -1558 3198 3252 9980 3076 -9272 -12196 -15290 -4801 -3759 -11434 -14627 -9161 -16500 -18015 -11246
15618a1246J3108j038n182N486j1037J0458J4009r97j753j064j023n854j351o083
$$ -11246 1862 824 -4358 1128 -9909 549 14558 13561 11808 10744 9721 3867 2516 -3567
15604c567p483o982R419L408j4930N751p490k867K46L297P46J020J917M786Q9
$$ -3567 -11050 -18032 -8613 -5205 -20135 -14384 -21874 -24741 -24495 -21198 -20452 -19432 -17515 -12729 -12640
15589a2640j2422p252J6965J4210l683j0003J7902J1622j1956n955M065L086O970
$$ -12640 -25062 -32314 -15349 -1139 -4822 -14825 3077 14699 2743 -3212 853 3939 10909
15576A0909k436M729Q805L180j027n480j4643j903P787N86m686j55p782q061j0176
$$ 10909 8473 13202 22007 25187 24160 18680 4037 2134 9921 10507 5821 5666 -2116 -10177 -20353
15561b0353J847J4476J5379l204o96j921M31J0922n097q033m926k008k915K733
$$ -20353 -18506 -4030 11349 8145 7449 5528 5959 16881 11784 3751 -1175 -3183 -6098 -3365
15547c365j675K155N243J037q00p440K222J2040J1454J623n571j3632l011k150
$$ -3365 -5040 -2885 2358 3395 2595 -4845 -2623 9417 20871 22494 16923 3291 280 -1870
15533a870J0023j341M500k562o123m785L278k546o885O067N512k237n108K655
$$ -1870 8153 6812 11312 8750 2627 -2158 1120 -1426 -8311 -2244 3268 1031 -4077 -1422
15519a422j84j0310Q348Q419m168k188j625O577J9629N093k5n904M251o919j3763
$$ -1422 -1606 -11916 -3568 4851 683 -1505 -3130 3447 23076 28169 28144 22240 26491 19572 5809
15504E809M305L391o139K974p313j1811K700M068K731L683q145K603L034j900
$$ 5809 10114 13505 7366 10340 3027 -8784 -6084 -2016 715 4398 -3747 -1144 1890 -10
15490a0o421P41j95n427N771J168J2896R135O30q250j0756J656M589N412K042
$$ -10 -6431 -5690 -5885 -11312 -5541 -4373 8523 17658 18288 10038 -718 938 5527 10939 12981
15475A2981J701J0975J1418l182j0440p964o606o371q385n21Q299O822J110k581
$$ 12981 14682 25657 37075 33893 23453 15489 8883 2512 -5873 -6394 1905 8727 9837 7256
15461G256o721j412R887K94p741j4124k188M937j587l792R365J191O980J370M164
$$ 7256 535 -877 9010 9304 1563 -12561 -14749 -9812 -11399 -15191 -5826 -4635 2345 3715 7879
15446G879Q034k556J969M745K973n258j2691n371k372P160L645j7890j1165J0799
$$ 7879 15913 13357 15326 20071 23044 17786 5095 -276 -2648 4512 8157 -9733 -20898 -10099
15432a0099M379n833m784R142N179r685J783J8033J0751q31J760m415L199M409
$$ -10099 -5720 -11553 -16337 -7195 -2016 -11701 -9918 8115 18866 18035 19795 15380 18579 22988
15418B2988M945K827P151L456j0261L53m108j9088n938O768J830m146n88L733
$$ 22988 27933 30760 37911 41367 31106 31459 27351 8263 2325 9093 10923 6777 6189 9922
15404I922m608L025K278r378l022R339M954q35L932l694o379L675L841K911J259
$$ 9922 5314 8339 10617 1239 -1783 7556 12510 11675 15607 11913 5534 9209 13050 15961 17220
15389A7220L282K716R340j044P984O038J6102K1768P605j1394r836q321l656m431
$$ 17220 20502 23218 32558 31514 39498 45536 61638 83406 91011 79617 69781 61460 57804 53373
15375E3373n087j6282k754R43J0358J6196M230o619o255p340j0555N732Q633K2
$$ 53373 48286 32004 29250 30193 40551 56747 60977 54358 48103 40763 30208 35940 44573 44595
15361D4595k477q187m885J353P53Q691o19P141o93l559J059J6509n638R898J7980
$$ 44595 42118 33931 29046 30399 31152 39843 39224 46365 45672 42113 43172 59681 54043 63941 81921
15346H1921N99J923K035o949O531p383m125R349K654K0735O787m659r537o046
$$ 81921 82520 84443 86478 79529 86060 78677 74552 83901 86555 107290 114077 109418 99881 93835
15332I3835n368k352P044Q192J3408O83p346o237L967K0730J2362J3612J2234
$$ 93835 88467 86115 93159 101351 114759 115442 108096 101859 105826 126556 138918 152530 164764
15319A64764J340J9230J7347J2020J8983K2789K1762J7620K3147K6407J9999L9906
$$ 164764 166104 185334 202681 214701 233684 256473 278235 295855 319002 345409 365408 405314
15307D05314O0291P1352Q1668Q7897P6578J13361J54906J95533K35989L11366
$$ 405314 465605 536957 618625 706522 783100 896461 1051367 1246900 1482889 1794255
15297A794255M19783N64122P82771J094170J617780K375272L244178L582745K448526
$$ 1794255 2214038 2778160 3560931 4655101 6272881 8648153 11892331 15475076 17923602
15288A7923602L8060k158556l098538k928988k292832j678016j187344q24413
$$ 17923602 17961662 15803106 12704568 9775580 7482748 5804732 4617388 3792975
15280C792975n77187m28977l24698k50843j69544j28129q7398l4539L181J9051
$$ 3792975 3215788 2786811 2462113 2211270 2041726 1913597 1826199 1791660 1794841 1813892
15270A813892P3123J09290J47147J89433K50256L58193M77584O16976Q39447J145925
$$ 1813892 1887015 1996305 2143452 2332885 2583141 2941334 3418918 4035894 4875341 6021266
15260F021266J597310K311300L486771N253819P395690Q728693O971058J312744
$$ 6021266 7618576 9929876 13416647 18670466 26066156 34794849 41765907 43078651
15252D3078651n156473q334296q018323o046429m129761k760613j840822j275348
$$ 43078651 37922178 29587882 21569559 15523130 11393369 8632756 6791934 5516586
15244E516586r18900o79616n20357m01883l18517k40911j83041j23756o1092l1956
$$ 5516586 4597686 3918070 3397713 2995830 2677313 2436402 2253361 2129605 2068513 2036557
15234B036557p733K9767P6340J23713J83222K45563L33341M38139N91973Q27363
$$ 2036557 2028824 2058591 2134931 2258644 2441866 2687429 3020770 3458909 4050882 4878245
15224D878245J189756J738892K545612L519384M027393L018092L25763k429161
$$ 4878245 6068001 7806893 10352505 13871889 17899282 20917374 21243137 18813976
15216A8813976l786694l709407k922997k115747j484487j047102p24822n37725
$$ 18813976 15027282 11317875 8394878 6279131 4794644 3747542 3022720 2484995
15208B484995m08885l30859k58798k10417j95818j40973j07659q8094p2435n5858
$$ 2484995 2076110 1745251 1486453 1276036 1080218 939245 831586 743492 671057 615199
15198F15199n9086n1280l7981l5810k9671k2689j4065k4494k6143k1505j4607
$$ 615199 556113 504833 466852 431042 401371 378682 364617 340123 313980 292475 277868
15187B77868q105p223j1418r931j2022j7809j570l61k4730o077M686m107o24r431
$$ 277868 269763 262540 251122 241191 229169 211360 209790 209429 184699 178622 183308 179201 178577 169146
15173A69146j2610j321j2006j9155M61R532p045j2144n941o342k067o125J912
$$ 169146 156536 155215 143209 124054 124515 134047 127002 114858 108917 102575 100508 94383 96295
15160I6295M885l072m491n390k931j986K954J497k759P688m091j2708j091N992
$$ 96295 101180 98108 93617 88227 85296 83310 86264 87761 85002 92690 88599 75891 74800 80792
15146H0792N921K9j3696p799M65J0368N567j6496j3777n966R96P123J0474N557
$$ 80792 86713 86742 73046 65247 65712 76080 81647 65151 51374 45408 46404 53527 64001 69558
15132F9558N34m56j1876q881k0196j0284n987J2261Q972M751j801q046N389J256
$$ 69558 70092 69636 57760 48879 28683 18399 12412 24673 33645 38396 36595 28549 33938 35194
15118C5194j8763j4181N642N851J3401K923k071p212q71j2335N83J0923l776O215
$$ 35194 16431 2250 7892 13743 27144 30067 27996 20784 19913 7578 8161 19084 15308 21523
15104B1523M32l301p088m313J7173Q220R2R253L763L324j6518j4194j1242j0769
$$ 21523 21955 18654 11566 7253 24426 32646 32738 41991 45754 49078 32560 18366 7124 -3645
15090c645n809o120O515J2706o848k356J3466J2423j0695j4731K479J7944L434
$$ -3645 -9454 -15574 -9059 3647 -3201 -5557 7909 20332 9637 -5094 -2615 15329 18763
15077A8763p228J643J2290O14o351q531k099K638J0203q531j2537n860J5809N198
$$ 18763 11535 13178 25468 26082 19731 11200 9101 11739 21942 13411 874 -4986 10823 16021
15063A6021k523L20n889L165J4908L984r405n8P582m093k077P005j2818j6872
$$ 16021 13498 13818 7929 11094 26002 29986 20581 20523 28105 24012 21935 28940 16122 -750
15049g50n050J67R951J7850J363p322k293p495P056L239j1559j990Q359J232p549
$$ -750 -5800 -5633 4318 22168 23531 16209 13916 6421 13477 16716 5157 3167 11526 12758 5209
15034E209P01L88M030J442P476o47m789j1119K96P711n295R426Q276k916P056
$$ 5209 5910 6298 10328 11770 19246 18599 13810 2691 2987 10698 5403 14829 23105 20189 27245
15019B7245O56j5036N918J0919K00L894j2847l246K261p411q347o46N182J0069
$$ 27245 27901 12865 18783 29702 29902 33796 20949 17703 19964 12553 4206 3560 8742 18811
15005A8811r719j283O479p300n928m936K787j0249m326J132J1758P748N771J237
$$ 18811 9092 7809 14288 6988 1060 -3876 -1089 -11338 -15664 -14532 -2774 4974 10745 11982
14991A1982L092P268n147m529L697O043k392k96N885j4037q26m642L029M499M787
$$ 11982 15074 22342 17195 12666 16363 22406 20014 19718 25603 11566 10740 6098 9127 13626 18413
14976A8413p837n915Q2k011M608L667j861o506n947L726l248l663R169j0975l920
$$ 18413 10576 4661 4743 2732 7340 11007 9146 2640 -3307 419 -2829 -6492 2677 -8298 -12218
14961a2218J968P770j63o286j249O052N038j4203l279M53P677Q786p721j584N916
$$ -12218 -10250 -2480 -2643 -8929 -10178 -4126 912 -13291 -16570 -16117 -8440 346 -7375 -8959 -3043
14946c043N557O873o654k226l274l735r689q95n063Q094R273q453m829m465J989
$$ -3043 2514 9387 2733 507 -2767 -6502 -16191 -17086 -22149 -14055 -4782 -13235 -18064 -22529 -20540
14931b0540R645q579K405Q646M548O164J3324j2521j0498N216m32l267k273K5
$$ -20540 -10895 -19474 -17069 -8423 -3875 2289 15613 3092 -7406 -2190 -2622 -5889 -8162 -8137
14917h137m611j2398J2409J9272R693m753r843K728L325j2766j5770M763K268
$$ -8137 -12748 -25146 -12737 6535 16228 11475 1632 4360 7685 -5081 -20851 -16088 -13820
14904a3820n373n357L797J2876L482k983J1914J0146J794J318J944L212N954k479
$$ -13820 -19193 -24550 -20753 -7877 -4395 -7378 4536 14682 16476 17794 19738 22950 28904 26425
14890B6425p723l987j0487K586m068m160J110r611M47K382r0N29N031J1351J0408
$$ 26425 18702 14715 4228 6814 2746 -1414 -304 -9915 -9468 -7086 -7176 -6647 -1616 9735 20143
14875B0143m797J791O624k1734m714L299k87j313j804P542J0342j290l969M819
$$ 20143 15346 17137 23761 2027 -2687 612 325 -988 -2792 4750 15092 13802 9833 14652
14861A4652N310j011l250L118J917m970O5O557J413m251l954j1220k722Q384K0697
$$ 14652 19962 18951 15701 18819 20736 15766 15831 22388 23801 19550 15596 4376 1654 10038 30735
14846C0735J2298L190M164O712J5001L1203N0447N7861N6560M8282L4108o504
$$ 30735 43033 46223 50387 57099 72100 103303 153750 211611 268171 316453 350561 344057
14834C44057k6081m3953n0554l8782l6181l2725k9868k4939j5429j048P043l500
$$ 344057 317976 274023 223469 184687 148506 115781 85913 60974 45545 44497 51540 48040
14822D8040j4141K560l418r909l481j490J2670N36N273J1116J0413K044O038P381
$$ 48040 33899 36459 33041 23132 19651 18161 30831 31367 36640 47756 58169 60213 66251 73632
14808G3632J6948J5230J4076K4157M2287L8060L0635L0643M784j2217l1629m8903
$$ 73632 90580 105810 119886 144043 186330 224390 255025 285668 290452 278235 246606 197703
14796A97703n1342k7701k0352j6661j7858j8483j0519p542r047n558Q443N484
$$ 197703 146361 118660 98308 81647 63789 45306 34787 27245 18198 12640 21083 26567
14784B6567o236j0988n709j467J469Q92J5407O079m618n331n734J627J372j377
$$ 26567 20331 9343 3634 2167 3636 4528 19935 26014 21396 16065 10331 11958 13330 11953
14770A1953q311P276L551l338j498L536j6502n463J0074K381j2181j329l981J4721
$$ 11953 3642 10918 14469 11131 9633 13169 -3333 -8796 1278 3659 -8522 -9851 -13832 889
14756H89J4770j0046k381l042q351l426P970M527L799P398m923Q371L988j1999
$$ 889 15659 5613 3232 190 -8161 -11587 -3617 910 4709 12107 7184 15555 19543 7544
14742G544r829r115j1903J7627J5388J885j2926M151O005m134j963j6074r754
$$ 7544 -2285 -11400 -23303 -5676 9712 11597 -1329 2822 8827 4693 2730 -13344 -23098
14729b3098J546J4027J8535n214J875J1224q481J608n889j1229j831m410o329
$$ -23098 -21552 -7525 11010 5796 7671 18895 10414 12022 6133 -5096 -6927 -11337 -17666
14716a7666l937R212J2238N696M864P647Q592l143o603J328K022o680r560L368
$$ -17666 -21603 -12391 -153 5543 10407 18054 26646 23503 16900 18228 20250 13570 4010 7378
14702G378O384r094J1236n241o032q418p050K991N561q18K976J2137O337o887
$$ 7378 13762 4668 15904 10663 4631 -3787 -10837 -7846 -2285 -3103 -127 12010 18347 11460
14688A1460m476N771P962L8n868o698Q361M713j70M900M744j699m9p886R384J730
$$ 11460 6984 12755 20717 20755 14887 8189 16550 21263 21093 25993 30737 29038 28989 21103 30487 32217
14672C2217q121p942j135J649J797j1935m10r88P906p180j3071k613j701p774
$$ 32217 24096 16154 15019 16668 18465 6530 6120 5132 13038 5858 -7213 -9826 -11527 -19301
14658a9301J984k63J3480J4728q884J7358R777j4832j4313O28J5906J5512N656
$$ -19301 -17317 -17580 -4100 10628 1744 19102 28879 14047 -266 362 16268 31780 37436
14645C7436j331Q647J0827J1786l686j1541M85n920j4340j591m141L849K096p283
$$ 37436 36105 44752 55579 67365 63679 52138 52623 46703 32363 30772 26631 30480 32576 25293
14631B5293j1259j278l378j0562P665L283O950O727o617m480n437K161R660J12
$$ 25293 14034 12756 9378 -1184 6481 9764 16714 23441 16824 12344 6907 9068 18728 18840
14617A8840o662M80J158J0103M032K081o93O436r332O235Q706O934j900j3249
$$ 18840 12178 12658 13816 23919 27951 30032 29339 35775 26443 32678 41384 48318 46418 33169
14603C3169k525j802o860m963o030Q866N154J0901p827o451L023k251q145k046
$$ 33169 30644 28842 21982 17019 10989 19855 25009 35910 28083 21632 24655 22404 14259 12213
14589A2213M038r204j1943k77J0350J2336j02r192K187K157L654M353J0457n798
$$ 12213 16251 7047 -4896 -5173 5177 17513 17411 8219 10406 12563 16217 20570 31027 25229
14575B5229n229o96N369q86j3176L104Q530p500p663N26n59Q363L129Q295k532
$$ 25229 20000 19304 24673 23787 10611 13715 22245 14745 7082 7608 7049 15412 18541 26836 24304
14560B4304j1966j923J0098n152J323M147j233N048j2242j1222J7092L739m368
$$ 24304 12338 10415 20513 15361 16684 20831 19598 24646 12404 1182 18274 22013 17645
14547A7645R22r205q637M97N00J0558J4353n10N436K326M686N918l754j4946j1012
$$ 17645 18567 9362 725 1222 1722 12280 26633 26123 31559 33885 38571 44489 40735 25789 14777
14532A4777O642N861K39o92k443J3255R406o391j0380R592L127O758J4743J4175
$$ 14777 21419 27280 27519 26827 24384 37639 47045 40654 30274 39866 42993 49751 64494 78669
14518G8669J2328K1441K4881J8943J230p424j6440k8360k6923j5791q209j688
$$ 78669 90997 112438 137319 156262 157492 150068 133628 105268 78345 62554 54345 52657
14506E2657j036K891Q742N240J623l735K054m370m182k000K257J185J460m52j2364
$$ 52657 51621 54512 63254 68494 70117 66382 68436 64066 59884 57884 60141 61326 62786 62334 49970
14491D9970l58N877Q925J1371J1483J6931P097O468J4146J9895K4243K2362k309
$$ 49970 49612 55489 64414 75785 87268 104199 111296 117764 131910 151805 176048 198410 196101
14478A96101j5169j7890k2344j0112j1552j7727J53K935O837J1662M874m152j966
$$ 196101 180932 163042 140698 130586 119034 101307 101460 104395 111232 122894 127768 123616 121650
14465A21650N815N064l985o776n033J2009N429L793m664K14J5404J3234P280J3343
$$ 121650 127465 132529 128544 121768 116735 128744 134173 137966 133302 133516 148920 162154 169434 182777
14451A82777k322j0843K471R438J3510N719J1321J2400N886K0084J0547K635L461
$$ 182777 180455 169612 172083 181521 195031 200750 212071 224471 230357 250441 260988 263623 267084
14438B67084N729O926J4593Q922J0827Q581O793J8269K2763K5384J4600J7778
$$ 267084 272813 279739 294332 303254 314081 322662 329455 347724 370487 395871 410471 428249
14426D28249J8324K7091L4004K4884K4877L3980M9489N4686M9375M5916N0537
$$ 428249 446573 473664 507668 532552 557429 591409 640898 695584 744959 790875 841412
14415H41412N4396P0150P5813R6925J07773J34705J48951J57140J78416K38435
$$ 841412 895808 965958 1041771 1138696 1246469 1381174 1530125 1687265 1865681 2104116
14405B104116K77500L43677M31395N33842O52645P62445Q74320J040844J304745
$$ 2104116 2381616 2725293 3156688 3690530 4343175 5105620 5979940 7020784 8325529
14396H325529J723067K387906L434397N046022P447930J0651395J3817642J4450340
$$ 8325529 10048596 12436502 15870899 20916921 28364851 39016246 52833888 67284228
14388F7284228R829321P29620q121688j2767174j2875436j0558960p848345n615813
$$ 67284228 77113549 77843169 69721481 56954307 44078871 33519911 25671566 20055753
14380B0055753l968578k815521k019280j495011j127595q52257o67569n19821
$$ 20055753 16087175 13271654 11252374 9757363 8629768 7777511 7109942 6590121
14372F590121m00388k64882j29581J8593J36558K73817M22102N64833P16243R11315
$$ 6590121 6189733 5924851 5795270 5813863 5950421 6224238 6646340 7211173 7927416 8838731
14362H838731J167615J552577K153205L086528M475434O556669R360890J2271757
$$ 8838731 10006346 11558923 13712128 16798656 21274090 27830759 37191649 49463406
14354D9463406J3128914R218883Q53416p643369j2246224j2449115j0209661p556083
$$ 49463406 62592320 71811203 72664619 65021250 52775026 40325911 30116250 22560167
14346B2560167n359156l770605k667374j929610j448299j118143q85485p24760
$$ 22560167 17201011 13430406 10763032 8833422 7385123 6266980 5381495 4656735
14338D656735o17332n25227m51355l60288k76803k33623j98931j66520j54206
$$ 4656735 4039403 3514176 3062821 2702533 2425730 2192107 1993176 1826656 1672450
14329A672450j23339j06258j08084q4925o2921p9255q8884p1184n3669m4454l8600
$$ 1672450 1549111 1442853 1334769 1249844 1186923 1107668 1018784 947600 893931 849477 810877
14318H10877k9327l0273k6169l4969l5538l1747l2478k6346j3423k5657l1389
$$ 810877 781550 751277 725108 690139 654601 622854 590376 564030 550607 524950 493561
14307D93561k1553j4777k3297j3578r130j2836k4138j3646j8295j2436M419l72
$$ 493561 472008 457231 433934 420356 411226 398390 374252 360606 342311 329875 334294 333922
14295C33922j1426j7160j1184n719j4621k646j0376j1867n31J790M75L111o436
$$ 333922 322496 305336 294152 288433 273812 271166 260790 248923 248392 250182 250657 253768 247332
14282B47332p722l551k399r79p996j5867r342L088j19r281j164Q356J2326o125
$$ 247332 239610 236059 233660 232681 224685 208818 199476 202564 202445 193164 192000 200356 212682 206557
14268B06557j1816j0461r416q853n086j0972k1343k5369j7677J409J1401L477
$$ 206557 194741 184280 174864 166011 160925 149953 128610 103241 85564 86973 98374 101851
14256A01851p421k671J3671J1250q773p227J4210P205j0644L39K429q581r807
$$ 101851 94430 91759 105430 116680 107907 100680 114890 122095 111451 111790 114219 105638 95831
14243I5831p292M323J708n242l548J9906N486R971N761O175j434J300L457j993
$$ 95831 88539 92862 94570 89328 85780 105686 111172 121143 126904 133079 131645 132945 136402 134409
14229A34409o302j6283j9332k7972j5139l895j5990O613J2611R271Q5j0664r548
$$ 134409 128107 111824 92492 64520 49381 45486 29496 36109 48720 57991 58076 47412 37864
14216C7864O760K387N13j838R314P872M177J176p530K120r06p830m099L24L445
$$ 37864 44624 47011 47524 45686 55000 62872 67049 68225 60695 62815 61909 54079 49980 50304 53749
14201E3749j3963o309N740K779J8303J1253j665K441Q152j434l28l964q805m17
$$ 53749 39786 33477 39217 41996 60299 71552 69887 72328 80480 79046 78718 74754 65949 65532
14187F5532j918L458r463j9216o391k570K674K998M308K88m557Q073j222J4257
$$ 65532 63614 67072 57609 38393 32002 29432 32106 35104 39412 39700 35143 43216 41994 56251
14173E6251N800r296j0998m607k819j328O817N586q338j2826j156J1282R798L432
$$ 56251 62051 52755 41757 37150 34331 33003 39820 45406 37068 24242 23086 34368 44166 47598
14159D7598q441p367R50M180j899J0862p420r36m247m875M70Q69J8283L257j128
$$ 47598 39157 31790 32740 36920 35021 45883 38463 37527 33280 28405 28875 29744 48027 51284 50156
14144E0156O36K027k410k373j1221k958L185p844k374l237k86P444R604j124m944
$$ 50156 50792 52819 50409 48036 36815 33857 37042 29198 26824 23587 23301 30745 40349 39225 34281
14129C4281j1411j037K958K482L173K709r275l845P253K926L155Q048J123J946
$$ 34281 22870 21833 24791 27273 30446 33155 23880 20035 27288 30214 33369 41417 42540 44486
14115D4486q717O379J304n020l662q980k0040j9689J818J2674m857L263J574P510
$$ 44486 35769 42148 43452 38432 34770 25790 5750 -13939 -12121 553 -4304 -1041 533 8043
14101H043O104P708N171J880k455M38J546M10J724J4744R196J015j6842j1119
$$ 8043 14147 21855 27026 28906 26451 26889 28435 28845 30569 45313 54509 55524 38682 27563
14087B7563n058j2057J906N263j651J0673Q654J564o814J110j3205q307K135m119
$$ 27563 22505 10448 12354 17617 15966 26639 35293 36857 30043 31153 17948 9641 11776 7657
14073G657m7N354J0917J2918k554l501m702P69r513j580K174M8L194M597j660
$$ 7657 7610 12964 23881 36799 34245 30744 26042 26811 17298 15718 17892 17940 21134 25731 24071
14058B4071J07j156j1208m258j266l065M105P552R243K956J744N681k778j395
$$ 24071 24178 23022 11814 7556 6290 3225 7330 14882 24125 27081 28825 34506 31728 30333
14044C0333R695J998r576j2529j658o788j871q72Q993R214N509J1537K1476Q943
$$ 30333 40028 42026 32450 19921 18263 11475 9604 8732 17725 26939 32448 43985 65461 74404
14030G4404p146n415r334j3266p497l800k937K219K037n675o228l923L557O86
$$ 74404 67258 61843 52509 39243 31746 27946 25009 27228 29265 23590 17362 13439 16996 17682
14016A7682L366n262J0944J2935j500r838p137L202k18q58o292p936j1972P5K810
$$ 17682 21048 15786 26730 39665 38165 28327 21190 24392 24174 23316 17024 9088 -2884 -2809 1
14001AP149J3410M441j349J81n738j0919o51P40p001l117M010j349m307N56J0980
$$ 1 7150 20560 25001 23652 23833 18095 7176 6525 7265 264 -2853 1157 -192 -4499 -3943 7037
13985G037L776J946N15O572J964r303M01O839J376p923j440R449N173N060L676
$$ 7037 10813 12759 13274 19846 21810 12507 12908 19747 21123 13200 11760 21209 26382 31442 35118
13970C5118j8047j4292K577P076k412M801J6011n741p573j3248q497L990J1286
$$ 35118 17071 2779 5356 12432 10020 14821 30832 25091 17518 4270 -4227 -237 11049
13957A1049P733j134n583M184K748M225l686J0380O77p434j0R053M898Q619J0379
$$ 11049 18782 17648 12065 16249 18997 23222 19536 29916 30593 23159 23149 32202 37100 45719 56098
13942E6098J2526O207j38J1762K8295L1874K9387M9868N9567M4622J1105j4720
$$ 56098 68624 74831 74693 86455 114750 146624 176011 225879 285446 330068 341173 326453
13930C26453m9312m6846m5122l4498l3829k2252j0299j5147j7183j2677m399O942
$$ 326453 277141 230295 185173 150675 116846 94594 84295 69148 51965 39288 34889 41831
13918D1831Q724M740j4921r285j129P573m278j037k686M787J6051P799Q23J4331
$$ 41831 50555 55295 40374 31089 29960 37533 33255 32218 29532 34319 50370 58169 58992 73323
13904G3323J4806J8253J5210M4985O6176N7482M0641N318m1626m8320m3772m0125
$$ 73323 88129 106382 121592 166577 232753 290235 330876 336194 294568 246248 202476 162351
13892A62351l5697l2811l3762j1961o861n818j2002Q074k982P51Q254Q50K511
$$ 162351 126654 93843 60081 48120 41259 35441 23439 31513 28531 29282 37536 38386 40897
13879D0897r069j0334J438l453K78Q107j730j833j7473n958M804K25K29N716J3451
$$ 40897 31828 21494 22932 19479 19757 27864 26134 24301 6828 870 5674 5899 6128 11844 25295
13864B5295N932P59k135j3068q788J0504J212M987m613q469p563l472Q576J3976
$$ 25295 31227 31986 29851 16783 7995 18499 19711 24698 20085 11616 4053 581 9157 23133
13850B3133j2858r219N937l011l147j149K822Q274P098K341n566j443j1414o473
$$ 23133 10275 1056 6993 3982 835 -314 2508 10782 17880 20221 14655 13212 1798 -4675
13836d675J592L732k043P466M73j454n282l325K192m110R1P178J0963K868J91
$$ -4675 -3083 649 -1394 6072 6545 5091 -191 -3516 -1324 -5434 -5343 1835 12798 15666 15857
13821A5857J2528P738o962n639l745p852j2711j2550O689J3012N132P350M212
$$ 15857 28385 36123 29161 23522 19777 11925 -786 -13336 -6647 6365 11497 18847 23059
13808B3059o076M517K719r694M899J2705J8265q875j6627j7863j9909r878R167
$$ 23059 16983 21500 24219 14525 19424 32129 50394 41519 24892 7029 -12880 -22758 -13591
13795a3591O789M543J1646K907r013j0055P392j1612O094k666k92L867n035L767
$$ -13591 -6802 -2259 9387 12294 3281 -6774 618 -10994 -4900 -7566 -7858 -3991 -9026 -5259
13781e259O759K740J059L278J757K287l231M229l59Q68k169n699K265P345l468
$$ -5259 1500 4240 5299 8577 10334 12621 9390 13619 13260 14128 11959 6260 8525 15870 12402
13766A2402m918n425N584J2439J6994k804p354O687p333j19j0840j9768k147N604
$$ 12402 7484 2059 7643 20082 37076 34272 26918 33605 26272 26153 15313 -4455 -6602 -998
13752i98k870k561j0072Q373J6574J4562m276o782j0264o95K286R986J1574J7833
$$ -998 -3868 -6429 -16501 -8128 8446 23008 18732 11950 1686 991 3277 13263 24837 42670
13738D2670o303j1464N814o134j2855N777n197j1958K683n924m749L820J8232
$$ 42670 36367 24903 30717 24583 11728 17505 12308 350 3033 -2891 -7640 -3820 14412
13725A4412J5423K126L421m960K690J81q226K606K396M420N295j0969m318k437
$$ 14412 29835 31961 35382 30422 33112 33293 25067 27673 30069 34489 39784 28815 24497 22060
13711B2060j125k876p642K367N589N025j841Q422P101l524q449P59j735j5863
$$ 22060 20935 18059 10417 12784 18373 23398 21557 29979 37080 33556 25107 25866 24131 8268
13697H268r061J1086L242m118J824N535m769K545N554l414m667n092K415j896
$$ 8268 -793 10293 13535 9417 11241 16776 12007 14552 20106 16692 12025 6933 9348 7452
13683G452K5827J7816N359j7586j1736j255o674L800J5782Q510r596j0955j609
$$ 7452 33279 51095 56454 38868 27132 25877 19203 23003 38785 47295 37699 26744 25135
13670B5135P92N395n01M973K127M164l519K995J7949L6573J4384J737j2105k0542
$$ 25135 25927 31322 30821 35794 37921 42085 38566 41561 59510 96083 110467 112204 100099 79557
13656G9557j3072j1081m76L013K111J4935J1378K833K13J5722K0779L3547N8987
$$ 79557 66485 55404 54928 57941 60052 74987 86365 89198 89411 105133 125912 159459 218446
13643B18446P8610P7905K7066l7262n1025n5955m4569l6235k5102p339R16k746
$$ 218446 297056 374961 402027 364765 313740 257785 213216 176981 151879 144540 145456 142710
13631A42710P887J5129n624m435J8253K8295L7509N8361Q7954J25013K06839K79002
$$ 142710 150597 165726 160102 155667 173920 202215 239724 298085 386039 511052 717891 996893
13619I96893K84839J75587n5376k27568k72401k14739j42247p9183n4365l3036
$$ 996893 1281732 1457319 1401943 1174375 901974 687235 544988 465805 411440 378404
13609C78404o007j6520j6382J8328L1940M6395N8767O5369Q5474J18169J52764
$$ 378404 372397 355877 339495 357823 389763 436158 494925 560294 645768 763937 916701
13598I16701K11250K82847L89317N59524Q36924J261217J973344K816248L028288
$$ 916701 1127951 1410798 1800115 2359639 3196563 4457780 6431124 9247372 12275660
13589A2275660J611396q07763k452464k763515k216276j567066j067151p33372
$$ 12275660 13887056 13079293 10626829 7863314 5647038 4079972 3012821 2279449
13581B279449n23253l72535k70697j91251j56560j32462r8015p1603m8007m0105
$$ 2279449 1756196 1383661 1112964 921713 765153 632691 534676 463073 415066 374961
13571C74961l1923l5427l3415k7493l1312j2352j0175k073j6788k5364k8686J0541
$$ 374961 343038 307611 274196 246703 215391 203039 192864 190791 174003 148639 119953 130494
13559A30494R0q896o61p698m834p507k3227q309R116M705p525O99J559o730q516
$$ 130494 130584 121688 121027 113329 108495 100988 77761 69452 78568 83273 75748 76447 78006 71276 62760
13544F2760k591m144j4101j091N640R597L259M423N973o47L042k403j301p448
$$ 62760 60169 56025 41924 40833 46473 56070 59329 63752 69725 69078 72120 69717 68416 60968
13530F0968j4145J62P294l778j0260k072q955p40p177j2659J1106J4214J6596
$$ 60968 46823 46985 54279 50501 40241 38169 29214 28474 21297 8638 19744 33958 50554
13517E0554N447j5990j1469m424l746P583P139l545K716P795J0051l901q088j794
$$ 50554 56001 40011 28542 24118 20372 27955 35094 31549 34265 42060 52111 48210 40122 38328
13503C8328n783j5448j345O66N986l89o332M118J1557k760m757J2472m559k305
$$ 38328 32545 17097 15752 16418 22404 22015 15683 19801 31358 28598 23841 36313 31754 29449
13489B9449k365l397j8966j8470k0879N962J9084kp476N700O596J2531L828l724
$$ 29449 27084 23687 4721 -13749 -34628 -28666 -9582 -9584 -17060 -11360 -4764 7767 11595 7871
13475G871N492n631M147J2369R475j592P532K457j3685n250M203R612O347j070
$$ 7871 13363 7732 11879 24248 33723 32131 39663 42120 28435 23185 27388 37000 43347 42277
13461D2277L960l930N551K2656J4350K2709K5669L5354N7434L6435J0481j5720
$$ 42277 46237 42307 47858 70514 84864 107573 133242 168596 226030 262465 272946 257226
13449B57226l3773n5452m0127k3282k0284j0665p427L074K788m381j0990P082
$$ 257226 223453 168001 127874 104592 84308 73643 66216 69290 72078 67697 56707 63789
13437F3789P281J844P407J4822R92J4132M0519M1649J1496n881m4060m9831k4463
$$ 63789 71070 72914 80321 95143 96135 110267 150786 192435 203931 198050 153990 104159 79696
13424G9696j0206j3764j1503j1864p473n574q045l801J5637M84j2490L26Q448
$$ 79696 69490 55726 44223 32359 24886 19312 11267 7466 23103 23587 11097 11423 19871
13411A9871J0088J736p290m175O068o089R50J031L861j0556n467J2199J5955J4024
$$ 19871 29959 31695 24405 20230 26298 20209 21159 22190 26051 15495 10028 22227 38182 52206
13397E2206p927j5477r944O883J995j452n147O232p35o420J455n698j0693L169
$$ 52206 44279 28802 18858 25741 27736 26284 21137 27369 26634 20214 21669 15971 5278 8447
13383H447N056j4300M403L714O029j4057j6738N395m860J548K3805J7148L190
$$ 8447 13503 -797 3606 7320 13349 -708 -17446 -12051 -16911 -15363 8442 25590 28780
13370B8780Q311K1125K0214K0830L421m969j9253j3411j2803k6634j2864j034
$$ 28780 37091 58216 78430 99260 102681 97712 78459 65048 52245 25611 12747 11713
13358A1713M334l951j0199j37P530N951Q131K2221J8663k261j0101l086P134l13
$$ 11713 16047 12096 1897 1760 9290 15241 23372 45593 64256 61995 51894 48808 55942 55629
13344E5629k220m897j5063o720l020n856n725j3085r486j2351l3313k2138m278
$$ 55629 53409 48512 33449 26729 23709 17853 12128 -957 -10443 -22794 -56107 -78245 -82523
13331h2523K5630L3861M6100L7616L1905l069p215J728j0331o025j3312o464M837
$$ -82523 -56893 -23032 23068 60684 92589 89520 82305 84033 73702 67677 54365 47901 52738
13318E2738o014Q890N710n620k521L309J696J0838K1874L6456K8206L9997O6662
$$ 52738 46724 55614 61324 55704 53183 56492 58188 69026 90900 127356 155562 195559 262221
13305B62221J08693J07544N6780j4298o9302q6940q1440n3212m3860l9613r042
$$ 262221 370914 478458 535238 520940 451638 364698 283258 230046 186186 146573 137531
13294A37531k907k880q962j1926Q68j653r855J1281P66k468m480N140L719J2083
$$ 137531 134624 131744 122782 110856 111724 110071 100216 111497 112263 109795 105315 110455 114174 126257
13280A26257K890L833j3193o258K19J692K852m403O366Q621N969k321m966o524
$$ 126257 129147 132980 119787 113529 113748 115440 118292 113889 120255 128876 134845 132524 127558 121034
13266A21034J2653J9640L570j6062o110L761J0011K902K221P04J1906J6761Q59
$$ 121034 133687 153327 156897 140835 134725 138486 148497 151399 153620 154324 166230 182991 183850
13253A83850j202P039J4325R231N775O796R051P096K0244K8368K5872M2239L4123
$$ 183850 182648 189687 204012 213243 219018 225814 234865 241961 262205 290573 316445 358684 392807
13240C92807L0442M7086N4890O3267P9790Q9277J03102J15220P0900k106m9461
$$ 392807 423249 470335 525225 588492 668282 757559 860661 975881 1046781 1044675 995214
13229I95214q7608p2167m8716l5250k3223j3161k925J3738J8552R488J5495J6727
$$ 995214 907606 835439 786723 751473 728250 715089 712164 725902 744454 753942 769437 786164
13217G86164K4667K7285L6254M2045M7994N6424O5120Q0519P6910Q1273Q9241
$$ 786164 810831 838116 874370 916415 964409 1020833 1085953 1166472 1243382 1324655 1413896
13206A413896J03836R9508J06798J27637J44238J79236K17962K39640K69886L13291
$$ 1413896 1517732 1617240 1724038 1851675 1995913 2175149 2393111 2632751 2902637 3215928
13196C215928L65207M32683N21720O39564P84554R39477J133003J399178J769476
$$ 3215928 3581135 4013818 4535538 5175102 5959656 6899133 8032136 9431314 11200790
13187A1200790K317009L118831M224753N694372P777946J1146898J7060474K7349712
$$ 11200790 13517799 16636630 20861383 26555755 34333701 45480599 62541073 89890785
13179H9890785M3586695O1206025O0068820K3895830k5157901n3583110n5713441
$$ 89890785 133477480 194683505 254752325 278648155 253490254 199907144 144193703
13172A44193703m2710785k8937564j9161826j2909243r107396o731441n015075
$$ 144193703 101482918 72545354 53383528 40474285 31366889 24635448 19620373
13165A9620373l727763k781864k104272j605619j236268r82394p88368o47947
$$ 19620373 15892610 13110746 11006474 9400855 8164587 7182193 6393825 5745878
13157E745878n51807m59199m13655l55924l07616k68947k37591k16708k17791
$$ 5745878 5194071 4734872 4321217 3965293 3657677 3388730 3151139 2934431 2716640
13148B716640j85381j69889j56311j28404j12629q6223o2020o0921p3702q1752
$$ 2716640 2531259 2361370 2205059 2076655 1964026 1877803 1815783 1754862 1681160 1599408
13138A599408q3986r4170q2786o9573o4411n2120o2524n3644m5297n1191n0572
$$ 1599408 1515422 1421252 1338466 1268893 1204482 1152362 1089838 1036194 990897 939706 889134
13127H89134n3801l6736k6817k1792l3328k5990q874j6249r199j1383j7242k1816
$$ 889134 835333 798597 771780 749988 716660 690670 681796 665547 656348 644965 627723 605907
13115F05907j2465j2057k570j8360j0904k1814o269q672l398K941L840q999j4550
$$ 605907 593442 581385 578815 560455 549551 527737 521468 512796 509398 512339 516179 507180 492630
13102D92630j9739j5267k1960j9277o608J0700l751j0058o478j4167j4479k620
$$ 492630 472891 457624 435664 416387 409779 420479 416728 406670 400192 386025 371546 368926
13090C68926q918m899o164q34q884o466j2481j0769N446j890O802M399r476J005
$$ 368926 360008 355109 348945 348111 339227 332761 320280 309511 314957 313067 319869 324268 314792 315797
13076C15797q748q154m634k097j2161k4258n506m202j2786n524L82M790J45M563
$$ 315797 307049 298895 294261 292164 280003 255745 250239 246037 233251 227727 228109 232899 233044 237607
13062B37607r481m751l355N297N542J8807O551j286n031q067n2572q6716r3339
$$ 237607 228126 223375 220020 225317 230859 249666 256217 254931 249900 241833 189261 102545 9206
13049I206q9262k1806L6046N0677M0684J7518J6167K6432J4348R571J2697M613
$$ 9206 -80056 -101862 -65816 -15139 25545 43063 59230 85662 100010 109581 122278 126891
13037A26891M542N456K2731K7913K4005O098j4909l2210k8606j7979k2445j1101
$$ 126891 131433 136889 159620 187533 211538 217636 202727 170517 141911 123932 101487 90386
13025I0386q168Q828L4158L7845K7607J6026m25j8529j9587m406l206j1562k0552
$$ 90386 82218 91046 125204 163049 190656 206682 206257 187728 168141 163735 160529 148967 128415
13012A28415j6564j0261j9358n109K808Q67j1039p513O538L095J331J9269J9494
$$ 128415 111851 101590 82232 77123 79931 80798 69759 62246 68784 71879 73210 92479 111973
12999A11973J394L924K291K711j3833j0074J5932J4594j15J0972K1239J0624R799
$$ 111973 113367 117291 119582 122293 108460 98386 114318 128912 128797 139769 161008 171632 181431
12986A81431k7116j6525j0736p702j1988k173n823p677o452M858J0560R67k723
$$ 181431 154315 137790 127054 119352 107364 105191 99368 91691 85239 90097 100657 101624 98901
12973I8901j1017r547k197L207k0967r812J0930N613N02p229p80N325R453m68
$$ 98901 87884 78337 76140 79347 58380 48568 59498 65111 65613 58384 57604 62929 72382 71914
12959G1914q979J145q261j6997L442O671O544J1762L825r939R373J1372p993J911
$$ 71914 62935 64080 55819 38822 42264 48935 55479 67241 71066 61127 70500 81872 73879 75790
12945G5790P101j991J0157O818r562M490O393l587j675L515j1579m710L052j4667
$$ 75790 82891 80900 91057 97875 88313 92803 99196 95609 93934 97449 85870 81160 84212 69545
12931F9545q144o790J923N627P759m756m907P44q993J873O011Q08N266P005o700
$$ 69545 61401 54611 56534 62161 69920 65164 60257 61001 52008 53881 59892 60700 65966 72971 66271
12916F6271j0474l14o097j2169m401l619L493J6003J0016j2426j9565J157J3779
$$ 66271 55797 55483 49386 37217 32816 29197 32690 48693 58709 46283 26718 27875 41654
12903D1654J2491J924j151j7786j4591M284J047j293l839r573M625P723M928m861
$$ 41654 54145 56069 54918 37132 22541 26825 27872 26579 22740 13167 17792 25515 30443 25582
12889B5582o075Q02K924K2969R237k247O039R642q155j2661q789J0231N364n951
$$ 25582 19507 20309 23233 46202 55439 53192 59231 68873 60718 48057 39268 49499 54863 48912
12875D8912k624l531J3737K173O233K2571N768j5779j1384p026j3022k0999o467
$$ 48912 46288 42757 56494 58667 64900 87471 93239 77460 66076 59050 46028 25029 18562
12862A8562r170R6k302Q798o127k545L449m322j109J1324J4663O393J4p960N231
$$ 18562 9392 9488 7186 15984 9857 7312 10761 6439 5330 16654 31317 37710 37724 29764 34995
12847C4995M863j1160j7728M46R561N249p646p798l269O188J760K043l556M403
$$ 34995 39858 28698 10970 11416 20977 26226 18580 10782 7513 13701 15461 17504 13948 18351
12833A8351P939J7412R01j0764j2639l342k755J09K581J0217k204p489P158P362
$$ 18351 26290 43702 44603 33839 21200 17858 15103 15212 17793 28010 25806 18317 25475 32837
12819C2837K332o534m370r564O476P135J258j0099M718N342j0113k79k881m809
$$ 32837 35169 28635 24265 14701 21177 28312 29570 19471 24189 29531 19418 19139 16258 11449
12805A1449J4008j997o188J338Q019p384j0314o309j884n790O090k876p784k26
$$ 11449 25457 23460 17272 18610 26629 19245 8931 2622 738 -5052 1038 -1838 -9622 -9848
12791i848J3109J9932J2820o656j5127P369J5469N770O577l859r792m586J51J751
$$ -9848 3261 23193 36013 29357 14230 21599 37068 42838 49415 45556 35764 31178 31329 33080
12777C3080N800N473n214l86p094n106l992N698l547L550n39Q834J584m14m645
$$ 33080 38880 44353 39139 38753 31659 26553 22561 28259 24712 28262 27723 36557 38141 37727 33082
12762C3082J487o009m564j1798q179Q959P486J4810j234r320N196j883N34Q43
$$ 33082 34569 28560 23996 12198 4019 12978 20464 35274 34040 24720 29916 28033 28567 29410
12748B9410j105J2320J6661P123K75M575l09n477n11J7344K0126J6331K2742L8170
$$ 29410 28305 40625 57286 64409 64684 69259 68950 63473 62962 80306 100432 116763 139505 177675
12734A77675L9230O1533J03852J44321K39797K98507K40383M9674j49756k54772
$$ 177675 216905 278438 382290 526611 766408 1064915 1305298 1354972 1205216 950444
12724I50444k55312j94701j35374r9945o2620m4745k2221k8094k7576j0094j8292
$$ 950444 695132 500431 365057 265112 202492 157747 135526 107432 79856 69762 51470
12713E1470j7653j0469j0698r462R548R206R534J235j2876p760M072Q479Q242
$$ 51470 33817 23348 12650 3188 12736 21942 31476 32711 19835 12075 16147 24626 32868
12700C2868m785K925J899o662J0698P410m587n024j2635j846L240l15J4855o442
$$ 32868 28083 31008 32907 26245 36943 44353 39766 34742 22107 20261 23501 23186 38041 31599
12686C1599j246k944m837J0204J37q059M237j00p866m740l972j2744L453J5129
$$ 31599 30353 27409 22572 32776 32913 24854 29091 28991 21125 16385 12413 -331 3122 18251
12672A8251J179j389l585l681N0r581l342M105J8064Q582M659j2284n652J3551
$$ 18251 19430 18041 14456 10775 10825 1244 -2098 2007 20071 28653 33312 21028 15376 28927
12658B8927k37j4345n162N245O208O266m138q735p474K867Q455r309J956M243
$$ 28927 28690 14345 9183 14428 20636 26902 22764 14029 6555 9422 17877 8568 10524 14767
12644A4767j575p396k119J5883K360r026o72M094M067l616j354J392J356j081
$$ 14767 13192 5796 3677 19560 21920 12894 12222 16316 20383 16767 15413 16805 18161 17080
12630A7080q382J934j2043l747Q617M93j148Q79J3413R710p384l172k373j1550
$$ 17080 8698 10632 -1411 -5158 3459 3952 2804 3683 17096 26806 19422 16250 13877 2327
12616B327m145n89N33q995L017R060o673Q971J6099k128j0975Q968m5o091P83
$$ 2327 -1818 -2407 -1874 -10869 -7852 1208 -5465 3506 19605 17477 6502 15470 15425 9334 10117
12601A0117J1016P475N69j1400k73m407K899j134O992O366k080j693m458K491
$$ 10117 21133 28608 29177 17777 17504 13097 15996 14862 21854 28220 26140 24447 19989 22480
12587B2480J117O703M306r73k095o019j0358r164P439r91m173j637Q863L256R89
$$ 22480 23597 30300 34606 33633 31538 25519 15161 5997 13436 12445 8272 6635 15498 18754 19743
12572A9743o607r309j1044M600J2580J0136J0112r284j0167p354K987J2400M042
$$ 19743 13136 3827 -7217 -2617 9963 20099 30211 20927 10760 3406 6393 18793 22835
12559B2835j1065m260O868P16l532p943o040J4400L705j3488m732J0472o367j58
$$ 22835 11770 7510 14378 15094 11562 3619 -2421 11979 15684 2196 -2536 7936 1569 1411
12545A411R713M746r2j4785l604m681P028N692o251K201P464M509j725o002p437
$$ 1411 11124 15870 15778 993 -2611 -7292 -264 5428 -823 1378 8842 13351 11626 5624 -1813
12530a813J205L351J1262J5351J7769L380j1486j0860j2672q833M384j095N547
$$ -1813 -608 2743 14005 29356 47125 50505 39019 28159 15487 6654 11038 9943 15490
12517A5490O113j647N589n418J1588O012j8782r220J497n692P07J0616K45j270
$$ 15490 21603 19956 25545 20127 31715 37727 18945 9725 11222 5530 6237 16853 17098 15828
12503A5828K994M439n678m488J982m474n751L232K2356O751j1474l642q145o482
$$ 15828 18822 23261 17583 13095 15077 10603 4852 8084 30440 37191 25717 22075 13930 7448
12489G448p850K380J3583L549n458m05m936l634j009J2019Q30k708P854Q887j49
$$ 7448 -402 1978 15561 19110 13652 13247 8311 4677 3668 15687 16517 13809 21663 30550 30401
12474C0401k79J6112o556k0952j4991J5522R743j91K985N193J8875J7210L884
$$ 30401 30122 46234 39678 18726 3735 19257 29000 28809 31794 36987 55862 73072 76956
12461G6956j843j1524j3837n707j1634j3399l251n999n917P45Q821N530R65k684
$$ 76956 75113 63589 49752 44045 32411 19012 15761 9762 3845 4590 13411 18941 19906 17222
12447A7222Q880n966q612K997O682l470m874L623P372J119j80L358p035l171P454
$$ 17222 26102 20136 11524 14521 21203 17733 12859 16482 23854 24973 24793 28151 21116 17945 25399
12432B5399K34n350m233j665m941k012K885j790K653Q878K937q65O399L82p339
$$ 25399 25633 20283 16050 14385 9444 7432 10317 8527 11180 20058 22995 22130 28529 28911 21572
12417B1572n362r119j946k273M655P867M320m656j1828q928M402J320J889J373
$$ 21572 16210 7091 5145 2872 7527 15394 19714 15058 3230 -5698 -1296 24 1913 3286
12403C286N430l131n017k760r52J2026L095O609K148o30n398q26p572n246j3016
$$ 3286 8716 5585 568 -2192 -3144 8882 11977 18586 20734 20104 14706 13880 6308 1062 -11954
12388a1954J617L964j614j658J4295J5088r732l360O69O988J0232j418J1949o23
$$ -11954 -10337 -6373 -7987 -9645 4650 19738 10006 6646 7315 14303 24535 23117 35066 34443
12374C4443o850j3693n023P424L349n903q098L262N497M44M197R530k436m111
$$ 34443 27593 13900 8877 16301 19650 13747 5649 8911 14408 14852 19049 28579 26143 22032
12360B2032q954j3433j1380J6314J0595R080J845L314j0820K523J4063L57j3560
$$ 22032 13078 -355 -11735 4579 15174 24254 26099 29413 18593 21116 35179 35536 21976
12347B1976k267j0900o282p776n518R81Q460J928j518M317Q711l221n536Q405
$$ 21976 19709 8809 2527 -5249 -10767 -9786 -1326 602 -916 3401 12112 8891 3355 11760
12333A1760O752M881j1214q953J0507Q05j859l884K787J379p223q318m417N664
$$ 11760 18512 23393 12179 3226 13733 14538 12679 8795 11582 12961 5738 -2580 -6997 -1333
12319a333K262N352r478Q539Q902P250r43k644P302K197j7235o580N962P15j0283
$$ -1333 929 6281 -3197 5342 14244 21494 20551 17907 25209 27406 10171 3591 9553 10268 -15
12304a5J5233J1077J386p371j2873p650n177q36J0967P313j908J967J419k101
$$ -15 15218 26295 27681 20310 7437 -213 -5390 -6226 4741 12054 10146 12113 13532 11431
12290A1431j764r230l37M799p525J0696Q267J3948J918j3650j4678M901P729o750
$$ 11431 9667 437 100 4899 -2626 8070 16337 30285 32203 18553 3875 8776 16505 9755
12276I755k903O794J302o10J0701O953n44m937n261J456l411n777r084j9522n845
$$ 9755 6852 13646 14948 14338 25039 31992 31448 26511 21250 22706 19295 13518 4434 -15088 -20933
12261b0933M593O701n508j726K585J5857M387m643j155P376k638r040R650N551
$$ -20933 -16340 -9639 -15147 -16873 -14288 1569 5956 1313 158 7534 4896 -4144 5506 11057
12247A1057q104q810n601M742L857r58J0093K09K325Q146j5989n491K78R878M455
$$ 11057 2953 -5857 -11458 -6716 -2859 -3817 6276 6485 8810 16956 967 -4524 -4246 5632 10087
12232A0087O47K271o865K26J2833k608j2405l128O967J2732k61P033Q036Q07j0542
$$ 10087 10734 13005 6140 6366 19199 16591 4186 1058 8025 20757 20496 27529 35565 36372 25830
12217B5830o924N046O420j0129l748r476k930p257J7940J7903J7736N852j3023
$$ 25830 18906 23952 30372 20243 16495 7019 4089 -3168 14772 32675 50411 56263 43240
12204D3240r112J328j9835p093J940J613q80O066L360O213j0066r651P951R438
$$ 43240 34128 35456 15621 8528 10468 12081 11201 17267 20627 26840 16774 7123 15074 24512
12190B4512j5697K675M042K37L62n419l671j0936J319J649r09P083K643l558m141
$$ 24512 8815 11490 15532 15769 16131 10712 7041 -3895 -2576 -927 -1836 5247 7890 4332 191
12175A91O694k171m666J3275O155J149l485j4012l862q620Q453l058M386K1584
$$ 191 6885 4714 48 13323 19478 20627 17142 3130 -732 -9352 -899 -3957 429 22013
12161B2013k9n00n423N890K945j2754r440N478n456n258J1650J4560L766j004
$$ 22013 21984 21484 16061 21951 24896 12142 2702 8180 2724 -2534 9116 23676 27442 26438
12147B6438Q218N144P50K452o541q148Q92j5681o477j0203K782M122R811o22k629
$$ 26438 34656 39800 40550 43002 36461 28313 29205 13524 7047 -3156 -374 3748 13559 12937 10308
12132A0308l243L766J525l078j659K500J2034J5449o262j0213P531j669j5498
$$ 10308 7065 10831 12356 9278 7619 10119 22153 37602 31340 21127 28658 26989 11491
12119A1491O263N773q69O30j2280J973n587j4774n77M003K61M733J468K601J2545
$$ 11491 17754 23527 22658 23288 11008 12981 7394 -7380 -7957 -3954 -3693 1040 2508 5109 17654
12104A7654J3871m357L788O25J1066m410q726j239r18p956k508n794P826M001
$$ 17654 31525 27168 30956 31581 42647 38237 29511 28272 27354 19398 16890 11096 18922 22923
12090B2923j636j75m848J508J5346J2291l0K3695M5223K2899Q569n128j7719j1809
$$ 22923 21287 21112 16264 17772 33118 45409 45379 69074 114297 137196 145765 140637 122918 111109
12076A11109r683j1939k6375j2811j1541n740q733k967J2123m029O651O445j885
$$ 111109 101426 89487 63112 50301 38760 33020 24287 21320 33443 29414 36065 42510 40625
12063D0625r613l950M106k70l405M395L800J639r111k142Q512k326q377k504O639
$$ 40625 31012 27062 31168 30898 27493 31888 35688 37327 28216 26074 34586 32260 23883 21379 28018
12048B8018O804P889j360K353k776j1961O758r472O24R121Q906O680p117l070
$$ 28018 34822 42711 41351 43704 40928 28967 35725 26253 26877 35998 44904 51584 44467 41397
12034D1397k724L751J3019J5950j0648l051N24p563M407M985O546j110K830J667
$$ 41397 38673 42424 55443 71393 60745 57694 58218 50655 55062 60047 66593 65483 68313 69980
12020F9980L577J5026J5493N098j193q20O498R496P387O582l650M975M746O839
$$ 69980 73557 88583 104076 109174 107981 107161 113659 123155 130542 137124 133474 138449 143195 150034
12006A50034J4220O576K869J7403J5381P865R471O758M808k13M978Q313O053k10
$$ 150034 164254 170830 173699 191102 206483 214348 223819 230577 235385 235172 240150 248463 254516 254306
11992B54306O692J6688K0700J6001L2559K7433K2813L6743K9552J9206K4459L4863
$$ 254306 260998 277686 298386 314387 346946 374379 397192 433935 463487 482693 507152 542015
11980E42015L7221L5280O0220O4552P7376P9644Q4558J05604J38079J56440J91005
$$ 542015 579236 614516 674736 739288 816664 896308 980866 1086470 1224549 1380989 1571994
11969A571994K33655K75610L36114M07223N14190O56593Q35180J106905J561038
$$ 1571994 1805649 2081259 2417373 2824596 3338786 3995379 4830559 5937464 7498502
11960G498502K255957L320418N024566P782437J1916093J6087156J5534684O756761
$$ 7498502 9754459 13074877 18099443 25881880 37797973 53885129 69419813 76176574
11952G6176574n883912j3899209j5091418j2013102q386578n651340l809395k607790
$$ 76176574 70292662 56393453 41302035 29288933 20902355 15251015 11441620 8833830
11944H833830j843688j345467j004729p49825n77949m59149l60007k93511k21666
$$ 8833830 6990142 5644675 4639946 3890121 3312172 2853023 2493016 2199505 1977839
11935A977839j88671j74248j35419j17474j14056r8861q4549p5730p1033o7939
$$ 1977839 1789168 1614920 1479501 1362027 1247971 1149110 1064561 988831 917798 849859
11925H49859m3498l5762l4801l3508m1561k3914k2912j4154j6440k9542j9321
$$ 849859 806361 770599 735798 702290 660729 636815 613903 599749 583309 553767 534446
11914E34446k2169l0056l6847k1840l4955l4211k2000j9809q235k1949k8638j1038
$$ 534446 512277 482221 445374 423534 388579 354368 332368 312559 304324 282375 253737 242699
11902B42699o921n172k540k468m115n638m443k84m168l700q315N61l206Q48k996
$$ 242699 235778 230606 228066 225598 221483 215845 211402 211118 206950 203250 194935 195496 192290 193138 190142
11887A90142j7803j3101j637n79j564l35j134p333q966p896o974L818M586q956
$$ 190142 172339 159238 157601 157022 155458 155123 153989 146656 137690 129794 122820 126638 131224 122268
11873A22268q97N454k739J961j0451l786Q732K845l956k753l213n462j0431p425
$$ 122268 121371 126825 124086 126047 115596 111810 120542 123387 119431 116678 113465 108003 97572 90147
11859I0147Q179J94K771l972p590j252n557P95m066J0476O356j003k881N559l513
$$ 90147 98326 98520 101291 97319 89729 88477 82920 83715 79649 90125 96481 95478 92597 98156 94643
11844I4643j9472j3428j582L552J283j1641L602K761J2364J1748N323N964k399
$$ 94643 75171 61743 60161 63713 64996 53355 56957 59718 72082 83830 89153 95117 92718
11831I2718j445q450j8545j9769k4633k0973j5356J4827K3377R836J4582L585
$$ 92718 91273 82823 64278 44509 19876 -1097 -16453 -1626 21751 31587 46169 49754
11819D9754n780n561j501j679k207n789J710J4542J1814k335r139r483m576n871
$$ 49754 43974 38413 36912 35233 33026 27237 28947 43489 55303 52968 43829 34346 29770 23899
11805B3899L752K646j1225n597O456J4854R079N96N557J0532R930nj4273o341
$$ 23899 27651 30297 19072 13475 19931 34785 43864 44460 50017 60549 70479 70474 56201 49860
11791D9860j1537m71O553m030K572j876N969n199k837M1j0108q121m814P051J3763
$$ 49860 38323 37852 44405 40375 42947 41071 47040 41841 39004 39045 28937 20816 16002 23053 36816
11776C6816Q879l119L466j083j496k888n028K231m836j3424m007k913K659p254
$$ 36816 45695 42576 46042 44959 43463 40575 35547 37778 32942 19518 15511 12598 15257 8003
11762H003m200P196N192M051P087R007l257o428M433J1141M853n575N32q592J638
$$ 8003 3803 10999 16191 20242 27329 36336 33079 26651 31084 42225 47078 41503 42035 33443 35081
11747C5081j278l493M941N15r730m094n54K601O714k315m806k697K933n238o804
$$ 35081 33803 30310 35251 35766 26036 21942 21388 23989 30703 28388 23582 20885 23818 18580 11776
11732A1776J3050N914k818J975m573m990n266j1296n501M588R745O187P282k100
$$ 11776 24826 30740 27922 29897 25324 20334 15068 3772 -1729 2859 12604 18791 26073 23973
11718B3973o641l976N251M135r619N33L853P341P46q911q898l87M736l264o3O981
$$ 23973 17332 13356 18607 22742 13123 13656 17509 24850 25596 16685 7787 7400 12136 8872 8809 15790
11702A5790J801J1389J2224p434n912j690K273K791k74j276q054K190J093M422
$$ 15790 17591 28980 41204 33770 27858 26168 28441 31232 30958 29682 21628 23818 24911 29333
11688B9333l423P615J2039l672o542o571p088j1963J764j218M684j7520K260J1861
$$ 29333 25910 33525 45564 41892 35350 28779 21691 9728 11492 10274 14958 -2562 -302 11559
11674A1559l055m989k101P07O147M31o073q553P635N94l678q46J8312J0105l290
$$ 11559 8504 3515 1414 2121 8268 8699 2626 -5927 1708 2302 -1376 -2222 16090 26195 22905
11659B2905l928l589j4645J841j292J500j097L014k815M832J4181M465O800j562
$$ 22905 18977 15388 743 2584 1292 2792 1695 4709 1894 6726 20907 25372 32172 30610
11645C0610l173K561J424o92j3317l288j060o977M655M07K512q092M320p315Q028
$$ 30610 27437 29998 31422 30730 17413 14125 13065 6088 10743 11150 13662 5570 9890 2575 10603
11630A0603M332j228j7764J707O004J474p691K129K393m454j081j0439J449K687
$$ 10603 14935 13707 -4057 -2350 3654 5128 -2563 -434 1959 -2495 -3576 -14015 -12566 -9879
11616i879J0225P027J977l249l111k669L152P662L903P253N043O0J3364k250j0249
$$ -9879 346 7373 9350 6101 2990 321 3473 11135 15038 22291 27334 27394 40758 38508 28259
11601B8259j350J90n602j793o456K312Q109J460q954R005l963p203M570P939M673
$$ 28259 26909 27099 21497 19704 13248 15560 23669 25129 16175 25180 21217 14014 18584 26523 31196
11586C1196j0637j1190K235N267R519O159m751K47j0569r432R763L569l305q300
$$ 31196 20559 9369 11604 16871 26390 32549 27798 28045 17476 8044 17807 21376 18071 9771
11572I771j4692k555o356L485P654R488J2671Q585j1679r832N252k2p425Q74m328
$$ 9771 -4921 -7476 -13832 -10347 -2693 6795 19466 28051 16372 6540 11792 11770 4345 5219 891
11557H91j3118j6003k9J6302Q136J170N669j60P207N547J050P551j0209j5720
$$ 891 -12227 -28230 -28259 -11957 -3821 -2651 3018 2858 10065 15612 16662 24213 14004 -1716
11543a716m503R286K1561K111j3845n648M508L363m244n823m194j0744Q064m05
$$ -1716 -6219 3067 24628 26739 12894 7246 11754 15117 10873 5050 856 -9888 -1824 -2229
11529b229n326O376O150Q615P048q195j5434o837o976J3242K0008Q56n893j0606
$$ -2229 -7555 -1179 4971 13586 20634 12439 -2995 -9832 -16808 -3566 16442 17298 11405 799
11515G99o287k423R02P519n973m275O527J0722N146n738q201J2338M373m269r64
$$ 799 -5488 -7911 -7009 510 -5463 -9738 -3211 7511 12657 6919 -1282 11056 15429 11160 10196
11500A0196l340j191o551m499o711N848K1057j558k3889j4631P468O188j688r142
$$ 10196 6856 5665 -886 -5385 -12096 -6248 14809 13251 -10638 -25269 -17801 -11613 -13301 -22443
11486b2443k26J3683O706L61q410m014J1243O953O045M903p541p226k729k72l576
$$ -22443 -22669 -8986 -2280 -1919 -10329 -14343 -3100 3853 9898 14801 7260 34 -2695 -2967 -6543
11471f543P680m174n175M90J4600N534j147o764p027L909Q839j0976j435M851
$$ -6543 1137 -3037 -8212 -7722 6878 12412 11265 4501 -2526 1383 10222 -754 -2189 2662
11457B662J0602L908j1971r642N511R739M778p925l245l932L841L855M034J3584
$$ 2662 13264 17172 5201 -4441 1070 10809 15587 7662 4417 485 4326 8181 12215 25799
11443B5799J973k303q297j073q265L664o550q914K761j514o730l280J3183N123
$$ 25799 27772 25469 17172 16099 7834 11498 4948 -3966 -1205 -2719 -9449 -12729 454 5577
11429E577j503m54L649J1767M552r527o770L94L405M117j871l383K209n272k477
$$ 5577 4074 3620 7269 19036 23588 14061 7291 7685 11090 15207 13336 9953 12162 6890 4413
11414D413n272K62N935P279n825L522J3507r281j2349p278N877J0155K215p663
$$ 4413 -859 -597 5338 12617 6792 10314 23821 14540 2191 -5087 790 10945 13160 5497
11400E497J5113R839k0968n482k579L916J0336J484j630j0052K051m767o912j4395
$$ 5497 20610 30449 9481 3999 1420 5336 15672 17156 15526 5474 7525 2758 -4154 -18549
11386a8549O199J2650O70m625M688q52q369L725J0614O517O899k640o448M454
$$ -18549 -12350 300 970 -3655 1033 181 -8188 -4463 6151 12668 19567 16927 10479 14933
11372A4933p459L745L092r30j4055P131L447m306l36j341p729K712q127L664J9
$$ 14933 7474 11219 14311 13381 -674 6457 9904 5598 5262 3921 -3808 -1096 -9223 -5559 -5540
11357e540O445J1664K105l87o544j1619J503j433j0399k853J7344L389J425l988
$$ -5540 905 12569 14674 14287 7743 -3876 -2373 -3806 -14205 -17058 286 3675 5100 1112
11343A112p750j3583M440J5559K334M533l457k89P120q799p944j2676n745J7897
$$ 1112 -6638 -20221 -15781 -222 2112 6645 3188 2899 10019 1220 -6724 -19400 -25145 -7248
11329g248J0589O650L324L590M498o89n47n991j0489K482J1354q528l963J101
$$ -7248 3341 9991 13315 16905 21403 20714 20167 14176 3687 6169 17523 8995 5032 6133
11315F133k823O7P506p53p103K164P64j177K922o182p677Q470R858Q08q363o645
$$ 6133 3310 3377 10883 10130 3027 5191 5955 4778 7700 1518 -6159 2311 12169 12977 4614 -2031
11299b031o531J3696J0140m876l254m705k098k068k821O974J0156k03o785q791
$$ -2031 -8562 5134 15274 10398 7144 2439 341 -1727 -4548 2426 12582 12379 5594 -3197
11285c197o452l199R341J4872j22j0321L753Q992j1320L61o188l033j028N802
$$ -3197 -9649 -12848 -3507 11365 11243 922 4675 13667 2347 2708 -3480 -6513 -7541 -1739
11271a739K358j0691o93R360Q806m92q13n445K558L052K495K589k830j343k410
$$ -1739 619 -10072 -10765 -1405 7401 6909 6096 651 3209 6261 8756 11345 8515 7172 4762
11256D762k844o579K375m831k223L811p110L224r29o85J3583J7243L766K227j192
$$ 4762 1918 -4661 -2286 -7117 -9340 -5529 -12639 -9415 -10344 -11029 2554 19797 23563 25790 24598
11241B4598o987r503K668j067L945J0621J685m748o900k646l600o61r11j88N153
$$ 24598 17611 8108 10776 9709 13654 24275 25960 21212 14312 11666 8066 7405 6494 6306 11459
11226A1459j781j9337j797K2783M296r908O679K902p034k445j3679J517J3376
$$ 11459 9678 -9659 -11456 11327 15623 5715 12394 15296 8262 5817 -7862 -6345 7031
11213G031P648M5m675n961l487J0995J5080j4268o666N823K253n031n593r21O222
$$ 7031 14679 14724 10049 4088 601 11596 26676 12408 5742 11565 13818 8787 3194 2273 8495
11198H495l799J0208j072K643J557P606n200k270l007m790k616l639L41P499K303
$$ 8495 4696 14904 13832 16475 18032 25638 20438 18168 15161 10371 7755 4116 4457 11956 14259
11183A4259m57j1781j4592m083L521O211N929K365L27o066O21M343q200J2081
$$ 14259 13802 2021 -12571 -16654 -13133 -6922 -993 1372 1699 -4367 -3746 597 -7603 4478
11169D478L833l674N047k339Q98L759J0185R518j5381j9356q885L328J3947j300
$$ 4478 8311 4637 9684 7345 8243 12002 22187 31705 16324 -3032 -11917 -8589 5358 4058
11155D058n141k364q93R17L737j584L471M040n55j104l40l686j943O66p143m167
$$ 4058 -1083 -3447 -4340 -3423 314 -1270 2201 6241 5686 4582 4242 556 -1387 -721 -7864 -12031
11139a2031M379Q846n207l894m051J194J198j31J1544J7503j2197j4778J982J680
$$ -12031 -7652 1194 -4013 -7907 -11958 -10764 -9566 -9697 1847 19350 7153 -7625 -5643 -3963
11125c963R776Q017M78q07l487N766n25K834P00j0009j1808o791p450L169J4328
$$ -3963 5813 13830 14308 13501 10014 15780 15255 18089 18789 8780 -3028 -9819 -17269 -14100 228
11110B28J6197J695p493o074l153N553J901o305j587O720L939N767m589p924m234
$$ 228 16425 18120 10627 4553 1400 6953 8854 2549 962 7682 11621 17388 12799 4875 641
11095F41L716K911k681q464N345Q53Q431j855p354P127l777p208K802J540K735
$$ 641 4357 7268 4587 -3877 1468 2321 10752 8897 1543 8670 4893 -2315 487 2027 4762
11080D762J044n053m257N922K23l620n8l383j1583q327N436M446K523J3645J2339
$$ 4762 5806 753 -3504 2418 2641 -979 -1037 -4420 -16003 -24330 -18894 -14448 -11925 1720 14059
11065A4059j584R78M80k207j757o40K055j1537P94j1298O345J685o448J920Q317
$$ 14059 12475 13453 13933 11726 9969 9329 11384 -153 641 -10657 -4312 -2627 -9075 -7155 1162
11050A162m724q314q795J0057J1902J2952J5883M161N790l772j0935K642j151
$$ 1162 -3562 -11876 -20671 -10614 1288 14240 30123 34284 40074 36302 25367 28009 26858
11037B6858m660o33j249J1284J0590j376L569n787J760O398L68r72L695m22k562
$$ 26858 22198 21565 20316 31600 42190 40814 44383 38596 40356 46754 47122 46150 49845 49423 46861
11022D6861Q887J4922J5797J504l908m568p873o029o637j0182J687N139L6J5170
$$ 46861 55748 70670 86467 87971 84063 79495 71622 65593 58956 48774 50461 55600 55636 70806
11008G0806l958j646n103l664k435q537K114j2154q952K069j2918M388Q375m931
$$ 70806 66848 65202 60099 56435 54000 45463 47577 35423 26471 28540 15622 20010 28385 23454
10994B3454M575n195j390K294J458k839r636r114r486O320N939N90n891o242j360
$$ 23454 28029 22834 21444 23738 25196 22357 12721 3607 -5879 441 6380 6970 1079 -5163 -6523
10979f523K307m647J1281K095o011p848m199L354N043k471m921L036r545o466
$$ -6523 -4216 -8863 2418 4513 -1498 -9346 -13545 -10191 -5148 -7619 -12540 -9504 -19049 -25515
10965b5515M067J3117J1642j2987R08L450j965P119L845J680p942J4094M691J094
$$ -25515 -21448 -8331 3311 -9676 -8768 -5318 -7283 -164 3681 5361 -2581 11513 16204 17298
10951A7298j4047m951K673R752Q870J237k564o634p101L650N188p192m623j0009
$$ 17298 3251 -1700 973 10725 19595 20832 18268 11634 4533 8183 13371 6179 1556 -8453
10937h453O183J5738j2388q391J5618N731m108k218j6383m511J3128P07j4710
$$ -8453 -2270 13468 1080 -7311 8307 14038 9930 7712 -8671 -13182 -54 653 -14057
10924a4057r837J8164J6367J3472L329j6000j782J1915l72o869O771L040j2062
$$ -14057 -23894 -5730 10637 24109 27438 11438 9656 21571 21199 14330 21101 24141 12079
10911A2079r475k491j317k039K178R439n736q218R399j065M962k373J049j053
$$ 12079 2604 113 -1204 -3243 -1065 8374 2638 -5580 3819 2754 7716 5343 6392 5339
10897E339K960m394j879M584L79Q26J632N374o197r117l186l067P526m281j2675
$$ 5339 8299 3905 2026 6610 6989 7815 9447 14821 8624 -493 -3679 -6746 780 -3501 -16176
10882a6176M106R332j455K326J1610M491k997n152Q603Q690N54o523r973M141
$$ -16176 -12070 -2738 -4193 -1867 9743 14234 11237 6085 14688 23378 23932 17409 7436 11577
10868A1577K251M270M339j0493j4266k340K557K062O9N388l389j0924j441o155
$$ 11577 13828 18098 22437 11944 -2322 -4662 -2105 -43 26 5414 2025 -8899 -10340 -16495
10854a6495J3407J3113J1174m359j7627n117j094J0745o15O885j0818j425L520
$$ -16495 -3088 10025 21199 16840 -787 -5904 -6998 3747 3132 10017 -801 -2226 1294
10841A294M017m32p885l528M655K747N530K666L173n540q833K078Q230L646j3837
$$ 1294 5311 4879 -3006 -6534 -1879 868 6398 9064 12237 6697 -2136 -58 8172 11818 -2019
10826b019L485M820L141j894j1419j230R779j0360m872K833j269K306N266J1358
$$ -2019 1466 6286 9427 7533 -3886 -5116 4663 -5697 -10569 -7736 -9005 -6699 -1433 9925
10812I925l967m742j548M657j945p868j5227m840J176K087O353L912J932P468
$$ 9925 5958 1216 -332 4325 2380 -5488 -20715 -25555 -24379 -22292 -15939 -12027 -10095 -2627
10798b627R700l169N47L26J5986O551k5650j5029O643o971q399J931P438m148
$$ -2627 7073 3904 4451 4777 20763 27314 1664 -13365 -6722 -13693 -22092 -20161 -12723 -16871
10784a6871J0294P225Q778j1758L434N140J2044N897m995N37m297l926J27j600
$$ -16871 -6577 648 9426 -2332 1102 6242 18286 24183 19188 19725 15428 11502 11629 10029
10770A0029O481K396j2904o956L865N811n302k186o012j859P183o661q10R306
$$ 10029 16510 18906 6002 -954 2911 8722 3420 1234 -4778 -6637 546 -6115 -6925 2381
10756B381L100L039o484q248J612K504M159r144O324P785J360q545j031L19J749
$$ 2381 5481 8520 2036 -6212 -4600 -2096 2063 -7081 -757 7028 8388 -157 -1188 -869 880
10741H80p430n54n544P29J3792J591L679j364P715P192Q138M592p499m566Q980
$$ 880 -6550 -7104 -12648 -11919 1873 3464 7143 5779 13494 20686 28824 33416 25917 21351 30331
10726C0331n36l967K41K052o088q021M457N655k293m56l672p172K444L759q109
$$ 30331 29795 25828 26069 28121 22033 14012 18469 24124 21831 21375 17703 10531 12975 16734 8625
10711H625J2261J0465N210r073k1026n17P528o618m972l113P148n090m862k305
$$ 8625 20886 31351 36561 27488 6462 5945 13473 6855 1883 -1230 5918 828 -4034 -6339
10697f339O691P859M819j152j5809m742J2768J2470j713o481O253j2256k569L34
$$ -6339 352 8211 13030 11878 -3931 -8673 4095 16565 14852 8371 14624 2368 -201 133
10683A33j95l188R661L290N077p376j363Q032l914j9181o682J1718k091P590R452
$$ 133 -62 -3250 6411 9701 14778 7402 6039 14071 10157 -9024 -15706 -3988 -6079 1511 10963
10668A0963o229k10K05k15J3380o38L171l768R78P18k931k910R689O774N353Q898
$$ 10963 4734 4524 4729 4514 17894 17256 20427 16659 17637 18355 15424 12514 22203 28977 34330 43228
10652D3228J2005L473m101K132M369J483N49l964O18J0200O461M730M369R99J2735
$$ 43228 55233 58706 54605 56737 61106 62589 63138 59174 59792 69992 76453 81183 85552 86551 99286
10637I9286K255J54J0181K8074K7848K0639K2574K8213K1813J7095K0233L4330
$$ 99286 101541 101695 111876 139950 167798 188437 211011 239224 261037 278132 298365 332695
10625C32695M8883N2997O4074Q5281J27903J80313K26333L15658M24141N59484
$$ 332695 381578 434575 498649 583930 711833 892146 1118479 1434137 1858278 2417762
10615B417762O72310P22290N91116L16170K5132j69117j95749q8804J06261L56487
$$ 2417762 3090072 3812362 4403478 4719648 4744780 4575663 4379914 4291110 4397371 4753858
10605D753858O59568J016092J339415J412062J048516L18502m15940q11976q08138
$$ 4753858 5413426 6429518 7768933 9180995 10229511 10548013 10132073 9320097 8511959
10596H511959n46433j47505K98438P87664J307051J712519J693446J019269j17063
$$ 8511959 7965526 7818021 8116459 8904123 10211174 11923693 13617139 14636408 14519345
10587A4519345j134742j627762j588190j217360p53260k88911J78582N96501Q74843
$$ 14519345 13384603 11756841 10168651 8951291 8198031 7909120 8087702 8684203 9559046
10578I559046Q15927K91193m85555j112646j335607j232815r51242o39325l33805
$$ 9559046 10374973 10666166 10180611 9067965 7732358 6499543 5548301 4908976 4575171
10569D575171q6648R8941K02336J45212p9322l77733o00065o89379o46641n35650
$$ 4575171 4488523 4587464 4789800 4935012 4855690 4477957 3877892 3188513 2541872 2006222
10559B006222m09037l07035k19758j82064j43911j06595r0050n4208n2815m1429
$$ 2006222 1597185 1290150 1070392 888328 744417 637822 547772 493564 440749 399320
10549C99320l7517k9384k6270k3112j6823j1065j6106k1253j4094m588k0229k5901
$$ 399320 361803 332419 306149 283037 266214 255149 239043 217790 203696 199108 178879 152978
10537A52978n378R620l196o008Q450j4426k1353M90J477R98M301q824j4579j3742
$$ 152978 147600 157220 154024 148016 156466 142040 120687 121177 122654 123652 127953 119129 104550 90808
10523I0808k875Q01l903n088J393j691O881M824N184L410J220j588j0542p869
$$ 90808 87933 88734 84831 79743 81136 79445 86326 91150 96334 99744 100964 99376 88834 80965
10509H0965K06n522l211L178j748o667Q81L313n120o334j821J2336o588p310J542
$$ 80965 81171 75649 72438 75616 73868 67201 68082 71395 66275 59941 58120 70456 63868 56558 58100
10494E8100k927m344J353Q183j229l329o159m539J905j0201M783k524o910L538
$$ 58100 55173 50829 52182 60365 59136 55807 49648 45109 47014 36813 41596 39072 32162 35700
10480C5700M778k153n209j2867N06J846l508l447J798J1012J1635O635k621j550
$$ 35700 40478 38325 33116 20249 20755 22601 19093 15646 17444 28456 40091 46726 44105 42555
10466D2555j735J588q445o680J948J044j6708K293L383L047J11q081q190L184
$$ 42555 40820 42408 33963 27283 29231 30275 13567 15860 19243 22290 22401 14320 6130 9314
10452I314M774M151L819q80J5847j93j4488p776k404M847Q17j2699p586j969J4781
$$ 9314 14088 18239 22058 21178 37025 36832 22344 14568 12164 17011 17828 5129 -2457 -4426 10355
10437A0355l450j0791J797R116P057l330j205k733O391k675m740K074M324N82
$$ 10355 6905 -3886 -2089 7027 14084 10754 9549 6816 13207 10532 5792 7866 12190 12772
10423A2772N423J835j3235K67k6j0596R461p555k496P678N351Q920N269q393P701
$$ 12772 18195 20030 6795 7062 7036 -3560 5901 -1654 -4150 3528 8879 17799 23068 14675 22376
10408B2376J4883K899m895K489o777p231k935p133K065k371j1299j263J3965Q753
$$ 22376 37259 40158 35263 37752 30975 23744 20809 13676 15741 13370 2071 808 14773 23526
10394B3526L681o572o336q26M390p206j209K763J827l197J3392J490q266n241
$$ 23526 27207 20635 14299 13473 17863 10657 9448 12211 14038 10841 24233 25723 17457 12216
10380A2216p246j3824J284M527L566j011k969R265O850K347l865O229R848j3941
$$ 12216 4970 -8854 -7570 -3043 523 -488 -3457 5808 12658 15005 11140 17369 27217 13276
10366A3276L271M608R68k185K459k676J530L653j2957k009J436L577J087j0164
$$ 13276 16547 21155 22123 19938 22397 19721 21251 24904 11947 9938 11374 14951 16038 5874
10352E874J13K378K735p045K4Q959K368o730n872k628L991L219j706J357p042
$$ 5874 5987 8365 11100 4055 4079 13038 15406 8676 2804 176 4167 7386 5680 7037 -5
10337eJ1296l364j2308m259J6405J3510j0058o886P403O865r767n538r532o67
$$ -5 11291 7927 -4381 -8640 7765 21275 11217 4331 11734 18599 8832 3294 -6238 -6905
10323f905J4126N87m520K147P20j441n827O137J1196M221n273r012K25k106J946
$$ -6905 7221 7808 3288 5435 6155 4714 -1113 5024 16220 20441 15168 6156 6381 4275 6221
10308F221o65n148k652m497L53p265N754P115J2116N229P304j1689j0641p39j560
$$ 6221 5556 408 -2244 -6741 -6388 -13653 -7899 -784 11332 16561 23865 12176 1535 796 -764
10293g64N300K038l585J783q31o14o026J708k614j5045J0141N876m028J816q69
$$ -764 4536 6574 2989 4772 3941 3327 -2699 -991 -3605 -18650 -8509 -2633 -6661 -4845 -5714
10278e714N825J1485L544m244p779n739j2416O438J2700N305K937q873J2123l404
$$ -5714 111 11596 15140 10896 3117 -2622 -15038 -8600 4100 9405 12342 3469 15592 12188
10264A2188N698Q71P510O693M266j4816k212n696k835O824p422m958q118L045
$$ 12188 17886 18757 26267 32960 37226 22410 20198 14502 11667 18491 11069 6111 -2007 1038
10250A038l661J524j036q795k613J1997J535N79l00j360N425J242j299j174p45
$$ 1038 -2623 -1099 -2135 -10930 -13543 -1546 -11 568 268 -1092 4333 5575 4276 3102 2357
10235B357J396K328N581K230p976m630l714M862M77J368K136j542J393N35k101
$$ 2357 3753 6081 11662 13892 5916 1286 -2428 2434 2911 4279 6415 4873 6266 6801 4700
10220D700k279L352N959L551n569o006K403m412o712L728N102j30N583k379j8422
$$ 4700 2421 5773 11732 15283 9714 3708 6111 1699 -5013 -1285 3817 3687 9270 6891 -11531
10205a1531O413l1m406Q986K292R657Q010q530q345j977k518J6413Q87r27M463
$$ -11531 -5118 -5149 -9555 -569 1723 11380 19390 10860 2515 538 -1980 14433 15320 14393 18856
10190A8856N192p023j0138M808l916n940j0054K074R226L459O725j621R310p482
$$ 18856 24048 17025 6887 11695 7779 1839 -8215 -6141 3085 6544 13269 11648 20958 13476
10176A3476J2366J3874r555m55M367J129r190l595M759M711O483q97P319P552
$$ 13476 25842 39716 30161 29706 34073 35202 26012 22417 27176 31887 38370 37473 44792 52344
10162E2344M550J655m747q418m905Q034j092M114J6885J1650M091j0142j7230
$$ 52344 56894 58549 53802 45384 40479 48513 47421 51535 68420 80070 84161 74019 56789
10149E6789j7239L827j222L116J819R678P608K758R056J655k003r056j4825n998
$$ 56789 39550 43377 42155 45271 47090 56768 64376 67134 76190 77845 75842 66786 51961 45963
10135D5963o270j7589j694J0876M836l563o971j5651j1082R941Q915o392n906
$$ 45963 39693 22104 20410 31286 36122 32559 25588 9937 -1145 8796 17711 11319 5413
10122E413j2219p976J3234R749j740P833j817o328J052J42o299O041R548p620
$$ 5413 -6806 -14782 -1548 8201 6461 14294 12477 6149 7201 7343 1044 7085 16633 9013
10108I013o968P236N139N075L44q762p440l182O3k559l505j715J5525q847q30
$$ 9013 2045 9281 14420 19495 19839 11077 3637 455 518 -2041 -5546 -7261 8264 -583 -1413
10093a413K1l089k538p92J4656P643j9111p022R225k021l705J0047j0722j319
$$ -1413 -1392 -4481 -7019 -7811 6845 14488 -4623 -11645 -2420 -4441 -8146 1901 -8821 -10140
10079a0140J3318R171L246m656j598o028j2042l028N015L592K231l938k444M931
$$ -10140 3178 12349 15595 10939 9341 3313 -8729 -11757 -6742 -3150 -919 -4857 -7301 -2370
10065b370J2384o648m642M489L339J072k28n529j4235J261K148J8056M285o374
$$ -2370 10014 3366 -1276 3213 6552 7624 7396 1867 -12368 -11107 -8959 9097 13382 7008
10051G008o788m702R666K44j826m122O325P496k380L016O587j4240r664L75m799
$$ 7008 220 -4482 5184 5428 3602 -520 5805 13301 10921 13937 20524 6284 -3380 -3005 -7804
10036g804O0L906L136O348j712Q968R453m526q709P52p972n650M530M555M28K999
$$ -7804 -7744 -3838 -702 5646 3934 12902 22355 17829 9120 9872 1900 -3750 780 5335 5763 8762
10020H762N259q318j0079l95K768J928J3745J5580l301l334n702j4260r192n380
$$ 8762 14021 5703 -4376 -4771 -2003 -75 13670 29250 25949 22615 16913 2653 -6539 -11919
10006a1919M428k269K709O916k247J409o322m981m412L608K63L725J3168O435
$$ -11919 -7491 -9760 -7051 -135 -2382 -973 -7295 -12276 -16688 -13080 -12817 -9092 4076 10511
9992A0511K498j0670J190J2562J1162j068q348j0507N927P669m330j0872n964
$$ 10511 13009 2339 3529 16091 27253 26185 17837 7330 13257 20926 16596 5724 -240
9979b40Q453P854P58j439l069m504n97p949O063P278N51J6q312k834j002k478
$$ -240 8213 16067 16825 15386 12317 7813 7216 -733 5330 12608 13159 13175 4863 2029 1027 -1451
9963a451o885L592L285r418L321J0962P790j6302r92K368J1571J1947j0704n738
$$ -1451 -8336 -4744 -1459 -10877 -7556 3406 11196 -5106 -6098 -3730 7841 19788 9084 3346
9949C346M203P511J217j0546n931K79k257k739K792n00m331r193O393J4107O699
$$ 3346 7549 15060 16277 5731 -200 79 -2178 -4917 -2125 -2625 -6956 -16149 -9756 4351 11050
9934A1050q919n976R88q70K321M083J1838N835r669m375J0168K973l093j9626
$$ 11050 2131 -3845 -2857 -3727 -1406 2677 14515 20350 10681 6306 16474 19447 16354 -3272
9920c272o322M294n467Q706J1980L870n035k602O602j675L401o756m939J182J1715
$$ -3272 -9594 -5300 -10767 -2061 9919 13789 8754 6152 12754 11079 14480 7724 2785 3967 15682
9905A5682l89j7292j1625p74l579n70J7919L678p753k048k483j243K37o813j1952
$$ 15682 15293 -1999 -13624 -14398 -17977 -18547 -628 3050 -4703 -6751 -9234 -10477 -10240 -17053 -29005
9890b9005N57Q254J7568K0504l594m796J486m416l297k893P377J292J1135M090
$$ -29005 -28448 -20194 -2626 17878 14284 9488 10974 6558 3261 368 7745 9037 20172 24262
9876B4262l332J492r159q494m111R958N134j505Q51l696k410j5043r22M004J2845
$$ 24262 20930 22422 13263 4769 658 10616 15750 14245 15096 11400 8990 -6053 -6975 -2971 9874
9861I874J1556k988n007j929q994r808M261P167p026k93j653N89J1277M80j61
$$ 9874 21430 18442 13435 11506 2512 -7296 -3035 4132 -2894 -3187 -4840 -4251 7026 7506 7345
9846G345j683o048N17J0575J829j0496j5564j908R146J2499q544o68O862K575
$$ 7345 5662 -386 131 10706 12535 2039 -13525 -15433 -6287 6212 -2332 -3000 3862 6437
9832F437m365l128P890l939N300n214j2455l692n108J6230M040k973l112j815
$$ 6437 2072 -1056 6834 2895 8195 2981 -9474 -13166 -18274 -2044 1996 -977 -4089 -5904
9818e904N182M255p957J1661j754j1991j3067K785O942K339l077l354N383j838
$$ -5904 -722 3533 -4424 7237 5483 -6508 -19575 -16790 -9848 -7509 -10586 -13940 -8557 -10395
9804a0395K714N783M675K069P747L102O141O062j795n279m866O702L704P932J2980
$$ -10395 -7681 -1898 2777 4846 12593 15695 21836 27898 26103 20824 15958 22660 26364 34296 47276
9789D7276N308O480K0662L9323P0843J19081J63809J52643O7482p1122j43192
$$ 47276 52584 59064 79726 119049 189892 308973 472782 625425 692907 621785 478593
9778D78593j43289j11732q1408m4636l5189k6998j1640M651M617j2101l137j117
$$ 478593 335304 223572 142164 97528 62339 35341 23701 28352 32969 20868 17731 16614
9766A6614n204K564m891n137m012J5040R510m066k226J217j107J420R387p480
$$ 16614 11410 13974 9083 3946 -66 14974 24484 20418 18192 19409 18302 19722 29109 21629
9752B1629r898J3m32m223M479P464k636O809k720K580R264j1402o721r470j1287
$$ 21629 11731 11744 11312 7089 11568 19032 16396 23205 20485 23065 32329 20927 14206 4736 -6551
9737f551o912j787j546L036Q053l12k985k707k156Q615J1834Q79o113l051J005
$$ -6551 -13463 -15250 -16796 -13760 -5707 -6019 -9004 -11711 -13867 -5252 6582 7461 1348 -1703 -698
9722f98Q781k478q802K264P460K382j1190J062O704L401N563L370j0881n301q308
$$ -698 8083 5605 -3197 -933 6527 8909 -2281 -1219 5485 8886 14449 17819 6938 1637 -6671
9707f671j8946j275R617L326O257k124M411K965K419l670l495m573P057j719q660
$$ -6671 -25617 -26892 -17275 -13949 -7692 -9816 -5405 -2440 -21 -3691 -7186 -11759 -4702 -6421 -15081
9692a5081k856O08R60k518j884J206J0748J6958l085q083O739j199j2835m343
$$ -15081 -17937 -17329 -16369 -18887 -20771 -19565 -8817 8141 5056 -3027 3712 2513 -10322 -14665
9678a4665P805K544L088K389L439M522o191j3300l041J631N781O368l907M40J1148
$$ -14665 -6860 -4316 -1228 1161 4600 9122 2931 -10369 -13410 -11779 -5998 370 -3537 -3097 8051
9663H051q070l617J4619P88o313j499R130Q01k089k324K350j2722q785n957L928
$$ 8051 -19 -3636 10983 11771 5458 3959 13089 13890 11801 9477 11827 -895 -9680 -15637 -11709
9648a1709M572J0194Q238Q370j3427p553K56L715n808l91L18P340J587j269N426
$$ -11709 -7137 3057 11295 19665 6238 -1315 -1059 2656 -3152 -3543 -3225 4115 5702 4433 9859
9633I859r28K613K428o785L02q608M134J1756p571J593m058J995k167k527m890
$$ 9859 8931 11544 13972 7187 7489 -1119 3015 14771 7200 8793 4735 6730 4563 2036 -2854
9618b854J863O567O268q173o507O371l630P572l684p323p375M636O105P084l65
$$ -2854 -991 5576 11844 3671 -2836 3535 -95 7477 3793 -3530 -10905 -6269 -164 6920 6555
9603F555m406l796M925p077k628k032J0535J5J56K537J752N60l065q66Q316M143
$$ 6555 2149 -1647 3278 -3799 -6427 -8459 2076 2091 2247 4784 6536 7096 4031 3165 11481 15624
9587A5624j1308k750N653O051O969j3433j0580L960O626p573p817O469N940n500
$$ 15624 4316 1566 7219 13270 20239 6806 -3774 186 6812 -761 -8578 -2109 3831 -1669
9573a669l388r01j407J338M591J0704o99J826M575m039p082n346k0807r200O358
$$ -1669 -5057 -5958 -7365 -6027 -1436 9268 8569 10395 14970 10931 3849 -1497 -22304 -31504 -25146
9558b5146j61J0398J0442l874m92M149p22n190J4561k518l294N792L541o758L848
$$ -25146 -25307 -14909 -4467 -8341 -8833 -4684 -5406 -10596 3965 1447 -1847 3945 7486 728 4576
9543D576N317n323k336j095J038n882J4451J4826L353n387j4198K724j4000Q64
$$ 4576 9893 4570 2234 1139 2177 -3705 10746 25572 28925 23538 9340 12064 -1936 -1072
9529a072J992L936K846o624o493P46l121M054M845J2114K566p747o853R539K605
$$ -1072 920 4856 7702 1078 -5415 -4669 -7790 -3736 1109 13223 15789 8042 1189 10728 13333
9514A3333n408m281n373n021j918k220O694M309j433k010o068J924j295n116L258
$$ 13333 7925 3644 -1729 -6750 -8668 -10888 -4194 115 -1318 -3328 -9396 -7472 -8767 -13883 -10625
9499a0625P488K746m14q031R171K514L343M781p470j7053j505P80M986l188j0923
$$ -10625 -3137 -391 -805 -8836 335 2849 6192 10973 3503 -13550 -15055 -14275 -9289 -12477 -23400
9484b3400m449J5354J182j795Q37M379j810l07O364J268L78l599J541n420q846
$$ -23400 -27849 -12495 -11313 -13108 -12271 -7892 -9702 -10009 -3645 -2377 -1999 -5598 -4057 -9477 -18323
9469a8323M641O146R232N388P354m84j1903J2265o782q433P617r027J958J468
$$ -18323 -13682 -7536 1696 7084 14438 13954 2051 14316 7534 -899 6718 -2309 -351 1117
9455A117Q872J1860j0954k2737l196p21k958P782R708O718L74m849j2074q976
$$ 1117 9989 21849 10895 -11842 -15038 -15759 -18717 -10935 -1227 5491 5865 1016 -11058 -20034
9441b0034O454L844N368O032k301O957N646L502l419j0813M563j305r847j1524
$$ -20034 -13580 -9736 -4368 1664 -637 6320 11966 15468 12049 1236 5799 4494 -5353 -16877
9427a6877R048O232O75j0409J45J6038O680q329M650o058K368O384j05K597p257
$$ -16877 -7829 -1597 -922 -11331 -11186 4852 11532 3203 7853 1795 4163 10547 10442 13039 5782
9412E782l924J0559R431M525l142l701p123p008p517n956N628R699k888j4001
$$ 5782 1858 12417 21848 26373 23231 19530 12407 5399 -2118 -8074 -2446 7253 4365 -9636
9398i636o975J1973Q360K90k641K536O84K282j0081K993j645l992l06k196n139
$$ -9636 -16611 -4638 3722 4012 1371 3907 4591 6873 -3208 -215 -1860 -5852 -6158 -8354 -13493
9383a3493j622J10O820k199K499J6304N175L473Q42m646n947K956J271o316L791
$$ -13493 -15115 -15005 -8185 -10384 -7885 8419 13594 17067 17909 13263 7316 10272 11543 5227 9018
9368I018M715K046q648J998l427r40Q473J022p416o971J4644l864q520Q12o793
$$ 9018 13733 15779 7131 9129 5702 4762 13235 14257 6841 -130 14514 10650 2130 2942 -3851
9353c851j4407M894N83l7R806K197N176M950L06j114M261K742m509o727J838o527
$$ -3851 -18258 -13364 -12781 -12818 -3012 -815 4361 9311 9617 8503 12764 15506 10997 4270 6108 -419
9337d19l936J2855j735j2225j0611j1293J251L937lO139K663P797J2497L505j373
$$ -419 -4355 8500 6765 -5460 -16071 -27364 -26113 -22176 -22179 -16040 -13377 -5580 6917 10422 9049
9322I049m605k357j778o19q024q504J385Q364l797l470n122K3J0370N331n919
$$ 9049 4444 2087 309 -310 -8334 -16838 -15453 -7089 -10886 -14356 -19478 -19455 -9085 -3754 -9673
9307i673M649M149J0132q09j0690m301M574l614o1P354R928J109q32j0697J259
$$ -9673 -5024 -875 9257 8448 -2242 -6543 -1969 -5583 -5644 1710 11638 12747 11915 1218 2477
9292B477l541j987M7o588N8N401o176m127J376J16K608N747M381J758J572P43
$$ 2477 -1064 -3051 -3004 -9592 -9534 -4133 -10309 -14436 -13060 -12944 -10336 -4589 -208 1550 3122 3865
9276C865j0151k041N250m660K843J205q056p35q098l05P821P108O202L118P409
$$ 3865 -6286 -8327 -3077 -7737 -4894 -3689 -11745 -12480 -20578 -20883 -13062 -5954 248 3366 10775
9261A0775L191l700r91o962J751O286J792N159j521o331o95Q400o906j4150r674
$$ 10775 13966 10266 9275 2313 4064 10350 12142 17301 15780 9449 8754 17154 10248 -3902 -13576
9246a3576k78J2026N264O855J004j5319j0859O075M996L973M08j746L651Q207
$$ -13576 -13854 -1828 3436 10291 11295 -4024 -14883 -8808 -3812 161 569 -1177 2474 10681
9232A0681p833m790j723m405O508O410R354K426j0359R11J0569O539n360J536
$$ 10681 2848 -1942 -3665 -8070 -1562 4848 14202 16628 6269 7180 17749 24288 18928 20464
9218B0464J141m078p5l286p891J827M653N515k619r985q36o241q278L633j152
$$ 20464 21605 17527 17452 14166 6275 8102 12755 18270 15651 5666 4830 -1411 -9689 -6056 -7208
9203g208o516J542M744l552k120p172L139M88j928M547P21m956J2613N925l69
$$ -7208 -13724 -12182 -7438 -10990 -13110 -20282 -17143 -16655 -18583 -14036 -13315 -18271 -5658 267 -102
9188a02R31j0586O777R868j0034p67O202J214r8m042j3935L162k716N621J2156
$$ -102 829 -9757 -2980 6888 -3146 -3913 2289 3503 3405 -637 -14572 -11410 -14126 -8505 3651
9173C651K1210J3654L117j6754q992j5133j7726j264R214R660M269K472o469q170
$$ 3651 24861 38515 41632 24878 15886 753 -16973 -18237 -9023 637 4906 7378 909 -7261
9159g261q06l930J1416R522k193p583m9n540o008L135L328O409O906j141j534
$$ -7261 -8067 -11997 -581 8941 6748 -835 -884 -6424 -12432 -9297 -5969 440 7346 6205 4671
9144D671K003N003J981p49j6014l381O034M167o742p486L463p7q555j329j0940
$$ 4671 6674 11677 13658 12909 -3105 -6486 -452 3715 -3027 -10513 -7050 -7127 -15682 -17011 -27951
9129b7951p63J6377R911K707N688M834P874L378j8786j8779L028J360l770k883
$$ -27951 -28714 -12337 -2426 281 5969 10803 18677 22055 3269 -15510 -12482 -11122 -14892 -17775
9115a7775Q350K970j0474Q097J0249N622J074n149R008n412k760m634j523k941
$$ -17775 -9425 -6455 -16929 -8832 1417 7039 8113 2964 11972 6560 3800 -834 -2357 -5298
9101e298J043r3q146L131K17M945P517p514M166R736O695K810l75m027n681j2756
$$ -5298 -4255 -4348 -12494 -9363 -9146 -4201 3316 -4198 -32 9704 16399 19209 18834 14807 9126 -3630
9085c630n733l3P091Q508O05m580p877R368K108o44j4858o247J7936Q261m016
$$ -3630 -9363 -9396 -2305 6203 6808 2228 -5649 3719 5827 5183 -9675 -15922 2014 10275 6259
9070F259K52J1018j554r232k0006q363J2198Q38m453o193P582L995N812k574n488
$$ 6259 6511 17529 15975 6743 -13263 -21626 -9428 -8590 -13043 -19236 -11654 -7659 -1847 -4421 -9909
9055i909P645J915J0738K193q682l37k888p395L325K32L376j742o248o719M302
$$ -9909 -2264 -349 10389 12582 3900 3563 675 -6720 -3395 -3163 213 -1529 -7777 -14496 -10194
9040a0194N161R080L308p679j2249q124P456L313q115L103J104O361m895O392
$$ -10194 -5033 4047 7355 -324 -12573 -20697 -13241 -9928 -18043 -14940 -13836 -7475 -12370 -5978
9026e978N852k614j134J0064J7660j392j2654q965n949j5J005m974J58J380M100
$$ -5978 -126 -2740 -3874 6190 23850 22458 9804 839 -5110 -5125 -4120 -9094 -8936 -7556 -3456
9011c456K925R64q956q357o179O280R39K496J051Q329J8838M283o811j0921l100
$$ -3456 -531 433 -8523 -16880 -23059 -16779 -15840 -13344 -12293 -3964 14874 19157 12346 1425 -1675
8996a675q915P386R589l596j844R164j0152j2334Q496O460o972r13m141Q039K546
$$ -1675 -10590 -3204 6385 2789 945 10109 -43 -12377 -3881 2579 -4393 -5306 -9447 -1408 1138
8981A138K661M020p273p138r154P699N951m98M679L782n681Q225m4n867N983R387
$$ 1138 3799 7819 546 -6592 -15746 -8047 -2096 -2594 2085 5867 186 8411 8367 2500 8483 17870
8965A7870N600k733j0145j7769p327l610N167k03L042J8328m411M245J0469o719
$$ 17870 23470 20737 10592 -7177 -14504 -18114 -12947 -13150 -10108 8220 3809 8054 18523 11804
8951A1804p128j0730P933Q571J0564n502j0929N784J5859o38j2751o104P48J609
$$ 11804 4676 -6054 1879 10450 21014 15512 4583 10367 26226 25588 12837 6733 7481 9090
8937I090K841M05k472j508m130k0257K537Q342M268J0158j495j5588J0953M366
$$ 9090 11931 12336 9864 8356 4226 -16031 -13494 -5152 -884 9274 7779 -7809 3144 7510
8923G510q284l424J5954N660j7191M2N716n7l349l166n569M147j525l583J7128
$$ 7510 -774 -4198 11756 17416 225 267 5983 5926 2577 -589 -6158 -2011 -3536 -7119 10009
8908A0009K543K501J520N550j959J127n184p60q280P18Q980j32K988O705m630
$$ 10009 12552 15053 16573 22123 20164 21291 16107 15347 7067 7785 16765 16633 19621 26326 21696
8893B1696P83l271n329j4848l68J699l881P470j6979J709M430j349j924M377J2376
$$ 21696 22479 19208 13879 -969 -1337 362 -3519 3951 -13028 -11319 -6889 -8238 -10162 -5785 6591
8878F591J4805J8202N030m677j2050O202Q486K455p849k5326r873L126j1456l262
$$ 6591 21396 39598 44628 39951 27901 34103 42589 45044 37195 11869 1996 5122 -6334 -9596
8864i596l421R38O540m822J0396J3307q596m416L381J659o173O319Q746j0264
$$ -9596 -13017 -12079 -5539 -10361 35 13342 4746 330 3711 5370 -803 5516 14262 3998
8850C998o680l465Q754p619l162J5021O265Q130L694K591j0261n502r977o090
$$ 3998 -2682 -6147 2607 -5012 -8174 6847 13112 21242 24936 27527 17266 11764 1787 -4303
8836d303K495k047R319O337O075j120o671N174L665K482j2235q955r578L164p921
$$ -4303 -1808 -3855 5464 11801 17876 16756 10085 15259 18924 21406 9171 216 -9362 -6198 -14119
8821a4119P680J6494M090k816m467o375N141o817j5616o991J3531J166o048P04
$$ -14119 -6439 10055 14145 11329 6862 487 5628 -1189 -16805 -23796 -10265 -9099 -15147 -14443
8807a4443q369K558L041J1239J5925n985p668p225m340R506l97Q394k012O298
$$ -14443 -22812 -20254 -17213 -5974 9951 3966 -3702 -10927 -15267 -5761 -6158 2236 224 6522
8793F522n916L472n344p216M578j968k433O106R378j652n27k591j622k272L978
$$ 6522 606 4078 -1266 -8482 -3904 -5872 -8305 -2199 7179 5527 5000 2409 787 -1485 2493
8778B493R091P021N982r026l979O14j5201j2142L20J5104m005k415M117l254j281
$$ 2493 11584 18605 24587 15561 11582 12196 -3005 -15147 -14827 277 -3728 -6143 -2026 -5280 -6561
8763f561L686j601o742M481Q888J53j5226P704k272J067k155j1296k796K511L970
$$ -6561 -2875 -4476 -11218 -6737 2151 2304 -12922 -5218 -7490 -6423 -8578 -19874 -22670 -20159 -16189
8748a6189L432J12N711k572l594o861J1338J1388p088o011p729l478n658m291
$$ -16189 -12757 -12645 -6934 -9506 -13100 -19961 -8623 2765 -4323 -10334 -18063 -21541 -27199 -31490
8734c1490j976Q098J6858N260k368o041J0388N738n851j8279o89J4164J105r31
$$ -31490 -33466 -25368 -8510 -3250 -5618 -11659 -1271 4467 -1384 -19663 -20352 -6188 -5083 -6014
8720f014p015n262N74R792J0871K202k511m414j472q04J2194Q456P92k769p63
$$ -6014 -13029 -18291 -17717 -7925 2946 5148 2637 -1777 -3249 -4053 8141 16597 17389 14620 13857
8705A3857o722l691k254k060K347J866L815j4593q677J66n717n075K2730J0266
$$ 13857 7135 3444 1190 -870 1477 3343 7158 -7435 -16112 -15946 -21663 -26738 -4008 6258
8691F258m617l059n931j0193J582K353m781O85R689n80q160j4883R70Q593Q936
$$ 6258 1641 -1418 -7349 -17542 -15960 -13607 -18388 -17703 -8014 -8594 -16754 -31637 -30667 -22074 -13138
8676a3138Q675M027O475M970o696l094j913J369J368k408J58o870n226P41n965
$$ -13138 -4463 -436 6039 11009 4313 1219 -694 675 2043 -365 -207 -7077 -12303 -11562 -17527
8661a7527P127J8788m490o211l518j0656k739N835m417Q162J9054n855j0603l206
$$ -17527 -10400 8388 3898 -2313 -5831 -16487 -19226 -13391 -17808 -9646 9408 3553 -7050 -10256
8647a0256J2177R76J4074K608n838Q00K349p580n755l334O925Q113p332j1654
$$ -10256 1921 2897 16971 19579 13741 14541 16890 9310 3555 221 7146 15259 7927 -3727
8633c727p103Q044J6284L181l003r400j4254j3406J1722Q836R141K923l311l512
$$ -3727 -10830 -2786 13498 16679 13676 4276 -9978 -23384 -11662 -2826 6315 9238 5927 2415
8619B415l457l489o433J5114J0309n795N6n878o313J0570n482n455J2380M035
$$ 2415 -1042 -4531 -10964 4150 14459 8664 8720 2842 -3471 7099 1617 -3838 8542 12577
8605A2577K139l496j1443K20J03J447l04N762J2129K162m285N533o389m500Q89
$$ 12577 14716 11220 -223 -3 100 1547 1243 7005 19134 21296 17011 22544 16155 11655 12544
8590A2544l563k15j097L388o455L203N999M127Q853j1604q897K063J0705m811
$$ 12544 8981 8766 7669 11057 4602 7805 13804 17931 26784 15180 6283 8346 19051 14240
8576A4240k0785l362N603Q202Q353K408j0471M482o81r989K51J4470r19j327l748
$$ 14240 -6545 -9907 -4304 3898 12251 14659 4188 8670 7989 -2000 -1749 12721 11802 10475 6727
8561F727o189M59O793P927m661m566O305k12j8852r478m003j543J4504R154r29
$$ 6727 538 997 7790 15717 11056 6490 12795 12583 -6269 -15747 -19750 -21293 -6789 2365 1436
8546A436J755K294k176n044J1539J5886P119N582Ml125J4267M3459M8913M2384
$$ 1436 3191 5485 3309 -1735 9804 25690 32809 38391 38395 35270 49537 92996 141909 184293
8532A84293M266l1935l9465m1238k5015j4577j0339l548k444m234j790k7q65K523
$$ 184293 188559 156624 117159 75921 50906 36329 25990 22442 19998 15764 13974 13947 13082 15605
8518A5605r332j8442k511J2845O939M848N240O268j8928n527L815M501m033p667
$$ 15605 6273 -12169 -14680 -1835 5104 9952 15192 21460 2532 -2995 820 5321 1288 -6379
8504f379O582R220M936M375M991k854k735M026m612J975J8739J3046K1893L9262
$$ -6379 203 9423 14359 18734 23725 20871 18136 22162 17550 19525 38264 51310 73203 112465
8490A12465M8637Q4012R3696J6310o4064q9648o9985m0611k7639j1135j1887o184
$$ 112465 161102 245114 338810 355120 291056 201408 131423 90812 63173 52038 40151 33967
8478C3967o562r640Q547L084j6523j1996J0269m845q920l872L892K794M236r587
$$ 33967 27405 17765 26312 29396 12873 877 11146 6301 -2619 -6491 -2599 195 4431 -5156
8464e156j786J62M17M081J821N210K306o249l560J0633J6731J262J3470R479N312
$$ -5156 -6942 -6780 -6363 -2282 -461 4749 7055 806 -2754 7879 24610 25872 39342 48821 54133
8449E4133J963O90N559K4962L6515M1928L9392J284j9010k6092k8970k8962k6664
$$ 54133 56096 56786 62345 87307 123822 165750 205142 206426 187416 161324 132354 103392 76728
8436G6728j4865j5360k528Q576L143m036j2924o340j0626J885m138m717R60l155
$$ 76728 61863 46503 43975 52551 55694 51658 38734 32394 21768 23653 19515 14798 15758 12603
8422A2603J191k501m59r270k606O014J1563K851o62p107J02p695r609m922P039
$$ 12603 13794 11293 10834 1564 -1042 4972 16535 19386 18724 11617 11719 4024 -5585 -10507 -3468
8407c468L536j1318p134N083n406J1813J2817O55m177j0635j5180k229R884j852
$$ -3468 68 -11250 -18384 -13301 -18707 -6894 5923 6578 2401 -8234 -23414 -25643 -15759 -17611
8393a7611L962N508M436L458p390L154p120q788Q879M424j020L60p140J0106O029
$$ -17611 -13649 -8141 -3705 -247 -7637 -4483 -11603 -20391 -11512 -7088 -8108 -7748 -14888 -4782 1247
8378A247L955J164O365L681p883j688q34r3p929Q097k454R776q187L957O574M289
$$ 1247 5202 6366 12731 16412 8529 6841 6007 5914 -2015 6082 3628 13404 5217 9174 15748 20037
8362B0037K512r017l270k707n581j1930R089P719j6476j0441M193J2401O245j842
$$ 20037 22549 13532 10262 7555 1974 -9956 -867 6852 -9624 -20065 -15872 -3471 2774 932
8348I32n886R70q855P217L699J2913j0188j4706j0587m179K537Q851O082L744
$$ 932 -4954 -3984 -12839 -5622 -1923 10990 802 -13904 -24491 -28670 -26133 -17282 -11200 -7456
8334g456p10r3M588r723N889J5138K061k955M639m299K166J428m528m782J979
$$ -7456 -8166 -8259 -3671 -13394 -7505 7633 9694 6739 11378 7079 9245 10673 6145 1363 3342
8319C342K788r309r918K769J0256j022j299J3917O877j1324j1234j203J0769J6303
$$ 3342 6130 -3179 -13097 -10328 -72 -1094 -2393 11524 18401 7077 -4157 -5360 5409 21712
8305B1712J376j464k274m604o806J29mm340m567J4403J0310n243K861o42j016
$$ 21712 23088 21624 19350 14746 7940 8069 8065 3725 -842 13561 23871 18628 21489 20847 19831
8290A9831j1358o592r980j5769L62J5263l83l37K423Q514m162k007L392n54N245
$$ 19831 8473 1881 -8099 -23868 -23506 -8243 -8626 -8963 -6540 1974 -2188 -4195 -803 -1357 3888
8275C888m74j0867Q607L538N384l928n534q453m117L335K0639J3670r686O38J845
$$ 3888 3414 -7453 1154 4692 10076 6148 614 -7839 -11956 -8621 12018 25688 16002 16640 18485
8260A8485p013o561k573Q470p904l832K424J583N402k283q302K236l52L706m654
$$ 18485 11472 4911 2338 10808 2904 -928 1496 3079 8481 6198 -2104 132 -220 3486 -1168
8245a168M511k787p266J329q089J606N716k339J0496L053J0j2448N03j776j4973
$$ -1168 3343 556 -6710 -5381 -13470 -11864 -6148 -8487 2009 5062 5072 -7376 -6873 -8649 -23622
8230b3622N752J4921L946j986m034k303K340J179N814j638l161N43p812L433P182
$$ -23622 -17870 -2949 997 -989 -5023 -7326 -4986 -3807 2007 369 -2792 -2249 -10061 -6628 554
8215E54j2492o295M766J913K784k549P693M236J836j1418k094l306j0904L369
$$ 554 -11938 -18233 -13467 -11554 -8770 -11319 -3626 610 2446 -8972 -11066 -14372 -25276 -21907
8201b1907P996J1566l059P715k360p192M114O766j77r814p446J43L544O091J1697
$$ -21907 -13911 -2345 -5404 2311 -49 -7241 -3127 3639 3462 -6352 -13798 -13655 -10111 -4020 7677
8186G677o648M584j0723Q253J820k713k615K315N713k24j0505Q347Q101J9198
$$ 7677 1029 5613 -5110 3143 4963 2250 -365 1950 7663 7439 -3066 5281 13382 32580
8172C2580j0882p092r920p588m129J3000M04p552K53p304m608J1694r51q172L39
$$ 32580 21698 14606 4686 -2902 -7031 5969 6373 -1179 -926 -8230 -12838 -1144 -2095 -10267 -9928
8157i928Q012q16l829P660P056o08M208K705K472o52o16j74l935m626j4130j2302
$$ -9928 -1916 -2732 -6561 1099 8155 7547 11755 14460 16932 16280 15664 15490 11555 6929 -7201 -19503
8141a9503P518O198J0769j0896j3967L039R280P719K714p369m022k96Q000N53
$$ -19503 -11985 -5787 4982 -5914 -19881 -16842 -7562 157 2871 -4498 -8520 -8816 -816 -263
8127b63L031O205l896o581j2863p41R699M359j1519j5652j4356m371J4583K6728
$$ -263 2768 8973 5077 -1504 -14367 -15108 -5409 -1050 -12569 -28221 -42577 -46948 -32365 -5637
8113e637n995o509L512l675q99J0436O690M054K559L729J027j261r706l464o408
$$ -5637 -11632 -18141 -14629 -18304 -19203 -8767 -2077 1977 4536 8265 9292 8031 -1675 -5139 -11547
8098a1547j862j265O966J2464k762j3244m084L776j1764j576R286P304P641R141
$$ -11547 -13409 -14674 -7708 4756 1994 -11250 -15334 -11558 -23322 -24898 -15612 -8308 -667 8474
8084H474m183Q08o316N942N408j4082O079p809p078J955Q14N058L891p037K885
$$ 8474 4291 5099 -1217 4725 10133 -3949 2130 -5679 -12757 -10802 -9988 -4930 -1039 -8076 -5191
8069e191Q576P602j5n579l512N85o932L443q869j1117K950J530J21P197J0670
$$ -5191 3385 10987 10972 5393 1881 2466 -4466 -1023 -9892 -21009 -18059 -16529 -16408 -9211 1459
8054A459m378N623J4326p688n540k391P908L714o372r118k2697j128N733k967
$$ 1459 -2919 2704 17030 9342 3802 1411 9319 13033 6661 -2457 -25154 -26282 -20549 -23516
8040b3516M849J3494M533J111J3793J3720k36j4877j3827O466j182j327J2313
$$ -23516 -18667 -5173 -640 471 14264 27984 27748 12871 -956 5510 4328 3001 15314
8027A5314n583j299J483l7j0040q532J0653Q269j453l513k779m269L826J1114
$$ 15314 9731 8432 9915 9878 -162 -8694 1959 10228 8775 5262 2483 -1786 2040 13154
8013A3154J529q4J018j989q208j0624J1673J7142p504j778j0891J090P387m564
$$ 13154 14683 14599 15617 13628 5420 -5204 6469 23611 16107 14329 3438 4528 11915 7351
7999G351K013M326K011j0897n411L13J5643J6869O123J467j510j25j0622j6577
$$ 7351 9364 13690 15701 4804 -607 -294 15349 32218 38341 39808 38298 38173 27551 10974
7985A0974j1017K559j1350j1057o78J2656Q548M307m945l018J1510Q862n212m940
$$ 10974 -43 2516 -8834 -19891 -20569 -7913 635 4942 -3 -3021 8489 17351 12139 7199
7971G199q159P416O441P648m931j0812N351k39P40P914n037q187j1322j4664l889
$$ 7199 -960 6456 12897 20545 15614 4802 10153 9914 10654 18568 13531 5344 -5978 -20642 -24531
7956b4531Q608J1775J2782Q506l502L30J210R190J6912j659o124r679j5499O77
$$ -24531 -15923 -4148 8634 17140 13638 13968 15178 24368 41280 39621 33497 23818 8319 8996
7942H996P380J685o397k307L532L657m674L224j0065r622M19J698L558J793J0643
$$ 8996 16376 18061 11664 9357 12889 16546 11872 15096 5031 -4591 -4172 -2474 1084 2877 13520
7927A3520L7j542j1418M335Q027J0535k554n034j5639j898Q552j3885j1908N331
$$ 13520 13557 12015 597 4932 12959 23494 20940 15906 267 -1631 6921 -6964 -18872 -13541
7913a3541M441j193l915o121O82N059K564L31J31J0472L556l409l353n715J96
$$ -13541 -9100 -10293 -14208 -20329 -19647 -14588 -12024 -11693 -11562 -1090 2466 -943 -4296 -10011 -9815
7898i815J909j76k657J2001J188k873n807M653J768p544J3178J190R513R034J049
$$ -9815 -7906 -8082 -10739 1262 2450 -423 -6230 -1577 191 -7353 5825 7015 16528 25562 26611
7883B6611k2038j2274o573K936m41J1760k021q549m491l20O623K567l701J252
$$ 26611 4573 -7701 -14274 -11338 -11779 -19 -2040 -10589 -15080 -15400 -8777 -6210 -9911 -8659
7869h659j819J69N005k930m745n832L253J1560J659m418J1395J0903R266N272
$$ -8659 -10478 -10309 -5304 -8234 -12979 -18811 -15558 -3998 -2339 -6757 4638 15541 24807 30079
7855C0079j0786j1659L031p958j7070p182O804J8531q632k5314J3182J5090m281
$$ 30079 19293 7634 10665 2707 -14363 -21545 -14741 3790 -4842 -30156 -16974 -1884 -6165
7842f165J811n220K773O597k906L171O023M973l692K138j509j3155r507K212M491
$$ -6165 -4354 -9574 -6801 -204 -3110 61 6084 11057 7365 9503 7994 -5161 -14668 -12456 -7965
7827g965o323j039J6438n040q733L920O854L559N748K683o591p860j4973o585
$$ -7965 -14288 -15327 1111 -3929 -12662 -8742 -1888 1671 7419 10102 3511 -4349 -19322 -25907
7813b5907J0682K5445j173j2112m067m457J959N96O003J1782L146j335j6070r641
$$ -25907 -15225 10220 9047 -3065 -7132 -11589 -9630 -9034 -3031 8751 11897 10562 -5508 -15149
7799a5149M012K75M649j3639K485J0486J944N420p20P12P899n202r685L845K676
$$ -15149 -11137 -10862 -6213 -19852 -17367 -6881 -4937 483 -237 475 8374 3172 -6513 -2668 8
7784Hj2585P076K970p999J57L089J1621L542j5358l766J5756m000o462Q296K507
$$ 8 -12577 -5501 -2531 -10530 -10373 -7284 4337 7879 -7479 -11245 4511 511 -5951 2345 4852
7769D852m758L337j194o488j1957j956P224N126m502o218o207M331J0246K910
$$ 4852 94 3431 2237 -4251 -16208 -18164 -10940 -5814 -10316 -16534 -22741 -18410 -8164 -5254
7755e254M617p346k172j1507p89R91R42J293N483O433M812J822J466o547M490
$$ -5254 -637 -7983 -10155 -21662 -22451 -21460 -20518 -19225 -13742 -7309 -2497 -675 791 -5756 -1266
7740a266J0193M276n007j6472j0238Q983M967R891m419n332n406p50q40n331L383
$$ -1266 8927 13203 8196 -8276 -18514 -9531 -4564 5327 908 -4424 -9830 -10580 -11420 -16751 -13368
7725a3368l288l092M448j794J65L64J5156Q819Q08k346p954j0641o736J0092m124
$$ -13368 -16656 -19748 -15300 -17094 -16929 -16565 -1409 7410 8218 5872 -2082 -12723 -19459 -9367 -13491
7710a3491p898N282J3212N841L4N11r732J970K141j474q87m293K877m452K372
$$ -13491 -21389 -16107 -2895 2946 2980 3491 -6241 -4271 -2130 -3604 -4491 -8784 -5907 -10359 -7987
7695g987R621K295k619p094o279J0431J2607k725p863M006k228p055n17Q9J615
$$ -7987 1634 3929 1310 -5784 -12063 -1632 10975 8250 387 4393 2165 -4890 -5407 -5318 -3703
7680c703M919l608r8l706l644J5409J2150m323r869j0728j5343J436j1477j517
$$ -3703 1216 -2392 -2490 -6196 -9840 5569 17719 13396 3527 -7201 -22544 -21108 -32585 -34102
7666c4102L867J0714R381L236p611n067J0376M989O980R470O71j006p695M506
$$ -34102 -30235 -19521 -10140 -6904 -14515 -19582 -9206 -4217 2763 12233 12904 11898 4203 8709
7652H709o328n109L832J0419O78j558J028n478p078k819p170M60j316N137r295
$$ 8709 2381 -2728 1104 11523 12201 10643 11671 6193 -885 -3704 -10874 -10414 -11730 -6593 -15888
7637a5888l785R67L170L684Q647K380r548M193j887j0953N47l67J2409J0335o624
$$ -15888 -19673 -18706 -15536 -11852 -3205 -825 -10373 -6180 -8067 -19020 -18473 -18840 -6431 3904 -2720
7622b720L013m805r298p93L903J6345K954j0911L438N143j726l684p625m251L598
$$ -2720 293 -4512 -13810 -14603 -10700 5645 8599 -2312 1126 6269 4543 859 -6766 -11017 -7419
7607g419j619l018P551O219N58R12l664L395J81n446m845k395j554J69k079r02
$$ -7419 -9038 -12056 -4505 1714 2272 3184 -480 2915 3096 -2350 -7195 -9590 -11144 -10975 -13054 -13956
7591a3956J233k59j0229o569Q638K548l58P817J882k803O821L195o191k184L71
$$ -13956 -12723 -12982 -23211 -29780 -21142 -18594 -18952 -11135 -9253 -12056 -5235 -2040 -8231 -10415 -10044
7576a0044P054J767N668Jm210Q916j619r319L87j624P89m167J610O71o576k992
$$ -10044 -2990 -1223 4445 4446 236 9152 7533 -1786 -1399 -3023 -2234 -6401 -4791 -4120 -10696 -13688
7560a3688j026M463J840m173N730N301L574J7539J3167O23p624j5217j5053p210
$$ -13688 -14714 -10251 -8411 -12584 -6854 -1553 2021 19560 32727 33350 25726 10509 -4544 -11754
7546a1754L407J0405O875J068r164p959R045M778R680J59J10J50o669q97L733
$$ -11754 -8347 2058 8933 10001 837 -7122 1923 6701 16381 16540 16650 16800 10131 9234 12967
7531A2967J243l089q336r709j4091j1760N758J4876Q569R151m148k091j0351J0318
$$ 12967 14210 11121 2785 -6924 -21015 -32775 -27017 -12141 -3572 5579 1431 -660 -11011 -693
7517f93N663J069o188J978J3681O936m076l853q106M540P36j7177M208j164j0102
$$ -693 4970 6039 -149 1829 15510 22446 18370 14517 6411 10951 11687 -5490 -1282 -2446 -12548
7502a2548K61n276J644K348p0O337j416j6118J466K0791o958l730L141K447L536
$$ -12548 -12287 -17563 -15919 -13571 -13641 -7304 -8720 -24838 -23372 -2581 -9539 -13269 -10128 -7681 -4145
7487d145O420l875J606J0591j275j5648p460L848K264q950m58n31j242P769J7866
$$ -4145 2275 -1600 6 10597 9322 -6326 -13786 -9938 -7674 -16624 -17082 -17613 -18855 -11086 6780
7472F780k262j5121j8747j096O628J4958N193Q987n195J5807p748m493K319M475
$$ 6780 4518 -10603 -29350 -30446 -23818 -8860 -3667 5320 125 15932 8184 3691 6010 10485
7458A0485o003m395Q186Q555K20o153Q609j2602j6811J0282J2397j4441j0125
$$ 10485 4482 87 8273 16828 17048 10895 19504 6902 -9909 373 12770 -1671 -11796
7445a1796J5476q39m422L423Q317J177q684p930M30J2918m360n183l754k66q186
$$ -11796 3680 2841 -1581 1842 10159 11336 2652 -5278 -4848 8070 3710 -1473 -5227 -5493 -13679
7430a3679J532O30K695j2853M481O762L055N787J2622p863o874k561j1Q36O425
$$ -13679 -12147 -11517 -8822 -21675 -17194 -10432 -7377 -1590 11032 3169 -3705 -6266 -6277 -5441 984
7415I84M715M772k509n188q886m110Q950R383p152l244J388o12p214Q0r351j414
$$ 984 5699 10471 7962 2774 -6112 -10222 -1272 8111 959 -2285 -897 -1509 -8723 -8643 -17994 -19408
7399a9408J1003N741n200j0355R574N53M161j443l182k356M920m411k846n001
$$ -19408 -8405 -2664 -7864 -18219 -8645 -8092 -3931 -5374 -8556 -10912 -5992 -10403 -13249 -18250
7385a8250k044k742M648R843l778K344l717J159L770M876q427M037m542O270J891
$$ -18250 -20294 -23036 -18388 -8545 -12323 -9979 -13696 -12537 -8767 -3891 -12318 -8281 -12823 -6553 -4662
7370d662j0763n09J1431j0223p615L368o158J2464M442m19N371j624L256j783
$$ -4662 -15425 -15934 -4503 -14726 -22341 -18973 -25131 -12667 -8225 -8644 -3273 -4897 -1641 -3424
7356c424j493J525O651K335n500k535l611Q533j800j1115R254L332K026n067N066
$$ -3424 -4917 -3392 3259 5594 94 -2441 -6052 2481 681 -10434 -1180 2152 4178 -889 4177
7341D177J121n546P072j3704n434M164r584j0986j982J3040J0113k918p582L295
$$ 4177 5298 -248 6824 -6880 -12314 -8150 -17734 -28720 -30702 -17662 -7549 -10467 -18049 -14754
7327a4754j666r329K414J3115J1357K251l615j1510p293L059n038J2049K876n19
$$ -14754 -16420 -25749 -23335 -10220 1137 3388 -227 -11737 -19030 -15971 -21009 -8960 -6084 -6603
7313f603k101j0558o232L806Q046o078P393Q607q651j1937K151J1670N080J362
$$ -6603 -8704 -19262 -25494 -21688 -13642 -19720 -12327 -3720 -12371 -24308 -22157 -10487 -5407 -4045
7299d045M14K029l744q32r170m051J2901n561o021o23J1847O212K705k226P305
$$ -4045 -3631 -1602 -5346 -6178 -15348 -19399 -6498 -12059 -18080 -18703 -6856 -644 2061 -165 7140
7284G140k05j0324k375O143O748j835r050J904K769L216Mp209o74R024J265j2388
$$ 7140 6935 -3389 -5764 379 7127 5292 -3758 -1854 915 4131 4135 -3074 -3748 5276 6541 -5847
7268e847m84N179K209R69j1525m248J1931J3683p246n883M151p449j517K28o331
$$ -5847 -6331 -1152 1057 2026 -9499 -13747 -1816 11867 4621 -1262 2889 -4560 -6077 -5849 -12180
7253a2180L441K819R1M067o665j1267j622Q639j0582J601P262O662m115r266k645
$$ -12180 -8739 -5920 -5829 -1762 -8427 -19694 -21316 -12677 -23259 -21658 -14396 -7734 -11849 -21115 -23760
7238b3760K626o911J2050J0688K39n98Q807P378p24N347J479k539j5939n179L417
$$ -23760 -21134 -28045 -15995 -5307 -5068 -5666 3141 10519 9795 15142 16621 14082 -1857 -7036 -3619
7223c619j1291K915r01j0336J138J0041L078K921L248r035p160l873j62J353k881
$$ -3619 -14910 -11995 -12896 -23232 -22094 -12053 -8975 -6054 -2806 -11841 -19001 -22874 -23036 -21683 -24564
7208b4564K4861J0581q982r036J058J38j649j8463K382R419J2512R4J500O041
$$ -24564 297 10878 1896 -7140 -6082 -5944 -7593 -26056 -23674 -14255 -1743 -1649 -149 5892
7194E892j885q476r500l78K376J329m569n73j148J0914R029n719r646M413K822
$$ 5892 4007 -4469 -13969 -14347 -11971 -10642 -15211 -15784 -16932 -6018 3011 -2708 -12354 -7941 -5119
7179e119j51l973k916K513j2578j5630J2563Q140r354j519J3793Q489n156L34
$$ -5119 -5270 -9243 -12159 -9646 -22224 -37854 -25291 -17151 -26505 -28024 -14231 -5742 -10898 -10564
7165a0564n879p675Q161J2147M075o234M891L308M746K654r513q534j2405O457
$$ -10564 -16443 -24118 -15957 -3810 265 -5969 -1078 2230 6976 9630 117 -8417 -20822 -14365
7151a4365L048j8l21n926n148j434M877R933O343K20j1424j2151k480J491K952
$$ -14365 -11317 -11335 -11656 -17582 -22730 -24164 -19287 -9354 -3011 -2791 -14215 -26366 -28846 -27355 -24403
7136b4403J6881J2578L359m152q159j926j1997k759J3072P827j5823j3303j545
$$ -24403 -7522 5056 8415 4263 -3896 -5822 -17819 -20578 -7506 321 -15502 -28805 -30350
7123c0350Q972j278R887O015o287M256L552r531q481J0009K673M242l926o485
$$ -30350 -21378 -22656 -12769 -6754 -13041 -8785 -5233 -14764 -23245 -13236 -10563 -6321 -10247 -16732
7109a6732m885K809j529k594R739K817q109K712r28k362K206L102l477K042Q568
$$ -16732 -21617 -18808 -20337 -22931 -13192 -10375 -18484 -15772 -16700 -19062 -16856 -13754 -17231 -15189 -6621
7094f621J010J511l386J520N02j165m395J810M914J4304K021p431M366k26K884
$$ -6621 -5611 -4100 -7486 -5966 -5464 -6629 -11024 -9214 -4300 10004 12025 4594 8960 8734 11618
7079A1618j481p127l383J640k570j7959L82J3767R793J549l721l977l047k838
$$ 11618 10137 3010 -373 1267 -1303 -19262 -18880 -5113 4680 6229 2508 -1469 -4516 -7354
7065g354O51j064J875N627q529N97N441k031k917P961P364J2812N244J997L28
$$ -7354 -6703 -7767 -5892 -265 -8794 -8197 -2756 -4787 -7704 257 7621 20433 25677 27674 28002
7050B8002r732r355r160r284m276N486J6189J330K134M842j004k592L168J950
$$ 28002 18270 8915 -245 -9529 -13805 -8319 7870 9200 11334 16176 15172 12580 15748 17698
7036A7698n101j3854R198P389N756q308j5344r82L788m265q558j657J2766J1297
$$ 17698 12597 -1257 7941 15330 21086 12778 -2566 -3548 240 -4025 -12583 -14240 -1474 9823
7022I823j763o671o369k613j3862K184J2758j0763q2R947J327J086K701R329k196
$$ 9823 8060 1389 -4980 -7593 -21455 -19271 -6513 -17276 -17358 -7411 -6084 -4998 -2297 7032 4836
7007D836Q299K2129J4299J284n272K617o499o777j8657r032K597p223q898l183
$$ 4836 13135 35264 49563 50847 45575 48192 41693 34916 16259 7227 9824 2601 -6297 -9480
6993i480J1703l125J804k886R246k18l676q688n797k316J0092O502J144k099K113
$$ -9480 2223 -902 902 -1984 7262 7044 3368 -5320 -11117 -13433 -3341 3161 4305 2206 4319
6978D319P008l539J260p613L657o505m119M412O910m042p96q095j2758m635J1814
$$ 4319 11327 7788 9048 1435 5092 -1413 -5532 -1120 5790 1748 952 -7143 -19901 -24536 -12722
6963a2722O013j944l544Q601p366k710R896Q038m491j4699j0964M898j556n689
$$ -12722 -6709 -8653 -12197 -3596 -10962 -13672 -3776 4262 -229 -14928 -25892 -20994 -22550 -28239
6949b8239L260J390l641L25k413Q152J5865J7171j1115j3154k020m356K906P703
$$ -28239 -24979 -23589 -27230 -26905 -29318 -21166 -5301 11870 755 -12399 -14419 -18775 -15869 -8166
6935h166n707j44o797n384R659K500p236J46Q857J818l285Q197M118J01l817K22
$$ -8166 -13873 -14017 -20814 -26198 -16539 -14039 -21275 -21129 -12272 -10454 -13739 -5542 -1424 -1323 -5140 -4918
6919d918N47L229J1671k806K784l219j2880l261j321J077J819k953J170L33J0759
$$ -4918 -4371 -1142 10529 7723 10507 7288 -5592 -8853 -10174 -9097 -7278 -10231 -9061 -8728 2031
6904B031L551j0057l958Q954R216K599q171k0112j970J8585J0822J0015o146j2352
$$ 2031 5582 -4475 -8433 521 9737 12336 4165 -15947 -17917 668 11490 21505 15359 3007
6890C007j2469M480L393o231k531J1701L837o186m202k139R265m779K69O837k429
$$ 3007 -9462 -4982 -1589 -7820 -10351 1350 5187 -999 -5201 -7340 1925 -2854 -2585 4252 1823
6875A823l511J2114K114j322j2055j4062J494k135m805O054M287n174M339K466
$$ 1823 -1688 10426 12540 11218 -837 -14899 -13405 -15540 -20345 -14291 -10004 -15178 -10839 -8373
6861h373n337L525o654K109L969L548K947j753N694j1937L013J0989K354j4703
$$ -8373 -13710 -10185 -16839 -14730 -10761 -7213 -4266 -6019 -325 -12262 -9249 1740 4094 -10609
6847a0609j409R953J824l416j0021l51k022J2262N634o181J698O993M775j00p877
$$ -10609 -12018 -2065 -241 -3657 -13678 -14029 -16051 -3789 1845 -4336 -2638 4355 9130 9030 1153
6832A153p097j1285m548m92M069J277M941L51M299m837L645Q545l398M198R330
$$ 1153 -5944 -17229 -21777 -22269 -18200 -16923 -11982 -11631 -7332 -12169 -8524 21 -3377 821 10151
6817A0151m239j4143j333M507L946k181R9K961Q10J097N37m321n948R56J2008
$$ 10151 5912 -8231 -9564 -5057 -1111 -3292 -3193 -232 578 1675 2212 -2109 -8057 -7101 4907
6802D907R069q38p386p604J727j231n298l59L2l549J133k758k4J5623j233m940
$$ 4907 13976 13138 5752 -1852 -125 -1356 -6654 -7013 -6981 -10530 -9397 -12155 -12179 3444 2211 -2729
6786b729L353j11p867o09K532O175L418j5061j2679J6869N604j0044l668M306
$$ -2729 624 513 -7354 -7963 -5431 744 4162 -10899 -23578 -6709 -1105 -11149 -14817 -10511
6772a0511P173L684k372M881Q618m353p398r304k691J2596P278O275m823K263
$$ -10511 -3338 346 -2026 2855 11473 7120 -278 -9582 -12273 323 7601 13876 9053 11316
6758A1316O224R54m292k0656k744K833J77J761m036J465J941O775M464L498M3
$$ 11316 17540 18494 14202 -6454 -9198 -6365 -6188 -4427 -8463 -6998 -5057 1718 6182 9680 9723
6743I723M056r610p849m566J88N621l5M071M369r00M40J121n539P246p56j1665
$$ 9723 13779 4169 -3680 -8246 -8058 -2437 -2472 1599 5968 5068 5508 6629 1090 8336 7580 -4085
6727d085P228J3773R539L26K668r856p874j2640Q528J043j2263m668P656N932
$$ -4085 3143 16916 26455 26781 29449 19593 11719 -921 7607 8650 -3613 -8281 -625 5307
6713E307n294m02K209L203n94j0411m511p460m008L915J258N961P75N362J432
$$ 5307 13 -389 1820 5023 4429 -5982 -10493 -17953 -21961 -18046 -16788 -10827 -10052 -4690 -3258
6698c258n136j981J1821N105Q07L856J821l387k214P701m701j0398o118k199K457
$$ -3258 -8394 -10375 1446 6551 7358 11214 13035 9648 7434 15135 10434 36 -6082 -8281 -5824
6683e824J1240P912M044p428j6043N719N434J3393Q08k0218k389N417K230Q142
$$ -5824 5416 13328 17372 9944 -6099 -380 5054 18447 19255 -963 -3352 2065 4295 12437
6669A2437J4739L473l938p782P812J6669N252K384M585N175K0882K3479J5504
$$ 12437 27176 30649 26711 18929 26741 43410 48662 51046 55631 60806 81688 105167 120671
6656A20671K2299N9356J01749J26197O4108l9194q4567q5193l1662O944J4391
$$ 120671 142970 202326 304075 430272 494380 455186 370619 285426 253764 260708 275099
6645B75099J5416M1853O6142Q5333J16798J70100K26346L19392M34746O37284
$$ 275099 290515 332368 398510 483843 600641 770741 997087 1316479 1751225 2388509
6635B388509J094695K043982L799947M975981K578457j974421m001023l819636
$$ 2388509 3483204 5527186 9327133 14303114 16881571 14907150 10906127 7086491
6627G086491k414832j427448q79302n71871m11506l12203k25234j60885j22192
$$ 7086491 4671659 3244211 2364909 1793038 1381532 1069329 844095 683210 561018
6618E61018q8965n3555m4636l2290O550K3721O9881J00992N5080o3225j12544
$$ 561018 472053 418498 373862 341572 348122 371843 441724 542716 597796 534571 422027
6607D22027j09183p5778n3827k5405j7399k8341j2727j1882l807k255q74n011
$$ 422027 312844 237066 183239 157834 140435 112094 99367 87485 83678 81423 80549 75538
6595G5538J974n293n250m400M747N232L001J0053q698j8185q086j560m631J326
$$ 75538 77512 72219 66969 62569 67316 72548 75549 85602 76904 58719 50633 49073 44442 45768
6581D5768l342r780o906N922K762m643J2073l519n357m954j8064k064R104o99
$$ 45768 42426 32646 25740 31662 34424 29781 41854 38335 32978 28024 9960 7896 17000 16301
6567A6301l530Q49O432L289M687j4510p889J31O37K201J0160o392q736J10p740
$$ 16301 12771 13620 20052 23341 28028 13518 5629 5760 6397 8598 18758 12366 3630 3740 -4000
$$ [...]
##END NTUPLES=NMR SPECTRUM
##END=
