##TITLE=Analysis number 317871
Compound Code cc 44504
Book Reference 464/22/1
Project Code adrs
Chemist Name chrisr
##JCAMPDX= 6.0         $$ Bruker NMR JCAMP-DX V2.0
##DATA TYPE= NMR SPECTRUM
##DATA CLASS= NTUPLES
##ORIGIN= Bruker BioSpin GmbH
##OWNER= nmr
$$ XWIN-NMR		Version 3.5
$$ Tue Mar  7 14:19:23 2006 GMT Standard Time (UT+0h)  MAYBRIDGE\nmr@NMR_250MHZ
##.OBSERVE FREQUENCY= 250.131544655141
##.OBSERVE NUCLEUS= ^1H
##.ACQUISITION MODE= SIMULTANEOUS (DQD)
##.ACQUISITION SCHEME= undefined
##.AVERAGES= 16
##.DIGITISER RES= 18
##SPECTROMETER/DATA SYSTEM= dpx250
##.PULSE SEQUENCE= zg30
##.SOLVENT NAME= CDCl3
##.SHIFT REFERENCE= (INTERNAL, CDCl3, 0, 16.4461)
##AUDIT TRAIL= $$ (NUMBER, WHEN, WHO, WHERE, WHAT)
$$ ##TITLE= Audit trail, XWIN-NMR		Version 3.5
$$ ##JCAMPDX= 5.01
$$ ##ORIGIN= Bruker BioSpin GmbH
$$ ##OWNER= nmr
$$ C:\u/data/dgb/nmr/ADRS/170/pdata/1/auditp.txt
$$ ##AUDIT TRAIL=  $$ (NUMBER, WHEN, WHO, WHERE, WHAT)
(   1,<2006-03-07 14:18:54.01 +000>,<MAYBRIDGE\nmr>,<NMR_250MHZ>,
      <created by zg, POWCHK disabled, PULCHK disabled
       configuration hash MD5:
       84 BC 41 DB A1 6E 1D 46 DA 25 12 A5 C1 ED C5 3A
       data hash MD5: 64K
       57 A9 DF 28 C6 A3 1C E4 2F 25 2A 83 41 B1 BF BE>)
(   2,<2006-03-07 14:19:12.74 +000>,<MAYBRIDGE\nmr>,<NMR_250MHZ>,
      <Start of raw data processing
       ef LB = 0.3 FT_mod = 6 PKNL = 1 SI = 32K 
       data hash MD5: 32K
       F7 23 49 D6 89 42 A3 84 E6 31 9A 2C F3 3B 41 D8>)
(   3,<2006-03-07 14:19:14.37 +000>,<MAYBRIDGE\nmr>,<NMR_250MHZ>,
      <apk 
       data hash MD5: 32K
       56 24 CD 13 CC 8B 9C 13 4F 47 75 37 FC 72 C5 77>)
(   4,<2006-03-07 14:19:15.27 +000>,<MAYBRIDGE\nmr>,<NMR_250MHZ>,
      <abs ABSG = 5 
       data hash MD5: 32K
       1A B0 4E 8E 0C 8C EE 1E A6 FA CB FF 74 22 7C 6F>)
$$ ##END=
$$ 
$$ hash MD5
$$ A0 E0 AD F4 D9 2C C6 45 81 65 CA EF A8 3E 53 EA
##$RELAX= 
##$RELAX= 
##$RELAX= 
##$RELAX= 
##$RELAX= 
##$RELAX= 
##$RELAX= 
$$ Bruker specific parameters
$$ --------------------------
##$DU= <C:\u>
##$EXPNO= 170
##$NAME= <ADRS>
##$PROCNO= 1
##$TYPE= <nmr>
##$USER= <dgb>
##$AMP= (0..31)
100 100 100 100 100 100 100 100 100 100 100 100 100 100 100 100 100 100 
100 100 100 100 100 100 100 100 100 100 100 100 100 100 
##$AQSEQ= 0
##$AQ_mod= 3
##$AUNM= <au_zg>
##$AUTOPOS= <44 >
##$BF1= 250.13
##$BF2= 250.13
##$BF3= 250.13
##$BF4= 250.13
##$BF5= 500.13
##$BF6= 500.13
##$BF7= 500.13
##$BF8= 500.13
##$BYTORDA= 1
##$CFDGTYP= 0
##$CFRGTYP= 5
##$CHEMSTR= <none>
##$CNST= (0..31)
1 1 145 1 1 1 1 1 1 1 1 1 1 1 1 1 1 1 1 1 1 1 1 1 1 1 1 1 1 1 1 1 
##$CPDPRG= <>
##$CPDPRG1= <>
##$CPDPRG2= <>
##$CPDPRG3= <>
##$CPDPRG4= <mlev>
##$CPDPRG5= <mlev>
##$CPDPRG6= <mlev>
##$CPDPRG7= <mlev>
##$CPDPRG8= <mlev>
##$CPDPRGB= <>
##$CPDPRGT= <>
##$D= (0..31)
0 1 0 0 0 0 0 0 0 0.06 0 0 0 0 0 0 0.0002 0 0 0 0 0 0 0 0 0 0 0 0 0 0 
0 
##$DATE= 1141741131
##$DBL= (0..7)
120 120 120 120 120 120 120 120 
##$DBP= (0..7)
150 150 150 150 150 150 150 150 
##$DBP07= 0
##$DBPNAM0= <>
##$DBPNAM1= <>
$$ [...]
##$SUBNAM8= <"">
##$SUBNAM9= <"">
##$SW= 20.6930455092707
##$SWIBOX= (0..15)
0 0 3 0 0 0 0 0 0 0 0 0 0 0 0 0 
##$SW_h= 5175.983436853
##$TD= 65536
##$TD0= 1
##$TE= 294.16
##$TE2= 300
##$TE3= 300
##$TEG= 300
##$TL= (0..7)
0 120 120 120 120 120 120 120 
##$TP= (0..7)
150 150 150 150 150 150 150 150 
##$TP07= 0
##$TPNAME0= <>
##$TPNAME1= <>
##$TPNAME2= <>
##$TPNAME3= <>
##$TPNAME4= <>
##$TPNAME5= <>
##$TPNAME6= <>
##$TPNAME7= <>
##$TPOAL= (0..7)
0.5 0.5 0.5 0.5 0.5 0.5 0.5 0.5 
##$TPOFFS= (0..7)
0 0 0 0 0 0 0 0 
##$TUNHIN= 0
##$TUNHOUT= 0
##$TUNXOUT= 0
##$USERA1= <user>
##$USERA2= <user>
##$USERA3= <user>
##$USERA4= <user>
##$USERA5= <user>
##$V9= 5
##$VALIST= <valist>
##$VCLIST= <CCCCCCCCCCCCCCC>
##$VD= 0
##$VDLIST= <DDDDDDDDDDDDDDD>
##$VPLIST= <PPPPPPPPPPPPPPP>
##$VTLIST= <TTTTTTTTTTTTTTT>
##$WBST= 1024
##$WBSW= 4
##$XGAIN= (0..3)
0 0 0 0 
##$XL= 0
##$YL= 0
##$YMAX_a= 505617
##$YMIN_a= -584681
##$ZGOPTNS= <>
##$ZL1= 120
##$ZL2= 120
##$ZL3= 120
##$ZL4= 120
##$ABSF1= 16.44608
##$ABSF2= -4.247093
##$ABSG= 5
##$ABSL= 3
##$ALPHA= 0
##$AQORDER= 0
##$ASSFAC= 0
##$ASSFACI= 0
##$ASSFACX= 0
##$ASSWID= 0
##$AUNMP= <proc_1d>
##$AZFE= 0.1
##$AZFW= 0.1
##$BCFW= 0
##$BC_mod= 0
##$BYTORDP= 0
##$COROFFS= 0
##$CY= 12.5
##$DATMOD= 1
##$DC= 0
##$DFILT= <>
##$DTYPP= 0
##$F1P= 14.0000005364418
##$F2P= -0.99999901652339
##$FCOR= 0.5
##$FTSIZE= 32768
##$FT_mod= 6
##$GAMMA= 0
##$GB= 0
##$INTBC= 1
##$INTSCL= 1
##$ISEN= 128
##$LB= 0.3
##$LEV0= 0
##$LPBIN= 0
##$MAXI= 10000
##$MC2= 0
##$MEAN= 0
##$ME_mod= 0
##$MI= 0
##$NCOEF= 0
##$NC_proc= -3
##$NLEV= 6
##$NOISF1= 0
##$NOISF2= 0
##$NSP= 0
##$NTH_PI= 0
##$NZP= 0
##$OFFSET= 16.44608
##$PC= 1
##$PHC0= 249.8029
##$PHC1= 0.03566672
##$PH_mod= 1
##$PKNL= yes
##$PPARMOD= 0
##$PSCAL= 4
##$PSIGN= 0
##$REVERSE= no
##$SF= 250.130018988378
##$SI= 32768
##$SIGF1= 0
##$SIGF2= 0
##$SINO= 400
##$SIOLD= 32768
##$SREGLST= <1H.CDCl3>
##$SSB= 0
##$STSI= 32768
##$STSR= 0
##$SW_p= 5175.98343685301
##$SYMM= 0
##$S_DEV= 0
##$TDeff= 65536
##$TDoff= 0
##$TI= <Analysis number 999999
Compound Code 99
Book Reference 9
Project Code 9>
##$TILT= no
##$TM1= 0
##$TM2= 0
##$TOPLEV= 0
##$USERP1= <user>
##$USERP2= <user>
##$USERP3= <user>
##$USERP4= <user>
##$USERP5= <user>
##$WDW= 1
##$XDIM= 32768
##$YMAX_p= 283176869
##$YMIN_p= -187610
$$ End of Bruker specific parameters
$$ ---------------------------------
##NTUPLES= NMR SPECTRUM
##VAR_NAME=  FREQUENCY,     SPECTRUM/REAL,   SPECTRUM/IMAG
##SYMBOL=    X,             R,               I
##VAR_TYPE=  INDEPENDENT,   DEPENDENT,       DEPENDENT
##VAR_FORM=  AFFN,          ASDF,            ASDF
##VAR_DIM=   32768,         32768,           32768
##UNITS=     HZ,            ARBITRARY UNITS, ARBITRARY UNITS
##FACTOR=    0.157963299565203, 1,           1
##FIRST=     4113.65811612501, 0,            0
##LAST=      -1062.325320728, 0,             0
##MIN=       -1062.325320728, -187610,       0
##MAX=       4113.65811612501, 283176869,    0
$$ Real data points
##PAGE= N=1
##DATA TABLE= (X++(R..R)), XYDATA
$$ [...]
##PAGE= N=2
##DATA TABLE= (X++(I..I)), XYDATA
$$ plain form
27822 812904 778214 769445 737437 760416 837062 846122 878045 906235 892298 872029 800633 775845
27810 775845 808328 838777 845203 878200 883166 857312 866026 873328 859317 846703 850115 849872 822527
27797 822527 829866 794317 769736 808522 845967 840188 808748 836044 834161 844424 887917 910086
27785 910086 911775 920570 862949 813494 828372 860329 930829 938820 916955 924869 918413 947196
27773 947196 933704 902067 908711 864445 816953 850603 833301 798556 816614 859256 915519 919934
27761 919934 901855 815012 795745 820922 801266 784667 854674 871943 838228 799177 818583
27750 818583 839660 807151 828764 837875 863774 864765 853076 846533 872070 878628 875290 883287 875985
27737 875985 880274 823602 800702 805015 849680 849425 823182 826386 817008 790236 753867 752833 767524
$$ packed form
27822H12904l4690q769l2008K2979P6646R060L1923K8190j3937k0269p1396k4788
27810G75845L2483L0449O426L2997M966k5854Q714P302j4011j2614L412k43k7345
27797H22527P339l5549k4581L8786L7445n779l1440K7296j883J0263M3493K2169
27785I10086J689Q795n7621m9455J4878L1957P0500P991k1865P914o456K8783
27773I47196j3492l1637O644m4266m7492L3650j7302l4745J8058M2642N6263M415
27761I19934j8079q6843j9267K5177j9656j6599P0007J7269l3715l9051J9406
27750H18583K1077l2509K1613R111K5899R91j1689o543K5537O558l338P997p302
27737H75985M289n6672k2900M313M4665k55k6243L204r378k6772l6369j034J4691
$$ plain form
27724 767524 755792 771870 801657 799142 792728 850429 896485 920766 926085 879914 879417 896116
27712 896116 914761 912633 895937 891911 861484 846210 863715 875410 873327 845866 855008 889158
27700 889158 902075 896640 925498 885175 865441 861940 894985 911864 919498 855934 800665 799923
27688 799923 815254 879957 892416 895168 850911 858613 870355 863599 857000 891714 901623 885869
27676 885869 874144 826357 835323 851359 850087 841951 835964 868517 858737 851878 870651 868192 845111
27663 845111 809799 831923 874353 900762 876584 869452 848697 871421 864651 844431 838692 842677
27651 842677 839532 830551 841404 850413 892763 921863 896460 873106 898182 887236 840560 825760
27639 825760 850694 866528 871894 887087 884939 905780 919959 885917 862371 876172 824757 808008
$$ packed form
27724G67524j1732J6078K9787k515o414N7701M6056K4281N319m6171m97J6699
27712H96116J8645k128j6696m026l0427j5274J7505J1695k083k7461R142L4150
27700H89158J2917n435K8858m0323j9734l501L3045J6879P634o3564n5269p42
27688G99923J5331O4703J2459K752m4257P702J1742o756o599L4714R909j5754
27676H85869j1725m7787Q966J6036j272q136n987L2553r780o859J8773k459k3081
27663H45111l5312K2124M2430K6409k4178p132k0755K2724o770k0220n739L985
27651H42677l145q981J0853R009M2350K9100k5403k3354K5076j0946m6676j4800
27639H25760K4934J5834N366J5193k148K0841J4179l4042k3546J3801n1415j6749
$$ plain form
27627 808008 858667 826313 818110 813110 781587 801125 822257 860538 924003 897594 878166 884547
27615 884547 853331 797457 778234 853720 869118 866341 863637 866869 865371 842385 836881 842295 825342
27602 825342 826175 833107 825329 827532 826756 793257 762312 782869 854134 896883 885205 875184 870361
27589 870361 887786 857568 876537 904588 890508 865794 836506 850920 881985 879076 871770 868116
27577 868116 876446 887966 908178 887804 873554 891707 877231 900716 909838 905155 885033 923748
27565 923748 959158 970496 935889 892432 890417 871037 861718 855957 827899 850594 888000 881121
27553 881121 888549 872100 873048 862212 856240 836354 831760 850378 844095 838092 834556 826258 835136
27540 835136 810983 806729 818203 823838 841192 879974 837501 812704 836913 885297 908118 892540
$$ packed form
27627H08008N0659l2354q203n000l1523J9538K1132L8281O3465k6409j9428O381
27615H84547l1216n5874j9223P5486J5398k777k704L232j498k2986n504N414j6953
27602H25342Q33O932p778K203p76l3499l0945K0557P1265M2749j1678j0021m823
27589H70361J7425l0218J8969K8051j4080k4714k9288J4414L1065k909p306l654
27577H68116Q330J1520K0212k0374j4250J8153j4476K3485R122m683k0122L8715
27565I23748L5410J1338l4607m3457k015j9380r319n761k8058K2695L7406o879
27553H81121P428j6449R48j0836n972j9886m594J8618o283o003l536q298Q878
27540H35136k4153m254J1474N635J7354L8782m2473k4797K4209M8384K2821j5578
$$ plain form
27528 892540 924137 934232 896989 892770 921980 879262 901066 894528 882880 906813 913382 888410
27516 888410 889887 911672 930315 932970 870786 832108 854421 844737 852829 828250 836613 883295
27504 883295 949633 894183 853495 847248 832363 889809 877088 830313 856680 892346 893812 895972
27492 895972 918499 908356 886494 894097 906825 901716 881196 890381 906943 935401 949709 926409
27480 926409 881924 879875 850262 843190 868919 850154 824604 867007 910043 950940 889315 852456
27468 852456 899833 964203 987955 934653 906765 890361 890756 936413 948381 940812 922048 894967
27456 894967 886367 922772 951168 960364 940370 909673 921039 934676 896377 875379 889110 878375
27444 878375 880822 898319 870087 854790 871088 847575 795690 768604 822435 875197 831191 837479
$$ packed form
27528H92540L1597J0095l7243m219K9210m2718K1804o538j1648K3933O569k4972
27516H88410J477K1785J8643K655o2184l8678K2313r684Q092k4579Q363M6682
27504H83295O6338n5450m0688o247j4885N7446j2721m6775K6367L5666J466K160
27492H95972K2527j0143k1862P603J2728n109k0520R185J6562K8458J4308k3300
27480I26409m4485k049k9613p072K5729j8765k5550M2403M3036M0897o1625l6859
27468H52456M7377O4370K3752n3302k7888j6404L95M5657J1968p569j8764k7081
27456H94967q600L6405K8396R196j9994l0697J1366J3637l8299k0998J3731j0735
27444H78375K447J7497k8232j5297J6298k3513n1885k7086N3831N2762m4006O288
$$ plain form
27432 837479 867557 916625 926552 891690 866789 822941 837651 853595 874002 863204 861203 882890
27420 882890 879903 909855 926431 937989 922541 897232 897000 919531 949254 952667 941658 906852
27408 906852 872947 859086 857585 870406 871126 826935 861242 881272 905337 902830 929087 910714
27396 910714 847560 841558 899254 951705 943866 909767 880145 865247 853668 884720 927820 914730
27384 914730 911924 951293 957828 933093 888027 845866 837605 858507 877394 871513 876738 864525
27372 864525 860885 880377 903124 881133 867060 869094 869462 863003 871801 916971 919977 928982 900735
27359 900735 860230 825868 845095 887058 912387 915050 891660 877545 844499 818087 827589 861800
27347 861800 858505 803239 772759 837798 876693 880438 940062 939891 914477 860460 838161 858276
$$ packed form
27432H37479L0078M9068R927l4862k4901m3848J4710J5944K0407j0798k001K1687
27420H82890k987K9952J6576J1558j5448k5309k32K2531K9723L413j1009l4806
27408I06852l3905j3861j501J2821P20m4191L4307K0030K4065k507K6257j8373
27396I10714o3154o002N7696N2451p839l4099k9622j4898j1579L1052M3100j3090
27384I14730k806L9369O535k4735m5066m2161q261K0902J8887n881N225j2213
27372H64525l640J9492K2747k1991j4073K034L68o459Q798M5170L006R005k8247
27359I00735m0505l4362J9227M1963K5329K663k3390j4115l3046k6412R502L4211
27347H61800l295n5266l0480O5039L8895L745N9624j71k5414n4017k2299K0115
$$ plain form
27335 858276 857343 862336 850238 855753 876601 869896 855996 850220 838891 878152 917641 930477 928501
27322 928501 903335 892975 904353 933940 940786 952441 913363 902886 925056 900177 904201 901142
27310 901142 897484 924784 908903 895740 892763 897876 923426 934617 941301 936171 900712 869553
27298 869553 874437 849607 849516 891115 890546 910176 946303 935477 893671 868508 893857 888825 898405
27285 898405 929686 930764 912600 940306 942598 906906 914151 900190 865742 867191 876179 869090 873970
27272 873970 879954 894742 961628 1011838 1011468 986273 968910 917091 885397 901080 926650 905069
27260 905069 892044 862482 878003 873555 883334 900997 928868 912374 904702 920521 965736 943679
27248 943679 921035 883187 878472 866753 878373 858566 827266 872612 941570 927288 897166 945451
$$ packed form
27335H58276r33M993j2098N515K0848o705j3900n776j1329L9261L9489J2836j976
27322I28501k5166j0360J1378K9587O846J1655l9078j0477K2170k4879M024l059
27310I01142l658K7300j5881j3163k977N113K5550J1191O684n130l5459l1159
27298H69553M884k4830r1M1599n69J9630L6127j0826m1806k5163K5349n032R580
27285H98405L1281J078j8164K7706K292l5692P245j3961l4448J449Q988p089M880
27272H73970N984J4788O6886N0210l70k5195j7363n1819l1694J5683K5570k1581
27260I05069j3025k9562J5521m448R779J7663K7871j6494p672J5819M5215k2057
27248I43679k2644l7848m715j1719J1620j9807l1300M5346O8958j4282l0122M8285
$$ plain form
27236 945451 966379 918035 895776 873005 877636 887820 915610 915966 930974 939214 921664 879524
27224 879524 866164 877952 938758 962377 935059 866747 858639 881636 892333 910069 902236 905332
27212 905332 918663 980983 978573 937583 926693 868607 866285 892639 937068 941754 950658 933081
27200 933081 925509 922519 924215 956637 1002259 993895 973591 988531 952839 889836 870756 863826
27188 863826 898934 882206 904563 906907 923423 921108 899754 862457 886166 923225 895215 892993
27176 892993 919210 937472 929291 947712 930730 897583 902810 925394 927088 919430 929151 920343 933993
27163 933993 960806 935100 922982 932301 913788 906058 916190 879746 860426 901578 883334 879445
27151 879445 916139 966632 970538 971338 945404 969835 954923 950439 934392 910862 914136 902064
$$ packed form
27236I45451K0928m8344k2259k2771M631J0184K7790L56J5008Q240j7550m2140
27224H79524j3360J1788O0806K3619k7318o8312q108K2997J0697J7736p833L096
27212I05332J3331O2320k410m0990j0890n8086k322K6354M4429M686Q904j7577
27200I33081p572k990J696L2422M5622q364k0304J4940l5692o3003j9080o930
27188H63826L5108j6728K2357K344J6516k315k1354l7297K3709L7059k8010k222
27176H92993K6217J8262q181J8421j6982l3147N227K2584J694p658R721q808J3650
27163I33993K6813k5706j2118R319j8513p730J0132l6444j9320M1152j8244l889
27151H79445L6694N0493L906Q00k5934K4431j4912m484j6047k3530L274j2072
$$ plain form
27139 902064 893015 893185 879303 877118 934336 982912 973509 976541 932866 919074 921823 924388 923260
27126 923260 930392 956811 937902 935201 937979 958359 946244 923634 921371 914406 932080 928851 889372
27113 889372 855623 844535 859686 892938 922315 912571 917749 927293 935953 944161 927184 872441
27101 872441 863284 871403 880729 892392 928103 964036 943406 891410 911672 904761 939814 972180
27089 972180 965761 978984 1000250 1008638 959724 915745 896810 894661 897939 914347 909773 923297
27077 923297 905672 916315 937879 924118 890417 877150 880071 905637 921698 951178 994267 1005606
27065 1005606 972189 926829 935321 953896 942728 928118 953838 954608 945918 953973 964163 954414
27053 954414 967185 966733 966126 960352 931235 887236 875249 894804 947250 982486 946852 911350
$$ packed form
27139I02064r049J70j3882k185N7218M8576r403L032m3675j3792K749K565j128
27126I23260P132K6419j8909k701K778K0380j2115k2610k263o965J7674l229l9479
27113H89372l3749j1088J5151L3252K9377r744N178R544Q660Q208j6977n4743
27101H72441r157Q119R326J1663L5711L5933k0630n1996K0262o911L5053L2366
27089I72180o419J3223K1266Q388m8914m3979j8935k149L278J6408m574J3524
27077I23297j7625J0643K1564j3761l3701j3267K921K5566J6061K9480M3089J1339
27065A005606l3417m5360Q492J8575j1168j4610K5720P70q690Q055J0190r749
27053I54414J2771m52o07n774k9117m3999j1987J9555N2446L5236l5634l5502
$$ plain form
27041 911350 915367 950925 993706 992903 975663 955475 969273 974590 1002689 1039759 1006883 985787
27029 985787 998067 998457 983382 966280 950610 925735 874633 889810 914741 937681 966437 977274
27017 977274 962980 950561 961352 987035 966093 951163 929648 943380 990699 933136 901160
27006 901160 916771 934759 966006 933967 933702 917836 895587 955859 975677 958174 921162 902124
26994 902124 903643 922430 911995 892563 870566 860669 859932 911321 970579 925728 877210 879578
26982 879578 914872 905232 876688 869177 853698 869426 893610 927734 959911 950998 976134 995491
26970 995491 986962 951108 918582 962633 948272 983477 961383 939280 924818 923027 897776 888596
26958 888596 870451 907432 936113 916099 915614 936071 947812 965182 967280 949061 951974 936258
$$ packed form
27041I11350M017L5558M2781q03j7240k0188J3798N317K8099L7070l2876k1096
27029I85787J2280L90j5075j7102j5670k4875n1102J5177K4931K2940K8756J0837
27017I77274j4294j2419J0791K5683k0942j4930k1515J3732M7319n7563l1976
27006I01160J5611J7988L1247l2039k65j5866k2249O0272J9818j7503l7012j9038
26994I02124J519J8787j0435j9432k1997r897p37N1389N9258m4851m8518K368
26982H79578L5294r640k8544p511j5479J5728K4184L4124L2177q913K5136J9357
26970I95491q529l5854l2526M4051j4361L5205k2094k2103j4462j791k5251r180
26958H88596j8145L6981K8681k0014m85K0457J1741J7370K098j8219K913j5716
$$ plain form
26946 936258 943775 970474 975620 965531 932080 951746 963142 946492 923806 919025 911945 959565
26934 959565 975361 977680 966158 976500 1003182 1033586 1026780 958395 933518 917928 864206 828020
26922 828020 874064 908059 903571 901858 893869 913295 899754 912792 903305 915744 958791 968242
26910 968242 988017 967679 905497 907941 904469 907674 905687 910426 918337 934616 929728 922677 941254
26897 941254 973013 1012321 1008483 985271 997296 1020442 1029956 985534 922495 872631 883904 887669
26885 887669 882438 919167 955491 996115 961455 949527 933460 957844 959858 983679 959657 941204
26873 941204 916599 938949 970542 952796 968682 982480 965843 938786 935241 949872 933822 902702
26861 902702 913780 948678 976565 968843 962077 967411 961406 941906 965545 973388 974486 971022 966113
$$ packed form
26946I36258P517K6699N146j0089l3451J9666J1396j6650k2686m781p080M7620
26934I59565J5796K319j1522J0342K6682L0404o806o8385k4877j5590n3722l6186
26922H28020M6044L3995m488j713p989J9426j3541J3038r487J2439M3047R451
26910I68242J9775k0338o2182K444l472L205j987M739P911J6279m888p051J8577
26897I41254L1759L9308l838k3212J2025K3146R514m4422o3039m9864J1273L765
26885H87669n231L6729L6324M0624l4660j1928j6067K4384K014K3821k4022j8453
26873I41204k4605K2350L1593j7746J5886J3798j6637k7057l545J4631j6050l1120
26861I02702J1078L4898K7887p722o766N334o005j9500K3639P843J098l464m909
$$ plain form
26848 966113 1010543 1041677 1004519 963522 951254 950841 974047 976632 955972 978149 991833 948329
26836 948329 936607 937834 919155 912668 901980 928042 973109 934625 854097 811773 833470 900397
26824 900397 956482 978562 986780 1031034 986908 955559 992833 1008399 943809 919878 898051 920855
26812 920855 1001398 1017547 934133 882120 896779 922215 986554 1009174 980768 967419 964773 963163
26800 963163 953103 965693 963805 952966 953490 974431 976172 903292 900228 947385 1010830 1005330 994715
26787 994715 993898 1004981 1004050 979592 993837 990268 1007109 996087 990990 982323 974425 998205 968388
26774 968388 967966 945046 961368 996238 996785 1005019 999429 960581 947201 963308 990788 964813 950856
26761 950856 972041 922991 921030 970299 911863 878462 919078 974756 985041 986885 950111 902683
$$ packed form
26848I66113M4430L1134l7158m0997j2268m13K3206K585k0660K2177J3684m3504
26836I48329j1722J227j8679o487j0688K6062M5067l8484q0528m2324K1697O6927
26824I00397N6085K2080Q218M4254m4126l1349L7274J5566o4590k3931k1827K2804
26812I20855Q0543J6149q3414n2013J4659K5436O4339K2620k8406j3349k646j610
26800I63163j0060J2590j888j0839N24K0941J741p2880l064M7157O3445n500j0615
26787I94715q17J1083r31k4458J4245l569J6841j1022n097q667p898K3780k9817
26774I68388m22k2920J6322L4870N47Q234n590l8848j3380J6107K7480k5975j3957
26761I50856K1185m9050j961M9269n8436l3401M0616N5678J0285J844l6774m7428
$$ plain form
26749 902683 911351 946091 930350 949115 970026 1003080 962676 930351 947229 913443 906449 937080
26737 937080 911058 914628 947831 943221 954885 912042 891111 915464 916973 893351 905828 931519
26725 931519 949411 927239 963391 1000035 1005044 1006163 993009 974634 951009 923105 950287 977643
26713 977643 984306 930659 910447 981429 985342 968536 961093 952190 928016 889167 890658 873533
26701 873533 898609 928344 952818 933459 937896 943681 951170 948750 950357 959582 996743 973571 980260
26688 980260 968133 981810 949967 935052 946653 958038 935232 909935 966776 1026589 1043667
26677 1043667 1013748 1009087 985642 990708 963259 932984 903688 920937 934954 940203 955742 955320
26665 955320 959918 932433 935908 927524 938257 983236 985072 1007196 1033790 1034333 1017774 998325 1004785
$$ packed form
26749I02683Q668L4740j5741J8765K0911L3054m0404l2325J6878l3786o994L0631
26737I37080k6022L570L3203m610J1664m2843k0931K4353J509k3622J2477K5691
26725I31519J7892k2172L6152L6644N009J119j3154j8375k3625k7904K7182K7356
26713I77643O663n3647k0212P0982L913j6806p443q903k4174l8849J491j7125
26701H73533K5076K9735K4474j9359M437N785P489k420J607R225L7161k3172O689
26688I80260j2127J3677l1843j4915J1601J1385k2806k5297N6841N9813J7078
26677A043667k9919m661k3445N066k7449l0275k9296J7249J4017N249J5539m22
26665I55320M598k7485L475q384J0733M4979J836K2124K6594N43j6559j9449O460
$$ plain form
26652 1004785 1010223 1006802 973883 961916 941114 902304 945456 962302 940590 923177 929171 967864
26640 967864 978109 995366 1017140 1028294 1008419 999112 967873 942457 962173 971445 996312 1000558
26628 1000558 972002 937645 934947 950540 967047 993202 989382 964750 950167 953016 990955 999951
26616 999951 967291 952830 981441 1007175 1012794 1026499 998423 962519 957181 947675 910627 926881
26604 926881 926990 950474 1011003 1036232 1011386 1009086 1025037 1012529 941462 928342 961645 956190
26592 956190 898723 883327 950581 1000458 1013469 999284 1022854 1002906 1007561 1012748 970048 971702
26580 971702 995295 991037 996573 1039793 1055406 1006049 981189 1000228 1006437 1000084 971249 908694
26568 908694 849554 926933 948801 951060 991903 985712 1006663 1023609 1024724 1012948 1015209 1014761 966488
$$ packed form
26652A004785N438l421l2919j1967k0802l8810M3152J6846k1712j7413N994L8693
26640I67864J0245J7257K1774J1154j9875r307l1239k5416J9716R272K4867M246
26628A000558k8556l4357k698J5593J6507K6155l820k4632j4583K849L7939Q996
26616I99951l2660j4461K8611K5734N619J3705k8076l5904n338r506l7048J6254
26604I26881J09K3484O0529K5229k4846k300J5951j2508p1067j3120L3303n455
26592I56190n7467j5396O7254M9877J3011j4185K3570j9948M655N187m2700J654
26580I71702K3593m258N536M3220J5613m9357k4860J9039O209o353k8835o2555
26568I08694n9140P7379K1868K259M0843o191K0951J6946J115j1776K261m48m8273
$$ plain form
26555 966488 921374 977835 1047194 1042211 993959 965000 978705 1026974 1010376 958669 976513 990537
26543 990537 1018649 996726 1001253 1037656 1048982 1023631 1007965 971996 999000 1008492 1012969 1017935
26531 1017935 1010195 1014474 1000904 1007821 1037762 1026707 991814 962662 979342 1026807 1058344 1039243
26519 1039243 993299 992358 997559 1004263 1014100 1040190 1028156 1042542 1042690 1044057 1055137 1095380 1080937
26506 1080937 1011140 971867 956059 975900 984122 949937 929872 953227 983560 1003037 996208 1000065
26494 1000065 987736 988778 1038493 1010931 995872 936013 936532 970580 1005378 993664 978726 964108
26482 964108 979554 959061 940688 948782 956312 990926 1008134 1013865 1013637 982787 965049 961828 967379
26469 967379 961705 986231 1014213 1027812 1008250 972061 981613 973322 989348 1009219 999410 1004954
$$ packed form
26555I66488m5114N6461O9359m983m8252k8959J3705M8269j6598n1707J7844J4024
26543I90537K8112k1923M527L6403J1326k5351j5666l5969K7004R492M477M966
26531A017935p740M279j3570O917K9941j1055l4893k9152J6680M7465L1537j9101
26519A039243m5944r41N201O704R837K6090j2034J4386J48J367J1080M0243j4443
26506A080937o9797l9273j5808J9841Q222l4185k0065K3355L0333J9477o829L857
26494A000065j2329J042M9715k7562j5059n9859N19L4048L4798j1714j4938j4618
26482I64108J5446k0493j8373Q094P530L4614J7208N731k28l0850j7738l221N551
26469I67379n674K4526K7982J3599j9562l6189R552q291J6026J9871r809N544
$$ plain form
26457 1004954 1012813 1041895 1044921 1022895 1035927 1017079 1004465 1034650 1069511 1041570 1039334 1023664
26445 1023664 1028787 1059368 1059556 1048104 994748 979214 1012850 1037524 1010413 990271 1039475 1014993
26433 1014993 1003528 986131 960712 978818 1044400 1092473 1050576 1005540 1004060 1025206 1019939 997841
26421 997841 1012363 1009473 1018623 1001581 996749 986945 978048 971009 1015566 1032737 1033416 1016221 1007793
26408 1007793 982890 952287 937983 946019 932281 917996 952425 980730 999424 1027149 1037416
26397 1037416 984629 977067 1021798 1021603 982476 975274 997217 979608 976036 953474 934070 967304
26385 967304 1009951 1039637 1035560 1030741 975425 963430 974897 978124 994351 1001704 964216 949346
26373 949346 981602 1000886 1011630 1024602 1025074 1023406 1021978 1009723 1027505 1049956 1026287 988378
$$ packed form
26457A004954P859K9082L026k2026J3032j8848j2614L0185L4861k7941k236j5670
26445A023664N123L0581J88j1452n3356j5534L3636K4674k7111k0142M9204k4482
26433A014993j1465j7397k5419J8106O5582M8073m1897m5036j480K1146n267k2098
26421I97841J4522k890R150j7042m832r804q897p039M4557J7171O79j7195q428
26408A007793k4903l0603j4304Q036j3738j4285L4429K8305J8694K7725J0267
26397A037416n2787p562M4731j95l9127p202K1943j7609l572k2562j9404L3234
26385I67304M2647K9686m077m819n5316j1995J1467L227J6227P353l7488j4870
26373I49346L2256J9284J0744J2972M72j668j428j2255J7782K2451k3669l7909
$$ plain form
26361 988378 946096 952121 965109 992301 1043697 1042947 1026191 1034022 1053406 1051070 1061711 1052843 1040521
26348 1040521 1026493 1032416 1051703 1083361 1109626 1076353 1038004 1013989 986571 983217 1012030 1040239
26336 1040239 1028470 1075490 1105914 1072756 1059647 1077325 1095815 1113477 1083432 1044304 1037431
26325 1037431 1038632 1043358 1069822 1130854 1127332 1078440 1051857 1035519 991607 948474 958091 968231
26313 968231 1010076 1055117 1067074 1048162 1031241 999984 964675 966324 1015133 1053828 1098856 1062213
26301 1062213 1063467 1106339 1141494 1122132 1106034 1106974 1093113 1091026 1055798 1026197 1016943 1003553
26289 1003553 1039909 1045449 1004932 959469 957467 1030855 1034123 1004832 1045009 1082050 1084304 1076107
26277 1076107 1041199 1028131 1022484 1041579 1059515 1033470 1017397 1004348 1007098 1001186 1027182 1021115
$$ packed form
26361I88378m2282O025J2988K7192N1396p50j6756P831J9384k336J0641q868j2322
26348A040521j4028N923J9287L1658K6265l3273l8349k4015k7418l354K8813K8209
26336A040239j1769M7020L0424l3158j3109J7678J8490J7662l0045l9128o873
26325A037431J201M726K6464O1032l522m8892k6583j6338m3912m3133R617J0140
26313I68231M1845M5041J1957j8912j6921l1257l5309J649M8809L8695M5028l6643
26301A062213J254M2872L5155j9362j6098R40j3861k087l5228k9601r254j3390
26289A003553L6356N540m0517m5463k002P3388L268k9291M0177L7041K254q197
26277A076107l4908j3068n647J9095J7936k6045j6073j3049K750n912K5996o067
$$ plain form
26265 1021115 1028888 1040006 1053596 1013509 972282 989292 1022573 1041291 985526 990919 1024487 1040111
26253 1040111 1012889 1000629 985843 971040 993270 1008195 1009087 1031864 1034918 1043257 1070491 1056852
26241 1056852 1084409 1101129 1058502 1037763 1027416 1044792 1062997 1048822 1024929 1018746 1041494
26230 1041494 1085358 1085008 1076688 1119851 1105289 1059952 1048031 1033516 1011415 1011572 1017355 1027681
26218 1027681 1018710 1033798 1066842 1098830 1087495 1100078 1113515 1128853 1101808 1046198 1059141
26207 1059141 1081908 1112431 1107493 1089872 1102202 1139228 1168686 1173817 1111063 1054187 1067496 1078464
26195 1078464 1052448 1079668 1068735 1069064 1064960 1073053 1082297 1104162 1093507 1059938 1053280 1052649 1053639
26182 1053639 1059576 1070064 1065838 1082385 1077926 1072710 1077721 1099207 1111710 1088425 1072317 1033642
$$ packed form
26265A021115P773J1118J3590m0087m1227J7010L3281J8718n5765N393L3568J5624
26253A040111k7222j2260j4786j4803K2230J4925Q92K2777L054Q339K7234j3639
26241A056852K7557J6720m2627k0739j0347J7376J8205j4175k3893o183K2748
26230A041494M3864l50q320M3163j4562m5337j1921j4515k2101J57N783J0326
26218A027681q971J5088L3044L1988j1335J2583J3437J5338k7045n5610J2943
26207A059141K2767L0523m938j7621J2330L7026K9458N131o2754n6876J3309J0968
26195A078464k6016K7220j0933L29m104Q093R244K1865j0655l3569o658o31R90
26182A053639N937J0488m226J6547m459n216N011K1486J2503k3285j6108l8675
$$ plain form
26170 1033642 1045354 1058562 1059227 1093535 1088165 1082378 1089094 1063062 1016366 949989 942940 991026
26158 991026 966189 989261 1014237 1038716 1062697 1042942 1047544 1091804 1055078 1024748 1012109 1058991
26146 1058991 1082210 1060638 1035725 1054622 1077644 1051344 1059218 1108541 1094036 1073411 1084232
26135 1084232 1086684 1061393 1071308 1112355 1097026 1122786 1149878 1078531 1060156 1077040 1094346 1096609
26123 1096609 1080331 1070329 1059388 1070315 1071226 1043110 1059711 1090970 1116990 1094268 1104133 1111710
26111 1111710 1108034 1111830 1076939 1059801 1037733 1042188 1054326 1056412 1011725 1013919 977119 986005
26099 986005 1007618 1035550 1038008 1039471 1059163 1086091 1106219 1088281 1094531 1093423 1019752 1025018
26087 1025018 1076435 1099078 1092393 1041298 1003580 1040080 1132487 1154764 1088156 1075187 1079270 1096562
$$ packed form
26170A033642J1712J3208O65L4308n370n787O716k6032m6696o6377p049M8086
26158I91026k4837K3072K4976K4479K3981j9755M602M4260l6726l0330j2639M6882
26146A058991K3219k1572k4913J8897K3022k6300P874M9323j4505k0625J0821
26135A084232K452k5291R915M1047j5329K5760K7092p1347j8375J6884J7306K263
26123A096609j6278j0002j0941J0927R11k8116J6601L1259K6020k2722R865P577
26111A111710l676L796l4891j7138k2068M455J2138K086m4687K194l6800Q886
26099I86005K1613K7932K458J463J9692K6928K0128j7938O250j108p3671N266
26087A025018N1417K2643o685n1095l7718L6500R2407K2277o6608j2969M083J7292
$$ plain form
26075 1096562 1111853 1113048 1061645 1042755 1053426 1068208 1107772 1095754 1070026 1044898 1066580
26064 1066580 1027515 1010370 1040545 1049021 1068308 1064033 1014740 1030997 1060803 1078094 1084678 1059330
26052 1059330 1028131 1020647 1009608 1013218 1029134 1030623 1041650 1032195 1021583 1031175 1036433 1024881
26040 1024881 1025831 1064888 1059080 1092449 1119961 1130756 1083233 1021396 1044787 1047026 1043232 1043369 1014198
26027 1014198 1003262 1014432 1071097 1080467 1048930 1012441 1055517 1072038 1081981 1095144 1105875 1099042
26015 1099042 1088673 1056841 1038347 1027225 1040725 1041529 1074487 1091900 1099534 1078444 1106620 1112391
26003 1112391 1112301 1147718 1151905 1133347 1112824 1042559 1016891 1026737 1062499 1068340 1035139 1013688
25991 1013688 1034644 1058732 1072088 1075486 1145647 1146787 1127000 1087812 1051501 1018862 1037188 1042629
$$ packed form
26075A096562J5291J195n1403j8890J0671J4782L9564j2018k5728k5128K1682
26064A066580l9065j7145L0175Q476J9287m275m9293J6257K9806J7291O584k5348
26052A059330l1199p484j1039L610J5916J489J1027r455j0612R592N258j1552
26040A024881R50L9057n808L3369K7512J0795m7523o1837K3391K239l794J37k9171
26027A014198j0936J1170N6665R370l1537l6489M3076J6521R943J3163J0731o833
26015A099042j0369l1832j8494j1122J3500Q04L2958J7413P634k1090K8176N771
26003A112391r0L5417M187j8558k0523p0265k5668R846L5762N841l3201k1451
25991A013688K0956K4088J3356L398P0161J140j9787l9188l6311l2639J8326N441
$$ plain form
25979 1042629 1026925 1028988 1059908 1115621 1145362 1144707 1174197 1151101 1136792 1061824 1010202 1021863
25967 1021863 1071888 1083233 1089487 1074136 1046475 1018791 1047289 1091115 1100488 1080454 1069929 1061985
25955 1061985 1032814 1037310 1034627 1074743 1100117 1105736 1120924 1158305 1164747 1161909 1132214 1104306
25943 1104306 1094287 1090848 1100642 1088802 1088841 1089209 1079620 1054837 1031616 1022802 1047562 1074807 1084424
25930 1084424 1121460 1123686 1130341 1089707 1086497 1139245 1140979 1105601 1114510 1139141 1123517 1084156
25918 1084156 1054291 1093884 1143547 1157485 1165030 1108681 1119759 1157243 1192486 1152522 1150401 1159300
25906 1159300 1103630 1090643 1134607 1150846 1125901 1092316 1057329 1075900 1103428 1130506 1140767
25895 1140767 1172249 1187559 1166334 1146207 1139724 1156752 1143832 1118759 1084833 1082016 1062712 1078036
$$ packed form
25979A042629j5704K063L0920N5713K9741o55K9490k3096j4309p4968n1622J1661
25967A021863N0025J1345O254j5351k7661k7684K8498M3826R373k0034j0525p944
25955A061985k9171M496k683M0116K5374N619J5188L7381O442k838k9695k7908
25943A104306j0019l439R794j1840L9L68r589k4783k3221q814K4760K7245R617
25930A084424L7036K226O655m0634l210N2748J734l5378Q909K4631j5624l9361
25918A084156k9865L9593M9663J3938P545n6349J1078L7484L5243l9964k121Q899
25906A159300n5670j2987M3964J6239k4945l3585l4987J8571K7528K7078J0261
25895A140767L1482J5310k1225k0127o483J7028j2920k5073l3926k817j9304J5324
$$ plain form
25883 1078036 1079888 1059245 1072395 1110823 1137226 1110472 1067373 1039617 1052994 1104493 1177048
25872 1177048 1174794 1183782 1174478 1127130 1139641 1141702 1109560 1124617 1108170 1115120 1144278 1141336
25860 1141336 1113258 1096305 1143315 1148212 1152149 1153569 1119197 1083483 1089935 1072947 1123393 1138520
25848 1138520 1122776 1106257 1086147 1084050 1094503 1097683 1057110 1057168 1083312 1059890 1080111 1143310
25836 1143310 1185069 1218577 1217988 1193520 1156957 1151478 1154918 1147578 1121991 1071970 1076178 1093599
25824 1093599 1068372 1087993 1109184 1126634 1119332 1100435 1126543 1154722 1163561 1138346 1164682 1155451
25812 1155451 1161707 1192968 1189549 1175835 1167363 1186710 1161848 1119384 1094418 1087285 1098248 1107721
25800 1107721 1100513 1064824 1056848 1059596 1056356 1081658 1096521 1110896 1195063 1191341 1177236 1176616 1185007
$$ packed form
25883A078036J852k0643J3150L8428K6403k6754m3099k7756J3377N1499P2555
25872A177048k254Q988r304m7348J2511K061l2142J5057j6447O950K9158k942
25860A141336k8078j6953M7010M897L937J420l4372l5714O452j6988N0446J5127
25848A138520j5744j6519k0110k097J0453L180m0573N8K6144k3422K0221O3199
25836A143310M1759L3508n89k4468l6563n479L440p340k5587n0021M208J7421
25824A093599k5227J9621K1191J7450p302j8897K6108K8179Q839k5215K6336r231
25812A155451O256L1261l419j3714q472J9347k4862m2464k4966p133J0963R473
25800A107721p208l5689p976K748l240K5302J4863J4375Q4167l722j4105o20Q391
$$ plain form
25787 1185007 1169688 1126834 1113683 1113690 1133524 1107019 1053812 1025706 1038916 1064258 1075579 1099141
25775 1099141 1090099 1104846 1099743 1090798 1097952 1096318 1161764 1193980 1150894 1128512 1094786 1057693
25763 1057693 1075896 1063975 1075224 1078156 1109484 1131310 1097181 1062658 1080792 1109185 1104173 1140693
25751 1140693 1132091 1108039 1122875 1128127 1126668 1168057 1177760 1149464 1131455 1135591 1109899 1096298
25739 1096298 1134941 1166826 1129358 1105468 1107999 1106481 1146564 1187739 1203379 1212149 1166757 1111616
25727 1111616 1089163 1115117 1109362 1129647 1146066 1140523 1131417 1117097 1081474 1058478 1019576 1013245
25715 1013245 1025805 1048676 1125316 1107098 1154257 1167436 1146002 1125694 1141750 1117610 1102780
25704 1102780 1044317 1048612 1084811 1097851 1125159 1154070 1169506 1190413 1212432 1249435 1249622 1204770
$$ packed form
25787A185007j5319m2854j3151PJ9834k6505n3207k8106J3210K5342J1321K3562
25775A099141r042J4747n103q945P154j634O5446L2216m3086k2382l3726l7093
25763A057693J8203j1921J1249K932L1328K1826l4129l4523J8134K8393n012L6520
25751A140693q602k4052J4836N252j459M1389R703k8296j8009M136k5692j3601
25739A096298L8643L1885l7468k3890K531j518M0083M1175J5640Q770m5392n5141
25727A111616k2453K5954n755K0285J6419n543r106j4320l5623k2996l8902o331
25715A013245J2560K2871P6640j8218M7159J3179k1434k0308J6056k4140j4830
25704A102780n8463M295L6199J3040K7308K8911J5436K0907K2019L7003J87m4852
$$ plain form
25692 1204770 1177623 1175149 1112587 1037887 1019245 1015780 1091555 1097584 1087857 1132570 1120748 1140406
25680 1140406 1159485 1170692 1165276 1136509 1142802 1137730 1173494 1184339 1137535 1125120 1127142 1107467
25668 1107467 1095009 1142808 1129583 1106755 1105432 1114883 1118298 1135495 1166340 1135025 1140113 1115525
25656 1115525 1134208 1111485 1095072 1145749 1194860 1181783 1158702 1198320 1234729 1248996 1193237
25645 1193237 1158379 1165242 1113654 1115652 1142733 1150892 1148703 1132914 1137256 1161007 1188713 1240165
25633 1240165 1222932 1185817 1158391 1142399 1139856 1141695 1194718 1261194 1274657 1243500 1217508 1220752
25621 1220752 1189436 1187776 1142715 1133375 1120617 1119342 1111972 1100831 1090674 1124069 1125074 1123301
25609 1123301 1103135 1130115 1155868 1128880 1111404 1119085 1115160 1106691 1108215 1166820 1187892 1203663
$$ packed form
25692A204770k7147k474o2562p4700j8642l465P5775O029r727M4713j1822J9658
25680A140406J9079J1207n416k8767O293n072L5764J0845m6804j2415K022j9675
25668A107467j2458M7799j3225k2828j323R451L415J7197L0845l1315N088k4588
25656A115525J8683k2723j6413N0677M9111j3077k3081L9618L6409J4267n5759
25645A193237l4858O863n1588J998K7081Q159k189j5789M342K3751K7706N1452
25633A240165j7233l7115k7426j5992k543J839N3023O6476J3463l1157k5992L244
25621A220752l1316j660m5061r340j2758j275p370j1141j0157L3395J005j773
25609A123301k0166K6980K5753k6988j7476P681l925q469J524N8605K1072J5771
$$ plain form
25597 1203663 1226995 1249769 1249293 1174125 1145546 1157865 1178633 1178799 1162508 1159764 1127857 1153566
25585 1153566 1146670 1136082 1091493 1084536 1072767 1117756 1151291 1115237 1113516 1141725 1209957 1176958
25573 1176958 1130347 1114897 1139098 1161659 1152455 1147233 1139396 1075384 1060920 1092251 1100521 1115032
25561 1115032 1128852 1122371 1148191 1210201 1217318 1210747 1176434 1155775 1146255 1160823 1173110 1176942
25549 1176942 1202263 1233309 1251379 1227614 1205114 1221293 1255003 1251110 1255885 1236735 1216652 1202134
25537 1202134 1170666 1171376 1172093 1186000 1226307 1245575 1237568 1255930 1227964 1223479 1208917 1214682 1239966
25524 1239966 1235779 1193344 1149538 1123900 1121522 1133501 1120285 1106395 1128454 1139455 1175757 1203023
25512 1203023 1211543 1182655 1165405 1149245 1138699 1133285 1180149 1204834 1169017 1170968 1186173 1207739
$$ packed form
25597A203663K3332K2774m76p5168k8579J2319K0768J66j6291k744l1907K5709
25585A153566o896j0588m4589o957j1769M4989L3535l6054j721K8209O8232l2999
25573A176958m6611j5450K4201K2561r204n222p837o4012j4464L1331Q270J4511
25561A115032J3820o481K5820O2010P117o571l4313k0659r520J4568J2287L832
25549A176942K5321L1046J8070k3765k2500J6179L3710l893M775j9150k0083j4518
25537A202134l1468P10P17J3907M0307J9268q007J8362k7966m485j4562N765K5284
25524A239966m187m2435m3806k5638k378J1979j3216j3890K2059J1001L6302K7266
25512A203023Q520k8888j7250j6160j0546n414M6864K4685l5817J951J5205K1566
$$ plain form
25500 1207739 1223119 1186735 1180569 1164399 1162183 1155442 1147018 1129479 1140455 1135169 1101753 1063723
25488 1063723 1081497 1131346 1174900 1161212 1158550 1209032 1197665 1216836 1235070 1222624 1235885
25477 1235885 1233643 1203774 1187608 1199722 1201308 1177213 1189033 1212431 1205530 1200203 1216397 1218013
25465 1218013 1196978 1207868 1199968 1165833 1173260 1197537 1191219 1165403 1167792 1182099 1204960 1211197
25453 1211197 1240829 1219214 1214873 1214377 1172549 1133632 1103416 1099467 1089069 1088237 1163370 1193081
25441 1193081 1176630 1169153 1184099 1188823 1203995 1179524 1165564 1166827 1142464 1133907 1122762 1113027
25429 1113027 1137755 1140973 1126275 1140430 1182983 1169003 1187569 1179820 1184275 1214658 1224878 1213693
25417 1213693 1182146 1141412 1162278 1198742 1206109 1237205 1252781 1219196 1177550 1165345 1195543
$$ packed form
25500A207739J5380l6384o166j6170k216o741q424j7539J0976n286l3416l8030
25488A063723J7774M9849M3554j3688k662N0482j1367J9171J8234j2446J3261
25477A235885k242k9869j6166J2114J586k4095J1820K3398o901n327J6194J616
25465A218013k1035J0890p900l4135P427K4277o318k5816K389J4307K2861O237
25453A211197K9632k1615m341m96m1828l8917l0216l949j0398q32P5133K9711
25441A193081j6451p477J4946M724J5172k4471j3960J263k4363q557j1145r735
25429A113027K4728L218j4698J4155M2553j3980J8566p749M455L0383J0220j1185
25417A213693l1547m0734K0866L6464P367L1096J5576l3585m1646j2205L0198
$$ plain form
25406 1195543 1229141 1208058 1197315 1190742 1189205 1191402 1216138 1195565 1163288 1178568 1200146 1164090
25394 1164090 1161030 1187299 1236412 1290165 1252135 1224365 1190190 1167587 1182345 1207803 1194779
25383 1194779 1203091 1208567 1199582 1193386 1184710 1137178 1107703 1135578 1164902 1113245 1069315 1113319
25371 1113319 1125638 1134744 1158684 1183899 1168839 1157795 1176119 1193676 1211659 1180323 1182172 1233103
25359 1233103 1214741 1198316 1161898 1150640 1179873 1187978 1190640 1153709 1115805 1150654 1131429 1124485
25347 1124485 1116380 1107546 1149205 1214845 1296317 1280744 1224017 1214736 1258856 1290710 1284072 1250862
25335 1250862 1218492 1227539 1253763 1258147 1226128 1176112 1220826 1243380 1252357 1222910 1204511 1206065
25323 1206065 1231040 1220786 1215869 1230935 1215693 1200790 1160163 1142638 1173889 1205574 1200137 1228481
$$ packed form
25406A195543L3598k1083j0743o573j537K197K4736k0573l2277J5280K1578l6056
25394A164090l060K6269M9113N3753l8030k7770l4175k2603J4758K5458j3024
25383A194779Q312N476q985o196q676m7532k9475K7875K9324n1657m3930M4004
25371A113319J2319R106K3940K5215j5060j1044J8324J7557J7983l1336J849N0931
25359A233103j8362j6425l6418j1258K9233Q105K662l6931l7904L4849j9225o944
25347A124485q105q834M1659O5640Q1472j5573n6727r281M4120L1854o638l3210
25335A250862l2370R047K6224M384l2019n0016M4714K2554Q977k9447j8399J554
25323A206065K4975j0254m917J5066j5242j4903m0627j7525L1251L1685n437K8344
$$ plain form
25311 1228481 1295971 1277710 1248975 1193083 1195079 1251247 1269684 1296259 1258505 1255688 1254216 1255249
25299 1255249 1214426 1192622 1198378 1238007 1263070 1247552 1232789 1230725 1193525 1196851 1193212 1160764
25287 1160764 1182508 1209326 1183353 1171322 1177575 1175291 1166584 1132356 1141567 1180277 1188609 1218422
25275 1218422 1204598 1185471 1182541 1215289 1264841 1232178 1199848 1214486 1237912 1243109 1231780 1223064
25263 1223064 1243653 1249639 1204805 1181536 1209730 1258953 1252179 1227231 1202846 1167634 1214734 1241735
25251 1241735 1260385 1266763 1295766 1278495 1249021 1211248 1203905 1232787 1292351 1297861 1315945 1315316
25239 1315316 1301746 1244267 1237198 1277142 1251829 1240765 1263404 1277786 1278816 1254045 1201546 1163868
25227 1163868 1167162 1167440 1164798 1197066 1248517 1234649 1254526 1250516 1266467 1271027 1290162 1307343
$$ packed form
25311A228481O7490j8261k8735n5892J996N6168J8437K6575l7754k817j472J033
25299A255249m0823k1804N756L9629K5063j5518j4763k064l7200L326l639l2448
25287A160764K1744K6818k5973j2031O253k284q707l4228R211L8710Q332K9813
25275A218422j3824j9127k930L2748M9552l2663l2330J4638K3426N197j1329q716
25263A223064K0589N986m4834k3269K8194M9223o774k4948k4385l5212M7100K7001
25251A241735J8650O378K9003j7271k9474l7773p343K8882N9564N510J8084o29
25239A315316j3570n7479p069L9944k5313j1064K2639J4382J030k4771n2499l7678
25227A163868L294K78k642L2268N1451j3868J9877m010J5951M560J9135J7181
$$ plain form
25215 1307343 1302845 1263563 1235123 1279375 1292844 1311197 1260938 1269222 1346239 1351642 1317448 1287254
25203 1287254 1280343 1240049 1247562 1243155 1272824 1280532 1266984 1279238 1243028 1249039 1221907 1186286
25191 1186286 1197337 1209500 1214106 1196622 1232216 1255825 1239715 1243555 1278104 1294806 1305719 1304459
25179 1304459 1262844 1256762 1253658 1251334 1243652 1242496 1269597 1248960 1273961 1347018 1383933 1335470
25167 1335470 1306293 1305056 1276673 1240788 1263675 1257896 1231537 1212493 1231717 1273241 1278840 1275320
25155 1275320 1242466 1264345 1267205 1256331 1272912 1282406 1299225 1321684 1330453 1320848 1341607 1308117
25143 1308117 1293750 1289125 1268797 1233013 1206870 1177091 1207308 1262908 1260917 1273600 1265132 1260687
25131 1260687 1237600 1239253 1218704 1195877 1232805 1233560 1249564 1297402 1298010 1241887 1235098 1276618
$$ packed form
25215A307343m498l9282k8440M4252J3469J8353n0259Q284P7017N403l4194l0194
25203A287254o911m0294P513m407K9669P708j3548J2254l6210O011k7132l5621
25191A186286J1051J2163M606j7484L5594K3609j6110L840L4549J6702J0913j260
25179A304459m1615o082l104k324p682j156K7101k0637K5001P3057L6915m8463
25167A335470k9177j237k8383l5885K2887n779k6359j9044J9224M1524N599l520
25155A275320l2854K1879K860j0874J6581R494J6819K2459Q769r605K0759l3490
25143A308117j4367m625k0328l5784k6143k9779L0217N5600j991J2683q468m445
25131A260687k3087J653k0549k2827L6928P55J6004M7838O08n6123o789M1520
$$ plain form
25119 1276618 1314765 1311705 1307576 1306312 1329190 1340010 1330520 1299666 1280613 1286530 1262048 1243557
25107 1243557 1240470 1302705 1307110 1273927 1282030 1291858 1277344 1274819 1286478 1268189 1237504 1256183
25095 1256183 1272519 1256509 1245348 1233728 1221047 1232713 1231628 1245938 1251035 1246901 1278331 1312162
25083 1312162 1322919 1317145 1303628 1255489 1204370 1209200 1259788 1304799 1315926 1310541 1284168 1259301
25071 1259301 1257932 1308946 1327132 1291776 1314372 1332601 1312479 1267193 1268037 1258738 1230544 1244009
25059 1244009 1257917 1269817 1308996 1299258 1295343 1305841 1318513 1326680 1332294 1322604 1322666 1323566 1291088
25046 1291088 1296449 1338565 1335948 1292297 1254507 1270357 1230377 1237802 1307210 1323942 1316758 1320756
25034 1320756 1315160 1299119 1307817 1374173 1404490 1316126 1274351 1252291 1271112 1285546 1301827 1328567
$$ packed form
25119A276618L8147l060m129j264K2878J0820r490l0854j9053N917k4482j8491
25107A243557l087O2235M405l3183Q103R828j4514k525J1659j8289l0685J8679
25095A256183J6336j6010j1161j1620j2681J1666j085J4310N097m134L1430L3831
25083A312162J0757n774j3517m8139n1119M830N0588M5011J1127n385k6373k4867
25071A259301j369N1014J8186l5356K2596J8229k0122m5286Q44r299k8194J3465
25059A244009J3908J1900L9179r738l915J0498J2672Q167N614r690O2R00l2478
25046A291088N361M2116k617m3651l7790J5850l9980P425O9408J6732p184L998
25034A320756n596j6041Q698O6356L0317q8364m1775k2060J8821J4434J6281K6740
$$ plain form
25022 1328567 1326242 1360114 1322691 1258993 1270316 1325923 1335522 1316071 1337041 1380812 1392546 1376204
25010 1376204 1390624 1431171 1394600 1375934 1317593 1323699 1355929 1331102 1311859 1301961 1297878 1243668
24998 1243668 1224626 1277274 1303761 1309390 1301117 1290038 1277574 1260485 1252607 1227716 1237689 1251938
24986 1251938 1246033 1285114 1300735 1306646 1307277 1333729 1311180 1332098 1356943 1330807 1319484 1302122
24974 1302122 1251901 1244146 1263244 1298451 1290328 1282420 1304007 1286240 1262111 1274499 1265583 1267562
24962 1267562 1282897 1282683 1276116 1262625 1235554 1208505 1232580 1260701 1235023 1251382 1281001 1269799
24950 1269799 1288856 1297528 1346640 1357073 1337107 1301563 1295719 1280904 1304940 1308327 1309883 1317633
24938 1317633 1338177 1364445 1352890 1292405 1282519 1301801 1304489 1328010 1326783 1367015 1368958 1371216
$$ packed form
25022A328567k325L3872l7423o3698J1323N5607R599j9451K0970M3771J1734j6342
25010A376204J4420M0547l6571j8666n8341O106L2230k4827j9243r898m083n4210
24998A243668j9042N2648K6487N629q273j1079j2464j7089p878k4891R973J4249
24986A251938n905L9081J5621N911O31K6452k2549K0918K4845k6136j1323j7362
24974A302122n0221p755J9098L5207q123p908K1587j7767k4129J2388q916J979
24962A267562J5335k14o567j3491k7071k7049K4075K8121k5678J6359K9619j1202
24950A269799J9057Q672M9112J0433j9966l5544n844j4815K4036L387J556P750
24938A317633K0544K6268j1555o0485r886J9282K688K3521j227M0232J943K258
$$ plain form
24926 1371216 1330043 1297627 1308091 1326784 1359592 1392446 1400296 1396172 1404753 1409074 1366939 1356340
24914 1356340 1304254 1286743 1317976 1316942 1338254 1364918 1304755 1300917 1331891 1345713 1383630 1393173
24902 1393173 1359093 1347615 1319795 1349358 1329740 1316026 1296767 1293594 1320710 1307311 1321113
24891 1321113 1324994 1326735 1318826 1331920 1325026 1334981 1352473 1317080 1311431 1323206 1347416 1359791
24879 1359791 1397976 1333300 1307241 1346485 1356824 1348128 1310242 1302574 1345161 1356531 1391321 1364868
24867 1364868 1346450 1340497 1327918 1346659 1338839 1298894 1315360 1355813 1365465 1349498 1326113 1366020
24855 1366020 1381180 1401854 1406762 1407157 1424398 1445188 1431468 1397154 1343050 1307658 1310956 1303808
24843 1303808 1322269 1337176 1337687 1339510 1371233 1389033 1376969 1396864 1367570 1334051 1335114 1359572
$$ packed form
24926A371216m1173l2416J0464J8693L2808L2854P850m124Q581M321m2135j0599
24914A356340n2086j7511L1233j034K1312K6664o0163l838L0974J3822L7917R543
24902A393173l4080j1478k7820K9563j9618j3714j9259l173K7116j3399J3802
24891A321113L881J741p909J3094o894R955J7492l5393n649J1775K4210J2375
24879A359791L8185o4676k6059L9244J0339q696l7886p668M2587J1370L4790k6453
24867A364868j8418n953j2579J8741p820l9945J6466M0453R652j5967k3385L9907
24855A366020J5160K0674M908L95J7241K0790j3720l4314n4104l5392L298p148
24843A303808J8461J4907N11J823L1723J7800j2064J9895k9294l3519J063K4458
$$ plain form
24831 1359572 1416057 1432479 1402862 1366968 1337096 1386444 1372943 1297024 1314266 1341899 1370271
24820 1370271 1387556 1425795 1426582 1391542 1392786 1391609 1402571 1400643 1414115 1390479 1371739 1391584
24808 1391584 1391351 1355758 1331726 1322641 1312880 1323844 1350761 1357329 1347613 1344100 1334632 1322399 1323745
24795 1323745 1380680 1398970 1393039 1423767 1406619 1371884 1396475 1404433 1375937 1354109 1365420 1393168
24783 1393168 1405707 1425793 1411550 1396713 1410418 1434962 1438361 1388959 1394538 1422588 1448768 1450701
24771 1450701 1439878 1433095 1442512 1441565 1426362 1423868 1421589 1414355 1405578 1402345 1398733 1389815 1361386
24758 1361386 1344876 1322145 1311641 1331257 1381537 1384054 1394316 1426975 1425675 1403337 1424475 1433177
24746 1433177 1405097 1384589 1398813 1371219 1375964 1393062 1377679 1417649 1440914 1424392 1392281
$$ packed form
24831A359572N6485J6422k9617l5894k9872M9348j3501p5919J7242K7633K8372
24820A370271J7285L8239P87l5040J244j177J0962j928J3472k3636j8740J9845
24808A391584k33l5593k4032r085r761J0964K6917O568r716l513r468j2233J346
24795A323745N6935J8290n931L0728j7148l4735K4591P958k8496k1828J1311K7748
24783A393168J2539K0086j4243j4837J3705K4544L399m9402N579K8050K6180J933
24771A450701j0823o783R417r47j5203k494k279p234q777l233l612q918k8429
24758A361386j6510k2731j0504J9616N0280K517J0262L2659j300k2338K1138Q702
24746A433177k8080k0508J4224k7594M745J7098j5383L9970K3265j6522l2111
$$ plain form
24735 1392281 1360829 1361825 1336868 1337216 1367875 1357122 1356157 1344265 1326837 1338675 1405185 1468004
24723 1468004 1491373 1457052 1430173 1384471 1378580 1398519 1372231 1389608 1384632 1379386 1409898 1421528
24711 1421528 1427840 1436718 1403820 1421819 1414114 1386064 1394078 1401820 1403266 1421957 1433082 1478696
24699 1478696 1475213 1458104 1448497 1454021 1407549 1359742 1339303 1317650 1341074 1365221 1403131 1441312
24687 1441312 1398778 1294093 1287524 1352775 1389907 1356387 1351840 1306777 1295497 1330909 1371084
24676 1371084 1434616 1417066 1365004 1394825 1416312 1400867 1383554 1401955 1436216 1432593 1415306
24665 1415306 1459849 1460546 1477507 1479180 1471940 1446646 1428107 1391473 1370403 1372716 1390761 1396928
24653 1396928 1395779 1405442 1404691 1419136 1409893 1425574 1425207 1440608 1461288 1470660 1405192 1442455 1494930
$$ packed form
24735A392281l1452R96k4957L48L0659j0753r65j1892j7428J1838O6510O2819
24723A468004K3369l4321k6879m5702n891J9939k6288J7377m976n246L0512J1630
24711A421528O312Q878l2898J7999p705k8050Q014P742J446J8691J1125M5614
24699A478696l483j7109r607N524m6472m7807k0439k1653K3424K4147L7910L8181
24687A441312m2534j04685o569O5251L7132l3520m547m5063j1280L5412M0175
24676A371084O3532j7550n2062K9821K1487j5445j7313J8401L4261l623j7287
24665A415306M4543O97J6961J673p240k5294j8539l6634k1070K313J8045O167
24653A396928j149R663p51J4445r243J5681l67J5401K0680R372o5468L7263N2475
$$ plain form
24640 1494930 1461346 1384241 1328622 1319267 1357136 1366001 1329992 1361049 1379724 1414633 1415796 1427146
24628 1427146 1423552 1429054 1475956 1503895 1475213 1435525 1424170 1429907 1401721 1417351 1445149 1468060
24616 1468060 1471773 1420459 1455792 1440436 1436570 1428413 1434835 1439691 1413871 1407139 1408098 1369346 1345988
24603 1345988 1377291 1404456 1430500 1414503 1417394 1399772 1415237 1443152 1474453 1470863 1439462 1414721
24591 1414721 1421611 1426707 1408542 1429598 1451235 1479344 1486940 1475925 1478575 1459326 1438341 1473415
24579 1473415 1459153 1441687 1428467 1392221 1356097 1359705 1370661 1374891 1362145 1366212 1388165 1386485
24567 1386485 1380736 1403469 1396142 1404425 1447597 1433888 1414905 1419241 1411944 1403670 1418624 1441353
24555 1441353 1456817 1469703 1464712 1394422 1370219 1386678 1420789 1403050 1411632 1421292 1433738 1465546
$$ packed form
24640A494930l3584p7105n5619r355L7869Q865l6009L1057J8675L4909J163J1350
24628A427146l594N502M6902K7939k8682l9688j1355N737k8186J5630K7798K2911
24616A468060L713n1314L5333j5356l866q157O422M856k5820o732R59l8752k3358
24603A345988L1303K7165K6044j5997K891j7622J5465K7915L1301l590l1401k4741
24591A414721O890N096j8165K1056K1637K8109P596j1015K650j9249k0985L5074
24579A473415j4262j7466j3220l6246l6124L608J0956M230j2746M067K1953j680
24567A386485n749K2733p327Q283M3172j3709j8983M336p297q274J4954K2729
24555A441353J5464J2886m991p0290k4203J6459L4111j7739Q582R660J2446L1808
$$ plain form
24543 1465546 1489775 1501847 1520086 1479216 1475992 1474208 1488024 1460231 1426983 1448961 1465438 1462348
24531 1462348 1488789 1488576 1438474 1413992 1464398 1434525 1413864 1445526 1450792 1381967 1369088 1377614
24519 1377614 1387275 1424048 1461068 1472650 1477021 1449326 1420870 1412351 1397632 1418864 1409469 1426128
24507 1426128 1435087 1438747 1456518 1452565 1440643 1504157 1498063 1438440 1404060 1385465 1433249 1495445
24495 1495445 1478468 1472741 1481530 1471791 1428651 1381440 1358194 1379185 1393566 1418456 1432886 1437064
24483 1437064 1447074 1437882 1443213 1453721 1475104 1471676 1467053 1439704 1421194 1448679 1494426 1488629
24471 1488629 1485206 1466448 1487157 1514980 1512412 1522371 1523954 1549328 1532860 1488612 1426918 1468355
24459 1468355 1472906 1488292 1507995 1511220 1490492 1495068 1473364 1456887 1473936 1499471 1458303 1419400
$$ packed form
24543A465546K4229J2072J8239m0870l224j784J3816k7793l3248K1978J6477l090
24531A462348K6441k13n0102k4482N0406k9873k0661L1662N266o8825j2879Q526
24519A377614R661L6773L7020J1582M371k7695k8456q519j4719K1232r395J6659
24507A426128Q959L660J7771l953j1922O3514o094n9623l4380j8595M7784O2196
24495A495445j6977n727Q789r739m3140m7211k3246K0991J4381K4890J4430M178
24483A437064J0010r192N331J0508K1383l428m623k7349j8510K7485M5747n797
24471A488629l423j8758K0709K7823k568R959J583K5374j6468m4248o1694M1437
24459A468355M551J5386J9703L225k0728M576k1704j6477J7049K5535m1168l8903
$$ plain form
24447 1419400 1393717 1429284 1453510 1461266 1466182 1423542 1438573 1471504 1547254 1531698 1483803 1418468
24435 1418468 1405475 1413268 1423851 1401250 1387457 1386376 1424505 1464291 1499161 1516167 1503678 1456759
24423 1456759 1445016 1463368 1527471 1539884 1516923 1507816 1475121 1480984 1480845 1497966 1508970 1518353
24411 1518353 1505191 1539151 1539324 1545044 1579939 1552238 1525749 1516547 1522939 1514009 1515666 1556058 1552986
24398 1552986 1531095 1510576 1513715 1497547 1492393 1531798 1543235 1556578 1548507 1539003 1480606 1442005
24386 1442005 1423784 1486762 1496278 1522050 1570703 1559476 1517033 1500610 1471588 1500653 1501506 1552276
24374 1552276 1569838 1543279 1505246 1511754 1520304 1540599 1532769 1500884 1486808 1499474 1507485 1492267
24362 1492267 1461679 1434242 1456692 1473536 1481399 1511665 1524838 1484552 1479204 1503936 1511250 1505795
$$ packed form
24447A419400k5683L5567K4226P756M916m2640J5031L2931P5750j5556m7895o5335
24435A418468j2993P793J0583k2601j3793j081L8129L9786L4870J7006j2489m6919
24423A456759j1743J8352O4103J2413k2961r107l2695N863j39J7121J1004R383
24411A518353j3162L3960J73N720L4895k7701k6489r202O392q930J657M0392l072
24398A552986k1891k0519L139j6168n154L9405J1437J3343q071r504n8397l8601
24386A442005j8221O2978R516K5772M8653j1227m2443j6423k9022K9065Q53N0770
24374A552276J7562k6559l8033O508Q550K0295p830l1885j4076J2666Q011j5218
24362A492267l0588k7437K2450J6844P863L0266J3173m0286n348K4732P314n455
$$ plain form
24350 1505795 1462572 1463756 1493301 1518550 1510391 1498008 1494153 1484333 1488569 1511784 1478312 1438856
24338 1438856 1456207 1501325 1538116 1555926 1550270 1489433 1518525 1539027 1554719 1566239 1549447
24327 1549447 1532475 1544533 1510314 1454269 1449516 1455453 1473336 1483833 1504432 1504587 1494877 1515301
24315 1515301 1513458 1512894 1529198 1514846 1503093 1528386 1512672 1522358 1536778 1518831 1521218 1537034
24303 1537034 1567916 1550544 1541639 1558328 1586254 1591364 1587882 1599666 1588713 1566153 1567701 1590336
24291 1590336 1543836 1547166 1561909 1547056 1566178 1576471 1547439 1518853 1543809 1511756 1504189 1493876
24279 1493876 1497308 1537341 1562987 1586655 1611465 1613390 1585684 1588541 1569677 1510519 1499755 1515166
24267 1515166 1497596 1496034 1501359 1528445 1522719 1511360 1534145 1508411 1514045 1532837 1581203 1611693
$$ packed form
24350A505795m3223J184K9545K5249q159j2383l855r820M236K3215l3472l9456
24338A438856J7351M5118L6791J7810n656o0837K9092K0502J5692J1520j6792
24327A549447j6972J2058l4219n6045m753N937J7883J0497K0599J55r710K0424
24315A515301j843n64J6304j4352j1753K5293j5714R686J4420j7947K387J5816
24303A537034L0882j7372q905J6689K7926N110l482J1784j0953k2560J548K2635
24291A590336m6500L330J4743j4853J9122J0293k9032k8586K4956l2053p567j0313
24279A493876L432M0033K5646K3668K4810J925k7706K857j8864n9158j0764J5411
24267A515166j7570j562N325K7086n726j1359K2785k5734N634J8792M8366L0490
$$ plain form
24255 1611693 1594667 1603094 1590157 1584570 1606182 1622515 1634632 1637806 1609544 1571264 1563136 1556307
24243 1556307 1510358 1504856 1505797 1542423 1581378 1567010 1557117 1550983 1547361 1570713 1573411 1586055 1572489
24230 1572489 1579633 1614845 1607215 1589097 1573457 1568903 1548555 1585830 1599311 1583857 1540524 1508344
24218 1508344 1573043 1623388 1661904 1675992 1598758 1588317 1544077 1525051 1548515 1536895 1574959
24207 1574959 1574468 1586774 1606157 1612052 1595941 1581036 1573718 1571350 1578606 1631842 1600440 1577033
24195 1577033 1589612 1594250 1605731 1611278 1620419 1595399 1583085 1608925 1602361 1602351 1600282 1607642 1610299
24182 1610299 1613046 1608169 1597456 1595128 1559747 1536503 1547241 1555115 1586836 1668114 1696591 1718025
24170 1718025 1715630 1685882 1632903 1578924 1589544 1631862 1642655 1611179 1639426 1654492 1644920 1610386
$$ packed form
24255A611693j7026Q427j2937n587K1612J6333J2117L174k8262l8280q128o829
24243A556307m5949n502R41L6626L8955j4368r893o134l622K3352K698J2644j3566
24230A572489P144L5212p630j8118j5640m554k0348L7275J3481j5454m3333l2180
24218A508344O4699N0345L8516J4088p7234j0441m4240j9026K3464j1620L8064
24207A574959m91J2306J9383N895j6111j4905p318k368P256N3236l1402k3407
24195A577033J2579M638J1481N547R141k5020j2314K5840o564j0k069P360K657
24182A610299K747m877j0713k328l5381k3244J0738P874L1721Q1278K8477K1434
24170A718025k395k9748n2979n3979J0620M2318J0793l1476K8247J5066r572l4534
$$ plain form
24158 1610386 1591828 1595132 1598601 1600312 1609404 1623028 1613875 1611850 1633899 1628661 1636429 1619475 1571469
24145 1571469 1576082 1585826 1584011 1574630 1588050 1604391 1615386 1606919 1604741 1679940 1697789 1650120
24133 1650120 1664047 1668361 1669897 1687764 1669173 1638788 1582315 1565212 1583492 1606681 1587187 1589778
24121 1589778 1619361 1606706 1595196 1631662 1645484 1619619 1618174 1601590 1579063 1568057 1616386
24110 1616386 1642861 1656391 1686468 1688119 1660151 1622771 1580121 1624591 1631413 1611107 1618463 1622618
24098 1622618 1602218 1671069 1686205 1671117 1663531 1644935 1670776 1716797 1693890 1662462 1629104
24087 1629104 1609725 1575759 1548405 1590377 1646077 1694878 1731352 1726303 1695654 1685895 1658434 1670033
24075 1670033 1708984 1699647 1712861 1725846 1690164 1696608 1709559 1714111 1686529 1637538 1651510 1665062
$$ packed form
24158A610386j8558L304L469J711R092J3624r153k025K2049n238P768j6954m8006
24145A571469M613R744j815r381J3420J6341J0995q467k178P5199J7849m7669
24133A650120J3927M314J536J7867j8591l0385n6473j7103J8280K3189j9494K591
24121A589778K9583j2655j1510L6466J3822k5865j445j6584k2527j1006M8329
24110A616386K6475J3530L0077J651k7968l7380m2650M4470O822k0306P356M155
24098A622618k0400O8851J5136j5088p586j8596K5841M6021k2907l1428l3358
24087A629104j9379l3966k7354M1972N5700M8801L6474n049l0649r759k7461J1599
24075A670033L8951r337J3214J2985l5682O444J2951M552k7582m8991J3972J3552
$$ plain form
24063 1665062 1678649 1730615 1754060 1726597 1705360 1706694 1697795 1643229 1629061 1605523 1627645 1668899
24051 1668899 1705074 1685784 1670901 1627759 1620376 1655276 1646237 1626348 1650005 1727509 1747845 1721075
24039 1721075 1726066 1735172 1727889 1708634 1684430 1674403 1678992 1727381 1723386 1720187 1746646 1742981 1768928
24026 1768928 1775169 1761659 1719848 1678574 1647660 1651099 1647598 1674695 1730890 1761791 1740268 1721571
24014 1721571 1710684 1723105 1705109 1657252 1625983 1635325 1643064 1628845 1674068 1695421 1714730 1752283
24002 1752283 1735324 1738189 1732685 1725701 1661956 1649354 1662502 1672595 1677640 1690531 1703135 1680450
23990 1680450 1681800 1676238 1681348 1665813 1678889 1694052 1729707 1725217 1728980 1749289 1751406 1763523
23978 1763523 1786593 1786164 1792941 1805276 1790892 1758905 1729444 1729710 1696303 1721898 1768832 1787620
$$ packed form
24063A665062J3587N1966K3445k7463k1237J334q899n4566j4168k3538K2122M1254
24051A668899L6175j9290j4883m3142p383L4900r039j9889K3657P7504K0336k6770
24039A721075M991R106p283j9255k4204j0027M589M8389l995l199K6459l665K5947
24026A768928O241j3510m1811m1274l0914L439l501K7097N6195L0901k1523j8697
24014A721571j0887J2421j7996m7857l1269R342P739j4219M5223K1353J9309L7553
24002A752283j6959K865n504o984o3745j2602J3148J0093N045J2891J2604k2685
23990A680450J350n562N110j5535J3076J5163L5655m490L763K0309K117J2117
23978A763523K3070m29O777J2335j4384l1987k9461K66l3407K5595M6934J8788
$$ plain form
23966 1787620 1801309 1815701 1769584 1751802 1754390 1777009 1785025 1753632 1771626 1742295 1713163 1746132
23954 1746132 1735443 1720808 1742386 1772173 1775945 1793452 1755927 1724986 1730057 1761022 1778002 1799510
23942 1799510 1810723 1755527 1705318 1726774 1727634 1719832 1728476 1753054 1760258 1736160 1713805 1704079
23930 1704079 1768776 1789937 1744105 1735858 1761911 1785491 1822660 1787142 1766578 1755247 1750788 1758030
23918 1758030 1774091 1751092 1742829 1741781 1730727 1779273 1771543 1735931 1764586 1794018 1801995 1777978
23906 1777978 1766813 1741004 1759766 1757035 1741990 1737017 1748431 1737953 1784233 1813974 1794247 1775815
23894 1775815 1762521 1777387 1790048 1775492 1753301 1813568 1836061 1818682 1793256 1796751 1784087
23883 1784087 1768778 1757153 1803606 1819436 1785715 1766430 1739844 1764354 1755030 1787727 1809048
$$ packed form
23966A787620J3689J4392m6117j7782K588K2619Q016l1393J7994k9331k9132L2969
23954A746132j0689j4635K1578K9787L772J7507l7525l0941N071L0965J6980K1508
23942A799510J1213n5196n0209K1456Q60p802Q644K4578P204k4098k2355r726
23930A704079O4697K1161m5832q247K6053K3580L7169l5518k0564j1331m459P242
23918A758030J6061k2999q263j048j1054M8546p730l5612K8655K9432P977k4017
23906A777978j1165k5809J8762k731j5045m973J1414j0478M6280K9741j9727j8432
23894A775815j3294J4866J2661j4556k2191O0267K2493j7379k5426L495j2664
23883A784087j5309j1625M6453J5830l3721j9285k6586K4510r324L2697K1321
$$ plain form
23872 1809048 1819816 1821153 1797871 1814926 1857599 1872603 1864004 1841129 1831173 1850788 1789789 1776102
23860 1776102 1805117 1837953 1822076 1814302 1829625 1813743 1814429 1837137 1830487 1841725 1808083 1757014
23848 1757014 1758602 1771669 1750295 1780925 1785897 1795853 1791522 1797992 1852971 1885743 1855002 1785578
23836 1785578 1796823 1820326 1849578 1879431 1874631 1832060 1876171 1922712 1892748 1849927 1846114 1891708
23824 1891708 1903220 1922627 1949948 1938499 1884704 1853685 1838781 1847186 1817986 1817004 1835027 1834258
23812 1834258 1816840 1869261 1894447 1904504 1926478 1918660 1896949 1875204 1838929 1837204 1812966 1787159
23800 1787159 1775960 1769897 1803438 1780675 1750331 1763844 1829692 1829714 1797588 1768955 1770542 1805368
23788 1805368 1811354 1825890 1819288 1804612 1845767 1868890 1849657 1848725 1884237 1870767 1832219 1811459
$$ packed form
23872A809048J0768J337k3282J7055M2673J5004q599k2875r956J9615o0999j3687
23860A776102K9015L2836j5877p774J5323j5882O86K2708o650J1238l3642n1069
23848A757014J588J3067k1374L0630M972R956m331O470N4979L2772l0741o9424
23836A785578J1245K3503K9252K9853m800m2571M4111M6541k9964m2821l813M5594
23824A891708J1512J9407K7321j1449n3795l1019j4904Q405k9200r82J8023p69
23812A834258j7418N2421K5186J0057K1974p818k1711k1745l6275j725k4238k5807
23800A787159j1199o063L3541k2763l0344J3513O5848K2l2126k8633J587L4826
23788A805368N986J4536o602j4676M1155K3123j9233r32L5512j3470l8548k0760
$$ plain form
23776 1811459 1850484 1861139 1866007 1881608 1898454 1929755 1900940 1871347 1882245 1917472 1904936
23765 1904936 1873836 1886652 1896032 1893392 1911537 1915106 1929151 1889060 1833130 1787141 1793195 1820053
23753 1820053 1863097 1898742 1909779 1894842 1882403 1808398 1796352 1793382 1824889 1836261 1868663
23742 1868663 1856608 1873546 1928097 1977683 1954346 1867452 1842698 1876749 1874707 1871459 1877911 1916376
23730 1916376 1906384 1896578 1916455 1904018 1892659 1870101 1939269 1905254 1844193 1851375 1862679 1901825
23718 1901825 1936780 1936628 1919385 1912432 1908362 1870589 1829146 1860822 1875454 1894249 1919236 1888640
23706 1888640 1881637 1906252 1922582 1936594 1953827 1911833 1865341 1897603 1886750 1842058 1875133
23695 1875133 1889958 1873255 1867773 1862438 1883917 1917082 1962307 1921625 1889612 1922206 1946096 1915904
$$ packed form
23776A811459L9025J0655M868J5601J6846L1301k8815k9593J0898L5227j2536
23765A904936l1100J2816R380k640J8145L569J4045m0091n5930m5989O054K6858
23753A820053M3044L5645J1037j4937j2439p4005j2046k970L1507J1372L2402
23742A868663j2055J6938N4551M9586k3337q6894k4754L4051k042l248O452L8465
23730A916376r992r806J9877j2437j1359k2558O9168l4015o1061P182J1304L9146
23718A901825L4955j52j7243o953m070l7773m1443L1676J4632J8795K4987l0596
23706A888640p003K4615J6330J4012J7233m1994m6492L2262j0853m4692L3075
23695A875133J4825j6703n482n335K1479L3165M5225m0682l2013L2594K3890l0192
$$ plain form
23683 1915904 1964708 2003564 1967276 1924077 1928153 1930692 1923787 1923917 1943504 1945835 1924429 1886422
23671 1886422 1861412 1860560 1865213 1887368 1926320 1916460 1905003 1912077 1888556 1921895 1944110 1931386
23659 1931386 1954828 1958611 1943964 1928472 1869534 1881072 1891504 1908950 1908751 1934600 1950551 1910094
23647 1910094 1913662 1931575 1899518 1891694 1931497 1943351 1943577 1974421 1977895 1945189 1968005 1984371
23635 1984371 1995402 1956548 1947219 1964669 1967908 1989399 1992237 2015695 1998751 2021942 2035607 2010594
23623 2010594 1993153 1971480 1970515 1992098 1975024 2012014 2048126 2052658 2040394 2032663 1971500 1968105
23611 1968105 1998698 2061737 2042959 1990774 1990886 2003449 1966918 1993056 2022860 2017645 1987162 1946091
23599 1946091 1975299 2033498 1985895 1961158 1966485 1969610 1959846 1954921 1983952 1967142 1963931 1991299
$$ packed form
23683A915904M8804L8856l6288m3199M076K539o905J30J9587K331k1406l8007
23671A886422k5010q52M653K2155L8952r860j1457P074k3521L3339K2215j2724
23659A931386K3442L783j4647j5492n8938J1538J0432J7446j99K5849J5951m0457
23647A910094L568J7913l2057p824L9803J1854K26L0844L474l2706K2816J6366
23635A984371J1031l8854r329J7450L239K1491K838K3458j6944K3191J3665k5013
23623B010594j7441k1673r65K1583j7074L6990L6112M532j2264p731o1163l395
23611A968105L0593O3039j8778n2185J12J2563l6531K6138K9804n215l0483m1071
23599A946091K9208N8199m7603k4737N327L125r764m925K9031j6810l211K7368
$$ plain form
23587 1991299 1997746 2019292 2025452 2025643 2016957 2011417 2005243 2013228 2017135 2030990 2081704 2061549 2068682
23574 2068682 2039185 1968846 1898206 1939011 1974602 2008507 2074383 2077040 2054318 2057575 2066461 2041379
23562 2041379 2037658 2055986 2037637 2026259 2056164 2064699 2028525 2074797 2074246 2088361 2065694 2077662
23550 2077662 2091559 2074704 2081950 2096084 2108550 2100376 2084430 2082616 2079887 2050379 2066985 2093155
23538 2093155 2074526 2062439 2094243 2100817 2081869 2070301 2095083 2064362 2040135 2081616 2124435
23527 2124435 2134499 2135662 2136051 2126942 2108734 2116649 2131027 2071841 2050922 2064169 2069126 2105655
23515 2105655 2136084 2091189 2062246 2054965 2058742 2099208 2093051 2056331 2047124 2081909 2089109 2079706
23503 2079706 2082592 2101757 2153185 2149389 2145926 2140128 2158248 2101549 2069134 2062737 2084779 2130487
$$ packed form
23587A991299O447K1546O160J91q686n540o174P985L907J3855N0714k0155P133
23574B068682k9497p0339p0640M0805L5591L3905O5876K657k2722L257Q886k5082
23562B041379l721J8328j8349j1378K9905Q535l6174M6272n51J4115k2667J1968
23550B077662J3897j6855P246J4134J2466q174j5946j814k729k9508J6606K6170
23538B093155j8629j2087L1804O574j8948j1568K4782l0721k4227M1481M2819
23527B124435J0064J163L89r109j8208P915J4378n9186k0919J3247M957L6529
23515B105655L0429m4895k8943p281L777M0466o157l6720r207L4785P200r403
23503B079706K886J9165N1428l796l463n798J8120n6699l2415o397K2042M5708
$$ plain form
23491 2130487 2151003 2133766 2130060 2085784 2059576 2067481 2097491 2103690 2075135 2097657 2123030 2112347
23479 2112347 2063177 2080115 2110896 2088385 2107044 2138926 2172715 2173528 2185008 2186669 2147288 2134257
23467 2134257 2113244 2092570 2118178 2130545 2118430 2160811 2177357 2170988 2193453 2158448 2116679
23456 2116679 2113539 2130886 2138061 2161759 2176114 2182861 2153105 2153930 2145146 2179132 2222199 2223961 2237015
23443 2237015 2242373 2198984 2156359 2122350 2119162 2143159 2167973 2182888 2207987 2235229 2201675 2147565
23431 2147565 2149113 2146383 2173475 2174276 2194245 2197371 2165316 2167904 2188985 2174774 2159954 2140992
23419 2140992 2149926 2208379 2217320 2195124 2130105 2098241 2132090 2190400 2211335 2235098 2226190 2218460
23407 2218460 2223626 2216995 2230774 2244962 2249949 2276361 2331308 2331021 2284026 2206212 2187808 2195754
$$ packed form
23491B130487K0516j7237l706m4276k6208P905L0010O199k8555K2522K5373j0683
23479B112347m9170J6938L0781k2511J8659L1882L3789Q13J1480J661l9381j3031
23467B134257k1013k0674K5608J2367j2115M2381J6546o369K2465l5005m1769
23456B116679l140J7347P175K3698J4355O747k9756Q25q784L3986M3067J762J3054
23443B237015N358m3389m2625l4009l188K3997K4814J4915K5099K7242l3554n4110
23431B147565J548k730K7092Q01J9969L126l2055K588K1081j4211j4820j8962
23419B140992Q934N8453Q941k2196o5019l1864L3849N8310K0935K3763q908p730
23407B218460N166o631J3779J4188M987K6412N4947k87m6995p7814j8404P946
$$ plain form
23395 2195754 2190398 2248328 2297248 2289801 2221736 2226903 2270702 2251866 2232989 2214762 2245142 2270561
23383 2270561 2260976 2263490 2239778 2237999 2222064 2230111 2250062 2272353 2285449 2274514 2310678 2304061
23371 2304061 2234338 2205979 2241746 2255396 2262156 2235306 2224515 2243471 2244926 2258484 2246530 2235887
23359 2235887 2226580 2278132 2317613 2308158 2339875 2343269 2336514 2347758 2294378 2293399 2332618 2317508
23347 2317508 2331544 2342122 2363082 2347538 2362023 2386736 2404348 2380741 2395543 2385717 2319693
23336 2319693 2300673 2327626 2321457 2329661 2317277 2353403 2349020 2333718 2330188 2317776 2348755 2336051
23324 2336051 2291469 2307721 2350008 2342616 2317710 2291804 2314857 2290768 2257344 2288890 2310588
23313 2310588 2323110 2396595 2410967 2380441 2387959 2402005 2425245 2404706 2392745 2371130 2383121
$$ packed form
23395B195754n356N7930M8920p447o8065N167M3799j8836j8877j8227L0380K5419
23383B270561r585K514k3712j779j5935Q047J9951K2291J3096j0935L6164o617
23371B304061o9723k8359L5767J3650O760k6850j0791J8956J455J3558j1954j0643
23359B235887r307N1552L9481r455L1717L394o755J1244n3380r79L9219j5110
23347B317508J4036J0578K0960j5544J4485K4713J7612k3607J4802r826o6024
23336B319693j9020K6953o169Q204j2384L6126m383j5302l530j2412L0979j2704
23324B336051m4582J6252M2287p392k4906k5906K3053k4089l3424L1546K1698
23313B310588J2522P3485J4372l0526P518J4046K3240k0539j1961k1615J1991
$$ plain form
23302 2383121 2442945 2447302 2417541 2375017 2368332 2380733 2439246 2459594 2471741 2468217 2400632 2318408
23290 2318408 2372424 2369618 2331510 2355116 2388053 2389902 2444661 2459121 2432246 2411803 2411319 2417380
23278 2417380 2469407 2445715 2405297 2412444 2379236 2346080 2353932 2352669 2376929 2427931 2459344 2488783
23266 2488783 2473211 2456813 2468814 2503294 2485895 2463291 2448556 2469630 2466237 2421091 2435459
23255 2435459 2441331 2441092 2475877 2512722 2513470 2498958 2487316 2533584 2571074 2577957 2584100 2608000 2575896
23242 2575896 2513333 2507500 2521451 2521789 2557092 2562342 2548707 2552631 2521985 2523881 2548740 2559157
23230 2559157 2529288 2540521 2548450 2540399 2485403 2469059 2480017 2479425 2495703 2519588 2529714 2539550
23218 2539550 2558221 2578550 2584093 2567707 2549748 2586693 2584927 2547809 2555773 2569322 2591465 2590890
$$ packed form
23302B383121N9824M357k9761m2524o685J2401N8513K0348J2147l524o7585q2224
23290B318408N4016k806l8108K3606L2937J849N4759J4460k6875k0443m84O061
23278B417380N2027k3692m0418P147l3208l3156P852j263K4260N1002L1413K9439
23266B488783j5572j6398J2001L4480j7399k2604j4735K1074l393m5146J4368
23255B435459N872k39L4785L6845P48j4512j1642M6268L7490O883O143K3900l2104
23242B575896o2563n833J3951L38L5303N250j3635L924l0646J896K4859J0417
23230B559157k9869J1233P929q051n4996j6344J0958n92J6278K3885J0126R836
23218B539550J8671K0329N543j6386j7959L6945j766l7118P964J3549K2143n75
$$ plain form
23206 2590890 2564357 2576230 2591544 2565265 2569588 2615711 2632988 2622849 2672488 2670948 2675121 2675757
23194 2675757 2629711 2626450 2662376 2629139 2605048 2612007 2600071 2603691 2599381 2594080 2628199 2678987
23182 2678987 2679660 2656366 2673553 2692606 2674275 2653723 2639943 2633673 2625349 2626285 2630620 2681465 2731067
23169 2731067 2762194 2762447 2757109 2696941 2678187 2719904 2734177 2696458 2701577 2767323 2828707 2794988
23157 2794988 2747269 2751985 2745997 2742593 2722733 2708725 2730957 2784888 2779961 2766153 2752729 2745853
23145 2745853 2778492 2785485 2759527 2762140 2796877 2751931 2703747 2744888 2771683 2816004 2827221 2803901
23133 2803901 2834588 2847189 2840816 2836943 2812457 2807549 2821832 2853512 2839805 2795898 2790631 2784865
23121 2784865 2807565 2826688 2845273 2859053 2895370 2888853 2883278 2827055 2848528 2908592 2949359 2962138
$$ packed form
23206B590890k6533J1873J5314k6279M323M6123J7277j0139M9639j540M173O36
23194B675757m6046l261L5926l3237k4091O959j1936L620m310n301L4119N0788
23182B678987O73k3294J7187J9053j8331k0552j3780o270q324R36M335N0845M9602
23169B731067L1127K53n338o0168j8754M1717J4273l7719N119O5746O1384l3719
23157B794988m7719M716n988l404j9860j4008K2232N3931m927j3808j3424o876
23145B745853L2639O993k5958K613L4737m4946m8184M1141K6795M4321J1217k3320
23133B803901L0687J2601o373l873k4486m908J4283L1680j3707m3907n267n766
23121B784865K2700J9123J8585J3780L6317o517n575n6223K1473O0064M0767J2779
$$ plain form
23109 2962138 2975932 2961919 2938683 2936371 2973544 2996370 3015089 3047127 3072932 3091210 3100706 3149888
23097 3149888 3179373 3218684 3254162 3302987 3324935 3410463 3538921 3682776 3733785 3629120 3324966
23086 3324966 2944944 2579647 2225263 2097076 2122422 2158195 2205258 2285790 2356629 2384901
23076 2384901 2407381 2449999 2512235 2556866 2614304 2648334 2648919 2641442 2641729 2674641 2686756 2692821
23064 2692821 2696463 2734590 2790521 2833003 2820480 2795170 2792227 2804309 2837946 2832590 2827403 2832125
23052 2832125 2812211 2844560 2896887 2862310 2840644 2805189 2795135 2775063 2799178 2846440 2881467
23041 2881467 2928164 2939837 2905094 2896817 2914874 2895887 2882657 2909833 2954268 2953293 2984542 3002332
23029 3002332 2997908 2984206 2980491 2970527 2955773 2979016 3016431 2985734 3000690 3009430 3023041 3056582
$$ packed form
23109B962138J3794j4013k3236k312L7173K2826J8719L2038K5805J8278R496M9182
23097C149888K9485L9311L5478M8825K1948Q5528J28458J43855N1009j04665l04154
23086C324966l80022l65297l54384j28187K5346L5773M7063Q0532P0839K8272
23076B384901K2480M2618O2236M4631N7438L4030N85p477K87L2912J2115O065
23064B692821L642L8127N5931M2482j2523k5310k943J2082L3637n356n187M722
23052B832125j9914L2349N2327l4577k1666l5455j0054k0072K4115M7262L5027
23041B881467M6697J1673l4743q277J8057j8987j3230K7176M4435r75L1249J7790
23029C002332m424j3702l715r964j4754K3243L7415l0697J4956Q740J3611L3541
$$ plain form
23017 3056582 3021282 3028259 3014810 2986344 3009750 2989253 2973367 2998779 3065379 3081374 3042499
23006 3042499 3032019 3044955 3093033 3041593 2998334 3022644 3027419 3004939 2971627 3020934 3054866
22995 3054866 3039815 3056121 3080511 3106461 3116009 3107327 3088832 3115412 3140366 3183876 3223298 3277415
22983 3277415 3303583 3276551 3238152 3213372 3205186 3169677 3156337 3221483 3257385 3266173 3271340 3259688
22971 3259688 3265644 3273142 3302208 3308867 3323812 3293387 3254999 3232536 3220582 3229003 3235289 3293777
22959 3293777 3323570 3314044 3296540 3303082 3341149 3287157 3263726 3345878 3342915 3333082 3335702 3367328
22947 3367328 3373951 3363644 3334532 3327179 3323491 3331772 3335791 3403617 3421335 3411804 3429893 3441839
22935 3441839 3438880 3499854 3514137 3461194 3455578 3492261 3478110 3501123 3474663 3471773 3491946 3486480
$$ packed form
23017C056582l5300O977j3449k8466K3406k0497j5886K5412O6600J5995l8875
23006C042499j0480J2936M8078n1440m3259K4310M775k2480l3312M9307L3932
22995C054866j5051J6306K4390K5950R548q682j8495K6580K4954M3510L9422N4117
22983C277415K6168k7032l8399k4780q186l5509j3340O5146L5902Q788N167j1652
22971C259688N956P498K9066O659J4945l0425l8388k2463j1954Q421O286N8488
22959C293777K9793r526j7504O542L8067n3992k3431Q2152k963r833K620L1626
22947C367328O623j0307k9112p353l688Q281M019O7826J7718r531J8089J1946
22935C441839k959O0974J4283n2943n616L6683j4151K3013k6460k890K0173n466
$$ plain form
22923 3486480 3529196 3545268 3528113 3497810 3479309 3523309 3567156 3587965 3553137 3534921 3559406
22912 3559406 3585409 3591368 3593586 3595838 3560510 3566333 3607123 3601199 3593866 3611899 3631508 3646369
22900 3646369 3668436 3670305 3701563 3661599 3622047 3628908 3656862 3697031 3677500 3662737 3620635 3633699
22888 3633699 3642918 3603901 3606341 3617890 3635047 3661568 3711696 3736134 3744754 3752441 3721888 3752203
22876 3752203 3791401 3827997 3838371 3851260 3860729 3826160 3796066 3790883 3793708 3782488 3847890 3910949
22864 3910949 3940522 3966946 3930293 3946427 3972862 3947242 3940379 3916155 3922618 3942235 4008883 4005889
22852 4005889 3995482 3992097 3983656 3972912 3944792 3976733 3984529 3993017 4030828 4044274 4056440 4089712
22840 4089712 4083075 4064884 4058573 4066568 4050041 4105660 4158781 4147562 4154509 4166965 4155316 4158188
$$ packed form
22923C486480M2716J6072j7155l0303j8501M4000M3847K0809l4828j8216K4485
22912C559406K6003N959K218K252l5328N823M0790n924p333J8033J9609J4861
22900C646369K2067J869L1258l9964l9552O861K7954M0169j9531j4763m2102J3064
22888C633699R219l9017K440J1549J7157K6521N0128K4438Q620P687l0553L0315
22876C752203L9198L6596J0374J2889R469l4569l0094n183K825j1220O5402O3059
22864C910949K9573K6424l6653J6134K6435k5620o863k4224O463J9617O6648k994
22852D005889j0407l385q441j0744k8120L1941P796Q488L7811J3446J2166L3272
22840D089712o637j8191o311P995j6527N5619N3121j1219O947J2456j1649K872
$$ plain form
22828 4158188 4165784 4193916 4218561 4249027 4277864 4283110 4271301 4322495 4352839 4363931 4319889 4301240
22816 4301240 4303694 4305324 4334983 4373042 4396726 4431127 4442563 4413492 4423927 4457133 4464559 4492155
22804 4492155 4487587 4453213 4444989 4484387 4526822 4554474 4587991 4582822 4585749 4586917 4590826 4595999 4597901
22791 4597901 4587076 4582473 4556013 4566536 4600342 4631379 4628527 4576612 4576212 4603012 4630539 4660948
22779 4660948 4666427 4676242 4726564 4751065 4750522 4766595 4767226 4806394 4844122 4834729 4852535 4881489 4886212
22766 4886212 4871357 4928987 4920283 4930386 4906478 4918567 4977032 5023231 5033849 5035704 5006910 5019162
22754 5019162 5024655 5030309 5051787 5081597 5150647 5205654 5243502 5230445 5226946 5254748 5287548 5289766
22742 5289766 5287928 5307283 5330451 5361082 5359829 5347814 5375086 5390960 5386836 5435884 5484580 5483524
$$ packed form
22828D158188P596K8132K4645L0466K8837N246j1809N1194L0344J1092m4042j8649
22816D301240K454J630K9659L8059K3684L4401J1436k9071J0435L3206P426K7596
22804D492155m568l4374q224L9398M2435K7652L3517n169K927J168L909N173J902
22791D597901j0825m603k6460J0523L3806L1037k852n1915m00K6800K7527L0409
22779D660948N479R815N0322K4501n43J6073O31L9168L7728r393J7806K8954M723
22766D886212j4855N7630q704J0103k3908J2089N8465M6199J0618J855k8794J2252
22754E019162N493N654K1478K9810O9050N5007L7848j3057l499K7802L2800K218
22742E289766j838J9355K3168L0631j253j2015K7272J5874m124M9048M8696j056
$$ plain form
22730 5483524 5515084 5600262 5665167 5721121 5743605 5770243 5847287 5870312 5878987 5862094 5855562 5865958
22718 5865958 5882141 5947040 5994538 6009687 6019503 6042405 6065855 6073746 6068381 6066314 6114614 6153518
22706 6153518 6193340 6254392 6312804 6325537 6331562 6345466 6340980 6389867 6430026 6482520 6515673 6502074
22694 6502074 6525138 6542925 6534953 6525272 6578906 6633083 6696194 6735919 6752888 6831164 6888632 6906592
22682 6906592 6945214 7009455 7073258 7090458 7107607 7139594 7202176 7271142 7294067 7344164 7397923
22671 7397923 7456321 7568067 7617721 7640438 7675553 7720891 7743975 7786318 7839199 7917625 7951976
22660 7951976 7952073 7999452 8066362 8118872 8137265 8219049 8308533 8358901 8367226 8394217 8487627 8559557
22648 8559557 8600919 8692174 8798531 8848895 8901170 8974227 9117701 9176757 9213613 9283950 9372782
$$ packed form
22730E483524L1560Q5178O4905N5954K2484K6638P7044K3025Q675j6893o532J0396
22718E865958J6183O4899M7498J5149R816K2902K3450P891n365k067M8300L8904
22706F153518L9822O1052N8412J2733O025J3904m486M8887M0159N2494L3153j3599
22694F502074K3064J7787p972r681N3634N4177O3111L9725J6969P8276N7468J7960
22682F906592L8622O4241O3803J7200J7149L1987O2582O8966K2925N0097N3759
22671G397923N8398J11746M9654K2717L5115M5338K3084M2343N2881P8426L4351
22660G951976R7M7379O6910N2510J8393Q1784Q9484N0368Q325K6991R3410P1930
22648H559557M1362R1255J06357N0364N2275P3057J43474N9056L6856P0337Q8832
$$ plain form
22637 9372782 9494302 9604067 9724111 9814482 9824002 9891814 9991991 10112303 10290722 10418360
22627 10418360 10490692 10566414 10636684 10723871 10850136 11012628 11204956 11385874 11531822 11702947
22617 11702947 11969790 12193843 12378934 12381285 12255513 12027889 11695412 11475826 11449788 11591440
22607 11591440 11830747 12071239 12315024 12561273 12843977 13138512 13390099 13612948 13839081
22598 13839081 14089665 14373013 14598018 14793666 15034382 15282629 15482177 15727291 16001134
22589 16001134 16272709 16537917 16834075 17169296 17506384 17824222 18205162 18623925 19030403
22580 19030403 19458888 19937005 20418057 20912800 21428135 21976887 22510894 23093647 23663006
22571 23663006 24345475 25058283 25733448 26477594 27287004 28137412 29066042 30132938 31267104
$$ packed form
22637I372782J21520J09765J20044R0371R520O7812J00177J20312J78419J27638
22627A0418360P2332P5722P0270Q7187J26265J62492J92328J80918J45948J71125
22617A1702947K66843K24053J85091K351j25772k27624l32477k19586k6038J41652
22607A1591440K39307K40492K43785K46249K82704K94535K51587K22849K26133
22598A3839081K50584K83348K25005J95648K40716K48247J99548K45114K73843
22589A6001134K71575K65208K96158L35221L37088L17838L80940M18763M06478
22580A9030403M28485M78117M81052M94743N15335N48752N34007N82753N69359
22571B3663006O82469P12808O75165P44146Q09410Q50408R28630J066896J134166
$$ plain form
22562 31267104 32395043 33662747 35079517 36629690 38261394 40054946 41975014 44141593
22554 44141593 46588605 49324846 52457678 56030748 60228177 65129320 70840696 77548057
22546 77548057 85410598 94946738 106846363 122167770 141863457 163606262 173044263
22539 173044263 149197666 95967223 23134703 -58780984 -119391052 -147722151 -149778025
22532 -149778025 -136167315 -119475836 -105172440 -93810829 -84624190 -76907855 -70319000
22525 -70319000 -64685155 -59845203 -55704705 -52045425 -48798742 -45912795 -43249829 -40884364
22517 -40884364 -38719663 -36820035 -35123845 -33555565 -32106629 -30742780 -29474473 -28346930
22509 -28346930 -27338153 -26356080 -25411744 -24576195 -23777000 -23047243 -22365102 -21689446 -21019242
$$ packed form
22562C1267104J127939J267704J416770J550173J631704J793552J920068K166579
22554D4141593K447012K736241L132832L573070M197429M901143N711376O707361
22546G7548057P862541R536140J1899625J5321407J9695687K1742805R438001
22539A73044263k3846597n3230443p2832520q1915687o0610068k8331099k055874
22532a49778025J3610710J6691479J4303396J1361611R186639P716335O588855
22525g0319000N633845M839952M140498L659280L246683K885947K662966K365465
22517d0884364K164701J899628J696190J568280J448936J363849J268307J127543
22509b8346930J008777R82073R44336Q35549P99195P29757O82141O75656O70204
$$ plain form
22500 -21019242 -20326775 -19727900 -19170074 -18607759 -18094465 -17603088 -17144469 -16668760 -16222800
22491 -16222800 -15840049 -15495133 -15184300 -14862033 -14510631 -14151446 -13822429 -13494077 -13180662
22482 -13180662 -12859691 -12552346 -12272116 -11994570 -11734415 -11436070 -11179045 -10946181 -10718962
22473 -10718962 -10506195 -10308250 -10141664 -9922464 -9730380 -9510787 -9254397 -8956794 -8679422
22464 -8679422 -8425625 -8229980 -8196950 -8390548 -8706842 -9010252 -9203275 -9227010 -9139237 -8984712
22454 -8984712 -8769552 -8557812 -8393617 -8261564 -8076803 -7888559 -7746137 -7600409 -7480456
22445 -7480456 -7359243 -7256089 -7152192 -7075241 -7004287 -6858365 -6730468 -6637838 -6565459 -6469621
22435 -6469621 -6384415 -6261721 -6197184 -6167377 -6095851 -5999135 -5926624 -5854597 -5780504 -5671407 -5581436
$$ packed form
22500b1019242O92467N98875N57826N62315N13294M91377M58619M75709M45960
22491a6222800L82751L44916L10833L22267L51402L59185L29017L28352L13415
22482a3180662L20971L07345K80230K77546K60155K98345K57025K32864K27219
22473a0718962K12767J97945J66586K19200J92084K19593K56390K97603K77372
22464h679422K53797J95645L3030j93598l16294l03410j93023k3735Q7773J54525
22454h984712K15160K11740J64195J32053J84761J88244J42422J45728J19953
22445g480456J21213J03154J03897P6951P0954J45922J27897R2630P2379R5838
22435f469621Q5206J22694O4537K9807P1526R6716P2511P2027P4093J09097Q9971
$$ plain form
22424 -5581436 -5524430 -5468617 -5434015 -5347872 -5261247 -5170558 -5110312 -5085100 -5036151 -4970253 -4916362
22413 -4916362 -4854909 -4790726 -4744638 -4689875 -4622509 -4596901 -4581945 -4588584 -4574360 -4512692 -4463542
22402 -4463542 -4411209 -4398741 -4333002 -4269127 -4201693 -4166197 -4105779 -4044231 -4017920 -4020441 -3952691
22391 -3952691 -3882733 -3847709 -3818494 -3836100 -3820054 -3814729 -3773812 -3735107 -3684084 -3665810 -3588756
22380 -3588756 -3485656 -3400949 -3358615 -3360996 -3406601 -3390390 -3363880 -3260188 -3215875 -3162703 -3153338
22369 -3153338 -3094656 -3024192 -3040036 -3009241 -2982829 -2972185 -2945334 -2922736 -2892681 -2844890 -2827232
22358 -2827232 -2821870 -2811084 -2761568 -2717000 -2707267 -2688368 -2621014 -2525911 -2511561 -2474958 -2428126 -2427746
22346 -2427746 -2506331 -2585716 -2597660 -2625050 -2651420 -2626969 -2557701 -2508388 -2473131 -2437413 -2390884
$$ packed form
22424e581436N7006N5813L4602Q6143Q6625R0689O0246K5212M8949O5898N3891
22413d916362O1453O4183M6088N4763O7366K5608J4956o639J4224O1668M9150
22402d463542N2333J2468O5739O3875O7434L5496O0418O1548K6311k521O7750
22391c952691O9958L5024K9215j7606J6046N325M0917L8705N1023J8274P7054
22380c588756J03100Q4707M2334k381m5605J6211K6510J03692M4313N3172R365
22369c153338N8682P0464j5844L0795K6412J0644K6851K2598L0055M7791J7658
22358b827232N362J0786M9516M4568R733J8899O7354R5103J4350L6603M6832L80
22346b427746p8585p9385j1944k7390k6370K4451O9268M9313L5257L5718M6529
$$ plain form
22335 -2390884 -2359204 -2375643 -2342747 -2290806 -2220416 -2184494 -2158236 -2157850 -2176997 -2180527 -2201466 -2170458
22323 -2170458 -2153900 -2112909 -2019357 -1991890 -1969747 -1944086 -1942572 -1917196 -1894309 -1848278 -1843719 -1871631
22311 -1871631 -1885594 -1883284 -1872460 -1856462 -1826062 -1818677 -1818841 -1764112 -1699300 -1693966 -1657415 -1635018
22299 -1635018 -1633180 -1677575 -1676198 -1614707 -1596956 -1587603 -1519074 -1531623 -1530860 -1530786 -1542260 -1569571 -1541542
22286 -1541542 -1514277 -1519965 -1491683 -1450676 -1447815 -1473405 -1463821 -1459122 -1465943 -1444417 -1400597 -1365182
22274 -1365182 -1390638 -1390141 -1373038 -1367998 -1345844 -1319477 -1302091 -1299222 -1276380 -1192616 -1153825 -1126582
22262 -1126582 -1164875 -1198842 -1185800 -1153812 -1133263 -1128843 -1126664 -1087417 -1080045 -1065451 -1034668 -1018292
22250 -1018292 -1066368 -1063980 -1037280 -1007757 -1059947 -1103914 -1085200 -1114144 -1122663 -1047959 -971886 -947458
$$ packed form
22335b390884L1680j6439L2896N1941P0390L5922K6258L86j9147l530k0939L1008
22323b170458J6558M0991R3552K7467K2143K5661J514K5376K2887M6031M559k7912
22311a871631j3963K310J0824J5998L0400P385j64N4729O4812N334L6551K2397
22299a635018J838m4395J377O1491J7751R353O8529j2549P63P4j1474k7311K8029
22286a541542K7265n688K8282M1007K861k5590R584M699o821K1526M3820L5415
22274a365182k5456M97J7103N040K2154K6367J7386K869K2842Q3764L8791K7243
22262a126582l8293l3967J3042L1988K0549M420K179L9247P372J4594L0783J6376
22250a018292m8076K388K6700K9523n2190m3967J8714k8944q519P4704P6073K4428
$$ plain form
22238 -947458 -959861 -963039 -944567 -941878 -960609 -999834 -977679 -923249 -924834 -910557 -893191 -907371
22226 -907371 -963519 -946367 -897221 -861193 -856627 -792214 -752098 -771834 -756915 -749893 -749915 -765018
22214 -765018 -736779 -741775 -742940 -735471 -713328 -760343 -731775 -722773 -716670 -753625 -719158 -672464
22202 -672464 -649255 -604424 -602655 -634102 -601930 -586909 -630120 -639701 -637464 -597272 -594890 -613968
22190 -613968 -611740 -572265 -536668 -542024 -548305 -557388 -546786 -547741 -506114 -487855 -499007 -545685 -538963
22177 -538963 -514570 -542431 -557852 -477886 -432946 -411465 -419089 -451119 -504542 -495739 -477086 -459672
22165 -459672 -467148 -441266 -402558 -391955 -422162 -416645 -395121 -364396 -344714 -348898 -349436 -307790
22153 -307790 -315243 -335773 -333290 -318765 -304969 -290018 -282894 -296513 -303098 -288743 -289666 -296212 -294349
$$ packed form
22238i47458j2403l178J8472K689j8731l9225K2155N4430j585J4277J7366j4180
22226i07371n6148J7152M9146L6028M566O4413M0116j9736J4919P022k2j5103
22214g65018K8239m996j165P469K2143m7015K8568R002O103l6955L4467M6694
22202f72464K3209M4831J769l1447L2172J5021m3211r581K237M0192K382j9078
22190f13968K228L9475L5597n356o281r083J0602r55M1627J8259j1152m6678O722
22177e38963K4393k7861j5421P9966M4940K1481p624l2030n3423Q803J8653J7414
22165d59672p476K5882L8708J0603l0207N517K1524L0725J9682m184n38M1646
22153c07790p453k0530K483J4525J3796J4951P124j3619o585J4355r23o546J863
$$ plain form
22140 -294349 -244216 -240382 -253271 -247738 -264734 -290562 -291302 -299138 -275832 -245565 -204801 -119104
22128 -119104 -116249 -141429 -130422 -109907 -128294 -115800 -130973 -140894 -127016 -103987 -78353 -91670
22116 -91670 -74487 -78250 -58466 -21376 -35280 -60104 -107272 -63755 -10479 -18247 -743 10817
22104 10817 -9144 -10376 -6873 -13405 -34387 -51105 -41504 -27305 25475 66194 106270 73926
22092 73926 47218 6620 1064 7733 -6906 -3987 49936 72572 109948 152105 124812 57019
22080 57019 51099 71694 63923 82113 103723 91025 99575 144072 157593 164343 168824 141740 132930
22067 132930 173271 163748 143333 193637 209305 199315 147435 125667 179735 190744 143017 121307
22055 121307 111120 142178 148611 130473 143368 215033 250908 253357 263385 226310 223410 239065
$$ packed form
22140b94349N0133L834j2889N533j6996k5828p40p836K3306L0267M0764Q5697
22128a19104K855k5180J1007K0515j8387J2494j5173r921J3878K3029K5634j3317
22116i1670J7183l763J9784L7090j3904k4824m7168M3517N3276p768J7504J1560
22104A0817j9961j232L503o532k0982j6718R601J4199N2780M0719M0076l2344
22092G3926k6708m0598n556O669j4639K919N3923K2636L7376M2157k7293o7793
22080E7019n920K0595p771J8190K1610j2698Q550M4497J3521O750M481k7084q810
22067A32930M0341r523k0415N0304J5668r990n1880k1768N4068J1009m7727k1710
22055A21307j0187L1058O433j8138J2895P1665L5875K449J0028l7075k900J5655
$$ plain form
22043 239065 255760 191218 187441 215234 220404 208548 255040 273517 262958 307671 316178 323781
22031 323781 350348 358232 374165 348567 337271 336634 300276 305795 331129 349326 351730 353989 393610
22018 393610 408359 406877 391259 379183 381006 403469 399365 389153 400164 430865 449495 499774
22006 499774 537974 537362 551510 551693 567461 588647 591142 583624 578312 588377 619618 617028 615483
21993 615483 647969 697290 745412 792979 821275 825289 874873 907360 983545 1128043 1225100
21982 1225100 1293600 1215783 983044 628369 220992 -116303 -322804 -351519 -308722 -258992
21972 -258992 -179191 -137855 -147591 -86973 -21078 -30890 17244 84592 93162 87251 79312 118502
21960 118502 166405 223574 280991 284284 267220 267983 308875 337396 324235 314718 326831 327993
$$ packed form
22043B39065J6695o4542l777K7793N170j1856M6492J8477j0559M4713Q507P603
22031C23781K6567P884J5933k5598j1296o37l6358N519K5334J8197K404K259L9621
22018C93610J4749j482j5618j2076J823K2463m104j0212J1011L0701J8630N0279
22006D99774L8200o12J4148J83J5768K1186K495p518n312J0065L1241k590j545
21993F15483L2486M9321M8122M7567K8296M014M9584L2487P6185J44498R7057
21982A225100O8500p7817k32739l54675m07377l37295k06501k8715M2797M9730
21972b58992P9801M1336r736O0618O5895r812M8134O7348Q570n911p939L9190
21960A18502M7903N7169N7417L293j7064P63M0892K8521j3161r517J2113J162
$$ plain form
21948 327993 336366 390035 425529 420726 409473 404300 428129 454723 452077 424297 429360 462751
21936 462751 474008 433286 449513 408982 397907 440120 454137 445185 434710 434016 430100 447359
21924 447359 485854 513634 537581 532876 541215 530188 532526 559189 583050 575927 550878 504046
21912 504046 475528 475717 493686 471106 511264 520104 521536 564091 556031 536064 550842 534708
21900 534708 547788 562327 544750 531589 575394 636315 637360 655666 660759 625664 567632 563301
21888 563301 550820 585678 592583 587590 583536 540257 520470 547358 572368 590750 605657 606806
21876 606806 604026 609693 637769 633474 677523 677823 660830 657240 720584 766981 761313 712918 685778
21863 685778 726292 789479 745916 705425 718708 760773 772261 781747 744725 736707 777125 775847
$$ packed form
21948C27993Q373N3669L5494m803j1253n173K3829K6594k646k7780N063L3391
21936D62751J1257m0722J6227m0531j1075M2213J4017q952j0475o94l916J7259
21924D47359L8495K7780K3947m705Q339j1027K338K6663K3861p123k5049m6832
21912E04046k8518J89J7969k2580M0158Q840J432M2555q060j9967J4778j6134
21900E34708J3080J4539j7577j3161M3805O0921J045J8306N093l5095n8032m331
21888E63301j2481L4858O905m993m054m3279j9787K6888K5010J8382J4907J149
21876F06806k780N667K8076m295M4049L00j6993l590O3344M6397n668m8395k7140
21863F85778M0514O3187m3563m0491J3283M2065J1488R486l7022q018M0418j278
$$ plain form
21851 775847 753703 753660 738471 740831 751828 777306 785468 821861 787216 719851 738894 735924 739540
21838 739540 753480 745740 740225 722628 717031 756950 776772 788527 764949 731931 717251 763786
21826 763786 775098 739291 716283 690969 704655 696487 738971 765356 815641 831958 861213 855513
21814 855513 813876 833432 830943 820296 839348 804857 778659 762333 764610 776206 786281 823985
21802 823985 844805 860587 837074 816241 806466 814990 830881 785400 797979 863823 869468 896855
21790 896855 906417 897655 891354 908824 925226 903904 875538 866617 886863 908467 946810 997911
21778 997911 946269 898261 858266 884662 922429 965766 958974 912406 903535 914923 938251 943629
21766 943629 975681 976323 968538 945424 957740 938997 891266 873908 910669 950141 911846 933331
$$ packed form
21851G75847k2144m3j5189K360J0997K5478Q162L6393l4645o7365J9043k970L616
21838G39540J3940p740n515j7597n597L9919J9822J1755k3578l3018j4680M6535
21826G63786J1312l5807k3008k5314J3686q168M2484K6385N0285J6317K9255n700
21814H55513m1637J9556k489j0647J9052l4491k6198j6326K277J1596J0075L7704
21802H23985K0820J5782k3513k0833r775Q524J5891m5481J2579O5844N645K7387
21790H96855R562q762o301J7470J6402k1322k8366q921K0246K1604L8343N1101
21778I97911n1642m8008l9995K6396L7767M3337o792m6568q871J1388K3328N378
21766I43629L2052O42p785k3114J2316j8743m7731j7358L6761L9472l8295K1485
$$ plain form
21754 933331 943934 886401 909522 938931 951106 965234 962887 943357 947336 947464 967400 1005803
21742 1005803 1035462 1038720 1020390 979093 978949 1020368 1035128 1008126 1033764 999089 981509 984192
21730 984192 986243 980936 958061 979958 996216 994825 972305 964838 983179 1010043 975998 929092
21718 929092 912376 932005 919834 938728 961482 1019186 1076442 1102969 1142390 1143885 1077091 1073075
21706 1073075 1119232 1068134 1034559 1024085 1029756 1053573 1039082 1068238 1102865 1062108 1046817
21695 1046817 1075630 1041164 1057898 1087592 1098772 1102560 1091035 1074205 1039193 1049899 1033232
21684 1033232 1022137 1024403 1032525 1020319 1057454 1089430 1058213 1050763 1075897 1054338 1024436 1019852
21672 1019852 1015134 1048093 1058730 1093859 1135090 1132077 1091638 1058623 1094449 1111981 1142229 1151787
$$ packed form
21754I33331J0603n7533K3121K9409J2175J4128k347j9530L979J28J9936L8403
21742A005803K9659L258j8330m1297j44M1419J4760k7002K5638l4675j7580K683
21730I84192K051n307k2875K1897J6258j391k2520p467J8341K6864l4045m6906
21718I29092j6716J9629j2171J8894K2754N7704N7256K6527L9421J495o6794m016
21706A073075M6157n1098l3575j0474N671K3817j4491K9156L4627m0757j5291
21695A046817K8813l4466J6734K9694J1180L788j1525j6830l5012J0706j6667
21684A033232j1095K266Q122j2206L7135L1976l1217p450K5134k1559k9902m584
21672A019852m718L2959J0637L5129M1231l013m0439l3015L5826J7532L0248R558
$$ plain form
21660 1151787 1130637 1120010 1135878 1159896 1173418 1174923 1165813 1136951 1108870 1087465 1084404 1106474
21648 1106474 1107452 1135958 1157924 1171195 1179844 1159022 1155710 1112228 1115844 1151343 1127322 1074027
21636 1074027 1110208 1148278 1182190 1194386 1176553 1149659 1185302 1193742 1164632 1171184 1158973 1143943
21624 1143943 1132953 1173117 1175747 1140537 1118521 1129103 1167597 1156782 1186255 1208161 1227543
21613 1227543 1211365 1224891 1221560 1188315 1186100 1199247 1209156 1229395 1227323 1266663 1239681 1219424
21601 1219424 1230563 1227450 1230826 1261306 1262365 1240932 1215025 1227614 1243384 1269314 1256136 1245354
21589 1245354 1202775 1215033 1271796 1247691 1229183 1211869 1214075 1249013 1268600 1257668 1265831 1234538
21577 1234538 1219256 1194781 1188043 1175508 1158584 1176123 1169218 1164999 1152560 1170439 1180750 1183807
$$ packed form
21660A151787k1150j0627J5868K4018J3522J505r110k8862k8081k1405l061K2070
21648A106474R78K8506K1966J3271Q649k0822l312m3482L616L5499k4021n3295
21636A074027L6181L8070L3912J2196j7833k6894L5643Q440k9110O552j2211j5030
21624A143943j0990M0164K630l5210k2016J0582L8494j0815K9473K1906J9382
21613A227543j6178J3526l331l3245k215J3147R909K0239k072L9340k6982k0257
21601A219424J1139l113L376L0480J059k1433k5907J2589J5770K5930j3178j0782
21589A245354m2579J2258N6763k4105j8508j7314K206L4938J9587j0932Q163l1293
21577A234538j5282k4475o738j2535j6924J7539o905m219j2439J7879J0311L057
$$ plain form
21565 1183807 1227419 1290371 1331506 1347349 1302241 1280303 1269763 1273045 1276967 1272833 1315727 1328266
21553 1328266 1316105 1286398 1266424 1289408 1270476 1271986 1239357 1258717 1276282 1302205 1352516
21542 1352516 1373601 1361416 1405599 1423129 1409735 1390714 1412906 1408330 1384067 1404104 1384817
21531 1384817 1348084 1364068 1347462 1308859 1288002 1288714 1306334 1351884 1403818 1423767 1384929 1370968
21519 1370968 1336286 1377877 1412871 1416060 1409298 1408963 1381896 1352927 1328229 1367114 1383213 1388151
21507 1388151 1386875 1429696 1467420 1408129 1344672 1361581 1355422 1330300 1347994 1404250 1421372 1369090
21495 1369090 1351463 1389814 1390241 1386664 1452067 1479478 1455447 1436615 1459004 1421571 1341137 1330138
21483 1330138 1356064 1374460 1388429 1408737 1393269 1417353 1431319 1386105 1326372 1312522 1353456
$$ packed form
21565A183807M3612O2952M1135J5843m5108k1938j0540L282L922m134M2894J2539
21553A328266j2161k9707j9974K2984j8932J510l2629J9360J7565K5923N0311
21542A352516K1085j2185M4183J7530j3394j9021K2192m576k4263K0037j9287
21531A384817l6733J5984j6606l8603k0857P12J7620M5550N1934J9949l8838j3961
21519A370968l4682M1591L4994L189o762l35k7067k8969k4698L8885J6099M938
21507A388151j276M2821L7724n9291o3457J6909o159k5122J7694N6256J7122n2282
21495A369090j7627L8351M27l577O5403K7411k4031j8832K2389l7433q0434j0999
21483A330138K5926J8396J3969K0308j5468K4084J3966m5214n9733j3850M0934
$$ plain form
21472 1353456 1421905 1449327 1450856 1445247 1441645 1443753 1478797 1480554 1454867 1430321 1441901 1455194
21460 1455194 1438539 1456590 1500924 1517657 1529253 1496371 1464084 1499362 1513786 1461007 1439184
21449 1439184 1460840 1466330 1458846 1498085 1550531 1517553 1474927 1471823 1453716 1459642 1481259 1475679
21437 1475679 1474870 1480220 1496398 1487826 1507310 1533790 1553972 1524403 1500310 1524650 1561625 1566562
21425 1566562 1538412 1538881 1552767 1538135 1521413 1493500 1528146 1544804 1527512 1503082 1494008 1480776
21413 1480776 1538478 1548052 1519512 1504303 1544279 1609555 1602592 1558806 1565429 1569504 1555439 1512772
21401 1512772 1512611 1556638 1577542 1578996 1585809 1571002 1546558 1505322 1486972 1505293 1549425 1590018
21389 1590018 1624299 1648829 1589779 1538762 1544065 1541904 1521496 1542012 1541915 1551725 1528590 1505349
$$ packed form
21472A353456O8449K7422J529n609l602K108L5044J757k5687k4546J1580J3293
21460A455194j6655J8051M4334J6733J1596l2882l2287L5278J4424n2779k1823
21449A439184K1656N490p484L9239N2446l2978m2626l104j8107N926K1617n580
21437A475679q09N350J6178q572J9484K6480K0182k9569k4093K4340L6975M937
21425A566562k8150M69J3886j4632j6722k7913L4646J6658j7292k4430r074j3232
21413A480776N7702R574k8540j5209L9976O5276o963m3786O623M075j4065m2667
21401A512772j61M4027K0904J454O813j4807k4444m1236j8350J8321M4132M0593
21389A590018L4281K4530n9050n1017N303k161k0408K0516r7R810k3135k3241
$$ plain form
21377 1505349 1490364 1509520 1547390 1556455 1553076 1580744 1611269 1623145 1550977 1536735 1590496 1634495
21365 1634495 1613429 1601401 1584992 1545190 1545963 1556521 1548407 1583644 1610103 1585925 1594933 1663998
21353 1663998 1729482 1715231 1640926 1569799 1549132 1558289 1585753 1591817 1608763 1622145 1624084 1649815
21341 1649815 1637108 1625672 1637966 1651110 1630307 1637238 1615515 1599076 1605337 1598837 1613360 1657152
21329 1657152 1701977 1686184 1645179 1638454 1655027 1667301 1608437 1597075 1621946 1647716 1694744
21318 1694744 1696117 1644725 1618119 1615676 1672978 1672226 1666248 1693458 1686779 1659518 1625775 1640593
21306 1640593 1638479 1647644 1678824 1680451 1691877 1704030 1688330 1688576 1710283 1679899 1640353 1632990
21294 1632990 1607585 1621655 1636166 1622397 1678836 1734566 1719187 1678976 1673580 1691851 1679720
$$ packed form
21377A505349j4985J9156L7870R065l379K7668L0525J1876p2168j4242N3761M3999
21365A634495k1066j2028j6409l9802P73J0558q114L5237K6459k4178R008O9065
21353A663998O5484j4251p4305p1127k0667R157K7464O064J6946J3382J939K5731
21341A649815j2707j1436J2294J3144k0803O931k1723j6439O261o500J4523M3792
21329A657152M4825j5793m1005o725J6573J2274n8864j1362K4871K5770M7028
21318A694744J373n1392k6606k443N7302p52n978K7210o679k7261l3743J4818
21306A640593k114R165L1180J627J1426J2153j5700K46K1707l0384l9546p363
21294A632990k5405J4070J4511j3769N6439N5730j5379m0211n396J8271j2131
$$ plain form
21283 1679720 1679981 1695562 1652930 1669127 1709424 1714282 1675469 1694627 1721102 1694871 1648471 1644041
21271 1644041 1683249 1733450 1734046 1717612 1752357 1752077 1752855 1765142 1742262 1705576 1720509 1721121 1735478
21258 1735478 1711316 1678695 1696185 1718294 1706568 1704241 1748368 1736173 1682111 1665920 1690682
21247 1690682 1707654 1724613 1741018 1758297 1755280 1760532 1759859 1750689 1804877 1808409 1793324 1818964
21235 1818964 1819612 1811881 1786851 1793220 1803872 1807719 1788128 1727836 1748716 1785114 1768142 1751574
21223 1751574 1734762 1732994 1751313 1779874 1785246 1797794 1781047 1804638 1816318 1798252 1757153 1756520
21211 1756520 1768336 1773400 1806450 1812436 1801459 1776506 1767517 1744615 1744865 1769701 1765007 1794987
21199 1794987 1815702 1851825 1875629 1844916 1810025 1778672 1828456 1881071 1885075 1864017 1850173
$$ packed form
21283A679720K61J5581m2632J6197M0297M858l8813J9158K6475k6231m6400m430
21271A644041L9208N0201N96j6434L4745k80P78J2287k2880l6686J4933O12J4357
21258A735478k4162l2621J7490K2109j1726k327M4127j2195n4062j6191K4762
21247A690682J6972J6959J6405J7279l017N252o73r170N4188L532j5085K5640
21235A818964O48p731k5030O369J0652L847j9591o0292K0880L6398j6972j6568
21223A751574j6812j768J8319K8561N372J2548j6747K3591J1680j8066m1099o33
21211A756520J1816N064L3050N986j0977k4953q989k2902K50K4836m694K9980
21199A794987K0715L6123K3804l0713l4891l1353M9784N2615M004k1058j3844
$$ plain form
21188 1850173 1862136 1846525 1823843 1809198 1853673 1847780 1830636 1790680 1790782 1821426 1820734 1806433
21176 1806433 1843725 1824541 1834989 1872054 1892833 1891802 1870081 1819386 1796442 1812721 1878019
21165 1878019 1882035 1878851 1874380 1879074 1832850 1797466 1815961 1845348 1847097 1814891 1801222 1802213 1822425
21152 1822425 1900440 1914833 1848932 1867640 1919429 1919019 1897085 1887758 1914115 1938241 1925635 1907597
21140 1907597 1880940 1869504 1869281 1911185 1916924 1893146 1872092 1895876 1950915 1963171 1897774 1858189
21128 1858189 1865605 1892326 1904442 1894013 1875224 1864580 1864578 1833597 1853406 1904435 1926744 1958544
21116 1958544 1952655 1942953 1953756 1965739 2026119 2032987 1984578 1898006 1879269 1905225 1949817 2039945
21104 2039945 2018418 1978717 1994168 1964626 1929462 1956663 1972946 1963702 1960399 1949336 1990740 2019859
$$ packed form
21188A850173J1963j5611k2682j4645M4475n893j7144l9956J02L0644o92j4301
21176A806433L7292j9184J0448L7065K0779j031k1721n0695k2944J6279O5298
21165A878019M016l184m471M694m6224l5384J8495K9387J749l2206j3669R91K0212
21152A822425P8015J4393o5901J8708N1789m10k1934r327K6357K4126j2606j8038
21140A907597k6657j1436k23M1904N739k3778k1054K3784N5039J2256o5397l9585
21128A858189P416K6721J2116j0429j8789j0644kl0981J9809N1029K2309L1800
21116A958544n889r702J0803J1983O0380O868m8409q6572j8737K5956M4592R0128
21104B039945k1527l9701J5451k9542l5164K7201J6283r244l303j1063M1404K9119
$$ plain form
21092 2019859 2007843 1989366 2019770 1987645 1924902 1886020 1849613 1921875 1967832 1987079 1996777
21081 1996777 1964740 1979705 1980836 1957292 1936985 1955967 1977634 1976228 1933298 1958709 1991968 1993134
21069 1993134 1964991 1977409 2006540 2024150 2016628 2007207 2025320 2028134 2040227 2029552 2037737 1994178
21057 1994178 1977201 2021724 2043310 2027875 1977616 1971531 2010215 2063885 2108253 2106423 2069843 2010392
21045 2010392 2001075 2050573 2062268 2029771 1981776 2033080 2111957 2131667 2115852 2092500 2089950 2034483
21033 2034483 2033309 2068828 2073119 2092570 2101431 2114689 2103201 2075012 2040152 2044204 2059498 2095622
21021 2095622 2091990 2052946 2020739 2008870 1982799 1955209 2017792 2075531 2111558 2079764 2092459
21010 2092459 2142952 2154936 2134193 2132674 2098231 2111437 2114977 2128279 2166717 2126100 2049661 2045636
$$ packed form
21092B019859j2016j8477L0404l2125o2743l8882l6407P2262M5957J9247R698
21081A996777l2037J4965J131k3544k0307J8982K1667j406m2930K5411L3259J166
21069A993134k8143J2418K9131J7610p522r421J8113K814J2093j0675Q185m3559
21057A994178j6977M4523K1586j5435n0259o085L8684N3670M4368j830l6580n9451
21045B010392r317M9498J1695l2497m7995N1304P8877J9710j5815k3352k550n5467
21033B034483j174L5519M291J9451Q861J3258j1488k8189l4860M052J5294L6124
21021B095622l632l9044l2207j1869k6071k7590O2583N7739L6027l1794J2695
21010B092459N0493J1984k0743j519l4443J3206L540J3302L8438m0617p6439m025
$$ plain form
20998 2045636 2069219 2077641 2104319 2137360 2135937 2087707 2051528 2046268 2094349 2152769 2155002 2120922
20986 2120922 2132174 2142285 2136944 2142461 2124494 2127798 2109490 2093051 2124070 2130698 2124131 2113592
20974 2113592 2117553 2146116 2152583 2137312 2154880 2151012 2142182 2158317 2152188 2122775 2108063 2147664
20962 2147664 2198541 2187237 2174173 2122960 2107015 2116192 2138858 2134061 2140303 2155884 2183557 2207483
20950 2207483 2202853 2194530 2197969 2207765 2215085 2224154 2219027 2215108 2215820 2216279 2199027 2234843 2232830 2249933
20936 2249933 2260997 2248882 2218828 2212583 2186648 2198583 2216299 2201810 2178565 2174580 2195253 2183434
20924 2183434 2141214 2141686 2147973 2142777 2137249 2199696 2245106 2264681 2278346 2277243 2281545 2305346 2294636
20911 2294636 2298836 2275932 2234768 2245631 2274518 2239504 2223076 2248565 2250894 2255832 2271648 2298793
$$ packed form
20998B045636K3583Q422K6678L3041j423m8230l6179n260M8081N8420K233l4080
20986B120922J1252J0111n341N517j7967L304j8308j6439L1019O628o567j0539
20974B113592L961K8563O467j5271J7568l868q830J6135o129k9413j4712L9601
20962B147664N0877j1304j3064n1213j5945R177K2666m797O242J5581K7673K3926
20950B207483m630q323L439R796P320R069n127l919P12M59j7252L5816k013J7103
20936B249933J1064j2115l0054o245k5935J1935J7716j4489k3245l985K0673j1819
20924B183434m2220M72O287n196n528O2447M5410J9575J3665j103M302K3801j0710
20911B294636M200k2904m1164J0863K8887l5014j6428K5489K329M938J5816K7145
$$ plain form
20899 2298793 2295551 2298070 2303313 2287211 2261888 2287512 2245496 2207015 2192001 2200219 2218331 2243006
20887 2243006 2268504 2301218 2312736 2316926 2284715 2299037 2304034 2278805 2310049 2341046 2355839 2364274
20875 2364274 2380313 2357439 2330349 2324181 2306535 2281765 2309129 2331278 2347954 2332770 2331933 2319842
20863 2319842 2311037 2334310 2375737 2376882 2378928 2380927 2366267 2370878 2351126 2369929 2356253 2326273
20851 2326273 2316896 2353253 2381383 2368957 2373991 2375497 2376151 2401410 2407802 2424543 2394311 2321833
20839 2321833 2317399 2369087 2384526 2363039 2348385 2367856 2368084 2376866 2431720 2448235 2427814 2403952
20827 2403952 2421890 2427720 2432524 2420947 2437878 2456581 2464175 2475403 2474076 2480947 2491693 2475357
20815 2475357 2480666 2493312 2523063 2545660 2548536 2541355 2503695 2486547 2490081 2503290 2461309 2412037
$$ packed form
20899B298793l242K519N243j6102k5323K5624m2016l8481j5014Q218J8112K4675
20887B243006K5498L2714J1518M190l2211J4322M997k5229L1244L0997J4793Q435
20875B364274J6039k2874k7090o168j7646k4770K7364K2149J6676j5184q37j2091
20863B319842q805K3273M1427J145K046J999j4660M611j9752J8803j3676k9980
20851B326273r377L6357K8130j2426N034J506O54K5259O392J6741l0232p2478
20839B321833m434N1688J5439k1487j4654J9471K28Q782N4854J6515k0421k3862
20827B403952J7938N830M804j1577J6931J8703P594J1228j327O871J0746j6336
20815B475357N309J2646K9751K2597K876p181l7660j7148L534J3209m1981m9272
$$ plain form
20803 2412037 2373820 2394320 2446824 2483105 2485707 2466286 2455951 2438267 2449252 2466998 2448764
20792 2448764 2463795 2479724 2463009 2444583 2440265 2487362 2492366 2513757 2542763 2539183 2496551 2456176
20780 2456176 2450833 2458917 2475182 2467008 2476516 2468942 2504258 2486215 2517035 2547650 2530350 2529351 2518511
20767 2518511 2473805 2490033 2509953 2559343 2564770 2528127 2528632 2573739 2558881 2553624 2558011 2558555 2594145
20754 2594145 2577679 2560166 2582044 2591640 2567907 2582328 2566546 2554056 2572451 2607595 2601665 2533220
20742 2533220 2517937 2551848 2579220 2543469 2544778 2553309 2580988 2581231 2571574 2581436 2592833 2639881
20730 2639881 2667886 2643710 2604014 2585375 2597529 2567432 2571812 2566689 2599867 2614444 2621997 2601743
20718 2601743 2586311 2585375 2609138 2612995 2627001 2654349 2621231 2569826 2563457 2625847 2595793 2558902
$$ packed form
20803B412037l8217K0500N2504L6281K602j9421j0335j7684J0985J7746j8234
20792B448764J5031J5929j6715j8426m318M7097N004K1391K9006l580m2632m0375
20780B456176n343Q084J6265q174R508p574L5316j8043L0820L0615j7300r99j0840
20767B518511m4706J6228J9920M9390N427l6643N05M5107j4858n257M387N44L5590
20754B594145j6466j7513K1878R596k3733J4421j5782j2490J8395L5144n930o8445
20742B533220j5283L3911K7372l5751J309Q531K7679K43r657R862J1397M7048
20730B639881K8005k4176l9696j8639J2154l0097M380n123L3178J4577P553k0254
20718B601743j5432r36K3763L857J4006K7348l3118n1405o369O2390l0054l6891
$$ plain form
20706 2558902 2569738 2593930 2627210 2634690 2645881 2633005 2605018 2575954 2576528 2596552 2620191 2633597
20694 2633597 2603879 2594871 2625591 2624741 2626673 2630665 2638196 2655198 2643544 2608299 2618274 2642794 2665736
20681 2665736 2647422 2636733 2639062 2630771 2637633 2629525 2632760 2597387 2578040 2598184 2611224 2632180
20669 2632180 2639381 2653313 2672196 2676728 2680716 2706284 2729142 2739080 2742104 2729829 2670049 2648501
20657 2648501 2680211 2713664 2724491 2736905 2723506 2744908 2782712 2749114 2735918 2720975 2739726
20646 2739726 2750584 2708937 2700994 2743549 2735799 2731375 2740907 2751631 2732986 2728467 2702400 2674205
20634 2674205 2691840 2726551 2738681 2735309 2769705 2795414 2758653 2733818 2731122 2720607 2725816 2741576
20622 2741576 2766981 2788787 2765219 2766236 2777112 2779709 2762107 2779456 2796852 2787721 2813383 2844709
$$ packed form
20706B558902J0836K4192L3280P480J1191j2876k7987k9064N74K0024K3639J3406
20694B633597k9718r008L0720q50J932L992P531J7002j1654l5245R975K4520K2942
20681B665736j8314j0689K329q291O862q108L235l5373j9347K0144J3040K0956
20669B632180P201J3932J8883M532L988K5568K2858R938L024j2275n9780k1548
20657B648501L1710L3453J0827J2414j3399K1402L7804l3598j3196j4943J8751
20646B739726J0858m1647p943M2555p750m424R532J0724j8645m519k6067k8195
20634B674205J7635L4711J2130l372L4396K5709l6761k4835k696j0515N209J5760
20622B741576K5405K1806k3568J017J0876K597j7602J7349J7396r131K5662L1326
$$ plain form
20610 2844709 2861387 2812709 2721967 2730519 2759534 2788756 2809550 2804684 2815004 2815033 2807235 2840289
20598 2840289 2858989 2830817 2802506 2817015 2845412 2860257 2848474 2854264 2865201 2860287 2854799 2842360
20586 2842360 2862459 2878846 2861117 2875483 2904118 2880394 2861975 2915445 2911988 2860587 2859803 2874598
20574 2874598 2877183 2859983 2890417 2889051 2934101 2947844 2947156 2918361 2898540 2874080 2891911 2965565
20562 2965565 2988674 2942083 2884337 2901294 2904979 2945555 2934442 2942956 2943413 2952730 2927258 2918633
20550 2918633 2908802 2964069 2956983 2943272 2974908 2960025 2953368 2957220 3000049 3014030 2963257 2975091
20538 2975091 3008047 2992379 2976314 2983658 2979342 2950860 2974704 3014367 3079783 3040902 3000921 3006825
20526 3006825 2994018 2961027 2983959 2988408 2978426 2979497 2963179 2960570 2975414 2975679 2973999 2950274 2972982
$$ packed form
20610B844709J6678m8678r0742Q552K9015K9222K0794m866J0320K9p798L3054
20598B840289J8700k8172k8311J4509K8397J4845j1783N790J0937m914n488j2439
20586B842360K0099J6387j7729J4366K8635k3724j8419N3470l457n1401p84J4795
20574B874598K585j7200L0434j366M5050J3743o88k8795j9821k4460J7831P3654
20562B965565K3109m6591n7746J6957L685M0576j1113Q514M57R317k5472q625
20550B918633r831N5267p086j3711L1636j4883o657L852M2829J3981n0773J1834
20538B975091L2956j5668j6065P344m316k8482K3844L9663O5416l8881l9981N904
20526C006825j2807l2991K2932M449r982J071j6318k609J4844K65j680k3725K2708
$$ plain form
20513 2972982 2956430 2939804 2991089 3070375 3050808 3033998 3028520 3042459 3031698 3065124 3098810
20502 3098810 3070496 3056290 3092786 3112751 3118979 3103473 3049387 3033859 3082444 3086796 3041235 3032978
20490 3032978 3039734 3050643 3086275 3113291 3093073 3109417 3102670 3075393 3081719 3117200 3141740 3123874
20478 3123874 3130089 3153322 3163081 3109909 3116505 3157092 3159693 3151242 3088111 3061486 3110665 3136114
20466 3136114 3131937 3122900 3144415 3154502 3101765 3070469 3036304 3069673 3111677 3072079 3098456 3098560
20454 3098560 3117092 3184842 3174081 3134025 3131679 3177783 3218564 3209715 3204179 3224587 3237038 3183415
20442 3183415 3172135 3148645 3181181 3193090 3191726 3175865 3213451 3218660 3187684 3223976 3197565 3186408
20430 3186408 3226771 3293454 3300454 3273135 3249947 3250115 3239506 3195152 3185722 3190339 3232679 3238891
$$ packed form
20513B972982j6552j6626N1285P9286j9567j6810n478J3939j0761L3426L3686
20502C098810k8314j4206L6496J9965O228j5506n4086j5528M8585M352m5561q257
20490C032978O756J0909L5632K7016k0218J6344o747k7277O326L5481K4540j7866
20478C123874O215K3233R759n3172O596M0587K601q451o3131k6625M9179K5449
20466C136114m177r037K1515J0087n2737l1296l4165L3369M2004l9598K6377J04
20454C098560J8532O7750j0761m0056k346M6104M0781q849n536K0408J2451n3623
20442C183415j1280k3490L2536J1909j364j5861L7586N209l0976L6292k6411j1157
20430C186408M0363O6683P000k7319k3188J68j0609m4354r430M617M2340O212
$$ plain form
20418 3238891 3227111 3231431 3238322 3235090 3209052 3230124 3291659 3299223 3240543 3236383 3253641 3260878
20406 3260878 3239852 3273389 3324140 3321243 3302539 3287737 3299546 3308379 3306120 3349834 3371219 3360325
20394 3360325 3316926 3320786 3326140 3335332 3347741 3329696 3287644 3325237 3328423 3347489 3351701 3335015
20382 3335015 3355639 3345912 3365142 3357978 3346905 3375564 3404024 3418178 3386608 3397965 3405989 3391113
20370 3391113 3367162 3340434 3346921 3368187 3398638 3396982 3391078 3387770 3382865 3379888 3398205 3426530
20358 3426530 3404146 3395759 3397234 3378910 3414764 3441199 3434586 3414268 3421622 3432747 3420255 3403488
20346 3403488 3417258 3420173 3407108 3407745 3419468 3472850 3546181 3568615 3537698 3506860 3500698 3477139
20334 3477139 3497611 3475277 3431169 3421856 3447931 3444768 3449361 3468989 3452145 3454888 3493505 3513259
$$ packed form
20418C238891j1780M320O891l232k6038K1072O1535P564n8680m160J7258P237
20406C260878k1026L3537N0751k897j8704j4802J1809Q833k259M3714K1385j0894
20394C360325m3399L860N354R192J2409j8045m2052L7593L186J9066M212j6686
20382C335015K0624r727J9230p164j1073K8659K8460J4154l1570J1357Q024j4876
20370C391113k3951k6728O487K1266L0451j656n904l308m905k977J8317K8325
20358C426530k2384q387J475j8324L5854K6435o613k0318P354J1125j2492j6767
20346C403488J3770K915j3065O37J1723N3382P3331K2434l0917l0838o162k3559
20334C477139K0472k2334m4108r313K6075l163M593J9628j6844K743L8617J9754
$$ plain form
20322 3513259 3493989 3469094 3467942 3496882 3529303 3522769 3525649 3521706 3530742 3554342 3597346 3606670
20310 3606670 3585476 3542430 3536636 3580317 3629918 3629976 3642329 3650373 3651573 3628344 3578105 3542906
20298 3542906 3588505 3632108 3621861 3579296 3572178 3567545 3570519 3609071 3602125 3622121 3661392 3650779
20286 3650779 3610940 3600520 3592585 3651199 3693926 3671561 3654465 3641629 3621430 3657444 3680475
20275 3680475 3686325 3687551 3716369 3727680 3698693 3653059 3574823 3559661 3605127 3626663 3652531 3672884
20263 3672884 3696648 3656000 3657710 3683014 3678875 3701624 3690406 3692928 3714193 3691543 3654095 3664770
20251 3664770 3705111 3705195 3709307 3743055 3728978 3739623 3761661 3805587 3795658 3819481 3845789 3834485
20239 3834485 3810464 3847035 3818287 3782855 3803857 3812860 3778376 3742572 3764833 3767664 3792799 3822703
$$ packed form
20322C513259j9270k4895j152K8940L2421o534K880l943R036K3600M3004R324
20310C606670k1194m3046n794M3681M9601N8J2353Q044J200k3229n0239l5199
20298C542906M5599M3603j0247m2565p118m633K974L8552o946J9996L9271j0613
20286C650779l9839j0420p935N8614M2727k2365j7096j2836k0199L6014K3031
20275C680475N850J226K8818J1311k8987m5634p8236j5162M5466K1536K5868K0353
20263C672884K3764m0648J710K5304m139K2749j1218K522K1265k2650l7448J0675
20251C664770M0341Q4M112L3748j4077J0645K2038M3926r929K3823K6308j1304
20239C834485k4021L6571k8748l5432K1002R003l4484l5804K2261K831K5135K9904
$$ plain form
20227 3822703 3824749 3840628 3839564 3826851 3846976 3849792 3875298 3876276 3828148 3809606 3844598 3868985
20215 3868985 3867471 3856521 3859417 3840471 3856916 3880573 3871744 3858191 3854343 3903687 3937238 3950219
20203 3950219 3939938 3911362 3877294 3895602 3958428 3989397 4005247 3991779 3948871 3956481 3961807 3932770
20191 3932770 3900155 3907366 3901013 3946705 4000150 3997327 3963872 3949969 3965029 4005836 4012376 4004630
20179 4004630 4005517 3984296 4036727 4047595 4040309 4074645 4093410 4116561 4093389 4088663 4090290 4072202
20167 4072202 4067150 4092732 4051647 4010302 4031749 4020773 4047387 4019633 4006544 4057902 4086305
20156 4086305 4063851 4036041 4033439 4034436 4038966 4083017 4117725 4120147 4116193 4118696 4121342 4177217 4184161
20143 4184161 4180104 4175583 4137195 4137945 4129215 4115200 4129820 4142358 4158001 4161460 4188286 4199318
$$ packed form
20227C822703K046J5879j064j2713K0125K816K5506R78m8128j8542L4992K4387
20215C868985j514j0950K896j8946J6445K3657q829j3553l848M9344L3551J2981
20203C950219j0281k8576l4068J8308O2826L0969J5850j3468m2908P610N326k9037
20191C932770l2615P211o353M5692N3445k823l3455j3903J5060M0807O540p746
20179D004630Q87k1221N2431J0868p286L4336J8765K3151k3172m726J627j8088
20167D072202n052K5582m1085m1345K1447j0976K6614k7754j3089N1358K8403
20156D086305k2454k7810k602R97M530M4051L4708K422l954K503K646N5875O944
20143D184161m057m521l8388P50q730j4015J4620J2538J5643L459K6826J1032
$$ plain form
20131 4199318 4193390 4228889 4260709 4266238 4272150 4281174 4263386 4234847 4228629 4260908 4280851 4269184
20119 4269184 4271367 4246752 4245807 4225505 4238682 4218296 4211528 4219849 4237706 4261822 4258821 4269829
20107 4269829 4282977 4312570 4308043 4370453 4341220 4344448 4353355 4335204 4328439 4357590 4363164 4331610
20095 4331610 4349493 4364809 4369650 4379094 4392953 4393982 4409236 4464715 4434111 4432144 4405770 4397315
20083 4397315 4430366 4418886 4423749 4475470 4504184 4499574 4485980 4472758 4429184 4409693 4429441 4453207
20071 4453207 4447678 4453589 4433798 4394200 4456083 4535801 4535295 4480161 4448693 4448480 4480106 4521745
20059 4521745 4545832 4523347 4463504 4480820 4531164 4555498 4557075 4552084 4555733 4555682 4555941 4557837 4593737
20046 4593737 4594391 4605194 4642046 4635334 4627656 4647384 4674659 4668826 4651667 4650243 4691701 4690637 4625190
$$ packed form
20131D199318n928L5499L1820N529N912R024j7788k8539o218L2279J9943j1667
20119D269184K183k4615r45k0302J3177k0386o768Q321J7857K4116l001J1008
20107D269829J3148K9593m527O2410k9233L228Q907j8151o765K9151N574l1554
20095D331610J7883J5316M841R444J3859J029J5254N5479l0604j967k6374q455
20083D397315L3051j1480M863N1721K8714m610j3594j3222m3574j9491J9748K3766
20071D453207n529N911j9791l9598O1883P9718n06n5134l1468k13L1626M1639
20059D521745K4087k2485n9843J7316N0344K4334J577m991L649n1K59J896L5900
20046D593737O54J0803L6852o712p678J9728K7275n833j7159j424M1458j064o5447
$$ plain form
20033 4625190 4638308 4679737 4676272 4672561 4692443 4681683 4699110 4689242 4660224 4648857 4642680 4660282
20021 4660282 4692631 4714824 4721495 4691410 4721447 4761567 4756147 4755231 4802023 4808336 4812859 4827537
20009 4827537 4847544 4847832 4853527 4894176 4908834 4869668 4855773 4857011 4865062 4887821 4913945 4897534
19997 4897534 4873904 4889547 4882452 4891305 4965586 4997129 4985273 4966686 4961127 4950633 4922768 4940716
19985 4940716 4998381 5022566 5047280 5081443 5097601 5056051 5050037 5101608 5138909 5134888 5147131 5155591
19973 5155591 5127135 5146732 5213379 5198715 5206494 5239855 5270367 5277639 5292880 5283572 5295565 5335274
19961 5335274 5359830 5330784 5344219 5328922 5295661 5254603 5232943 5194347 5227134 5280896 5322458
19950 5322458 5376098 5343383 5304984 5206493 5130049 5073882 5024602 4996350 4993224 5007842 5028766
$$ packed form
20033D625190J3118M1429l465l711J9882j0760J7427r868k9018j1367o177J7602
20021D660282L2349K2193O671l0085L0037M0120n420r16M6792O313M523J4678
20009D827537K0007K88N695M0649J4658l9166j3895J238Q051K2759K6124j6411
19997D897534k3630J5643p095Q853P4281L1543j1856j8587n559j0494k7865J7948
19985D940716N7665K4185K4714L4163J6158m1550o014N1571L7301m021J2243Q460
19973E155591k8456J9597O6647j4664P779L3361L0512P272J5241r308J1993L9709
19961E335274K4556k9046J3435j5297l3261m1058k1660l8596L2787N3762M1562
19950E322458N3640l2715l8399r8491p6444n6167m9280k8252l126J4618K0924
$$ plain form
19939 5028766 5097352 5131533 5036882 4964674 4967217 4922962 4881211 4857315 4817947 4827298 4862353 4911540
19927 4911540 4974657 5026360 5037150 5050016 5078796 5142292 5181363 5137111 5133942 5162615 5209697
19916 5209697 5206381 5209192 5219705 5258999 5267771 5275063 5297856 5337652 5381381 5366942 5314617 5305075
19904 5305075 5317562 5356211 5372534 5375927 5401009 5397453 5371287 5373889 5394703 5416528 5412686 5413586
19892 5413586 5390359 5393040 5435872 5422220 5397724 5427979 5477926 5490451 5447515 5440813 5447988 5480491
19880 5480491 5501187 5545367 5559838 5521233 5520533 5514096 5520149 5549379 5541234 5572925 5601317 5601276 5586362
19867 5586362 5598723 5655917 5677375 5675160 5688687 5744418 5718749 5728446 5743124 5726882 5686697 5700800
19855 5700800 5707417 5706532 5718600 5741951 5726891 5700691 5676523 5690839 5699663 5714378 5721029 5738209
$$ packed form
19939E028766O8586L4181r4651p2208K543m4255m1751k3896l9368R351L5055M9187
19927D911540O3117N1703J0790J2866K8780O3496L9071m4252l169K8673M7082
19916E209697l316K811J0513L9294Q772P292K2793L9796M3729j4439n2325r542
19904E305075J2487L8649J6323L393K5082l556k6166K602K0814K1825l842R00
19892E413586k3227K681M2832j3652k4496L0255M9947J2525m2936o702P175L2503
19880E480491K0696M4180J4471l8605p00o437O053K9230q145L1691K8392m1j4914
19867E586362J2361N7194K1458k215J3527N5731k5669R697J4678j6242m0185J4103
19855E700800O617q85J2068K3351j5060k6200k4168J4316Q824J4715O651J7180
$$ plain form
19843 5738209 5745681 5742473 5757059 5777295 5792867 5822182 5845123 5849208 5863019 5902282 5938583 5966637
19831 5966637 5996229 5994618 6003442 5976562 5992281 5960813 5961461 6001067 5985236 5978694 6032506 6044907
19819 6044907 6023029 5989901 6012845 6077252 6099715 6115714 6135854 6153211 6132692 6141182 6161310
19808 6161310 6193817 6214571 6229731 6241723 6214567 6219158 6224382 6241055 6244501 6243881 6262790 6261220
19796 6261220 6280190 6275200 6257959 6265254 6333232 6394855 6407961 6436812 6352088 6321356 6334835 6355107
19784 6355107 6405095 6456658 6482795 6466431 6468467 6488165 6503823 6505760 6516664 6547400 6586115 6586940
19772 6586940 6541130 6546248 6573844 6568136 6583203 6616186 6675273 6681662 6683749 6708351 6723916 6751983
19760 6751983 6755427 6782985 6796864 6814822 6799894 6716981 6685820 6720101 6745185 6741808 6781068 6820310
$$ packed form
19843E738209P472l208J4586K0236J5572K9315K2941M085J3811L9263L6301K8054
19831E966637K9592j611Q824k6880J5719l1468O48L9606j5831o542N3812J2401
19819F044907k1878l3128K2944O4407K2463J5999K0140J7357k0519Q490K0128
19808F161310L2507K0754J5160J1992k7156M591N224J6673L446o20J8909j570
19796F261220J8970m990j7241P295O7978O1623J3106K8851q4724l0732J3479K0272
19784F355107M9988N1563K6137j6364K036J9698J5658J937J0904L0736L8715Q25
19772F586940m5810N118K7596n708J5067L2983N9087O389K087K4602J5565K8067
19760F751983L444K7558J3879J7958j4928q2913l1161L4281K5084l377L9260L9242
$$ plain form
19748 6820310 6839195 6869584 6889020 6903404 6931239 6911852 6926107 6963295 6967168 6992814 7054183
19737 7054183 7085555 7115464 7078711 7071305 7060476 7035462 7027866 7092102 7045773 7054588 7096221 7163562
19725 7163562 7197831 7205378 7232910 7276503 7289314 7331712 7379594 7450071 7437423 7438068 7474978 7450504
19713 7450504 7461355 7457337 7472309 7453572 7425289 7469069 7510017 7556259 7586221 7653836 7651441 7613528
19701 7613528 7583063 7609886 7642590 7649377 7680986 7710171 7721639 7738422 7743024 7715315 7741320 7764622
19689 7764622 7753275 7786045 7803062 7818167 7875674 7889884 7899277 7915778 7933964 7963152 8002665
19678 8002665 8009908 7986549 7976943 8032188 8055794 8071342 8073247 8117928 8188719 8244141 8251419 8273227
19666 8273227 8266441 8262991 8250049 8284744 8320493 8351761 8365221 8443397 8461242 8419734 8373913 8409119
$$ packed form
19748F820310J8885L0389J9436J4384K7835j9387J4255L7188L873K5646O1369
19737G054183L1372K9909l6753p406j0829k5014p596O4236m6329Q815M1633O7341
19725G163562L4269P547K7532M3593J2811M2398M7882P0477j2648O45L6910k4474
19713G450504J0851m018J4972j8737k8283M3780M0948M6242K9962O7615k395l7913
19701G613528l0465K6823L2704O787L1609K9185J1468J6783M602k7709K6005K3302
19689G764622j1347L2770J7017J5105N7507J4210R393J6501J8186K9188L9513
19678H002665P243k3359r606N5245K3606J5548J905M4681P0791N5422P278K1808
19666H273227o786l450j2942L4695L5749L1268J3460P8176J7845m1508m5821L5206
$$ plain form
19654 8409119 8498996 8574845 8610809 8600554 8640038 8668667 8714636 8760591 8799304 8777410 8776588 8781630
19642 8781630 8806450 8833721 8854798 8867215 8885087 8904503 8956991 9019293 9095533 9157319 9172627
19631 9172627 9169678 9193607 9233864 9257576 9274675 9299380 9336021 9387144 9445524 9502539 9583246
19620 9583246 9619389 9655790 9702269 9726322 9785574 9815213 9806529 9809897 9858940 9920954 9953953 10001879
19608 10001879 10003729 10042589 10103324 10162854 10260400 10297376 10295491 10292119 10270015 10263743 10323004 10430427
19596 10430427 10475917 10504046 10513723 10519684 10554598 10601802 10619029 10618994 10626080 10634624 10662663 10734762
19584 10734762 10827284 10875245 10885822 10933710 10969681 10964942 10994896 11098649 11168473 11230826 11295699
19573 11295699 11349690 11410763 11448875 11494753 11602174 11674751 11746884 11800735 11866332 11933475 11963634
$$ packed form
19654H409119Q9877P5849L5964j0255L9484K8629M5969M5955L8713k1894q22N042
19642H781630K4820K7271K1077J2417J7872J9416N2488O2302P6240O1786J5308
19631I172627k949K3929M0257K3712J7099K4705L6641N1123N8380N7015Q0707
19620I583246L6143L6401M6479K4053N9252K9639q684L368M9043O2014L2999M7926
19608A0001879J850L8860O0735N9530R7546L6976j885l372k2104o272N9261J07423
19596A0430427M5490K8129R677N961L4914M7204J7227l5P086Q544K8039P2099
19584A0734762R2522M7961J0577M7888L5971m739K9954J03753O9824O2353O4873
19573A1295699N3991O1073L8112M5878J07421P2577P2133N3851O5597O7143L0159
$$ plain form
19562 11963634 12052302 12172378 12233284 12317902 12425254 12489324 12553160 12625384 12722568 12779947 12805859
19551 12805859 12838455 12901871 12981499 13051166 13118167 13199350 13299965 13340545 13389859 13480612 13568412
19540 13568412 13627883 13648665 13682783 13810624 13947585 14068551 14190465 14280719 14359499 14438386
19530 14438386 14507744 14620087 14722565 14896914 15044869 15172917 15274892 15445029 15586370
19521 15586370 15752614 15939208 16100457 16314061 16479369 16594445 16769275 16964555 17123692
19512 17123692 17264300 17435384 17667395 17902577 18087439 18278866 18467173 18682247 18912595
19503 18912595 19166118 19464672 19790798 20024261 20287148 20591000 20895787 21196998 21551035
19494 21551035 21877321 22201906 22532111 22924247 23367485 23794505 24203570 24705038 25165028
$$ packed form
19562A1963634Q8668J20076O0906Q4618J07352O4070O3836P2224R7184N7379K5912
19551A2805859L2596O3416P9628O9667O7001Q1183J00615M0580M9314R0753Q7800
19540A3568412N9471K0782L4118J27841J36961J20966J21914R0254P8780P8887
19530A4438386O9358J12343J02478J74349J47955J28048J01975J70137J41341
19521A5586370J66244J86594J61249K13604J65308J15076J74830J95280J59137
19512A7123692J40608J71084K32011K35182J84862J91427J88307K15074K30348
19503A8912595K53523K98554L26126K33463K62887L03852L04787L01211L54037
19494B1551035L26286L24585L30205L92136M43238M27020M09065N01468M59990
$$ plain form
19485 25165028 25716943 26244743 26779471 27395081 28085514 28786026 29584566 30427398 31253668
19476 31253668 32062687 32881761 33626504 34361590 35253262 36318980 37607233 39030250 40693843
19467 40693843 42547419 44577209 46945961 49674787 52751128 56372485 60702063 65872495
19459 65872495 71181693 73794860 70352668 63437033 57199848 50594276 42572722 36548366
19451 36548366 35613008 40605858 49819664 57852709 59474898 55290709 45545052 28687752
19443 28687752 8873246 -9006347 -24279787 -34834144 -37801742 -34066713 -25611939
19436 -25611939 -16930153 -14603736 -19960443 -26998098 -33881352 -42973193 -52940360 -59749628
19428 -59749628 -61796949 -59351598 -54661715 -49867335 -45661013 -41949683 -38686051 -35895945
$$ packed form
19485B5165028N51915N27800N34728O15610O90433P00512P98540Q42832Q26270
19476C1253668Q09019Q19074P44743P35086Q91672J065718J288253J423017J663593
19467D0693843J853576K029790K368752K728826L076341L621357M329578N170432
19459F5872495N309198K613167l442192o915635o237185o605572q021554o024356
19451C6548366r35358M992850R213806Q033045J622189m184189r745657j6857300
19443B8687752j9814506j7879593j5273440j0554357k967598L735029Q454774
19436b5611939Q681786K326417n356707p037655o883254r091841r967167o809268
19428e9749628k047321K445351M689883M794380M206322L711330L263632K790106
$$ plain form
19420 -35895945 -33549188 -31585839 -29856577 -28238118 -26831160 -25620341 -24463661 -23288793
19412 -23288793 -22154640 -21167835 -20329983 -19467543 -18595245 -17789716 -16990929 -16245625 -15585668
19403 -15585668 -15000068 -14370275 -13721057 -13145961 -12568518 -12055795 -11611262 -11192049 -10758106
19394 -10758106 -10292926 -9851141 -9456041 -9104769 -8750366 -8410290 -8079816 -7693617 -7386026
19385 -7386026 -7129387 -6847985 -6575223 -6335430 -6096834 -5880960 -5614313 -5362180 -5115901
19376 -5115901 -4982262 -4778501 -4556409 -4382805 -4175282 -3959458 -3719838 -3552303 -3395361
19367 -3395361 -3253761 -3095628 -2954619 -2841091 -2730742 -2562482 -2364764 -2186128 -2047333
19358 -2047333 -1929021 -1802614 -1659221 -1547764 -1517391 -1396733 -1208934 -1118920 -1029901 -944036
$$ packed form
19420c5895945K346757J963349J729262J618459J406958J210819J156680J174868
19412b3288793J134153R86805Q37852Q62440Q72298Q05529P98787P45304O59957
19403a5585668N85600O29793O49218N75096N77443N12723M44533M19213M33943
19394a0758106M65180M41785L95100L51272L54403L40076L30474L86199L07591
19385g386026K56639K81402K72762K39793K38596K15874K66647K52133K46279
19376e115901J33639K03761K22092J73604K07523K15824K39620J67535J56942
19367c395361J41600J58133J41009J13528J10349J68260J97718J78636J38795
19358b047333J18312J26407J43393J11457L0373J20658J87799R0014Q9019Q5865
$$ plain form
19348 -944036 -803147 -641372 -503771 -400492 -308405 -198065 -109671 -57427 70083 198986
19338 198986 326908 428212 498387 625779 742929 784177 827525 908359 1013908 1112005
19328 1112005 1182193 1281843 1391818 1425856 1516917 1589547 1690021 1780480 1839462 1864349 1912039
19317 1912039 2007624 2134604 2242980 2329893 2427381 2463220 2540869 2626611 2697669 2734101 2755640
19306 2755640 2827412 2902892 2908826 2955578 3055320 3117342 3190940 3264614 3337637 3419030 3472114
19295 3472114 3502521 3560313 3592395 3620730 3675760 3737097 3831456 3895307 3965851 4005839 4072857
19284 4072857 4157677 4227039 4308064 4367624 4376866 4407549 4497120 4582629 4674553 4761569 4845893
19273 4845893 4882435 4925704 4943406 4999656 5096505 5157404 5234729 5323303 5352439 5392987 5430500
$$ packed form
19348i44036J40889J61775J37601J03279R2087J10340Q8394N2244J27510J28903
19338A98986J27922J01304P0175J27392J17150M1248M3348Q0834J05549R8097
19328A112005P0188R9650J09975L4038R1061P2630J00474R0459N8982K4887M7690
19317A912039R5585J26980J08376Q6913R7488L5839P7649Q5742P1058L6432K1539
19306B755640P1772P5480N934M6752R9742O2022P3598P3674P3023Q1393N3084
19295C472114L0407N7792L2082K8335N5030O1337R4359O3851P0544L9988O7018
19284D072857Q4820O9362Q1025N9560R242L0683Q9571Q5509R1924Q7016Q4324
19273D845893L6542M3269J7702N6250R6849O0899P7325Q8574K9136M0548L7513
$$ plain form
19262 5430500 5488927 5558875 5624143 5707278 5788853 5889041 5967680 6032278 6034240 6041383 6086567
19251 6086567 6136452 6184474 6231649 6264507 6312883 6349654 6388347 6479437 6549107 6562632 6603103
19240 6603103 6689933 6760743 6794304 6850892 6941624 7033809 7093615 7156852 7187785 7260427 7322546
19229 7322546 7427201 7541422 7598713 7659633 7728999 7805368 7855269 7882091 7949531 8008385 8066358
19218 8066358 8174659 8243340 8346579 8391717 8443489 8508531 8602115 8660704 8730485 8791281 8820699
19207 8820699 8891137 8983400 9027668 9100410 9195600 9258656 9309691 9425555 9508471 9541164 9588016
19196 9588016 9691033 9768318 9867160 9963746 10071504 10168164 10253672 10359026 10475604 10574142
19186 10574142 10674819 10731284 10811721 10855775 10900350 10995262 11095607 11215113 11324136 11433547
$$ packed form
19262E430500N8427O9948O5268Q3135Q1575J00188P8639O4598J962P143M5184
19251F086567M9885M8022M7175L2858M8376L6771L8693R1090O9670J3525M0471
19240F603103Q6830P0810L3561N6588R0732R2185N9806O3237L0933P2642O2119
19229G322546J04655J14221N7291O0920O9366P6369M9901K6822O7440N8854N7973
19218H066358J08301O8681J03239M5138N1772O5042R3584N8589O9781O0796K9418
19207H820699P0438R2263M4268P2742R5190O3056N1035J15864Q2916L2693M6852
19196I588016J03017P7285R8842R6586J07758R6660Q5508J05354J16578R8538
19186A0574142J00677N6465Q0437M4054M4575R4912J00345J19506J09023J09411
$$ plain form
19176 11433547 11531766 11624073 11743899 11873821 11924914 11963439 12075461 12205037 12356876 12492756
19166 12492756 12625512 12693804 12810070 12932796 13065932 13237445 13412250 13543146 13655097
19157 13655097 13823394 13978513 14181729 14393930 14535193 14679924 14852438 15010303 15147080
19148 15147080 15303201 15471029 15625980 15827560 16055939 16287207 16507330 16712709 16941256
19139 16941256 17169185 17422368 17724652 17983780 18270284 18539725 18788934 19020949 19319777
19130 19319777 19735048 20130655 20496926 20868895 21267361 21637782 21995387 22411677 22876684
19121 22876684 23383447 23907383 24455617 25062468 25727144 26419161 27163073 27879352 28673742
19112 28673742 29651919 30771874 32092766 33540390 35235900 37190762 39464663 42240536
$$ packed form
19176A1433547R8219R2307J19826J29922N1093L8525J12022J29576J51839J35880
19166A2492756J32756O8292J16266J22726J33136J71513J74805J30896J11951
19157A3655097J68297J55119K03216K12201J41263J44731J72514J57865J36777
19148A5147080J56121J67828J54951K01580K28379K31268K20123K05379K28547
19139A6941256K27929K53183L02284K59128K86504K69441K49209K32015K98828
19130A9319777M15271L95607L66271L71969L98466L70421L57605M16290M65007
19121B2876684N06763N23936N48234O06851O64676O92017P43912P16279P94390
19112B8673742R78177J119955J320892J447624J695510J954862K273901K775873
$$ plain form
19104 42240536 45534910 49330724 52421834 51026156 42724263 33287607 27508613 26850715
19096 26850715 30756002 36366507 39847203 36006146 26401916 18985892 16085971 15898420
19088 15898420 12437620 5319564 -104108 -1593134 1296757 6550287 11248658 10907857
19080 10907857 2760262 -7066596 -13550038 -15445208 -13465260 -10170437 -6876892 -3939342
19072 -3939342 -1323070 1023331 3170322 5219573 7133421 8814746 10312684 11621830
19064 11621830 12964557 14491993 16291208 18335563 20536427 22842371 25412318 28304850
19056 28304850 31620697 35588495 40112848 43792824 42113960 32476683 21886132 15728546
19048 15728546 15628111 20626425 27246574 30846330 25623890 14162576 5362112 1990660
$$ packed form
19104D2240536L294374L795814L091110j395678q301893r436656n778994o57898
19096B6850715L905287N610505L480696l841057r604230p416024k899921j87551
19088A5898420l460800p118056n423672j489026K889891N253530M698371l40801
19080A0907857q147595r826858o483442j895170J979948L294823L293545K937550
19072c939342K616272K346401K146991K049251J913848J681325J497938J309146
19064A1621830J342727J527436J799215K044355K200864K305944K569947K892532
19056B8304850L315847L967798M524353L679976j678864r637277j0590551o157586
19048A5728546j00435M998314O620149L599756n222440j1461314q800464l371452
$$ plain form
19040 1990660 1737661 -2667132 -11156028 -17284972 -18743730 -15121529 -8858836 -3693220
19032 -3693220 -5114433 -15822241 -28136061 -36250724 -38539788 -36214292 -32378923 -28627714
19024 -28627714 -25413862 -22666030 -20274199 -18192911 -16345158 -14761731 -13418465 -12193091
19016 -12193091 -11060934 -9978852 -8975251 -7949433 -6998812 -6096418 -5254685 -4465681 -3695379
19007 -3695379 -2912387 -2135281 -1434512 -710403 21062 752418 1493173 2209673 2944867
18998 2944867 3678145 4404899 5081518 5767666 6494037 7300708 8097356 8874260 9640252
18989 9640252 10484778 11354766 12239906 13172242 14162923 15252001 16476661 17889192 19489115
18980 19489115 21265379 23249554 25576888 28374572 31740328 35513846 38814828 38793546
$$ packed form
19040A990660k52999m404793q488896o128944j458758L622201O262693N165616
19032c693220j421213j0707808j2313820q114663k289064K325496L835369L751209
19024b8627714L213852K747832K391831K081288J847753J583427J343266J225374
19016a2193091J132157J082082J003601J025818R50621R02394Q41733P89004P70302
19007c695379P82992P77106P00769P24109P31465P31356P40755P16500P35194
18998B944867P33278P26754O76619O86148P26371Q06671P96648P76904P65992
18989I640252Q44526Q69988Q85140R32336R90681J089078J224660J412531J599923
18980A9489115J776264J984175K327334K797684L365756L773518L300982k1282
$$ plain form
18972 38793546 32888625 24117351 17690772 16010959 19008267 24562840 29260641 29027031
18964 29027031 22678372 12371375 -285414 -11427860 -17298752 -17737936 -14069876 -8787757
18956 -8787757 -5093457 -6606026 -13488238 -20987185 -25346498 -25665429 -23164287 -19823604
18948 -19823604 -16648242 -13863223 -11483721 -9437473 -7674223 -6019931 -4385019 -2712984
18940 -2712984 -999098 640875 2235135 3809852 5385965 7106008 8920814 10881812
18932 10881812 13035567 15547861 18578059 22171552 26462637 31464329 36441381 38295040
18924 38295040 32624822 20744934 9872057 4652771 6090209 12208412 19008104 21626622
18916 21626622 16971179 6305410 -9178414 -25931171 -37357129 -41330415 -38864580
$$ packed form
18972C8793546n904921q771274o426579j679813K997308N554573M697801k33610
18964B9027031o348659j0306997j2656789j1142446n870892m39184L668060N282119
18956h787757L694300j512569o882212p498947m359313l18931K501142L340683
18948a9823604L175362K785019K379502K046248J763250J654292J634912J672035
18940b712984J713886J639973J594260J574717J576113J720043J814806J960998
18932A0881812K153755K512294L030198L593493M291085N001692M977052J853659
18924C8295040n670218j1879888j0872877n219286J437438O118203O799692K618518
18916B1626622m655443j0665769j5483824j6752757j1425958l973286K465835
$$ plain form
18909 -38864580 -32695292 -26988883 -26355368 -32848909 -42234093 -49114712 -51426055 -49831484
18901 -49831484 -46500572 -43013660 -39851079 -37088949 -34720444 -32675548 -30872446 -29258877
18893 -29258877 -27872006 -26742004 -25739948 -24803135 -23938218 -23055399 -22128346 -21276803 -20542973
18884 -20542973 -19833992 -19187680 -18577421 -18056885 -17524121 -17000442 -16534956 -16095797 -15703905
18875 -15703905 -15354805 -15018619 -14642732 -14220671 -13813187 -13434812 -13114312 -12862706 -12615516
18866 -12615516 -12343715 -12124833 -11873112 -11528100 -11161123 -10862193 -10582034 -10274779 -9994969
18857 -9994969 -9686666 -9333471 -9041586 -8900107 -8840091 -8836400 -8838041 -8760110 -8601458 -8361117
18847 -8361117 -8125754 -8044609 -8095794 -8165950 -8172264 -8048760 -7788906 -7577645 -7376934 -7154912
$$ packed form
18909c8864580O169288N706409O33515o493541r385184o880619k311343J594571
18901d9831484L330912L486912L162581K762130K368505K044896J803102J613569
18893b9258877J386871J130002J002056R36813Q64917Q82819R27053Q51543P33830
18884b0542973P08981O46312O10259N20536N32764N23679M65486M39159L91892
18875a5703905L49100L36186L75887M22061M07484L78375L20500K51606K47190
18866a2615516K71801K18882K51721L45012L66977K98930K80159L07255K79810
18857i994969L08303L53195K91885J41479O0016L691j641P7931J58652K40341
18847h361117K35363Q1145n1185p0156o314J23504K59854K11261K00711K22022
$$ plain form
18837 -7154912 -6950867 -6824346 -6684342 -6567896 -6438842 -6253573 -6079860 -5906127 -5748090
18828 -5748090 -5608123 -5461274 -5303161 -5145914 -4978621 -4839705 -4753979 -4673392 -4672123 -4681912
18818 -4681912 -4637481 -4560373 -4403185 -4272017 -4223030 -4232402 -4291890 -4295555 -4199266 -4054637 -3916643
18807 -3916643 -3774238 -3624242 -3529453 -3451464 -3343444 -3196582 -3067344 -2983009 -2889296 -2763650
18797 -2763650 -2676126 -2604281 -2490545 -2397984 -2332870 -2258249 -2146487 -2005408 -1936502 -1863481 -1767224
18786 -1767224 -1692171 -1594390 -1515924 -1420973 -1324218 -1241309 -1209415 -1158861 -1078533 -966574 -886078
18775 -886078 -783438 -681418 -602675 -514007 -490158 -428977 -348305 -311723 -214818 -69727 3458
18764 3458 27752 -25014 -45636 -41660 3220 109551 252555 374649 487799 585629 695291
$$ packed form
18837g154912K04045J26521J40004J16446J29054J85269J73713J73733J58037
18828e748090J39967J46849J58113J57247J67293J38916Q5726Q0587J269r789
18818d681912M4431P7108J57188J31168M8987r372n9488l665R6289J44629J37994
18807c916643J42405J49996R4789P7989J08020J46862J29238Q4335R3713J25646
18797b763650Q7524P1845J13736R2561O5114P4621J11762J41079O8906P3021R6257
18786a767224P5053R7781P8466R4951R6755Q2909L1894N0554Q0328J11959Q0496
18775h86078J02640J02020P8743Q8668K3849O1181Q0672L6582R6905J45091P3185
18764C458K4294n2766k0622L976M4880J06331J43004J22094J13150R7830J09662
$$ plain form
18753 695291 759644 841064 907491 964052 1026535 1108974 1205029 1274971 1327391 1433560 1516504
18742 1516504 1622432 1685446 1741640 1811688 1944798 2050853 2117672 2206356 2269578 2333543 2389399
18731 2389399 2432435 2481488 2546063 2641497 2706522 2754410 2860213 2947771 3026950 3102651 3217871
18720 3217871 3238910 3260736 3314305 3402806 3511020 3613768 3697885 3734668 3840291 3940240 4036485
18709 4036485 4144830 4250654 4371319 4469601 4556706 4638569 4727457 4860477 4976523 5057034
18699 5057034 5103662 5174184 5324794 5478129 5575552 5610420 5692895 5820385 5956323 6074524
18689 6074524 6179860 6261750 6342379 6428361 6573053 6697864 6805488 6917844 7084735 7160740
18679 7160740 7309356 7467878 7623408 7744603 7920186 8032093 8162643 8319457 8479022
$$ packed form
18753F95291O4353Q1420O6427N6561O2483Q2439R6055O9942N2420J06169Q2944
18742A516504J05928O3014N6194P0048J33110J06055O6819Q8684O3222O3965N5856
18731B389399M3036M9053O4575R5434O5025M7888J05803Q7558P9179P5701J15220
18720C217871K1039K1826N3569Q8501J08214J02748Q4117L6783J05623R9949R6245
18709D036485J08345J05824J20665R8282Q7105Q1863Q8888J33020J16046Q0511
18699E057034M6628P0522J50610J53335R7423L4868Q2475J27490J35938J18201
18689F074524J05336Q1890Q0629Q5982J44692J24811J07624J12356J66891P6005
18679G160740J48616J58522J55530J21195J75583J11907J30550J56814J59565
$$ plain form
18670 8479022 8665150 8826102 8981870 9158433 9322653 9502955 9688568 9888375 10056455
18661 10056455 10261933 10477487 10665633 10914868 11178643 11430618 11713325 11978777 12255754
18652 12255754 12510529 12796599 13165674 13485331 13813951 14150925 14493029 14839959 15179911
18643 15179911 15540634 15985073 16379020 16709872 17051717 17485098 17989182 18511737 19180445
18634 19180445 20009528 20976921 21985230 23097419 24328317 25669814 27220237 29071721
18626 29071721 31218405 33788922 36807857 40342686 44504468 48953538 51738067 49782439
18618 49782439 44735760 36585307 23538713 9050749 -3585546 -15023415 -23467381
18611 -23467381 -26920136 -26717827 -23707793 -19745549 -16000109 -12753927 -10006502 -7620528
$$ packed form
18670H479022J86128J60952J55768J76563J64220J80302J85613J99807J68080
18661A0056455K05478K15554J88146K49235K63775K51975K82707K65452K76977
18652A2255754K54775K86070L69075L19657L28620L36974L42104L46930L39952
18643A5179911L60723M44439L93947L30852L41845M33381N04084N22555O68708
18634A9180445Q29083R67393J008309J112189J230898J341497J550423J851484
18626B9071721K146684K570517L018935L534829M161782M449070K784529j955628
18618D9782439n046679q150453j3046594j4487964j2636295j1437869q443966
18611b3467381l452755K02309L010034L962244L745440L246182K747425K385974
$$ plain form
18603 -7620528 -5566846 -3718007 -2041518 -518555 945015 2367411 3701329 4963315
18595 4963315 6152041 7176555 8089249 8893747 9636601 10401785 11238170 12219176 13345439
18586 13345439 14615370 16105386 17729514 19469474 21382190 23447548 25749415 28401727
18578 28401727 31419517 34992997 39201919 44165246 50028969 56801132 63197901 64944185
18570 64944185 59543324 49971504 34027500 11877349 -10286047 -29587838 -46561950
18563 -46561950 -57112105 -60468325 -58429004 -52957914 -46860556 -41434477 -36847729 -33000728
18555 -33000728 -29726087 -26895151 -24430226 -22270633 -20386533 -18689425 -17094748 -15629615
18547 -15629615 -14325609 -13175597 -12103179 -11137632 -10355072 -9751219 -9269634 -8728039 -8094167
$$ packed form
18603g620528K053682J848839J676489J522963J463570J422396J333918J261986
18595D963315J188726J024514R12694Q04498P42854P65184Q36385R81006J126263
18586A3345439J269931J490016J624128J739960J912716K065358K301867K652312
18578B8401727L017790L573480M208922M963327N863723O772163O396769J746284
18570F4944185n400861r571820j5944004k2150151k2163396j9301791j6974112
18563d6561950j0550155l356220K039321N471090O097358N426079M586748L847001
18555c3000728L274641K830936K464925K159593J884100J697108J594677J465133
18547a5629615J304006J150012J072418R65547P82560O03853M81585N41595O33872
$$ plain form
18538 -8094167 -7253269 -6274219 -5223919 -4139576 -3059312 -1910438 -678268 648078
18530 648078 2098884 3717270 5568104 7658496 10100839 13025690 16268598 18906905
18522 18906905 18766464 15890396 11419878 3745854 -5636444 -14093284 -21499584 -27574748
18514 -27574748 -30341274 -30592943 -28859190 -26221326 -23677508 -21501939 -19610105 -17998503
18506 -17998503 -16706755 -15590575 -14572482 -13671838 -12795906 -12012653 -11317910 -10651871 -10051285
18497 -10051285 -9563896 -9117714 -8706918 -8331227 -7947970 -7655616 -7399476 -7115685 -6828074
18488 -6828074 -6512308 -6201254 -5948829 -5654440 -5352596 -5037758 -4759752 -4476298 -4153010
18479 -4153010 -3925559 -3673811 -3413586 -3166036 -2941824 -2683977 -2444379 -2180572 -1982585
$$ packed form
18538h094167Q40898R79050J050300J084343J080264J148874J232170J326346
18530F48078J450806J618386J850834K090392K442343K924851L242908K638307
18522A8906905j40441k876068m470518p674024r382298q456840p406300o075164
18514b7574748k766526k51669J733753K637864K543818K175569J891834J611602
18506a7998503J291748J116180J018093R00644Q75932P83253O94743O66039O00586
18497a0051285M87389M46182M10796L75691L83257K92354K56140K83791K87611
18488f828074L15766L11054K52425K94389L01844L14838K78006K83454L23288
18479d153010K27451K51748K60225K47550K24212K57847K39598K63807J97987
$$ plain form
18470 -1982585 -1782947 -1601048 -1387129 -1187989 -978157 -765930 -539744 -358668 -173046
18461 -173046 10312 164863 360258 630485 858200 1034934 1199452 1375145 1538435 1717794
18451 1717794 1939032 2159812 2348098 2480224 2626240 2734866 2852870 3000573 3152520
18442 3152520 3298185 3448208 3474150 3490183 3587955 3722392 3914021 4175141 4431791 4640990
18432 4640990 4790931 4933684 5111091 5285141 5457180 5648291 5903468 6152711 6399262
18423 6399262 6592855 6742944 6826343 6917653 7101448 7342251 7638948 7938572 8165373 8340853
18413 8340853 8486746 8659456 8927524 9189080 9439311 9748039 10037974 10334760 10657890
18404 10657890 11013362 11365868 11700647 12011594 12325653 12665759 13034176 13390637 13754363
$$ packed form
18470a982585J99638J81899K13919J99140K09832K12227K26186J81076J85622
18461a73046J83358J54551J95395K70227K27715J76734J64518J75693J63290J79359
18451A717794K21238K20780J88286J32126J46016J08626J18004J47703J51947
18442C152520J45665J50023K5942J6033R7772J34437J91629K61120K56650K09199
18432D640990J49941J42753J77407J74050J72039J91111K55177K49243K46551
18423F399262J93593J50089Q3399R1310J83795K40803K96697K99624K26801J75480
18413H340853J45893J72710K68068K61556K50231L08728K89935K96786L23130
18404A0657890L55472L52506L34779L10947L14059L40106L68417L56461L63726
$$ plain form
18395 13754363 14126698 14553838 14992258 15372383 15545406 15643491 15806116 16137155 16571602
18386 16571602 17096119 17679445 18314718 18940161 19419012 19881087 20354309 20999963 21799778
18377 21799778 22674465 23603315 24568298 25490064 26467098 27580463 28825206 30258073 31783469
18368 31783469 33381618 35014216 36726299 38692468 41112190 44089540 47751840 52203276
18360 52203276 57604357 64026955 71368111 76653464 70737721 50483916 30231402 19006237
18352 19006237 19130360 27952279 38278115 40162040 22853786 -3606040 -23197677 -31485252
18344 -31485252 -28670938 -20975834 -12769342 -5226845 1717600 8532006 15577104 23281188
18336 23281188 32088141 41593820 48121961 41538395 19453233 -2047986 -13649009 -12855672
$$ packed form
18395A3754363L72335M27140M38420L80125J73023R8085J62625L31039M34447
18386A6571602N24517N83326O35273O25443M78851M62075M73222O45654P99815
18377B1799778Q74687R28850R64983R21766R77034J113365J244743J432867J525396
18368C1783469J598149J632598J712083J966169K419722K977350L662300M451436
18360E2203276N401081O422598P341156N285353n915743k0253805k0252514j1225165
18352A9006237J24123Q821919J0325836J883925j7308254k6459826j9591637q287575
18344c1485252K814314P695104Q206492P542497O944445O814406P045098P704084
18336B3281188Q806953R505679O528141o583566k2085162k1501219j1601023P93337
$$ plain form
18328 -12855672 -2995421 7908940 8484235 -12041252 -41573530 -63324054 -72724070 -70438699
18320 -70438699 -63226627 -55895646 -49689832 -44569901 -40432297 -37042159 -34089531 -31433840
18312 -31433840 -29063997 -26977777 -25088644 -23306662 -21700473 -20150762 -18656258 -17239570
18304 -17239570 -15988427 -14857273 -13714717 -12545427 -11357158 -10210146 -9163120 -8213958
18296 -8213958 -7260708 -6305239 -5362118 -4341036 -3349596 -2405200 -1478878 -534231 418801
18287 418801 1434232 2558726 3827747 5109105 6312502 7581133 9029493 10635459
18279 10635459 12422554 14461999 16620805 18872310 21367357 24354957 27967176 32454534
18271 32454534 37960431 44684080 52273534 57462485 51172319 29973557 6938655 -7344009
$$ packed form
18328a2855672R860251J0904361N75295k0525487k9532278k1750524r400016K285371
18320g0438699P212072P330981O205814N119931M137604L390138K952628K655691
18312c1433840K369843K086220J889133J781982J606189J549711J494504J416688
18304a7239570J251143J131154J142556J169290J188269J147012J047026R49162
18296h213958R53250R55469R43121J021082R91440R44396R26322R44647R53032
18287D18801J015431J124494J269021J281358J203397J268631J448360J605966
18279A0635459J787095K039445K158806K251505K495047K987600L612219M487358
18271C2454534N505897O723649P589454N188951o290166k1198762k3034902j4282664
$$ plain form
18263 -7344009 -10103117 -3632608 5170157 7323416 -5094256 -25382742 -41277818 -48301599
18255 -48301599 -46717219 -41017788 -34916653 -29535971 -24997336 -21119561 -17599501 -14203193
18247 -14203193 -10839206 -7401986 -4011020 -622798 2834283 6671545 11184370 16529050
18239 16529050 22996571 30694813 39585460 47531246 45765203 25102227 -4355211 -26232690
18231 -26232690 -34669786 -30237486 -20067848 -13875902 -22577075 -45005811 -66450822 -78763692
18223 -78763692 -80437039 -75297569 -68638993 -62736572 -57876799 -53927102 -50651449 -47874402
18215 -47874402 -45388547 -43135536 -41128089 -39429963 -37891018 -36490084 -35266669 -34194598
18207 -34194598 -33130962 -32177093 -31311315 -30480161 -29694722 -28910136 -28103801 -27317268 -26636503
$$ packed form
18263g344009k759108O470509Q802765K153259j2417672k0288486j5895076p023781
18255d8301599J584380N699431O101135N380682M538635L877775L520060L396308
18247a4203193L363987L437220L390966L388222L457081L837262M512825N344680
18239A6529050O467521P698242Q890647P945786j766043k0662976k9457438k1877479
18231b6232690q437096M432300J0169638O191946q701173k2428736k1445011j2312870
18223g8763692j673347N139470O658576N902421M859773L949697L275653K777047
18215d7874402K485855K253011K007447J698126J538945J400934J223415J072071
18207c4194598J063636R53869Q65778Q31154P85439P84586Q06335P86533O80765
$$ plain form
18198 -26636503 -26084078 -25593102 -25107050 -24646714 -24171698 -23645138 -23131544 -22636517 -22157807
18189 -22157807 -21702913 -21299803 -20901903 -20509533 -20152303 -19843080 -19474386 -19065025 -18667597
18180 -18667597 -18309996 -18007880 -17667534 -17379943 -17109938 -16816552 -16543712 -16239956 -15985502
18171 -15985502 -15752475 -15465482 -15193885 -14943860 -14697601 -14421649 -14158854 -13963899 -13746815
18162 -13746815 -13532840 -13280236 -13024635 -12799895 -12658759 -12499887 -12308241 -12135498 -11899566
18153 -11899566 -11647917 -11410061 -11168496 -10965585 -10734032 -10483623 -10246649 -9992280 -9705577
18144 -9705577 -9468595 -9259282 -9068511 -8852421 -8618685 -8364239 -8111685 -7831870 -7528454
18135 -7528454 -7281468 -7028127 -6753206 -6485152 -6137940 -5804933 -5472624 -5155943 -4768469
$$ packed form
18198b6636503N52425M90976M86052M60336M75016N26560N13594M95027M78710
18189b2157807M54894M03110L97900L92370L57230L09223L68694M09361L97428
18180a8667597L57601L02116L40346K87591K70005K93386K72840L03756K54454
18171a5985502K33027K86993K71597K50025K46259K75952K62795J94955K17084
18162a3746815K13975K52604K55601K24740J41136J58872J91646J72743K35932
18153a1899566K51649K37856K41565K02911K31553K50409K36974K54369K86703
18144i705577K36982K09313J90771K16090K33736K54446K52554K79815L03416
18135g528454K46986K53341K74921K68054L47212L33007L32309L16681L87474
$$ plain form
18126 -4768469 -4321137 -3863301 -3357258 -2826432 -2234275 -1621999 -957274 -134567 744587
18117 744587 1720798 2923093 4295952 5875515 7789207 10072404 13000635 16811655
18109 16811655 21715147 28035105 34676589 32387129 6133190 -22785862 -41944084 -49544091
18101 -49544091 -46430859 -41044590 -36422827 -32862110 -30102695 -27911295 -26112300 -24545583
18093 -24545583 -23212171 -22055459 -21080482 -20242776 -19479375 -18731975 -18089546 -17515164 -16986650
18084 -16986650 -16513563 -16100677 -15686933 -15305761 -14976117 -14579034 -14165497 -13833303 -13598835
18075 -13598835 -13410756 -13151729 -12913303 -12722813 -12492942 -12229479 -11991669 -11796824 -11576323
18066 -11576323 -11356368 -11176729 -11004692 -10853442 -10705009 -10507149 -10309850 -10115289 -9962304
$$ packed form
18126d768469M47332M57836N06043N30826N92157O12276O64725Q22707Q79154
18117G44587R76211J202295J372859J579563J913692K283197K928231L811020
18109A6811655M903492O319958O641484k289460k6253939k8919052j9158222p600007
18101d9544091L113232N386269M621763L560717K759415K191400J798995J566717
18093b4545583J333412J156712R74977Q37706P63401P47400O42429N74382N28514
18084a6986650M73087M12886M13744L81172L29644L97083M13537L32194K34468
18075a3598835J88079K59027K38426J90490K29871K63463K37810J94845K20501
18066a1576323K19955J79639J72037J51250J48433J97860J97299J94561J52985
$$ plain form
18057 -9962304 -9777572 -9561248 -9353487 -9220910 -9147290 -9069575 -9075540 -9089856 -9082926 -9049129 -8955385
18046 -8955385 -8790989 -8603787 -8457014 -8399238 -8314741 -8175044 -8063159 -7969066 -7841673 -7707715
18036 -7707715 -7634420 -7597722 -7463975 -7325435 -7205605 -7048854 -6979833 -6852374 -6741532 -6633397
18026 -6633397 -6575199 -6477028 -6318394 -6223830 -6145754 -6094110 -5986009 -5901382 -5741836 -5566795
18016 -5566795 -5419364 -5307268 -5199978 -5118860 -5019040 -4896726 -4788046 -4696565 -4596806 -4471265
18006 -4471265 -4423775 -4395289 -4276167 -4186079 -4117836 -4064784 -3999523 -3931153 -3792411 -3686705 -3603314
17995 -3603314 -3492577 -3376684 -3212225 -3051504 -2949654 -2857082 -2743963 -2586760 -2455467 -2332222
17985 -2332222 -2131784 -1992757 -1875360 -1718784 -1591139 -1502871 -1409911 -1277837 -1131008 -1000141
$$ packed form
18057i962304J84732K16324K07761J32577P3620P7715n965j4316O930L3797R3744
18046h955385J64396J87202J46773N7776Q4497J39697J11885R4093J27393J33958
18036g707715P3295L6698J33747J38540J19830J56751O9021J27459J10842J08135
18026f633397N8198R8171J58634R4564P8076N1644J08101Q4627J59546J75041
18016e566795J47431J12096J07290Q1118R9820J22314J08680R1481R9759J25541
18006d471265M7490K8486J19122R0088O8243N3052O5261O8370J38742J05706Q3391
17995c603314J10737J15893J64459J60721J01850R2572J13119J57203J31293J23245
17985b332222K00438J39027J17397J56576J27645Q8268R2960J32074J46829J30867
$$ plain form
17975 -1000141 -826089 -694361 -558746 -371958 -196635 -73878 72957 275889 467680
17966 467680 652517 830905 1003822 1216392 1373838 1544900 1747912 1977407 2207674 2418956
17956 2418956 2651301 2898056 3201721 3482915 3778937 4052467 4277951 4533621 4852151
17947 4852151 5218967 5614211 6002729 6387794 6742333 6942909 7143544 7432734 7877571
17938 7877571 8371149 8919181 9517259 10193335 10898051 11475816 12034755 12693495 13390742
17929 13390742 14049915 14850920 15863022 17030531 18385782 19897433 21625237 23631916
17921 23631916 25951301 28593061 31630235 35401275 40203233 46316296 53863763 61594580
17913 61594580 61763093 38702410 3524540 -22835355 -36629433 -36497296 -30525503 -24139465
$$ packed form
17975a000141J74052J31728J35615J86788J75323J22757J46835K02932J91791
17966D67680J84837J78388J72917K12570J57446J71062K03012K29495K30267K11282
17956B418956K32345K46755L03665K81194K96022K73530K25484K55670L18530
17947D852151L66816L95244L88518L85065L54539K00576K00635K89190M44837
17938G877571M93578N48032N98078O76076P04716N77765N58939O58740O97247
17929A3390742O59173Q01005J012102J167509J355251J511651J727804K006679
17921B3631916K319385K641760L037174L771040M801958O113063P547467P730817
17913F1594580J68513k3060683l5177870k6359895j3794078J32137N971793O386038
$$ plain form
17905 -24139465 -18619913 -13840502 -9573864 -5737161 -2232231 1070507 4391750 7851270
17897 7851270 11508710 15494703 20117435 25675342 32401016 40385509 48359527 48906203
17889 48906203 28425815 -1318818 -22337837 -31270070 -27193867 -17320811 -6175710
17882 -6175710 4733888 11648896 2826758 -23594103 -46838573 -60743960 -62785572 -57465347
17874 -57465347 -51068238 -45444144 -40779735 -36751234 -33090266 -29740876 -26607815 -23681715
17866 -23681715 -20755210 -17686389 -14461547 -10862352 -6679475 -1748704 4243617 10706640
17858 10706640 13867212 2348509 -24459308 -46959125 -60361273 -62613569 -58356768
17851 -58356768 -53165579 -48687175 -45218086 -42458940 -40153629 -38180229 -36431155 -34901186
$$ packed form
17905b4139465N519552M779411M266638L836703L504930L302738L321243L459520
17897G851270L657440L985993M622732N557907O725674P984493P974018N46676
17889D8906203k0480388k9744633k1019019q932233M076203R873056J1145101
17882f175710J0909598O915008q822138k6420861k3244470j3905387k041612N320225
17874e7465347O397109N624094M664409M028501L660968L349390L133061K926100
17866b3681715K926505L068821L224842L599195M182877M930771N992321O463023
17858A0706640L160572j1518703k6807817k2499817j3402148k252296M256801
17851e8356768N191189M478404L469089K759146K305311J973400J749074J529969
$$ [...]
##END NTUPLES=NMR SPECTRUM
##END=
