##TITLE=Analysis number 318989
Compound Code cc 44513
Book Reference 464/34/4
Project Code adrs
Chemist Name chrisr
##JCAMPDX= 6.0         $$ Bruker NMR JCAMP-DX V2.0
##DATA TYPE= NMR SPECTRUM
##DATA CLASS= NTUPLES
##ORIGIN= Bruker BioSpin GmbH
##OWNER= nmr
$$ XWIN-NMR		Version 3.5
$$ Wed Apr 26 10:45:34 2006 GMT Daylight Time (UT+1h)  MAYBRIDGE\nmr@NMR_250MHZ
##.OBSERVE FREQUENCY= 250.131544655141
##.OBSERVE NUCLEUS= ^1H
##.ACQUISITION MODE= SIMULTANEOUS (DQD)
##.ACQUISITION SCHEME= undefined
##.AVERAGES= 16
##.DIGITISER RES= 18
##SPECTROMETER/DATA SYSTEM= dpx250
##.PULSE SEQUENCE= zg30
##.SOLVENT NAME= CDCl3
##.SHIFT REFERENCE= (INTERNAL, CDCl3, 0, 16.522)
##AUDIT TRAIL= $$ (NUMBER, WHEN, WHO, WHERE, WHAT)
$$ ##TITLE= Audit trail, XWIN-NMR		Version 3.5
$$ ##JCAMPDX= 5.01
$$ ##ORIGIN= Bruker BioSpin GmbH
$$ ##OWNER= nmr
$$ C:\u/data/dgb/nmr/ADRS/3220/pdata/1/auditp.txt
$$ ##AUDIT TRAIL=  $$ (NUMBER, WHEN, WHO, WHERE, WHAT)
(   1,<2006-04-26 10:44:43.66 +100>,<MAYBRIDGE\nmr>,<NMR_250MHZ>,
      <created by zg, POWCHK disabled, PULCHK disabled
       configuration hash MD5:
       84 BC 41 DB A1 6E 1D 46 DA 25 12 A5 C1 ED C5 3A
       data hash MD5: 64K
       58 7F 95 DF 67 3F 1C 11 D2 53 3F E5 3E 69 F7 72>)
(   2,<2006-04-26 10:45:05.48 +100>,<MAYBRIDGE\nmr>,<NMR_250MHZ>,
      <Start of raw data processing
       ef LB = 0.3 FT_mod = 6 PKNL = 1 SI = 32K 
       data hash MD5: 32K
       E3 14 9C 14 B4 21 BF F7 90 3F FA 2E 94 16 D1 98>)
(   3,<2006-04-26 10:45:07.83 +100>,<MAYBRIDGE\nmr>,<NMR_250MHZ>,
      <apk 
       data hash MD5: 32K
       F2 39 E4 72 98 1A C0 D7 89 55 FD B4 09 F0 2F 4B>)
(   4,<2006-04-26 10:45:08.99 +100>,<MAYBRIDGE\nmr>,<NMR_250MHZ>,
      <abs ABSG = 5 
       data hash MD5: 32K
       BF 36 18 A2 CC DC 9D 04 B4 25 3A BD D1 BB E6 15>)
$$ ##END=
$$ 
$$ hash MD5
$$ F2 63 22 05 81 20 88 3E 86 3D 40 45 F9 5C 07 9B
##$RELAX= 
##$RELAX= 
##$RELAX= 
##$RELAX= 
##$RELAX= 
##$RELAX= 
##$RELAX= 
$$ Bruker specific parameters
$$ --------------------------
##$DU= <C:\u>
##$EXPNO= 3220
##$NAME= <ADRS>
##$PROCNO= 1
##$TYPE= <nmr>
##$USER= <dgb>
##$AMP= (0..31)
100 100 100 100 100 100 100 100 100 100 100 100 100 100 100 100 100 100 
100 100 100 100 100 100 100 100 100 100 100 100 100 100 
##$AQSEQ= 0
##$AQ_mod= 3
##$AUNM= <au_zg>
##$AUTOPOS= <14 >
##$BF1= 250.13
##$BF2= 250.13
##$BF3= 250.13
##$BF4= 250.13
##$BF5= 500.13
##$BF6= 500.13
##$BF7= 500.13
##$BF8= 500.13
##$BYTORDA= 1
##$CFDGTYP= 0
##$CFRGTYP= 5
##$CHEMSTR= <none>
##$CNST= (0..31)
1 1 145 1 1 1 1 1 1 1 1 1 1 1 1 1 1 1 1 1 1 1 1 1 1 1 1 1 1 1 1 1 
##$CPDPRG= <>
##$CPDPRG1= <>
##$CPDPRG2= <>
##$CPDPRG3= <>
##$CPDPRG4= <mlev>
##$CPDPRG5= <mlev>
##$CPDPRG6= <mlev>
##$CPDPRG7= <mlev>
##$CPDPRG8= <mlev>
##$CPDPRGB= <>
##$CPDPRGT= <>
##$D= (0..31)
0 1 0 0 0 0 0 0 0 0.06 0 0 0 0 0 0 0.0002 0 0 0 0 0 0 0 0 0 0 0 0 0 0 
0 
##$DATE= 1146044681
##$DBL= (0..7)
120 120 120 120 120 120 120 120 
##$DBP= (0..7)
150 150 150 150 150 150 150 150 
##$DBP07= 0
##$DBPNAM0= <>
##$DBPNAM1= <>
$$ [...]
##$SUBNAM7= <"">
##$SUBNAM8= <"">
##$SUBNAM9= <"">
##$SW= 20.6930455092707
##$SWIBOX= (0..15)
0 0 3 0 0 0 0 0 0 0 0 0 0 0 0 0 
##$SW_h= 5175.983436853
##$TD= 65536
##$TD0= 1
##$TE= 295.16
##$TE2= 300
##$TE3= 300
##$TEG= 300
##$TL= (0..7)
0 120 120 120 120 120 120 120 
##$TP= (0..7)
150 150 150 150 150 150 150 150 
##$TP07= 0
##$TPNAME0= <>
##$TPNAME1= <>
##$TPNAME2= <>
##$TPNAME3= <>
##$TPNAME4= <>
##$TPNAME5= <>
##$TPNAME6= <>
##$TPNAME7= <>
##$TPOAL= (0..7)
0.5 0.5 0.5 0.5 0.5 0.5 0.5 0.5 
##$TPOFFS= (0..7)
0 0 0 0 0 0 0 0 
##$TUNHIN= 0
##$TUNHOUT= 0
##$TUNXOUT= 0
##$USERA1= <user>
##$USERA2= <user>
##$USERA3= <user>
##$USERA4= <user>
##$USERA5= <user>
##$V9= 5
##$VALIST= <valist>
##$VCLIST= <CCCCCCCCCCCCCCC>
##$VD= 0
##$VDLIST= <DDDDDDDDDDDDDDD>
##$VPLIST= <PPPPPPPPPPPPPPP>
##$VTLIST= <TTTTTTTTTTTTTTT>
##$WBST= 1024
##$WBSW= 4
##$XGAIN= (0..3)
0 0 0 0 
##$XL= 0
##$YL= 0
##$YMAX_a= 502329
##$YMIN_a= -572012
##$ZGOPTNS= <>
##$ZL1= 120
##$ZL2= 120
##$ZL3= 120
##$ZL4= 120
##$ABSF1= 16.522
##$ABSF2= -4.171173
##$ABSG= 5
##$ABSL= 3
##$ALPHA= 0
##$AQORDER= 0
##$ASSFAC= 0
##$ASSFACI= 0
##$ASSFACX= 0
##$ASSWID= 0
##$AUNMP= <proc_1d>
##$AZFE= 0.1
##$AZFW= 0.1
##$BCFW= 0
##$BC_mod= 0
##$BYTORDP= 0
##$COROFFS= 0
##$CY= 12.5
##$DATMOD= 1
##$DC= 0
##$DFILT= <>
##$DTYPP= 0
##$F1P= 14.0000005364418
##$F2P= -0.99999901652339
##$FCOR= 0.5
##$FTSIZE= 32768
##$FT_mod= 6
##$GAMMA= 0
##$GB= 0
##$INTBC= 1
##$INTSCL= 1
##$ISEN= 128
##$LB= 0.3
##$LEV0= 0
##$LPBIN= 0
##$MAXI= 10000
##$MC2= 0
##$MEAN= 0
##$ME_mod= 0
##$MI= 0
##$NCOEF= 0
##$NC_proc= -4
##$NLEV= 6
##$NOISF1= 0
##$NOISF2= 0
##$NSP= 0
##$NTH_PI= 0
##$NZP= 0
##$OFFSET= 16.522
##$PC= 1
##$PHC0= 166.1059
##$PHC1= 7.481133
##$PH_mod= 1
##$PKNL= yes
##$PPARMOD= 0
##$PSCAL= 4
##$PSIGN= 0
##$REVERSE= no
##$SF= 250.13
##$SI= 32768
##$SIGF1= 0
##$SIGF2= 0
##$SINO= 400
##$SIOLD= 32768
##$SREGLST= <1H.CDCl3>
##$SSB= 0
##$STSI= 32768
##$STSR= 0
##$SW_p= 5175.98343685301
##$SYMM= 0
##$S_DEV= 0
##$TDeff= 65536
##$TDoff= 0
##$TI= <Analysis number 999999
Compound Code 99
Book Reference 9
Project Code 9>
##$TILT= no
##$TM1= 0
##$TM2= 0
##$TOPLEV= 0
##$USERP1= <user>
##$USERP2= <user>
##$USERP3= <user>
##$USERP4= <user>
##$USERP5= <user>
##$WDW= 1
##$XDIM= 32768
##$YMAX_p= 370195353
##$YMIN_p= -202047
$$ End of Bruker specific parameters
$$ ---------------------------------
##NTUPLES= NMR SPECTRUM
##VAR_NAME=  FREQUENCY,     SPECTRUM/REAL,   SPECTRUM/IMAG
##SYMBOL=    X,             R,               I
##VAR_TYPE=  INDEPENDENT,   DEPENDENT,       DEPENDENT
##VAR_FORM=  AFFN,          ASDF,            ASDF
##VAR_DIM=   32768,         32768,           32768
##UNITS=     HZ,            ARBITRARY UNITS, ARBITRARY UNITS
##FACTOR=    0.157963299565203, 1,           1
##FIRST=     4132.6476996994, 0,             0
##LAST=      -1043.33573715361, 0,           0
##MIN=       -1043.33573715361, -202047,     0
##MAX=       4132.6476996994, 370195353,     0
$$ Real data points
##PAGE= N=1
##DATA TABLE= (X++(R..R)), XYDATA
$$ [...]
18328D120308J15644J46563M6723n2716q6959j55238j63661j96107r8147n3890
18318C622520l3696j569M1075P7383J01524R8345J24795J61840K74001M39684
18308D905902O89834J001468J376930J975419K995998M400433O070261P570679
18300C0986924Q407749P750309N731111K637543q75383l333889n426994p217692
18292C8659678q239799p149029n047936l215058j993805j334303q81700p05308
18284A0092740m52173l15364l35213k86211j46142m0812R5426J63316J03833q905
18274H870495L5875l9302j14307j65046j60455j45657q0997J5615J18861K09505
18264H544587L72510N62216P69345Q67037J213237J892783K823397M298568O402637
$$ y = [4120308, 4235952, 4382515, 4429238, 4376522, 4289563, 4134325, 3970664, 3774557, 3676410, 3622520, 3588824, 3587255, 3628330, 3705713, 3807237, 3905582, 4030377, 4192217, 4466218, 4905902, 5595736, 6597204, 7974134, 9949553, 12945551, 17345984, 23416245, 30986924, 39394673, 47144982, 52876093, 55513636, 54638253, 51304364, 45877370, 38659678, 30419879, 23270850, 18222914, 15007856, 13014051, 11679748, 10798048, 10092740, 9640567, 9325203, 8989990, 8703779, 8557637, 8516825, 8612251, 8775567, 8879400, 8870495, 8906370, 8867068, 8752761, 8587715, 8427260, 8281603, 8200606, 8216221, 8335082, 8544587, 8917097, 9479313, 10248658, 11115695, 12328932, 14221715, 17045112, 21343680, 27746317]
18255B7746317R403959J2870938J5928856J7638999J6532924J2224678N635199
18248A17981870j734295o854903j1119186j4897300j6984152j4640581j0581725
18241D1169728o491128l709123k070422r97889k0829J218006L045430N811308
18233C7955081R104060J2463685J4025478J1267979O067341k335977j1092691
18226G7454956o117356M316192J1048462J1439327N984965k186038j6550372k2475200
18218F2914936j4453216p173808l314004j292766K80586K044287M377216P885811
18210E1269042J2214146J6306511J8046880J5548568J1251535K409627l098034
18203A23948275N219876J3963619J6423748J0598321Q42762j2380105l0300736
$$ y = [27746317, 37150276, 50021214, 65950070, 83589069, 100121993, 112346671, 117981870, 116247575, 109392672, 98273486, 83376186, 66392034, 51751453, 41169728, 34678600, 30969477, 28899055, 27901166, 27880337, 29098343, 32143773, 37955081, 47059141, 59522826, 73548304, 84816283, 90883624, 88547647, 77454956, 71337600, 75653792, 86702254, 98141581, 104126546, 101940508, 85390136, 62914936, 48461720, 41287912, 37973908, 36681142, 36961728, 39006015, 43383231, 51269042, 63483188, 79789699, 97836579, 113385147, 124636682, 127046309, 123948275, 129168151, 143131770, 159555518, 170153839, 170996601, 158616496, 128315760]
18196A28315760l3609791k3214303j4355041q763661n523870l738019k677566
18189C6433509k055423j691507j448800j395992j297514j057329q48479o89047
18181B5949418n44686m26898m90657m62354m04344m13132m11214l54730l59015
18172B2082388l14877j93334K5587L53840O13642R41775J431488K451431M450943
18163C1842883P461627J1032451J4311106J4927159J0860675M205193o564504
18156H8076590j4143924p880660J881169P367184O971226K666312m793220j5347214
18148F4797463j6811716j0427161n575095l173868k028952j334006r61140q02476
18140B3683049o51126l96523L8598M39914P71825J143199J658119K623117M664395
$$ y = [128315760, 94705969, 71491666, 57136625, 48372964, 42849094, 39111075, 36433509, 34378086, 32686579, 31237779, 29841787, 28544273, 27486944, 26638465, 25949418, 25404732, 24977834, 24487177, 24024823, 23620479, 23207347, 22796133, 22441403, 22082388, 21767511, 21574177, 21599764, 21953604, 22567246, 23509021, 24940509, 27391940, 31842883, 39304510, 50336961, 64648067, 79575226, 90435901, 94641094, 88076590, 73932666, 66052006, 67933175, 75300359, 82271585, 84937897, 80144677, 64797463, 47985747, 37558586, 31983491, 28809623, 26780671, 25446665, 24485525, 23683049, 23031923, 22635400, 22673998, 23113912, 23885737, 25028936, 26687055, 29310172, 33974567]
18131C3974567Q122720J2552647J6959220J9244335J6087530Q857012k508769
18124A13289262j6053325j4366562k117332O893018R207603N390266j675071j3640768
18116H6927091k0415237j4556190p143568k774374o2954K444458N500714R347861
18108E9267801J3382081J7152642J8997558J3777768P621565k937141k0492808
18101A06769466j4328822m972372N2663J694496J614709J800167J611773q0193
18093I4161887k246892k675003l347769m499924m126303l014146k849263l185085
18085F8217502k772959k569411m065821n430010m942028m196618m261145m215744
18077C5763766l287735k295600j645118j263699r85296q46588q01029p67049o69075
$$ y = [33974567, 42097287, 54649934, 71609154, 90853489, 106941019, 115798031, 113289262, 97235937, 82869375, 80752043, 87645061, 96852664, 102242930, 100567859, 86927091, 66511854, 51955664, 44812096, 42037722, 41974768, 44419226, 49919940, 59267801, 72649882, 89802524, 108800082, 122577850, 130199415, 127262274, 106769466, 92440644, 87468272, 87520935, 89215431, 90830140, 92630307, 94242080, 94161887, 91914995, 89239992, 85892223, 81392299, 77265996, 74251850, 71402587, 68217502, 65444543, 62875132, 58809311, 53379301, 48437273, 44240655, 39979510, 35763766, 32476031, 30180431, 28535313, 27271614, 26286318, 25439730, 24638701, 23871652, 23202577]
18068B3202577o00711m75789j80241O6090M46474Q85772J440842K032949K414325
18059B9232288K631610K544926K221149K065301J945122J384135O89251J163968
18051D3877750K098855K251046J710769J536147J298156K90352r33511j195426
18043E0934138j774662k653876k400538j648716j633857j851113j570757j526563
18035C5874056k354268l158716k845500k398778k412420k369192j880356j331380
18027A7123446r96770q07707p17624o01691m79999m07754l67396m43475l95929
18018A1905101l12306l28010l99060l67578l25978k76244k42312j97564o3159
18009I392890K656n6132j39273j81676j49373k15891k23585j18678p5856o9924
$$ y = [23202577, 22601866, 22126077, 21945836, 22011926, 22458400, 23344172, 24785014, 26817963, 29232288, 31863898, 34408824, 36629973, 38695274, 40640396, 42024531, 42713782, 43877750, 45976605, 48227651, 49938420, 51474567, 52772723, 53063075, 52129564, 50934138, 49159476, 46505600, 44105062, 42456346, 40822489, 38971376, 37400619, 35874056, 33519788, 30361072, 27515572, 25116794, 22704374, 20335182, 18454826, 17123446, 16126676, 15318969, 14601345, 13999654, 13519655, 13111901, 12744505, 12301030, 11905101, 11592795, 11264785, 10865725, 10498147, 10172169, 9895925, 9653613, 9456049, 9392890, 9395546, 9339414, 9200141, 9018465, 8869092, 8653201, 8429616, 8310938, 8235082, 8165158]
17999H165158j18602k02862j82586j83658j93049j28162j55953j79055j39715
17990F681516j60176j33884j10853r8186m7931m7214k2461n9731J5647L1023N5192
17979F102942M2214l3899l5322j85906j80731j91558k66934j97743j45104p2891
17969D835068l7153R969n138o5524j43930j19279m4341J9821P7728O25N3904o1015
17957D520735m0839m2872j00324j10179j52627j20858j06875r6827m7930o8660
17947C632744m8790m6321j59440k12380j65723j34645j56168j58033j12028k4798
17937B414418J1642O8825J6485n0643m4925K9846P701k2497P4103J19954J03364
17926B728273R3806m513j3050p1762n9955p4301j72361j80716j07235l8966r8279
$$ y = [8165158, 8046556, 7843694, 7661108, 7477450, 7284401, 7156239, 7000286, 6821231, 6681516, 6521340, 6387456, 6276603, 6178417, 6130486, 6083272, 6060811, 6001080, 6016727, 6047750, 6102942, 6145156, 6111257, 6075935, 5890029, 5709298, 5517740, 5250806, 5053063, 4907959, 4835068, 4797915, 4807884, 4802746, 4737222, 4593292, 4474013, 4429672, 4449493, 4527221, 4527846, 4581750, 4520735, 4479896, 4437024, 4336700, 4226521, 4073894, 3953036, 3846161, 3749334, 3701404, 3632744, 3583954, 3537633, 3378193, 3165813, 3000090, 2865445, 2709277, 2551244, 2439216, 2414418, 2426060, 2494885, 2511370, 2460727, 2415802, 2445648, 2453349, 2430852, 2504955, 2624909, 2728273, 2822079, 2817566, 2804516, 2732754, 2672799, 2598498, 2426137, 2245421, 2138186, 2099220, 2000941]
17915B000941m0788N9215Q5514K1799K695n3893o8183o3192o1004r3940k3540
17904A765624j9322j2590k1651L2688N8009k7018m252j1159r315n6922k5357P087
17892A675822J07256M9598r859K1890l7963K1488J08688J90245J26559O6118K4460
17881B344302p8964r7472j6159O5147O6195J48615K07294J78565J05692J74723
17871C097938Q7504O8599Q3149R6905J66033K74262L50751N15599P59990J047091
17861F547821J452610K183553L261656N412643R078999J3413299J7538062J8763506
17853G7652149J2642544M335266j0563611k6886779j9758060j0319404n494464
17846B1607641l234364j993444j227849p13676l99520l7783K95768O35586J110069
$$ y = [2000941, 1960153, 2019368, 2104882, 2126681, 2129376, 2075483, 2007300, 1944108, 1883104, 1789164, 1765624, 1746302, 1733712, 1712061, 1744749, 1802758, 1775740, 1771488, 1760329, 1751014, 1694092, 1668735, 1675822, 1783078, 1832676, 1822817, 1844707, 1806744, 1828232, 1936920, 2127165, 2253724, 2319842, 2344302, 2265338, 2167866, 2151707, 2216854, 2283049, 2431664, 2638958, 2817523, 2923215, 3097938, 3185442, 3254041, 3337190, 3434095, 3600128, 3874390, 4225141, 4740740, 5500730, 6547821, 8000431, 10183984, 13445640, 18858283, 27937282, 41350581, 58888643, 77652149, 90294693, 94629959, 84066348, 57179569, 37421509, 27102105, 21607641, 18373277, 16379833, 15151984, 14438308, 14038788, 14001005, 14296773, 14932359, 16042428]
17837A6042428J881640L109611N474897R016632J2787425J6226575J5881675R469562
17829H9890445K180238j3363422k1923756j1711206j815092N213263J0229104
17822E8699574J3509009J1201331M703770l615808j9601221k0023065j1274582
17815C3599008n942549l412801k202298j565168j177067r09540n30623j65621
17807A7693341J25645L71816Q57661J692314L311851N921589R107044J2023089
17799E1104350J3445962R338461L148913o459769j9927134j6030904q430312m441378
17791B1748189k693051j764379j287947j028033p72137p28591o64991n25859m43230
17782A1839971l67309l00915k99948k95524l55306l82763l38449l04258l76370
$$ y = [16042428, 17924068, 21033679, 26508576, 35525208, 48312633, 64539208, 80420883, 89890445, 92070683, 78707261, 56783505, 45072299, 43257207, 48470470, 58699574, 72208583, 83409914, 88113684, 84497876, 64896655, 44873590, 33599008, 27656459, 24243658, 22041360, 20476192, 19299125, 18389585, 17858962, 17693341, 17818986, 18190802, 19048463, 20740777, 24052628, 29974217, 39081261, 51104350, 64550312, 73888773, 77037686, 70577917, 50650783, 34619879, 26189567, 21748189, 19055138, 17290759, 16002812, 14974779, 14202642, 13474051, 12809060, 12283201, 11839971, 11472662, 11171747, 10871799, 10576275, 10220969, 9838206, 9499757, 9195499, 8819129]
17773H819129l74643l36926k34016j96107j21882q5997j55095k12362k91073k92244
17763F518784k42304k11621j96761k33075j46473j26104j77093p7642j16403j04483
17753D886825j16909j88968j32247p5635m9457j0883m3679r5353j07123o6471
17743D000100o4552l3477L6723N6285L1973p4347n3186p3760j16500j56127j37226
17732C415906q2033K614j1256o277n297m2807m3048n2617j69900r8762j08598
17721B797925j49866q1108o3377n3131o0893o6821j04175k769N379l2031j8487
17710B170646r57J4854N1064N1947J24661J47577Q2681R7696M5721K4003k3869
17699B786024j05782o8346N0735K5784m752n109m653p7178j41219j68982j52120
$$ y = [8819129, 8444486, 8107560, 7873544, 7677437, 7555555, 7469558, 7314463, 7102101, 6811028, 6518784, 6276480, 6064859, 5868098, 5635023, 5488550, 5362446, 5185353, 5107711, 4991308, 4886825, 4769916, 4580948, 4448701, 4373066, 4323609, 4312726, 4269047, 4173694, 4066571, 4000100, 3935548, 3902071, 3938794, 3995079, 4027052, 3952705, 3899519, 3825759, 3709259, 3553132, 3415906, 3333873, 3336487, 3325231, 3318954, 3313657, 3270850, 3227802, 3175185, 3005285, 2906523, 2797925, 2648059, 2566951, 2503574, 2450443, 2389550, 2322729, 2218554, 2215785, 2221164, 2189133, 2170646, 2169689, 2184543, 2235607, 2287554, 2412215, 2559792, 2642473, 2740169, 2785890, 2809893, 2786024, 2680242, 2611896, 2662631, 2688415, 2683663, 2678554, 2673901, 2596723, 2455504, 2286522, 2134402]
17688B134402q1982p5927r8972m3937j8438J6474N1697J57933J29805R5089J82254
17677B448398J73883J77583J65761J42474J05845J11248j1796j15017k09120k59091
17667B730168l71553l91801k45577j15221j13471j21126n2096P990n178l8008
17657A284127l7349n3404o5727m8057n1649o0477m7018K885k073o3665l0080p117
17645H20396m8956r7552m9190n9886o437J2553L3283K4430L2650J4331k1078m0781
17633F13763m9017k1428k9721j8609O0897O7793J3424J5494N669j5248p6376l5509
17621E31132Q371j0520J7447K258m011m4157k6569j9086r7892m315K9191k8554
17609C53295l975N9373N6518M0228M5755K7166L6401J9253K9199N3431j4938j8019
$$ y = [2134402, 2052420, 1976493, 1877521, 1833584, 1815146, 1831620, 1883317, 2041250, 2171055, 2266144, 2448398, 2622281, 2799864, 2965625, 3108099, 3213944, 3325192, 3313396, 3198379, 2989259, 2730168, 2358615, 1966814, 1721237, 1606016, 1492545, 1371419, 1319323, 1327313, 1322135, 1284127, 1246778, 1193374, 1127647, 1079590, 1027941, 967464, 920446, 923331, 921258, 857593, 827513, 820396, 771440, 673888, 624698, 564812, 558375, 570928, 604211, 628641, 661291, 675622, 654544, 613763, 564746, 543318, 513597, 494988, 555885, 623678, 637102, 652596, 658265, 643017, 566641, 531132, 539503, 528983, 546430, 548688, 544677, 500520, 473951, 454865, 356973, 352658, 381849, 353295, 349320, 408693, 465211, 505439, 551194, 578360, 614761, 634014, 663213, 716644, 701706, 683687]
17597F83687o135j7232J136n733L6022J7749j1178o8302R587j3585j7141o842
17585F02033o2679n7116L2805m914o7081j8498K45l7160J6194k4511j1605N1626
17573D19339J7807l081K958L1803J3186n987N7172J31084J02705N6441M1706m4687
17561H20446n7860m5712L6844R7276L2645L8785j6960j47105j11643o6786J3117
17550E93047j6901K815J5041j9312k1538j8926L9456K0540J1211l4431n9319l6128
17538D75555r295K0404M2857P1615Q7211K6272K0327N6237k5495o8883j32729
17527E64076m2814L9760J39783Q9908l3145j32180j47761j21921q4686m2451K0216
17516B48785l415K839k6798j1788N1827K8326l3629j6425j5189q0942j4634q553
$$ y = [683687, 677552, 660320, 661456, 655723, 691745, 709494, 698316, 630014, 639601, 626016, 608875, 602033, 539354, 482238, 515043, 510129, 443048, 424550, 424795, 387635, 403829, 379318, 367713, 419339, 437146, 434065, 437023, 468826, 482012, 476025, 533197, 664281, 766986, 823427, 865133, 820446, 762586, 716874, 753718, 850994, 883639, 922424, 905464, 758359, 646716, 579930, 593047, 576146, 578961, 594002, 574690, 553152, 534226, 573682, 594222, 605433, 571002, 511683, 475555, 466260, 486664, 529521, 601136, 688347, 714619, 734946, 791183, 765688, 696805, 564076, 521262, 561022, 700805, 790713, 757568, 625388, 477627, 355706, 271020, 228569, 248785, 245370, 248209, 221411, 209623, 261450, 289776, 256147, 239722, 224533, 143591, 128957, 120404]
17504A20404J5619L8226n29j2258N1780J2139n4322p1456n1551N1907P725J0573
17492A18257N7235N631p759m9665K7175k1348k9536o084J0579l7303j6335k790
17480D8057j4884j5794O4053Q4292l6335o0279k8627K1460P4975J11932k7819
17469B21031L349l8434q7193m0636L9345L2397J224J0906o6976j8852J8010K596
17457G6767k2603K2226j7253k8022j3466M520n058J5540K7871Q187O986K1198
17445I6893L4837M8622N8444O0234L1049L6736N675J4746P837p4875j03200o4541
17433A52457l6031j9428K0533J140K5016R268n9290l8665j0067M1644m8532j2625
17421B5420K9570o3504q710L1663K6758L8694J7414k9806j3972J6221p166Q033
$$ y = [120404, 136023, 174249, 173720, 161462, 213242, 225381, 171059, 99603, 48052, 99959, 107684, 118257, 175492, 181123, 173364, 123699, 150874, 129526, 99990, 93906, 104485, 67182, 50847, 48057, 33173, 17379, 81432, 165724, 129389, 69110, 40483, 61943, 136918, 248850, 221031, 224380, 185946, 98753, 58117, 97462, 129859, 131083, 141989, 75013, 56161, 74171, 76767, 54164, 76390, 59137, 31115, 17649, 22169, 17111, 32651, 60522, 68709, 75695, 96893, 131730, 180352, 238796, 299030, 330079, 366815, 372490, 387236, 395073, 320198, 216998, 152457, 116426, 96998, 117531, 118671, 143687, 152955, 93665, 55000, 44933, 86577, 38045, 25420, 54990, -8514, -17224, 14439, 41197, 79891, 97305, 67499, 53527, 69748, 62582, 70615]
17409G0615K5330P1931O5237M95q1048k5977j7494k290M4757o904l8226m2989
17397F3437J3630j936j247N1503j5658l3334l3586m3939M7041M6958p916m264
17385H0689N919l9580k618R292N486o8547R585K6969m6229j4601L3645J4433J3496
17372B7939K660p803l9015K9448L3013n479m1508j9390j682J4397k412k0506L8044
17359G706P9800l4944L6387R463l6291l6416k9309m2403M1047O8087L0405r926
17347H3606j8897j7503l1362K0796k7599k2366k9895M5109O1833J7622m3651l9895
17335b202j8160j0971O4834L3373j4936K6113k3885j1626k3291n484P8649j994
17323I0420O8315R7961R3875R0422R508j7569j25860j40922j09548n4480M1232
$$ y = [70615, 95945, 167876, 233113, 233608, 152560, 126583, 109089, 106799, 151556, 144652, 106426, 63437, 77067, 75131, 73884, 125387, 109729, 76395, 42809, -1130, 45911, 92869, 84953, 80689, 86608, 47028, 44410, 53702, 59188, -9359, 226, 27195, -19034, -33635, 10, 14443, 27939, 30599, 22796, -16219, 13229, 46242, 40763, -745, -20135, -21817, -7420, -9832, -30338, 7706, 87506, 52562, 88949, 98412, 62121, 25705, -3604, -46007, -4960, 63127, 93532, 83606, 64709, 47206, 15844, 36640, 9041, -13325, -43220, 1889, 63722, 81344, 37693, -2202, -20362, -31333, 33501, 66874, 51938, 78051, 54166, 42540, 19249, 13765, 92414, 90420, 158735, 256696, 350571, 440993, 450501, 432932, 307072, 166150, 56602, 2122, 43354]
17312D3354K5767P814R850n1588k9056L8494O9059k6952o3746L3734J03323O6208
17300B26261M1129P4437K6412R154J6514n0295p8325m0725k2706L8505P7039K5939
17288C43339M7965j9946m7125o8681q1526o8377R695j4525k3822J26K9276m7979
17276E8420l9563p053K8920K2334L1486L0973K6118O4981K6257L4896M0904P2847
17264C91520N6471q9096q5997l4554l7170r0008k2631K6091k1016O8777L8278
17253B00665o4260m1867k7192N213J1129L3696n0269m8015K2559K3259n349l3864
17241B5705J5171L7866K4681p037n3900j306J7515j8866K831R183j8399k6469
17229F975L193j7669j9301j9220J6586o844L6510L0903m8224r665N7753L7399
$$ y = [43354, 69121, 76935, 86785, 35197, 6141, 44635, 113694, 86742, 22996, 56730, 160053, 226261, 267390, 341827, 368239, 377393, 393907, 343612, 265287, 224562, 201856, 240361, 317400, 343339, 391304, 371358, 324233, 255552, 174026, 105649, 115344, 100819, 76997, 77123, 106399, 58420, 18857, 11804, 40724, 63058, 94544, 125517, 151635, 216616, 242873, 277769, 318673, 391520, 447991, 358895, 272898, 238344, 201174, 111166, 88535, 114626, 93610, 162387, 200665, 136405, 94538, 67346, 72559, 83688, 117384, 67115, 19100, 41659, 64918, 59569, 25705, 40876, 78742, 103423, 96386, 42486, 41180, 58695, 39829, 42660, 51843, 33444, 6975, 10168, -7501, -26802, -46022, -29436, -36280, 230, 31133, -17091, -26756, 30997, 68396]
17217F8396j9919K6606l5218r1801k2523M3281o852L902m820L1528j9456K85M3163
17204A6572k8398k3332L525M3300o6898P276N0449L5350L4157l6255j9423J0162
17192B6485Q554O790o026j0542L2719J2116n3340m6070R644K5795L063K2875m2063
17179a0000q948M7868L4179j5440k3349l1315K477P041k3773L036j468j4642k3398
17166e7732K4537L626n1937o408M5802J4362J1224K2605k6898K9754K7395K485
17154C8815n2273l7163o0073P240M5771j9791N238N9461N9684j9636J125J9640
17142D8038L340k4433m4449L1678l5038j6735M2463Q601j9725l0462O662J6281
17130a3779j6485N2487j1183o3480j8717J7740p312l3506M6189K0405k262j0571
$$ y = [68396, 48477, 75083, 39865, -51936, -74459, -31178, -38030, -34128, -38948, -7420, -26876, -26591, 16572, -11826, -35158, -31633, 11667, -55231, -47955, 2494, 37844, 72001, 35746, 16323, 26485, 35039, 41829, 35803, 25261, 57980, 70096, 16756, -29314, -19670, 6125, 9188, 32063, -10000, -18948, 28920, 63099, 47659, 24310, -7005, -4528, 2513, -21260, -18224, -19692, -34334, -57732, -33195, -29569, -81506, -87914, -42112, -27750, -16526, 6079, -20819, 8935, 36330, 38815, -13458, -50621, -110694, -103454, -57683, -77474, -72236, -12775, 46909, 27273, 28398, 48038, 51378, 26945, -17504, 14174, -20864, -37599, 4864, 13465, -6260, -36722, -30060, -13779, -30264, 22223, 11040, -52440, -71157, -53417, -60729, -94235, -48046, -27641, -29903, -40474]
17118d0474K3152Q509L3220q971k591K656m0235l0328J8075p202n6419L8222Q7135
17105B4749K3716l869n1794j7586k6785K6720K0434L002M325L3319J9084o9k2084
17092C3162K0931J6298k7886k7519J5479k8344M9620K4936K3029p7717j6308r861
17080d180L0034R88n3264R428m0504o3233N850M3289m929L5447j8780m2659k7797
17067a30310M5899P4877J0392K2764p040o278Q45o881M6135m2123p916K94R464
17054A0122N565M0263L652k5861K078m2799m7013n993K9529o811K600L1343o398
17041i723J6022L8948k1272k4040L7328O0947j5807m7509m0195K4169J1399p2401
17029d2134n2341N6966L2668J775O337p15L9222M16l9737k0055K542O219L4073
$$ y = [-40474, -17322, -8813, 24407, 15436, 12845, 15501, -24734, -55062, -36987, -44189, -100608, -62386, 24749, 48465, 44596, -7198, -24784, -51569, -24849, -4415, -1413, 2912, 36231, 55315, 55246, 33162, 54093, 70391, 42505, 14986, 30465, 2121, 51741, 76677, 99706, 21989, 5681, -4180, 25854, 26842, -26422, -16994, -57498, -120731, -114881, -71592, -76521, -41074, -59854, -102513, -130310, -84411, -9534, 858, 23622, 16582, 10304, 11149, 4268, 50403, 8280, 364, 658, 10122, 15687, 55950, 59602, 33741, 35819, -6980, -53993, -59986, -30457, -37268, -34668, -3325, -9723, 6299, 45247, 23975, -65, 37263, 98210, 82403, 34894, -5301, 18868, 30267, -42134, -94475, -37509, -4841, -3066, 3271, 2556, 41778, 42194, 2457, -17598, -15056, -8837, 25236]
17016B5236L532j6049j3162o8166m0202L6289M7522o569r660M2645R364n764q633
17003c617N0353n6193j8121K0749m087j735r8J6732k6919l702M5694N140m307
16990A9889m3915L080P054j3639P1205j6816k1448p0271j3810l6447K0790j4212
16978a08540K1109O1154n2768J509K1974q889N1298J1825k293l2197j9794q282
16966f3894m9282l888Q2009N8159k4168p369p833N74L6130O0885J9273o993J055
16953I4658j2775J629j7939j4736o667j1679R441L9287m839o368K846j118o1391
16940A0349m430K4047m8681l4719O744k1758K7165M2400J8583l5265k2112k8349
16928f6026j6172l2370j1909M4131r977k3244j0046K1877J6872L3367K4456N1588
$$ y = [25236, 28768, 12719, -443, -68609, -108811, -72522, -25000, -31569, -41229, 1416, 10780, 5016, -3617, 46736, -9457, -27578, -6829, -10916, -12651, -12749, 3983, -22936, -26638, 19056, 24196, 19889, -24026, -20946, -13892, -27531, 43674, 26858, 5410, -64861, -78671, -115118, -94328, -108540, -87431, -26277, -79045, -77536, -55562, -64451, -13153, -1328, -3621, -35818, -55612, -63894, -113176, -117064, -35055, 23104, -1064, -8433, -16266, -15692, 20438, 81323, 100596, 93603, 94658, 81883, 83512, 65573, 50837, 44170, 32491, 41932, 81219, 76380, 70012, 72858, 71740, 10349, 5919, 29966, -18715, -53434, -46690, -68448, -41283, 1117, 19700, -15565, -37677, -66026, -82198, -114568, -126477, -82346, -92323, -115567, -125613, -103736, -86864, -53497, -29041, 22547]
16916B2547J9870p1344j3636K2066J62o029M2186L9558n9158l8476K6316L7099
16904B1161j1711K8417J5554L711L486k1227O349L715n5027m0513j5173j8607
16892g9865K8738j6564l844j3331J8037l0063J315Q1237K0925m0342k3304l1019
16880h8080l3119O1147N8878M2129j3959K244l2407p4599l0327J7650p282j4423
16868a12148K8340P5259J5167m0292K3292K0111o8222l7782j7939L5841L7892
16857d0481J7K9254j7037k4138k7829R095M8258K9300l1265k8639P584O181l2933
16844g2633J01745O0131m9883l4363m1092M117K2583n204j8289K7016r811q015
16832b3698N4519N2809M781j2696m0110j3104k2155m0003N0940J2845l4260n5605
$$ y = [22547, 42417, -28927, -42563, -20497, -20335, -26364, 15822, 55380, -3778, -42254, -15938, 21161, 9450, 37867, 53421, 57132, 60618, 39391, 45740, 49455, -5572, -46085, -61258, -79865, -51127, -67691, -71535, -84866, -66829, -96892, -95577, -14340, 6585, -33757, -57061, -88080, -121199, -60052, -1174, 40955, 26996, 29240, -3167, -77766, -108093, -90443, -97725, -112148, -83808, -8549, 6618, -33674, -10382, 9729, -58493, -96275, -114214, -78373, -40481, -40464, -11210, -28247, -52385, -80214, -71119, -22861, 6439, -24826, -53465, -45881, -39700, -72633, 29112, 89243, 39360, 4997, -36095, -31978, -9395, -14599, -32888, -5872, -15683, -23698, 30821, 83630, 88411, 75715, 35605, 22501, 346, -39657, 11283, 24128, -10132, -65737]
16820f5737k2091K1943Q6782q866j2471l4849K16L6852j7185l8505k0029J7441
16808e6499J1594j7317m1658Q574l239l4437j2090R01N9906J3357P9552J0624
16796A9268j06672j01065j3578O2862L5665K7876K0761l7168M4531K5343m0088
16785f2265q201R045j98o430J9127P3740L1381m8793J751j2379N191K356J4100
16772A8425k141r597m1016K6042k4251q121m129J6091N457n175N5980J9696o6504
16759a9243j9224J1607j2347k1888m159k9559j2103P7630P6573J9608m3530k0811
16747B554k1919J8608K132j1218j8938n9868M1939K9288p840m045k4343l3750
16735h7400M5865K8312M603q873n5845k3167J70N2466L4549K0289L4459J4797
$$ y = [-65737, -87828, -65885, 20897, 12031, -440, -35289, -35073, 1779, -15406, -53911, -73940, -56499, -44905, -62222, -103880, -95306, -98545, -132982, -145072, -144171, -84265, -70908, 8644, 19268, -87404, -188469, -202047, -139185, -103520, -75644, -54883, -92051, -47520, -22177, -62265, -70466, -61421, -61619, -68049, -48922, 24818, 56199, 7406, 9157, -3222, 1969, 4325, 18425, 16284, 6687, -34329, -8287, -32538, -40659, -44788, -28697, -23240, -28415, 27565, 47261, -19243, -38467, -26860, -39207, -61095, -65254, -94813, -106916, -29286, 47287, 66895, 23365, 2554, -19365, -757, 1375, -9843, -28781, -88649, -46710, -17422, -25262, -29307, -53650, -87400, -41535, -13223, -8620, -17493, -73338, -96505, -96335, -43869, -9320, 10969, 45428, 60225]
16723F0225o092q8642l6205K1712J6976m2158j4629L5941M3337K5834o9094k3216
16711g6011N5469j2927k4787J4271M4385N748K0672k7122J3597L601k849n4365
16699d0318k6026M1099L4389k1721L3087K957k8539l4615n737m5880l211M5116
16687d9399M6199K0027r947Q071J1534o5738j7479j3536l19K7552P399K7776J6047
16674H187m5242j4342J7479J4013P4521M6380n090l4911l8662N413M8562o763
16662F9545l4527l9617m1343m592o230m634L0540P333k0889L807M7264K8516J3621
16649D8794l9483l9048j8182k0345J2098J7431K8753j9079j0741j7197k6923L5885
16637d8037N9111k4243k4818J4813P1269j3563m3750N6419j4714k7250K268N1826
$$ y = [60225, 54133, -34509, -70714, -49002, -32026, -74184, -88813, -52872, -9535, 16299, -52795, -76011, -20542, -33469, -58256, -43985, 400, 6148, 26820, -302, 13295, 16896, 14047, -40318, -66344, -25245, 9144, -12577, 20510, 23467, -5072, -39687, -45424, -91304, -94515, -49399, -3200, 16827, 6880, 14951, 26485, -39253, -56732, -70268, -70587, -43035, -35636, -7860, 8187, -37055, -51397, -33918, -19905, 54616, 100996, 95906, 60995, 22333, 27746, 76308, 69545, 35018, -4599, -45942, -50534, -56764, -61398, -30858, -23525, -44414, -40607, 6657, 35173, 48794, 9311, -29737, -47919, -68264, -56166, -38735, -9982, -29061, -39802, -56999, -83922, -48037, 11074, -13169, -37987, -23174, 48095, 34532, -9218, 47201, 32487, 5237, 7505, 59331]
16625E9331J9584m9841k9276p409k9971k9679l0888R009j1035L2026L8431m4257
16613g3975M995m9215k3621P2712M1682J1096j4940k398K1325k1819l7146j4075
16601h5379L5921R064L0033K2084l2799p772Q830J1250k1159n727P566M1013J5841
16588B8766k7746o1086j0969N4393J515m4368N596O2108K3894J0715l9754J4892
16576A7956j4452o8419M0346N0487N0971k5340k8544Q195j3763K7207n948k1074
16564A7622q8308k7808M9804N7361J5003M987n5832j4282K7335l6347m1722n31
16552i2718L0106L395k908j2941L4328M7632j9157M095O2161K1912r785m9095
16540A7025J7576j7663m3312l1659L5538L7469o384J4875l8363l7085M1783k8147
$$ y = [59331, 78915, 29074, -202, -7611, -37582, -67261, -98149, -89140, -100175, -68149, -29718, -73975, -68980, -118195, -141816, -69104, -27422, -16326, -31266, -33664, -12339, -34158, -71304, -85379, -49458, -40394, -10361, 11723, -21076, -28848, -20018, -8768, -29927, -35654, -28088, 12925, 28766, 1020, -60066, -71035, -16642, -15127, -59495, -53899, 8209, 32103, 42818, 3064, 17956, 3504, -64915, -24569, 25918, 76889, 51549, 23005, 31200, 17437, 44644, 38696, 17622, -70686, -98494, -48690, 8671, 23674, 28661, -27171, -41453, -14118, -50465, -92187, -92718, -62612, -59217, -62125, -75066, -40738, 6894, -12263, -8168, 53993, 75905, 66120, 17025, 34601, 16938, -26374, -58033, -22495, 14974, 8590, 23465, -14898, -51983, -10200, -38347]
16528c8347k1628M6910L7954m228k9716j2706L925m4449n0757J2922j8190M3684
16516g4626L2938K1595J0761J9852L6355m6250q378K1650M496k9484j8213J6898
16504a2406r46j6812N4849r532o5013m844m85n439K3235p008P3478j9263o2466
16491e2652J13576M0073j9935o5723p5069R459M0067J0079J954j6785l0968K9282
16479a6642j7106N2827Q5720k0329r6767m068j2149K2513L5398R729j9807n6303
16467c6984k4189K4971N9941J585N817n3979k4551j8258k3673N3337O504q542
16455c8021J5691l44M3479o300l6599m5328k2523M1110M8243K1312n623k3814
16443h717P343k4178l0848M6438N9964j1031l577K5660Q59k2613K7732j9853k3006
$$ y = [-38347, -59975, -13065, 24889, 20661, -9055, -21761, -17836, -62285, -113042, -100120, -118310, -74626, -41688, -20093, -9332, 10520, 46875, 625, -7753, 13897, 18393, -11091, -29304, -12406, -13352, -30164, 24685, 15153, -49860, -54704, -55189, -60628, -37393, -44401, 29077, 9814, -52652, 60924, 100997, 81062, 15339, -59730, -50271, -10204, -125, 1829, -14956, -45924, -16642, -33748, 19079, 104799, 84470, -12297, -16365, -28514, -6001, 29397, 39126, 19319, -36984, -61173, -36202, 23739, 25324, 31141, -22838, -47389, -65647, -89320, -35983, -29479, -38021, -22330, -22674, 20805, 14505, -22094, -67422, -89945, -48835, -592, 20720, 15097, -8717, -1374, -25552, -56400, -9962, 50002, 38971, 35394, 61054, 61913, 39300, 67032, 47179, 24173]
16430B4173K1746n526n5601p3347k1291K0757O8009L9695l5590j7665L5080Q349
16418H789L7315p206J2185k787l6146K4118K2537K9060K7277m9097m0323p893
16406A7829N5228j809l6052n3859k5007l404m672K193K2462J5470k7777J3496
16394b5902P1396L1268p8541j471n3106j1695l723K5174m164L3707L8694l5373
16382a3736J816J5266M8879k823l6128m8522Q658K1129r837J8897j6386p843L165
16369a7465K2417L4930k4291n7905R744Q6602M1113J4826k8295o828j2507j6638
16357D5703r540L6218o8529r3308K5976M5565O5727J1688l9841l7646n0422L4093
16345c4316J1189o288K3459R271J627p4428l1102L3614J2854R787L0657j5136
$$ y = [24173, 45919, 40393, -15208, -88555, -109846, -89089, -21080, 18615, -16975, -34640, 440, 8789, 46104, 38898, 51083, 48296, 12150, 36268, 58805, 87865, 115142, 66045, 25722, 17829, 73057, 71248, 35196, -18663, -43670, -47074, -51746, -49553, -27091, -11621, -39398, -25902, 45494, 76762, -1779, -3250, -56356, -68051, -71774, -46600, -50764, -17057, 21637, -13736, -11920, 3346, 52225, 49402, 13274, -35248, -26590, -5461, -15298, 3599, -12787, -20630, -17465, 4952, 39882, 15591, -42314, -32570, 54032, 95145, 109971, 81676, 74848, 62341, 45703, 36163, 72381, 3852, -89456, -63480, -17915, 47812, 59500, 19659, -17987, -68409, -34316, -23127, -29415, -5956, 3315, 4942, -69486, -100588, -66974, -54120, -44333, -13676, -28812]
16333b8812l6902l399J0648J3178o459K646L8752O7654j2423l7282O529j5693
16321a563p959o842l32k550J970K5524n4156N01j4258m675L2950K240l3835L3609
16307b9376J4995k4595k0946L4229P174P271J7772l9505K308L442l859j1018j9881
16294f1989N4676l7355m4645K0490L5917r2L5609J7726n485L1872m827p7859N1902
16281A5940N2359l0014n6117K5101N844k8875o4485k2151J7700M0481k338m5873
16269i2428M5439K4765n9712R199R1166N0336M171k4581j7657L1402n1699r0814
16257h0413j9878K1371j8660K3474L1335l225m7081J3812J0794J7916j254q756
16245f0565m1801M4129Q4089j9670l5806j6192J2913l7334k2525P8530L3798J979
$$ y = [-28812, -65714, -69113, -58465, -45287, -51746, -49100, -10348, 57306, 44883, 7601, 14130, -1563, -9522, -16364, -16696, -19246, -17276, 8248, -45908, -45407, -59665, -64340, -31390, -29150, -62985, -29376, -14381, -38976, -59922, -25693, -18519, -11248, 6524, -32981, -30673, -27231, -31090, -42108, -61989, -7313, -44668, -89313, -68823, -32906, -32998, 2611, 20337, 14852, 46724, 41897, -35962, 15940, 68299, 38285, -17832, 7269, 13113, -15762, -80247, -102398, -84698, -44217, -46555, -92428, -46989, -22224, -81936, -72737, 18429, 68765, 72936, 48355, 30698, 62100, 10401, -80413, -100291, -78920, -97580, -74106, -42771, -45996, -93077, -79265, -68471, -50555, -51809, -60565, -102366, -58237, 25852, 6182, -29624, -45816, -32903, -70237, -92762, -14232, 19566, 21545]
16233B1545L4568m021m3152m4623j2325K2871j0529L0598N136L1962l2533L293
16221B790j6011n7386J4509J0634l8757p2661k5928J1394P0626K4453O1978N0309
16209C5950P843l0406l6931j2667J3324q0549k4677k4152J9615J9704M3332M9993
16197a9621M2035L6350m5756k3611n408K4693l7906k1032K5951M9170J1352l8469
16185b252N128o43o947L510R992L5983k9202K1956j2392j7564K3503j7260l9969
16172b6157k3558Q023K6862L7344J4224j8195p5860m4890N2467N2168M7777n8915
16160h710m5006l9848j142k6598L2749P6786l298M5810k4028k99N472J6833L590
16147C2311L2729J649j5780o3933p294L4877l3900J3573m46J654L9494k0447k7421
$$ y = [21545, 56113, 52092, 8940, -35683, -48008, -25137, -35666, -5068, 68, 32030, -503, 2790, -13221, -70607, -56098, -45464, -84221, -156882, -182810, -171416, -100790, -76337, -14359, 35950, 43793, 13387, -23544, -36211, -22887, -103436, -128113, -152265, -132650, -112946, -69614, -19621, 22414, 58764, 13008, -10603, -16011, 8682, -29224, -50256, -24305, 24865, 36217, -2252, 2876, 2233, -4714, -1204, 8788, 44771, 15569, 37525, 25133, 7569, 31072, 13812, -26157, -49715, -41692, -14830, 22514, 36738, 18543, -57317, -102207, -49740, 2428, 50205, -8710, -53716, -93564, -94706, -121304, -88555, -11769, -15067, 30743, 6715, 6416, 11888, 28721, 32311, 65040, 66689, 50909, -13024, -20318, 14559, -19341, -5768, -6214, -4560, 34934, 14487, -12934]
16134a2934l8030L6894J3004k5505O3744j2083k9011k5840L1735L4110J5118l3227
16122A7975l8549q2138J3968P576j2253K0336l9416k600m186M3167k3914Q030
16110i2004K2896N0665l521p258k2409r218r811l6188J6173L1001N7606j3608
16098a5676M605M3552j1115K4549k62K255J7643l153L808M4822k9909j4093n224
16085F1802l6691j5376m3300k9394l487m763k5883N5215j1379j6427J9384Q956
16073d1343Q649K2289M7826J0396l1734n0456j3847M927M5140m498j2266L0732
16061A5815r580J0028l8210k8931O171K6552M7195K2001N79j5149j2949P4479
16049I8001k6485r0890o075J2550m7007o5625M0252N4830J5232m9256L4422r874
$$ y = [-12934, -50964, -14070, -1066, -26571, 37173, 25090, -3921, -29761, 1974, 36084, 51202, 17975, -20574, -102712, -88744, -81168, -93421, -73085, -112501, -115101, -119287, -76120, -100034, -92004, -69108, -18443, -21964, -29222, -51631, -60849, -70660, -106848, -90675, -59674, -2068, -15676, -11071, 32481, 21366, 45915, 45653, 47908, 65551, 62398, 66206, 111028, 81119, 67026, 61802, 25111, 9735, -33565, -62959, -66446, -71209, -97092, -41877, -53256, -69683, -50299, -41343, -32694, -10405, 37421, 47817, 16083, -34373, -48220, -43293, 1847, -2651, -14917, 15815, 6235, 16263, -21947, -50878, -44707, -18155, 29040, 51041, 51620, 36471, 23522, 98001, 71516, -19374, -25449, -12899, -59906, -125531, -85279, -30449, -15217, -64473, -30051, -39925]
16037c9925k6089K5822R536m926N756J8879k5503j6088M4381J1906M9759L6625
16025I0133K0747Q873m8883m5322l700M3386n7286m816O027l4813l0647j6232
16013g2533j2756l4873K7861J7842J1925N1727K3804J4781J8002N146k9923K4270
16001D5273K160k3555o6481m2988m7131k1649O8460l8316k6595O6407M5033l3804
15989g3186j4850J3061q341j2221K811p015K2634L3842M2897k0886n5831j6603
15977i3688J3710N8491M5058J497j5001m0135l981p210L4152N5125L1656l4275
15965D5399o4537m0050k4723o98M797j6109k555Q605J8668J5584k3153M023M1225
15952c3524N1401J3738N12j3538K0660l7789m3031K1180j7522j0287O841J2887
$$ y = [-39925, -66014, -40192, -30656, -35582, -29826, -10947, -36450, -52538, -8157, 3749, 53508, 90133, 110880, 119753, 70870, 25548, 21848, 65234, 7948, 3132, 9159, -25654, -56301, -72533, -85289, -120162, -92301, -74459, -62534, -10807, 12997, 27778, 45780, 50926, 21003, 45273, 47433, 23878, -42603, -85591, -132722, -154371, -85911, -124227, -150822, -84415, -39382, -73186, -88036, -74975, -83316, -95537, -92726, -99741, -77107, -43265, -368, -21254, -77085, -93688, -79978, -21487, 23571, 25068, 10067, -30068, -34049, -41259, -7107, 48018, 79674, 45399, -19138, -59188, -83911, -84609, -79812, -95921, -98476, -89871, -71203, -55619, -78772, -74749, -33524, 17877, 31615, 32127, 18589, 39249, 1460, -41571, -20391, -37913, -48200, -41359, -28472]
15940b8472P918j891J0370q028L1062L5197j5275m1979l4563O0261J9591m0717
15928f526k7883J5640n3825l1396K4458J8224N1269M2648P261j1985j0288j7330
15916B67K625M6116m1123J5642N657n6293o831K2708k0660j1235l975j4626L0036
15903c1692J6997q13j4538M7421L187L1715m337l3265o4249m3006J9247R8284
15891B4951J4662l8420q525K7689M5332n848q0264l8423K7828J0749k9982j9113
15879f9364j5481k0062M192L9304M3737r046L2615L97k2244P800P1108K0832p0359
15866A3429p1484J7280N9449J03309J5311L356k4898n0703k4003j6344k1026J5285
15854A8961L1525k1037l4828M290N4742l0963m0460L7459L247p6881k5064J3686
$$ y = [-28472, -20554, -22445, -12075, -20103, 10959, 46156, 30881, -11098, -45661, 14600, 34191, -6526, -34409, -18769, -72594, -103990, -79532, -61308, -10039, 32609, 39870, 27885, 17597, 267, 2892, 49008, 7885, 23527, 29184, -27109, -33940, -11232, -31892, -43127, -47102, -61728, -31692, -14695, -15508, -30046, 17375, 20562, 52277, 47940, 14675, -49574, -92580, -73333, 24951, 39613, 1193, -7332, 20357, 65689, 59841, -20423, -58846, -31018, -20269, -50251, -69364, -84845, -104907, -100715, -61411, -17674, -26720, 5895, 6292, -15952, -8152, 62956, 83788, 13429, -58055, -40775, 18674, 121983, 137294, 140650, 115752, 65049, 41046, 24702, 3676, 18961, 50486, 29449, -5379, -1089, 53653, 22690, -17770, 19689, 22936, -53945, -79009, -65323]
15842f5323P0288L6697j0007K6279P443Q061m9618k3067o3967j8808j310K7178
15830e6154K666R5246P6225m2918k9332n8435k8594L7627K3994K9954m4152l2155
15818b6028L4637p919o5050o0166K6359M4496l610j3118m691M580K2476L6926
15806a1108J6019J2596L929L8132K2373J932n5592k9441L0711R191M402M4024
15794H7168O5507n980o4854j05706p8530M535M4232L8725o1102o574M9827N1853
15782A9101k2542l2545j1008m77J06033J494m4387r516p223M4747m3569m5512
15770d5404j6298K3594K406m859j6320K8511K1038o663m1818k1778o916J2774
15758g1733K1075L1888K9042l0643j298K343m7686O477P489N5330K6794L7094
$$ y = [-65323, 4965, 41662, 31655, 57934, 65377, 73438, 23820, 753, -63214, -82022, -83332, -56154, -53488, 41758, 117983, 75065, 45733, -12702, -41296, -3669, 20325, 50279, 6127, -26028, 8609, 690, -64360, -124526, -98167, -53671, -57281, -70399, -75090, -70510, -48034, -11108, 4911, 17507, 21436, 59568, 81941, 83873, 28281, -1160, 29551, 38742, 43144, 87168, 152675, 146695, 81841, -23865, -102395, -97860, -53628, -14903, -76005, -82579, -32752, 19101, -3441, -35986, -46994, -47471, 58562, 60056, 15669, 6153, -1070, 43677, 108, -45404, -61702, -38108, -35702, -40561, -56881, -28370, -7332, -13995, -55813, -77591, -84507, -71733, -50658, -18770, 10272, -20371, -21669, -19326, -67012, -60535, -53046, 2284, 29078, 66172]
15746F6172j9706j14065j8441J8574J5673k5135p09N1445j1037n2429L8122O9880
15734A8344l3911O011j5396O212M441N2973n487K5807J7903j173o927k2278P284
15721E3803k4635l7988l8465K5913P3982L3478r3278k6094J5962k1337J2447o3533
15709h9745Q7993P5667J7864l1569M9275k571m8333j1833m9907L70n6684J6723
15697d2750p863k5954j6333J7118Q621j1816O5471K9631O773P1881j4963j9891
15685E9925m9338P752o208n15K806J433J470o8481k6935M7581J6433O2530K6686
15672G5139k6523o145K2160J2556m1749q865q872Q958J2375n3815n3264K0596
15660d7449p4784K1536P5097N9820O3942m6457o4727J6736q558k3163N5207M3720
$$ y = [66172, 46466, -67599, -86040, -67466, -51793, -76928, -77637, -26192, -37229, -89658, -51536, 18344, -15567, -9556, -24952, -18740, -14299, 38674, 33187, 58994, 76897, 75724, 68797, 46519, 53803, 29168, -8820, -47285, -21372, 52610, 86088, -7190, -33284, -17322, -38659, -26212, -89745, -1752, 73915, 91779, 60210, 109485, 106914, 58581, 46748, -3159, -2789, -59473, -42750, -50613, -76567, -92900, -75782, -67161, -78977, -13506, 16125, 22898, 94779, 79816, 59925, 10587, 18339, 12131, 11616, 14422, 15855, 17325, -51156, -78091, -30510, -14077, 48453, 75139, 48616, 42471, 64631, 77187, 35438, 26573, 17701, 26659, 39034, -14781, -68045, -47449, -122233, -100697, -25600, 34220, 98162, 51705, -13022, 3714, -4844, -28007, 27200, 70920]
15648G0920j8216l2882n475O5088k1085j1950J4651l964N1590M883k2750m5137
15636D5673m3249m2584j8715N7143k1204L7526L0864o0993k3168L4534K4677R685
15624C0189L471m1398O320n3308K4313J3731o775K7658j959l3455j4932o043Q648
15611d3540J9364J6262J5776q963q348P687K8877M7906j3817o6024o6484J8353
15599e2951Q4763J7299L712l3540l9639k137j7100P48L5401J9648l349J1024L1932
15586E5811L6339m5034o2403j1599j0976J2017m1089k9764M5155k0779p139M0099
15574c9362J9752j1721J0862M368k4808m666L132J3894K3223l0970n0589q54M3891
15561d3848N1043K6862K739j517j4045L6670N7249M1997q9331j06995J367J8648
$$ y = [70920, 52704, 19822, 14347, 79435, 58350, 46400, 61051, 57087, 108677, 113560, 90810, 45673, 2424, -40160, -58875, -1732, -22936, 14590, 45454, -15539, -38707, -4173, 20504, 30189, 33660, -7738, -1418, -54726, -30413, -16682, -23457, 4201, 2242, -31213, -46145, -52188, -43540, -24176, -7914, 7862, -1101, -9449, -1762, 27115, 75021, 61204, -4820, -71304, -52951, 31812, 49111, 52823, 19283, -20356, -22493, -39593, -38845, -3444, 16204, 12855, 23879, 55811, 92150, 47116, -15287, -26886, -37862, -25845, -66934, -96698, -51543, -72322, -79461, -39362, -19610, -31331, -20469, -16101, -40909, -45575, -42443, -28549, -5326, -36296, -86885, -87739, -43848, 7195, 34057, 36796, 35279, 21234, 57904, 115153, 157150, 67819, -39176, -37809, -19161]
15549a9161R64m7483K9790j540o2387Q572Q8566O4773l4469n491j5739l111O684
15536I968k693l4457m0012l19L5835N2952l7459l7116l3908j5601m005m576L1473
15523g9918M2393N7006O693o7434m452M8101j1395j7369k0593r410j6010o068
15511g8456j623j2712k4872j4637K0417O220r930n702L8299N0793L6622k6196
15499b1777K8828N01l3160l1760r890l4154k1073J7714M1583m807M6O6120J7428
15486A5599L1468L5462j3066m0889R386Q622n3402n764N8226K2288k4354j3938
15474B9638Q435m970q2779j2590L7818P8187j3933j0054j2814r902p116j8093
15462a8173j7374k6240M7612P5374L3208m0332l1173N273j3046j3586j1334n3282
$$ y = [-19161, -18197, -65680, -35890, -37430, -99817, -91245, -2679, 62094, 27625, 22134, 6395, 3284, 9968, 7275, -27182, -67194, -67513, -31678, 21274, -16185, -53301, -87209, -102810, -106815, -111391, -79918, -37525, 19481, 26174, -41260, -45712, 2389, -9006, -26375, -46968, -56378, -72388, -78456, -80079, -92791, -117663, -132300, -111883, -105663, -115593, -121295, -82996, -32203, 4419, -21777, 7051, 7552, -25608, -57368, -67258, -101412, -122485, -104771, -63188, -67995, -67949, -1829, 15599, 47067, 82529, 69463, 28574, 37960, 46582, -6820, -12584, 45642, 67930, 43576, 29638, 38073, 33103, -49676, -62266, -24448, 53739, 39806, 29752, 16938, 7036, -80, -18173, -35547, -61787, -14175, 61199, 94407, 54075, 22902, 28175, 15129, 1543, -9791, -63073]
15450f3073m868N7512m0092M571J8014m582M7696L0883M73j5205j7515o4919l2984
15437h4089j7398l1385n2221J7808L0114K3814K4004k5174L3209O5372k5339L964
15425c7321k9558O002M7825O0582K2306J64r2536n7893k6937M448J6795M8203
15413c7920N5320n989k3681l5358k7779l7295M0852l2288p435p204K381J1172
15401a05224l95O4025j149k2319M5878k8962k2969J3241P6209K8665l228O360
15389E0132n7531o3672L4001J2331J5131j4996l5535r523k7241O451k8846K3226
15377i6072P502n2332J7641K9338K4747k2697L5186m6211j66k1350N8996N6542
15365h876N1125O382j5766j7986o986L421l4683k8595l1129p038M2874J3972L531
$$ y = [-63073, -67941, -10429, -50521, -45950, -27936, -32518, 15178, 46061, 46534, 31329, 13814, -51105, -84089, -101487, -132872, -185093, -167285, -137171, -113357, -89353, -114527, -81318, -15946, -41285, -37321, -66879, -60877, -13052, 47530, 69836, 70000, -22536, -80429, -107366, -102918, -86123, -37920, 17400, 11411, -12270, -47628, -75407, -112702, -71850, -104138, -111573, -118777, -116396, -105224, -105619, -41594, -42743, -65062, -19184, -48146, -71115, -57874, 18335, 47000, 43772, 50132, -7399, -71071, -37070, -24739, -9608, -24604, -60139, -69662, -96903, -90452, -119298, -96072, -88570, -140902, -123261, -93923, -69176, -91873, -56687, -102898, -103064, -124414, -65418, -8876, 42249, 48631, 32865, 14879, 7893, 11314, -23369, -51964, -83093, -90131, -47257, -33285, -29754]
15352b9754q505m0101L6113N681j7484k4245K8703O8513K5749m4670j2984k642
15340a5626l293K8731J4497p7934j1874J7627L1846j0388J2000J1003L2944q904
15328B0629k2821j2617m0205J7235J7591L3082O2548N111O955M173L317j5863
15316G9135o5222m7981L3895j382k3233k8006L9615j5342l3311j9616L8275Q832
15304c4341R275L9371K6903M2656K7351j3980k5553q7877n7930J9716M7887N358
15292a164m001P834l7798O0261J4143j7529k0763L1852K6192j9606m0226k1080
15280b1885m1332m793q009R95l5899m4230N6379o4l0193J4532M9778J6438K8646
15267a9637k639K4150l0474k8398J8134r078K7780L7346k0866m8697J6470R2092
$$ y = [-29754, -38259, -78360, -42247, -36566, -54050, -78295, -49592, 18921, 44670, 0, -12984, -15626, -18919, 9812, 24309, -53625, -65499, -47872, -16026, -26414, -14414, -3411, 29533, 20629, -2192, -14809, -55014, -37779, -20188, 12894, 75442, 80553, 87508, 91681, 94998, 79135, 13913, -34068, -173, -1555, -24788, -52794, -13179, -28521, -61832, -81448, -43173, -34341, -25066, 14305, 41208, 83864, 111215, 97235, 71682, -16195, -74125, -54409, -6522, -1164, -5165, 2669, -35129, 25132, 39275, 21746, 983, 32835, 59027, 39421, -805, -21885, -63217, -68010, -76019, -75024, -110923, -155153, -98774, -98838, -129031, -114499, -64721, -48283, -19637, -22276, 1874, -28600, -56998, -38864, -47942, -20162, 17184, -3682, -52379, -35909, 56183]
15255E6183j1014k4073k0576j6348K1943J6002J3837n0486j2970o232j2992k1835
15243f8561l3655K0797M6795j0317j13k7810K9921Q3964K1622m8016O064j4365
15231F326k9094n6332K1777K3287K8901L6083k6484J8615l772L9862m0978k1523
15219c332J5070r523K2038j3191M7335j0854p0206j1834J9166L1943L543J9924
15207D0079j6103M3277L242n1764m2062l346o777j9674q253L9019R4749K680m2563
15194C2504k9532p5016J6478P7295O8880L0225m2382k5969l6030l1500K3192j0264
15182b119l1464n0094K2844K9025K56J5824L1159k8727j2261J2523J1490O9431
15170F7887K7354k2997l1997o1768j3806j8621l7639J8803R2495m394m4407K0710
$$ y = [56183, 45169, 21096, 520, -15828, 6115, 22117, 35954, -14532, -27502, -33734, -46726, -68561, -102216, -81419, -34624, -44941, -45054, -72864, -42943, 41021, 62643, 14627, 20691, 6326, -22768, -79100, -57323, -34036, -5135, 30948, 4464, 23079, 19307, 59169, 18191, -3332, 11738, 2215, 24253, 11062, 58397, 47543, -22663, -34497, -15331, 16612, 20155, 40079, 23976, 67253, 70495, 18731, -23331, -26677, -33454, -53128, -61381, -22362, 72387, 75067, 32504, 2972, -72044, -55566, 21729, 90609, 120834, 78452, 52483, 16453, -15047, 8145, -2119, -33583, -83677, -60833, -31808, -31552, -15728, 15431, -13296, -25557, -13034, -1544, 67887, 95241, 72244, 40247, -21521, -35327, -53948, -91587, -72784, 19711, 15317, -29090, -8380]
15158h380J8405L4855m3205J9786J1543k7381Q071n7513m6966m4564n0642K4788
15146a61203K8689L9963L0123k1862o802K579j315L5760L7017M5124L4157k8178
15134C4052k7799j6112l5496M0466J8320K6085k1630K4497K9546M8350l7120l0200
15122E2959J3019J5275o2135j4727k6852k4302N1782Q807m046J4740L8783K0839
15110H4142m2957p0351n163n1486j3935p45L5245l507K4414j6756r620l8957j186
15097a10862M2222L8198n14N4596L3552r494J3609j5558m870k7435k8843m9001
15085f4400n395P1919M9033O7068p4820l7800L3380K5203l1590j3098N749J6487
15073D1736K6613l7385m8684j2476L0752N630K1843J0332j1696L949L3423l0420
$$ y = [-8380, 10025, 44880, 1675, 21461, 33004, 5623, 13694, -43819, -90785, -135349, -185991, -161203, -132514, -92551, -62428, -84290, -91092, -88513, -89828, -54068, -17051, 28073, 62230, 34052, 6253, -9859, -45355, -4889, 13431, 39516, 17886, 42383, 71929, 120279, 83159, 52959, 65978, 81253, 19118, 4391, -22461, -46763, 5019, 13826, 9780, 24520, 63303, 84142, 41185, -29166, -34329, -85815, -99750, -100495, -65250, -68757, -44343, -61099, -70719, -109676, -110862, -68640, -30442, -30956, 23640, 57192, 47698, 61307, 45749, 40879, 13444, -15399, -64400, -69795, 2124, 51157, 118225, 43405, 5605, 38985, 64188, 32598, 19500, 25249, 41736, 68349, 30964, -17720, -30196, 556, 6186, 28029, 38361, 26665, 30614, 64037, 33617]
15061C3617k1465K4082J308R426J7621m801K0500O1049k2981p3332j8636l1132
15049d744K5075L565l978O757K8274J504J8658j1240k8250l8488j5268K9398P863
15036A9126l1255n6147k5428K1369j9591L9506K4355k7762p750L1685P6013L3922
15024G8043j5287n2080n2718L9480J6104n2181J6855L0895n0340L741K6170j9887
15012c1205l1495j4462N4294J654m1435n526R3135K0324L966J584k5001K9552
15000E5385L2658l4860K742J5146O0952o2030r835m064l4742K6764J1820P271
14988F7207k11m2711k6200P373q086j5999J2846K4011M211n8832J238K3382J07414
14975I5643q298o2595K2838n6467o848J9716L5485m1488n0195M7446J1120k3006
$$ y = [33617, 12152, 36234, 37542, 46968, 64589, 59788, 80288, 141337, 118356, 45024, 26388, -4744, 20331, 23896, 19918, 26675, 54949, 56453, 75111, 63871, 35621, -2867, -18135, 11263, 19126, -12129, -68276, -93704, -72335, -91926, -52420, -28065, -55827, -63577, -31892, 44121, 78043, 62756, 10676, -42042, -2562, 13542, -38639, -21784, 9111, -41229, -37488, -11318, -31205, -62700, -77162, -22868, -21214, -62649, -68175, 24960, 45284, 49250, 50834, 25833, 55385, 88043, 53183, 55925, 71071, 132023, 69993, 60158, 56094, 21352, 48116, 59936, 67207, 66996, 24285, -1915, 5458, -2628, -18627, -5781, 18230, 22441, -36391, -35153, -11771, 95643, 87345, 24750, 47588, -8879, -15727, 3989, 39474, -2014, -52209, -4763, 6357, -16649]
14963a6649J0005P469k0611l7801K3274M3682q562o8721m7740J9031P1224Q407
14951a6992j6654j7533L548J0064N0025K0585M814m5912o1102l4685P6857o545
14939c3530n3218K8601J5638m5811j8949K8424M3608m091J0712J8831J9603K8666
14927C8484k1959R075J4590m3966j2475K6760N6340m4421O782J0259O692P932
14915E4093k215l3312r0447k8878N3860k2209l0522l2942K6118P8540O2836j5185
14903A9737K8406j5619o4797o4192j7353O0984l73J5682L1196P5734k8697k8965
14891A1743k9060M2594J1631j9232O4959m2178p2024j6217M3756K7975N577J589
14879C1113l7229l5804L566m66P1978Q3605P3924m0874q7907p5447q718l822L2224
$$ y = [-16649, -6644, 825, -19786, -57587, -34313, 9369, 807, -67914, -115654, -96623, -25399, -16992, -33646, -51179, -47631, -37567, 12458, 33043, 37857, -8055, -69157, -103842, -26985, -33530, -86748, -58147, -42509, -88320, -107269, -78845, -35237, -39328, -28616, -9785, 9818, 38484, 16525, 25600, 40190, -3776, -16251, 10509, 66849, 22428, 29210, 39469, 46161, 54093, 51878, 18566, -71881, -100759, -46899, -69108, -99630, -132572, -106454, -27914, 34922, 19737, 48143, 32524, -32273, -96465, -113818, -52834, -53207, -37525, -6329, 69405, 40708, 11743, -17317, 25277, 36908, 17676, 82635, 40457, -31567, -47784, -4028, 23947, 29524, 31113, -6116, -41920, -38354, -38820, 33158, 116763, 190687, 149813, 61906, -13541, -22259, -26081, 6143]
14866F143p890J0557L9259N902L355o559m8935k683m6408K0557L8850Q666l408
14853A7406k2852j2511j567k7845m23k6354K8881Q991n8608L584O4461j4812J543
14840d0106j2416j9660l167M8174q650m8918J1200M7394L4203j3296q8200k8274
14828a21716J1990M4637M8434l1516k5013M2290P1798j4906K2623J8601K4227
14817I1449l4499q4443k6991K7232K469K5806K1620J1325j9354J7374L41j3939
14805A8390K1640k0715l4888J3010M6718L2983L4327k9038k5736o7628l9123J1270
14793c8790O2739M0647k0303m1911n650J5792M8631j4526l7500k8659n2746m7936
14781a20212n0255J8395Q2893K5863N5222M065K54k1812R959K5901J2729J3779
$$ y = [6143, -1747, 8810, 48069, 53971, 57326, 50767, 1832, -851, -47259, -26702, 12148, 20814, 17406, -5446, -17957, -19524, -47369, -47792, -74146, -45265, -36274, -94882, -91298, -26837, -41649, -40106, -52522, -72182, -75349, -27175, -35825, -84743, -73543, -26149, 8054, -5242, -93442, -121716, -109726, -65089, -16655, -48171, -73184, -30894, 40904, 25998, 48621, 67222, 91449, 56950, -27493, -54484, -27252, -24783, 1023, 22643, 33968, 14614, 31988, 32329, 18390, 40030, 19315, -15573, -2563, 44155, 77138, 111465, 82427, 56691, -10937, -50060, -38790, 23949, 64596, 44293, 2382, -3268, 12524, 61155, 46629, 9129, -19530, -72276, -120212, -170467, -152072, -69179, -43316, 11906, 15971, 16225, -5587, 4372, 30273, 43002, 56781]
14769E6781j4300k0527m0327Q562J3585r528k8361k1050j0969M3427n566m3661
14757g1934J4936J1859k1500k2067L3300K9112K275n1769L8608M9378j7651j3443
14745a8896J9218j3506n4569j3148M3172K5574J2867J4362o617L3670j354n6596
14733a5823J7103k9330j9230K7925J3591J9706n2852l5823l1570L7738M3221R688
14721a5656J347J8390M287m4832k3034M7802Q9057L8223J5203j3337p0584p9444
14709c2578q55N6831l4402k0415j379M6140N751k2202J8429L2488K486O569k7697
14696B9166l3921n1167l8092L0123N2779q356k3476l1368k0593J2392m150K6649
14684f0014J120M021o2927k7753L4191L618l504J0611N76M9074M6804P3256L0202
$$ y = [56781, 42481, 21954, -18373, -9811, 3774, -5754, -34115, -55165, -66134, -22707, -28273, -71934, -56998, -45139, -66639, -88706, -55406, -26294, -24019, -75788, -37180, 12198, -5453, -18896, 322, -13184, -67753, -80901, -37729, -12155, 712, 15074, 8457, 42127, 40773, -15823, 1280, -28050, -47280, -19355, -5764, 13942, -38910, -74733, -106303, -68565, -25344, -15656, -14309, 4081, 8368, -36464, -59498, -11696, 77361, 115584, 130787, 117450, 46866, -32578, -33433, 23398, -11004, -31419, -32798, 13342, 19093, -3109, 15320, 47808, 50294, 56863, 29166, -4755, -55922, -94014, -63891, -11112, -19468, -42944, -74312, -94905, -82513, -86663, -60014, -58894, -54873, -117800, -145553, -111362, -107744, -111248, -100637, -100061, -50987, -4183, 69073, 99275]
14671I9275N988j2607l8405l8300k2227m7209R245M0866N1354L0495N029n81j8683
14658F4240l6175p118M5977k195n9472M618M7708r332n6810k2143M6217M1959
14646E7474Q671m5380J4339j2908J7237K7333J0765Q2k9901n4605l2845K518R1711
14633E4491R6093K1527k4020l3745l5049k8536k4912l2395L2376M2119L873l6233
14621C5589l2322P2096K2506L337j8742l555L7029k3052n2697m0382j2159M7916
14609C5564L4777n9430l7462K7762o252k3369N1254L869Q796L2432M7623k7542
14597H8022l1432J8098K7048R4635l7243j7586j3129m3479l5355L631n105j7835
14585C0270J7428k194L6875K8436l821l0451l6610o134R459J3772N8208M297j3265
$$ y = [99275, 105263, 92656, 54251, 15951, -6276, -53485, -44240, -3374, 47980, 78475, 83504, 82923, 64240, 28065, 20947, 66924, 64729, 5257, 9875, 57583, 48251, -8559, -30702, 15515, 57474, 66145, 20765, 35104, 22196, 39433, 66766, 77531, 77613, 47712, -6893, -39738, -37220, 54491, 150584, 172111, 148091, 114346, 79297, 50761, 25849, -6546, 25830, 67949, 71822, 35589, 3267, 75363, 97869, 101206, 82464, 78909, 115938, 92886, 40189, -193, -12352, 35564, 70341, 10911, -26551, 1211, -5041, -28410, 22844, 26713, 35509, 67941, 115564, 88022, 56590, 74688, 101736, 196371, 159128, 141542, 128413, 84934, 49579, 53210, 48105, 30270, 47698, 45504, 82379, 110815, 106994, 76543, 39933, 33799, 43258, 57030, 115238, 119535, 106270]
14572A06270m3730l8529L0934L8098K717O326m8296m0301L3808N6062l7904m2483
14560B2972J9221p408l5854J6297M951j9364M4409J6222m1877Q56O420N5632K0038
14547A02515O2265k0304j1890n249j4891J1803k5449o7257k3355R924l189k7636
14535a2713k8724l8235k2312M1376K6447K147L0840O570K6234J737M2076n1903
14523B3540l8523K4920J5784M1574K8377l2804n3456J151K5978k4767p7045p5003
14511a40274K9804J23008N1153J4097L1626m3722j1973k0358o6672M2585K7488
14500C6762l4422m8431j7420M8438N1981l8437p829r111j8796J0141J4507J8729
14488F112L520n1200L4072M9699l6805j6603n5031j2388K6347N6587J3349l2189
$$ y = [106270, 62540, 24011, 54945, 93043, 95760, 102086, 53790, 13489, 47297, 103359, 65455, 22972, 42193, 34785, -1069, 15228, 20179, 815, 45224, 61446, 19569, 20425, 26845, 82477, 102515, 164780, 144476, 132586, 127337, 112446, 124249, 98800, 31543, 8188, 18112, 14923, -12713, -41437, -79672, -101984, -60608, -34161, -32014, -1174, 5396, 31630, 33367, 75443, 23540, -14983, 9937, 25721, 67295, 95672, 62868, 9412, 10563, 36541, 11774, -65271, -140274, -110470, 12538, 63691, 77788, 109414, 65692, 53719, 33361, -33311, 9274, 36762, 2340, -46091, -63511, -15073, 36908, -1529, -9358, -18469, -37265, -27124, -12617, 6112, 9632, -41568, -7496, 42203, 5398, -11205, -66236, -78624, -52277, 4310, 17659, -14530]
14476a4530J9954J0081J1921j9332n4544l7433J3682k0971J3146K0058J4382M7121
14464C535j7402l1015J6171k1865L1131M4885K3309j2598J471k68n6334l1244
14452e0224R36Q8236k6940n5587l848N2603r473l4396m7567N0599L3419p391L8566
14439B8933k35K0875n8112j2919L0785K086J4793j74j8188K5186J5923n462n9861
14426a6370n4458k1030L8754L7510k4159N8379O7774k9299k7568K402J0232K5117
14414F7284L8477j5833m5822k413j9021J397j4661O2M1200j1362R04j4809p8985
14401e3582K4548K5673K7960O744k7315M802M3440l544n2728p353L1746J3352
14389C3743k3080k9887K0073N2291k6051l5576O450N5372n40q7036k3146N0081
$$ y = [-14530, 5424, 15505, 27426, 8094, -46450, -83883, -70201, -91172, -78026, -57968, -43586, 3535, -13867, -44882, -28711, -50576, -19445, 25440, 48749, 36151, 37622, 37354, -18980, -50224, -49288, 38948, 12008, -43579, -47427, 5176, -4297, -38693, -86260, -35661, -2242, -9633, 28933, 28698, 49573, -8539, -21458, 9327, 11413, 26206, 26032, 7844, 33030, 48953, 43491, -16370, -70828, -91858, -53104, -15594, -39753, 18626, 86400, 57101, 29533, 31935, 42167, 67284, 105761, 89928, 44106, 41693, 22672, 24069, 9408, 9470, 50670, 39308, 40212, 25403, -53582, -29034, -3361, 24599, 31343, 4028, 8830, 52270, 48726, -4002, -11355, 20391, 33743, 10663, -19224, 849, 53140, 27089, -8487, -2037, 53335, 52795, -34241, -57387, -7306]
14377g306R7662O2798n8407o6667p8690k4251J5959O7054n0385k8711J0944J8489
14365d1511M580J6026J9790J6011j0078m0738j0168L5852J6528l1726M5327P0095
14353H9988l3377j05481J312L306J2214j1721j0123L0968J3431N5353k8786J9368
14341C6452o1611n3886N720k2468L3523J2428O386J3830O436L855M0738M4664
14329F6067j369J8017k503l6348J2103l6136K4165O27P412o5409j4505k847j4399
14316d5125j2726J4179J9164L8700K5623P252k5509N86k288m8141M0405K1094
14304C3214K3886J6603n594l1494k1670j1221J9142O482m0887L288K1556J4019
14292B7324N0782K132o4266m0882m579j1873j926K2383k2532l1426K6108j4251
$$ y = [-7306, 90356, 153154, 94747, 28080, -50610, -74861, -58902, 8152, -42233, -70944, -60000, -41511, -36931, -20905, -1115, 14896, 4818, -35920, -46088, -10236, 6292, -25434, 19893, 89988, 56611, -48870, -47558, -44252, -32038, -43759, -53882, -22914, -9483, 45870, 17084, 36452, -25159, -79045, -73325, -95793, -62270, -49842, -43456, -29626, -23190, -19335, 21403, 66067, 64698, 82715, 80212, 43864, 55967, 19831, 43996, 44623, 52035, -13374, -27879, -30726, -45125, -57851, -43672, -24508, 14192, 39815, 47067, 21558, 22144, 19856, -28285, 12120, 33214, 57100, 73703, 68109, 36615, 14945, 3724, 22866, 29348, -11539, -8251, 13305, 27324, 78106, 80238, 15972, -24910, -29489, -41362, -43288, -20905, -43437, -74863, -48755, -63006]
14280f3006K5883O0365L3098M7923L9129j8215m7790l3728L032j1737n1409J7586
14268A131J9203R084K1355j0462l7414K7410J9065k0074k2337n705K1214k1437
14256A033k2651l0009p052Q576K6322J3470l4638j7293J3887k023J7263J7791
14244a5324P167k0588k1421O0149j0333l3717n2399K3170N8736l1587J4391j964
14232b3720j3065K3548l820M0760L9538l7440R885P73J6332k3098j8379K2037
14220C3351M0145r510j9764m7667J8116M7468j7873n9476k9168l8635K5900M3328
14208a3785J1338J8883j9318l458k1360j2481q705k0378L5388O1322l9813j8525
14196c0892N360K7065O685m3891l7653K5295M1870q110j0489J035J5800M8003
$$ y = [-63006, -37123, 23242, 56340, 104263, 143392, 125177, 77387, 43659, 46691, 34954, -16455, 1131, 20334, 29418, 50773, 40311, 2897, 30307, 49372, 29298, 6961, 1256, 22470, 1033, -21618, -51627, -58679, -50103, -23781, -10311, -44949, -62242, -48355, -50378, -33115, -15324, -8157, -28745, -50166, 9983, -350, -34067, -86466, -63296, -4560, -36147, -21756, -23720, -36785, -13237, -17057, 23703, 63241, 25801, 35686, 36459, 52791, 29693, 11314, 33351, 73496, 63986, 44222, -3445, 14671, 62139, 44266, -15210, -44378, -83013, -57113, -13785, -2447, 16436, -2882, -6340, -27700, -40181, -48886, -69264, -33876, 27446, -12367, -30892, -25532, 1533, 8218, -35673, -73326, -48031, -6161, -14271, -24760, -23725, -7925, 40078]
14184D0078K4061J697K569m059k6850K276l7927o5167M485M6024M471j6910j6070
14171d1322l1787J9441j3461m523R3687L3388o1577l9062K9131L4186K7291J4257
14159E9649k8132l3353J4739q508P511L9694m758P784Q3653L679q9505k3711k752
14146B5990r5717n8361K8954P8474O5478K7489n3340k1711M8726o369m5035m6437
14134e1859J6343O1207k4711L7457K9100j1833j9622J0963N507j934J0129m6451
14122A4296m9369m6258K2742J5039K9306j1107k0701o7805m8555K3414O3460M5071
14110c0467j9181K9209o629K9908p729J0839n4951l6289o861J4634J5234j8677
14098h0960N319J9925R0067N2661r440j00J7104o9769n4516j4918J935K6898M421
$$ y = [40078, 64139, 65836, 68405, 64346, 37496, 39772, 1845, -63322, -58837, -12813, -8342, -25252, -41322, -73109, -53668, -67129, -71652, 22035, 55423, -6154, -45216, -16085, 18101, 45392, 59649, 31517, -1836, 12903, 4395, 11906, 51600, 46842, 54626, 138279, 141958, 52453, 28742, 25990, -69727, -128088, -99134, -20660, 44818, 72307, 18967, -2744, 45982, 39613, -5422, -51859, -35516, 25691, 980, 38437, 67537, 55704, 36082, 47045, 52552, 50618, 60747, 14296, -35073, -81331, -58589, -43550, -14244, -25351, -46052, -113857, -162412, -138998, -75538, -30467, -49648, -20439, -27068, 2840, -4889, 5950, -49001, -85290, -92151, -77517, -62283, -80960, -75641, -55716, 34351, 87012, 77572, 77472, 94576, 24807, -29709, -44627, -42692, -15794, -11373]
14085a1373n841j2071k9064j5210Q134J9485k3029K1272P569M6244m6245k8319
14073f8448K6524M7522k141k1342j0064N18O7751N007o5128o1740m4055l7014
14061a62610L9278P6659L2788m3178k3546l4787O752M8758l5680l6715O9312J2718
14049e0251K1778L1041L2947m4917j2294n4113l2488j9584K1251L0871J4239K7405
14037c4115P284M655O2598K590J2152m3800o3090k6979O0157O5551r909m1357
14025d263J4441L8684k6892r0245p6154O4884Q5583O9606p577l1049j4935J8177
14013D0260K7284p4904m3233M1917K7574m0869m1169k2048n541P6384L5172l9587
14001a8760q946K3138q978N1700J5607k9038K8451o118j9557m1908j4469J6553
$$ y = [-11373, -17214, -29285, -58349, -73559, -65425, -45940, -68969, -47697, -40128, 6116, -40129, -68448, -41924, 5598, 3457, -17885, -27949, -27431, 40320, 45327, -19801, -81541, -125596, -162610, -123332, -46673, -13885, -57063, -80609, -115396, -108644, -59886, -95566, -132281, -62969, -50251, -28473, 2568, 35515, -9402, -21696, -75809, -108297, -127881, -106630, -75759, -61520, -34115, -26831, -22176, 40422, 43012, 55164, 11364, -51726, -78705, -18548, 47003, 37094, -4263, 10178, 48862, 21970, -68275, -144429, -79545, 6038, 75644, 68067, 37018, 22083, 40260, 67544, -7360, -50593, -8676, 18898, -21971, -63140, -85188, -90729, -14345, 20827, -18760, -27706, -4568, -13546, 38154, 53761, 24723, 53174, 47056, 27499, -14409, -28878, -12325]
13989a2325j3570J4594N3323K1560l2273m9339m3188m4908L193L9339j4793J1792
13977f6595M7212k1600l633R670m4517Q315Q1566L0756l9773o7809M6143O8254
13965D7989J5702L1137j7546m7814j6036K531j4821n8991r105n918m4832n248
13953a22952M9571N0521j5680K8501J2099P1812L7492j2822m2560p349K8706r403
13941F7936m9964o19j9393l8578J8001M1971O94M2998J3702o410m4051j338N792
13928C0741k7410J094L6921m1290n2399P965K1385J1746m2094J0280J3991K3615
13916e455J6562K9649K4173M583n8615k2905R448L9361J7307n6373l4832m3186
13904h0283J3088M5932j6901n6912N9420J6743L7312N638o4079l8980L2102M4173
$$ y = [-12325, -25895, -11301, 42022, 63582, 31309, -18030, -61218, -106126, -102933, -63594, -78387, -66595, -19383, -40983, -44616, -34946, -79463, -71148, 10418, 41174, 1401, -66408, -20265, 47989, 63691, 94828, 77282, 29468, 13432, 15963, 1142, -57849, -66954, -72872, -117704, -122952, -73381, -22860, -38540, -10039, 2060, 73872, 111364, 98542, 55982, 48633, 77339, 67936, 17972, 17353, -2040, -40618, -22617, 19354, 20048, 63046, 76748, 70338, 26287, 24949, 30741, 3331, 4425, 41346, 56, -52343, -44378, -22993, -11247, -53341, -43061, -29070, -5455, 11107, 40756, 64929, 69512, 10897, -12008, -2560, 36801, 54108, -2265, -37097, -80283, -67195, -21263, -38164, -95076, -35656, -18913, 18399, 24037, -40042, -79022, -46920, -2747]
13892b747K0578J889Q655j0670n973N0480k9632m6424k0513K5163k9972l3063
13880g2229K0161l0610n782k9253O403M2432L7539K7726k3795o1138K1405l821
13868g0962J5149j427K7541l0534k3645L2344K6580j1544m706J3713m876L1689
13856f78N407k08J9015Q4885J815j06408p4890J2315L3797m0747M76M6348M2790
13843B3917J7504k8918L1513K4624J5150J4259p5373K966k2266o7781m3544J8692
13831h9257o284o0248J5002Q6598L5442k5433J6579l1637n0276r903p895L8280
13819h9032L6087J7731J1950O015k604M6746M4483m6490n6180k9613J2009j4049
13807f2947K4554j4784J5194K2154L0052N8911L430l5392l7711J2116L7314j0513
$$ y = [-2747, 17831, 19720, 28375, 17705, 11732, 62212, 32580, -13844, -34357, -9194, -39166, -72229, -52068, -82678, -88460, -117713, -111310, -68878, -31339, -3613, -27408, -88546, -67141, -70962, -55813, -57240, -29699, -60233, -83878, -51534, -24954, -36498, -41204, -27491, -32367, -678, 4729, 4521, 23536, 108421, 110236, 3828, -71062, -58747, -24950, -65697, -65221, -18873, 23917, 41421, 12503, 44016, 68640, 83790, 98049, 22676, 25642, 3376, -64405, -107949, -89257, -95541, -155789, -140787, -54189, -18747, -44180, -27601, -59238, -109514, -119417, -127312, -89032, -52945, -35214, -23264, -17249, -19853, 26893, 71376, 24886, -31294, -60907, -48898, -62947, -38393, -53177, -37983, -15829, 14223, 73134, 76564, 41172, 3461, 15577, 52891, 42378]
13795D2378L6101N1258m2328M2093m195k0517k3922J6594k2089o0932m0831L9924
13783A3534L9190Q426k982j0204o396n4209M693M174J7391M1490p236K6599J5784
13770I0254m0721k6832K940K6460J5608K1009q200j2238m5437l660k4371j3618
13758a8806K3727K525K7585l590J0040j5865j3179K8650M0333o2870p9512L2084
13746b8878J520L4355P3534k1926k2733j5236j4874k8183J7188M3105J6379j719
13734E2532J7468m8788l4284P4014j2235J6588j7273j7841k4397j841k441k5548
13722b4046R986L1822K7553L2818J9527k9324k4251N4443K9762M4953N024k4744
13710A53523o0386m4755K9584P440M7345L2445L0913K2094N4907J7323j5894o1387
$$ y = [42378, 78479, 129737, 87409, 129502, 125307, 104790, 80868, 97462, 75373, 14441, -26390, 13534, 52724, 61150, 58168, 47964, 41568, -12641, -7948, -3774, 13617, 55107, 47871, 74470, 90254, 49533, 22701, 25641, 52101, 67709, 88718, 80518, 68280, 22843, 19183, -5188, -18806, 4921, 7446, 35031, 31441, 41481, 25616, 12437, 41087, 81420, 18550, -60962, -28878, -27358, 6997, 80531, 58605, 35872, 20636, 5762, -22421, -5233, 37872, 54251, 52532, 70000, 21212, -13072, 60942, 48707, 65295, 48022, 30181, 5784, 3943, 1502, -24046, -14060, 17762, 45315, 78133, 97660, 68336, 44085, 98528, 128290, 173243, 178267, 153523, 93137, 48382, 77966, 85406, 132751, 165196, 196109, 218203, 273110, 290433, 274539, 213152]
13698B13152m9841J4115P419j4815J3894p024j9781m931K6539R463k9812o291
13686A52087l3284k3434l3740K0213J0055j2934O483L120K1144M999n5592k5601
13674C3516o165j4799m2647M7446P0198j4442K9669K4867Q934M2161M264l8134
13662A44868N4044j97l9056o4889l2385J5254m2670k0648L6992l9544r881L476
13650E364L7073j8813J7392K8129k6466m6405q296k0786O4625O7707o4875k0825
13638A3824L3430K3306K9670j4299o1734n3934k1583Q523K6904L7969L9983J4837
13626G6896n0806o089L7344K2385j9174p3861j5074J4244j2986k3994l803L3456
13614b1462j7009l9122L7712K2698k7373M4143J0498l4710L93o894J8782L8160
$$ y = [213152, 163311, 177426, 184845, 170030, 183924, 176900, 157119, 152188, 178727, 188190, 158378, 152087, 118803, 95369, 61629, 81842, 91897, 78963, 85446, 88566, 109710, 114709, 59117, 33516, 27351, 12552, -30095, 17351, 87549, 73107, 102776, 127643, 136577, 178738, 183002, 144868, 198912, 198715, 159659, 94770, 62385, 77639, 34969, 14321, 51313, 11769, 1888, 5364, 42437, 23624, 41016, 69145, 42679, -3726, -12022, -32808, 31817, 99524, 34649, 13824, 47254, 70560, 100230, 85931, 24197, -29737, -51320, -42797, -15893, 22076, 62059, 76896, 26090, 20001, 57345, 79730, 60556, -13305, -28379, -14135, -27121, -51115, -54918, -21462, -38471, -77593, -39881, -17183, -44556, -413, 10085, -24625, -24232, -31126, -12344, 25816]
13602B5816K3282j5805J7139p93P651j4959k6245J3985J7779L5947O2942p0135
13590G6604k2067p0195q6236M8381P3691R761j3345l6858J7256N6222R034L2748
13578I4996k0132j6826r519q571j1075k6448J0024O6095l059l1729j4597K7003
13566E6162N3211j8236k4949m9625r557q950M0082m2767n915P214K7754K3892
13554D8316j6100J0274O129q7429K0519l1291N6305M9502M998O473M0886j7723
13542I0859K7194n6677j09720k3504K1385L9323J6502J4790k2791k4662K3302
13531c999Q1897M2038j03106K0943j4582l6219J8822n2781k5865K3222M0813J0914
13519B097k0232j1284K9477m891K1703m6168M2497K6099j4146l1893J8273L0593
$$ y = [25816, 49098, 33293, 50432, 49639, 57290, 42331, 16086, 30071, 47850, 83797, 146739, 76604, 54537, -15658, -101894, -53513, 20178, 29939, 16594, -20264, -3008, 53214, 62248, 94996, 74864, 58038, 48519, 39948, 28873, 2425, 12449, 78544, 75485, 43756, 29159, 56162, 109373, 91137, 66188, 16563, 7006, -1944, 38138, -4629, -10544, -3330, 24424, 48316, 32216, 42490, 48619, -38810, -18291, -49582, 6723, 56225, 61223, 67696, 108582, 90859, 118053, 61376, -48344, -71848, -50463, -11140, 5362, 20152, -2639, -27301, -3999, 77898, 119936, 16830, 37773, 23191, -13028, 5794, -46987, -72852, -49630, -8817, 2097, -18135, -29419, 58, -4833, 16870, -29298, 13199, 39298, 25152, -6741, 11532, 42125]
13507D2125R411K1114J2835l4956l4215k5102J0170K7137q387n0907j0154O2563
13495B1634L0818N015l1686m4168k7609N530J2941Q35K943L2420J9796J6643m0162
13482D950J8997J05662L9253k7311n3390n2919n9658j6330P2566L1374k5107L0253
13470F8340j3521J3231O285j8662j5667p160l4924L0045N5190k2947n164L7528
13458I2574L2175k3073j8993j4776n9446k5195j764m6560k312l349L5736J0489
13446b4494L9095o262l5460K3131L7293K3060n7569R766j5416n4868K7681P6028
13434D1985N8770J7539m1995o1939k1667O255K9005M650m8743o9381j1704J5310
13422h1915M4417K4856J8803n0667k3942P4027N1649m2911j5941J5651N5272J4416
$$ y = [42125, 51536, 72650, 85485, 50529, 16314, -8788, 1382, 28519, 20132, -30775, -40929, 21634, 52452, 57467, 25781, -18387, -45996, -40466, -27525, -26690, -23747, 8673, 28469, 45112, 4950, 23947, 129609, 168862, 141551, 88161, 35242, -24416, -40746, 31820, 63194, 38087, 68340, 54819, 68050, 74335, 55673, 40006, 32846, -2078, 27967, 83157, 60210, 55046, 92574, 124749, 101676, 82683, 67907, 8461, -16734, -18498, -65058, -67370, -70719, -34983, -24494, 14601, 8339, -27121, -3990, 33303, 56363, -1206, 8560, -6856, -61724, -34043, 41985, 100755, 118294, 76299, 14360, -7307, -1052, 27953, 32603, -16140, -85521, -97225, -81915, -37498, -12642, 6161, -44506, -68448, 5579, 57228, 14317, -1624, 14027, 69299, 83715]
13410H3715l2294m1361k8830J4639L0012j962R308K9421K1480q846j8182K2970
13398H0070O399l5267p4582m2465K2261L3362j1220M2785j9088j5725m0506q549
13386f2525K5033j0228o1524k7055K5720N6257J1226J0381o253L152K3390R727
13374b699o347L4344J5726K8607j1854k0788J9443M4182m5068m5562J7519L4033
13362F1536k5111k4507l9751L5490K605k4012J8620L1269K7655j8727R562j778
13350E2851j3887J951p272J2528K760j7922M755K547l7914m128M2932O9335m2027
13337F6509o5461K1162K2821q290l9619k502n225J096L0455j1131M233k6825p538
13324b0315K2167l8060r712K1065Q819J02116O4486l0338k7041j2710J275J0038
$$ y = [83715, 51421, 10060, -18770, -4131, 25881, 23919, 33227, 62648, 84128, 75282, 57100, 80070, 86469, 51202, -23380, -65845, -43584, -10222, -21442, 21343, 2255, -13470, -53976, -62525, -37492, -47720, -109244, -136299, -110579, -54322, -43096, -32715, -38968, -35816, -12426, -2699, -9046, 25298, 41024, 69631, 57777, 36989, 56432, 100614, 55546, 9984, 27503, 61536, 36425, 11918, -27833, 7657, 10262, -13750, 4870, 36139, 63794, 45067, 54629, 52851, 38964, 40915, 33643, 46171, 48931, 31009, 35764, 38311, 397, -3731, 39201, 108536, 66509, 1048, 22210, 45031, 36741, -2878, -5380, -10605, -9509, 20946, 9815, 14048, -12777, -20315, 1852, -36208, -45920, -24855, -16036, 86080, 150566, 120228, 93187, 80477, 81752, 91790]
13312I1790K2661o2779m1920k0163k518J3668L0916R490J4427J3940l7271m7292
13300a5051l4167k9242L1842R202L1172J7930l9955L388O3154K4115K0796N129
13288H8313l8385j4958N088J2682Q026J5830m5540o1757m643n133L9547J4455
13276A3525j2646k1103m7444L5501K1099K1900O7343j3295l4702l193O269l4662
13264a408l5314O2217j0970K074n8513K071N3701O1355L367j4470L049k6006r711
13251C1442K376k8905K174L8736k7767k3179K9744j0268O7479N2137K5583O3100
13239B22652K5471J9545Q3723N4923O5402J42843J75338K19931K33608K33653
13229A477089K16491J52603P7061Q77l6247o2124q5151k18756k51948k38411k03384
$$ y = [91790, 114451, 51672, 9752, -10411, -12929, 739, 31655, 41145, 55572, 69512, 32241, -15051, -49218, -78460, -46618, -37416, -6244, 11686, -28269, -24881, 38273, 62388, 83184, 88313, 49928, 34970, 40058, 52740, 60766, 76596, 31056, -30701, -35344, -40477, -930, 13525, 879, -20224, -67668, -32167, -11068, 10832, 78175, 64880, 30178, 26985, 33254, -1408, -36722, 25495, 14525, 16599, -41914, -39843, 13858, 75213, 78580, 64110, 67159, 41153, 31442, 33818, 4913, 7087, 45823, 18056, -5123, 24621, 14353, 81832, 133969, 159552, 222652, 248123, 267668, 351391, 406314, 471716, 614559, 789897, 1009828, 1243436, 1477089, 1693580, 1846183, 1923244, 1924121, 1887874, 1825750, 1740599, 1521843, 1269895, 1031484, 828100]
13218H28100j36346j05323q2817p2111k0947n0636m7053K6399l7625n2402j8219
13207B31020J818J1552j5379n5270M868k0532K5606j1834l0304L4800L2414K3546
13195B32305l8436p5747l3241K7944R521P0091j2143k8144N201m2840j1173L6185
13183A39523l6149l3396J6185n94j028n037O5105J40Q017j8550m4528L5348p4594
13170E0442J0550Q2709j6203J4360L3197k8812j6831m5021m8234j3602k7019K2182
13158A7718O3246j5699k1180L2950K2820K5710J1705J1796l3038p3765N928L5329
13146H3520r813K6325o893j9293j8747j1768l018j7154N25L5938N3702l7656k2511
13133E3157q899l3465P3879L7633j7455J963k8558j1593j2806J7961J5882n8835
$$ y = [828100, 691754, 586431, 503614, 431503, 410556, 359920, 312867, 339266, 301641, 249239, 231020, 232838, 244390, 229011, 173741, 178609, 158077, 183683, 171849, 141545, 176345, 208759, 232305, 193869, 118122, 84881, 112825, 122346, 192437, 180294, 152150, 157351, 114511, 103338, 139523, 103374, 69978, 86163, 85569, 84541, 79504, 144609, 144749, 152766, 134216, 89688, 125036, 50442, 60992, 143701, 127498, 141858, 175055, 146243, 129412, 84391, 36157, 22555, -4464, 17718, 80964, 65265, 44085, 77035, 99855, 125565, 137270, 149066, 116028, 42263, 48191, 83520, 73707, 100032, 93139, 73846, 55099, 43331, 40313, 23159, 23684, 59622, 113324, 75668, 53157, 44258, 10793, 84672, 122305, 104850, 106813, 78255, 66662, 53856, 71817, 87699, 28864]
13121B8864k9993p983k7213j8710J9897R7998O3783j7901l2055q048j1036k0277
13109C7326m1341J1025J9050j6285k0953j0169K9937N0868l5224j1886M1464N367
13097E9179j8108l9822j5166k3244L1354K1334n969J4309K0027k8695r513K4077
13085B9763N9009m438r461K0827m6527J9264n5987o5441P6640K9901j4386J4294
13073E3458J7261l1958k4042j1486j6203Q424l8636M4026J10737K3894m67l1391
13061A03617l4976N6373L6557K6179k2321k0782k2690L9026M3842K0088k8459
13050A96454k3012l3627j5697K385N269L9493l6688k4631P666o684j5419k4773
13038G0736Q06l1527Q8441L77n9958k9912l7135m4033K4304L4585p374M6082L2481
$$ y = [28864, -1129, -9112, -36325, -55035, -35138, 62860, 126643, 108742, 76687, 68639, 57603, 37326, -4015, 7010, 26060, 9775, -11178, -21347, 8590, 59458, 24234, 12348, 53812, 59179, 41071, 1249, -13917, -37161, -5807, 15527, 9558, 23867, 43894, 15199, 5686, 29763, 88772, 84334, 74873, 95700, 49173, 68437, 12450, -52991, 23649, 53550, 39164, 53458, 70719, 38761, 14719, 3233, -12970, -4546, -43182, 844, 111581, 135475, 135008, 103617, 68641, 125014, 161571, 187750, 165429, 144647, 121957, 160983, 204825, 224913, 196454, 173442, 139815, 124118, 126503, 131772, 171265, 134577, 109946, 117612, 110928, 95509, 70736, 71542, 40015, 128456, 128833, 68875, 38963, 1828, -42205, -17901, 16684, 9310, 55392, 87873]
13025H7873J2609j4829k3432k2842L8482L8495o7589o2056l08l655o173l2835
13013e6260J6134K8290K1893L8322m6582k6548M6405l533j0666j8957N070M1436
13001C5004j0238j371P9531J9182O1444J31309J09319J05316J01393J31471J16077
12990H78437L0298N1677L6407P661k8987j03687o9422n6918l9597n9728o5868
12979E80273K5316k0808n1659q1803o7q7675m4538M6724k4855m2898p376j088
12967B89546M7331M1652j2352k1563k072o0782k0401K9181K3814p146J1289Q087
12955C26584j4905m8716k0218j4028M8260R3101J1996j871k559L3738N8862N9676
12943E29920Q1631P1029N5176L2351J00574J46685J58808K08151K58235K73225
$$ y = [87873, 100482, 85653, 62221, 39379, 77861, 116356, 48767, -13289, -13597, -17252, -23425, -56260, -40126, -11836, 10057, 48379, 1797, -24751, 21654, 18121, 7455, -11502, -6432, 35004, 24766, 23395, 102926, 122108, 183552, 314861, 424180, 529496, 630889, 762360, 878437, 908735, 960412, 996819, 1004480, 975493, 871806, 802384, 745466, 705869, 646141, 580273, 605589, 584781, 533122, 451319, 451252, 363577, 319039, 365763, 340908, 298010, 290634, 289546, 336877, 378529, 366177, 344614, 342542, 281760, 261359, 290540, 314354, 307208, 318497, 326584, 311679, 262963, 242745, 228717, 276977, 370078, 382074, 380203, 377644, 411382, 470244, 529920, 611551, 682580, 737756, 770107, 870681, 1017366, 1176174, 1384325, 1642560, 1915785]
12933A915785L30014L76344K74900J75572O6249p477p6233o4406k01360k36397
12923B552991k36699k08248k87986k38340j93103j24270j45206j34742j4687n066
12913I64644Q135m4300k7690Q620l0660l7726k4545M1905j8435J1878J1547o4118
12901G99255N2820K0509K0717L9051J179o5686m3542N959K7569L1184n5591M1737
12889H75161r032j2875O2584J6581k8678o8030P4799Q8873L9680N946J7419R607
12877A072035M9914J8396J1929j5915L875m8895p3262M9811N1961M0882m91L2830
12865A193070k0264K0530K7410J3969J0593M1632j0688M2668O7695M045Q210L1736
12853A430606M3794J9935N222p163j723P0837J07995R127J4739M4994K3480P8219
$$ y = [1915785, 2245799, 2622143, 2897043, 3072615, 3138864, 3131387, 3055154, 2990748, 2789388, 2552991, 2316292, 2108044, 1820058, 1581718, 1388615, 1264345, 1119139, 984397, 969710, 964644, 972779, 928479, 900789, 909409, 878749, 841023, 816478, 858383, 839948, 851826, 863373, 799255, 852075, 872584, 893301, 932352, 933531, 867845, 824303, 830262, 857831, 889015, 833424, 875161, 866129, 853254, 915838, 932419, 903741, 835711, 910510, 999383, 1039063, 1045009, 1062428, 1072035, 1121949, 1140345, 1152274, 1136359, 1140234, 1091339, 1018077, 1067888, 1119849, 1160731, 1160240, 1193070, 1172806, 1193336, 1220746, 1234715, 1245308, 1286940, 1276252, 1318920, 1386615, 1390660, 1398870, 1430606, 1474400, 1494335, 1499557, 1492394, 1490671, 1561508, 1669503, 1678630, 1693369, 1738363, 1761843, 1840062]
12841A840062J09428P0987R8318J41489J28855K15408K63800K17061J66845K91664
12831C543917M12018L80309M02267L88791N13514P09673Q09237J029137J266411
12822I455274J533130J841471K100383K384534K717164L196704L839957M905509
12814C1974126O705944R739396J4271147K0271244K7292290L4364376M0455379
12807A85073902M3408823M2819348L9537945L2472102K1185323N697910q021694
12800C62173659k0607770l0609627l8611903m1397666l8759629l4292014k9133102
12793A28761948k3605925j6542371j0874168p499917n541072m385055l830663
12786E6482777l451062l107620k931248k695412k412219k161760j963838j761220
$$ y = [1840062, 1949490, 2020477, 2118795, 2260284, 2389139, 2604547, 2868347, 3085408, 3252253, 3543917, 3955935, 4336244, 4738511, 5127302, 5640816, 6350489, 7159726, 8188863, 9455274, 10988404, 12829875, 14930258, 17314792, 20031956, 23228660, 27068617, 31974126, 38680070, 48419466, 62690613, 82961857, 110254147, 144618523, 185073902, 228482725, 271302073, 310840018, 343312120, 364497443, 370195353, 362173659, 341565889, 310956262, 272344359, 230946693, 192187064, 157895050, 128761948, 105156023, 88613652, 77739484, 70239567, 64698495, 60313440, 56482777, 53031715, 49924095, 46992847, 44297435, 41885216, 39723456, 37759618, 35998398]
12778C5998398j570422j392790j271581j131035j072888j007224r32370r75227
12770B6644861q08602p29469p36136p20448p40269p43286o48591o22199o37533
12761B0258328n99958n56998n22477n19701n09864m45362m32161m31492m08794
12752A5831521m46551m54602m19817m05162l38818l42417l94203l32865l13806
12743A2383280l16877l22486k94833k63031k97289l22415l41115k80081j56181
12734I788972k26864l05982k65605k26647k18528j56683j62757k25595j91714
12725G808597k23630j70856j58927j54698j98955j85747k13844j52649j27827
12716F221464j15439p5076j62979j31152j16115p0180r4485j53129j62569j26058
$$ y = [35998398, 34427976, 33035186, 31763605, 30632570, 29559682, 28552458, 27620088, 26644861, 25836259, 25106790, 24370654, 23650206, 22909937, 22166651, 21518060, 20895861, 20258328, 19658370, 19101372, 18578895, 18059194, 17549330, 17103968, 16671807, 16240315, 15831521, 15384970, 14930368, 14510551, 14105389, 13766571, 13424154, 13029951, 12697086, 12383280, 12066403, 11743917, 11449084, 11186053, 10888764, 10566349, 10225234, 9945153, 9788972, 9562108, 9256126, 8990521, 8763874, 8545346, 8388663, 8225906, 8000311, 7808597, 7584967, 7414111, 7255184, 7100486, 6901531, 6715784, 6501940, 6349291, 6221464, 6106025, 6030949, 5867970, 5736818, 5620703, 5550523, 5456038, 5302909, 5140340, 5014282]
12706E014282q3210p0001q0197j03882l2504q8552j31333j37037m4358L0384m5255
12695D228337r8024p2476l6568p617l5571j8287R562K4590O2382R8357J68149
12684D322834J46211J52804J93156K19704L12710K79585J66193J3664K6571l9559
12674E793873j53092j85176j74329k68715k86329k79275k85557k83214k25856
12665C652330j82291j85291j20210p3632n0944o1318j05104r8933q3754j02320
12655B588533q4542m7431O462m4549o2138q5991n2305o7198l3063j04046j35187
12644A878545r6111j9705L0426l2633k2665l5250p9885n7940r116m0671k6074
12633A488921o0397p8925r0510k7601j6912o759r4740j42098j7678j2038m5521
$$ y = [5014282, 4931072, 4861071, 4780874, 4676992, 4644488, 4555936, 4424603, 4287566, 4243208, 4273592, 4228337, 4130313, 4057837, 4021269, 4013652, 3978081, 3959794, 3969356, 3993946, 4056328, 4154685, 4322834, 4469045, 4621849, 4815005, 5034709, 5347419, 5627004, 5793197, 5806861, 5833432, 5793873, 5640781, 5455605, 5281276, 5012561, 4726232, 4446957, 4161400, 3878186, 3652330, 3470039, 3284748, 3164538, 3090906, 3039962, 2978644, 2873540, 2774607, 2690853, 2588533, 2503991, 2456560, 2463022, 2418473, 2356335, 2270344, 2218039, 2150841, 2117778, 2013732, 1878545, 1782434, 1762729, 1793155, 1760522, 1737857, 1702607, 1622722, 1564782, 1555666, 1514995, 1488921, 1428524, 1349599, 1259089, 1231488, 1214576, 1207817, 1113077, 970979, 953301, 941263, 895742]
12622H95742o0029j22111r8369r6497j39404j18079m7657J1629K0482M1625J21913
12611D09245J88229N1814N3148J42151Q5691L2332r121M1602L3487n7021j555
12600I70002K4441n657l1891j3924k4875K6605K7795j0962m4510j2865n1928j8643
12588H33588K994j954l0325l4545k5701j4430K1841L1902k3602p7915m3608k5407
12576F12838k2519j6669N9273K8185R10n4444l4540N1311O3643M6974m7296l7320
12564F50346m3540n978r40M1543m3255K235L0557m840j9496M1283j4318n4259
12552E79338j3033k1153J2441M1527j5655n2557j2072R487J2564l0577k459p543
12540E00308J6648M7807M1226k855l3531k7490j6623j9625l6402o1835l5570j2900
$$ y = [895742, 835713, 713602, 615233, 518736, 379332, 261253, 213596, 225225, 245707, 287332, 409245, 597474, 649288, 702436, 844587, 930278, 962610, 953489, 995091, 1028578, 971557, 970002, 994443, 988786, 956895, 942971, 918096, 944701, 972496, 961534, 917024, 904159, 852231, 833588, 836582, 834628, 804303, 769758, 744057, 729627, 751468, 783370, 759768, 681853, 638245, 612838, 590319, 573650, 632923, 661108, 662018, 607574, 573034, 624345, 687988, 734962, 687666, 650346, 606806, 600828, 599888, 641431, 598176, 600411, 630968, 626128, 606632, 647915, 633597, 579338, 566305, 545152, 557593, 599120, 583465, 530908, 518836, 528323, 540887, 510310, 507851, 500308, 516956, 564763, 605989, 603134, 569603, 542113, 525490, 505865, 469463, 407628, 372058, 359158]
12528C59158Q9059N1952k8980o9365m3673J780l4036n1585n1704l6247J0375J7962
12516B14696L0467K8635n3462K8366Q5388J812p776m9169o593L176k7560k3921
12504B24059O842O1527P8588l4683o6115K300Q644L3362K2251K428J8002k2610
12492C34595J538j2714J3531m2583o9250M161N6901l577J890J2502m2176Q704
12480B63522J7097j2073M163O651n1506m2790J4526N586m113k2015n385K546J3093
12467A89302k2203J2391n3829l2149K409k0909k530K8475j1098l5778L1665J7112
12455A02858O4014M687J1679l321j6153j4902k9053m5519K434K6379J8269l2338
12443H9034k3608P4226O5212J5019N588n4158o7542j2664K5185M882J9250N0378
$$ y = [359158, 448217, 500169, 471189, 401824, 358151, 359931, 325895, 274310, 222606, 186359, 196734, 214696, 245163, 273798, 220336, 248702, 334090, 335902, 328126, 278957, 272364, 275540, 247980, 224059, 230901, 292428, 371016, 336333, 270218, 272518, 281162, 314524, 336775, 339203, 357205, 334595, 336133, 323419, 336950, 294367, 225117, 229278, 286179, 282602, 284492, 296994, 254818, 263522, 280619, 268546, 272709, 279360, 227854, 185064, 199590, 205176, 201063, 179048, 173663, 176209, 189302, 167099, 179490, 125661, 93512, 95921, 75012, 72482, 100957, 89859, 54081, 85746, 102858, 166872, 171559, 183238, 179917, 163764, 148862, 119809, 74290, 76724, 103103, 121372, 89034, 65426, 139652, 204864, 219883, 225471, 171313, 103771, 91107, 116292, 121174, 140424, 190802]
12431A90802O1292N269n9983j8223n0844j8214l9744J1018J9186K112M6313k2695
12419A26289J4570K6916P802Q653J1845m0469K3718m1743k3196J0734L7263J7293
12407A79675m6151k7469L665K3077L9182L2203l9429L2399J7683k3074m3144j5038
12395A33579k4281m103J4261K1399k7901p0887J1678J2804Q79K0671J09390P6476
12383B73965K7932L4460N0985J25701J82651K55027K58329K43068J90173J95889
12373A838180J07010P8010l0196o7979j17273j79186k69341k51300j58713k02798
12363G46414k18676p2174j8203l4872j4619M9800K714n7561m4923k4675k9286
12352B83939j6275L0611p4970j0363L9847Q96O391n9080j0664j2656L097Q500
$$ y = [190802, 252094, 257363, 197380, 179157, 128313, 110099, 70355, 81373, 100559, 102671, 148984, 126289, 140859, 167775, 175577, 184230, 196075, 155606, 179324, 137581, 114385, 125119, 162382, 179675, 133524, 106055, 109720, 132797, 171979, 204182, 164753, 197152, 214835, 191761, 148617, 133579, 109298, 105195, 119456, 140855, 112954, 42067, 53745, 66549, 67428, 88099, 197489, 273965, 301897, 336357, 387342, 513043, 695694, 950721, 1209050, 1452118, 1642291, 1838180, 1945190, 2023200, 1993004, 1925025, 1807752, 1628566, 1359225, 1107925, 949212, 746414, 527738, 455564, 437361, 402489, 387870, 437670, 440384, 382823, 337900, 313225, 283939, 267664, 298275, 223305, 212942, 252789, 253685, 260076, 200996, 190332, 177676, 180773, 189273]
12340A89273l3910K5008k920o0374n7486r549R7286J9212j8758q828J3357K6821
12328A79132j0519P0115m6789q7259N2967j2662m3087m1209K3936L4374L7722
12317A56721k5320K3942j97m3555k5834J6472K7882q466k9361j8873n736k5322
12305D2353J2422q048k7216J502j5026m104R697o9568J1572J4883L4186K3064
12293B5717K4889O7196K1158k7107l1617l5874j1406J1354J6798K6219J3476K6930
12281A27733l192l5621p8700n8297j2897M8869M2641L6127K5952j1150l8931M1197
12269H3731m637j273k0858l5943n2598m8975J5297J3490L5217M3054L8649j6461
12257D8693n8325n1246j6257N2604O3972L5900k3032j2405J3683k4884j2215K8873
$$ y = [189273, 155363, 180371, 177451, 117077, 59591, 50042, 147328, 166540, 147782, 138954, 152311, 179132, 168613, 238728, 191939, 104680, 157647, 144985, 101898, 60689, 84625, 118999, 156721, 131401, 155343, 155146, 111591, 85757, 102229, 130111, 121645, 92284, 73411, 67675, 42353, 54775, 46727, 19511, 21013, 5987, 1883, 11580, -57988, -46416, -31533, 2653, 25717, 50606, 117802, 138960, 111853, 80236, 44362, 32956, 44310, 61108, 87327, 100803, 127733, 124541, 88920, 10220, -48077, -60974, -12105, 30536, 66663, 92615, 81465, 42534, 83731, 79094, 77821, 56963, 21020, -31578, -80553, -65256, -51766, -16549, 26505, 65154, 48693, -9632, -60878, -77135, -24531, 39441, 75341, 52309, 39904, 53587, 28703, 16488, 45361]
12245D5361m3053k4405r612j9599O228n712j8531J7085P2801P7493J1980o6111
12233D3925J8730j7724p587M0158o780l6352k4919J1906K6244J0188n7575J1254
12221A1468Q785J2420j3634K4718K467j9313l8876M733J6713j3147j8667j7963
12209d0296j7174J4081J8228J8366K700j1975L915k9056j1198K6621j5878j1310
12197e2976J5934O859m0184M1078J2910l2233k075O3946p763m3561k4907m808
12185f7780L5204j4529k5125n156P475M0292P4206M0118k8739l3561p4300k7322
12173g9217P3990Q5690M0772k2256o7395M7947m8288m1014K5658j5523j9571P444
12161a1763R40N6239K4531J2330l5453M7042P404m5487j5847n642p006K0136m1066
$$ y = [45361, 2308, -22097, -31709, -51308, -45080, -50792, -69323, -52238, 20563, 98056, 110036, 43925, 62655, 44931, 37344, 77502, 70722, 34370, 9451, 21357, 47601, 57789, 214, 11468, 20253, 32673, 19039, 43757, 46224, 26911, -11965, -7232, 9481, -3666, -22333, -40296, -57470, -43389, -25161, -6795, -4095, -16070, -12155, -41211, -52409, -25788, -41666, -52976, -37042, -30183, -70367, -29289, -16379, -48612, -50687, 13259, 5496, -38065, -62972, -67780, -32576, -47105, -72230, -77386, -69911, -29619, 44587, 84705, 55966, 22405, -51895, -79217, -5227, 80463, 121235, 98979, 31584, 79531, 31243, -9771, 15887, 364, -19207, -11763, -10823, 45416, 69947, 82277, 46824, 93866, 101270, 55783, 39936, 34294, 27288, 47424, 6358]
12148F358l1943k4201p536j3692L204l1323o1313J9365P4903N0315k9619K6258
12136a9224N2742J0377m103N759k9125q466M888k378K7335N5964R53o3088p4463
12123d2829J5870K9358j9463L6168n445J6912o2386M3810j9066l8224p180K1753
12111c0722K0057K8519J8952j2362k1911m2425J3644M182j5519k8301M7377L2565
12099A4056J0769j9807k1498r581r186J8660J5364L4878o228j8838k9195k6622
12087d7228J4694K1236k0282J9598K7487j2621M0349N849J0718K0059K5556k2546
12075H2869m9421j3859k5709L0155k7498J6429P701L7531j1367N1931L5865n2864
12063H1763l4259j3217J1892r458M877n164L9254j6517l7088K5502L3490k5199
$$ y = [6358, -25585, -49786, -57322, -71014, -67810, -99133, -160446, -141081, -66178, -15863, -45482, -19224, 33518, 43895, 39792, 45551, 16426, 7960, 12848, 10470, 37805, 93769, 94722, 31634, -42829, -26959, 2399, -17064, 19104, 13659, 30571, -31815, 11995, -7071, -45295, -52475, -30722, -10665, 17854, 36806, 24444, 2533, -39892, -26248, -22066, -37585, -65886, -18509, 14056, 24825, 5018, -16480, -26061, -35247, -16587, -1223, 33655, 27427, 8589, -20606, -47228, -32534, -11298, -31580, -11982, 15505, 2884, 43233, 49082, 59800, 79859, 105415, 82869, 33448, 19589, -6120, 24035, -3463, 12966, 20667, 58198, 46831, 98762, 134627, 81763, 47504, 34287, 46179, 36721, 41598, 36434, 75688, 59171, 22083, 47585, 81075, 55876]
12051E5876n2325k4388J6702J8862J9267L2710k6873p4602n13L7043K6274m1444
12039a3411k2685K5800K7130N6772l1556m231k4187l5042m8624K6509L0894J6045
12027C414m8605m319j1645L2016l45n585L4566k0025m0341j6819K6410L6737l1560
12014d6101j7808P8420K5052L7598l716l4333l0113k6051J4719j8687k4979j5658
12002f1657N248k7154k1446p540L3733r17K5990L8636m113K144L2641M6450j7135
11989D4880j5870J601l139k1472q5161n6046J8276j5105M4595L5116N1000N0625
11977D9300j8452m1055j7053J500K4467J389J2970K8194N0095p0973l2873L4721
11965B2230k1235l5942j3619K4987k5948Q739Q0610Q054J8443l8363n5054K3224
$$ y = [55876, 3551, -20837, -4135, 14727, 33994, 66704, 39831, -34771, -35284, 1759, 28033, -13411, -36096, -10296, 16834, 73606, 42050, 37819, 13632, -21410, -70034, -43525, -12631, 3414, -45191, -49510, -61155, -29139, -29484, -35069, -503, -20528, -60869, -77688, -51278, -14541, -46101, -63909, 14511, 39563, 77161, 73445, 39112, 8999, -17052, -2333, -21020, -45999, -61657, -56409, -83563, -105009, -112549, -78816, -79733, -53743, -15107, -19220, -17076, 15565, 62015, 44880, 29010, 30611, 27472, 6000, -79161, -135207, -116931, -132036, -87441, -52325, -1325, 49300, 30848, -10207, -27260, -25760, -1293, 96, 13066, 41260, 91355, 20382, -12491, 22230, 995, -34947, -48566, -23579, -49527, -40788, 39822, 47876, 66319, 27956, -27098, -3874]
11953c874L8711R517k8115l9521L4354L215M5027l9422l2046N747J857J3419J1981
11940B0850K280Q558n6237L5973O4570L3210n9062n5070l9275k079q479l0383
11928h5144j7841O5044K3946M1163N462k1570l6824J4830Q678O931k2841l3189
11916e1355k8218k9244K1359K0270O662K9228O3059k6978Q01L2708J9937M8326
11904A06555O936m792k7809l9371l8147R614L382j6813L194l4170j5334j1496
11892e8251k2018P367n019J319J7163J8459J7677M2176J2123o0603j6009m1849
11880h7465L2588J0685K0299j0492J5465O2520Q4249j1532o3326r6700m0941M98
11868h4152J0807N3715K695j4969j5728k07P4389K7987J963J4348l6692o6729
$$ y = [-3874, 34837, 44354, 16239, -23282, 11072, 14287, 59314, 19892, -12154, -6407, -4550, 8869, 20850, 23130, 31688, -24549, 11424, 75994, 109204, 50142, -4928, -44203, -46282, -54761, -85144, -102985, -37941, -13995, 27168, 32630, 11060, -25764, -10934, -2256, 4675, -18166, -51355, -79573, -108817, -87458, -67188, -60526, -31298, 31761, 4783, 5584, 38292, 58229, 106555, 113491, 108699, 80890, 41519, 3372, 12986, 16368, -445, 2749, -31421, -46755, -58251, -80269, -72902, -77921, -76602, -59439, -40980, -23303, 18873, 30996, -29607, -45616, -87465, -54877, -44192, -23893, -34385, -18920, 43600, 127849, 116317, 52991, -43709, -84650, -84152, -73345, -19630, -16935, -31904, -47632, -47839, 26550, 54537, 56500, 70848, 34156, -32573]
11856c2573J8031J191J5520L2251K0086k6057P693k033j7477r312L034J3255l2131
11843h522J3722J0153N4912l1329k8596L1972N934n1367n1867M3071j4282L7663
11831A1464k2181R440j4741j9211O4267q76o3536k6046N8375k0540m986r178j6484
11818e4233L9054J2760J815j5146m4769N4428K8893O393l0202J1080J5126k2013
11806C186n7857L7504o8432n1813L7416P94R33L1570P0784K4091m5906n8611m2211
11793a18552p759o32j545O0511l2104P232O9193J3180l1099l9533l9193l08P503
11780a13106J01411M2981K6827j6647J554j8766k5603L7894L6778N626l3390o8275
11768b2716q524M2373K3458l8208l9349m7619j8111M6669O007J7892J1354r96
$$ y = [-32573, -14542, -13351, 2169, 34420, 54506, 28449, 36142, 34109, 16632, 7320, 10354, 23609, -8522, 5200, 15353, 70265, 38936, 10340, 42312, 48246, -3121, -54988, -11917, -26199, 11464, -10717, -1277, -16018, -35229, 29038, 28162, -35374, -61420, -3045, -23585, -28571, -37749, -54233, -15179, -2419, -604, -15750, -60519, -6091, 22802, 29195, -1007, 10073, 25199, 3186, -54671, -17167, -85599, -137412, -99996, -99202, -98269, -66699, 4085, 28176, -17730, -76341, -118552, -126311, -126943, -128488, -67977, -100081, -92849, -23656, -10476, -41575, -81108, -120301, -120609, -113106, -11695, 31286, 58113, 41466, 43020, 24254, -1349, 36545, 73323, 78949, 45559, -22716, -31240, 11133, 34591, -3617, -42966, -90585, -108696, -62027, -56020, -38128, -26774, -27770]
11756b7770M5744N8087j4870J2686j0394M503P067m9711m1073r474K6013L4607
11744C5415j0047j9531K8362N92m9844j4913J0734k3955L6678L0945P156J6476
11732D8068l8711l5419K797R411q900k5759n097M2395m6393l397K3707O2425L1942
11719E7069k6967n4869j6947L0185o316j050j213k6297M74N6581M463j5809n3398
11706e4094l4402L2084M157k5317j0352k2959N4394M558j7240k3585K4292j4254
11694h2718K3021l9474k9117L6255Q0495K3125N2599L0378j5517l9564Q635J8411
11682F6529P14n6123n5259O78M0148J7632O332k951j7181j2676m6085p71j4046
11669g3059k7123J0241M3601j3419k5173K1592N159J5044Q356K451K432K0189
$$ y = [-27770, 17974, 76061, 61191, 73877, 63483, 67986, 75053, 25342, -15731, -25205, 808, 35415, 25368, 5837, 34199, 34791, -15053, -29966, -19232, -43187, -6509, 24436, 31592, 48068, 9357, -26062, -23265, -13854, -22754, -48513, -53610, -11215, -57608, -61005, -37298, 25127, 57069, 30102, -24767, -41714, -11529, -17845, -18895, -20108, -46405, -45931, 10650, 15113, -696, -54094, -88496, -56412, -52255, -77572, -87924, -110883, -56489, -51931, -69171, -92756, -68464, -82718, -59697, -99171, -128288, -92033, -11538, 11587, 64186, 94564, 79047, 39483, 48118, 66529, 67243, 11120, -44139, -43461, -3313, 14319, 20651, 17700, 519, -12157, -58242, -59013, -73059, -100182, -89941, -46340, -59759, -84932, -63340, -58181, -43137, -34781, -32330, -29898, -9709]
11657i709J2916L9184K2511J2274m2057m6509l7248j9488l7049r260L5904N8211
11645b0320J993o713k0316j0166J6929J2103k1673l3087R21J5656l5607k209K6960
11632g5529k9710M632l6648N7701O6543j5148q855n691k2682N765R002M6964J6195
11619A2539m8699k4238M5814q264j1687L671m652l4093P4034O4388m4795q6113
11607f2095L296L5454l4303n4711k2150J3629N3128J956n0754R793k743j7429
11595a26929j6203K7464M0884J0074q537P257j9272m8277J7275L1858J8185l0313
11583i6534R184L7341Q6157K7552m5322l4430k9367J0148K8970o3393k0798L6747
11571e3745j7030J5560N3851K4345J7797l9897p3220o2696M576P5123J1630M0709
$$ y = [-9709, 3207, 42391, 64902, 77176, 35119, -11390, -48638, -68126, -105175, -114435, -78531, -20320, -18327, -25040, -45356, -55522, -38593, -26490, -48163, -81250, -80329, -64673, -100280, -102489, -75529, -105239, -100607, -137255, -79554, -13011, -28159, -37014, -42705, -65387, -59622, -50620, -3656, 12539, -36160, -60398, -14584, -22848, -34535, -30864, -35516, -69609, 4425, 68813, 24018, -62095, -58799, -23345, -57648, -112359, -134509, -120880, -67752, -65796, -116550, -106757, -109500, -126929, -143132, -115668, -74784, -64710, -73247, -65990, -85262, -133539, -116264, -84406, -66221, -96534, -87350, -50009, 36148, 63700, 18378, -16052, -45419, -35271, -6301, -69694, -90492, -53745, -70775, -55215, -1364, 22981, 40778, 881, -72339, -135035, -130459, -55336, -43706, -2997]
11559b997J11240N3083p6249p3811k9764K9663k6208m0867j8588l075m78N1813
11547b6238k0032l2274L8323L456l8776J128J00681J1584m7079l182j1690l4946
11535e9045K3805M5109j8034K8673m7971j2938m896M5864Q797J4296m8990k3069
11523d8399l0798M629L7295J9692l609n4496P5162m8406j6407M860J469K4978
11511c4030m3558J1010L5703N5403K1578p4135o0259p405O1009J0070j0808n736
11499d1158j2219j8756J0011M9898k6641m4664N9663R896J1416K9631m7943o6238
11487h7104l6122P574J7737K3109P2768K6775M3887l7448l8977n5879l0181J9779
11475g4082J4017N8407L6072j7511j2310J9269P261l4203q647L1249j2531n6450
$$ y = [-2997, 108243, 161326, 85077, 11266, -18498, 11165, -15043, -55910, -74498, -77573, -78051, -26238, -46270, -78544, -40221, -36765, -75541, -74413, 26268, 37852, -9227, -12409, -24099, -59045, -35240, 9869, -8165, 20508, -27463, -40401, -45297, 567, 9364, 23660, -25330, -48399, -79197, -74568, -37273, -17581, -21190, -75686, -524, -48930, -65337, -60477, -59008, -34030, -77588, -66578, -30875, 24528, 46106, -28029, -88288, -95693, -34684, -24614, -35422, -41158, -53377, -72133, -62122, -12224, -38865, -83529, -23866, -13970, -2554, 27077, -20866, -87104, -123226, -115652, -97915, -74806, -2038, 24737, 68624, 31176, -7801, -63680, -93861, -74082, -60065, -1658, 34414, 16903, 4593, 23862, 31123, -3080, -11727, 19522, 6991, -49459]
11463d9459J4921P996K2434k6174k7565j1513L3421O2277n692o2024m7185N1494
11451c7069Q1386K7102m6419j973J4118J7885n9907J3948M0005K0994n7125j6615
11439c670k9852l8293k5019K0370P4655L8704J824L7269P455K3431o8383p8196
11427c9705r770K6223m8849L1488r679m0624L228O8504L8851k332l5467o204J2341
11414a1995P5K544L3628R947l2102K7693j4011m0845m705M8328J5814n1661k3414
11401d0704q182K7932K5641M432Q755j351J3432o686K0859j0365q6563J929L5535
11388a5336M0166K0353q310R851j0060l8481l322p3369j2808J2147K807P2777
11376c585L8478J9204n5686n1306j0003K1249M8462P224M056j3713p436p289p648
$$ y = [-49459, -34538, -26542, -4108, -30282, -57847, -69360, -35939, 26338, 20646, -41378, -88563, -37069, 44317, 71419, 25000, 23027, 37145, 55030, -4877, 9071, 49076, 70070, 12945, -3670, -33522, -71815, -96834, -76464, -1809, 36895, 38719, 75988, 83443, 106874, 38491, -39705, -49475, -23252, -72101, -40613, -50292, -90916, -87688, -19184, 19667, 17335, -18132, -24336, -11995, -11920, -9376, 24252, 34199, 2097, 29790, 15779, -25066, -29771, 18557, 34371, -17290, -40704, -48886, -20954, 4687, 9119, 17874, 16523, 29955, 23269, 44128, 33763, -52800, -50871, -15336, 24830, 45183, 36873, 46724, 36664, -1817, -5139, -78508, -91316, -79169, -76362, -3585, 34893, 54097, -1589, -52895, -62898, -41649, 6813, 14037, 18093, 4380, -3056, -10345, -17993]
11363a7993J8544M7513M7297J3358p160J1185M4332m4191l0923K265k5809p6514
11351a8096k0322q196p290j6334M3257j6727m2650M4951K4144k0752k195L849
11339c6361k009r366M6247K7742j2227q94m8243Q242R7775j4833o3509l656L3332
11326B2240J8567L5175n0132p0620J0314P5095j8073l9131j5769N418l8326K4442
11314d0800N9813k1020n583J9599J2405m2947m0471p415J8915K8745J5792n551
11302h518m6668n3890K3934L0913L9039K4237l728k4563n5722k3711Q967N7548
11290c2162L1793k6405N4363M7505p095j5904K2j5319k4919m1225j8894j5044
11278f3284L0043J0882k5520n7748J2894L145J0772P9262M0679K9112o499l0822
$$ y = [-17993, 551, 48064, 95361, 108719, 101559, 112744, 157076, 112885, 81962, 84227, 58418, -18096, -38418, -46614, -53904, -70238, -26981, -43708, -86358, -41407, -17263, -38015, -40210, -36361, -38370, -47736, -1489, 26253, 14026, 13132, -35111, -26869, 70906, 56073, -7436, -11092, 22240, 40807, 75982, 25850, -44770, -34456, 40639, 22566, -16565, -32334, -26916, -65242, -40800, 19013, -2007, -7590, 12009, 24414, -18533, -59004, -66419, -47504, -18759, -2967, -8518, -55186, -109076, -85142, -54229, -15190, 9047, 5319, -19244, -74966, -98677, -89710, -32162, -369, -26774, 27589, 75094, 67999, 52095, 52117, 36798, 11879, -29346, -48240, -63284, -33241, -22359, -47879, -105627, -92733, -89588, -78816, 446, 41125, 70237, 63738, 32916]
11266C2916L9381J0295j4988M462k9592l9938m5005m5266K5627N831L1043p574
11254c2808J2517j8609j2516j3701L340M9948L8283l2364o7J1255J7193m462o4958
11241d6949m181N3148K4418j3567J6339j5953L5926J930J13o5651r7281K4637
11229h7071N7014K5395J0519N3095R449k0314m5818n6442M4064j8976n47j275
11217c0907J080K7935K6297J8798m4228K942K8441k3328m5617j7321L3105K6972
11205D169J8696N112m9744J5480K0227O471J022j4786l4548K2171k2400r291o926
11192d4347L8149K0166K7720o026r312J9516m2639k3267n289l8406j766K3102
11180d2399J0493L4969N5438l7470k5506P0910N94j7215J9019j2145m8585j0469
$$ y = [32916, 72297, 82592, 67604, 72066, 42474, 2536, -42469, -87735, -62108, -56277, -25234, -32808, -20291, -38900, -51416, -65117, -61777, -11829, 26454, -5910, -5977, 5278, 22471, 18009, -46949, -51130, 2018, 26436, 12869, 29208, 13255, 49181, 51111, 51224, -14427, -111708, -87071, -30057, -4662, 5857, 58952, 68401, 48087, 2269, -54173, -10109, -29085, -29632, -30907, -29827, -1892, 24405, 43203, -1025, 1917, 30358, 7030, -38587, -55908, -22803, 4169, 22865, 27977, -21767, -6287, 13940, 20411, 21433, 6647, -27901, -5730, -28130, -37421, -44347, -6198, 13968, 41688, 35662, 26350, 45866, 3227, -20040, -25329, -63735, -65501, -42399, -31906, 3063, 58501, 21031, -4475, 66435, 67029, 49814, 68833, 56688, 8103, -2366]
11168b366k9179K045l9930l5701L9927N3074L9173P412n559L6802L1577k7806
11156F9469j2922J2184n5901n9945j479M0470O9943P0103K5837o3112l3323n109
11144E6215l8576k9151n900K2484q550M3638L980l3637j3077J8711j1492J7917
11132B2562m0020L2252L9211Q332k9984j2676j4109m3551r555J7204l1165J3838
11120d7661P0601K8258l6925j6838k8880J2209k8674P4418P3548k5095o5265P838
11108A7534q991q810k2364k2575k0947k6047K6402J6353K5877L4820M9288L1628
11096I2168l5267l2507P455l9970m8916o639R843j1694M7865P444K7925R275n8118
11083c1136J4420k3631J4856L9882M5586J7118n3016q3347L286P6777J4041k2310
$$ y = [-2366, -31545, -29500, -69430, -105131, -65204, -12130, 27043, 34455, 28896, 65698, 97275, 69469, 56547, 68731, 12830, -47115, -48594, -8124, 61819, 131922, 157759, 94647, 61324, 56215, 17639, -11512, -17412, 5072, -3478, 40160, 44140, 10503, -2574, 16137, 4645, 22562, -17458, 14794, 54005, 62337, 32353, 19677, 5568, -37983, -47538, -30334, -61499, -47661, 22940, 51198, 14273, -2565, -31445, -19236, -47910, 26508, 100056, 74961, 9696, 17534, 8543, -267, -22631, -45206, -66153, -92200, -65798, -49445, -23568, 11252, 60540, 92168, 56901, 24394, 31849, -8121, -57037, -63676, -53833, -65527, -17662, -10218, 17707, 26982, -31136, -16716, -40347, -25491, 14391, 59977, 77095, 24079, -59268, -55982, 20795, 34836, 12526]
11071A2526K3110N7921M5911p065n2263q921r383m2489o5525l2004M140J7808
11059e6234O274K5908R929l6170n097m5001q620K5290P2556J6186p510l382l4597
11046d0468j9212M7145L518m2654m486J7394o628l1871l4891j8953L3678o670
11034a04098N377O3620J6805j533q9247q509K6451L1164P349m2430j2531N7506
11022e0076J0623j4337K5679K2704l2051K3884j7288k1120L4737K7577N4043M4876
11010A09251n822l0933k2392o594m1786k8101J941K3267j3157k8054P39J041K3557
10997a7043J0468j9557K3055J7633M8134J1553l8139k7040n917r410q1806k2529
10985a10598K2969k2823L9752O8361K5161k0114j4006n9182O889Q1742K743q3515
$$ y = [12526, 35636, 93557, 139468, 132403, 80140, 71219, 61836, 19347, -46178, -78182, -74042, -56234, -49960, -24052, -14123, -50293, -55390, -100391, -109011, -83721, -11165, 5021, -2489, -5871, -40468, -59680, -12535, -9017, -51671, -56157, -38763, -45391, -77262, -112153, -131106, -97428, -104098, -98721, -35101, -18296, -19829, -109076, -117585, -91134, -59970, -52621, -95051, -107582, -50076, -39453, -53790, -28111, -5407, -37458, -13574, -30862, -51982, -17245, 10332, 64375, 109251, 103429, 72496, 50104, 43510, 1724, -26377, -24436, -1169, -14326, -42380, -41641, -40600, -17043, -6575, -26132, -3077, 14556, 62690, 74243, 36104, 9064, 3147, -6263, -88069, -110598, -87629, -110452, -70700, -2339, 22822, 2708, -11298, -70480, -63591, 18151, 20894, -62621]
10973f2621k9044K3766j1098K6120J4435J5215n0470l1333J6455k3175q3590M4188
10961a51152J09637K5452J595K0475J9998j2721m3039j6332L1317j6944j0236
10950d1950K7915K1701P838L9952L2800m8063o4862J712K1921K4972K3066K999
10938E0001k9368o4491o612N0191k6730Q050K1732R699j9751j2585k3586m7965
10926i1415l0736O9426O2674N694O276n787l481N280p550k5045N03O336p6467
10913h4292P11K0762k1428N6733k307Q17K8495K891m9364l8460J7206L4137N853
10900b8246J2707j7100Q39R429R209N0096K1681J3166K5398j9492m3642l2308
10888A737K4584N572o7111l4629j6436L3020P3750J5700j6559m0646J7443O164
$$ y = [-62621, -91665, -67899, -78997, -52877, -38442, -23227, -73697, -105030, -88575, -111750, -195340, -151152, -41515, -16063, -14468, 6007, 26005, 13284, -29755, -46087, -14770, -31714, -41950, -14035, 7666, 15504, 55456, 88256, 40193, -24669, -22957, -1036, 23936, 47002, 50001, 20633, -43858, -50470, -279, -27009, -18959, 2773, 12472, -7279, -19864, -43450, -91415, -122151, -52725, 9949, 15643, 21919, 16132, 12651, 17931, 10381, -14664, -14161, -7825, -84292, -83581, -62819, -84247, -27514, -29821, -29004, -509, 2382, -46982, -85442, -68236, -34099, -28246, -15539, -32639, -31800, -22371, -13162, 36934, 58615, 71781, 97179, 77687, 34045, 1737, 26321, 31893, -35218, -69847, -86283, -53263, 20487, 36187, 19628, -21018, -3575, 2589]
10876B589L3673N3046J5353k9110n1365L5948K3524N092k0416J3631M7409N656
10864A35030j643n9485m889j5903l4202j5876K6547L2490J2058m5934l9969O4029
10852E2253Q326j3189J9306m045k6109q3399J6371L5338p1285n0880p067k1196
10840a45576O0080L4029J7267O116m7185m0755P047n941M3646L2937l8549m4825
10828a21709K7796K6600R510j3790N228N7762P2678P319n7452R39P273L757l1207
10815e296J6757K179n4119p5770K3069K7905N195J1939L9638M0491l3329o3733
10803f5074k4853j2723J587M3107L6069N347n0760j6740N4698j9555k3182R048
10791f3031M883L3136K1879l2597j7237Q102J2822J9582m02j728j8667n4147n501
$$ y = [2589, 36262, 89308, 104661, 75551, 24186, 60134, 83658, 88750, 68334, 81965, 129374, 135030, 133387, 73902, 69013, 53110, 18908, 3032, 29579, 62069, 74127, 28193, -11776, 52253, 60579, 47390, 66696, 62651, 36542, -46857, -30486, 4852, -66433, -117313, -124380, -145576, -85496, -51467, -34200, -28084, -75269, -116024, -108977, -114918, -71272, -38335, -76884, -121709, -93913, -67313, -57803, -71593, -66365, -8603, 64075, 71394, 13942, 14881, 22154, 25911, -5296, 11461, 13640, -40479, -116249, -93180, -65275, -60080, -48141, -8503, 31988, -1341, -65074, -89927, -102650, -101063, -57956, -21887, -16540, -67300, -84040, -29342, -48897, -72079, -63031, -58148, -25012, -3133, -35730, -52967, -44865, -32043, -12461, -12863, -14591, -33258, -87405, -92906]
10778i2906P239j6270N3135K1729o841k242k5891j2916r636m384L6518k3272N3380
10765b2357O6868L3292L0468m5816o786n0439J5790O2817r5047J2418K2234M6326
10753F9768j492k2234o3553k3259K609M3640n3096o4046N3625P0016j8034q138
10741a4194k8966o9747n5485Q8938R3152Q772j3202m0842m644L0984j6196k530
10729b3960k2050K4942L4281L8449J0095j6889m2566M2396K898j1466J5823J242
10717E3195r562K2383j8946J4567m7930j7193q398q982L5858M769j7391L6635
10705C9005o7637k6833O5829J2456k6101L3819J4731k366P7632J7044m4759l3360
10693E9460m1231p7847m6545K8738K2506L4949j3856j9755K9415O0570r087m574
$$ y = [-92906, -85667, -101937, -48802, -27073, -33914, -36156, -62047, -74963, -84599, -88983, -52465, -75737, -22357, 44511, 77803, 108271, 62455, 55669, 5230, 21020, 83837, -11210, 1208, 23442, 69768, 68276, 46042, -17511, -40770, -38161, 5479, -47617, -111663, -58038, 11978, -6056, -14194, -43160, -112907, -168392, -79454, 13698, 22470, 9268, -31574, -36218, -5234, -21430, -23960, -46010, -21068, 13213, 51662, 61757, 44868, 2302, 44698, 47596, 36130, 51953, 53195, 43633, 66016, 47070, 61637, 13707, -3486, -11884, -20866, 14992, 19761, 2370, 39005, -28632, -55465, 10364, 22820, -3281, 30538, 45269, 42903, 120535, 137579, 92820, 59460, 18229, -59618, -106163, -77425, -54919, -19970, -33826, -53581, -24166, 36404, 27317, 22743]
10681B2743K3725N759k1228n1476K6004K4975k2078J3249r30n5752k4847L2987
10669b6869J7619l4336K5736L7568n190o747J6983n665j9825L4232J8561J2224
10657F4291o1208k3293P079R057k2450m9106n4476q543P8015J19856M5346n1277
10645E3291m9417p515j5593k0083J3275k2209J8730k1217k2183N9795O1196k3516
10633B4554k7528K8358k2442l2609j7706l6815q253O7884M3293l093M2840k1635
10621C6848k3794p486j7269l7329m1103L9139R1583J6137k6701L2528N6432J7738
10609A36723j1391k6009l8139k7953j9572l872J8544k2347j2859O0211M299n4618
10597C017k3878J29K4732k1664r598P749k6031L987P7229M3477n1038l8028q848
$$ y = [22743, 46468, 52227, 30999, -20477, 5527, 30502, 8424, 21673, 20743, -35009, -59856, -26869, -9250, -43586, -17850, 19718, 14528, 7781, 24764, 19099, -726, 33506, 52067, 64291, 3083, -20210, -13131, -4074, -26524, -75630, -130106, -138649, -60634, 59222, 104568, 53291, 3874, -3641, -19234, -39317, -26042, -48251, -29521, -50738, -72921, -13126, 48070, 24554, -2974, 25384, 2942, -29667, -47373, -84188, -92441, -24557, 18736, 15643, 58483, 36848, 13054, 5568, -11701, -49030, -90133, -50994, 40589, 56726, 30025, 62553, 118985, 136723, 125332, 99323, 61184, 33231, 13659, 9787, 28331, 5984, -6875, 53336, 57635, 3017, -20861, -20732, 4000, -17664, -27262, -19513, -45544, -41557, 35672, 79149, 28111, -9917, -18765]
10584a8765N26J7807J3419M3770m7296k0101j5656k5123K1612o086M7537K1109
10572C2753K8338J224j6940k0057K6361j270o3135j5229K1446J9614r784l1855
10560b8534J9305K240m2691k5459p50j770J5346R047J8486J4524m749K6221l526
10547b310l3640J8215P393L1013K3653j9636o072j3749m4802k2142Q9353R844
10535C7120q7344K9165Q4053J7666o459l7800q2986n273L3923P5048L7316o8836
10523B5593m3815K8680M8771j192o597K6802j4830P185m9543l9952j2934M6591
10511A4759L1470p8614j5090L3958j1669k2292N8120O10l9495k9470r371N5335
10499a1749L6066K5234l8850J7959N3028k1028l1566o8251l704j2233k4926J2343
$$ y = [-18765, -18239, -432, 12987, 56757, 9461, -10640, -26296, -51419, -29807, -35893, 11644, 32753, 61091, 62315, 45375, 25318, 51679, 50409, -12726, -27955, -6509, 13105, 3321, -28534, -9229, -6989, -49680, -75139, -75889, -77659, -62313, -53266, -34780, -20256, -25005, 1216, -2310, -35950, -17735, -10342, 20671, 44324, 24688, 18616, 4867, -39935, -62077, 27276, 37120, -50224, -21059, 62994, 80660, 74201, 36401, -46585, -51858, -17935, 57113, 94429, 25593, -18222, 10458, 59229, 58037, 51440, 78242, 63412, 70597, 21054, -18898, -31832, 14759, 46229, -32385, -47475, -13517, -25186, -47478, 10642, 11252, -28243, -57713, -67084, -11749, 24317, 49551, 10701, 28660, 81688, 60660, 29094, -39157, -42861, -55094, -80020, -67677]
10487f7677R7243j5819j9564j4112J3478J9388N469j00052J009O5676k4541m3111
10475h2613K4604K5087K1322l1610n79j048L4863K2638P422L786j9969K6964j8283
10462A2584N590j0796j5594K092l082q1702J1849J00236L496K8422K1096M014
10450G8205J9981k1506o2354l6176m0765K5567j9642K8028K6588n0748k2017Q4843
10438A0004J5096j9847L434P930K8659n0491j1799K3342Q344l9855k1387j5541
10426f2111Q56M2356l100K6912m9231J8103n055M2984J3646P647J0679n424r99
10413C7263L1545J6120J5985L0061Q705O976J3281L05K8522N5091N5171J28466
10401D27491J34931J53994J33825N8348m0416j6647q160o8155p9452q0265j20930
$$ y = [-67677, 29566, 13747, -5817, -19929, -6451, 12937, 18406, -81646, -80637, -14961, -39502, -82613, -58009, -32922, -11600, -43210, -43789, -44837, -9974, 12664, 20086, 23872, 3903, 30867, 12584, 18174, 7378, -8216, -6124, -9206, -90908, -79059, 21177, 24673, 53095, 74191, 78205, 98186, 76680, 14326, -21850, -62615, -37048, -56690, -28662, -2074, -52822, -74839, 10004, 25100, 5253, 8687, 16617, 45276, -5215, -17014, 6328, 14672, -25183, -46570, -62111, -61255, -18899, -21999, 4913, -44318, -26215, -31270, 11714, 25360, 33007, 43686, 38262, 37263, 68808, 84928, 100913, 130974, 139679, 146655, 159936, 160241, 188763, 243854, 299025, 427491, 562422, 716416, 850241, 908589, 868173, 851526, 843366, 775211, 695759, 615494, 494564]
10390D94564j35930p1540n3602l3515m5428p1265m5585k782R400j372K7943L1055
10378A01943Q3257M5349m6704n9888l7387j3485J9873j8R132j2111m8619l7898
10366C444j655N4015K8250L3997k1099j0721J0125M6941O648k6472l5027m1048
10354D7398k6508P286Q278N310K915K41K3954K3830k5998m0812M1166N0330K1977
10341A39367k1858l1908l9162J0046k540J0359k2919l96P103j8586N1925J6595
10329I8026l2255p035J67N4570J0080j093k5517o5243K0870j4387j8768J4738
10317C4153l7232J5171K5494j0648o0204o2396L5230K983K7137M4081M2857J4083
10305G0709l7441l6850k0822K8040l405L7201M8652J3417q2011q867J2355J5904
$$ y = [494564, 358634, 287094, 233492, 199977, 154549, 83284, 37699, 34917, 44317, 42945, 70888, 101943, 185200, 230549, 183845, 123957, 86570, 73085, 92958, 92940, 102072, 89961, 41342, 3444, 1789, 55804, 84054, 118051, 96952, 86231, 96356, 143297, 149945, 123473, 88446, 47398, 20890, 28176, 36454, 41764, 44679, 44920, 68874, 92704, 66706, 25894, 67060, 117390, 139367, 117509, 85601, 46439, 56485, 53945, 64304, 41385, 40989, 48092, 29506, 81431, 98026, 65771, 58736, 58903, 113473, 123553, 122460, 96943, 31700, 52570, 38183, 19415, 34153, -3079, 12092, 37586, 26938, -33266, -95662, -60432, -57449, -30312, 13769, 56626, 70709, 33268, -3582, -24404, 3636, 231, 37432, 86084, 99501, 17490, 8623, 20978, 36882]
10293C6882o6091k259O7278P7090j747m6936m4971k0988K019J148K758K5330O7811
10280I7324j0696m0909j8622j5632j3123q738M9529M1372J3487j7462L285l2053
10268D7762K861M3676M468m1821K3074J0357J4676m3J5861r5191M6430J8063J1151
10255A01324m4519m3535k3818K3691J1754j8302j2749k3922L8365p64R475L842
10243B0842J8579L8089l2300l3437j1563L0316K6647M2411n8815l2816N1721N8181
10231A17855j0603J6674K6380J4182k4537P7048J23402J00433J99412K53718K74790
10220A168754L03157L38824K88241K38082J69094J14647n069k39853l07556k83961
10210A784360k82036k97248k56072k72948j48451n7709m2112n2834k5096o5279
$$ y = [36882, -29209, -31468, 35810, 112900, 111153, 64217, 19246, -1742, 277, 1425, 4183, 29513, 97324, 86628, 45719, 27097, 11465, -1658, -10396, 39133, 80505, 93992, 76530, 79815, 47762, 50623, 94299, 98767, 56946, 80020, 90377, 105053, 105010, 120871, 25680, 72110, 90173, 101324, 56805, 13270, -10548, 13143, 24897, 6595, -6154, -30076, 8289, 7525, 17000, 20842, 39421, 77510, 45210, 11773, 210, 30526, 57173, 99584, 40769, 7953, 59674, 117855, 107252, 123926, 150306, 164488, 139951, 216999, 340401, 440834, 640246, 893964, 1168754, 1471911, 1810735, 2098976, 2337058, 2506152, 2620799, 2615730, 2375877, 2068321, 1784360, 1502324, 1205076, 949004, 676056, 527605, 469896, 427784, 374950, 349854, 284575]
10200B84575n9524O7399J7708k0945m4429L1878K7846K377J3121j8317n3100m3728
10188B04861m2038k7591J0868L002r298Q690o816j0581N775J5559o250K1500q866
10175A58815k3913k2819J4436k8830r707J9044J1014N373K3299L4128k2779J3045
10163A71106P806n6701l3296q845k832L0773k5725K243O9718O6972k7843l9253
10151A54123l96k72L75p9067j7472K287m692K6093M5083K413m9713k1779J6844
10138G3827k092j6889K7512J0814l0882N594J2326K5985R037j3973n6388l487
10126D1384N2851K5286m7323l5522l2707j5242N5799K2296j0213J0270j926p8614
10114a3661n7075K2029N0522L6558P934j5062J4220k5692k3550J4966R1124J645
$$ y = [284575, 225051, 292450, 310158, 289213, 244784, 276662, 304508, 306885, 320006, 301689, 248589, 204861, 162823, 135232, 146100, 149102, 139804, 148494, 141678, 131097, 136872, 152431, 146181, 167681, 158815, 134902, 112083, 126519, 97689, 87982, 107026, 118040, 123413, 146712, 180840, 158061, 171106, 178912, 122211, 88915, 80070, 77238, 108011, 82286, 84529, 154247, 221219, 193376, 154123, 153727, 153455, 153830, 74763, 57291, 59578, 54886, 80979, 126062, 128475, 78762, 56983, 73827, 71735, 54846, 82358, 93172, 62290, 67884, 80210, 106195, 115232, 101259, 44871, 41384, 94235, 119521, 72198, 36676, 3969, -11273, 44526, 66822, 56609, 66879, 64953, -13661, -70736, -48707, 1815, 38373, 46307, 31245, 45465, 19773, -3777, 11189, 102313, 103958]
10102A03958k7143k2963K2943K1222l4234l5418j0258m1734L1393P276l1756k2472
10090c9186P447O918J5540K6693k8317m6386J6526Q7012L1552L818l0107l9687
10078A1823k2513l6023J5012L2643j6512J8803L008n2212M5455O4618o8099O466
10066B469N2195j2079m4046j0402L0640p304J6854k226M644p002N6888P301j7917
10053G0015L6017k3367o3683o4989M7764O4160Q606n7090J9381L6355Q431l6168
10041D5432K40N1135l0579o7599j4492J324M5750J758l9037k7486K8477j3682
10029a8759l546j1980K6677O3270n2535l8628Q944l9395j57N1429k9872N81O3758
10016A9787K730k5705k5971O5228P14Q207k7603m940L0564n5586k6369J1583N0026
$$ y = [103958, 76815, 53852, 76795, 98017, 63783, 28365, 18107, -23627, 7766, 15042, -16714, -39186, -31739, -24821, -9281, 17412, -10905, -57291, -40765, 46247, 77799, 81617, 51510, 11823, -10690, -46713, -31701, 942, -15570, 3233, 6241, -45971, -516, 64102, -3997, 2469, 54664, 42585, -1461, -11863, 18777, 11473, 28327, 26101, 30745, 23743, 80631, 87932, 70015, 106032, 82665, 18982, -46007, 1757, 65917, 74523, 17433, 36814, 73169, 81600, 45432, 45672, 96807, 66228, -1371, -15863, -14539, 31211, 32969, -6068, -33554, -5077, -18759, -22305, -34285, -7608, 55662, 3127, -35501, -26557, -65952, -66109, -14680, -44552, -43971, 19787, 22517, -3188, -29159, 36069, 36783, 44990, 17387, 12447, 43011, -12575, -38944, -27361, 22665]
10003B2665m1555o4530M375N0935M3301m0118J9427L0298p0718j5888R737n136
9991e7207P7025M6835L88k5124q8650o580O9592L6159n582o4347o708O5317R3101
9978A34219J0609l9174m6218l7439N1382L6326n4640n3079M403m179R7261j302
9966I8169j978N887M3546P111n907L4475o706k9940L5947J8646N992L6935K7191
9953B69368n7282n7818m0490n4445o760J8834N1942K7042l4559m2233r181j8278
9941D6140l823j3058K34Q013k9294j7728M1344O0332O2629n9287p3205K036k0523
9928C810M699K3191m3681k235p274L744K7910N1696L2699J9391o3540l0183q16
9915A9411j8056j3354M5780K4787r724j6459J0581l064J8641N2316O905j6639
$$ y = [22665, -18890, -83420, -79045, -28110, 15191, -24927, -5500, 24798, -45920, -61808, -52071, -57207, 19818, 66653, 67041, 41917, -46733, -53313, 16279, 52438, 46856, -17491, -24199, 41118, 134219, 144828, 105654, 59436, 21997, 73379, 109705, 55065, 1986, 6389, 2210, 99471, 98169, 96191, 102078, 145624, 152735, 146828, 181303, 174597, 144657, 180604, 199250, 205242, 242177, 269368, 212086, 154268, 113778, 59333, 52573, 71407, 123349, 150391, 115832, 73599, 64418, 46140, 42317, 29259, 29493, 37506, 8212, -9516, 31828, 92160, 154789, 95502, 22297, 24333, 3810, 8509, 31700, -11981, -14216, -21490, -17746, 10164, 61860, 94559, 113950, 50410, 20227, 19411, 1355, -11999, 33781, 58568, 48844, 32385, 42966, 39902, 58543, 110859, 117764, 101125]
9903A01125l0934j1652M7534n655k4353n0720K1874K0272n3579j6538K4464K4744
9891D6582P3681J1012O234r873j8567m6206m7155J1571J8380q836l80j8821M7757
9878F5379L1677K0048o5249n9579N4393M0788J7266m9986O544L2327J8700K2912
9866A35220j2856r796M4315K6935n3416p7938l5871m5049L5414K9739K5678K5135
9854H7510K8234k244K0621n1699j156L8406Q0132R0655J61951R4932J26194P7258
9842G50794M5209J1937r5661j42485q9318p6952l2618p0242l1403J0957j2936
9831B67282q7209k3710M390O401m7835l1742r291Q766M2847k8534p9506L2194
9819E4053K0716k649j1193j1704N2319J128k8028o0163m7597J5631M4699O5691
$$ y = [101125, 70191, 58539, 106073, 100418, 76065, 25345, 47219, 67491, 13912, -2626, 21838, 46582, 120263, 131275, 137509, 127636, 109069, 62863, 15708, 27279, 45659, 36823, 36443, 17622, 65379, 97056, 117104, 51855, -7724, 46669, 87457, 104723, 54737, 61281, 93608, 112308, 135220, 122364, 112568, 156883, 183818, 130402, 52464, 16593, -28456, 6958, 36697, 62375, 87510, 115744, 113500, 134121, 82422, 81266, 119672, 199804, 290459, 452410, 547342, 673536, 750794, 796003, 807940, 712279, 569794, 480476, 403524, 370906, 300664, 269261, 280218, 267282, 180073, 156363, 160753, 167154, 119319, 87577, 78286, 87052, 129899, 101365, 21859, 54053, 74769, 72120, 60927, 49223, 101542, 102670, 74642, 14479, -33118, -17487, 27212, 92903]
9807I2903L3539l9866o8649k3798N4769O3516r928l1539K9858k1377J3991k2461
9795G0958k9628j1899L6993P3617Q26r489m9426k5670k5027K428n957N709k2185
9782A1250Q68N7491M6276J2403K1853J1587k1593k6808J3480q425o534n8172k8210
9769B5466K7549P953M5100P123m5990m916l3798k344L8172J1595l0267k3412J9585
9756D1816o639n3595l5730M6044N0942j6183n904N197P960J9383K0285M1055j8238
9743I6393k106k432m2460L4693L0200l1011n4696k6850K9007L5705L9687P41l1762
9730G5109M6479N3179j913j4689l339P098j7104J0765j4253p2317j1211M494q77
9717F1421M4150M3512L4956M6222J9806L7559J0151m981P510J1931q5125k091
$$ y = [92903, 126442, 86576, 17927, -5871, 48898, 112414, 102486, 70947, 100805, 79428, 93419, 70958, 41330, 29431, 66424, 140041, 140867, 131378, 81952, 56282, 31255, 33683, 27726, 33435, 11250, 12118, 69609, 115885, 128288, 150141, 161728, 140135, 113327, 126807, 118382, 111848, 53676, 25466, 53015, 60968, 106068, 113191, 67201, 62285, 28487, 26143, 64315, 75910, 45643, 22231, 41816, 35177, -18418, -54148, -8104, 42838, 26655, 20751, 25948, 33908, 53291, 73576, 114631, 96393, 94287, 91855, 49395, 84088, 114288, 83277, 28581, 1731, 30738, 66443, 106130, 106871, 75109, 121588, 174767, 172854, 158165, 154826, 161924, 144820, 155585, 141332, 69015, 57804, 62298, 61421, 105571, 149083, 184039, 230261, 250067, 287626, 297777, 292796, 300306, 312237, 227112, 225021]
9705B25021j3806p3531n4542k5161M6102L2060N5528l488k2013m8403m1401L7517
9693A13883o592j5359j272K2253j3017l9261r26L3929m3033k4082j2636R178l0481
9680g416J1635j689O6032L9626j211k0138Q616k1218K7262N0861O050R231j8454
9667A49187p2143L2022L7315m895M432j7757J3541r3j2584k8650o225P7102m1258
9654A29994n366n57j6584j0433P245l1940k2543k5023j0654O1394L4610J1625
9642A21768K623j2905m681l5945l9157k1156j8319J8360L9185Q260o88j0694J0817
9629E7468j9173R704J4219o43K0963n5294n835l8456o0383N4661N5554L7658j5592
9616E4851O329N3193j5281n0654l2161J0857M3783L5592k4447J5437K3033m1750
$$ y = [225021, 211215, 137684, 83142, 57981, 104083, 136143, 191671, 188183, 166170, 117767, 76366, 113883, 107291, 91932, 90660, 112913, 99896, 60635, 59709, 93638, 50605, 26523, 13887, 23065, -7416, 4219, 2530, 68562, 108188, 106977, 86839, 95455, 74237, 101499, 152360, 158410, 167641, 149187, 77044, 109066, 146381, 141486, 145918, 128161, 141702, 141609, 129025, 100375, 94150, 171252, 129994, 124628, 124071, 107487, 97054, 104299, 72359, 49816, 24793, 14139, 75533, 110143, 121768, 124391, 111486, 106805, 70860, 31703, 10547, -7772, 10588, 49773, 58033, 57345, 46651, 57468, 38295, 47999, 62218, 61575, 82538, 27244, 21409, -17047, -77430, -22769, 32785, 70443, 54851, 61180, 114373, 99092, 48438, 16277, 27134, 70917, 106509, 82062, 97499, 120532, 78782]
9604G8782J6617k86k5979N0216P7593K785r1192o3906L320K2522q00Q2669j7653
9591A34688l852M351J5529N1334r2j7565l0278r0329j5199K5234P5984J314p4763
9578G6356l7584j9228J3077n5J7995N6253j7773n788K7016K4253k2010k5088j1208
9565G6216j3629j268L7126o598l3974J0891k1794l2186P511M0987l1404l9845
9553g967k6078O2859M1339L3752k781n340n8707m4832K6350P5891N2688J0760
9541A57934K8896L1518j5699k7940P151k6673p7050j01964m191k1212M3760O3974
9529E8504P015M911k7250K1686M4905k6204j6469J2368J1283n1717k4968J410
9517A5474L0803L6199l7588j0416J9501Q4959n228j3706o580k8108j2111P439
$$ y = [78782, 95399, 95113, 69134, 119350, 196943, 199728, 108536, 44630, 47950, 70472, 69672, 152341, 134688, 130836, 135187, 150716, 202050, 201958, 184393, 154115, 63786, 48587, 73821, 149805, 151119, 76356, 38772, 19544, 32621, 32566, 50561, 106814, 89041, 83253, 110269, 134522, 112512, 87424, 76216, 62587, 61319, 98445, 91847, 57873, 68764, 46970, 14784, 22295, 63282, 31878, -7967, -34045, 28814, 70153, 103905, 101124, 95784, 37077, -7755, 18595, 94486, 147174, 157934, 186830, 218348, 202649, 174709, 181860, 155187, 78137, -23827, -28018, -49230, -5470, 58504, 65519, 70430, 43180, 64866, 109771, 83567, 67098, 79466, 90749, 39032, 14064, 15474, 46277, 82476, 44888, 34472, 53973, 138932, 133704, 119998, 113418, 85310, 73199, 80638]
9505H0638K7698l4923j00486M295N2620J2035o1915J5292K5401L5112M5117M6077
9493A46961K4479J9053J2914j1048q6848p6541N1646P5923J3594k6138l3059k4528
9481H6408k1186R155L964l224J7499M3038K1972k4698P115M0163J4249n4266j8079
9468A22110L0013J8002K2437K0914L7852k3285n4337m6652l9289j8369N7940P2205
9456A99541j7912o3198l9076J9511k983K7559J690k787J8604L6291o4130J8999
9444A32109K453J9134K2849m7868k1744K7752j9571j6295J9150k2776K4442M7807
9432A67442J8053l2006J3228j1892l0971M397K7920L6089j3852l0332k7821J0543
9420A30798j1768M0582l5171m0525L1679O2647O295K7823M9953l9714l6993l80
$$ y = [80638, 108336, 73413, -27073, -22778, 29842, 41877, -20038, -4746, 20655, 55767, 100884, 146961, 171440, 190493, 203407, 192359, 105511, 28970, 80616, 156539, 170133, 143995, 110936, 86408, 65222, 74377, 78341, 75117, 92616, 135654, 157626, 132928, 140043, 180206, 194455, 140189, 122110, 152123, 170125, 192562, 213476, 251328, 228043, 173706, 127054, 87765, 69396, 127336, 199541, 181629, 118431, 79355, 98866, 95883, 123442, 125132, 122345, 140949, 177240, 113110, 132109, 134562, 153696, 176545, 128677, 106933, 134685, 115114, 98819, 117969, 95193, 119635, 167442, 185495, 153489, 166717, 154825, 123854, 128251, 156171, 192260, 178408, 148076, 120255, 130798, 119030, 159612, 124441, 83916, 115595, 178242, 184537, 212360, 262313, 222599, 185606, 185226]
9408A85226j4606K1905m149j5960L8654m0011k5993M4155M7269J7519k3953J5559
9396B45615j7194l1028k6947k1433j3551P1122P8697p03k7468k7037m2972m759
9384A82342J40o209k4841l3390J3244n390k3855j0858K5946M7853L013j9380k5444
9371A23171p698J6760q52K7608l6166K0495J9209J7582J2410K5991m200p281R503
9358B16532m2234p2372j543O3313R067M371o278k8303K5559K2086N007k3296j3880
9345A58029L763j5938o1639j1461L4170L9001Q661k6972o2173L7883R4657N1802
9333B49783k5705m9362K3422j9874k8353O6501O2327k129l8174r961K1027L6004
9321B85506k4502K2146N0035l9155l8080m7683K914J4051J8595J0134K1543J4871
$$ y = [185226, 170620, 192525, 188376, 172416, 211070, 171059, 145066, 189221, 236490, 254009, 230056, 245615, 228421, 197393, 170446, 149013, 135462, 206584, 285281, 284578, 257110, 230073, 187101, 182342, 182482, 176273, 151432, 118042, 131286, 125896, 102041, 91183, 117129, 164982, 167995, 148615, 123171, 115473, 132233, 131381, 158989, 122823, 143318, 162527, 180109, 192519, 218510, 214310, 207029, 216532, 174298, 101926, 100383, 163696, 172763, 177134, 170856, 142553, 168112, 190198, 195205, 171909, 158029, 161792, 145854, 84215, 72754, 106924, 145925, 154586, 127614, 65441, 103324, 197981, 249783, 224078, 174716, 198138, 178264, 149911, 216412, 278739, 276610, 238436, 228475, 249502, 285506, 261004, 283150, 333185, 294030, 255950, 208267, 211181, 225232, 243827, 253961, 275504, 290375]
9309B90375Q720o1803m2899j4123N4420M8305l3169J5010p377j3992N9926N6247
9297C59640m9335j13176m4552J9608N4030O2055K6394j4159l0709P1954K1907
9286C63657K2483k866p6012n0250O029N1352M4166J4785n2331k2093O724J3970
9274C19614j0434p2396J0219P707J2956K3587j9276J6868M9863r058J5189j5300
9262C29539m2056M2201K5105n586J73J457L1879m2398l3368N583L2961M187l005
9249C46672J6029o744j5619j8492K3888L3339k7190m7247m6731M7338m022k3004
9237B78217j384j521J3865K6943k7041O0251M1643R344k6411n5985j6705J4435
9225C15651R864J6215J5584k3807m0710K2917K3119k0274R309L4047K5767k1235
$$ y = [290375, 299095, 237292, 194393, 180270, 234690, 282995, 249826, 264836, 257459, 243467, 303393, 359640, 310305, 197129, 152577, 172185, 226215, 288270, 314664, 300505, 269796, 341750, 363657, 386140, 383274, 307262, 257012, 263041, 314393, 358559, 373344, 321013, 298920, 305644, 319614, 309180, 236784, 247003, 254710, 267666, 291253, 271977, 288845, 338708, 329650, 344839, 329539, 287483, 329684, 354789, 349203, 349376, 350833, 382712, 340314, 306946, 312529, 345490, 349677, 346672, 362701, 355957, 340338, 321846, 345734, 379073, 351883, 304636, 257905, 305243, 301221, 278217, 276833, 275312, 289177, 316120, 289079, 349330, 390973, 400317, 373906, 317921, 301216, 315651, 325515, 341730, 357314, 333507, 292797, 315714, 338833, 318559, 327868, 361915, 387682, 366447]
9213C66447j9325L8052J2117J9596k6558L8170M6789m2700j9275o284Q014j1842
9201D03201k5347j635N3713L3254k6082n4809K2807N2035M406k7895M7323m1498
9189D39473n7500R6205N2666L763m033N2954k0700o9973O643O0771M3271k8365
9177E75175k8976r1834j6334M8818L6863j2179j7528J5136J5607R617L2467Q155
9165E74987Q1447j3261q4999k3968Q3845L3055J8801K2360K895K1215r8424j5446
9153F02507O5586M5932m0612l1908M101j0969J8572q717J2464L6527k9240K7763
9141F92006K0135K0842q7605k0269J3518M0077M046R844M3392j6715m9253M7058
9129G17076O0709N852N499K3551O999J1541K0043K3039J5495Q573o7664M015M9854
$$ y = [366447, 347122, 385174, 397291, 416887, 390329, 428499, 475288, 432588, 413313, 407029, 415043, 403201, 377854, 376219, 429932, 463186, 437104, 382295, 405102, 457137, 461543, 433648, 480971, 439473, 381973, 478178, 530844, 534607, 530574, 583528, 562828, 492855, 499498, 560269, 603540, 575175, 546199, 454365, 438031, 486849, 523712, 511533, 494005, 509141, 524748, 534365, 566832, 574987, 656434, 643173, 558174, 534206, 618051, 651106, 669907, 692267, 695162, 716377, 617953, 602507, 668093, 714025, 673413, 641505, 645606, 634637, 653209, 644492, 656956, 693483, 664243, 692006, 712141, 732983, 645378, 625109, 638627, 678704, 682750, 692594, 735986, 719271, 670018, 717076, 777785, 783637, 789136, 812687, 819686, 831227, 851270, 874309, 889804, 898377, 830713, 834728, 884582]
9116H84582L5513J4538K8882M7349o832J6445k151L1259M7317K0177N1306P964
9104A176349M4009K1315O097K691L1219k4941L9525R4243N3232J4583J6184K2818
9092A497324K6710r642P663J3671N070o2791n1356L5372K8564J159L1947l094
9080A520597R1648J7509j1394K9057l0716m5872j445L5195L8209Q4079R8930M7667
9068A873464O688O1764J9450n254J9641M8800O4953M7897j9111j5400N7394N4954
9056B215240J7215P124J1427O0293K8304P0005P4235M4040L9190Q4022J14941
9045B766036R1253Q6907J16617O1006M1875J3820L8608L9529j6244N461L273J6440
9033C264581P0751J3833N3104l6276o6030j1165l3900N5796K8820k545N6004J7722
$$ y = [884582, 920095, 934633, 963515, 1010864, 1004032, 1020477, 1018326, 1049585, 1096902, 1117079, 1168385, 1176349, 1220358, 1241673, 1247770, 1250461, 1281680, 1256739, 1296264, 1390507, 1443739, 1458322, 1474506, 1497324, 1524034, 1514392, 1522055, 1535726, 1540796, 1478005, 1426649, 1462021, 1490585, 1491744, 1523691, 1520597, 1612245, 1629754, 1618360, 1647417, 1616701, 1570829, 1569384, 1604579, 1642788, 1726867, 1825797, 1873464, 1880152, 1941916, 1961366, 1956112, 1975753, 2024553, 2089506, 2137403, 2118292, 2102892, 2160286, 2215240, 2232455, 2239579, 2251006, 2311299, 2339603, 2409608, 2483843, 2527883, 2567073, 2651095, 2766036, 2857289, 2944196, 3060813, 3121819, 3163694, 3177514, 3216122, 3255651, 3239407, 3244868, 3248141, 3264581, 3335332, 3349165, 3402269, 3365993, 3299963, 3288798, 3254898, 3310694, 3339514, 3336969, 3392973, 3410695]
9021C410695J5864L5665M721M6263Q1316M8407N2593M1267Q5072N4786P3117K7280
9009C977046K1244O7238N8894K1461Q9762Q8723Q8053Q4519J769J2161K2333J24133
8997D657336J31769J32605J78959N4586O4718P5848O4296Q1504Q5416J18328J38815
8986E784180J58260J08789J90454J90104J51006J41390J61618K25672K71154K57022
8976G639649J51008J51057K50054K91142K66041K00132K40590K22355K42573K53716
8966I908317L36275L73537L01346L65071M21454M57553M66113M52252M84756M78364
8956A4045038N99103O24576O13354O28447O94050P23767Q22468R18544R35367
8947B0604714R20778J012382J156976J202214J313058J361589J564794J663362
$$ y = [3410695, 3426559, 3462224, 3466945, 3513208, 3594524, 3642931, 3695524, 3736791, 3821863, 3876649, 3949766, 3977046, 3998290, 4065528, 4124422, 4145883, 4235645, 4324368, 4412421, 4496940, 4498709, 4510870, 4533203, 4657336, 4789105, 4921710, 5100669, 5155255, 5219973, 5295821, 5360117, 5441621, 5527037, 5645365, 5784180, 5942440, 6051229, 6241683, 6431787, 6582793, 6724183, 6885801, 7111473, 7382627, 7639649, 7790657, 7941714, 8191768, 8482910, 8748951, 8949083, 9189673, 9412028, 9654601, 9908317, 10244592, 10618129, 10919475, 11284546, 11706000, 12163553, 12629666, 13081918, 13566674, 14045038, 14644141, 15268717, 15882071, 16510518, 17204568, 17928335, 18750803, 19669347, 20604714, 21525492, 22537874, 23694850, 24897064, 26210122, 27571711, 29136505, 30799867]
8939C0799867J705424J880364K019815K227494K358118K462308K716727L008707
8931D9178824L259630L454476L595292L887456M185601M478370M749465M887757
8923H1676871N017914N087117N121799N030966M849079M532561M136714L612713
8915A19065734K870498K073081J231219L62733n76397j391256k101651k711982
8907A18821979l183703l641178l974275m090061m138978m127716m067057l889180
8899H7709831l801034l542074l335540l193839l052137k808466k558351k374688
8891F3043702k015695j571497r98215j91784P25799J669702K259025J799066K83826
8882F5003929k055123n424536o470456m828418l298500k341345j909501j559743
$$ y = [30799867, 32505291, 34385655, 36405470, 38632964, 40991082, 43453390, 46170117, 49178824, 52438454, 55892930, 59488222, 63375678, 67561279, 72039649, 76789114, 81676871, 86694785, 91781902, 96903701, 101934667, 106783746, 111316307, 115453021, 119065734, 121936232, 124009313, 125240532, 125603265, 125026868, 123635612, 121533961, 118821979, 115638276, 111997098, 108022823, 103932762, 99793784, 95666068, 91599011, 87709831, 83908797, 80366723, 77031183, 73837344, 70785207, 67976741, 65418390, 63043702, 61028007, 59456510, 58458295, 58266511, 58992310, 60662012, 62921037, 64720103, 65003929, 62948806, 57524270, 51053814, 46225396, 42926896, 40585551, 38676050, 37116307]
8874C7116307j363764j252902j029097r38312q72736q53821q07885q65642q76002
8865B8256146q52944q24835q32067p49055p14981o92927o12412n88172n49487
8856B1839266n21668n16312n20777n49124n28668m62073l84611l86388m57911
8847A7511734m64625l58145l77602m24771l67775l61242l10110l40759l31477
8838A4175228k73677k46856k87761k76741k81264k52773k63014k41844k24396
8829A1826902k39152l02269k07563j94926k36812k64951k22995k28210k08603
8820I721421j31889j62296j04951j42220j43086j12859j65657j40077q5662j49115
8810H383609j76391j42761j34872j04078j03863m7456q1024q3978n9414j5156
$$ y = [37116307, 35752543, 34499641, 33470544, 32532232, 31659496, 30805675, 29997790, 29132148, 28256146, 27403202, 26578367, 25746300, 24997245, 24282264, 23589337, 22976925, 22388753, 21839266, 21317598, 20801286, 20280509, 19731385, 19202717, 18740644, 18356033, 17969645, 17511734, 17047109, 16688964, 16311362, 15886591, 15518816, 15157574, 14847464, 14506705, 14175228, 13901551, 13654695, 13366934, 13090193, 12808929, 12556156, 12293142, 12051298, 11826902, 11587750, 11285481, 11077918, 10882992, 10646180, 10381229, 10158234, 9930024, 9721421, 9589532, 9427236, 9322285, 9180065, 9036979, 8924120, 8758463, 8618386, 8532724, 8383609, 8207218, 8064457, 7929585, 7825507, 7721644, 7674188, 7593164, 7509186, 7449772, 7434616]
8800G434616j19393j04183j41545r3265k7971k4197l3519m6921j8062R676J1223
8789F846459j05486j27646j21503o9775o9526r1042j22747l3830m6871j31930
8779E926103j30517q0440j93289j20445j05879o4767o2481q5988o6034p5603q5309
8768D855351j21045j13584j10546r3788o9549L2556q0889q5159l7638n1327p8240
8757D046142j11957o4046o3648n9963o8290j34624j24045n5496m4266k8712p1145
8746C219950r0355k9374n6733n4364n4126o9384n5945q7464l7838l3611k260j05483
8734B543013n0959m0229m6348n4638Q283j9960k5287J3559k8445j16103l500j6896
8722B162490q2999k0894j8313K5362j5825n6397j505m857j3734o7834j4196K0295
$$ y = [7434616, 7315223, 7211040, 7069495, 6976230, 6948259, 6924062, 6890543, 6843622, 6825560, 6835236, 6846459, 6740973, 6613327, 6491824, 6422049, 6352523, 6261481, 6138734, 6104904, 6058033, 5926103, 5795586, 5715146, 5521857, 5401412, 5295533, 5230766, 5168285, 5082297, 5016263, 4940660, 4855351, 4734306, 4620722, 4510176, 4416388, 4346839, 4379395, 4298506, 4213347, 4175709, 4124382, 4046142, 3934185, 3870139, 3806491, 3746528, 3678238, 3543614, 3419569, 3364073, 3319807, 3291095, 3219950, 3129595, 3100221, 3043488, 2989124, 2934998, 2865614, 2809669, 2722205, 2684367, 2650756, 2648496, 2543013, 2492054, 2451825, 2405477, 2350839, 2359122, 2339162, 2313875, 2327434, 2298989, 2182886, 2179386, 2162490, 2079491, 2058597, 2040284, 2065646, 2049821, 1993424, 1991919, 1987062, 1973328, 1905494, 1891298, 1911593]
8710A911593Q375n8530k686K4991j3975J9250k8358l1655l6570l3778J2650o6462
8698A704845k0815J8773k178o2003m1784n4471k1460K2192L8726k3082k3964R925
8686A544704j0208k2289p7270K9046O2928J2372J095L4934p5999k3435j3832p751
8674A454295M204J0252N234R13m6663K330M4014J23794J40178J03266O7225N5319
8662A964361k2841j25246j99409j32807m9472K0256l9391j41461q1877K2017O7715
8651A281845Q0691l854l711n3141q9072k0737j2733k1032j8200R973M861n810
8639A149080j1442N133K4328m1830j5680j9087M2278L9061j3791p970p4639r9886
8627I75555K3438P805N1997M2428j2974l7341n3649J2724N469k3777L7739N4305
$$ y = [1911593, 1919968, 1861438, 1858752, 1883743, 1869768, 1889018, 1860660, 1829005, 1792435, 1758657, 1771307, 1704845, 1684030, 1702803, 1700625, 1638622, 1596838, 1542367, 1520907, 1543099, 1581825, 1558743, 1534779, 1544704, 1534496, 1512207, 1434937, 1463983, 1526911, 1539283, 1540378, 1575312, 1499313, 1475878, 1462046, 1454295, 1458499, 1468751, 1473985, 1474898, 1428235, 1430565, 1474579, 1598373, 1738551, 1841817, 1909042, 1964361, 1941520, 1816274, 1616865, 1484058, 1434586, 1454842, 1415451, 1273990, 1192113, 1214130, 1281845, 1362536, 1358682, 1354971, 1301830, 1212758, 1192021, 1179288, 1158256, 1140056, 1150029, 1154890, 1149080, 1137638, 1142771, 1167099, 1125269, 1109589, 1090502, 1132780, 1171841, 1158050, 1150080, 1075441, 975555, 998993, 1006798, 1058795, 1101223, 1088249, 1050908, 997259, 1009983, 1015452, 991675, 1029414, 1083719]
8615A083719M3144R191k276K3419O9837R825Q450Q978K3455J7402K1916K5276
8603A342336j3218r2908o1083o9130j5126k629m2614o3003n9413l3586l2245k5304
8591H32077m015j6892M4308k2738o0823l6140N1225J3333n5279o990J3778o9149
8579F82695N591j1363k8687K6402K7526j8713l8760m4803J9782q601o136l2436
8567E72497J4634P4942m1652j672l9082K5802N3753k2030l08j3390n7690q5031
8555D80773k9821M7218O8059P8573j1353o4612n7842N678K2071N3884K0426k5251
8543E87803n5196m79j3725n5944j7329N9448P3065k4284k4488n5635l1658P002
8531D48580M2673O8470J873l2518n5987k9415J2959L1966n355k4184q334l7297
$$ y = [1083719, 1126863, 1136054, 1133778, 1157197, 1227034, 1236859, 1245309, 1254287, 1277742, 1295144, 1317060, 1342336, 1329118, 1236210, 1175127, 1105997, 1090871, 1088242, 1045628, 982625, 923212, 889626, 857381, 832077, 828062, 811170, 855478, 832740, 771917, 735777, 787002, 800335, 745056, 738066, 751844, 682695, 688286, 676923, 648236, 674638, 702164, 683451, 644691, 599888, 619670, 611069, 604933, 572497, 587131, 662073, 620421, 618749, 579667, 605469, 659222, 637192, 636884, 623494, 565804, 480773, 450952, 498170, 566229, 644802, 633449, 568837, 510995, 516673, 538744, 592628, 613054, 587803, 532607, 532128, 518403, 462459, 445130, 504578, 577643, 553359, 528871, 473236, 441578, 448580, 491253, 559723, 561596, 529078, 473091, 443676, 456635, 488601, 483246, 459062, 450728, 413431]
8519D13431O120k8743K0472k1130o8796j5995M0422j3651j2927j3413j6624L0059
8507C19225K723J3046K3215L8703k338n4040o9659J4177L5053p858J3858r368
8495C16737J0987l4787L867P3603M205p1264N5002j003p4517J6801L8379L5044
8483C73054J0934K4066l8706O002j9083m4148m0911m5620K9027M9447N348j7538
8471B91872k7078k8887J3850L6174K8846P8991K1928N4464R709k1150j9335n6157
8459C83227K3658J3602j5041l0435r8186l0725J8482L67O0648k3491r7807m1531
8447A62768N5760K4886o593j149L6696O3664P812j5095j4672o3541m6356k483
8435B01697J8015M1185J4741J9071J9801j3751o1091j3169p469k2670L8790l4691
$$ y = [413431, 419551, 390808, 411280, 390150, 321354, 305359, 345781, 332130, 319203, 305790, 289166, 319225, 321948, 334994, 358209, 396912, 394574, 340534, 270875, 285052, 320105, 312247, 326105, 316737, 327724, 292937, 296804, 370407, 374612, 303348, 358350, 357347, 282830, 299631, 338010, 373054, 383988, 408054, 369348, 375350, 356267, 312119, 271208, 225588, 254615, 304062, 309410, 291872, 264794, 235907, 249757, 285931, 314777, 393768, 415696, 470160, 479869, 458719, 439384, 383227, 406885, 420487, 405446, 375011, 276825, 246100, 264582, 264949, 325597, 302106, 204299, 162768, 218528, 243414, 236821, 235672, 272368, 336032, 343844, 328749, 314077, 250536, 204180, 201697, 219712, 260897, 275638, 294709, 314510, 300759, 239668, 226499, 219030, 196360, 235150, 200459]
8423B00459n2486k3589K9463K5083O9182L3362l2309j3092K8159M9403q010l0383
8411B75242m4338j181Q025N388M8930r526k4045j4034j1073l3050O145L512Q9646
8398B99641N7687j7505o1142k8484r6J2991l2607o675K1581P6474l582R198n2227
8385B75254M194k733j8383n9856o3397L5464N0452L9356n1129j6995k6407o2706
8373A03114l4896K140O634J4804N4371N1786M0092J556o1135L0545J4832n118
8361B18725P682k5354m5007K308k0643L8846K1879O8145J7491n3779l8501q135
8349A83657j5456k3558j5137O2023K7562o827k9156n0512J6864K1456J7862o7976
8337A20802q110L9385n8575K748K5555M5929k7397q325m1596L0668J9168m9121
$$ y = [200459, 147973, 124384, 153847, 178930, 248112, 281474, 249165, 236073, 264232, 313635, 305625, 275242, 230904, 229723, 237748, 243136, 292066, 282540, 258495, 244461, 233388, 200338, 206483, 209995, 299641, 357328, 339823, 278681, 250197, 250101, 263092, 230485, 223810, 245391, 321865, 318283, 327481, 275254, 279448, 276715, 258332, 198476, 135079, 170543, 220995, 260351, 209222, 192227, 165820, 103114, 68218, 70358, 76992, 91796, 146167, 197953, 238045, 239601, 178466, 209011, 223843, 218725, 226407, 201053, 156046, 158354, 137711, 176557, 198436, 266581, 284072, 230293, 191792, 183657, 168201, 144643, 129506, 191529, 219091, 212264, 183108, 132596, 149460, 170916, 188778, 120802, 112692, 152077, 93502, 96250, 121805, 167734, 140337, 132012, 90416, 121084, 140252, 91131]
8325I1131l5408O4708o805j0030M5861R569L2975J7281N669m95L553j2346J3960
8312B19623J153n1424o1230O2915j3724l5651K9309R7357m8574o2259K7859o417
8300A58937n25j1888k8398O0156K4799l5704l4337k8599j2014J4829J7756k6098
8288I8914k291n4656N236M8891J6975L6317K7638M7800m3820o0747l4278l6606
8276D9373n437P001M4643q031N951L5427k3767J603l0679K710K6230m2731n253
8263E7040R3369l9856k3561N7930M2396K0693J4455l6924l1999m1713o2j2413
8251I9355M589K1063j5398m3150o2949J859L2710K2100J5617j4772n227K4305
8239H0102l3974m8491j6327Q8120N1371k7926k8115j5375k5109j4854P785O9072
$$ y = [91131, 55723, 120431, 113626, 103596, 149457, 159026, 192001, 209282, 214951, 214456, 218009, 205663, 219623, 220776, 169352, 108122, 171037, 157313, 121662, 150971, 248328, 199754, 137495, 165354, 158937, 158412, 146524, 118126, 178282, 203081, 167377, 133040, 104441, 92427, 107256, 125012, 98914, 96623, 41967, 47203, 96094, 113069, 149386, 177024, 224824, 181004, 120257, 85979, 49373, 43936, 50937, 95580, 87549, 93500, 128927, 105160, 106763, 76084, 78794, 105024, 62293, 57040, 150409, 110553, 86992, 144922, 187318, 208011, 222466, 185542, 153543, 111830, 111768, 99355, 103944, 125007, 109609, 66459, 3510, 5369, 38079, 60179, 75796, 61024, 55797, 80102, 46128, -2363, -18690, 69430, 120801, 92875, 64760, 49385, 24276, 9422, 17207, 86279]
8227H6279J8147m1296j3858m845J831k4842j3702j547K9693J9443N8659R8082
8215B12044l6215n5860j7244L6853L399R165J4481L2759j5208k563J0574j1389
8203A80796J5562p535n515n9956k5706k6890j1157M5035M0154k7858L9954R462
8191A66346k0023k1248L899L2566j2247J9744l1849l1797k2155P414o6614m671
8179A9365M7198k0195M5357J9692l2242m574n3143J9086n933j4032P120L6608
8167F4307J4782l1924n4719L6022J8632N4816J0632k0068k0924q516k038K9345
8155I0347j420l9292Q584J4567J5606k0463m7747L1375M4078K1535J3285n2541
8143G7914p641l292j5542K1853K482J4851l7273L667j1489J7610N360L5840q574
$$ y = [86279, 104426, 63130, 49272, 44427, 46258, 21416, 7714, 6167, 35860, 55303, 113962, 212044, 175829, 119969, 102725, 139578, 142977, 152142, 166623, 199382, 184174, 181611, 192185, 180796, 196358, 188823, 183308, 123352, 97646, 70756, 59599, 104634, 144788, 116930, 156884, 166346, 146323, 125075, 128974, 161540, 149293, 169037, 137188, 105391, 83236, 90650, 24036, 19365, 66563, 46368, 91725, 111417, 79175, 74601, 21458, 40544, 34611, 20579, 27699, 64307, 79089, 47165, -7554, 28468, 47100, 101916, 112548, 92480, 71556, 63040, 61002, 90347, 88927, 49635, 58219, 72786, 88392, 67929, 20182, 51557, 95635, 117170, 130455, 77914, 70273, 66981, 51439, 73292, 75774, 90625, 53352, 57019, 45530, 63140, 68500, 104340, 95766]
8130I5766P62m0J8726k0339o0390J3894n633j9400k4484L4352K6254K60l5987
8117B3741j3589L2677N2194J2704j6387r09M0215n4321m2628n5269M9131J1316
8105C8875J0194Q0284L2787j706k4164n05o976L2673K1540k8918J5853P1343l2928
8092B08352q4797M0947K7933M661K329m8645m2733r144L0871K87r4939J4910J7107
8079F7139M5032M9075k1709m932J7919o1498Q907j6339m0400n5363M9940L5638
8067G3409n543M3344M4044j7354k0640j1025l5740M875L0495K5360l0625j2205
8055H8395j0795m5347N7892J2823M6922j7063Q375M629p10J818m564j452l1223
8042A09700O5231J5215p1780M324j2425M4763J8830n4411K5721k960J9917l363
$$ y = [95766, 96528, 96488, 115214, 94875, 34485, 48379, 42746, 23346, -1138, 33214, 59468, 59728, 23741, 10152, 42829, 95023, 107727, 91340, 90431, 130646, 76325, 33697, -21572, 27559, 38875, 49069, 129353, 162140, 160434, 136270, 135765, 128789, 161462, 183002, 154084, 169937, 241280, 208352, 123555, 164502, 192435, 197096, 199425, 150780, 108047, 98903, 129774, 130061, 35122, 50032, 67139, 112171, 161246, 139537, 134605, 152524, 91026, 99933, 83594, 43194, -12169, 37771, 73409, 67866, 111210, 155254, 137900, 117260, 106235, 70495, 75370, 105865, 131225, 100600, 88395, 77600, 32253, 90145, 102968, 149890, 132827, 141202, 145831, 145121, 146939, 142375, 140923, 109700, 174931, 190146, 118366, 122690, 110265, 155028, 173858, 119447, 145168, 142208, 162125, 158762]
8030A58762m8613j1634J6523j2089L3775K8067o4391M0849M1528L1736K0033o189
8018B28357P201L17p5095l3653J4691L4937K8926l9318o9240N4785K0666l1733
8006A40841m3780k4592L9731K7241K0283Q69k9502J003N672K8135O317M663j7434
7993A59447l9656j2069P2053j112q912k7476J9753J2479l7802o843O021o801K308
7980A31390o3396K6271M4162K5320L3871L453M1525j0201k5599k0926n8038M5318
7968A73150P8995J0253k5350j2545k1582l1035k2520R7699l0186l4343K9705p448
7956B04793p6886m7009l8951K1786j5510J7622J1791K0193J2306p38L070k34M7798
7943A60031O2356j4334p4880J0626K5286k6392j8773l2805n165R2374O8454L69
$$ y = [158762, 110149, 98515, 115038, 102949, 136724, 164791, 100400, 141249, 182777, 214513, 234546, 228357, 235558, 235875, 160780, 127127, 141818, 176755, 205681, 166363, 97123, 151908, 172574, 140841, 97061, 72469, 112200, 139441, 159724, 160593, 131091, 132094, 137766, 165901, 172218, 176881, 159447, 119791, 107722, 179775, 178663, 169751, 142275, 162028, 174507, 136705, 129862, 135883, 129082, 131390, 67994, 94265, 138427, 163747, 197618, 201071, 242596, 232395, 206796, 185870, 127832, 173150, 252145, 262398, 237048, 224503, 202921, 171886, 149366, 247065, 216879, 182536, 212241, 204793, 127907, 80898, 41947, 63733, 48223, 65845, 77636, 97829, 110135, 109397, 112467, 112233, 160031, 222387, 208053, 133173, 143799, 169085, 142693, 123920, 91115, 85950, 178324, 246778, 247147]
7931B47147m6637j6672K0373Q557K0449k8786m3753K7581k535j6758m6662j9870
7919A02434L6524k6159L255j4789M0664m0367k8611J359J9662P8698M522k9783
7907A47409J4956J2590m5853p2996K338n070k0194o357N9544J5994k4616P780
7895H5525k3611l221K5895J3166k3787K6339K1980K0983j4324l7960m3639k0290
7883B7056N0595M0493j5548m7353j0251K1929k9829J9258L9201N460m7369K2268
7871G5910J6876k3816p1009l1857Q4424M8691M555k4968m1206j6960M6202P3260
7859A40102L7339l9368q5607K2162P903o6291O698O4562M0785j2664Q312N3730
7847A77663j6606k8274p708k5364J5965J8566J3348k3687j1528J6797J3119l9353
$$ y = [247147, 200510, 183838, 204211, 212768, 233217, 204431, 160678, 188259, 185724, 168966, 122304, 102434, 138958, 112799, 116054, 101265, 141929, 101562, 72951, 74310, 93972, 172670, 177192, 147409, 162365, 174955, 129102, 56106, 58444, 53374, 33180, 26823, 86367, 102361, 77745, 85525, 61914, 58693, 84588, 97754, 73967, 100306, 122286, 143269, 128945, 90985, 47346, 27056, 77651, 118144, 102596, 55243, 44992, 66921, 37092, 56350, 95551, 101011, 53642, 75910, 92786, 68970, -2039, -33896, 50528, 99219, 103774, 78806, 37600, 20640, 66842, 140102, 177441, 138073, 52466, 74628, 82531, 16240, 22938, 87500, 128285, 115621, 123933, 177663, 161057, 132783, 125075, 99711, 115676, 134242, 147590, 123903, 112375, 129172, 142291, 102938]
7835A02938l5702K6290o33j0362o5377M2160M6698j2491J252L8797p7o4200j7220
7822E2073k7516K4812K3380K8071K5857L767l2611k705p849K921J7845j1326m9743
7809D6976o4423o286N1030Q06J2884J6362k3986J284o6544o0005Q88N5926L5889
7796H01J7984M2739K2478j7869k22Q937p2135j4816Q3735L8558j1743J0716o816
7783A02347k8873j6211L0487j0114j0190n5134m5383P018N8020M4030M2691n616
7771A13072o1173m1015k488l7152r9875J4305O8176K3705k6894L0557K969K9161
7759A3348O476l6051P9483L9550m6990m5226L442m4795k9048P5951m681k4452
7747a2993p132J0471L4520q342j205m4452k0764J0433k541K8750L2426j6746J9589
$$ y = [102938, 67236, 93526, 92893, 82531, 17154, 59314, 106012, 93521, 94773, 133570, 133493, 69293, 52073, 24557, 49369, 72749, 100820, 126677, 130444, 97833, 95128, 87279, 90200, 108045, 96719, 46976, -17447, -23733, 27297, 28103, 40987, 57349, 33363, 34647, -31897, -91902, -91014, -35088, 801, 18785, 61524, 84002, 66133, 65911, 74848, 2713, -12103, 71632, 110190, 98447, 109163, 102347, 73474, 57263, 87750, 77636, 67446, 12312, -33071, -26053, 31967, 75997, 118688, 113072, 51899, 10884, 8396, -28756, -128631, -114326, -46150, -22445, -49339, -18782, -15813, 13348, 19824, -16227, 63256, 102806, 55816, 10590, 14032, -30763, -59811, 16140, 11459, -12993, -20125, -9654, 24866, 16524, 15319, -29133, -49897, -39464, -42005, -13255, 19171, 2425, 22014]
7734B2014N5130K461m9442L793m1511n6882O4788J7299L4110J6024N8509n789
7722A20504j9230K7614L274n1136r062k2539m3084L653N7629o67n0493p2340k5189
7709h1066J3897O7053L5110J4314N5035k851p2820M7056j5219k3967K7971Q235
7697G2748l8206p5537J6474O461J3512L3914k695J6938L3373j9498l0764k5095
7685A625j129l7432J5750O7390K822q042K2399K5570l7759m1229k4859K1106Q265
7672A4477j0829K5748J4823L8803k1821m7516l7847L9423N1608L4014R974q0262
7660C0595n5634p756J5550m475K7522M0201r067J0567L8910l6596p2560J5921
7648f822j9160l1165l2925q486J9867P895K5463K7498j4101j5803n7568q991M8008
$$ y = [22014, 77144, 79605, 30163, 33956, -7555, -64437, 351, 17650, 51760, 67784, 126293, 120504, 101274, 128888, 132162, 81026, 71964, 49425, 6341, 9994, 67623, 66956, 16463, -55877, -81066, -67169, -116, 34994, 49308, 104343, 101492, 28672, 75728, 60509, 36542, 64513, 72748, 34542, -40995, -24521, -18060, -4548, 29366, 26671, 43609, 76982, 57484, 26720, 1625, 496, -36936, -21186, 46204, 49026, 40984, 63383, 88953, 51194, 9965, -14894, 6212, 14477, 3648, 29396, 44219, 83022, 61201, 13685, -24162, 15261, 66869, 100883, 110857, 30595, -25039, -32795, -17245, -21720, 5802, 46003, 36936, 47503, 86413, 49817, -22743, -6822, -25982, -57147, -90072, -98558, -78691, -70796, -45333, -17835, -31936, -47739, -105307, -114298, -66290]
7635f6290Q0864K577j2453l3544k7395Q2439L6990r296m6295J6725K5967n9645
7623i356m59P356j0747J1015K2301j8291k7930j5260K8359M392j0852j9103J155
7610c7420j8352P9536R865J7326j3583L0747K471j6790M5175m3737p5840m0690
7598f1292m760R8023L1323k4823j1075l6399l7244N7509L5540j1849K9179M0934
7586A05066j6713j8913o5340l3025M2409L0910L583n0279J5375j0176K1325R737
7574C3959o0394N069J5728L0340n6726k3195l5268k6002K5868K3525L2486K1540
7562a3070J6282N9006l651k6728j2337j2771J6231p548J565l781K4037l8292o510
7549g567M577n96N920j2341j7458k389M5490J1329l2828L000J0113j7531n1018
$$ y = [-66290, 14574, 17151, 4698, -28846, -56241, 26198, 63188, 53892, 7597, 24322, 50289, -9356, -9815, -2459, -13206, -2191, 20110, 1819, -26111, -41371, -13012, -8620, -19472, -38575, -37420, -55772, 23764, 33629, 50955, 37372, 68119, 70590, 53800, 98975, 55238, -20602, -61292, -66052, 31971, 63294, 38471, 27396, -9003, -46247, 11262, 46802, 34953, 64132, 105066, 88353, 69440, 4100, -28925, 13484, 44394, 47977, -2302, 13073, 2897, 24222, 33959, -26435, -21366, -5638, 24702, -32024, -55219, -90487, -116489, -90621, -67096, -34610, -13070, 3212, 62218, 58567, 31839, 19502, 6731, 22962, 15414, 16979, 13198, 37235, -1057, -7567, -2990, -3586, 2334, -10007, -27465, -29854, 15636, 26965, -5863, -2863, 7250, -10281, -61299]
7536f1299J7380l9188l7063Q6237O8037J790n51L8477l7860k9998l8070j2815
7524d4923l861K1773L0410J8672q179J5217O1925P2463o303n0502l7368k3038
7512D6286l5148m1272j0234Q9357q570j0655P7923l2181j9245l553k6039j4642
7500A2027l748k2888o6079o294k8248J7117K830M3800N732K5728L804O2508n4856
7487h567l0803P6064K1104n9723J0852n950k1728q5968j8146P3649O2810L1181
7475D4775k0568n8388o4390j1582P7435J07630L4522m4190j3315p646j6627m0736
7463a3080k7824p983P38k617O8916J2344M3370L2848n5627j2233N7183j5977k1628
7450E8430l3900l0936j3513o6887o1930O4877R2924j1698J9326j2684J4183O4035
$$ y = [-61299, -43919, -83107, -120170, -33933, 34104, 35894, 35343, 73820, 35960, 5962, -32108, -44923, -48784, -27011, 3399, 22071, 13892, 29109, 91034, 163497, 157194, 106692, 69324, 46286, 11138, -30134, -40368, 48989, 40419, 29764, 107687, 75506, 56261, 52708, 26669, 12027, 8279, -14609, -80688, -86982, -115230, -98113, -95283, -51483, -45751, -20023, -16219, 46289, -8567, -39370, 36694, 57798, -1925, 8927, 2977, -18751, -104719, -122865, -49216, 13594, 44775, 24207, -34181, -98571, -110153, -32718, 74912, 109434, 65244, 51929, 44283, 27656, -13080, -40904, -48887, -48149, -50766, 18150, 30494, 73864, 106712, 51085, 38852, 96035, 80058, 58430, 24530, -6406, -19919, -86806, -148736, -83859, 9065, -2633, 16693, 4009, 18192, 82227]
7438H2227m5284j8788M9075K1130k6658r8637m5832l853p8196j8347O0926O4498
7426e7739R963L4409M9143K9764o38K9241n8534o3108j5140M5714L923j2493L3499
7413B8004N3541k6081n6013k1209J8886l115K1K1294L6115k4948j9096J3162N7860
7400G8421M2340k3621n9843k8552k9463k1258M0681O7972M3228j114k8732p2252
7388G807K0321J0197m8632N5313O0828Q164l8918j8477j3040j50m299J2955M495
7375E6564m2811J2978L2063m0906k9417K1072k6757l8476N1358O593J4106J973
7363A8340l8429j2525k899M9566J1809M734J2336J3620j9273L9392j633P807j8438
7350F4407n6136k0480n5175J5767j5859l272P1641P793k6187O230J834N1359j3184
$$ y = [82227, 36943, 18155, 67230, 88360, 61702, -36935, -82767, -86620, -164816, -183163, -122237, -57739, -47776, -13367, 35776, 65540, 64902, 94143, 35609, -27499, -42639, 3075, 6998, -5495, 28004, 81545, 55464, -549, -21758, -2872, -5987, -5966, 15328, 51443, 26495, 7399, 20561, 78421, 120761, 97140, 37297, 8745, -20718, -41976, -1295, 66677, 109905, 108791, 80059, 7807, 28128, 38325, -10307, 45006, 105834, 113998, 75080, 56603, 43563, 43413, 39114, 52069, 56564, 13753, 26731, 58794, 17888, -11529, 9543, -17214, -55690, -4332, 2261, 16367, 18340, -20089, -32614, -35513, 14053, 25862, 30596, 42932, 56552, 37279, 76671, 75038, 82845, 64407, 8271, -12209, -67384, -51617, -67476, -70748, 893, 8686, -17501, -11271, -9437, 41922, 28738]
7337B8738j2487m6100m1583L5739J5073P121m3051n1398L2541J8670q335N2219
7325a2853J9146J313J8443N0003q353n5934n5472J4371N9125O6019k0434p3847
7313A527m3497P080K7815N1303R715k921p908N020l1580M8039K538l0071j7360
7300A9700j1945m8487j9931m035L2753K3938O2616J108J2508j9004l0319n3263
7288c4361m9190M7181Q2690k1795J3414O847n5963j801k8357L9619J1983j9119
7276h852J3340M446l026N0948K2934L5530n5866m2186o4880J8994M1996l4347
7264b0969J2928j4389K8019R521j757J6518R85j4373p771j1055O7391K5315K858
7251I3221n8131m0397k8588J756J2402l5784k1087M1268K9795p751k8288J8217
$$ y = [28738, 16251, -29849, -71432, -35693, -20620, -13499, -56550, -107948, -75407, -56737, -65072, -12853, 6293, 7606, 26049, 76052, 67699, 11765, -43707, -29336, 29789, 95808, 75374, 1527, -41970, -34890, -7075, 44228, 53943, 51022, 43114, 48134, 16554, 64593, 67131, 37060, 19700, 7755, -40732, -60663, -64698, -31945, -8007, 54609, 55717, 68225, 49221, 18902, -34361, -83551, -36370, 46320, 24525, 37939, 44786, -11177, -12978, -41335, -1716, 10267, -8852, 4488, 8934, 5908, 56856, 79790, 115320, 59454, 17268, -47612, -28618, 13378, -20969, -8041, -22430, 5589, 15110, 13353, 29871, 30856, 16483, 8712, -2343, 65048, 90363, 93221, 35090, -5307, -33895, -32139, -19737, -55521, -76608, -35340, -5545, -13296, -41584, -23367]
7239b3367K2250J1653N0378l1571o8224l8094J9219L9907M2456M7608o1469P981
7227A8727l641l9513r271j4375M5508J7049L8628N173K3196K9555J38L0499k6067
7214A15606n4620j5218m2490K234O954M1750m7303j1872L3242J2580n3218p5988
7202h8343j0648L5874j4803l2838K2721M9694K1538N4300j1175k3139M1007J0058
7190E4246j5671k3406k6795p311J651J3950k4361j7676K4852M6200M084q497K8884
7177E0150l2532n8153j4888M7899N4448p926r517j8968m3721q30k7055J9090l065
7164d5068M531L2790K0767K3553o247j3338L8695K6799J2623l2986j2481L479
7152E3117j999l359o1801m3321L8545K5946K204l6288K2880J2220R049l9080n663
$$ y = [-23367, -1117, 10536, 60914, 29343, -38881, -76975, -57756, -17849, 24607, 72215, 10746, 18727, 15086, -24427, -33698, -48073, -2565, 14484, 53112, 58285, 81481, 111036, 111174, 141673, 115606, 60986, 45768, 3278, 5512, 12466, 54216, 6913, -4959, 28283, 40863, -12355, -88343, -98991, -63117, -77920, -110758, -88037, -38343, -16805, 37495, 26320, 3181, 44188, 54246, 38575, 15169, -11626, -18937, -17286, -3336, -27697, -45373, -20521, 25679, 29763, 21266, 50150, 17618, -40535, -55423, -7524, 46924, 38998, 29481, 10513, -33208, -34038, -61093, -42003, -45068, -40537, -7747, 13020, 36573, 30326, 16988, 55683, 82482, 95105, 62119, 49638, 53117, 51118, 47759, -14042, -57363, -18818, 7128, 9332, -26956, -4076, 8144, 17193, -21887, -27550]
7139b7550k439J4997J5168R77J8974l3285m3532K1464m920J5305L7573K4789P113
7126D4634n8754l5429J8210Q349K9531r63k6523L403L826J1714K5146n6350k1724
7113e4930M7904K0476O6289O91l0044m8318p740n831n202J1009m076N1340Q653
$$ y = [-27550, -29989, -14992, 176, 1153, 20127, -13158, -56690, -35226, -40146, -24841, 12732, 37521, 44634, -14120, -49549, -31339, -22990, 6541, 5578, -20945, -17542, -13716, -2002, 23144, -33206, -54930, -7026, 13450, 79739, 80430, 50386, 2068, -5672, -11503, -16705, -5696, -9772, 41568, 50221]
$$ [...]
##END NTUPLES=NMR SPECTRUM
##END=
