##TITLE=Analysis number 318572
Compound Code cc 44546
Book Reference 464/28
Project Code adrs
Chemist Name chrisr
##JCAMPDX= 6.0         $$ Bruker NMR JCAMP-DX V2.0
##DATA TYPE= NMR SPECTRUM
##DATA CLASS= NTUPLES
##ORIGIN= Bruker BioSpin GmbH
##OWNER= nmr
$$ XWIN-NMR		Version 3.5
$$ Wed Apr  5 09:09:32 2006 GMT Daylight Time (UT+1h)  MAYBRIDGE\nmr@NMR_250MHZ
##.OBSERVE FREQUENCY= 250.131544655141
##.OBSERVE NUCLEUS= ^1H
##.ACQUISITION MODE= SIMULTANEOUS (DQD)
##.ACQUISITION SCHEME= undefined
##.AVERAGES= 16
##.DIGITISER RES= 18
##SPECTROMETER/DATA SYSTEM= dpx250
##.PULSE SEQUENCE= zg30
##.SOLVENT NAME= CDCl3
##.SHIFT REFERENCE= (INTERNAL, CDCl3, 0, 16.522)
##AUDIT TRAIL= $$ (NUMBER, WHEN, WHO, WHERE, WHAT)
$$ ##TITLE= Audit trail, XWIN-NMR		Version 3.5
$$ ##JCAMPDX= 5.01
$$ ##ORIGIN= Bruker BioSpin GmbH
$$ ##OWNER= nmr
$$ C:\u/data/dgb/nmr/ADRS/2020/pdata/1/auditp.txt
$$ ##AUDIT TRAIL=  $$ (NUMBER, WHEN, WHO, WHERE, WHAT)
(   1,<2006-04-05 09:09:00.57 +100>,<MAYBRIDGE\nmr>,<NMR_250MHZ>,
      <created by zg, POWCHK disabled, PULCHK disabled
       configuration hash MD5:
       84 BC 41 DB A1 6E 1D 46 DA 25 12 A5 C1 ED C5 3A
       data hash MD5: 64K
       41 85 66 31 B2 50 8C D7 8A 46 CA 93 D8 6D 6F 73>)
(   2,<2006-04-05 09:09:19.45 +100>,<MAYBRIDGE\nmr>,<NMR_250MHZ>,
      <Start of raw data processing
       ef LB = 0.3 FT_mod = 6 PKNL = 1 SI = 32K 
       data hash MD5: 32K
       77 C0 A0 D3 DB 99 86 44 0B 99 2A 25 E7 0F BC 39>)
(   3,<2006-04-05 09:09:21.49 +100>,<MAYBRIDGE\nmr>,<NMR_250MHZ>,
      <apk 
       data hash MD5: 32K
       B6 2C 73 A2 C3 3C EF 53 CA 41 68 20 85 0B 75 34>)
(   4,<2006-04-05 09:09:22.34 +100>,<MAYBRIDGE\nmr>,<NMR_250MHZ>,
      <abs ABSG = 5 
       data hash MD5: 32K
       A8 2D 52 76 C9 3B 6B 03 F0 C9 8E BB 18 C5 8D E7>)
$$ ##END=
$$ 
$$ hash MD5
$$ E5 AC CC 94 D3 E6 77 D8 45 09 BF 3C FD 1B 1F C2
##$RELAX= 
##$RELAX= 
##$RELAX= 
##$RELAX= 
##$RELAX= 
##$RELAX= 
##$RELAX= 
$$ Bruker specific parameters
$$ --------------------------
##$DU= <C:\u>
##$EXPNO= 2020
##$NAME= <ADRS>
##$PROCNO= 1
##$TYPE= <nmr>
##$USER= <dgb>
##$AMP= (0..31)
100 100 100 100 100 100 100 100 100 100 100 100 100 100 100 100 100 100 
100 100 100 100 100 100 100 100 100 100 100 100 100 100 
##$AQSEQ= 0
##$AQ_mod= 3
##$AUNM= <au_zg>
##$AUTOPOS= <4 >
##$BF1= 250.13
##$BF2= 250.13
##$BF3= 250.13
##$BF4= 250.13
##$BF5= 500.13
##$BF6= 500.13
##$BF7= 500.13
##$BF8= 500.13
##$BYTORDA= 1
##$CFDGTYP= 0
##$CFRGTYP= 5
##$CHEMSTR= <none>
##$CNST= (0..31)
1 1 145 1 1 1 1 1 1 1 1 1 1 1 1 1 1 1 1 1 1 1 1 1 1 1 1 1 1 1 1 1 
##$CPDPRG= <>
##$CPDPRG1= <>
##$CPDPRG2= <>
##$CPDPRG3= <>
##$CPDPRG4= <mlev>
##$CPDPRG5= <mlev>
##$CPDPRG6= <mlev>
##$CPDPRG7= <mlev>
##$CPDPRG8= <mlev>
##$CPDPRGB= <>
##$CPDPRGT= <>
##$D= (0..31)
0 1 0 0 0 0 0 0 0 0.06 0 0 0 0 0 0 0.0002 0 0 0 0 0 0 0 0 0 0 0 0 0 0 
0 
##$DATE= 1144224538
##$DBL= (0..7)
120 120 120 120 120 120 120 120 
##$DBP= (0..7)
150 150 150 150 150 150 150 150 
##$DBP07= 0
##$DBPNAM0= <>
##$DBPNAM1= <>
$$ [...]
##$SUBNAM7= <"">
##$SUBNAM8= <"">
##$SUBNAM9= <"">
##$SW= 20.6930455092707
##$SWIBOX= (0..15)
0 0 3 0 0 0 0 0 0 0 0 0 0 0 0 0 
##$SW_h= 5175.983436853
##$TD= 65536
##$TD0= 1
##$TE= 294.16
##$TE2= 300
##$TE3= 300
##$TEG= 300
##$TL= (0..7)
0 120 120 120 120 120 120 120 
##$TP= (0..7)
150 150 150 150 150 150 150 150 
##$TP07= 0
##$TPNAME0= <>
##$TPNAME1= <>
##$TPNAME2= <>
##$TPNAME3= <>
##$TPNAME4= <>
##$TPNAME5= <>
##$TPNAME6= <>
##$TPNAME7= <>
##$TPOAL= (0..7)
0.5 0.5 0.5 0.5 0.5 0.5 0.5 0.5 
##$TPOFFS= (0..7)
0 0 0 0 0 0 0 0 
##$TUNHIN= 0
##$TUNHOUT= 0
##$TUNXOUT= 0
##$USERA1= <user>
##$USERA2= <user>
##$USERA3= <user>
##$USERA4= <user>
##$USERA5= <user>
##$V9= 5
##$VALIST= <valist>
##$VCLIST= <CCCCCCCCCCCCCCC>
##$VD= 0
##$VDLIST= <DDDDDDDDDDDDDDD>
##$VPLIST= <PPPPPPPPPPPPPPP>
##$VTLIST= <TTTTTTTTTTTTTTT>
##$WBST= 1024
##$WBSW= 4
##$XGAIN= (0..3)
0 0 0 0 
##$XL= 0
##$YL= 0
##$YMAX_a= 417101
##$YMIN_a= -392891
##$ZGOPTNS= <>
##$ZL1= 120
##$ZL2= 120
##$ZL3= 120
##$ZL4= 120
##$ABSF1= 16.522
##$ABSF2= -4.171173
##$ABSG= 5
##$ABSL= 3
##$ALPHA= 0
##$AQORDER= 0
##$ASSFAC= 0
##$ASSFACI= 0
##$ASSFACX= 0
##$ASSWID= 0
##$AUNMP= <proc_1d>
##$AZFE= 0.1
##$AZFW= 0.1
##$BCFW= 0
##$BC_mod= 0
##$BYTORDP= 0
##$COROFFS= 0
##$CY= 12.5
##$DATMOD= 1
##$DC= 0
##$DFILT= <>
##$DTYPP= 0
##$F1P= 14.0000005364418
##$F2P= -0.99999901652339
##$FCOR= 0.5
##$FTSIZE= 32768
##$FT_mod= 6
##$GAMMA= 0
##$GB= 0
##$INTBC= 1
##$INTSCL= 1
##$ISEN= 128
##$LB= 0.3
##$LEV0= 0
##$LPBIN= 0
##$MAXI= 10000
##$MC2= 0
##$MEAN= 0
##$ME_mod= 0
##$MI= 0
##$NCOEF= 0
##$NC_proc= -3
##$NLEV= 6
##$NOISF1= 0
##$NOISF2= 0
##$NSP= 0
##$NTH_PI= 0
##$NZP= 0
##$OFFSET= 16.522
##$PC= 1
##$PHC0= 22.08952
##$PHC1= 5.750669
##$PH_mod= 1
##$PKNL= yes
##$PPARMOD= 0
##$PSCAL= 4
##$PSIGN= 0
##$REVERSE= no
##$SF= 250.13
##$SI= 32768
##$SIGF1= 0
##$SIGF2= 0
##$SINO= 400
##$SIOLD= 32768
##$SREGLST= <1H.CDCl3>
##$SSB= 0
##$STSI= 32768
##$STSR= 0
##$SW_p= 5175.98343685301
##$SYMM= 0
##$S_DEV= 0
##$TDeff= 65536
##$TDoff= 0
##$TI= <Analysis number 999999
Compound Code 99
Book Reference 9
Project Code 9>
##$TILT= no
##$TM1= 0
##$TM2= 0
##$TOPLEV= 0
##$USERP1= <user>
##$USERP2= <user>
##$USERP3= <user>
##$USERP4= <user>
##$USERP5= <user>
##$WDW= 1
##$XDIM= 32768
##$YMAX_p= 339328354
##$YMIN_p= -36318
$$ End of Bruker specific parameters
$$ ---------------------------------
##NTUPLES= NMR SPECTRUM
##VAR_NAME=  FREQUENCY,     SPECTRUM/REAL,   SPECTRUM/IMAG
##SYMBOL=    X,             R,               I
##VAR_TYPE=  INDEPENDENT,   DEPENDENT,       DEPENDENT
##VAR_FORM=  AFFN,          ASDF,            ASDF
##VAR_DIM=   32768,         32768,           32768
##UNITS=     HZ,            ARBITRARY UNITS, ARBITRARY UNITS
##FACTOR=    0.157963299565203, 1,           1
##FIRST=     4132.6476996994, 0,             0
##LAST=      -1043.33573715361, 0,           0
##MIN=       -1043.33573715361, -36318,      0
##MAX=       4132.6476996994, 339328354,     0
$$ Real data points
##PAGE= N=1
##DATA TABLE= (X++(R..R)), XYDATA
$$ [...]
17127A0480Q858l71K108j2347M146M432o95j580N479n541j0254j948R494Q55j0447
17112B669k740k87O502j4503R2J1343O841N077j987p531k625j449J445Q429j028
17097A0248j2144n420M910R817R22K803p706q257R27m627l207J7148R156j2239
17083B331m4M810K730l153j514K130n930n57M712L297r9o93p674J356p67n750
17067d815l795L682R652M491o798r33K009q276j209J485P470M279L798l767n487
17052A786r83k979O52l391J026K118J294Q240N084j112K337K508j490j782l686
17037I622n932j809l378J563l965L164O632L110p328K559O787L962m4o249j1803
17022c109m98M528M560R82m825r780L736k64Q26K647M901M661o34k978l412O082
$$ y = [10480, 19338, 18967, 21075, 8728, 12874, 17306, 16611, 15031, 20510, 14969, 4715, 2767, 12261, 13116, 2669, -71, -358, 6144, -8359, -8267, 3076, 9917, 14994, 13007, 5476, 2851, 1402, 2847, 11276, 10248, -1896, -7316, -2406, 7411, 8333, 11136, 3430, -4827, -3900, -8527, -11734, 5414, 14570, 2331, 2287, 7097, 9827, 6674, 5160, 7290, 1360, 803, 5515, 8812, 8713, 8020, 346, 1702, 935, -4815, -8610, -4928, 4724, 9215, 2417, 1484, 3493, -4783, -5992, -4507, 2963, 7242, 11040, 7273, 1786, 803, -2176, -1524, -4915, -3889, -1771, -477, 7763, 12847, 11735, 14072, 16580, 15090, 13308, 9622, 3690, 1881, -1497, 66, -3899, -735, 5897, 9007, 1679, 4238, 11025, 14987, 14943, 8694, -3109, -3607, 921, 5481, 6463, 1638, -8142, -4406, -4670, -3844, -1197, 3704, 8365, 7731, 4753, 1341, 7423]
17006G423j149N3k469M83j336k46P746N04M730j740n641K406l842j1889m850L749
16990f068O956L682J626n496l126n63j01j114m761Q18O455M729K0l454n005p03
16974f105L683L830M138m538o387j657P646Q128P091K223j385K841k509r280j190
16959F529n70M797k630r498N674O166m504j202j289o01J942q787l574K998P862
16944C313N328r778j1062M64M845J60o306J432P599m032o38m531Q597J2658J606
16929I655J03J061r67j5915j166M402n447K598J226o529J391R685K9l596j208
16914d678j027P570N682O34n968k756n434q888j0153P796Q936K176N327J525j568
16899h26m135K987M313j0142M727L253M880k140L28J556k711l343L730K379N963
$$ y = [7423, 6274, 6327, 3858, 4341, 3005, 2759, 10505, 11009, 15739, 13999, 8358, 10764, 6922, -4967, -9817, -6068, 888, 4570, 6196, 700, -2426, -2989, -3090, -4204, -8965, -8147, -1692, 3037, 3057, -397, -5402, -6105, -2422, 1408, 5546, 1008, -5379, -7036, 610, 8738, 15829, 18052, 16667, 19508, 16999, 7719, 6529, 5959, 10756, 8126, -1372, 4302, 10468, 5964, 4762, 3473, 2872, 4814, -3973, -7547, -4549, 3313, 8641, -1137, -12199, -11735, -6890, -6730, -13036, -11604, -4005, -8037, -8675, -13206, -4609, 8049, 9655, 9758, 10819, 9852, -6063, -7229, -2827, -8274, -5676, -4450, -10979, -9588, 97, 126, -3470, -4678, -5705, 1865, 7547, 8181, 2213, -543, -5977, -14865, -25018, -17222, -8286, -6110, -783, 742, -826, -4961, -1974, 2339, -7803, -3076, 177, 5057, 2917, 3245, 4801, 2090, -1253, 2477, 4856, 10819]
16884A0819k660l698R41P342j0023m584M069k999p881O867Q289l595l022O228
16870F093L795j073L366o566k214k760K65J789j129M651j514m218O153M926O88
16855A2252o991J50L43j93j1916J673J772r54j086j224M681J797r547q90l307
16840a3440L248j590R895M89K208M845k082j396P663Q690n210j105K226n614j0062
16825a235k617Q849M246J810j1183j376P467K15k829m803q11n689M04J2151R3
16810D692L120M529N776l539l32k070j1603K58l29n183n49l666n370L857O229
16795d180O70O196N073l972m652k885l444J859R794j098R58J061m514n66j41P151
16779G310r76L270M396k935N602j1048r395M066m360l141l456j05O924m131k707
$$ y = [10819, 8159, 4461, 5402, 12744, 2721, -1863, 2206, -793, -8674, -1807, 6482, 2887, -135, 6093, 9888, 8815, 12181, 5615, 3401, 641, 906, 2695, 1566, 6217, 4703, 485, 6638, 11564, 12252, 5261, 5411, 5754, 5561, -6355, -4682, -2910, -3864, -4950, -6174, -1493, 304, -9243, -10133, -13440, -10192, -11782, -1887, -1398, 810, 5655, 3573, 2177, 9840, 18530, 13320, 12215, 14441, 8827, -1235, -3852, 4997, 9243, 11053, -130, -1506, 5961, 6176, 3347, -1456, -2267, -7956, -7552, 4599, 4692, 7812, 12341, 18117, 14578, 14246, 12176, 573, 831, 502, -4681, -5230, -8896, -14266, -10409, -4180, -3510, 2686, 7759, 3787, -865, -3750, -7194, -5335, 4459, 3361, 4319, 5380, 866, 300, 159, 7310, 6334, 9604, 14000, 11065, 16667, 5619, -3776, 290, -4070, -7211, -10667, -10772, -3848, -7979, -10686]
16764a0686J091m850J759Q103O232R481k3M917M063m337o489j823r235j420L088
16749a29j296j214j0211m858J937k704J1957J0694L121P42p13O511j571m557j745
16734E964j96L325k461P701J116k300j595j2935j697N010K869o85N23K412l678
16719C373k711j160j1801j5j40o429L458L820m210j357L132K999Q8L874P261l491
16703c309j600M199L557k38R907L490J153p441k507j1588o490n51J2854K795o326
16688b095O104J0817o317J914K020o027p72n626l040O792P17k745p666K987j853
16673d790j0196o514O683j417K060j154O850m6m968J1245M889K417m339q220l53
16658g853k301J640R60R286k74K559O15k902Q50J1437L284j2812o513p470n777
$$ y = [-10686, -9595, -14445, -12686, -4583, 1649, 11130, 11107, 16024, 20087, 15750, 9261, 7438, -1797, -3217, -129, -1425, -2639, -12850, -17708, -15771, -18475, -6518, 4176, 7297, 8039, 7326, 13837, 12266, 7709, 5964, 5768, 9093, 6632, 14333, 15449, 13149, 11554, -1381, -3078, 1932, 4801, 4116, 4639, 7051, 3373, 662, -498, -12299, -12314, -12454, -18883, -15425, -11605, -15815, -17172, -14040, -11041, -10953, -7079, 182, -3309, -4909, -710, 2847, 2609, 12516, 16006, 17159, 9718, 7211, -4377, -10867, -11418, 1436, 4231, -2095, 4009, 14826, 8509, 10423, 12443, 6416, 5644, 18, -3022, 3770, 4487, 1742, -5924, -2937, -4790, -14986, -21500, -14817, -16234, -14174, -15328, -8478, -8524, -13492, -2247, 2642, 5059, 720, -7500, -7853, -10154, -8514, -7554, 1732, 1458, 4017, 4632, 1730, 2580, 14017, 17301, 4489, -2024, -9494, -15271]
16643a5271P678K824j400N696N926P871n305K521L996j0952m271o9l01k572l87
16628d016j24P20M680m679l16m5L120m529l100P615m05j539M625k784r256j987
16612a2020L573N803q132q340K74j802N470N781K220j030O401M218n880J625l147
16597d986P94M710M489J070O85p08p574J284O633L084o126J66m812n345L262R83
16581b391j0677L966l31o679M831L665Q860P178q77k070p457k551P813N258N297
16566A3835J925j0201p051O34M521Q379Q368l141k542r61k196N23M339J366n124
16551A2674o384m141K043m536K233j812m108k822L451O409L801p283p65l016j553
16536e809r144n322K857L143R700J188n0k30J328K608m580k646N083K673K472
$$ y = [-15271, -7593, -4769, -6169, -473, 5453, 13324, 8019, 10540, 14536, 3584, -687, -756, -1057, -3629, -4016, -4140, -3420, 1260, -3419, -3735, -3780, -660, -5189, -8289, -674, -1079, -2618, 2007, -777, -10033, -12020, -8447, -2644, -10776, -19116, -18842, -20644, -15174, -9393, -7173, -8203, -1802, 2416, -3464, -1839, -4986, -4192, 518, 5007, 6077, 6762, 6054, -1520, -236, 6397, 9481, 3355, 3521, -1291, -6636, -3374, -2391, -13068, -9102, -9433, -16112, -11281, -7616, 1244, 8422, 7545, 5475, -1982, -4533, 3280, 8538, 13835, 15760, 5559, -1492, -858, 3663, 12042, 20410, 17269, 14727, 13766, 11570, 12093, 16432, 17798, 12674, 6290, 2149, 4192, -344, 1889, 77, -4031, -6853, -3402, 3007, 6808, -475, -1240, -4256, -5809, -14953, -20275, -17418, -14275, -4575, -3387, -3437, -3667, -2339, 269, -4311, -6957, -1874, 799, 3271]
16521C271L786q352J947J177r200J602p94k680k815O087J569l787q03l188k144
16506a4324M324j975k886J1188L533L53j496j784l897j245l750P525O464l344
16492a314N950j678l80N700K756o219n187K585Q645N947k033j0198q742k5L599
16477e94K045p505n767N386J0035P71n869K158O063l20m251n581L760M162p900
16462c407j18o595P544J0411j038o837J856J975L470K432j2557j0908p70l82J198
16447a3726P476M109L175J792O397o167m427K106L684j215k172l402L275P212
16433H117J536M490n849J591M833l723l843L676n822j585l521n250M70L633J254
16418GL988P520m725L866N359n42J984p716j597J140n721q749o407K654L345J938
$$ y = [3271, 7057, -1295, 652, 1829, -7371, -5769, -6563, -9243, -12058, -5971, -4402, -8189, -8992, -12180, -14324, -10000, -11975, -14861, -3673, -140, 213, -1283, -3067, -6964, -8209, -11959, -4434, 2030, -1314, 4636, 2958, 2578, 8278, 11034, 4815, -372, 2213, 10858, 16805, 14772, 4574, -4168, -4193, -594, 1451, -6054, -11821, -6435, 3600, 4371, -1498, 660, 6723, 6403, 2152, -3429, 331, 4493, -3407, -3525, -10120, -2576, 7835, 6797, -40, 1816, 3791, 7261, 9693, -2864, -13772, -14542, -14924, -13726, -6250, -2141, 1034, 2826, 9223, 3056, -1371, 735, 4419, 3204, 1032, -2370, 905, 8117, 9653, 14143, 8294, 9885, 14718, 10995, 7152, 10828, 5006, 3421, -100, -5350, -4880, -1247, 7, 3995, 11515, 6790, 10656, 16015, 15473, 17457, 9741, 8144, 9284, 3563, -5186, -11593, -8939, -5594, -3656]
16402c656Q7K678l521l927k960L398O145O475P941m125j6948l350N092k34O543
16387c62j1590q239J238K976l06J076J130N175O211j0945p774O08K542L194O418
16372h648K236N828O591o02l200m55o723p01k063P38j712q80l180j753K47L797
16356a0480o0J4918M245n924j0252J1465Q071l548o56Q14o5o527K76q11k877M478
16340C067O908P38n353n504o02j212p667J457Q023R909l476k816r27o177o0M557
16324H65O497K234m174m986N514N466Q16J907l180p745o295O231N114Q91p940
16309A215p561k442L385q75K692K094N879M436j622L94J776M964j5520n677l759
16294a0621m177J333J943q89J0464m887N176Q050j361l620R19K054l88k114j203
$$ y = [-3656, -3569, -891, -4412, -8339, -11299, -7901, -1756, 4719, 12660, 8535, -8413, -11763, -6671, -6905, -362, -11952, -20191, -18953, -15977, -16283, -15207, -14077, -8902, -2691, -13636, -21410, -20802, -18260, -15066, -8648, -6412, -584, 6007, 5405, 2205, 1750, -4973, -5674, -7737, -6999, -8711, -9591, -12771, -14524, -14277, -10480, -10540, 4378, 8623, 2699, -7553, 3912, 11983, 8435, 7779, 8593, 8528, 2001, 2277, 1466, -1411, 3067, 9975, 10713, 5360, -144, -746, -1958, -9625, -8168, -145, 9764, 6288, 3472, 2545, -3632, -3692, 865, 7362, 9596, 5422, 436, 5950, 11416, 12232, 14139, 10959, 3214, -3081, 3150, 8264, 9155, 1215, -6346, -8788, -5403, -6278, -3586, -1492, 4387, 8823, 7201, 7595, 9371, 14335, -1185, -6862, -10621, -14798, -13465, -11522, -12411, -1947, -6834, -1658, 6392, 5031, 1411, 2330, 4384, 3996, 1882, 679]
16279F79m122K15L738R627J522q659n278p572j332Q632m343o281P132Q814L629
16264F401L777J610O837o997j5032n778N627L725m040m977J864M851L726K41l462
16249a627j09l00l109K901m123k786M742j011N664R922p15k40l25N71n544k894
16233A017P265j491M872K59n668q208k636n525m546j440Q795R495q103p227M345
16218h796M345k862l205l9J878Q608J164p162k231j883L86O677K246m763K868
16203b769l973J028J523j263o127m392J5038P708k189n332k858j523o43m63M703
16188a532L224K963k925m556n33J3250n273M957j39K50L940r528j5444J561P973
16173a812k3l643p388o829Q522P711l785M070k998j00O423j375n677m284N552
$$ y = [679, -3443, -3228, 510, 10137, 11659, 3000, -2278, -9850, -11182, -2550, -6893, -13174, -6042, 2772, 6401, 10178, 11788, 18625, 11628, -3404, -9182, -3555, 170, -3870, -8847, -6983, -2132, 1594, 1835, -1627, -1736, -2036, -5145, -2244, -6367, -9153, -4411, -5422, 242, 10164, 9449, 9209, 8884, 9455, 3911, 1017, 8282, 6791, 11663, 11922, 6254, -1954, -4590, -10115, -14661, -16101, -7306, 2189, -5914, -13141, -8796, -4451, -7313, -10518, -10557, -8679, -71, 1093, -6069, -8300, -10183, -9797, -3120, -874, -5637, -2769, -6742, -5714, -4191, -5454, -11581, -15973, -935, 6773, 4584, -748, -3606, -5129, -5772, -6235, -1532, 1692, 4655, 1730, -2826, -3359, 9891, 4618, 9575, 9436, 9686, 13626, 4098, -11346, -9785, -1812, -1835, -5478, -12866, -19695, -11173, -3462, -7247, -3177, -6175, -6275, 148, -1227, -6904, -11188, -5636]
16158e636O232J0819k584p836k214m827o85O686m327p164m963q71q20l823O618
16143a5395P520m09J410O479N485m310n814l305J1956k94l028n30J0988J0726
16129B1479n593o992o747j2850o271K58p0q10R208l394k691j832m161N824K142
16114a2500J906r612m611J307K741L370L61K03O531n362Q350N195J033p437o375
16099a4900m620J96K812P658N024J2471j997m223O693O353o192j3737r1M656N952
16084F055n563l271m150L853J324k001N70l409j860M849n237j1258L050M673P325
16069e050O943p66J22P315k559L927o849M764l155j044N862j95r255J30P832O5
16053H087q561J62O820n235o14J3171L804p856l827K913K863o80O702n140N350
$$ y = [-5636, 596, 11415, 8831, 995, -1219, -6046, -6731, -45, -4372, -11536, -16499, -17370, -18190, -22013, -15395, -7875, -8284, -6874, -395, 5090, 780, -5034, -8339, 3617, 3323, 295, -235, 10753, 21479, 15886, 8894, 2147, -10703, -16974, -16716, -16786, -17596, -8388, -11782, -14473, -16305, -20466, -14642, -12500, -10594, -20206, -24817, -23510, -20769, -17399, -17038, -16835, -10304, -15666, -7316, -2121, -1088, -8525, -14900, -19520, -19324, -16512, -8854, -3830, 8641, 6644, 2421, 9114, 15467, 9275, -4462, -4553, 103, 6055, 492, -2779, -6929, -3076, -1752, -3753, -3183, -6592, -8452, -3603, -8840, -20098, -17048, -12375, -5050, 1893, 1127, 1249, 8564, 6005, 9932, 3083, 7847, 4692, 3648, 9510, 9315, 60, 190, 8022, 8087, -474, -312, 6508, 1273, 659, 13830, 17634, 9778, 5951, 8864, 11727, 11047, 17749, 12609, 17959]
16038A7959p712j4025k511k983P08j679m531K84K132O480O789J721j0024N55k060
16023h897k313o390J0572J160L091N599j401o826m543l251k377N225m044m498
16009a8893P930k185k358n823o363J589Q542K218l266J1129J1415j60j453l166
15995h44n336L197N369n8l599j066J189Q318m614m494j244o768j114R466P490
15980E892j596j2446q277R687M377l63n076O636J021n095n716N049P613j53k238
15965f85m63n774L874N625q566o154l272K233K786M335N880n124L943j07j789
15950c258N543k146o79J684k826m557p116N979M429M386K579p550l866k89J0054
15935B367J074k292K292R070j352L620j354o722m740j202K459j853J312m608m88
$$ y = [17959, 10247, -3778, -6289, -9272, -8564, -10243, -14774, -14490, -12358, -5878, 911, 2632, -7392, -6837, -8897, -11210, -17600, -7028, -5868, -2777, 2822, 1421, -5405, -9948, -13199, -15576, -10351, -14395, -18893, -10963, -13148, -15506, -21329, -27692, -26103, -17561, -15343, -18609, -7480, 3935, 3775, 2322, -844, -6180, -2983, 2386, 2328, -1271, -2337, -1148, 7170, 2556, -1938, -3182, -9950, -11064, -1598, 5892, 4296, -8150, -16427, -6740, -2363, -2726, -7802, -1166, -145, -5240, -10956, -5907, 1706, 1553, -685, -1148, -6922, -3048, 2577, -5989, -12143, -15415, -13182, -10396, -6061, -181, -5305, -1362, -1469, -3258, 2285, 139, -540, 1144, -1682, -6239, -13355, -7376, -2947, 1439, 4018, -3532, -7398, -7687, 2367, 3441, 1149, 3441, 12511, 11159, 14779, 13425, 6703, 1963, 761, 3220, 1367, 2679, -1929, -2417]
15920b417L212N499J640j7057p114Q234K158M915k48o85m702P29K068j136j33
15905e037O982J101j44o048Q933j57o337p639j779K805K590L812l072L885J336
15890A231l790J135j0677l509N997M182o86N592l899j0220K450J831L8M311n075
15875a1089O967K90K908r155o095N719N77J853Q971K834m038k183r152O411J2072
15860F890L228l729j664p065l867N321L861m033j2493m424J4681L14M084K883
15846C987J396Q07J405Q55m649m092r925m78k795K618O560J414J497K676K920
15831D196J1847j1586j3228k039K434n364P836P93m728K181j470P23J226j39J07
15816g211L729o705M66J833r214q264J3967q83R71M724m463l83O00J574O682R947
$$ y = [-2417, 795, 6294, 7934, -9123, -16237, -8003, -5845, -930, -1178, -1863, -6565, -5836, -3768, -4904, -5037, 1945, 3046, 2902, -3146, 5787, 5630, -707, -8346, -10125, -7320, -4730, -918, -3990, -105, 1231, -2559, -1424, -12101, -15610, -9613, -5431, -6117, -525, -4424, -14644, -12194, -10363, -10325, -6014, -11089, -4122, -3832, -924, -10079, -16174, -10455, -9878, -8025, 946, 3780, -258, -2441, -11593, -5182, 6890, 10118, 6389, 4725, -2340, -6207, -886, 2975, -1058, -13551, -17975, -3294, -2980, 1104, 3987, 5383, 6190, 7595, 8450, 3801, -291, -10216, -10694, -13489, -10871, -4311, -2897, -1400, 1276, 4196, 16043, 4457, -8771, -10810, -8376, -13740, -5904, -5111, -9839, -7658, -9128, -8405, -7179, -7318, -7211, -3482, -10187, -9721, -7888, -17102, -25366, -11399, -12282, -11311, -6587, -11050, -11433, -10833, -9259, -2577, 7370]
15800G370M475q880p023J1078q06o00K313m686l070P040q92r39K589l982L900
15785G887m334l755m662R60L309K966q598K750M284o539l782L297L630L126P616
15770H155Q01N56l715o517r524M940K091L269P642n161L245R900j280j1981n799
15755c378J779l376r19M671l647o43j258m455K404k10o662p46N957K464l269K006
15739i282j766P465P582J0760q497r557r580n09j047K743J256Q930P165q459p268
15724a0064J683M951n646j465k683K931L509O199L869K665N186q83n827p915j597
15709e087M234J154J2054R75r227n346n567J709n646R84Q050O740m417o802L894
15694b298J674N632M244j639J0548j938n517n003o378M610L154r690l398K5L840
$$ y = [7370, 11845, 2965, -4058, 7020, 6214, 5614, 7927, 3241, 171, 7211, 6319, 5380, 7969, 3987, 7887, 3553, -202, -4864, -3904, -595, 2371, -6227, -3477, 807, -5732, -9514, -6217, -2587, 539, 8155, 8956, 9512, 5797, -720, -10244, -5304, -3213, 56, 7698, 2537, 5782, 15682, 14402, 2421, -3378, -1599, -4975, -5894, -1223, -4870, -5513, -6771, -11226, -8822, -9032, -15694, -16440, -10483, -8019, -11288, -9282, -11048, -3583, 3999, 14759, 6262, -3295, -12875, -13384, -14431, -11688, -10432, -1502, 5663, -2796, -10064, -8381, -3430, -9076, -10541, -13224, -10293, -6784, -585, 3284, 5949, 11135, 10252, 4425, -3490, -5087, -853, 301, 12355, 13330, 4103, -1243, -6810, -5101, -10747, -9763, -1713, 5027, 610, -6192, -2298, -624, 5008, 9252, 7613, 18161, 16223, 10706, 5703, -675, 3935, 7089, -2601, -5999, -5974, -2134]
15679b134R302l07j94L526M70pq25o322L66j53q0m153k389o867J1668l669k723
15662d491o476L772N413k832l312O745Q11k570k932k432J990M255l954K8L828
15647b157L255J486m110j576o73N019Q720L113p230M688O763m760o350j0166n958
15632i936N200L432m217m440K683k837m994N737Q61j105R609N300J756M712m25
15617A1336o021N563p008n661j065m869k351L232J646l922P725K662o393p572
15603a2698n93R353J1147j2004m492k799k237p58P85O46J1234M138O04o047L673
15588d8L751p433M551J0906l360q015l662n030k775J563K515N651J666k858K339
15573b39m165K111M758K388j1235K638N816N20k989P86J338Q81m802M095o499
$$ y = [-2134, 7168, 6861, 6667, 10193, 10663, 10656, 9831, 3509, 3875, 3722, 3642, -511, -2900, -9767, 1901, -1768, -4491, -10967, -7195, -1782, -4614, -7926, -1181, -370, -2940, -5872, -8304, -6314, -2059, -6013, -5985, -2157, 1098, 2584, -1526, -3102, -3775, 1244, 9964, 13077, 5847, 10535, 17298, 12538, 6188, -3978, -9936, -4736, -1304, -5521, -9961, -7278, -10115, -15109, -9372, -8511, -9616, -7, 5293, 7049, 11761, 11336, 5315, 10878, 3870, -1791, -2856, -7725, -10076, -6844, -5198, -9120, -1395, 1267, -5126, -12698, -13291, -3938, 7209, -4795, -9287, -12086, -14323, -15081, -14296, -13650, -2416, 1722, 2326, -3721, -48, 3703, -3730, 821, 11727, 8367, 352, -3310, -8340, -11115, -9552, -7037, -1386, 280, -2578, -239, -4404, -2293, 2465, 4853, -6382, -3744, 2072, 2592, -397, 389, 1727, 2608, -2194, 1901, -4598]
15558d598n775j458O525L683j468r330j0643j733J0893P369K697o416L518M366
15544b370m849O63N923N4K59J235r193q372J459K385q015Q534J0043m174J2055
15529E637O981k951l883k625n384r754p458J0901P420J320N794l529j1893M47
15515h977Q434J095j267j5559j886K993M650K39Q846R389j755k533k83K098J045
15500F529r89Q81n747o233J804M174N639k806l671N869L32n147L54M452M245j478
15484H208m117J407l855J559m251n321n032J068J772m733m143J1008M856O10r227
15469a0191L532L835k382K069p198n734J099l027l281K890j352o73K620M783K222
15454a0788P004l495r175N146L410L700Q681k715N582n290m829p027K021K18L309
$$ y = [-4598, -10373, -11831, -5306, -1623, -3091, -12421, -23064, -24797, -13904, -6535, -3838, -10254, -6736, -2370, -7219, -6556, -633, -579, -320, 915, -8278, -16650, -15191, -12806, -20821, -12287, -2244, -6418, 5637, 12618, 9667, 5784, 3159, -2225, -11979, -19437, -8536, -1116, 204, 5998, 2469, -9424, -8977, -543, 552, -715, -16274, -18160, -15167, -10517, -10278, -1432, 7957, 6202, 3669, 3386, 5484, 6529, 5540, 6421, 674, -5559, -3755, 419, 6058, 3252, -419, 5450, 5782, 635, 989, 5441, 9686, 8208, 4091, 5498, 1643, 3202, -1049, -6370, -11402, -10334, -8562, -13295, -17438, -6430, -1574, -964, -10191, -6659, -2824, -5206, -3137, -10335, -16069, -14970, -17997, -21278, -18388, -19740, -20413, -17793, -13010, -10788, -3784, -7279, -16454, -11308, -7898, -4198, 4483, 1768, 7350, 2060, -2769, -9796, -7775, -7557, -4248]
15439d248k610N283P526k549o2K312j973k418j1365P50J0270M800K920J89m228
15424D597j3815q591l77j43L269R548O394M394j959k593J162N786K297n354m656
15409d1J385k083m870J596J655k434O60o715r400m577l334k339k102M917P619
15394b0063Q242Q823L682l296P03P79j318l913J552l39J266l921O692Q477q917
15379a551J497k642M351N733M903l490l979j2649K633J0795p151O40M605k52l960
15364e17o902k17k082K507J528L250k994O792r942k509Q85M876M703l538N819
15349A659N590L255j910k770K295L846N042J860j85J159k745N48Q50r923n26l46
15333G699L87K434m783j905m517r48p545j315R143L945P250j230k735J879q676
$$ y = [-4248, -6858, -1575, 5951, 3402, 3340, 5652, 3679, 1261, -10104, -9354, 916, 5716, 8636, 8825, 4597, -9218, -17809, -18186, -18329, -15060, -5512, 882, 5276, 3317, 724, 1886, 7672, 9969, 4615, -41, 1344, -739, -5609, -4013, -2358, -4792, -4132, -10847, -20247, -24824, -28158, -30497, -32599, -27682, -20063, -11821, -2998, 684, -2612, -1909, -1130, -2448, -6361, -4809, -5148, -3882, -7803, -1111, 7366, -1551, -54, -2696, 1655, 7388, 12291, 8801, 4822, -7827, -5194, 5601, -1550, -910, 3695, 3443, -517, -7419, -7636, -9718, -7211, -5683, -2433, -5427, 1365, -8577, -11086, -10201, -5325, -622, -4160, 1659, 7249, 10504, 8594, 5824, 8119, 11965, 17007, 18867, 18682, 19841, 17096, 17644, 18494, 8571, 8045, 7699, 8086, 10520, 5737, 3832, -685, -1633, -9178, -10493, -1350, 2595, 9845, 8615, 5880, 7759, -917]
15318i17q085K118J533l5J298J9L226k254l880l775l247n901P9M221K800M982
15302g818N807O555p790o277M424O635m235M310J423j526m050o342M063L249o511
15287h083n746k965J3511R201N393q25j299l428r541r299n523N135K418K848Q077
15272a26J0802R432J726P91o761p972n969l484j142l653k528m22R464J462n051
15257c431r720l261L677j2815k937J266R116O292O581J464R05J823O623l128k403
15242E2k975m860R316M621k568j0482K132R58L230k396m683n28m825K163N556
15227e289N70p555j679N179L01k641J776J1748O084o500p10K274L008K843j545
15212G864m76K010m797j0060n169o99m474L106Q419q400k387M116R72R137L759
$$ y = [-917, -9002, -6884, -5351, -5386, -4088, -4069, -843, -3097, -6977, -10752, -13999, -19900, -19821, -15600, -12800, -7818, -2011, 4544, -3246, -9523, -5099, 1536, -2699, 1611, 3034, 1508, -2542, -8884, -4821, -1572, -8083, -13829, -16794, -3283, 5918, 11311, 10486, 9187, 5759, -3782, -13081, -18604, -13469, -11051, -8203, -126, 10676, 20108, 21834, 22625, 15864, 7892, 1923, -1561, -2703, -6356, -8884, -9306, 158, 1620, -3431, -13151, -16412, -12735, -25550, -28487, -27221, -18105, -11813, -5232, -3768, -2863, -1040, 5583, 2455, 52, -2923, -7783, 1533, 6154, 3586, -6896, -4764, -3806, -576, -2972, -7655, -8183, -13008, -10845, -5289, -4719, -12274, -13953, -8774, -8473, -11114, -9338, 2410, 8494, 1994, 1284, 3558, 6566, 9409, 7864, 7388, 9398, 4601, -5459, -10628, -11327, -15801, -12695, -4276, -12676, -15063, -10947, -9975, -838, 2921]
15197B921J653q73p824L000M780m930N649j818j980j215q723p632P370O78l273
15182a2217m837k577k342J6829M559p681J173L172k979O028R121J120m029o144
15168h04J72K625k740n237j41j41O13j0160L314j414j581Q739P136j273K725O753
15152H586Q245n128r622j0113n955o614j66M730K450Q913k659J803L563L981M092
15137F106n418P1k090l851M105l592O739P459N52k843k925R42q790p626k156K579
15121a0738L421K192p925R790N908o23p022m140L173n917K636K942n315J505K645
15106g468P74k182j157N30m52m224M582o000R91m284j1737N621Q835M520N132
15091f519L607L926J792r083P728J679J542l723p769K01j204L918J489O462R87
$$ y = [2921, 4574, 3701, -4123, -1123, 3657, -1273, 4376, 2558, 578, -637, -9360, -16992, -9622, -8944, -12217, -17054, -19631, -21973, -5144, -585, -8266, -7093, -3921, -6900, -872, 8249, 9369, 5340, -804, -632, 1993, -747, -5984, -6125, -6266, -5653, -15813, -12499, -13913, -15494, -6755, 381, -892, 1833, 8586, 16831, 11703, 2081, -8032, -13987, -20601, -20767, -16037, -13587, -4674, -7333, -5530, -1967, 2014, 6106, 688, 759, -1331, -5182, -1077, -4669, 2070, 9529, 10081, 7238, 4313, 5255, -3535, -11161, -13317, -10738, -7317, -5125, -13050, -3260, 2648, 2025, -4997, -9137, -5964, -11881, -9245, -6303, -11618, -10113, -7468, -6694, -8876, -10033, -9503, -9955, -14179, -9597, -15597, -14606, -18890, -30627, -25006, -16171, -11651, -6519, -2912, 1014, 2806, -6277, 1451, 3130, 4672, 949, -6820, -6619, -7823, -3905, -2416, 4046, 5033]
15076E033m794n198j123rl166p075J0452J164P187P492P063J305j2341n06J90
15061E674Q94n45k097q076K296N65j4133o511p72N343J254J1334l742k408J189
15046i735J744j936M44o261P593J0444j311P826p10k927o819p200o814K577Q491
15031d594q26N52J4285J51m914r969l540M143l552q336L039N167L593M465Q404
15016H068m491k584L642l647l805p161L694Q451l256n186q69N182J742m281p806
15001a2307K16M11j029P164N475j3305j1629M59m087p686Q432R360P393R235P827
14986E929L29r311L739M395l587r473k962j966k429N570J5856M527n592m047K19
14971A197K577L795l514o509j681k77L511n73L918J297n228K785J496J816l833
$$ y = [5033, 239, -4959, -6082, -6091, -9257, -16332, -5880, -4716, 2471, 9963, 17026, 18331, 5990, 5484, 5674, 6568, 6023, 3926, -4150, -1854, -1289, -15422, -21933, -22705, -17362, -16108, -4774, -8516, -10924, -9735, -7991, -9927, -9483, -15744, -8151, 2293, 982, 8808, 8098, 5171, -1648, -8848, -15662, -13085, -4594, -5420, -4868, 9417, 9568, 4654, -5315, -8855, -4712, -8264, -16600, -13561, -8394, -4801, -336, 8068, 3577, 993, 4635, 988, -2817, -9978, -6284, 2167, -1089, -6275, -7144, -1962, -220, -4501, -12307, -12091, -11680, -12709, -5545, -70, -13375, -25004, -24545, -28632, -36318, -27886, -18526, -11133, -1898, 5929, 6258, -3053, 686, 5081, 1494, -7979, -10941, -12907, -15336, -9766, 6090, 10617, 5025, 978, 1197, 3774, 7569, 4055, -2454, -4135, -4412, -901, -1474, 2444, 3741, -1487, 1298, 2794, 4610, 777]
14956G77M84P378k301J576p532o523l863P47M766M569p41m841j213j151Q496R26
14940A554m755K451K886m011l948r65Q199j232l996p555j563q669N369R165R312
14925B242j932j2868m317M449R492M237K353l71M676l673p132J0457J2360K237
14911B2210q890r491k780K482j629k69m740m579J068P419Q03j2274o091M298k24
14896a2687p008K183L158q63N57O339Q658L673N112L643K950m581p059m202j129
14881a256l4l897k4k450L973K939J017l589j0183j767Q287j160M438M196Q361
14866H851J0961j3058j249N539M191Q1j0042j3626o472j859J2927N831J428j102
14852B401L564k214j3005n854K264K615j748L708J0989m628j0364j303J415k96
$$ y = [777, 1261, 8639, 6338, 7914, 382, -6141, -10004, -9257, -4491, 78, -663, -5504, -6717, -7868, 628, 1554, -3201, -750, 2136, -1875, -5823, -6788, 1411, 179, -3817, -11372, -12935, -21604, -16235, -7070, 2242, 310, -12558, -16875, -12426, -2934, 1303, 3656, 3285, 7961, 4288, -2844, 7613, 19973, 22210, 13320, 3829, 1049, 3531, 1902, 1633, -3107, -7686, -6618, 801, 1604, -10670, -16761, -12463, -12687, -19695, -17512, -14354, -15217, -14660, -8321, 337, 4010, 9122, 12765, 15715, 11134, 4075, -127, -1256, -1290, -5187, -5211, -7661, -3688, -749, 268, -3321, -13504, -15271, -6984, -8144, -3706, 490, 8851, 19812, 6754, 5505, 11044, 15235, 15316, 5274, -8352, -14824, -16683, -3756, 2075, 3503, 2401, 5965, 3751, -9254, -15108, -12844, -10229, -11977, -8269, 2720, -1908, -12272, -13575, -12160, -12456]
14838a2456k428q10N21J2506J0067m031l151k607K49j079J823J263l193m828J882
14823f272j87n349L22J0557K534N540R93l107o28J946P90N38n119q518m638J1140
14807E42M515o367k48O869O301L856j0246l732k518l819q970J273J723R7J649
14792i075P789Q793j952j4078j237J837o53J768Q97Q47k400l332q80j129P940
14777d865L335m58L620J861p595k891K930l516j0667l00J5287Q323n45q652m332
14762h465K782J228M557L033q059j304r496L316R959K512K279l958n473L479J721
14747a889n251J390r94n977o115j749L366L276M448L006O608K981p64P48L336
14732F420j52n42n190j658Q764K020K403k038M91o92l696o885m04N162j914l712
$$ y = [-12456, -14884, -15694, -15173, -2667, 7400, 3369, 218, -2389, -2140, -3219, -1396, -133, -3326, -8154, -6272, -6459, -11808, -11486, -929, 1605, 7145, 8138, 5031, 4403, 6349, 7139, 7677, 2558, -5960, -10598, 542, 5057, -1310, -1558, 5311, 11612, 15468, 5222, 1490, -1028, -4847, -13817, -12544, -10821, -10724, -9075, -1286, 7507, 5555, -8523, -9760, -7923, -8576, -6808, -5911, -5064, -7464, -10796, -11676, -12805, -4865, -1530, -1988, 1632, 3493, -4102, -6993, -4063, -7579, -18246, -18546, -3259, 5064, 4519, -4133, -8465, -5683, -4455, 102, 3135, -4924, -6228, -15724, -12408, -2449, 63, 2342, -1616, -7089, -3610, -1889, -7140, -5750, -6744, -12721, -18836, -20585, -17219, -13943, -9495, -6489, 119, 3100, 2336, 3084, 6420, 6268, 5726, 536, -1122, 7642, 9662, 12065, 10027, 10518, 9826, 6130, -755, -1159, 4003, 2089, -1623]
14716a623m60K604J230j568K205l733p834j176j177L834K661n00n93l122o523
14701a5775J473O602O91j708k243j3670M838J0735M492r95j373P633O867j298
14687F269o610J959m698j846l594j385J048K094q447n370L552K822J012M677R77
14672g540k25k448L630Q649q07j59Q586N477N47o151l14j92j053J252M092n035
14656H309q857j1967L561L458o946K105K397j277l915M752P647n29r188N33J506
14641h411j541j615j425M05o583K83m877M287P952J67M21m222L90P73j273L051
14625a2218J81J263J30o425k387L748J6327P161o463m979M664M408m64j0544N222
14610c76r94k744l443m209K248O79J558P861o873J441k147n998L37J847J115P353
$$ y = [-1623, -2083, 521, 1751, 183, 2388, -1345, -9179, -10355, -11532, -7698, -5037, -5537, -6130, -9252, -15775, -14302, -7700, -7009, -8717, -10960, -24630, -19792, -9057, -4565, -5560, -6933, 700, 7567, 6269, -341, 1618, -3080, -4926, -8520, -9905, -8857, -6763, -15210, -20580, -17028, -14206, -13194, -8517, -7540, -7765, -10213, -6583, 2066, 1259, 1100, 9686, 15163, 15710, 9559, 9245, 9053, 8000, 9252, 13344, 8309, -548, -12515, -8954, -5496, -12442, -10337, -7940, -9217, -13132, -8380, -733, -1262, -10450, -9917, -8411, -9952, -11567, -12992, -12587, -19170, -18887, -23764, -19477, -11525, -11358, -10937, -15159, -14769, -13996, -15269, -12218, -12037, -10774, -10644, -17069, -19456, -15708, 619, 7780, 1317, -3662, 1002, 5410, 4946, -5598, -376, -1370, -4114, -7557, -11766, -9518, -8839, -7281, 580, -6293, -4852, -6999, -12997, -12660, -10813, -9698, -2345]
14594b345J6035K053m50l78j1449k978k945m194O272m61o252l557o614p407m907
14579b9577J822J0065P11j39j801O8Q769n867L630P113L227l710l216n24ol549
14563a2984M35J799J136j438J633L461M098K094J3331k23o350O278p673j4132
14549h535j100O499k463n382p525L147M39O577j033l856m485N254o46k298K942
14534a2465J2616J715M022p022k936k152k402k091M04O115J0370N181l588k260
14520E507M073k278n395j295O153n123n859l436K164J739P892L641r456r30o289
14505h892m114L990J663k692n856P99L225J96k779M087L598P01m869l812k066
14490a6821M501j296n266J0954Q765n710l868l952r68j846L092O858m25O181L360
$$ y = [-2345, 13690, 15743, 15293, 14915, 3466, 488, -2457, -6651, -379, -840, -7092, -10649, -17263, -24670, -29577, -27755, -17690, -16979, -17118, -18919, -18851, -10082, -15949, -12319, -5206, -1979, -5689, -8905, -9429, -9435, -12984, -12549, -10750, -9614, -11052, -9419, -5958, -1860, 234, 13565, 13342, 6992, 13270, 5597, -8535, -9635, -3136, -5599, -10981, -18506, -15359, -14920, -8343, -9376, -13232, -17717, -12463, -13109, -15407, -12465, 151, 1866, 5888, -1134, -4070, -6222, -8624, -10715, -10311, -4196, 6174, 11355, 7767, 5507, 9580, 7302, 1907, 612, 6765, 1642, -4217, -7653, -5489, -3750, 4142, 7783, -1673, -2603, -8892, -13006, -9016, -7353, -10045, -15901, -15102, -11877, -11681, -14460, -10373, -6775, -6074, -10943, -14755, -16821, -12320, -13616, -18882, -7928, 837, -4873, -8741, -12693, -13661, -15507, -12415, -5557, -5982, 199, 3559]
14475C559J729q249L647L257p807L454J214j64q03M57N965p052o374m72k147j867
14459a1653k877p89O065l37L794p175l442J4080Q585l712j4226q634N74L825O786
14444i136k109l357j2299J489K263j381j306N645L309p126L548P537L317m756
14430a4362M375l535n10N25M658m984Q09J2099n038n021J1449K412j491q309k790
14415i713K984L579J321n242M319N97J802N715l389m504r325M867m11l92M532
14400c260K265o00j2351m80r70r57N038j062M746O885k183j770o241n92L457L104
14384d971R314J476l228n054p092L488n526r952p2j823J4182Q685N810n886n653
14369f302K05J160M048j723p089L517R691J307q183m562o47P281q44n255M81l107
$$ y = [3559, 5288, -2961, 686, 3943, -3864, -410, 804, 640, -163, 294, 6259, -793, -7167, -7639, -9786, -11653, -14530, -15319, -9254, -9591, -5797, -12972, -16414, -2334, 6251, 2539, -11687, -20321, -19747, -15922, -9136, -11245, -14602, -26901, -25412, -23149, -24530, -25836, -20191, -16882, -24008, -20460, -12923, -9606, -14362, -9987, -13522, -14032, -13507, -8849, -13833, -13024, -925, -5963, -10984, 465, 2877, 1386, -6923, -9713, -6729, -3150, -1829, -7071, -2752, -2155, -353, 5362, 1973, -2531, -11856, -6989, -7400, -7792, -3260, -995, -1595, -13946, -14426, -15396, -16353, -11315, -12377, -7631, -746, -2929, -4699, -10940, -11532, -8075, -4971, 4343, 5819, 2591, -2463, -9555, -6067, -11593, -21545, -21617, -23440, -9258, -573, 5237, -649, -6302, -6097, -4937, -889, -2612, -9701, -6184, 3507, 4814, -3369, -7931, -8578, -1297, -2141, -7396, -6915, -10022]
14353a0022p053L159n489k680J437L669R841L184M183j525l381r10k045n370j891
14338a4893L511K129J625J597j265l186J647L442m106l902O630o493o015q775
14324b8054L609J282J012m261L204M347K455O885M047j588n501J790K324k366
14310a0815k050O531m161j696Q584N363%O607q36q364o444K006r76k018l42J1300
14294B689J206n147m623m847N974J3991L067q238J043m22l616k126j2013p928
14280b0990j106N661R700N847j1643m620L705N462L005N21q79P060N950M404n734
14265F343o323q076l722M164l617j075o729J739m92P250L23l808k188Q916O346
14250i49N159K357J14q456j0241q712N542J1396m487k176J2233P404K624J89o422
$$ y = [-10022, -17075, -13916, -19405, -22085, -20648, -16979, -7138, -3954, 229, -1296, -4677, -5587, -7632, -13002, -14893, -11382, -9253, -7628, -6031, -7296, -10482, -8835, -5393, -9499, -13401, -6771, -13264, -19279, -28054, -24445, -23163, -22151, -26412, -23208, -18861, -16406, -9521, -5474, -7062, -12563, -10773, -8449, -10815, -12865, -6334, -10495, -12191, -3607, 1756, 1756, 8363, 7527, -837, -7281, -5275, -6251, -8269, -8611, 2689, 3895, -1252, -5875, -10722, -4748, 9243, 12310, 4072, 5115, 4693, 1077, -1049, -13062, -20990, -22096, -16435, -6735, -888, -12531, -17151, -13446, -7984, -4979, -4458, -5337, 1723, 7673, 12077, 6343, 20, -8056, -11778, -7614, -11231, -12306, -19035, -17296, -17788, -10538, -10215, -14023, -16211, -7295, -949, 4210, 6567, 6681, -1775, -12016, -20728, -15186, -3790, -8277, -10453, 1780, 9184, 11808, 11997, 5575]
14235E575L728k309n756k114M847J0969j728j1774J542l137K268m404q703m509
14221a5505m15P457N117o538m548P744K413n447r155J184K083K654N170l191q792
14206a9769P054l33m453J966L595k607O219R219k972k59o30N040k168K556K477
14191D935m848m436r538r90j34K873j116J197m949J59M168J446J567o737J813
14176a4590M092k050j123m969Q815J579O40Q23k011k569Q051J75r661L865M883
14161d050J403l030j013L793r073j1617N877J702O847P76m365L03M916P066K541
14146B076m139L414k389k93J235N308j1181j2874l868L371J731o269j897M959
14132b0816J630o31K018L448J2392j260j2873q239Q471J7081j240n476p489q511
$$ y = [5575, 9303, 6994, 1238, -876, 3971, 14940, 13212, 1438, 2980, -157, 2111, -2293, -10996, -15505, -15920, -8463, -3346, -9884, -14432, -6688, -4275, -9722, -18877, -17693, -15610, -12956, -7786, -10977, -19769, -12715, -13048, -17501, -15535, -11940, -14547, -8328, 891, -2081, -2340, -2970, 2070, -98, 2458, 4935, 87, -4349, -13887, -14877, -15011, -12138, -13254, -12057, -17006, -16847, -12679, -11233, -9666, -16403, -14590, -10498, -12548, -13671, -18640, -9825, -8246, -7606, -6783, -8794, -11363, -3312, -3137, -12798, -8933, -4050, -2647, -5677, -6690, -2897, -11970, -23587, -17710, -16008, -9161, -8385, -12750, -12447, -7531, -465, 2076, -2063, 1351, -1038, -1331, -96, 5212, -5969, -18843, -22711, -19340, -17609, -23878, -25775, -20816, -19186, -19817, -17799, -14351, -1959, -3219, -16092, -24331, -15860, 1221, -19, -5495, -12984, -21495]
14118b1495L565K773m877M644P706l05L175P532p88O947j2539l930j014m916j996
14103a5518k292J1270Q363N22n092p779N219O616q226l216K995K538l990M011
14089d579P65O640k79q081j689O386J0480N06J386o277P36n27o883l384O10O980
14073B790l64j1367k612M145L566J1196j1487k249N179P509j489l353P370l681
14059E153k242k650k722P91L088K38M912J055k171l77n120N263L45K363L781O603
14043A8310p261P145k322Q649j323m546M480l786J570J178l766k076k250j2338
14029A664R3p20j3317o32N042j687p988O340N995o127J667K228O393N549q17J491
14013E174M40L03k334q82l775P513p371q172K390l825J846k672p577K503O842
$$ y = [-21495, -17930, -15157, -20034, -15390, -7684, -7989, -4814, 2718, 1930, 8877, -3662, -7592, -8606, -13522, -15518, -17810, -6540, 1823, 2345, -2747, -10526, -5307, 1309, -6917, -10133, -7138, -4600, -8590, -4579, -3814, 2826, 2547, -5534, -7223, -837, 9643, 10149, 11535, 5258, 5994, 5467, -1416, -4800, -4190, 2790, 2426, -8941, -11553, -7408, -3842, 7354, -4133, -6382, -1203, 6306, 4817, 1464, 8834, 5153, 2911, 261, -2461, -1670, 1418, 1656, 6568, 7623, 5452, 5075, -45, 5218, 5563, 7926, 11707, 18310, 11049, 18194, 15872, 24521, 23198, 18652, 23132, 19346, 20916, 22094, 18328, 16252, 14002, 1664, 1757, 1037, -12280, -12912, -7870, -9557, -17545, -11205, -5210, -11337, -9670, -7442, -1049, 4500, 3683, 5174, 5614, 5917, 3583, 2701, -1074, 6439, -932, -9104, -6714, -10539, -8693, -11365, -18942, -16439, -9597]
13998i597k649k067k346K450K246o78N115J784P978K254j617n461J623N824j935
13983B924m571l690M542J107N780j173j08P044n399q983k026J195K582l456n524
13968i756J4514L734j580K06j966k192p36j250K31P811O16k304n681J418l910
13953h45p586O211K524N191J755o996j1636p278K787N263M742l840N849m67n707
13938a0033j850L602N615l16m044J542n413o019Q517Q197K284K845K007p941n52
13923a559K655L178R48M372L489K648m680m44k893m180J118N61q468n903L646
13908e512n071L152L484J2769R426o80j4018o310o027j716L594N358K877J200
13894B526O393p584j791p55o229O063j09J560m088k575k699L575P332O557M45
$$ y = [-9597, -12246, -14313, -16659, -14209, -11963, -12641, -7526, -5742, 2236, 4490, 2873, -2588, -965, 4859, 2924, -1647, -5337, -795, 312, 6092, 4919, 4811, 11855, 6456, -2527, -4553, -3358, -776, -4232, -9756, 4758, 8492, 6912, 7118, 5152, 2960, 2224, 974, 1205, 9016, 9632, 7328, 1647, 3065, -845, -8431, -2220, 304, 5495, 7250, 254, -11382, -18660, -15873, -10610, -5868, -9708, -3859, -4326, -10033, -11883, -8281, -2666, -2982, -7026, -5484, -10897, -16916, -8399, -202, 2082, 4927, 6934, -1007, -1559, 1096, 4274, 5222, 9594, 13083, 15731, 11051, 10607, 7714, 3534, 4652, 5213, -3255, -9158, -5512, -10583, -7431, -3947, 8822, 18248, 17568, 3550, -2760, -8787, -10503, -6909, -1551, 1326, 2526, 8919, 1335, -456, -1211, -7440, -1377, -1486, 74, -4014, -6589, -9288, -5713, 1619, 8176, 8621]
13879H621J708k442p749l676L091k447M221J029L632k740j4268j24L35p39O003
13864e545j168M675O326m552O744o628r450o475M805K985k689K003N265j23j1124
13849a4951J781n79k783J1779J975m791k976k177P7J809p55K319R762N273r382
13834c619l250N360K214N605k160J767k450j832Q33O03L367l99K536J927n043
13819E459n929p940j82P913O601L669L885n124m455j2082L89k85M239N220J1383
13804A2761M970n393L509J160p352l073n693O067Q102J783r400L576R80q394k523
13789A080m94l03l164r513K49Q359Q131L684Q721n70o070N194j824j6129o352
13774i001L559m730k470m360J60O308J898P312O106k274Q699N381j185m948n515
$$ y = [8621, 10329, 7887, 138, -3538, -447, -2894, 1327, 2356, 5988, 3248, -11020, -11144, -10809, -11548, -5545, -6713, -2038, 4288, -264, 6480, -148, -9598, -16073, -11268, -8283, -10972, -8969, -3704, -3827, -14951, -13170, -13749, -16532, -4753, -2778, -7569, -10545, -12722, -12645, -10836, -11591, -9272, 490, 5763, -3619, -6869, -1509, 705, 6310, 4150, 5917, 3467, 1635, 2468, 3071, 6438, 6039, 8575, 10502, 5459, -470, -8410, -8592, -679, 5922, 9591, 13476, 8352, 3897, -8185, -7796, -8081, -3842, 1378, 12761, 17731, 12338, 15847, 17007, 9655, 6582, 889, 6956, 15058, 16841, 7441, 11017, 11997, 3603, 1080, 586, 283, -2881, -12394, -12145, -3786, 4345, 8029, 16750, 16180, 10110, 15304, 13480, -2649, -9001, -5442, -10172, -12642, -17002, -16842, -10534, -8636, -1324, 4782, 2508, 11207, 16588, 15403, 10455, 4940]
13759D940N308M308P41m344j961j676l700N726L804l868q786l08j05O00l906k008
13743e235R626l227K635J924k09l974l099k970o7K375J0334P496q810M321N109
13728A6229j295n605j3944n356n035P88M625m946L57Q369R758m341n245K492j910
13713e059m6r56l874l872o339o933P766J0528Q619O095r849j5201k95O482K009
13698a0925L196L586L558J086m862p108m07P43J2819n743n147M053K956o08l312
13683f115L629J0076p764l245M672J896L196l102j340m163j3751m553K987O89
13669a6888k757O621N263p925q340P037J2667l96l473K382l209l051n188Q60J5538
13654h59M932p783j2409J799J8988L320l300o102L86n113m80j474j774L246j312
$$ y = [4940, 10248, 14556, 15297, 10953, 8992, 7316, 3616, 9342, 13146, 9278, 492, 184, 79, 679, -3227, -5235, 4391, 1164, 3799, 5723, 5514, 1540, -1559, -4529, -4596, -2221, 8113, 15609, 6799, 11120, 16229, 14934, 9329, -4615, -9971, -15006, -14218, -9593, -14539, -14182, -5813, 3945, -396, -5641, -3149, -5059, -5105, -6061, -9935, -13807, -20146, -27079, -19313, -8785, -166, 5929, -3920, -19121, -19416, -12934, -10925, -7729, -4143, -585, 501, -4361, -11469, -11876, -11133, 1686, -4057, -9204, -5151, -2195, -2803, -6115, -2486, 7590, -174, -3419, 1253, 3149, 6345, 3243, 1903, -2260, -16011, -20564, -17577, -16888, -19645, -13024, -7761, -15686, -24026, -16989, -4322, -4718, -8191, -5809, -9018, -12069, -17257, -16397, -859, 4073, -3710, -16119, -14320, 4668, 7988, 4688, -1414, -1028, -6141, -6621, -8095, -9869, -6623, -7935]
13639g935o779L545P257L695J383N311o936l520r852M27M537O672m86n69M468
13624A218R948M008p547k617j2624L156K788k978o2O543j421n247K826l891L57
13609e543O073k450p25J83l658r785J90J0350L076l740M237l141l916j856n857
13594a6562j835K584K814J203O386M691j590l115K783j276o063o975L138k561
13580a6378r195K79O599M175p03j952L91R453q37J286Q062J38m597m490K941n405
13564a0233o990J399R163J1765r854r694N839O085O519l715O403k74k760K552
13550F205L06j1192m179L610J354P233k772j1766j5837O45Q033J92m459L409P671
13535a1547R811r85N99M287n894j615P880L005m82n12k33N144n52r594m701n831
$$ y = [-7935, -14714, -11169, -3912, -217, 1166, 6477, -459, -3979, -13831, -13404, -8867, -2195, -2681, -3250, 1218, 11166, 15174, 7627, 5010, -7614, -4458, -1670, -4648, -4710, 1833, 412, -4835, -2009, -5900, -5543, 530, -1920, -2645, -2462, -6120, -15905, -15715, -5365, -2289, -6029, -1792, -4933, -8849, -10705, -16562, -18397, -15813, -12999, -11796, -5410, -719, -2309, -5424, -2641, -3917, -9980, -16955, -13817, -16378, -25573, -25294, -18695, -14520, -15223, -17175, -16784, -7331, -8168, -6882, 1180, 1318, -3279, -7769, -4828, -10233, -17223, -15824, -6661, 5104, -4750, -14444, -8605, -2520, 3999, 284, 6687, 6413, 3653, 6205, 6511, -4681, -8860, -5250, -3896, 3337, 565, -11201, -27038, -26393, -18360, -18168, -22627, -19218, -11547, -1736, -2721, -2122, 2165, -3729, -5344, 2536, 5541, 5059, 4547, 4314, 9458, 8906, -688, -5389, -11220]
13519a1220n745L446J861L346j617j702r45K54P897n85l083N042L951j2254K292
13504i062m881l017L430N94K877r54P533M253j888k660l972O357K9L192l264p471
13488h904O185K816l775m185L478k890j2660l928M16R037J0259o647m259N674
13474i383N673n414Q93L533M765L922J327j826r382k239p084R324Q807k439q550
13459h073m808O863m559P79N992K757o68o084p756K771N125N921k743L290J641
13444D48l849R09K570m682n791L272Q970J4255M64j4384p700J1046K279p674K28
13429C61m9o438J642Q01L998L900j1670j45L145n703K317M522J830L720l666l694
13413e129L663P366P15l42j1311k931p151L953O631k123K650O747J544L997L738
$$ y = [-11220, -16965, -13519, -11658, -8312, -9929, -11631, -12576, -12322, -4425, -5010, -8093, -3051, 900, -11354, -9062, -13943, -16960, -13530, -12936, -10059, -11013, -3480, 773, -1115, -3775, -7747, -1390, -1361, 1831, -1433, -8904, -2719, 97, -3678, -7863, -4385, -7275, -19935, -23863, -23447, -14410, -4151, -10798, -15057, -9383, -3710, -9124, -8231, -4698, 67, 3989, 5316, 3490, -5892, -8131, -15215, -5891, 2916, 477, -8073, -12881, -6018, -10577, -9798, -3806, -1049, -1717, -7801, -15557, -12786, -7661, -1740, -4483, -1193, 448, -3401, -2492, 78, -4604, -10395, -7123, 1847, 16102, 16566, 2182, -5518, 5528, 7807, 133, 361, 312, -6126, -4484, -3683, 315, 4215, -7455, -7600, -4455, -10158, -7841, -3319, -1489, 2231, -1435, -5129, -1466, 5900, 6615, 6273, -5038, -7969, -15120, -11167, -4536, -6659, -4009, 2738, 4282, 8279, 12017]
13398A2017o170j209n261k863l274Q38L508l986L419j696j2701n381M013J0466
13384h280n03L023N991J380k652M071Q05L552m51n725k028J721j300N347J620
13369F571q093L884n31k940K425k571J202K388P19J546n199j68o58K172l00l300
13353b853J1214N013q8r988K975M789N558O505j960o721j3013j63J1674j933p287
13338C722Q03N820k563j969m333n191n295L401L349J4548M223m80j378j739r362
13323C556L734J1187m397l380k675Q13P397o117j460Q87L844l480j3225K683J4404
13308A3771J998j898q61L097n938j1649r674N231M471M691L66n28k786J037J522
13293B850K073m904L424j926N23l987K728O80M906M161N07p428m93K388q86n297
$$ y = [12017, 5847, 4638, -623, -3486, -6760, -5922, -2414, -6400, -2981, -4677, -17378, -22759, -18746, -8280, -8783, -5760, 231, 1611, -1041, 3030, 3835, 7387, 6936, 1211, -817, 904, -396, 4951, 6571, -1522, 2362, 1831, -1109, 1316, -1255, -53, 2335, 3054, 4600, -599, -767, -1425, 747, 447, -2853, 8361, 13374, 13286, 3298, 6273, 11062, 16620, 23125, 21165, 14444, 1431, 1268, 12942, 11009, 3722, 4525, 10345, 7782, 5813, 1480, -3711, -9006, -5605, -2256, 12292, 16515, 16035, 14657, 12918, 3556, 7290, 18477, 14080, 10700, 8025, 8838, 16235, 10118, 8658, 9545, 13389, 9909, -3316, -633, 13771, 15769, 13871, 13010, 16107, 10169, -1480, -11154, -5923, -1452, 3239, 3605, 3077, 291, 1328, 2850, 4923, 19, 3443, 1517, 2040, -1947, 781, 1461, 6367, 10528, 11035, 3607, 3114, 5502, 4616, -681]
13277f81m131K150n089P609J1044j240M371P704j126l835o511l274K455l579l97
13262E470N797J110O724N092j737r086l140O638L712N856K235l550j0169M823
13248A9775M407O64m505o112n291M784K945L028P018j1878n643n25k240k983m191
13233g47L750O646k305q645Q667P30m519q65n621K392J3566N276n689j279Nr793
13217A569m844r50K037J954J2576N863J354l034p458j2790l349J0706P560m166
13203G028k16q319o633Q751P856K388l221k20m748r54j611O140R109O84k353o919
13187F762k557O296n352j21K639j462P64O861J350q984j1561L936O929L798K227
13172A1525k972k317K818K257l993l206m450j603L475J458j807n732l481P265
$$ y = [-681, -4812, -2662, -7751, -142, 10902, 9662, 14033, 21737, 20611, 16776, 10265, 6991, 9446, 5867, 5470, 11267, 12377, 19101, 24193, 22456, 13370, 10230, 16868, 20580, 26436, 28671, 25121, 14952, 19775, 24182, 24846, 20341, 14229, 8938, 13722, 16667, 19695, 26713, 14835, 9192, 8667, 6427, 3444, -747, 3003, 9649, 7344, -1301, 7366, 8096, 3577, 2712, -2909, -517, 13049, 18325, 12636, 11357, 11362, 1569, -3275, -4225, -2188, -234, 12342, 18205, 19559, 16525, 9067, -3723, -7072, 3634, 11194, 7028, 6812, -1507, -8140, 611, 8467, 10855, 7634, 7414, 2666, 1712, 101, 6241, 15350, 16034, 13681, 6762, 4205, 10501, 5149, 5028, 7667, 6205, 6969, 13830, 15180, 6196, -5365, -1429, 5500, 9298, 11525, 8553, 6236, 9054, 11311, 7318, 4112, -338, -1941, 1534, 2992, 1185, -4547, -8028, -763]
13158g63R880J0694p41p753p355L454N679J3415o03J735j531j5528n962m307J2337
13143A2651J4296k359k184j3515o820Q70P702k889K570M370M490j544j17M817
13129B2338n477k386R80k196l4o705K626K740o42l404L88m095M052m689l913K380
13113A963r6J524L001l183r98J2160M345j853k700j1731o796K381J122N847R73
13098E959l604n03j236j472q476J0314M291L274k014j581n060n997m087m150k973
13083a7315L026J2819M558m047n16N075k068k207K482j83k638j996Q59j267J1123
13068G705j391j727O193k535J1924K768K579k870J361M193j436N479M049K523
13054C8815k23O009O275q99L834J3323P041Q584o546Q044j558K981J4784O634
$$ y = [-763, 9117, 19811, 19070, 11317, 3962, 7416, 13095, 26510, 25907, 27642, 26111, 10583, 4621, 314, 12651, 26947, 24588, 22404, 8889, 2069, 2939, 10641, 7752, 10322, 14692, 19182, 17638, 17521, 22338, 16861, 14475, 15455, 13259, 13225, 6520, 9146, 11886, 11244, 7840, 8228, 4133, 8185, 3496, -417, 1963, 1867, 3391, 6392, 3209, 2211, 14371, 18716, 16863, 14163, 2432, -4364, -1983, -861, 4986, 5959, 2355, 1852, 616, -856, -9332, 982, 5273, 8547, 6533, 4952, -108, -6105, -10192, -14342, -17315, -14289, -1470, 3088, -959, -1475, 3600, 1532, -675, 1807, 1624, -1014, -3010, -2151, -3418, 7705, 6314, 4587, 10780, 8245, 20169, 22937, 25516, 22646, 24007, 28200, 26764, 32243, 36292, 38815, 38592, 44601, 50876, 49977, 53811, 67134, 74175, 82759, 76213, 84257, 82699, 85680, 100464, 107098]
13040A07098m8J0670J9966K6583K9075M1329O2141P9895Q2609R4072Q8388P6518
13028G18296N7182K5294J1424k0032n5071p5158q1149q3399p5668o4007n0900
13017C06812m4813l9882j8518o198j2357m322j9593o364l770N400K74j1189j8600
13004A26880j6666q629K768P09n399o491n374k288l79j141Q819N53j85m242j0522
12989G8413j649M947N170k492p566l526J252p716r47m792q516p802J389L521J236
12974E0922k671O780M863n803l981P268P242O73l981k205N901R52j518n306r473
12959D9663l657L404L098J3J959M363Q36n016o878J0053J1845m236P2M804o558
12944F3765n169L712k844J243j871j1402J025P886O160K879k724l926j5088j925
$$ y = [107098, 107050, 117720, 137686, 164269, 193344, 234673, 296814, 376709, 459318, 553390, 641778, 718296, 775478, 800772, 812196, 792164, 737093, 661935, 580786, 497387, 421719, 357712, 306812, 261999, 222117, 203599, 197401, 185044, 180722, 161129, 154765, 150995, 156395, 156669, 145480, 126880, 110214, 101585, 104353, 105062, 99663, 93172, 87798, 85510, 85131, 83990, 92809, 93362, 93177, 88935, 78413, 76764, 81711, 86881, 84389, 76823, 73297, 74549, 66833, 65886, 61094, 52578, 44776, 46165, 49686, 50922, 48251, 55031, 59894, 54091, 50110, 57378, 64620, 65293, 61312, 59107, 65008, 65960, 64442, 59136, 49663, 46006, 49410, 52508, 52521, 54480, 58843, 59679, 54663, 47785, 57838, 69683, 65447, 65519, 70323, 63765, 58596, 62308, 59464, 60707, 58836, 47434, 48459, 56345, 62505, 65384, 62660, 58734, 43646, 41721]
12930D1721J155Q102O126k391j1222M177R141j453j598l67o34m86j290o279L68
12915D5070N783J5972L555L406K047N584l551n320n841N14K624l072k106n472
12901E9193p799l985J451j6444N537M156O009M405o483r395j872O242P810o48
12887D8177L3M125O879K614K505N196M605J32k88L211J023M80l423N668J5061
12872I5998J0457J9643K5027J9178J2976M905l506o834L895q986k0714j9650k1113
12859A11276j7597j4696j1945j0863j2416n368l197N322K045J030J0346k711o758
12846D4468m138J241o373l073J072Q41r16l793J655n702l299O411K627k670m263
12831B4088L677J761J07L49M148o338J304O331J679j149k884n047k503J38O027
$$ y = [41721, 42876, 50978, 57104, 54713, 43491, 47668, 56809, 55356, 53758, 53391, 52757, 52271, 50981, 44702, 45070, 50853, 66825, 70380, 73786, 75833, 81417, 77866, 72546, 66705, 67219, 69843, 66771, 64665, 59193, 51394, 47409, 48860, 32416, 37953, 42109, 48118, 52523, 46040, 36645, 34773, 41015, 48825, 48177, 48210, 52335, 59214, 61828, 64333, 69529, 74134, 74266, 73978, 77189, 78212, 78692, 75269, 80937, 95998, 106455, 126098, 151125, 170303, 183279, 188184, 184678, 177844, 181739, 172753, 152039, 132389, 111276, 93679, 78983, 67038, 56175, 43759, 38391, 35194, 40516, 42561, 43591, 53937, 51226, 44468, 40330, 41571, 35198, 32125, 33197, 34038, 33122, 29329, 30984, 25282, 21983, 28394, 31021, 28351, 24088, 27765, 29526, 29633, 29982, 34130, 27792, 29096, 35427, 37106, 35957, 33073, 28026, 25523, 25661, 31688]
12816C1688K889J48P492l270R574l773Q30L526n323k892M216k424J001m210N064
12801D4536L415M438j0120K496J5705Q525L351k321M042j967P541J469p189P799
12787H1720L152m341M276J125j952n296K639R13o568m024k45q349k214K746k420
12772F1162q84m509m635JJ701O542k516O19l876O209j964K500J0070R904J411
12757H1735P213M06P234M71N018J2368J1518J3906J4703J3563J6430K364J2673
12744A99602L0511J3481L5327M6650N8220P7648R5028R9570R5890O9710M1623
12733H63260J8100n512k5110m5513n8990n5094m4918l4888l4088k7899j5329j3403
12721E20616j0920K57j0200o318n098N232r768j1381O117M731o529M553K01p240
$$ y = [31688, 34577, 34725, 42217, 38947, 48521, 44748, 45578, 49104, 43781, 40889, 45105, 42681, 43682, 39472, 44536, 47951, 52389, 42269, 44765, 60470, 68995, 72346, 70025, 74067, 72100, 79641, 81110, 73921, 81720, 84872, 80531, 84807, 85932, 83980, 78684, 81323, 82236, 75668, 71644, 71399, 63050, 60836, 63582, 61162, 60278, 55769, 51134, 51135, 52836, 59378, 56862, 57481, 53605, 59814, 57850, 60350, 70420, 80324, 81735, 88948, 89354, 96588, 97059, 102077, 114445, 125963, 139869, 154572, 168135, 184565, 186929, 199602, 230113, 243594, 278921, 325571, 383791, 461439, 556467, 656037, 751927, 821637, 863260, 881360, 875848, 850738, 805225, 746235, 691141, 646223, 611335, 577247, 549348, 534019, 520616, 509696, 509953, 499753, 493435, 488337, 493569, 483801, 472420, 478537, 483268, 476739, 481292, 481493, 474253]
12707D74253n631J369j0967n583O711j90j0764j546M940m11o20Q804L191J70J0696
12692D74422Q099j979m408L979M594k835k372j297j0044J404Q866L663K366p262
12678D77196k785J2550O443Q58Q896J6186J4432J7481J5698O025R704J7634K0406
12665F20724J6875K2798Q842J0814K2227K0514K3048K8771L1811L8721L6391L8490
12653I20026L9958L7565L6851L8886N1154M3758L5849N1781N8064O4839O7822
12642A446553Q0996J00910J12107J28701J53261J78231J93170K05768K31955K64174
12632C095826L02886L62178M38004N10031O13228P27471Q24655R42382J052386
12623H869047J177128J303683J488681J782032K255078K996795M144300N850832
$$ y = [474253, 468622, 469991, 459024, 453441, 460152, 459962, 449198, 447652, 452592, 452181, 451561, 460365, 463556, 463726, 474422, 482521, 480542, 476134, 480113, 484707, 481872, 479500, 478203, 468159, 469563, 478429, 482092, 484458, 477196, 474411, 486961, 493404, 494262, 503158, 519344, 533776, 551257, 566955, 572980, 582684, 600318, 620724, 637599, 660397, 669239, 680053, 702280, 722794, 745842, 774613, 806424, 845145, 881536, 920026, 959984, 997549, 1034400, 1073286, 1124440, 1168198, 1204047, 1255828, 1313892, 1378731, 1446553, 1527549, 1628459, 1740566, 1869267, 2022528, 2200759, 2393929, 2599697, 2831652, 3095826, 3398712, 3760890, 4198894, 4708925, 5322153, 6049624, 6874279, 7816661, 8869047, 10046175, 11349858, 12838539, 14620571, 16875649, 19872444, 24016744, 29867576]
12615B9867576Q148821J0914334J3752165J5933959J6886572J6622458J4975736
12608A27101621J1505204O420771Q08727m561343r389799j3264435j5264658j5300451
12600H8055637j4209908j2498458j0158472p548238n367026l868240k929294k356143
12592B9119858j993436j772379j621557j505662j405894j315644j202692j077995
12584A7224599r65485q46649p40917o50199n75164m96327m41713l99272l59751
12575A1749122l19645l01229l02232k89832k79546k82930k82717k76825k62743
12566I151423k50943k54829k26484k11821j99480j75839j43230j17926j12213
12557G458658j32882j55949j89293k09811k18697k10291j99113j87734j87087
$$ y = [29867576, 38016397, 48930731, 62682896, 78616855, 95503427, 112125885, 127101621, 138606825, 145027596, 145836323, 141274980, 131885181, 118620746, 103356088, 88055637, 73845729, 61347271, 51188799, 43640561, 38273535, 34405295, 31476001, 29119858, 27126422, 25354043, 23732486, 22226824, 20820930, 19505286, 18302594, 17224599, 16259114, 15412465, 14671548, 14021349, 13446185, 12949858, 12508145, 12108873, 11749122, 11429477, 11128248, 10826016, 10536184, 10256638, 9973708, 9690991, 9414166, 9151423, 8900480, 8645651, 8419167, 8207346, 8007866, 7832027, 7688797, 7570871, 7458658, 7325776, 7169827, 6980534, 6770723, 6552026, 6341735, 6142622, 5954888, 5767801]
12548E767801j70109j59037j43529j41316j30010j23434j23076j26533j08325
12539D542432j03997j12733j04112j01949q7300r1725j00899q8693q9923q7975
12529C573126q7473q4078p8983p8688p0686o3564o0154o1206o4199o1822n4069
12518B808204n6429o7935n0976n0992n1098m4943l5736l3651m2551n4917n6333
12507B262643n0770m2567l3263m4825l7736l8779l3214j6882k8350k7489k5225
12496A883543j8195j0898q728o229k534k553N135J8122K4470L0714L8113L5164
12484A986124L4057N3728M7044L0796J5949q274l4509n0827n5330p6354p7950
12473A864454q1643p3870o6566o7525n6879m8323k9954k4291k6919k4848k8411
$$ y = [5767801, 5597692, 5438655, 5295126, 5153810, 5023800, 4900366, 4777290, 4650757, 4542432, 4438435, 4325702, 4221590, 4119641, 4032341, 3940616, 3839717, 3751024, 3661101, 3573126, 3485653, 3401575, 3322592, 3243904, 3173218, 3109654, 3049500, 2988294, 2924095, 2862273, 2808204, 2751775, 2683840, 2632864, 2581872, 2530774, 2485831, 2450095, 2416444, 2373893, 2318976, 2262643, 2211873, 2169306, 2136043, 2091218, 2053482, 2014703, 1981489, 1964607, 1936257, 1908768, 1883543, 1865348, 1854450, 1845722, 1839493, 1836959, 1834406, 1839541, 1857663, 1882133, 1912847, 1950960, 1986124, 2020181, 2073909, 2120953, 2151749, 2167698, 2159424, 2124915, 2074088, 2018758, 1942404, 1864454, 1782811, 1708941, 1642375, 1574850, 1517971, 1469648, 1439694, 1415403, 1388484, 1363636, 1335225]
12462A335225k2721k4434k4624j9976l0577j9265q035j6277k2050j5880j0910
12451A120476r271j6002o837j5877k0156k3407j8996j7328j6092j0034j8048j9901
12439I28527k5658j7538r428j3061j8117k5698j8198j9213r382n467j1587k6182
12427G28998j0755m947j1882r881j3379k9997j1975q106j0302o512n47o28k565
12414F07522M563r788j6149j6541j4028o333p712j790p453j4761k1324j4233m510
12401D77463m596j1069j9248m71m473n215n72o903m5l283r643j5614o346k437
12387C87548m566q876o961j0970o81n927r376o455M879k643J639r711j2317J330
12373C16913R578m818j946r158j2726n818k331Q0j965P145r047o578R71k504p056
$$ y = [1335225, 1312504, 1288070, 1263446, 1243470, 1212893, 1193628, 1185593, 1169316, 1147266, 1131386, 1120476, 1111205, 1095203, 1088366, 1072489, 1052333, 1028926, 1009930, 992602, 976510, 966476, 948428, 928527, 902869, 885331, 875903, 862842, 844725, 819027, 800829, 781616, 772234, 766767, 755180, 728998, 718243, 713296, 701414, 691533, 678154, 648157, 636182, 628076, 617774, 611262, 610715, 610087, 607522, 612085, 602297, 586148, 569607, 555579, 549246, 541534, 539744, 532291, 517530, 496206, 481973, 477463, 472867, 461798, 442550, 442079, 437606, 432391, 431819, 424916, 424871, 421588, 411945, 396331, 389985, 387548, 382982, 374106, 367145, 356175, 355494, 349567, 340191, 333736, 338615, 335972, 337611, 327900, 315583, 316913, 326491, 321673, 319727, 310569, 297843, 292025, 289694, 289774, 287809, 294954, 285907, 279329, 280300, 277796, 270740]
12358B70740k369J327m607j3535j2751p872P99j291j2722l075P129o602j8739
12345A96432j4447m697o613m865m164P275J250n172j1398p298M273P541l960k017
12331A52140l056K475j1455l814k539M313M150J211o824o50K904o3k128O292j084
12316A41872K139p854j2054p33M26j8154r536P79m744j647r309j1776m488P253
12302G2174R402L288m99q722j065l62k163q081o56J782j698M130O504o57l350
12287G0027p549j509O21j294m246o892K619J263J702P238p454j2939j258J1367
12273E1696K233m145k263N837j565p147r733n54L194j489K950J74l727N220Q096
12258D8777L473J619m408p935N01L227P65m833k469p40K731K028o6r089l549l241
$$ y = [270740, 268371, 269698, 265091, 251556, 238805, 230933, 231732, 230441, 217719, 214644, 221773, 215171, 196432, 181985, 177288, 170675, 165810, 161646, 168921, 170171, 164999, 153601, 146303, 150576, 158117, 154157, 152140, 149084, 151559, 140104, 136290, 133751, 138064, 142214, 143425, 136601, 135951, 138855, 138792, 136664, 142956, 141872, 144011, 136157, 124103, 123370, 123796, 105642, 96106, 96885, 92141, 90494, 81185, 69409, 64921, 72174, 81576, 84864, 84365, 75643, 74578, 74216, 72053, 63972, 63316, 65098, 63400, 67530, 74034, 73377, 70027, 62478, 60969, 61590, 60296, 56050, 49158, 51777, 53040, 54742, 61980, 54526, 41587, 40329, 51696, 53929, 49784, 47521, 53358, 51793, 44646, 34913, 34359, 37553, 36064, 39014, 39188, 35461, 40681, 48777, 52250, 53869, 49461, 41526, 42027, 45254, 46019, 41186, 38717, 37977, 40708, 42736, 42670, 33581, 30032, 26791]
12242B6791O103L776N018n73L397M925M891n097j566R672J3201Q660L438j243
12228H1393p63O303Q489M334P244O700K422O30o413p082k062p029p336o077j0540
12213G0213l533l573j291j0573L493J0028Q87N060j1012m418j825N462N769O246
12199G0933P990M609P943J4348P393Q804J1543J1311J5972J5610L7800N2053O8804
12186C35113Q0371Q7809R1765Q2370O0148N0043J7242r451l8761o7834q2805q4432
12174E21578q1667p0106n3978m4714l1330l2700k1529n171j4128j4494j2706n741
12162A33314o935m216j791j1812j9694j0099o673L928L147P47q38l539k589m578
12148F8372o857q447K626M884j0244o78L899K064p6P246J0723R45j248P277J61
$$ y = [26791, 32894, 36670, 41688, 41115, 44512, 49437, 54328, 49231, 47665, 57337, 70538, 79198, 82636, 81393, 80630, 86933, 95422, 99756, 107000, 113700, 116122, 116752, 110339, 103257, 101195, 94166, 86830, 80753, 70213, 66680, 63107, 61816, 51243, 54736, 64764, 65651, 70711, 59699, 55281, 53456, 58918, 64687, 70933, 78923, 83532, 91475, 105823, 113216, 122020, 133563, 144874, 160846, 176456, 214256, 266309, 335113, 415484, 503293, 595058, 677428, 737576, 787619, 804861, 795410, 756649, 688815, 606010, 521578, 439911, 369805, 315827, 271113, 239783, 207083, 185554, 180383, 166255, 151761, 139055, 133314, 126379, 122163, 120372, 108560, 88866, 78767, 72094, 76022, 79169, 79916, 79078, 75539, 72950, 68372, 61515, 53068, 55694, 60578, 50334, 49656, 53555, 55619, 55543, 62789, 73512, 74457, 73209, 80486, 80647]
12133H0647j2224N542N982J823l750j0707m133P888p106m523Q008K210k192j797
12119F5668j562q224N243O402K765L507L568q412j0751m418K192Q651R298P343
12105H1270K710M012Q097J9429K2213J2427R878P578J3136K1330L0064L1350N0113
12092C13607O0373P7473R8603J41979J69327J95070K04175J94084J62424J14640
12082A731755O2384l71p2357j25427j59423j81299j78787j67670j42505j23291
12072F43009r2450o0608m3695l6928k2290k3754k4954j7473j6232k2571k5572
12061B56482q226j1019j5435n227j5543j8546m172J844q425j1331o873p290Q10
12048A47049o271k787r435j330K226P604R539K128j1365j2816j1780m221Q731
$$ y = [80647, 68423, 73965, 79947, 81770, 78020, 67313, 63180, 71068, 63962, 59439, 67447, 69657, 67465, 65668, 64106, 55882, 61125, 67527, 70292, 73799, 77367, 68955, 58204, 53786, 55978, 64629, 73927, 81270, 83980, 87992, 96089, 115518, 137731, 150158, 160036, 167614, 180750, 202080, 232144, 263494, 313607, 373980, 451453, 550056, 692035, 861362, 1056432, 1260607, 1454691, 1617115, 1731755, 1794139, 1793768, 1721411, 1595984, 1436561, 1255262, 1076475, 908805, 766300, 643009, 550559, 489951, 446256, 409328, 387038, 363284, 338330, 320857, 304625, 282054, 256482, 248256, 237237, 221802, 216575, 201032, 182486, 178314, 180158, 171733, 160402, 153529, 146239, 147049, 140778, 137991, 128556, 127226, 129452, 137056, 146595, 148723, 137358, 124542, 112762, 108541, 117272]
12035A17272l380q015O36L431m128r758p294m129q435q55L08L271l028j2769m021
12020E9106K911L405J605q376J492L525J515R035M411M606l69j3800j3490R34
12006E6510J612o770q645l797J987L072K554n87r084K158J72L802J0912Q963R7
11991F2956q294n703o66l161j2277l980M99L591J839n310Q438O738l976j1230
11977B9464J593j921q047M347j068j253p43l844j1328N639J4958k441k310j850
11963B1196L111J193l22J549P403M286q02q200J69l490J065J4204j3027j0764
11949A7571J835J5557M634o511O672J2205L579N606J4175J5974k919j4583j3923
11936E9872j3295j1270q667k567N732J744J883M730M523m387o914J062n631j037
$$ y = [117272, 113892, 105877, 106513, 109944, 105816, 96058, 88764, 84635, 76200, 75345, 75653, 78924, 75896, 63127, 59106, 62017, 65422, 67027, 58651, 60143, 63668, 65183, 74218, 78629, 83235, 82866, 69066, 55576, 56510, 58122, 51352, 42707, 38910, 40897, 43969, 46523, 45936, 36852, 39010, 39182, 42984, 53896, 62859, 62956, 54662, 48959, 48293, 45132, 32855, 28875, 29374, 32965, 34804, 29494, 37932, 44670, 40694, 29464, 31057, 29136, 21089, 25436, 24368, 23115, 22372, 18528, 7200, 12839, 27797, 25356, 23046, 21196, 24307, 25500, 25178, 26727, 34130, 38416, 37614, 29414, 29583, 26093, 27158, 41362, 28335, 17571, 19406, 34963, 39597, 33086, 39758, 51963, 55542, 61148, 75323, 91297, 88378, 73795, 59872, 46577, 35307, 26640, 24073, 29805, 31549, 33432, 38162, 42685, 38298, 31384, 32446, 26815, 25778]
11922B5778k095j450j951m169m036J945K327K141n562O03j909m731m352l41P476
11907I674L989n12k100k484J932m45J678k926k771L659J0569O470r969J205J249
11892A9218l102m208o810q31j555O969L93q121L865Q507M15n815L888M221m804
11877A2230m516L684m003L315K455o137k924K622O522R583p013J617k398o663
11863H374o09R35k864p363k26j251N415J0336j824q625l281r537K643l427j563
11848a2867O270J1772m49L249O697m636j2491j935P416K45J408J418n098l736
11834b737o4l320m192J210n208M941N235Q19K748O260P288M287k022l536l835
11819G874q967p72n690l301J629K442j716J0689n90n925M266j064K951P24N911
$$ y = [25778, 23683, 22233, 20282, 16113, 12077, 14022, 16349, 18490, 12928, 13531, 11622, 6891, 2539, 2198, 9674, 13663, 13151, 11051, 8567, 10499, 10054, 11732, 8806, 6035, 9694, 20263, 26733, 16764, 17969, 19218, 16116, 11908, 5098, 4267, 2712, 9681, 10074, 1953, 5818, 14325, 14740, 8925, 12813, 17034, 12230, 7714, 11398, 7395, 10710, 13165, 7028, 4104, 6726, 13248, 22831, 15818, 17435, 15037, 8374, 7765, 8700, 5836, -1527, -1753, -3004, 2411, 12747, 10923, 2298, -983, -10520, -7877, -11304, -12867, -6597, 5175, 4726, 7975, 14672, 10036, -2455, -4390, 3026, 3271, 4679, 6097, 999, -2737, -2801, -6121, -10313, -9103, -14311, -9370, -4135, -3316, -568, 5692, 12980, 17267, 15245, 11709, 7874, -1093, -1865, -7555, -10856, -9227, -6785, -8501, 2188, 1598, -4327, -61, -1125, 1826, 2550, 8461]
11804H461L886N41r539j9988q533Q19J1774J866m733Q061o114l01M918p816L187
11789a3511R182O050P900P122l189m310M291J912m024q417n414J013k844M683
11775D44R338l811m443k005M994k820l499n221K331J992l112J05P28j210L395
11760b794R395P494n529j0740o312L701N573M668J5339m117j6876q123o173O743
11746g751N793j0842m787J123J901K165O163R298K320j3023n824K195N673O652
11732A056j604N41J665O264n90n215J724J463J765o244k65l262l885J93M518M508
11716B632m238k521m036K252J477j047j447m93J658M398j0251j218l062l20P801
11701h415J3991l506o282n48J911q328l770j161O972M382O249K814L358j0901
$$ y = [8461, 12347, 12888, 3349, -16639, -25172, -24353, -12579, -10713, -15446, -7385, -13499, -13800, -8882, -16698, -13511, -4329, 1721, 9621, 16743, 13554, 9244, 13535, 15447, 11423, 3006, -2408, -1395, -4239, 444, 9782, 5971, 1528, -477, 4517, 1697, -1802, -7023, -4692, -2700, -5812, -5707, -4979, -6189, -2794, 6601, 14095, 8566, -2174, -8486, -4785, 788, 5456, 20795, 16678, -198, -8321, -14494, -7751, -1958, -12800, -17587, -16464, -14563, -12398, -6235, 3063, 5383, -7640, -13464, -11269, -5596, 1056, -548, -7, 1658, 7922, 7332, 2117, 3841, 5304, 7069, 825, 560, -2702, -6587, -6394, -1876, 2632, -1606, -4127, -8163, -5911, -4434, -5481, -6928, -7421, -5763, -1365, -11616, -12834, -15896, -16216, -8415, 5576, 2070, -4212, -4760, -2849, -11177, -14947, -16108, -9136, -4754, 1495, 4309, 7667, -3234]
11687c234O908M105q006n175n646k660Q391Q700L222M653l213r514l83m201k955
11672i008q96L322q162l510N81P954K211J0K099J583N367O954K490M77m954n649
11656H69o599j478O15Q127l787l785J2149L68l432N105L916j431r396J869n402
11641b292r431k942M49J927n979l728L507M0Q706R784j772r109l076j756j227
11626a6899k940O686N514q030N34P557k695k088Q355j468l634R60J633K757M63
11611c295q175j1153O204J0794P549J318o385J852N358l508q65n599r255K336
11597a2824L422M289O041J769n180J677k128j864L269l682r988k471N644M131
11583g895J555j398O483j1928l439K035P666J4872n102j2081o06O237n172o445
$$ y = [-3234, 3674, 7779, -227, -5402, -11048, -13708, -5317, 3383, 6605, 11258, 8045, -1469, -1852, -6053, -9008, -9904, -6582, -14744, -18254, -17673, -9719, -7508, -7498, -5399, -3816, 1551, 8505, 10995, 11472, 6518, 869, -5730, -7208, -6593, 1534, -2253, -6038, 6111, 6479, 3047, 8152, 12068, 10637, 1241, 3110, -2292, -11723, -14665, -14216, -12289, -18268, -21996, -18489, -18449, -9743, 41, -1731, -10840, -13916, -15672, -16899, -19839, -13153, -7639, -15669, -15135, -7578, -10273, -12361, -4006, -5474, -9108, -8148, -6515, -3758, -3295, -11470, -22623, -16419, -5625, 1924, 3242, -3143, -1291, 4067, 559, -306, -5905, -15160, -12824, -9402, -5113, 928, 2697, -2483, -806, -2934, -4798, -1529, -5211, -15199, -17670, -12026, -7895, -6340, -7738, -1255, -13183, -16622, -14587, -6921, 7951, 2849, -9232, -9838, -3601, -8773, -15218]
11569a5218jL976P747O468J894k205o740R47k454K597N391k257L755L37J733p570
11553a600k096j966o356O20m42J240o18l22k78n920J164L493j847J566o60Q096
11537e926J1796L315n891j608K202l310n599o166J041M713K804k94Q00m522j509
11522h154m180k359M642M893R374N627k179p078m132M457j0396m529N488J279
11508g247o10p598P116N934Q07j356P80P789L523%l916n362m339Q496N509O462
11492A5988j736k019L792k241O311l934q181K04o805J1058P881j694m805n778
11478H041N026J380r41j343K013j852o884o733j863L282O503K551M137j755J0485
11463B2047j10q000p822k923N188J608q326o237q544K912n92K703O548L190n285
$$ y = [-15218, -15219, -11243, -3496, 2972, 4866, 2661, -4079, -3132, -5586, -2989, 2402, 145, 3900, 4237, 5970, -1600, -3696, -5662, -12018, -11398, -11840, -10600, -11218, -11540, -11818, -17738, -16574, -13081, -14928, -13362, -14022, -5926, 5870, 9185, 3294, 1686, 3888, 578, -5021, -11187, -10146, -5433, -2629, -2923, -2123, -6645, -8154, -12334, -14693, -10051, -5158, 4216, 9843, 7664, 586, -3546, 911, -9485, -14014, -8526, -7247, -7857, -15455, -8339, -2405, -1598, -2954, -2174, 5615, 9138, 9138, 5222, -140, -4479, 4017, 9526, 15988, 14252, 12233, 16025, 13784, 20095, 16161, 7980, 8184, 1379, 12437, 20318, 18624, 13819, 8041, 13067, 14447, 13506, 12163, 14176, 12324, 5440, -1293, -3156, 126, 6629, 9180, 13317, 11562, 22047, 21937, 13937, 6115, 3192, 8380, 9988, 1662, -4575, -13119, -10207, -10799, -8096, -1548, 1642, -3643]
11448c643p746k694R588R89p497K649M688Q57L645R239J000r567p273J831j994
11433e928J2925L417Q03o34l863p959j307K163J107r11n41M512k469P038Q114
11418A6467J037p245l699k284j2152o227J6023R435j4436n191N518J202m164L727
11404a989M680j95l784k075K886N722o270m854m910O2N530J0492j054M64l957
11389G48j506J9L772l33j1209m64K809K426J0935Q317K812n125l065K50J931j506
11373A0811o811j0170o249j075K333p27k668Q410M281P424J0746L218j3144r46
11359E433M687J939l135j2R6q911K161l784K313k001K842J84R21r64M049N059
11343A0877K378p383q452k480L6L423r35N597M548k309k644j636j627n243J939
$$ y = [-3643, -11389, -14083, -4495, -3506, -11003, -8354, -3666, -2809, 836, 10075, 11075, 1508, -5765, -3934, -5928, 6997, 10414, 11217, 10583, 6720, -1239, -2546, -383, 724, -187, -728, 3784, 1315, 8353, 16467, 17504, 10259, 6560, 4276, -7876, -14103, 1920, 11355, -3081, -8272, -2754, -1552, -5716, -1989, 2691, 2496, -1288, -3363, -477, 5245, -1025, -5879, -10789, -10727, -5197, 5295, 4241, 4705, 748, -758, -739, 3033, 2700, -8509, -8973, -6164, -3738, 7197, 15514, 18326, 13201, 10136, 10386, 12317, 10811, 4000, -6170, -12419, -13494, -11161, -11888, -14556, -6146, -1865, 5559, 16305, 19523, 6379, 5433, 10120, 12059, 8924, 8912, 9008, 97, 2258, -1526, 787, -1214, 1628, 1812, 2733, 1769, 5818, 10877, 13255, 5872, -2580, -5060, -5024, -1601, -2536, 3061, 7609, 5300, 2656, 1020, -607, -5850, -3911]
11328c911R606L816L196K994j902O489O158N672j171j1353j4766N006Q505L774
11314B2113K809j0215o297J05N30J380j345q805k547M064K595p022P578P865j1490
11299A318k982M089k489n61n555P816J2622k003N471P738m346l925n212l750J6237
11284B4468L500n362n730o198l347j191K649L494L058m264M083L231o590n091
11270F710k013M576j409j016Q039p065K330O815M73m056N20k233J355l79J4626
11255B7273R395O330q545j938J816O361R216j678q10j033n243j0274n898k742
11241B2230M575n484P22n038O915R763J672m522n633M216o58k555M882j186j784
11226B8115J317R69J564L965L164o419M572K986k845m487L390n372l568N523Q306
$$ y = [-3911, 5695, 9511, 12707, 15701, 13799, 20288, 26446, 32118, 30947, 19594, 4828, 9834, 18339, 22113, 24922, 14707, 8410, 8515, 9045, 10425, 9080, 275, -2272, 1792, 4387, -2635, 4943, 12808, 1318, -1664, 2425, -64, -625, -6180, 1636, 14258, 12255, 17726, 25464, 21118, 17193, 11981, 8231, 24468, 27968, 22606, 16876, 10678, 7331, 6140, 8789, 12283, 15341, 11077, 15160, 18391, 11801, 6710, 4697, 9273, 7864, 6848, 14887, 7822, 10152, 16967, 17440, 13384, 13904, 11671, 13026, 12647, 27273, 36668, 42998, 34453, 32515, 34331, 40692, 49908, 48230, 47420, 46387, 41144, 30870, 24972, 22230, 26805, 21321, 22043, 17005, 23920, 33683, 35355, 30833, 25200, 29416, 28758, 26203, 31085, 29899, 28115, 29432, 30401, 31965, 35930, 39094, 32675, 37247, 40233, 37388, 32901, 36291, 30919, 27351, 32874, 41180]
11211D1180M984L104k370l144p334L65o83J0752q239L284Q228o339j769j199l86
11196D0434l063p336j733n210K826O596l185J208P141n04n400R399M321K591m176
11181D3909k722j80l991p101K683N448j509l831K203R222n092p417M133k455m680
11166B8620J253K794n942k928q172o19l488k851K546J2744J5317l302n83p944
11152B7445r21K362J689q362L970J987R34n009J357P47m226L603M078J282p019
11137B3917k198K567l610K310K71J108m71Q4J470L829L469m253J379n319j2656
11122A1897m568N683N025L944L42j1760m837Q79Q581R571n94k07l712j404K663
11107B1503j520K734j356k175K753k229p999J72Q671L228O749k626k576l24N645
$$ y = [41180, 46164, 49268, 46898, 43754, 36420, 36785, 36102, 46854, 38615, 41899, 50127, 43788, 42019, 40820, 40434, 37371, 30035, 28302, 23092, 25918, 32514, 29329, 30537, 37678, 37174, 31774, 41173, 45494, 48085, 43909, 41187, 41007, 37016, 29915, 32598, 38046, 36537, 32706, 34909, 44131, 39039, 31622, 35755, 33300, 28620, 29873, 32667, 26725, 23797, 15625, 15006, 11518, 8667, 11213, 23957, 39274, 35972, 35389, 27445, 26524, 28886, 30575, 22213, 26183, 28170, 29104, 24095, 25452, 26199, 21973, 25576, 29654, 30936, 23917, 21719, 24286, 20676, 22986, 23257, 24365, 23894, 23978, 25448, 29277, 32746, 28493, 29872, 24553, 11897, 7329, 13012, 18037, 21981, 22323, 10563, 5726, 6605, 15186, 24757, 24163, 23956, 20244, 18840, 21503, 19983, 22717, 21361, 19186, 21939, 19710, 11711, 11883, 20554, 23782, 30531, 27905, 25329, 25005, 30650]
11092C0650J56K925j820J201m120N440R705j645p357l817l461k434k608N209K802
11077C0826R55M626m627j1316J942N816M876l076j167M465J4055K286j371o739
11063D1551p671k042l6j4639j0622K636Q881N256N38n512p42n694r220K269R82
11048E935j368L98N50l238N230P326M839m018j1799K307j715M728J2306R517k945
11033B8053n048n204n009l818j886J261p020k687k32j79m054p844K066k035J805
11018a1831R100J2120J9503J6814J1838K085o836m549j0116J549l587k755J166
11005C4501L870L810O767M994k08q593p91r30K232r90o347j1325M778Q289J5829
10990E5886J6084J6797J9133O521q053k165Q644M469Q509K015R122K7802L8103
$$ y = [30650, 30806, 33731, 31911, 33112, 28992, 34432, 44137, 42492, 35135, 31318, 27857, 25423, 22815, 28024, 30826, 31781, 36407, 31780, 20464, 22406, 28222, 33098, 30022, 28855, 33320, 47375, 49661, 48290, 41551, 33880, 31838, 31802, 17163, 6541, 9177, 18058, 23314, 23852, 18340, 17598, 11904, 2684, 4953, 5935, 4567, 4965, 5515, 2277, 7507, 14833, 19672, 15654, 3855, 6162, 4447, 9175, 21481, 30998, 28053, 23005, 17801, 12792, 8974, 7088, 8349, 1329, -1358, -1590, -1769, -5823, -13667, -11601, -13636, -11831, -2731, 9389, 28892, 45706, 57544, 59629, 52793, 48244, 38128, 39677, 36090, 33335, 34501, 38371, 42181, 48948, 53942, 53734, 45141, 44350, 43420, 45652, 44662, 38315, 26990, 31768, 40057, 55886, 71970, 88767, 107900, 114421, 106368, 104203, 112847, 117316, 125825, 127840, 136962, 164764, 202867]
10977B02867L5454N3123P8620J05079J48121K15881K86494L25753K94847J12140
10967A858379j96043l72528l23853k22616j52340r5214p2070n6322m2559l0553
10957B94281k1998j7984j9786m006o481j0998j3363n896q559k789o671m426p342
10944A63982o964j680k594j2363j0481o824j0807J984J5705J0910N006k979o21
10931A42274Q43l76r62P2j1141j8701j0565J660J318J206j200k881r147m968J2715
10916A00147R451j952j392M838L644l057l105M240l625j0973j0850L972j966j0359
10902G9013o79K041K120n358N571N428k373l527M360J25L66O219j248p064J383
10887H6377M114o084q405n085M82n549O38J456k031O260O344j138q516j383n988
$$ y = [202867, 238321, 291444, 370064, 475143, 623264, 839145, 1125639, 1451392, 1746239, 1858379, 1662336, 1289808, 965955, 743339, 590999, 495785, 423715, 367393, 324834, 294281, 272283, 254299, 234513, 230507, 224026, 213028, 199665, 193769, 185210, 182421, 175750, 171324, 163982, 157018, 155338, 152744, 140381, 129900, 123076, 112269, 114253, 129958, 140868, 145874, 142895, 142274, 143117, 142741, 141779, 141851, 130710, 112009, 101444, 103104, 104422, 105628, 104428, 101547, 92400, 87432, 100147, 109598, 107646, 106254, 111092, 114736, 111679, 108574, 112814, 109189, 98216, 87366, 91338, 89372, 79013, 78334, 80375, 82495, 77137, 82708, 88136, 85763, 82236, 86596, 86721, 87087, 93306, 92058, 84994, 86377, 90491, 84407, 76002, 70917, 71399, 65850, 66488, 67944, 65913, 72173, 78517, 77379, 68863, 67480, 61492]
10872F1492N236N206N557R024M505K413j0562j0150r881L507k527J47N593L737
10858G3297J2362Q987j181j007J1681J2148K3188K1673O280n882k8431k9268j0444
10845I3403q392j9940j7703l890Q662K461j743P414P390Q857m933l395K251J3417
10831H3859j992k79q22J097m14j328p565J179Q691J0821Q833Q120J0909K995L454
10816A27558Q885J2361K9950L6184L0717L7802M3176K7227O609q161l5413n5519
10804B61376n1164m8647o6806o6693m5736o525K3712K8610K8279J4667J973M280
10792G7326J385l739j332m887K640L257n649r540J294J854p916m421l619m764
10778D1889j487N020J0884L538K442j226O624L423m666m001m216j0827J269N493
$$ y = [61492, 66728, 71934, 77491, 86515, 91020, 93433, 82871, 72721, 62840, 66347, 63820, 63967, 69560, 73297, 85659, 94646, 93465, 92458, 104139, 116287, 139475, 161148, 167428, 161546, 133115, 103847, 93403, 85011, 65071, 47368, 43478, 52140, 54601, 52858, 60272, 67662, 76519, 71586, 68191, 70442, 83859, 81867, 81588, 80766, 81863, 81449, 80121, 72556, 73735, 82426, 93247, 102080, 110200, 121109, 124104, 127558, 136443, 148804, 178754, 214938, 245655, 283457, 326633, 353860, 360469, 352308, 316895, 261376, 210212, 161565, 94759, 28066, -17670, -24195, -483, 28127, 56406, 71073, 73046, 77326, 78711, 74972, 73640, 68753, 71393, 74650, 69001, 59461, 60755, 62609, 54693, 50272, 46653, 41889, 40402, 45422, 56306, 59844, 62286, 61060, 67684, 71107, 66441, 62440, 58224, 47397, 48666, 54159]
10764E4159K58J284K948n81K863L070O751N825k842M669R730p405j401J561L493
10749H4382j2839j8358j7054j0497o254N687J5487P918J2189J5406P896J0563
10737I4526K4781R820n921k308Q3m456Q288L385o754r610o30Q136J1469j167j4100
10722A15542k946l020r81q235l058J2901o032j8572n599m309M548j174P197J4781
10708A01043Q069k087j1649j7853j0177K162J3091K3061K0233J3845R643M480
10696A53861j692J9263J8619L771P609J0051O846K5392K4666K4539L5663L3019
10684C61607M4798N2492O4765J02476K33123M25736N13729L34488j34674m69007
10674A529533l55481j33825n7173m0315n3573m2130m3106l3096j1443r892o552
$$ y = [54159, 54417, 55701, 58649, 58068, 60931, 64001, 70752, 76577, 73735, 78404, 88134, 80729, 79328, 80889, 84382, 71543, 53185, 36131, 25634, 19380, 25067, 40554, 48472, 60661, 76067, 83963, 94526, 119307, 129127, 123206, 120898, 120981, 116525, 124813, 128198, 121444, 111834, 111204, 119340, 130809, 129642, 115542, 112596, 109576, 108595, 100360, 97302, 110203, 104171, 85599, 80000, 75691, 80239, 79065, 86262, 101043, 109112, 107025, 95376, 77523, 67346, 69508, 82599, 105660, 125893, 139738, 149381, 153861, 152169, 171432, 190051, 193822, 201431, 211482, 218328, 243720, 268386, 292925, 328588, 361607, 406405, 458897, 523662, 626138, 859261, 1284997, 1798726, 2133214, 1998540, 1529533, 1174052, 1040227, 983054, 942739, 889166, 847036, 803930, 770834, 759391, 749499, 742947]
10663G42947J734n10j2574k055K842K218O140N632k770j6968j3938n707J610q429
10649G00172l387m031n815N928O051N232Q284J49k493k803k302M317J2343N474
10635G27119M190R719J0873n61J3760J3835n739j9104j3481q303M106j2981j0860
10622G12573M11L993M043J0258J3215K1442K9597K4317O972J2183K2585J9710
10610H81299L5031M5455L1577J7500N216M255J0938J0269J1131L1634O8518P9465
10598A232288Q8174P3316N4764N3664O2170O2447N7344M1552L9166L4996N2691
10587A852572P0457Q9329J31816J68012J76247J82729K11196K29882K49028K68033
10577C629301K81563L07513L29579L59978M32115N57120P39483R43461J116951
$$ y = [742947, 744681, 744171, 731597, 729542, 732384, 734602, 740742, 746374, 743604, 726636, 712698, 706991, 708601, 700172, 696785, 692754, 686939, 692867, 698918, 704150, 712434, 712583, 710090, 707287, 704985, 709302, 721645, 727119, 731309, 741028, 751901, 751340, 765100, 778935, 773196, 754092, 740611, 732308, 736414, 723433, 712573, 712984, 716977, 721020, 731278, 744493, 765935, 795532, 819849, 826821, 839004, 861589, 881299, 916330, 961785, 993362, 1010862, 1016078, 1020333, 1031271, 1041540, 1052671, 1084305, 1152823, 1232288, 1320462, 1393778, 1448542, 1502206, 1564376, 1626823, 1684167, 1725719, 1764885, 1799881, 1852572, 1923029, 2012358, 2144174, 2312186, 2488433, 2671162, 2882358, 3112240, 3361268, 3629301, 3910864, 4218377, 4547956, 4907934, 5340049, 5897169, 6636652, 7580113, 8697064]
10568H697064J198605J143964R53935R07517J188915J712962K428263L353002
10560B1584227M470026N911145P970740J1135003J6115983K3902870L5320302
10553A26410296M9189534N9808409O0522563M3397552m867674n9769071p1922709
10546B02768900n3409608l4203273k2119890j5124557j0923790q225021o380629
10539E2382132n022413l960163l176249k675986k327104j970219j640447j432053
10531C0177498j450784j549710j483306j347639j244027j133636j009031q97845
10523B0061520p88999o50232n15203l91245l16079l09200l33675l62096l52294
10514A6042497l26140k87845l16482m66742o00243n73092m79958m08293l58715
$$ y = [8697064, 9895669, 11039633, 11993568, 12901085, 14090000, 15802962, 18231225, 21584227, 26054253, 31965398, 39936138, 51071141, 67187124, 91089994, 126410296, 175599830, 235408239, 295930802, 339328354, 334460680, 274691609, 202768900, 149359292, 115156019, 93036129, 77911572, 66987782, 58762761, 52382132, 47359719, 43399556, 40223307, 37547321, 35220217, 33249998, 31609551, 30177498, 28726714, 27177004, 25693698, 24346059, 23102032, 21968396, 20959365, 20061520, 19272521, 18622289, 18107086, 17715841, 17399762, 17090562, 16756887, 16394791, 16042497, 15716357, 15428512, 15112030, 14645288, 14045045, 13471953, 12991995, 12583702, 12224987]
10505A2224987l30918l24566l12207k95284k66883k42674k35694k48956k66178
10496I701627k82609k86890k68905k54444k28342j98123j84346j77926j96696
10487G623346k07298j96233j80896j61244j50113j46480j46352j47411j51724
10478F135595j41470j20174j35312j48593j45237j42823j22060j17915j09094
10469D952917j09558j11017j04729r9940r6016r2702p9310p6555p7172p5266q0239
10458C950413q6635q4121o9989o1680o8054p5593p7299p0778p1825p9575p8030
10447C126834o3115n3210n7264m4201l0635k4765j9229k2213k7106j7436k0900
10436B746760j7754k465J2712J5268K8942L8781O0400M9966J8252k5412j5122
$$ y = [12224987, 11894069, 11569503, 11257296, 10962012, 10695129, 10452455, 10216761, 9967805, 9701627, 9419018, 9132128, 8863223, 8608779, 8380437, 8182314, 7997968, 7820042, 7623346, 7416048, 7219815, 7038919, 6877675, 6727562, 6581082, 6434730, 6287319, 6135595, 5994125, 5873951, 5738639, 5590046, 5444809, 5301986, 5179926, 5062011, 4952917, 4843359, 4732342, 4627613, 4527673, 4431657, 4338955, 4259645, 4183090, 4105918, 4030652, 3950413, 3863778, 3779657, 3709668, 3647988, 3579934, 3504341, 3427042, 3356264, 3284439, 3204864, 3126834, 3063719, 3010509, 2953245, 2909044, 2878409, 2853644, 2834415, 2812202, 2785096, 2767660, 2746760, 2729006, 2726541, 2739253, 2754521, 2783463, 2822244, 2882644, 2932610, 2950862, 2925450, 2910328]
10425B910328K07878M38169L31363m7329l10352l34196k38517j70159j30802j03469
10415B552914q6898q3563q2230o5194n2532m7685n4964l8796l0841l1122l0042
10404A949047k9238l4925l1933k7423l4264k2399k5812k2480k7004l2105l6906
10393A624558j6856J673p176j4464k4755l3839l9026k3155r040k0707l1860k7455
10381A377898k2552l2937l5277l4575k5259k1961l2251l0694k2210k1652k3510
10370A075020k2921k1521k1330r096m443j8936j7989j1028r537o741P166N515
10358I44159r403j5697j2746q529j3622k0690k7704k7681j9723j5353j2906k0780
10346G39325j1383r905j2358j0579j916O347M428p312n922o467j0749j4619j6194
$$ y = [2910328, 3118206, 3556375, 3887738, 3840409, 3530057, 3195861, 2957344, 2787185, 2656383, 2552914, 2466016, 2382453, 2300223, 2235029, 2182497, 2134812, 2079848, 2041052, 2010211, 1979089, 1949047, 1919809, 1884884, 1852951, 1825528, 1791264, 1768865, 1743053, 1720573, 1693569, 1661464, 1624558, 1607702, 1609375, 1602199, 1587735, 1562980, 1529141, 1490115, 1466960, 1457920, 1437213, 1405353, 1377898, 1355346, 1322409, 1287132, 1252557, 1227298, 1205337, 1173086, 1142392, 1120182, 1098530, 1075020, 1052099, 1030578, 1009248, 1000152, 995709, 976773, 958784, 947756, 938219, 931478, 938644, 944159, 934756, 919059, 906313, 897784, 884162, 863472, 835768, 808087, 788364, 773011, 760105, 739325, 727942, 718037, 705679, 695100, 693184, 699531, 703959, 696647, 690725, 684258, 673509, 658890, 642696]
10333F42696j6047j5543j4962r092n434r994j2224j1782j3183k422j681L00m853
10320E25779j5311j3192j172m576q310p14N678p723m812l198j1277l356R429M13
10306D67658j6020k0145j0153o16q661l25j020l088n381j5338j4930r419n633
10293C56929j4086o793j5710k762l409k332k960J936p822j2869j0274j1487m122
10280B64239K259o797P25R97j438L814l687p020p764n548J357K8q83Q629L239
10265B52150j0364k059J789L589L126L513r5J366l871m747o698j6547j9747k6909
10251A74496j6149k685m4J0670J6326J5565P616J0395K1598K0568J8498J1076
10239B87930j727n214Q985Q192K4962K5701L9460N7400Q5810J03983J17604J20379
$$ y = [642696, 626649, 611106, 596144, 587052, 581618, 571624, 559400, 547618, 534435, 532013, 530332, 530632, 525779, 510468, 497276, 496104, 491528, 483218, 482504, 488182, 480459, 475647, 472449, 461172, 457816, 467245, 467658, 451638, 431493, 421340, 420724, 412063, 411738, 410718, 407630, 402249, 386911, 371981, 362562, 356929, 342843, 336050, 320340, 317578, 314169, 311837, 308877, 310813, 302991, 290122, 279848, 268361, 264239, 266498, 259701, 260426, 261423, 259985, 263799, 260112, 253092, 245328, 239780, 241137, 241165, 240282, 248911, 252150, 241786, 239727, 241516, 245105, 248231, 251744, 251649, 253015, 249144, 244397, 237699, 221152, 201405, 174496, 158347, 155662, 155618, 166288, 182614, 198179, 205795, 216190, 237788, 258356, 276854, 287930, 286203, 280989, 289974, 298166, 323128, 348829, 388289, 445689, 531499, 635482, 753086, 873465]
10227H73465J05204M9603M826l8916l2818K8333R0448J59781K37815L50528N30340
10216B358609P65355J045308J299627J324589R67809J31733q64759j402623j326573
10207D299075r73889o57587m47955l15994k28615j67784j36527j13358q8506q1792
10197A087068n7441m7993n6876n8084m6128m1872l0034m0592l0320l3118k6236
10186F18374k0415j8288j7781j6744r055p238j3454j5262k801p367j3942q114
10174D67913p980p594k1862j8321k0150q555j1309q616r932p589q771q374R6M671
10160C33627j846o732q634j0338j6213m901m978j2524k64n208j561J684o564j3419
10146B42129j724J1022R183O623n365J72J1376K730J7117J5281J0582K7573K5951
$$ y = [873465, 978669, 1028272, 1033098, 994182, 961364, 989697, 1080145, 1239926, 1477741, 1828269, 2358609, 3123964, 4169272, 5468899, 6793488, 7761297, 7893030, 7028271, 5625648, 4299075, 3325186, 2667599, 2219644, 1903650, 1675035, 1507251, 1370724, 1257366, 1168860, 1087068, 1029627, 981634, 924758, 866674, 820546, 778674, 748640, 708048, 677728, 644610, 618374, 597959, 579671, 561890, 545146, 536091, 528853, 515399, 500137, 497336, 489969, 476027, 467913, 459933, 452339, 430477, 412156, 392006, 383451, 372142, 363526, 353594, 346005, 337234, 328860, 328956, 333627, 331781, 325049, 316415, 306077, 289864, 284963, 279985, 267461, 267197, 261989, 260428, 262112, 255548, 242129, 240405, 251427, 260610, 267233, 261868, 262040, 273416, 276146, 293263, 308544, 319126, 346699, 372650]
10133C72650K6273M1049P1249J32179K05311K64891L05816L09518K06242o3705
10123A871473l28981l61463k69003j82759j14093p3127n8868o2228m9475k4698
10113C46778k5589k2731j8313o256j48n996j6785p223k846r527p896k940l249
10100B17279n239j4330j1391j052p954j83R44l379m218N77J0788j890j0629q411
10086A60912j627J2658J9772J5695Q132j880P904J040k191j726P829J9429K6889
10073B72836K3502J4244m34p204j8748k4608k8277k6337j9218j0835p338k798
10061A64785n963q332k971M163L328J630q170m058J43O315Q138N357J1088K3531
10047A98984M0562O4336R0897J08988Q8451n8663j57295j02725m6283l1026k8761
$$ y = [372650, 398923, 439972, 511221, 643400, 848711, 1113602, 1419418, 1728936, 1935178, 1871473, 1542492, 1181029, 912026, 729267, 615174, 542047, 483179, 420951, 371476, 346778, 321189, 298458, 280145, 273889, 273741, 267745, 250960, 243737, 240891, 231364, 223468, 220528, 217279, 212040, 197710, 186319, 185267, 177313, 177130, 178074, 174695, 170477, 171054, 181842, 179952, 169323, 160912, 159285, 171943, 191715, 207410, 215542, 213662, 221566, 222606, 220415, 218689, 226518, 245947, 272836, 296338, 310582, 310148, 302944, 284196, 259588, 231311, 204974, 185756, 174921, 167583, 164785, 158822, 150490, 147519, 151682, 155010, 156640, 148470, 144412, 144555, 150870, 159008, 164365, 175453, 198984, 239546, 303882, 394779, 503767, 592218, 533555, 376260, 273535, 227252, 196226, 167465]
10036A67465j7969l786p824p312m830l060p640k195m735n83k476j2507o346J848
10022H8050j025P75l021l117l670m424o179N195j801j264j362L761M051N285n640
10007G5614n755q642J339l268n045M413N911k275k372m554P07q273l737j754P447
9992D9756J0548l037q595r730K713M058P731n802l338L707P37J957j300L313p974
9977D4744l09o30l719n237K49P641M853P53N433j616o564j064n44k790o306N626
9961D0520P693o812m727J727q722n249Q740Q808j687k201P12j0183l863N77j438
9946B3895m144n478m321R932M885j099r83M918L998l930j09J833j584Q738P792
9931D4343j179j308l510L15m047j0004Q60J935q152k543J0154Q729o751j1393
$$ y = [167465, 149496, 145710, 137886, 130574, 125744, 122684, 115044, 112849, 108114, 107531, 105055, 92548, 86202, 88050, 87025, 87800, 84779, 81662, 77992, 73568, 67389, 72584, 70783, 69519, 68157, 71918, 75969, 81254, 75614, 69859, 61217, 62556, 59288, 54243, 58656, 64567, 62292, 59920, 55366, 56073, 47800, 44063, 42309, 49756, 60304, 57267, 48672, 38942, 41655, 45713, 53444, 47642, 44304, 48011, 48748, 50705, 49405, 52718, 44744, 44435, 43805, 40086, 34849, 35098, 42739, 47592, 48345, 53778, 52162, 45598, 44534, 43990, 41200, 34894, 40520, 48213, 41401, 36674, 38401, 29679, 24430, 33170, 41978, 40291, 38090, 38802, 28619, 24756, 25333, 23895, 19751, 14273, 9952, 19884, 24769, 23670, 22687, 27605, 31603, 27673, 27564, 29397, 27813, 36551, 44343, 43164, 41856, 38346, 38661, 34614, 24610, 25470, 27405, 19253, 16710, 26864, 35593, 28842, 17449]
9917A7449p312J613o13N675k081k915L646Q242k1M445k853j402J720J1317r09
9902C6001o478m260R85k108j2612q18l737P028P596j749j0071o377M664P807J432
9887A7303l794l035k838j775N720j452m205L288P197J02R06m048k302m580j086
9872E401k982M981J3076n549j829o92O642l359k232K072k041Q829K795r056m297
9857A1759p134k623O793J1562L999k976n543J971Q944o082j3488k431R922L698
9843A8371J864M388j0479j222l338p168P487J2273j096n897P623J61p238o808
9829H921j2786M625M725K25P203J2766k878q504K391K947J035l243m89N527J924
9814B4389j2054J987Q788j93L165k696n932n721O623N04q788p838P632O662M068
$$ y = [17449, 10137, 11750, 11137, 16812, 14731, 11816, 15462, 23704, 23683, 28128, 25275, 23873, 25593, 36910, 36001, 29523, 25263, 26248, 24140, 11528, 10710, 6973, 14001, 21597, 19848, 9777, 3400, 8064, 15871, 17303, 13509, 10474, 7636, 5861, 11581, 10129, 5924, 9212, 16409, 16511, 17417, 13369, 11067, 6487, 5401, 2419, 7400, 20476, 14927, 13098, 12406, 19048, 15689, 13457, 15529, 13488, 22317, 25112, 16056, 11759, 4625, 2002, 8795, 20357, 24356, 21380, 15837, 17808, 26752, 20670, 7182, 4751, 14673, 18371, 20235, 24623, 14144, 12922, 9584, 2416, 9903, 22176, 21080, 15183, 22806, 22967, 15729, 8921, -3865, 760, 5485, 5710, 12913, 25679, 22801, 14297, 16688, 19635, 20670, 17427, 16938, 22465, 24389, 12335, 14322, 23110, 22917, 26082, 23386, 17454, 11733, 18356, 18860, 10072, 2234, 9866, 16528, 20596]
9799B0596m602N493j452p684k010Q438L986K877n09j420J745M174n628P366J792
9784C3162j355m158l830L499K021J777o556j0456k067j679L47M467j404l139K780
9769A3409l189M431p900n402j104N121N454m42m894k37n278O632M063p58J494
9754A1400J865k454J239p38k6J2626m66n783n84J462k522q45k585l538j623J085
9738H513M677n288P51J837L970R75o928q713J2739N202r32m492R48N90m673o330
9722B846n725Q09K852O362L987K993j77M46p176P029p092N70K741p32J419J1353
9706B2505J786p412k386l635r561L623J1086K821k024j0660n429p661j522l088
9692a1557K587P720L523M292o886K931P995K02r039l817k132Q956Q344J765J72
$$ y = [20596, 15994, 21487, 20035, 12351, 10341, 18779, 22765, 25642, 25133, 23713, 25458, 29632, 24004, 31370, 33162, 31807, 27649, 23819, 27318, 29339, 31116, 24560, 14104, 12037, 10358, 10705, 15172, 13768, 10629, 13409, 10220, 14651, 6751, 1349, 245, 5366, 10820, 10378, 5484, 5247, -31, 6601, 10664, 9906, 11400, 13265, 10811, 12050, 11312, 11286, 23912, 23446, 17663, 17079, 18541, 16019, 15174, 12589, 9051, 7428, 8513, 13190, 7902, 8653, 10490, 14460, 15435, 8507, -206, 12533, 17735, 16803, 12311, 13259, 13849, 9176, 2846, -2879, -2070, 782, 7144, 11131, 14124, 13947, 14393, 7217, 14246, 7154, 7724, 10465, 9733, 11152, 22505, 24291, 16879, 14493, 10858, 1297, 4920, 16006, 18827, 16803, 6143, 714, -6947, -8469, -11557, -8970, -1250, 2273, 6565, -321, 2610, 10605, 10807, 1768, -2049, -4181, 4775, 13119, 14884, 15056]
9677A5056J282m597N653k056n609j21L553L618r513l089P060O203m331J17p26
9662A2500j0563Q626J358m519P00O233K224q665q891j103Q268K809k601Q61j305
9647E932k466l257J549Q316J100J805K13O47K431n408o831j809J187l773p5O610
9631F171K030m909j336J0809M207o709p462o6J3048k336j880L115R416M312m625
9616B3785J902J896o155q638r361m926P184N306j38p177K374m700k545K655k032
9601e70L760K662j245k122K517J622l056m780N424M623k051l677K324N099K922
9586A3452l610n239l240m395K631j116J0418P799n963m576O542p61m372k546n002
9571B2m765j70L353R12o052n058L984P577N855K343m503m693l096J017M205p134
$$ y = [15056, 16338, 11741, 17394, 15338, 9729, 9608, 13161, 16779, 7266, 4177, 11237, 17440, 13109, 13226, 12500, 1937, 10563, 11921, 7402, 8102, 14335, 16559, 7894, -997, -2100, 6168, 8977, 6376, 7237, 5932, 3466, 209, 1758, 10074, 11174, 12979, 13192, 13839, 16270, 10862, 4031, 2222, 3409, -364, -439, 6171, 8201, 3292, 1956, 12765, 16972, 10263, 2801, 2735, 15783, 13447, 11567, 14682, 24098, 28410, 23785, 25687, 27583, 21428, 12790, 3429, -1497, 5687, 10993, 10855, 3678, 6052, 1352, -1193, 1462, -570, 3190, 5852, 4607, 2485, 5002, 6624, 3568, -1212, 4212, 8835, 6784, 3107, 5431, 10530, 13452, 9842, 4603, 1363, -3032, -401, -1517, 8901, 16700, 10737, 6161, 12703, 11942, 7570, 5024, 22, -4743, -4913, -1560, -648, -6700, -11758, -7774, -197, 5658, 8001, 3498, -1195, -4291, -3274, 931, -6203]
9555f203p47L918M001K039J0277K609j4873M855L263R89j180k737m469o106J152
9540c212J0517N59O700M103n031o058m570N228O899r590J994r663k896P356N212
9525G548K790J53l360R65N537O310k66M516n765n560l224l829r356R13J470J475
9509C17L605j543k787J2697K410n219q103N285P170n789j636K256k027m566r231
9494g161q184K784O391O458n03n94j366l124M606R335k780K873j098o2p405N371
9478E541N131l560q211p75J0139J2442J070o477n600l412n671n829J944P692N073
9463I497L883Q035j26p281p695M491r848j619N019O92M783N284o98m031K242l167
9447I461J264k05R239k163o235j00P4j107j180p101l749j787K436M193P633K800
$$ y = [-6203, -6950, -3032, 969, 3008, 13285, 15894, 1021, 5876, 9139, 10128, 8948, 6211, 1742, -4364, -3212, 7305, 7864, 14564, 18667, 13636, 7578, 3008, 8236, 15135, 5545, 7539, -2124, -5020, 2336, 7548, 10338, 10491, 7131, 8096, 13633, 19943, 19677, 24193, 18428, 12868, 9644, 5815, -3541, -2628, -1158, 317, 3922, 2379, -408, 12289, 14699, 9480, 1377, 6662, 13832, 8043, 6407, 8663, 6636, 2070, -7161, -15345, -12561, -6170, 288, -215, -809, -2175, -5299, -693, 8642, 5862, 8735, 7637, 7575, 170, 5541, 10672, 7112, -1099, -1874, 8265, 20707, 21777, 15300, 9700, 6288, 617, -5212, -3268, 4424, 9497, 13380, 21415, 21289, 14008, 6313, 10804, 956, -663, 4356, 5048, 9831, 15115, 14417, 10386, 12628, 9461, 10725, 10520, 19759, 17596, 11361, 11261, 11335, 10228, 9048, 1947, -1802, -3589, -1153, 3040, 10673, 13473]
9431A3473k095l46j240p949o603j766O850J0912K79l301K924K441o352j244J630
9416G613P603K036k671k09l218K149O089j039l258N360K579K286Q64n484q582
9401A2118j552Q418p743r167l870r077O529J0972K479M669K772R89r118n538O927
9386I808N003M169k162R92K237o301J991l063m450m373Q046J118r938n447L415
9371A045J0911L489n988m359L550J986O639j0457o762J960L199K875K301n077
9357E312M154P989K399o778l368O053l456J731o832N202J2460p246q395m914m850
9342e39o024O754Q50l933N087J7656R228k962l729q5L003J549N478L327p194L522
9326C1988O07m777m479O80Q017m759p177l65k778K086j814m048o447l123K53L711
$$ y = [13473, 11378, 11032, 9792, 1843, -4760, -6526, 324, 11236, 11515, 8214, 11138, 13579, 7227, 5983, 7613, 15216, 17252, 14581, 14372, 11154, 13303, 19392, 18353, 15095, 20455, 23034, 25320, 26184, 20700, 12118, 10566, 18984, 11241, 2074, -1796, -10873, -4344, 6628, 9107, 13776, 16548, 17537, 8419, 2881, 9808, 14811, 18980, 16818, 17810, 20047, 13746, 15737, 12674, 8224, 3851, 11897, 13015, 3077, -2370, 1045, 11956, 15445, 9457, 5098, 8648, 10634, 17273, 6816, 54, 2014, 5213, 8088, 10389, 5312, 9466, 17455, 19854, 13076, 9708, 15761, 12305, 14036, 7204, 12406, 24866, 17620, 9225, 4311, -539, -6563, 191, 1041, -2892, 2195, 19851, 29079, 26117, 22388, 22303, 25306, 26855, 32333, 35660, 28466, 31988, 32595, 27818, 23339, 24019, 32036, 27277, 20100, 19735, 16957, 19043, 17229, 13181, 6734, 3611, 3864, 7575]
9310G575J1618P431N801m336q05K712o343k592Q030j368l80N627J223k091J376
9295C3478n84o147p318j692k838J763K773O19R652J775r987P1j100k466k25p144
9279A0630P21l574L273J6205Q623m789l104J724O756j1511p377L36l028j800j024
9264A2061J5481R180l291n677m021M567J849L618n612j0433O498J2989r154r341
9250A8714J198k432o859P76J270k096J719P614M349o72J890J378j993L084M388
9235C2328m335J086P806k601l58n844o235L969O194L943J432m892l434M664K290
9220C6013l780r606J09m48J789J370P100p550N2l390n081m308K670l282M383L630
9204A9671P57N57O770k082N803o417K592Q131m865r166K013k315K160O416n412
$$ y = [7575, 19193, 26624, 32425, 28089, 27284, 29996, 23653, 21061, 29091, 27723, 27343, 32970, 34193, 32102, 33478, 32894, 26747, 19429, 17737, 14899, 16662, 19435, 20054, 29706, 31481, 21494, 21565, 20465, 17999, 17774, 10630, 11351, 7777, 11050, 27255, 35878, 31089, 27985, 29709, 36465, 24954, 17577, 17913, 14885, 13085, 12061, 27542, 36722, 33431, 27754, 23733, 28300, 30149, 33767, 28155, 17722, 24220, 37209, 28055, 18714, 19912, 17480, 10621, 11397, 12667, 10571, 12290, 19904, 24253, 23581, 25471, 26849, 24856, 27940, 32328, 27993, 29079, 36885, 34284, 33926, 28082, 21847, 25816, 32010, 35953, 37385, 32493, 29059, 33723, 36013, 32233, 22627, 22736, 22288, 24077, 25447, 32547, 24997, 25049, 21659, 16578, 12270, 14940, 11658, 16041, 19671, 20428, 20985, 27755, 25673, 31476, 25059, 27651, 35782, 30917, 21751, 23764, 21449, 23609, 30025, 24613]
9189B4613J231J730K620K023j050j980p274O169j02k779o10m388j658N497j762
9174B2280n552k446l361N336R176l505l771n34L627N249j054r93J106N705L481
9159C4744q42m544N817R784j732q493q389O916L296j412M20P23j540j826L90j823
9143C1489L282n155M959N273l905l462o743K621N924n899l36O65O766Q887l037
9128D1329N218l263p840j303k315M771K279J818j832q865r769j3J4402J94j800
9113C3011M414O90J104M01J211l47l928l427N686K178k312Q9o998r6M366J184
9097C7226J019N403L104n192j5150k168P589M507P054P713m604o126K542m013
9083C8904R426N816p673j788j0256k065j925R70K551J6421L428j23l604p143p441
$$ y = [24613, 25844, 27574, 30194, 32217, 31167, 29187, 21913, 28082, 27980, 25201, 24591, 20203, 18545, 24042, 22280, 16728, 14282, 10921, 16257, 25433, 21928, 18157, 17623, 21250, 26499, 25445, 24452, 25558, 31263, 34744, 33902, 29358, 35175, 44959, 43227, 34734, 26345, 33261, 36557, 35145, 35565, 36288, 34748, 32922, 33312, 31489, 34771, 29616, 34575, 39848, 35943, 32481, 25738, 28359, 34283, 28384, 28048, 28713, 35479, 44366, 41329, 46547, 43284, 35444, 34141, 31826, 36597, 38876, 40694, 38862, 29997, 20228, 20215, 34617, 34811, 33011, 37425, 38115, 39219, 39620, 40831, 40484, 36556, 33129, 38815, 40993, 38681, 38770, 31772, 31676, 36042, 37226, 38245, 43648, 46752, 41560, 26410, 24242, 31831, 36338, 43392, 51105, 46501, 40375, 42917, 38904, 48330, 54146, 46473, 44685, 34429, 32364, 30439, 31409, 33960, 50381, 53809, 53686, 50082, 42939, 35498]
9068C5498j556j916R499M892k328l781k34L806j84M297M515k628q201j729j644
9053C8306J105M268k911o293Q447Q719n08j3701o448P021k180L525J644J681N881
9038D8556m648Q43N783p052N8L784j730J076R442O73L351L414k269J040O403k888
9022F5836o73j235n651K696K364M155n115l116r741J249o493O034Q595k152K608
9007E9361J2080m425O86j781n176r958k795p45L301L862M770n80o742j330o353
8992D4175M522N933r79L640K57O622Q120M558p590r066l48m407n89M608Q46R223
8976F9525M844o15p432p343Q889J0029J669q55O666k682j321M659n773j0300K259
8961G2219M58n056O221N945n135O188q27O074r15K648K902K142M988k520m769
$$ y = [35498, 33942, 32026, 41525, 46417, 44089, 40308, 40074, 43880, 43696, 47993, 52508, 49880, 41679, 39950, 38306, 39411, 43679, 40768, 34475, 42922, 51641, 51133, 37432, 30984, 38005, 35825, 39350, 40994, 42675, 48556, 43908, 44751, 50534, 43482, 43540, 47324, 45594, 46670, 56112, 56785, 60136, 63550, 61281, 62321, 68724, 65836, 65163, 63928, 58277, 60973, 63337, 67492, 62377, 59261, 49520, 50769, 44276, 50310, 58905, 56753, 59361, 71441, 67016, 67702, 65921, 60745, 50787, 47992, 47247, 50548, 54410, 59180, 58600, 51858, 50528, 44175, 48697, 54630, 53651, 57291, 57548, 64170, 72290, 76848, 69258, 60192, 59844, 55437, 54848, 59456, 60302, 69525, 74369, 73754, 66322, 58979, 67868, 77897, 79566, 78711, 85377, 82695, 81374, 86033, 80260, 69960, 72219, 72677, 67621, 73842, 79787, 74652, 80840, 80013, 86087, 85172, 87820, 90722, 92864, 97852, 95332, 90563]
8946I0563o727J525J007l652k591l483r510M546J2647N341p73L604k36n717m000
8931H2544k219K327J2817k632j2218L927J2283J8713R453j681O92n858j0909j979
8917A05260n814L756O630J969K120P216m803p575l855k217L272L153P084J1905
8903A28101L519K821k579P323K365K162k189K115K980N86k908k037k183L18P2
8888A40466j503j725l914o449J342l64o187k934N769N182n14o031r41q39P98L127
8872A25283J744L444l231N002l474j919K042o301l35M624K503M840P117M779q2
8857A46036o974p209N767k998K137J646p7o378R384J4641Mj1049m188P122O147
8842A54011J5384O132M624n524j069N950j044K244L271p01M301K362Q243n788
$$ y = [90563, 83836, 85361, 86368, 82716, 80125, 76642, 67132, 71678, 84325, 89666, 88893, 92497, 92261, 86544, 82544, 80325, 82652, 95469, 92837, 80619, 84546, 96829, 115542, 124995, 123314, 124006, 118148, 107239, 105260, 99446, 103202, 109832, 111801, 113921, 121137, 116334, 108759, 104904, 102687, 105959, 109112, 116196, 128101, 131620, 134441, 131862, 139185, 141550, 143712, 141523, 143638, 146618, 147204, 144296, 142259, 140076, 140394, 140466, 138963, 137238, 133324, 126875, 128217, 127853, 121666, 118732, 124501, 129683, 129169, 123138, 122197, 121358, 122156, 125283, 127027, 130471, 127240, 132242, 128768, 126849, 128891, 122590, 122255, 126879, 129382, 134222, 141339, 146118, 146036, 139062, 131853, 137620, 134622, 136759, 138405, 138328, 131950, 141334, 155975, 155979, 144930, 140742, 147864, 154011, 169395, 175527, 180151, 174627, 173558, 179508, 178464, 180708, 183979, 183278, 187579, 189941, 198184, 192396]
8828A92396N942Q001p88k456l241Q88L820J547L50K562n72O217L27P68l69N734
8812B21126m689r47P045J6258R827n470j264J824m032j83N402J4577N498L810
8798B68782N604M032N547m289R982J7846M309J168k097K880J771q48O591J5728
8784C37006R808Q238J0832J7447j865M444R573J7708R938P531K0036J6667Q982
8771D76345o086J4251J8686J4530J5370J2870J5034Q474L167R94K064L62J1103
8758E87164Q604O662O876K088M744J1800Q612N71k243P958N408K163Q116J7578
8744F76101J0039N951Q166M223N827J4656J1548J3455J0632J0606O149M712J7365
8731G99430K0681J3066N266M545J1664J2488J2109J2001K1167K0154K5914K4088
$$ y = [192396, 198338, 206339, 205551, 203095, 199854, 200742, 204562, 206109, 206459, 209021, 208449, 214666, 214993, 215761, 215392, 221126, 216437, 215490, 222535, 238793, 248620, 243150, 241886, 243710, 239678, 239495, 244897, 259474, 264972, 268782, 274386, 278418, 283965, 279676, 289658, 307504, 311813, 312981, 310884, 313764, 315535, 314687, 321278, 337006, 346814, 355052, 365884, 383331, 381466, 385910, 395483, 413191, 423129, 430660, 450696, 467363, 476345, 470259, 484510, 503196, 517726, 533096, 545966, 561000, 569474, 572641, 573635, 575699, 576061, 587164, 595768, 602430, 609306, 611394, 616138, 627938, 636550, 637121, 634878, 642836, 648244, 650407, 658523, 676101, 686140, 692091, 700257, 704480, 710307, 724963, 736511, 749966, 760598, 771204, 777353, 782065, 799430, 820111, 833177, 838443, 842988, 854652, 867140, 879249, 891250, 912417, 932571, 958485, 982573]
8719I82573J8395Q098J3963J9601K1191J0547J5790L5644L1245K3641K7301K8839
8707A236828K0629J8671L2638L2817L0897L7164M0423M2663L9012M4182N2113
8696A628037M5580M8679M8334N7759O0898O2198N9035O4205O0125P8259R1920
8685B305029Q7116Q0865Q6681J00374J03130J03652J09393J26868J29878J39177
8675C372163J52306J62276J67722J83232J98723K05548K20675K46170K67904K80768
8665E457487K98475L25406L51896L93504M11414M48880M89802N28620N77863O19912
8655I903259O71270P31833P87862Q46015R15796R85537J046207J102480J139670
8646A8129929J186243J207374J213437J183352J120643J039714Q99786P24218
$$ y = [982573, 1000968, 1009066, 1023029, 1042630, 1063821, 1074368, 1090158, 1125802, 1157047, 1180688, 1207989, 1236828, 1257457, 1276128, 1308766, 1341583, 1372480, 1409644, 1450067, 1492730, 1531742, 1575924, 1628037, 1673617, 1722296, 1770630, 1828389, 1889287, 1951485, 2010520, 2074725, 2134850, 2213109, 2305029, 2392145, 2473010, 2559691, 2660065, 2763195, 2866847, 2976240, 3103108, 3232986, 3372163, 3524469, 3686745, 3854467, 4037699, 4236422, 4441970, 4662645, 4908815, 5176719, 5457487, 5755962, 6081368, 6433264, 6826768, 7238182, 7687062, 8176864, 8705484, 9283347, 9903259, 10574529, 11306362, 12094224, 12940239, 13856035, 14841572, 15887779, 16990259, 18129929, 19316172, 20523546, 21736983, 22920335, 24040978, 25080692, 25980478, 26704696]
8638B6704696N35074L16291Q6171j43628l56278n32537o90146q08642r05028r55939
8628B3250034r86964r92821r77907r56655r10803q77861q48130p87620p48568
8619A5162705p02768o47860o14334n79644n41804n03039m70362m42414m07513
8610A0252967l86707l72681l38245l11060l09061k92677k79597k50804k43660
8601G468475k29930k21988k19614k01169j87636j83576j75600j67473j59709j56614
8591E565166j52385j38463j34795j40110j28801j16827j24283j08837j08284j02620
8581D309761j03262j19449r8347q7963r2207r0409q6169q4445p4988p8518p7808
8570C316196p4376o9213o5219o5681n6115o2336p0009o9430n5601m6267n4035
$$ y = [26704696, 27239770, 27556061, 27642232, 27498604, 27142326, 26609789, 25919643, 25111001, 24205973, 23250034, 22263070, 21270249, 20292342, 19335687, 18424884, 17547023, 16698893, 15911273, 15162705, 14459937, 13812077, 13197743, 12618099, 12076295, 11573256, 11102894, 10660480, 10252967, 9866260, 9493579, 9155334, 8844274, 8535213, 8242536, 7962939, 7712135, 7468475, 7238545, 7016557, 6796943, 6595774, 6408138, 6224562, 6048962, 5881489, 5721780, 5565166, 5412781, 5274318, 5139523, 4999413, 4870612, 4753785, 4629502, 4520665, 4412381, 4309761, 4206499, 4087050, 3988703, 3900740, 3808533, 3718124, 3631955, 3547510, 3472522, 3394004, 3316196, 3241820, 3172607, 3107388, 3041707, 2985592, 2923256, 2853247, 2783817, 2728216, 2681949, 2627914]
8559B627914n3838n4279n4999m4119m6844n3361m3379m6113m5855l7641m2712
8548B104774m0965m5978m2002l8975l1074l6120l5365k1454l1032l1221l0727
8537A719861k1290k2696k9267j8291j5482k7103k3099j8778k3374l1542k8319
8526A460620m161r399j7470j6004r883k1250j4812j1777j0103j4277j8307l602
8514A309575j368j2043j5560j8032j2259j7453j3794j1358k1051k0168j6018j3615
8502A136856m812j3686j6899k2457j8796q298R67j5341p451j1248j8905k0350
8490I79580k0148k6200k6742j9119k8423j6090p933q329m138j3544j0134p724
8478G91056j9046j1792j2077m163j3256r017r668j5356q910p669p299r206q978
$$ y = [2627914, 2574076, 2519797, 2464798, 2420679, 2373835, 2320474, 2277095, 2230982, 2185127, 2147486, 2104774, 2063809, 2017831, 1975829, 1936854, 1905780, 1869660, 1834295, 1812841, 1781809, 1750588, 1719861, 1698571, 1675875, 1646608, 1628317, 1612835, 1585732, 1562633, 1543855, 1520481, 1488939, 1460620, 1456459, 1447060, 1429590, 1413586, 1403703, 1382453, 1367641, 1355864, 1345761, 1331484, 1313177, 1309575, 1308207, 1296164, 1280604, 1262572, 1250313, 1232860, 1219066, 1207708, 1186657, 1166489, 1150471, 1136856, 1132044, 1118358, 1101459, 1079002, 1060206, 1051908, 1052875, 1037534, 1030083, 1018835, 999930, 979580, 959432, 933232, 906490, 887371, 858948, 842858, 834925, 826596, 822458, 808914, 798780, 791056, 772010, 760218, 748141, 743978, 730722, 721705, 712037, 696681, 687771, 680102, 672803, 663597, 654619]
8465F54619j0229j4005j1185p114n544j1076n614k903j2591j5361r832j424m369
8452E43372m706j219p440j2825j2418k1997j3747L801M145k849n028j3488q377
8439D47224N088K407k627j0572o934j4035r180q279l943o151l989J669m696L631
8425C89613k385j3416p865N32o131p0n492j1022j397J864j745n922q401m918K502
8410C25747m08O63r480j1847p675j4247m415N359L842l962l515p511k123M149
8396B74577n293n227n423m159M25l398O18k48q92J809m31l307j9080j3177J0727
8381B27521Q6q226K486k280m505n535l539q26k336j35M704n037j24P043J0344
8366B19641M614J671P144J2312J4102K1714L4125K8166O730j2611l8835m0811
$$ y = [654619, 644390, 630385, 619200, 612086, 606542, 595466, 589852, 586949, 574358, 558997, 549165, 547741, 543372, 538666, 537447, 530007, 517182, 504764, 482767, 469020, 472821, 476966, 474117, 469089, 455601, 447224, 452312, 454719, 452092, 441520, 434586, 420551, 411371, 403092, 399149, 392998, 389009, 390678, 385982, 389613, 387228, 373812, 365947, 366479, 360348, 360278, 354786, 343764, 342367, 344231, 342486, 336564, 328163, 323245, 325747, 325339, 326002, 316522, 304675, 297000, 282753, 278338, 283697, 287539, 283577, 280062, 272551, 270428, 274577, 269284, 264057, 258634, 254475, 254900, 251502, 252120, 251872, 250980, 252789, 252358, 249051, 229971, 216794, 227521, 227607, 219381, 221867, 219587, 215082, 209547, 206008, 205182, 202846, 202711, 207415, 202378, 202254, 209297, 219641, 224255, 225926, 233070, 245382, 259484, 281198, 315323, 343489, 350219, 337608, 298773, 257962]
8354B57962j8881j6025j5764j4979l953K346k893o758q013p859j169k923K562
8341A63653J0285j2982j6079K33j534R322K551j754N89l165l863j129K853J423
8327A50403p587K730Q706K130J403J9229K2755J7942K9829L4436K7778M546l4722
8314B79578m7704l8696k3709j7233o847m356q045j3888m984K786K531J424n316
8301A15541k593p33k64m791j047k399K23j10j302o799l361p88P73l318K844P2
8285I1948o4K236k515R77k617j391K561k114K063K312p18q119j1577o367O772
8270G3387Q011R38m072l972n91K369K062j328p453m623J1380O888n772l73J908
8255G8759l205o277m711P893o99K781k632j3927p584M635P256P562k631r083r352
$$ y = [257962, 239081, 223056, 207292, 192313, 188360, 190706, 187813, 181055, 173042, 165183, 164014, 161091, 163653, 173938, 160956, 144877, 145110, 143576, 152898, 155449, 153695, 154284, 151119, 147256, 146127, 148980, 150403, 142816, 145546, 154252, 156382, 157785, 177014, 199769, 217711, 247540, 281976, 309754, 314300, 279578, 231874, 193178, 169469, 152236, 145389, 141033, 132988, 119100, 114116, 116902, 119433, 120857, 115541, 112948, 112215, 111951, 107160, 106113, 103714, 103937, 103827, 102525, 95726, 92365, 91577, 92350, 89032, 91876, 91948, 91884, 94120, 91605, 92582, 89965, 88574, 91135, 89021, 91084, 93396, 92678, 84559, 72982, 66615, 73387, 81398, 82336, 78264, 74292, 73701, 76070, 78132, 76804, 69351, 64728, 76108, 82996, 77224, 76851, 78759, 75554, 69277, 64566, 72459, 71760, 74541, 71909, 57982, 50398, 55033, 62289, 69851, 67220, 58137, 48785]
8240D8785q87M50Q772J0137k720L017N13n292n119r76L70r203n564L000K990J644
8224D9917k194M244R472l673l96q776j05k978k338K595O443j351m694M493K374
8209E3033K325M19j240q609q368J0474N148j626q137k564Q410k741j1425m604
8195C0495M940J1885j743J083j0366L499K070k838j0014O679J1361M045l630j770
8181D5696m135l159N010R35r976j852J1448k64j675j521j468M851O13j0078O205
8166D0630L024n186k927N139M021L143J71J159o570J300K386k606o233j1641l449
8151B2361K492L498R132P632l030K919J252q669J793J2766M497L86o572j1250
8137C9207M103L860j529k296l558L31k866p417k876M152J2569L744n904O296J145
$$ y = [48785, 47898, 48348, 57120, 67257, 64537, 67554, 68067, 62775, 57656, 56680, 57050, 47847, 42283, 45283, 48273, 49917, 47723, 51967, 61439, 57766, 57370, 48594, 48489, 45511, 43173, 45768, 52211, 50860, 46166, 50659, 53033, 55358, 55777, 54537, 45928, 37560, 48034, 53182, 51556, 43419, 40855, 49265, 46524, 35099, 30495, 35435, 47320, 45577, 46660, 36294, 39793, 41863, 39025, 29011, 35690, 47051, 51096, 47466, 45696, 41561, 38402, 43412, 44347, 34371, 32519, 43967, 43703, 42028, 40507, 39039, 43890, 44503, 34425, 40630, 43654, 38468, 35541, 40680, 44701, 47844, 48015, 49174, 42604, 43904, 46290, 43684, 37451, 25810, 22361, 24853, 28351, 37483, 45115, 42085, 45004, 46256, 37587, 39380, 52146, 56643, 57029, 50457, 39207, 43310, 47170, 45641, 43345, 39787, 40118, 37252, 29835, 26959, 31111, 43680, 47424, 41520, 47816, 48961]
8122D8961j373n23M37m288q534L581K023p610o149K454K386J195J496k329o993
8107B4734m572N695L134l341n942k477R307O226q26K449p58Q230L401J699R315
8092E6274M58j0448j794j841K64O131P793k700K047M875l212j919J037p527k141
8077D7297n441J829K975k415q688m077m994M037K169k810j790Q323P569K375J587
8062D7946n054l363L985Q31N538M528j86p527j782k267q582J255M378J96j6j014
8046C8866M510J0414K697M09Q2J556k36M406N699o781q519j391l035K94N152P208
8030F1331m516n445J402r724q856P121L949k97N665J147m543n242o502o59K425
8015C7256r35M667l169L22n331K220P518m086p371N026J632J156M467K078Q82
$$ y = [48961, 47588, 47065, 47502, 43214, 34680, 38261, 40284, 32674, 26525, 28979, 31365, 32560, 34056, 31727, 24734, 20162, 25857, 28991, 25650, 19708, 17231, 26538, 32764, 31938, 34387, 33629, 41859, 45260, 46959, 56274, 56732, 46284, 44490, 42649, 42913, 49044, 56837, 54137, 56184, 61059, 57847, 55928, 56965, 49438, 47297, 41856, 43685, 46660, 44245, 35557, 31480, 26486, 30523, 32692, 29882, 28092, 36415, 43984, 46359, 47946, 42892, 39529, 43514, 44345, 49883, 54411, 54225, 46698, 44916, 42649, 34067, 35322, 39700, 39896, 39880, 38866, 43376, 53790, 56487, 56896, 56978, 58534, 58298, 62704, 68403, 61622, 53103, 51712, 48677, 48971, 54123, 61331, 56815, 51370, 52772, 43048, 34192, 41313, 45262, 44965, 50630, 51777, 47234, 41992, 35490, 34831, 37256, 36321, 40988, 37819, 38141, 32810, 35030, 42548, 38462, 31091, 36117, 37749, 38905, 43372, 45450, 46332]
8000D6332L049N625o658n770l75M536k156o315l268N255J0981O023N123q096L818
7985E8104j44j0877j475L347o502K69k351J513m298k956n713O614M589L881M592
7970D8593j670n376K819l636l330k503N806l91L01K856K796M405r99n963Q46m220
7954D0334O377k532l856q262m343N156J0231jK619L257m014m273N32n23Q87L089
7938D4678K127L231K443j213k119K15J373q223j0397O372J626K854k34R491P539
7923E9763j722n026p187r276M855K41O78p321N94J052j999n877m22Q193j537l838
7907C1171k520J435r59K584N850k249m480j622j1130M650Q875K227p565j400m717
7892B0150k083N243k573L580M801M48j1158q287O669K522k899K022m214m55k692
$$ y = [46332, 49381, 55006, 48348, 42578, 42203, 46739, 44583, 38268, 35000, 40255, 51236, 57259, 62382, 54286, 58104, 57960, 47083, 45608, 48955, 42453, 42722, 40371, 41884, 37586, 34630, 28917, 35531, 40120, 44001, 48593, 46923, 41547, 44366, 40730, 37400, 34897, 40703, 40312, 40613, 43469, 46265, 50670, 49671, 43708, 44554, 40334, 46711, 44179, 40323, 32061, 27718, 32874, 43105, 43104, 45723, 48980, 44966, 40693, 41225, 40702, 41589, 44678, 46805, 50036, 52479, 51266, 49147, 49362, 50735, 42512, 32115, 38487, 40113, 42967, 42733, 52224, 59763, 58041, 53015, 45828, 36552, 41407, 41648, 42326, 35005, 35599, 36651, 34652, 28775, 28353, 36546, 35009, 31171, 28651, 30086, 29127, 31711, 37561, 35312, 30832, 29210, 18080, 22730, 31605, 33832, 26267, 24867, 20150, 18067, 23310, 20737, 24317, 29118, 29566, 18408, 10121, 16790, 19312, 16413, 18435, 14221, 13766, 11074]
7877A1074m22J048L014J729O523n754N762M053N46m548q753j528R19J114j976
7862A2801o837k924P880N889j0017l177K534j847O341L131R811l936m533o813
7848H303L17K364J676J012l475k51Q944L806k326q123k082q520o508J168N395
7833A700K222M421K285N976M240o296J890l740m342l660Q328N502o787J565J0542
7818B3846M341j456l254j964k971K61o597o811r628k246Q732r18j642J683p02
7803F74j593Q362P170n167j0244K579M339K333K200l371n027K528L304k550N60
7788F097N963J015K649M128r507q882J221J270O97j105N815j549L661R682o021
7773A5134m550k193P174L128l086Q93p023p005r68k894M699J720L015k030m733
$$ y = [11074, 10652, 11700, 14714, 16443, 22966, 17212, 22974, 27027, 27573, 23025, 14272, 12744, 13663, 14777, 12801, 5964, 3040, 10920, 16809, 6792, 3615, 6149, 4302, 10643, 13774, 23585, 19649, 15116, 8303, 8620, 10984, 12660, 13672, 10197, 9946, 18890, 22696, 20370, 12247, 10165, 1645, -4863, -3695, 1700, 3922, 8343, 10628, 16604, 20844, 14548, 16438, 12698, 8356, 4696, 13024, 18526, 11739, 13304, 23846, 28187, 26731, 23477, 21513, 18542, 18803, 12206, 5395, -4233, -6479, 2253, 1335, -307, 1376, 674, -919, 7443, 14613, 9446, -798, 1781, 6120, 8453, 10653, 7282, 2255, 4783, 8087, 5537, 6097, 12060, 13075, 15724, 19852, 10345, 1463, 2684, 3954, 4651, 3546, 9361, 7812, 11473, 21155, 15134, 10584, 8391, 15565, 18693, 15607, 16500, 9477, 2472, 1504, -1390, 3309, 5029, 8044, 6014, 1281]
7758A281J575O982q260R77o46o949R560k10l138J1089L677o311J590n76m728k352
7742C561k850k65M761j871j141L548L970l458m419j332j594n286R18m532r7J1321
7726A234J1373J788r804k227Q02k54K795r477j985O03L416N694o213k38k932m082
7710i507P20Q956K940M378J268n0j2620j147K262J732r34J238p449N86N699K553
7694F25J0575J51j1130r75P698n434r800j438L090p308J555k911K205P084M846
7679a167j535J2129J628j2154j1232M010R680N955K93k421Q07o753L728Q133K852
7664A3953n888j1192k185L335K757J1484J277j00n048m772L22N471k929n49k303
7649C633l111P163o358j315m933m528r954l318R981Q907M314P788J759k909m012
$$ y = [1281, 2856, 9838, 1578, 2555, 1909, -5040, 4520, 4310, 1172, 12261, 15938, 9627, 11217, 10641, 5913, 3561, 711, 446, 5207, 3336, 2195, 5743, 9713, 6255, 1836, 504, -1090, -6376, -5458, -9990, -10087, 1234, 12607, 14395, 4591, 2364, 3166, 2912, 5707, -3770, -5755, -5152, -1736, 3958, -2255, -2493, -5425, -9507, -8787, 169, 3109, 7487, 8755, 8705, -3915, -5062, -2800, -1068, -2002, -764, -8213, -7627, -1928, 625, 11200, 11351, 221, -754, 6944, 1510, -8290, -9728, -6638, -13946, -12391, -15302, -13097, -6013, -1167, -2702, 9427, 11055, -1099, -12331, -8321, 1359, 7314, 7607, 5186, 5993, -760, 2968, 11101, 13953, 8065, -3127, -5312, -1977, 780, 12264, 13541, 13441, 8393, 3621, 3943, 9414, 6485, 5936, 3633, 522, 7685, 1327, 12, -4921, -9449, -19403, -22721, -12740, -3833, 481, 8269, 10028, 7119, 3107]
7634C107O70P157M177J780k174R542k05k873p934R005k290r513p330m668Q797
7619G248n344O04L188j4002n177K656J2252o45n91j704L58J516M234k042l169
7604f18l489q95r31j08L470M132L481N755j974J266m187j1300n496J486N038P587
7588C217O641p577m687o10K544L577L03o566M037Q60J668L843O025k451m878o114
7572a68J1364o232L562L671m494l864p111L566L57l298k001j131j651n8q603l23
7556a6414o462P22J2236J2731L389k123j4174p158L60J3493M396l649N24L964
7542A835m777o432o064J706N238J101k742j646L660K667K071P683r245p609l271
7527a5825q90J1018K322k164M397R677j113M529N216n327p785N91L272P5l424
$$ y = [3107, 3777, 10934, 15111, 16891, 14717, 24259, 24054, 21181, 13247, 22252, 19962, 10449, 3119, -1549, 7248, 1904, 2508, 5696, -8306, -13483, -10827, 1425, 780, 189, -1515, -1157, 359, 4593, 2551, -618, -4107, -5002, -5933, -6041, -2571, 1561, 5042, 10797, 8823, 10089, 5902, -5398, -10894, -9408, -4370, 3217, 9858, 2281, -2406, -3016, -472, 3105, 3408, -3158, 879, 1739, 3407, 7250, 13275, 10824, 5946, -168, 11196, 4964, 8526, 12197, 7703, 3839, -3272, 294, 651, -2647, -4648, -5779, -7430, -7488, -16091, -16414, -22876, -22154, -9918, 2813, 6202, 4079, -10095, -17253, -16893, -3400, 996, -2653, -2129, 1835, -2942, -9374, -15438, -13732, -8494, -7393, -10135, -11781, -8121, -5454, -3383, 4300, -4945, -12554, -15825, -16715, -5697, -3375, -5539, -1142, 8535, 7422, 11951, 17167, 11840, 4055, 4646, 7918, 7993, 4569]
7512D569k832m130N716K644J079n687n413K925Q561k937q324k211k21n482J37
7497a1606o18K308M624l889m095K96Q648O320N607m52j3164J82M338N116L285
7482F900P811L998p323p842L20R777l188j726p949o35J133J760N074m413K434
7467F131j855j954J593N425l273M04j643j2251r157P330P80l220P963N100n057
7452c684m190L660K127R924p18L219K664n530l089l77j103j0038j195Q799L139
7437C608q865k118N477P124l137n925l474O405Q385j349m439j632N408l11k435
7422B722j407k536m873j684K556R202n264j0325M65P496P375n716o495L136Q046
7407B698Q884N571q365q890j09k091M390K15o048M890j095l045k13K029j389l454
$$ y = [4569, 1737, -2393, 3323, 5967, 7046, 1359, -4054, -1129, 7432, 4495, -3829, -6040, -6261, -11743, -11606, -12224, -9916, -5292, -9181, -13276, -12980, -4332, 1988, 7595, 7143, -6021, -5839, -1501, 3615, 6900, 14711, 18709, 11386, 3544, 3864, 13641, 10453, 8727, 778, 143, 1276, 3036, 8110, 3697, 6131, 4276, 2322, 3915, 9340, 6067, 6471, 4828, -7423, -16580, -9250, -8470, -11690, -3727, 1373, -3684, -7874, -4214, -2087, 7837, 7119, 10338, 13002, 7472, 4383, 4006, 2903, -7135, -8330, 469, 3608, -5257, -7375, -1898, 5226, 2089, -3836, -7310, -905, 7480, 6131, 1692, 60, 5468, 5157, 2722, 1315, -1221, -6094, -7778, -5222, 3980, -1284, -11609, -11144, -3648, 3727, -1989, -8484, -5348, 2698, 11582, 17153, 8788, -102, -211, -2302, 2088, 2303, -3745, 1145, 50, -2995, -3208, -1179, -2568, -6022]
7391f022m508J706K94R983j873K669N328J208k755l351J94j785n007l051K057
7376d913j42P777l059l640l382m037K12J004J834m365Q52Q203k126K360O098J0089
7360A2765L363n298l968K827o987j7172O015O559J737L365J798n95k560J102R971
7345A2922l782N373J786p397N832J786l491k023k119K771j2471J76N17K216K461
7330D557J287j59l619j0453j2053P956J8058K386p479K29N466J473k395j748J148
7315D654M351L642k055j707o216N791N964P5n308m116j3897L064L754r568J356
7300a0216N379Q018P852K205r286o249q286K248L528J2300L426r438O226p63o576
7285C68J0487O292p11m485n217o056j983l065m853k932L239N648K437P555K128
$$ y = [-6022, -10530, -8824, -8530, 1453, -420, 2249, 7577, 8785, 6030, 2679, 2873, 1088, -3919, -6970, -4913, -5055, 2722, -337, -3977, -7359, -11396, -11184, -10180, -8346, -12711, -11859, -3656, -5782, -3422, 2676, 12765, 16128, 10830, 6862, 9689, 2702, -14470, -8455, -1896, -159, 3206, 5004, 4409, 1849, 2951, 12922, 9140, 14513, 16299, 8902, 14734, 16520, 13029, 11006, 8887, 11658, -813, -637, -120, 2096, 4557, 5844, 5685, 2066, -8387, -20440, -12484, 5574, 7960, 481, 710, 6176, 7649, 5254, 3506, 4654, 9005, 12647, 10592, 8885, 2669, 8460, 14424, 14499, 9191, 5075, -8822, -5758, -2004, -11572, -10216, -4837, 3181, 11033, 13238, 3952, -2297, -10583, -8335, -4807, 7493, 10919, 1481, 7707, 6944, 368, 10855, 17147, 16436, 11951, 6734, 678, -1305, -4370, -9223, -12155, -8916, -3268, -831, 6724, 8852]
7270H852J312q067q156j31p590N239R559J801n881k190r775O790K519Q238l641
7255a121L204o47r365n893p384N722k713N888O713n694N041P560K02o150L34K79
7239d024J966o033j369L089K067r8L751k125o414k854j568j93l812l896L237O05
7223a7671L571P635j145k283L40M17n143n318J4122K328K246P722j752j9939k117
7208a6987J0646k297j2015Q65q7L19J0202R850p142j1088l092j365J542J7398
7194c251R041k580Q34Q78k68j0884L591M968K566o539L577Q400m213l531L006
7179E595N02J73l96j2921l885k97K048N356J509l563N957p96L289Q028k494n23
7163G582J15n341m284m287J13J67O574j934Q87J047r651l311R363J2542L882m86
$$ y = [8852, 10164, 2097, -6059, -6190, -13780, -8541, 1018, 2819, -3062, -5252, -15027, -8237, -5718, 2520, -1121, 2083, 1436, -7929, -13822, -21206, -15484, -18197, -12309, -5596, -11290, -6249, 1311, 1513, -4637, -4303, -4024, -2058, -8091, -9460, -6371, -4304, -4402, -651, -2776, -9190, -12044, -13612, -13805, -17617, -21513, -18276, -17671, -14100, -6465, -7610, -9893, -9553, -9136, -14279, -19597, -5475, -3147, -901, 6821, 5069, -14870, -16987, -6341, -8638, -20653, -19788, -19875, -19556, -9354, 496, -6646, -17734, -20826, -22191, -20649, -3251, 5790, 3210, 4044, 4922, 4654, -6230, -2639, 2329, 4895, -1644, 1933, 10333, 6120, 2589, 5595, 6097, 6270, 5874, -7047, -10932, -11229, -9181, -3825, -2316, -5879, 78, -718, 2571, 10599, 8105, 7582, 7697, 2356, -1928, -6215, -6102, -5935, 639, -1295, -408, 639, -9012, -12323, -2960, 9582, 13464, 12978]
7147A2978K302o30K629J950r055j5420Q102J0L442L03j0120p448P621J0336p331
7132c31J330L626l120J970n442o083M827P646o26K142O587N350j338k82q807j1668
7116d219K73K115J690J0542m632j1557p363l613N637M945L285N172P97o623J665
7101a886J0952N54k878j419J373J221q068p525n42L316R75O186m95n472J680o40
7085b668o344P427P97m028j745p047J970m33K39k294N263J819L832r972m18M858
7069h744j171J150N99l091J816L131L328K623K986O90r103p339N11J1046O231
7054D663O086L021j0527m468J0020j127j150j3555N266J2917Q994n696p162O213
7040A3495M349m247m56l608J239l497q257m876o055J525J3936j647q372j446P464
$$ y = [12978, 15280, 14650, 17279, 19229, 10174, -5246, 2856, 2866, 6308, 6611, -3509, -10957, -3336, 7000, -331, 999, 4625, 1505, 3475, -1967, -8050, -3223, 4423, 3797, 5939, 12526, 17876, 16538, 16256, 7449, -4219, -3946, -1831, -141, 10401, 5769, -5788, -13151, -16764, -11127, -6182, -2897, 2275, 3072, -3551, -1886, 9066, 9620, 6742, 5323, 6696, 7917, -151, -7676, -8218, -4902, -3927, 2259, 1764, -3708, -2028, -2668, -9012, -1585, -788, -4816, -6561, -13608, -11638, -12071, -11832, -14126, -8863, -7044, -3212, -13184, -13602, -8744, -9915, -8765, -8166, -11257, -9441, -6310, -2982, -359, 2627, 3317, -5786, -13125, -12614, -1568, 4663, 10749, 13770, 3243, -1225, 8795, 7668, 6518, -7037, -1771, 11146, 20140, 14444, 7282, 13495, 17844, 13597, 13141, 9533, 10772, 7275, -982, -5858, -11913, -10388, 3548, 1901, -6471, -7917, -453]
7025d53J128L453l771N274k791n550K970K902M883L738L519j043j4886j2364M347
7010h644Q89O056L623j310m224j34N035K262N250j339p53n697J892n014l45J788
6994f65L123k439J856n259o544m712l87k039N799N823N280l020o246n077J2610
6979a897M680l589j360o984l84J556p62j083J322J584J181P77M931K121n456j71
6963c534q784l401L487L913k127n86l967r59J522J53P491K628J307L571l827l815
6947f928L412J983l224o713r817k00N094N128l623r553O865O993K850m806J200
6932a1339N854l084m877L477M683l042K60o348j4K39o729o9L682N34Q688L058
6916e027Q544m20j1657M98k327M458Q546P15n112l050J663Q149K099l539k07J851
$$ y = [-453, 675, 4128, 357, 5631, 2840, -2710, 260, 3162, 8045, 11783, 15302, 14259, -627, -12991, -8644, -7755, -1699, 1924, 614, -3610, -3744, 1291, 3553, 8803, 7464, 6711, 1014, 2906, -2108, -2453, -665, 2458, 19, 1875, -3384, -9928, -14640, -15027, -17066, -11267, -5444, -164, -3184, -9430, -14507, -1897, 2783, -806, -2166, -9150, -9534, -7978, -8740, -9823, -8501, -6917, -5736, -4959, -28, 2093, -3363, -3534, -12318, -15719, -12232, -8319, -10446, -11032, -14999, -15958, -14436, -14283, -6792, -4164, -2857, 714, -3113, -6928, -3516, -1533, -4757, -11470, -21287, -21487, -16393, -11265, -14888, -24441, -17576, -10583, -7733, -12539, -11339, -5485, -8569, -13446, -9969, -5286, -8328, -8068, -14416, -14430, -14191, -20920, -20989, -17307, -16773, -8085, -5027, 3517, 3097, -8560, -8062, -10389, -5931, 2615, 3330, -1782, -4832, -3169, 4980, 7079, 3540, 3333, 5184]
6900E184l198P187R38J938j276q677o800n258m214L391K577j538l786J826k33
6885a1939j468K648j031r95J792M110J199k084K093J441M91o354n635J3211J1218
6870H697m955J041m169l947L598L559l282j3026K655P247p459k288J441n891P131
6855i648R148J087j408k83o342R81k180P666L153K799k616n933N90J638K514J361
6839B527j2129K334K612O328k98J710k791k059N21q410l202O678K71M759N949
6824D800p02m420k06L012L956l680p088l646l794Q541O015K138k876j1481k461
6809a1892O872N641K423K683j830j386R990n903o224m021m93j941m404R640K973
6794B128k79j943k196n522L307k361j0230J64P442Q055j427o410k785j34K737
$$ y = [5184, 1986, 9173, 10111, 12049, 10773, 2096, -4704, -9962, -14176, -10785, -8208, -9746, -13532, -11706, -11939, -13407, -10759, -11790, -12785, -10993, -6883, -5684, -7768, -5675, -4234, -3743, -10097, -15732, -2521, 8697, 3742, 4783, 614, -3333, 265, 3824, 542, -12484, -9829, -2582, -10041, -12329, -10888, -16779, -9648, -500, 587, -821, -1104, -7446, -6465, -8645, -979, 2174, 4973, 2357, -3576, -2986, -1348, 1166, 2527, -9602, -7268, -4656, 1672, 1374, 3084, 293, -1766, -1245, -9655, -12857, -6179, -5908, -1149, 4800, 4098, -322, -528, 2484, 6440, 2760, -4328, -7974, -11768, -3227, 2788, 4926, 2050, -9431, -11892, -5020, 621, 3044, 5727, 3897, 2511, 12501, 6598, 374, -3647, -4140, -6081, -10485, -845, 2128, 1849, -94, -2290, -7812, -4505, -6866, -17096, -16932, -9490, -1435, -2862, -9272, -12057, -12191, -9454]
6779i454K136M90l450j1767m607J4018O816o49L376K176P018p774q387J328p89
6764i519P924l760n723j79K544m158l157O549R987L463p272n268O729K483n71
6749G2P448n92p328k628n756o946L737O684O733j006O145L689m15q198k65l075
6733a701R36K628n774o97j186j0265j490K550j231N012J5250J404m601o600p670
6718a3435J1188O308k785J25Q28n546L064J432O951Q630M08j081r759o593K35
6703c0J747K228L505M598m080m201j0017O058M434p952l420o429j359K784p317
6688a9451J60L739Q30K864Q78r256k540R156J1389J2116m281j1063n400q516j827
6673b1202K776O131N04L927J444K616k509j93P462L848N43K511L052o404m432
$$ y = [-9454, -7318, -6828, -10278, -22045, -26652, -12634, -5818, -6467, -3091, -915, 6103, -1671, -10058, -8730, -9519, -1595, -5355, -11078, -11257, -8713, -12871, -16028, -9479, 508, 3971, -3301, -8569, -1840, 643, 72, 7520, 6928, -400, -3028, -8784, -15730, -11993, -5309, 1424, 418, 6563, 10252, 9837, 1639, 1374, -1701, -765, 1863, -3911, -4608, -5794, -16059, -17549, -14999, -16230, -11218, 4032, 5436, 835, -5765, -13435, -2247, 4061, 1276, 1401, 2229, -3317, -253, 1179, 8130, 16760, 17168, 16087, 6328, -265, -30, 1717, 3945, 7450, 12048, 7968, 3767, -6250, -192, 4242, -3710, -7130, -13559, -14918, -12134, -19451, -19291, -15552, -14722, -11858, -10980, -20236, -22776, -13620, -2231, 9885, 5604, -5459, -10859, -19375, -21202, -18426, -12295, -11791, -7864, -6420, -3804, -6313, -6506, 956, 4804, 5347, 7858, 10910, 4506, 74]
6658G4N683j2126j030M140q962l054J3412M834k023n770l524q192k400K980M426
6643a1532P618N575L017O332q406m879k575K948N052j170p115J299m814n008O806
6628f852j425L888j242k86L071k5M857n870q400J1618M097J555L132n305q52m535
6612b574k542k000j777L097m414r10J278O480j504k850K533l397R2O232K311n010
6596d955o021j908M945J4064j716l805J800k549M896J70K83r112Q513Q812q603
6581D814N0K805J0268q34p714j656m817R680L151n800q157m335j292j0669L59
6566a4147N728K635O273k609j018L744K177O127J226K13L222q878l161L60L169
6551E061J587J340K117N959n797q716L79N189o605l183Q674j334j662j719m761
$$ y = [74, 5757, -6369, -7399, -3259, -12221, -15275, -1863, 2971, 948, -4822, -8346, -16538, -18938, -15958, -11532, -3914, 1661, 4678, 11010, 2604, -2275, -4850, -1902, 3150, 1980, -5135, -3836, -8650, -13658, -6852, -8277, -4389, -5631, -5917, -2846, -2871, 1986, -3884, -12284, -666, 3431, 4986, 8118, 2813, 1961, -2574, -5116, -7116, -8893, -5796, -10210, -11120, -9842, -3362, -4866, -7716, -5183, -8580, -8488, -2256, 55, -4955, -10976, -12884, -7939, 6125, 4409, 604, 2404, -145, 4751, 4921, 5204, -3908, 4605, 13417, 4814, 4864, 7669, 17937, 17103, 9389, 7733, 2916, 12596, 15747, 9947, 1790, -2545, -3837, -14506, -14147, -8419, -5784, 489, -2120, -3138, 606, 2783, 8910, 10136, 10349, 13571, 4693, 1532, 1892, 5061, 6648, 7988, 10105, 16064, 10267, 1551, 1930, 7119, 514, -2669, 6005, 4671, 3009, 1290, -3471]
6536c471m12L563K286m796J708J611M0J177Q953k890j1138m346M34o522L154J0863
6520B14j333p099k881k275N820Q929Q284q048Q7o018o169J468O005o22L023K91
6504c24l409j786k417Q242L80n342R983L931o457m547j062m136O416L024J513
6489D009j86m57M50P625l131m865q68l2O446q626n717J50k132O78R252n104q385
6472a0893o604O341M278m848K341M781O386l696n557N745k575o697J334J1586
6458A922N937o703p193K46j890l995O78Q766L909k864Q87k581l870K102K938j1052
6442a2763m939m571N767N873n389p976O84J2127L014o15m840J0733L863N197J2594
6427A8759J042o715r375J557J209p212R72K713J046K382l304m220r54m950j752
$$ y = [-3471, -3883, -320, 1966, -2830, -1122, 489, 529, 1706, 10659, 7769, -3369, -7715, -7281, -13803, -10649, 214, -1119, -8218, -11099, -13374, -7554, 1375, 9659, 1611, 1698, -4320, -10489, -9021, -3016, -3638, -615, -324, -3733, -5519, -7936, 306, 686, -4656, 5327, 9258, 2801, -1746, -2808, -6944, -528, 2496, 4009, 3823, 3366, 3816, 11441, 8310, 3445, 2577, 2545, 8991, 365, -5352, -5202, -7334, -6656, 2596, -2508, -10893, -17497, -11156, -6878, -11726, -9385, -4604, 1782, -1914, -7471, -1726, -4301, -10998, -9664, 1922, 7859, 1156, -6037, -5791, -7681, -11676, -10998, -2232, 1677, -1187, -300, -2881, -6751, -4649, -1711, -12763, -17702, -22273, -16506, -10633, -16022, -23998, -23314, -11187, -8173, -8788, -13628, -2895, 968, 6165, 18759, 19801, 13086, 3711, 5268, 6477, -735, 237, 2950, 3996, 6378, 3074, -1146, -2100, -7050, -8802]
6412h802r026l897J253M120q544O736M002n787q51J3093N675j489L479Q455N931
6397A4348k258k498L007m118j3104q798M737J0326R204o110n023K83j686l53L873
6382A830K973n401q895J613N616q069K643J506J881O543R191K925J151m854j9103
6367h450l664r1j0260J500N785J2507m678l198j762K25L810l818J749K686L60
6352g299R217L811p999j449L32K744N700j0227l491l330K77j128P871J0238J248
6337F515p516r167M943L370k084j1632K48J0136j219J593K718O274K298j909l615
6322I53m435r937P225L230o184l690M12j894L250O741J926q67k722k108J100n342
6306a2342K026Q287j0461o129O13N518J710j412Q676P704K420j71o63o120m26
$$ y = [-8802, -17828, -21725, -20472, -16352, -24896, -18160, -14158, -19945, -20796, -7703, -2028, -3517, -38, 8417, 14348, 12090, 9592, 12599, 8481, -4623, -13421, -8684, 1642, 10846, 4736, -287, -4, -1690, -2043, 1830, 4803, -598, -9493, -7880, -2264, -10333, -7690, -6184, -4303, 2240, 11431, 14356, 15507, 10653, -8450, -12114, -12205, -22465, -20965, -15180, -2673, -7351, -10549, -12311, -12086, -8276, -12094, -10345, -7659, -7299, 1918, 5729, -2270, -3719, -3387, -643, 5057, -5170, -8661, -11991, -11714, -12842, -4971, 5267, 6515, -1001, -10168, -5225, -1855, -3939, -15571, -15323, -5187, -6406, -4813, -2095, 4179, 6477, 4568, 953, -3482, -13419, -6194, -2964, -9148, -12838, -12426, -14320, -11070, -4329, -2403, -3270, -5992, -8100, -7000, -12342, -10316, -2029, -12490, -18619, -18006, -12488, -10778, -12190, -3514, 4190, 6610, 6439, 5776, -344, -770]
6291g70j235p393N939K825m664p855Q65P324L394l654k20N166K550q894n443M317
6275g748J363J755J932o945r813R22L892K217j813M677J6617R202r050l740p458
6260c990Q98J695l988l022L477m153j642O491L375K098K596n73n183K545L038
6245C662M183k076n357k800p066q228L011J0323R122N535n536M828m287m918o374
6230e978J52J495J445l292M211j665n775o84L778J423j783Q158N919K55r807j0702
6214a2850j0431N336k247J189N356K860j352J73j246N362j95p116n199K212K732
6199a5416l109k998M53j0316Q29Q061j23L117O380J3324J146j692J433j69o644
6184e724k531K846l354j091J022j818J892L258J1069j339m878k149q713J858l334
$$ y = [-770, -2005, -9398, -3459, -634, -5298, -13153, -12288, -4964, -1570, -5224, -5444, -278, 2272, -6622, -12065, -7748, -6385, -4630, -2698, -9643, -19456, -18534, -14642, -12425, -14238, -9561, 7056, 16258, 7208, 3468, -3990, -3092, -1397, -5385, -8407, -4930, -9083, -10725, -4234, -859, 1239, 3835, 3262, -1921, 624, 3662, 7845, 5769, 412, -2388, -9454, -17682, -14671, -4348, 4774, 10309, 4773, 9601, 5314, 396, -5978, -5826, -4331, -2886, -6178, -1967, -3632, -9407, -10091, -6313, -4890, -6673, 1485, 7404, 7659, -2148, -12850, -23281, -17945, -20192, -19003, -13647, -10787, -12139, -11966, -13212, -7850, -8045, -15161, -20360, -18148, -15416, -18525, -21523, -21070, -31386, -30557, -22496, -22619, -19502, -13122, 202, 1348, -344, 1089, 920, -5724, -8255, -5409, -8763, -9854, -8832, -10650, -8758, -5500, 5569, 4230, -648, -2797, -11510, -9652, -12986]
6169a2986K823L310O030q111j908m293K143J540J0633M298k873o362N106J954
6155A304N122j0360j5829P060R225K643l558P61P231q198K106O356r771n356M225
6140g039L587k147l532K611R327J722l44n472o156Q14P441J319k436l05j694j1228
6124a3532N154P830O71L83K7m117L015K998K247K979k79o516n027l401k923n478
6108a5969o225K342P563N018P380M455l63j556j2163p520K884M276N190j489j359
6093g536N249k723p712j1374J050P353J0698Q1j181M295r881N00n002p10J1651
6078e242R827l296k595j993o767o221j507j38P106J35O48O828l663m985O328N681
6062A46l644L037N986n174r903m18N03M713Q354n786o129J288J512k852O400J3425
$$ y = [-12986, -10163, -6853, -823, -8934, -10842, -15135, -12992, -11452, -819, 3479, 606, -5756, -650, 1304, 6426, -3934, -19763, -12703, -3478, -835, -4393, -3632, 3599, -4599, -2493, 3863, -5908, -11264, -7039, -3452, -5599, -9131, -6520, 2807, 4529, 4185, -1287, -7443, -6629, 812, 2131, -305, -610, -2304, -13532, -8378, -548, 123, 506, 533, -3584, -569, 2429, 4676, 7655, 7376, 860, -4167, -7568, -10491, -15969, -22194, -19852, -12289, -7271, 109, 4564, 4201, 2645, -9518, -17038, -14154, -9878, -4688, -6177, -7536, -2287, -5010, -12722, -24096, -23046, -15693, -4995, -4914, -6095, -1800, -11681, -11181, -16183, -16893, -5242, 4585, 1289, -1306, -3299, -10066, -16287, -17794, -17932, -10826, -10691, -10043, -3215, -6878, -11863, -5535, 146, -3498, -461, 5525, 351, -9552, -9970, -9467, -4754, 3600, -2186, -8315, -7027, -5515, -8367, -1967, 11458]
6046A1458M755l097n686m218p123q350J81N097P911l117L681n281k891J470m000
6031i210j387p704J284P245P787Q991K959p495O229k173j3849m293O927N360L514
6016D185k265L799k216q69l58q045k480l10J512Q70r7R605K172J986j932n310
6000B47j87L467J861p426j030m267n12N111m270m383r06L096J693n444j556j789
5984a6295q636n946J3656J0994m41j981p424J797N517k926j806p52o13M255Q085
5969b516K761l712j56J739l868N53M289K990m342m967P048R638Q212r297o442
5954A930n023j518N99q41M163M427q473j465p995p491O682j359K774O055P22L50
5938f463o236j517Q424M170J802O316n06j714n117o183P291J472j405l265m573
$$ y = [11458, 16213, 13116, 7430, 3212, -3911, -12261, -12080, -6983, 928, -2189, 1492, -3789, -6680, -5210, -9210, -10597, -18301, -17017, -9772, -1985, 7006, 9965, 2470, 8699, 6526, -7323, -11616, -4689, 671, 4185, 1920, 5719, 3503, 2634, 2276, -5769, -8249, -8559, -7047, -6177, -6274, 3331, 5503, 7489, 5557, 247, 60, 3527, 5388, -2038, -3068, -7335, -7847, -2736, -7006, -11389, -12295, -9199, -7506, -12950, -14506, -16295, -24931, -30877, -17221, -6227, -6668, -8649, -16073, -14276, -8759, -11685, -13491, -14243, -14856, -10601, -2516, 245, -3467, -3623, -1884, -5752, -5199, -910, 2080, -2262, -7229, -181, 9457, 17669, 8372, 1930, -3093, -4611, -4012, -4853, -690, 3737, -4736, -6201, -14196, -21687, -15005, -16364, -13590, -7535, -6813, -6463, -12699, -14216, -5792, -1622, 180, 6496, 5990, 4276, -841, -7024, 267, 1739, 334, -2931, -7504]
5923g504K298P393j071n726n383k31j251K484l166n7N877L033L681L053L91n019
5907a198l906M329L9j479l612M342K393q74o686o987p147o73L514J0426P371K908
5891B760k773M185j841m932j145M046j805L926N740m191l901j0371o232J642L704
5876a1188k722N248P99n334j460L357Q554J731n421j7937n491Q714J3713R328
5862A891J208j1989p716l688O379K560j071K873Q960L077j516j732O366j1502
5848e900O3l150j841k367K452N910p736l203o848J605P218N394p79J18l623L54
5832a2333J974l888m845K308R960k852o76l640L11J926N677P310j019k588N603
5817C228J1610m443l178K783m91J34m839j224j3101K002l95n877p19O928Q064
$$ y = [-7504, -5206, 2187, 1116, -4610, -9993, -10224, -11475, -8991, -12157, -12214, -6337, -3304, 377, 3430, 3821, -1198, -5104, -775, -736, -2215, -5827, -1485, 908, 34, -6652, -13639, -20786, -21459, -17945, -7519, -148, 2760, -13, 4172, 2331, -2601, -3746, 300, -1505, 2421, 8161, 3970, 69, -10302, -16534, -14892, -11188, -13910, -8662, -7863, -13197, -14657, -11300, -2746, -1015, -6436, -24373, -29864, -21150, -7437, 1891, 3099, -8890, -16606, -20294, -13915, -11355, -12426, -9553, -593, 2484, 968, -764, 5602, -5900, -5837, -8987, -10828, -13195, -10743, -4833, -12569, -15772, -22620, -21015, -13797, -8403, -9182, -9064, -12687, -12333, -10359, -14247, -19092, -16784, -6824, -9676, -10352, -13992, -13681, -11755, -6078, 1232, 213, -2375, 3228, 14838, 10395, 7217, 10000, 9509, 9643, 4804, 3580, -9521, -7519, -7914, -13791, -14510, -7582, 482]
5802D82L821l653J057N174q39j1530q286J0646N483l429J238o876m893l004j10
5787a4719j479J0676m523l870M905K633l148j883R86J454J2436K748n280q155
5773g219J477k967J825J603K732Q414j62o334k105n530L199o175m71O510M221
5758i82L205J174P710k793j0143q15k496k934N843M380n562m869k89q165J828
5743a4908L492L934J285K295M563L000n073o1N377N108r049q686O015O828K616
5728F736o899m040K352J949k103J3092k910o093m301k591k976M956N244O916J2
5713I344q425p421l211j4458j228O866K447Q785Q847L572Q341o067j1407n140
5699i155k07q4j680p52R69N700k413k488q920j715Q141L89L913k236M902Q14k15
$$ y = [482, 4303, 650, 1707, 6881, 6042, -5488, -13774, -3128, 2355, -1074, 164, -6712, -11605, -14609, -14719, -16198, -5522, -10045, -13915, -9010, -6377, -9525, -11408, -10422, -8968, 3468, 6216, 936, -7219, -5742, -8709, -6884, -5281, -2549, 5865, 5703, -631, -2736, -8266, -5067, -11242, -11713, -5203, -982, 2223, 3397, 11107, 8314, -1829, -2644, -5140, -8074, -2231, 2149, -3413, -8282, -8571, -16736, -14908, -11416, -7482, -6197, -3902, 661, 3661, -1412, -1473, 3904, 9012, -37, -8723, -2708, 4120, 6736, -163, -4203, -1851, 98, -2005, 11087, 8177, 2084, -2217, -4808, -7784, -2828, 2416, 9332, 9344, 919, -6502, -9713, -24171, -25399, -18533, -16086, -7301, 1546, 5118, 13459, 7392, -4015, -9155, -9362, -9446, -11126, -11878, -10909, -5209, -7622, -10110, -19030, -20745, -12604, -12215, -8302, -10538, -5636, -4822, -5037]
5682e037P675j890r95j0827r312k46K767J2255n142o445K402N573L619p94l769
5667a0166N565m32j2802p543L592k78K235L999J6004J301l350p329M697J951M216
5652A660P46J166l816j1039K993J581j894L206m258l435J934J132P62M683N262
5637F83q88n104m005P789P814k686m773n597l369l649R15N859J1753P474j514
5622A0702p437n110n07k464l819m276M554J1123k602l506N446O48P26r501n42
5607f565M152m474J511O534M135L406K574k263l766n488J118N443M820L675n909
5592H903p130l217l273m223J819k632K283o71L384q153O506P913p077L736L287
5577A455k272l391O91r378r274L309M132M000P494l772K225m91j739o365n043
$$ y = [-5037, 2638, 748, -247, -11074, -20386, -20632, -17865, -5610, -10752, -17197, -14795, -9222, -5603, -6397, -10166, -4601, -5033, -17835, -25378, -21786, -22064, -19829, -15830, 174, 1475, -1875, -9204, -4507, -2556, 1660, 2406, 3572, -244, -11283, -8290, -6709, -8603, -5397, -9655, -13090, -11156, -10024, -9262, -4579, 683, -205, -5309, -9314, -1525, 6289, 3603, -1170, -6767, -10136, -13785, -12870, -7011, 4742, 12216, 10702, 3265, -1845, -2352, -4816, -8635, -12911, -8357, 2766, 164, -3342, 2104, 2752, 3478, -6023, -6565, -2413, -6887, -5376, 1158, 5293, 8699, 11273, 9010, 5244, -244, 874, 6317, 11137, 14812, 8903, 1773, -1444, -4717, -8940, -7121, -9753, -7470, -8141, -4757, -12910, -6404, 1509, -5568, -1832, 1455, -817, -4208, -3517, -12895, -22169, -18860, -14728, -10728, -3234, -7006, -4781, -5272, -7011, -13376, -18419]
5562a8419M915j29k04K508J054R743N377N586o472o233r22m84R98q25O78q295
5546a1124J1769L493j327o407m124K426j1L414l782M222j189K98k533o312j0940
5531b2127J389R124J2300N145np965J428R806K078j3113n985O013M902k04r593
5516f807j568l652R496M315K295J854q321J834L15J068Q029P40k090l915j1699
5501h106p393J673K203M209R485j809n866N750Q874J333j363k297N45q573n668
5486g003L395M682K83L108J899J236m350k262P701o129n817l127k56O848J3050
5471A3258p99j0259o885j920L442L184O771J663o526l377O063L713L133p59n13
5456A0189O086j1758l765l569l354J0105n523j0452M323O716k657q92K784J1830
$$ y = [-18419, -13504, -13633, -13837, -11329, -10275, -532, 4845, 10431, 3959, -2274, -3196, -3680, -2682, -3507, -2829, -11124, 645, 4138, 2811, -3596, -7720, -5294, -5305, -1891, -5673, -1451, -2640, -2342, -4875, -11187, -22127, -20738, -11614, 686, 5831, 5826, -2139, -711, 9095, 11173, -1940, -7925, -1912, 2990, 2786, -6807, -8375, -12027, -2531, 1784, 4079, 5933, -2388, -554, -239, 829, 8858, 9598, 7508, 3593, -8106, -15499, -13826, -11623, -7414, 2071, 262, -5604, 146, 9020, 10353, 8990, 6693, 7238, -1335, -7003, -3608, 1074, 1357, 4465, 6364, 7600, 3250, 988, 8689, 2560, -3257, -6384, -6640, 208, 13258, 12459, 2200, -4685, -6605, -3163, 21, 6792, 8455, 1929, -1448, 4615, 8328, 11461, 10702, 10189, 16275, 4517, 752, -2817, -6171, 3934, -1589, -12041, -7718, -1002, -3659, -4551, -1767, 10063]
5442A0063K773J726n526j0396k23n205l147P748R75l428j0850Q412Q796n755q628
5427a2665K511R050N498l919q897L22Q4O594O859o642n281K170M864p453L585
5412c320L48M990j207j1208L19N814P212n086J657Q077K768k797o894r094k528
5397a0949L036Q790K456o5k368m936M705M583r99j0876l39j928L23J2388q42P94
5381C773o980q781L26j788k12N452R059N116r18m152o30Q3J304L630J15O0Q229
5364A3686j0440o665M02k709K027O954m12K370j0999k527L355j031K737J7004
5350A3752O072k305j300k85k427m115j2026j384n178k198m956k086M689K008P900
5335c839P393n68j237M377Q30Q73K408n06j3816r317N266L663j575n702L34j263
$$ y = [10063, 12836, 14562, 9036, -1360, -1583, -6788, -9935, -2187, -1212, -4640, -15490, -7078, 1718, -4037, -12665, -10154, -1104, 4394, 475, -8422, -8100, -8016, -1422, 5437, -1205, -6486, -4316, 548, -6905, -3320, -2972, 2018, 811, -10397, -10078, -4264, 2948, -2138, -481, 7596, 10364, 7567, 673, -8421, -10949, -7913, 877, 3333, 3268, 900, -4036, 669, 5252, 4253, -6623, -6962, -8890, -8567, 3821, 2979, 3773, -3207, -11988, -11662, -13450, -13662, -8210, 849, 5965, 5047, 895, 265, 348, 1652, 5282, 5397, 5457, 13686, 3246, -3419, -3017, -5726, -3699, 3255, 2843, 5213, -5786, -8313, -4958, -5989, -3252, 13752, 19824, 17519, 16219, 15934, 13507, 9392, -2634, -4018, -9196, -11394, -16350, -18436, -13747, -11739, -3839, 3554, 2986, 1749, 6126, 6956, 7829, 10237, 9731, -4085, -13402, -8136, -4473, -6048, -11750, -11416, -12679]
5319a2679L552J694N075J0078M592n656l271n701M393J442m816q166m964J74J0122
5304d131M332M317m19n674O86K764j976l806o572K6l1n416K558J4223N855p516
5288g80k975j325j145N287K05m368J802L708l323P218n172k279N392l689l382
5273d826Q427k138O119p25m083j0626l384J750o62K762N629K84L131J1231q160
5258D729l569J099M497Q36l357K724o836o581P773Q657J2754K583p575k517M989
5243B0206k177k701n303N663o433p768m906n40N710R323j1845q316p551J21K986
5228a3531L850o765O75N086Q211K375R68m03O555p88p551o622j1133R364k642
5213a2351o991Q840M94m879J163l91M41n6l307L71n29k110P958J0380J0076L570
$$ y = [-12679, -9127, -7433, -2358, 7720, 12312, 6656, 3385, -2316, 2077, 3519, -1297, -9463, -14427, -14253, -4131, 201, 4518, 4099, -1575, -889, 1875, -101, -3907, -10479, -10453, -10484, -15900, -13342, 881, 6736, -780, -3755, -5080, -6225, -938, -733, -5101, -3299, 409, -2914, 4304, -868, -3147, 2245, -1444, -4826, 3601, 1463, 7582, 6857, 2774, -7852, -11236, -9486, -10148, -7386, -1757, -1473, 1658, 12889, 4729, 1160, 2259, 6756, 7592, 4235, 6959, 123, -6458, 1315, 9972, 22726, 25309, 17734, 15217, 20206, 18029, 15328, 10025, 15688, 9255, 1487, -3419, -3959, 1751, 11074, -771, -9087, -16638, -16517, -13531, -9681, -16446, -15771, -10685, -2474, -99, 869, 466, 7021, 6233, -1318, -7940, -19073, -9709, -12351, -19342, -10502, -10008, -14887, -13724, -14115, -13674, -13730, -17037, -16666, -17195, -19305, -11347, -967, 9109, 12679]
5197A2679j809N250r045j627m187m254Q656P609j038j4265q783K079j85L838J123
5182c959M052O742J873m540J496N369j267r049o764m349L863L716p838J401m16
5167i670M676M659l700L576K962j0333J594m441k960l18P09O146J549L393N17
5152a641q291q701M382j079n479k234Q015J562O795R351M064O791r89p272o164
5137h90J091J027n462O68Q047j387p632q453l706O194N255n708q804n665n03O965
5121a8963P86l803j35N999O753m431L362k86N238L116n284K053j407j317j245
5106i564O823O354J287k215q61J342J018p600J415L400q856J621K719k539n185
5091a0841N805K869P468n011k899N134q136k290q95K681J393J928M381R92O307
$$ y = [12679, 10870, 16120, 7075, 5448, 1261, -2993, 5663, 13272, 12234, -2031, -10814, -8735, -8920, -5082, -3959, 93, 6835, 8708, 4168, 5664, 11033, 9766, 717, -6047, -10396, -6533, -2817, -10655, -9254, -9670, -4994, -335, -4035, -459, 2503, -7830, -6236, -10677, -13637, -13955, -13246, -7100, -5551, -2158, -1641, -9932, -18633, -14251, -15330, -20809, -23043, -15028, -13466, -6671, 2680, 6744, 13535, 12546, 5274, -890, 201, 1228, -4234, -3566, 4481, 3094, -4538, -12991, -16697, -10503, -5248, -10956, -19760, -25425, -25928, -18963, -18177, -21980, -22115, -16116, -9363, -13794, -10432, -10718, -5480, -2364, -7648, -5595, -7002, -8319, -9564, -2741, 3613, 4900, 2685, 1824, 3166, 4184, -3416, -2001, 1399, -7457, -5836, -3117, -5656, -10841, -5036, -2167, 5301, 290, -2609, 2525, -5611, -7901, -8796, -6115, -4722, -2794, 1587, 2579, 8886]
5076H886p621j2355k615j56Q970M507m056p677n09J1106L912K703k667j1287m426
5061a3285Q052J1828l23L697K541k697m148J303p206L309O110P770J088p418r79
5046I642M772q21j384m026O624n44j143k451N059j551o67j0223p187j931j993
5031g824k497k626j508K440K643J3165N731K763k044r456m339R75n433m150J0459
5016a701R997M488J062l402n743m130l810m582n27R4K092P511N089M375J833n235
5000G411p885k52N266n51m757m166K48J37J323j1613N506m032m330k900K987Q536
4984i072P850q89p807q98m226P600Q419k227k999q178J1250K273j8J609M885n462
4968B110n934K734j010l641K487L564o910n892M375K083L924k913k637J203K355
$$ y = [8886, 1265, -11090, -13705, -13861, -4891, -384, -4440, -12117, -12626, -1520, 2392, 5095, 2428, -8859, -13285, -5233, 6595, 6272, 9969, 12510, 9813, 5665, 6968, -238, 3071, 9181, 16951, 18039, 10621, 9642, 14414, 13593, 12209, 8183, 14807, 14263, 13120, 10669, 15728, 14177, 13510, 3287, -3900, -5831, -7824, -10321, -12947, -14455, -12015, -9372, 3793, 9524, 12287, 10243, 787, -3552, -2577, -8010, -12160, -1701, 8296, 12784, 13846, 10444, 4701, 571, -3239, -7821, -8348, -8254, -6162, 1349, 6438, 10813, 12646, 7411, -474, -726, 4540, 3989, -768, -4934, -4686, -4549, -3226, -14839, -9333, -13365, -17695, -20595, -17608, -9072, -1222, -2111, -9918, -10816, -15042, -7442, 977, -1250, -4249, -12427, -1177, 1096, 1078, 2687, 7572, 2110, -3824, -1090, -2100, -5741, -3254, 310, -6600, -12492, -8117, -6034, -2110, -5023, -7660, -6457, -4102]
4953d102O860m314n980P584P973j060j86n135L16k920o810k272k519P350J1612
4938F397k40j4645J267N811j0080K394Q508J639o065N830L978n597l768J430J0470
4923G329Q135p100k126O49M257k799K851O83J737m545K23J269p122l595j0492
4908a0646k485k927K504L731l892p67O888N334q289N934j501q855L892P409n102
4893h772M089N390p15O604L601L318j3734j4269k184R71o189R209J2611m724N098
4878C04J168l14J872L303n645n5J662p168q027J62M975m82J015O902m526j0312
4862a5166n258L043j247j184k286N525L285O025R789J1632k656p240M2K608M73
4847G385p54O7l092M748K336m782j0245k758P383o231l587l764J265j829L31L881
$$ y = [-4102, 2758, -1556, -7536, 48, 8021, 6961, 6775, 1640, 1956, -964, -7774, -10046, -12565, -5215, 6397, 6157, -8488, -7221, -1410, -11490, -9096, -588, 1051, -5014, 816, 4794, -803, -4571, -3141, 7329, 15464, 8364, 6238, 6887, 11144, 8345, 11196, 11879, 13616, 9071, 9294, 10563, 3441, -154, -10646, -13131, -16058, -13554, -9823, -13715, -14482, -7594, -2260, -10549, -4615, -6116, -14971, -11079, -3670, -8772, -4683, 707, -8, 6596, 10197, 13515, -219, -14488, -16672, -15701, -21890, -12681, -70, -4794, 304, 1472, 1158, 3030, 6333, 688, 633, 2295, -4873, -12900, -12738, -7763, -8245, -7230, -328, -4854, -15166, -20424, -17381, -18628, -19812, -22098, -16573, -13288, -7263, 2526, 14158, 11502, 4262, 4304, 6912, 7385, 6631, 6698, 3606, 8354, 10690, 5908, -4337, -7095, 288, -5943, -9530, -13294, -12029, -13858, -13527, -9646]
4831i646N265M381j267o992m092N939m975K355P872L546M5J056J711o471r976
4816a1249O526P464L399J988K835j0973q207J0388o261q539O648l785k158j170
4802a3094J34m312O791P311k65L925q99J19j785k449J681j0471p978J8471J1670
4787H849j854r606p994J213J808r41N227J698m102K90M187j77j062p017L912N487
4771h2r072q90L723k252m353l320P47R802O383r236j2M028l648N698J4299P650
4755A9465k281J632j814j0303j2306J248P70m71n459r167J672K730N776j0j120
4740i638L846M110Q334M96j1688p98J1471n291j1428O301M779l553M505o358j498
4725f410P21K897K511N116K47r107L11J739L033M763K872K804l358o072m558q84
$$ y = [-9646, -4381, 0, -1267, -8259, -12351, -6412, -11387, -9032, -1160, 2386, 2431, 3487, 5198, -1273, -11249, -4723, 2741, 6140, 8128, 10963, -10, -8217, 2171, -4090, -12629, -5981, -9766, -11924, -13094, -12960, -17272, -10481, -3170, -3435, 490, -409, -290, -2075, -4524, -2843, -13314, -21292, -2821, 8849, 6995, -2611, -10605, -9392, -7584, -8525, -3298, -1600, -5702, -5412, -1225, -1402, -2464, -9481, -5569, -82, -9154, -10044, -6321, -8573, -12926, -16246, -15499, -5697, 686, -8550, -8562, -4534, -8182, -2484, 11815, 19465, 17184, 18816, 17002, 6699, -5607, -4359, -3589, -4060, -9519, -18686, -17014, -14284, -8508, -8518, -9638, -5792, -1682, 6652, 7148, -4540, -5338, 6133, 842, -10586, -4285, 494, -3059, 1446, -4912, -6410, -5689, -2792, -281, 4835, 5082, -4025, -3714, -1975, 1058, 5821, 8693, 11497, 8139, 2067, -2491, -3375]
4709c375O904J309L45M37j821k440k263m495m006KP563J54n713j484L813Q515
4693C445O138r27K212j0511k889O381N894k594j0070j44j01p63n08J998M459j626
4677C94O19N119O59q266L871L449l674p041o064J041k533j878k280O377O773k156
4661e590o038M317N591N764R307N135r16o601l415J948K461p486r822M222M157
4646C034J92m566j84K936J416K615K129p128l680R842M732j184p801n925p45j706
4630f023N932L926j3115j1395J3194Q020K231p507r978O992n61J553J220k500
4616h011O386N715O752j246r322p466K030L465m107j853j964K239K076k006m417
4601a1729K59P140M690L718k320l716m076J122K739K127j423l352m593j78N186
$$ y = [-3375, 3529, 4838, 5183, 5620, 3799, 1359, -904, -5399, -9405, -9403, -1840, -1686, -7399, -8883, -5070, 3445, 9583, 8656, 10868, 357, -2532, 3849, 9743, 7149, -2921, -3065, -3166, -3929, -4437, -2439, 2020, 394, 1013, 6132, 6791, -1475, 2396, 5845, 2171, -4870, -10934, -9893, -12426, -14304, -16584, -10207, -3434, -5590, -11628, -7311, -1720, 4044, 13351, 18486, 17570, 10969, 7554, 9502, 11963, 4477, -5345, -1123, 3034, 3226, -1340, -1524, 1412, 2828, 5443, 7572, 444, -3236, 6606, 11338, 10154, 2353, -3572, -4317, -6023, -91, 3835, -9280, -20675, -7481, 539, 2770, -4737, -14715, -7723, -8284, -6731, -5511, -8011, -1625, 4090, 10842, 9596, 274, -7192, -5162, -1697, -5804, -7657, -9621, -7382, -5306, -7312, -11729, -11470, -4330, 360, 4078, 1758, -1958, -6034, -4912, -2173, -46, -1469, -4821, -9414, -9592, -4406]
4586d406l56K376N932m88m198p275p166K696J1445O589J512n447j3561m17o848
4571a9612o619k2J0060N059j593J1979O78j0286J34O245L41N45J149o601l855
4556a2398n50N146K382N619M682N392j11o481j283m011M35J178K021q51r43o48
4540d21r7J415J042L2l880K373j884k849r66p266N427M835m299J301k305q001
4524a5543K183L632N050L082K731L335l596P788K028j205n926q596j0477k944
4510a8458K101O942J2896m44m224l126K095Q59j408P321j583m29o310l073n94
4495g435J790K714M855j03l51j1627L407J0617R392j294q938R276M301p182J332
4480A0754o725m881j163o60j413M41n25K869L225j771o542K35m026J905n569l309
$$ y = [-4406, -4762, -2386, 3546, 3058, -1140, -8415, -15581, -12885, -1440, 5149, 6661, 1214, -12347, -12764, -19612, -26231, -26253, -16193, -11134, -12727, -748, -70, -10356, -10222, -3977, -3636, -3091, -1942, -8543, -12398, -12948, -7802, -5420, 199, 4881, 10273, 10162, 3681, 2398, -1613, -1178, 0, 2021, 1170, 227, -421, -518, 897, 1939, 1971, -1909, 464, -1420, -4269, -5235, -12501, -7074, -2239, -6538, -5237, -7542, -15543, -13360, -9728, -4678, -1596, 1135, 4470, 874, 8662, 10690, 9485, 3559, -5037, -15514, -18458, -16357, -9415, 3481, 3037, -1187, -4313, -2218, -1359, -2767, 4554, 2971, 2542, -3768, -6841, -7435, -5645, -2931, 1924, 1821, 1470, -10157, -6750, 3867, 13259, 11965, 3027, 12303, 16604, 9422, 10754, 4029, -852, -2015, -2675, -4088, -3647, -4172, -1303, 1922, 151, -6391, -6156, -10182, -8277, -13846, -17155]
4464a7155R956J48L136k584l356N678Q835K291l200n125K508K630j876q43K551
4449C594K869n515o015o100j694K585L600o351l403j0450o273J0155N20L455J880
4434a7143J2454J1319N673J175o600L175n27j5653m311L313Q115l402L620O470
4420G678m305l594J282N185m058j3588r404R213O101L4r481j641N518L882N950
4405a228J3107P075q227p523o577j704l993L638L39k264j801R423J279J1330k719
4390A0155q097O74L817L614K009l020l312R53k265n833j865M190N265O013K638
4375A4936q694j8P714l45m594j297N231J059j604p975j3265L063N314J0272o851
4360B946n879M022O658j575m134k676L961Q060j856j2252j0327L148L707q29k514
$$ y = [-17155, -7199, -7051, -3915, -6499, -9855, -4177, 4658, 6949, 3749, -1376, 1132, 3762, 1886, 1043, 3594, 6463, 948, -5067, -11167, -12861, -10276, -6676, -13027, -16430, -26880, -33153, -22998, -22478, -19023, -17143, -4689, 6630, 12303, 13478, 6878, 10053, 9526, -6127, -10438, -7125, 990, -2412, 1208, 7678, 3373, -221, 1061, 6246, 2188, -11400, -20804, -11591, -5490, -5456, -14937, -16578, -11060, -7178, -1228, 11879, 18954, 10727, 3204, -3373, -5077, -9070, -5432, -5093, -7357, -9158, 265, 1544, 12874, 10155, 2058, 2732, 6549, 10163, 12172, 9152, 5840, 6793, 4528, -1305, -3170, 1020, 6285, 12298, 14936, 6242, 6224, 13938, 13593, 8999, 7702, 12933, 13992, 12388, 4413, -8852, -5789, -475, 9797, 2946, -2933, 1089, 7747, 6172, 2038, -638, 3323, 11383, 9527, -2725, -13052, -9904, -6197, -7026, -9540]
4345i540n833O960N773j173r174R608J0415M086L979M530R08m478j026R73l380
4330A2628q139n946O01P763M576q755q696p163K746J7761R38M802k928k633L358
4315A0913J425j564n992J894j410o283j932M05l695L000O595k603m134l008O486
4300I7R18K177m47j202k699j0742L053P928q07M100R91k832m03N702j98L715j18
4283I233n91L047m620l306l191M22M203M847J017j1926o780J0409Q38J62m308
4268e44o918j118L650J1943J290o003K784P612o420r802q846M151N524L207m368
4253c858L20k152M8q325n151N749R769l625k682L964k38Q455L191N787L293n032
4237I513L62p295m571P173J950j570L36J866l2j789m859m280k659k515L504Q165
$$ y = [-9540, -15373, -8413, -2640, -3813, -12987, -3379, 7036, 11122, 15101, 19631, 20539, 16061, 15035, 16008, 12628, 4489, -1457, -856, 6907, 11483, 2728, -5968, -13131, -10385, 7376, 8314, 13116, 10188, 7555, 10913, 12338, 10774, 4782, 6676, 5266, -1017, -2949, -2544, -6239, -3239, 3356, 753, -3381, -6389, 97, 1015, 3192, 2745, 1543, -1156, -11898, -8845, -917, -1724, 2376, 3367, 535, 132, 5834, 5636, 9351, 9233, 8642, 11689, 7069, 3763, 572, 994, 5197, 10044, 11061, -865, -7645, 2764, 3602, 3764, -544, -7462, -8580, -4930, 7013, 8303, 2300, 5084, 12696, 6276, -3526, -12372, -8221, -2697, 510, -3858, -3538, -5690, -5642, -13967, -19118, -13369, -3600, -7225, -9907, -5943, -6181, 2274, 5465, 11252, 14545, 9513, 9875, 2580, -1991, 5182, 7132, 5562, 5898, 7764, 7732, 5943, 1084, -3196, -5855, -8370, -4866, 3299]
4221C299J1078j587p544K527M891j459K24N410r147m717j1056l057k961L463K694
4206g942l352n892J232J3312J0881P62k154o726j0835m342O516K896k01o664n186
4191a7695M145J767J0616O052l897M037l084o937M029M441j947l353Q882K328
4177I384l986m49Q64j230l891L349L871J369M657j064j0094q914l667M279P492
4162A970K646P697l133n307r49q16K874n93M039J092j693n073j474p745n727o736
4146a8928J129L208R651L019l227M547q221J23J0108Q914j2460p536O325M060
4132G12l904K771M742m367n839n715N805n23L815l381N971O534m633k453k852
4117c317j1068J195O360R107O989o078p678L38J643Q643J0469m127l731O049j532
$$ y = [3299, 14377, 12790, 5246, 7773, 12664, 11205, 11429, 16839, 7692, 2975, -8081, -11138, -14099, -10636, -7942, -11294, -17186, -15954, -2642, 8239, 9001, 6847, 121, -10714, -15056, -8540, -5644, -5845, -12509, -17695, -13550, -11783, -1167, 4885, 988, 5025, 1941, -4996, -967, 3474, 1527, -1826, 7056, 9384, 5398, 4949, 5813, 4583, 692, 4041, 7912, 9281, 13938, 12874, 2780, -6134, -9801, -5522, 1970, 4616, 12313, 9180, 3873, 2924, 2108, 4982, 4389, 8428, 9520, 7827, 2754, 1280, -6465, -12192, -18928, -17799, -14591, -4940, -1921, -5148, -601, -8822, -8699, 1409, 10323, -2137, -9673, -3348, 712, -3192, -421, 4321, -46, -5885, -11600, -5795, -6318, -2503, -5884, 87, 6621, 1988, -465, -3317, -14385, -13190, -6830, 2277, 9266, 3188, -4490, -4152, -2509, 6134, 16603, 12476, 8745, 14794, 13262]
4102A3262p776n280Q697K852l012j2760o368R205J48j311o491q606j604j372O584
4087a3832J1726Q071Q654K088j0332n029P50R44M69r84L102l099l644P31m740
4072e125j713M450L159l504n928Q822O100L00n712j4539K781N164L739l132j2214
4057a7352J280R708P807R669M3q375j177J635n835O73r635k944K748J868l717
4042a3604O534M691J39n676n85O009p23K052J934q719L920J4807m82p139p443
4027d285N200K225r258J036O42o061J4253L109k733K183N84k581q791n876R515
4012h38L583n723r173j525M036Q301J0233O483j658j710r853l564o417k543P14
3997i654O843N565m545Q11K162J141p459n616P076M889O952K350n314m144m265
$$ y = [13262, 5486, 206, 8903, 11755, 8743, -4017, -10385, -1180, -1032, -2343, -8834, -17440, -19044, -20416, -13832, -2106, 5965, 14619, 16707, 6375, 1346, 2096, 3040, 3509, 2525, 5627, 2528, -1116, -385, -5125, -6838, -2388, 771, -2733, -8661, 161, 6261, 6561, 849, -13690, -10909, -5745, -2006, -5138, -17352, -16072, -6364, 1443, 11112, 11155, 2780, 1603, 3238, -2597, -1924, -11559, -14503, -11755, -9887, -13604, -7070, -2379, -2240, -7916, -8501, -2492, -3215, -1163, 771, -7948, -4028, 10779, 10297, 3158, -4285, 915, 3140, -6118, -5082, -4440, -10501, 3752, 6861, 4128, 6311, 6895, 4314, -4477, -10353, -838, 2745, -2978, -12151, -13676, -9640, -1339, 8894, 15377, 13719, 12009, 2156, -1408, -7825, -10368, -9654, -2811, 2754, -1791, -980, 1182, 2323, -5136, -10752, -3676, 1213, 8165, 10515, 5201, 1057, -3208]
3982c208K999k360q124O915Q780M96m193Q934P177n564q63o152m461q750O134
3967b240K621L605M659j743j2330r074n11P966L183j609K424l140j862M727j070
3952d394k871j687n223o843Q617J110l401J2655Q487j435k396o993k593L134M26
3937c407k994m326K460N679o45j1433k538O920M493M027L19m705q778p997M419
3922a8506N159L780l220R74P387k915J578j809N482J487r930Q01J653q045N913
3907a0211J09L962N780L535k436l96j196k539k46o761J77P821k281P178j450p337
3891f291j507J158l207k357k134k77K454N298n279k327K141M831j8j327k891m981
$$ y = [-3208, -209, -2569, -10693, -3778, 5002, 5498, 1305, 10239, 17416, 11852, 10989, 4837, 376, -8374, -2240, 381, 3986, 8645, 6902, -5428, -14502, -15013, -7047, -3864, -5473, -3049, -6189, -8051, -3324, -4394, -7265, -8952, -14175, -21018, -12401, -11291, -14692, -2037, 6450, 5015, 2619, -4374, -6967, -3833, -3407, -6401, -10727, -8267, -2588, -3233, -14666, -17204, -10284, -5791, -1764, -1445, -6150, -14928, -22925, -18506, -13347, -9567, -12787, -11813, -4426, -7341, -5763, -7572, -2090, -603, -10533, -9732, -8079, -16124, -10211, -10102, -6140, -360, 3175, 739, 343, -853, -3392, -3638, -10399, -10222, -2401, -4682, 2496, 1046, -6291, -7798, -6640, -9847, -12204, -14338, -14615, -12161, -6863, -12142, -14469, -12328, -7497, -7515, -8842, -11733, -16714]
$$ [...]
##END NTUPLES=NMR SPECTRUM
##END=
