##TITLE=Analysis number 319807
Compound Code cc 44804
Book Reference 438/134
Project Code adrs
Chemist Name antons
##JCAMPDX= 6.0         $$ Bruker NMR JCAMP-DX V2.0
##DATA TYPE= NMR SPECTRUM
##DATA CLASS= NTUPLES
##ORIGIN= Bruker BioSpin GmbH
##OWNER= nmr
$$ XWIN-NMR		Version 3.5
$$ Wed May 31 10:48:04 2006 GMT Daylight Time (UT+1h)  MAYBRIDGE\nmr@NMR_250MHZ
##.OBSERVE FREQUENCY= 250.131544655141
##.OBSERVE NUCLEUS= ^1H
##.ACQUISITION MODE= SIMULTANEOUS (DQD)
##.ACQUISITION SCHEME= undefined
##.AVERAGES= 16
##.DIGITISER RES= 18
##SPECTROMETER/DATA SYSTEM= dpx250
##.PULSE SEQUENCE= zg30
##.SOLVENT NAME= CDCl3
##.SHIFT REFERENCE= (INTERNAL, CDCl3, 0, 16.522)
##AUDIT TRAIL= $$ (NUMBER, WHEN, WHO, WHERE, WHAT)
$$ ##TITLE= Audit trail, XWIN-NMR		Version 3.5
$$ ##JCAMPDX= 5.01
$$ ##ORIGIN= Bruker BioSpin GmbH
$$ ##OWNER= nmr
$$ C:\u/data/dgb/nmr/ADRS/5400/pdata/1/auditp.txt
$$ ##AUDIT TRAIL=  $$ (NUMBER, WHEN, WHO, WHERE, WHAT)
(   1,<2006-05-31 10:47:31.78 +100>,<MAYBRIDGE\nmr>,<NMR_250MHZ>,
      <created by zg, POWCHK disabled, PULCHK disabled
       configuration hash MD5:
       E2 DF 36 D8 04 B2 41 60 5A D7 A3 38 5A 4B D0 FE
       data hash MD5: 64K
       05 16 A8 2A 45 57 D9 46 1D C2 C3 B1 2D 9E ED AC>)
(   2,<2006-05-31 10:47:47.01 +100>,<MAYBRIDGE\nmr>,<NMR_250MHZ>,
      <Start of raw data processing
       ef LB = 0.3 FT_mod = 6 PKNL = 1 SI = 32K 
       data hash MD5: 32K
       7C 02 F6 46 55 5A 46 A8 2C 00 0B 6E 40 37 D3 AB>)
(   3,<2006-05-31 10:47:51.53 +100>,<MAYBRIDGE\nmr>,<NMR_250MHZ>,
      <apk 
       data hash MD5: 32K
       00 F1 7C E1 1A 12 41 51 48 9B CE 7B 2F 11 3E 45>)
(   4,<2006-05-31 10:47:53.26 +100>,<MAYBRIDGE\nmr>,<NMR_250MHZ>,
      <abs ABSG = 5 
       data hash MD5: 32K
       BB 2E CB 91 66 D5 E4 90 D1 73 23 DA E3 B9 B4 4D>)
$$ ##END=
$$ 
$$ hash MD5
$$ FC 5B 42 DC DC 52 9F 06 E4 F0 95 B0 61 64 5F 30
##$RELAX= 
##$RELAX= 
##$RELAX= 
##$RELAX= 
##$RELAX= 
##$RELAX= 
##$RELAX= 
$$ Bruker specific parameters
$$ --------------------------
##$DU= <C:\u>
##$EXPNO= 5400
##$NAME= <ADRS>
##$PROCNO= 1
##$TYPE= <nmr>
##$USER= <dgb>
##$AMP= (0..31)
100 100 100 100 100 100 100 100 100 100 100 100 100 100 100 100 100 100 
100 100 100 100 100 100 100 100 100 100 100 100 100 100 
##$AQSEQ= 0
##$AQ_mod= 3
##$AUNM= <au_zg>
##$AUTOPOS= <3 >
##$BF1= 250.13
##$BF2= 250.13
##$BF3= 250.13
##$BF4= 250.13
##$BF5= 500.13
##$BF6= 500.13
##$BF7= 500.13
##$BF8= 500.13
##$BYTORDA= 1
##$CFDGTYP= 0
##$CFRGTYP= 5
##$CHEMSTR= <none>
##$CNST= (0..31)
1 1 145 1 1 1 1 1 1 1 1 1 1 1 1 1 1 1 1 1 1 1 1 1 1 1 1 1 1 1 1 1 
##$CPDPRG= <>
##$CPDPRG1= <>
##$CPDPRG2= <>
##$CPDPRG3= <>
##$CPDPRG4= <mlev>
##$CPDPRG5= <mlev>
##$CPDPRG6= <mlev>
##$CPDPRG7= <mlev>
##$CPDPRG8= <mlev>
##$CPDPRGB= <>
##$CPDPRGT= <>
##$D= (0..31)
0 1 0 0 0 0 0 0 0 0.06 0 0 0 0 0 0 0.0002 0 0 0 0 0 0 0 0 0 0 0 0 0 0 
0 
##$DATE= 1149068849
##$DBL= (0..7)
120 120 120 120 120 120 120 120 
##$DBP= (0..7)
150 150 150 150 150 150 150 150 
##$DBP07= 0
##$DBPNAM0= <>
##$DBPNAM1= <>
$$ [...]
##$SUBNAM7= <"">
##$SUBNAM8= <"">
##$SUBNAM9= <"">
##$SW= 20.6930455092707
##$SWIBOX= (0..15)
0 0 3 0 0 0 0 0 0 0 0 0 0 0 0 0 
##$SW_h= 5175.983436853
##$TD= 65536
##$TD0= 1
##$TE= 294.16
##$TE2= 300
##$TE3= 300
##$TEG= 300
##$TL= (0..7)
0 120 120 120 120 120 120 120 
##$TP= (0..7)
150 150 150 150 150 150 150 150 
##$TP07= 0
##$TPNAME0= <>
##$TPNAME1= <>
##$TPNAME2= <>
##$TPNAME3= <>
##$TPNAME4= <>
##$TPNAME5= <>
##$TPNAME6= <>
##$TPNAME7= <>
##$TPOAL= (0..7)
0.5 0.5 0.5 0.5 0.5 0.5 0.5 0.5 
##$TPOFFS= (0..7)
0 0 0 0 0 0 0 0 
##$TUNHIN= 0
##$TUNHOUT= 0
##$TUNXOUT= 0
##$USERA1= <user>
##$USERA2= <user>
##$USERA3= <user>
##$USERA4= <user>
##$USERA5= <user>
##$V9= 5
##$VALIST= <valist>
##$VCLIST= <CCCCCCCCCCCCCCC>
##$VD= 0
##$VDLIST= <DDDDDDDDDDDDDDD>
##$VPLIST= <PPPPPPPPPPPPPPP>
##$VTLIST= <TTTTTTTTTTTTTTT>
##$WBST= 1024
##$WBSW= 4
##$XGAIN= (0..3)
0 0 0 0 
##$XL= 0
##$YL= 0
##$YMAX_a= 455760
##$YMIN_a= -578990
##$ZGOPTNS= <>
##$ZL1= 120
##$ZL2= 120
##$ZL3= 120
##$ZL4= 120
##$ABSF1= 16.522
##$ABSF2= -4.171173
##$ABSG= 5
##$ABSL= 3
##$ALPHA= 0
##$AQORDER= 0
##$ASSFAC= 0
##$ASSFACI= 0
##$ASSFACX= 0
##$ASSWID= 0
##$AUNMP= <proc_1d>
##$AZFE= 0.1
##$AZFW= 0.1
##$BCFW= 0
##$BC_mod= 0
##$BYTORDP= 0
##$COROFFS= 0
##$CY= 12.5
##$DATMOD= 1
##$DC= 0
##$DFILT= <>
##$DTYPP= 0
##$F1P= 14.0000005364418
##$F2P= -0.99999901652339
##$FCOR= 0.5
##$FTSIZE= 32768
##$FT_mod= 6
##$GAMMA= 0
##$GB= 0
##$INTBC= 1
##$INTSCL= 1
##$ISEN= 128
##$LB= 0.3
##$LEV0= 0
##$LPBIN= 0
##$MAXI= 10000
##$MC2= 0
##$MEAN= 0
##$ME_mod= 0
##$MI= 0
##$NCOEF= 0
##$NC_proc= -4
##$NLEV= 6
##$NOISF1= 0
##$NOISF2= 0
##$NSP= 0
##$NTH_PI= 0
##$NZP= 0
##$OFFSET= 16.522
##$PC= 1
##$PHC0= 170.1979
##$PHC1= 6.207266
##$PH_mod= 1
##$PKNL= yes
##$PPARMOD= 0
##$PSCAL= 4
##$PSIGN= 0
##$REVERSE= no
##$SF= 250.13
##$SI= 32768
##$SIGF1= 0
##$SIGF2= 0
##$SINO= 400
##$SIOLD= 32768
##$SREGLST= <1H.CDCl3>
##$SSB= 0
##$STSI= 32768
##$STSR= 0
##$SW_p= 5175.98343685301
##$SYMM= 0
##$S_DEV= 0
##$TDeff= 65536
##$TDoff= 0
##$TI= <Analysis number 999999
Compound Code 99
Book Reference 9
Project Code 9>
##$TILT= no
##$TM1= 0
##$TM2= 0
##$TOPLEV= 0
##$USERP1= <user>
##$USERP2= <user>
##$USERP3= <user>
##$USERP4= <user>
##$USERP5= <user>
##$WDW= 1
##$XDIM= 32768
##$YMAX_p= 279268246
##$YMIN_p= -123679
$$ End of Bruker specific parameters
$$ ---------------------------------
##NTUPLES= NMR SPECTRUM
##VAR_NAME=  FREQUENCY,     SPECTRUM/REAL,   SPECTRUM/IMAG
##SYMBOL=    X,             R,               I
##VAR_TYPE=  INDEPENDENT,   DEPENDENT,       DEPENDENT
##VAR_FORM=  AFFN,          ASDF,            ASDF
##VAR_DIM=   32768,         32768,           32768
##UNITS=     HZ,            ARBITRARY UNITS, ARBITRARY UNITS
##FACTOR=    0.157963299565203, 1,           1
##FIRST=     4132.6476996994, 0,             0
##LAST=      -1043.33573715361, 0,           0
##MIN=       -1043.33573715361, -123679,     0
##MAX=       4132.6476996994, 279268246,     0
$$ Real data points
##PAGE= N=1
##DATA TABLE= (X++(R..R)), XYDATA
$$ [...]
19515 -43935 -7494 -43 -3126 -11691 -54098 -44841 -6066 -23897 -34008 -37645 -27125 -26723 -49907
19502 -49907 -59032 -34863 -15165 -25381 -42276 -24606 -23679 -59496 -81084 -80183 -40063 -44754 -45714
19489 -45714 -47310 -23158 -388 -35546 -25529 -31434 -34022 -31397 -12940 4132 -7801 -709 -38569
19476 -38569 -49730 -35878 -39088 -32194 -30381 -13086 3777 23070 11059 -35607 -51638 -28137
19464 -28137 -42982 -60560 -44238 -47273 -65043 -76555 -78255 -68482 -23067 6286 3677 24393
19452 24393 23152 11672 -16657 -18975 -25007 -22206 -24586 -55314 -53500 -48586 -64049 -55631 -56298 -62837
19438 -62837 -45943 -46857 -25591 -23857 -8531 31034 6174 9370 14844 1922 -3364 -21325 -22171
19425 -22171 -35334 -46101 -25920 -32721 -17990 3395 16061 -14392 -27345 -47740 -42775 -31835
19413 -31835 -39194 -63161 -55982 -36429 -8960 8162 14012 24515 -3807 -32579 -41749 -35560 -50450
19400 -50450 -62014 -65986 -44596 -20035 -29940 -37826 -23763 -22211 -39045 -39737 -63901 -70866 -92459
19387 -92459 -73977 -35722 -23356 -646 354 -7657 -32541 -41827 -13389 -1529 -13412 -25081
19375 -25081 -20160 -11015 -2717 -2819 -34727 -62118 -60912 -24477 13656 -17763 -32856 -30512 -962
19362 -962 18204 15893 -12432 -19626 -4680 -30856 -52850 -45784 -51950 -64960 -35353 -8211 14948
19349 14948 34596 47412 71648 51727 51990 35998 20510 29377 50547 60397 64941 81230 105684
19336 105684 130735 181512 217355 236961 253760 252359 246842 221082 198655 202747 210235 194669
19324 194669 217388 240308 252711 259494 255235 230711 197553 177319 165858 129715 87453 78636
19312 78636 73333 69624 50786 49235 61214 79440 79298 70159 63600 34479 40616 19650 23121
19299 23121 58299 41227 -3361 -12628 -8796 -3499 16045 36269 25549 47802 73178 83305
19287 83305 133909 177700 213091 245968 253990 256143 254070 239758 223069 189837 157878 175578
19275 175578 207800 227103 263291 296023 342190 322697 268940 207466 219289 224285 216017 159420
19263 159420 105858 100547 73964 59654 44575 54033 65792 60339 42167 15647 22861 41752
19251 41752 34565 13468 19499 53608 65789 68535 74038 67382 53402 46860 44217 4148 -4488
19238 -4488 16330 -13943 -47421 -12400 -1723 -19934 7518 10246 -26519 -32077 -12744 -11035
19226 -11035 -10761 -23025 -21391 -38232 -35583 -36543 -21957 -42164 -58853 -36601 -22585 -27467 -41854
19213 -41854 -18028 8024 22992 -23615 -22651 19187 38075 38409 45514 25456 20875 23427 19587
19200 19587 15711 10019 26260 34709 41301 38468 14199 -24607 -54459 -52897 -21708 42253 64155
19187 64155 54421 30360 19168 28373 32138 19877 -6650 -11082 -20946 -42041 -41964 -46217 -21321
19174 -21321 10350 26517 8953 -24723 -35729 -48521 -45658 -21282 -4427 12062 8861 6263
19162 6263 -6794 -22458 -5877 7239 8148 28411 35984 27489 17622 32831 31283 29542 26519
19149 26519 42568 27393 15786 55960 61614 77562 77328 72341 61586 80179 102182 131239
19137 131239 164433 180800 192281 238985 254850 239466 257967 282334 244149 250139 258805 246103
19125 246103 240831 269769 307055 291814 254677 249752 227706 202622 182382 163765 175822 168556
19113 168556 173176 158184 128869 109220 98315 100136 74836 75830 65098 47365 31900 15083
19101 15083 4415 4693 28205 31042 39489 70620 135800 179760 219500 280775 311383 342293
19089 342293 389472 400505 433475 475165 471825 473179 452722 433003 441427 473763 456604 450565
19077 450565 447704 479824 509971 520816 500108 466649 410641 358915 295278 220577 174087 120149
19065 120149 119170 139456 134049 104188 88305 97100 131923 144108 147250 127493 95232 67507
19053 67507 87667 91873 106036 74534 100255 97933 109422 111340 150367 192046 229813 260537
19041 260537 287466 318926 319290 306835 268735 236281 211578 205349 238162 257769 268447 295339
19029 295339 316088 339567 346979 315530 268179 233113 174181 160228 162353 139506 118518 110298
19017 110298 99216 64165 44570 48181 49483 27901 35024 43750 37964 25195 -13657 17736
19005 17736 31533 34374 44171 19429 -2583 3736 -11432 -16848 -11558 -30405 -17301 -14850 -6985
18992 -6985 1726 -10156 14450 23949 12111 -4881 -5329 8167 22521 38322 74524 83783 84320
18979 84320 68306 42162 49460 27795 16814 9269 -3845 -15623 -14511 465 22113 19541
18967 19541 2786 23660 33475 35862 48812 61869 72971 82179 70441 46743 35198 50324
18955 50324 56180 57468 54062 57366 96508 88334 71537 100418 134223 122857 105342 97276 90492
18942 90492 96328 89411 81471 64420 41625 55975 54428 47852 49451 52546 58210 60235 44014
18929 44014 46894 81384 126063 132882 118830 136842 135425 127249 114064 113011 103144 117326 119595
18916 119595 113946 123149 134624 153265 164720 169644 141642 122514 153577 207357 208403 211440
18904 211440 208063 198362 198069 189914 163927 175461 210102 212589 216824 214424 207763 206591 230695
18891 230695 221592 207353 203665 206353 211190 218510 213222 221705 232037 228071 217675 231621 251750
18878 251750 262964 277177 296618 306928 299640 311804 322478 320041 337279 379743 408955 454847
18866 454847 521376 587380 664253 740670 839634 937998 1056887 1202864 1401174 1634296 1846269
18855 1846269 2045884 2246994 2411694 2543755 2666458 2785262 2943176 3138384 3405940
18846 3405940 3793013 4309513 5021041 6030667 7613341 10102139 14009973 19562308 26393848
18837 26393848 33510100 40541888 46772333 50922502 52351063 51262142 48263283 44577084
18829 44577084 41855538 40917332 42035715 45033824 49148806 53563629 56694960 57215053
18821 57215053 55001547 50402037 44112545 37325795 30839813 24840860 20120039 16925896
18813 16925896 14879476 13519788 12531021 11819402 11263973 10804687 10456040 10181382 9938536
18804 9938536 9706884 9524520 9387955 9266056 9150024 9120753 9213332 9412449 9729896 10255419
18794 10255419 11186759 12718802 15226522 19177738 24844365 31881667 39264196 46524388
18786 46524388 52869786 56926494 58159451 56830125 53440518 49356781 46335768 45104063
18778 45104063 46058559 49233401 53831971 58721858 62167488 62878369 60831575 56210785
18770 56210785 49745984 42765056 35971098 29494460 24359358 20839673 18398029 16519985
18762 16519985 15002963 13744289 12712915 11821433 11063501 10466506 9976552 9535996 9109414
18753 9109414 8688990 8337480 8008055 7717830 7425852 7132888 6832427 6566363 6304461
18744 6304461 6027506 5785963 5550717 5326944 5089091 4904620 4760510 4601918 4432422
18735 4432422 4277015 4143416 4027280 3935120 3789680 3660698 3551088 3468727 3351371 3237609
18725 3237609 3090455 2979251 2884860 2785229 2700777 2646717 2575030 2495152 2413710 2348616 2276807
18714 2276807 2183511 2102268 2056685 1982169 1893664 1819476 1747685 1708924 1678181 1624373 1576913
18703 1576913 1561240 1518645 1462484 1440861 1418983 1414070 1390587 1362431 1307014 1253839 1217397
18692 1217397 1164795 1136216 1095585 1036783 1041735 1070662 1081584 1102453 1096811 1090002 1092839 1100121
18680 1100121 1083120 1060016 1032420 960731 935573 940545 931632 891805 845762 822568 827067 840617
18668 840617 828729 808488 801730 780003 765409 739096 697232 640321 602041 581663 536957 527519
18656 527519 540106 521065 524933 536367 586820 593909 558488 548926 567003 580865 590216 587295
18644 587295 555401 530911 527481 517843 535924 550996 532189 524009 522039 532708 559571 605458
18632 605458 644814 636075 620145 597022 568098 491444 392330 336154 342948 355246 394366 441445
18620 441445 461244 445006 454718 443356 449230 405628 383703 361117 345338 340486 342512 344635
18608 344635 352987 355153 364157 370242 384181 385322 384373 379924 377097 390182 402277 409152 422587
18595 422587 433566 422138 399485 380487 362758 376698 409972 418958 433877 422035 386475 376007
18583 376007 401236 396185 398300 383643 384253 375938 342405 362603 343557 315575 308723 300236 281080
18570 281080 235216 204785 206580 231515 268609 297993 294110 294501 304534 322992 305946 259557
18558 259557 269698 300472 320298 331577 303388 281519 289415 285318 279061 305127 279589 320947
18546 320947 322701 324138 311723 281394 252111 252764 254404 276891 306011 289028 270985 247578
18534 247578 239493 269396 293084 277131 279409 270287 233869 222507 204990 220769 234483 253548
18522 253548 260426 235841 232984 264864 270499 272957 298847 320633 322566 307628 258548 249085 266113
18509 266113 292678 309111 321947 312796 280979 284956 297653 311767 298213 288095 304758 310350
18497 310350 306331 298852 294920 286745 271197 262147 246256 218259 217488 234911 247512 252922 263151
18484 263151 272809 273412 294229 313930 318538 339253 318352 274959 288912 306023 296190 297369 294614
18471 294614 292600 287664 288821 275635 263137 274608 280198 284398 303361 332441 324759 285188 245627
18458 245627 228878 222125 229183 235328 223633 220333 205929 227706 234864 231241 242931 221046 211708
18445 211708 202857 205727 216947 233362 244349 271517 254145 198750 159891 157099 205923 232330
18433 232330 229767 257654 274504 270138 251263 249009 254659 257432 273519 262967 269919 295633 293311
18420 293311 286766 264204 216953 226631 258120 274673 279134 291313 278521 251207 259307 277790
18408 277790 291197 303318 334493 334798 349848 388744 418046 470050 506426 518762 531753 525364
18396 525364 508811 487864 476282 512864 556463 621595 672923 661034 639063 624751 614157
18385 614157 601406 567260 525436 533559 568209 597630 650018 721072 774110 817352 868524 898751
18373 898751 886971 852068 824767 859006 924857 998350 1095471 1208951 1322242 1438480 1583720
18362 1583720 1756483 1988058 2256761 2544592 2975038 3582622 4384235 5621730 7638351
18353 7638351 10914421 15731124 21372823 25661701 26836242 26811676 27105264 26184022 22489764
18344 22489764 18429498 16354127 16719477 19336188 23543490 27583371 28942529 28260750
18336 28260750 27691652 26819264 23346828 18070619 13794150 11168251 9558854 8503890
18328 8503890 7745865 7206113 6853323 6651707 6558221 6510738 6430366 6374418 6346137 6336541 6286780
18317 6286780 6246519 6317698 6562664 6981861 7621896 8531523 9900873 11974801 15361238
18308 15361238 20420753 26474915 31412211 33179320 33497977 34302706 34308831 31787666 29223849
18299 29223849 29923916 34964148 43656802 53346965 59807937 61529568 60984131 59701086
18291 59701086 55193833 46803774 38085853 32937174 32157625 34716412 38469631 40225786
18283 40225786 39155453 37855331 36843150 33596701 27610490 22059591 18395182 16091698
18275 16091698 14536059 13336112 12363084 11605036 11023437 10525964 10121644 9820730 9528052
18266 9528052 9259364 9060916 8900813 8761478 8668045 8699165 8880545 9270728 9970346 11102061
18256 11102061 12956559 16152276 21290166 27962653 34160729 36814307 36712571 36760500
18248 36760500 36385327 32758296 27159332 23303720 22436344 24499070 28947383 34252656
18240 34252656 37373883 37052735 35969388 35106386 32061002 25841044 19735654 15626945
18232 15626945 13082893 11434281 10302368 9413849 8744482 8261865 7853067 7473071 7121338
18223 7121338 6795646 6441246 6109288 5834964 5547718 5249991 5033018 4868387 4733389
18214 4733389 4618511 4514203 4369659 4216541 4045526 3861383 3669629 3497626 3341165
18205 3341165 3215083 3114681 3014918 2929112 2836737 2731367 2641083 2582565 2480136 2404843
18195 2404843 2346600 2282475 2212813 2149926 2096554 2023587 1966331 1935805 1888438 1834912 1794248
18184 1794248 1766619 1750222 1691842 1620851 1598662 1620849 1628237 1603066 1563001 1542546 1572146
18173 1572146 1578059 1565927 1532046 1516575 1506291 1511056 1468835 1409473 1332551 1265351 1195719 1155653
18161 1155653 1117934 1046328 983017 970890 962400 950830 926734 909200 876307 835720 832960 825424
18149 825424 817590 786275 765530 767363 774353 776823 733304 718053 732134 764684 770580 748734
18137 748734 729781 734029 770477 808836 885695 904306 941426 999443 1039061 1095391 1179504 1264676
18125 1264676 1322263 1401165 1429510 1456847 1526662 1577648 1601026 1625954 1687534 1781768 1905576
18114 1905576 2073545 2382659 2836620 3508973 4753857 7092192 11297027 17328992 23651983
18105 23651983 26417048 25530872 25169080 25406317 22174078 15667092 10493637 7567437
18097 7567437 5986119 5089584 4516884 4110218 3795072 3558620 3333831 3147489 3014209
18088 3014209 2871698 2719901 2584390 2466591 2373972 2266432 2157199 2105572 2058032 2040000
18078 2040000 2023249 1983310 1917302 1885313 1820522 1800269 1758912 1691099 1623754 1569882 1504783
18067 1504783 1454162 1392951 1334619 1286496 1232317 1162155 1139201 1135100 1125621 1127333 1094530 1068636
18055 1068636 1063351 1065747 1051683 1041148 1066791 1078355 1114818 1129331 1175642 1189499 1212505 1235931
18043 1235931 1249908 1277329 1293870 1308443 1381227 1509379 1637914 1760941 1824198 1860375 1861632
18032 1861632 1844768 1818398 1807148 1791210 1729113 1656674 1594319 1527842 1416806 1249622 1117800
18021 1117800 1012088 932607 890509 851240 827059 793524 758080 716089 672857 646311 646194
18010 646194 671963 680038 654368 636046 661773 682299 710721 719517 737992 770820 784749 774879
17998 774879 786915 799551 826122 873867 959024 1078804 1190533 1310099 1417465 1522954
17988 1522954 1591529 1600056 1641847 1654790 1672272 1721087 1747042 1758722 1758434 1749695 1728509 1665028
17976 1665028 1524625 1414597 1334491 1279359 1261689 1217143 1173463 1147927 1145879 1139901 1131799
17965 1131799 1133351 1132942 1108617 1071983 1049414 1033911 1016194 991093 975396 989155 992739 1009081
17953 1009081 1046839 1107341 1156192 1177981 1223910 1265670 1290010 1307188 1347750 1370515 1357645
17942 1357645 1361474 1352709 1303760 1241458 1173592 1118001 1092609 1070309 1050964 1000868 954241 950858
17930 950858 901273 799260 742287 697336 673593 673445 665670 663401 667341 680696 706684 730831
17918 730831 743291 792897 856283 912562 929364 924955 968880 1007027 1025279 1048179 1054768 1044812
17906 1044812 1075362 1095851 1079115 1081818 1085148 1114453 1173441 1213579 1250183 1261700 1270086 1259232
17894 1259232 1263231 1294964 1331669 1334073 1323262 1285548 1245667 1210660 1133548 1071907 1011551 995920
17882 995920 969512 921431 872273 805305 741942 689806 651083 590280 537904 528076 554117 577937
17870 577937 613733 629996 601881 612988 645834 619259 607398 641961 669956 701247 720227
17859 720227 726745 746927 749972 760215 766948 771256 778929 785562 798978 799121 818039 866514 864090
17846 864090 822077 774445 759606 789584 785322 751617 746646 774674 844758 916238 946498 973417
17834 973417 989278 1017465 1033175 1034321 1057533 1069173 1059870 1054420 1045822 1018959 985106 961597
17822 961597 943198 911712 894215 886461 832203 830483 816657 794710 766085 697354 661018 618216
17810 618216 610956 604615 601423 602540 622897 656779 651031 639010 648060 651654 633225 611984 576436
17797 576436 557106 546778 577206 614158 675952 699788 687546 699442 719472 704361 648676
17786 648676 603543 606007 639969 666848 686000 706810 712704 789448 826236 824874 822616 826513
17774 826513 835651 801824 767008 750824 707396 690347 700979 699361 706505 666645 615030 567066
17762 567066 541307 560813 543024 507470 495867 504191 531200 551578 541380 529472 546222 602483
17750 602483 635756 663067 675180 658387 651539 639304 603661 548362 528497 552131 603307 630794
17738 630794 623072 630454 595524 566263 538850 502627 430695 415239 448537 467735 413231 383239
17726 383239 368477 399297 415381 394134 382408 380557 376176 354058 334933 341691 312962 302746
17714 302746 323412 334492 334715 314211 286218 283186 276018 293654 319865 322175 325172 350542 383748
17701 383748 374818 317211 304809 311119 289341 296081 292897 292670 325471 325515 332012 310401 295163
17688 295163 297988 297086 274106 310252 307274 290703 292549 274604 242831 242996 271599 282653 271874
17675 271874 247048 248552 261465 268279 266154 264229 259418 252652 244221 280782 315888 341618 359321
17662 359321 382372 409170 374632 375304 371206 387685 431229 482509 477870 497982 523924 562094
17650 562094 587939 602732 606448 634762 645730 650338 625187 638596 644518 639074 647487 658128
17638 658128 651234 650146 627078 620503 600973 564887 527180 500302 482202 480146 472461 465332 459381
17625 459381 478524 450923 397391 358585 348400 320594 312636 315016 323733 337847 325151 335767
17613 335767 344133 337992 336347 350953 348031 369128 387940 408029 420246 423906 435232 459411
17601 459411 482951 513150 547891 584140 618594 628251 626652 630058 634550 646512 651076 675933
17589 675933 666348 688892 702465 689822 698664 698239 650934 643587 640115 628558 647155 657286 675506
17576 675506 654029 629104 586562 533660 505891 492303 487729 454117 434313 383744 339030 327925
17564 327925 337678 373894 375095 357537 361934 368783 384085 378128 365051 371054 367482 374231 373820
17551 373820 371236 407037 421049 417175 430614 455400 454769 462777 450759 482131 500966 531684
17539 531684 514962 490381 506396 525080 503345 512622 549955 557073 558038 548613 563785 560352 563847
17526 563847 570166 573608 613874 635941 651838 662604 674534 665628 632388 623422 644721 626649
17514 626649 615318 606803 589033 558699 561701 554989 582929 592222 580747 567917 568469 549989 520433
17501 520433 512257 542896 555930 550186 559885 559821 554189 596898 626939 642940 676636 686648 712694
17488 712694 719621 712598 717391 763274 808077 891384 983268 1063804 1167524 1281510 1385494
17477 1385494 1505726 1619641 1758422 1890730 2040317 2167408 2315828 2543188 2786301
17468 2786301 3051582 3346153 3686184 4109648 4643358 5321109 6256004 7635502 9601327
17459 9601327 12320885 16047522 20881220 26841462 33792587 41481153 49601649 57860037
17451 57860037 65945222 73391297 79622323 84215775 86734819 86711337 84076365 79247947
17443 79247947 72746917 65264102 57840100 51699361 47740881 46506551 47837737 50779458
17435 50779458 54035156 56675544 58227944 58320588 57128144 54862197 51458929 47361820
17427 47361820 43322446 39585292 35919467 32197903 28467992 24868880 21723771 19334908
17419 19334908 17693441 16540552 15720674 15131895 14725297 14451346 14274329 14182205 14223770
17410 14223770 14366410 14608291 15041677 15760681 16893891 18675962 21274791 24788956 29355659
17401 29355659 35019003 41720719 49344022 57784828 66953536 76768254 86979243 97312771
17393 97312771 107165865 115397536 120882844 123509182 123646605 121409692 117107282 111299584
17385 111299584 104434902 97198026 90513897 84833514 79703882 74389182 68627973 62758724
17377 62758724 56971866 51244365 45652642 40233792 35073439 30579634 27109175 24583030
17369 24583030 22712803 21261186 20055416 19009023 18103649 17329721 16637229 15978035 15365531
17360 15365531 14825637 14288605 13757709 13294591 12869589 12480006 12154290 11879434 11727341
17351 11727341 11689102 11783386 12112622 12851436 14162998 16310947 19496714 23641771 28162476
17342 28162476 32347755 35865134 38513679 40288701 41307567 41643926 40991958 39413062
17334 39413062 37339329 34878975 31872353 28360035 24532048 20703057 17259281 14620365
17326 14620365 12768508 11493541 10541541 9782350 9175453 8669767 8248461 7872543 7521958
17317 7521958 7208268 6932959 6658304 6401761 6170501 5933365 5691469 5453909 5252103
17308 5252103 5000845 4808670 4602321 4392535 4226764 4095258 3958688 3813237 3667456
17299 3667456 3552056 3445683 3353655 3265022 3170198 3074981 2989911 2909685 2862260 2820010 2731754
17288 2731754 2659109 2612171 2555799 2489047 2454915 2411832 2319168 2243331 2177818 2127112 2037906
17277 2037906 1970258 1937777 1897881 1832061 1767742 1723930 1679822 1632941 1581835 1567631 1566650 1507519
17265 1507519 1460620 1392241 1308256 1264272 1231649 1191274 1161397 1121391 1095502 1087043 1065928
17254 1065928 1027859 986463 953855 910083 887240 871881 846657 832560 828770 812515 777685
17243 777685 747253 748653 738096 734507 702981 692904 699183 718851 726992 687937 660708 680967
17231 680967 692096 661893 649184 635458 619122 618682 613712 630944 652392 657487 655691 657315 651474
17218 651474 648895 655229 640774 644190 654666 652784 666669 644187 622615 593522 555509 523508
17206 523508 484798 481617 512757 519810 491227 488688 479987 476354 468643 471350 465400 467205 446481
17193 446481 443217 466778 458120 451450 448969 445947 452151 461152 445303 432413 450410 483810 485303
17180 485303 478416 478305 488516 488154 475515 472483 464469 461831 460296 457089 429492 424832 441793 418122
17166 418122 371468 360825 369525 357846 377237 388627 373918 361721 318753 314769 286935 297144
17154 297144 327286 318786 311466 321652 313659 295475 294126 306183 309641 278796 269557 291540 320189
17141 320189 315646 334019 354286 364086 400673 404114 417011 460336 468922 491002 481319 457036
17129 457036 429399 402501 392950 374699 342996 321516 309693 284259 260567 254575 245619 208051
17117 208051 204258 200265 201942 187666 177010 178539 160405 131473 138680 153632 185672 184585 163919
17104 163919 181411 198069 180759 142062 137349 158925 174370 176404 164948 130317 130062 125014
17092 125014 144365 174621 200368 200550 211923 216178 234651 262925 280853 260609 253341 240107
17080 240107 248384 248054 246918 231435 192563 178625 175999 181001 168349 142162 141181 147940 151430
17067 151430 145254 128413 121830 143345 155915 160004 93898 73828 101432 97506 110550 114924
17055 114924 127001 138555 147110 119349 105180 100200 114701 100077 91940 94216 104787 100836
17043 100836 85715 101423 120234 142787 141271 146226 154882 183633 216564 240246 273791 311864
17031 311864 357344 409396 436964 494518 550840 528245 509020 500333 505927 503446 515581 488775
17019 488775 513377 504569 473949 428304 365064 336602 317648 286706 286513 281411 293320 271182
17007 271182 249248 188440 177522 180573 180325 159020 148707 138599 148797 123091 83181 85341
16995 85341 85523 88200 107092 152697 170991 175497 216116 223113 212333 249585 265621 270959 281886
16982 281886 290441 277014 292715 337113 351879 329447 378448 466637 508124 491649 453680 436300
16970 436300 457073 452703 407169 400305 404322 412746 414416 394400 343851 307360 244155 203408
16958 203408 204677 215565 206392 178787 209116 221816 229677 245093 279620 317334 346153 421801
16946 421801 472354 507999 493040 483528 484331 482184 466163 441758 428128 418504 392243 354616
16934 354616 319361 275817 247370 226692 231858 209224 171634 163293 147432 138594 140803 154361
16922 154361 164751 169351 175287 161625 233900 258433 246916 261400 292182 314107 338886 381919
16910 381919 388823 380603 382082 382013 397430 408958 421369 421135 385856 351676 310277 268315 257430
16897 257430 263822 309394 341817 376628 405611 442677 499443 555148 568505 533044 500336 465785
16885 465785 457655 479080 474911 449067 401183 378321 361651 316772 288552 271320 277254 284868
16873 284868 290982 288521 301335 312155 347936 383957 412705 441811 489398 515663 534838 545748
16861 545748 530326 528205 497519 444506 395097 325545 300654 307313 306368 274548 249896 223379
16849 223379 194000 191753 175527 170210 164720 157165 175355 152451 154284 141361 120883 103268
16837 103268 92198 110137 96909 93667 89950 100184 119618 145039 136224 130694 133297 125835 114385
16824 114385 116001 146703 162200 209694 231269 223342 247145 278358 321779 342361 324079 310304
16812 310304 274915 252992 242529 238385 220717 190359 161926 124239 103125 114414 133095 136420
16800 136420 121700 113818 114907 129316 108657 85986 102770 88746 72964 66686 67983 73668
16788 73668 95085 79034 61706 62237 69743 52249 68006 78462 91673 86795 74281 80584 68802
16775 68802 51596 28029 40234 47432 42764 69648 85534 91491 93222 78098 100261 118391
16763 118391 111586 100396 81266 68710 49190 41994 40504 36089 15833 21057 47332 54424 95938
16750 95938 96379 78135 46919 42311 49294 62616 64104 47627 47628 52942 35854 54122 63769 76300
16736 76300 76039 75280 61309 47593 40343 47946 24413 46618 86800 66723 28533 42085 54290
16723 54290 74236 77128 64488 51300 46878 61874 76638 92149 75487 64514 53641 69116
16711 69116 75227 60639 45697 28993 26876 49134 76518 70085 53764 45648 43986 28168 25284
16698 25284 44264 80291 81079 62436 30052 26632 40015 43582 47081 31605 46106 37821 22377
16685 22377 33546 34523 28763 21452 38138 58817 87665 113304 82207 37758 38663 53554 64492
16672 64492 50348 7972 5293 36359 64999 76536 67114 49220 36218 40844 35955 23455
16660 23455 12589 -3382 1159 -22559 -38866 -19902 14303 41508 42980 30688 35508 37686
16648 37686 43638 64469 61286 34979 27443 35514 35743 39210 43818 40496 25391 2441 5570 9948
16634 9948 18530 14193 9917 -4049 -26425 -20194 25720 53713 44302 38848 14911 1029 -10570
16621 -10570 -19280 -2803 9754 4173 15165 9451 9353 13015 21564 7502 5575 5760 9462 23483
16607 23483 22774 25989 46458 58402 50436 44692 43278 48957 52431 47997 50973 38247 25108 23298
16593 23298 24062 27180 23456 31612 64823 43150 15171 13562 36719 33952 42830 53158 75082
16580 75082 42546 10457 3392 26424 27863 38658 55435 63289 62837 41169 26492 -7987 -12056
16567 -12056 -8985 3186 -9077 3475 46047 70970 79407 50890 30967 33006 35326 54284
16555 54284 55491 29382 25778 54666 56536 47731 57389 70064 73282 46848 26138 9436 8372
16542 8372 -15537 -30023 -13135 2850 12771 26326 33806 56371 56116 44360 24312 2442 -25108
16529 -25108 -23283 -22421 -1812 12032 9803 -3572 17107 40654 74024 45557 23425 9050
16517 9050 16413 -726 -5097 5464 7737 8793 26622 38747 53781 47567 23804 -22888 -44753
16504 -44753 -32252 -6702 44291 47861 34334 34383 28990 44000 29793 17427 -9782 -25024 -11069
16491 -11069 -216 -2932 -25321 -3777 23757 29704 18001 23496 53228 28026 18387 -9522
16479 -9522 -50557 -49031 -40192 -33944 -37224 -45854 -62561 -48893 -37370 -41186 -39584 -5232 20032
16466 20032 41042 36975 16682 15556 11857 -7611 8571 24784 17839 13082 1657 21324 24411
16453 24411 36740 18111 -28581 -48207 -19805 -17126 8615 16638 4105 -845 -11159 -19856
16441 -19856 -42789 -53920 -41687 -34259 -24951 -26032 -6330 -2418 -14046 -24011 -17839 -10042 8161
16428 8161 4141 -28579 532 51544 25851 2312 -18967 -16129 -21040 -22619 -14070 -15147 -26557
16415 -26557 3361 11521 -10083 5055 -566 -11651 -35511 -40574 -37423 -52240 -47787 -8174 -1739
16402 -1739 -3214 8413 21846 4916 17329 38670 5392 -8646 15026 42097 53414 5003
16390 5003 -4229 -26919 -31982 -18007 -30553 -29540 4410 3831 -10159 -8487 6647 22963 36880
16377 36880 58442 26626 -19106 -31535 -16890 -15180 2741 16905 1290 -46681 -45578 -27046
16365 -27046 1910 29818 33121 29051 42942 43426 22871 -13954 -8198 -8737 -10289 -1966 -2529 -13133
16351 -13133 2483 27711 13018 -7603 15941 26203 21591 11485 -8275 9159 10393 22063
16339 22063 43834 30158 5824 -18350 -24758 -29768 -12469 -5453 18476 28178 12827 -19010
16327 -19010 -39609 -17143 8932 11194 5366 6444 -24853 -35572 -12829 3287 -5036 16390
16315 16390 27521 16418 27785 11053 -20594 -16342 -6481 11041 18481 -5880 -20054 -30762
16303 -30762 -51820 -38425 -9461 -15172 10571 36129 30683 27138 28736 37010 18144 4192 -2721
16290 -2721 -14906 -21273 -16446 -11700 -13556 13728 21964 -4085 -25678 -30977 -42314 -54973 -39171
16277 -39171 -16529 -1984 -16123 58 28856 -1754 -7714 -2815 27487 25596 22579 32562 19768
16264 19768 12833 4577 3269 11474 4768 24043 13771 -6885 -6677 4613 6923 15120 32274
16251 32274 27043 15813 -9223 -27120 -28821 -16114 -20552 -22853 -2996 1146 11603 32518 23397
16238 23397 -2976 -3640 -13246 -26729 -4685 15798 7185 -5363 -1501 -17995 -15605 -10358 -14993
16225 -14993 -49218 -40406 -23091 -18033 6433 22055 26495 21678 -15312 -62618 -58361 -32879 -2953
16212 -2953 12724 33590 32921 34569 -516 -7054 -12872 -12475 -21668 -6033 -8967 -7812 -15343 -9959
16198 -9959 26959 59040 38967 35732 47846 40194 8437 -8351 -30354 -26446 -11544 7209
16186 7209 -12149 -24603 13477 18720 -5851 -22160 -27197 -35347 -4927 -1290 -13302 -5362 4877
16173 4877 29687 50240 49660 46234 13161 -2869 -29601 -48222 -27411 -5038 6004 11679 1742
16160 1742 -16275 -25428 2162 -956 -12359 4176 -11756 -13561 -1645 -15914 -8172 -26985 -20525
16147 -20525 -3325 28347 23411 16839 12765 20215 18791 29172 8261 -1079 -19777 -19217 -9548
16134 -9548 -12357 -6968 -1915 -2574 12024 5837 -3857 -1225 -896 -5811 39131 29524 -11398 -18601
16120 -18601 -26420 -31946 -42124 -14303 -320 -7754 -19046 -16406 705 6755 15764 -1550 12427
16107 12427 -23734 -5905 25229 -2992 -32052 19248 48275 40529 36407 38421 42476 22851
16095 22851 -319 2111 15084 20315 12050 40461 51817 76049 87750 78471 86175 42492 27098
16082 27098 43033 29145 45039 45156 13374 1679 34502 80084 88034 47927 32999 46753
16070 46753 43803 45762 35904 32117 29712 37737 28763 6007 29191 26723 30977 35896 40665 40221
16056 40221 42796 26152 11255 -27512 -36610 21564 42272 33202 40070 29652 6507 1211 5300
16043 5300 19287 -15576 -41603 -40729 -26601 13246 16330 11039 1531 -3606 -3890 8681 7760 6877
16029 6877 -2259 3037 21812 22291 14511 20144 48095 66312 66480 26025 11603 -3498 -9261 6231
16015 6231 34488 33794 37418 11279 13447 18286 -4901 -6632 8823 -1900 21638 27824 -3249
16002 -3249 2722 7589 -8048 9446 33787 45844 41656 -3544 -24420 -30049 -31067 -27337 -1390
15989 -1390 8991 31695 15593 2027 -26359 -10341 -12577 -21421 -10616 -12228 -13169 -4431 25447
15976 25447 30090 46757 31980 -1652 -13159 -17669 -33547 -36415 -54354 -55547 -60072 -47933 -39385
15963 -39385 -20118 -18337 -3197 -9037 -12118 -540 -843 6895 9145 -16953 -31304 -16311 -7142
15950 -7142 16597 25956 16110 13773 31841 9717 -40351 -73689 -65970 -44428 -51143 -32225 -1718
15937 -1718 -10143 -29543 -27977 6854 25415 14687 -17693 -25288 -16538 21038 44267 60803 34098
15924 34098 21510 28076 41517 48292 9130 15619 40212 51381 59096 41096 27697 -158
15912 -158 -32142 -19317 21196 20190 -1116 -6213 -10626 11046 31638 16799 10401 8110 5436
15899 5436 -2602 -4533 -5768 -7228 4507 22326 16636 11719 -5166 -16566 -648 11374 -1501
15886 -1501 -2696 20291 12926 -16151 -18830 6110 18177 -11602 -24934 -53486 -31433 -28169 -26092
15873 -26092 -15582 -779 31996 27822 12747 -107 -4437 10030 11339 -6324 -38446 -37277
15861 -37277 -30583 -10403 29285 44638 51554 37843 23497 12365 28576 31405 21957 -10301
15849 -10301 -31916 -16666 11261 2290 -26462 -23960 -12092 -33995 -41544 -30226 -13018 2315
15837 2315 13738 -1674 16004 40078 35204 11296 612 19640 33465 30582 45009 48708
15825 48708 52713 59959 56536 39356 -11857 -15392 7863 3411 741 32942 3911 -41695 -46806
15812 -46806 -30201 -21127 10033 9068 -13655 -11990 -1091 11735 18539 8385 16736 2198 11333
15799 11333 16692 2726 -11444 -48306 -34681 -23648 -22339 -13893 -12659 2026 5963 -12370 -28003
15786 -28003 -29540 -12075 -20344 -29262 -30902 -42190 -33030 -44814 -41071 -35275 -30169 -13036 -19810
15773 -19810 -26188 -44126 -88383 -80364 -75213 -88435 -84030 -41235 6360 19748 8776 -2849
15761 -2849 5734 4284 10073 4963 21523 10554 -4792 1383 -3045 -955 -4462 -12650 8836 -8235
15747 -8235 -10997 -19409 -50862 -35762 -31822 -5626 2672 -11900 -14602 -18402 -25255 -12312 -6569
15734 -6569 -8002 -7337 -18290 -30237 -6918 38364 35497 15483 12543 9137 13198 18737 -6144
15721 -6144 -28025 -34536 -22213 6288 7027 -7451 26369 23189 22987 19122 10829 -22386 -11147
15708 -11147 -3232 13422 -4126 -16540 -12010 -34478 -41258 -21287 -7453 -16836 -19269 -1250 32278
15695 32278 18319 -8454 -5067 21898 11985 12280 30384 28775 18151 1472 -19358 -9182 -7412
15682 -7412 -6927 -9205 -9458 -18237 -37982 -32077 -18386 -3339 17911 11087 9753 -9966 -22167 -27964
15668 -27964 -2232 11353 -12516 -21565 -17552 -17113 -35804 -47331 -1186 34416 17179 10182 -374
15655 -374 -9276 4140 -2134 -8442 7456 27321 -10778 -34069 -27133 -9483 -6199 15198 14544
15642 14544 -16384 -25468 -18478 3414 15524 12167 18082 4837 8769 17987 5981 -802 -22884
15629 -22884 -23459 -39422 -14210 2236 -17220 -7622 4140 1458 -3892 23226 36812 30030 7256
15616 7256 13591 16171 8610 1785 17398 46245 28960 7789 -7980 -7839 12638 2815 -2352
15603 -2352 -15617 8714 19580 25551 -6829 -8679 2770 32299 13085 4507 -11303 -10108 -592
15590 -592 -14212 36 -7402 -9975 7564 11703 45151 42304 72669 55485 21200 26985 39432
15577 39432 30739 23295 -14922 -33295 -15299 11251 10633 -6851 -40247 -56246 -30743 2868
15565 2868 11929 28998 44449 28029 39012 46654 28219 -3204 -39522 -12639 3060 10106
15553 10106 5092 -5358 -15326 -14562 -30017 -34860 -38396 -40048 -18572 -3268 6365 17033 38226
15540 38226 24651 -17028 -40651 -30431 -9516 4793 -17489 -42200 -20994 -4147 -9440 -22852
15528 -22852 -33300 -43263 -20738 3354 13858 13340 3826 -9444 -11994 1297 -7653 -22830 -64345
15515 -64345 -93032 -76734 -63880 -43888 -40393 -37298 -20864 -25312 -15989 -13350 -22921 1993 20267
15502 20267 -9353 -34721 -18673 -29141 -27019 -26419 -45000 -17147 160 7289 -21000 -32576
15490 -32576 -20854 -14154 -15526 -7988 -21665 -23993 -32611 -16775 16718 29730 32230 -6735 -18513
15477 -18513 -4204 5078 -25339 -44042 -47807 -36479 -5113 12533 9648 18302 20965 27656 19551
15464 19551 -3541 -7963 -11937 2685 21515 5200 -44944 -52266 -10034 12666 -4246 -22228
15452 -22228 -1251 9788 -18719 -38283 -33097 -30139 -17845 -26934 -36776 -25929 -9202 -6366 -21396
15439 -21396 -19605 -36357 -51914 -60869 -61601 -17880 -21544 -16235 22893 31858 40287 32213 -1785
15426 -1785 -11517 -13997 -24260 -28493 -41365 -20212 -4638 -26708 -24105 -8016 12985 35712 18884
15413 18884 -789 -21585 -10940 16935 14945 -27652 -26796 -25918 9450 28024 22252 38308 48459
15400 48459 43521 44776 16313 5241 -11398 518 7600 14312 15835 13453 3127 20459 -1902
15387 -1902 -30332 -51003 -46731 -23010 -9687 11715 7711 -7654 -1884 21905 41365 21963
15375 21963 -12780 -19128 -51088 -46073 -22215 -62 15262 -12003 -40724 -33834 -14586 1038
15363 1038 17238 31929 31949 9562 -322 -9248 -25370 17636 21511 -14124 -33189 -18203 18538
15350 18538 4792 -30292 -54398 -76955 -83194 -53239 -43132 -38281 -16690 -18095 -6794 10057
15338 10057 23639 32403 9028 -18622 -20791 -10553 19497 40994 20689 -2070 10043 20883
15326 20883 19989 12936 -4418 -23224 -38366 -17322 -619 7598 3704 -28295 -54433 -37635 5219
15313 5219 23845 25633 -12695 -67522 -64248 -43817 -49392 -53676 -39351 -30421 -42565 -19798 -28628
15300 -28628 -29860 -17495 -8721 12578 17178 21522 9305 3342 22142 37355 3170 -31934 -21343
15287 -21343 -3984 -24496 -24137 -3415 5649 -6460 5624 13276 -7039 -12609 -22550 -21656 -15271
15274 -15271 -12472 11100 -1405 -5141 10161 18335 19501 19194 15449 20678 28557 57240 51958 43520
15260 43520 60132 105731 81992 62562 55321 41202 39859 42072 15266 -4698 -33568 -23798
15248 -23798 -22372 -4656 14894 8757 -13829 -19321 -20547 -28474 -29173 -4237 -2334 31266 60314
15235 60314 38950 22871 21744 4501 3417 -11508 -22846 -13003 10180 33281 36342 13448
15223 13448 13033 20647 8773 -9157 -23841 -19798 -1794 27702 29583 13290 23026 42930 52402
15210 52402 39565 37643 25815 10855 4949 6751 -825 21427 54320 42812 25841 25596 7134
15197 7134 7375 15621 8727 9215 -27009 -6347 -25607 -24014 -38913 -52158 -34093 -38706 -38997 -24976
15183 -24976 -11691 -25947 -28794 -37977 -36333 -19585 630 -6466 -11343 5826 12301 15391 29494
15170 29494 24246 10743 1991 3381 20342 10918 8283 2844 -27548 -27899 -47439 -42368 -22082
15157 -22082 -15622 -28960 -50361 -25962 8986 50458 46480 35145 20349 23197 46112 17828
15145 17828 -540 -16718 -9750 9573 -19133 -37940 -26240 -16243 -5026 -13012 16487 22082
15133 22082 20127 3503 8544 10254 1325 21064 17997 3783 6198 19475 6829 -2710 -9892
15120 -9892 -6396 -8192 7659 8984 19146 30360 44778 7503 -31184 -20624 -16975 -35540 -24888
15107 -24888 -10082 -19712 -15793 11533 13268 41718 58749 38929 25105 14887 326 16815
15095 16815 19010 -22421 -52908 -31776 -15433 9140 27669 30814 5772 -37874 -39372 -41506
15083 -41506 -15438 -19316 -30656 -21532 -30287 -32749 -31475 -13298 7003 24809 35140 16054 -23982
15070 -23982 -31884 -25942 -41694 -30836 -4172 14132 25373 23376 27124 3248 -28958 -42582
15058 -42582 -51365 -24837 -482 -2037 2834 -16720 -32509 -54784 -53581 -28755 -15322 6238
15046 6238 5670 -22439 -3717 -3504 -26099 -12513 14048 10565 9011 10803 15137 27307 20823 -6741
15032 -6741 -15368 -11893 10457 19129 25324 14206 6373 -10572 -6889 12396 8990 3531 3927 26689
15018 26689 29714 622 -17592 -3977 16162 26229 38014 16681 -21034 -37065 -47204 -29124
15006 -29124 11314 16034 6527 37185 37003 29342 39094 44743 -1010 -11916 -19146 -15941 20111
14993 20111 27298 -12762 -24708 -10862 -3862 5780 4653 -28540 -10180 -10941 -43732 -38874 -7690
14980 -7690 7637 179 -34135 -45296 -49152 -24374 -18170 -28207 -12982 6387 -17327 -30945
14968 -30945 -52905 -31320 20993 33734 40490 1586 -14524 -25661 -18461 15491 26025 7160
14956 7160 15093 17820 -10425 -658 20718 8948 2499 -12504 -27962 -17213 17210 -3117 -39602
14943 -39602 -42906 -27273 -41264 -38912 -11177 -19817 -25148 -39966 -31784 -26741 -9472 18763 14565
14930 14565 16447 -648 -36633 -33894 -34748 3848 -247 -45088 -42657 -46348 -59311 -39301 -4517
14917 -4517 540 -16714 -29689 -34479 -54135 -43840 -23331 -10316 -746 10796 5571 14595 11573
14904 11573 -24866 -50773 -29784 -2133 7875 6364 22804 36410 28899 19677 -7164 -6895 -19127
14891 -19127 -23720 -16121 -24290 -25381 -14060 -35521 -22120 -22118 -27492 -18207 -9424 17746 22191 6405
14877 6405 -13895 -3875 14764 5491 8087 3274 -28269 -27888 -26394 -33477 -7989 -15340 -38017
14864 -38017 -22896 -10021 -31965 -26812 -14596 6193 960 10979 35842 23939 23445 39123
14852 39123 60340 95462 94687 79253 80800 100849 116254 127516 115116 82479 53279 59738
14840 59738 28929 10707 3196 18805 41544 33475 4031 -8003 -23041 -34470 -31755 -20970
14828 -20970 5061 25597 11667 -2026 -12621 3303 823 8825 13621 -9700 2058 24968
14816 24968 57639 31033 34873 39155 42161 49496 30202 20705 45171 24405 -8197 -9715 -10851
14803 -10851 -10308 -12010 -20654 -19100 -21834 -10721 -19150 -12496 1034 15523 -3225 6222 -16656
14790 -16656 -30892 -669 -4849 6538 30681 40993 52149 36441 27069 9443 -6780 -24094
14778 -24094 -31439 -42684 -41038 -24848 -28289 -16666 8746 2726 -13619 -27343 -15094 -8998 -28328
14765 -28328 -34401 -47669 -45806 -20447 2775 11961 -13710 1652 4546 -49789 -67961 -45094
14753 -45094 -13926 -30030 -28731 -30903 -17507 -31127 -34596 -28107 -5974 3759 -11050 -775 38088
14740 38088 30626 -4349 -25558 -31478 2167 10475 -13932 -9835 1463 5656 14082 29697 14929
14727 14929 2902 3625 18598 32058 7053 10273 27814 41647 37501 33170 44936 52947 17647
14714 17647 -24599 -42699 -27820 -31004 -42949 -44369 -14908 -7890 -12769 -13564 1112 12664 15341
14701 15341 -14505 -28709 -17030 6303 1462 -2106 835 -15331 -24 10694 9557 -6889
14689 -6889 444 46040 30911 22 -8452 -2223 -4922 1957 7309 -71 -23415 -25939 -33050 -17882
14675 -17882 -19296 -40807 -13092 31089 -5489 -37917 -44277 -34736 -30881 -9736 -1350 4316 22379
14662 22379 20569 12116 27335 8877 -7859 -16461 -14844 -5153 -831 -21568 -39833 -38973 -8971
14649 -8971 13679 11577 17885 -1443 4135 -4572 -1613 13643 -3820 11013 27373 24903 12738
14636 12738 13519 -14200 -35918 -25317 -13826 -15191 -46549 -46203 -41739 -38004 -21353 -24088 -14426
14623 -14426 -35210 -33314 -12006 394 7761 -5476 -12130 -5317 -18507 -12524 -25164 -31301 -25021
14610 -25021 -12928 -2232 -11463 -34081 -61786 -37664 -29209 -38579 -23800 -10680 -254 -38660
14598 -38660 -42282 -24751 -16181 -20288 -22394 -8522 -3478 -6386 11948 27345 53366 54734 29689
14585 29689 6751 -13647 -28536 -23571 -4433 19725 -8624 -7237 -17071 -32653 -29498 15671
14573 15671 36435 27641 16730 22904 23250 24354 25339 52630 92633 76041 61135 29558 5095
14560 5095 -1743 -4904 12352 34268 31495 26355 37010 48941 59175 61381 47117 21772 -9004
14547 -9004 -39089 -44544 -18996 -18050 -41803 -40755 -29706 -28409 -26808 -39363 -58055 -49780 -12218
14534 -12218 -5218 -55405 -73411 -42594 -8403 -5345 -32994 -32955 -30244 -26156 16456 26360 -7651
14521 -7651 -26461 -2419 10827 12921 6072 4928 -10273 -20513 -23125 -23362 -17343 -18916 -17187 -6065
14507 -6065 12376 50647 43478 31138 30150 11847 8794 21117 237 -4269 -8692 -29128 -30473
14494 -30473 -14286 -16203 -22972 5208 -8329 -4434 -5231 -31169 -21982 10835 -518 -16529 13427
14481 13427 39625 54708 35884 36170 29701 21233 17372 21095 3810 -19617 -37852 9927 50662
14468 50662 51983 52618 18372 1011 -2424 -9354 -16778 -26665 -28910 -14222 -25095 -18776 -13901 -7909
14454 -7909 -34538 -50844 -66420 -38365 -2772 29093 45321 46110 48072 62079 36316 13564
14442 13564 13861 -711 -22465 -10762 -8582 -7119 442 12084 20633 4708 -1849 12096 7454
14429 7454 7278 -8956 -14491 -97 -42619 -52847 -29278 -27769 -21340 -2039 8488 15828 -669
14416 -669 -12445 -50454 -53912 1345 11610 12152 5481 -602 16755 12487 -11252 -8995 -17253 -33711
14402 -33711 -38563 -16152 -25728 -45766 -63168 -34253 1088 12572 1453 17223 19064 5621
14390 5621 -1487 16898 35795 33481 29531 -3537 -12758 -13715 1597 2120 17464 38499 52647
14377 52647 42136 39671 45494 51409 63434 72135 75073 58825 42657 31045 15911 28169 9337
14364 9337 11280 5875 -23894 -19826 -30519 -26165 -25489 -27481 16610 58531 54757 33991 26081 13833
14350 13833 22962 22090 -19642 -25978 -31410 -33571 -43638 -55620 -23338 -33720 -33284 -25135 -19271 -15975
14336 -15975 -7651 -43600 -17283 -1813 -11118 -10665 -11237 -8189 -5890 4505 37376 32898 -5819
14323 -5819 -25675 -16313 -15451 -5741 -22543 -20465 -16371 -49306 -62995 -67473 -75825 -70358 -57219 -64977
14309 -64977 -40462 -39267 -31402 -30086 -47283 -73228 -106529 -122165 -78640 -38589 -40507 -30246
14297 -30246 -50510 -60495 -69987 -61748 -51870 -67194 -40974 -40596 -65020 -45738 -32087 -52582 -53958
14284 -53958 -44523 -24331 -13407 -27784 -31350 -21231 -53031 -38242 -27605 -45866 -73296 -60419
14272 -60419 -48591 -73979 -79022 -44612 -31249 -1412 -5900 -10077 -9342 -193 6550 -40277 -62428
14259 -62428 -53256 -58658 -46826 -53251 -55405 -67721 -33783 -24012 -18623 7532 -28494 -72108 -64726
14246 -64726 -29804 -23467 -15271 12821 7446 -17707 -44632 -29371 -25841 -16249 -5282 -13610 -41670
14233 -41670 -40402 -32227 -13952 -11089 1183 8656 -3220 12806 4311 -19031 -5724 -32031 -67823
14220 -67823 -66784 -59044 -53299 -40536 -38242 -47079 -39702 -4749 9809 30019 -3721 -4669 -7894
14207 -7894 -1968 -15865 23278 35125 40796 56494 67358 67846 86381 110441 130304 137719 154741
14194 154741 146304 141805 151783 106715 71635 75086 91835 51597 2238 6860 12455 18146 34578
14181 34578 61897 49904 53555 43964 54311 65054 98765 102486 91291 81376 96760 100908 73321
14168 73321 91013 75490 82581 92021 108746 123910 118227 141240 179168 167309 166151 183876
14156 183876 212278 209015 185280 184898 170706 157601 134141 127870 99603 40983 34726 36447 41133
14143 41133 74029 99520 85867 35248 23002 44493 66495 75703 57437 110 -44562 -39496
14131 -39496 -12088 27628 21080 -30931 -21820 -6704 -33446 -41890 -10162 -1936 8306 2711 -42777
14118 -42777 -55531 -23547 19151 49561 33366 42751 38843 -6907 -43832 -48743 -22519 4732
14106 4732 -222 -32123 -19734 11206 2926 15271 14761 8801 -7565 -18651 12553 29823 10271
14093 10271 -16663 -12800 -27791 -16429 -14575 -9439 -38757 -49474 -47761 -65292 -12268 56697
14081 56697 83406 97472 57196 68379 60862 44172 21747 14719 17119 35321 19460 -23375
14069 -23375 -7616 -19952 -41213 350 22502 5267 -19793 -41125 -24524 -19092 -13748 -20664
14057 -20664 -26167 -12689 -2515 -9643 -18649 -13685 -12796 -23358 -35418 -40414 -23413 -2634 -7725
14044 -7725 -4751 26050 15640 -10162 -6566 8955 20560 19463 -5849 -6753 -21185 -40490 -45886
14031 -45886 -50087 -54928 -52548 -54841 -71667 -86630 -74323 -41525 -17398 -14652 -12806 21881 20292
14018 20292 16236 -7277 -31476 -39714 -27004 -20695 -21261 -12594 -6881 -15825 -27974 -42025 -65441
14005 -65441 -75452 -64722 -57842 -32985 -23739 -24291 -59630 -80036 -51843 -49497 -60077 -45061 -18922
13992 -18922 680 -18730 -11323 11710 18910 13850 10123 -14339 -1016 -11526 12589 25430
13980 25430 -452 -29264 -61022 -63319 -83167 -71706 -31370 -41807 -42993 -11453 4235 34194
13968 34194 32115 17626 19199 49894 43483 27692 19993 12593 79413 114266 146132 138888 145398
13955 145398 167059 186655 177822 185433 168493 138922 122176 101185 80573 67244 46118 24551
13943 24551 19311 15009 10286 15006 8292 -5884 -8697 -20973 12263 29451 19442 3744 -1340
13930 -1340 858 -23193 -29146 3905 17276 14215 41363 36897 10139 -9786 8277 -2375 -24161
13917 -24161 -17169 -5568 -12800 -33566 -37917 -32376 -28606 -27316 5063 13162 13874 -27290 -57823
13904 -57823 -44534 -54756 -43590 -31502 -48291 -40845 -15558 -22363 -27369 -18747 7240 12229 -26410
13891 -26410 -35878 -25322 -27847 -35201 -69306 -106519 -85583 -64335 -84335 -75739 -75638 -65476 -47562
13878 -47562 -47401 -38854 -9077 -17610 -58508 -78053 -59531 -37412 -34080 -38651 -50745 -38153 -25645
13865 -25645 -2552 -14005 -46520 -26483 -4210 -4819 -16372 -5200 -16832 -3872 13616 -1880
13853 -1880 -4637 -15208 -15303 -33134 -48300 -14361 -6096 -8670 -26402 -26944 -50408 -52787 -7697 -3895
13839 -3895 -19834 -21270 -23392 -20040 -56695 -76023 -45363 -14779 -13990 -31649 -17315 -19874 -27293
13826 -27293 -14744 -2487 -3782 9029 6352 -29823 -23985 -3880 7506 -10212 -25446 -6230
13814 -6230 18046 11051 -5881 -27122 -26949 -38090 -38782 -23220 -11958 -45729 -66282 -45750 -15350
13801 -15350 9818 13079 30437 12385 -7862 -25620 -31491 -56137 -41578 -35364 -55620 -56174 -28213
13788 -28213 -17499 -5221 -7563 -30509 -46611 -65317 -37573 -42110 -35743 -12261 -2313 -9916 -29517
13775 -29517 -14148 -19503 -57117 -43943 -47102 -16295 27275 -1216 -23875 -38125 -58755 -70183
13763 -70183 -67970 -60352 -29322 -30072 -36295 -37104 -2588 21928 12429 -576 -25905 -60607 -63514
13750 -63514 -46075 -47710 -50898 -74580 -73788 -76083 -78146 -83086 -56511 -34516 -39782 -62690 -68225
13737 -68225 -56564 -53985 -62148 -36402 -19543 -4550 -33683 -5473 -4707 -16431 -20792 -16379 -6310
13724 -6310 22012 10140 -7388 -10895 -27365 -37945 -60517 -61923 -51663 -48740 -30007 -46986
13712 -46986 -58901 -55332 -53907 -51373 -65274 -67637 -79324 -74246 -68813 -70976 -87832 -82117 -86308
13699 -86308 -66045 -56416 -66854 -54465 -36998 -41821 -36475 -20836 -7429 6538 -17763 -25972
13687 -25972 -30215 -27274 -47428 -37954 -19002 3510 7748 -12037 -30783 -35409 -24048 -46707 -48428
13674 -48428 -18625 10481 3911 -2361 2621 -29281 -7576 20925 34573 21139 -10965 -23600
13662 -23600 -41641 -60847 -45838 -48102 -45123 -48735 -48913 -48205 -15124 -24496 -13157 6650 8771
13649 8771 14490 27 -5717 -27185 -28899 -32027 -58098 -60121 -47983 -54085 -25497 -21290 12620
13636 12620 5209 -52208 -75670 -70922 -41184 -36576 -32845 -20437 -31074 -53291 -71287 -48839
13624 -48839 -25370 -44506 -60740 -68511 -67979 -56599 -29437 -39868 -60277 -35985 -19338 -38489
13612 -38489 -69271 -55026 -49652 -44962 -47588 -55884 -70839 -79769 -86399 -94828 -82802 -65798 -79734
13599 -79734 -61757 -70633 -61083 -39236 -62710 -67697 -78813 -78221 -35126 -6134 -9541 -3654 -6783
13586 -6783 16499 11335 4110 -17271 8342 12055 -8432 -39993 -35589 -25732 -49167 -27413 -15184
13573 -15184 -19956 -17262 -20184 -11684 -6298 -15623 -26287 -26077 -17689 -28179 -38911 -52165 -54982 -62537
13559 -62537 -62971 -46933 -30650 -30176 -24525 -40514 -38614 -47902 -76274 -74077 -71161 -49061 -11976
13546 -11976 -7333 -43904 -31700 -19288 -20752 -35913 -25127 -29088 -46022 -56844 -59047 -58313 -53905
13533 -53905 -52725 -39519 -11354 5698 17437 22275 22779 14073 -2210 -20312 -15510 -11554 -22038
13520 -22038 -15706 -20663 -60523 -74289 -62286 -37150 3795 17046 15724 34578 40929 18483
13508 18483 -8312 -41866 -54879 -48509 -48622 -29904 -34445 -34111 -13787 -1078 -7144 -10946 -32155
13495 -32155 -16104 -2969 -24701 -13888 -18203 -3306 1738 -21027 -43227 -37551 -5976 24169
13483 24169 12781 9699 4715 -6772 -32414 -43835 -40752 -37590 -23296 3047 3118 -12792 -41785
13470 -41785 -85319 -74806 -36314 -48337 -53664 -29699 -42894 -25917 14101 -11331 -44934 -41714
13458 -41714 -27548 -3770 10925 25060 15630 -8265 -13129 -1183 -23261 -44004 -46999 -74260
13446 -74260 -101351 -111046 -110541 -86419 -57277 -26834 -41156 -60858 -71638 -72546 -44027 -27821 -32988
13433 -32988 -44836 -33953 -22960 -42090 -44668 -56354 -26963 -14900 -18478 -17960 -38403 -66799
13421 -66799 -73116 -74812 -83119 -65710 -58396 -53880 -51623 -62557 -56239 -62870 -74810 -47916 -43522
13408 -43522 -54637 -43423 -29255 -64160 -67591 -42627 -11968 -17179 -15110 -36758 -72761 -56433
13396 -56433 -25405 8341 -7226 -23394 -25876 -16674 -36833 -21976 -5255 -27699 -55224 -31797
13384 -31797 17972 3748 2015 1896 -26291 -28982 -27355 -34621 -34688 -35383 -24541 -4865 421 4653
13370 4653 -32293 -27397 -44285 -63307 -77408 -74018 -53690 -62738 -83287 -68035 -39175 -39669 -44717
13357 -44717 -51081 -65172 -45736 -21825 -11665 -30720 -38412 -50530 -25065 -34150 -65388 -74458
13345 -74458 -86058 -73283 -57724 -83445 -85827 -94568 -70156 -25750 -44188 -67211 -50720 -51043
13333 -51043 -44137 -52455 -37090 -33588 -20784 -3632 4528 8336 13778 39439 42938 33331 14822
13320 14822 -15351 -7061 -1092 -11710 -15166 -34116 -36404 -59835 -72480 -54075 -64427 -58849 -32176
13307 -32176 -27160 -32733 -62284 -72725 -30178 -4676 -3387 12572 24204 9790 -4582 2522
13295 2522 3101 22660 -5455 22205 52336 61151 36273 1818 -26941 -18513 9612 46007 48746
13282 48746 26503 7000 15108 9716 -7681 10977 39364 45340 52280 43020 41869 54998 55554
13269 55554 35596 25690 9130 -101 26114 24288 20714 -13434 4065 33746 50797 49223 39178
13256 39178 39264 65482 77326 66992 31009 3547 -9925 -7018 16044 23562 33564 40036 32773
13243 32773 61396 55720 38175 -380 -3923 13797 29896 38913 55879 55035 70105 84386 60405
13230 60405 7138 -3071 -4837 -44011 -39712 -25343 -30542 6908 47472 53799 46903 48991 43458
13217 43458 34404 19638 -27066 -62078 -70353 -41728 -39375 -18263 4487 -24744 -42047 -30412
13205 -30412 -33237 -26988 -21416 -2346 -5390 -25640 -25538 -13553 4535 -14094 -12668 -1170 15997
13192 15997 -4872 5199 31112 34731 49207 25630 1971 -8471 -1881 -11584 -20324 -34147
13180 -34147 -17941 -21001 -24972 -17865 7490 7085 11233 7341 -10139 -12523 -15598 -20750 -6969 -16083
13166 -16083 -40377 -49546 -39349 -28383 10263 24245 264 -15681 -12232 10015 -6056 -26816
13154 -26816 -39629 -48912 -23077 -6017 -24310 -39677 -26574 -39887 -47012 -39149 -22228 -37914
13142 -37914 -27654 11183 19805 -13076 -23522 -46562 -56986 -70041 -46815 -20870 -25161 -18242
13130 -18242 -43452 -23012 12466 -6550 -25691 -29476 2166 -4925 -24245 -45853 -31303 -18394
13118 -18394 -22424 -17065 -22312 -26729 -11062 -7154 3997 21854 -292 -25400 -37074 -32838 2481
13105 2481 -5085 -36326 -42912 -39787 -34853 -18356 -13336 -3 -11622 -35197 -41436 -17474 3741
13092 3741 3782 -7993 -24792 -31914 -22298 -12618 -7129 -38367 -26697 270 -1805 2172 9828 -5512
13078 -5512 -29412 -7018 -6535 13869 37550 19853 16316 -8811 -25303 -2895 19947 18371 27236
13065 27236 16927 -4718 -19513 5047 25108 18712 7048 -4117 26125 25442 12122 21854
13053 21854 10369 14199 -11192 -36890 -23788 -15614 17 27321 19362 21233 16164 218 -11659
13040 -11659 -21893 -22491 -26599 -20111 -23367 -9675 -5675 5655 -15171 -5740 -2034 4272 -8532
13027 -8532 -16106 -41771 -22283 8622 27676 31725 49155 15429 -5719 -9559 7948 10425 -2712
13014 -2712 -2511 23660 22015 10197 4074 1153 8224 22664 48345 36432 -10027 -15082 -7141
13001 -7141 10485 26369 -1128 -22039 -30509 -32326 9884 26059 19358 21148 35275 11153 26911
12988 26911 62983 51075 23397 33581 48927 51268 63461 33104 9449 2407 -5443 20696
12976 20696 18959 7913 -5881 -2278 -16625 -46636 -50884 -32665 -13062 -13033 3582 -767 -28752
12963 -28752 -21077 -25464 -30232 -24501 -38424 -46475 -40965 -47128 -25003 -15875 -18387 -23981 -27147 -11287
12949 -11287 -1414 18556 20912 30061 36199 31078 39392 41671 51797 37556 18130 30964 30669
12936 30669 19909 2153 -11666 5782 27034 23816 -6216 -13502 -6587 5225 55359 85163
12924 85163 82084 52470 29762 13919 -13618 -46121 -57975 -69571 -59996 -60677 -62195 -70885 -58852
12911 -58852 -53534 -36095 -43375 -41376 -48278 -39280 -7577 16504 16104 17088 3942 9738 22198 43491
12897 43491 48364 21236 35164 41400 28350 901 -8504 -1500 -28733 -39437 -8897 27603
12885 27603 28181 14569 22304 6109 -1986 -797 7222 11063 17008 14882 22635 31100 11674 16514
12871 16514 -5321 -16350 -1002 16716 7120 -3287 -31566 -53947 -32673 -33181 -18050 -4511
12859 -4511 747 9875 1946 1180 457 9470 15906 64703 78657 48625 31326 17188 33917 39158
12845 39158 49646 67496 60169 67800 87348 80073 51160 15892 29857 24094 30370 42712 36105
12832 36105 46387 46922 46125 42272 62882 47982 39187 66175 41908 29667 42512 24787 3000
12819 3000 -9387 13924 64384 73591 38675 27692 16078 30117 36583 54724 56942 50685 37818
12806 37818 28800 13155 13665 12110 4759 1643 -823 954 1496 4883 6293 8179 41171 60707
12792 60707 67344 51050 53259 38715 21701 29848 16525 33736 46771 16928 10461 22813
12780 22813 14620 19499 366 -7801 12492 24467 15171 20273 9394 11969 13227 9398 -11572
12767 -11572 -24422 -11965 10720 50751 97224 94935 79678 29543 15516 -1563 346 -7253
12755 -7253 4243 29382 38624 51671 24686 -4679 6059 31665 33914 31818 55968 56611 60321
12742 60321 64091 54079 96917 122835 123915 81436 92314 108393 115709 71714 64229 82633
12730 82633 64255 47824 26621 30952 65540 103531 98111 91088 54505 61434 54851 68573 66969
12717 66969 68878 74021 87328 84231 95036 77777 60625 57456 53167 28148 7858 26201 62349
12704 62349 97030 107335 118888 82059 83647 113440 111169 99482 66777 60255 67934 81440
12692 81440 76304 70828 104377 130481 115760 89606 85072 93028 99381 104268 104629 134366 148833
12679 148833 127645 126150 122009 126061 94365 68658 62270 75795 80004 109110 117542 134026 162485
12666 162485 144427 117096 140714 156872 169825 170759 196077 195747 227228 237059 221745 224913 219220
12653 219220 243883 271539 272752 268625 263737 269429 268489 263372 259179 262691 258366 263565 237752 196490
12639 196490 186588 165528 136415 112664 150212 158808 142120 145648 175621 172552 166375 153607
12627 153607 122850 109095 113038 106166 106820 69827 51093 74536 81985 53141 107030 142622
12615 142622 119499 100127 91120 62176 70715 64607 67706 87148 69126 51195 68335 83461
12603 83461 78062 93302 108826 85427 55424 57947 91211 123036 147655 140872 127108 118292
12591 118292 117154 112400 88065 82295 107361 96436 89436 109595 120568 127304 107028 88210
12579 88210 99226 111883 105002 87993 99202 99950 86684 89581 78360 65653 86113 83724 68687
12566 68687 84770 92185 77730 77778 79419 69986 73835 87519 120047 101745 97177 102872 83789
12553 83789 63328 50773 64089 73844 91687 106346 108486 122226 119028 123228 99631 84970
12541 84970 70041 88339 103087 117849 103870 101699 69632 74532 113436 139217 144469 148382
12529 148382 142458 108513 105602 117030 140557 133989 107900 77728 53574 87631 98274 106030
12517 106030 105220 103461 125809 155994 107254 65538 55973 70876 90793 114364 106055 85073
12505 85073 92486 114569 143185 132652 149209 154292 131198 106210 127539 138117 134926 119546
12493 119546 119882 126235 139900 115865 97353 105820 112915 113209 113534 108137 92134 100588 141616 131159
12479 131159 137009 153206 145639 142776 125288 90187 77777 88414 110043 125147 125733 101268
12467 101268 92442 79195 59566 75647 73871 72970 92726 113468 104610 80046 81334 88621 84140
12454 84140 100004 129836 97215 76020 87417 98399 104932 102194 119105 126120 163038 255324
12442 255324 365830 425289 480290 556814 636692 706816 753122 775521 759947 715956 642153
12431 642153 592221 568099 543655 537511 503823 470089 437599 395156 378314 374568 377313 337317
12419 337317 323424 308144 303819 341527 418925 483771 543595 590416 620714 676151 723392 719363
12407 719363 730070 752442 774403 807712 851547 950689 1029141 1130228 1248817 1359263 1488434
12396 1488434 1616083 1713896 1747028 1750938 1790608 1792241 1741838 1694216 1619525 1522037 1419889
12385 1419889 1333198 1246408 1119707 1024255 965272 910668 901376 910585 904595 895376 913111 992080
12373 992080 1111135 1240014 1408424 1554339 1660650 1725261 1736415 1663188 1553166 1445631
12363 1445631 1331583 1205918 1114962 1048210 1005671 987825 1023192 1090734 1149724 1227864 1316029
12352 1316029 1427700 1499614 1537729 1539318 1515239 1441457 1359510 1267336 1146146 1025330 917033
12341 917033 855682 806831 745289 709585 729114 724390 705169 674438 670796 693365 716694 764135
12329 764135 799281 808658 797884 807084 850347 833670 759201 676103 611065 571455 511548 499248
12317 499248 495075 474160 456277 439104 409158 376312 340120 302544 301961 277305 266042 261093
12305 261093 266294 274770 304163 289377 247724 241836 224871 227181 230517 233916 262163 257164 236547
12292 236547 233094 198773 185395 175899 213813 214523 209725 205929 195577 171215 143390 133020 135137
12279 135137 120157 145116 185532 245388 316142 395968 454762 512512 555734 552950 514482 463445
12267 463445 414875 375916 341732 277853 253954 247029 236503 240345 241504 222603 207833 206194
12255 206194 197168 201398 184335 173920 189341 206059 191262 189529 177727 177937 164523 138747
12243 138747 151508 123339 83111 75587 81819 108849 127934 137011 124134 98493 73634 91170
12231 91170 104402 112013 103522 139678 153841 134600 123090 157159 199438 229923 229256 225574 205703
12218 205703 199646 171331 134878 115679 145954 159927 174902 189087 182069 158674 154746 170102
12206 170102 160156 165966 153190 112261 96268 72610 86392 139193 126999 99296 113073 126523
12194 126523 112152 132669 120460 101712 99687 101830 140636 152294 164078 176054 191069 184021
12182 184021 181577 206652 204477 189494 200060 206636 204270 201548 178324 164390 159294 164099 187415
12169 187415 226536 213697 186640 177684 164362 188664 219114 221449 193282 168103 157415 196091
12157 196091 230555 222158 207149 182638 167914 156830 131695 119779 117008 116690 114647 120136 112373
12144 112373 121222 133665 138893 134399 142377 136823 146769 164285 158635 174129 172278 134397 115993
12131 115993 121239 115721 125965 116895 97918 86933 57053 74256 103470 120516 128524 138190
12119 138190 157979 178872 200382 214398 235336 212116 197730 128239 91253 120582 147672
12108 147672 125219 130609 138676 115741 120332 134521 123963 140465 163421 186736 199535 211120
12096 211120 237390 248656 245789 243551 268022 274660 289173 283961 280738 306110 323491 318082 318870
12083 318870 348284 362761 368555 404481 424255 441912 477492 506941 508272 507128 508140 545747
12071 545747 558730 554783 554924 585132 574460 552100 543398 563793 599121 619521 623653 681542
12059 681542 755754 788341 853289 926831 986033 1009335 1040753 1083989 1125307 1134941 1128044 1154284
12047 1154284 1207448 1253885 1323005 1421094 1546712 1690968 1851270 1984863 2158249 2309954
12037 2309954 2403863 2456991 2496784 2546123 2584489 2621845 2625634 2612908 2598273 2569644 2570424 2570728
12025 2570728 2615881 2661757 2716275 2765556 2787512 2787471 2760929 2739037 2719499 2688855 2640326 2553324
12013 2553324 2494418 2463929 2436967 2423673 2456360 2506202 2590417 2685940 2794477 2962175 3194099
12002 3194099 3495118 3909289 4350784 4811009 5344413 5894643 6440793 6945981 7446908
11993 7446908 7963678 8548829 9181300 9883256 10673590 11492187 12300847 13070932 13748225
11984 13748225 14297923 14773405 15210192 15684089 16263203 17121604 18469732 20542675 23636192
11975 23636192 28127636 34433416 42716019 52902776 64515862 76286202 86411153
11968 86411153 93376843 96629387 96279765 92646053 86289707 78538924 71070090 65085261
11960 65085261 61101990 59157455 58984157 60211014 62377089 65053491 67836370 70341282
11952 70341282 72362924 73955819 75238536 76286252 77371719 78815691 80915245 83647424
11944 83647424 86696793 89515440 91701493 93010238 93373265 92924150 92092104 91463121 91757852
11935 91757852 93579963 97782909 105702631 118844438 138610838 165498098 197665976
11928 197665976 230277962 257005815 273578878 279268246 274579501 259337579 234801858
11921 234801858 205659668 177818136 155123804 138620865 127750499 121322289 118023687
11914 118023687 116744053 116667503 116920166 116841485 115948729 114050987 111307224 107961723 104428703
11905 104428703 101224681 98710783 96917641 95559199 94238054 92696690 90889897 88815564
11897 88815564 86438937 83912856 81558960 79726452 78691349 78818553 80623564 84605304
11889 84605304 90927449 99298332 108605428 117062115 122932757 125153034 123447296 117825337
11881 117825337 108575328 96852667 84511243 73182943 63726280 56351095 50853771
11874 50853771 46844558 43947253 41859831 40289609 39005192 37888625 36849988 35785337
11866 35785337 34654950 33415291 32098275 30726376 29351482 28020603 26769534 25638549
11858 25638549 24631801 23719316 22858975 22063901 21278119 20477941 19664295 18804631 17961216
11849 17961216 17140395 16397013 15694191 14995270 14364031 13799771 13310274 12851500 12444266
11840 12444266 12099497 11783676 11525103 11350483 11213511 11066904 10944137 10783953 10596945
11831 10596945 10380156 10145031 9886328 9579102 9283424 9046157 8834673 8669413 8553806
11822 8553806 8492478 8426124 8386903 8351235 8314848 8228199 8136020 8049968 7948493 7804671 7604870
11811 7604870 7349380 7096360 6799816 6464849 6180231 5902427 5637140 5369060 5138502
11802 5138502 4938520 4755748 4603458 4478742 4398194 4313009 4244097 4209440 4208843 4221811 4198657
11791 4198657 4190762 4121114 4008477 3871919 3709941 3514609 3316310 3148586 3027702 2942517
11781 2942517 2897268 2844144 2796636 2761845 2688782 2629003 2599610 2547717 2478790 2431992 2387129
11770 2387129 2321101 2239306 2194568 2139369 2091169 2040590 2010606 2003917 1995148 1964236 1923005 1883936
11758 1883936 1876440 1856488 1827555 1775196 1746681 1753803 1774358 1788813 1828043 1837570 1811001 1787707
11746 1787707 1723944 1652800 1559659 1480915 1406269 1378148 1353052 1300651 1259012 1224755 1226688
11735 1226688 1207419 1191515 1212043 1229170 1221728 1207055 1183337 1149944 1150616 1168784 1215071 1220852
11723 1220852 1177069 1142247 1134473 1091902 1076662 1105190 1098243 1100519 1064637 1019944 1012688 1024775
11711 1024775 1014301 1004989 975152 944947 927135 900128 889174 882776 874174 879370 872697 881007
11699 881007 896286 890817 858106 846021 844928 856692 856603 872364 859918 863229 900416 919872 935415
11686 935415 957941 986374 1009330 1009246 993021 995960 991900 973987 937813 890430 887619 865335 889222
11673 889222 960416 993452 982855 953808 952148 970165 991411 1028089 1076130 1089431 1118344 1172304
11661 1172304 1185490 1190914 1210941 1205897 1215794 1233599 1256885 1269930 1253101 1228906 1212715 1216282
11649 1216282 1229860 1274057 1321577 1350942 1350060 1379565 1429017 1472521 1481170 1438525 1419404 1415803
11637 1415803 1408176 1421169 1421647 1412963 1409145 1400388 1398052 1392316 1395351 1435167 1482778 1525451 1575498
11624 1575498 1652189 1707014 1750048 1817321 1864733 1909708 1918229 1913223 1911441 1877668 1827516 1758852
11612 1758852 1691497 1646830 1618493 1569099 1538621 1514501 1498321 1446404 1447800 1437377 1421674
11601 1421674 1410582 1362609 1327377 1299770 1272594 1265863 1229039 1169875 1151583 1142310 1106237 1057439
11589 1057439 1054592 1059113 1050078 1027840 1011368 1020680 1027364 1034215 1028180 1015678 1028176 1032415 1028395
11576 1028395 1020721 979220 927402 905702 867247 857017 815194 770864 743790 706729 681607
11565 681607 658897 627478 567023 541871 541391 559908 521854 469605 470271 469898 458021 429463 467036
11552 467036 498323 500214 496269 462763 466425 455925 444115 435619 441505 455979 454944 431719 414260
11539 414260 429985 426407 400836 410464 416397 426943 452821 433257 386033 371746 382122 388525
11527 388525 422657 438173 448941 461047 467144 531076 592700 632361 691448 732650 767602 770757
11515 770757 716959 687949 673556 620747 596133 591182 578144 563206 551084 547990 536372 520100
11503 520100 553036 547507 554126 562472 568557 593748 612225 638548 640987 667391 699330 728182
11491 728182 731842 722798 698096 699399 684147 677242 694622 728441 751996 809428 935201 1067282
11479 1067282 1205350 1324639 1456047 1577332 1650178 1625766 1563348 1437209 1303253 1190452
11469 1190452 1087117 955719 879008 826695 759641 670267 647693 664239 662269 649148 657889
11458 657889 640813 625017 645867 669028 690197 663143 648893 643304 665488 642314 635720 625095
11446 625095 637945 646593 697341 704922 695495 679710 676566 707682 743814 795808 827094 834541
11434 834541 797807 799686 799836 743659 662740 613360 578783 525697 484072 464467 444642 443500
11422 443500 446761 422607 399936 379479 376363 350738 341202 348967 355108 336842 326145 296254
11410 296254 256570 255759 242945 252030 276662 253313 256660 280666 278019 248262 242390 245430 209602
11397 209602 174702 207811 204289 218869 246913 246823 211175 216439 230518 244532 249987 233105 240497
11384 240497 260136 265822 263390 257580 250700 271372 278106 274518 269607 252101 250334 264955 244041
11371 244041 237963 260829 292987 278002 255266 248597 229983 236771 242878 229931 242243 267505
11359 267505 276912 286868 331954 368441 448817 535132 642271 777636 914217 1048297 1204593
11348 1204593 1298659 1343157 1329010 1257009 1110558 982401 876918 733655 613451 525730
11338 525730 478050 460617 423799 382905 354962 342165 351839 350502 317462 286788 280552 289271
11326 289271 259258 258605 233631 198828 231092 276436 293703 293679 272801 253072 290361 299378 319162
11313 319162 362553 381102 366689 344932 300816 247741 274568 265166 246373 245489 221492 210799
11301 210799 206029 187903 178278 184882 185688 197346 195028 183625 183580 200975 217277 214029 212999 188919
11287 188919 182935 167797 167070 175048 181893 162808 140726 149179 154804 118097 92994 109163 118697
11274 118697 114098 132998 140996 164479 179660 163612 175623 184541 182293 163724 157750 174933
11262 174933 181073 186238 169116 149544 131673 125720 120593 100533 103263 103857 99114 110295 106561
11249 106561 106533 131022 123499 90702 99529 111939 103429 111145 111389 81046 82855 109330 140779
11236 140779 143092 143550 117014 119892 129505 113828 92052 89270 89076 92682 88631 99803 112800
11223 112800 113354 137693 124312 138866 119004 78313 98324 127130 141746 156157 133448 124638
11211 124638 134437 132736 108144 85744 73080 79736 80901 75202 86174 86181 94355 97029 105758 129087
11197 129087 130550 118491 116414 129660 126363 120477 122055 116360 104118 116765 151318 129898 121859
11184 121859 143574 126341 118947 128666 132761 133079 105402 117384 124465 138545 140644 154710 150568
11171 150568 167029 178635 156135 148574 152254 142169 120186 131119 151140 176904 193082 180359
11159 180359 141116 80423 57115 42996 50709 85029 102020 130024 152714 170597 159130 124313
11147 124313 125669 135847 136906 119943 106924 117543 121465 96148 80028 96304 104853 96623
11135 96623 114903 99256 83999 86976 89345 78879 101343 102140 106791 137015 182016 199902 192462
11122 192462 195087 200851 198346 227070 252952 281451 326828 425241 530047 701932 926355
11111 926355 1215315 1483760 1733497 2052707 2506221 2907104 3090420 3090000 3085548 3149752 3149674
11100 3149674 2911194 2549511 2188236 1932521 1715127 1450086 1173936 984986 858788
11091 858788 757456 688932 641629 608438 537760 496295 482944 477066 462563 471571 478656 453895
11079 453895 449276 451434 403368 363512 374930 404479 398133 360595 352924 346363 328116 337673 348704
11066 348704 350713 319121 283000 253316 294602 323152 303456 298253 281319 276818 275335 281642
11054 281642 295979 298115 294444 291334 303234 294654 266443 264135 270474 295641 265787 230187 207241
11041 207241 235007 244782 238213 228445 233460 213011 215848 230254 254827 237773 219473 227419 233962
11028 233962 240309 233256 219130 212927 208833 234845 255213 265217 258035 244362 227582 229072 225160
11015 225160 227299 248690 262056 270104 262468 244801 186850 175719 184018 183064 197725 216233 234379
11002 234379 260388 266286 276616 239321 253166 239886 205272 166557 174665 209886 205709 191338
10990 191338 210997 212634 213139 181726 191984 164123 150300 179259 207090 178590 167898 171830
10978 171830 168622 192372 178192 172196 224334 232421 216407 206545 226044 193313 193211 206051 223922
10965 223922 260045 239139 221789 206311 219739 242147 240906 225097 207343 207627 206016 220945
10953 220945 220880 217775 221657 217744 213841 228502 220005 233177 213571 168031 167364 178729 186606 221749
10939 221749 220344 193783 203958 216670 247077 262694 247027 266331 283289 301698 271681 285270
10927 285270 309210 322437 316082 314426 314804 340815 336702 318156 355685 393551 370564 354064
10915 354064 341216 353967 351275 340297 371930 407977 425011 448026 498181 545453 617061 739500
10903 739500 904746 1090654 1295689 1524652 1691155 1866311 1968647 1980364 1867395 1726337
10893 1726337 1533183 1317581 1097851 897615 764609 671262 619129 578614 555063 529806
10883 529806 500764 519055 520744 504821 488139 476405 474200 470581 428042 418342 431629 436559
10871 436559 438771 432491 408539 421003 440662 460665 466823 454739 443166 433238 422643 420268
10859 420268 398270 384252 385426 376679 351293 360393 358387 357124 368828 380914 354443 358346 354222
10846 354222 346060 329185 315173 299371 284092 303473 333384 322645 297302 312137 319457 314562
10834 314562 338594 365147 369572 361721 359562 350342 330922 303603 324958 335806 333061 355287
10822 355287 364443 374924 369914 371146 366690 341539 363277 375199 363606 348825 344418 332472
10810 332472 332368 331606 348661 367200 338137 330062 335539 329634 310236 296225 317809 321879 309340
10797 309340 311352 322801 334447 344178 315946 282774 279294 295530 290347 293651 312075 309563 323073
10784 323073 315885 312243 293938 281682 291321 284024 269956 271097 263436 268130 253665 225762 240871
10771 240871 267497 280476 270551 254847 256343 276802 283791 277595 274997 253527 261495 265389 266549
10758 266549 241512 228161 216453 220502 245493 237166 233714 277839 286292 290922 272534 251156
10746 251156 233786 255321 270127 247189 219512 209868 212490 215399 216018 213657 198415 203520 215233
10733 215233 218512 260840 252997 252265 243342 237643 249776 249410 242346 258614 290214 294392 266354
10720 266354 261955 259419 254365 243921 224257 214515 219258 205914 195882 211202 236841 242489 234190
10707 234190 209962 224051 234027 236307 227556 244286 232869 206223 201079 212895 247008 266864
10695 266864 255285 237766 241948 238970 211091 236320 239451 216635 221311 209959 171785 143022
10683 143022 158351 157416 173908 209677 224047 227963 216100 210210 235156 263569 252483 212811
10671 212811 212380 219201 210502 189767 204341 206588 177824 168651 191843 178067 159060 189663 184055
10658 184055 173376 205115 232923 190460 182081 202239 205975 182798 203101 206613 180781 179858
10646 179858 165346 135239 137706 121950 146421 179953 181570 158802 163906 178796 182285 173660
10634 173660 154899 161976 187117 193269 162381 106350 106788 114986 126352 107724 88806 98678 70383
10621 70383 47402 70744 66701 50732 94647 134136 130688 114988 104844 112329 87286 84592
10609 84592 113079 134722 126694 108680 101981 105535 108999 102096 108732 124679 110084 104686 121520
10596 121520 103008 104043 96699 102912 115240 113467 132008 120334 117911 106724 89712 71804
10584 71804 42365 58130 89933 79814 58491 54719 70638 85199 77278 77963 102150 107285 98142
10571 98142 74957 61988 67492 66301 70891 77266 59759 32137 41112 79629 122845 159590 162681
10558 162681 153838 140112 139961 128227 98591 82599 60615 81274 85352 104388 105682 104139 110956
10545 110956 105996 68558 71406 78426 96345 104651 83666 51798 32924 49421 92228 99840
10533 99840 83611 91210 87656 119209 120364 87517 77665 95291 101091 120339 124426 119100 129861
10520 129861 131674 112088 96198 81614 93735 115542 136398 172412 160994 117286 84236 93307
10508 93307 117838 128134 86500 82844 88153 83963 68005 73061 111763 138116 150220 166877
10496 166877 162273 106935 65356 90548 121551 124506 94729 96582 86334 92547 85474 84992 110529
10483 110529 102720 125001 147593 148253 157989 131096 127927 107757 81351 45506 62487 74641
10471 74641 104254 138682 144057 166466 194131 197386 195650 210689 209401 191161 188810 179115 153583
10458 153583 136537 138563 116449 110681 101153 95026 104442 129117 138964 150739 163271 182251 167414
10445 167414 177376 173108 166624 186238 166488 161945 173661 174086 184259 176706 151240 131962 135544
10432 135544 136474 142636 144067 158676 123605 137235 162770 153232 175801 207760 212943 222672 250284
10419 250284 269960 320203 337537 356824 402207 449839 446891 426315 413300 426371 487180 498380
10407 498380 472978 442162 421492 397751 353145 332720 338335 317749 241428 218546 225129 217685
10395 217685 176460 145508 139189 146120 170930 181736 188902 179689 206809 207301 193051 176225 192108
10382 192108 189551 175879 160767 184279 197242 190277 208826 253417 281134 293952 310254 342163
10370 342163 384764 438372 477425 520252 594261 658526 702644 742334 769141 764249 784455 762034
10358 762034 755155 749529 726640 709209 654815 574962 550417 484332 414747 367286 354914 356459
10346 356459 359772 338567 312092 256645 235762 260826 268607 292094 290624 292160 357784 409392
10334 409392 428167 419480 428146 450214 447141 419657 360509 331023 344040 317219 273387 269442
10322 269442 299188 311227 336477 359294 374939 397220 423166 491558 529463 558738 620489
10311 620489 658988 671903 692288 705668 716577 692144 665951 653801 611324 550624 466183
10300 466183 457074 442931 414364 392772 382497 357883 338058 303582 283186 270511 279159 302298
10288 302298 336794 365902 414173 477708 558109 627749 745471 825272 900437 1024820 1085845
10277 1085845 1106016 1071999 1013237 937371 873015 798714 709875 616168 521945 465979 419975
10266 419975 388976 359689 374939 357839 340816 364637 445648 475459 492413 499468 514427 546509
10254 546509 562104 570865 545263 537415 542899 528112 488706 460867 450418 437270 386181 362355
10242 362355 340568 342186 337530 279243 234428 224332 224454 217905 229273 212667 227018 235979 210745
10229 210745 214119 239961 236409 236430 256630 312895 357119 407517 465042 550574 646721 707511
10217 707511 777987 845052 902261 936855 963690 927483 861498 822365 785105 745055 716286
10206 716286 714516 686398 668207 641375 625971 567505 509752 467301 433270 427350 420736 413493
10194 413493 344036 307479 289342 267375 244009 260613 290493 354626 380202 399188 424413
10183 424413 440527 452101 488944 538907 605637 708863 840021 944001 1093118 1224690
10173 1224690 1323276 1393887 1421593 1391107 1312664 1193970 1085355 933611 792710 699894
10163 699894 624123 559797 508585 488620 451204 452901 428220 393540 371551 366022 365056 339141
10151 339141 324148 332406 329854 347884 340041 360696 351828 332074 323632 339769 347391 354240 386659
10138 386659 440443 494192 586640 667320 761958 894621 1004558 1104982 1158965 1160490 1121300
10127 1121300 1040936 943725 831872 755444 674333 573709 515536 456887 419033 388933 344252
10116 344252 346000 332987 314799 294491 268578 274651 269858 259832 266067 266079 269611 279425 286692
10103 286692 284220 289457 291614 317718 315542 317140 317151 303286 315880 350359 355267 388585 428563
10090 428563 459305 483639 507384 555070 534851 470002 427273 413826 368063 324659 348840
10079 348840 334902 309200 284116 257701 245014 231489 205300 219621 223170 252159 253517 248207
10067 248207 274928 275088 275708 246061 258767 271025 291245 303167 348781 393922 446435 508837
10055 508837 584858 658606 702803 769887 826669 870878 941622 1055995 1243449 1539099 2035512
10044 2035512 2972831 4668299 7145162 9805627 10941047 10522477 10419413 10599977 9270801
10035 9270801 6498358 4350152 3192703 2547913 2185809 1916535 1700048 1564758 1417370
10026 1417370 1309423 1237569 1173781 1110387 1082590 1078161 1041055 998584 965278 931397 898241
10015 898241 890480 895031 901114 918367 919557 911592 893732 875313 838589 832910 827810 830544 813342
10002 813342 781492 728656 685837 661383 636779 617072 587986 573651 564708 553078 566020 586337
9990 586337 583874 549807 534146 525451 520157 487677 453478 428583 401364 421088 415696 397896
9978 397896 372235 327339 303973 278638 285602 308913 318449 307569 325293 351357 368118 352162
9966 352162 355180 355148 372904 409848 417615 397204 403387 396700 379851 348879 300483 272181 278854
9953 278854 293296 282852 275827 326602 356517 367145 371855 345796 333110 342690 357278 351051
9941 351051 307561 269636 244303 235969 216178 205296 236827 224428 198684 210655 240770 266808
9929 266808 274928 308665 333789 351951 332219 327985 335396 345472 337607 336844 325674 337462 361466
9916 361466 366571 385099 385113 364293 374864 387897 380556 389691 437613 461491 492994 525216 548144
9903 548144 556263 546797 555704 594019 628030 616284 590320 565493 567945 606000 643013 700792
9891 700792 744653 781076 823394 874265 931198 982082 1053773 1107289 1122308 1165454 1215548 1209994
9879 1209994 1249529 1233885 1224450 1243924 1313497 1424913 1545660 1649306 1777874 1944827 2089459
9868 2089459 2222317 2365600 2496718 2697867 2902782 3123697 3340892 3541771 3702752 3821055
9858 3821055 3921507 3998582 3996443 3948817 3866895 3795374 3720858 3641708 3561360 3495819 3463148
9847 3463148 3449652 3548422 3741529 3965580 4282115 4670113 5218342 5917113 6682338 7443418
9837 7443418 8130316 8740753 9229489 9553748 9701307 9598161 9311957 8942803 8537077 8127347
9827 8127347 7729248 7348339 6992551 6712749 6541695 6439924 6421417 6451555 6498507 6621699
9817 6621699 6880678 7243799 7725818 8311754 8967509 9775270 10722820 11808628 13074023
9808 13074023 14715618 16904118 19871940 24011604 29632042 37048898 46536897 58248139
9800 58248139 71740587 85149423 95610046 101448207 103310529 101907320 96549817 87240469
9792 87240469 76433125 66654310 58980640 53623318 50551169 49666546 50932530 54234411
9784 54234411 59309687 65680479 72817068 80359460 87864896 94593313 100217252 105089930
9776 105089930 109306958 112173953 113361233 113202454 111804376 108909338 104921286 100522369
9768 100522369 96066523 91878739 88781687 87889155 89931409 95549950 105841252 122307938
9760 122307938 146366821 178344635 215112093 248838614 269932711 277054628 275384675
9753 275384675 265123530 241829516 208669772 175769429 149366611 130361970 117597387
9746 117597387 109692063 105450895 104088702 105210131 108327754 112558973 116983114 121227858
9738 121227858 125001634 127717221 129120566 129510999 128953777 126851549 122910531 117667568
9730 117667568 111380585 104076301 96085656 87977589 80316220 73810745 69075561 66371820
9722 66371820 65622387 66842020 70168731 75742155 83530348 93096152 103291443 111903385
9714 111903385 116636704 117036527 114151110 108221403 98665052 86557239 74560460 64399094
9706 64399094 56261676 49882903 44895166 41049531 38073536 35712670 33792353 32115963
9698 32115963 30661080 29304280 28050836 26907842 25862157 24901694 24018815 23238804 22532022
9689 22532022 21903136 21374046 20925795 20585478 20341599 20185321 20150664 20268694 20420940 20565192
9679 20565192 20712150 20782296 20703109 20434836 19914783 19152068 18284562 17335209 16331021 15343114
9669 15343114 14412137 13651677 13053622 12569417 12181362 11888347 11698148 11544774 11442215
9660 11442215 11383341 11327300 11292958 11199887 11098051 10995860 10906602 10852142 10752268 10573394 10418339
9649 10418339 10201676 9926419 9614550 9291723 9012677 8796624 8606734 8470290 8373796 8289100
9639 8289100 8210692 8118094 7994927 7857511 7672777 7425580 7131521 6850370 6581428 6329176
9629 6329176 6112038 5959682 5837644 5665953 5499631 5386119 5281706 5186007 5102388 4988857
9619 4988857 4854982 4752045 4680658 4569280 4451803 4310820 4170255 4038539 3900603 3781133
9609 3781133 3668876 3585014 3472775 3384625 3336362 3291220 3259526 3272810 3286499 3278384 3264989
9598 3264989 3264960 3327478 3391887 3407623 3426457 3428207 3403706 3372658 3347697 3304392 3243605 3163482
9586 3163482 3138451 3074509 2964263 2856622 2762041 2682871 2604289 2547790 2516223 2480761 2420649
9575 2420649 2347015 2289383 2234356 2221377 2181750 2115385 2068084 2028821 1992215 1983766 1965188 1951148
9563 1951148 1966061 1985764 1981461 1938465 1943364 1985179 2000109 2017532 2048533 2085733 2103771 2128540
9551 2128540 2148102 2205133 2242278 2245191 2223681 2184546 2164830 2139315 2117432 2065961 2026830 2019103
9539 2019103 2015972 2032174 2041125 2051224 2037730 2005739 1991509 1973206 1947299 1926203 1927402 1915456
9527 1915456 1902279 1903531 1886865 1896704 1897724 1884482 1885206 1878039 1879939 1871077 1883587 1870552 1858990
9514 1858990 1849553 1833891 1858173 1890508 1906080 1891284 1894464 1925514 1965181 1999263 1996918 1962618
9502 1962618 1932669 1912643 1917335 1929050 1910418 1887402 1881019 1879718 1865885 1859162 1871913 1837078
9490 1837078 1821822 1809641 1821611 1796901 1790594 1759913 1736973 1736218 1757762 1756771 1751603 1718617 1671112
9477 1671112 1652119 1677936 1663361 1664315 1660671 1625798 1605057 1606382 1607847 1579789 1585865 1600549 1576049
9464 1576049 1556371 1557097 1564573 1569091 1565525 1534663 1496574 1481108 1465808 1497506 1495211 1474415 1465264
9451 1465264 1447109 1457171 1458319 1427542 1384619 1361199 1351962 1355821 1325261 1283202 1289243 1283996
9439 1283996 1290555 1302421 1283310 1255980 1240899 1213188 1185627 1183044 1200473 1215736 1211405 1193331
9427 1193331 1207283 1241435 1237661 1229866 1242088 1264133 1291566 1324904 1332633 1378993 1404106 1386589
9415 1386589 1374500 1366319 1348754 1341052 1320643 1257403 1207562 1193876 1186007 1204113 1241457 1221224
9403 1221224 1173985 1142124 1127828 1114218 1108561 1104201 1121348 1140857 1107456 1087633 1088015 1093336
9391 1093336 1092123 1092381 1100519 1101071 1102680 1106449 1120733 1141579 1139219 1190158 1234194 1308728 1425382
9378 1425382 1562717 1666975 1735276 1817136 1856159 1873415 1864065 1796159 1724877 1608804 1500718
9367 1500718 1430888 1357227 1256369 1193693 1180032 1156656 1101418 1096582 1082992 1058741 1054817 1061005
9355 1061005 1064338 1063899 1065260 1051726 1016679 1020431 1028067 1004515 999392 1034692 1068408 1090380 1113661
9342 1113661 1108999 1105158 1141304 1246514 1373741 1510351 1659404 1785219 1923876 2062906
9332 2062906 2111124 2115465 2070705 1953748 1818176 1686517 1527335 1389734 1284229 1207174
9322 1207174 1160397 1105092 1062938 1039734 1000260 1018818 980555 940785 923770 896830 876375
9311 876375 855608 841952 863422 862555 861380 870131 878079 870265 872737 878351 857394 861941 911662
9298 911662 950969 992022 1046141 1117354 1201113 1256717 1313988 1366062 1382005 1384176 1365210 1312454
9286 1312454 1226536 1185959 1097555 1032496 981710 935484 883469 830893 805149 795494 762585 749169
9274 749169 770425 756687 729948 689509 664407 647544 633590 604205 618204 624226 635109 637530
9262 637530 624762 615039 613289 593850 611060 619134 614458 608830 643656 686191 691493 713797 711359
9249 711359 690481 698815 702184 702601 685819 675440 621453 594616 598567 595168 562779 535676 510453
9236 510453 505815 514132 498796 483957 489761 510429 498209 484397 491595 498200 494655 490322 482257
9223 482257 449700 436877 447373 452322 416697 391231 409044 435845 427835 433135 434889 421880
9211 421880 411319 371738 373927 373892 352995 369183 349374 364366 399058 405383 356574 324240 332293
9198 332293 335762 355453 359277 366959 391273 382221 382023 368969 345070 306439 267313 280771 315512
9185 315512 344388 338190 322071 300806 277103 284217 316997 328703 326436 317635 318864 304500 341855
9172 341855 344028 322583 321062 303063 269480 261035 244625 269354 289414 287821 291178 289126 250988
9159 250988 263058 278591 300342 298958 294244 283623 282074 281940 265068 252644 277627 283391 267682
9146 267682 259156 251443 221856 229079 225143 238271 264733 259367 243082 268989 267961 272516 275002
9133 275002 290045 264826 255785 242750 231395 266126 293673 285265 274966 300048 281467 273917
9121 273917 270528 282968 289873 274367 251802 253300 263162 256773 230599 214412 225740 241946 243730
9108 243730 243082 238430 236492 258354 244041 224049 196939 201763 204593 210810 206621 196062 194939
9095 194939 217151 217878 210348 189949 208969 225672 223562 231516 243507 216508 213704 236676 205108
9082 205108 167395 186428 195452 191652 213178 197220 189272 181783 167491 145533 157313 202706
9070 202706 201667 207148 193930 202024 213235 211393 191090 200751 190225 182029 192719 192365 198906
9057 198906 185932 177517 152597 172083 187990 181120 195027 190791 186189 174174 152783 169960
9045 169960 175189 144827 144212 168512 173499 162979 157162 168595 196427 212396 191251 178616 188905
9032 188905 205128 202372 211922 209521 187546 164704 168663 166180 159628 185464 189332 147530 146414
9019 146414 175690 167626 156749 150398 136312 133208 141105 148648 145641 145020 159357 157440 141509
9006 141509 151324 172755 163463 159223 159704 160226 165279 157562 140482 142036 185725 206133 201002 188652
8992 188652 161319 162090 161746 153765 158290 139817 119990 124957 164190 191107 192950 160875 162574
8979 162574 159484 174867 146717 131636 151584 197324 209220 173817 155790 145866 140457 155609
8967 155609 160839 168122 162597 150287 149561 146177 131753 92770 80892 94581 105733 98685 94259
8954 94259 109100 129603 147931 127113 91226 74713 85687 85434 106262 133279 129877 109846
8942 109846 123169 144418 154952 153461 129326 140230 167324 163694 165658 168565 163957 148023 109304
8929 109304 106312 124643 139316 142325 126278 126489 107523 81669 79431 103259 111282 119745 108608
8916 108608 114562 118805 118721 118188 129584 119899 130340 151854 146349 134908 115398 110791 78519 78600
8902 78600 90188 105496 133865 124841 112874 77576 69768 93134 61486 74568 73689 88382 72656
8889 72656 87086 98555 76881 60212 54190 35306 56267 77857 73844 64655 93572 124446
8877 124446 100045 100116 89356 69264 65690 107111 118679 112542 129745 123561 131683 124317 85657
8864 85657 80835 114101 118493 96903 80617 88789 122131 128278 95971 88942 111773 135645 125422
8851 125422 126191 136653 144570 153486 141029 135164 117759 129421 134153 100346 103092 113685 101405
8838 101405 86597 93889 90042 114397 123354 94935 43861 50237 65069 88884 94727 80411 64754
8825 64754 71402 88219 121381 157521 191405 164031 146184 130217 122862 97408 113574 126964
8813 126964 112879 107773 109482 130945 132880 136325 127468 123337 132531 152742 147612 112968 101626
8800 101626 111635 107823 121492 121361 107690 137541 163864 154281 145769 128360 113559 117263 95373
8787 95373 84150 83705 78622 112381 118749 94474 100581 125629 89561 75149 77992 86883 81180
8774 81180 52472 60757 68639 82897 95445 91619 85914 86142 77541 70835 95548 88245 73368 58107
8760 58107 63368 78819 63132 53605 67327 63180 84590 100362 110669 140287 122912 112630
8748 112630 109717 112148 120508 122160 134752 125691 118501 114507 106858 110322 137500 113883 89415
8735 89415 109519 123253 120522 100661 110670 125211 108544 94917 76934 73342 96322 124068
8723 124068 123021 130105 103566 65578 60438 35430 36596 52607 67206 68997 61369 71837 57039
8710 57039 63860 120080 128593 102929 108575 120733 105662 83814 94852 88336 87091 60645 72079
8697 72079 86564 103352 111557 105682 112134 127015 127300 117323 118872 97136 122304 131224 124370 136997
8683 136997 115678 109147 125666 107104 97549 112582 116591 103578 109627 139017 124234 86016
8671 86016 74267 90107 109419 113004 106296 89390 74595 68025 84460 97434 85735 58298
8659 58298 54596 96874 121226 79607 86842 85850 84391 71962 110750 111000 95386 81343 85789
8646 85789 118733 117164 114482 112760 91859 83756 78954 114535 130197 118629 124313 108985 86098
8633 86098 105988 91887 61453 72978 82816 103760 138608 124359 99377 110173 114747 95585
8621 95585 87008 61211 83554 106038 77176 76448 91997 122932 133497 152825 134456 117251
8609 117251 110867 116017 103740 114306 133247 116579 110429 112980 116834 135948 165346 164178 148165
8596 148165 162201 191518 194446 200773 213394 214558 184478 161574 147171 183771 182419 161008
8584 161008 163400 153694 154717 166457 142595 131520 146640 150284 124124 106302 115405 113159 88865
8571 88865 74933 99066 99815 82616 100201 153158 166454 145865 140251 86818 58032 54444 45875
8558 45875 26830 11581 36886 44083 53137 49822 63251 77332 60754 58845 92873 104196 110501
8545 110501 110793 110578 108835 125203 97315 88678 111243 122794 121044 104111 98206 94394 76054
8532 76054 49321 62729 75259 73780 65690 24644 25341 76078 88897 61391 56128 31848 50385
8519 50385 50933 36255 37011 60397 82974 83880 75384 72792 56978 47750 64328 97241 109000 82437
8505 82437 50957 80470 85088 82412 61327 62253 86704 97772 114944 109514 87381 67469 70056
8492 70056 108446 102612 81568 80825 59411 42501 43856 28587 49089 94492 94888 63153 55997
8479 55997 81442 76040 45372 58854 78131 58263 32754 32488 55300 52864 51846 35247 44704
8466 44704 49567 35903 52747 56243 34860 24453 24730 13633 -13040 -42710 -33957 -13657 20110
8453 20110 41060 49159 49536 37951 21527 11416 29055 35213 35147 28067 33539 47437 40649 55747
8439 55747 80472 64615 54393 49358 51704 49269 44019 46300 63558 68616 56741 55509 36635
8426 36635 26870 16325 18728 43067 41192 39901 25867 14846 -4042 -19558 19644 48157 30336
8413 30336 41378 47826 50997 54775 39287 56465 91466 108458 86613 64343 52800 84776
8401 84776 95469 71844 75354 90201 72983 85165 103977 60806 43015 52631 53646 47567 31336
8388 31336 14251 1193 -20894 -6295 7510 18163 55832 83316 77511 62546 37560 19712
8376 19712 38500 43814 43641 47096 54591 66196 58550 62769 55040 48825 45867 48475 61053 56202
8362 56202 40380 67157 102486 138917 129515 97976 71976 51885 42769 57739 53080 51277 70504
8349 70504 70682 53216 51890 40174 60509 69862 30069 22467 44394 48167 39529 41404 14792
8336 14792 20615 51267 47714 45986 44560 32907 31737 39250 32835 19137 30416 52285 51612 37074
8322 37074 30202 18231 24260 36202 50436 55379 69579 64807 54072 62752 37643 38997 34786
8309 34786 66153 78542 67574 46926 38976 10969 -1848 15881 13489 13274 16279 34202 33541
8296 33541 40700 50729 18842 41251 60222 36246 37521 25012 25543 -19601 -25340 2494 24338
8283 24338 3656 17354 16875 15321 20815 29852 33815 60300 68306 59100 50307 55753 78029 84442
8269 84442 79582 70650 25416 6269 -2795 35780 82903 80855 61321 46489 32778 -5562 2646
8256 2646 43500 48235 23534 4774 12646 16596 32942 41096 44044 37287 22131 14950 20940 -11546
8242 -11546 7215 22247 25068 43902 52777 63518 66410 66608 31111 -1543 16685 18080 6134
8229 6134 11573 3968 117 -4625 22435 43763 47724 48115 57137 43818 54164 64558 64613 83568
8215 83568 95136 59050 22014 19395 29258 27079 17900 28795 5799 9252 10432 20560 41308
8202 41308 51721 38756 9009 -10083 -14420 14070 36919 32405 26955 35402 51576 77566 57646
8189 57646 68682 53899 17056 44790 83662 98213 59348 2992 11696 556 -17374 -7022
8177 -7022 -9340 5275 43367 55476 57239 43646 21429 4268 29484 36816 5384 -523 8350
8164 8350 33686 7027 1350 21155 -4550 -28652 -14898 22108 47278 5623 -12954 -6835
8152 -6835 -21376 6103 35810 15292 -21998 -17353 -19387 -2529 26033 36 14023 25383
8140 25383 15422 35287 28390 23005 30162 26612 23042 5807 -6814 -1606 22917 43199 44368
8127 44368 34617 36829 44582 34655 35744 26000 4257 3758 -2419 -26728 2633 33388 46230 74494
8113 74494 78022 81969 83134 79695 83318 76007 54794 58419 51908 47073 50618 66590 84346 62652
8099 62652 30695 2372 20134 56222 67624 63379 59354 58835 42119 39981 67776 66854 57817
8086 57817 49680 42541 11402 -13343 -36164 -29004 -28090 -37763 -30337 -9666 -10343 -18646 241 35019
8072 35019 64551 80509 83128 68002 49797 42189 46135 84218 110648 102792 79396 66644 83997
8059 83997 72276 60349 54129 71070 90693 68941 76392 71601 60587 29223 8461 17211 32678
8046 32678 55526 35708 14358 34758 50269 52935 31464 21860 43890 58245 53503 45974 60020
8033 60020 71202 57401 22637 18170 64903 91464 76171 52267 64047 21741 -13416 -23321
8021 -23321 -4145 16206 20413 40351 58929 75186 73933 73973 70032 65364 56821 40920 29735
8008 29735 29051 9517 8732 13377 44557 74868 80788 79165 47910 62770 88083 80358 67364
7995 67364 84887 69418 51524 60347 53059 64275 61199 75791 60250 70156 64395 75903 99348
7982 99348 113459 87504 81914 69219 44148 12437 -2319 14278 51048 41242 24600 30772
7970 30772 27006 28226 43481 40976 13689 20522 37004 55589 71984 86330 86633 88440 58711
7957 58711 45608 59941 64765 55137 48235 33042 53732 23227 37441 54231 61994 43124 46803
7944 46803 53107 30677 14005 -11822 -14672 7873 12308 16499 35233 30811 10801 20468 35367
7931 35367 41696 25909 16523 22151 14333 -916 -5262 -13413 -834 -8611 -13463 -941 21459
7918 21459 34964 49139 29619 6688 7758 12830 -8389 -25133 -9802 16243 40330 49952
7906 49952 39733 58074 46399 18390 15115 52328 56693 44416 35920 45729 22032 19326 42165
7893 42165 56812 59676 40676 48903 42244 45199 35756 24981 32184 59091 53069 43291 44485 30835
7879 30835 19368 5861 16286 12390 26613 39071 54922 52644 37686 22979 35766 71297
7867 71297 75694 37288 5616 -13230 -24047 -11591 5913 29795 27869 18166 8835 -1565 -6042
7854 -6042 15207 24955 26846 19764 20522 29027 27050 4938 8315 8681 19728 28301 42338 57717
7840 57717 75602 70680 26337 -1628 -1974 8822 19030 43334 48441 29803 15350 7907 8008
7827 8008 -5709 -27282 -6753 39724 68177 47945 19655 36228 70776 100083 84322 44504
7815 44504 -3482 -29497 -16886 14507 14195 6873 22778 33646 36431 45352 33962 12336 19346
7802 19346 39246 49551 65960 69676 65287 33346 -5752 -18724 11810 15140 20100 28425 16343
7789 16343 47950 59452 61453 58718 40090 49059 17218 6584 47878 55660 63513 53171 46062
7776 46062 40480 30427 32149 35243 -5267 -7286 14657 30192 15631 4993 29897 51366 42275
7763 42275 40741 37226 37907 31163 10780 -7527 -4318 -5204 -20652 -42979 -12200 -10986 -18785 -21713
7749 -21713 -10472 -7604 2440 14393 30386 35279 37526 18806 17134 14714 -6005 16543 8820
7736 8820 7078 19993 63347 69897 39868 20559 5732 -21503 -2689 -6109 -10589 17791 42016
7723 42016 46801 42949 49194 47482 73377 56217 31099 25217 8964 42331 41371 22143 34105
7710 34105 22722 -12338 -16864 -15491 -11890 -13338 -20713 -3673 19615 63844 69317 11134 -163
7697 -163 -6167 -17749 4074 13871 28742 17726 -16292 -26981 11164 17944 3517 20459 36336
7684 36336 27313 19610 2066 8059 -7373 2583 44856 52361 -5681 -23865 -1711 -6894 -22094
7671 -22094 -16867 -15750 -12105 11744 6578 -2321 15891 27921 5811 5491 30772 40475 14622
7658 14622 -5884 21526 35005 63300 78945 60977 50424 31989 19304 -8899 -31207 -20791
7646 -20791 -21846 -10496 7231 15148 18037 28874 16124 -17390 -3454 -4513 -36102 -40251 -23770
7633 -23770 -7170 45522 34530 26728 32220 67129 71203 67580 74320 54364 47626 15672 -2156
7620 -2156 4120 44730 82179 75948 65220 46699 41735 41919 42358 31262 31314 53428 54208 47602 29311
7605 29311 29068 48435 36860 23915 38110 16609 2889 17431 16760 -10116 -15304 -27395 -29423
7592 -29423 -14683 20316 40896 38477 42516 38718 31641 29347 25879 21352 27735 13965 -6731
7579 -6731 -16800 -2948 7453 29904 32093 25434 42091 61145 39604 16105 30673 47141
7567 47141 33428 44448 44527 29261 11318 22360 18562 15604 23086 14652 -12248 -24067 -9337
7554 -9337 -19590 6147 40838 27733 3567 5950 10025 23394 45599 37457 33793 53419 77874
7541 77874 85984 79409 29962 -16608 -39850 -43120 -42833 -20167 5761 16041 -17972 -8052 345
7528 345 3778 10953 16782 -4335 -16781 2095 13951 -7162 -20400 -187 1861 12230 19130
7515 19130 6799 10413 -10960 -3722 14804 18819 20133 11189 21265 21864 -1965 -49189 -41223
7502 -41223 13654 25111 12448 13100 24641 9228 -4489 -38682 -31865 -7832 14370 33024
7490 33024 18572 35831 33538 38378 27818 95 -24898 -4763 -1292 -17910 -33221 -41439 -33655
7477 -33655 -4393 38813 51634 25243 33657 38370 21429 -2601 -53964 -52559 -9071 975
7465 975 -564 -6385 -7219 -8673 -35327 -48893 -38018 -8345 19164 43328 38893 26117 41048
7452 41048 51049 40919 20482 10502 16697 25684 10363 -4810 15538 48137 23405 -14635
7440 -14635 2172 34066 47575 6227 -25469 -38336 -20926 -20733 8106 -422 -14908 -29006
7428 -29006 -22211 11530 17380 -13028 -31849 -54115 -24582 4992 -8756 -43383 -24006 16981
7416 16981 662 -15259 -33465 -32293 -3891 -1655 808 9262 30896 45019 39720 23902 27330
7403 27330 12517 -22735 1767 23399 8128 -8554 -29524 -42350 -51035 -36340 -28132 -26490
7391 -26490 -6842 10361 9218 16210 11863 10585 32607 73165 75028 39479 18364 24031 26587
7378 26587 51655 17615 -12201 -744 -1261 -2406 600 -5061 -13819 2627 22350 24285 13194
7365 13194 -7820 -13009 -452 -19320 -29598 -30700 -39396 -33028 -11406 332 10072 11574 28985
7352 28985 18094 14570 31469 24834 25185 11648 -1561 -13598 -15187 -19380 -37800 -21842 -22604
7339 -22604 -6289 32949 46483 20565 8540 3526 1965 22094 17342 7139 877 18239 29145
7326 29145 32458 52229 49569 50597 69808 65911 27577 -573 20483 9164 -8591 -1237 15366
7313 15366 18737 23215 37426 23074 1479 -74 17284 44791 22132 -14579 12411 10815 -12233
7300 -12233 -27399 -17341 3008 17472 -10225 -28308 -12949 -14868 -20455 -19448 -26723 -35800 -55519
7287 -55519 -35535 -26652 -20123 -13415 -25498 -25449 -16108 -1220 -10070 -27944 2904 31117 32632 27052
7273 27052 24915 20484 19067 36460 34188 48971 51605 11327 -21784 -37469 3663 2453 -623
7260 -623 -28833 -46164 -63465 -64097 -41169 -32618 -12655 15213 9692 -20267 -56786 -57261 -47957 -17084
7246 -17084 -5206 6137 -18470 -62598 -74583 -45650 -21227 -14962 -36594 -66841 -61787 -58199
7234 -58199 -23125 -23656 -11180 -25106 -55379 -72610 -56627 -29815 -23945 -26452 -38394 -54304 -45865
7221 -45865 -38691 -29943 -33163 -36182 -21484 -27027 -63285 -75494 -45784 -41028 -45822 -37814 -34919 -40876
7207 -40876 -14738 10982 30545 6256 2691 2375 -3651 -16467 -7701 6545 22172 -5612 -25992
7194 -25992 -8244 -4800 -22247 -2375 25602 10367 1450 1776 -21666 -3439 8186 13151 10184
7181 10184 8140 -29296 -32709 -30631 -38288 -27615 -260 7042 634 20953 41167 12310 -172
7168 -172 -29685 -16975 23227 48313 59459 64259 54024 38782 22387 9808 -28952 -8531
7156 -8531 13452 27489 19517 16889 15547 -1342 -5131 -911 19654 29075 10693 -17661 -15693
7143 -15693 9133 34615 17929 -13464 -18484 20137 4408 -39404 -45836 -44745 -46034 -37697 -38811
7130 -38811 -21256 5068 -12884 -16840 10479 43987 41716 -3345 -30090 -33529 -18655 5081
7118 5081 36568 30940 -7217 -32928 -10987 13283 7885 97 -2652 6102 17533 11608 8573
7105 8573 4797 9406 6472 17771 19182 15981 2607 19290 29172 18725 -11181 -10388 -9310 -2895
7091 -2895 9176 8431 -13680 -9300 4111 16603 -15304 -16598 -10407 6072 36224 17097 -25889
7078 -25889 -38424 -8740 14724 -11512 -21433 -19576 14748 -16875 -29864 -18866 -7344 9797
7066 9797 -6606 -23941 -39716 -35762 10946 27566 25895 40559 48513 40539 28379 21906 1979
7053 1979 -26055 -33470 -17244 -7756 14480 32601 33596 32770 30480 27842 18269 18872 -1046 -1947 16151
7038 16151 19501 -4040 -2750 -2413 4328 -8274 617 22871 5755 -6107 4655 771 33551
7025 33551 33229 -8151 -40720 -48260 -37887 -37933 -12036 23523 40544 22970 3654 1269 9294
7012 9294 19326 5170 -5567 7570 -2183 81 2007 -4896 20608 11042 -14718 -23603 -41614
6999 -41614 -52036 -40624 -20733 -27392 -40178 -20395 -3353 4877 27501 21585 44800 70796
6987 70796 55550 19118 -4879 5646 27785 33243 46168 39196 22607 34638 130 16023
6975 16023 17943 -2868 -329 -4846 -4045 -15812 -10098 34702 35867 21969 31717 9694 -937
6962 -937 -19861 -17763 -3416 -5746 3837 17463 5948 -3771 -9090 -19631 -19830 -5857 4099 14036
6948 14036 13004 6442 18869 9577 -6982 5980 13023 13956 -18835 -4432 -19145 -16701 -7504
6935 -7504 -6467 13781 29089 26326 16775 19997 37543 37369 18318 -15419 -28256 -12904 -10333
6922 -10333 1395 -29314 -41245 -50282 -68937 -54666 -27103 -15276 -27759 -1935 4132 -9080
6910 -9080 -21711 -6005 26846 34637 44803 64180 54859 12305 -35454 -36520 -42356 -16084 22596
6897 22596 42600 22295 -6066 -30351 -40263 -34091 -38893 -54249 -52982 -14833 -19132 -34872 -40712
6884 -40712 -21131 -9443 5742 30735 34957 32738 40748 35669 36428 30446 22319 25595 1602 5268
6870 5268 23957 23923 -2006 -28976 -26494 -22650 -40990 -44686 -27700 -51874 -66475 -60328 -32843
6857 -32843 -30686 -11018 2305 -14049 -4302 -29678 -24463 -2874 44870 29515 -2023 -10491 -21812
6844 -21812 -17025 6410 14740 20317 920 18866 44091 -1622 -12239 -1219 -1749 704 41136
6831 41136 56534 16607 -18659 -14121 -2077 -6730 -2986 4382 -4756 -34956 -54663 -39370 -2099
6818 -2099 7181 -21151 -26386 -9805 9183 -31379 -31432 10181 39638 34371 27047 21011 34916 28034
6804 28034 30925 14051 23741 22233 17841 7678 27086 54105 56151 42145 20960 -19346 -21757
6791 -21757 -16595 -11979 -6995 -16821 -15354 -24680 -9853 -16108 -45663 -33256 -45595 -67420 -50944
6778 -50944 -43685 -35890 -17624 -3493 -1410 1450 21964 20380 -9133 -15930 75 16797 5564
6765 5564 -23024 -14833 -2808 -10354 236 -24612 -23444 15791 46848 30690 8697 -717 -16297
6752 -16297 -12066 9837 -5750 -23358 -17762 16557 39764 24929 31723 20172 -673 10291
6740 10291 -9730 -38781 -34534 -8419 7947 5020 5564 -809 -26041 -23772 -12356 2293 -6791
6727 -6791 -8885 -4730 -27649 -13730 21035 -16701 -17947 -23300 -32241 -12678 -30491 -36020 -6881
6714 -6881 2402 -6644 -13875 -28174 -38867 -33113 -23968 -26006 -38151 -31926 -35232 -41603 -8023 5919
6700 5919 2169 -3683 -8420 1832 32678 31212 30401 -10885 -12132 -13302 -20232 11968 1383 -9083
6686 -9083 -1902 -6860 -8971 8255 26371 -2611 12202 45687 39281 35795 31706 39999 39754 43498
6672 43498 39967 21433 44915 40550 32500 19945 239 -93 -4656 -20035 -32557 8004 -4675
6659 -4675 9625 17146 -3213 -23236 -12985 -6230 -23057 -3568 -773 -9511 -31805 -29649 -19077
6646 -19077 -8281 -26279 -34786 -26672 -19838 -12903 -3354 17426 19000 -6033 -27999 -58220 -61355
6633 -61355 -18922 12392 29471 11223 15501 28035 19731 6810 -9722 -2870 -6752 -28256 -37931
6620 -37931 -51122 -20427 -1376 -13221 -34687 -55570 -54254 -37917 -3125 25654 20650 -953
6608 -953 14142 41463 28096 20163 4509 18202 60711 46607 11434 32345 43230 22040
6596 22040 6427 15484 33192 31162 15310 5501 -12105 -26580 -44322 -10187 24569 29283 16269
6583 16269 31934 3224 -43437 -49040 -43759 -20755 -7962 -10693 879 9633 4026 4273 -8341
6570 -8341 18103 25712 9946 -16342 -41029 -2086 10 1646 -9160 -8893 547 18574 -16913
6557 -16913 -40788 -34486 -1347 5259 -4707 -5438 -31570 -9669 10853 -11169 -25113 -35011 -36688
6544 -36688 -34691 -4557 30648 44107 59998 59964 55840 47403 22504 -2888 -3273 -2974 4547 -1433
6530 -1433 -7687 12558 1436 -23878 -10626 5824 -394 -15937 -3529 7623 -3631 -3660 14779
6517 14779 22823 1129 14237 4946 18930 24050 14391 19110 -318 -8406 17400 24935 23026
6504 23026 32455 33003 22528 -1601 -25267 -62266 -65163 -29832 499 28999 16383 -9597 616
6491 616 21124 16170 -3179 9545 23523 23127 15874 9897 -9539 -37102 -34896 -9341 -2814 1573
6477 1573 2865 -3886 -6128 -30284 -44655 -27062 -30035 -21131 -21898 -18415 -13686 -4918 32480 29793
6463 29793 25821 4201 -12542 21774 29114 38268 50487 54082 29025 26748 16913 -4674 -20013
6450 -20013 -7559 6481 15602 -9489 -9795 -612 7894 3501 13442 26085 14062 1071 21361
6437 21361 12525 2642 -4038 4102 -5198 -23893 -52432 -54851 592 23452 16744 15924 -11803 -49037
6423 -49037 -48449 -22878 -16081 -3334 -1569 19258 22612 -3641 -31466 -19383 -30381 -33171 -40908
6410 -40908 -36027 -29489 -49384 -24054 1384 -74 1440 -13236 5748 638 -11184 5485 19532
6397 19532 18586 8370 -5247 -14442 -25398 -27593 -46479 -82769 -66068 -39867 -44001 -30977 -41269
6384 -41269 -39215 -13487 -1183 4147 2408 -26042 -39586 -43686 -38948 -9479 7028 19696 44901
6371 44901 71973 60640 43703 29546 10522 -5957 -21771 -25072 -21409 -20384 -48559 -41617 -42964
6358 -42964 -28413 -20196 -5421 2786 -17329 -37093 -32702 -28498 -42134 -57951 -43678 -20474 -15299
6345 -15299 10910 13986 -36805 -72481 -63247 -41257 -44219 -34608 -13898 4647 -12755 -24547 -39743
6332 -39743 -62156 -26002 -1447 24488 31557 33045 20075 9997 -6247 -18300 440 17879
6320 17879 -3639 1632 4967 6742 1071 -4045 -29680 -13879 -12368 -43973 -23968 -11046 21091
6307 21091 35083 4666 -11046 -8673 1939 20303 -1493 -14458 503 16743 20849 -3068
6295 -3068 -5397 4924 3879 24446 24110 28630 25670 26514 2904 -25408 -35225 -51524 -35897 -25806
6281 -25806 -24645 -37575 -34548 -33130 -24628 -10055 -15886 -28924 -36835 -7421 10635 22930 -14728
6268 -14728 -18576 -9833 -656 7295 20840 31746 45951 45162 32700 562 -7280 -17918 -10519
6255 -10519 -7964 -8824 -21950 -37595 -11507 -16656 -9390 -16356 -4238 -36264 -26969 -20429 -14405 -25133
6241 -25133 -382 -4454 536 -16644 -3848 -24489 -49985 -27415 -38391 -38568 -14958 13943 20589
6228 20589 -14905 -34897 -31926 -22867 24357 52522 69672 59058 23583 10117 20208 35236
6216 35236 35205 11325 15748 31894 5495 -20022 -29188 -13846 1768 -4029 747 -25739 -47479
6203 -47479 -48353 -44688 -39462 -23143 -11122 -28888 -19028 -9401 183 -14 8142 15429 334 -26537
6189 -26537 -11154 -10785 -5120 19886 21322 -9456 -15368 -47378 -44876 -39779 -8220 12968 -1129
6176 -1129 -4641 5332 -4912 21241 35432 43612 46290 49721 40414 31444 -5316 -16803 1999
6163 1999 9096 -3937 4945 16801 17394 33340 52159 64164 14947 6407 -22876 -40570 -28801
6150 -28801 -38279 -32935 -14185 13648 28604 10579 -13990 -35293 -36539 -35744 -11656 20915 33363
6137 33363 27875 27397 15436 -11439 -6397 -3007 -20389 -2161 36719 4407 -24238 -41425 -35045
6124 -35045 -36086 -20947 2174 15081 28064 7255 3159 29137 26681 26710 16048 -10463 -18701
6111 -18701 266 11355 -101 13564 28673 16887 -6022 -37331 -25294 -4405 17822 12255
6099 12255 -1899 -11751 13205 9953 10765 -1991 5435 10014 22424 22743 23212 21298 14004 32227
6085 32227 58284 54773 32507 41266 32964 9496 16167 1173 -15478 -11106 -11285 -474 -41854
6072 -41854 -47889 3713 19075 16399 14248 18055 1025 -12088 -16443 -29883 2092 26022 45605
6059 45605 23023 12194 7210 4891 -2175 -6162 -4031 19330 8741 -25667 -5468 3147 6805
6046 6805 -9255 -22322 -23845 -4351 2989 -16731 -14159 9041 21827 15894 24081 22994 16753
6033 16753 471 -18643 -13781 -36000 -58639 -53706 -54507 -54203 -60399 -34267 -20672 19097 17132
6020 17132 9823 16593 18227 6806 64 -21644 -10031 22005 17099 23874 4342 6821 11578
6007 11578 11241 17261 58941 41507 -9989 -37530 -51251 -22208 -5981 -13305 -24752 -32612 -22401
5994 -22401 -15261 -552 -2580 7226 18910 15862 21137 10613 1205 2437 3771 -29489 -26994 -11192
5980 -11192 -20231 -24734 -33894 -37010 -16833 -24349 -29308 -26373 -15695 -4313 20205 15978 15384 18944
5966 18944 29184 36112 38117 34875 12984 4622 -8786 -26709 -15854 1703 10217 12394 9505
5953 9505 43256 39550 24601 11009 -10309 -16074 -5445 -10129 -1229 16712 11350 6003 47406
5940 47406 22932 -25388 -31864 -29364 -35916 23385 15762 -7646 -5207 6069 -14012 -4268 -3423
5927 -3423 -15539 -16804 -22288 -4532 -1563 -25049 -35201 1410 -10129 -31435 -29060 -44771 -27725
5914 -27725 -12807 -19361 -12083 -1310 -32448 -29722 -18353 -32883 -10122 23941 21122 5777 -22537
5901 -22537 -28437 -9966 -18632 -39668 -11733 -14366 -25919 -48764 -53225 -44978 -73050 -65289 -45986
5888 -45986 -25317 -13066 3703 521 -32598 -24750 -31864 -53147 -52016 -32589 -9005 32000 50928
5875 50928 41736 26299 18076 13190 20901 9466 7977 305 -21545 -34518 -39230 -23137 -9494
5862 -9494 -11704 -8474 4932 34605 12340 -18716 5458 12525 2330 33137 17331 -1423 -10388
5849 -10388 -29128 -31792 -11488 -16426 -16172 -11690 -24351 1539 -8213 -1031 -1069 -15976 -3250 -22236
5835 -22236 -11516 18184 41424 27691 4968 -15550 -45091 -31949 -10211 -23486 -75535 -79779
5823 -79779 -46277 -28297 -34462 -22163 -27967 -30203 -12839 9748 19976 18942 24008 1454 830
5810 830 -13220 -33430 -29511 -11061 -3239 7804 35980 -4795 -24777 -5425 2457 10576 18312
5797 18312 -6420 2746 1788 4692 -23196 -24012 26359 22933 7812 4997 686 16172 3909 -9453
5783 -9453 -18777 -20140 -23031 -20282 -25397 -46351 -39539 -3338 -16123 -15581 -289 11829 3283 -2008
5769 -2008 -15174 -7128 -23342 -27844 -5601 -14757 -17336 -17737 769 -15032 -42131 -39799 -50836
5756 -50836 -38987 -30126 -8456 431 22218 17305 8276 4327 -6433 -27635 -599 31801 27138
5743 27138 8524 -883 449 9749 19141 30186 37757 14833 -8172 -17747 -19597 -32239 -53817
5730 -53817 -60183 -66228 -52405 -16399 9633 -17473 -35323 -10460 -5879 -21818 -28760 -46427 -55568
5717 -55568 -35220 -27409 10257 22547 8965 11369 10407 1607 -12047 -2114 887 -11185 -17357
5704 -17357 11589 4396 -21933 7 20838 18617 994 -33740 -55716 -46097 -11286 -8057 -770
5691 -770 -8595 -19422 -17225 -6499 -37884 -55749 -45673 -39827 -40052 -22146 1117 19805 -1780
5678 -1780 -10820 -11479 -32269 -61480 -64272 -25108 -15777 2142 36510 68232 93463 84663 42611
5665 42611 6480 5868 17024 1760 -16048 -17631 279 -7448 -23401 -10607 12316 12448 39225
5652 39225 64269 41451 39232 37723 16999 -2472 8700 -6954 -20890 13068 -1050 -20453
5640 -20453 -23088 -24308 -13729 1142 -9039 -19312 13411 -15624 -17602 -12693 -4599 -5313 -12505
5627 -12505 -11834 -12333 -27284 -17807 -19033 -17833 -14839 2143 24486 20012 10787 611 -9662 -10206
5613 -10206 8827 17978 18256 4663 -5565 14474 14941 7542 -5965 -6627 4345 31954 47948
5600 47948 45644 23796 17329 12866 7292 -33850 -67520 -41475 -15292 6544 19584 24380 21968
5587 21968 9719 8706 -15949 -14073 -8195 -27066 -31884 -39459 -13552 -25117 -27439 -12283 -45877
5574 -45877 -56179 -36457 -35723 -48443 -47394 -55872 -46723 -38949 -42571 -43564 -40072 -20887 -6817 -991
5560 -991 -1017 -4010 -18769 -18081 11481 25842 14229 -31207 -35020 -16921 -50585 -48282 -32472 13651
5546 13651 27012 19914 22514 -12177 -46982 -41453 12161 11473 -10068 -38064 -28398 -158 -28522
5533 -28522 -61795 -25525 -10653 -19939 -39272 -35602 -30312 -29221 -31488 -31979 -25986 -54130 -71974
5520 -71974 -59420 -14436 16011 17316 28951 34713 23105 -13927 -18787 4721 6680 -237 1377
5507 1377 32990 42043 48004 53325 34292 32178 -1150 -13932 5121 3528 2802 -1652 -23921 -22686
5493 -22686 -995 6274 2178 -4287 5666 100 10622 23467 5178 -11750 -3691 22072 8743
5480 8743 15840 9142 4367 -962 -13112 -23432 -2501 8833 5215 5901 -8064 -28667 -11151
5467 -11151 18257 -2814 -16798 -2744 -542 -11576 -13982 -22018 -31591 -41929 -17244 -37147 -43026
5454 -43026 -30540 -30610 -14128 1648 24696 29784 -3837 -5215 6747 26735 28455 -6178 -36803
5441 -36803 -22337 179 16646 20666 -16231 -31223 -28889 -8194 1846 31916 -4567 -36593
5429 -36593 -18974 -3437 13811 12389 -17119 -10760 1894 -15280 -14975 -3291 841 16315 -5046
5416 -5046 -10637 26735 44593 44231 23746 1870 5516 35845 42689 35759 44838 23065 13516 6703
5402 6703 -11006 18486 8215 5929 -1891 -26959 -36203 -7543 2448 -10611 7736 6731 -25985
5389 -25985 -38003 -41970 -42829 -10293 -26 -4787 2530 18407 -27593 -74668 -83225 -86489 -68343
5376 -68343 -49702 -23746 -34685 -47649 -41525 -26188 -19298 -4500 27445 36704 39201 26549 11676
5363 11676 -21871 -39662 -30682 -18611 -26716 -34275 -26734 -31952 -50090 -48402 -37953 -7644 1971
5350 1971 22994 46705 32607 23549 23430 34196 20691 -6887 -10015 13172 13752 1008 -10120
5337 -10120 -2429 -1869 -18211 -102 -125 2482 20735 35170 8309 -17274 1651 1323 4698 5751
5323 5751 476 2234 -21540 -34603 -15573 -18346 -2397 27093 9431 -5638 -21714 -12973 -18347
5310 -18347 -41037 -31064 -26037 -19710 -26661 -32829 -13880 -15063 -845 22625 11227 -22340 -24423
5297 -24423 -30899 -50933 -80167 -87129 -82352 -73580 -76108 -64744 -52080 -45340 -45262 -22401 1859 1246
5283 1246 8457 -8562 -40531 -36470 -16484 -15786 -22827 4534 8464 18028 17734 19892 -7720 -40855
5269 -40855 -42729 -19282 727 8367 18599 1209 -32284 -18703 4230 -7075 -49834 -57464
5257 -57464 -45744 -66907 -57814 -28760 -5412 -27534 -21821 1314 -11556 -48430 -61230 -60889 -19294
5244 -19294 23176 30590 22087 -7917 -15556 -23047 -32169 -35873 -26568 -36546 -44417 -37462 -10767 -8249
5230 -8249 -16135 1425 -3779 -4776 -3655 -17375 -6047 17496 8348 -1259 -24020 -14599 -10639 -23810
5216 -23810 -17847 -37495 -41289 -32505 -18470 -18184 -7640 5281 -7745 -29822 -41572 -43243 -31614
5203 -31614 -35046 -26824 -39073 -52098 -55284 -48992 -29838 -15636 -23812 -26733 -38204 -7802 16288
5190 16288 -15809 -44439 -1912 3365 -11626 -7482 -495 -28890 -13201 26663 14486 -1101
5178 -1101 3969 16929 13643 16882 21570 21508 17596 17270 26123 38127 35464 2706 -13323 -24042
5164 -24042 -6042 -18833 -18265 -8481 -19809 -27597 -29235 -64634 -36503 12770 10919 1767 44059
5151 44059 69411 51087 31230 31516 35438 45275 39512 22591 10366 5868 24179 29832 60756
5138 60756 67119 62919 46684 29639 -10142 -26710 -28159 -24407 783 16153 9843 6060 12456
5125 12456 21732 6994 -16503 -28217 -25151 -38619 -38595 -27703 -19201 -21849 -33364 -45663 -31679
5112 -31679 -6290 2359 -6522 -37171 -42720 -21005 -2396 6598 2945 1928 1330 -7841 -9310 -13925
5098 -13925 -14392 637 -8366 -23061 -62775 -52953 -40857 -60932 -61152 -40577 -12427 15420 5627
5085 5627 -22919 -33315 -29931 -17823 -26068 5490 36577 26936 -8197 9031 30917 34238 5932
5072 5932 -15823 -52649 -58639 -38822 -47362 -56131 -56660 -39722 -30398 -17604 -21626 -13569 -28785 -28455
5058 -28455 -46994 -39606 -36405 -4701 5683 -27280 -37204 -15656 6230 -15425 -5055 -31002
5046 -31002 -48370 -33894 -3381 -8010 -19451 -21778 -11775 -22208 -43167 -53400 -53420 -22645 -32500
5033 -32500 -43849 -33869 -29753 -34221 -25265 -32204 -37514 -24083 -7919 -26041 -34804 -20984 -38872
5020 -38872 -43189 -33674 -194 -4628 -9027 -7937 -34619 -26235 -26127 -53687 -33839 -38192 -64469 -73988
5006 -73988 -52426 -67548 -64481 -70245 -33660 -485 34510 29326 15982 3842 27409 20022 21291
4993 21291 25666 13921 277 -14570 -22796 -27670 -35460 -30699 -18328 -6445 -28598 -66829 -36859
4980 -36859 -53826 -89629 -71539 -17423 2849 -24349 -37874 -19989 12070 8260 19998 23049
4968 23049 5785 -7740 -18925 -22985 -29968 -42077 -48423 -60948 -59306 -31309 -20495 -21218 -16333
4955 -16333 943 8467 6925 174 23740 47990 25718 -2544 -3894 -28869 -10630 -7159 -5577
4942 -5577 -13363 -12094 -4042 584 1629 17498 4322 7363 36713 33805 31735 29412 11159 -8370
4928 -8370 -11146 2497 17866 -13508 -45461 -26058 -9781 8345 11340 -7192 -30022 -5650
4916 -5650 2979 -17495 -38503 -29921 -16516 13671 13945 -2159 -25443 -28878 -27178 -3942 13842
4903 13842 4176 -44052 -61742 -33562 -225 -45248 -55934 -47213 -63669 -71788 -74417 -84457 -73097
4890 -73097 -48193 -65831 -54143 -61858 -66173 -53080 -37642 -56396 -70488 -66963 -27087 -17206 -5185
4877 -5185 1281 -10621 -22850 -7509 -6044 -21986 -45204 -38450 -23833 -20370 -25148 -12901 -17109
4864 -17109 -12571 -18466 -22522 -3019 22971 9773 -24612 -39411 -34481 -18016 8990 -3640 -47058
4851 -47058 -44138 -35669 -30476 -27220 -21507 -12822 -10863 -12465 -12562 -31276 -24147 -15285 2277 26009
4837 26009 14771 -22279 -40557 -47955 -32586 -39120 -30643 7729 20670 -7112 1315 886 6252
4824 6252 3957 3535 9557 28170 53096 61125 24276 -7993 -20517 -29948 -27626 -17659 -10035 -10598
4810 -10598 133 -1584 16748 15252 523 9804 13976 14317 12235 -3681 -12413 -10795 -9201 -7606
4796 -7606 -36877 -64917 -56889 -49753 -47300 -40201 -44890 -22624 -40543 -34960 -27711 -8859 -14342 -36796
4782 -36796 -47697 -12605 -8510 -8767 -2746 -19605 -25303 -17432 -37542 -42592 -25589 -17813 2832
4769 2832 14407 -11306 -10828 1850 -5726 -12185 -7066 4506 17796 11648 14260 28653 19158 21571
4755 21571 33040 5769 -29972 -37970 -50261 -54412 -45344 -51783 -25453 -3903 6784 12319 -25102
4742 -25102 -36898 -26675 -27120 -21989 -24989 -37356 -16128 -5069 -9907 -4142 1953 6930 -4102
4729 -4102 -7564 11927 -8824 -55695 -44378 -43303 -41991 -49181 -58417 -45754 -45110 -48426 -47987 -27016
4715 -27016 -2385 -10165 -39221 -33906 -15459 -6573 -7038 7724 -6248 -21382 -17205 -5358 13419
4702 13419 9139 -7195 -12873 -2492 582 -936 -24123 -18074 -20581 -60456 -52555 -47703 -40450 -41105
4688 -41105 -27415 -9479 8579 15522 -12201 -19447 -28084 -29671 -13094 -36468 -15272 -19764 -55393
4675 -55393 -49327 -40801 -17485 13080 10360 -19254 -8112 9289 30608 18836 15780 -4126 -15714
4662 -15714 -18099 -7163 -2343 -9845 24179 21113 12512 8233 15132 18438 24693 14223 -4497 5955
4648 5955 19247 38711 19819 4956 12981 51375 42299 10209 -12153 -24415 -47016 -31710
4636 -31710 -5326 -9448 -7231 -3672 -5635 -12556 -17014 -23785 -49227 -59818 -21479 6566 -11895
4623 -11895 -16168 29948 22435 -9444 -16169 -16825 -9098 -7446 714 15671 1696 10953 45051 45105
4609 45105 40128 28793 7207 -13289 -15838 -5377 -16828 -47042 -43183 -24186 -18707 -33535 -36996
4596 -36996 -46593 -51239 -81156 -96408 -66674 -49248 -51432 -16463 -9443 -3311 -15973 -33907 -41510
4583 -41510 -25129 -1536 -10283 7581 9846 6789 -27 11428 -466 496 23846 -9915 -35222
4570 -35222 -20836 5298 -26499 -7487 -6292 -12250 -29346 -20972 -14408 2023 17356 -12261 -26287
4557 -26287 -7866 8035 12499 -7556 -26256 -4494 24261 17924 41990 46657 20149 -3038
4545 -3038 -7966 -9067 -6066 361 -3092 25490 50413 40743 37678 34269 9936 22051 22465 25742
4531 25742 -21144 -56921 -59724 -44071 -16821 2310 13473 -6320 6066 5095 15483 1395
4519 1395 -6388 -1428 1424 -17792 -16176 -35005 -28396 -33374 -50248 -18159 -33201 -59703 -80837
4506 -80837 -85695 -47787 -31761 -62518 -64211 -49585 -37291 582 31462 22567 17962 34092 26268
4493 26268 11950 -25673 -35991 -43805 -43293 -32996 -36958 -40947 -33468 -32204 -19302 -11428 -28130
4480 -28130 -26831 -21895 -54562 -53330 -23048 -4628 -9413 -8951 8497 26352 -9188 -16570 -22457
4467 -22457 -30038 -16247 -40081 -25755 -19831 15784 36753 15102 -2430 -12330 3606 4907 -1966
4454 -1966 14573 -850 8422 20071 -16057 -19025 6674 21526 1167 -6031 -3671 -20935 -31987
4441 -31987 -44911 -54035 -41119 -42421 -50493 -55567 -57348 -15639 -18697 -28096 -16373 -34855 -35003 -2228
4427 -2228 5534 2698 14603 10902 29328 39301 12380 -6572 16593 29892 19788 15550 -5631
4414 -5631 789 -2280 -3187 -8111 -13517 -14607 27056 8545 -21834 -25812 -18211 -11438 -8792 24966
4400 24966 34073 34807 38169 9938 9781 10887 -27516 -61330 -41513 -6974 -17639 -42555 -49544
4387 -49544 -46322 -40532 -50495 -33796 -29763 -24378 -32315 988 14043 -5606 3586 9961 4189 14351
4373 14351 16481 -18088 -32906 -59550 -52991 -29447 5492 -3880 -13071 -9774 -16652 13021 27154
4360 27154 31378 21625 -16516 -25496 -3100 -10120 -10152 -28261 -44977 -32905 -16906 -13655 -34015
4347 -34015 -37105 -44034 -37206 -20816 16749 27271 15158 -4727 -21400 -25101 -39383 -46696 -46936
4334 -46936 -42384 -22412 -12164 -5426 33393 32359 -5941 -17295 -23711 -26021 -48865 -64912 -43482
4321 -43482 -49610 -26981 -24994 -19069 -36747 -49961 -35163 -5146 15688 24921 7190 -35123 -36949
4308 -36949 -22646 -20633 -24388 -33525 -59236 -52400 -44678 -32716 -41789 -44982 -19771 -25334 -20958 5531
4294 5531 15820 24958 10670 -12406 -15936 -28160 -29786 -8743 -2346 10611 -1718 16786 13932
4281 13932 -12141 -7544 25240 22677 22945 -14095 -8066 6828 12525 16083 24304 12429 10138 44989
4267 44989 45605 49751 35863 -13907 -14523 -6844 -15102 -20103 -43753 -61089 -65192 -50698 -40002 -29187
4253 -29187 5772 533 8365 16668 17980 8599 13792 21039 1770 -17190 11763 30661 37857
4240 37857 27372 12005 3686 3727 2038 10333 26346 11713 19021 25204 31137 7330 -13128 -31568
4226 -31568 -32142 -27907 -16320 -15962 -31902 -590 25738 16415 1993 -7632 -8059 -17072 9348 10765
4212 10765 10483 -8761 -53366 -86893 -123679 -113423 -63734 -22677 -7263 -11248 -18540 -10573 -25167
4199 -25167 -31592 13810 39226 40877 1732 -23422 4092 3468 2057 6938 -4223 2635 13355
4186 13355 -4841 -12920 1879 39422 36080 569 -35256 -60046 -46069 -8707 26374 41820
4174 41820 35857 21617 -1566 -33233 -21921 -7148 16837 10697 2173 16718 17169 4228 11482
4161 11482 24210 32631 21665 24139 28438 38230 21859 30464 36928 47333 11869 23598 44218
4148 44218 37355 37923 37065 15020 -15199 -35845 12473 28737 30672 39803 61913 41959 17000
4135 17000 10490 14575 38995 43333 7771 -23042 -8590 -3879 -44466 -49275 -21794 10646 -3808
4122 -3808 -9940 -14377 2537 32134 10367 -6255 11935 38704 31725 14061 19705 20628 7996
4109 7996 5889 8615 -18036 -22104 -13941 -25952 -15590 -25971 -54018 -60443 -43012 -35631 -36818
4096 -36818 -15493 6319 13682 21508 12970 3410 -31094 -52566 -46564 -722 16776 5344 -4319
4083 -4319 7014 21820 45634 37205 36645 21304 -5897 2596 941 -5983 -13163 -7940 -22498 -25483
4069 -25483 -14718 -20534 -18703 563 -11445 -18123 2396 -17228 -461 2871 -2670 -6906 -35937
4056 -35937 -80650 -103233 -84099 -36112 -1395 8791 -22285 -32949 -10392 6429 8138 -5759
4044 -5759 -17718 -7895 17335 13998 1130 -1428 -2544 -2262 -8254 2714 17571 38906 43709 36413
4030 36413 21939 6454 -7307 -32841 -26851 -14859 -5018 3083 22135 37471 35913 16403 -3353
4017 -3353 -28948 -45999 -31726 -37575 -14584 -1457 -10880 -47884 -12845 8868 -19476 -40999
4005 -40999 -2296 -3540 -19281 -30180 -42472 -26759 -42265 -37284 -32902 -5612 -3975 4025 -17136
3992 -17136 -20916 -8088 -1608 4789 21148 23689 610 -19197 -22580 -25404 -23706 -2897 -20152
3979 -20152 -29669 -10735 5890 -10631 -14684 -6973 -15641 -35130 -33518 6572 44547 28500 10075
3966 10075 20442 37847 30859 27804 29424 30738 -9710 -30702 -28420 -40201 -60203 -59822 -16216
3953 -16216 -5528 -36499 -25185 -21146 -29697 -1770 10168 -2338 -26819 -37289 -38123 -694 42427
3940 42427 29665 -4584 -19664 -5874 12209 -12320 -2306 -10558 -14012 -28409 -45132 -42039
3928 -42039 -70254 -80520 -72801 -79966 -78332 -50308 -27120 -32603 -30854 -35117 -7209 4 -1667
3915 -1667 19529 2034 -23803 -32467 -20789 2451 37449 30938 2296 -9611 -8402 -23680 -39456
3902 -39456 -40137 -21487 -4393 -25442 -47767 -28098 -15855 -21342 -6462 10402 -8095 -16316 37661
3889 37661 55687 53168 13827 -763 789 -2248 -37232 -56946 -42306 -35650 -7526 -10728 -47010
3876 -47010 -52273 -49982 -40725 -36620 -58383 -89263 -82330 -41249 -47763 -41394 -10407 -14670 -26291
3863 -26291 -47789 -57752 -52336 -22514 -6440 -629 -2833 -3663 -14195 -3218 9486 30932 38280
3850 38280 10703 18554 -11920 -18369 -7183 -5781 -1802 -15099 -3607 12184 7646 -21076 -27935
3837 -27935 -7680 16484 17004 6261 3241 -53589 -55181 -47430 -31760 -13431 -16655 -40442 -18591
3824 -18591 -18834 -39640 -53565 -48804 -19036 -161 2212 -21391 -52873 -64973 -39256 -38040 -37700
3811 -37700 -33897 -32090 -14267 -4560 -9924 -64390 -71920 -62264 -74829 -84521 -69696 -59642 -34725
3798 -34725 -20058 -36169 -23344 -35603 -28755 -16490 -7834 7468 -8001 -8886 -12020 -15235 -11118
3785 -11118 -18273 -16373 -10241 14558 -1365 28 6890 10125 19708 30035 21029 20756 17399 5485
3771 5485 -13342 -15766 -18372 -21729 -38851 -24412 -22774 -25326 -50253 -59618 -72552 -89788 -73356
3758 -73356 -22933 -15294 -13465 -2105 20858 2522 -30130 7351 21847 -14159 -5479 11591
3746 11591 6163 -15648 -21215 -33309 -60972 -48847 -29550 -17564 -29110 -43121 -12541 11057
3734 11057 17631 -3393 -19535 -11943 -14415 -16642 3814 -15017 -36562 -24574 -44603 -48079 -10367
3721 -10367 10388 11357 -5544 -6622 18433 -3281 -27627 -9721 -38278 -50338 -20472 -25566 -9927
3708 -9927 -1333 -6291 10781 35604 20873 -11662 -13737 -37905 -30480 2564 -1896 -8668 3596
3695 3596 -802 -22564 -20020 1309 17338 33478 21230 6739 -9536 -16934 17147 51193 40997
3682 40997 18256 -8540 -39160 -21555 14488 4208 9778 30260 14693 -6539 -18443 -28209
3670 -28209 -20896 -12014 11249 30567 19634 26773 34588 22786 4742 1512 -11463 -20026 -11469
3657 -11469 11450 -57 283 6320 -12794 -13251 6463 -9875 -19503 -9587 -17054 -8715 2947 15384
3643 15384 17700 11590 3539 6542 18110 32203 32845 19453 2010 5454 16670 1144 -21701
3630 -21701 -17311 4410 6640 37348 19973 -16123 -13405 -19155 -13686 -16998 4426 -14394 -25683
3617 -25683 -23564 13419 8781 4768 17136 27900 12940 16963 12913 21756 -19488 -51930 -37586
3604 -37586 -7402 -6130 9701 2533 -13884 5821 2721 5843 -14504 -33378 10417 50083 59257
3591 59257 46324 29984 39112 59412 34027 -9411 -1809 9583 23988 16849 22219 41944 38002
3578 38002 12558 -15226 -20054 -11712 27143 40874 31471 40295 3574 -12860 3290 15139 29704
3565 29704 23471 3140 -3584 12359 31731 34616 29727 8087 -19067 -18568 -7559 -15633 -39166
3552 -39166 -30518 -1444 3101 10099 6480 4582 4222 245 -18869 -53564 -91871 -49513 -4318
3539 -4318 3413 6587 6339 1896 35745 21609 -22846 -53824 -21319 37426 40619 45278 59656
3526 59656 40814 34413 47565 44069 36023 31682 33873 23072 -92 -9843 26034 44532 15906
3513 15906 8439 9116 -22906 1286 29941 22551 4247 547 -14208 -13652 -23112 -47873 -39877 -46804
3499 -46804 -59848 -37861 -40161 -39852 -5108 30711 46790 19360 -11861 -26781 -21667 -34716 -1042
3486 -1042 23476 35891 27252 15379 43587 46105 45290 5031 -35262 -59928 -39808 -193 4892
3473 4892 -6718 -10252 9434 11549 11388 -16911 -19308 -6689 -5892 -15312 -13950 -22545 -8383 -199
3459 -199 8840 9134 -10767 -26073 -27857 -6296 14768 40160 16523 7527 19209 7439 25276
3446 25276 28029 36046 1695 -6418 18241 22806 22267 24858 6198 19262 23728 22223 16256 -6791
3432 -6791 -33326 -21372 -19157 -6532 -3118 245 19066 27812 -10373 -25375 -21265 -16444 -24806
3419 -24806 -30273 -8709 -10428 -51164 -32423 -11811 -23826 -4521 20816 23114 13740 -20322 -56314
3406 -56314 -53655 -27695 2120 21428 31804 7554 -4011 9627 44363 20800 -5638 -14259
3394 -14259 -9720 -12227 -17884 -16604 3948 -1139 -21820 10207 1175 174 7057 12695 -1901 -22225
3380 -22225 -5854 6769 -5871 -8874 -8536 -33106 -21214 447 18909 12869 28454 31517 31386
3367 31386 -5002 -16855 -6273 -523 18187 21917 -15797 -20117 -9400 6949 8301 558 -46019
3354 -46019 -56017 -67902 -70946 -65464 -28063 -12207 -17974 -12066 3619 9019 -11212 -32624 -26141
3341 -26141 -21652 -8420 14911 9123 -25770 -25743 -26803 -20955 -2593 14463 12218 -17881 2100
3328 2100 27071 26815 14422 25060 17978 -1138 11587 20316 7438 -15828 -26014 -8375 -28686
3315 -28686 -37746 -24972 1251 25521 2671 -8290 -886 -6553 -1263 11153 14153 819 -30818
3302 -30818 -47958 -60084 -66753 -52814 -34016 -44411 -39530 -10299 -10076 6039 3262 9599 -3751
3289 -3751 -8542 -21297 -12840 8900 33512 33737 31950 48609 55301 30195 -3491 -29226 -62523
3276 -62523 -927 19140 -2623 -33476 -12906 -4123 7632 7439 4200 18136 24166 4542 -8185
3263 -8185 -12371 -47371 -30753 -32075 -43422 -41099 -29223 13793 -4406 -7540 824 -28666 -30848
3250 -30848 -19173 -601 12275 25379 -8680 -15309 -1070 -6912 -25724 -20125 607 2734 2649
3237 2649 7877 -1377 -16749 -18594 7647 54064 53653 42545 40954 29533 26776 19646 31995 12035
3223 12035 208 -5953 -2382 -8624 -5880 -8781 -7179 4184 33339 41366 32076 36460 8854 -22464
3209 -22464 -1080 5858 450 -9540 -13385 -14975 -18699 9353 -5783 -28922 -38058 -29056 -20023 -6894
3195 -6894 -4954 -28252 -34226 -40014 -35782 -22585 -7851 -13598 8596 -12530 -17650 -23332 -4096
3182 -4096 -11667 -12793 -32161 -46641 -6704 24271 38375 10627 -19456 -1628 22982 27193 4030
3169 4030 -5635 -11986 -19189 -3899 10518 7391 754 -4106 7309 -6245 -13231 -29009 -49383
3156 -49383 -45178 -13874 382 1440 -1681 14709 17334 3267 -8757 -11509 -31894 -33601 -22031
3143 -22031 -14485 -19170 17368 17706 24381 43357 26935 10372 -679 -3276 3046 -14739 -20259
3130 -20259 979 17954 17448 7551 2401 15076 35384 20200 -7636 -31733 -58683 -46506 -23792
3117 -23792 6827 -3562 -47637 -48796 -51885 -28160 -47438 -26543 190 2360 7298 20091 7132
3104 7132 6002 5161 -18431 -27827 5331 7461 -19030 -33829 -18081 -28630 -44547 -51036 -49861
3091 -49861 -58193 -66725 -36896 -27951 -41943 -46263 -50547 -3568 31517 30939 13940 -845 8912
3078 8912 19050 20325 31339 32967 19831 41567 45758 30315 7448 -9563 -12400 -8606 -11185
3065 -11185 5051 1309 -13984 -41280 -45759 -26464 -6838 -5966 12223 19444 30846 36509 17170
3052 17170 22388 -9892 4040 19735 -15211 -26113 -41841 -39250 -16344 -6177 3368 28332
3040 28332 46816 35753 17225 -12713 -8660 9209 5258 2751 20508 38830 29653 6538 12665
3027 12665 19200 -4506 -16847 -21723 -21585 -11758 11211 -4830 -13177 -12640 4473 -15791 -4422
3014 -4422 23755 17598 8857 -18663 -27919 -19775 -9232 1235 4635 -1813 16387 22694 25697 16030
3000 16030 444 -13448 2242 25594 6767 -12025 19784 25037 7993 8831 4900 2635 -13817
2987 -13817 -1008 -299 -516 28738 37234 32320 -257 -11860 -38219 -58859 -59332 -75425 -58448
2974 -58448 -21121 7498 13150 -3267 19489 22665 33747 37431 15663 -40277 -73686 -40143
2962 -40143 -18587 -39078 -37415 -47418 -47106 -33511 -4877 2237 13417 -6649 -29585 -41557 -39135
2949 -39135 -12389 -10551 12963 48744 42202 41248 37278 18270 -4458 -7650 -20305 -19494 -8205
2936 -8205 -7728 -33554 -67413 -45905 -18035 -12248 9502 33302 73180 72803 28394 25376 43248
2923 43248 19935 17295 7961 -15274 -22042 4752 39273 76079 72151 64478 73010 62919 69133
2910 69133 51405 1802 -2054 19275 27111 13980 11923 -5506 -13233 -2156 835 13173 17918
2897 17918 30599 38074 2314 -18323 -7722 -10417 19482 10361 1439 -15701 -33838 -35524 -37391
2884 -37391 -34862 -21408 -28754 -6969 1618 996 2158 14534 29312 12880 2080 690 -10893
2871 -10893 206 -27302 -60696 -46146 -31679 -14325 4920 5999 -23098 -14599 16245 10199
2859 10199 9958 30021 33957 28862 -12416 -11740 -12578 -24358 -37532 -26369 4577 16968 20419 21914
2845 21914 20799 25698 17627 -3299 -2756 -1031 -17526 -8930 -26656 -36688 -43528 -37358 -13873 -2986
2831 -2986 -12442 -23664 -8113 -23966 -49146 -41463 -36613 -19984 -2627 14717 15139 19258 -10355
2818 -10355 -39987 -37949 -11206 5717 4819 -11094 -4779 -8914 -12962 313 -1328 -35304 -33207
2805 -33207 -29486 -28544 -33248 -33258 -43117 -40789 -27162 -3474 4580 6833 -7072 -12214 -15597 -44339
2791 -44339 -23628 -3324 -25254 -34661 -33411 -9151 -2036 -10758 -28859 -25979 -15768 -6700 -11858
2778 -11858 -59462 -82887 -80311 -59245 -41150 -29054 -12106 21122 29931 20640 27234 8672 5238
2765 5238 19811 5121 -3336 -1192 -21163 -29852 -52120 -37980 -21892 -6713 -2868 -2381 -8861
2752 -8861 -46705 -70544 -92405 -70308 -53598 -54411 -58672 -51754 -58095 -20104 -534 1003 -12248
2739 -12248 -870 -25629 -27595 -27006 -20278 -18081 -12154 -13246 -23121 -39588 -35756 -35361 -53276 -67933
2725 -67933 -78074 -53246 -6825 -18355 -29012 -22707 -40562 -27501 9532 5939 4979 2488 -24225
2712 -24225 -52023 -72925 -84787 -83818 -73450 -60018 -54319 -40627 -28154 -18461 -22423 -38233 -34523
2699 -34523 -24066 -38964 -18135 -6873 -14935 -25241 -27669 -26200 -24279 -47431 -49603 -27055 -38864
2686 -38864 -56039 -22623 3578 6961 -13708 -5040 -447 10268 -1130 7502 16473 27778 -2908
2673 -2908 -25510 -33417 -42943 -61558 -28567 -8368 -15735 -8755 -7961 3357 -3870 277 -1209 245
2659 245 -8534 -20709 -1981 -14181 -31230 -21865 -25183 -22762 -10949 4825 3383 -8489 -26888
2646 -26888 -25610 -13513 7756 4588 13248 4318 -15188 -6191 9837 5578 -8581 -4432 11073
2633 11073 11522 -23357 -18519 20074 17934 7957 2227 16003 17420 10514 6659 5731 21793 16631
2619 16631 -11929 -39258 -47789 -57269 -57665 -51364 -44339 -53430 -50443 -19804 -31846 -31243 -11698 -23345
2605 -23345 -28867 -23517 -17219 539 30759 25422 7324 -14913 -25748 -26285 -12198 13266 10139
2592 10139 -10506 -38538 -16134 -11599 -19528 -22973 -30441 -25024 -25933 -34535 -33488 -38413 -39692 -5826
2578 -5826 5344 10055 3721 -3485 -29261 -30603 -12263 23727 30884 16860 22210 22591 3883 -5794
2564 -5794 -25024 -22509 3189 22067 24196 7451 -21210 -16810 13291 8902 -10818 -10705 -786
2551 -786 -2946 -19423 -27715 10793 11369 15152 18767 11630 30026 28848 -11130 -10596 1337 1825 33005
2536 33005 27961 11875 23447 46415 34792 7180 18521 19466 18735 14856 -1990 -14464 -21925
2523 -21925 -25565 -28009 -26453 -13470 6630 26269 7399 -4463 14300 32209 30700 17166 702
2510 702 975 -16405 -15246 1276 -6448 13650 26184 26656 22214 39090 50804 6777 -36569 -67826
2496 -67826 -59040 -17228 1803 8036 1827 -8853 12605 -7158 1388 10815 -3980 24553 51683
2483 51683 46831 39253 31092 20848 20949 3534 -10966 -3647 -6338 -5335 -6719 -4469 16556 6608
2469 6608 13390 19173 -1276 -12768 15188 2040 -13767 -25521 -19369 -25057 -30455 -21481 -26422
2456 -26422 -22431 -3505 -4204 -33382 -33495 -22518 -17297 -17065 -14703 -1948 12857 21790 1609 -22763
2442 -22763 -26759 -43113 -26991 -17741 -8614 -17587 -8276 1026 18915 38138 35756 31708 13561
2429 13561 -18469 -23865 -3533 -1141 -18536 -14705 4466 -6516 -13689 372 -1383 15270 28166
2416 28166 7005 15606 21060 16534 -4700 -4863 -509 23487 17862 5329 -16232 -20352 6614
2403 6614 8776 -84 7551 27013 20960 35584 30579 20597 7359 1707 -16711 -1202 13385
2390 13385 19136 17021 2986 -53267 -63655 -1315 23116 26524 21868 15314 32016 36725 28993
2377 28993 28413 12378 21682 39733 14083 17337 -11863 -29377 -30370 6580 14979 6133 13083 15660
2363 15660 12184 9863 5856 4511 -14709 -1442 11095 826 -26448 -19093 -1525 22401 42766
2350 42766 -1737 -35481 -40335 -15648 -5606 -3963 4813 -1244 -5192 -26808 -11902 -15572 -16625
2337 -16625 6092 28063 37159 46709 18785 -986 -21316 -24449 -35026 -32183 -26309 -42587 -51246
2324 -51246 -34356 -42164 -49336 -45599 -28106 -19410 6016 20290 21041 19780 31324 21314 -3132
2311 -3132 -28112 -40755 -41054 -23621 3516 6263 -21189 -16039 21028 15531 -31373 -19849 5054
2298 5054 -3233 -19122 -23509 -23183 -6643 4484 -1064 -31144 -69317 -55427 -39680 -10054 17564
2285 17564 43031 44058 1580 6153 22007 4558 5361 -12660 -8622 7953 7703 -32328 -28956
2272 -28956 -7231 3523 -10175 343 20070 50019 32572 24746 25864 44190 52298 67993
2260 67993 65905 44574 62072 47701 33002 36212 8363 -7036 10871 29366 21095 8121
2248 8121 792 -6560 13131 14065 14402 27055 28400 25361 39074 36352 34909 24540 -1095 -18607
2234 -18607 -14012 -36291 -64270 -54436 -37639 -4494 5298 -6911 -10775 -26221 -16395 35899 15537
2221 15537 -13222 -7251 -4320 1383 1084 -4879 -8031 -6692 3363 38044 30604 11667 11287 2677
2207 2677 7607 -4248 -37426 -21023 -14331 -5196 28658 -1147 2554 6670 14553 32835 32727 25715
2193 25715 17965 -20051 -14808 -16713 -36050 -49802 -53372 -53726 -31802 -32011 -18530 -12698 -20518 -14101
2179 -14101 -7615 70 7140 -415 -1007 -16863 -42948 -33333 -16834 -33434 -25351 2380 -7120 5423
2165 5423 3100 -10969 -10411 13008 14112 8925 9791 10461 -4829 -29145 -21791 -2259 6429 -11772
2151 -11772 -12208 28021 34862 21274 17511 19368 30192 9250 -13917 -3944 11972 4699 -9750
2138 -9750 -17449 225 29107 52978 40317 28695 34627 45541 23843 -1080 8025 3246 -11452
2125 -11452 -15273 -2955 -2449 -6994 8995 -12243 -25933 -12929 -13757 2733 6425 9346 -15694
2112 -15694 -12301 -7087 16162 29372 32511 29563 30198 25955 27338 24014 22373 15859 27980 44116
2098 44116 43624 15488 -20205 -33039 -42049 -27976 -8766 10664 -5234 -2862 -761 5258 -12128
2085 -12128 -40566 -24189 10465 34216 22419 -14880 -48340 -37964 -14884 -10560 -14646 -28406
2073 -28406 -10515 -6126 -30439 -24028 -32464 -17076 -3130 5145 37589 35118 29833 18239 -19521
2060 -19521 -13344 12653 11625 -11348 -20429 12594 35422 52445 66280 19619 -2821 -3929 -10278
2047 -10278 4346 -1396 -22261 -11201 -6816 9130 -15154 -11538 26713 12960 9034 32760 8647
2034 8647 -7197 -24620 -21432 6891 19005 -6249 -7937 25584 34104 31331 17943 21617 17923
2021 17923 10752 20603 1857 6132 12760 13302 4022 -1690 -10046 -13051 6659 32207 36294 11160
2007 11160 6034 -12657 6547 6512 4112 1738 10694 31299 2543 -16043 5261 36113 22011
1994 22011 12352 9042 6180 20648 30406 33150 12665 -27619 -15250 -8493 14925 31041 2710
1981 2710 -13790 -21842 -7370 -1252 483 -12040 11444 23418 36001 21636 11047 -1927 -23656
1968 -23656 -56231 -61944 -40529 -17780 -9087 -6473 -3164 -6459 118 13126 43598 44825 22542
1955 22542 31564 28583 32104 21912 21613 34691 66131 46281 15945 5056 22210 6513 -23064
1942 -23064 -35224 -11375 42177 64990 56752 8228 6286 11419 12291 -1389 -6646 -10692 -1863
1929 -1863 14121 23000 26483 11222 18894 20911 8598 1263 815 21226 3528 -20255 -23184 -13276
1915 -13276 -9066 -17486 -29530 -36971 -31663 -42846 -60841 -30821 -2382 -3548 -12112 -31358 -25097
1902 -25097 3769 19492 43506 64895 68899 72759 72648 69676 63964 32585 8961 31274 57985
1889 57985 26024 395 4887 4360 14716 12930 26635 8895 -4944 14343 25308 50643 44906
1876 44906 47397 34813 -24995 -4208 -22238 -8101 24272 31175 7384 17075 37833 34941 21765
1863 21765 24492 26984 -10737 -36835 -43298 -25729 -38439 -42287 -36872 -18260 -26542 -10752 211
1850 211 21174 61361 56554 56789 42677 5750 7481 37163 21956 10080 -1539 37879 33122
1837 33122 7897 18842 24342 42458 39671 47794 28766 -2549 19391 7576 6413 -37837 -30735
1824 -30735 -13106 23710 38108 39724 8506 1 4058 -27794 -25847 12875 -2206 42572 55872
1811 55872 10059 -20677 -20826 -21464 -15206 -13244 -4392 -6682 -3634 4089 -10615 -30705 -12030 17603
1797 17603 -2713 -3150 464 -15228 -31544 -23532 -32592 -48549 -30036 -2857 258 10794 33727
1784 33727 53741 56625 21170 -20196 -35693 -30467 -13358 1726 28371 45026 32719 -3121
1772 -3121 2072 29526 42409 7708 6112 30320 22043 -4732 -5484 17832 8919 25338 60822
1759 60822 25532 -41093 -50268 249 33842 31802 30562 56101 55434 11835 -10367 -18931 -11625
1746 -11625 -20107 -11087 -32471 -24188 -913 3491 5184 19711 35476 7356 -18204 -22150 -16826
1733 -16826 9045 -3918 -44012 -43563 -13251 2200 12589 -10039 -7620 -15433 -14268 21492 43887
1720 43887 39757 12845 -12228 -24544 -4816 -10267 -18997 -20716 -22651 -19603 -8058 -1353 3753
1707 3753 9689 16862 40379 45815 31384 12816 3450 -1744 24640 55428 60745 46678 18094
1694 18094 7670 -932 -17708 5185 27095 44557 53274 40523 27103 366 -485 -19617 1320
1681 1320 51782 67233 59927 20976 18375 -9407 12497 22310 39848 60449 53732 55730 61915
1668 61915 65693 49458 53059 30187 278 6924 35071 69819 38268 27293 41514 57497
1656 57497 40499 45069 64604 38353 32685 38573 36757 -8623 -45156 -36106 -2707 5460 -44634
1643 -44634 -57544 -41583 -43541 -32400 -1022 4536 -1628 -31108 -19675 -17697 -8221 20910 19657
1630 19657 11988 9477 2193 -18057 -13147 -8032 -6793 -19182 -45893 -57569 -45459 -15889 2773
1617 2773 -1078 -44773 -42207 -54109 -48457 -11426 -6627 -57662 -44050 -18024 -9317 -1159 -24484
1604 -24484 -2813 1924 5363 -8404 -12364 -22911 -19180 -19513 4453 5953 11629 -2342 -18289
1591 -18289 -25410 -22999 -11398 -23615 -19859 -13813 -20818 -8267 21343 1810 -10423 -11455 -25034
1578 -25034 -32804 -41436 -31663 -20793 5551 28180 52378 59984 25341 4841 9151 5052 -3684
1565 -3684 1240 29206 47279 39260 20029 5487 17135 22683 20966 23389 -3350 -8475 -12020
1552 -12020 -14050 -6562 -12660 -20513 -5251 13966 27112 44405 30066 -6703 -4737 7485 5322
1539 5322 4178 1252 -25363 -38727 -19343 -24554 -8547 6064 3055 -16406 -22092 -345 31999
1526 31999 17344 -18097 -36823 -28897 -11963 -9129 -18100 -12607 -13756 -15693 923 -13647 -5691
1513 -5691 10211 27618 12929 -409 1547 -8335 -7823 -43317 -58195 -28952 8149 10768 13148
1500 13148 13175 15405 14435 -10120 -10100 5779 21333 12308 -13852 9489 3329 11834 13569 6026 23060
1485 23060 54022 44070 31778 15198 3510 -21766 -14746 5769 8621 14445 22922 27074 24371
1472 24371 30074 23287 13320 31838 53793 77181 74913 62292 38751 25497 3726 16611 1750
1459 1750 -25806 -19773 -26389 -31815 -34137 -23541 -6997 5352 2951 -2717 2392 23019 65135
1446 65135 63811 31844 24989 25215 26440 46755 51020 5061 3605 36773 27945 12676 16293 29741
1432 29741 37839 19644 16424 17339 34037 27482 -930 -7685 -11995 1188 12017 18560 22182 37012
1418 37012 27405 28014 11361 -4365 -12016 387 10221 11623 4390 3235 -7203 -2599 16777 40262
1404 40262 52410 35291 13494 11553 5104 -13134 -32825 -17534 -10332 19121 36907 41249 54405
1391 54405 41959 32946 37876 31939 32721 12021 -3748 17382 24918 23241 25119 24045 23773 21606
1377 21606 33436 56562 38722 25614 21878 -6637 -4631 12365 18203 -8971 -3089 25381 46746
1364 46746 30977 -2193 -4092 -11330 10217 21191 44523 59371 28421 -13526 -30662 -20252
1352 -20252 -5787 12364 -7874 -18782 -3000 15927 36135 52313 35435 11986 6181 2552
1340 2552 -12058 6265 19240 8573 -38444 -36277 -2125 -4276 13579 10931 14568 20993 39192
1327 39192 50737 37696 906 -31645 -25231 -29947 -18305 -14031 -6033 -5112 3887 20067 26461
1314 26461 8230 13301 32895 7322 -22053 -11488 30514 19497 8104 -6591 -18557 -32742
1302 -32742 -33154 -29951 -13810 -9537 1948 8608 -10463 -35004 -51453 -43573 -25092 -4546 -14189
1289 -14189 -19153 -8027 10103 16321 17111 1818 -10295 -24751 -8047 -25132 -27836 -18712 -49859
1276 -49859 -39677 -653 -4656 -17604 -16970 2604 7716 18222 31973 21286 18966 -1198 -26443
1263 -26443 -26981 -23159 4410 -10053 -15951 -33431 -49974 -58181 -44569 -23967 -5375 1175 -8158
1250 -8158 -41807 -52808 -18037 24612 18388 21423 -3345 -26616 11193 42839 53598 66781
1238 66781 54630 41854 17073 3858 11034 21890 26997 15760 11258 23277 40785 49862 42619
1225 42619 24414 24052 35009 37416 30350 31473 19047 12481 13483 -12310 -11676 -27952 -35133 -24315
1211 -24315 -8836 22407 27590 20382 14332 22036 36291 34231 17567 38194 42576 38565 38770 29080
1197 29080 -5523 -17382 -13233 18485 18669 42051 35546 563 -12374 -9294 -7312 -9159 9923
1184 9923 51524 6490 -9856 -16165 -34112 -27153 -19890 -30884 -45739 -36540 -32848 -16519 -17786
1171 -17786 -16073 -23900 -20241 -27444 -19917 -6464 2924 -16135 -44746 -21057 -29622 -27189 -7625
1158 -7625 11775 -5194 14683 34946 40081 7595 -14166 -17439 -12532 -22627 -32521 -42173 -38382
1145 -38382 -35690 -32128 -15071 4195 -18278 -21067 -23821 -2103 -12619 -18588 16841 53140 43232
1132 43232 18639 33573 44131 38297 36687 63586 76242 66972 53109 30251 -5442 -24057
1120 -24057 -18924 -22584 -32060 -31787 -23360 8099 21744 45999 65149 48055 32164 28936 25478
1107 25478 13286 -10984 15417 49291 52885 47929 51155 47870 33525 36742 60538 46619 18555
1094 18555 1412 -6196 -32243 -23192 26714 65150 60552 54013 56456 61109 47826 18961 16651
1081 16651 37257 36521 54459 46548 27088 35160 42669 47766 55650 31281 32061 28681 8087 -2625
1067 -2625 1294 -2695 -9195 248 -1874 8448 12833 24951 39879 4036 -7267 2334 9189 -21898
1053 -21898 -29813 -52858 -39242 -397 10208 42178 99353 89194 51341 22846 12919 -8124
1041 -8124 -35357 -24686 -29653 -18736 -28484 -19585 7937 12339 7611 -28667 -32321 -29468 3615
1028 3615 45433 50147 30532 27144 14491 2944 12618 7561 -23789 -17309 -5128 1714 5850
1015 5850 -3758 6093 30024 50200 53478 53649 46466 17867 -5646 -23784 -3108 17090 -2843
1002 -2843 8113 35555 12885 -16923 -19070 -4568 -22183 -35998 -19085 -13650 -28384 6617
990 6617 29476 25759 52021 67561 86032 92543 68568 47516 36466 36685 40295 -908 11281
977 11281 13628 -4191 -5989 -11296 -30524 -25454 -15454 -5730 -3064 -4719 10593 22472 42379
964 42379 31146 -3963 -29739 -25352 -15401 -12888 -11257 6506 -16802 -5502 32858 41009 23509
951 23509 21065 33359 29046 25488 9630 -21733 -22475 -17580 -6290 29224 38286 40370 35702 50096
937 50096 54434 41010 28977 63416 56348 30468 14919 27193 39803 54733 47080 55906 58800
924 58800 49656 28437 19822 43667 46513 46477 35611 27281 18096 -1516 546 -10875 -5953 -1144
910 -1144 -8035 13919 15002 7848 52602 47537 45804 37413 45354 60610 54157 37474 21348 -4620
896 -4620 -99 47187 79416 77078 64002 40339 12955 16804 -1984 -17846 -1816 3086 -1877
883 -1877 6188 14364 459 14174 3213 -14335 -31891 -46808 -24454 -421 23047 39051 31029
870 31029 30028 20020 9816 23212 54937 62949 58667 55366 40136 43094 34283 25144 45082
857 45082 47430 14221 -5650 8955 24489 34400 34720 38500 13507 15926 26283 21396 41580
844 41580 28006 16583 27875 33710 19076 20183 13192 12429 6885 9657 29853 41324 23206
831 23206 -1567 2176 -1036 -8003 5070 -2090 -17418 10937 26039 22150 15263 -17131 -24958
818 -24958 -34051 -32556 -12954 15561 30128 31451 29791 15664 19980 33212 10713 -7349 -26188
805 -26188 -8485 8585 22416 7594 524 18035 5047 -4201 -5089 18398 14408 -9022 -8479
792 -8479 -5972 -13894 -12991 -21436 -41969 -43750 287 -4056 -36116 -30165 10647 16599 -24090 -24487
778 -24487 -7669 9527 36850 60715 66746 51861 -5225 -14515 -7872 11803 21687 -12210 -31992
765 -31992 -37982 -59802 -50867 -31103 -31843 -9921 26260 21997 6314 8934 28288 16310 -1208
752 -1208 -17966 -8811 -5423 -9430 -5911 18846 13437 -5109 -5187 7040 7048 25709 30371 62546 57085
737 57085 32394 37178 34021 25217 48792 18052 4033 -20462 -32117 -36281 -24363 -7650 -28886
724 -28886 -47919 -14552 -7135 8767 11515 15180 239 -20266 8284 25595 49831 56434 48402
711 48402 61116 58347 33108 11228 -3237 -7943 23545 44167 12799 -10584 18499 11716 6486
698 6486 6963 15242 13490 -9412 -7457 11251 17280 22286 61660 63284 32747 13214 12759 24417
684 24417 41540 46973 21900 19437 14800 7450 -5247 -12122 15793 35001 24386 12884 5944
671 5944 -19259 -27747 -31749 -43141 -45371 -11309 2563 1726 -16585 -67270 -78389 -50403 -26188
658 -26188 -32950 -20840 -5012 21339 12607 1325 -17267 -23178 -19836 -716 566 -8597 -17362
645 -17362 -17853 -20870 -12601 -24174 -25395 -19831 -19976 -4168 8707 28769 33959 -5937 -32738 -13598
631 -13598 -2850 10405 56132 60309 25507 16788 33701 18008 1052 -11975 -15544 -11005 -15604
618 -15604 -18443 -5720 13456 48710 44661 10751 -2844 -3648 18872 22375 2619 7654 6076
605 6076 -29309 -17953 288 -8871 -1237 -18185 -3774 23800 37125 22777 3014 -14635 -7542
592 -7542 1837 -1767 19181 28949 33431 7570 -5806 11586 60646 67689 77170 71891 89458 62911
578 62911 59724 81680 73656 41877 28566 34790 26266 28556 6982 17196 30446 -2404 -12245
565 -12245 -117 6347 -18951 -18610 -6482 -31976 -46471 -46635 -49228 -33057 -26396 -21143 -15986 -27721
551 -27721 -26383 21234 49259 23566 2252 19299 44349 39980 5959 -566 -6024 -22889 -7426
538 -7426 11312 7309 -8465 -47178 -58026 -37642 -1161 6271 6930 24615 19308 4124 28224
525 28224 5905 -17322 3672 43090 37942 42150 39456 15391 -2140 -10829 -154 16043 19424
512 19424 10187 18607 18833 -15463 -31026 -26646 -29897 -27783 -11876 -9082 -13962 -6097 -10298 -11232 -14784
497 -14784 10173 10624 -10596 -37279 -26609 13333 -17405 -20226 4225 -25662 -28582 -24736 -13451
484 -13451 -685 -2358 7024 -832 10366 48326 43443 165 -13190 -1351 -4927 -9406 -2267
471 -2267 4282 6229 10320 18628 30881 33384 46761 31550 15611 13668 16440 8813 22541 15904
457 15904 -18150 -11843 -10232 -16610 20868 18494 11860 24601 10023 -11085 2143 15350 20140
444 20140 23424 18222 21743 2535 -2909 3877 -639 1620 3891 23825 9136 371 -24475 -13951
430 -13951 -19016 -16573 -16443 7918 22747 -15674 -8091 2678 -8942 -21525 -8894 10654 44946
417 44946 34517 16930 21446 23101 50482 15124 -8288 17557 21048 12907 21006 13938 14832 14552
403 14552 20509 12269 20067 56543 68103 39525 35286 33385 14764 3853 3822 53489 44987 21627
389 21627 30607 30491 27166 55769 55687 55841 36274 18497 -1289 103 34959 34981 5737 4636 26102
374 26102 35653 14442 7924 4611 -15215 -28379 -19875 -10815 1122 9949 14689 1603 -12959
361 -12959 1617 8269 -7692 13585 55963 41593 24349 970 -677 -16994 -8182 23407 25570
348 25570 21157 -6422 -4059 -2013 -6217 -768 -8317 -21809 -11575 -15819 -2204 28455 57615
335 57615 63890 41698 12688 -11631 -23063 -170 26498 44869 30352 14781 -15189 -31782
323 -31782 -23590 -1216 9582 13651 -3701 -22474 5807 11554 14260 45475 52729 15458 -14354
310 -14354 10911 32252 40317 49057 46058 44159 50376 55808 47634 45381 46365 46573 27846 8052
296 8052 23989 37609 6855 23867 24091 20734 25651 7661 -8219 4874 3850 -5313 13622
283 13622 17323 30714 37396 14272 -22053 -24437 594 13740 24596 26410 36942 19692 6954
270 6954 11905 20753 17227 -3703 -17923 299 6394 4136 -10674 -32778 -19438 -7143 -12707
257 -12707 2410 -2959 -21776 -34078 -29444 -8261 -14731 6959 28506 15083 8481 17786 19488
244 19488 1359 -6750 3359 8794 11659 17572 28019 8191 3689 1513 -8186 4171 26602
231 26602 -231 -21793 -23425 -9212 -16377 -33445 -32027 -6476 20729 21279 21357 19870 20032 20784 -3902
216 -3902 -14747 -11383 5861 -5921 35691 54016 52971 65533 57885 44317 31195 22707 10269
203 10269 13023 16988 3902 3424 12647 6573 4843 18351 24574 11615 6293 33865 30773 9631
189 9631 19093 12088 9378 10080 -1875 -20494 -23326 -5740 4077 14715 4291 19562 31701 11401
175 11401 8794 22403 27918 42847 38632 22493 7098 9847 9788 -1055 -16616 1734 16933
162 16933 34444 44694 41748 21823 21305 19466 18558 17902 11147 24740 32063 25871 7238 13447
148 13447 14901 285 643 8489 -4084 -25515 -21998 -6595 -16596 -21788 -12893 -857 19957
135 19957 31874 16452 16753 28521 9778 -5215 8105 27992 44975 61404 74558 65750 21144
122 21144 -5959 14101 31565 27261 45459 43940 27842 2426 9072 17594 19881 7571 -11821
109 -11821 -33727 -27229 8363 29013 14579 -4871 -3784 18309 13783 105 11662 17311 23652
96 23652 49814 50433 20343 1366 -14695 -6616 7870 9267 18174 19638 31547 37768 16094 15622
82 15622 31644 26038 10583 -12251 -10145 -590 5780 3466 14853 9656 -9440 -17338 -24220 -14051
68 -14051 -1175 5473 7890 22186 26152 21724 39160 42266 30338 35458 57517 62686 23199 2547
54 2547 19289 24297 17758 17963 23003 37465 57640 42830 32694 37666 24225 34196 30590 22789
40 22789 4722 -7321 -6839 18846 33922 35373 16779 18752 29824 22504 17773 10848 -1288 -11975
26 -11975 -5267 -2616 -17458 -13735 2476 4514 -2798 -5399 -2426 -1784 20456 23740 13180 28389
12 28389 35788 52818 52402 44293 31546 21606 3048 344 1698 21059 23649 -9082
0 -9082
$$ Imaginary data points
##PAGE= N=2
##DATA TABLE= (X++(I..I)), XYDATA
32767 200886 197410 211814 219472 232935 233591 227970 217646 203157 189082 186125 190540 210101 229138
32754 229138 243392 242485 234731 229168 232036 242510 253152 244467 217270 193337 206786 239422 257129
32741 257129 268183 274315 260492 250257 256883 265747 268462 267657 256547 280477 299164 297601 302407
32728 302407 305074 291076 294182 313545 314838 300311 305364 303355 304621 300868 284266 288763 320137
32715 320137 329377 322182 321758 332069 333230 328617 318834 320252 340598 343721 340005 361543 343266
32702 343266 323305 312390 311893 305035 296485 307571 311504 323582 339727 353185 329450 315767
32690 315767 344524 338644 328906 332655 321973 328712 336436 338781 349080 330856 312209 335199 355344
32677 355344 378871 365111 344106 371315 398685 405695 413857 408943 395469 377043 381110 372663
32665 372663 351645 356841 374578 384596 397886 414721 412973 417095 427149 404307 396760 420456
32653 420456 452015 437443 429060 443083 435360 429504 411695 418510 452191 475825 458670 416802
32641 416802 432555 458927 439703 420771 452307 477660 472739 438273 444675 463114 444435 432310
32629 432310 428516 404815 394304 406083 412099 418771 423232 444179 437729 445042 462971 475299 471763
32616 471763 460527 473504 482557 473126 472487 454500 476488 503374 531164 518409 513433 498198
32604 498198 482372 510035 494503 490270 501470 514885 507397 499013 496366 521279 533860 533485 530078
32591 530078 520703 540539 538614 528348 527097 527187 525537 521983 531774 547859 554574 551773 572518 596507
32577 596507 577563 559553 550135 563981 556061 556159 566722 556308 574152 588907 587322 596535 598847
32564 598847 590093 577715 562533 560288 579323 584937 578897 601183 598432 576056 571501 565576 574354
32551 574354 585728 589943 594687 582585 583973 582201 575301 585290 575594 579795 581431 568287 569032 575540
32537 575540 591167 578202 566030 579328 609360 606109 613184 623600 619113 603959 603753 611544 641664
32524 641664 646169 655283 621470 602154 616513 637985 625905 634945 633687 609239 619420 633349
32512 633349 630696 619248 622776 630428 613026 597518 613055 627874 635977 629752 641676 646457 634732
32499 634732 631535 633743 639323 636086 633094 643219 650056 670547 694567 674886 671512 662219 688282
32486 688282 690024 672702 668070 662119 644430 640928 676523 683207 669681 661297 674859 674089 685201
32473 685201 712811 719294 724118 719568 709140 712611 698126 675228 670765 667235 684986 692203 692347
32460 692347 703173 715852 720093 709468 696822 679542 690812 688858 717922 734207 749804 768538
32448 768538 754705 735891 729910 751996 760987 742202 733226 713032 679077 681005 685941 707285
32436 707285 716842 719216 734229 754562 755326 729098 706239 727333 711843 680604 677128 669765 676610
32423 676610 711585 705680 701283 707853 726389 725619 731678 714804 718994 730818 736073 743082 735375
32410 735375 758064 776738 769504 734307 700482 699765 705924 712837 720452 716179 737309 760189 722799
32397 722799 718184 763107 773523 780952 773192 763548 779558 756199 732825 766074 802231 795943
32385 795943 755278 776803 799531 776644 751328 736766 751365 768260 789509 781895 751446 770708
32373 770708 799507 807170 779468 780186 811481 832623 816458 815038 809707 777698 739242 737818 755113
32360 755113 759872 774621 790812 802897 798405 786919 752047 745283 779760 798736 793896 796954
32348 796954 818924 811178 820800 834920 852912 850385 827982 823136 785052 746696 756824 783957
32336 783957 809279 818338 812631 800212 789849 784391 793090 795496 803117 788602 800151 816051 817899
32323 817899 825540 814973 816271 830568 817410 814605 841916 823338 814568 818433 828747 829283 807512
32310 807512 778874 781997 782831 816178 816750 810622 824548 865604 854868 839932 843015 839721 824197
32297 824197 832863 831801 840400 851726 812759 807622 803508 780188 806312 822242 789798 772876
32285 772876 780109 800437 825485 855996 854670 826610 843015 870568 859692 833683 847326 849425
32273 849425 839000 824329 843591 850304 863925 867106 875738 861948 845497 854479 848195 820526
32261 820526 799654 790649 824798 811258 811640 817237 817479 812952 829380 865348 853185 837728 807765
32248 807765 805946 830165 833521 835462 830188 845105 822392 793100 793905 809903 802712 814370 817825
32235 817825 828582 836958 831701 852994 832032 817612 818752 822537 834956 839700 831381 845401 827458
32222 827458 806574 792342 816083 851912 811165 802795 812612 807358 803237 818881 830638 853386
32210 853386 881173 877189 846612 857709 879229 853696 834920 843419 858575 881091 868114 849759
32198 849759 869409 905142 922136 912792 907856 882081 837546 848632 863780 880953 875023 863113
32186 863113 874783 901567 889642 876785 854749 842467 822348 831699 843377 862591 837187 836738
32174 836738 840169 867793 874003 856243 834967 827442 823228 807640 807778 831048 845672 855836 813629
32161 813629 812575 811486 808772 841653 842699 831691 824470 814009 813428 823944 828159 802106 787292
32148 787292 789658 833986 842118 835336 857088 872885 861831 846319 831388 841232 866261 872696
32136 872696 877270 852898 828792 848012 860799 858670 863105 853410 881842 847549 821635 839354
32124 839354 839978 851510 833552 814377 820206 837643 832714 814254 811908 838239 820894 807567
32112 807567 803054 823974 860041 854141 835313 853950 869804 843548 848080 826228 815103 825473
32100 825473 847422 867006 886660 891691 872050 868587 862941 869269 859741 847511 824265 843711
32088 843711 865606 887596 887356 902882 923716 902102 870599 853177 831343 837673 851295 887860
32076 887860 872103 828275 831765 839404 846051 856714 891080 893312 873164 837301 826456 852704
32064 852704 861529 850709 870849 857662 852431 854636 876817 899056 902760 908415 899741 883342 863735
32051 863735 832094 840388 849964 878453 889647 903046 902034 910797 897971 896332 866230 835757
32039 835757 844129 840598 827591 813701 829158 867044 873349 880764 903382 900935 874171 860969
32027 860969 849904 858465 861062 881144 881086 885083 862103 895591 907188 857622 859445 848519 817839
32014 817839 823597 852594 867866 883310 886956 899170 922797 926865 915171 899452 862557 838410
$$ [...]
##END NTUPLES=NMR SPECTRUM
##END=
