##TITLE=Analysis number 328860
Compound Code cc 58609
Book Reference 528/46
Project Code adrs
Chemist Name davee
##JCAMPDX= 6.0         $$ Bruker NMR JCAMP-DX V2.0
##DATA TYPE= NMR SPECTRUM
##DATA CLASS= NTUPLES
##ORIGIN= Bruker BioSpin GmbH
##OWNER= nmr
$$ XWIN-NMR		Version 3.5
$$ Wed Jul 11 10:08:41 2007 GMT Daylight Time (UT+1h)  MAYBRIDGE\nmr@NMR_250MHZ
##.OBSERVE FREQUENCY= 250.131544655141
##.OBSERVE NUCLEUS= ^1H
##.ACQUISITION MODE= SIMULTANEOUS (DQD)
##.ACQUISITION SCHEME= undefined
##.AVERAGES= 16
##.DIGITISER RES= 18
##SPECTROMETER/DATA SYSTEM= dpx250
##.PULSE SEQUENCE= zg30
##.SOLVENT NAME= DMSO
##.SHIFT REFERENCE= (INTERNAL, DMSO, 0, 16.522)
##AUDIT TRAIL= $$ (NUMBER, WHEN, WHO, WHERE, WHAT)
$$ ##TITLE= Audit trail, XWIN-NMR		Version 3.5
$$ ##JCAMPDX= 5.01
$$ ##ORIGIN= Bruker BioSpin GmbH
$$ ##OWNER= nmr
$$ C:\u/data/dgb/nmr/ADRS/740/pdata/1/auditp.txt
$$ ##AUDIT TRAIL=  $$ (NUMBER, WHEN, WHO, WHERE, WHAT)
(   1,<2007-07-11 10:08:18.95 +100>,<MAYBRIDGE\nmr>,<NMR_250MHZ>,
      <created by zg, POWCHK disabled, PULCHK disabled
       configuration hash MD5:
       76 6E 9A 78 1E 09 19 81 EC 84 63 8F B0 6A 59 2D
       data hash MD5: 64K
       94 B2 FE AC FA D5 5E 11 48 04 B2 1B 9D 99 93 C6>)
(   2,<2007-07-11 10:08:30.81 +100>,<MAYBRIDGE\nmr>,<NMR_250MHZ>,
      <Start of raw data processing
       ef LB = 0.3 FT_mod = 6 PKNL = 1 SI = 32K 
       data hash MD5: 32K
       0D CE A9 83 6A B7 DF 10 FC FB B3 6A 80 E0 D6 2D>)
(   3,<2007-07-11 10:08:32.44 +100>,<MAYBRIDGE\nmr>,<NMR_250MHZ>,
      <apk 
       data hash MD5: 32K
       23 09 EE 12 F3 1D A8 CC 8B 12 D4 B3 9B D7 42 30>)
(   4,<2007-07-11 10:08:33.19 +100>,<MAYBRIDGE\nmr>,<NMR_250MHZ>,
      <abs ABSG = 5 
       data hash MD5: 32K
       FF 3D 4B 66 BF C2 42 13 62 6B 0B FC F3 9E 92 C2>)
$$ ##END=
$$ 
$$ hash MD5
$$ 13 97 72 2A 89 E3 FF 01 18 ED CA A3 22 02 A0 AC
##$RELAX= 
##$RELAX= 
##$RELAX= 
##$RELAX= 
##$RELAX= 
##$RELAX= 
##$RELAX= 
$$ Bruker specific parameters
$$ --------------------------
##$DU= <C:\u>
##$EXPNO= 740
##$NAME= <ADRS>
##$PROCNO= 1
##$TYPE= <nmr>
##$USER= <dgb>
##$AMP= (0..31)
100 100 100 100 100 100 100 100 100 100 100 100 100 100 100 100 100 100 
100 100 100 100 100 100 100 100 100 100 100 100 100 100 
##$AQSEQ= 0
##$AQ_mod= 3
##$AUNM= <au_zg>
##$AUTOPOS= <3 >
##$BF1= 250.13
##$BF2= 250.13
##$BF3= 250.13
##$BF4= 250.13
##$BF5= 500.13
##$BF6= 500.13
##$BF7= 500.13
##$BF8= 500.13
##$BYTORDA= 1
##$CFDGTYP= 0
##$CFRGTYP= 5
##$CHEMSTR= <none>
##$CNST= (0..31)
1 1 145 1 1 1 1 1 1 1 1 1 1 1 1 1 1 1 1 1 1 1 1 1 1 1 1 1 1 1 1 1 
##$CPDPRG= <>
##$CPDPRG1= <>
##$CPDPRG2= <>
##$CPDPRG3= <>
##$CPDPRG4= <mlev>
##$CPDPRG5= <mlev>
##$CPDPRG6= <mlev>
##$CPDPRG7= <mlev>
##$CPDPRG8= <mlev>
##$CPDPRGB= <>
##$CPDPRGT= <>
##$D= (0..31)
0 1 0 0 0 0 0 0 0 0.06 0 0 0 0 0 0 0.0002 0 0 0 0 0 0 0 0 0 0 0 0 0 0 
0 
##$DATE= 1184144897
##$DBL= (0..7)
120 120 120 120 120 120 120 120 
##$DBP= (0..7)
150 150 150 150 150 150 150 150 
##$DBP07= 0
##$DBPNAM0= <>
##$DBPNAM1= <>
$$ [...]
##$SUBNAM7= <"">
##$SUBNAM8= <"">
##$SUBNAM9= <"">
##$SW= 20.6930455092707
##$SWIBOX= (0..15)
0 0 3 0 0 0 0 0 0 0 0 0 0 0 0 0 
##$SW_h= 5175.983436853
##$TD= 65536
##$TD0= 1
##$TE= 296.16
##$TE2= 300
##$TE3= 300
##$TEG= 300
##$TL= (0..7)
0 120 120 120 120 120 120 120 
##$TP= (0..7)
150 150 150 150 150 150 150 150 
##$TP07= 0
##$TPNAME0= <>
##$TPNAME1= <>
##$TPNAME2= <>
##$TPNAME3= <>
##$TPNAME4= <>
##$TPNAME5= <>
##$TPNAME6= <>
##$TPNAME7= <>
##$TPOAL= (0..7)
0.5 0.5 0.5 0.5 0.5 0.5 0.5 0.5 
##$TPOFFS= (0..7)
0 0 0 0 0 0 0 0 
##$TUNHIN= 0
##$TUNHOUT= 0
##$TUNXOUT= 0
##$USERA1= <user>
##$USERA2= <user>
##$USERA3= <user>
##$USERA4= <user>
##$USERA5= <user>
##$V9= 5
##$VALIST= <valist>
##$VCLIST= <CCCCCCCCCCCCCCC>
##$VD= 0
##$VDLIST= <DDDDDDDDDDDDDDD>
##$VPLIST= <PPPPPPPPPPPPPPP>
##$VTLIST= <TTTTTTTTTTTTTTT>
##$WBST= 1024
##$WBSW= 4
##$XGAIN= (0..3)
0 0 0 0 
##$XL= 0
##$YL= 0
##$YMAX_a= 418864
##$YMIN_a= -393777
##$ZGOPTNS= <>
##$ZL1= 120
##$ZL2= 120
##$ZL3= 120
##$ZL4= 120
##$ABSF1= 16.522
##$ABSF2= -4.171173
##$ABSG= 5
##$ABSL= 3
##$ALPHA= 0
##$AQORDER= 0
##$ASSFAC= 0
##$ASSFACI= 0
##$ASSFACX= 0
##$ASSWID= 0
##$AUNMP= <proc_1d>
##$AZFE= 0.1
##$AZFW= 0.1
##$BCFW= 0
##$BC_mod= 0
##$BYTORDP= 0
##$COROFFS= 0
##$CY= 12.5
##$DATMOD= 1
##$DC= 0
##$DFILT= <>
##$DTYPP= 0
##$F1P= 14.0000005364418
##$F2P= -0.99999901652339
##$FCOR= 0.5
##$FTSIZE= 32768
##$FT_mod= 6
##$GAMMA= 0
##$GB= 0
##$INTBC= 1
##$INTSCL= 1
##$ISEN= 128
##$LB= 0.3
##$LEV0= 0
##$LPBIN= 0
##$MAXI= 10000
##$MC2= 0
##$MEAN= 0
##$ME_mod= 0
##$MI= 0
##$NCOEF= 0
##$NC_proc= -3
##$NLEV= 6
##$NOISF1= 0
##$NOISF2= 0
##$NSP= 0
##$NTH_PI= 0
##$NZP= 0
##$OFFSET= 16.522
##$PC= 1
##$PHC0= -63.13807
##$PHC1= 7.087069
##$PH_mod= 1
##$PKNL= yes
##$PPARMOD= 0
##$PSCAL= 4
##$PSIGN= 0
##$REVERSE= no
##$SF= 250.13
##$SI= 32768
##$SIGF1= 0
##$SIGF2= 0
##$SINO= 400
##$SIOLD= 32768
##$SREGLST= <1H.DMSO>
##$SSB= 0
##$STSI= 32768
##$STSR= 0
##$SW_p= 5175.98343685301
##$SYMM= 0
##$S_DEV= 0
##$TDeff= 65536
##$TDoff= 0
##$TI= <Analysis number 999999
Compound Code 99
Book Reference 9
Project Code 9>
##$TILT= no
##$TM1= 0
##$TM2= 0
##$TOPLEV= 0
##$USERP1= <user>
##$USERP2= <user>
##$USERP3= <user>
##$USERP4= <user>
##$USERP5= <user>
##$WDW= 1
##$XDIM= 32768
##$YMAX_p= 374927743
##$YMIN_p= -68362
$$ End of Bruker specific parameters
$$ ---------------------------------
##NTUPLES= NMR SPECTRUM
##VAR_NAME=  FREQUENCY,     SPECTRUM/REAL,   SPECTRUM/IMAG
##SYMBOL=    X,             R,               I
##VAR_TYPE=  INDEPENDENT,   DEPENDENT,       DEPENDENT
##VAR_FORM=  AFFN,          ASDF,            ASDF
##VAR_DIM=   32768,         32768,           32768
##UNITS=     HZ,            ARBITRARY UNITS, ARBITRARY UNITS
##FACTOR=    0.157963299565203, 1,           1
##FIRST=     4132.6476996994, 0,             0
##LAST=      -1043.33573715361, 0,           0
##MIN=       -1043.33573715361, -68362,      0
##MAX=       4132.6476996994, 374927743,     0
$$ Real data points
##PAGE= N=1
##DATA TABLE= (X++(R..R)), XYDATA
$$ [...]
20731 1566 12505 35080 54182 49942 47119 39962 43882 51816 68895 64467 56581 51245 59050 57231
20717 57231 44421 39048 31749 35978 55653 64097 54521 55931 61513 57925 57378 42699 41195 43771
20703 43771 27606 1599 21082 33175 39922 44791 52868 53087 39767 50281 58592 56500 62050
20690 62050 36157 6910 13099 13498 7405 26414 30379 40740 40706 38077 32528 36208 29484 22994
20676 22994 11760 21234 32176 53919 61546 48315 33885 44014 60978 45100 30013 8938
20664 8938 -1226 10813 42372 35286 31614 24008 18168 16467 27772 30540 15729 40919 42919
20651 42919 40587 23387 34176 53356 37073 35383 34610 39612 41798 31931 26202 29981 27209 47260
20637 47260 49794 69855 82167 77931 74556 65677 62861 48637 35669 57441 64746 68696 70763
20624 70763 74978 70305 67030 72107 62744 62593 69712 69198 70134 56820 56653 56982 62311 59415 79649
20609 79649 86397 75115 80696 100554 87088 87166 82901 77642 88534 108549 118923 110475 105129
20596 105129 97208 79566 69861 82962 93838 91347 96753 96111 100957 98750 103637 118364 120241
20583 120241 127977 111831 101379 99748 119953 133081 134727 136600 129357 115883 114331 110457 103901
20570 103901 113271 111615 105181 98038 88291 86824 102153 123714 128039 134585 138175 136209 118766
20557 118766 115299 123366 138993 138408 126426 114391 93367 81899 97434 97566 95686 86901 86233
20544 86233 85618 76801 83675 97611 116267 117718 104183 109393 117283 124374 133861 129738 123982 132544
20530 132544 156685 163860 179342 219490 246397 257632 264839 251621 235727 209459 188477 198410
20518 198410 201384 202840 232085 258397 264945 254239 200867 146002 126170 134741 155502 163426
20506 163426 158023 162373 191643 205538 217821 244726 270221 308590 358966 405723 447256 492623
20494 492623 549880 619758 724122 862808 1012910 1125078 1200994 1215480 1140404 1034143
20484 1034143 933677 890635 860722 876309 925413 969963 989431 954376 886898 794368 710144
20473 710144 650866 627536 605209 613153 584013 574157 568688 593944 627692 684893 746519 823786
20461 823786 915523 953658 962670 944254 934297 958066 991690 1040142 1109860 1216635 1349474
20450 1349474 1452272 1464788 1413279 1324560 1216541 1137633 1079800 1047863 1029486 997423 964534
20439 964534 918727 904932 909100 888936 858829 834594 817481 828643 854254 864468 892019 911936
20427 911936 921032 919699 912647 932460 964849 981681 1004708 1036803 1073937 1110292 1132402 1167715
20415 1167715 1215729 1253410 1267821 1301410 1337330 1384466 1436675 1504676 1588306 1671020 1775474
20404 1775474 1879084 1969659 2090233 2222035 2355947 2483805 2592107 2655382 2723459 2810836
20394 2810836 2942760 3092945 3301384 3521907 3729523 3956260 4213322 4479321 4757062
20385 4757062 5020509 5277973 5531802 5827505 6199449 6676437 7296319 8059976 8975344
20376 8975344 10104065 11496694 13222818 15414203 18263632 22009875 26990568 33628784
20368 33628784 42242390 52841138 64653971 75627062 82601662 82730022 76182319 66492870
20360 66492870 57483736 51098439 47711934 47103247 48820110 52036758 55131206 55726001
20352 55726001 52374911 46016735 38973403 32901140 28318300 25107382 23075031 21973879
20344 21973879 21687946 22202853 23543803 25903560 29490954 34542493 41035780 48286302
20336 48286302 54542419 57515278 56434249 53068283 49920415 48700956 50197808 54728993
20328 54728993 62317073 72272330 82324180 88259270 86637378 77978018 65699964 53142105
20320 53142105 42252979 33609504 27047321 22109071 18386203 15528114 13277203 11499548
20312 11499548 10064647 8905441 7981338 7228009 6620880 6128397 5737025 5396366 5102261
20303 5102261 4846168 4580780 4304344 4047837 3825662 3627867 3433883 3263510 3094714
20294 3094714 2940101 2796274 2671947 2581347 2495742 2408960 2290520 2131594 1949738 1778295
20284 1778295 1620391 1488808 1400552 1317261 1241270 1171615 1118168 1059752 1002423 963104 933659
20273 933659 902537 857942 787613 750151 718721 690825 653165 645246 629316 610087 581294 557853
20261 557853 533174 530676 519941 485520 462530 452406 464952 420706 369473 354150 364878 337752
20249 337752 316632 317678 318045 303829 302901 287265 282487 275462 279735 272727 259011 261984 271630 261451
20235 261451 240217 230654 248871 255451 248643 260791 268913 258444 274559 287566 279589 278731 288882
20222 288882 285558 253874 242137 236777 233761 219115 216708 206438 213658 217003 205284 199633 189503
20209 189503 177346 155810 140483 134894 143793 151939 153867 162680 179606 177174 179207 167814 165346
20196 165346 183827 194586 211098 214128 205935 188135 187733 191467 204338 213014 225598 227963 228107
20183 228107 231410 234438 224402 223063 201773 177871 166517 168530 169230 158957 150366 148398 147677
20170 147677 163358 161437 161117 155247 141839 145879 144485 146037 150381 153777 156592 156488 139475 126365
20156 126365 119194 124113 123896 140218 125092 131846 140957 126723 126145 109524 86095 81386 102034
20143 102034 132259 146387 131449 108214 121002 124804 110338 108634 96881 91551 101635 86829
20131 86829 68883 92864 102514 102848 89593 84976 75805 73210 61982 80167 86359 82384 84374
20118 84374 84644 103223 143772 139455 119283 114848 106602 92239 72437 68504 69237 85579 84569
20105 84569 85979 65996 54139 56372 62645 66050 65624 59281 50943 40246 51487 63386 57091
20092 57091 46317 59619 55888 47849 51163 33027 47953 76724 71611 74559 78456 84158 85516
20079 85516 92524 101028 100571 90492 79171 70959 81847 80986 75688 64536 51165 52419 64261
20066 64261 77143 69017 63875 62675 53452 56005 84596 97246 96803 88239 72306 82102 69702
20053 69702 47117 35488 50833 63770 70975 56562 47947 55956 58380 49180 46535 52692 62158
20040 62158 67538 55946 48493 46642 39931 45614 48678 29163 18164 15959 19445 22791 29350 35813
20026 35813 39723 32869 53401 50280 42240 22713 7002 10287 7415 17100 6629 6566 11129 17742
20012 17742 13686 28424 28529 25566 40894 44863 25937 4264 -4158 21056 41413 55447 54615
19999 54615 34720 21660 15276 5866 -4390 24234 29697 24692 31186 37450 30714 33983 22645
19986 22645 24807 23930 13402 32245 37616 36403 28140 25450 24865 21600 22138 29064 38583 41321 34787
19971 34787 38334 46909 40905 14031 26664 41226 39261 31043 19217 31772 48102 37722 19716
19958 19716 29912 37011 43729 52096 51875 49044 59195 51510 32275 12749 10385 30683 39924
19945 39924 35977 47566 38852 37607 17460 16815 36890 24455 38527 37935 35542 36842 38992 37521
19931 37521 28547 15973 -12952 -11277 -609 4955 12120 23406 19703 14728 17598 16028 11710
19918 11710 17573 34383 13207 14734 30581 32027 27590 37718 45609 52825 40317 39259 37272
19905 37272 40053 40040 20598 8884 9447 6027 -1511 140 -4324 4833 24361 35183 30189 25466
19891 25466 32633 31506 26569 24425 37384 32608 35579 13691 3640 11724 38241 53693 66321
19878 66321 43088 45022 43851 24526 15183 38212 30726 28421 24624 33164 18517 19778 14094
19865 14094 31882 9854 10147 17171 22762 26635 9610 14464 18089 13089 22485 16029 27412 16159
19851 16159 15597 28903 23828 33626 38513 32142 28567 39028 21839 3508 -9694 5028 27417
19838 27417 48143 33845 8447 11415 33297 28411 1884 -5719 1541 -3674 13055 14838 13668
19825 13668 20508 22602 3412 -296 26913 40332 43478 44187 53370 45677 38640 24551 36959
19812 36959 43443 42390 45032 52365 58459 69598 63842 81469 90312 102586 117500 114115 113266 116811
19798 116811 137607 165908 182909 199244 232560 272561 320584 371143 400122 372094 331821
19787 331821 311876 306245 300281 302206 299079 288669 274464 244029 233801 207967 168250 175925
19775 175925 199921 231371 224713 212668 209225 210161 194067 186908 184773 172312 157641 160741 182689
19762 182689 194474 221651 245559 262394 294016 321809 340187 369310 411347 411227 421913 428815
19750 428815 402818 356861 294745 252351 228038 191825 168730 145352 111964 78476 71414 78236
19738 78236 74597 52200 53485 48032 49488 60807 39554 28197 26062 19409 16321 36447 40970
19725 40970 41864 32869 26322 47687 47710 33221 4700 -1888 10990 43302 39044 33462 33972 6404
19711 6404 -17772 -21519 -18624 -27277 -32068 -33908 -18281 -17501 -25275 -19462 -4984 1890 22666 39599
19697 39599 12383 4937 4763 13505 9397 2722 2257 -2883 15867 20549 20917 11513 -2280 -12483
19683 -12483 -2420 5719 3539 5868 4482 8828 13348 6468 -16540 -18105 17024 38306 33967
19670 33967 39127 41212 35988 21463 1757 -670 9238 19892 13032 -212 -10031 -19250 3455
19657 3455 20540 28924 17821 3598 19777 9145 2250 8433 -1772 -10349 -5086 -1415 13981
19644 13981 11650 11658 4830 10577 15126 8965 -8520 -13810 -26335 -8589 22775 26151 18981 10632
19630 10632 -5477 -12807 -9601 1813 19581 21346 2476 -1091 19970 24357 6213 -4462 -2922
19617 -2922 -3388 546 14936 13310 20927 24581 9577 6349 -1365 13306 18437 11201 16943 24845
19603 24845 14963 9195 12977 22919 13089 14421 15027 35410 32526 26047 9444 -4521 -10969 4871
19589 4871 29697 23926 7078 -5635 4787 8586 -9226 -8569 4549 5356 3759 378 -14310
19576 -14310 -13780 -2470 -5303 -1771 -3613 9679 12493 12004 23615 30140 30872 20546 33944 39548
19562 39548 42645 52394 46751 21522 -2144 2824 4563 18224 14523 13752 28376 37974 46801 68659
19548 68659 55427 32683 30276 44343 59695 72208 98919 111492 128462 158732 206737 257739
19536 257739 305570 319447 316176 301553 315858 344172 336109 312515 296331 294556 310051 325306
19524 325306 346646 341072 341143 346195 345380 322309 291394 274422 253906 232590 198081 166549 155210
19511 155210 130538 124834 136637 128979 156570 194532 213099 254693 282915 300254 325206 321574
19499 321574 319499 331054 335017 290861 253607 239042 245442 290487 326671 338121 330696 304876
19487 304876 297386 302695 291943 260485 219340 188564 155696 118623 100212 83939 74889 81921
19475 81921 86684 84814 77800 57760 51601 60523 36502 31475 28023 15456 10353 12066 27264
19462 27264 44850 50343 51294 20955 -59 2204 14896 29599 25309 10272 28529 44098 39010
19449 39010 26825 11259 -12685 -17388 -6879 -10347 -12007 -7304 -21739 -30547 -11499 10972 22482
19436 22482 20740 19490 26884 25738 15993 27736 12103 7386 2845 1216 -8130 -15003 -32866 -12526
19422 -12526 2213 3045 15244 -9414 -13277 13558 20765 27841 28223 40081 30829 28005 44785
19409 44785 34580 29637 18048 17561 24488 14452 523 -12210 -5717 -15251 -30039 -36723 -52427
19396 -52427 -54588 -36394 -16630 -6479 -2316 13924 27139 34509 39651 35695 22184 23091 15354
19383 15354 5785 3585 13197 32873 50529 36167 21072 9532 20439 27718 30226 31746 41594
19370 41594 53707 41910 19508 6866 7785 1298 14482 34765 39105 30201 38729 41351 26690
19357 26690 24871 30376 23737 20294 19314 17551 31166 36501 32735 28728 47188 47694 54019 60382
19343 60382 44968 41184 18711 5443 2053 8856 9384 -1326 -17352 -13374 -7764 -3466 -3226 -1148
19329 -1148 14562 22245 15550 19160 24095 26037 21273 9187 4678 15744 12085 29554 34704 37334
19315 37334 41553 25955 10830 6785 24112 40765 32383 15722 31856 42770 42505 28535 9669
19302 9669 896 7457 20675 27530 11800 20824 41758 48907 66062 56441 44157 26846 33603
19289 33603 41981 44366 48941 53901 50511 31129 30025 27788 25247 19950 27761 25688 20679 23080
19275 23080 32866 55987 63441 44910 42867 66699 75840 50261 55625 64187 60881 53683 58589
19262 58589 58309 68898 67914 84081 86545 97375 87434 67220 68253 73061 68226 69575 73698 79329
19248 79329 86356 81055 88730 106746 112566 96687 115157 142849 158992 203329 243786 269213
19236 269213 309673 299951 239734 198760 173051 147558 146081 139361 171821 207705 209723 196207
19224 196207 189663 199763 183693 162761 130273 132153 143839 122160 93973 105682 127362 125557
19212 125557 117888 143639 164564 196679 220293 214854 203641 203800 206223 203768 211861 252672 320779
19199 320779 399433 506090 643891 789227 920176 1065017 1139602 1059461 843025 645338
19189 645338 516124 444952 422843 437287 494597 563056 655057 698268 621208 471821 358195
19178 358195 304245 274911 250994 234683 221546 214829 239275 268073 290954 322315 390716 484634
19166 484634 584116 660992 643881 525135 421282 379440 380963 415222 475694 588956 750903
19155 750903 925735 1024978 930639 726391 542820 392919 289607 244977 220685 205763
19145 205763 188678 200433 217153 237088 248060 256432 230665 236712 255682 290298 312134 341376
19133 341376 366288 373568 374136 348565 339088 327954 294093 275240 289344 318715 348681 369805
19121 369805 374915 377430 344539 323956 303424 300283 313844 330425 348868 362929 345503 341091
19109 341091 353936 370190 387166 425661 440675 449480 474051 482961 461750 460030 473013 449316
19097 449316 447153 486935 551534 585873 594439 604488 585960 569991 568400 568929 579242 610646
19085 610646 640847 639515 630738 600663 589581 588182 597965 592632 588287 586077 584956 586065 584777
19072 584777 582220 582046 590268 599311 616560 648067 690797 704994 702449 709012 726783 735380 744093
19059 744093 785313 810199 859807 897529 909203 931043 946688 981397 1019873 1044808 1075365
19048 1075365 1134817 1191553 1232943 1269300 1321726 1374245 1428749 1508151 1596896 1730719 1892491
19037 1892491 2051910 2228428 2428466 2631985 2828041 3063559 3368420 3735016 4172631
19028 4172631 4661440 5185528 5725630 6294985 6969604 7862952 9059010 10644485 12803580
19019 12803580 15884726 20371626 27117449 37366303 52607612 73442270 97259971
19012 97259971 118029942 123551990 106163891 79798230 59208983 47240490 41894664
19005 41894664 41551342 45700802 54328785 66171136 74610914 70259107 55713951 41147887
18997 41147887 30917437 24403455 20316292 17809538 16419103 15879329 16127162 17242231
18989 17242231 19424164 23017713 28632659 37210617 49486014 63871219 72455378 67979676
18981 67979676 55985314 45581680 40074583 39474105 43640627 53241903 69504690 92411540
18973 92411540 113869926 116924111 100182899 76416228 54495194 38324888 27697079
18966 27697079 20817611 16242500 13106395 10883036 9240652 7977173 7016827 6295916
18958 6295916 5695399 5109018 4588807 4111970 3693506 3335450 3038335 2775988 2526838
18949 2526838 2299372 2105415 1942900 1783111 1647512 1533728 1458949 1379239 1288173 1216834
18939 1216834 1142794 1068997 995796 933131 894951 861997 819489 775572 724076 681523 656200
18928 656200 616880 576155 556585 564172 558035 528152 491063 472752 454802 447795 425429 386889
18916 386889 382588 366056 355335 344233 326101 293348 266335 265960 263260 256646 267173 265385 247777
18903 247777 221571 216643 209755 204883 172469 156350 164154 150491 108800 74579 59878 49809
18891 49809 71570 81454 95354 99954 127106 138972 122202 109423 87717 59585 58095 78169
18879 78169 103778 108284 97498 114837 129967 125733 132300 157125 164059 145046 132139 122647 106607
18866 106607 91684 88599 82357 81939 106829 119385 117900 93691 72957 70170 46713 27925 18514
18853 18514 13736 16662 36968 56966 67300 83574 94688 82996 88844 93537 100550 108890 122920
18840 122920 127709 149353 156694 155973 167994 184182 201970 206219 213573 220383 192458 196721 182427
18827 182427 163955 153635 158351 161093 150856 141217 139412 138304 131826 119110 101831 111773 110499
18814 110499 83332 72308 93833 116709 108152 103335 99680 98594 76541 68456 58809 53422 79216
18801 79216 112499 116754 125026 121153 110779 97429 99450 107733 102318 89906 99567 107821 100361
18788 100361 102463 82786 45783 40116 46850 45520 52632 57188 41269 44235 55070 66843 61720
18775 61720 46856 45485 43327 56335 45997 42833 50799 46173 46894 51569 61877 65160 63774 65831
18761 65831 55052 74098 58897 49769 32840 33033 53378 59410 66669 79030 81600 73861 75398
18748 75398 68866 57807 46167 51452 49705 43022 38382 50260 48919 44387 51901 56123 41003
18735 41003 32601 23397 17268 34516 29525 11214 -2561 26274 52986 54110 49792 50911 63215
18722 63215 79117 86354 64168 59092 34351 34382 41441 49185 67885 69955 69186 72054 81702 79155
18708 79155 65033 69641 52195 32640 23961 29029 35796 42336 48433 39984 47825 59188 36750
18695 36750 18900 2275 -14852 -7169 6935 3175 10303 17277 33998 46738 28355 25866 38670
18682 38670 53586 40115 42180 23589 7531 20401 28209 19299 34510 43904 29658 36388 43555
18669 43555 36129 15392 1456 -8712 4100 3974 793 -4292 26552 41828 25165 1934 -6574
18656 -6574 -7531 -2159 -24051 -20852 -4396 4990 3090 1762 23030 41504 43792 23294 -15702
18643 -15702 -20570 -4537 3915 -1734 872 -8349 -9677 -7062 -12901 -21672 -8834 -9696 -2749 7320
18629 7320 12910 13379 4709 3189 7085 -15170 -21181 -15165 -4904 -20147 -17646 -22339 -8872 3345
18615 3345 29557 43598 29012 18254 11515 3914 -18004 -29109 -22679 -24508 -20878 -22993 -32699
18602 -32699 -22247 -13533 -18969 -17548 58 24989 52513 47510 12926 -15086 -11245 -3519 -8872
18589 -8872 -9796 -19446 -12736 -10312 7900 39845 43935 29852 8389 9359 6704 16922 11843 21328
18575 21328 31247 26591 23221 31236 40721 36308 35582 31469 43567 41317 25257 35463 26356 16696
18561 16696 6220 5042 5549 2794 4010 -1567 6361 1776 -168 1439 3288 -1327 5424 6253 -1496
18546 -1496 5463 6401 -2606 -2367 -5101 9015 27448 23130 16100 11546 -1128 -13688 -13559 4076
18532 4076 26932 31220 22080 30209 36799 23864 25526 4990 16261 7464 -412 -4578 -4614 147
18518 147 -500 9803 21892 35337 16023 -3332 -14542 -7783 -12752 -1936 14675 20344 8190
18505 8190 12097 3609 11265 26025 56472 70918 60693 86926 99508 116475 163356 216751
18493 216751 266438 289145 297432 303786 295569 298239 295494 289347 272076 271591 273592 275446 295105
18480 295105 291615 297960 302438 295474 289807 286397 254658 210172 166284 133488 105958 102979 114005
18467 114005 94508 96587 102199 113379 147648 192848 226779 278299 306433 301283 293408 305207
18455 305207 314163 301037 275800 246210 240772 259718 268354 287645 306474 292504 277839 254545
18443 254545 245430 247947 227735 198690 153484 134119 117283 91835 74512 64199 43879 33590
18431 33590 17379 9963 18153 17354 26558 27494 20980 12503 817 11663 8010 -12638 -29248 -25475
18417 -25475 -20662 -4821 -1694 8957 5518 -239 -4953 -7904 -4661 3266 733 3568 -6302 -9640
18403 -9640 5982 18371 -3089 -8194 4491 14590 5425 -7842 -9617 2364 10056 7385 -4764
18390 -4764 -8226 -3766 11 11722 10737 14887 11311 9157 -728 -15890 -16567 -14440 -7664 -9449 -11029
18375 -11029 -6287 -13126 -27798 -20461 -19624 -17537 -10130 -6940 -15255 -10261 -15836 -7985 -17539 -20962
18361 -20962 -24211 -26533 -24880 -23691 -25252 -15433 -26893 -33044 -35726 -29613 -32141 -20978 -3437 -2618
18347 -2618 -17707 -30256 -18960 -17059 -27504 -26303 -7023 11639 16772 7910 13451 2883 -7978
18334 -7978 -4236 15866 28776 7886 4370 4288 9686 -5309 -42893 -37414 -33346 -3838 3566 -5932
18320 -5932 -12429 -10233 -16736 -11910 9613 12295 8057 -1600 -5582 -16674 -21928 -12155 -14911 -19108
18306 -19108 -26711 -38489 -38729 -34516 -31554 -45460 -44628 -20218 -12093 -16301 -30477 -42731 -32156
18293 -32156 -14394 -28081 -31218 -32974 -39340 -30042 -14555 -9700 -11772 -19402 -35681 -43280 -32847
18280 -32847 -38321 -34878 -14738 -28884 -34501 -24669 -27871 -36172 -22803 -10945 403 2017 -2667
18267 -2667 6933 29025 26453 3414 -4359 -4031 2373 16666 4043 -17420 -23911 -26469 -25361 -23406
18253 -23406 -17470 -5097 14432 12905 8794 5408 2484 -11396 -26800 -20397 2808 2495 -17143
18240 -17143 -25019 -3744 7262 -3454 -15935 -23558 -41186 -15914 -9170 -19574 -4586 1097
18228 1097 -17690 -22671 -2379 14592 5925 -13843 -9554 -2846 -3489 -3162 -2154 3189 -12804 -21716
18214 -21716 -14325 5809 30616 29269 19818 20810 8563 -779 -20908 -30945 -21922 676 -7095
18201 -7095 -13678 -29868 -21728 -10033 3083 -2587 92 13478 413 262 -11248 -19475 -21183
18188 -21183 -6304 8636 11154 -2883 -3937 -8854 -8298 -16034 -26243 -35159 -26464 -8998 -25684
18175 -25684 -24508 -25951 -42325 -34721 -27046 -38514 -23950 -11439 -10938 -15484 -19602 -31333 -47808
18162 -47808 -27706 1001 -23213 -37422 -44152 -36007 -23061 -10229 -8934 -15088 -10880 -5330 1696
18149 1696 4302 16855 2527 -8308 -12890 -24782 -24502 -21988 -10347 -12691 -9709 6 3209 -10959
18135 -10959 -16005 -11827 -28499 -34178 -21170 -10475 -17981 -23542 -7071 2896 -6376 -15429 -12157
18122 -12157 -14017 -904 -5310 -14301 -23544 -32952 -37638 -39862 -50032 -43722 -27105 -4821 -4811 2951
18108 2951 -1199 6801 10352 -6183 3711 2240 -19258 -19973 -22869 -18344 -16824 3888 9133 1598
18094 1598 -7642 3952 6053 -16084 -17697 -18434 -22031 -28461 -41615 -50786 -28563 -16396 -31111
18081 -31111 -19904 -8575 -30508 -22232 2672 11114 15899 220 -10635 -15415 -10955 -13388 -10515
18068 -10515 306 2175 9101 -4329 -18750 -29318 -24328 -13810 -15026 -6283 15160 6386 -19832
18055 -19832 -17271 -19209 -22773 9983 31839 36492 20683 5580 -8619 -14677 -7688 -11316 -15968
18042 -15968 -16464 -13157 -22222 -22764 -24866 -16717 -16813 -16738 -25592 -13501 7573 12564 14149 8112 -18060
18027 -18060 -37845 -44460 -41325 -41580 -33362 -29210 -41772 -63921 -60867 -30917 -24541 -33926 -41953 -22227
18013 -22227 -1884 3666 3455 16192 16960 8727 -5155 -7225 -16631 -29461 -45405 -51299 -53852 -54920
17999 -54920 -51081 -30296 -18450 -17424 16359 20166 4262 13044 11802 -6918 -16687 6469 14489
17986 14489 -1660 -9031 8813 8764 -18419 -14956 -1424 -11121 -11436 963 -5906 -18730 -14108 4105
17972 4105 16433 17642 9113 2 4416 -11569 -14630 -2412 17644 15940 20059 28341 32285 35988
17958 35988 7775 -19954 -7014 -2796 7625 -13452 -28458 -21522 -5249 -10590 -25115 -38786
17946 -38786 -19082 -14570 -4787 8266 12483 13600 -11116 -18694 -15504 -31151 -34585 -29053 -16978
17933 -16978 -12650 -12191 -16499 -18222 -20870 -32844 -29649 -28741 -32700 -33603 -16371 -8908 -10049 -10785 -1453
17918 -1453 4504 1669 734 -3732 -6762 18 -13129 -21539 -19068 -18951 -14507 -11182 -8806 -28603 -36391
17903 -36391 -35829 -37777 -30075 -25231 -39858 -42765 -30613 -20602 -19452 -11327 -14043 -20533 -12865 -2306
17889 -2306 6004 8093 -22123 -44186 -28498 -10208 -15594 -13323 -26593 -41184 -25507 -28654 -28328
17876 -28328 -7397 5715 10913 -4585 -15381 -4817 -743 -11113 -37335 -32910 -32377 -29192 -8238
17863 -8238 -1015 5658 -2575 -26907 -38454 -40029 -43968 -27121 963 4013 -6928 -20082 -18582
17850 -18582 -17970 -9091 -21010 -26341 -24760 -14782 -18279 -6437 12905 10608 -5533 -8014 -3977 7509
17836 7509 -8523 -26658 -18929 -12430 -15453 -26524 -10418 12185 8588 -10482 -7159 3546 4219
17823 4219 6574 7473 1144 3350 -1350 -9665 -26051 -38432 -26299 -29827 -35351 -34859 -47278 -59199
17809 -59199 -44629 -28521 -24144 -22725 -16678 -22719 -15230 -3733 7983 6160 -18293 -28391 -29087
17796 -29087 -26152 -8900 -4849 -14983 -29714 -39025 -31774 -9687 15221 10589 237 -1698 -18557
17783 -18557 -39539 -37541 -42183 -21888 -14563 -25758 -11965 4021 -4246 -17915 -3872 -6829 -12691
17770 -12691 -8750 -15097 8998 29364 16437 10835 -4050 2556 8512 -8453 -23068 -22848 -23669
17757 -23669 -38140 -24761 -13744 -11425 -3630 -8759 -2509 16143 13239 -63 -14156 -3952 12904
17744 12904 16167 4085 6565 5617 -9956 -18973 -15427 -10881 -14925 -10995 -8626 -2971 10766 12620
17730 12620 6258 -10307 -12316 -14370 -18826 -22548 -11147 -10300 -20371 -15450 -14282 4051 12748 -3192
17716 -3192 1164 7056 -15222 -18233 -18770 -29414 -32546 -17856 -27060 -43653 -43443 -34918 -34044 -1680
17702 -1680 10747 24142 25013 36798 21252 12882 14368 19916 26424 6497 -24599 -20932 9682
17689 9682 37171 32942 8491 310 6508 8515 3447 -10099 -28205 -24484 6446 22167 6084
17676 6084 -90 -7419 -24518 -20895 -10446 -7189 -341 -1880 457 7645 -5383 -29636 -24377 -8187
17662 -8187 8019 12515 26 -1388 -12785 -32632 -29795 -22862 -20071 -22541 -46462 -49155 -37688
17649 -37688 -51448 -48082 -39946 -35780 -19461 -15176 -19604 -24498 -15673 -9546 -16304 -2652 -17188
17636 -17188 -14286 -18473 -6325 -6748 -9831 5502 9816 -6479 -24712 -32475 -35360 -42825 -34365 -25198
17622 -25198 -41783 -53848 -48139 -62034 -41833 -28463 -15791 -16154 -17467 -8326 -27187 -28001 -25745
17609 -25745 -41103 -47135 -38467 -25609 -27238 -31991 -24200 -7466 -16341 -34211 -29392 -13097 -6836
17596 -6836 -10787 -2139 -3959 -4216 -2030 -11273 -16964 8142 17088 10212 -3524 2164 -2065 -20305
17582 -20305 -17015 -27318 -25815 -14356 -5867 -1032 4813 4604 -13033 -20032 -26785 -26504 -1868 4609
17568 4609 15572 7244 -15570 -16647 -13358 -12306 -24993 -19457 -16524 -17009 -13366 -24010 -46387 -41928
17554 -41928 -48224 -44230 -25268 -34810 -41119 -16820 -19834 -19096 7947 -3336 -3556 -2020 -7376 -21260
17540 -21260 -17759 -22368 -6065 10997 -11255 -14202 -4183 -8160 -5656 -1606 1163 -2129 3154
17527 3154 -15185 -22010 -21966 -12129 6015 6173 8244 2351 2066 7897 9595 5353 -1981 -5789 8080
17512 8080 4650 7076 -25115 -32623 -27041 -14258 -19250 -16397 -23260 -12196 10492 14076 22685 6181
17498 6181 -17632 -31338 -24381 -2930 15430 7829 -16069 -26362 -26620 -35146 -26770 -26551 -36777
17485 -36777 -34935 -30295 -27875 -34108 -35387 -16625 -7828 -6385 -8409 3745 3182 -9949 -25002 -40696
17471 -40696 -62284 -36532 4836 18238 -3363 -32639 -38634 -19718 -7584 -6470 -9447 -16887
17459 -16887 -18049 -5753 13236 18836 19307 11730 -1094 282 -2150 -8742 -10127 2755 11923 20595
17445 20595 36291 29532 26166 26766 2311 -9458 -2465 -26995 -45048 -36907 -19531 790 -1156
17432 -1156 -558 2939 -2307 -13769 -8693 -19163 -32728 -21544 -21644 -14425 -14918 -15518 -18969 -20144 -16747
17417 -16747 -19248 -28879 -32085 -30942 -34433 -6249 16230 41261 26331 11559 24461 25304 21419
17404 21419 2769 -30377 -36206 -34396 -44479 -41905 -56979 -56333 -47507 -49357 -22249 -4239 -781
17391 -781 -7046 -28550 -16238 -27551 -27398 -22966 -25093 -30701 -8717 -22688 -36878 -24865 -18858
17378 -18858 -18509 -9847 -8527 -21013 -11679 -1998 -65 12042 -831 -3014 -5018 -11944 -3186 -13822
17364 -13822 -28193 -39448 -6446 -2912 -20377 -41751 -31531 -29015 -40689 -33406 -14148 -12250
17352 -12250 -15615 524 8867 -6212 -16126 -22303 -22901 -29460 -39036 -28389 -14164 -3708 -3374 -12987
17338 -12987 -28663 -36799 -40026 -26628 -14382 -1345 11393 -4816 -15435 -11745 -351 -10518
17326 -10518 -17357 -17637 -29834 -12564 -2664 -8076 -16956 -18328 -29318 -42495 -57646 -60694 -51036
17313 -51036 -55550 -68362 -49824 -48580 -49647 -57666 -50533 -32173 -17677 -3419 -15851 -25232 -25258
17300 -25258 -41613 -43002 -30110 -19324 -26492 -44217 -30593 -14233 -16936 -15096 -28056 -32176 -15054
17287 -15054 5255 10720 1950 -5502 -14497 -8857 -9963 -4440 4320 -828 -1276 -12898 -14101 -23152
17273 -23152 -28571 -23267 -20693 -11112 7654 10914 -3736 -10441 -41810 -31090 -27052 -12504 -17280
17260 -17280 -30220 -39962 -39317 -25937 -27281 -32483 -14373 -21801 -29599 -23135 -4901 -6603 -7409 -2294
17246 -2294 -1393 -11924 -17396 -11357 4650 5590 -2591 -7178 -24383 -21598 -9708 17070 8842 -7000
17232 -7000 -26741 -42673 -34157 -32984 -33620 -27685 -29712 -30950 -45607 -51365 -32171 -9104 -4772 -6310
17218 -6310 7422 4847 -5341 8678 14158 13755 7308 -14160 -15571 -4429 15067 10011 -4404
17205 -4404 -13735 -9311 -15967 -25327 -17115 -23155 -34911 -23718 1311 8390 8747 12234 -3575 -27421
17191 -27421 -36091 -24443 -9584 -4712 -9067 -22003 -21430 -3648 2046 2096 7829 -4074 -17073 -39663
17177 -39663 -41072 -40163 -39086 -42272 -34624 -36854 -47832 -33616 3549 -1901 -9291 -6881 9786 18113
17163 18113 28912 40755 37285 17623 4081 -11848 -18494 863 24429 19362 2308 -11316
17151 -11316 -12731 -10415 3335 -11029 -28151 -15915 -17619 -23835 -31138 -51099 -59898 -39835 -17980
17138 -17980 14648 17328 -2858 -6500 -12412 -8164 -2056 -11677 -3138 8405 5367 12151 18543 24935
17124 24935 21525 1044 -7779 -19316 -5359 -1658 -24648 -35930 -38964 -20431 -11316 -380 -10929
17111 -10929 -35885 -50537 -37314 -4598 -220 -4978 -6671 5584 19427 299 -17994 -28536
17099 -28536 -28937 -26340 -19510 -15224 -15121 -12452 -32647 -40064 -35638 -37919 -26380 -24419 -12878 -4003
17085 -4003 -3379 2153 4081 -167 -572 -13357 -2350 8472 1918 12329 5209 5352 5009 1902 5957
17070 5957 8788 -8029 -24017 -32663 -38901 -45930 -53332 -40897 -41224 -27595 -24594 -10678 -7200 -21735
17056 -21735 -40429 -45422 -33541 -13341 -7129 -7920 -10089 -19818 -35795 -30785 -24687 -17291 -16694 -25306
17042 -25306 -24306 5090 -6284 -23153 -34836 -52009 -36706 -27788 -12578 4301 1745 -8953
17030 -8953 -19903 -13540 -18437 -11135 -6705 4365 -3290 -14503 -11229 -19791 -15395 -7480 3062 -1569
17016 -1569 11145 21554 18990 -2020 -13974 1801 -3041 -19375 -28666 -20966 -11947 -3995 -4771
17003 -4771 -2047 -1188 4735 12094 16522 24282 7422 4922 6658 5161 5486 9108 -5363 -6334 -3556
16988 -3556 -9764 -1630 -4635 -3498 -1838 -703 -19522 -31771 -31321 -19686 -7953 1441 3721 20468
16974 20468 12443 10233 3946 -13551 -9288 -444 -6884 -20627 -20863 -27522 -32569 -20237 -28883 -23942
16960 -23942 3270 4503 -5665 -9291 -22217 -22383 -6007 -1018 -2841 -6013 -2504 -825 17751
16947 17751 47236 40401 15556 -9507 -16967 -15107 168 -3524 -20705 -20288 -6965 6865 17665
16934 17665 6127 -223 3111 -3434 -7908 -13299 -2993 -18 -4282 -4185 3341 -5335 -15590 -19213
16920 -19213 -10511 -2118 -8250 -27814 -43399 -43930 -27549 -15212 -12709 -13110 -14266 -17604 -14951 -14790
16906 -14790 -12393 -11357 -16965 -39636 -14811 -376 -20344 -42324 -47546 -33013 -18526 -34105
16894 -34105 -31815 -26995 -19988 -17656 -25796 -15589 -17451 -34870 -32421 -29836 -22133 -19452 -24963 -22732
16880 -22732 -24789 -33167 -30886 -28063 -15644 -10168 -9516 -10646 -30864 -59598 -48368 -15398 6370
16867 6370 -148 13106 29059 18580 9459 8400 -8337 -3624 6754 6931 13628 35190 23506
16854 23506 -479 -1497 -9342 -13970 377 -10534 1509 9106 3326 -11785 -22579 -35059 -22325
16841 -22325 -26613 -28303 -19706 -10662 -8543 135 4360 -7393 -31782 -55920 -36816 -2115 -15478
16828 -15478 -24372 -16422 -8827 -11346 -22750 -23057 -24029 -695 10572 11106 -2279 2329 -1464 -26376
16814 -26376 -11848 494 -20263 -25138 -16820 -6565 3824 -5580 -16120 -13537 -18760 -24924 -26807
16801 -26807 -26599 -39990 -41009 -26655 -23839 -30498 -62717 -62644 -23400 -24036 -33837 -28872 -14255 -20503
16787 -20503 -25124 -28085 -26909 -31133 -46182 -44203 -30566 -21281 -3189 7924 1281 -9002 -19275
16774 -19275 -44732 -49216 -32657 503 22793 19224 7741 9885 -16536 -10809 7685 18949
16762 18949 -696 -4141 -5980 -6574 -1415 9407 22180 -465 -28170 -26219 -20629 -20532 -1183 8900
16748 8900 15010 30923 23450 27315 19141 33094 35242 17478 -1537 -20126 -31740 -35479 -39672
16735 -39672 -10427 16175 11978 2862 3293 5831 17479 21604 12491 4939 3905 9609 16748 1822
16721 1822 -19822 -26069 -32062 -37293 -51644 -20265 32034 45045 29133 18064 11079 -21524 -28073
16708 -28073 -16928 -26115 -33642 -25493 -27376 -31503 -36376 -21438 -21388 -15370 -23078 -18667 -16211 -23692
16694 -23692 -4778 838 -9427 -20806 -9637 16722 13868 2576 -348 -5792 -7023 -9236 -2762
16681 -2762 -422 -4264 -9173 -9873 -8143 -2927 -2162 -10004 -10541 -17936 -41701 -34121 -12482 -11371 -24320
16666 -24320 -18181 -12151 12058 14571 1622 -16228 -20168 -23918 -20050 -9314 3311 740 1003
16653 1003 -7787 -23199 -36196 -38968 -35369 -8168 4261 -19449 -30772 -23491 -21702 -25059 -21392
16640 -21392 -10108 -12784 2919 15661 21571 16616 23291 26393 13793 -7888 -22097 -18074 -26743
16627 -26743 -39385 -27614 -3657 11119 -8897 -16407 -10024 -17519 -13876 -7031 -10703 -11426 -21860
16614 -21860 -19102 -23584 -40030 -31296 -20057 -25129 -29454 -20725 -16215 -16547 -2956 12137 18345 27992
16600 27992 36304 26144 20349 13052 3356 -4800 -25530 -27041 -22130 -13949 -11504 -18509 -38812 -27998
16586 -27998 -17088 569 4880 -4952 -13652 -12085 -27677 -32783 -33642 -40946 -33860 -28279 -34818 -24898
16572 -24898 -17124 -15948 -6808 4843 1887 -18541 -3655 27143 15017 449 -1757 -2295 -8301
16559 -8301 -11321 -18092 -33225 -44570 -36117 -30015 -17816 -18678 -26347 -32861 -15381 11894 5617 7675
16545 7675 16552 29138 29633 19891 16137 22179 14017 -3809 -12904 -5000 -6683 -1483 11210 23676
16531 23676 6634 152 -2145 -12842 -14062 -18332 -11811 21334 26560 -3664 -19663 -9022 17830
16518 17830 19691 17441 -2667 -14341 -1009 4569 -1428 -500 -23674 -10105 -8344 -32463 -43387
16505 -43387 -52693 -42452 -32699 -25532 -9327 -2522 -3723 -1263 -1966 13350 6689 15804 32188 13185
16491 13185 9799 9420 854 9967 4345 8494 9295 -14481 -46678 -41468 -20571 5277 11579 17885
16477 17885 15230 8375 -2647 -719 -4024 -3104 -20751 -36812 -39447 -30994 154 -7565 -20594
16464 -20594 -25616 -32139 -31741 -28290 -21331 -15717 -14740 -9159 -32714 -34581 -26056 -21744 -18947 -30106
16450 -30106 -45221 -53978 -47800 -27299 -23693 -28790 -21226 -23282 -26031 -16612 -20275 -23035 -12756 3989
16436 3989 -5112 -4701 13383 24567 5236 14012 2238 -17989 -17597 -6837 -1317 7606 7457 4301
16422 4301 3704 18 -1867 -10740 -21211 -23501 -30793 -33759 -28932 -17517 6360 -7771 -2463 -2063
16408 -2063 1251 -726 -20209 -4815 -9732 -15828 -1897 -6439 -8745 -372 13696 17001 7529 -6299
16394 -6299 -6601 -17768 -31367 -8998 7386 13095 14213 3997 2903 -1233 3721 7201 -8658
16381 -8658 7495 22253 4866 -10404 -26172 -41493 -27100 -19665 -13722 -16334 -19515 -11048 -18284
16368 -18284 -16891 -15149 -18009 -12359 -14124 -16451 -22166 -20972 -18211 -8080 -4337 -5182 1281 -1533
16354 -1533 7597 -474 -26316 -19694 -15419 -10761 -10144 -5712 -11753 -2993 -111 10483 578 -2418
16340 -2418 1350 -13674 -9746 -3943 -18411 -25531 -22897 -19010 -16157 -7613 -4150 -23533 -27351 -9099
16326 -9099 1385 -10725 -1624 8082 13649 9438 7422 2575 -2841 -20053 -29868 -35887 -34268 -17440
16312 -17440 -21930 -38200 -45988 -38849 -38122 -33328 -15769 -36 -7136 1168 14125 8553 5051 4140
16298 4140 117 418 2409 8476 4351 -9149 -2385 6008 372 -7958 -10253 -5771 14451 9924
16284 9924 3680 3553 14808 40605 37529 30989 20375 -8872 -17766 -10779 -9570 -17972 -29798 -7401
16270 -7401 3266 10157 11981 7133 -2952 -4666 -288 6545 1843 20066 24589 19817 5458 12019
16256 12019 20284 22609 27864 27425 21632 7044 13626 16503 -4115 -9234 -8399 -4007 -8587 -33178
16242 -33178 -23054 -20309 -5862 8174 -4061 -14591 -14844 -4980 -5208 -8608 2704 8947 7345
16229 7345 -2283 -1509 2591 11246 25432 24300 24352 33593 28813 18956 -6658 -17864 -18899 -14752 -10193
16214 -10193 -2482 9677 4216 -10575 -11740 -11087 -12898 -28673 -27444 -24308 -8088 -295 7337 14733
16200 14733 5797 26177 34920 20943 12450 20024 12297 8883 11892 13311 -2920 -7813 -9099 547
16186 547 524 4978 1045 -18865 -36019 -17728 4172 11601 8202 -10824 -16072 -19708 -15703 -21264
16172 -21264 -26073 -24093 -15553 -24640 -20013 1295 23906 1973 -19116 -11457 -9094 -7624 -17104
16159 -17104 -12815 -3086 1584 13069 11818 1026 -16763 -32919 -26534 -2091 16071 9980 1953
16146 1953 -3853 834 2191 14190 20943 23057 23548 25567 -9612 -15684 -18460 -11101 -5162 1904
16132 1904 -4196 -1255 -5232 -15900 -7637 4933 9615 -3129 2920 17012 13957 -6928 -6040 -7623
16118 -7623 -18882 -28587 -23328 -7914 -20520 -19912 -15816 -11692 -12331 -6043 1752 780 13245 3582
16104 3582 -17371 -14439 -3308 15906 21187 1013 -12405 -14237 -6526 11561 3069 -3850 -24756
16091 -24756 -45302 -49320 -40283 -38171 -21421 -3564 -10180 -4780 -1459 -13686 -7241 -3410 -13256
16078 -13256 -45820 -40019 -42588 -35637 -35591 -10688 17908 17935 25147 20398 20872 7852 14405 5706 16389
16063 16389 2165 -5133 -6709 4227 17441 2044 -3028 3395 -2309 -9442 -5505 1268 -6194
16050 -6194 -33129 -34329 -43338 -18459 -11107 941 27927 28869 143 5961 10 3531 2881 5845
16036 5845 -6603 -15432 -1477 -10492 -5772 9006 4862 3861 -3443 -1217 -1889 13726 5998 11349
16022 11349 10783 -5453 70 -232 -7492 -7685 -1702 3322 6551 -2455 -6013 -5498 -2050 10573 17396
16007 17396 14384 19799 14741 14180 2400 6510 2728 -18758 -30052 -26308 -32023 -28780 -36578 -25887
15993 -25887 -19415 -14713 -7911 -9088 -7303 2451 11121 9797 11515 -1525 -19019 -13998 -2755 2829
15979 2829 -1223 4906 -521 -13884 5356 14505 9555 -2425 -24164 -41506 -19399 -16238 -6764
15966 -6764 12828 18910 8173 -18938 2771 41063 48064 45399 40097 21058 8846 12199 7127
15953 7127 -11627 4565 33980 35810 21585 24622 13081 3296 14128 25468 26910 19490 10626
15940 10626 5146 15501 771 -14222 -8105 -5659 2488 10776 43 -15799 -21128 -23208 -35626
15927 -35626 -25756 5303 14371 2857 11885 1617 -10420 -23577 -13053 4248 23198 33428
15915 33428 27648 27302 43668 39745 38912 38422 21539 19699 36489 53530 36279 15303 36600
15902 36600 52865 59012 39260 29626 22753 16961 17341 19205 36383 38936 35831 39160 43272 48929
15888 48929 46320 43529 32013 21598 7048 -4702 -22582 -18407 -1775 14555 26404 12290
15876 12290 13199 22165 23766 18379 8099 20254 28978 26003 13887 21441 20681 15665 17863 18338
15862 18338 8438 16921 19339 30176 41213 28123 20617 30613 44331 31435 22878 15457 19416
15849 19416 22037 25287 29055 50225 41889 36594 36613 21999 25905 27867 44725 32670 39475 48560
15835 48560 48734 46957 43188 48088 43103 27321 18510 8855 24386 5941 -14138 -9788 -1211 -5391
15821 -5391 -19236 -15204 -22722 -24430 -12926 -18385 -27025 -47227 -28051 -1382 6970 6740 10999 8357
15807 8357 21558 26120 29622 39644 49170 55261 74968 79485 69077 87149 85567 78682 98989
15794 98989 98770 83016 93601 110272 105110 100943 85634 60585 58694 80707 77773 42432 40549
15781 40549 64024 60387 48583 36091 33673 50638 65207 66923 88765 114980 138539 157996
15769 157996 151440 139912 133905 138002 178352 190952 178211 166920 181401 196429 218535 238293
15757 238293 256000 248542 229674 204216 172399 187052 189846 186311 185475 201659 209434 197504 183602
15744 183602 157509 144250 155515 176082 180681 193031 189306 190274 204014 222697 211541 236011
15732 236011 257935 252984 225941 240407 246920 270058 305396 331734 345917 356577 361732 360575
15720 360575 352014 360882 355718 359946 373227 376631 367583 381769 400576 418298 428016 447061 482277
15707 482277 506753 511191 526933 542948 577918 609266 622064 637383 670849 731219 795555 847230
15695 847230 898990 971395 1047494 1141089 1237861 1351067 1457194 1600821 1759362 1972363
15685 1972363 2243028 2581034 2988040 3468182 4080197 4872733 5890838 7223201 9039701
15676 9039701 11578740 15198881 20174501 26258818 32090449 34944622 33125926 27922454
15668 27922454 21929380 16834770 13047400 10392073 8556257 7267986 6339492 5650783
15660 5650783 5133859 4766215 4479459 4302833 4184214 4146391 4185636 4299140 4470167 4752133
15650 4752133 5125937 5634107 6324419 7228540 8398235 9912245 11868518 14458404 18037520
15641 18037520 23241275 30857282 41688303 55798714 70581376 79312659 75529881 61904171
15633 61904171 46288438 33668675 24886575 18983085 14996491 12272740 10351210 8934040
15625 8934040 7835403 6933948 6166422 5536546 5042262 4688701 4464713 4310593 4228913
15616 4228913 4249574 4346605 4541014 4831226 5236333 5791085 6532949 7522536 8882834 10761681
15606 10761681 13434515 17238968 22443236 28837369 35016502 38073919 36005233 30118755
15598 30118755 23335216 17558846 13265714 10221290 8083829 6559091 5473526 4655304
15590 4655304 4016189 3466132 2997470 2601197 2252045 1964480 1761247 1608903 1476892
15581 1476892 1344729 1220577 1101257 997962 930391 872429 825208 786660 736690 698303
15571 698303 666406 627165 600458 561752 520433 482458 454099 426088 384997 356905 344610
15560 344610 329088 301500 293187 298008 288759 280029 274970 265396 251529 234896 239180 244629 253484
15547 253484 235166 216886 223413 226892 220546 222158 202824 187002 183214 181264 159042 148245 159985
15534 159985 167500 168550 189976 210749 217336 206227 189384 171576 147562 115983 100674 115952
15522 115952 115418 108270 122834 111616 85593 60048 52622 82928 132790 155087 174970 189831
15510 189831 204128 228484 243245 249704 263942 245447 214397 198180 189874 188566 184191 163318
15498 163318 152309 143224 143265 117516 105736 108899 110937 108652 107714 86539 82860 81740 78164 64242
15484 64242 73084 71792 65534 68103 65302 66270 84969 75423 66156 64549 58213 57959 67639 63914 51731
15469 51731 33737 55023 81135 96364 92483 96083 111097 100299 101446 102208 103332 100719 84238
15456 84238 74645 73949 80794 79970 59731 65432 73574 67300 59277 62666 48390 40016 36002 44558
15442 44558 65483 84372 81697 51332 37433 54101 66084 54597 46980 47752 57461 52437 51029
15429 51029 50728 39473 27681 50724 58047 71091 73259 83377 81671 76046 42688 29570 27833
15416 27833 34468 38024 36979 41239 47303 53983 42146 24229 14406 21250 40468 51864 43553
15403 43553 44340 66469 59925 45890 30938 40998 42758 27374 28176 31800 51355 56374 55200
15390 55200 46037 37701 42929 48538 51985 46529 28203 15398 14159 17515 23925 17572 34271 30427
15376 30427 30789 33056 28934 30635 26878 25620 43083 55367 57631 48184 52154 46577 37566 26528
15362 26528 13570 10493 10209 -661 -11882 19140 27469 15959 17082 23094 15782 -6421 6991
15349 6991 5383 8077 9773 8248 15418 16552 743 3736 8939 24262 35097 45359 58167
15336 58167 72120 60754 43075 46596 48775 45495 24295 -9091 -25918 -31691 -17368 -16269 373
15323 373 -718 -6184 -3855 -164 -8343 -7347 -9862 -16536 -26894 -13630 -8517 -16894 -14405 -12832 -6059
15308 -6059 1638 7124 6777 -478 -2410 -6340 -1898 621 1521 -13312 -16021 6060 9340 -4924
15294 -4924 -10633 18546 13178 5356 -3049 -9743 -11739 -10323 -22663 -22113 -22993 -17565 872 16693
15280 16693 4625 8257 923 -2066 -11321 -14532 -13104 -32319 -32480 -17054 -16885 -36791 -41022 -28654
15266 -28654 -20554 -24926 -15275 -22557 -28580 -32293 -36275 -27449 -19352 -21805 -9014 12810 16614 8255
15252 8255 -5202 -10128 2372 11847 8896 -1512 -8454 8558 4410 14153 14026 783 -17313
15239 -17313 7173 16137 -15400 -23043 -18986 -11128 -14383 -6429 6920 1245 -6842 -18360 -22299
15226 -22299 -16095 -17307 -19462 -9875 4900 2571 -18046 -15064 4769 25349 13002 11392 36709
15213 36709 45901 11416 -11934 -7321 -2407 -1065 6162 -4671 13627 10263 6449 16009 24089
15200 24089 25715 10643 32034 35525 35541 39595 34868 28532 28641 31459 34240 18771 10063 11183
15186 11183 14976 26574 28364 4639 4816 41691 48256 17439 -2237 -20061 -23480 -17153 -9849
15173 -9849 -12924 -1627 4491 3354 25145 30635 11389 -1865 -6561 15165 15091 7057 3339 17603
15159 17603 12012 -9786 -11616 12462 31605 39866 52489 37572 12038 -21174 -15126 -6853 -20742
15146 -20742 -12038 -7847 -23364 -35933 -40806 -18437 8784 25141 5192 -3797 -4327 -15159 -6482
15133 -6482 -7623 1123 9568 -620 -5213 -3315 -483 6115 12401 -1208 -14661 -14685 -14612 -29081 -40382
15118 -40382 -38704 -31845 -19937 -19828 -31192 -29727 -26815 -12697 -38 -615 55 3137 1739 6263
15104 6263 4754 8975 7884 2979 307 -3702 -5551 -12323 -11490 -5016 6238 15344 11511 3956 5799
15089 5799 -7289 3462 2161 10763 14444 -1780 -6259 9811 2441 -1080 -15982 -17615 -8526
15076 -8526 -320 -8784 -11276 6096 11619 -13716 -17789 -2795 -162 -6916 -8327 -3790 -9652 -23510
15062 -23510 -22783 -8940 6690 -18202 -41570 -37796 -21860 6895 24110 9111 80 19428
15050 19428 32831 27169 17340 2114 6385 -3475 -14534 -15580 -20381 -13909 -21033 -9911 -82
15037 -82 -8607 -19611 -28104 -31278 -21333 -19055 -25284 -13803 -10904 -2027 -404 -12576 -34028 -39294
15023 -39294 -13788 9355 25112 24935 11921 32466 27622 3749 -9097 -20889 -30849 -25215 -18777
15010 -18777 -16603 3545 7743 35 -15241 -13003 -943 -7097 6124 11844 10681 796 -6611
14997 -6611 -9106 -10308 -13504 -18015 -6980 -11488 -14110 -37861 -46136 -37117 -18263 -1040 -8384 -30538
14983 -30538 -35457 -17282 2271 5197 -11149 -17533 -26510 -19742 -18081 -2689 10264 9784 14410
14970 14410 9604 1043 729 -4921 -15404 -7492 6083 -7567 -9132 -4653 17584 4641 -8024
14957 -8024 -10182 -20714 -31087 -16416 -14882 -22241 -21263 -18674 -12232 -4271 -639 -3321 -6439 2543
14943 2543 3419 -1637 -86 3160 6279 10651 -7341 -4534 5675 778 -4878 -7550 1503 14632
14929 14632 28144 27561 9221 16089 2537 -10011 4011 5697 -6925 -20501 -30548 -15159
14917 -15159 9385 15632 8912 -23676 -32263 -27650 -23584 -10536 6360 6761 5226 15030 39611
14904 39611 18126 2068 -4223 -5309 -9939 -3688 -10493 -16487 -8235 -6128 661 8164 16147 18359
14890 18359 18078 -1766 -17202 -2296 8947 9035 -2287 -17010 -11088 2997 2797 542 -11597
14877 -11597 -13101 -13674 -1511 6137 9521 9689 -12482 -10956 -10608 -24023 -29614 -24688 -12641 -8402
14863 -8402 4432 12752 7117 15279 14546 -6983 -3439 11921 1662 -6166 7667 22005 14130
14850 14130 10746 10121 -4680 -5944 -2483 -13613 -23250 -14011 -2933 -8882 -4941 8125 9321 7303
14836 7303 -10784 -17477 -15561 -24354 -42297 -32349 -5496 -5301 5737 6888 14657 11429 7125 15646
14822 15646 13379 -2991 -7777 -5418 3828 24176 32940 24639 22893 5278 3823 -4468 -6237 -151
14808 -151 -1919 -16439 -278 12280 5663 18661 33172 17920 4467 10279 2518 -16982 -32287
14795 -32287 -33786 -31903 -919 12074 6732 -18252 -38899 -31915 -10398 -5912 1153 -8038 -6931
14782 -6931 -7151 -9162 -6308 -14298 -7461 -2230 -8412 -23040 -13819 2923 -26372 -32174 -6069 4954
14768 4954 11302 3791 -6580 -4076 -7278 -18747 -26945 -19371 -11512 -33027 -35712 -46132 -27626
14755 -27626 -9830 -17654 -13738 1170 5518 2296 -12328 -3036 6001 1229 11315 15017 24095
14742 24095 39564 31381 14719 21153 16686 3180 -16358 -12085 -1137 -9318 3581 23331 36526
14729 36526 14777 669 7310 16079 29750 16231 6794 14055 13284 3113 -3989 -4060 887 -3147
14715 -3147 -2150 7905 9041 -9006 -34862 -26052 -10179 -6080 -9947 -19648 -19520 -14142 -14696 -5895
14701 -5895 -10999 -13500 -984 14702 19034 17628 14648 15940 11982 -6887 -10532 -3172 1422 12559
14687 12559 24630 22252 11843 6720 -1049 -30530 -39922 -18739 2623 28904 30659 7903 3912
14674 3912 -12671 -35221 -20120 4933 -5776 -16939 -11473 298 -5544 -16267 -21598 -17357 -12038
14661 -12038 -9073 3396 4544 -6628 -5256 -2309 669 -5498 -1376 613 -10207 -17589 -5197
14648 -5197 -3757 5814 11939 16020 26759 15393 20222 23338 31976 41445 35618 45373 41409 22794
14634 22794 8135 20573 15618 7656 -8597 -12038 12590 22387 -5635 -6219 -4016 -5260 9413
14621 9413 25893 -2833 -24214 -8749 9127 14845 14064 10660 8565 -2716 2539 10523 -58
14608 -58 -27031 -33957 -16497 -1719 14182 19765 18360 6055 -9458 -13870 -6346 -14673 -20523 -9209
14594 -9209 -4175 -1486 -5381 -6124 -18031 -16534 -3081 -4275 15612 18028 28280 39144 21473
14581 21473 10119 11032 13314 23239 23318 23438 19158 13730 2770 15636 10546 -1884 4261 21527
14567 21527 26787 18261 18487 31977 24328 20240 24295 22580 23902 27000 26230 27256 10154 -1960
14553 -1960 -12260 -13729 -11500 5188 19199 14112 79 1539 4436 15382 22420 25244 19913
14540 19913 730 11325 15029 11456 146 -8464 -6744 -10527 -2185 11044 25245 20652 5150
14527 5150 15494 43555 38595 26838 33270 38549 43606 51479 51533 53366 71856 71246 79198 66773
14513 66773 75110 89631 102960 120668 131020 141224 169025 197474 247845 295710 359075 424875
14501 424875 471490 501525 493974 484303 468820 447677 426726 391560 358514 300227 247118 207433
14489 207433 183716 166642 134270 110959 94403 74058 56104 63570 68264 66791 60737 61743
14477 61743 77174 98975 115124 142045 166280 200632 258314 299634 342087 381607 434021 482512
14465 482512 508481 514040 506058 480270 446948 395321 345829 309526 255595 197603 142572 126253
14453 126253 125092 90889 75186 73592 58745 46396 39402 29457 30253 39087 48485 57923 57461 42528
14439 42528 27905 12070 8796 -3290 5216 -6165 4959 12043 10084 494 1421 176 23852
14426 23852 22571 23334 33822 41764 20090 9546 6619 11048 9535 21554 23975 24277 41148 33495
14412 33495 32386 25024 25280 4843 -5523 -18525 -1978 -8796 5738 27220 25089 21974 36464
14399 36464 27081 16257 29198 35896 43842 55416 41243 28455 24290 49164 46413 45271 39021
14386 39021 41160 42722 27044 20947 36038 36238 35680 33211 10618 20222 33475 39738 36849 40307
14372 40307 52997 49567 32037 26079 28146 34192 37381 30720 42485 31369 19318 21890 31325
14359 31325 31695 24373 20086 23517 39408 33858 22025 10973 9192 25760 51045 28515 13856
14346 13856 9002 2447 16074 18653 13665 27083 29357 23476 33330 39481 25800 21015 19236 16784
14332 16784 12645 17445 30829 37036 35326 17618 14073 22299 15458 4688 -13670 -11350 5897
14319 5897 -3924 -9005 6741 -11753 -10584 4664 18345 35403 42579 38036 35055 36791 41152
14306 41152 51025 59337 44846 43811 60758 68005 51622 54441 54695 35703 37120 37632 40401 36629
14292 36629 43132 32715 47994 62599 63713 60450 63143 56313 43372 47183 59585 60469 43815
14279 43815 48881 55459 77085 84413 82700 87808 85660 95535 111074 95593 86799 71597 61721
14266 61721 60522 55147 45104 37940 42710 82482 94546 86869 66990 46850 56198 76760 64562
14253 64562 43173 40394 41822 43948 48151 43350 21635 17208 13558 9874 9074 7011 8034 7089
14239 7089 17444 23948 36111 41524 37481 29168 1267 25812 36458 25282 29600 38135 40947
14226 40947 18009 -24128 -26830 5356 15711 29477 42035 45710 66534 77567 65803 48593
14214 48593 24804 12279 28823 43233 56211 74597 78102 57896 46635 58958 41753 30294
14202 30294 15166 -1228 6635 12962 16709 16742 -3649 -14229 -21354 -25817 -17823 3296 16935
14189 16935 29817 26509 44386 56627 51536 78201 109189 134680 158707 173604 195463 216257
14177 216257 246001 246042 260657 283020 314414 326008 332653 342981 337107 347422 357646 368767
14165 368767 344461 313228 301434 297419 290013 285925 262929 246369 221677 213911 206585 204755 219734
14152 219734 230838 226615 245274 265826 262259 261539 300678 341377 355126 349152 367007 384274
14140 384274 393361 428022 468692 479719 480280 512642 541645 562549 557048 548492 534568 524870 542193
14127 542193 546801 537067 513773 499432 484848 489400 502703 499242 495552 508248 519995 540284
14115 540284 529765 545494 571529 575915 566771 572042 595191 614251 612326 611229 642437 687169
14103 687169 688762 699738 724294 747790 781887 799725 828516 888944 899687 903666 919141 969903
14091 969903 1021216 1053653 1089211 1137822 1186110 1228438 1280671 1344664 1402328 1469501 1563706
14080 1563706 1662313 1754917 1867838 1996478 2145857 2305790 2479484 2667003 2899430 3153698
14070 3153698 3460281 3814710 4189293 4625269 5176598 5838489 6636379 7598738 8764318
14061 8764318 10169520 11907011 14123874 17005122 20786106 25809220 32360002 40615071
14053 40615071 50505246 61761046 74043778 86164074 95540602 100351434 101900091 101569805
14045 101569805 97880442 89442502 77958735 66056901 55063513 45359777 37220129
14038 37220129 30766941 25872448 22247577 19587369 17623699 16184583 15134358 14439750
14030 14439750 14054761 14004019 14263968 14841026 15793585 17167682 19055915 21635403 25162641
14021 25162641 29911213 36133084 43976108 53339837 63931705 75344307 86383539 94539810
14013 94539810 98144412 98462404 96940003 92280568 83266189 71557612 59653322 48782803
14005 48782803 39320656 31440485 25205312 20430643 16812662 14044646 11915631 10205025
13997 10205025 8786368 7636799 6677685 5880988 5217110 4654791 4210691 3828870 3468827
13988 3468827 3188633 2941364 2713138 2531806 2380867 2257541 2131175 1992627 1855793
13979 1855793 1745867 1626574 1536373 1455635 1377959 1318117 1254461 1177871 1101132 1044979 996311
13968 996311 962072 927015 883750 846895 824540 794228 748942 689341 640997 634354 646658 641331
13956 641331 618036 597747 579787 545202 522819 503201 472006 469742 472318 465399 434981 408472
13944 408472 392329 378039 353761 351033 358048 371823 339250 292672 271522 267494 247454 225243
13932 225243 223747 195967 176652 184368 169185 160069 153595 137853 157472 179836 184878 204456
13920 204456 212789 207900 199790 189758 202523 215742 228610 225022 219397 224235 236020 241420 227965
13907 227965 203922 198628 226242 218178 210782 190091 181661 179318 154196 132936 126468 109560 104097
13894 104097 106274 92564 86181 91542 108135 112439 101755 111806 119091 141642 149402 154436 146291
13881 146291 140652 147081 170080 193305 191356 206359 211784 221262 227991 229925 240393 258221 270660
13868 270660 260609 262874 265373 250111 231555 216949 209057 211443 196940 179249 161073 158362
13856 158362 173178 176325 162477 150559 138237 145191 156826 159257 145211 138497 133161 130835 127531
13843 127531 128177 136938 133377 141388 124532 119028 129403 148859 129056 113154 116071 121088 115764
13830 115764 127844 116590 112293 116902 103079 89706 76611 94003 114927 93831 72531 61847
13818 61847 79283 76246 68113 77836 90251 95072 95417 117188 121094 110832 92876 87358 92732
13805 92732 87414 79662 78534 89498 81145 83115 82192 75550 72833 78636 72757 63544 62020 69626
13791 69626 64669 30727 27027 41695 40654 56655 58498 57026 54909 52188 37515 42631 65211
13778 65211 78980 79119 80820 86312 81451 59562 55640 68840 63483 49378 61974 62081 70940 75857
13764 75857 68314 72060 71295 76275 87915 82167 82380 85472 80850 79507 77061 85047 93645 85737 73215
13749 73215 68921 76761 54287 46081 50412 51312 60538 64146 54900 38559 27702 35760 36178 34646
13735 34646 26020 37489 42838 37897 33468 28964 37301 44626 49179 75624 80941 54801 45494 37606
13721 37606 24031 27051 41863 66149 81855 79817 79595 70801 68344 75608 77247 76177 80208 67994
13707 67994 46607 36285 45617 38031 39920 33931 1313 5238 7866 13390 18311 12487 16005 28195
13693 28195 19217 32952 34511 10939 -1588 404 -17783 -16254 402 17951 26689 23759 25111
13680 25111 36662 34661 21968 28431 42852 55675 47152 38020 28262 41502 56654 45482 33359
13667 33359 45053 38963 29500 13638 11656 6473 11401 14478 18363 27039 39085 28661 15186
13654 15186 -5812 12371 38210 25085 13153 27284 37648 39137 23580 32681 29351 49176
13642 49176 56352 47425 40657 23431 20218 28386 22345 29042 43854 50947 43929 26032 13389
13629 13389 18999 34043 53899 59406 58696 54966 60444 63755 52523 40379 38481 45953 46863 53542
13615 53542 51985 38953 21192 10528 22963 44825 58542 62319 50592 65426 100575 109873
13603 109873 104832 107874 124641 124128 123706 135155 174232 213197 267794 312339 364379 430826 472572
13590 472572 501045 530904 549796 532595 498568 454350 406754 376265 339665 308221 256444
13579 256444 219276 215510 226115 245758 267769 280618 317494 349498 408181 499972 580092 613118
13567 613118 609671 572969 501676 441495 396183 389090 395839 412123 427019 458705 513845 556780
13555 556780 568492 580027 589053 578183 540038 495354 448761 420515 408841 379196 343558 341972
13543 341972 374677 429321 479972 575917 702654 864786 1032554 1152066 1185682 1128012 1005643
13532 1005643 875704 763463 697842 595111 490594 403252 334206 275068 240416 225648
13522 225648 218890 167403 127069 129225 128039 122500 111330 105725 114564 144009 157722 182909 205150
13509 205150 237865 311691 395351 460587 516113 567959 576626 524881 460677 396631 323245 276479
13497 276479 241674 214666 219327 233573 249799 283600 311778 367386 470088 601809 774699
13486 774699 925369 972211 859558 659079 481473 371043 292997 235010 184833 163361
13476 163361 145374 124646 112891 109398 101893 80124 65731 58129 48330 61239 73348 71006
13464 71006 65763 71344 62167 45022 28412 40561 47028 41332 38003 52107 83622 87331 85798
13451 85798 115886 140133 143318 174762 209770 256411 329836 435089 570613 741724 900176
13440 900176 960737 858315 652680 466859 358073 285356 218579 177419 147031 134756 121785
13429 121785 95062 83100 62284 54572 39642 32111 35563 48490 39844 41326 24730 11204
13417 11204 24780 54212 58543 48445 35354 38572 39332 34797 43745 41649 44794 71223 55446
13404 55446 50699 63111 80537 88789 103540 139453 179854 221907 268045 286766 253514 194962
13392 194962 136115 92163 83037 70256 52045 35091 22221 19799 10998 18806 15471 8164 -5319
13379 -5319 -5298 5965 16768 25015 8962 7469 -2151 -10206 -8971 4879 5848 2237 5759 7523
13365 7523 16951 18354 8049 9055 35356 38760 18316 1028 -4580 -12991 -24362 -13417 -9222
13352 -9222 4125 14436 11940 18167 23656 33430 24791 11671 -7758 -19336 -26249 -26408 -24923 -8845
13338 -8845 10324 3841 3372 7771 5862 -8972 -4898 -9414 277 546 -1761 -12790 -1291 -3301
13324 -3301 -15531 7246 1194 2303 3926 8931 2832 -10934 -24860 -8426 7123 -7704 -19685
13311 -19685 -21491 -34792 -28016 -17917 -11718 -4257 6966 -71 7308 13183 2750 -1533 -7233
13298 -7233 -33968 -25372 -902 6079 14935 14975 19835 18359 19445 13732 20869 14879 13807 29362
13284 29362 49012 41124 24558 29667 20527 14653 -1530 -3113 5879 21492 16764 13455 16394
13271 16394 23268 21326 19638 11542 7496 -10178 -466 2623 -3319 7722 31423 27103 32947 27408
13257 27408 -4540 -6404 4702 18880 12489 15223 10572 15153 17695 18063 -7765 -26510 -20628
13244 -20628 -28570 -15684 -7701 15940 30045 16217 19101 19240 17064 2550 -21748 -24149 -2623
13231 -2623 12311 28702 26881 18701 7019 5256 12030 -3473 -20964 -9855 -2101 -4399 3799
13218 3799 5146 -771 -18313 -19130 -12229 -16967 -11479 -5702 -14665 2148 -868 -20021 -9888 2249
13204 2249 13507 11743 11504 708 -9377 7125 2658 -1545 2446 6355 11278 12646 25473 24132
13190 24132 23312 30420 36972 27775 43329 77438 77589 73154 63241 49324 37669 25365 14650
13177 14650 8225 19095 -705 -15292 -16088 -20287 -15600 -2813 20556 32664 19324 5073 3150
13164 3150 6562 33034 53583 56273 67653 65270 86881 113783 146421 167828 200848 241531
13152 241531 252724 254544 236877 203752 155597 132386 121115 101330 86483 70752 53661 37577
13140 37577 36738 41242 51867 38037 26638 7266 -526 4638 25644 30655 32168 31116 50274
13127 50274 65871 73373 76924 88512 122179 147042 171793 221158 241907 250355 227478 173859
13115 173859 130108 98080 87985 77932 62574 42033 24802 11632 20469 38703 36222 26645
13103 26645 5043 -1468 -1010 8251 22035 27630 14396 27447 59196 50547 51864 56457 41441
13090 41441 47990 53704 56240 60674 76760 97689 91403 78198 79187 69958 68975 53430 46619 47785
13076 47785 34847 24224 12196 25113 15646 19157 25321 12053 12691 9029 20881 4673 -11000
13063 -11000 -23646 -37501 -27269 -16647 -20626 -28803 -16488 4064 -5301 -16116 980 12059
13051 12059 19495 4096 -11888 -15943 -3643 39 -5139 -2927 -2536 3208 7444 2544 -3235 -4790
13037 -4790 -6348 1841 -1827 2256 -1289 -2547 -14927 6575 14183 -658 -3225 1024 7407 9056
13023 9056 36907 29323 906 -1237 -6927 4300 10690 -6593 -13503 4048 19525 10235 14838
13010 14838 11619 -1390 3524 5066 2885 3174 -7349 -15391 -17658 5400 10921 5173 1908 -1595
12996 -1595 3759 17872 4417 585 10356 6933 -1514 -4223 -5894 -15587 -23505 -11815 -5330 9862
12982 9862 1261 -2842 431 -2720 -13630 -8862 3552 -11889 -13378 -4557 9952 21299 10991
12969 10991 -1697 7111 16712 906 -5758 -7680 -317 17281 12657 8222 15214 17903 -4930
12956 -4930 -5686 8636 -930 -13383 -19056 -13939 -11063 -15388 -12369 4770 27405 28000 10856 -1343
12942 -1343 9 9417 4367 7924 7074 2117 5035 13741 22896 8158 -12161 -4258 21808 19361
12928 19361 2289 -14446 5655 16023 16151 20979 10464 -16064 -9600 -414 2227 10934 4043
12915 4043 -6042 -15450 -15632 -14882 -6919 -11013 -18840 -18590 -15082 -8740 -4971 960 6908 -1241 -15622
12900 -15622 -1663 6056 18762 9103 2397 -20751 -24407 -30088 -24843 -12175 -4804 4670 6217
12887 6217 16024 22752 23322 7108 -24994 -29189 -19109 -13524 -22792 -11229 10213 12624 11387 10388
12873 10388 12734 15348 -5333 -23742 -8596 -3623 22 4331 19652 32941 12740 1144 26593
12860 26593 43630 22368 -6530 -2069 -9034 -24731 -16047 6558 40721 43986 22721 7996
12848 7996 1902 6986 -10145 -24509 -18715 1192 20211 23115 9626 7403 11677 17747 24145
12835 24145 24437 23820 4973 739 -14520 -28139 -19897 -9015 -14351 -19594 -20679 108 3525 -2355
12821 -2355 8053 18032 -2967 -24575 -13398 -15379 -12126 -11477 -3868 2960 -1814 -20569 -23380 -30455
12807 -30455 -30891 -20865 -18333 857 15165 12512 23388 24554 11688 5877 23718 38216 26930
12794 26930 19219 29543 37274 25239 -5974 4394 15495 27059 38888 35582 18366 28357
12782 28357 21006 13871 -1143 -14832 -11158 -13727 -28049 -20361 -22774 -11826 -7549 -16539 -10616
12769 -10616 -19360 -19222 -6930 -11627 -3554 10728 14630 22693 24652 -1945 -18960 -18058 -7916 -19164
12755 -19164 -10970 -1399 8090 5500 -6815 -11377 3331 18696 -8521 -19464 -19707 -6893 -3281
12742 -3281 948 4466 15095 36700 42483 43471 43286 27619 15739 -6182 -18988 -12724 -15512 -7419
12728 -7419 -9174 -4098 -6964 -9285 9746 6930 -8439 -4271 5415 -849 -8080 4817 10852 -2470
12714 -2470 -22513 -41456 -37311 -40512 -36804 -27284 -18317 -5052 -3779 10034 16734 12803 -15477
12701 -15477 -30377 -6212 14161 9655 -5179 469 12880 -10682 -10044 -2095 -17876 -29336 -26001
12688 -26001 -16763 -12391 -11981 -8455 -19439 -16751 -21496 -2780 5122 3648 -4832 -314 25390 15408
12674 15408 3573 -6370 -1256 4383 3925 9221 1430 -9467 2568 8356 -11125 -5542 -5529 -17242
12660 -17242 -15988 -4562 4095 -2230 4917 20115 35080 22271 24696 37335 40043 43255 34044
12647 34044 32649 16995 -1109 -16914 -27524 -26931 -13680 -1481 -17201 -26578 -4388 -11463 -6903
12634 -6903 15734 8977 7108 13850 4822 -6683 1946 18559 31295 18717 -4013 -24422 -17116
12621 -17116 3916 34846 24427 10702 -2649 -31448 -21241 -12922 -6572 -2994 -754 3666 -6894
12608 -6894 -14592 -13399 -15628 -13853 -9414 -5447 12644 10316 9511 940 -17337 -3081 3044 -13320
12594 -13320 -2531 7746 20196 -2939 -23992 -26293 -27424 -15307 -18555 -14741 -14607 -5502 -4513
12581 -4513 -3527 -5121 -8110 -25629 -21476 -17019 -14062 7609 26993 31299 7337 -8774 9299
12568 9299 -3839 885 -10207 -23230 -34147 -24625 3754 31362 17776 -6336 -6898 -2615 -2353
12555 -2353 11250 29027 38008 25541 5076 -15819 -17449 -14928 -5308 -3650 12847 26453 36921
12542 36921 17675 -7056 -18685 -30695 -29754 -25921 -8544 -5086 -4744 -491 -6126 -15428 -293
12529 -293 4457 -17155 -15243 -19883 -2219 -3771 -5181 6476 15462 15884 8607 13652 27579 9002
12515 9002 8921 6702 6078 4618 -14370 -32912 -43470 -16175 -6709 5879 15690 13788 840 -8711
12501 -8711 -8673 5616 5767 -7780 -9806 -7278 -2062 8528 15569 24425 25857 28760 38138 26836
12487 26836 10757 -341 28321 34771 40286 53586 53581 22052 15058 39815 46911 33439 21386
12474 21386 -35 -9321 -12662 -4989 6972 710 -5666 7714 17479 20043 19587 5891 15388 13792
12460 13792 76 -12337 -494 28626 30792 18553 27565 27181 15383 25360 42830 32553 17150
12447 17150 11973 24954 28865 388 4339 5228 -2749 -9938 -14651 -9747 -6297 -28421 -33796 -40229
12433 -40229 -25838 -11110 -6901 -1706 2023 5550 25739 13873 -8607 -13988 -7567 -5073 604
12420 604 363 3777 6244 -3731 -362 17116 12133 -8863 -16879 -15164 -1524 10331 12626 -8493
12406 -8493 -18634 -19159 1764 7675 -7245 -25418 -16058 -23268 -15005 -462 -14683 -11733 16025
12393 16025 12283 6334 -7194 -12746 -17805 -19130 -3364 -5290 -6637 4801 11330 -16279 -10241
12380 -10241 -2844 -16482 -19177 -23240 -18888 -4058 -16072 4535 22049 19912 29593 21026 -4692
12367 -4692 -15183 -17615 -9112 -2579 -2962 -11193 -15602 -7731 4605 11978 25429 15561 9221 6424
12353 6424 10620 7444 3505 5157 -3107 4542 877 -6492 -10630 -38890 -34928 -29348 -36272 -31937
12339 -31937 -29395 -25232 -33659 -30197 -6521 -4629 -11478 -16913 -4755 -7375 -25695 -26150 -13760 -18954
12325 -18954 -22650 -17014 -3848 1249 -24628 -10412 -9054 -7375 4865 15888 12026 5165 -6339
12312 -6339 12696 27331 44215 15743 5709 23653 37273 28395 13556 19687 21746 12696 15249
12299 15249 22097 29003 559 -7228 2437 18927 17165 10057 8507 6545 3881 -3302 -9878 -15800
12285 -15800 -14248 -6201 8898 13181 15933 2202 745 13182 23684 25417 17660 695 -7602
12272 -7602 273 6761 12972 6385 9798 11697 3951 3054 -1856 -7840 3098 5856 4347 9057 9482
12257 9482 22655 22281 21973 24431 28559 33635 16285 7978 5744 -6181 15672 39126 30998 19114
12243 19114 27495 36215 40241 43199 31057 18444 14290 10894 32 3729 -14753 -21121 -8542
12230 -8542 -9396 16481 28656 31041 39151 32506 14108 13462 4591 -6484 -16589 -4033 8527
12217 8527 4123 5263 24197 34865 35312 26462 21085 15963 16050 23181 2209 -2497 18243 31397
12203 31397 30756 9737 -5081 -2805 5539 11136 10459 -1517 -64 13263 37983 33463 29047 39384
12189 39384 53604 51924 28065 23926 23537 18309 33022 43153 49453 49262 52360 71401 83772
12176 83772 69876 40679 15884 10272 21958 25826 36135 55465 66027 73776 71924 66391 71304
12163 71304 111419 167777 237655 290773 321918 312128 259520 202139 165014 146427 129298 103587
12151 103587 90297 86688 80407 79183 69532 64576 40427 53364 66555 60181 62216 61270 64815
12138 64815 68152 78837 85564 83681 85017 118452 120649 151893 199160 264113 334869 366899 366026
12125 366026 335803 277092 237658 221209 225158 243250 303917 413572 567743 760183 918474
12114 918474 939922 843173 670461 491898 382530 317593 262520 227548 209195 197767 166065
12103 166065 157009 165849 155167 145017 131680 136146 145614 162795 182636 188482 184098 183449 184444
12090 184444 207025 246018 297290 382127 497308 631652 804767 940442 966190 846714
12080 846714 666108 508756 435656 416359 422167 450705 532527 661414 839849 998243 1073960
12069 1073960 1018047 864533 680621 544576 459640 409897 349027 315673 307413 297505 275472
12058 275472 247528 238149 264072 266050 277524 278423 264615 271732 274005 278053 298636 304253 320595
12045 320595 341407 372336 451347 548623 674604 854724 1025787 1095222 994470 806573
12035 806573 634558 514398 439656 384846 366847 357624 369357 423152 474917 488552 461917
12024 461917 419385 377365 332678 296738 271529 262637 267313 263618 278274 276196 258772 258236 254570
12011 254570 249451 263846 279181 259254 252498 264998 277794 297863 309380 312794 334278 369750
11999 369750 402035 427990 486386 564577 637226 671617 667230 620393 571673 516071 489681 484714
11987 484714 470986 474535 489590 493338 510696 541248 571993 602060 618860 634002 664113 687770
11975 687770 728940 760938 805979 853330 905517 943763 991677 1074434 1173838 1251447 1330418
11964 1330418 1429101 1517738 1633212 1765814 1900353 2056841 2241962 2470363 2706293 2966793
11954 2966793 3265466 3631361 4075994 4585934 5177557 5895975 6748833 7800203 9090806
11945 9090806 10690276 12705501 15198155 18249450 21936003 26260701 30997383 35603073
11937 35603073 39264389 41047213 40436055 37607190 33324165 28481884 23832939 19778426
11929 19778426 16401696 13660035 11466424 9687985 8277169 7147290 6226016 5451418
11921 5451418 4814991 4271880 3832063 3462703 3133768 2845309 2598146 2401056 2223692
11912 2223692 2054308 1889805 1748940 1623951 1520975 1417166 1324988 1246217 1176411 1125799
11902 1125799 1086339 1032796 978943 935305 885407 820709 782743 752688 732614 708590 681449
11891 681449 637870 578006 566293 552178 515105 495228 464043 419380 404168 397108 381971 379363
11879 379363 364002 350906 346414 328942 313548 296764 297008 314701 320138 284856 256003 250373
11867 250373 256684 239566 220247 225474 228220 222020 217220 219877 214491 198124 186057 168358 170822
11854 170822 166019 151865 135678 139409 145416 155818 161150 160059 141449 107619 95976 79319
11842 79319 80572 78150 93262 129902 145836 141928 110192 80655 83188 81967 95265 84718 80867
11829 80867 76736 70572 69728 63366 68399 79549 84581 52436 43829 42454 38621 37923 48721 56262
11815 56262 71716 67155 35320 17393 14136 42245 58721 67604 71521 64189 65938 76776 87165
11802 87165 81336 54913 51560 67371 72273 67847 80745 73061 65436 70587 72031 86616 83955
11789 83955 71840 73150 85879 89593 81009 76937 87568 90282 70826 53968 32988 23524 25983
11776 25983 40099 58599 37708 40372 59516 77074 84954 91398 94027 70900 61542 64555 57010
11763 57010 39979 37876 34931 36840 37231 54131 45046 39663 52961 57279 38440 17915 27098
11750 27098 29687 43861 35207 33626 42463 60898 57357 38320 28632 30204 29111 13141 27114
11737 27114 25083 31219 50988 58267 48428 47702 54295 57254 46951 45018 38739 23017 14634 24570
11723 24570 42066 32666 44237 49823 58491 40495 13712 -17006 -17317 -7736 -7955 -20130 -36454
11710 -36454 -18535 18207 35721 28280 22629 31730 32210 41976 45555 31161 21409 10240 12891
11697 12891 31993 38779 43150 35265 47557 60848 50698 48872 29425 28978 20946 20140 47871
11684 47871 47608 37945 33186 29378 16790 32306 51643 64620 87045 104845 120560 130777 148669
11671 148669 201884 275846 389142 555507 783436 1049095 1285117 1306892 1109645 860034
11661 860034 650325 504244 391039 309210 255113 214966 178146 159826 173331 154003 129990
11650 129990 138431 126898 133270 133751 128993 135272 148720 159609 163210 164729 207671 251198 293658
11637 293658 350553 430654 576537 795512 1053527 1256358 1278596 1082402 810906 588580
11627 588580 416260 302430 209455 162046 129671 134807 137469 110203 93333 103028 95252 83456
11615 83456 70878 55019 50530 54691 54240 45230 30393 19236 39632 51191 45686 24972 21562
11602 21562 29433 22849 13866 15908 27089 33093 15079 -16746 -8171 11324 27100 20480 14309
11589 14309 24530 41823 32565 1511 -3879 4087 -750 -1132 -9762 -9140 5423 18757 21629 20927
11575 20927 21243 16483 12033 16028 25002 22213 30921 33141 42832 31578 12942 14810 5492 5172
11561 5172 13565 17502 8072 10086 13030 -1905 -2824 2836 8451 -340 2335 13162 28491 25972
11547 25972 27231 25949 3950 -5026 20682 33686 34361 17948 20569 28911 13846 20 -784
11534 -784 -695 -9988 7467 38456 29189 25851 25268 16620 -4503 -14424 -17155 -7081 9508 9552 3408
11519 3408 4539 -1740 -186 3594 23402 27973 24615 12857 7384 15102 15657 -1500 2621 21876
11505 21876 25609 17644 14813 7265 12071 2695 6713 -6025 -12225 5497 6866 13548 12906 10167
11491 10167 15662 30249 30079 8241 5601 24893 20386 89 2447 11690 5077 -19786 -34797
11478 -34797 -32871 -12819 7809 18209 33068 20137 -963 1437 -7962 -10782 -5659 9148 16579
11465 16579 24781 15266 11507 14941 19824 5158 -5381 -9899 -10381 -20612 -22144 -9986 5602
11452 5602 6007 5988 217 -16982 -22452 -4524 12451 20836 35532 14455 -12722 11770 47105
11439 47105 53327 54440 34294 4560 9037 27975 10715 2360 -3835 9617 9158 20171 23015
11426 23015 10028 8771 -3601 -17607 -35421 -34810 -11496 -6192 2843 30157 25384 18997 26052
11413 26052 34256 10661 -3088 3684 13184 27825 34907 40142 55791 41358 40812 51624 27386
11400 27386 4341 -7900 -16875 -29391 -12089 -5914 -4728 6607 24689 22005 22531 14202 13366
11387 13366 4538 -10321 -17899 -9588 4453 15080 28171 19118 6481 15261 9300 4216 14974
11374 14974 36172 50079 19062 -25586 -28038 -13620 6466 7795 -22860 -21465 8231 16556
11362 16556 3142 -13990 -16267 -1592 1383 -12666 -23010 -31038 -21346 -19470 -25357 -9742 17524
11349 17524 21327 22858 14228 359 -6512 2425 13965 19762 13325 24851 32774 29575 29140 38819
11335 38819 16066 -9891 -9638 -15336 -2821 4120 19637 28206 4812 -11625 5067 29694 28865
11322 28865 25247 10224 -1851 5218 18724 19020 10308 9142 4202 -3405 -10693 -11947 -5147 -7575
11308 -7575 -9141 -1449 3124 -11212 -26365 -25058 -12017 -3319 7398 8785 631 3943 -2157 -23753
11294 -23753 -21262 -27074 -23949 -20907 -3388 1748 7860 29882 27555 10624 15217 26368 19261
11281 19261 16993 24385 18230 1287 14463 25393 5748 16734 29015 53469 46773 20078
11269 20078 -1232 -5766 11362 7932 -4439 -1330 5417 1586 8808 4076 -102 3984 14559
11256 14559 -1724 -21517 -29465 -16474 -5554 8291 12481 16901 21503 15737 17193 17347 -6609
11243 -6609 -17415 -9535 8177 7700 -5065 -6201 -16148 -19110 -3566 14545 11946 20321 25322 15117
11229 15117 302 -8351 -13707 -1850 12388 12828 9705 22830 29905 19605 18909 15085 4561
11216 4561 12268 20574 6662 -13305 -13071 19687 40342 16210 762 -3301 528 -14628 -22311
11203 -22311 -20270 -31386 -23418 -26536 -32338 -16414 -11839 -20216 -42338 -27774 13308 31794 15442
11190 15442 11510 12115 19053 19635 3584 -7816 -10242 -5809 -11655 -13975 11559 23959 29898 48781
11176 48781 38422 44074 53698 47260 19095 9888 21398 18794 1298 3941 19255 33137 26278
11163 26278 12897 -16918 -4592 27386 29219 23884 18823 4496 7225 11913 25991 38882 32189
11150 32189 7032 -7623 745 3129 -8799 -27854 -26617 -23365 -17419 -20218 -12051 3513 12980
11137 12980 18750 27834 28734 21307 946 -2254 17414 6616 12375 20777 1342 -1413 8351 1135
11123 1135 22274 45145 48971 29107 10083 8607 -8513 1365 14852 19211 6243 10677 -14923
11110 -14923 -13284 20238 35900 34523 21534 19708 5954 13071 2327 4424 -12442 -5460 11233
11097 11233 13873 5547 -9801 -14857 -24997 -13361 -4144 -9559 4027 17951 23178 42647 24828
11084 24828 7061 2662 8722 30218 31628 25701 18641 17529 25957 8015 -14218 -10226 14107
11071 14107 12700 15302 24468 33284 29470 30865 38106 19233 6449 9490 27601 27368 16913 -7398
11057 -7398 8744 32705 55183 49650 45593 45395 29789 27599 48902 58214 57735 59965 75039 89071
11043 89071 89433 97744 92238 89585 115781 140356 139198 147569 190954 252061 326717 428684 593921
11030 593921 776413 915508 900250 734283 525869 395370 341264 304580 288160 282744 250229
11019 250229 224205 208819 199646 185430 159922 137335 120307 142212 141474 123180 119104 130687
11007 130687 129601 101546 100583 86467 65226 62691 58252 73508 75426 69504 83090 87819 93440
10994 93440 108461 95193 74790 79664 56333 37914 33906 29479 20327 15671 20038 26030 23164
10981 23164 24923 36786 29389 35610 26613 21601 35493 43832 46617 53212 64901 65946 57827 71034
10967 71034 69508 59013 63387 54263 57230 62358 55878 60530 68528 70946 63570 60735 84467 108258
10953 108258 138771 184890 229065 280250 364515 485396 554784 542800 471659 374461 297691
10942 297691 257956 230438 217842 230451 269277 302569 343954 375952 425865 537872 708372
10931 708372 929858 1251265 1723933 2388734 3269790 4112314 4156794 3313628 2342047 1636972
10921 1636972 1166113 862072 666558 531620 457959 393867 337459 291333 244891 222809
10911 222809 190607 183841 164481 150165 145053 154146 138730 137259 148835 137943 108195 98770
10899 98770 96922 81277 57294 77259 92276 68766 42063 26931 27530 22821 36462 69106
10887 69106 67649 78872 104400 117549 116199 124948 142350 158878 215381 293817 379270 437936
10875 437936 468977 452032 390794 326467 265361 213773 175152 145063 128898 125756 106749 77574
10863 77574 77733 80568 66838 59656 57749 50893 65695 86174 95988 80074 62613 49932 64641
10850 64641 72649 78308 69391 51126 64564 71330 58363 40824 23260 43100 38755 39205 43286
10837 43286 42590 26173 12419 25350 15363 -2788 -1803 -491 28552 21092 5160 -6268 -21825
10824 -21825 -21945 -4599 10936 2564 -3338 -5831 -4938 -493 19619 34618 39399 52061 56068 37301
10810 37301 27749 5962 10312 24358 29916 26640 31740 48491 59835 67483 71662 75327 83082
10797 83082 104151 117198 129020 141107 156474 190642 240101 268407 344960 453599 600971
10786 600971 785467 1000609 1269479 1482386 1694985 1913996 1989692 1845393 1602898 1369847
10776 1369847 1165358 938108 710624 533484 418847 323585 257794 210665 185158 170875
10766 170875 159850 144047 127578 113270 91747 96058 85339 75567 71886 95754 88614 65229
10754 65229 74765 77307 72602 67121 78532 75564 46921 53521 54670 31852 46078 64936 53251
10741 53251 44114 30548 36659 39563 42569 42554 45869 57882 66458 80377 64552 38575 33940 46182
10727 46182 51642 69853 67748 69586 88563 111168 128087 131263 109300 101643 89035 94415 112480
10714 112480 128877 120577 130426 131117 133677 141171 154780 160629 145529 125771 120601 130494 129340
10701 129340 136993 133055 117868 122774 124747 113657 101611 112151 123894 111086 116464 106484 99716
10688 99716 113666 114390 103989 89840 77360 80140 81639 58004 42189 37003 32945 40149 62539
10675 62539 70537 91822 102137 94684 93471 103449 112461 103101 98181 114113 126639 124947 115495
10662 115495 121317 133839 133431 142862 150961 164409 165657 178495 203336 200409 212589 226925 217129
10649 217129 209185 242897 296532 337369 382765 415287 435842 491305 566822 659993 754562 822298
10637 822298 836262 815587 783652 773623 775851 788197 817981 842946 855535 882515 926804 1005180
10625 1005180 1108517 1222498 1389798 1593824 1896324 2309180 2855261 3592954 4560928
10616 4560928 5752141 7085993 8246727 8847820 8817311 8416237 7976926 7725180 7822644
10607 7822644 8399574 9547289 11350632 13785367 16504564 18652187 19310619 18348626 16596513
10598 16596513 14941032 13847329 13533858 14057813 15424619 17726743 20856064 24199505
10590 24199505 26478892 26420175 24066501 20725054 17619276 15355850 14024401 13557318
10582 13557318 13919916 15039120 16700009 18421184 19298187 18553093 16363657 13675443
10574 13675443 11293195 9541307 8419519 7862724 7741120 7965496 8426238 8803171 8785860
10565 8785860 8133542 6949874 5603909 4378848 3398917 2665273 2126863 1738393 1481092
10556 1481092 1292929 1128117 988329 881179 801357 737620 672482 626163 600026 547342
10546 547342 511479 494106 469322 448010 423250 391960 383550 385263 371308 356404 329556 299311
10534 299311 267939 244731 214617 186757 150005 98293 91739 90081 79727 53729 37488 55509
10522 55509 57199 48387 59111 92957 109337 166608 225017 272847 323012 374217 432811 480193
10510 480193 529816 576041 628849 660239 701233 756739 809600 866603 950181 1007962 1031523
10499 1031523 1052218 1070887 1060781 1001965 937083 873885 817801 774779 722677 688644 674326
10488 674326 649921 630046 607426 602310 570846 559455 556626 545624 552458 536133 507711 498458
10476 498458 500763 490525 496184 518398 521806 520690 532784 544251 560784 565632 567659 587684 625025
10463 625025 662122 713837 733496 730730 732461 750918 780370 799506 822307 847686 876528 881814
10451 881814 902098 912843 925213 932985 973831 1041919 1117714 1170285 1203511 1214725 1241528 1241121
10439 1241121 1245730 1285674 1331778 1366072 1397794 1436388 1476600 1530685 1568210 1599988 1630995
10428 1630995 1671084 1718467 1760957 1826231 1898898 1963419 2041124 2153632 2285075 2404905 2511270
10417 2511270 2638241 2770453 2887669 3000998 3158660 3356827 3578882 3843657 4174654
10408 4174654 4544197 4981629 5457537 6034193 6734241 7520071 8389196 9330238 10381277
10399 10381277 11552381 12704788 13847491 15250950 16992393 19066202 21634973 24924617
10391 24924617 29063747 34251538 41042810 50413965 63728892 82802510 110127269 147867767
10383 147867767 194705777 242363943 284702946 327141414 366867454 374927743 341974239
10376 341974239 296874898 254886629 210050366 162737325 121774420 91480983 70480081
10369 70480081 55874968 45486872 37946305 32304285 27851293 24187046 21231516 18894279
10361 18894279 16988981 15370362 14006826 12922925 11981672 10966012 9937737 9029888
10353 9029888 8207183 7463906 6806267 6239889 5759926 5325796 4933439 4607493 4317005
10344 4317005 4070329 3831279 3611559 3408066 3215845 3042032 2877244 2725644 2564306
10335 2564306 2421041 2299212 2193882 2103265 2022728 1914775 1810574 1706868 1625495 1554995
10325 1554995 1489494 1427784 1360297 1302532 1257576 1208979 1149149 1119331 1106886 1092784 1064120
10314 1064120 1016384 986193 969407 932072 900552 882149 861926 828716 799796 773034 728024
10303 728024 712594 699886 708409 699124 665073 670123 679299 672721 647577 625932 607167 602585 599363
10290 599363 588453 561473 540172 543900 562469 541659 507426 484795 461281 449125 427566 397658
10278 397658 391139 393288 374706 360408 358757 330707 285729 244738 236804 229850 213570 179444
10266 179444 145692 115836 74000 34585 -12415 -44565 -64679 -68282 -47308 -29418 -1274 51019
10254 51019 121768 180092 203043 215725 246649 291455 326260 372280 400091 405080 406288 425231
10242 425231 468332 504222 508031 499851 510361 516391 506400 513229 529261 517029 504152 495358 486873
10229 486873 467402 456615 419025 405889 378554 347762 311392 288483 278245 270109 270919 267965
10217 267965 264512 238649 233415 251771 262908 252148 237266 234726 227252 235763 252047 264582
10205 264582 266722 274509 303854 323846 318478 322636 316612 335606 351998 327700 291025 277691
10193 277691 281763 266561 236017 200806 188758 193320 202830 202524 194991 186682 182226 180575 183145
10180 183145 188740 190136 202826 214676 216104 211103 189527 183677 172238 182028 214463 230802 234585
10167 234585 237114 244653 228570 234721 240486 244915 237150 222989 208458 217017 224272 249921 263373
10154 263373 278925 282583 272831 268808 269442 255117 233292 211808 190751 188908 211597 229702 234590
10141 234590 237185 219209 197469 181547 181229 187565 182382 165749 159266 169492 180245 187664 188491
10128 188491 179487 187909 179329 158407 144313 142243 128862 118751 109438 121741 120039 127834 151758
10115 151758 151295 156853 152059 142152 151682 165102 160920 177271 178616 167116 157849 144842 145049 146734
10101 146734 150495 138455 121329 106322 101177 104079 113193 109098 92937 99048 103468 100568 83588
10088 83588 69566 77370 95154 106651 124162 132829 122119 121027 124581 134017 152320 158753 150730
10075 150730 125185 98037 80735 80353 93586 90296 92377 113986 118374 68253 52867 68456
10063 68456 88083 84417 86298 92184 72675 68349 47745 43684 47602 48238 58416 62690 71831 60934
10049 60934 39464 46761 72586 71288 55989 47964 51410 59445 57961 57432 44176 25073 32298
10036 32298 45325 53119 46226 42309 40219 27984 42603 58063 46481 23667 31453 53516 55748
10023 55748 54087 66542 66089 56389 59320 59146 54963 59284 78674 81664 80407 58901 41643 41893
10009 41893 46255 48736 52017 51271 48726 35656 44483 57172 67709 66681 63269 65223 63841 65456
9995 65456 86003 106734 113952 113085 120251 119181 119952 128900 145121 160240 161345 185292 218455 240583
9981 240583 273010 333008 444540 601611 749634 968126 1237917 1485907 1717253 1919214
9971 1919214 2032755 1945261 1725144 1508056 1288008 1039909 814711 615192 489358 402833
9961 402833 333338 283937 245069 223966 190941 175159 156474 152322 145476 124928 116869 116452 100355
9948 100355 98350 104860 112019 110179 100440 99230 83392 68968 65993 63409 79020 81492 92939
9935 92939 83281 83297 77353 82375 93282 92175 83302 77247 43403 33979 22813 32790 33975 23338
9921 23338 34416 44195 32512 18438 16538 13248 18057 32522 34781 36465 29613 21476 26887 42164
9907 42164 53517 65874 79285 75807 55396 43004 41838 14998 6186 36180 39803 21879 16021
9894 16021 17723 27047 33436 33744 24318 21283 37558 49845 43682 40611 33287 28637 19468 28628
9880 28628 37615 28057 25576 14313 27513 32880 38015 45143 36634 23117 32553 35777 17804 7718
9866 7718 -893 6077 7540 8045 31832 37343 27942 30475 20696 11711 22792 34047 39007 23292
9852 23292 21277 32259 28155 -159 -1050 20004 22929 22988 12480 15063 7143 -11 9116 -9124
9838 -9124 9511 53394 47188 46931 43241 28076 36179 30579 28134 22672 25416 21804 2721 -1129
9824 -1129 28276 20585 30528 54504 47702 21083 9554 10637 3076 16758 25908 30849 22396 13313
9810 13313 10246 22258 22932 26486 12379 13984 19317 11943 16128 12983 20023 27935 32487 22121
9796 22121 21609 39275 38983 19055 22378 25840 22041 8930 4806 13569 18556 4981 14666 34563
9782 34563 37180 30329 35029 31616 36538 48609 31518 38402 36822 52752 74330 73391 63980 57118
9768 57118 46685 44598 36827 7664 -13624 -12083 4029 21791 36325 38831 23877 20283 17666
9755 17666 27140 16787 11725 33806 31242 24615 12369 -6362 5112 18269 36968 29234 38287
9742 38287 44311 25849 20507 14895 14872 7904 -5268 3219 19610 37337 35265 16150 7562 7883
9728 7883 6457 327 15285 41321 37379 22644 20387 209 -7485 -7284 -11264 -11413 13321 31970
9714 31970 32045 35435 28064 6599 -6880 13706 16929 -5085 -8877 -5905 7613 12931 6622 12348
9700 12348 30742 51394 22973 12298 30316 51407 52291 45561 41511 45803 26984 9977 35789
9687 35789 47694 34028 42267 49767 46219 29717 34178 35429 36321 20111 4437 -12059 -11351 1552
9673 1552 10654 13830 9689 22593 38017 46790 24976 11382 7691 25708 32480 25995 14278
9660 14278 20660 25665 24048 31944 37293 45691 52476 55293 35061 31078 27661 10119 4320 17516
9646 17516 15205 10719 12615 5914 3721 998 893 -3646 -6477 5152 13523 8904 18933 10207
9632 10207 -15229 -10312 12502 5106 -4569 232 21574 9003 -22918 -35597 -19669 -13858 -13602
9619 -13602 -13009 -13133 1787 13042 14974 704 -3041 4515 14574 26070 17133 9345 -10334 -2201
9605 -2201 20217 43091 48222 34433 27965 8186 -19819 -17085 -15387 -10932 -4620 17766 24340
9592 24340 42857 32926 20620 15650 15093 14746 25525 39735 26532 19086 19323 19856 9291 5410
9578 5410 17534 25674 28703 20810 13469 3876 -2044 6710 5781 5478 5654 3042 -11280 -31662 -38322
9563 -38322 -22653 -10982 -5803 -6451 -3114 3905 20650 23746 24666 41948 47745 39694 32923 30347
9549 30347 27319 14838 4964 -2774 -6558 -11304 -28512 -29142 257 6517 6509 787 -4128 -9309 -6986
9534 -6986 -10579 -11979 -5810 -1813 5252 -3154 -1530 10276 12473 23137 38308 25115 15759 14957
9520 14957 17185 12117 19904 21075 36102 39499 33318 24185 25760 30562 26437 12350 19047 9526
9506 9526 2733 6315 -1882 -10238 12336 26129 13166 -845 -8767 -6250 8036 25153 52727
9493 52727 37744 12230 9078 6984 21220 30962 28983 15607 19351 25145 6619 -12992 -16326
9480 -16326 12879 7086 3240 7517 8198 9193 3461 190 3993 -14977 -8164 -8923 -876 16066 35136
9465 35136 40367 20416 14099 34097 50138 27317 16313 26354 34489 19203 7537 8413 14421
9452 14421 9972 -5456 -10308 -20778 -10466 -20149 -26509 -15507 -5707 -5789 -9382 9580 654 -16213
9438 -16213 -29891 -19621 -14686 -9771 -3531 4977 4069 -989 21358 30200 29418 6644 27 50 32883
9423 32883 51459 35959 14970 8046 6792 -2983 12391 13591 5791 -14634 -4610 15347 13789
9410 13789 14636 8056 -13059 -21406 -28851 -30557 -19841 -21320 -8850 2378 -8501 -33439 -31046
9397 -31046 -23893 -14474 -8370 -1643 7790 24922 30303 2675 -9780 -7259 -10035 -8304 -12358 -14012
9383 -14012 -4787 -7562 -13122 -15999 -22392 -24819 -21036 -28137 -27862 -21220 -24894 135 -85 -2697 -9112
9368 -9112 -8629 6430 10864 7618 689 -8355 -22857 -13100 -610 6505 -4028 -12555 -28727 -31632
9354 -31632 -20615 -11951 -3957 8340 19952 28872 41136 25833 14265 10671 8188 -2159 1087
9341 1087 -504 -29339 -13261 11528 24265 2395 3139 3648 -6059 -3746 2816 6913 -1295 -4412
9327 -4412 21294 37846 26569 15005 2938 -11476 -14074 -17649 -33337 -52190 -58909 -18659 6784
9314 6784 -2329 -11455 -1296 -13588 -29283 -22991 -5654 17275 8996 -1680 -5517 -4675 2930 9006
9300 9006 15383 17800 18510 21675 19152 25725 36627 31659 25469 13118 -14256 -12630 -3695 9343
9286 9343 17119 12283 22576 1233 -9784 -478 -1047 -1782 -11378 -13840 -1569 3649 12133 14141
9272 14141 2870 6084 14275 1044 -233 5359 5555 15669 16244 10566 8035 2145 -12521 -22487
9258 -22487 306 415 -9362 5791 18658 14839 7046 14074 18873 11820 -6274 -1298 6860 8436
9244 8436 12312 4055 -9240 -9539 -18266 -26625 -16273 5401 15106 24828 32551 -3601 -1897 285
9230 285 1011 -8264 2453 10499 10461 5840 16526 6815 15060 13328 19750 16904 -1573 -18440 -28657
9215 -28657 -16560 418 -3573 11358 2635 6741 11129 6124 4687 6311 -1890 -13886 -14123 10580
9201 10580 23501 -6122 -12915 3710 -1900 3926 15350 19461 22584 21740 12432 9603 5663 8507
9187 8507 14907 -1325 8709 15336 16942 6462 13913 6492 4335 -1657 1379 12928 19966 10437
9173 10437 7556 8324 -6890 -16968 -25468 -31679 -35730 -35795 -28582 -20510 -22720 -12256 -5690 -2018 22063
9158 22063 18673 12732 3574 -14778 4730 9877 27865 49428 46139 42904 48632 39691 26833
9145 26833 24775 17135 8878 12712 7170 -6461 1877 12569 11486 4368 -1790 -8353 -12708 -10275
9131 -10275 -7103 -4948 3905 5052 19514 21389 11888 14107 19665 16964 7103 17591 14845 4555
9117 4555 -798 -3131 -14885 -15749 -11866 -10924 -7094 -16843 614 2652 -6863 2178 -1860 -11340 -14744
9102 -14744 -11338 -5537 5133 20277 4956 -3488 -9576 -11892 -10199 -5839 -2539 -9272 -18073 -11270
9088 -11270 -4968 -5893 -23298 -27178 -12329 -5165 3765 1848 -4230 14340 26698 7450 -10386
9075 -10386 -8750 -9526 2014 12482 20805 47068 26180 -14353 -22769 -12548 18213 15394 -3303
9062 -3303 6750 11761 29729 31999 28357 9970 4786 -605 -9634 -11527 1898 12260 8726 10441
9048 10441 -4181 -27152 -29386 -5843 -3179 -9085 -13513 -5423 12937 24176 10136 532 -8243
9035 -8243 -22 -14754 -19889 -4780 -5501 3560 18504 26995 22374 10758 15166 15211 14182 -3166
9021 -3166 -18599 -6637 17206 27974 27126 9832 15254 23183 4880 13453 23442 10662 -5788
9008 -5788 -21499 -30406 -12568 -5876 2888 14819 11198 18397 25273 16986 5360 -11502 -33586
8995 -33586 -45726 -30085 -21726 -17068 -2379 -3042 -13230 -7943 -1708 10016 18197 15055 12177 3508
8981 3508 -7968 -12409 -16035 -28787 -25812 -5618 3095 6703 4808 12870 4539 -5514 -17615 -21812
8967 -21812 -28845 -8379 14378 9722 5425 17605 18399 3114 5549 11654 9659 10406 15531 24667
8953 24667 12553 10861 14869 3363 -1378 2151 -552 8316 25572 24841 17680 7210 -11319 -21203
8939 -21203 -19289 -12537 -12989 -10209 -2652 -3165 -21340 -16502 -8788 -15816 -23450 -24970 -28481 -20898 1928
8924 1928 6064 4966 11498 32614 36379 27758 26689 17571 20919 16490 19192 24517 28753 27237 31896
8909 31896 23975 10896 20835 24785 12805 -6348 -9192 -21601 -34250 -33148 -22974 -19951 -31303
8896 -31303 -12018 5222 -4344 6984 31327 33303 31199 9605 5597 5545 3932 -1484 -21838 -14334
8882 -14334 -446 8060 6903 5722 29057 23201 17300 31061 40975 30592 25278 34875 40799 31282
8868 31282 30617 30136 17865 2967 -4696 -2275 17693 15338 1922 5062 627 -9241 -10704 -17551
8854 -17551 -24355 -21353 -5448 6109 -1898 -8331 -6902 -4261 14194 24483 8919 -4436 -4903
8841 -4903 -11333 -11351 -3310 8125 3868 -3120 20090 35438 19968 22339 11415 2656 10936 24410
8827 24410 25907 3227 -13282 7208 12561 -4553 1963 15565 4150 11058 9944 11383 10874
8814 10874 9744 -11289 -33314 -37264 -32178 -16617 -2752 5968 6915 15788 5990 -16978 -19546 -16740
8800 -16740 -9656 2705 10341 6416 -5803 -6322 -524 -2573 -11185 -14247 -20315 856 35929 24819
8786 24819 5893 -8590 -3287 -5319 -4558 4323 9340 25885 30134 38637 50698 37430 20649
8773 20649 26330 20969 23860 11160 25993 23616 15865 14757 12045 40822 56962 50449 44604 77906
8759 77906 113963 156532 205037 270551 372925 535978 730692 925532 971795 834691 620998
8748 620998 440512 345427 265005 210487 184298 165557 147428 113547 73440 65081 66366 42615
8736 42615 39444 37207 30202 47730 52951 64462 75615 78823 88905 81137 74537 52636 72951
8723 72951 79130 66257 81686 100382 100670 111446 134482 163341 184682 229843 307511 418388
8711 418388 561361 783845 1113247 1613334 2088848 2150237 1737369 1212940 816148 586640
8701 586640 443004 334118 271596 220569 190170 170952 144526 128085 146078 130054 97330
8690 97330 102437 108096 99969 86054 67393 51138 66166 65099 67953 56635 22164 16190 39968
8677 39968 42212 37346 46631 62479 74618 87051 107706 123061 164044 202729 246115 309072
8665 309072 430102 574419 752504 925935 938776 797598 598201 429384 309558 232728
8655 232728 192116 149902 118285 75859 49015 47295 38127 31351 28995 27725 21987 33050 29453
8642 29453 6400 7497 14431 12451 22501 33726 34684 21807 15982 10912 22632 31392 22262 21645
8628 21645 23613 23627 14204 14167 9679 -7897 -408 -6624 -21069 -28520 -14501 175 -6131 -7133 7806
8613 7806 10697 -1661 2670 -9044 -8369 2496 1354 4085 25593 30513 12448 4079 583 -6524
8599 -6524 -15922 -23330 -6120 -2678 -7967 -8994 730 12686 5463 1673 7991 -2582 -2935 -13193
8585 -13193 -28133 -29462 -17556 -21679 -34060 -42105 -39383 -45957 -40034 -25216 -6663 16755 16130
8572 16130 8844 2806 9630 264 -6087 -5184 -118 18593 17463 28203 37626 54188 76153 78817
8558 78817 54132 37616 27424 10491 3154 18201 24080 3249 -21546 -13974 -7092 16047 17303
8545 17303 12748 12222 11676 20573 13802 12379 32644 25602 9690 -6747 -13512 -3317 10422 6028
8531 6028 381 -1987 -5254 -197 -2048 4430 10709 22155 14147 2077 -1731 -4728 6664 11265
8517 11265 13407 8630 8837 -11491 -35289 -47984 -25826 -56 8757 18306 2789 -6376 1252
8504 1252 18941 27917 15179 11149 19018 27959 35004 27988 15022 -3805 11387 11090 -8071 -290
8490 -290 1096 18356 14291 5280 8795 8543 5439 14208 24687 22485 25955 47551 65032 63595
8476 63595 47762 37279 23497 7745 4471 853 -10468 -24577 -21640 5181 20823 11987 3761
8463 3761 8502 -17655 -8376 1949 -3804 -9971 -13583 -5251 7296 2269 1741 745 15057 18233
8449 18233 -953 -13268 -9858 -7361 -12408 -25761 -38946 -26012 -24947 -26582 -21496 -13443 -967
8436 -967 21148 27743 26757 33580 24411 28697 33248 13818 5790 4939 18537 37034 31705 2903
8422 2903 -14648 -9527 -859 777 363 -18062 -13121 -4601 3080 2927 5278 14491 8067 -2430 -794
8407 -794 9677 33755 36964 15018 4390 10182 11687 11871 16147 23194 26328 43089 37318 25427
8393 25427 13722 -4907 -1823 15175 14667 11342 14040 4801 -3178 -8550 15909 27196 21810 17866
8379 17866 26787 19569 13076 14349 12195 4875 9696 2673 -8469 -15361 -3905 7581 27052 36402
8365 36402 31514 28009 20739 18480 22105 37757 50064 52872 59064 51871 61745 69219 80036 107247
8351 107247 121855 133424 162264 201518 273593 386425 542504 794285 1235983 1911495 2599551
8340 2599551 2578077 1895695 1210214 755096 520029 381954 287095 211652 172128 154845
8330 154845 141205 122260 106008 109820 106792 86791 83277 79337 81822 96004 85571 69219 64922
8317 64922 86756 118540 120335 108613 112225 124604 158890 178323 200909 214074 223200 237027
8305 237027 275206 351530 476853 619739 846620 1293341 2063195 3318264 4880289 5327831
8295 5327831 4132988 2626398 1610798 1056599 745562 563917 420323 314012 257469
8286 257469 226517 201493 174101 152628 136442 128582 100077 80108 58997 57211 58819 52699
8274 52699 55022 51058 63064 73467 84584 84274 97521 116544 121194 130156 145010 156098 169102
8261 169102 174129 207681 256394 319542 409942 591234 915828 1442114 2172854 2610641 2227206
8250 2227206 1483165 906934 575857 403167 302896 256010 193082 147593 128179 119941 114546
8239 114546 92837 65502 50249 60905 77194 68898 48529 38004 38337 16644 7862 21732
8227 21732 45855 50408 38273 41274 37030 35090 12066 6988 15439 12207 2714 -4137 -11699 -13559
8213 -13559 -22428 -30079 -38575 -24467 8696 23885 17820 4675 -540 1762 5983 4513 -11852
8200 -11852 -16107 1455 4695 7726 9082 17051 17749 -4294 -5135 13153 20882 29135 20620 7497
8186 7497 10664 42469 46458 39003 9952 7138 6677 1508 -3484 2390 2540 -15408 -32886 -35389
8172 -35389 -34702 -22389 -22990 -22321 -20871 -12905 2912 -2045 -11206 4886 10231 4213 -893 -13489
8158 -13489 -14638 -20493 -15082 -4446 -5312 -5677 12455 34084 18833 11138 14743 -7069 -18368 -19130
8144 -19130 -15530 19723 22215 8583 -804 6045 7269 6565 -6669 7252 -187 528 -9537 -10498
8130 -10498 4042 2480 7830 2330 -8608 -14775 -4703 -1584 -487 -22634 -24095 -26748 -44577
8117 -44577 -18689 1778 4337 562 3826 -4758 9077 19678 15966 17759 26665 21323 21193 1298
8103 1298 5810 5705 -2130 -18293 -31361 -34564 -25533 -8706 -15255 -9132 11081 11873 8641 -184
8089 -184 5898 16882 9326 -3133 -5832 -5256 -7553 -10044 -29348 -33389 -34107 -30901 -28476 -28264 -36614
8074 -36614 -32547 -10430 1626 -12038 -20434 -11654 -19304 -20218 -20300 -16487 -7070 19121 21288 33315
8060 33315 26983 23712 25713 3725 204 3465 4659 7018 17770 11796 12010 23308 11444 -2897
8046 -2897 -7175 -9995 5345 4714 -4814 3448 4446 -807 -26718 -17627 -18356 -20854 -17823 -16204 -19092
8031 -19092 -14995 -10399 -19440 -28169 -13338 1329 -18233 -24153 -24988 -26252 -16754 -379 -2038 6865
8017 6865 16457 7602 -9605 -16775 -9885 -3029 -2696 10429 6599 -8072 -1338 -157 -27404 -36600
8003 -36600 -31940 -18257 -12585 -305 -4326 -8955 -11660 -22847 -11042 -4172 -3917 4699 9200 676
7989 676 7920 2317 4281 7426 11406 2151 -660 -16471 -19360 -21825 -5567 17262 22938 28133
7975 28133 29479 30170 25605 27371 37436 29981 15412 7620 21788 24867 26121 24253 23057 30089
7961 30089 24412 13072 12292 1940 11346 20215 18250 10179 16683 14500 13902 -2093 -6311 3938
7947 3938 18090 22818 21893 24421 22518 37369 20201 11214 12194 12052 5058 -1091 4356 19978 29407
7932 29407 17660 2096 -14501 -2117 4454 -10634 -18402 -12874 8011 18071 7871 10385 18767
7919 18767 10025 6488 -11218 -32470 -28891 -8978 22852 41244 40967 20714 13126 13985 17607 15934
7905 15934 7554 10687 6932 24620 31632 24939 21339 20312 23060 22343 4832 166 11864 16002
7891 16002 11863 14690 3315 -8886 -5784 4781 -7160 -13780 -9103 3289 4668 5540 5373 13257
7877 13257 13539 14633 4746 6876 5423 -5610 5940 13666 12175 14185 25358 32057 28015 29630
7863 29630 19324 28083 32350 22780 13338 -8590 -23443 -12780 18640 44120 46350 34262 8489
7850 8489 -15669 -18172 -23087 -3287 -11592 -15811 -7064 -7486 3394 9954 2168 -4141 -19176 -8851
7836 -8851 -18149 -17486 -4419 -5467 1327 -2064 -1395 -8020 -4951 7050 -12661 -10007 -9407 953 15932
7821 15932 8485 -101 -7619 -13948 -11540 -10265 -22022 -8631 17812 13378 6454 -730 -108 17364
7807 17364 9342 3564 8182 5514 2932 -1197 2146 7007 -17998 -35774 -24385 -13479 -13716 1014
7793 1014 1168 10629 18453 23416 29307 28573 20479 15399 15205 10244 4819 -1619 -11564 -4504 10231
7778 10231 2164 1539 -2581 12018 4789 4765 8941 -7761 -2691 16472 28847 16020 6457 4511
7764 4511 -1358 -10432 -5427 -9850 -5457 -12859 -25466 -7149 13919 19027 14986 11448 14681 23733
7750 23733 24189 39598 35620 11565 13380 26409 53341 45615 20458 9674 4392 -6327 2488
7737 2488 11930 10113 11035 -8096 -11764 -11883 -9216 1751 12202 2348 -986 -5402 -31532 -35844
7723 -35844 -25598 -9503 -11879 -15124 -10154 10150 17568 5557 113 -6813 -2342 9109 19639
7710 19639 12165 -2246 -16991 -13424 -7696 -125 8980 17422 8357 -19310 -17756 3819 21716
7697 21716 7348 -1968 3220 17098 30893 31261 33754 25965 13913 4600 1509 -6213 17262 1735
7683 1735 -9060 9774 6652 9297 8588 22657 21879 11291 4827 -4269 -341 860 1544 4026 9422
7668 9422 2502 2242 1740 3386 14531 -12050 -25067 1975 11227 9322 -948 -14208 -15500 -30195
7654 -30195 -48483 -33641 -11765 -1729 -7280 -25518 -27964 -28383 -37231 -30996 -19383 -17484 -6641
7641 -6641 296 12027 28095 21040 -11808 -21289 -4498 2131 13343 14519 9416 4527 -936 -5676
7627 -5676 -15331 -23648 -32326 -24878 -13749 -3332 -10324 -22553 -23242 -34902 -37272 -33822 -32639 -30252
7613 -30252 -28590 -2843 10375 9394 7781 5762 10398 31289 37811 26766 9249 6103 -9783
7600 -9783 -14847 -13238 -25848 -23036 -26775 -31652 -15490 8984 15504 1947 -23859 -25004 -5264
7587 -5264 -13070 -46539 -59527 -57527 -40819 -11892 -12873 -24160 -16780 -9869 -12537 -10240 3571 -805
7573 -805 -12918 -13778 -11150 -14036 -7740 218 15999 20589 13123 -11236 -8185 -6520 -15724 -12765 -311
7558 -311 -11719 -22403 -36184 -44249 -35684 -17921 -20836 -25542 -20474 -9329 -4391 -6412 13930 7104
7544 7104 14456 10059 3286 -18240 -5817 1961 5933 2439 -12573 -8991 -525 -11918 -16192 2197
7530 2197 15098 9420 1645 5280 -15443 -19090 -9555 -21375 -32932 -24774 -17065 -16359 -11204 -1386
7516 -1386 15515 17320 22226 39294 28254 6736 1893 -998 -12788 -17577 -2982 -1393 -12479
7503 -12479 -12263 -8173 -21286 -37849 -37084 -26032 -1583 28610 32747 9762 5309 -15117 -21076
7490 -21076 -374 13042 22209 16206 14103 1546 -8770 -15150 -16138 -11834 -15203 -19984 -29065 -37176
7476 -37176 -37311 -40219 -45280 -27440 -6254 -23165 -24425 -15505 -15456 -7819 -37918 -38822 -4851 3019
7462 3019 4748 -5461 -4813 -1171 -5937 -6002 -8435 8189 24836 19635 11901 14775 19464 35246 34546
7447 34546 4343 -7848 -1468 19169 24763 16877 140 -3494 6232 7 -14518 -26043 -20307
7434 -20307 -2066 -4332 -5855 -9268 -14794 -18539 -21225 -41033 -37843 -19825 -28479 -25188 -18348 -21104
7420 -21104 -10386 -11766 -9723 -11119 -10180 -24257 -31730 -45462 -48409 -45495 -36215 -24787 -20968 -15985
7406 -15985 -6393 9342 9829 -6109 -30482 -25044 -5284 7242 -3892 -16641 -19301 -22280 -24890
7393 -24890 -8065 3039 -13502 -30751 -41395 -38122 -38978 -30057 -17636 -12675 -15743 -26436 -4227
7380 -4227 10644 4537 -2485 -796 -8578 -2790 5011 -11014 -27867 -34232 -41656 -42944 -21199 -5205
7366 -5205 -8823 -4666 -3533 -6538 -14330 -14328 -27688 -30074 -11322 -27035 -34048 -29052 -46249 -47913 -25605
7351 -25605 -9256 22453 28422 9160 22663 18168 -14291 -10631 -11341 -31643 -23239 -21248 -26012
7338 -26012 -20146 -35487 -31662 -36528 -24997 -10104 -14809 -15514 -11997 -8759 -9051 -7440 6968 -5717
7324 -5717 15354 22680 7430 -4412 6196 3203 -965 1 -10847 -16400 -22010 -21826 -16436 2842
7310 2842 6452 27954 16274 -16493 -18180 -18551 -11183 5812 12619 24243 5222 -28408 -25724
7297 -25724 -16004 -10646 -17440 -15549 -23273 2434 10343 21349 26043 22208 31422 15737 18421 13421
7283 13421 6610 13172 11742 5114 -8591 -1286 9865 5397 316 -11027 -14889 -14894 -2970 4323
7269 4323 10782 -4403 -13014 -4514 5493 4870 8824 -258 -18237 -10992 -3998 3118 -13499 -9346
7255 -9346 5788 10965 5081 -5384 -20703 -20949 -30711 -14364 8744 8332 12862 4765 -7458 2282
7241 2282 -12777 -16737 -8590 -15656 -12264 1014 5933 -4980 -6565 -9636 -17396 -5519 5923 -6404
7227 -6404 -12359 -13425 -20932 -14546 -6782 -3810 -19518 -21486 -10126 12311 20023 21281 33187 37992
7213 37992 16098 5821 -7176 -8657 -26189 -23415 -11039 2454 -5910 3098 30682 14252 10341
7200 10341 16155 29189 15541 -11210 -2796 1076 -5464 -12355 -3575 15108 12328 23647 17446
7187 17446 6792 10603 309 -3430 9893 27186 35298 17302 -2780 4540 20405 20507 2196
7174 2196 3510 -6162 -29186 -15810 4003 3543 -9403 -26941 -33302 -18273 -13487 -34458 -28559
7161 -28559 -13691 -24517 1114 6734 2257 -866 -11076 6738 17848 5680 3747 7970 11488
7148 11488 3388 21603 21340 251 -9487 -19524 -29349 -24045 -28500 -39186 -48628 -46145 -27455 -26018
7134 -26018 -11329 10010 8173 -19255 -28376 -21003 -22638 -4869 677 1241 814 8377 6660 -1035
7120 -1035 -1610 355 -23149 -26711 -26503 -5771 4051 -11697 -21354 -25037 -27163 -26931 -24570 -32643 -27642
7105 -27642 -11615 -11317 -30572 -20378 -7595 12631 17470 11995 7529 -7234 1900 -756 -8444
7092 -8444 1163 -1141 -21170 -27958 -34662 -17287 -7181 -11179 -31182 -29535 -35481 -36443 -32358 -22082
7078 -22082 -8292 -18124 -14161 7975 9354 7544 6624 10710 2909 1756 -1514 -2705 -15877 -15155
7064 -15155 -907 -9469 -18460 -10216 -7953 -10215 -16843 -25690 -29074 -33512 -44635 -29561 -13193 -5662
7050 -5662 -6001 -5760 16590 19986 25577 17093 16814 25897 29654 12279 10521 6569 -1735 4877 6278
7035 6278 26463 34375 21684 20465 28346 11123 -9889 -6544 12093 26313 26514 12850 20760
7022 20760 20109 29440 41510 28830 4813 -4967 3477 465 -10030 -9910 -6989 -2446 -1053 -8840
7008 -8840 -24279 -32590 -10421 -16356 -16645 -15930 -10044 8324 10931 -276 -8292 8100 8744 10073
6994 10073 4229 1207 12771 -5371 -18693 -27217 -11763 -1800 7986 14923 6512 5785 20125 12123
6980 12123 1617 -161 -5795 5040 9134 8075 -6567 -15441 -9365 -29 4885 -3366 8011 -119
6966 -119 1050 2130 -3658 -20845 -16496 -2749 4669 -1244 -10190 -17372 -8009 -457 -7886 -13181 1084
6951 1084 9656 11163 2669 -2153 140 3239 11837 13229 2836 -16208 -22003 -390 16004 21694
6937 21694 23838 8485 3078 12884 25464 9730 16399 24628 21619 12282 34737 9652 5847
6924 5847 17270 9318 -18750 -26255 -36634 -34911 -51374 -40381 -13492 -13462 -4025 436 245 5771
6910 5771 5187 -7325 -5453 -4136 -3530 5301 12687 12950 -1468 -9685 -8114 1614 24856 8525 -12929
6895 -12929 -21919 -9544 -5669 -6994 -3280 13447 -2018 -15877 -1687 -1249 8642 1763 13230
6882 13230 19917 22485 35644 34389 29400 19835 14433 -3863 -12934 -23977 -8989 4729 10639
6869 10639 11177 8294 4099 -8160 -11237 -8718 -14469 -16169 -21007 -27032 -26580 -19646 -6672 -22108
6855 -22108 -30136 -20939 -13768 -14069 -9983 -9189 -3295 -5754 -5359 6820 -2773 -15642 -19319 -15891 -10696
6840 -10696 -8303 -16058 -30290 -23176 -21522 -11691 3598 3801 830 -9776 -2399 -4510 -8567 6398
6826 6398 31777 16871 3540 8367 20718 13122 -11693 -13787 -21270 -13680 -2862 14454 10003
6813 10003 -9600 -6734 1575 14428 38340 38507 20083 4718 -2117 288 12507 22556 18157
6800 18157 10678 9145 21097 15529 7203 -6176 -19541 -15559 -18744 -25335 -32248 -29469 -33863 -35892
6786 -35892 -24423 -14108 -10660 -8306 -10798 -13172 -11696 -8425 -2290 4248 20041 39551 28083
6773 28083 168 -29899 -47175 -24245 -10816 -4579 1161 1614 2366 15549 16674 12692 12493 18900
6759 18900 8360 5957 2378 4340 18424 13097 8259 -176 748 20098 14319 5794 15394 18895
6745 18895 11796 -6832 -25709 -9951 -18395 -33383 -29376 -5180 7281 -15306 -30676 -33568 -37485
6732 -37485 -17789 -19909 -27094 -15131 -4107 7336 12953 -6840 -12883 10855 20806 -2859 -6874
6719 -6874 -12066 -2628 4846 -13943 116 17651 24912 39750 42169 23015 28055 30011 31976 23909
6705 23909 24400 18976 18076 10086 7553 14475 5672 -8841 -15859 -11884 -25581 -20886 -19170 -16904 -16156
6690 -16156 -21007 -20259 -14460 -12843 -10354 178 -443 -6740 1929 5838 -6564 -20424 -23631 -13973
6676 -13973 4012 2798 -4365 -7269 -15846 -3427 23225 13726 6090 3465 2603 18483 15152 10932
6662 10932 16692 23372 25599 10174 -16717 -8722 12668 17719 -1064 -4992 -10842 -7941 7850
6649 7850 11002 9806 10791 18294 5335 -5838 5747 23358 21882 17915 35923 32364 27363 17946
6635 17946 -3717 -4259 24286 30715 21051 7667 18582 3390 -5788 11924 14468 -14455 -28817
6622 -28817 -26447 -8914 3763 2767 3617 -7154 -23812 -18875 -32022 -33470 -1386 15900 18812
6609 18812 5685 10113 25215 31291 28866 27784 28829 15553 9916 17901 21221 20232 -1483 176
6595 176 25110 32962 16673 21098 43599 33535 15704 877 -14857 -5178 -10194 -13872 330
6582 330 -6176 -2667 -9177 -3530 5318 -325 -3386 -3775 -2697 -1028 4253 12291 13864 -1534 10421
6567 10421 15454 13870 11054 22793 37018 41746 44165 35814 48276 53003 57051 64044 70180 58119
6553 58119 53494 29721 33499 36059 32978 43579 51831 57032 48267 45843 49619 49868 55623 66988
6539 66988 64236 34490 41706 47374 48516 30334 31828 32873 16047 26471 51460 64112 60075
6526 60075 47461 44382 45877 49572 33095 32490 38559 37409 20813 6279 11662 3658 12362 23919
6512 23919 7327 -7306 -7300 11657 7587 -2714 -6454 -6471 -4330 -10010 2450 12390 5851 1846 14152
6497 14152 29053 24670 5141 -17512 -33790 -7360 10096 -3889 -6384 18664 29193 9805
6485 9805 -4822 -645 -6453 -23385 -45193 -36563 -8519 12272 17173 27168 9636 -8032 9147
6472 9147 15606 8898 -13119 -18756 -21120 -13878 -17191 -24705 -27734 -8396 2339 5377 -13206 -20204
6458 -20204 -18813 -16302 -19508 -8831 6397 -7257 -25596 -1410 6025 7289 14165 16556 11669
6445 11669 8529 26664 29566 29997 18655 2290 237 4584 -2971 -30375 -31399 -24877 -4627 8594
6431 8594 -10907 -7243 13968 14821 11146 20372 7441 1901 3207 9890 7058 9869 29243 9705
6417 9705 -2526 -13001 -19813 -3330 618 -10068 -5262 -24274 -25377 -1822 12164 2698 5723
6404 5723 1912 -3682 -6514 -2987 4555 24584 19599 944 -18789 -27566 -1313 21894 23976 19609
6390 19609 -3480 -21441 -3770 -9310 -24668 -8495 -4348 -31309 -50479 -48287 -28065 -37466 -40870
6377 -40870 -4989 -16124 -7202 2842 -27091 -9635 15970 21467 458 -12732 -16964 -3804
6365 -3804 1490 -9979 -27500 -7674 13795 17622 25738 19370 26811 20678 14891 -392 -14881
6352 -14881 -20675 -11440 -8533 -10987 17460 24351 10817 -2088 -16420 -19126 -18183 -9674 -15446 -35952
6338 -35952 -22289 -2863 -3705 -10141 -17364 -11523 3431 -9217 -21469 -38370 -15233 -14731 -16261
6325 -16261 -7126 9275 18929 18242 11015 4284 17856 27183 12952 -7166 -23029 -38797 -22920
6312 -22920 -11959 137 10292 8897 10041 7147 20598 22268 7788 -11992 -18809 -30513 -31756
6299 -31756 -32313 -7369 2868 -1616 -20621 -32791 -26906 -7972 -20459 -22748 -2671 -8513 -6660
6286 -6660 4293 13043 9770 16247 7490 4869 152 -7106 5393 15672 18330 11629 9974 21869
6272 21869 25634 6439 -180 11538 4975 -16218 -25124 -29852 -24125 -63 4055 -14419 -21790
6259 -21790 2139 4756 -6884 -1101 5534 -7182 -15693 -10065 -2157 -735 6720 10445 1387 -1543
6245 -1543 -3596 8537 14626 -4128 -21778 -28921 -34645 -23168 -19029 -29614 -27157 -35620 -36598 -25668
6231 -25668 -12765 6901 22150 11532 -7153 -20672 -19506 -16348 -36525 -35756 -33867 -29228 -6058
6218 -6058 6999 7366 5487 8776 25660 24130 3435 2333 737 541 -14066 -35022 -13754 -17507
6204 -17507 -22070 -37382 -32290 -23834 -19470 -22272 -20657 -16229 -26133 -26253 -27705 -26150 -664 8189
6190 8189 -5430 3590 -2628 -14842 -21219 -22159 -18203 -24710 -18823 -16146 -23708 -31320 -27762 -22163 -27693
6175 -27693 -28755 -10309 -6661 -18362 -29849 -17338 -6887 1328 -4096 -11194 6796 10999 19543
6162 19543 19504 14837 -17823 -18773 -1336 7749 8037 5646 -4702 16444 36740 24350 21058 10036
6148 10036 -917 -16254 -11052 -1832 8344 26592 37670 26165 -3665 -4350 4664 12025 30681
6135 30681 23369 33651 39457 18553 15244 -359 -2308 8299 13113 769 6204 16811 11550
6122 11550 2291 -7470 7253 6366 -5175 -15397 -21171 -15204 -6711 -7921 -13003 -24632 -30560 -37382
6108 -37382 -24086 -11299 742 9377 11232 -9335 -8834 13572 16430 -8145 -3172 -5025 -15040
6095 -15040 -25730 -34153 -31076 -32652 -22580 -7933 5636 14875 636 13538 4184 -18393 -19116
6082 -19116 -12507 -9926 -4953 -5179 -20669 -29450 -19294 -31374 -28843 -7000 -2677 -21962 -29922 -35998
6068 -35998 -37484 -23570 -20068 -17940 -9229 -3302 2933 669 -2540 -15651 -27104 -10793 -798 2428
6054 2428 180 -249 -17079 -20363 -8104 18251 37360 17683 13054 6304 -11059 -15729 -24885 -13413
6040 -13413 1078 2992 -17536 -18392 -6839 144 11542 9532 -13307 -37604 -30060 -15521 -21866
6027 -21866 -20122 -3929 -2910 -11109 -5326 -8799 -10135 -4887 -1909 2731 -7982 -11498 -5827 -11711
6013 -11711 -873 9743 6104 3629 3727 -6109 -15576 -6697 -5971 -7857 -2271 -2736 -3903 11078 21418
5998 21418 7681 10693 10525 5600 12162 17101 6670 -2545 -526 13289 20044 26108 31287 30268
5984 30268 17055 1494 -2800 -1607 -6324 -7306 -16267 -16909 -3445 -9490 -29254 -29528 -23276 -7191
5970 -7191 13761 4996 -14472 -29353 -19299 -11244 -3901 3164 19516 22716 19635 -5406 -27349
5957 -27349 -13600 7874 5044 4493 -4290 -5450 734 12915 11103 -9572 -2907 9330 20062
5944 20062 32974 21975 16444 9199 -18201 -37322 -34922 -26369 -30175 -16246 -7443 -5782 -7905
5931 -7905 4345 3218 -2380 -3232 4031 7328 9311 11948 -10184 -12773 13726 19929 19039 15192 2538
5916 2538 -2642 -9369 -14646 -10354 -17448 -8125 2891 -1573 -11374 -18208 -16664 -17130 -16862 2175 -1222
5901 -1222 -18864 -6005 -3026 -18179 -11886 -10465 -27254 -33558 -34711 -25643 -26721 -30887 -6502 -7304
5887 -7304 -5034 -4848 -7129 -7132 -1204 -15105 -15529 -10569 5512 10421 962 -26045 -24910 -38286 -29823
5872 -29823 -32507 -24436 -5984 -4188 -8636 -13723 -16497 -16788 -22365 -27382 -23388 -14136 -21388 -14372 -11954
5857 -11954 -23615 -22127 -16382 -6484 -7660 -27404 -32770 -24406 -12880 -2714 9949 22116 6313
5844 6313 -10036 -22761 -18353 5347 -256 1875 3800 -5931 -3542 -13177 -2192 5803 5501 -1948
5830 -1948 -9970 -27874 -7675 7510 -8633 -20137 -12458 -1526 -6724 -25794 -33968 -35687 -32075
5817 -32075 -16327 -20412 -30889 -35325 -39963 -15184 -11620 2819 9665 1963 -16847 -19651 -4991
5804 -4991 -8197 -5744 1500 4360 -13200 -13560 -10033 240 15166 20610 14042 17206 22432 16258
5790 16258 9016 -6669 -4907 -4920 970 -4923 -38140 -50111 -26721 -29370 -23332 -15158 -16887 -5721
5776 -5721 -17987 -12924 -2597 7367 -3273 18278 15489 19286 24778 34369 11038 8042 8652 -17367
5762 -17367 -23155 -9365 -14710 -15859 -9146 -17166 -19570 -22073 -8783 2429 -1249 -5720 -24766 -30220
5748 -30220 -24312 -16452 -16444 -20348 -32769 -41221 -34328 -13689 -317 7634 12198 -67 -3145 644
5734 644 -2866 -8658 -1200 11147 7282 -25010 -38989 -33579 -6996 32598 40402 24166 25402 20036
5720 20036 15577 106 -4142 -11418 -24883 -15595 -2943 -2076 15123 14183 -1193 -7721 -20280 -27423
5706 -27423 -27172 -26147 -16104 1548 2899 -10425 -20468 -13730 6344 7003 -8928 -8210 -9075 -16157
5692 -16157 -17656 7731 2391 1152 -7935 -13438 -14638 -15212 -12709 -9724 -7726 -2982 -13159 -11601
5678 -11601 -6295 8126 6575 9170 16139 5764 2448 1319 -2364 -10105 -31983 -27089 -29584 -40290
5664 -40290 -34560 -25154 -20294 -23155 -22061 -18397 -14298 -6180 10423 8618 4785 -8755 -9137 -21699
5650 -21699 -10354 3023 1296 -9637 -2150 4485 7811 2113 -22459 -14869 1661 3339 510
5637 510 -4073 -9421 -9505 -9365 -9706 -2778 1975 3878 5086 736 8858 9848 -1374 -4539 -10255 -8896
5621 -8896 -9401 -19355 -22633 -11657 -20803 -12172 -6888 -3877 -12624 -28833 -17411 -5136 -48 -8932
5607 -8932 -5788 -7871 -8494 6857 15717 26826 4422 -5245 -14880 -23569 -12905 -8505 -21451 -29655
5593 -29655 -20670 -16583 -6609 -17077 -25851 -18577 6126 16975 13246 25 -11005 -2248 -15445
5580 -15445 -7396 -1567 -6303 -10761 -5523 -1897 -3921 -3448 -7813 -3635 11759 23021 9546 -14173
5566 -14173 83 29205 23457 -2276 -13669 -8313 -6563 -28813 -37537 -36016 -19793 1895 -1359
5553 -1359 -16686 15131 23234 3950 -5217 -21014 -6823 -3101 -658 -9469 -454 25298 28688
5540 28688 2376 -8424 -4294 -7759 6523 1109 3671 5582 -7623 2519 -3298 -5710 12317
5527 12317 10847 10673 -3408 -7187 10988 10731 12757 -2700 7330 28953 26263 25804 20460 14712
5513 14712 -1927 -6031 -35481 -58462 -64228 -62529 -36431 -5024 13064 12616 -14481 -23359 -14539
5500 -14539 -5111 -11475 -9221 -16382 -8875 -11959 -4940 9594 13346 11988 33424 20047 1723 -13164
5486 -13164 -13844 -2190 2527 -6763 -6158 -16750 -10954 -11838 7677 17677 22600 30752 23485 18400
5472 18400 19466 -1239 -3532 293 -1844 11370 16043 18090 12121 16833 3442 -25123 -21401 -9544
5458 -9544 -13234 -5652 -1479 -16898 -21622 -46329 -44068 -30033 -8097 9014 -3891 -7703 -6560
5445 -6560 -4200 -4969 -11679 -26121 -22887 -20650 -22130 -29252 -35653 -31254 -26837 -6512 -2927 8102
5431 8102 12382 13419 24724 29914 7523 -5245 -3781 6369 4318 2359 3632 5496 25985 43344
5417 43344 27977 27395 37335 24161 20664 21183 25647 2266 -14201 -19406 -16992 -25069 -22648 -20255
5403 -20255 -15597 -23419 -45055 -48890 -32796 -39543 -24959 -15399 -6492 12928 14941 12785 12546 -4530
5389 -4530 -8376 -7759 -8786 6857 -8516 -14831 3539 2517 2965 7828 12791 -1855 -8495 -13022
5375 -13022 -14976 -22033 -29773 -26120 -27172 -28890 -13510 7822 19712 15399 15083 6112 3339 -3649
5361 -3649 -9137 -22668 -30018 -17062 -32184 -35368 -22890 -19008 -10679 -2046 -13744 -9457 -15870 -30664
5347 -30664 -11916 -5629 -14789 -3632 -23696 -20945 -17245 -3038 8762 2939 -15169 -15057 -834
5334 -834 17230 -121 -7641 -25390 -21482 -13277 -25109 -26543 750 21704 382 -26187 -45431
5321 -45431 -43432 -23875 -14230 -21461 -20100 -13827 -24190 -31177 -35486 -17873 -2883 6968 1846 -3350
5307 -3350 -8329 -28235 -47355 -35657 -35922 -28045 -16085 -11671 -9799 -7321 -6403 -25756 -35012 -31480
5293 -31480 -19138 -1133 1696 -1709 -14977 -15861 -18725 -2797 8810 9980 -9986 -31615 -30287
5280 -30287 -26166 -8165 -13801 -13322 -14005 -14299 -13005 1620 12512 5524 9220 -5608 -13259 5570
5266 5570 21958 19634 25099 18767 2560 -2592 1641 6233 4436 6496 15593 4450 -11432 -8168
5252 -8168 -9038 -5976 -9958 3409 7402 -8832 -12440 -23705 -37790 -38880 -36110 -39031 -30286 -18930
5238 -18930 -18685 -19562 -17669 -21202 -20296 1731 13269 2150 -4295 -10452 -19835 -22042 -19734 -20755 -8734
5223 -8734 14787 3473 -28422 -16674 -3560 -1425 -11183 -8136 -3412 -2046 -5676 -4172 -16364
5210 -16364 -20725 -11293 -3440 -9027 -16229 -25693 -21699 -8395 9391 7274 8712 9731 8168 23110
5196 23110 18956 11661 13577 16270 22699 7831 18414 32303 22557 11533 24931 17328 3851
5183 3851 -5202 -4168 -22799 -20998 -18003 -35033 -28897 -6019 -8283 -26147 -26454 -23281 4584 14758
5169 14758 10650 13890 22105 10221 19787 11942 -4617 -26645 -22774 -11625 -6904 -4905 5296
5156 5296 19928 11055 18668 4823 -16307 -8453 -18895 -39303 -33532 -18953 9697 13447 3090
5143 3090 1848 2863 -7926 12913 47258 32179 8179 2144 -2804 -3604 -12728 -25606 -32686 -35533
5129 -35533 -31309 -20571 -20674 -22600 -17907 -10580 -7118 5317 -8677 -9202 13601 11650 -13305 -17025
5115 -17025 -5208 -2924 244 7268 6014 -2133 338 -2686 -7331 13550 26585 15617 3396
5102 3396 4852 7497 23863 28240 3023 7900 28086 20337 9835 7788 15541 31282 26815 29577
5088 29577 15986 20622 8685 2402 4868 7854 -125 -3502 10336 7493 -4985 -588 -13568
5075 -13568 -21350 -22818 -15459 -25717 -50628 -59585 -63470 -39612 -37645 -18115 -4710 6851 -1031
5062 -1031 -15856 -31470 -33983 -36804 -33813 -32015 -23178 -5758 3232 10978 11993 7850 -8704 -21095
5048 -21095 -31234 -3874 -1859 -24575 -31235 -30595 -40012 -24010 -12165 2024 0 -5034 -3144
5035 -3144 -3306 -3234 2645 6759 13661 19992 19764 15651 2370 1622 -141 -7291 1323 -8322 -361 12579
5019 12579 817 -14329 -24298 -8191 2963 -7119 -1553 -5359 -6661 -17575 -30887 -42750 -37460
5006 -37460 -24824 -6936 -2713 -1606 -297 -18345 -23515 -11672 -2700 -12251 -8131 190 2980 -15075
4992 -15075 -26563 -29597 -31420 -17474 -1888 -11513 -10800 8523 23941 37762 25537 11919 7088
4979 7088 7468 265 5851 -4102 -4598 8280 21420 7023 -13131 -17095 -12837 -4282 -15865 -38021
4965 -38021 -38542 -40408 -45341 -31623 -15718 -36761 -38138 -18263 -45240 -61575 -36133 -15076 10669
4952 10669 8579 4593 -3426 -8794 -15070 -11119 -12745 -10892 -2008 6427 18688 17171 -12571 -13922
4938 -13922 -777 15206 15975 -1157 -4309 8650 -6747 -16212 -8137 707 4743 9454 15660 450
4924 450 -3582 1583 -1861 -12086 -13405 -23819 -20280 -9465 6144 19419 21467 5970 615 10080
4910 10080 2581 -4202 3399 -14187 -24324 -20397 -8495 -16597 -23888 -19663 -10985 12188 36656
4897 36656 21612 -4641 -16466 -28064 -34858 -17886 -7581 -21546 -24870 -22776 -37579 -40962 -26737
4884 -26737 2255 9953 58 -20781 -45421 -34974 -50059 -51672 -46560 -49500 -33915 -23783 -25976
4871 -25976 -9093 -1689 -2169 -12210 -18344 -5271 11828 14430 22762 17997 8780 17830 13399 -3533
4857 -3533 12502 27639 9103 15798 20326 12390 9754 5435 16393 21649 18694 4410 -6316
4844 -6316 -5597 -18593 -9750 4160 5766 8748 24090 30371 10622 1746 1348 -3351 -5228 3365
4830 3365 17348 17900 15321 24189 10881 1941 9664 -1453 -19682 -12564 -22927 -12795 -1535
4817 -1535 -2845 3047 -1291 2461 -4193 -13038 -1873 -2479 6152 226 6241 3601 -3884 6864 2695
4802 2695 6666 -890 -5213 -5490 -8185 -737 1912 -11203 -13765 -21180 -13040 -17234 -2474 -788 7346
4787 7346 13986 23392 38008 38651 35593 13570 12183 11145 -3921 -2583 -2008 2194 960 1774 -4797
4772 -4797 -10888 -15683 -17528 -8641 3169 -2971 8508 2203 9066 16000 -15011 -20657 -17694 -5610
4758 -5610 -11996 -27392 -35711 -22662 -12967 -10103 -4329 -7702 -16963 -10064 2006 -5041 -9286 11655
4744 11655 18233 -7545 -18182 1789 8131 1167 -2831 -16041 9122 15013 13967 1317 -3344
4731 -3344 -28422 -20266 -13898 -2717 4802 400 -6087 -12287 -17855 -2979 2930 -12673 -7903 393
4717 393 -8178 -12818 9167 15590 19435 9671 -10633 -10223 5292 8516 1819 -1932 1393 9520 13404
4702 13404 19112 9252 -617 -13528 -27153 -24897 -25130 -30082 -25240 -24400 -21546 -10160 -12022 -4229
4688 -4229 17057 19516 -506 -19785 -30567 -37174 -21281 -30031 -20408 -9383 -5520 -2187 -1082
4675 -1082 -9614 -8615 -8384 7085 19012 25210 7003 -11328 -16716 1411 16117 8313 -4487 291
4661 291 -5374 -15449 -6961 4718 -10632 1628 12729 6555 -6339 -755 5793 26973 15968
4648 15968 -2809 -11741 -15540 -10480 -3653 -16315 -32803 -38144 -30181 -17876 -23710 -12776 -21825
4635 -21825 -24231 -9802 -20296 -24803 -11884 -3506 -8189 -15268 -6446 4016 420 -9420 -10143 -9603
4621 -9603 3859 14621 20721 20824 34708 16998 24117 20595 -1013 -16218 -35230 -26714 -17464
4608 -17464 -5293 -8958 -9916 9770 -4694 -3750 5503 21490 15232 13885 -7741 -15085 -16904 4534
4594 4534 9644 11781 11003 -1091 -590 9586 9415 14891 19682 9513 1036 -17820 -6185 3927
4580 3927 12498 -547 -2827 -492 15966 22229 5439 14217 7669 -6091 -9298 4535 -3155 -24531
4566 -24531 -24990 -20859 -18488 -19999 -16637 -24909 -31929 -10930 -5997 4195 9242 7633 1563 -7939
4552 -7939 -7954 1655 -3789 -16581 -3214 6477 -2693 -3373 2550 4636 -4660 3824 -1361 -6516 -32049
4537 -32049 -36387 -11949 13233 17851 13637 15716 11586 9013 11367 -398 -21602 -19143 340
4524 340 1039 -7668 -8753 -849 -1653 -21507 -29120 -2691 87 8951 4859 -24254 -24972 -6614 2998
4509 2998 -3528 4168 11380 1404 -951 -5484 -3847 2698 -5028 6267 2616 -17299 -34556 -25393
4495 -25393 -21453 -9527 -9829 -9120 -12281 -19042 -6226 11777 -791 -8892 15585 22274 14491 299
4481 299 -1157 -11907 1881 -3030 -4391 14866 18715 35126 48975 30081 14871 -1708 -636
4468 -636 21962 4524 -1840 -10390 -5814 -22219 -14148 -10747 -23096 -16884 -13427 9100 15657 7169
4454 7169 9943 20518 26859 37775 40370 18313 12731 12746 15447 18148 13693 9521 5860 19024
4440 19024 25354 33150 9083 -117 5861 -10172 -7030 -13836 -22781 -24230 -25006 -26193 -26560 -16943 -16650
4425 -16650 -16861 -14330 -15392 -8937 -4802 5369 15290 -2164 -15845 -17784 -12385 -8992 -30193 -39782
4411 -39782 -30276 -19806 -18761 -11840 1475 7115 7168 1462 -3334 -5974 -19873 -37612 -47573 -24351
4397 -24351 -17401 -18363 2282 10280 488 1753 8637 10626 13375 11244 4967 7853 640 3897 19664
4382 19664 -10568 -23422 1842 9689 -983 2855 12839 8005 -8010 -15475 -3438 1909 18904
4369 18904 29185 25662 25481 7193 12596 32498 32168 20021 17988 17818 17922 24877 19734 11740 17388
4354 17388 23299 24539 9447 1492 -8967 -9398 6219 16679 36735 29852 27080 23546 7434
4341 7434 -15697 -6330 -4965 6345 8648 -6956 -17801 -25180 -15839 -22991 -29755 -10270 -22114
4328 -22114 -16226 -1882 12347 17282 25385 16000 13848 8137 -12355 -7107 5064 14368 11703 2433
4314 2433 -3213 -14924 -14616 -6773 -18511 -33670 -41901 -29814 -14874 8733 -456 -25180 -29963
4301 -29963 -26604 -17510 -25189 -35874 -8857 -8952 -7020 -1249 -440 -4069 -21833 -25431 -12730 -18305
4287 -18305 -23795 -26080 -15208 -27524 -26469 -4895 5229 335 -8023 -13559 -29269 -48635 -29322
4274 -29322 -21050 -18886 -8456 2893 5885 6397 11659 30764 20748 5986 -12902 -31337 -24298
4261 -24298 -11216 8849 -10556 -29303 -5948 -2616 -12741 -7476 10716 -5888 -5355 5579 8459
4248 8459 18335 33929 34195 27579 37329 18869 12666 1745 -5703 6703 8012 8935 105 -11015
4234 -11015 -13110 -21421 -24082 -18781 -17251 -15796 -13909 -14676 -13916 -17108 -15563 15730 37791 36271 8460
4219 8460 -5089 -300 2734 15340 14972 19933 12251 2782 4050 3892 -14563 -30466 -23601 -19894
4205 -19894 -15658 6012 21466 32368 21817 14817 4419 -2314 -1158 458 -10829 -2558 758
4192 758 -1748 5005 -934 16205 26539 40644 27990 9186 -2482 -13574 -13729 -3924 -14024
4179 -14024 -1524 13013 10171 -9786 -7063 -6412 -12696 -6822 -3270 -3148 -3941 -10162 -3195 -6666 -8994
4164 -8994 -8544 -13617 -4840 -3616 -1825 -5323 -3239 -26628 -10635 -5486 6344 7007 97 -10432
4150 -10432 -4667 -2392 -12496 -2193 6687 14265 26190 22477 9048 20666 32594 18896 25714
4137 25714 15078 9352 20539 26904 21729 10239 8652 8598 6369 6658 19098 7653 -1002 13791
4123 13791 7075 -6047 -12764 -12612 -11405 -9104 -4449 5144 -11218 -29133 -17167 -19953 -23225 -11971
4109 -11971 4038 487 11225 -3160 -8763 -15452 -14317 -13228 -929 12584 4290 -3321 -11809
4096 -11809 -19727 -34925 -26317 -30532 -39609 -44828 -19848 -5104 4052 5463 18668 16875 8415 -281
4082 -281 3310 2601 -3092 -3347 6787 25974 21217 27500 21042 -2663 -12783 -12962 13484 24969
4068 24969 17368 3644 15582 24783 10230 5052 8427 5604 -23870 -40454 -16005 287 1267
4055 1267 -3947 -11721 -21062 -18058 -34132 -26668 -13580 -8662 3403 4583 -14564 -6410 -7359 -18161
4041 -18161 -19423 -24930 -28929 -28779 -14357 -3383 7434 13694 -109 -17042 -29377 -39324 -23264
4028 -23264 -7779 -5681 -10788 -1916 8456 19037 17698 12101 10680 5019 6911 6600 14781 31507
4014 31507 17315 -4404 -8593 -18633 -24500 -18641 -16043 -6272 -5903 8735 19699 6466 25962
4001 25962 29098 19231 12521 5651 -588 -17629 -27527 -26864 -23108 -11697 -14498 -35020 -27626 -28664
3987 -28664 -14322 -2205 11406 9066 7155 4631 -10060 -18712 -28245 -18937 -40010 -45936 -45659 -29202
3973 -29202 -1624 19030 2706 -17575 -10543 -13579 -19708 -28271 -26585 -18729 -10089 -12292 -29366
3960 -29366 -35173 -38096 -37669 -99 19210 23875 -1187 -34146 -42414 -17001 -668 11748 -4197
3947 -4197 10188 8850 -2976 -13223 -24757 -41217 -45940 -31895 -25958 -22317 -1717 35027 23891
3934 23891 -1767 5259 13279 12247 5145 -3709 -11641 -8330 2615 6122 -9549 -29835 -13493
3921 -13493 -16112 -21959 -43279 -49514 -24462 -6039 4125 -12863 -9755 9563 14021 17538 25814
3908 25814 5538 -19116 -20293 -14586 15367 31736 29960 13482 -5777 -25294 -36654 -32393 -19363
3895 -19363 -7408 10626 -2625 -19676 -19165 -16727 -16472 -19710 -4517 19630 16718 21806 23769 22835
3881 22835 8020 -12425 -2833 11669 10156 27977 28955 30993 30995 36646 34006 17766 -4360 -21967
3867 -21967 -1216 19730 15302 9636 19459 24692 22510 19759 7284 3042 7335 5160 4827 -9224
3853 -9224 3452 24417 29076 19812 5699 11432 -2511 -56725 -53371 -14655 1565 2897 -14548
3840 -14548 -12222 1214 2017 -8623 16957 15942 20357 11790 7668 -5677 -971 9418 -11401
3827 -11401 -31152 -21264 -5116 823 3554 9930 7862 21513 11441 5352 -760 3625 -5799 -16330
3813 -16330 -3270 2804 -13570 -13633 -7731 4142 8635 -5648 -12905 -24346 -20845 -29225 -24707 -15182
3799 -15182 -15418 -5861 -10342 -9867 -2553 -34009 -29186 -12565 -6625 -3298 -17215 -18855 -33061 -35332
3785 -35332 -15567 2297 -4171 -15487 -21074 -18493 -4091 23897 33273 26018 8980 -2294 774
3772 774 6 -4572 -18785 -17501 -14254 -17542 -18705 5463 12848 4195 849 1016 -8000 -16567 -10663
3757 -10663 -15416 -1529 11851 11428 -6494 -18268 -8968 3839 760 9150 14464 10785 2675 -8586
3743 -8586 -2837 11754 774 -13226 -862 -9998 -34334 -33941 -32552 -28028 -5335 7129 11999
3730 11999 -3513 -13741 -17214 -10840 -17035 -7135 3275 -14311 -19050 -14041 -287 11559 14033
3717 14033 15802 10204 16712 16883 20564 3623 -4131 -2943 19310 25208 23318 20300 18813 34168
3703 34168 26022 -4117 484 3678 -1369 14351 14969 23903 18090 -6654 406 -7480 -6048 -48
3689 -48 10079 18286 6822 11228 10563 16801 -21 -5204 588 1833 4833 12968 15780 7355 -13827
3674 -13827 -23876 -18515 -16887 -12078 -5476 -13953 -3714 5272 3756 17132 18715 7474 21287
3661 21287 31627 23032 19062 -439 -24282 -38114 -21050 1577 10285 -544 -10844 -3756 -1223
3648 -1223 11982 -763 -15099 -22338 -27233 -29646 -25697 -8937 -14854 4747 10749 14636 904
3635 904 -16812 -24667 -30084 -13703 -6064 -13090 -1524 13688 11662 5916 -16296 -14956 -26843 -35930
3621 -35930 -19863 -10375 -9634 -5184 -2171 -16385 -28536 -26154 -27997 -28520 -23427 -16009 4085 -6485
3607 -6485 -22779 -28475 -13479 4443 14419 23297 23367 -11310 -34687 -27477 -29862 -33208 -37874 -25078
3593 -25078 -21980 -25768 -24870 -25638 -22277 -16768 -24405 -29012 -24335 -30824 -30480 -22704 -9163 -7662 -13917
3578 -13917 -19573 -4987 7910 -1294 -6359 3454 -9726 -21079 -26473 -14989 -5432 -22279 -42902
3565 -42902 -48175 -40005 -35333 -33689 -22752 -15738 -3719 1355 -2595 -6703 -13498 -9948 -12151 -19323
3551 -19323 -29959 -15861 -11400 -23177 -13888 -4481 -15272 -16847 -23033 -29757 -29907 -24846 -18986 -7268
3537 -7268 -2530 -8147 -14159 -21561 -20839 -11079 -15745 -18040 -23910 -13500 -4061 2611 49 -16702 -9282
3522 -9282 -1434 14747 7257 -7927 -6630 -17924 -7935 11366 16293 22737 29217 14032 -264
3509 -264 8650 6026 10148 12500 11069 -4183 -10315 -4074 -2579 414 3827 -8751 -10687 871
3495 871 25030 33432 27518 32596 39447 41231 22911 9221 8451 17026 10530 23011 5863 -14999
3481 -14999 -20482 -6347 10973 2537 -15122 -23893 -24659 -10274 -8441 -16318 -31351 -27926 -21146 -9667
3467 -9667 1166 -7410 3951 1095 -5075 -224 1261 1604 11184 26936 39476 15570 -4322 -508
3453 -508 7850 35716 47930 35926 29354 27339 22051 26859 29914 35169 30363 25422 11643 -2188
3439 -2188 -195 5327 -2414 -10386 -6992 1709 -2194 -11789 -6357 -2990 12038 22788 10569 14529
3425 14529 10059 5940 15137 29270 20798 17936 6973 -2002 391 14283 25944 10869 -6151
3412 -6151 -15838 -11029 -13359 -19851 -13110 -9480 -8166 -17112 -14814 -4639 5486 2815 10589 -8538
3398 -8538 -530 3587 9557 6497 -7976 6700 26603 24953 23192 18177 -251 -4484 -18359 -13660
3384 -13660 -15865 -17749 -17365 -11704 -12697 -35040 -38117 -20383 -18828 -12260 1206 5203 19584 32553
3370 32553 32822 8933 3648 11861 6701 -1191 -15072 -14812 4787 21344 10215 14289 7818 11419
3356 11419 14331 16492 24198 14961 9011 -906 -28136 -30349 -15943 -2464 -8585 -598 3725 -520
3342 -520 -6969 -11046 -2878 6006 -4955 -24319 -26435 -13232 -4520 -3821 -9521 -20600 -20180 -18918 -13794
3327 -13794 -21104 -34308 -27153 -21968 -23609 -11479 2218 14434 19666 25159 38283 22431 13702
3314 13702 18419 22783 9378 -12057 -9236 -9030 95 67 451 2124 -254 4580 2260 -8278 -11622
3299 -11622 -15251 -21874 -14564 18486 23372 17234 8966 4917 4148 -2546 -4771 -4874 19020 28914 21276
3284 21276 20329 13924 9615 5045 17363 27754 21174 7676 3629 -7844 -11476 -17319 -19868 -11145
3270 -11145 14911 18296 -9467 878 1327 -15522 -5049 6990 15270 8753 -15706 -32052 -24303
3257 -24303 -5068 -4026 -12122 4553 18903 11067 28887 18454 10473 -580 -7149 -6454 6436
3244 6436 -5185 -17875 -14867 -11981 -13314 -4594 -1285 -182 11760 30919 17492 18671 21228 -3979
3230 -3979 -26766 -26579 -25298 2588 10459 -1906 -20633 -6798 16870 24854 18067 16466 9378 1957
3216 1957 2520 14281 17222 26530 45266 44579 29159 24303 10173 1295 6957 18023 -5253 -4650
3202 -4650 -1540 -5392 -15870 -9969 -12865 2665 22331 -3407 -16970 -20013 -10208 9399 14511
3189 14511 -7984 -18354 -15627 1908 -740 -10175 -22208 -34142 -26550 -8277 -10328 -21239 -15270
3176 -15270 11973 29010 31293 18504 12937 19799 19810 11750 14528 13909 14572 8275 11010 19350 -3339
3161 -3339 -13055 -1569 3147 -11941 -36748 -38750 -32503 -14646 5388 8303 14773 7311 4313 4228
3147 4228 -310 -5239 -10901 4256 1958 -8298 -1613 1467 6908 10898 -5190 -18677 -13754 -1658
3133 -1658 -6771 2285 22034 14683 6935 625 8465 23884 38311 30719 20675 31228 27979 12044
3119 12044 11082 20359 29966 29804 22927 10009 -3077 -8631 9079 50922 62668 47435 35458
3106 35458 23312 25581 25892 17717 293 8635 3747 -5673 3580 -4560 5962 28497 4878 -8359
3092 -8359 -13789 -24151 -11730 11594 27773 18248 13711 15449 12601 20884 18785 1515 -9242
3079 -9242 -15692 -12277 -11509 -31143 -17383 6700 5058 6340 19638 20776 4567 -16967 -35731
3066 -35731 -32003 -11401 18166 35943 37897 29432 33520 49697 21160 10867 10887 17901 21974 11767
3052 11767 548 909 3967 13363 12741 1683 13023 23923 25090 16069 26922 18198 2633 795
3038 795 -1785 -6480 -6345 -6701 -8006 751 -2524 12040 17671 4985 -14022 -11147 -5008 -20654 -15535
3023 -15535 776 2699 9246 -1498 6472 18913 18188 9450 230 -5407 -972 -12651 -31078 -31671
3009 -31671 -4494 15559 14671 16706 4274 59 -3084 967 14011 27878 10343 -3020 -10226
2996 -10226 -1494 1478 9725 17601 9983 5390 -9180 -11200 3162 8349 13273 -288 -27102 -29048
2982 -29048 -11211 7181 -8475 -20157 -38039 -47464 -48342 -22252 -355 -938 -26352 -30445 -43738
2969 -43738 -39285 -24225 -9140 -9556 3914 19828 38241 29908 1409 -9536 -2099 12531 20098
2956 20098 10572 -6388 -4923 1068 1149 -9609 -8756 -8449 -14686 -22583 -20925 4124 12061 16388 9283
2941 9283 -3992 -2566 -3837 -11295 -13576 -11224 -17547 -20543 -25475 -27780 -29915 -18695 -11612 14
2927 14 5706 12563 13277 -3293 -18870 -24287 -35128 -24326 -11556 -16233 -5211 3023 -10874 -25834
2913 -25834 -16647 393 21848 23124 24690 14121 9941 -257 -6660 -15570 16321 11637 4303
2900 4303 1652 10390 13942 13031 6292 -3231 3929 24495 28312 14925 -6505 4551 31517 27853
2886 27853 4929 11314 12411 -2691 -9248 -5185 -12488 1029 13651 8212 8314 11198 19802 12527
2872 12527 -2705 -12550 -18265 -15593 -3419 2286 8504 18476 19729 -3215 -26221 -32237 -18090
2859 -18090 -16810 -17325 -12802 1618 -5590 -25957 -22540 -4018 -4926 -601 -5160 -10485 -1709 21923
2845 21923 32714 28327 3974 -5841 -13156 -4554 12668 21658 14299 10478 20435 31988 30130 45104
2831 45104 30823 12128 -1046 -24714 -25377 10292 10255 -6118 -12416 -15572 -16282 -4539 -6888 -13309
2817 -13309 -15026 -8786 8321 948 -16353 -3921 -3764 -6134 698 -12576 -5328 11137 9003 560
2803 560 3396 5019 1055 3919 10178 -2271 -19801 -12294 -13644 10509 6463 -3478 8144 6311
2789 6311 1827 -19183 -39328 -42248 -12866 -11975 -31405 -15088 -12587 -14652 -8110 649 1414 -4408
2775 -4408 -1878 -4307 7515 12540 18034 11223 -11805 -28051 -16891 3476 16231 16709 10107 13724
2761 13724 7875 -7830 -5153 9771 10764 9695 5142 5357 -3454 -7920 -4698 -12226 4350 18494
2747 18494 26487 12778 -21033 -23286 -31725 -28793 -28405 -8732 9033 133 14220 21864 18536 8126
2733 8126 36295 23858 16232 8833 10684 4081 12095 5538 10973 12512 14905 8818 7235 664
2719 664 6062 6277 8789 15044 35153 46294 38479 25305 4819 -13185 -18449 -5571 151 3139
2705 3139 7296 7273 -5457 9518 24174 5526 4553 21108 11685 16256 33601 35968 11274 -1022
2691 -1022 9418 39673 62488 44686 54397 64625 56157 49554 24105 14605 25125 31647 21534
2678 21534 -6354 -12330 -19743 -13260 -8517 -5820 -2273 -2209 -3358 -16169 -16354 -488 12282 11727 27324
2663 27324 23351 16254 -3761 -11785 -14618 -6287 -275 6322 7087 2512 -8901 -14226 -25664 -8885
2649 -8885 -3717 -10465 -1700 -1095 -9195 -5839 3562 9534 3081 -3512 -22020 -7758 7124 -827
2635 -827 -3876 19558 43293 37265 28901 17567 20141 7270 -5836 5826 -5342 -9989 4933
2622 4933 22628 35349 35698 31372 28861 6381 -6655 -6687 9422 15796 -3212 -12323 -12525 -6996
2608 -6996 5765 -369 4442 17290 23480 11986 1364 85 4900 -7501 -7550 3046 -894 140
2594 140 4882 6666 16804 10723 8538 -2461 -7299 -1616 4979 8649 7353 2120 3913 10270 20249
2579 20249 37333 36288 33708 22053 420 361 -713 -7661 -14612 1452 9289 -7223 -5681 4306
2565 4306 -19109 -25562 -1938 10519 22190 19727 29325 11342 -4444 7113 20863 11852 -4340
2552 -4340 -7056 -11666 -22931 -30826 -9928 5451 -2265 -7165 -9986 -26030 -34478 -13421 1064
2539 1064 -9249 -5135 6334 23677 19140 17981 20867 9541 5689 -3280 -1527 -19357 -22222 -12592
2525 -12592 -18455 -11085 -6872 -17369 -38968 -30918 2194 21080 16877 7652 1112 -21117 -32505
2512 -32505 -25697 -18554 -9699 -15328 -9311 -3941 2055 25276 21785 11984 -14513 -11187 -759 12560
2498 12560 38585 32655 17391 6962 13956 7722 188 5156 3748 5273 9158 -4481 10904
2485 10904 32169 27175 18649 13199 13240 -20816 -35423 -14494 1402 6741 2378 21755 26203 17093
2471 17093 15872 4117 2830 8950 -15027 -17704 -24325 -3433 -843 1236 -11138 -4409 21388
2458 21388 30784 33358 15091 -1464 1213 10624 15791 13275 14539 14657 21977 23284 20315 19778 34197
2443 34197 46274 32643 40882 31017 2071 -9343 -9052 5124 18677 14118 19355 37163 32703
2430 32703 25233 1996 -4163 -7585 2200 -863 -10905 -20082 -5807 4467 6271 20079 15564
2417 15564 3417 6562 19542 28134 8869 -202 552 -203 -4916 13814 24699 19389 5611 -1580
2403 -1580 -2580 1490 -15385 -31206 -17954 -14784 4624 16631 3897 -5741 4098 14628 3504
2390 3504 -6358 -15524 -8111 -8947 -1837 -10186 -11491 -23377 -32295 -31477 -27455 -29534 -42620 -39211 -13329
2375 -13329 3854 -2559 750 17715 22019 19771 12945 -2648 -3349 12682 2353 -3624 -549 33009
2361 33009 36087 18128 9127 14878 8136 861 -6970 -8845 -4647 8176 23360 36955 30472 19422
2347 19422 7871 -6877 -14177 -18747 -16948 -15342 -4000 -3084 -402 139 -19020 -34141 -37988 -32707
2333 -32707 -21479 -24350 -9666 9197 -2332 -1316 9544 1064 -5357 -8490 6260 23313 14398
2320 14398 -44 12013 3584 228 -20129 -11778 -22 1471 -1623 6892 10282 -935 -14918
2307 -14918 -16680 -1965 -4573 1797 21732 41339 47659 42448 45673 19644 -794 -10744 -5662
2294 -5662 7341 -2043 -29021 -6144 5738 6635 18116 8459 -6333 -17023 -15872 -15986 -25733 -31470
2280 -31470 -395 784 4635 20825 21596 12881 17916 14448 -7845 1831 26768 29781 24398 12717
2266 12717 -6940 -4382 9653 4159 6597 17994 -3261 -28906 -18409 6535 20165 19720 -5258
2253 -5258 -41380 -56028 -53809 -35312 -9473 -3501 -10290 -17895 -20078 -2570 -8103 -13320 -17723 -24187
2239 -24187 -16350 11814 27082 29716 17910 3684 -12537 -18813 -25922 -7454 13760 6211 -71
2226 -71 -2813 -6378 -24373 -36997 -29683 -16074 8709 -2260 -16499 -9794 3057 16861 19656
2213 19656 7521 -3419 -17969 -11163 13555 28582 14437 3688 7866 360 13267 26715
2201 26715 16576 12994 25222 11406 11733 12806 16734 -848 -14838 -357 4552 -5601 -143
2188 -143 10513 27168 30553 28050 35566 29182 11002 6763 143 2646 -7603 -4677 -13587 -18180
2174 -18180 -17653 -24677 -44701 -38174 -16234 2371 14363 6453 -77 5855 20506 10832 576
2161 576 -2214 15385 12159 -9597 -16678 -12668 -6381 -16772 -30229 -16715 6704 17641 7309
2148 7309 4370 -3973 -5904 -1910 -7748 -2108 -2970 -1623 1296 4588 6292 10634 8055 17222 29314
2133 29314 20278 10533 10540 8154 -2206 -9236 -25352 -25122 -20258 -17547 -7750 -13488 -17960 -33079 -29143
2118 -29143 -13858 -1765 -2778 -3907 -2790 22236 22293 18862 11267 4160 2791 2264 -8845 -19330
2104 -19330 -29862 -45252 -45377 -47885 -43775 -36380 -26069 -19593 -4774 -6078 -25348 -29579 -37547 -30875
2090 -30875 -10854 -17209 -29308 -31028 -22475 -8832 -519 10733 16892 16759 -410 -8154 -18253
2077 -18253 -29291 -20178 -14070 -4660 -19070 8334 33916 18008 9283 6451 -8841 -17648 8279
2064 8279 8661 19510 18479 19992 6353 -5578 8400 13394 20999 42595 52544 29822 15622
2051 15622 7202 -2483 7568 14424 26265 39664 38616 42763 23568 12464 4739 -6207 -968
2038 -968 12832 4231 25424 15940 9662 14915 11581 2219 -8226 4842 11379 -3276 -1827 15062
2024 15062 10331 -802 8012 10457 18486 22892 5685 -196 1902 19939 17647 -14259 -5330 14525
2010 14525 21537 27533 25275 6285 490 14937 23113 20159 5602 -9681 -10487 -10657 -13846 -14609
1996 -14609 -15379 -18994 -12229 -9102 -24996 -26387 -18085 -23719 -21687 1421 19364 8418 3187 5756
1982 5756 14313 20934 -2255 1522 11625 9462 9612 11841 22854 27052 32369 29628 23589 16201
1968 16201 2508 -5161 -8372 9743 -6046 -15578 -13714 421 10381 18734 40618 43310 39800
1955 39800 39479 43910 54133 38010 26645 25073 33825 17100 -7883 -8733 -11137 -10934 906 -2121
1941 -2121 -8501 -12068 -10896 -9231 1468 13678 18354 2218 -7556 -8551 -18054 -18850 -32372 -49228
1927 -49228 -33129 5333 4009 8836 21011 13240 -12610 -12052 -15755 -301 35382 26181 12547
1914 12547 -222 13386 23134 7456 -3520 -3407 -4109 7452 5120 1221 8505 14689 -225 -19149
1900 -19149 -4854 8989 8851 -4998 6056 8302 1190 -7327 -10880 -3297 -5298 4294 4463 -624
1886 -624 21472 20987 16603 4501 -13110 -22464 -4667 10178 18950 14299 16631 7368 24749 33411
1872 33411 35093 18499 640 -2663 6581 3947 -1578 -3453 -15081 -3952 -1408 -5040 -9690 1345
1858 1345 8581 1688 7497 16009 3438 3126 22158 19519 34023 35282 17595 -3388 -14864 -19726
1844 -19726 -8246 -15911 -3008 -3289 1941 -3998 7 3947 11459 21198 21074 23189 18346 -4199
1830 -4199 5064 -15600 -6284 4573 11931 -7003 -25172 -14210 -11821 7347 17133 28914 19217
1817 19217 11901 10500 -10325 -20561 -20309 -11291 -10918 -17611 -13564 -20938 -17024 -8298 -5373 5996
1803 5996 447 447 2362 -4757 -11385 -33616 -37142 -26879 -27419 -22159 -23285 -39802 -31053 -24344 -6819
1788 -6819 1810 23838 28122 7506 -13033 -15529 15147 850 5542 -279 -4260 20528 13212
1775 13212 -12120 -20904 -2731 -7879 -7640 -13750 -30250 -42025 -31371 -27394 -32520 -21726 -12023
1762 -12023 -15693 -15743 -2771 11793 19037 25736 32182 27799 22545 23987 29710 8203 -3832 -527
1748 -527 1035 -1341 -1189 19572 31581 44834 56473 35275 13714 -3152 1922 -2989 3060 -16555
1734 -16555 -19681 -12669 -12839 19444 25079 25826 8947 13513 -6319 -33357 -24501 -12074 -13523 -18824
1720 -18824 -10145 -8909 -1545 10101 845 -307 -4488 -10726 -25368 -25411 -23678 -3920 22027 28120
1706 28120 29430 33796 28936 44034 25133 1328 -8039 2102 -1378 -8728 -3715 -9255 -19549
1693 -19549 1087 4384 7376 -4112 3412 1752 -5818 12595 3540 -3882 20702 32370 28349
1680 28349 34151 30202 6379 -10812 -14506 -10189 -16775 802 17282 16387 26730 44557 40288
1667 40288 32795 18671 -9150 -13677 -16947 -6475 -14253 -13109 -18498 -11213 -20116 -22096 -6045 7110
1653 7110 12437 10915 41483 33468 13699 13730 3959 16476 15794 -10342 -21267 -4321 18920 35041
1639 35041 41171 33177 36555 35748 13171 3871 -4376 -5163 9377 7993 6213 -9163 -6364 13586
1625 13586 17760 22749 18491 17265 20969 31596 31411 8691 15756 34584 28184 13917 -3044 -9064
1611 -9064 -5394 17368 18295 12423 11545 7338 8333 -2289 -3256 1359 -21869 -29066 -26048 -22529 -25121
1596 -25121 -2709 -13784 -18429 18722 34020 30362 27343 31191 29486 10035 7106 16615 9967
1583 9967 -7549 -15280 -4559 8000 12073 909 -3155 24864 49290 35169 32463 31629 19592
1570 19592 -5976 -6549 -12650 -7742 -3184 -8709 -12097 -5980 -14940 -7360 14194 28106 32326 24511
1556 24511 23065 18610 20402 27024 27579 22450 11859 -11281 -17294 -11627 1315 1039 -3790 -15387
1542 -15387 -24313 -20436 -17413 -12298 1205 13177 11195 -19922 -26641 1240 13964 31248 14467
1529 14467 -7635 465 10255 4340 415 9566 18443 28977 26176 33527 39450 16985 5774 12918
1515 12918 9909 12571 18905 6247 -13712 -16707 -14814 -16977 -28709 -23055 -13045 -7809 19771
1502 19771 40315 20099 9422 17009 16612 22567 22801 28656 21770 -6366 -27073 -28590 -30151 -35364
1488 -35364 -25467 -16182 -9721 -9408 -13829 -7509 5392 22198 19534 21287 2137 -6221 -6060 -5732 985
1473 985 645 -928 -4743 -3406 2415 12618 11023 -7838 -22088 -36681 -39685 -29426 -17364 10333
1459 10333 15236 17371 14243 -610 -15630 -19698 -3091 10618 24758 17618 6304 2404 15158
1446 15158 23099 25866 -50 -11611 -912 4699 1892 11520 17507 21569 25135 15358 -4970 -13190
1432 -13190 -1644 -5270 -14212 -3667 -904 11635 5916 9726 1728 -946 -5153 -6896 7202 11995
1418 11995 2319 -7050 -16317 -6970 -7060 9808 14016 21432 12893 -820 1505 7571 24840 26646
1404 26646 8021 5070 10243 -1066 -24281 -14936 -2281 2595 5394 2245 16961 9876 20677
1391 20677 23537 29057 28239 10277 424 -4684 -12404 -19466 -11339 -34 9528 11557 14186 8383
1377 8383 13077 9873 2748 -2761 -13751 -11026 -8249 6769 17915 8687 -689 -7829 -12441 -4252
1363 -4252 -10332 -14035 -22195 -17059 -16402 -19348 983 7211 -4028 -3483 849 6651 6075 -12691 -15570
1348 -15570 -2535 1595 -9364 -5909 -3384 -12205 -16705 -862 6506 12116 22366 17036 25221 14675
1334 14675 8821 978 8091 9896 21341 13039 -6522 7094 17452 17096 22311 25815 22661 5371
1320 5371 7994 10110 1588 -3190 -11784 -45157 -33470 -5060 2727 -4694 -29076 -22658 -25083 -31271
1306 -31271 -11382 -1207 -3648 4078 1287 -1260 -4963 -7629 10205 13218 9134 15004 5523 -18624
1292 -18624 -20094 -19850 -18717 -13390 11275 23277 8375 3284 -2119 -10981 4165 3886 -11480 -5444
1278 -5444 -3086 -4990 4414 635 -15170 495 31173 16719 12926 11570 7735 2408 -7068 -7764
1264 -7764 2619 8577 -4231 -29727 -31923 -11275 880 7712 32 -9230 -9424 32561 31974 -15176
1250 -15176 -19163 -2962 -9875 -13582 -13369 -12539 -18038 -13963 -21048 -1319 -7262 -16635 -29890 -13821
1236 -13821 19248 34032 11908 1116 -3885 -4986 640 19806 23551 10426 -4160 -21147 -5660
1223 -5660 11311 20650 24677 -2669 -1905 16674 22510 7823 -5546 -19089 -17805 1018 8563
1210 8563 -12010 -19802 5272 11186 21246 13455 16240 15177 16440 29901 19052 24610 15371 4391
1196 4391 166 -2796 16140 27590 43813 26813 6284 -7964 -25768 -28477 -13420 -15982 -29475
1183 -29475 -15880 -3967 -10774 14757 33306 33918 34814 15486 3047 11592 2701 -13473 3819
1170 3819 15182 7167 -2844 -18212 -22200 -10067 -17541 -5242 -2035 -2222 -12320 -23344 -28245
1157 -28245 -32661 -24852 -12918 -15999 -6151 -467 2387 -6350 4437 5512 -780 7732 24386 22173
1143 22173 2017 -24582 -36642 -24424 -9440 -10803 -16723 -10539 -13815 -5482 -8598 -9484 -16071 -13740
1129 -13740 5848 11266 13719 1437 -9983 -16661 3117 -3166 -10759 -20273 311 13034 16301
1116 16301 28219 22672 -6311 -19414 -9450 3810 25195 32995 15229 -3463 -747 10281 216
1103 216 -20695 -35372 -42560 -37914 -10094 8010 186 -5622 -10914 858 10780 13820 19970 24204
1089 24204 8371 8430 -2057 -2678 -17572 -16638 -4663 -6371 -7125 -4327 -3094 11675 19232 -5173
1075 -5173 -16725 -18373 -16670 -7461 -11122 10706 27523 40637 45989 46355 23510 40731 31640 7646
1061 7646 -8283 -9208 -15893 -9250 -17391 -19482 660 -7924 -21184 -9731 -8880 -1901 -7797 -4155
1047 -4155 -13869 -31393 -30364 -28643 -18735 5008 23953 24828 24467 21536 390 1528 14634 21548
1033 21548 9117 8548 17341 23113 14938 -1057 -30838 -22296 -7350 -4661 12169 23143 12118
1020 12118 426 -6932 -10953 -14057 -1055 8078 -5062 -5146 4368 -5193 1595 7159 14111 695
1006 695 -12591 -22930 -15241 1855 8038 15674 8486 -3887 2010 -9734 -14243 -11056 -1114 15674
992 15674 -5278 -14086 -11101 -15428 -20628 -27963 -27772 -21197 7141 18800 15315 5996 -5143 -4599
978 -4599 6369 4516 8944 9886 1587 -8236 -3741 9128 12387 -6420 3338 9356 -16389 2270
964 2270 13283 1030 -5807 -20573 -28256 -26782 -16358 -6198 10095 20199 34184 41856 45292
951 45292 47846 44114 52445 36231 -4595 2631 11216 23190 16530 33256 43960 49829 29262
938 29262 -12199 -15049 5127 1295 3577 11975 22988 49910 43955 35757 33451 24916 9954 -1240
924 -1240 -837 -6110 -2489 -9781 -8515 -3460 7801 11178 -4538 -15169 -22589 -30116 -18900 -19334 -41617
909 -41617 -46707 -36641 -19688 7093 31345 32983 26815 6012 3869 13220 7818 7027 22841 20081
895 20081 532 1114 3694 6793 12475 21125 10784 20418 9022 -1290 486 6720 -10047 -228
881 -228 4638 12162 21030 14748 4982 -1524 -9613 -18009 -14724 781 8873 19806 9595 -7557
867 -7557 -24916 -32183 -37045 -21760 -5252 -2384 -1418 -4586 -18563 -14060 -28128 -17889 12347 30174
853 30174 40203 57783 66329 43618 30419 33057 17667 -1880 11352 30276 32597 28935 12057
840 12057 14750 16103 11968 9206 12725 14477 4204 -2245 228 -2621 3106 13386 13311 18098 12901
825 12901 19854 27043 34542 37202 19093 7236 22418 22324 11602 -1590 18513 45851 39335 19403
811 19403 19300 7844 9334 -5445 -23422 -8005 -5857 -3762 5122 -12923 -17970 -3799 7954
798 7954 13783 9069 -2487 4189 26258 21304 -2893 -12092 -4456 -8102 -2537 10371 40317 51267
784 51267 56547 47976 25440 22865 5363 -5218 -6809 -13794 -14458 -7229 267 -9894 -18061 -12874
770 -12874 -5577 9525 21441 24353 16410 7004 6648 13584 8111 -5272 -3634 -5624 -7041 12087
756 12087 26742 24961 18707 -2408 14335 24054 32484 31097 21472 13694 18628 16527 11197 -9501
742 -9501 -18149 -20799 -17922 -9725 14145 16760 20377 14674 16007 21007 16126 23638 24121 1875 -11874
727 -11874 -13066 2115 27580 11096 16746 742 9622 17018 13321 7440 12753 4441 16204 23063
713 23063 25619 30137 21981 33736 37702 14855 5645 21135 21227 23989 4702 -5678 23598 28980
699 28980 23614 16827 6170 12147 27996 30929 27290 17902 6645 14640 15209 20798 11161 198
685 198 2214 -5162 -15465 -22659 -13057 -10741 -6730 650 -16929 -21740 6175 29520 29825 38519 42431
670 42431 24476 16020 19786 15704 11800 -9135 -31094 -20512 316 27722 27877 10779 -7909
657 -7909 2613 17316 28071 33680 31112 21344 527 -21419 -10473 13427 7077 2979 908
644 908 6038 7971 1693 -9789 -20306 -16704 -11668 -8515 -10236 -20510 -30011 -25895 -19605 -3583
630 -3583 2280 942 8033 12399 15537 47181 42582 19743 -1466 14082 26471 20222 12878 6066
616 6066 -866 -4969 -30241 -25604 -16629 -6821 -236 4846 11901 17861 216 -16514 -31847 -36873
602 -36873 -48205 -35906 -25110 -11461 -5385 -22716 -7755 27812 48137 38210 26420 9893
590 9893 10679 1401 9903 9441 20970 16819 8001 730 -4979 -7201 -4841 -9589 15796 27186 29377
575 29377 21381 15028 17060 11146 10059 22726 42537 32278 16764 9162 8860 7830 12313 7370
561 7370 19476 37424 44526 50514 43066 20354 6739 15818 38491 48700 42420 25706 8896
548 8896 277 -2065 2537 6595 7605 3958 -15888 -29809 -22795 -15622 -8900 16510 43420 51472
534 51472 53770 44388 24256 5468 7334 -14138 -20544 -15059 14825 8444 20515 25156 22419 17451
520 17451 16048 18016 -1229 -6438 742 8121 6501 9308 856 -11851 -16739 -20530 -25923 -32939
506 -32939 -12872 11961 39420 38996 37554 23292 5451 -10258 -13859 -20650 -31336 -7679 18324
493 18324 13398 18287 20162 25182 19023 17326 16995 15677 9542 368 4606 4612 -653 16834 26500 33337
477 33337 16024 12644 35817 25049 8874 7910 14981 13596 23172 7615 -4105 4016 27031
464 27031 43988 37613 34808 29627 5277 -24518 -20444 -14713 -391 13962 5440 15848 16522 6226
450 6226 -5496 -7179 3471 5654 -2900 -6941 5219 8768 -1240 -16167 725 10313 1340 -1509
436 -1509 -2678 10722 15768 815 -9761 875 10765 19309 21957 8629 -10786 -16123 -5837
423 -5837 22073 9343 -3829 8813 15192 15424 5849 8871 1573 -17395 -17692 -10154 -8001 -3787
409 -3787 10645 21392 17827 24540 30579 33340 36607 29228 21322 8523 460 -881 -5337 -4132
395 -4132 -10072 -20813 -7024 17137 23764 7295 -6003 7047 7168 4939 8081 9934 16779 20989
381 20989 15200 9385 5742 9726 196 9911 11297 296 5436 12278 13973 -4303 -11541 2557
367 2557 1595 7273 10900 13634 24117 -3110 -34460 -31243 -23312 3923 15801 1639 1180 36400
353 36400 41139 18933 12383 1142 -2524 10854 11133 7973 10193 10672 10945 7675 9925 12938 2471
338 2471 1785 7003 18853 12973 34735 40683 7238 -2664 9323 17472 27449 12749 8746 13329
324 13329 15541 16933 23146 21849 14867 3876 1604 14836 26084 21636 8335 9963 -1438 -2352
310 -2352 -2190 3827 3542 -2088 -9346 -4911 16333 18555 1272 -2790 13748 15847 1377 -1157 16392
295 16392 19485 16959 4444 -3716 -10785 1467 2760 14655 9237 -7832 -13969 -6638 19821 32893
281 32893 27117 21776 10192 1605 9011 16809 6867 -1885 -11551 -11595 -11311 -4369 -2480 -4316 -6729
266 -6729 -9430 13149 31267 29751 17322 11095 10267 13631 20946 33240 29545 16800 -2001 -8834
252 -8834 -15662 -14601 -19220 -16382 -12014 -15715 -11611 1190 13524 10520 8496 -138 11903 6622
238 6622 -7784 -13225 -9152 -11872 -11638 -6679 577 575 5086 10638 3333 -19397 -18620 -5991 1745 6620
222 6620 10335 16662 31207 27655 15488 14983 22156 35077 28727 15474 13639 5662 4355 -2009
208 -2009 12326 11369 8498 14324 -1140 -11009 -4247 -1874 12309 33223 47957 41919 30646 31966
194 31966 15577 -8685 -20536 -24715 -19445 -14799 -23454 -36232 -5002 13091 23278 27981 19267
181 19267 17628 10937 -2933 3398 7881 22104 9586 3237 6 7241 5409 -5494 6595 15004
167 15004 20729 19803 12984 14743 21278 33054 14347 -12620 -10479 -7974 -993 -4308 3966 477
153 477 2166 12837 15871 6836 19066 24082 10441 2697 8623 20186 14619 6527 3522 13047
139 13047 8056 8750 8079 5451 4022 11061 22581 27887 36535 39020 25446 20977 16722 6644 12792
124 12792 8904 -2886 -10637 -5581 9197 16939 10278 7498 3593 3946 3490 -7757 -10554 -6672 2533
109 2533 3134 2611 1436 -4806 2152 2692 1376 15288 26349 22851 16166 906 6656 19613 12657
94 12657 -1757 -1296 3261 4248 -3295 -5793 -2816 2681 3409 5048 7935 1009 -12914 -2469 -5144
79 -5144 -9798 -5129 -8683 -9136 -5548 -394 6982 13468 19720 16367 17447 30692 24688 20448 19211
64 19211 13396 18387 30218 31629 15752 7359 -1941 -347 10130 -866 -13725 5790 17907
51 17907 1254 -16252 -3666 9667 15069 14427 -523 -2226 -5893 -7106 -16169 -17096 -3451 -1876
37 -1876 3313 12268 22850 22535 11509 2748 7062 14152 11646 13921 22058 15302 1494 4573 6333
22 6333 23014 22722 -6441 -18299 -18356 -11631 -1299 12612 19462 25730 19134 17791 17439 10415 7874
7 7874 2444 -2137 -407 6583 1252 2769 1744
0 1744
$$ Imaginary data points
##PAGE= N=2
##DATA TABLE= (X++(I..I)), XYDATA
32767 99677 99401 81595 89792 94104 102201 97189 100574 112353 109223 106192 106675 119166 120214 111634
32753 111634 107346 112073 116308 113573 115688 102341 106080 115574 128277 128956 125242 132540 137186 134647
32739 134647 134306 133703 127309 128249 141478 129769 116998 114585 117129 134550 133422 132493 137190 131050
32725 131050 127915 133613 141439 154073 140219 128243 132265 144845 156951 162555 156442 147163 147160 156206
32711 156206 159145 147994 146819 160569 165945 164511 162712 147723 151333 149893 154526 168969 179080
32698 179080 181970 175025 175781 168341 163177 160500 162716 154921 160570 158570 166556 175874 189465 191655
32684 191655 190726 191498 179893 181694 181803 176912 174690 173156 172382 165730 172765 176072 176065 169649 161980 170620
32668 170620 182655 186128 180894 179849 190460 190725 182259 177357 174432 177230 190974 198417 199654 187257
32654 187257 188538 197217 197750 192042 194990 207313 212799 205182 197669 195062 197160 195003 209622 206725
32640 206725 185153 182931 188772 201788 210416 232257 225458 210239 214091 216263 211071 206765 195116
32627 195116 194287 211177 215076 207516 207394 222015 222235 216848 227167 239456 231007 228465 218848 220962
32613 220962 223720 223536 230002 233954 235315 241226 227801 224008 220221 232974 246568 241840 235511 240908
32599 240908 236402 244588 245593 256586 258537 275129 277850 259955 243084 254747 264643 254715 251208
32586 251208 255966 263016 253326 247128 240728 255435 261590 267724 262615 255901 255626 260022 264170 263943
32572 263943 256743 258787 256473 272687 272201 263179 250116 248863 246542 244649 241265 246933 265312 248717
32558 248717 238453 240674 254157 259802 258345 260169 265435 262065 276093 290727 274089 275725 267788
32545 267788 270630 275906 271433 258802 256658 263122 262037 264407 253417 271267 265977 243019 250509
32532 250509 265858 278606 289319 292248 281122 269483 278354 285429 283121 295386 290850 290322 278586
32519 278586 267850 272433 283902 299411 311854 298982 288455 287077 283647 285358 308424 314725
32507 314725 312686 307254 302776 297534 287885 298953 303888 305327 314504 325519 330183 319858 316601
32494 316601 319982 317003 315936 301103 298608 295378 296137 306526 305625 285449 296867 318885 326357
32481 326357 321563 319094 315841 314863 325053 329605 324429 330231 338889 342152 351120 347782 345585 342762
32467 342762 320110 327519 351977 360162 355198 345330 316123 315382 333660 327904 322831 333287 328299
32454 328299 320329 319400 317532 303053 300659 314846 321487 344802 326480 302722 312959 318192 326704
32441 326704 319313 304557 309851 317084 326798 345180 351405 367379 348152 339628 324383 327507 321572
32428 321572 319106 311839 307874 317644 331393 327343 324525 319827 308816 304211 313253 317488 320297 315845
32414 315845 327164 329379 326879 333072 329903 327796 323881 322767 329491 330885 340422 325427 331528 341535
32400 341535 338224 334291 339375 352937 358294 337942 321204 329816 348488 335418 329536 335426 343248
32387 343248 339566 338416 337134 358074 352816 342836 351013 363445 375085 376496 370028 355607 344231
32374 344231 340978 346350 344962 328469 333496 334161 338728 338699 329816 316022 319421 346632 350873 348132
32360 348132 348243 350042 351753 346994 340437 344188 355687 362097 353657 344958 355660 364862 360005 361922
32346 361922 365639 357591 360598 358734 369865 382143 374111 346146 349702 356144 355163 365545 358401
32333 358401 363330 369146 361156 349295 366783 372995 371024 367390 354343 361699 375155 375676 365860
32320 365860 380902 377681 364343 355476 349849 364874 372403 371505 362465 356301 356643 369490 371403 366030
32306 366030 381726 371787 375351 377968 356620 351736 361602 364390 366197 374760 371215 367397 374859 390823
32292 390823 392261 393159 399230 396776 385817 400584 403040 392085 393717 390513 385988 395252 395361 393994
32278 393994 396375 381569 363907 355666 362312 361045 359084 358452 379279 366375 368884 378233 387654
32265 387654 373850 363303 366193 350908 354841 362328 339828 328368 339092 342005 351356 370197
32253 370197 377406 370129 379315 383583 385679 387914 385770 363129 354532 352053 366625 373220 389282
32240 389282 389276 390427 382714 390379 390714 409347 407539 398507 408233 404980 404269 390160 372677 372081 370604
32225 370604 380721 373972 371970 370382 363797 375616 372916 375556 365799 359243 352971 377000 393424
32212 393424 395231 384727 393339 386568 377681 376510 367616 361931 377154 384809 380047 367792 363351
32199 363351 366075 371189 403043 412999 385679 362939 357621 359650 358513 370018 361023 360883 354763
32186 354763 360415 385866 387723 371750 381798 389843 382727 379331 384798 386664 377146 375661 381202
32173 381202 385918 365716 374023 377569 388008 387726 373554 365416 364085 380654 385106 382023 375026
32160 375026 367217 371889 386838 383710 388417 389052 383764 375898 369109 381559 389613 394054 405891 403945
32146 403945 395762 397533 389842 392890 406943 414394 415638 403848 395245 392265 407529 404694 387726
32133 387726 382198 370509 375965 368972 383272 375750 370702 393296 402878 397893 395653 398315 399878
32120 399878 400806 411444 422058 416094 415761 412631 418792 421525 414803 410199 419098 421796 401146 400523
32106 400523 395579 400823 399310 383641 397936 389595 366793 364828 363136 375771 382742 379148 370602
32093 370602 373105 373464 381084 382975 386346 384490 383042 381852 355510 341140 370713 394359 390245
32080 390245 398015 416915 417736 401706 399866 403242 394843 397912 399026 392633 377631 383314 405407
32067 405407 403950 399522 393519 388765 384618 384564 380372 381159 384121 382250 399671 407182 408599 395866
32053 395866 396160 377850 386357 406686 405755 402972 401135 402172 415352 413078 410934 413906 405883 389675
$$ [...]
##END NTUPLES=NMR SPECTRUM
##END=
