##TITLE=Analysis number 329257
Compound Code cc 58701
Book Reference 486/182
Project Code adrs
Chemist Name simons
##JCAMPDX= 6.0         $$ Bruker NMR JCAMP-DX V2.0
##DATA TYPE= NMR SPECTRUM
##DATA CLASS= NTUPLES
##ORIGIN= Bruker BioSpin GmbH
##OWNER= nmr
$$ XWIN-NMR		Version 3.5
$$ Tue Aug 14 13:07:57 2007 GMT Daylight Time (UT+1h)  MAYBRIDGE\nmr@NMR_250MHZ
##.OBSERVE FREQUENCY= 250.131544655141
##.OBSERVE NUCLEUS= ^1H
##.ACQUISITION MODE= SIMULTANEOUS (DQD)
##.ACQUISITION SCHEME= undefined
##.AVERAGES= 16
##.DIGITISER RES= 18
##SPECTROMETER/DATA SYSTEM= dpx250
##.PULSE SEQUENCE= zg30
##.SOLVENT NAME= DMSO
##.SHIFT REFERENCE= (INTERNAL, DMSO, 0, 16.522)
##AUDIT TRAIL= $$ (NUMBER, WHEN, WHO, WHERE, WHAT)
$$ ##TITLE= Audit trail, XWIN-NMR		Version 3.5
$$ ##JCAMPDX= 5.01
$$ ##ORIGIN= Bruker BioSpin GmbH
$$ ##OWNER= nmr
$$ C:\u/data/dgb/nmr/ADRS/630/pdata/1/auditp.txt
$$ ##AUDIT TRAIL=  $$ (NUMBER, WHEN, WHO, WHERE, WHAT)
(   1,<2007-08-14 13:07:33.00 +100>,<MAYBRIDGE\nmr>,<NMR_250MHZ>,
      <created by zg, POWCHK disabled, PULCHK disabled
       configuration hash MD5:
       76 6E 9A 78 1E 09 19 81 EC 84 63 8F B0 6A 59 2D
       data hash MD5: 64K
       1D DA DD CE DF F2 A9 FE FA 82 38 19 3B BF 46 32>)
(   2,<2007-08-14 13:07:46.09 +100>,<MAYBRIDGE\nmr>,<NMR_250MHZ>,
      <Start of raw data processing
       ef LB = 0.3 FT_mod = 6 PKNL = 1 SI = 32K 
       data hash MD5: 32K
       93 C8 5E 3C 2D 03 7E F6 B0 2F 7A 18 CC 1A D8 81>)
(   3,<2007-08-14 13:07:47.72 +100>,<MAYBRIDGE\nmr>,<NMR_250MHZ>,
      <apk 
       data hash MD5: 32K
       49 A1 F1 B2 11 68 7D FE 37 17 F9 51 AC D4 36 D6>)
(   4,<2007-08-14 13:07:48.47 +100>,<MAYBRIDGE\nmr>,<NMR_250MHZ>,
      <abs ABSG = 5 
       data hash MD5: 32K
       1D C5 DC 0E 71 D4 04 4F F0 1E E7 C3 CE 42 1B 8C>)
$$ ##END=
$$ 
$$ hash MD5
$$ 30 F2 C5 CE 6B A4 25 3B DD 63 68 77 C2 3A A2 E9
##$RELAX= 
##$RELAX= 
##$RELAX= 
##$RELAX= 
##$RELAX= 
##$RELAX= 
##$RELAX= 
$$ Bruker specific parameters
$$ --------------------------
##$DU= <C:\u>
##$EXPNO= 630
##$NAME= <ADRS>
##$PROCNO= 1
##$TYPE= <nmr>
##$USER= <dgb>
##$AMP= (0..31)
100 100 100 100 100 100 100 100 100 100 100 100 100 100 100 100 100 100 
100 100 100 100 100 100 100 100 100 100 100 100 100 100 
##$AQSEQ= 0
##$AQ_mod= 3
##$AUNM= <au_zg>
##$AUTOPOS= <27 >
##$BF1= 250.13
##$BF2= 250.13
##$BF3= 250.13
##$BF4= 250.13
##$BF5= 500.13
##$BF6= 500.13
##$BF7= 500.13
##$BF8= 500.13
##$BYTORDA= 1
##$CFDGTYP= 0
##$CFRGTYP= 5
##$CHEMSTR= <none>
##$CNST= (0..31)
1 1 145 1 1 1 1 1 1 1 1 1 1 1 1 1 1 1 1 1 1 1 1 1 1 1 1 1 1 1 1 1 
##$CPDPRG= <>
##$CPDPRG1= <>
##$CPDPRG2= <>
##$CPDPRG3= <>
##$CPDPRG4= <mlev>
##$CPDPRG5= <mlev>
##$CPDPRG6= <mlev>
##$CPDPRG7= <mlev>
##$CPDPRG8= <mlev>
##$CPDPRGB= <>
##$CPDPRGT= <>
##$D= (0..31)
0 1 0 0 0 0 0 0 0 0.06 0 0 0 0 0 0 0.0002 0 0 0 0 0 0 0 0 0 0 0 0 0 0 
0 
##$DATE= 1187093251
##$DBL= (0..7)
120 120 120 120 120 120 120 120 
##$DBP= (0..7)
150 150 150 150 150 150 150 150 
##$DBP07= 0
##$DBPNAM0= <>
##$DBPNAM1= <>
$$ [...]
##$SUBNAM7= <"">
##$SUBNAM8= <"">
##$SUBNAM9= <"">
##$SW= 20.6930455092707
##$SWIBOX= (0..15)
0 0 3 0 0 0 0 0 0 0 0 0 0 0 0 0 
##$SW_h= 5175.983436853
##$TD= 65536
##$TD0= 1
##$TE= 297.16
##$TE2= 300
##$TE3= 300
##$TEG= 300
##$TL= (0..7)
0 120 120 120 120 120 120 120 
##$TP= (0..7)
150 150 150 150 150 150 150 150 
##$TP07= 0
##$TPNAME0= <>
##$TPNAME1= <>
##$TPNAME2= <>
##$TPNAME3= <>
##$TPNAME4= <>
##$TPNAME5= <>
##$TPNAME6= <>
##$TPNAME7= <>
##$TPOAL= (0..7)
0.5 0.5 0.5 0.5 0.5 0.5 0.5 0.5 
##$TPOFFS= (0..7)
0 0 0 0 0 0 0 0 
##$TUNHIN= 0
##$TUNHOUT= 0
##$TUNXOUT= 0
##$USERA1= <user>
##$USERA2= <user>
##$USERA3= <user>
##$USERA4= <user>
##$USERA5= <user>
##$V9= 5
##$VALIST= <valist>
##$VCLIST= <CCCCCCCCCCCCCCC>
##$VD= 0
##$VDLIST= <DDDDDDDDDDDDDDD>
##$VPLIST= <PPPPPPPPPPPPPPP>
##$VTLIST= <TTTTTTTTTTTTTTT>
##$WBST= 1024
##$WBSW= 4
##$XGAIN= (0..3)
0 0 0 0 
##$XL= 0
##$YL= 0
##$YMAX_a= 406769
##$YMIN_a= -343308
##$ZGOPTNS= <>
##$ZL1= 120
##$ZL2= 120
##$ZL3= 120
##$ZL4= 120
##$ABSF1= 16.522
##$ABSF2= -4.171173
##$ABSG= 5
##$ABSL= 3
##$ALPHA= 0
##$AQORDER= 0
##$ASSFAC= 0
##$ASSFACI= 0
##$ASSFACX= 0
##$ASSWID= 0
##$AUNMP= <proc_1d>
##$AZFE= 0.1
##$AZFW= 0.1
##$BCFW= 0
##$BC_mod= 0
##$BYTORDP= 0
##$COROFFS= 0
##$CY= 12.5
##$DATMOD= 1
##$DC= 0
##$DFILT= <>
##$DTYPP= 0
##$F1P= 14.0000005364418
##$F2P= -0.99999901652339
##$FCOR= 0.5
##$FTSIZE= 32768
##$FT_mod= 6
##$GAMMA= 0
##$GB= 0
##$INTBC= 1
##$INTSCL= 1
##$ISEN= 128
##$LB= 0.3
##$LEV0= 0
##$LPBIN= 0
##$MAXI= 10000
##$MC2= 0
##$MEAN= 0
##$ME_mod= 0
##$MI= 0
##$NCOEF= 0
##$NC_proc= -3
##$NLEV= 6
##$NOISF1= 0
##$NOISF2= 0
##$NSP= 0
##$NTH_PI= 0
##$NZP= 0
##$OFFSET= 16.522
##$PC= 1
##$PHC0= -59.01595
##$PHC1= 6.139318
##$PH_mod= 1
##$PKNL= yes
##$PPARMOD= 0
##$PSCAL= 4
##$PSIGN= 0
##$REVERSE= no
##$SF= 250.13
##$SI= 32768
##$SIGF1= 0
##$SIGF2= 0
##$SINO= 400
##$SIOLD= 32768
##$SREGLST= <1H.DMSO>
##$SSB= 0
##$STSI= 32768
##$STSR= 0
##$SW_p= 5175.98343685301
##$SYMM= 0
##$S_DEV= 0
##$TDeff= 65536
##$TDoff= 0
##$TI= <Analysis number 999999
Compound Code 99
Book Reference 9
Project Code 9>
##$TILT= no
##$TM1= 0
##$TM2= 0
##$TOPLEV= 0
##$USERP1= <user>
##$USERP2= <user>
##$USERP3= <user>
##$USERP4= <user>
##$USERP5= <user>
##$WDW= 1
##$XDIM= 32768
##$YMAX_p= 437377806
##$YMIN_p= -56735
$$ End of Bruker specific parameters
$$ ---------------------------------
##NTUPLES= NMR SPECTRUM
##VAR_NAME=  FREQUENCY,     SPECTRUM/REAL,   SPECTRUM/IMAG
##SYMBOL=    X,             R,               I
##VAR_TYPE=  INDEPENDENT,   DEPENDENT,       DEPENDENT
##VAR_FORM=  AFFN,          ASDF,            ASDF
##VAR_DIM=   32768,         32768,           32768
##UNITS=     HZ,            ARBITRARY UNITS, ARBITRARY UNITS
##FACTOR=    0.157963299565203, 1,           1
##FIRST=     4132.6476996994, 0,             0
##LAST=      -1043.33573715361, 0,           0
##MIN=       -1043.33573715361, -56735,      0
##MAX=       4132.6476996994, 437377806,     0
$$ Real data points
##PAGE= N=1
##DATA TABLE= (X++(R..R)), XYDATA
$$ [...]
17097B1675n721P820M899N632K893N269L609j175p057k0574k115P254P922j433
17083B8898p208K87J1958P459Q950n831k15m127q543K802M202k738j402J2739
17069D7231J0764J4336M006M621k949j4965q62n648j7517j1793M705J1608R461
17056E2998m140J4779R745J6648K3557M4814N3128L6594J6549Q73j1856m511J5228
17043B64406P462k6250l3041m1215l3583k2235k0369r037R19j224J8190L3829
17031A37852L2013M5830M2499J5283L028J746K976M623r466l2467n1253n0879
17019A41785k9912k8378j8060M423p951r888L838j511j0057j6255N374K4022J3982
17006G1412p27p029j4532j65J0854K787o825P809M523P400r383j0071J1212J619
$$ y = [21675, 15954, 23774, 28673, 34305, 37198, 42467, 46076, 44901, 37844, 17270, 15155, 22409, 30331, 28898, 21690, 21977, 33935, 41394, 50344, 44513, 44298, 40171, 31628, 34430, 38632, 35894, 34492, 47231, 57995, 72331, 76337, 80958, 78009, 63044, 62182, 56534, 39017, 27224, 31929, 43537, 52998, 48858, 63637, 73382, 90030, 113587, 158401, 211529, 248123, 264672, 265545, 253689, 249178, 264406, 271868, 245618, 212577, 171362, 137779, 115544, 95175, 86138, 87057, 85833, 104023, 137852, 169865, 215695, 258194, 273477, 276505, 278251, 281227, 285850, 276384, 243917, 192664, 141785, 111873, 83495, 65435, 69858, 61907, 52019, 55857, 54346, 44289, 28034, 33408, 57430, 71412, 70685, 63656, 49124, 48959, 59813, 62600, 55775, 63584, 68107, 75507, 66124, 56053, 67265, 68884]
16992F8884k7419j0079p095m613o249j2840J3323J2133J0084l368j401P120N990
16979D4470K3476J4113J883m10o830m801j0353p099q949j0262K865O621J6820
16966F1544J5158l309p105j3071m521J2460J603J6473R710l549j120n17n785P173
16952H5144J1278K453L09j086r268L180J9708O638J195J4734K035j1827k2051
16939A02442k516R402m74n21R278j4314r02J0483q96R232M858M245J3601R22N590
16924A50430J7132m932q063R607N715J0060P157P47K195J0483J5553J8816O956
16911B41856J0006J9923Q243J8050K2616K5061M848K7279L0686J2966K9741L2532
16899D83807L8781L7486M9214O6521P7516Q9779J16458J27439J30163J42588J43897
$$ y = [68884, 41465, 31386, 24291, 19678, 13429, 589, 13912, 26045, 36129, 32761, 31360, 38480, 44470, 67946, 82059, 83942, 83532, 76702, 71901, 61548, 54449, 45500, 35238, 38103, 44724, 61544, 76702, 73393, 66288, 53217, 48696, 61156, 62759, 79232, 88942, 85393, 84273, 83756, 77971, 85144, 96422, 98875, 99184, 98098, 88830, 92010, 111718, 118356, 119551, 134285, 136320, 124493, 102442, 99926, 109328, 108854, 108333, 117611, 103297, 102395, 112878, 111982, 121214, 126072, 130317, 143918, 144840, 150430, 167562, 162630, 154567, 164174, 169889, 179949, 187106, 187853, 190048, 200531, 216084, 234900, 241856, 251862, 271785, 280028, 298078, 320694, 345755, 350603, 377882, 408568, 421534, 451275, 483807, 522588, 560074, 609288, 675809, 753325, 843104, 959562, 1087001, 1217164, 1359752, 1503649]
16888A503649J54906J40576J31210J53431J62214J99457K60868L40251M72277
16879C518839O69720R40943J350612J964837K906284M232724N894122P601499
16871B9079580Q862012Q977499P426137M393182M74464l529773o610996q233014
16863D0839091q351218p416953n973546m499486l299488k355779j680987j214002
16855F047632q90963o48283m90425l71271k97909k50476j97957j67248j44402
16846B588698j34670j31927j19052j05091p3322l9518k1218K6968M1962N4827
16836B087657P5636Q0248J00124R8733J07346J54964K14405K90997M16822N71895
16826D198827P82191J123956J628755K380767L372960M677095O209131P590062
$$ y = [1503649, 1658555, 1799131, 1930341, 2083772, 2245986, 2445443, 2706311, 3046562, 3518839, 4188559, 5129502, 6480114, 8444951, 11351235, 15583959, 21478081, 29079580, 37941592, 46919091, 54345228, 58738410, 59212874, 55683101, 49072105, 40839091, 32487873, 25070920, 19097374, 14597888, 11298400, 8942621, 7261634, 6047632, 5156669, 4508386, 4017961, 3646690, 3348781, 3098305, 2900348, 2733100, 2588698, 2454028, 2322101, 2203049, 2097958, 2024636, 1985118, 1963900, 1990868, 2032830, 2087657, 2163293, 2243541, 2343665, 2442398, 2549744, 2704708, 2919113, 3210110, 3626932, 4198827, 4981018, 6104974, 7733729, 10114496, 13487456, 18164551, 24373682, 31963744]
16818C1963744Q323459P813325N843319K563379j316268m788774p279727q286929
16810C4835528p901558o641225n110929l689779k612363j846233j307325r46256
16802D779860o81929m93220l78456k96128k36197k00871j94092j73779j69017
16793A956171j83213j67935j72899j54782j42189j27243r9062r2421p2748p2747
16783F70932m4754l5361j4943l0130k8698l4360k1652k8174k4145j7024n619q234
16771C77838p617L575j7162j2577j2265j1753j1964l446q881k2835j9880j3385
16759B39648k4983p752k516J8717J546j4784j0804j3981J4235K645j0068m27K1679
16746B13155J7734Q64j8757K317J652k6854j4927Q64j0333j4928r389k0740J878
$$ y = [31963744, 40287203, 48100528, 53943847, 56507226, 55190958, 50402184, 43122457, 34835528, 26933970, 20292745, 15181816, 11492037, 8879674, 7033441, 5726116, 4779860, 4097931, 3604711, 3226255, 2930127, 2693930, 2493059, 2298967, 2125188, 1956171, 1772958, 1605023, 1432124, 1277342, 1135153, 1007910, 908848, 816427, 743679, 670932, 626178, 590817, 575874, 545744, 517046, 482686, 461034, 432860, 408715, 391691, 386072, 377838, 370221, 373796, 356634, 344057, 331792, 320039, 308075, 304629, 295748, 272913, 253033, 239648, 214665, 206913, 204397, 223114, 224660, 209876, 199072, 185091, 199326, 201971, 191903, 191476, 213155, 230889, 231753, 212996, 215313, 216965, 190111, 175184, 176048, 165715, 150787, 141398, 120658, 122536]
16733A22536K367m142j3695j873O959m941n599M518P633M772J785j1517m836P651
16719A11618o457q118o613P718m021m555K644K470J0929p254q819k1913j676K800
16705F8753Q754K273m981P978J693K431M905O539P169m711R437N186p25n200m013
16690A05488l085q755p990L512o042k1L982q666M647P656m443k2534r446k914
16676E1389p162n970q973K9406K887q121j5262o569K376l046j676l029K897n542
16662B3605j0336J0694J4012q219m151R661L283j5945o963J657J9697Q874j108
16649D4761J084l720q68K218n22n84n777K087K2057j2847j4518m993K740n49j730
16634B8839J8428p478n327o212o527N235J3981o101j0562l817q84Q373P590R310
$$ y = [122536, 124903, 120761, 107066, 105193, 112152, 107211, 101612, 106130, 113763, 118535, 120320, 108803, 103967, 111618, 105161, 97043, 90430, 98148, 94127, 89572, 92216, 94686, 105615, 98361, 89542, 67629, 65953, 68753, 77507, 79780, 74799, 82777, 84470, 86901, 91806, 98345, 105514, 100803, 110240, 115426, 114701, 109501, 105488, 102403, 93648, 85658, 89170, 83128, 83107, 87089, 78423, 83070, 90726, 86283, 63749, 54303, 51389, 44227, 38257, 29284, 58690, 61577, 53456, 38194, 31625, 34001, 30955, 29279, 26250, 29147, 23605, 13269, 23963, 37975, 29756, 25605, 35266, 38549, 22604, 15641, 17298, 36995, 45869, 44761, 45845, 42125, 41257, 43475, 42953, 42369, 36592, 38679, 60736, 47889, 33371, 28378, 31118, 30569, 28839, 47267, 39789, 34462, 28250, 21723, 26958, 40939, 34838, 24276, 20459, 19575, 27948, 35538, 44848]
16620D4848P642n159q026K255Q956j2011q104l684n556k60N528k303N646r669
16606B0103L935P528k183j5578j3480q842o629Q435J1889r32R853j918q274K592
16592F499K1616R850j3119q827n895m98j5149L271J7494P756l680m097l00L848
16578A8769n993j2452l375K982n684L153O09p461J1218l709n387R362J3288R136
16564B4456l05k362r164n014j5508L603K3252J5570j142p684p371J413J803j1426
16550A0121q606J36J490K864j887J3096J0212r391o626P55p954j1740m727j037
16536a3294L008K517P55K356M848M745J065j038J9327m573q814m415j362J6519
16522B1644K483q409o960o77o555J0575K03k837n366J305L023N115N20q034M802
$$ y = [44848, 52490, 47331, 39305, 41560, 50516, 38505, 30401, 26717, 21161, 20901, 26429, 24126, 29772, 20103, 24038, 31566, 29383, 13805, 325, -8517, -15146, -6711, 5178, 4246, 14099, 12181, 3907, 6499, 28115, 37965, 24846, 16019, 10124, 9626, -5523, -2252, 15242, 22998, 19318, 15221, 14921, 18769, 12776, 324, -3051, -69, -5753, -2600, -1991, -9452, 1766, -1943, -7330, 2032, 15320, 24456, 24151, 21789, 12625, 7611, -7897, -4294, 18958, 34528, 33386, 25702, 18331, 19744, 21547, 10121, 1515, 1651, 3141, 6005, 4118, 17214, 27426, 18035, 11409, 12164, 4210, -7530, -12257, -13294, -10286, -7769, -7014, -4658, 190, 4935, 6000, 4962, 24289, 19716, 10902, 6487, 5125, 21644, 24127, 15718, 8758, 8081, 1526, 12101, 12304, 9467, 4101, 5406, 8429, 13544, 14064, 6030, 10832]
16507A0832j2673q702Q038J1248L549n554r121k72q10L813Q262J926j31P475N578
16492B3458m071n177q26O497K651K737L123M496j1072r091j478n87l976N37M35
16477G656M007m020n836n654q792L65n270m882J76R656J4868Q054j541J5657M325
16462B8769j3265o658o695j942K43o696J0652O070j0590m551j4182L657J5534
16449C46N193O923m8r337p686j8695l153P979J1758j931O487P581M487L925P856
16434B1685r082l243m115j1667l488m28q07l239l858R311K422q21K839j0742J83
16419a5050m38K426Q732M049r360q612l009n635J583J5275R779m745R65j676J70
16404e546O53l600M97K4582j34j0319q073j3024k005J1602R495L698j1415l067
$$ y = [10832, -1841, -10543, -2505, 8743, 12292, 6738, -2383, -2655, -3465, 348, 8610, 10536, 10405, 17880, 23458, 19387, 14210, 13384, 19881, 22532, 25269, 28392, 32888, 21816, 12725, 11247, 10660, 6684, 7221, 7656, 11663, 7643, 1807, -3847, -12639, -12274, -17544, -22426, -22250, -12594, 2274, 10328, 8787, 24444, 28769, 15504, 8846, 2151, 209, 452, -6244, 4408, 10478, -112, -4663, -18845, -15188, 346, 5539, 12462, 12414, 3077, -4609, -23304, -26457, -18478, -6720, -8651, -2164, 5417, 9904, 13829, 21685, 12603, 9360, 5245, -6422, -9910, -10338, -11145, -14384, -18242, -8931, -6509, -7330, -4491, -15233, -15050, -15488, -13062, -4330, -281, -9641, -18253, -21262, -26897, -25314, -10039, -260, -5005, -4040, -5716, -5546, -4893, -8493, -7996, 16586, 16452, 6133, -1940, -14964, -16969, -5367, 4128, 7826, -3589, -6656]
16390f656O325k959K419O202J0087m634k811r527M333M357J4488K636l792M271
16376B4739j971l677N53K929J302l979n486O821J477N589J1518N102Q170K657
16362E5744L2789L2109L5745L9857K9746J7698J2392J8240q285l8075m0242k3329
16350A64389j9240l5058k7951j8654k0753n373L233j2304p647Q056j2790p064
16338H844l167K088j0810l038N277K1592R489N234P148j7194k6754m929m446Q18
16324i848r46R824J0762J1351J2108m739j4398o377P137J0515l848R05J2784m310
16310C0920J1479L1340L9624K6956L9494L2095K6502J4087J9037K191k7673n2929
16298A93123n2194k6570o362j6185j9707k3130j0407j9650r005K55p019J7802
$$ y = [-6656, -331, -3290, -871, 5331, 15418, 10784, 7973, -1554, 2779, 7136, 21624, 24260, 20468, 24739, 22768, 19091, 19644, 22573, 23875, 19896, 14410, 21231, 22708, 28297, 39815, 44917, 53087, 55744, 88533, 120642, 156387, 196244, 225990, 243688, 256080, 274320, 266035, 227960, 187718, 164389, 145149, 110091, 82140, 63486, 42733, 37360, 40593, 28289, 20642, 28698, 15908, 8844, 5677, 7765, -3045, -6083, -806, 20786, 30275, 35509, 42657, 25463, -1291, -6220, -10666, -9848, -10794, -970, 9792, 21143, 33251, 28512, 14114, 7737, 14874, 25389, 21541, 22446, 35230, 30920, 42399, 73739, 113363, 140319, 179813, 211908, 238410, 252497, 271534, 273725, 246052, 193123, 140929, 114359, 107997, 91812, 72105, 48975, 38568, 18918, 9913, 10168, 3149, 20951]
16286B0951J3040q418r105N247K047J644J818q598j0804k023j74p159o238J2287
16272D515P354N446p668n706k251j931n871l674p17J5188j510n263p577j164K503
16257h326M971j1685K723n562M410j827K253L449M815O948Q816O637L426q917
16243A2131j0216R85l305j9017q514O136m016j309J9319J4506J0992k100j7314
16230a722m084r987p77Q780k405Q296P575L389j905j8720j660J175O481Q37N738
16215A011M795L371k520p667K361n287o911P466r64M199k107p762k193l671m576
16200b0455p63J2153N233j1981P734J6980p505k770J532M982j0502o013k141Q878
16186d638r651j4769j2583k154K3478J1515M282Q393ol059l145J6420J2987r874
$$ y = [20951, 33991, 25573, 16468, 21715, 23762, 25406, 27224, 18626, 7822, 5799, 5625, -1534, -7772, 4515, 11869, 17315, 9647, 3941, 1690, -241, -6112, -9786, -10503, 4685, 3175, -2088, -9665, -10829, -8326, -3355, -15040, -12317, -17879, -13469, -15296, -13043, -9594, -4779, 2169, 10985, 17622, 21048, 12131, 1915, 2900, -405, -19422, -27936, -21800, -25816, -27125, -7806, 6700, 17692, 15592, -1722, -5806, -15793, -16570, -7790, -10195, -1899, 5676, 9065, 7160, -11560, -13220, -12045, -5564, -4727, 1011, 5806, 9177, 6657, -1010, 1351, -3936, -10847, -3381, -4345, -146, -2253, -10015, -12208, -15879, -20455, -21218, -9065, -3832, -15813, -8079, 8901, 1396, -1374, 158, 5140, -5362, -11375, -13516, -4638, -14289, -29058, -41641, -43795, -20317, -8802, -4520, 3873, 3867, 808, -2337, 14083, 27070, 17196]
16172A7196j2945j9822p869j8609J1917R311J6378L759M13o683K676j2850n389
16159b2517n479P236O465p290P752J0283M359m74k752j1385m056L475J867L6l971
16144a6451K790J0581L841R421O558r955j0509j6286j3417l104J0124M588j1060
16131c2879p46J4560M194K675o720o447j253l879J2451J9265J570q86m485j0471
16117a3051j6460j2426J6711R856L081P131j504m239p10N851j978m982m451m746
16103b1917N863O984R864n280k863j162J6393J997j931j0239j0283q620k535J2415
16089a1314k705k653l954R024J5j4598k540J382J7723J0703J2155j2637j0942
16076a0341l200L993K516J0041o694L432j410L175k991j4138J2309R002n659K405
$$ y = [17196, 4251, -15571, -23440, -42049, -30132, -20821, -4443, -684, -271, -6954, -4278, -17128, -22517, -27996, -20760, -14295, -21585, -13833, -3550, 809, 335, -2417, -13802, -17858, -14383, -12516, -12480, -16451, -13661, -3080, 761, 10182, 16740, 6785, -3724, -20010, -33427, -36531, -26407, -21819, -32879, -33625, -19065, -14871, -12196, -18916, -25363, -26616, -30495, -18044, 1221, 2791, 1905, -2580, -13051, -29511, -41937, -25226, -15370, -12289, -5158, -6662, -10901, -11611, -5760, -7738, -12720, -17171, -21917, -16054, -9070, 794, -4486, -7349, -8511, 7882, 9879, 7948, -2291, -12574, -21194, -23729, -11314, -14019, -16672, -20626, -11602, -11587, -26185, -28725, -27343, -9620, 1083, 13238, 601, -10341, -13541, -9548, -7032, 3009, -3685, -253, -1663, 1512, -1479, -15617, -3308, 5694, 35, 2440]
16062B440L46l87N343M670k297n792j499m446J6582r785r615l619P361O033n557
16047b22p902j932J78J8443J3879j7901j6382l181R81p11j3553K7633J8603j2848
16033E085j6846P13M587l685R678n350O762o213K049Q019J5402j3467k0172L94
16019a3044O133j3920O532Q269k976N591M967m606o784j4007p824L541J2499J2629
16005c000L382o067M573J1182R34o784n413j0713j560J0481k272k002l697N49
15991a0407J8832m055K676j4594K336J0739k693m321Q085n519m522l97j2447M93
15977a5794R173K010j0320J2770R563j2979j3646J685K1467Q810m589l999m799
15964f48r220n506O533N443k978N78J501r57j8725p475J4224Q782j996L701k258
$$ y = [2440, 2786, 2399, 7742, 12412, 10115, 4323, 2824, -1622, 14960, 5175, -4440, -8059, -698, 5335, -222, -8124, -10056, -9878, 8565, 22444, 4543, -11839, -15020, -14039, -14750, -28303, -670, 17933, 5085, -11761, -11048, -6461, -10146, -468, -5818, 944, -5269, -3220, 4799, 20201, 6734, -13438, -13044, -6911, -20831, -14299, -6030, -9006, -3415, 1552, -3054, -9838, -23845, -31669, -28128, -15629, -3000, 382, -5685, -1112, 10070, 11004, 4220, -1193, -11906, -13466, -2985, -5257, -7259, -10956, -10407, 8425, 4370, 7046, -7548, -5212, 5527, 2834, -1487, 6598, 1079, -3443, -3840, -16287, -15794, -6621, -4611, -14931, -2161, 7402, -5577, -19223, -17538, 3929, 12739, 8150, 4151, -648, -9868, -15374, -8841, -3398, -6376, -5798, -4297, -5254, -23979, -31454, -17230, -8448, -10444, -6743, -9001]
15949i001M228r00j4042p658L292M590j2321j579P157M410p673k477O906K340
15935b2728p755J2321N871J4745Q430L663J0820o452q345m259K118p158p997N285
15921a441j2099m584R444J4039n699l304Q377m133M414R434j7235j2003l915J9802
15907A097J8065J347p589M772q64o845l50l254j2252j0609l86L949J776j695R349
15892c489J1168j9623j7573q34J5050J6709j2737j0925K822m966q569L720L748
15879b5499L335J2759O697J249j1083n293R327M331J702N178m878j4115O136J5813
15865E659Q459m718j7253j018j347O206R750j1613j5167l590m441o959J2890J0126
15851a3016m908r398k618J0306J5269O346j2314j6053J216j24J013L339q090j190
$$ y = [-9001, -4773, -5673, -19715, -27373, -24081, -19491, -31812, -33391, -26234, -21824, -29497, -31974, -25068, -22728, -30483, -18162, -12291, 2454, 10884, 14547, 25367, 18915, 10570, 6311, 8429, 1271, -6726, -1441, -13540, -18124, -8680, 5359, -340, -3644, 4733, 600, 5014, 14448, -2787, -14790, -18705, 1097, 19162, 20509, 12920, 17692, 16828, 9983, 9633, 6379, -5873, -16482, -16868, -12919, -11143, -12838, -3489, 7679, -11944, -29517, -30351, -15301, 1408, -11329, -22254, -19432, -24398, -32967, -29247, -25499, -22164, -9405, -2708, -1459, -12542, -17835, -8508, -4177, -2475, 2703, -2175, -16290, -10154, 5659, 14118, 9400, -7853, -8871, -10218, -4012, 5738, -5875, -21042, -24632, -29073, -36032, -23142, -13016, -17924, -27322, -29940, -19634, -4365, 1981, -10333, -26386, -25170, -25294, -24281, -20942, -29032, -30222]
15837c0222N922K146J0275L039N567j572k302k314j2953o754q944K206K0042O803
15823i061J6529L692j125m37l853K548J597j7325Q284P931O915j1724j7223J1085
15809b167j0195k883N831j2886P075J1377M359k192q730j0617J1024N828j674
15796e850r793j1894J2189n033N31J1597Q687k0275q681j643P447J8571L797j213
15782a563p470M865N983k164M294j096n225M442j6273o095M172m861M205k351
15768a9137o414Q870j979p269N580j216n451R865j745m680J4250l852k2453l901
15754c9532J0920J435j461j521M182J0508k696l078p413j783J446J3153Q813J913
15740e114j6488Q020J1492P173o052n589k672M555k482l19m736j640J613N169
$$ y = [-30222, -24300, -22154, -11879, -8840, -3273, -4845, -7147, -9461, -22414, -29168, -38112, -35906, -15864, -9061, 7468, 11160, 10035, 9598, 5745, 8293, 9890, -7435, 849, 8780, 15695, 3971, -13252, -2167, -12362, -15245, -9414, -22300, -15225, -3848, 511, -1681, -10411, -21028, -10004, -4176, -5850, -15643, -27537, -15348, -20381, -19850, -8253, 434, -19841, -28522, -30165, -22718, -4147, -350, -1563, -9033, -4168, 1815, -349, 3945, 2849, -2376, 2066, -14207, -20302, -16130, -20991, -16786, -19137, -25551, -16681, -18660, -25929, -20349, -21565, -27016, -17151, -18896, -23576, -9326, -13178, -35631, -39532, -28612, -27177, -28638, -30159, -25977, -15469, -18165, -21243, -28656, -30439, -28993, -15840, -7027, -5114, -21602, -13582, -2090, 5083, -969, -6558, -9230, -4675, -7157, -7476, -12212, -13852, -12239, -7070]
15726g070K114n716j2105J669m710j2197m538m350Q159R061p14J8213O880n851
15712a1155q734j4240J67L945n857j105N862O674R09L20J6142Q850L35J694m814
15697a007p174j107L790j2406k620Q843J4311n130j0880J475J8849j443p964m428
15683f891j651J61L65j540m015l010J631m048J0633N248J180M114J2055q734J847
15668G345R7m120L901l871j3351r140r371Q938Q008k423o843J0089K2943J0309
15654B2511m542j7030o981M00M903k884j1409l264R185j456p019N448J0561L678
15640B101K339m364n916J099j0944n195P611M927O907K591j5962j1197p929J7297
15626a6635P259R27m101j345J384K298j500K186K112q619K750n797k539r35q219
$$ y = [-7070, -4956, -10672, -22777, -21108, -25818, -38015, -42553, -46903, -38744, -29683, -30397, -12184, -5304, -11155, -19889, -34129, -33962, -30017, -35874, -36979, -31117, -24443, -23534, -23214, -7072, 1778, 2113, 3807, -1007, -8181, -9288, -5498, -17904, -20524, -11681, 2630, -2500, -13380, -11905, 6944, 5501, -2463, -6891, -8542, -8381, -8016, -9556, -13571, -16581, -14950, -18998, -8365, -3117, -1937, 2177, 14232, 5498, 7345, 7442, 3322, 7223, 3352, -9999, -19139, -28510, -19572, -11564, -13987, -20830, -10741, 12202, 22511, 17969, 939, -6042, -5642, -739, -3623, -15032, -18296, -9111, -10567, -17586, -12138, -1577, 2101, 4440, 76, -5840, -4741, -15685, -20880, -13269, -8342, -1435, 1156, -14806, -26003, -33932, -16635, -9376, -8449, -12550, -13895, -12511, -10213, -11713, -9527, -7415, -16034, -13284, -19081, -21620, -22555, -30774]
15611c0774j3018J5896N182m904R880J5851O808O720n040k0366j4469J4022j1293
15598b5505k1559R251J1571k006J0025M590l616j842J1316N919r890j2603j019
15585b5368Q555o65l380J771J721j0861o158K646J5198J5201N283j0907m105J1324
15571B55P259j6033p367n778l995r315J385K5862N941n083o298l988K914n820
15557b0061q513Q735O318K601j1167p608J0148J4648j280r497J162m101O021N730
15543f864J349J18N564j7623k1816J2155K5417l264j1712R269J6677N802j571
15530A3501n297j6560J274j878Q278J174N36N639L028l423j3371j1495P75n594
15516b3413R256R203N669L937J2155P347j735m522j2129l592n64o29J4555j4774
$$ y = [-30774, -43792, -27896, -22714, -27618, -17738, -1887, 4921, 11641, 6601, -13765, -28234, -14212, -25505, -47064, -37813, -26242, -28248, -18223, -13633, -17249, -19091, -7775, -1856, -11746, -24349, -25368, -16813, -17478, -20858, -19087, -17366, -28227, -34385, -31739, -16541, -1340, 3943, -6964, -11069, 255, 7514, -8519, -15886, -21664, -25659, -34974, -33589, -7727, -1786, -6869, -13167, -17155, -14241, -20061, -28574, -19839, -13521, -10920, -22087, -29695, -19547, -4899, -6179, -15676, -14514, -18615, -12594, -6864, -5515, -5397, 167, -17456, -39272, -27117, -1700, -4964, -16676, -7407, 9270, 15072, 13501, 8204, -8356, -7082, -8960, -682, 492, 1028, 6667, 9695, 6272, -7099, -18594, -17819, -23413, -14157, -4954, 715, 4652, 16807, 24154, 22419, 17897, 5768, 2176, 1612, 983, 15538, 764]
15502G64j8557Q133M324j011q867j0747J158Q826q390j918n903P820J775P05R107
15487a2781L613R691q892R754K237M983M692r018q552J688N924P515j0920l046
15473c112k137q062O556J940j0144J0134K3084Q22j8832r686k761M365R540K165
15459C872o948j129n230K443J651k823r00L355m800N149M461o098J992m343l109
15444a2457j376j689L240J1684K375p306r617J6420M370K614m130q582p641k80
15430a2375l951J3674J990l833l334j5243m68N480P260O907q326L043O549q69
15416c496j5443j822L175N322J3478O206j0753j1997r280R9J2704K621J1556J4761
15402A7131j7079n553j3575J366O180p815R615J8631J0932k72j2458K417n672
$$ y = [764, -17793, -9660, -5336, -6347, -15214, -25961, -24803, -15977, -24367, -26285, -32188, -24368, -22593, -21888, -12781, -9168, 523, -8369, 1385, 3622, 8605, 13297, 4279, -4273, -2585, 3339, 10854, -66, -3112, -5249, -13311, -6755, -4815, -14959, -4825, 18259, 19081, 249, -9437, -12198, -7833, 1707, 3872, -3076, -4205, -9435, -6992, -5341, -8164, -9064, -5709, -10509, -5360, -899, -6997, -5005, -9348, -12457, -13833, -15522, -12282, -598, 1777, -5529, -15146, 1274, 5644, 8258, 4128, -4454, -12095, -12375, -16326, -2652, -662, -4495, -7829, -23072, -23540, -18060, -10800, -3893, -12219, -9176, -2627, -3496, -18939, -20761, -17586, -12264, 1214, 7420, -3333, -15330, -24610, -24511, -11807, -9186, 2370, 17131, 52, -5501, -19076, -17710, -11530, -19345, -9730, 8901, 19833, 19561, 7103, 9520, 3848]
15389C848o078j493l546j305J0334J6105N509n159j3881n618J206Q63k349j1373
15375a2937n700k084O047L562o412j731J644j9045L308J5618R545K022k017j357
15361i537o954p609J1386P800m966m580q619m962K527R847K376J188p876O689
15347a3290K137P542J418p612j1794J1009L489K595O714J870q672P55L844K209
15333B214R99K831J60j566j3617p663k032P4M408O692L871r55p498L965L369m747
15317i495n085K87K621p74o943n468J472j1273R754K2777J242n589J2952k1997
15303a5519j4042K2647Q385m684p733J4406J0916j6039n263J38l595j1871n408
15290b7662N174j758K24K220l866K031J7843R687M689q77j0256J1121l556j1820
$$ y = [3848, -2230, -3723, -7269, -8574, 1760, 17865, 23374, 18215, 4334, -1284, -78, 785, -1564, -12937, -18637, -20721, -14674, -11112, -17524, -19255, -17611, -36656, -33348, -17730, -8185, -6163, -8180, -9537, -16491, -24100, -12714, -4914, -9880, -14460, -23079, -28041, -25514, -15667, -13291, -12103, -19979, -13290, -11153, -3611, -2193, -9805, -21599, -10590, -7101, -4506, 2208, 4078, -4594, -3839, 5, 2214, 3213, 6044, 6204, 4638, -8979, -16642, -18674, -18600, -14192, -7500, -3629, -4584, -12082, -8117, -4748, -9495, -14580, -14293, -11672, -12446, -19389, -24857, -23385, -34658, -24904, -2127, -885, -6474, 6478, -15519, -29561, -6914, 1471, -3213, -10946, 3460, 14376, -1663, -6926, -6788, -10383, -22254, -27662, -22488, -24246, -24022, -21802, -25668, -23637, -5794, 3893, 8582, 7705, -2551, 8570, 5014, -6806]
15276f806L181l184n341O540R442N005j0573j3030j0634l519K0974J7474j162
15263H367p723q405j514L779K053M553j4646j0571m547L070N548n240P28Q724
15249a5824J7524M65k0866O594J5045q893M111N409J2555k158k771m55J356L618
15235A5710r927l321M046l442l080q877n158k437N992o829r595r59J6337J2445
15221I05J0338j5025j594J729K966J0638k95o744M06j426k320m80L272r765P467
15206G2J6588J3192j4431j2955L315m399R066l534j0585j0508J0005q654J965
15193a0863J4937j57k224l430L533o775m754k091j245m735r269J1501J4727J586
15179G41q291O302p976k51P568N337l520r957R938O76j5708J105l055N234J6383
$$ y = [-6806, -3625, -6809, -12150, -5610, 3832, 8837, -1736, -14766, -25400, -28919, -7945, 9529, 8367, 644, -7761, -9275, -5496, -3443, 1110, -13536, -24107, -28654, -25584, -20036, -25276, -24548, -15824, 1700, 2165, -18701, -12107, 2938, -5955, -1844, 3565, 16120, 13962, 11191, 10736, 12092, 15710, 5783, 2462, 6508, 3066, -14, -8891, -14049, -16486, -10494, -17323, -26918, -27877, -11540, 905, 11243, -3782, -5376, -3647, -681, 9957, 9662, 2918, 3324, 1898, -422, -902, 2370, -7395, 72, 16660, 29852, 15421, 2466, 5781, 1382, 10448, 6914, -3671, -14179, -4174, -12828, -10863, 4074, 3917, 1693, -1737, 1796, -4979, -9733, -11824, -13069, -17804, -27073, -15572, -845, 741, -7550, -1248, -9224, -9475, -1907, 3430, -90, -10047, -109, 567, -15141, -14036, -17091, -11857, 4526]
15164D526Q158q982m848k681l33L573j4772m647L415l891p891J1841J6345k153
15150b340p427K805N393M849N523p100M111P966o822J200Q702J2327m174k194
15136B2819l810k676o795o68j4045r355K320J5435O084j612q221l119n669p835
15122a7147P07j0514n131M907R039J719p145k164K8407K3286j4338j9368n743
15109a3485j1832Q372J6709r422J541J2584J258n395R974j559N795K568L139m814
15095A5433n101j466o692j0020j8507J1815J1508p650j4323n605K1993J5079o042
15082D22M184r559l370l00p387j3086K0865J6278j1621o990K887k586j102O361
15068e004N073n402j3187J544N634R783M749l086J82k2871O624O834j0584m173
$$ y = [4526, 12684, 3702, -1146, -3827, -4160, -587, -15359, -20006, -16591, -20482, -28373, -16532, -187, -2340, -9767, -6962, -1569, 3280, 8803, 1703, 5814, 13780, 6958, 8158, 16860, 29187, 25013, 22819, 19009, 16333, 9538, 8870, -5175, -14530, -12210, 3225, 9309, 7697, -524, -3643, -9312, -17147, -16440, -26954, -32085, -27178, -18139, -16420, -23565, -25729, 2678, 25964, 11626, -7742, -13485, -25317, -16945, -236, -9658, -8117, 4467, 5725, 330, 10304, 8745, 14540, 17108, 20247, 15433, 10332, 8866, 2174, -7846, -26353, -14538, -3030, -10680, -25003, -30608, -8615, 6464, 422, 4606, -4953, -8323, -8623, -16010, -29096, -8231, 8047, -3574, -10564, -7677, -10263, -11365, -5004, 69, -5333, -18520, -16976, -11342, -1559, 3190, 104, 286, -22585, -15961, -9127, -19711, -23884]
15054b3884L097J1779j3561l872J734L411M802q812Q213K0398J4890j7446k708
15041a959J580j413R021P118m882o486O186P52m504J676O464j2440l013J0361
15027H461r138q890m429J116O345J1831R790k180r629o722M152O823Q664j0306
15013E888j816j2893m150J1149j850M523m20j9279q835P751R205J6449J7950M710
14999B8382L716k5351j8901l578q418k426J8087J9578J2110j3569r636k0523n001
14986b5530J3236R795J152R222j575l407m718l910N491R295L924j0073L212p724
14972a610J5548Q92j4031m867L09K458J9098j0682j2212n433L277J1097Q090m528
14958G406p06n019p088l972P434J8043r922m264K644p368k1623k040R648l404
$$ y = [-23884, -20787, -9008, -22569, -26441, -24707, -21296, -16494, -25306, -17093, 3305, 18195, 749, -1959, -379, -1792, 7229, 14347, 9465, 2979, 9165, 9917, 5413, 7089, 13553, 1113, -1900, 8461, -677, -9567, -13996, -12880, -6535, 5296, 15086, 12906, 3277, -3445, 707, 7530, 16194, 5888, 4072, -8821, -12971, -1822, -3672, 851, 431, -18848, -27683, -19932, -10727, 5722, 23672, 28382, 32098, 6747, -12154, -15732, -24150, -26576, -8489, 11089, 23199, 9630, -6, -20529, -25530, -12294, -2499, -1347, 7875, 6300, 2893, -1825, -5735, -244, 9051, 12975, 2902, 6114, -1610, 13938, 14830, 799, -4068, -3759, -1301, 17797, 7115, -5097, -10530, -7253, 3844, 11934, 7406, 6700, 1681, -5407, -9379, -1945, 16098, 6176, 1912, 4556, -2812, -24435, -26475, -16827, -20231]
14944b0231n14R516J318L5o562r109J103L724J2177j280L484J766Q127L960L385
14929A0899k642n194L27j1736N098K223k703o827l257q333J3935O861r53Q425
14915F123N158q195j575k883P79m571p108O010Q495L019j2590R61K323m760m71
14900i285L102J611J6349n047K619j601L962o394Q18q90j7255l408O273q365j1414
14885b8925l48q098p137J4784J997p191P678m627K291K1568O708l212N737L497
14871D722R399j785q538j9812j1337p66j546J3998J6434M304m51l80j0159p864
14857a3781J0220l706r792r843K264J5280O775O59l309R602R636j065n063j449
14843F428Q039J525k159p819j7462O551O672o417n767L813M058L838j0596n121
$$ y = [-20231, -20745, -11229, -9911, -9876, -16438, -25547, -24444, -20720, -8543, -9823, -6339, -4573, 3554, 7514, 10899, 8257, 3063, 3390, -8346, -3248, -1025, -3728, -10555, -13812, -22145, -8210, -1349, -2302, 6123, 11281, 3086, 1511, -1372, -593, -5164, -12272, -6262, 2233, 5252, -7338, -6377, -4054, -8814, -9285, -6183, -4572, 11777, 6730, 9349, 7748, 11710, 5316, 6134, 5244, -12011, -15419, -9146, -17511, -28925, -29273, -37371, -44508, -29724, -27727, -34918, -27240, -31867, -29576, -8008, -1300, -4512, 1225, 4722, 14121, 12336, 3798, -16014, -27351, -28117, -29663, -15665, 769, 5073, 4622, 4242, -5917, -13781, -3561, -7267, -17059, -26902, -24638, -9358, -2583, -1924, -5233, 4369, 14005, 12940, 7877, 6428, 14467, 15992, 13833, 6014, -11448, -4897, 1775, -4642, -10409, -6596, -2538, 1300, -9296, -14417]
14829a4417J0606J5259j3225l986m58m638m102P116K03l824O217n605J868O301
14815b685J0549P67j5822n039J5088N769M0L193N389J251j4352j410R15K425J002
14800G080L77n99p166n532j0792R376J1430J17O993j5492p354J9316J2494l772
14786A6476O108L61l182k1065m266J4341m314k384N648J945N210l676m709n82
14772E911k843k4752q653J4474J2212J2327L309j598l125k835r93n971K95K679
14758D37m640K726M151J704M963K449j1969j0335j0687j4273J149M820N253J5886
14744h366k834r932M659J1785K189M925j2764n614J0883Q278N189o410j3605k852
14730a4469J7952J3466M562j1053M265J951q61j2161M194L807o030j444o078L354
$$ y = [-14417, -3811, 11448, -1777, -5763, -6221, -10859, -14961, -7845, -7642, -11466, -5249, -10854, -8986, -2685, 7864, 8631, -7191, -12230, 2858, 8627, 8667, 11860, 17249, 18500, 4148, 2738, 3653, 6078, 7080, 7457, 6858, -308, -5840, -16632, -7256, 4174, 4291, 11284, -4208, -11562, 7754, 20248, 16476, 22584, 22945, 19763, -1302, -5568, 8773, 4459, 2075, 7723, 9668, 14878, 11202, 6493, 5911, 3068, -21684, -30337, -15863, -3651, 8676, 11985, 10387, 7262, 4427, 3434, -2537, -2242, 437, -4203, -1477, 2674, 4378, 9341, 11790, -179, -10514, -21201, -35474, -34325, -29505, -24252, -8366, -11200, -21132, -16473, -4688, -2499, 2426, -10338, -15952, -5069, 3209, 8398, 1988, -11617, -14469, 3483, 16949, 21511, 10458, 14723, 16674, 15813, 3652, 7846, 11653, 5623, 4179, -1899, 1455]
14716A455j975N187K148J2084j780K13p599j1661o746K972J8805O967j6983o679
14702c592R517o705j098p576L618K765N100L57o45q092j4637n211R872p56P367
14687i716M128K296J323m982Q039L428j4432l077J0957M403p246j5306J3132J7099
14673A0046o765j2239m874n365j490O25n790Q723P080J403R841J3627J673J752
14659A8247M229o801q892J0221m052p649J0025N462j2111o856L861J837J449J581
14645A0551K845r059q11r750j219J0811j0983n765k312K0375K690k421L84o016
14631f80p33n423p71n582L655p152Q529J4376N34M083k546J693J392O797q35p185
14615A0152r761L509n981j1104o310O621Q565N475n07o869r76N511J439J2258
$$ y = [1455, -520, 4667, 6815, 18899, 17119, 17332, 9733, -1928, -8674, -5702, 13103, 20070, 3087, -3592, 5925, -780, -1878, -9454, -5836, -3071, 2029, 2386, 1741, -6351, -20988, -26199, -16327, -17083, -9716, -5588, -3292, -1969, -6951, 1088, 4516, -9916, -12993, -2036, 2367, -4879, -20185, -7053, 10046, 3281, -8958, -13832, -19197, -20687, -20062, -25852, -17129, -10049, -8646, 1195, 14822, 16495, 18247, 22476, 15675, 6783, 17004, 12952, 5303, 15328, 20790, 8679, 1823, 5684, 7521, 8970, 10551, 13396, 4337, 3526, -6224, -7443, 3368, -7615, -13380, -15692, 4683, 7373, 4952, 5336, -680, -1413, -6836, -7607, -13189, -9534, -16686, -8157, 6219, 6753, 10836, 8290, 9983, 11375, 18172, 17337, 10152, 391, 3900, -2081, -13185, -19495, -12874, -4309, 1166, 659, -6210, -7186, -1675, -236, 12022]
14601A2022j0166j7624l114J1006p08L832J925M471m278j6613j427Q180J1342
14588a152J2976J493j0077l208R175k931J416M392m142p129K156Q272M614o736
14574I119n517K763j4102M814K77o593q342L133J1529R10p425L789K044O148J6179
14559A8726n15m921j0407r316q93J320J0351J6403p820k650j0869K102O162N183
14545A2856r711j0033k70R748p81R827Q35J847J0621j501R594o149j3490k1238
14531g845j0647P825M191J4375J3852K825l1j2265m153q048q761o149n726J0287
14517a0270O012L691n538n778j402R543J5954n772j1271J0262P734q703k654Q880
14503A0688l60o381K607l965M72J150j12k57j1938J0104N549r180j9n209j8281
$$ y = [12022, 1856, -15768, -18882, -7876, -8584, -4752, -2827, 1644, -2634, -19247, -20674, -12494, -1152, 11824, 13317, 3240, 32, 9207, 6276, 7692, 12084, 7942, 813, 2969, 11241, 15855, 9119, 3602, 6365, -7737, -2923, -2646, -9239, -17581, -14448, -2919, -2009, -9434, -5645, -3601, 2547, 18726, 18211, 13290, 2883, -6433, -7326, -6006, 4345, 20748, 12928, 10278, -591, 1511, 7673, 12856, 3145, -6888, -7158, 2590, 1809, 11636, 12471, 14318, 24939, 23438, 33032, 26883, 13393, -7845, -18492, -10667, -6476, 7899, 21751, 24576, 24545, 12280, 8127, 79, -8682, -14831, -20557, -10270, -4258, -567, -6105, -11883, -13285, -3742, 12212, 6440, -4831, 5431, 13165, 4462, 1808, 10688, 10328, 3947, 6554, 2589, 3061, 4211, 4099, 3842, -8096, 2008, 7557, -1623, -1642, -6851, -25132]
14488b5132K7009K1400p958m638p215j2323Q445o563K31M309L83J42P573N868
14474A1531M40j903j0442n759M905n331K295j473r366K825K4702P605p471j4598
14460b040n793K637m559p409Q772J807n353R606J1189K295m475J817K332j3181
14446b355j689P975P179L94m290p914r597M299K0232K768p190j3172o894L345
14432f909P365N45R122P566n439l429j2389n957Q79j0521k8538J530K0305K1421
14418d449J4471k741j1798K923K518L155J582L481L555J0944J978n87l384j3007
14404H641o249J172L051K599J3515N355m760n258n502o18j2497l776k199o159
14390a2685L514n525l60J594O489J1797m084J951R65J90L982J1852L120p553o358
$$ y = [-25132, 1877, 23277, 15319, 10681, 3466, -8857, -412, -6975, -6744, -2435, -2052, -1910, 5663, 11531, 11971, 10068, -374, -6133, -1228, -6559, -4264, -5737, -15103, -12278, 12424, 20029, 12558, -2040, -7833, -5196, -9755, -17164, -8392, -6585, -11938, -2332, 8857, 11152, 6677, 8494, 10826, -2355, -4044, 3931, 11110, 11504, 7214, -700, -10297, -5998, 14234, 17002, 9812, -3360, -10254, -6909, 456, 1001, 10123, 17689, 12250, 8821, -3568, -9525, -8646, -19167, -47705, -46175, -25870, -4449, 10022, 7281, -4517, -1594, 924, 4079, 5661, 9142, 12697, 23641, 25619, 25032, 21648, 8641, 2392, 3564, 6615, 9214, 22729, 28084, 23324, 18066, 12564, 11946, -551, -4327, -6526, -12685, -9171, -14696, -15056, -13462, -6973, 4824, 740, 2691, 3656, 3846, 7828, 19680, 22800, 15247, 8889]
14375H889p634J919l935n963K253M707l359L140o775m129P144q386L489J8601
14361I961J9880r463j9497l77l716j438Q45m85R510n373k163j2268K87J1166l210
14346f341J2141J1299j125j2196n122j1340P012K3111O887j7054r664K1559k503
14333A6664j8894l419L353M513P993q694j1203O189J0812p977J5955j0234j5335
14320a0277Q454K304l007k117Q448N771m721r648p175L156J6311J5901j2650r260
14306A490K6n200J2321J5983j176N411j1567k599O435j965N914L196m157n799
14292A8313M543p599q990K491J3680m139j7556k639J0956J3999Q455Q0j3103j0679
14278G812l405j0027k41K280J841N884L127o529l114j4416J0805O324M543j108
$$ y = [8889, 1255, 3174, -761, -6724, -4471, 236, -3123, 17, -6758, -10887, -3743, -12129, -8640, 9961, 29841, 20378, 881, 504, -3212, -4650, -3805, -4290, 5220, -153, -2316, -14584, -14297, -3131, -6341, 5800, 17099, 15974, 3778, -1344, -12684, -5672, 17439, 24326, 7272, -2392, 19167, 16664, -2230, -5649, -2296, 2217, 10210, 1516, -9687, -3498, 7314, -663, 15292, 5058, -10277, -1823, 481, -2526, -4643, 3805, 9576, 4855, -4793, -11968, -8812, 7499, 23400, 10750, 1490, 1516, -3684, 8637, 24620, 23444, 28855, 17288, 14689, 21124, 19159, 25073, 28269, 24112, 18313, 22856, 15257, 6267, 8758, 22438, 18299, 743, -1896, 9060, 23059, 31514, 31594, 18491, 7812, 4407, -5620, -5861, -3581, -1740, 4144, 7271, 742, -2372, -16788, -5983, 341, 4884, 3776]
14264C776r329M184P901O14n556K385l602J5304Q447p048k7851j2043j81j638
14250b4637N531J9455J267k203P691n8N505K901R161k373j711j1842j1377O773
14236D083K898M461J100k1400j0873Q497R153Q96R707O361q158k304J377j2215
14222f417j3881p194L675O085J584M095J0578q98n346j636J976R274p991k379
14208h475J4445O039o364k569L918O415K041L969J125K810j0882K75j6829q465
14194a2547Q319P742j0749r79M498M158J0216k196j0259j583l931O565J2221J1163
14180B2638n931m466J4121p353j1375K588O03L124J2788m950q08j2634j565j0165
14166c385n902L784j5625O322P802n7n310J5169N645N662P744l455j3132k719
$$ y = [3776, -5553, -1369, 6532, 7146, 1590, 3975, 373, 15677, 24124, 17076, -10775, -22818, -22999, -24637, -19106, 349, 1616, -587, 7104, 7046, 12551, 15452, 24613, 22240, 20529, 8687, -2690, 4083, 6981, 11442, 12542, -8858, -19731, -11234, -2081, -1185, 8522, 14883, 6725, 4421, 5798, -6417, -20298, -27492, -23817, -17732, -16148, -12053, -1475, -2373, -7719, -9355, -7379, 1895, -6096, -8475, 5970, 12009, 5645, 3076, 6994, 13409, 15450, 19419, 20544, 23354, 12472, 12747, -4082, -12547, -4228, 3514, -7235, -8214, -3716, 442, 10658, 8462, -1797, -3380, -7311, -746, 11475, 22638, 16707, 12241, 26362, 19009, 7634, 10222, 10825, 13949, 26737, 21787, 20979, 8345, 6780, -3385, -9287, -5503, -21128, -14806, -7004, -7061, -12371, 2798, 8443, 14105, 21849, 18394, 5262, 2543]
14152B543j1261l916K594J1870k902K353k839O15J5019K690j608o027J3644j524
14138B1251q589j078J0791Q77J241p787q547p38P222m660k234M419p197l773p055
14123e857O524J2143k116j6335k288p22r019N900L63M727p554L699P235p641O353
14108d588Q609J505k343j1778l146R312P500j642L467L841l296j1517r73n628
14094a0677Q079p474L441k20M022J1500l788K564q081R37O61M74L821L789P147
14079A6195j0907O05j055M429R055J81n343r788J026Q601K477J078N608n573k2287
14064e698j6869P182K17P92n446n866N451M472p811J4174J8542j047J0351j158
14050A7286K213K772O687J1008J373n304n386J919r214l170j9943k70k15J3306
$$ y = [2543, -8718, -12634, -10040, 1830, -1072, 1281, -1558, -943, 14076, 16766, 15158, 9131, 22775, 21251, 12662, 11584, 22375, 23252, 24493, 16706, 8159, 7421, 14643, 9983, 7749, 12168, 4971, 1198, -5857, 667, 12810, 10694, -5641, -7929, -8651, -17670, -11770, -11407, -6680, -14234, -10535, -3300, -10941, -4588, 4021, 5526, 3183, -8595, -11741, -2429, 5071, 3429, 6896, 10737, 7441, -4076, -5049, -10677, -2598, -10072, -6631, -6851, -2829, 8671, 4883, 7447, -634, 303, 964, 1438, 5259, 9048, 16195, 5288, 5893, 4838, 9267, 18322, 18503, 13160, 3372, 4398, 12999, 15476, 16554, 22162, 16589, -5698, -22567, -15385, -15168, -14376, -19822, -25688, -20237, -15765, -23576, -9402, 9140, 8093, 18444, 17286, 19499, 22271, 28958, 39966, 41339, 36035, 30649, 32568, 23354, 20184, 241, -29, -244, 13062]
14036A3062k571k1488q462P29K459L252M118l920K1865J2990r794j4697r469N292
14022f634l470j7065M361R706N100K4341j912L400k679q492Q664r433j022M996
14008I861M650j3798n847J3520L071m395L0R723j2031j2527r362m548M005J2500
13994e148J3027P455Q021k832j9088Q06K4345O594j477m324k075m134k397r53
13980A7820o468j1431j987J309O615R682O175j5693j3173J0676J9254J4493j2275
13967B4997j8215k830l579L445L484K598N045J567O799j0908j855O10k323k4925
13953a6090O221J8072j4196R885J242j9493P718J6179O114q922j2216J774n878
13940i590P708Q958N983n513k509K481q473J980q025j72J2309L500p137l4Q11
$$ y = [13062, 10491, -10997, -19459, -18730, -16271, -13019, -8901, -12821, 9044, 22034, 12240, -2457, -11926, -6634, -10104, -27169, -22808, -13102, -8002, 16339, 14427, 17827, 15148, 6656, 15320, 5887, 4865, 9861, 14511, 713, -5134, 8386, 11457, 7062, 7092, 16815, 4784, -7743, -17105, -21653, -17648, -5148, 7879, 15334, 23355, 20523, 1435, 2241, 26586, 33180, 31703, 27379, 25304, 21170, 18773, 17820, 11352, -79, -2066, -757, 5858, 15540, 21715, 6022, -7151, 3525, 22779, 37272, 24997, 6782, 3952, 373, 3818, 7302, 9900, 14945, 16512, 23311, 12403, 10548, 11158, 8835, -16090, -9869, 8203, -5993, 3892, 5134, -14359, -6641, 9538, 15652, 6730, -5486, -3712, -9590, -1882, 7076, 13059, 7546, 5037, 7518, -955, 1025, -7000, -7172, 5137, 8637, 1500, 1466, 2277]
13925B277p828n367M764K063K1456J7535Q345q021j1794j274J2147o519l302M132
13911B8614j2958j9393M543J6727O160n802J2907p891j3401N52P073m302J22J3070
13897B6021M260p907k3662k186P090J4878k499k823O60n549R06j983k712m573
13883g9n75Q288J905N748j521J1466o7l651q692p028l55j216n844J0172P139L653
13867A9343j2340O35P378n736j3601o475J7589J6767k602K500k790L664L209q711
13853A8830r683P100l55p540j0726J520Q508J3636n855n642l034k337J3544Q857
13839B6823m641j4678p287J6094J3028j7453q553M769Q48q669O392m310n59j961
13825a57l931K104K397J712L894Q912Q162k012m825J995n962j0107o592q301J406
$$ y = [2277, -5551, -10918, -6154, -4091, 17365, 34900, 43245, 35224, 23430, 22156, 34303, 27784, 24482, 28614, 15656, -3737, 806, 17533, 23693, 17891, 30798, 22907, 9506, 10058, 17131, 12829, 12951, 26021, 30281, 22374, -1288, -3474, 3616, 18494, 15995, 13172, 13832, 8283, 9189, 7206, 4494, -79, -654, 7634, 9539, 15287, 13766, 25232, 25165, 21514, 12822, 5794, 5439, 4223, -1621, 8551, 15690, 19343, 7003, 7638, 15016, 9280, -4321, -10796, 6793, 23560, 20958, 23458, 20668, 24332, 27541, 18830, 9147, 16247, 15892, 8352, -2374, -854, 7654, 21290, 15435, 9793, 6759, 4422, 17966, 26823, 22182, 7504, 217, 16311, 29339, 11886, 3333, 8102, 8950, 281, 6673, 2363, 1804, -157, -4088, -1984, 413, 2125, 6019, 14931, 23093, 21081, 16256, 18251, 12289, 2182, -4410, -12711, -11305]
13810a1305J5197N314O323K964Q482j263j0550k187N297q628j0156n841L682P795
13796E124N993Q456K638L766j3089j4377M24J3405R199O613j0583j0750L19r335
13782b197K316J5387M578J843M299N398o88l896j4673J408K518r81J635K875L373
13767B3195Q341J1528K233q884j1710P943j837j64o715m280j0j323O756N615p385
13752B3303L89K917j407j4400o326m161L304L433j099O666P167O578j0303K240
13738A8301N48j314n769K206J135k127J4783J1712k209k2179j8429L541r80M08
13724c73P539J858N821n493q262K131m810M699M456m961J2742J0877k926j0627
13710A2671o354J6205J2978l39j4853q997J3534J130j3656q320J4156J0202K714
$$ y = [-11305, 3892, 9206, 15529, 18493, 26975, 25712, 15162, 12975, 18272, 9644, -512, -6353, -2671, 5124, 11117, 19573, 22211, 25977, 12888, -1489, -1065, 12340, 21539, 28152, 17569, 6819, 7138, -2197, 119, 15506, 20084, 21927, 26226, 31624, 30936, 27040, 12367, 13775, 16293, 15312, 16947, 19822, 23195, 31536, 43064, 45297, 36413, 24703, 32646, 30809, 30645, 23930, 19650, 19640, 18317, 25073, 30688, 23303, 23692, 26609, 25202, 10802, 4476, 315, 3619, 7052, 5953, 12619, 19786, 26364, 16061, 18301, 18849, 17535, 11766, 13972, 15107, 12980, 27763, 39475, 37266, 15087, -3342, 199, -781, -373, 7166, 9024, 14845, 9352, 1090, 3221, -1589, 3110, 7566, 2605, 15347, 26224, 23298, 12671, 6317, 22522, 35500, 35161, 20308, 11311, 24845, 25975, 12319, 3999, 18155, 28357, 31071]
13697C1071N501J997n768N525K529q229o857K893K883O502q190N146k718k146
13683C0139l995O730j1056o016p322M629k96o893j7223R540K484J2683Q908j2106
13669A0206j7875K182M295L575P519O534l495j1247N932O742l842K470N438J0370
13655B8804j675p423p519k983P022J9654N370l737q408K986N750j1311l432N852
13641B8950l185m844r93j0569j3308m011l710J7529J2850M139P000q398J127O253
13627B8830j133O879k538m958j640j1942R117j6182L011N105O773p193q401Q41
13613F569J0784L43K836j564J844J018o2M63J0811M888Q28L615r951j5833M970
13598B1559O981j8j2133J3457J5950l025j2514L32K061j0997p449N64K386O354
$$ y = [31071, 36572, 38569, 32801, 38326, 40855, 32626, 25769, 28662, 31545, 38047, 29857, 35003, 32285, 30139, 26144, 32874, 21818, 15802, 8480, 13109, 12813, 5920, -11303, -1763, 721, 13404, 22312, 10206, -7669, -5487, -1192, 2383, 9902, 16436, 12941, 1694, 7626, 14368, 10526, 12996, 18434, 28804, 27129, 19706, 12187, 9204, 16226, 35880, 41250, 37513, 29105, 32091, 37841, 26530, 23098, 28950, 25765, 20921, 19928, 9359, -3949, -7960, -11670, 5859, 18709, 22848, 29848, 21450, 22577, 28830, 27697, 34576, 32038, 27080, 25440, 13498, 22615, 6433, 9444, 14549, 21322, 14129, 5728, 6569, 17353, 17696, 20532, 18968, 20812, 21830, 21768, 22231, 33042, 37930, 38758, 42373, 32422, 16589, 21559, 28540, 28522, 16389, 29846, 45796, 42771, 30257, 30589, 32650, 21653, 14204, 14768, 17154, 23508]
13584B3508j4265r467J1330N92m222Q401J3802M55k467r18M536J3114J4696j5843
13570D3252r923J327K104l831n393n123J3770P0l173N568r394n840J2554M794
13556D0762j2092J925L983K88K958O638N70p31o660M954J875k567m235j2364n354
13541A9950K444j943n468P655J7186L604j0203l925J5630J130Q70j2951k2422
13528A1557N32J750k373J5128L703O734N415L229j191n517O7K328k145j0105m174
13513B4938P290k869K905l598j4214j0418M039M167P604N962k477L976l837O093
13499B9561L489M011p1j4227k403q60N132n598J705m40J3414Q443j900p729o666
13484B5861n613k691J1171P285j1131k838L727k624J110Q778O702q386K195k283
$$ y = [23508, 9243, -224, 11106, 11698, 7476, 15877, 29679, 30134, 27667, 26749, 31285, 44399, 59095, 43252, 33329, 34656, 36760, 32929, 27536, 22413, 36183, 36253, 33080, 38648, 29254, 23414, 35968, 40762, 28670, 30595, 34578, 34866, 37824, 44462, 45032, 44301, 37641, 42595, 44470, 41903, 37668, 25304, 19950, 22394, 20451, 14983, 22638, 39824, 43428, 33225, 29300, 44930, 46060, 46930, 33979, 11557, 12089, 13839, 11466, 26594, 30297, 37031, 42446, 45675, 44484, 38967, 39034, 41362, 39217, 29112, 24938, 32228, 29359, 32264, 28666, 14452, 4034, 8073, 12240, 19844, 25806, 23329, 27305, 23468, 29561, 33050, 37061, 36990, 22763, 20360, 19500, 24632, 19034, 20739, 20299, 33713, 42156, 40256, 32527, 25861, 20248, 17557, 28728, 36013, 24882, 22044, 25771, 23147, 24257, 33035, 39737, 31351, 33546, 31263]
13470C1263j6336K924J192k1302k533J3561R376Q120J0207k0348j7484J1324J042
13457A1006j835j774J4541J0091r015k162K323J046J0181J8135J2255J1711q255
13444F8248j8165o997j4045l052N932n168M679J783J329M622j0165r133m732q788
13430F348K0612P871K248q374j107o662P28Q250J0529J334r361K513k214J091
13416C3806J0310J712p831j0390M092O270J21j705M306p048M752m201n190M015
13402C3019O567p475q440L117q998J382K3599P908P1o63q583j2907j514N478P022
13387C9583R412j02l755o684n79m350O39j779k107P50Q114P059l850j6163K742
13372B8930J3828n668k103j1798J621j1060k386J2285J2808n384j1469J6659M666
$$ y = [31263, 14927, 17851, 19043, -2259, -4792, 8769, 18145, 26265, 36472, 16124, -1360, 9964, 11006, 9171, 7397, 21938, 32029, 23014, 20852, 23175, 24221, 34402, 52537, 64792, 76503, 68248, 50083, 43086, 29041, 25989, 31921, 26753, 31432, 33215, 34544, 39166, 29001, 19868, 15136, 6348, 26960, 34831, 37079, 28705, 27598, 20936, 21664, 29914, 40443, 41777, 32416, 34929, 32715, 33806, 44116, 45828, 37997, 27607, 31699, 37969, 38090, 36385, 40691, 33643, 38395, 34194, 29004, 33019, 39586, 32111, 23671, 26788, 17790, 19172, 42771, 50679, 50750, 50087, 41504, 28597, 27083, 32561, 39583, 48995, 48893, 45138, 38454, 37875, 33525, 34164, 32385, 30278, 31028, 39142, 46201, 42351, 26188, 28930, 42758, 37090, 34987, 23189, 24810, 13750, 11364, 23649, 36457, 31073, 19604, 36263, 40929]
13359D0929o35p321L104r869J127M15L503Q933m233p488J4532J7678k994j1395
13345D6286r603o078L668J0860j5305Q304N095o660L348Q458j0028p960M995K630
13331C8010n851n517j0864N240N634P923J1653P151l426p464P32J1784O371p695
13317E3681p357Q20J2222N173K001j6496p901R902K243P423p683k134J5111j1852
13303E5153j3541k222m354J5214n932l866j8884l16J5662M244R542J3377j7585
13290D6492r015q24R95J4228R163p026M160l533M603M183r806J674L222r148L970
13275E3338O068J4m165j4566j1177j2549P348R13J3435K1651r200Q359J575j6030
13261D5014o501M004m321q374J737J6105M968p872l129j5476j2040P592J923J3529
$$ y = [40929, 40294, 32973, 36077, 26208, 27335, 27750, 31253, 40186, 35953, 28465, 42997, 60675, 57681, 46286, 36683, 30605, 34273, 45133, 29828, 38132, 43227, 36567, 39915, 48373, 38345, 30385, 35380, 38010, 32159, 26642, 15778, 21018, 26652, 34575, 46228, 53379, 49953, 42489, 43221, 55005, 61376, 53681, 46324, 47144, 59366, 64539, 66540, 50044, 42143, 52045, 54288, 61711, 54028, 51894, 67005, 55153, 41612, 39390, 35036, 50250, 44318, 40452, 21568, 21252, 36914, 41158, 50700, 64077, 46492, 37477, 36653, 37648, 51876, 61039, 54013, 58173, 54640, 59243, 63426, 53620, 55294, 58516, 49368, 53338, 59406, 59420, 55255, 40689, 29512, 16963, 24311, 25224, 38659, 60310, 51110, 59469, 61044, 45014, 38513, 42517, 38196, 29822, 31559, 47664, 52632, 44760, 41631, 26155, 14115, 21707, 23630, 37159]
13247C7159J2155M97j2083j0954k241Q415J197P794J1450J0947j184n71m216j0067
13233D8298K990p690k550Q701k74n199P246M540J394J5836K669p362q979L831
13219F3451n747j7199p316n065m083Q574M802J0594K843j6757M852K633J54N957
13205D7693n25k803q422n804j237R496M570m11Q321K568l23P50m765O793J1157
13190F7058L359o223K675p698j3186M779K3729J156k4689O330J3298L146k127
13177G1607j7864j0618M796n056P094K926k534m116O321j023n772m009L129J1471
13163E6352m455J3464J6495k042k239k3322j4465m210q014j471Q388L673j0139
13150B8015J1602J0235n761J3251J0536o619r03P716P072L79o990m541k101N333
$$ y = [37159, 49314, 49811, 37728, 26774, 24533, 32948, 34145, 41939, 53389, 64336, 63152, 62581, 58365, 48298, 51288, 43598, 41048, 49749, 49475, 44276, 51522, 56062, 57456, 73292, 75961, 68599, 59620, 63451, 57704, 40505, 33189, 28124, 24041, 32615, 37417, 48011, 50854, 34097, 38949, 41582, 41736, 47693, 47168, 44365, 35943, 30139, 28902, 38398, 42968, 42557, 50878, 53446, 53123, 53873, 49108, 55901, 67058, 70417, 64194, 66869, 59171, 45985, 50764, 74493, 75649, 50960, 57290, 70588, 73734, 71607, 53743, 43125, 47921, 42865, 49959, 52885, 50351, 46235, 52556, 51533, 45761, 41752, 44881, 56352, 51897, 65361, 81856, 79814, 77575, 54253, 39788, 35578, 27564, 26093, 34481, 38154, 28015, 39617, 49852, 44091, 57342, 67878, 61259, 60356, 68072, 75144, 75523, 68533, 63992, 61891, 67224]
13136F7224m344m739L157J251j0243K396M11o580J2196J906P63K637O294m314
13122F8015O340p37P127l190j170m778O371O607m103p898R221P565j2641j8960
13108E7769p052m8K83O32N472j0806J3720J2894q161M567q534k428J0342k742
13094F5908j2967K774p203n992Q368r624O94N240k300l501P734J907r931r496
13080C1611L467J8022N725Q431J47j1564j5566J3727J0612R847r02q506k561J246
13066F3736o822R10p91N508M803P696J0035l095j4718j366L571q526o081p01P2
13051E4231q635K678P817O607L566m673l129J199k835J3519O612M44k007O56Q209
13036H4259l258n246p277r156k714L393P905J9473q540p275j0762K720J2317M544
$$ y = [67224, 62880, 58141, 61298, 62549, 52306, 54702, 55113, 48533, 60729, 62635, 63398, 66035, 72329, 68015, 74355, 73618, 80745, 77555, 76385, 71607, 77978, 84585, 80482, 72584, 81805, 89370, 76729, 57769, 50717, 50669, 50952, 51584, 57056, 46250, 59970, 72864, 64703, 69270, 60736, 58308, 68650, 65908, 52941, 55715, 48512, 42520, 50888, 41264, 41958, 47198, 44898, 41397, 49131, 51038, 41107, 31611, 35078, 53100, 58825, 67256, 67403, 55839, 40273, 54000, 64612, 74459, 73557, 65051, 62490, 63736, 56914, 57824, 57033, 62541, 67344, 75040, 85075, 81980, 67262, 65896, 69467, 60941, 54860, 54159, 54231, 45596, 48274, 56091, 62698, 66264, 61591, 58462, 59661, 56826, 70345, 76957, 77401, 75394, 76050, 84259, 81001, 75755, 68478, 59322, 56608, 60001, 67906, 87379, 78839, 71564, 60802, 63522, 75839, 80383]
13022H0383q236k057J339j1135j724K176K712L419J1547P963J325j6137j428R716
13008G9863k655o549J1048J806K707m991j1129J4732J5035J2989K3818K5060K80
12995A62014j4851r356j7215m884j5318M021k394j221K826Q064o023l054N91n199
12981I8001j266R975J864r854l462j4926J378o46K405J2499J53P98N648n447j0027
12966H7093m386P355J61M861k05l143r0o007p33q622l615Q645J1454n163M511
12951I2116j147N38j125k503n429n9l363j1634J0556P979l854P77N722j979m260
12936H2335j2360n034J6293j58k509Q298L119L417J2227n143m712j858k479J905
12922I3341K340l340j1800l039P150J1235m527j2588R605J0102R895o915m671
$$ y = [80383, 72147, 70090, 71429, 60294, 58570, 60746, 63458, 66877, 78424, 86387, 87712, 71575, 70147, 79863, 77208, 70659, 81707, 83513, 86220, 81229, 70100, 84832, 99867, 112856, 136674, 161734, 162014, 147163, 137807, 120592, 115708, 100390, 104411, 102017, 100796, 103622, 111686, 105663, 102609, 103200, 98001, 96735, 106710, 108574, 98720, 95258, 80332, 81710, 81064, 83469, 95968, 96121, 96919, 102567, 97120, 87093, 82707, 90062, 90223, 95084, 94879, 91736, 91646, 85639, 84906, 76284, 72669, 81314, 92768, 87605, 92116, 90969, 91507, 90382, 87879, 82450, 82391, 79028, 67394, 77950, 85929, 82075, 82852, 88574, 86595, 82335, 69975, 64941, 81234, 81076, 78567, 86865, 89984, 93401, 105628, 100485, 95773, 93915, 91436, 93341, 95681, 92341, 80541, 77502, 84652, 95887, 91360, 78772, 88377, 98479, 108374, 101459, 96788]
12909I6788j5189M568M575Q107Q75o03l905j5457j2451J6157J5522J7510K183
12896A18680r93j4187j4345m827n218p98J45L038p77p391R32L0247N356j0007
12882I9855o481o19N450m116j290R723k3758N365J5091p81O637K22q337J4386
12868A11347J5444O576q02n642P568J2104K956j9747r797o482n427J797J3136
12855A23031J1389m932j628o306l955p909j5501J457M134q889q488n704M192o557
12841G4334J5420N559M85K221K626R489L914J637N902K56N294j4506K027k960
12827A11698j169K398m071M557Q0O479P138J557n544j7415j5239R587J0045P498
12813A17599J256R385p329q354n943j6911P727N779R781o765N697o31l157o05
$$ y = [96788, 81599, 86167, 90742, 98849, 99724, 99121, 95216, 79759, 67308, 83465, 98987, 116497, 118680, 117687, 103500, 89155, 84328, 79110, 78312, 78457, 81495, 80718, 73327, 74259, 104506, 109862, 99855, 93374, 92755, 98205, 94089, 92799, 102522, 78764, 84129, 99220, 98439, 105076, 105298, 96961, 111347, 126791, 133367, 132565, 126923, 134491, 146595, 149551, 129804, 120007, 113525, 108098, 109895, 123031, 134420, 129488, 127860, 121554, 117599, 109690, 94189, 95646, 99780, 90891, 82403, 76699, 80891, 74334, 89754, 95313, 95798, 98019, 100645, 110134, 114048, 115685, 121587, 121843, 127137, 112631, 114658, 111698, 110529, 112927, 108856, 113413, 113493, 119972, 127110, 128667, 123123, 105708, 90469, 100056, 110101, 117599, 118855, 128240, 120911, 112557, 106614, 89703, 97430, 103209, 112990, 106225, 111922, 111291, 108134, 107529]
12799A07529N690O586L836P535Q4j5437j6257J1709M641L721j363j1645j2851
12786I3778j202J5871J6484O427q623j1067L687J2762j686m690L610q08N71J323
12772A26437K461J377n522K259L444L19J809k366L053J0843Q992j3230j2741j0778
12758A16357j7422q170J810J0937K1718O112m290M446J3496P496q8j8805j2429
12745A21168O619M682J942l775J632j0442p404L613K0227J2201p705j3491M468
12732A33735L545o088r512n551m73O744J3817J0093L043R645J659J035K155R013
12718A72860k201J2119N564n630j9470j8021r291j4782J026J3290J0522J7129
12706A63115J3631o582k1138K117L078m906P641K540R756J4084J7364J6613j568
$$ y = [107529, 113219, 119805, 123641, 131176, 131260, 115823, 99566, 111275, 115916, 119637, 118274, 106629, 93778, 92576, 108447, 124931, 131358, 122735, 111668, 115355, 128117, 126431, 121741, 125351, 124543, 125114, 126437, 128898, 130275, 124753, 127012, 130456, 130775, 132584, 130218, 133271, 144114, 153106, 139876, 127135, 116357, 98935, 90765, 92575, 103512, 125230, 131342, 127052, 131498, 144994, 152490, 152402, 133597, 121168, 127787, 132469, 134411, 130636, 132268, 121826, 114422, 118035, 138262, 150463, 142758, 129267, 133735, 137280, 131192, 121680, 116129, 115656, 122400, 136217, 146310, 149353, 158998, 160657, 161692, 163847, 172860, 170659, 182778, 188342, 182712, 163242, 145221, 135930, 121148, 122174, 135464, 145986, 163115, 176746, 170164, 149026, 151143, 154221, 149315, 156956, 159496, 169252, 183336, 200700, 217313, 215745]
12693B15745K287N083J7920L0050K6978R930J7800L5453M1311N8730Q9405J49135
12681F99827K02005L09970L87428L61164J72786j14839l18160l69179l20023k21216
12671G89763j49184r4775p1201o3773n9488k1471j9135j9401k1952j7323j1545
12660B40515k5152j2520P03m42J1695N887q186q474o558J659j1231j1255R748
12647A86389O20j282L60j562o830k1209q952O618Q037K1543q6O197m09j0072r415
12632A69947J2180K6338R994q331p315q858j2749L04Q782m558j970K279J0971
12619A97014r430j4915k451R765k9Q403J1871r596k184N00M637j3198j4432j955
12605A64000R057K3356J492m061J1370J0098k170j2021j0510k272j763L174J952
$$ y = [215745, 218032, 223115, 241035, 271085, 298063, 307993, 325793, 361246, 402557, 461287, 550692, 699827, 901832, 1211802, 1599230, 1960394, 2133180, 2018341, 1700181, 1331002, 1010979, 789763, 640579, 545804, 474603, 410830, 351342, 329871, 310736, 291335, 269383, 252060, 240515, 215363, 202843, 203546, 203104, 214799, 220686, 212500, 204026, 197468, 199127, 187896, 176641, 186389, 187009, 185727, 186087, 184525, 177695, 156486, 147534, 154152, 162189, 183732, 183646, 189843, 189434, 179362, 169947, 182127, 208465, 218459, 210128, 202813, 193955, 181206, 181510, 190292, 185734, 183764, 186043, 197014, 187584, 172669, 170218, 179983, 179954, 188357, 200228, 190632, 188448, 188948, 193585, 180387, 165955, 164000, 173057, 196413, 197905, 193844, 205214, 215312, 213142, 201121, 190611, 188339, 186576, 189750, 191702]
12592A91702M217k326J5152P02n246p03O631K406N016M38r840r288l489P404J0219
12577B12995q44p337O625j71j6233q543O31J4109K4849J5402k0136j6063N638
12564B10922J1478m28J0753n164p470k057Q031M882p921L36Q471l248j7149j3085
12550A98351O228Q687j345O47R656J2431k608J1239m270j8917r95J654n92J3167
12536B33333l854l120K614m13L476j5244j7712Q474O150K501J0067L23o094N880
12522B26381J4909J4881R042Q583R857N446K4200L8827L4632K2945J0374J6843
12510D36920j684j1460j7383j0724l4468k4768j4601k0914n247n83r804j0390
12498B74894r333j0052j0440K384R548n2j911j2958l154P513M538K30J4268J1529
$$ y = [191702, 195919, 193593, 208745, 209447, 204201, 203498, 210129, 212535, 217551, 217989, 208149, 198861, 195372, 202776, 212995, 212151, 204814, 211439, 211268, 195035, 186492, 187123, 201232, 226081, 241483, 221347, 205284, 210922, 222400, 221972, 232725, 227561, 220091, 218034, 226065, 230947, 223026, 223362, 231833, 228585, 211436, 198351, 204579, 213266, 211921, 212568, 222224, 234655, 232047, 243286, 239016, 220099, 219104, 220758, 220166, 233333, 229479, 226359, 228973, 228560, 232036, 216792, 199080, 207554, 213704, 216205, 226272, 226595, 220501, 226381, 241290, 256171, 265213, 273796, 283653, 289099, 313299, 352126, 386758, 409703, 420077, 436920, 435236, 423776, 406393, 395669, 361201, 336433, 321832, 300918, 295671, 295088, 285284, 274894, 265561, 255509, 245069, 247453, 257001, 256949, 255038, 242080, 238926, 246439, 250977, 251207, 265475, 277004]
12484B77004Q83L181n158j135K0403N672k7367o117K1476M262k2499L559J0214
12471B84378K3916R428M826P421K3389L0518K5834J0438L8908N0685M8370O6361
12459F24472O3646M8063J8917k0778l2140n6577o3739n0677m0268k6050l2253
12448D32616l0966k0324j7593Q510l650m161j5798j1083q422m730P324m625l56
12435C26742Q37K075L185q877q50j448j1963m287l83O787O261p37j5687L692J3029
12420C18376r437j188J3014q45o717J7168O308J6255O270J7162J5848J4912J6138
12407D23264K5806M6529M1803J1964r729j2224j2445l3693l3748k9847j9947k613
12395C95120j1086j7814j335k405k828q308m975M180L557j0686l199K36j4570
$$ y = [277004, 277887, 281068, 275910, 274775, 295178, 300850, 273483, 267366, 288842, 293104, 270605, 274164, 284378, 308294, 317722, 322548, 329969, 353358, 383876, 409710, 420148, 459056, 509741, 558111, 624472, 688118, 736181, 755098, 734320, 702180, 645603, 581864, 531187, 490919, 464869, 432616, 401650, 381326, 363733, 372243, 368593, 364432, 348634, 337551, 329129, 324399, 331723, 327098, 326742, 327579, 329654, 332839, 323962, 323112, 321664, 309701, 305414, 305031, 311818, 318079, 317342, 301655, 305347, 318376, 308939, 307751, 320765, 319920, 313203, 330371, 336679, 352934, 359204, 376366, 392214, 407126, 423264, 449070, 495599, 537402, 549366, 539637, 527413, 514968, 481275, 447527, 417680, 397733, 395120, 384034, 366220, 364885, 362480, 359652, 351344, 346369, 350549, 354106, 343420, 340221, 340457, 325887]
12382C25887j963l008m302N554N365n209Q678J1419j5722j7490j752p006J3537
12369C13988J8742J8507J3206o915o771J9846j566j0001n462r524k835N29n236
12356C36508J0048J3774m119o487p419K193J7998K106K280m189m58L277L866Q073
12342C77451j351N050M058j105j1332L593J7051J6054l435o374j1288q970Q238
12329C87640P301J4014K6814K1388J3209O545K974j9812j6017j6654J802j1935
12317D17269j0181j5962p697R094K08k338L169N090J1O706m157n934P275q113
12303C94440o458r222j3009R734N161K2178l753k3173J3812J5397p280p887L099
12290C93039J6733P654n623o12J1415O691J830J1136K2079O505p275n400N070
$$ y = [325887, 323924, 320916, 316614, 322168, 327533, 322324, 331002, 342421, 326699, 309209, 307457, 300451, 313988, 332730, 351237, 364443, 357528, 350757, 370603, 369037, 359036, 353574, 344050, 341215, 341744, 336508, 346556, 360330, 356211, 349724, 342305, 344498, 362496, 364602, 366882, 362693, 362235, 365512, 369378, 377451, 376100, 381150, 385208, 384103, 372771, 376364, 393415, 409469, 406034, 399660, 388372, 379402, 387640, 394941, 408955, 435769, 457157, 470366, 476911, 479885, 460073, 444056, 427402, 429204, 417269, 407088, 391126, 383429, 392523, 392731, 390393, 393562, 398652, 398663, 405369, 401212, 395278, 402553, 394440, 387982, 378760, 365751, 375485, 380646, 402824, 399071, 375898, 389710, 405107, 397827, 389940, 393039, 409772, 417426, 411803, 411191, 422606, 429297, 431127, 442263, 464342, 470847, 463572, 458172, 463242]
12277D63242L924Q188J3318N580L803J8306J0828k3124k8972L057P584j592K698
12264D86840m192J992j1501k2553j0293j0717p159j6839L151q44J52P29J1672
12251D20438j158p403k96M634J2047J197j269k1470m694J5126N513J2794K290
12238D37749r356L889M791J6222O777p250j458J3596O539P446k536J294J9101
12225D96804J3582j3245K742Q210Q804L566m378J2137l620j7996p609l72j169
12212D97456r623N259R252K6019L666o456j5426j2356j2204J799K2136Q542j6137
12199E01927j4654j0333M470J1460j650j7770m175j1950J294Q754J2800J786j6120
12186D65839m957J9657J8036J4638P650k153K5018J9685J8888J4158n399r930
$$ y = [463242, 467166, 475354, 488672, 494252, 498055, 516361, 527189, 504065, 475093, 478150, 485734, 484142, 486840, 482648, 484640, 473139, 450586, 440293, 429576, 422417, 405578, 408729, 407885, 408037, 408766, 420438, 419280, 411877, 411581, 416215, 428262, 429459, 428190, 406720, 402026, 417152, 422665, 435459, 437749, 428393, 432282, 437073, 453295, 460072, 452822, 451364, 464960, 471499, 478945, 476409, 477703, 496804, 510386, 497141, 499883, 508093, 516897, 520463, 516085, 528222, 524602, 506606, 498997, 498625, 497456, 487833, 493092, 502344, 528363, 532029, 525573, 510147, 497791, 485587, 487386, 509522, 518064, 501927, 487273, 476940, 481410, 492870, 491220, 473450, 469275, 457325, 458619, 467373, 480173, 481959, 465839, 460882, 480539, 498575, 513213, 520863, 518710, 543728, 563413, 582301, 596459, 591060, 581130]
12174E81130r234j2527j6357j1291j4729N776L554J5982P964k323N412P754q836
12161E52275L227K589J6025J0075k831Q001J3484J7931M183R129J399N01p251
12148F28737K820O977J1264q70k906j691o539j4109j6659o414n091J3520K1198
12135F30237J0329L956K062O312M264Q429J2446k915J684L360o059J9868J6974
12122G10947O977K3228M727J1805K1445R847N809J5022J5447J3410K7257L7768
12110I03689K7710J1272J4492M4238K6297K4357M2881L1061M9191M9929M4705
12099A269822N0701N8700P7084Q6430P8697Q9318R5085J18966J40377J69455J89217
12088B423852K11502K81112L40970M13229N21236O44787P82720R58022J194836
$$ y = [581130, 571896, 559369, 543012, 531721, 516992, 522768, 526322, 542304, 550268, 547945, 553357, 561111, 552275, 555502, 558091, 574116, 584191, 581360, 589361, 602845, 620776, 624959, 634088, 635487, 635988, 628737, 631557, 638534, 649798, 648928, 646022, 644331, 637792, 623683, 607024, 600610, 595519, 609039, 630237, 640566, 644522, 646584, 652896, 657160, 665589, 678035, 675120, 676804, 680164, 674105, 693973, 710947, 717924, 741152, 745879, 757684, 779129, 788976, 794785, 809807, 825254, 838664, 865921, 903689, 931399, 942671, 957163, 1001401, 1027698, 1052055, 1094936, 1125997, 1175188, 1225117, 1269822, 1320523, 1379223, 1456307, 1542737, 1621434, 1710752, 1805837, 1924803, 2065180, 2234635, 2423852, 2635354, 2916466, 3257436, 3670665, 4191901, 4836688, 5619408, 6577430, 7772266]
12079G772266J582995K149334K943222M003103N163060N923290N601403L963848
12071C9102521J716948j94796j643293k961830m137758m703302m542929l872634
12063A8762927l007744k255250j660174j268424j091056j036780r57790p97239
12055F688470o43691n17389m07158l10931k52646k01965j58854j13061o8441j9436
12045C994898J1159M4422R2851J38220J31991J03732J15911J68422K51029L15684
12035E368319M02831N06407O58774Q27405J006675J228625J515066J895283K408918
12026A5818303L136922M132906N542333P418802R519221J1370733J2304331J1796411
12018H1039962R602592N327733n12900n191127p604203r990592j2352246j2562490
$$ y = [7772266, 9355261, 11504595, 14447817, 18450920, 23613980, 29537270, 35138673, 39102521, 40819469, 40624673, 38981380, 36019550, 31881792, 27178490, 22635561, 18762927, 15755183, 13499933, 11839759, 10571335, 9480279, 8443499, 7485709, 6688470, 6044779, 5527390, 5120232, 4809301, 4556655, 4354690, 4195836, 4082775, 4014334, 3994898, 4006057, 4050479, 4143330, 4281550, 4413541, 4517273, 4633184, 4801606, 5052635, 5368319, 5771150, 6277557, 6936331, 7763736, 8770411, 9999036, 11514102, 13409385, 15818303, 18955225, 23088131, 28630464, 36049266, 45568487, 56939220, 69243551, 81039962, 90642554, 95970287, 95457387, 90266260, 82662057, 72671465, 60319219, 47756729]
12010D7756729j0643124p964184n665003m056709k979639k268177j782877j442051
12002A0954965j189480r61974p27487n17763l70668l34702m34091n14423m75018
11993E429359l70814k71981j86346j29327q7375m9197l930L2835M5070J05329
11983D513623J47618J93588K64260L43183M34279N48426O97454Q46555J056678
11974I045664J362151J717637K190465K758743L475373M557921O030965P521854
11966C8660773Q152987P014098M046176L62461k995177n646744p236769p503914
11958C4853891o700155n421099m112873l026673k214581j677129j465590j403119
11950H832672j245642j031418q29842o62063n33375m31557l70398l21832k72211
$$ y = [47756729, 37113605, 29149421, 23484418, 19427709, 16448070, 14179893, 12397016, 10954965, 9765485, 8803511, 8076024, 7558261, 7187593, 6852891, 6418800, 5904377, 5429359, 5058545, 4786564, 4600218, 4470891, 4383516, 4334319, 4330389, 4363224, 4408294, 4513623, 4661241, 4854829, 5119089, 5462272, 5896551, 6444977, 7142431, 7988986, 9045664, 10407815, 12125452, 14315917, 17074660, 20550033, 25107954, 31138919, 38660773, 46813760, 53827858, 57874034, 58236495, 55241318, 49594574, 42357805, 34853891, 28153736, 22732637, 18619764, 15593091, 13378510, 11701381, 10235791, 8832672, 7587030, 6555612, 5725770, 5063707, 4530332, 4098775, 3728377, 3406545, 3134334]
11941C134334k21305k10002j81343j74188j50913j24741j15903r1114q9252q6065
11931A689508o9343o3859m9580m6823l2362m0795l8419l0193k9167k2743k1807
11920A244417l8129j8714k5616j4856k9351n086M77m916M086K1817N4142N8829
11908A247100J1737n3759q2653o0060l7000k9912l0925l0172j9642J3764L273
11897I31751j220n528p450k103r621j7538j9195j1026k2742j5655L661l338k3947
11884G96049l0847p172n147r977o111m043p942j9040K003J829J1355Q202R236
11871G38395j549j947j889j1196N141L182M646J4871K1353L3742J8443M099k4644
11858H02647m7740m4075j1927q231p814r764r360P390j075j3857q746m767J0000
$$ y = [3134334, 2913029, 2703027, 2521684, 2347496, 2196583, 2071842, 1955939, 1864825, 1775573, 1689508, 1620165, 1556306, 1506726, 1459903, 1427541, 1386746, 1348327, 1318134, 1288967, 1266224, 1244417, 1206288, 1187574, 1161958, 1147102, 1117751, 1112665, 1113142, 1108226, 1112312, 1134129, 1188271, 1247100, 1258837, 1205078, 1122425, 1062365, 1025365, 995453, 964528, 934356, 914714, 928478, 931751, 930531, 925003, 917553, 915450, 905829, 888291, 869096, 858070, 835328, 819673, 823334, 819996, 796049, 765202, 758030, 752883, 742906, 736795, 732752, 724810, 705770, 707773, 709602, 720957, 729159, 738395, 736846, 734899, 733010, 721814, 726955, 730137, 734783, 749654, 771007, 804749, 823192, 827291, 802647, 754907, 710832, 698905, 690674, 682860, 673096, 663736, 671126, 670051, 656194, 647448, 642681, 652681]
11845F52681K0166J7636n734j803q961j7307n442n453p30N955j2333m447j3723
11832F20505n952j804N306P102r937j2139m504j1064j6913m577m771M135J841
11819E67228q175m144O94J2230O318M793o101j4128q729r542j1896Q630J008j0785
11805E27401k1173N201O256o983J1927J2075q033j036o604k605q643L027Q479
11792E19289mM153P409l038l121j892j771J56m425J0375M653k830k758k2905j6288
11777D87003k730O68n026r446R673R442J881O883o4Q988P065o483j676J2322j0033
11762E08467L090k122o451j0445o890j5998q856N151Q49k803m114j6113P393K1496
11748D72654j34J37o98J3889j1718M518J3490r568p775R276O404J0557N287j229
$$ y = [652681, 672847, 690483, 684749, 682946, 673985, 656678, 651236, 645783, 645053, 651008, 638675, 634228, 620505, 614553, 612749, 618055, 625157, 615220, 603081, 598577, 587513, 570600, 566023, 561252, 565387, 567228, 559053, 554909, 555603, 567833, 574151, 578944, 572843, 558715, 549986, 540444, 528548, 537178, 538186, 527401, 506228, 511429, 517685, 510702, 522629, 534704, 526671, 525635, 519031, 516426, 507783, 510810, 519289, 519285, 523438, 530847, 527809, 524688, 522796, 521025, 521181, 516756, 527131, 531784, 528954, 526196, 503291, 487003, 484273, 484941, 479915, 470469, 480142, 489584, 491465, 498348, 498284, 507272, 514337, 507854, 506178, 518500, 508467, 511557, 509435, 502984, 492539, 485649, 469651, 460795, 465946, 466795, 463992, 459878, 443765, 451158, 472654, 472520, 472657, 471959, 485848, 474130, 478648, 492138, 482570, 474795, 484071, 490475, 501032, 506319, 505090]
11734E05090n02K1495J9581n799K3497J2521p077j877N102O743Q730K4776J3189
11721F25469p99L481O95O12o131L934j3671q644k4804j0674j4992j255k1778j6961
11707E14482m555j7977j7709j663k808L286q007m81j0366n057P263M684j879j4139
11693D45074J0626J4423K108l99n374J1613l341Q591l30j313J0606J0635J87P594
11679E10700K1762L1898J9245m61j295J1499J3303K1712O024r975J0627K3320
11667F58359N408j7843j3700q455l981l529p308o901q154k6964j4679j3631k1834
11654E16788j3717p557j4112k3259j1595J037N112j1307n839K155O822n941j9945
11641D18642j5752J1086P506j912J1308J8659M486J3023J5426Q38J6443L0274
$$ y = [505090, 504588, 526083, 545664, 539865, 563362, 575883, 568806, 566929, 572031, 578774, 587504, 612280, 625469, 624670, 628151, 628846, 629458, 623327, 627261, 613590, 604946, 580142, 569468, 554476, 553221, 531443, 514482, 509927, 491950, 474241, 472578, 469770, 473056, 465049, 464568, 454202, 449145, 456408, 461092, 459213, 445074, 455700, 470123, 472231, 471832, 466458, 478071, 474730, 483321, 482991, 481678, 492284, 502919, 503106, 510700, 532462, 564360, 583605, 583144, 581849, 593348, 606651, 628363, 634387, 624412, 635039, 658359, 663767, 645924, 632224, 623769, 619788, 616259, 608951, 602050, 593896, 566932, 552253, 538622, 516788, 503071, 495514, 481402, 458143, 446548, 447585, 452697, 441390, 435551, 437706, 444528, 438587, 418642, 402890, 413976, 421482, 419570, 430878, 449537, 454023, 467046, 482472, 483310, 499753, 530027]
11629E30027K3814Q813P341R451p410q036L299J738q47L628m002o157N913j3324
11615E54248j7956l897j8854l344L400p73o350j7134k411l581j611j2672j4972
11602D54093j2425p737k123J630L261j1815j561L613M054J3143O684k204j0170
11589D38443R60r321j888P576K6670Q809N629K0025J7876J7538J5860J1644Q895
11576E68716P255J4303N307J0368J5071K0877J7544K4835K4377P926j543j3391
11564G01645l3663m3423m9157l8076k5082k3852j6353p439q474l933j7162r976
11552D25055o101p096q297R48J3307k389m064q447p835p78o152k810o586p523
11538C71232Q242O552p819j134N923R125M452L666J1423K6289J3817R346J3364
$$ y = [530027, 553841, 562654, 569995, 579446, 572036, 564000, 567299, 569037, 568190, 571818, 567816, 561659, 567572, 554248, 536292, 532395, 513541, 510197, 513597, 512824, 506474, 489340, 486929, 483348, 481737, 469065, 454093, 441668, 433931, 431808, 433438, 436699, 424884, 423323, 426936, 430990, 444133, 450817, 448613, 438443, 439403, 430082, 428194, 435770, 462440, 471249, 476878, 496903, 514779, 532317, 548177, 559821, 568716, 575971, 590274, 595581, 605949, 621020, 641897, 659441, 684276, 708653, 716579, 715036, 701645, 667982, 624559, 575402, 537326, 512244, 488392, 472039, 464600, 456126, 452193, 435031, 425055, 418954, 411858, 403561, 404509, 417816, 415427, 411363, 402916, 395081, 394303, 388151, 385341, 378755, 371232, 379474, 386026, 378207, 377073, 382996, 392121, 396573, 400239, 411662, 437951, 451768, 461114, 474478]
11525D74478J9184J7535K6465J9175K6731J4087j336Q668j045Q699K794j351j5694
11512E98390k1560j3197l3672l3613k0532q941p936j4846j1455k5110j0330N55
11500C97753n903l615j0220p105o965n567m385m777q613l912P022l260j5456q639
11486C16358J4693J2588q98j3961r454R612J777L006l762M565J3147J289l754
11473C45206j235o33L704O790J5110K5128K0368K722m402J7799O556Q917K2395
11460D68425K0865L6604M8657K3945K2756N0099R6055J36138J84979K78956L78905
11449A746384M25232L13357L3199k43985m14899l92469l02239k15178j52892r7309
11439F99201o3797k8946k8101l7257k0140k5877l2858l740q572j3699k5738j5773
$$ y = [474478, 493662, 511197, 537662, 556837, 583568, 597655, 596319, 604987, 603942, 612641, 615435, 614084, 598390, 576830, 563633, 529961, 496348, 475816, 466875, 458939, 444093, 432638, 407528, 397198, 397753, 391850, 388235, 378015, 370910, 363945, 358378, 353993, 349216, 340603, 336691, 343713, 340453, 324997, 316358, 331051, 343639, 342741, 328780, 319326, 328938, 330715, 333721, 329959, 334524, 347671, 348960, 345206, 343971, 343338, 347042, 353832, 368942, 394070, 414438, 417160, 412758, 430557, 437113, 446030, 468425, 489290, 525894, 574551, 598496, 621252, 671351, 767406, 903544, 1088523, 1367479, 1746384, 2171616, 2484973, 2518172, 2274187, 1859288, 1466819, 1164580, 949402, 796510, 699201, 635404, 606458, 578357, 541100, 520960, 495083, 462225, 458485, 449913, 436214, 410476, 394703]
11427C94703j3590j4999O377J7607n472j4275JO295J3991O1Q388L209J3529K1535
11413D37360L170O482J3628J0978J1622l763o068m929L550Q222J723q274J294
11400D74995r704j5462r310j2070j0348J480j0585l820p508N759J0753J7412J6761
11387D48353M681P885k355N280N39M07J5900L181n868j426j12j398J3456O094
11373D94617m116j5467j1895j017K1900J3781O241M424K378r31O977O131Q988
11360E32011M498R075J5263K2780K4788K1034R67J2775J7262K1678J6000J9023
11348G17154K9866L7241L1539L1015L4797K3411K9995L7067N4562O7345N4363
11337A148355N8867Q0175P0913Q7717R0580R4510J19853J40827J53460J68622
$$ y = [394703, 381113, 366114, 372491, 390098, 384626, 370351, 370352, 376647, 390638, 390699, 399087, 402296, 415825, 437360, 440530, 447012, 460640, 471618, 483240, 479477, 473409, 468480, 472030, 480252, 481975, 473701, 474995, 465291, 449829, 440519, 428449, 418101, 419581, 408996, 405176, 397668, 403427, 414180, 431592, 448353, 453034, 460919, 458564, 463844, 464383, 464790, 480690, 483871, 478003, 476577, 476465, 475067, 488523, 494617, 490501, 475034, 463139, 462122, 484022, 497803, 504044, 508468, 510846, 509915, 516892, 523023, 532011, 536509, 545584, 560847, 583627, 608415, 629449, 630416, 643191, 660453, 682131, 698131, 717154, 747020, 784261, 815800, 846815, 881612, 905023, 935018, 972085, 1026647, 1093992, 1148355, 1207222, 1287397, 1358310, 1446027, 1536607, 1631117, 1750970, 1891797, 2045257, 2213879]
11327B213879J90735K13668K58909L02593L53598M28189N16501O32606P85509
11318E896187R95610J254755J589777J990538K388327K746562K988982L082317
11310B2933055L001086K764953K395611J940449J434938R70684N65650J77284
11302C6183710k19392o55701j137916j633804k082818k491756k794783k941967
11294B2225573k949880k779463k412789j999025j614289j277889j017236q15543
11286G359459o41486n16317m11092l14172k39723j85228j44327r3884l9272L515
11276D777473O2855J15621J51521K29295L17062L80990M58207N71207P20989R14406
11266H699626J185119J542697K023113K606077L223406L793480M301002M778555
$$ y = [2213879, 2404614, 2618282, 2877191, 3179784, 3533382, 3961571, 4478072, 5110678, 5896187, 6891797, 8146552, 9736329, 11726867, 14115194, 16861756, 19850738, 22933055, 25934141, 28699094, 31094705, 33035154, 34470092, 35440776, 36006426, 36183710, 35964318, 35308617, 34170701, 32536897, 30454079, 27962323, 25167540, 22225573, 19275693, 16496230, 14083441, 12084416, 10470127, 9192238, 8175002, 7359459, 6717973, 6201656, 5790564, 5476392, 5236669, 5051441, 4907114, 4813230, 4773958, 4777473, 4840328, 4955949, 5107470, 5336765, 5653827, 6034817, 6493024, 7064231, 7785220, 8699626, 9884745, 11427442, 13450555, 16056632, 19280038, 23073518, 27374520, 32153075]
11258C2153075N095284N160479M909998M447695L775318K973550K129301J300478
11250F1945178M38260m58185j368592k278867l147806l850257m374112m760529
11242D2145090m997252n000396m728268m199704l579668k960531k393005j912742
11234A2373524j528888j240491j007956q18363p02356n84265m83145l91385l08489
11225E308186k55611k08368j55522r7578o1592l5977K3751Q7832J62552K13555
11215D981228K73322L60120M80743N81525P09893R11288J138693J358660J569990
11206A2365462J746198J893736J994966K065433K021571J869966J603615J263920
11198B6824867Q98993M99201Q0884l37758p82273j216857j590564j876754k056193
$$ y = [32153075, 37248359, 42408838, 47318836, 51766531, 55541849, 58515399, 60644700, 61945178, 62383438, 61925253, 60556661, 58277794, 55129988, 51279731, 46905619, 42145090, 37147838, 32147442, 27419174, 23219470, 19639802, 16679271, 14286266, 12373524, 10844636, 9604145, 8596189, 7777826, 7075470, 6491205, 6008060, 5616675, 5308186, 5052575, 4844207, 4688685, 4591107, 4529515, 4493538, 4517289, 4605121, 4767673, 4981228, 5254550, 5614670, 6095413, 6676938, 7386831, 8298119, 9436812, 10795472, 12365462, 14111660, 16005396, 18000362, 20065795, 22087366, 23957332, 25560947, 26824867, 27723860, 28223061, 28303945, 27966187, 27183914, 25967057, 24376493, 22499739, 20443546]
11189B0443546k132868k149143k132730k034343j823575j568404j290051j025073
11181F287359q06535o49968n38727m59790l81507l20507k70769k39405k18860
11172B401291j89147j53479j39063j27513j07777j08662o8293o7278q5175n5176
11162A299728m6506l2636k8303j4018k1973j2470j1545j1373k6640j7622J7005
11151A093647L8231K2125j2351p5141j32127j37834j07124o6083o674L034Q509
11140F28212M600l749J664n094j684K031p422j0938k450j112J2344K2842J1180
11127F50424Q74J2774n4p754q837l503k021L258R905k418j7383j5714q005N124
11113F16670m65J0516P408M55J9324J2449J0695m869q153M683J8553p840j3273
$$ y = [20443546, 18310678, 16161535, 14028805, 11994462, 10170887, 8602483, 7312432, 6287359, 5480824, 4830856, 4292129, 3832339, 3450832, 3130325, 2859556, 2620151, 2401291, 2212144, 2058665, 1919602, 1792089, 1684312, 1575650, 1507357, 1440079, 1354904, 1299728, 1253222, 1220586, 1192283, 1178265, 1156292, 1143822, 1132277, 1120904, 1094264, 1076642, 1093647, 1131878, 1154003, 1141652, 1066511, 934384, 796550, 689426, 623343, 616669, 619703, 628212, 632812, 629063, 630727, 625633, 623949, 625980, 618558, 607620, 605170, 604058, 616402, 639244, 650424, 651298, 664072, 664018, 656264, 647427, 643924, 641903, 645161, 655066, 652648, 635265, 619551, 611546, 616670, 616205, 626721, 634129, 634584, 653908, 666357, 677052, 672183, 664030, 668713, 687266, 679426, 666153]
11100F66153J1176K0931J5574K1121J5485J3738O385K4986M0354K9010J2885P559
11088H85357K299K426J3443K3942L0000K9723L0568K2689K4212J3718K3211J0404
11076A111992j986K4125J6271Q974J7457L7737K9698L8577O0784O4066Q4909R3334
11064A585938Q5000Q6996P2320Q3853R8922J01204J00866J08121J36098J56191
11054B615509J60231J69410J97265K30663K58020K88905L38734L49461L68143
11045D976341L79641M42890N41307O53930P93690R90797J208963J476318J821460
11036A3285337K259807K775530L293283L787144M342275N208459O861457R847028
11028E1660320J4949969K3410762L7144720N7149040P9181809Q9852474O8953854
$$ y = [666153, 677329, 698260, 713834, 734955, 750440, 764178, 770563, 795549, 835903, 864913, 877798, 885357, 887656, 890082, 903525, 927467, 957467, 987190, 1017758, 1040447, 1064659, 1078377, 1101588, 1111992, 1110006, 1134131, 1150402, 1159376, 1176833, 1214570, 1244268, 1282845, 1343629, 1407695, 1492604, 1585938, 1670938, 1757934, 1830254, 1914107, 2013029, 2114233, 2215099, 2323220, 2459318, 2615509, 2775740, 2945150, 3142415, 3373078, 3631098, 3920003, 4258737, 4608198, 4976341, 5355982, 5798872, 6340179, 6994109, 7787799, 8778596, 9987559, 11463877, 13285337, 15545144, 18320674, 21613957, 25401101, 29743376, 34951835, 41813292, 51660320, 66610289, 90021051, 127165771, 184314811, 263496620, 353349094, 422302948]
11021D22302948J5074858m4906993q1570422q3146813o5527266m5013898k9502177
11014H7710237j9372474j3002232r015605o621970n269268m510433m008837l548026
11006B2361392l063080k562824k092628j722000j417110j186088j023578q93410
10998H400674q06601p22172o17745n22655m32671l67730l29054k96280k76485
10989D029281k49801k20812j95611j79152j78044j45394j45868j38662j09127
10980B466810r1080q2042o5531n5861o2396l9296m9929o2544o2551q2537q2164
10969A730879p0494p3044p7943o3288n8922o9852o2950m7244k6407j2319J013
10958A169429l907j7626k1858P021M4089Q6921J20436Q2980N63k4165Qr259q6208
$$ y = [422302948, 437377806, 392470813, 310900391, 227753578, 162226312, 117212414, 87710237, 68337763, 55335531, 46319926, 39697956, 34428688, 29918255, 25909418, 22361392, 19298312, 16735488, 14642860, 12920860, 11503750, 10317662, 9294084, 8400674, 7594073, 6871901, 6254156, 5731501, 5298830, 4931100, 4602046, 4305766, 4029281, 3779480, 3558668, 3363057, 3183905, 3005861, 2860467, 2714599, 2575937, 2466810, 2375730, 2293688, 2228157, 2172296, 2109900, 2070604, 2020675, 1958131, 1895580, 1813043, 1730879, 1660385, 1587341, 1509398, 1446110, 1387188, 1317336, 1254386, 1207142, 1180735, 1168416, 1169429, 1165522, 1147896, 1126038, 1133059, 1177148, 1264069, 1384505, 1467485, 1468048, 1443883, 1443891, 1434632, 1348424]
10945A348424j44998j40138r8450n7799m5682n3956m4119k5218k3833r707q956
10934F95568o057k759n031r112p808p841j0299j1776j7546k5356j6975k654M113
10921E76467N615P759l627j0062o431Q622Oj2207M63Q899K1005M851m978J2881
10907F09263j0742j0253M777L3435K5455L3693M4736N6878M2665j9177o6705j01424
10895F42601q8889m1981J0694K7403N320k183j7515k4800j5086Q419M153o493
10883E01643L144R037j35j0378j3122o263m460l026J4545j8885k0500k2031r501
10870D20068n598j7287l0198k7601k5629k2994k1712j6972L570K682j2535p861
10858B37933o07K745N375J6546J0113J3821J0324k068J647O51n591o089R922N609
$$ y = [1348424, 1203426, 1063288, 964838, 907039, 861357, 807401, 763282, 738064, 714231, 704524, 695568, 689511, 686752, 681721, 672609, 664801, 656960, 646661, 634885, 617339, 591983, 575008, 572354, 576467, 582082, 589841, 586214, 576152, 569721, 578343, 578349, 566142, 566605, 575504, 596509, 601360, 596382, 609263, 598521, 588268, 593045, 626480, 651935, 685628, 730364, 787242, 829907, 810730, 744025, 642601, 553712, 511731, 522425, 549828, 555148, 552965, 535450, 510650, 495564, 503983, 508136, 501643, 504787, 513824, 513689, 503311, 490189, 483926, 479466, 476440, 490985, 472100, 451600, 429569, 420068, 414470, 397183, 366985, 339384, 313755, 290761, 269049, 252077, 255647, 258329, 245794, 237933, 237326, 240071, 245446, 261992, 272105, 285926, 296250, 294182, 295829, 296480, 290889, 284800, 294722, 300331]
10844C00331J4248P462m30J1192J2906K1951K7745L1564J0137n498o799r614J1767
10831D26962J5755K2455J7502J1055q100J2105J2353L081j8885m0137m4617j8063
10819C91466L050m097k6276l4715l4608k0565p491j9917r409p3j1705k6227j3983
10806A85450O930J009j95j3721j0557J7858L55n484J217l562R591J0376J1453
10793B10720l771p50O063j4318K059J2530R857J1n958o874m101Q033N727J0872
10779B30100Q303J593l87K1337L775j2810P376J9174m079N800L427n056j34m725
10765B73694q643j948k4387l5745p498j4918p859q900j2729P8j451r295m029K789
10751A39159j4519j0431j2954O683Q767O163k354r900J4144l390R6J0571J8828
$$ y = [300331, 314579, 322041, 321611, 332803, 345709, 367660, 395405, 426969, 437106, 431608, 424809, 415195, 426962, 442717, 465172, 482674, 493729, 485629, 497734, 510087, 513168, 494283, 454146, 409529, 391466, 394516, 390419, 364143, 329428, 294820, 274255, 266764, 246847, 237438, 237365, 225660, 199433, 185450, 192380, 193389, 193194, 179473, 168916, 186774, 187129, 181645, 182862, 179300, 188891, 199267, 210720, 206949, 206199, 212262, 197944, 200003, 212533, 222390, 222401, 216443, 209569, 205468, 213501, 219228, 230100, 238403, 239996, 239609, 260946, 264721, 251911, 259287, 278461, 274382, 280182, 283609, 278553, 278419, 273694, 265051, 263103, 238716, 202971, 195473, 180555, 172696, 163796, 151067, 151145, 149694, 140399, 136370, 139159, 124640, 114209, 101255, 107938, 116705, 122868, 120514, 110614, 124758, 121368, 121464, 132035, 150863]
10738A50863J0656K436j4750j2773n188r321l553N572l335j2488r755P405J7729
10725A23498K325k486q777r508N743j173P529J4581o836j739J867R145M808q958
10711A30019j3032J390J011O853Q01r036Oj714j301j447k88l000J0611J6313N901
10696A43087M035l213m312o276l886j6894n879J5022p3j0287L880n961o41L558
10682A12160K606P05r004N237p824r537J2755k228P437o735j1041m460j4947J6939
10668I2063R784k0269P439K2861o240N529J562r24j0553r378J1463K3431K3993
10655A50761K928R581J1696R504K220J1468J7541P69o591j202j2916J723J695
10642A99177J0819J5571K0484J1216J9010J9861J1814K9360K6526M7802O3610
$$ y = [150863, 161519, 163955, 149205, 136432, 131244, 121923, 118370, 123942, 120607, 108119, 98364, 105769, 123498, 125823, 123337, 114560, 105052, 110795, 109622, 117151, 131732, 124896, 123157, 125024, 134169, 138977, 130019, 116987, 118377, 119388, 126241, 127042, 118006, 118012, 116298, 114997, 113550, 113262, 110262, 120873, 137186, 143087, 147122, 143909, 139597, 133321, 129435, 112541, 106662, 121684, 121611, 111324, 115204, 109243, 108602, 112160, 114766, 115471, 106467, 111704, 103880, 94343, 107098, 104870, 112307, 105572, 94531, 90071, 75124, 92063, 101847, 81578, 89017, 111878, 105638, 111167, 112729, 111805, 101252, 91874, 103337, 126768, 150761, 153689, 163270, 174966, 184470, 186690, 198158, 215699, 216468, 209877, 208675, 195759, 197482, 199177, 209996, 225567, 246051, 257267, 276277, 296138, 307952, 337312, 363838, 411640, 475250]
10631D75250M3020L4110M7904M6717M9646P3293R3474J01455J29255J87230K83935
10620A565289L84173N40194P18618R27611J123385J140802Q63354L77573r6939
10611G544060l71775l69163j44555J95851O47575J183458J796639K287727K322222
10602A5092039J552805K24553r48772j473314j359947q29797j02880P31046J649121
10593A4534854K564814L219597L132905J874790k44705k138199l070074k987132
10585A6886850k278141j355679m71849L68696J094562J488102J297542L34801
10577A7364884j029732k036378k323328k028198j474095r14880m27346j2617K73226
10568G391536L90606K36246j73718p00748j064262j169305j048119q25828o22083
$$ y = [475250, 518270, 552380, 600284, 647001, 696647, 769940, 863414, 964869, 1094124, 1281354, 1565289, 1949462, 2489656, 3208274, 4135885, 5259270, 6400072, 7263426, 7640999, 7544060, 7172285, 6803122, 6658567, 6854418, 7501993, 8685451, 10482090, 12769817, 15092039, 16644844, 16869397, 15920625, 14447311, 13087364, 12257567, 12154687, 12885733, 14534854, 17099668, 20319265, 23452170, 25326960, 25082255, 22944056, 19873982, 16886850, 14608709, 13253030, 12781181, 13149877, 14244439, 15732541, 17030083, 17364884, 16335152, 14298774, 11975446, 9947248, 8473153, 7558273, 7130927, 7118310, 7391536, 7782142, 8018388, 7844670, 7143922, 6079660, 4910355, 3862236, 3036408, 2414325]
10559B414325m51525l38535k49322j93188j49380j08390q6739o6650o8150o3866
10549F38580p0935o1000l7592k6095j8243j6160k8531k7045j6434j3734j4752
10538C08059m154j2035j9915j3023n52j453j7608q093n514j765j1658j1905m412
10525A95972M300m072P731k748r285k5665j2768l650M435M928q858R971Q887j1215
10511A57963j0525o360N490J457n064j5537j693n280n5n884N661N153j8478p897
10497I8951J2345L526K773J1926j995m827M030O725N336O999n459j2143j1983
10484A16204p041J998j2769j1065J1338j4655p906L76R191K024O094n466j2377
10471G5946J1695p136q147O599K7794k705l089q48P860R583o928o809q996q297
$$ y = [2414325, 1962800, 1624265, 1374943, 1181755, 1032375, 923985, 837246, 770596, 702446, 638580, 567645, 506645, 469053, 442958, 424715, 408555, 380024, 352979, 336545, 322811, 308059, 303905, 291870, 271955, 258932, 258380, 256927, 239319, 231226, 225712, 223947, 212289, 200384, 195972, 200272, 196200, 203931, 201183, 191898, 166233, 153465, 149815, 154250, 159178, 150320, 160291, 169178, 157963, 147438, 141078, 146568, 148025, 142961, 127424, 125731, 120451, 120396, 114512, 120173, 125326, 106848, 98951, 111296, 114822, 117595, 129521, 127526, 122699, 126729, 133454, 138790, 145789, 140330, 128187, 116204, 109163, 111161, 98392, 87327, 98665, 84010, 76104, 76480, 85671, 87695, 93789, 88323, 75946, 87641, 80505, 72358, 78957, 106751, 104046, 100957, 100109, 107969, 117552, 110624, 103815, 94819, 86522]
10457H6522j4170J2967O232k264k1031j1655R91J4795J0016j0795j067J214j0010
10444F1745J1396Q502j993j602J5202j1197k4017m42L076j451N655p401j1637
10431D5836j025R504O714n128k440l096N54q130m258N253O390q375k105N99J2022
10416E2315Q528j214j8896l673R677R902j6047j1124r45J7513J3098n317k212
10403E1605M302o794l564J1337J1852J3770o192o984K578j6249l923r539r671
10390C2528P301J0179l114M742J483q420J45l921J254Q388N242j0649M811M427
10376E4396j6367K301J1936j3903j3358n316p724j1375O996P828N718J5420Q599
10363D5151l105j5716O128Q774R050L685R417j5757l074m21l685j7310l507O035
$$ y = [86522, 72352, 85319, 91551, 89287, 68256, 56601, 57592, 72387, 82403, 71608, 70541, 71755, 61745, 73141, 81643, 79650, 78048, 93250, 82053, 58036, 57594, 60670, 59219, 64874, 57473, 45836, 44811, 54315, 61029, 55901, 53461, 50365, 50919, 42789, 38531, 43784, 50174, 41799, 39694, 40293, 52315, 60843, 59629, 40733, 37060, 46737, 56639, 40592, 29468, 28523, 46036, 59134, 53817, 51605, 55907, 49113, 45549, 56886, 68738, 82508, 76316, 69332, 71910, 55661, 51738, 42199, 32528, 39829, 50008, 46894, 51636, 53119, 44699, 44844, 40923, 42177, 50565, 55807, 45158, 49969, 54396, 38029, 40330, 52266, 38363, 25005, 19689, 11965, 590, 7586, 15414, 21132, 36552, 45151, 42046, 26330, 32458, 41232, 50282, 53967, 63384, 47627, 44553, 44132, 40447, 23137, 19630, 25665]
10349B5665m95j2773J432M406L886Q18m476M421N354k441o107L283J0963J1895
10335D5831J6561O549r407j3380k8049K469J1734n472J216J2250Q463j693K921
10322D9993L092k0860n698l582K302L928k361Q841N121m050l577o423L076J940
10308C1742l269J94J2490N541j7897p869Q474m320m175J761M165n064l597N314
10294B3490p543L921M044N508O944o955J820n803O678j0453r848J670k692j5492
10280d711p37Q250J2976J2310O681Q302q211r029l988o380M998j6228j1521J7587
10266A0299K9001J2722m340k0794j0416J0780p185n058R089O540L096k835J417
10253C2316L532k602l399j4933k779J0377R60l475m334l022P74Q276p455j601
$$ y = [25665, 25170, 12397, 13829, 18235, 22121, 22939, 18463, 22884, 28238, 25797, 19690, 22973, 33936, 45831, 62392, 68941, 59534, 46154, 18105, 20574, 32308, 26836, 28052, 40302, 48765, 47072, 49993, 53085, 32225, 26527, 22945, 25247, 29175, 26814, 35655, 40776, 36726, 33149, 26726, 29802, 31742, 28473, 28667, 41157, 46698, 28801, 20932, 29406, 25086, 20911, 22672, 26837, 21773, 18176, 23490, 15947, 19868, 23912, 29420, 36364, 29409, 31229, 25426, 32104, 21651, 11803, 13473, 10781, -4711, -5448, 2802, 15778, 28088, 34769, 43071, 34860, 25831, 21843, 15463, 20461, 4233, -7288, 10299, 39300, 52022, 47682, 26888, 16472, 27252, 20067, 15009, 24098, 30638, 33734, 30899, 32316, 35848, 33246, 29847, 14914, 12135, 22512, 23472, 19997, 15663, 12641, 13415, 21691, 14236, 12635]
10239A2635R57J157J4516j047n25J077j174J023p902l42n10k3726J207J0458J7154
10224B4958K977q481l079O703Q682M001J917n230L320R343r401k734L522m18q038
10209B8042L318k354J1535R398j1713j5803k990j1654j452K3007O426j2501P639
10196C0898L938k0456l858J1077L234j2177j3776J5640R924m545K557R044J2400
10183D3900m911r762Q581R020M069M22K199j584J3389L010R971J616l299j2376
10169F4245j588J5569P591M93R869J874j2485l986M685M965j41O239J0889J3988
10155A22207K1661J1488M494j0939j7149l914j0776j0211p732j2473R153J5082
10143A10891R139j03j8448j7678M955n45j2632o487q111r727l868o370K60Q19
$$ y = [12635, 13592, 14749, 29265, 28218, 27693, 28770, 27596, 28619, 20717, 20375, 19865, -3861, -2654, 7804, 24958, 27935, 19454, 16375, 23078, 31760, 35761, 37678, 32448, 35768, 45111, 35710, 32976, 36498, 36080, 28042, 31360, 29006, 40541, 49939, 38226, 22423, 19433, 7779, 6327, 29334, 35760, 23259, 30898, 34836, 14380, 10522, 21599, 24833, 12656, -1120, 14520, 24444, 19899, 22456, 31500, 43900, 38989, 29227, 37808, 46828, 50897, 51319, 53518, 51934, 65323, 68333, 78304, 79920, 76621, 64245, 62657, 78226, 85817, 86310, 96179, 98053, 85568, 81582, 86267, 91232, 91091, 97330, 108219, 122207, 143868, 155356, 159850, 148911, 131762, 127848, 117072, 106861, 99129, 86656, 95809, 110891, 120030, 119927, 101479, 83801, 88756, 88211, 75579, 69092, 60981, 51254, 47386, 41016, 41276, 42095]
10129D2095K544K711n298N017Q940n207k521L81j054j0539j9285J1859J3166M796
10115D7605r129j1502J0657L03m180r168P527k679o617j5047P338J2525J0273
10102C7906J5693J3169O554q403j501N526l0244m046J3189j1570j2644p598n564
10089A0467k548r662o879K342O428J4134J941q825J5501J1334l261j0152N186
10076B6006p872l308l74m110L21J522p275J0217O816J995L545Q077R23m129o560
10061B5794M193L108k1865j0514O090O017p341p06P178J0193J108K0p312O72L701
10046B0336l206j955K149K519j3314j2130L433M182R875O946j7109n790P921J2298
10032A6155m035Q031N897P234Q869l246p79M527k818O683j1865k9014j4546q117
$$ y = [42095, 44639, 47350, 42052, 47069, 56009, 50802, 48281, 48662, 47608, 37069, 17784, 29643, 42809, 47605, 38476, 26974, 37631, 37934, 33754, 24586, 32113, 29434, 22817, 7770, 15108, 27633, 37906, 53599, 66768, 73322, 64919, 63418, 68944, 38700, 34654, 47843, 36273, 23629, 16031, 10467, 7919, -1743, -8622, -6280, 148, 14282, 16223, 7398, 22899, 34233, 30972, 20820, 26006, 18134, 14826, 14452, 10342, 10663, 12185, 4910, 15127, 21943, 23938, 27483, 35560, 36483, 32354, 25794, 29987, 33095, 11230, 716, 6806, 12823, 5482, 4776, 11954, 22147, 23255, 23275, 15963, 16635, 20336, 17130, 15175, 17324, 19843, 6529, -5601, -2168, 2014, 11889, 18835, 1726, -4064, 3857, 16155, 12120, 20151, 26048, 33282, 42151, 38905, 38126, 42653, 39835, 46518, 34653, 5639, -8907, -17024]
10018a7024O880R276n578J2368j27j2193O411J2764k860k0257l863O734O761P5
10004f33J558P314J2773L445k2815j4145R363K037O336K636J2840Q44l398j746
9990A6409m119j4939o187m935l489J061K3430K9267M371j0213n202j3294m970
9977G190o926K380J9700J258r51J037m451o654j4395o512L42j365j706J5599K3317
9962B7863J0333k941q695r868K202L587o643j3297K97q651N461P894N758j664
9948A1636K398q204k90O078p226j4750l774J2803q956n595J951J1303M580O145
9934H099J3113j3972m866j20J0272O82n901J0535J2592l123j109o408k904K250
9920A9140J623p240j535o8o50N789p629o49l420L617M727n77l513k509o355o414
$$ y = [-17024, -10144, -868, -6446, 5922, 5795, -6398, 13, 12777, 9917, -10340, -14203, -7469, -708, -633, 925, 8239, 21012, 24457, 1642, -12503, -3140, -1103, 5233, 7869, 20709, 21553, 18155, 16409, 12290, -2649, -8836, -13771, -17260, -16199, 7231, 36498, 40869, 30656, 25454, 12160, 7190, 264, 2644, 22344, 23602, 22651, 23688, 19237, 12583, -1812, -8324, -7982, -9347, -11053, 4546, 27863, 38196, 35255, 26560, 16692, 18894, 22481, 15838, 2541, 2838, -5813, -352, 7542, 13300, 11636, 14034, 5830, 5540, 11618, 4392, -10358, -14132, -1329, -10285, -15880, -13929, -2626, 1954, 8099, 21212, 7240, 2374, 2254, 12526, 13208, 7307, 17842, 30434, 27311, 26202, 19794, 16890, 19140, 20763, 13523, 11988, 11920, 11270, 17059, 9430, 8781, 5361, 8978, 13705, 13128, 9615, 7106, 751, -5663]
9904e663j5793J219K1254J2683k686M244K37j1037o273O195J8824N673J108r560
9890B0425j0011o282m416J150l132q33q58j905N798Q917K128P44l288K1280J0295
9875D0012j0422l875N019n090l409K085p620N933J509k008L472N695M392r321
9861B6372j793q147r360K228k85r551k832j761O10J6766L366K138r26j533k0993
9846e701n104O443J000J4759K188j1902j3488R626J7507J495o924j959k67r360
9832a687M613m794q426j0912P459K6711J1007j6664j2493o052L744k26L579l913
9818h054M81O532n741M811J0620k380n519L955K18l508m515J828m324p23o08K505
9802d422M966J281J371q435R216O248l080q6K08K03O678r80O75M514j2364K986
$$ y = [-5663, -21456, -20237, 1017, 13700, 11014, 15258, 15495, 4458, -1815, 4380, 23204, 28877, 29985, 20425, 10414, 4132, -284, 866, -2266, -3099, -3957, -5862, -64, 8853, 10981, 11725, 8437, 29717, 40012, 29590, 25715, 30734, 25644, 22235, 24320, 16700, 22633, 24142, 22134, 25606, 31301, 35693, 26372, 24579, 16432, 7072, 9300, 9015, -536, -3368, -5129, -4519, 12247, 15613, 17751, 16825, 15292, -5701, -10805, -4362, -3362, 11397, 13585, 1683, -11805, -2179, 15328, 16823, 9899, 7940, 7673, -1687, 2926, -1868, -10294, -21206, -13747, 12964, 23971, 7307, -5186, -11238, -7494, -7720, -4141, -8054, -7573, -1041, -6782, -1971, 8649, 6269, 750, 4705, 4923, 1415, -3100, -1272, -5596, -6319, -6927, -4422, 544, 1825, 3196, -5239, 3977, 10225, 7145, 7059, 7267, 7470, 14148, 13168, 13843, 18357, 5993, 8979]
9786H979P485j392k050j669m28l174o796k284m228O268J3258N364j2138l323r924
9771f052l171N757n781J366J2151p471P60N775K0p502r787R603R931R171N172
9756A9942J878j1349j1704p745N902J4573L994L768K504j1663m783K822m954K479
9742E664j0068Q785J2064R487j1042K699R282M329J914J814P06j333N579n938
9728C3942o067r239k528r554p95L370Q154M080j2331p314r102p63p26Q536j196
9713a533L463K149l760j2029L929M519J561r97L694l179j028K045J0350J894J6563
9698B7641n915k0573p27O276j583p11N544o089q563k271l632j4992M676k663J258
9683b2324J0145k474O325P7m472P713R390Q436J75n277L666M142J765k730j0186
$$ y = [8979, 16464, 15072, 13022, 11353, 10925, 7751, 955, -1329, -5557, 711, 13969, 19333, 7195, 3872, -6052, -9223, -3466, -9247, -7881, 4270, -3201, -2441, 3334, 3354, -4148, -13935, -4332, 5599, 14770, 19942, 21820, 10471, -1233, -8978, -3076, 11497, 15491, 19259, 21763, 10100, 5317, 8139, 3185, 5664, -4404, 4381, 16445, 25932, 14890, 17589, 26871, 31200, 33114, 34928, 35634, 34301, 39880, 33942, 27875, 18636, 16108, 6554, 5759, 9129, 17283, 21363, 9032, 1718, -7384, -8147, -8873, -337, -1533, 1930, 4079, 319, -11710, -7781, -3262, -1701, -2698, 996, -2183, -3211, -1166, 9184, 11078, 27641, 21726, 1153, 426, 6702, 5119, 4408, 9952, 3863, -4700, -6971, -10603, -25595, -20919, -23582, -22324, -12179, -14653, -8328, -8251, -12723, -5010, 4380, 12816, 12991, 7714, 11380, 15522, 17287, 14557, 4371]
9668D371n60R060J6533o964j932l735j8224q486L232L569O146J0646L816J2280
9654B9752l81L157o47j195q47r280q100j494j3914o232L811J2600m018q742j926
9639g456L169K538m477O63O43J8721j03j8561O174J1523L777R556m213j7905j3731
9624i682o703J3289P675J587M61J0328N629j923o134n86J7196O713j5490l371
9610A8989J2498L94q655j5568O984M573O08j002n731q856J969K502j2213J691
9596a817o78N132J1261K587k575j0291m893J6425N729p057R02j3006j2756J1705
9582F68Q349r70l650K717J1063J0605l539r92k2801o589P949j460j1425K473J6841
9567I239P021o457o536j415P94M160J127M661m771m756p420j2402Q019K0879m530
$$ y = [4371, 3811, 12871, 29404, 22440, 20508, 16773, -1451, -9937, -6705, -3136, 3010, 13656, 17472, 29752, 29371, 32528, 31881, 30686, 29839, 20559, 12459, 10965, -2949, -9181, -5370, 7230, 3212, -5530, -7456, -4287, -1749, -6226, -5563, -4920, 13801, 13698, -4863, 1311, 12834, 16611, 26167, 21954, 4049, -9682, -16385, -3096, 4579, 6166, 6627, 16955, 22584, 20661, 14527, 13941, 31137, 37850, 22360, 18989, 31487, 31881, 23226, 7658, 14642, 19215, 19823, 18821, 13090, 4234, 6203, 8705, -3508, -1817, -2495, 2637, 13898, 16485, 13910, 3619, -1274, 15151, 20880, 13823, 14725, 1719, -11037, 668, 9017, 8047, 4397, 7114, 18177, 28782, 25243, 24251, 1450, -5139, 2810, 1350, -10075, -7602, 9239, 16260, 9803, 3267, 1852, 2646, 6806, 7933, 12594, 7823, 3067, -4353, -16755, -8736, 12143, 7613]
9552G613p628k311j330j2078j15M172L234R339Q201M859m55o250m612m702l1J608
9536d86r240j665J2086O958q836j2099M564m548N5J0548L660L624j5975j3683
9522b5037m323J2973K954J872K0411J3438j0522j2641j0407J8087N979p81j78
9509A1825L86j2187j3699k570J6972J5053K655j7091r457o012K247K703O175J883
9495a117k701p498O607P783k584J1125N622K358J824l771R991o834M57J8o310
9480A4970J1469L044j535k586n507k686l272O269R08l224p658o016L27n210J4335
9465A3628N657l128j221P9p848q910N72K512P283J2935J1301K851j3327k050L170
9450B3504M997K961K133j53m488J2522J3271M394j6368r744p618J0053N732j2608
$$ y = [7613, -15, -2326, -3656, -15734, -15849, -11677, -8443, 896, 9097, 13956, 13501, 7251, 2639, -2063, -2094, -486, -9726, -11391, 695, 7653, -1183, -13282, -8718, -13266, -13211, -2663, 997, 4621, -11354, -25037, -29360, -16387, -13433, -11561, 8850, 22288, 11766, -875, -11282, 6805, 12784, 12003, 11825, 12211, 24, -13675, -16245, 727, 15780, 18435, 1344, -8113, -14125, -11878, -9175, -3000, -1117, -3818, -11316, -4709, 3074, 490, 11615, 17237, 19595, 21419, 17648, 27639, 20805, 21262, 21280, 14970, 26439, 29483, 27948, 25362, 19855, 17169, 13897, 20166, 21074, 17850, 10192, 4176, 4503, -707, 13628, 19285, 16157, 14936, 15015, 7167, -1743, -1171, 1341, 8624, 21559, 32860, 35711, 22384, 20334, 23504, 28501, 31462, 33595, 33442, 28954, 41476, 54747, 59141, 42773, 33029, 25411, 35464, 41196, 28588]
9436B8588m46K387k1J727J5200k767j5581N142J1749J960q739j4249j491l233
9422B0226L843j025J1150M828j2968J3408J6820p909m30j3265m493K687Q824R839
9408E1535O999J0711M860J6321J5392J0851J3106k3060j1487j1938k2486J033
9396F1837j017j3435r905n611m064l528Q271j4345P611R344R380n553J0636J1634
9382F1255P560q03P46p658j7449j8046j0838O054R55K017k286m325p321J1968
9368B1829P251J3999M272j2024j870p842J7664J3956q171N191p976j0229M33K140
9354C8623o623j748j4498J0587M240j5993j0621Q298R933j252k680k903n492M174
9340A4045p126p028j1438J2505J5652J2109R121o899O324p757j7557k632L77J112
$$ y = [28588, 28142, 30529, 30508, 32235, 47435, 44668, 29087, 34229, 45978, 47938, 39199, 24950, 23459, 20226, 24069, 23044, 34194, 39022, 26054, 39462, 56282, 48373, 47943, 34678, 30185, 32872, 41696, 51535, 58534, 69245, 74105, 90426, 105818, 116669, 129775, 106715, 95228, 83290, 60804, 61837, 60820, 47385, 37480, 31869, 27805, 24277, 32548, 18203, 25814, 35158, 44538, 38985, 49621, 61255, 68815, 68012, 68758, 61100, 43651, 25605, 14767, 20821, 21776, 23793, 21507, 17182, 9861, 21829, 29080, 43079, 47351, 35327, 33457, 25615, 43279, 57235, 49064, 54255, 46279, 36050, 36483, 38623, 32000, 30252, 15754, 26341, 30581, 14588, 3967, 12265, 22198, 20946, 18266, 15363, 9871, 14045, 6919, -109, -11547, 958, 16610, 28719, 37840, 30941, 37265, 29508, 11951, 9319, 9696, 10808]
9326A0808N638J397L381m05p70N813J886k354J549l909j1561n076R47R596j862
9311A5078M560P962m871P748O950j0644j1420m885Q276J6218Q192o164j5267p101
9297A4632m627M531L693m824j3282o892K92L469p92K293k947J40Q410J5074o619
9282A2551j3206l37j459Q510J990q797j244L348p507r291O675R077O110k495m107
9267a82j2946q826L10K2752J6492j080J180r598j2080k578P188j233j033R94O954
9252F314j034q794j1253o42L336k171J4164m090J345k973K602J1345J50n776q912
9237f389n149m742M873r024o073R747O461m332r582N739J850L199j478R33l96
9222a4363q41m792L546L648P458N780K773r880j2436J240J1668R647o758k758
$$ y = [10808, 16446, 17843, 21224, 20819, 20049, 25862, 27748, 25394, 26943, 23034, 11473, 6397, 7344, 16940, 15078, 19638, 27600, 22729, 30477, 37427, 26783, 15363, 10478, 18754, 34972, 43164, 37000, 21733, 14632, 10005, 14536, 18229, 13405, 123, -6769, -6477, -3008, -3800, -1507, -4454, -4314, 4096, 19170, 12551, -655, -992, -2451, 6059, 8049, -748, -1992, 1356, -6151, -15442, -8767, 310, 6420, 3925, -182, -13128, -21954, -21644, 1108, 17600, 16520, 17700, 8102, -3978, -6556, 632, -601, -1634, -640, 6314, 5280, -3514, -14767, -15409, -12073, -14244, -80, -4170, -2825, -5798, -3196, 8149, 8299, 2523, -6389, -11538, -16280, -11407, -20431, -26504, -16757, -10296, -14628, -24210, -18471, -16621, -13422, -14900, -13967, -14363, -15204, -19996, -16450, -12802, -5344, 436, 3209, -6671, -19107, -17867, -6199, 3448, -3310, -6068]
9208f068m838J486m969J7803N156k401L828l411Q274K714j5455p662P686L295
9194E438O95j496l330l179k664Q008j2815n101J0798J6949N657p615q819K712
9180E238K873p313M066m77L560q306q786j5196R204J231n330N977o607J975R55
9165a6936J2256K218o153O917p101N188R385j651m699n05N642l991j1749R98k508
9150a2689L900l137N320R945K172o7L813j2422m70J813n417Q505k603J689J1839
9135A2191N630m902k882O45j743r340j40K180R127J3896o4k200j9769p762l235
9120h368j692Q458j429M311N071J329L723o956m423R448O342m701J083M434r468
9105G162j2571M214K16J6212M694j5163n385L933r429J130l142l675J2937k615
$$ y = [-6068, -10906, -9420, -14389, 3414, 8570, 6169, 9997, 6586, 14860, 17574, 2119, -5543, 2143, 5438, 6133, 4637, 1307, -1872, -4536, 3472, -9343, -14444, -3646, 13303, 18960, 11345, 2526, 5238, 8111, 798, 4864, 4387, 7947, -359, -9145, -24341, -15137, -13906, -19236, -13259, -19866, -17891, -16936, -4680, -2462, -8615, -1698, -8799, -3611, 5774, 4123, -576, -1081, 4561, 570, -11179, -10181, -12689, -8789, -11926, -6606, 3339, 5511, 5444, 9257, -3165, -3635, -1822, -7239, 1266, -1337, 352, 12191, 17821, 12919, 10037, 10682, 8939, -401, -541, 1639, 10766, 24662, 24598, 22398, 2629, -5133, -8368, -10060, -1602, -3031, 1280, 6351, 7680, 11403, 4447, 24, 9472, 15814, 11113, 12196, 16630, 7162, -5409, -1195, -979, 15233, 19927, 4764, -621, 3312, -6117, -4987, -8129, -11804, 1133, -1482]
9091a482K970J1920L257p405o38J672k615K71j841O233o111K36n679p701N67Q00
9075e546o080P089J5321p865l249R967R53J5305n752m342O159J408q191r775j637
9060C765Q685p918l870J669j2769J3708J4129l904j8598j2768Q688J7814O086
9047A4717p189R809J6597p883j0017o738J2146M841j33j33j2692m321n974l97
9033B633J0377K833j5602j487m601j7242K152K6404J8083k167j558o563m153q348
9019G61J0171J4792M624j0739o747k545N77P083k579j1766P799J3390j0733j0586
9005C502L449j58L500l528L853P850l261j2295K964R015k380J093P25K170J1373
8990B7872J253k3160j5767j105J1286N65K370k282o520J102O486l981P972K303
$$ y = [-1482, 1488, 13408, 16665, 9260, 8622, 10294, 7679, 7950, 6109, 12342, 6231, 6467, 788, -6913, -6346, -5546, -11626, -4537, 10784, 2919, -330, 9637, 10590, 25895, 20143, 15801, 21960, 23368, 15177, 5402, 3765, 12450, 4532, 662, 2331, -10438, 3270, 17399, 13495, -5103, -17871, -9183, 8631, 14717, 7528, 17337, 33934, 26051, 16034, 9296, 21442, 26283, 26150, 26017, 13325, 9004, 3030, 2633, 13010, 15843, 241, -1246, -5847, -23089, -20937, 5467, 23550, 21383, 19825, 13262, 9109, 761, 10932, 25724, 30348, 19609, 12862, 10317, 10894, 17977, 15398, 3632, 11431, 24821, 14088, 3502, 6951, 6793, 10293, 6765, 10618, 18468, 15207, 2912, 5876, 14891, 12511, 13604, 14329, 16499, 27872, 29125, 5965, -9802, -10907, 379, 944, 3314, 1032, -5488, -4386, 2100, -1881, 6091, 8394]
8976H394Q244J558k877o824J4008Q925K850q595p496n959j397K0112K2995N211
8962E9149r867j1350Q403j8601j5649Q269J5025o611l098l433Q128O539N160N108
8948D7172q024k2508L464Q020o059n549r54k506J2114j1457J222j691L989L956
8934B1189j375p193L913L639O199J983p034Q320m194M982N448q03N793K595j0416
8919C3046k422N570j796q558m019K682K886R11k834J7216M670k660J337o189j1011
8904B8829R470N885p323j754k66m387j944N395P833j3487n843J709l04Q915l655
8889B9073r569j2985J2258J3120l326J822L662j3200j5811K981N835J173m266
8876A0767L091N960J5226J5549l142M8j5814q835L421k076j0464j2806j565M392
$$ y = [8394, 16638, 18196, 15319, 8495, 22503, 31428, 34278, 25683, 18187, 12228, 10831, 30943, 53938, 59149, 49282, 37932, 46335, 27734, 12085, 20354, 35379, 28768, 25670, 22237, 30365, 36904, 42064, 47172, 39148, 16640, 20104, 28124, 22065, 16516, 15562, 13056, 25170, 13713, 14935, 13244, 17233, 21189, 19814, 12621, 16534, 20173, 26372, 28355, 21321, 29641, 25447, 30429, 35877, 35074, 40867, 43462, 33046, 30624, 36194, 34398, 25840, 21821, 24503, 27389, 28300, 25466, 42682, 47352, 44692, 46029, 39840, 28829, 38299, 44184, 36861, 35107, 34841, 30454, 28510, 33905, 41738, 28251, 22408, 24117, 23813, 32728, 29073, 19504, 6519, 18777, 31897, 28571, 30393, 34055, 20855, 5044, 8025, 13860, 15033, 10767, 13858, 19818, 35044, 50593, 47451, 47499, 31685, 22850, 26271, 24195, 13731, 925, -640, 3752]
8862C752r221K860J967R144j1082r420n360j1138j819J9669K418J0315R366J574
8848A3025k264l561J5396oq721j4517J505J688K35J1388Q381Q138P436m206j1586
8833B2331M438r304k1606q68K5340n713k0249J879l213n491j044k435J2157J5417
8819A1639J988M190J2737l97l208q205J680K992o345L116K921J56o658J872K2186
8804D0664L479j558l831p867O778k0051l588J0949J1788R535P766j155j824P433
8790E8518k020n280N98m062n316N84r98j6778j6845o466K159N612n02K809J0284
8775B2297P330l185l628O835J2685p625l716j3527k794J2092m87n283Q764Q346
8761C8104n164l311J5322P928M24k779k040R096M554R575N963m558O189r816q528
$$ y = [3752, -5469, -2609, -642, 8502, -2580, -12000, -17360, -28498, -30317, -10648, -8230, 2085, 11451, 13025, 10761, 7200, 22596, 22590, 13869, -648, 857, 2545, 2780, 14168, 22549, 30687, 38123, 33917, 22331, 26769, 17465, -4141, -5009, 20331, 14618, -5631, -3752, -6965, -12456, -13500, -15935, -3778, 11639, 13627, 17817, 30554, 30157, 26949, 18744, 20424, 23416, 17071, 20187, 23108, 23264, 16606, 18478, 40664, 44143, 42585, 38754, 30887, 37665, 17614, 14026, 24975, 36763, 46298, 54064, 52909, 51085, 58518, 56498, 51218, 51816, 47754, 42438, 43022, 42024, 25246, 8401, 1935, 4094, 9706, 9204, 12013, 22297, 29627, 26442, 22814, 29649, 42334, 34709, 30993, 17466, 14672, 26764, 26277, 20994, 29758, 38104, 32940, 29629, 44951, 52879, 53303, 50524, 48484, 57580, 62134, 71709, 77672, 73114, 79303, 69487, 60959]
8746F0959J2787K0282R523R30j1242q396k175M750P702O799r445L838j1878L7
8732H4471Q77k0327k7272Q02L069J0270O78J2964J1380J692P425O243r53p763
8718H3556n029p089n342j960J6585J1704K28j6590p109N238J3654J744k273L552
8704I0869P617M038K954k405J1529J0014J1076N554m549j9210j8283q066P012
8691I8150K915Q225j4173j3467M939J2290r754K533J2828L715n848p070m104k393
8677H8786k452K955l213q633k028N999m936p537N747K942j1454P02O77m06N16
8662F7665r567l1q930m350J5956j818j2404n281L619J0980K638j5792n428q031
8648B9226N445J5514k057o920O080L982j0668l715J520J49q021k055R258J284
$$ y = [60959, 73746, 94028, 103551, 104481, 93239, 84843, 82668, 87418, 95120, 101919, 92474, 96312, 84434, 84471, 85348, 65021, 37749, 38551, 41620, 51890, 52568, 65532, 76912, 78604, 86029, 92272, 91319, 83556, 78527, 71438, 66096, 64136, 80721, 92425, 92653, 76063, 68954, 74192, 87846, 89590, 87317, 90869, 98486, 102524, 105478, 103073, 114602, 124616, 135692, 141246, 136697, 117487, 99204, 91138, 98150, 101065, 109290, 95117, 81650, 86589, 98879, 89125, 91658, 104486, 108201, 102353, 95283, 91179, 88786, 86334, 89289, 86076, 77443, 75415, 81414, 76478, 68941, 74688, 77630, 66176, 66878, 67555, 67149, 67665, 58098, 58067, 49137, 44787, 60743, 58925, 46521, 41240, 44859, 55839, 58477, 42685, 37257, 29226, 34671, 50185, 48128, 41208, 47288, 51270, 40602, 36887, 38407, 38556, 30535, 28480, 37738, 39022]
8634C9022n19j416o792k807O282n192l390L779l336j1078k618Q739n08p69l133
8619A6264R857r307j0390Q353P054M555k006j0723k799P110m46q77n720o269J0658
8604A5314m82q746j6475l847N595M381P674M721K897M074K3419R436k1686n236
8590B1039O686o17p709l597M399M254j8245N105L025K807M473l481m022L045R458
8575B6620o222j269J5720R785j5988l349J0233j885r82l168Q566o200p260j539
8561B3062j2079K174J810q534q411K441J3275R736k20n427j431L176q824j4321
8547c573K12o77J5678P931l550j0109J0158N62j1041j732J303O380j119j4784
8533d361j8508J1382J0879M436q837n805j1423J464j165r5J1865K938k659j363
$$ y = [39022, 38503, 37087, 30295, 27488, 33770, 28578, 25188, 28967, 25631, 14553, 11935, 20674, 20166, 19397, 16264, 26121, 16814, 6424, 14777, 21831, 26386, 24380, 13657, 10858, 17968, 17522, 16645, 10925, 4656, 15314, 14832, 6086, -10389, -14236, -8641, -4260, 3414, 8135, 11032, 15106, 38525, 47961, 26275, 21039, 27725, 27108, 19399, 15802, 20201, 24455, 6210, 11315, 14340, 17147, 21620, 18139, 14117, 17162, 26620, 20398, 19129, 34849, 44634, 28646, 25297, 35530, 33645, 32663, 29495, 38061, 31861, 24601, 23062, 10983, 13157, 14967, 6433, -1978, 463, 13738, 23474, 23254, 17827, 16396, 19572, 10748, -3573, -3361, -4038, 11640, 19571, 16021, 5912, 16070, 16632, 5591, 3859, 5162, 11542, 10423, -4361, -22869, -11487, -608, 3828, -5009, -10814, -22237, -20773, -21938, -22033, -10168, -7230, -9889, -11252]
8519a1252M813J1140J980o857j1292R91O908o60l686J1414n288K212P665P666
8505A5754j513O199q855L891l83j2896J5325j41M537j3447j483J0836N877j1005
8491A2696K481O043N297r197k890N017J327n386M689J8901P292k227j4370o83
8477B8990m213j0168j2151l466L540J645o404N579N615J98P981j943n358j4653
8463d808o500n326J6361R765m708n85j924J422m730R201j154j2979o374J1510
8449h29J3191o388q635P939N480l651Q061O224l742j0016M32l060l741P963k534
8434F694N812j00r662J122J8305q591P452P079j3877o008n597r021j2352J6645
8420b099R576M319j0056o93m981j174J3222R202n824l639J0091J0010n092J0063
$$ y = [-11252, -6439, 4701, 6681, -176, -11468, -10477, -3569, -4229, -7915, 3499, -1789, 423, 8088, 15754, 14241, 20440, 11585, 15476, 15093, 2197, 17522, 17381, 21918, 8471, 6988, 17824, 23701, 12696, 15177, 21220, 26517, 17320, 14430, 19447, 20774, 15388, 20077, 38978, 46270, 44043, 29673, 28990, 24777, 14609, 2458, -1008, 2532, 4177, -2227, 3352, 8967, 9165, 17146, 15203, 9845, -4808, -11308, -16634, -273, 9492, 4784, 4199, 2275, 3697, -1033, 8168, 7014, -5965, -12339, -829, 12362, 5974, -2661, 5278, 10758, 7107, 15168, 21392, 17650, 7634, 8066, 5006, 1265, 9228, 6694, 12506, 12406, 2744, 3866, 22171, 13580, 21032, 28111, 14234, 8226, 2629, -6392, -18744, -2099, 7477, 11796, 1740, 1047, -3934, -5108, 8114, 17316, 11492, 7853, 17944, 27954, 22862, 32925]
8406C2925q604N3M381J7863J5516O444J6256L4909N5481J04974J89860K37547
8394G07605J88621M542j72813k24322j85946j05595n2420k9542l2950j8040j8747
8383F0393j8325J081M289Q180M427l307k65L445j0893j1711J569l105N971N258
8369D7007L486l04P303m312J0802J4806J2799J1280r456M561j96J9176J5885K8740
8355A61577M8405Q2942J67920L11147M59403M65186J59217k68761m39293l84470
8345G63273k48518j49392q5304o4279m7644k2810k4545k0689j9042Q697j0294
8334G9453j2859m617J21K82L016q220j1108J7793k40P953P106K868O002J846J354
8319I0750j2675m346K933J2891P086P341Q275J4135J2204K8874P7022J16289J77546
$$ y = [32925, 24321, 24374, 28755, 46618, 62134, 68578, 84834, 119743, 175224, 280198, 470058, 707605, 896226, 900768, 727955, 503633, 317687, 212092, 159672, 130130, 97180, 79140, 60393, 42068, 43149, 47438, 55618, 60045, 56738, 56473, 59918, 49025, 37314, 38883, 35778, 41749, 47007, 50493, 50189, 57492, 53180, 63982, 78788, 91587, 102867, 93411, 97972, 97776, 116952, 132837, 161577, 209982, 292924, 460844, 771991, 1231394, 1696580, 1855797, 1587036, 1147743, 763273, 514755, 365363, 280059, 215780, 168136, 145326, 120781, 100092, 81050, 89747, 79453, 66594, 61977, 62098, 62380, 65396, 57176, 46068, 63861, 63621, 71574, 78680, 81548, 87550, 89396, 90750, 78075, 73729, 76662, 89553, 96639, 103980, 112255, 126390, 138594, 167468, 244490, 360779, 538325]
8306E38325K31488J51454p7015j94108j92385j47067j01607n6483l5331k5302
8296I1969q158j6247j5628j0392J2819l988j2438Q208Q09r694j1715k028K346
8283B5863r6K466J8425J3558o31J447j1388r553J308K495Q49m70K183M834N381
8268E6671o927q654j1329j4838L785J2902n779j0431j811J1415N74R12j4135k498
8254I857J2974k923j2531M015O918l991p004K267j0179l918J0364L763J2647N583
8240B7842K54l953N988J405m775j3920r046J7391N753j5134o694n216n089N331
8226A37M198J796P739j2210k989l733J510K197l161J2133J555M817M553J648j4847
8211E343r261k818Q84J2210J1825q835l303j1839J832j444Q91R864j0237o490
$$ y = [538325, 769813, 921267, 844252, 650144, 457759, 310692, 209085, 152602, 117271, 91969, 83811, 67564, 51936, 41544, 54363, 50375, 37937, 46145, 46954, 37260, 25545, 23517, 25863, 25767, 28233, 46658, 60216, 59585, 61032, 49644, 40091, 41399, 43894, 44743, 44273, 46456, 51290, 56671, 49744, 41090, 29761, 14923, 18708, 31610, 25831, 15400, 13589, 25004, 25578, 26490, 12355, 9857, 22831, 19908, 7377, 11392, 18310, 14319, 7315, 9582, -597, -4515, 5849, 9612, 22259, 27842, 28096, 24143, 30131, 31536, 26761, 12841, 3795, 21186, 26939, 11805, 5111, -105, -5194, 137, 4335, 6131, 13870, 1660, -1329, -5062, -3552, -1355, -4516, 7617, 9172, 13989, 18542, 20190, 5343, -3918, -6736, -5852, 6358, 18183, 9348, 6045, -5794, -3962, -5406, -4515, 5349, -4888, -11378]
8197a1378J350P400R193j521r342j853J0898M551p420k080k283O639j071m504
8183a421k381p495j1523k587J565O464L964J4458K932j3545o282j958J0407o877
8169a4279L97M198J3150M889o184J888k925r849p609J3234K1084K733p642k0061
8155f976m658K950J0702M959j100j0201j5878L324P881O580J718j763p632L729
8141f365M880m510m589j974J974J2456L013J1359j5167j8386p305j983J0294R027
8127g276O868j628L598K103M657o516k8801l499J9131R687k853N901P370K479
8113A1221Q92o050j4162J911j0794N478M835K601O506J0504J0178q681j0848p515
8099c924L843L016J587p210P331j392o328l830q12r031p575L475R027J0665J3232
$$ y = [-11378, -10028, -2628, 6565, 5044, -4298, -6151, 4747, 9298, 1878, -202, -2485, 4154, 3083, -1421, -3802, -11297, -22820, -25407, -23842, -17378, -13414, 1044, 3976, -9569, -15851, -17809, -7402, -14279, -13882, -9684, 3466, 8355, 2171, 4059, 1134, -8715, -16324, -3090, 17994, 20727, 13085, -6976, -11634, -8684, 2018, 6977, 5877, -4324, -20202, -16878, -8997, -2417, -699, -2462, -10094, -6365, -1485, -5995, -10584, -12558, -10584, 1872, 4885, 16244, 1077, -17309, -24614, -26597, -16303, -7276, -408, -2036, 1562, 3665, 8322, 1806, -26995, -30494, -11363, -1676, -4529, 1372, 8742, 11221, 12113, 6063, -8099, -6188, -16982, -11504, -6669, -4068, 2438, 12942, 23120, 14439, 3591, -3924, -81, 2935, 4522, -2688, 4643, 3251, -3077, -6907, -7719, -16750, -24325, -20850, -11823, -1158, 12074]
8084A2074J3818R853k179j655K681k850k140L746Q751J0580l335r411J3396J0231
8070F3560J627J637j992j2735q890k579l821l275J0624l820p129j083J6123L013
8056E1260j1255o080J6817J5738P212j1214N493R176p889M457M615l557k967Q091
8042G9897l594R372Q008J0377J9383K5049r89j558O05O56J4864J6648J4653o156
8028A87215j4519J3302O814l3312k2337m598j5743j3533j0581l356j1039q824
8016F9489M303K502j3198j3973K3430Q61k043j236q620o779r297k250N15n635
8002C8069J6060Q257O167O598K542j136p690k189O841J657M5J7881J7943J2019
7988A23064J9736J4526l704j8559j8370k3216l927K064j1734j4793L980R085j0040
$$ y = [12074, 25892, 35745, 33566, 31911, 34592, 31742, 29602, 33348, 42099, 52679, 49344, 39933, 53329, 63560, 65187, 66824, 64832, 52097, 43207, 40628, 36807, 33532, 44156, 40336, 33207, 32124, 48247, 51260, 40005, 33925, 50742, 66480, 73692, 62478, 67971, 77147, 69258, 73715, 78330, 74773, 71806, 79897, 76303, 85675, 93683, 104060, 123443, 148492, 147503, 145945, 146550, 147206, 162070, 178718, 193371, 187215, 172696, 185998, 192812, 159500, 137163, 132565, 116822, 103289, 92708, 89352, 78313, 69489, 73792, 76294, 63096, 49123, 72553, 73414, 71371, 70135, 61515, 54736, 45439, 43189, 43704, 38069, 54129, 62386, 68553, 75151, 77693, 76557, 68867, 66678, 73519, 75176, 75221, 93102, 111045, 123064, 142800, 157326, 153622, 135063, 116693, 93477, 89550, 91614, 79880, 65087, 69067, 78152, 68112]
7975F8112r338M131k4588l2641K064J5252l8r184j6311m721J6134K1121Q098r498
7961B8593j2137j1090O47R757r404n706K828R688J7857Q033L942j6512k343J3006
7947C7159K2329k921J334Q133o814k3459j3276j507L440l7r166k449j0325o631
7933d190N328m26j4391N459L368Q235M434M216L288o073J295j3639q707K146m750
7918a4407q321n968O445K457J2738J3675m716o223Q037p830R606j71n787j140
7904a605L703j9057n882J3963J3342J4374j5182j374k183k554O944j732M14n652
7890b481K331N531l275p739j4256r162Q609J745K115P058k898J255j3070J294
7876b2943J2091Q149L702m478K170O815L364m157k444o006q455R450L762n44R003
$$ y = [68112, 58774, 62905, 38317, 5676, 7740, 22992, 22954, 13770, -2541, -7262, 8872, 29993, 38091, 28593, 16456, 5366, 6013, 15770, 6366, 660, 3488, 13176, 31033, 39066, 43008, 26496, 24153, 37159, 59488, 56567, 57901, 66034, 59220, 35761, 22485, 20978, 24418, 24381, 15215, 12766, 2441, -4190, 1138, 712, -13679, -8220, -4852, 3383, 7817, 12033, 15321, 9248, 10543, -3096, -11803, -9657, -14407, -22728, -28696, -22251, -19794, -7056, 6619, 1903, -4320, 3717, -4113, 5493, 5322, -465, -1605, 2098, -16959, -22841, -8878, 4464, 18838, 3656, 2282, 99, -2455, 4489, 2757, 3171, -2481, -150, 5381, 2106, -5633, -19889, -29051, -20442, -18697, -16582, -9524, -12422, -11167, -24237, -22943, -10852, -2703, 999, -3479, -1309, 5506, 8870, 4713, 2269, -3737, -12192, -2742, 1020, 476, 9479]
7861I479M379n978j3538r284j970L542j053J3169J1968j4570o0J0152l868m397
7847b029R091N349J0042j6315L606m382q311L333N150K761J0345m560j3075j139
7833a34k3537J239J9370Q59Q388r368l981j162l627R876Q443q5j2374n152k66
7818a1511N101N38q959k252O53J224L699m127m156L821j9535q546J4005J0047
7804a9998J3344q263K46L479L929R701q448q918J0605m974l839K888p168J300
7790a6116K3249L925k620M768k787j1977P281J3393J894k715o817j6505K536L646
7776A155o983m715N2j0007l147J5124J085j566l814J1077j3855p880M833J6537
7762b104m500K266p318q979q56J0709K452K829p132l554l954O461M297O983M013
$$ y = [9479, 13858, 7880, -5658, -14942, -16912, -13370, -14423, -1254, 10714, -3856, -3916, 6236, 2368, -2029, 7062, 12411, 22453, 6138, 9744, 5362, -2949, 384, 5534, 8295, 18640, 14080, 1005, -134, -23671, -22432, -3062, -2203, 6185, -3183, -7164, -8326, -11953, -2077, 6366, 6281, -6093, -11245, -11511, -6410, -5872, -14831, -17083, -16430, -15206, -11507, -15634, -19790, -15969, -35504, -44050, -30045, -19998, -6654, -14917, -14671, -11192, -7263, 2438, -6010, -14928, -4323, -9297, -13136, -10248, -17416, -16116, 7133, 11058, 8438, 13206, 10419, -1558, 5723, 19116, 21010, 18295, 11478, -5027, -2491, 1155, -5828, -10543, -10491, -20498, -23645, -8521, -7436, -9002, -12816, -1739, -15594, -23474, -18641, -2104, -6604, -4338, -11656, -20635, -21491, -10782, -8330, -5501, -12633, -16187, -20141, -13680, -9383, -2400, 1613]
7747A613j1724O297l680j7437n61J313L689P193J5040l271j9917j5491J5053M592
7733a7291r168l361Q633J6627N949k921O251r475j1896K546Q667J613q103o775
7719a8704J1496P443J754j232J976M730M530o151L97r558r628o465J4953J2531
7705H072j887N364o145n709P485m15l539o813l531J0314L124k850p31j3839l569
7690a4669o179j436K042j311K108Q271l483j0108r031O776K0258R052K49M583
7676G122p819r090j1J904J6764L519j3215p337r475L204P582P445K870j676p25
7661A062J304j461q30M940L25o718o321m931j2194J250K459q522m901L783M340
7646b6415M965R017K359n903R301J4395k963r216K478j3693P888J085J2132R539
$$ y = [1613, -10111, -3814, -7494, -24931, -25492, -24179, -20490, -13297, 1743, -1528, -21445, -36936, -21883, -17291, -26459, -29820, -21187, -4560, 1389, -1532, 4719, -4756, -16652, -14106, -5439, -3826, -11929, -18704, -7208, 235, 1989, 757, 2733, 7463, 11993, 5842, 6239, -3319, -12947, -19412, -4459, 8072, 6185, 11549, 5404, -305, 7180, 6765, 3226, -3587, -7118, 3196, 6320, 3470, 2739, -11100, -14669, -20848, -22284, -20242, -21553, -19445, -11174, -14657, -24765, -33796, -27020, -6762, 2290, 2539, 7122, -697, -9787, -9798, -7894, 8870, 12389, -826, -8163, -17638, -14434, -6852, 593, 3463, 1787, 1062, 2366, 905, 75, 5015, 5340, -1378, -7699, -12630, -24824, -23574, -21115, -29637, -34538, -30755, -26415, -21450, -12433, -10074, -15977, -6676, 7719, 4756, -4460, -1982, -15675, -7787, -6702, 5430, 14969]
7632A4969m019j3493j0846q74R372k822j1407o430J226J7574p82R412Q345r403
7618H22p133r740l788J2404m499P606O207K015J641k325p643k328l233J344l305
7603a1955J567J5495j492P39K196P946J852J0348j0713k6904o189J407k099M19
7589a7383J1303l68n561O478K83j3138j3539J1377Q795M353O713J83l927L85r31
7574d977N884J432n589q431l131Q588K901N542q968L688J8406J5223o157j0901
7560A3510m820k46j1484p304J06m74k17J973k716M842J127L631k354n298J0429
7545G05o5O62j3905m980O597J0030j476m238P387j12O5Q304J879n590k494N880
7529H649m730o940q250m890K7720m919j8961K412J0583k078o746J155J055J77
$$ y = [14969, 10950, -2543, -13389, -14263, -4891, -7713, -19120, -25550, -24324, -6750, -7532, 1880, 10225, 822, -6311, -16051, -19839, -7435, -11934, -4328, 1879, 3894, 5535, 3210, -4433, -6761, -9994, -8650, -11955, -10388, 5107, 3615, 4354, 6550, 14496, 16348, 26696, 15983, -10921, -17110, -15703, -17802, -17383, -6080, -6448, -12009, -5531, -5248, -18386, -31925, -20548, -11753, -7400, -687, -504, -4431, -4046, -4977, 907, 2339, -3250, -11681, -14812, -6224, -3323, 2219, -6749, -3061, 15345, 30568, 24411, 13510, 8690, 8444, -3040, -10344, -10238, -10712, -10929, -8956, -11672, -6830, -5703, -2072, -4426, -9724, 705, 640, 1302, -12603, -17583, -10986, -956, -2432, -6670, 717, 605, 670, 8974, 10853, 5263, 2769, 8649, 3919, -3021, -11271, -16161, 11559, 6640, -12321, -9909, 674, -1404, -8150, -6995, -5940, -5763]
7515e763k931J628O87o089j2435j243J1118J3476j976p755J1456Q054m446p407
7501c626M653Q815J1820m001k969m073j0259j0177l1J323M964k1792j4496P969
7487c1880J8799k60K2116j119n294n508j335R895j0460m072r452j400p523j0602
7473c8095k320J5923J3602j3657K10j239j0841J2602K0735N894o478k859q555
7460a5078O251O683J0083K346r608K292N01K259k371P986l623M338N302l832k676
7445A0853L177o339K542m521j1569k102j6676j812N034N290J2635j857O106J366
7431B127j153k824K112K434N406n952n691o073k585N739o1J482l178k877q832
7416a9926k234l024j566M006N158J4464J0662L325j7221j1057O55R417J3838j99
$$ y = [-5763, -8694, -7066, -6379, -12468, -24903, -26146, -15028, -1552, -3528, -11283, 173, 8227, 3781, -3626, 1027, 9842, 21662, 17661, 14692, 10619, 360, -9817, -9848, -8525, -3561, -25353, -39849, -31880, -13081, -13341, 8775, 7656, 2362, -3146, -4481, 5414, -5046, -9118, -18570, -19970, -27493, -38095, -40415, -24492, -10890, -24547, -24337, -25576, -36417, -23815, -3080, 2814, -3664, -6523, -15078, -8827, -2144, 7939, 10285, 677, 2969, 3470, 5729, 3358, 11344, 7721, 12059, 17361, 13529, 10853, 14030, 7691, 10233, 5712, -5857, -7959, -24635, -26447, -21413, -16123, -3488, -5345, 761, 2127, 974, -1850, 262, 2696, 8102, 2150, -3541, -9614, -12199, -6460, -6521, -5039, -8217, -11094, -19926, -22160, -25184, -26750, -22744, -17586, -3122, 7540, 10865, -6356, -17413, -16758, -7341, 6497, 6298]
7402F298k0303p3K560n694L20j723P881J2867O909l20o718N896k794j697j5410
7387a2001j9783r378p12M338K1974J9752l579j3865j1508j481p868O753K4292
7374c066q023j619k404Q642j020l799n804o821j578J3700k038o698P251O699K495
7359d083n630J801n230j2317l796Q739J043K250J0235R814R077n298l978k761
7345a34q860m052O117R361N836m918k997M474R426L15K741j426j2591j4565o800
7330a8073J220K971r015q241J0737m114j92J2674J1878O633J686m884j298M371
7316F353J738r14Q262j2694k205J66l641l96k468p714J4425J2266l575j7329j3798
7301b1524n880m96K695L56N187j694N476N953p484J9426Q993p467J333j0365j3944
$$ y = [6298, -14005, -14078, -11518, -17212, -16892, -18615, -10734, 2133, 9042, 8722, 2004, 7900, 5106, 3409, -12001, -31784, -41162, -41874, -37536, -15562, 4190, 611, -13254, -24762, -26243, -34111, -27358, -3066, -11089, -12708, -15112, -6470, -7490, -11289, -17093, -23914, -25492, -11792, -13830, -20528, -13277, -6578, -4083, -9713, -7912, -13142, -25459, -29255, -20516, -19473, -17223, -6988, 2826, 11903, 6605, 2627, -134, -8994, -13046, -6929, 2432, 8268, 3350, 353, 4827, 14253, 14568, 17309, 15883, 3292, -11273, -18073, -16853, -13882, -22897, -31138, -20401, -24515, -24707, -12033, -155, 6478, 8164, 3280, 1982, 6353, 8091, 7177, 15439, 2745, 540, 706, -2935, -3331, -5799, -13513, 912, 13178, 9603, -7726, -21524, -27404, -27900, -25205, -24849, -19662, -21356, -15880, -9927, -17411, 2015, 11008, 3541, 4874, -5491, -19435]
7286a9435j898J206N046l770o006M396N570J710l499Q217J0230J463K87N65r54
7271C128J546k458m629P016m181o509L667l378j4289M81P940R64M463R05j2072
7256a7406q908J8891Q292L196M519j2541J0521L238l232p629J4193K341j6416
7243i41l179p92m9l788R66K678j1722p05P012m485o855l379L786J971l410K767
7227b0125O041J703k068l427k942l19m613j277J2392R340j6124j4810R053J8828
7213h348N244M765k916p493n336M368R424J0606K611q853m467j0515m393K56P33
7198a4314N72P279O138L590m225r082j3907l302O711J0278l700q53n66n664K538
7183a8507L394Q853M300K234m416o477j551O832j599r387R824P166M823N76j0325
$$ y = [-19435, -21333, -20127, -15081, -18851, -24857, -20461, -14891, -13181, -16680, -8463, 1767, 3230, 3517, 4082, 3128, 4674, 2216, -2413, 4603, 422, -6087, -2420, -5798, -20087, -19606, -11666, -10702, -6239, -5334, -17406, -26314, -7423, 869, 4065, 8584, -3957, 6564, 9802, 6570, -1059, 13134, 15475, -941, -4120, -4912, -4961, -8749, -7783, -5105, -16827, -17532, -10520, -15005, -21860, -25239, -21453, -19482, -22892, -20125, -14084, -12381, -14449, -17876, -20818, -21137, -25750, -27027, -14635, -5295, -21419, -36229, -27176, -8348, -3104, 1661, -1255, -8748, -14084, -9716, -292, 10314, 12925, 4072, -395, -10910, -15303, -15047, -14314, -13742, -6463, -325, 3265, -960, -10042, -23949, -27251, -20540, -10262, -13962, -14815, -15381, -21045, -18507, -15113, -6260, -1960, 274, -4142, -10619, -12170, -5338, -6937, -16324, -6500, 666, 5489, 6065, -4260]
7168d260l559Q627Q658J0702l550m178j4208l463J0516J952L61N165n243j819
7154E701k890k752l939m621J2205J4084l471O586k768j0703j5567n135M475k68
7140i063j5797q83N621N207J988p470O760L468O888P46j8014l526K2724J657r464
7125i158L746M747O744m389j3439k536N092M754n63r506k144p324m098J4165O323
7110g586o852j4236r921J5116L74k50K3969J9322q302r956j356j7558j0496J2331
7096a5401k31K404J599j1706L715J8782k852n16r563m575k579L569O19O378j0094
7081b0451P018J0898N360q137n444m020M121K735r235o614J020N648l592m45N657
7066a5481P150m311J752R253O197q209N64K662o570k1784q342J1212J3968n668
$$ y = [-4260, -7819, 808, 9466, 20168, 16618, 12440, -1768, -5231, 5285, 7237, 7598, 12763, 7520, 5701, 2811, 59, -3880, -8501, 3704, 17788, 14317, 20903, 18135, 7432, -8135, -13270, -8795, -9063, -24860, -25743, -20122, -14915, -12927, -20397, -13637, -10169, -3281, -2535, -20549, -24075, -1351, 306, -9158, -5412, -665, 6079, 1690, -11749, -14285, -9193, -4439, -5002, -14508, -16652, -23976, -28074, -13909, -7586, -14438, -28674, -38595, -23479, -23105, -23355, 614, 19936, 11634, 1678, 322, -17236, -27732, -15401, -15632, -13228, -11629, -23335, -19620, -838, -3690, -4206, -13769, -18344, -20923, -17354, -16735, -10357, -20451, -13433, -2535, 2825, -5312, -10756, -14776, -10655, -7920, -17155, -23769, -22749, -17101, -20693, -21138, -15481, -8331, -12642, -10890, -1637, 4560, -3649, -3085, -423, -6993, -28777, -37119, -25907, -11939, -17607]
7052a7607N690L168R987J0960pJ62j1976j6657j281K102q682L540O382L592q582
7037a9209J3578L168l123L011j779j2914P464Q695r739m116M997p114J4472J2846
7023A0237J1902J335j3733K581J1488o239k3655K313J05j2256m871p891j581M551
7009b5714R734M015J417J5033J0130r97p157p457J6191N061j8038j6714L529K222
6995h745P048j486k136J226J425n763O809j0403j0200k762P260J5430J5282n917
6981G068k773j134o402n552K186q20l906n294j252j2084o315R629J1618J2773
6967b258Q654j6691k079P912J203q573J0938J6075l136j0580O772O086k6802j7712
6953c0191P073j507K838j198O131q525q651m511k367K183o648J4481K0742M937
$$ y = [-17607, -11917, -8749, 1238, 12198, 12191, 12353, 377, -16280, -17561, -15459, -24141, -20601, -14219, -10627, -19209, -5631, -2463, -5586, -2575, -4354, -17268, -9804, -1109, -10848, -14964, -9967, -17081, -2609, 10237, 22139, 23474, 9741, 12322, 23810, 17571, -6084, -3771, -3666, -15922, -20793, -28684, -30265, -25714, -15980, -11965, -10548, 4485, 14615, 13618, 6461, -996, 15195, 20256, 2218, -14496, -10967, -8745, -1697, -3183, -5319, -4093, -2668, -8431, -1622, -12025, -22225, -24987, -17727, -2297, 12985, 7068, 4295, 3161, -3241, -8793, -6607, -7427, -11333, -16627, -17879, -29963, -36278, -26649, -15031, -2258, 6396, -10295, -12374, -4462, -3259, -11832, -894, 15181, 12045, 1465, 8237, 14323, -12479, -30191, -23118, -24625, -21787, -22985, -16854, -25379, -34030, -38541, -40908, -38725, -45373, -30892, -10150, -5213]
6939e213J6655J2401n754j4436p45K539J78m629k1958j6481O35PQ622K0207J4065
6924F093J1322n174j4250o050M623J0334L193K969n020r988J0772K446l421O889
6910A4738k746m849j72R74K164m69r454J3122P99k2124o483Q384J0443J3129N796
6895B3252n052k4948j2789J6126J4912n393j6469m079J825k988m48L07j747j1366
6881b8857R41k751J018M11j498J5441p44n65r884K223j553J5462j820o371J3780
6866d767O305j1525j875K269k559O1k267J0323J4543k1080j0563k062o45l019
6852b6861o594L545P590J5616J2170o715m315j4290J610J2027L683n760Q67k486
6838i913o033l200M403k958l008M80J4424O534q133m179j662J4576m394p18M037
$$ y = [-5213, 11442, 23843, 18089, 3653, 2908, 5447, 5625, 996, -20962, -37443, -36808, -36801, -28179, -7972, 6093, 17415, 12241, -2009, -8059, -3436, 6898, 10091, 13060, 8040, -1948, 8824, 11270, 7849, 14738, 11992, 7143, 6971, 7945, 10109, 9640, 186, 13308, 14107, -8017, -14500, -6116, 4327, 17456, 23252, 18200, -6748, -19537, -3411, 11501, 6108, -10361, -14440, -12615, -15603, -16051, -15744, -17491, -28857, -27916, -30667, -29649, -29238, -30736, -15295, -16039, -16604, -26488, -24265, -25818, -10356, -12176, -18547, -4767, 1538, -9987, -11862, -9593, -12152, -12091, -14358, -4035, 10508, -10572, -21135, -23197, -23842, -26861, -33455, -29910, -22320, -6704, 5466, -1249, -5564, -19854, -18244, -6217, -2534, -8294, -7427, -9913, -15946, -19146, -14743, -17701, -20709, -20229, -5805, 729, -7404, -11583, -13245, 1331, -3063, -3781, 256]
6823B56J043k926k106J2946N02J782J0640L136j5347k5927j5040M928J2101M831
6809i181O067O148m159M038n183o6R586l430n451J3765K43J903L677j3000k279
6794B678J1187p16l2087k1473l44J2089K2742J0263L13r861j559K097L870q09
6780a610o232N533J591j2590N807P078j3521k367N320j19R656J7656p637j9174
6766a0609k5784J1388K5112k802n863q112R593l64l378K367K453l09p024J3557
6752B25O900j2168j0098L53P142p027k468j255L782N061P621m858j1291q408L774
6737b2715K813L786J4992J3133r701r658K137P940r949j6953k915N362L970n160
6723b2918J0581J5411r410l323J917j589Q172k901o70k156R962R783L555n371
$$ y = [256, 1299, -1627, -3733, 9213, 9715, 11497, 22137, 25273, 9926, -16001, -31041, -26113, -14012, -9181, -3114, 3034, -1125, 2913, -2270, -2336, 7250, 3820, -1631, 12134, 12377, 14280, 17957, 4957, 2678, 13865, 13149, -18938, -40411, -40755, -28666, -5924, 4339, 4652, -5209, -6768, -4671, -801, -1610, -7842, -2309, -718, -13308, -7501, -423, -13944, -16311, -10991, -11110, -1454, 16202, 8565, -10609, -36393, -25005, 107, -2695, -8558, -16670, -7077, -7441, -10819, -8452, -5999, -6308, -13332, 225, 7125, -5043, -15141, -14788, -7646, -14673, -17141, -18396, -14614, -9553, -1932, -6790, -18081, -26489, -22715, -19902, -16116, -1124, 12009, 2308, -7350, -5213, 2727, -7222, -24175, -27090, -21728, -17758, -22918, -12337, 3074, -6336, -9659, -7742, -9331, -1159, -4060, -4730, -6886, 3076, 12859, 16414, 11043]
6709A1043k1278j3804k183o21Q961R288J143p463l365j920J834J8256J4550k360
6695A2081n893j0057L979M699p238q660r555M553P209K131l480j1511O55J0305
6681a0782M707N19J156L508M189j2396m929L174L450J0825m730L44Q195o015j8084
6666a6869k0325m482P240R085O454N70J5796P749J0022P98L36j7407L677O034
6652H678j1667N047j3690P580J1727M560j1278o817R325O713L379P909K978j0793
6638A3651k7669m924J7355K021r930l916K541p435P173J5906L964m102r160L732
6624g93J2401J1439Q971j6718j9332o655j3627M102J7147l536m604J3013j5546
6611a3738k682M770J0086L992l512j3923j310J4159r81o412l537m341k847q489
$$ y = [11043, -10235, -24039, -26222, -26843, -17882, -8594, -7451, -14914, -18279, -20199, -18365, -109, 14441, 12081, 6188, -3869, 110, 4809, -2429, -11089, -20644, -16091, -8882, -6751, -10231, -21742, -21087, -10782, -6075, -5556, -4400, -892, 3297, -9099, -14028, -10854, -7404, 3421, -1309, -965, 7230, 1215, -16869, -37194, -41676, -34436, -25351, -18897, -18327, -2531, 5218, 15240, 16038, 16374, -1033, 2644, 8678, -2989, 2058, -11632, -4052, 7675, 12235, 957, -5860, 3465, 10178, 13557, 21466, 24444, 13651, -14018, -18942, -1587, 434, -9496, -13412, -10871, -18306, -11133, 4773, 8737, 4635, -4525, -793, 11608, 23047, 32018, 15300, -4032, -10687, -24314, -20212, -3065, -6601, -11205, 1808, -13738, -16420, -11650, -1564, 2428, -1084, -15007, -16317, -2158, -3139, -9551, -13088, -17429, -20276, -28765]
6597b8765L03J0967O513o546J2641K808k035l97L287k868Q762l093r009n680j0016
6582b3128Q965J1473P273J011o613k918N56p767J010J3522p350L062j982m32m125
6567g443j531Q577k058P186r227P213N628L750N55j644o158n375J861P003M690
6552A3027p97m24O344n191k975J1794l352P729j636j0075J0871J4876m860k4608
6538A0723l628n240j981R888R686L676M791Q932r187j2371j4595l939j1021j713
6524a5979R666l86m480l611Q233J4184N842q217M42Or359q404n641Q638j246j1311
6508b1623P211K648N734p861j932K270O681N31O573l643k768J6688j2460O87J0575
6493I311j0044r720N18q700N40l02M32R721J1737L897K815N015L230k739k0335
$$ y = [-28765, -28462, -17495, -10982, -17528, -4887, -2079, -4114, -4511, -1224, -4092, 4670, 1577, -7432, -13112, -23128, -14163, -2690, 4583, 5594, -1019, -3937, -3381, -11148, -10138, 3384, -3966, -904, -2886, -3318, -7443, -8974, -397, -2455, 4731, -4496, 2717, 8345, 12095, 12650, 11006, 4848, -527, 1334, 8337, 13027, 12230, 11806, 18150, 12959, 9984, 21778, 18426, 26155, 24519, 14444, 25315, 40191, 35331, 10723, 7095, 1855, -126, 9762, 19448, 23124, 27915, 36847, 27660, 15289, 694, -3245, -14266, -15979, -6313, -6699, -11179, -14790, -6557, 7627, 13469, 5252, 5694, 5700, -3659, -12063, -17704, -9066, -10312, -21623, -14412, -11764, -6030, -13891, -15823, -13553, -6872, -6341, 232, -3411, -6179, 10509, -1951, -1264, 9311, -733, -10453, -9935, -18635, -18095, -18397, -17965, -8244, 3493, 7390, 10205, 15220, 18450, 15711, -4624]
6478d624M829P662j0480k526J5093p43p265L217k280J658l032j4001O261O076
6464a55l750j3776J1640L410q224J567R916j057j657m774O321L146K601l878j9631
6449a8301N298L977l625J9539L571l500n265J0132P295m071k1842j1117m715q801
6435c1425r156p187k410J2431J3455R204J1139J5629k555j6136K191j786j6058
6422b2664K267J217J1681J4042P202K6l024J1500q994j8209n501j6028j1902N277
6408c3110J3494N669N476J900K900J809j3423l275M824M14l125J0025K0724o125
6394H177j2302J431n052m953Q182K012L055K821N678L289q321k382j461j78k620
6379b624L561q809n314l098l09N600q716J7464J549r307q854K292J0819N966j170
$$ y = [-4624, 205, 7867, -2613, -5139, 9954, 9211, 1946, 5163, 2883, 4541, 1509, -12492, -6231, -155, -3905, -17681, -6041, -2631, -10855, -9288, 628, -429, -2086, -6860, -539, 2607, 5208, 1330, -18301, -13003, -9026, -12651, 6888, 10459, 6959, 1694, 11826, 19121, 15050, -6792, -17909, -22624, -31425, -40581, -47768, -50178, -37747, -24292, -15088, -3949, 11680, 9125, -7011, -4820, -6606, -22664, -20397, -19180, -7499, 6543, 13745, 13771, 10747, 22247, 13253, -4956, -10457, -26485, -38387, -33110, -19616, -13947, -8471, -6571, -3671, -1862, -15285, -18560, -13736, -13322, -16447, -6422, 14302, 8177, -4125, -2694, -7746, -12699, -4517, -2505, 550, 3371, 9049, 12338, 4017, 1635, 174, -4, -2624, 937, -7872, -13186, -16284, -16593, -10993, -19709, -2245, -696, -10003, -18857, -16565, -5746, 220, -950]
6364i50J4905L475q023j5463l787M154n374J540n87n05K896k232j043J163J390
6349h441J2449O993j0246n253m763J547j885j8n39L157J249p131r718J0702J6071
6334D174j0135k295L662l495Q93j599r958l245J4857L524M697j0753o156N666
6320a0163P805q889P682L545J534N531R626j3575j0323L881O129J363o242j2127
6306a4223Q294J0038K320p458j275R966J801j8115o558J587O637Q871q752P582
6292G15o308L166O566R427j723j2611q102k375k325l212R026N127M363j437k982
6277b685k27P029k778k466p028j424q19M249N95m913n372J0078r148N203M754
6262d952k394j290m956K422N551K285k325k472j4584n236R449J2702k495j4755
$$ y = [-950, 13955, 17430, 9407, -6056, -9843, -5689, -11063, -9523, -10110, -10615, -7719, -9951, -10994, -9831, -8441, 4008, 11001, 755, -4498, -9261, -7714, -9599, -9617, -10156, -6999, -5750, -12881, -22599, -11897, 4174, -5961, -8256, -4594, -8089, -7196, -8795, -18753, -21998, -7141, -3617, 1080, -9673, -15829, -10163, -2358, -11247, -3565, -20, 1514, 7045, 16671, 3096, -7227, -3346, 2783, 4146, -2096, -14223, -5929, 4109, 6429, -1029, -2304, 7662, 9463, -8652, -15210, -13623, -6986, 1885, -6867, 715, -5593, -2427, 4139, 13566, 11843, -768, -8870, -11245, -13570, -16782, -7756, -2629, 1734, 297, -2685, -2912, 4117, 1339, -1127, -8155, -9579, -10398, -6149, -5554, -10467, -15839, -5761, -14909, -9706, -4952, -7346, -8636, -13592, -11170, -5619, -3334, -5659, -8131, -22715, -27951, -18502, -5800, -8295, -23050]
6248b3050j0988K839L748K430O844J9176r726m774M842k617M084l033j7672R815
6234a8082J5902Q262O201p594P058N842J3877O390j2646j6109j938o91l325k122
6220A025p952p246R42j863L112K270K350m446J0173J9065k8255j5915k284j2513
6206d1537o524J75J21J0872J0698N214J0025L807j1491k428L988J223n262n518
6192b6637M948J3485M462J4J1976k285j049o48j8764k451O684J752M021O879O869
6177I256M890l896p389J5878J3350n136L139j2805j129O877j4494j2707k265M055
6163b376j077p576J892J970N065m85r141j1427J0663N142n731n649J691Q81l49
6148a6507p453j621M132L713K3465R382j9098j4569p597L65R611K720k180j3799
$$ y = [-23050, -34038, -31199, -27451, -25021, -18177, 999, -8727, -13501, -8659, -11276, -7192, -10225, -27897, -18082, -2180, 6082, 12283, 4689, 11747, 17589, 31466, 37856, 25210, 9101, 7163, 6472, 3147, 1025, -6927, -14173, -13231, -15094, -11982, -9712, -7362, -11808, -1635, 17430, -10825, -26740, -29024, -41537, -48061, -47886, -47765, -36893, -26195, -20981, -10956, -7149, -18640, -21068, -17080, -15857, -21119, -26637, -21689, -8204, -3742, -3728, 8248, 5963, 4914, 4266, -14498, -16949, -10265, -8513, -4492, 2387, 9256, 14146, 10250, 2861, 18739, 32089, 26953, 30092, 17287, 16158, 23035, 8541, -4166, -6431, -2376, -3453, -11029, -9137, -7167, -2102, -2587, -11728, -23155, -12492, -7350, -13081, -18730, -17039, -16158, -16507, -23960, -25581, -21449, -17736, 5729, 15111, -3987, -18556, -26153, -25788, -16177, -13457, -15637, -29436]
6134b9436O456Q880n058O69M323m512j4691O586J1386J321n343R538J1910o402
6120d373J6440K260R46M36q603j892k63p862j309N910M573Q813j2322p139m253
6105h638N929M81r402j735L787P3N785L543j3258O911R676K989l575m208j3999
6090a5641K087J8958M722k4166K422q7j2350M870J2763K777j7339m679K952K1312
6076a399N511k029m421j1961l830P984N394Q672o361K855M031M29k0331n322Q774
6061a2004K74p800K914R789P43J88o678l471m425j0976o439J0794J2093P446Q663
6046A111M244l229r561j3842P979r69M780p892o654L310O356j640q513M711J2715
6031g094J0182J052k236q942l015n576K145J3466O690O29m047j0659j2390K489
$$ y = [-29436, -22980, -14100, -19158, -18489, -14166, -18678, -33369, -26783, -15397, -14076, -19419, -9881, 2029, -4373, 12067, 14327, 15273, 15709, 7106, 5214, 4951, -2911, -4220, 1690, 6263, 15076, 2754, -4385, -8638, -2709, -2228, -11630, -13365, -9578, -9505, -3720, -177, -13435, -6524, 3152, 6141, 2566, -1642, -15641, -13554, 5404, 10126, -14040, -11618, -11705, -24055, -19185, -6422, -3645, -20984, -25663, -22711, -1399, 4112, 2083, -2338, -14299, -18129, -10145, -4751, 3921, -2440, 415, 4446, 4875, -15456, -20778, -12004, -11730, -19530, -16616, -6827, -6084, -5896, -12574, -16045, -20470, -31446, -37885, -27091, -14998, -7552, 1111, 5355, 2126, -7435, -21277, -13298, -14267, -9487, -17379, -24033, -20723, -14367, -16007, -24520, -19809, -7094, 3088, 4140, 1904, -7038, -10053, -15629, -13484, -18, 6672, 7301, 3254, -7405, -19795, -17306]
6017a7306J0142J4768P979k743k2036m571r90m489J8722l751k0413q218N924P876
6003a9106M89o567Q35j392j1159O680J4893M446n919M071m869L320R823M470J0366
5988A0381M88q580n900L735n47K754K786q346J1655J423N614l317r485j4737L442
5973h634M686j256j846J2977P909o333j8447q519k982j164L925K0227N277p746
5959a926L634M904j3101r307R088O651n698N32l659l415N090N594q358o166r228
5944b5365N169K1010J4566m256p348N818L184l570O75n82l440K763N187k600k68
5929A0943O5o412j3418k0166j792J302r789J1970M220P140K335k382J366L443
5915a1175N32m098n496j1902n424l968N345Q102R509q53k949p179j741M869J2203
$$ y = [-17306, -7164, 7604, 15583, 12840, -9196, -13767, -14757, -19246, -524, -4275, -24688, -32906, -26982, -19106, -18617, -25184, -24349, -25741, -36900, -30220, -15327, -10881, -16800, -12729, -17598, -14278, -4455, 15, 10381, 10869, 2289, -3611, 124, -423, 2331, 5117, -3229, 8426, 9849, 15463, 12146, 2661, -12076, -8634, -3948, -5204, -7050, 5927, 13836, 7503, -10944, -19463, -22445, -23609, -19684, 543, 5820, -1926, 1708, 6612, -6489, -15796, -6708, -57, -5755, -5223, -8882, -12297, -7207, -1613, -9971, -16137, -25365, -20196, 814, 15380, 11124, 3776, 9594, 12778, 9208, 9883, 9301, 5861, 8624, 13811, 11211, 10943, 11008, 4596, -8822, -28988, -30780, -29478, -39267, -27297, -23077, -15937, -13602, -15984, -14618, -11175, -10643, -14741, -20237, -32139, -37563, -41531, -36186, -28084, -18575, -19428, -22377, -29556, -31297, -26428, -14225]
5900a4225P870m513L369J211K452o065j4846n417Q871M486l428m914l148P607
5886b0690J1350O961o206n842k80m1l768J62J123P819L479l387M765Q260m718
5871a013j151j1164P4P074J7832J906j925k957j7928n248k259J2855J5446l588
5857G954k2879q537K485Q383m555l91N186J9969J1054p06j1411n123l063J617
5843a7O34M285J027j2654M323L864j664j3533l26K760P364J0283N873Q244j3042
5828G421o006k204O20J9979L096p920P022q386j46K874k909J215k83j109j1951
5813A313k1149N366N624L59n948L932J1462o205j2111j2186k211N687N457R749
5799a0861N396j345J1578O921o71O757P610j3693j2004j6158j618q535P878J117
$$ y = [-14225, -6355, -10868, -7499, -6288, -3836, -9901, -24747, -30164, -21293, -16807, -20235, -25149, -28297, -20690, -9340, -2379, -8585, -14427, -14707, -14748, -18516, -18354, -17231, -9412, -5933, -9320, -4555, 3705, -1013, -2164, -13328, -13254, -6180, 11652, 13558, 11633, 8676, -9252, -14500, -16759, -3904, 11542, 7954, -14925, -23462, -20977, -12594, -17149, -17540, -12354, 7615, 18669, 17963, 6552, 1429, -1634, -17, 617, 4902, 5929, -6725, -2402, 1462, -202, -13735, -14061, -11301, -3937, 6346, 12219, 20463, 7421, 1415, -789, -169, 19810, 22906, 14986, 22008, 13622, 13476, 16350, 13441, 14656, 14373, 13264, 1313, -19836, -14470, -8846, -8487, -14435, -10503, 959, -5246, -17357, -29543, -31754, -26067, -20610, -10861, -5465, -6810, 4768, 11689, 11018, 17775, 25385, 11692, -312, -16470, -18088, -26623, -18745, -17628]
5785a7628K313J9652J3872n80m881n967P132n96j9039j0286P054q48o363J9591
5771C426m58Q139J755j3182j0194J5887J1734o845o334J741P505L91J693j2054
5757C204j3755r179M096J4234J7525K100j0350l538K956j3788k16n47j250R00
5743g608o503o388L744M889k24L24R305J049J621j061p002k392J657m204o003
5728a8796J0268j0300m9j737O953J691Q962M017J809j2045M312l470R756Q763
5714A0134n867n469K707J1900r108N644N565J0110j173q889j2264r055L560j896
5700d101j0371k562J7503J122j931k743q625n464L042o358J4410N803P94q41O870
5685F548J289K314k541j4279n096R556n076o977P35J2060K624o586n853r988p16
$$ y = [-17628, -15315, 4337, 18209, 17629, 12748, 6781, 13913, 13317, -5722, -16008, -8954, -9802, -16165, 3426, 2968, 11107, 12862, -320, -10514, 5373, 17107, 10262, 3928, 5669, 13174, 13565, 15258, 3204, -10551, -19730, -15634, -1400, 16125, 18225, 7875, 4337, 7293, -6495, -6711, -7258, -8508, -7608, -14111, -20499, -16755, -11866, -12090, -11766, -2461, -1412, 209, -852, -7854, -10246, -8589, -12793, -18796, -8528, -18828, -18877, -20614, -13661, -11970, -3008, 1009, 2818, -9227, -4915, -8385, 1371, 10134, 4267, -1202, 1505, 13405, 4297, 9941, 15506, 25616, 24443, 15554, 3290, -5765, -2205, -4101, -14472, -17034, 469, 1591, -340, -3083, -11708, -17172, -14130, -20488, -6078, -275, 519, -322, 6548, 7837, 10151, 7610, -6669, -11765, -2209, -7285, -14262, -13527, -1467, 1157, -5429, -11282, -21270, -21986]
5670b1986O257O096k103L47Q991L147Q402r719R697l182j409L528O17J377n730
5655D330n742N898J1373j3410j0328J62p397m602k773O17K296n389J2422J1674
5641h69j144n266j0536m461K620J819n042K05J5485p461M836P4j991K371N996
5626c364O896N74p268J682M281L544J1071M725n390j8609k962R697M139j210k126
5611E680p050l910N105j1421k782k853Q233o654j1637M414o57P253M706K305M002
5596e266O900M761J1188N074k251J99p877n508j2060o85L81P932N970N661Q53
5581A5272j1795J34J423j8067m53R527J347p802r080Q258J6017L505oq63J048
5566H465l136m966m33j1677n903r038m539J0216N043P125k786l722k668Q570N202
$$ y = [-21986, -15729, -9633, -11736, -11389, -2398, 749, 9151, -568, 9129, 5947, 4538, 8066, 8683, 10060, 4330, -1412, 4486, 15859, 2449, -7879, -7717, -15114, -19716, -22489, -21872, -19576, -24965, -12543, -869, -2013, -7279, -17815, -22276, -19656, -17837, -22879, -22674, -7189, -14650, -9814, -9740, -11731, -9360, -3364, 3532, 4106, -3162, -1480, 2801, 6345, 17416, 22141, 16751, -1858, -4820, 4877, 9016, 7806, 5680, -1370, -5280, -175, -11596, -14378, -17231, -8998, -15652, -27289, -22875, -23532, -16279, -11573, -9268, -5266, 1634, 6395, 17583, 22657, 20406, 20605, 12728, 7220, -4840, -5525, -5144, 2788, 8758, 14419, 15272, 3477, 3611, 5034, -13033, -13486, -3959, -2612, -10414, -19494, -11236, 4781, 8286, 8280, 7417, 8465, 5329, 363, -70, -11747, -17650, -26688, -31227, -21011, -15968, -8843, -11629, -15351, -18019, -9449, -4247]
5551d247k59j0695N714O400M935j385j698j3638m646O86K117o768M765J8603O672
5536F556j1053r351k023j5307l08R524J9692O072L502R741p699n423p512O022
5522B433O382q654j6832k2535m101R239N341R592J883l889J8464J4906l62M369
5508A6236p965K597r860j1949J2128K411l439q584Q475k669j7587j0879Q06P468
5494b2811R652J7194n247j136o283p502n443o912J7364M223o661k001j1165M509
5480b2219N387J3831L032N449k87L982N577L504j4176j3552L899Q023r098l366
5466a0014n659J0782J113k330k471J696M485M775j21r12J187r980j7248m613J0473
5451a8837l044k2031j2823Q297O110M013M815J4405J4018J4688N671j1645q454
$$ y = [-4247, -4506, -15201, -9487, -3087, 1848, 463, -1235, -14873, -19519, -18833, -16716, -23484, -18719, -116, 6556, -4497, -13848, -15871, -31178, -31486, -21962, -2270, 3802, 7304, 17045, 9346, 3923, -3589, 2433, 8815, 161, -16671, -39206, -43307, -34068, -28727, -19135, -17252, -21141, -2677, 12229, 11867, 16236, 8271, 10868, 1008, -10941, 1187, 3598, 159, -8425, 50, -2619, -20206, -31085, -30279, -22811, -13159, 4035, -1212, -2348, -8631, -16133, -21576, -28488, -11124, -6901, -13562, -15563, -26728, -22219, -16832, -3001, 31, 5480, 5193, 9175, 14752, 18256, 4080, -9472, -5573, 2450, -6648, -10014, -15673, -4891, -3778, -6108, -8579, -6883, -2398, 2377, 2256, 1344, 2531, -7449, -24697, -29310, -18837, -21881, -43912, -56735, -48438, -42328, -38315, -33500, -19095, -5077, 9611, 15282, 3637, -4817]
5438d817K672o967m575k658p107k278J3196R483J0222j4743N096O877k2675j3855
5424c2129Q197K226J1796j302r708j1374K671R81P910N604O428J275M449j0326
5410a3302r584P497Q335J2405o875j3573m581J4063R245n761P930J2437p947j1199
5396i10N129o089R210n760j4690M832R69J1548N703n631j7468l111K903k908K1364
5381E091O196n414M004j1737r07Q280j4400j6009n817J1820P295j1128o838N848
5367b3716K070P041M384j987m871R989O84J999L255l108M746j1654P344N284k66
5352A194K712j5449J054J1540m605N787N861Q83k270K512j362k620j0729k6425
5338c1917N08R270N042l180J9779R763q755o295l631k10Q651M222O881M621j8306
$$ y = [-4817, -2145, -9112, -13687, -16345, -23452, -25730, -12534, -3051, 7171, -7572, -2476, 4401, -18274, -32129, -23932, -21706, -9910, -11212, -20920, -32294, -29623, -28642, -20732, -15128, -8700, -7425, -2976, -13302, -22886, -15389, -7054, 5351, -1524, -15097, -19678, -5615, 3630, -2131, 5799, 18236, 10289, -910, 4219, -1870, 7340, 1580, -13110, -8278, -7309, 4239, 9942, 4311, -13157, -16268, -13365, -16273, 5091, 11287, 5873, 9877, -1860, -2767, 5513, -8887, -24896, -30713, -18893, -11598, -22726, -29564, -23716, -21646, -14605, -10221, -12208, -17079, -7090, -6406, -4407, -1152, -4260, 486, -11168, -3824, 1460, 1194, 3906, -11543, -10489, 1051, -3554, 2233, 8094, 8977, 6707, 9219, 7857, 5237, -5492, -31917, -31409, -22139, -17097, -20277, -498, 9265, 510, -5785, -9416, -9626, -975, 3247, 10128, 14749, -3557]
5323c557j8500o400J4580K6797J3574K474j5480j6971N606L15l261M46o907K624
5309d660K455Q183j8385o940J650J4757o196j1785J4286j922j1536M684O943J9994
5295A1528L075j6101o570J4890N7j8138j0495j502R61q03j3447p341J9502J9264
5281e120J3097M623l165K970m576n401k934j3735j4200J5751J7741O578j4807
5268c178j0693O353L575J3216j342n539l249p541L373R270J171m635K250k297
5254G34J744M762j0051o555J1612k815j099Q108J2528o769J946k304n801j6319
5240a0279q120N155j0736K486J1069K242n37R353n028o271J3496J7039j524J1077
5226B9422j0537l0023o92O595R068N030j5503k841P885J201l241R788O524N189
$$ y = [-3557, -22057, -28457, -13877, 12920, 26494, 28968, 13488, -3483, 2123, 2438, -823, -377, -7284, -4660, -2205, 5978, -12407, -19347, -17697, -2940, -9136, -20921, -6635, -8557, -20093, -15409, -8466, 11528, 14603, -1498, -8068, 6822, 6879, -11259, -21754, -23256, -22295, -23098, -36545, -43886, -24384, -5120, 7977, 12600, 9435, 12405, 7829, 2428, -506, -14241, -28441, -12690, 5051, 11629, -3178, -13871, -7518, -3943, 9273, 7931, 2392, -857, -8398, -5025, 4245, 5416, 781, 3031, 734, 2478, 7240, -2811, -9366, 2246, -569, -1668, 6440, 18968, 12199, 14145, 11841, 6040, -10279, -18399, -13244, -23980, -21494, -10425, -8183, -8720, 633, -4395, -10666, 2830, 19869, 18345, 29422, 18885, -11138, -11830, -5235, 3833, 8863, -6640, -9481, -1596, -395, -3636, 6152, 12676, 17865]
5212A7865j0904k665O403j652p890j079L183m124Q025J2252N990o845k5R023n719
5197B1838r268l394q794p458q944Q818l094l750o132l227j771J1127O433m781
5183a2397M38J134J0669k024P63J3516L044q606j0827N917R45o441J676j6722
5169a8915K75P245l668J2587j1107J613J1639l424j0269M530R431o880j0274Q276
5155h941Q151r482p880O895P379R662l902p817k818L140q584l965J2307J657P095
5140B897q79K254r07M954K515J323j674M051l311L200j7616o949J2965P514r437
5125I00Q301N22q323l585K327o075q844k284Q236J5255k728o216p132O36J1074
5110B064k083m368J544J705o136Q256J7408L037j2618j3740k761N300P872J1931
$$ y = [17865, 6961, 4296, 10699, 9047, 1157, 78, 3261, -863, 7162, 19414, 25404, 18559, 18534, 27557, 21838, 12570, 9176, 382, -7076, -16020, -7202, -10296, -14046, -20178, -23405, -25176, -14049, -7616, -12397, -11959, -10825, -156, -2180, -1417, 12099, 15143, 6537, -4290, 1627, 2572, -3869, -2193, -18915, -18640, -11395, -15063, -2476, -13583, -11970, -331, -3755, -14024, -9494, -63, -6943, -17217, -8941, -790, -10272, -18152, -11257, -3878, 5784, 1882, -5935, -8753, -5613, -14197, -18162, -5855, -4198, 2897, 2018, 4272, 3365, 8319, 10834, 12157, 10483, 14534, 11223, 14423, -3193, -10142, 2823, 10337, 900, 9201, 9723, 1400, -2185, 142, -5933, -14777, -17061, -8825, 6430, 3702, -2514, -9646, -9010, 2064, -19, -4387, -2843, -1138, -7274, 982, 18390, 21427, 8809, -4931, -7692, -2392, 5480, 17411]
5096A7411q749j5376l754J385J3135M553n413o218K829J196j6457m082O64P693
5082a1183N391L35J103k634J765p805J048Q135Q386J0543o186P59n41q552r564
5067i000K930k766R311r755j881J6489p755n348j9049j237K491J1888J2880p300
5053h102j5760P207Q338Q496J1952k568j0501p160j3538J987J3967L834k530J3526
5039I148J16j1708j0101Q324J7419K972j3683j5054k573k255o30J884J3696R863
5025G418j704l817N070o925N890k676q576K787k582r481n041o690J729p984P326
5010b5256Q48j1699O248K1908R284j3326j002o993k574J3579J1359l211m359K695
4996b499K0147O438j2998k4516r862j1738P23J8131j015l396m011Q532m243M823
$$ y = [17411, 8662, -6714, -10468, -9083, 4052, 8605, 3192, -3026, -197, 999, -15458, -19540, -18876, -11183, -5792, -5457, -4354, -6988, -5223, -13028, -11980, -3845, 4541, 15084, 8898, 9657, 9116, 564, -9000, -6070, -8836, 475, -9280, -11161, 5328, -2427, -7775, -26824, -28061, -25570, -13682, -802, -8102, -23862, -16655, -8317, 179, 12131, 9563, -938, -8098, -21636, -19649, -5682, -1848, -4378, 9148, 9264, -2444, -12545, -4221, 13198, 16170, 2487, -12567, -15140, -17395, -18025, -16141, -2445, 7418, 5714, 1897, 6967, 42, 5932, 3256, -5320, -2533, -5115, -14596, -19637, -26327, -24598, -32582, -25256, -24408, -36107, -29859, -7951, 1333, -11993, -12995, -19988, -22562, -8983, 2376, -835, -5194, -2499, 17648, 24086, 11088, -13428, -23290, -35028, -34305, -16174, -17189, -20585, -24596, -16064, -20307, -15484]
4982a5484O516R746R227j4653j0900j7226L814J0036J4552l136r551m401J162
4969b0298J2438L252L475j292k136P716O145n186j9849q400k212j0865M309J3857
4955a9046N670M860J0333k640m489J478J644L069j5575m438q786m312q0J3526
4941a8786J1828r758n226M590Q080N7m208m740J6788M47j1444J1283o106k022
4927i217M547O655j3856M131j701k372q566J2199R558j3703N319k387j984Q057
4913c320O159j899j2949m42J776Q680P093J204l960j7428j1984L722k876M694
4899b1530J5954K509j0823M46J2845k153n977j2035L116K3724J8515j5372q804
4886D15j3514p589R736J0917o805n164k285O811P196Q143r42l13J2638N124m886
$$ y = [-15484, -8968, 778, 10005, -4648, -15548, -32774, -28960, -18924, -4372, -7508, -17059, -21460, -20298, -7860, -4608, -1133, -2425, -4561, 3155, 9300, 4114, -15735, -24135, -26347, -37212, -32903, -19046, -13376, -8516, 1817, -823, -5312, -3834, -2190, 879, -14696, -19134, -27920, -32232, -32312, -18786, -6958, -16716, -21942, -17352, -9272, -9215, -13423, -18163, -1375, -928, -12372, -1089, -7195, -9217, -4670, 1985, -11871, -7740, -9441, -11813, -20379, -8180, 1378, -12325, -7006, -9393, -11377, -3320, 2839, 940, -12009, -12451, -10675, -1995, 5098, 6302, 2342, -15086, -27070, -23348, -26224, -21530, -5576, -3067, -13890, -13444, -599, -2752, -8729, -20764, -17648, 6076, 24591, 9219, 415, -13099, -20688, -10952, -35, -6840, -12004, -14289, -7478, -282, 7861, 6919, 6606, 19244, 24368, 19482]
4871A9482q874k449o666K957J641O921j800n463j1891K670M642k023p419k254
4857a0526r06j12L667P670K552K473m008K510K55j6365j5582Q985J7173Q161k0094
4842a4147Q893M55m066J4934Q162k2679k711P902J4685O542p010j0129p98m062
4828d029L55O215l167k958j0426J2836J0794L861L557k407q722N599p383n32K215
4813E808m782j3095p106k628P381P590L056j248J88L524p833j175J0933N993l272
4798C334j3071o775j648J3851n270m5J1424N46p91N292m592O662q292k0017Q224
4783a1168J927k451R835M593K509M208r862j4884K897R987m842J189M119N99R768
4768H424k591o599j115J6536J2243o073k498l021n490j0619r480r077Q576L588
$$ y = [19482, 10608, 8159, 1493, 4450, 6091, 13012, 11212, 5749, -6142, -3472, 1170, -853, -8272, -10526, -11432, -11544, -7877, -207, 2345, 4818, 810, 3320, 3575, -12790, -28372, -19387, -2214, 5947, -14147, -5254, -4799, -8865, 6069, 14231, -8448, -11159, -3257, 11428, 17970, 10960, 831, 33, -4029, -3674, 2541, -626, -3584, -14010, -1174, 9620, 13481, 17038, 14631, 5909, 11508, 4125, 3593, 5808, 1026, -12069, -19175, -21803, -14422, -6832, -3776, -5024, -4836, -1312, -9145, -10320, 613, 6606, 3334, -9737, -16512, -18160, -4309, -9579, -9624, 1800, 2346, 1555, 6847, 2255, 8917, 625, -19392, -11168, -9241, -11692, -1857, 2736, 5245, 9453, -409, -15293, -12396, -2409, -7251, -6062, -1943, -1344, 8424, 5833, -766, -1881, 14655, 26898, 20825, 18327, 15306, 9816, -803, -10283, -19360, -10784, -7196]
4754g196n430N405J0006L688m724o841r71M975r696j810J8807J2565k108p373
4740I297n958q59K650j963j0048l096O174K782O57j1111J0377Q246k739q44J243
4725D808o998l377K1656L8k944j0496j2420K661Q43P3K0099Q751k099o179O859
4710B1275n132l681m025r637r689M006j667p167P884J1624L19o238r261m977K393
4695a3973R98P107Q147P727p531N354O64J504R04j895j545M293m013k977Q186
4680A2950M788j2490j512R371J668J349J836j1553j6490o039J3670L676j0326
4667i102Q60q11p55N878J5652N826j1224j1819k675R098L869R61M034r109j0646
4652i963k985K053R982M612k302n778k049Q147j919o91N430J712j155j1686j3195
$$ y = [-7196, -12626, -7221, 2785, 6473, 1749, -5092, -6063, -1088, -10784, -12594, 6213, 18778, 16670, 9297, 3339, 2480, 5130, 3167, -6881, -9977, -3803, -1021, -364, -11475, -1098, 7148, 4409, 3565, 4808, -2190, -5567, 16089, 16127, 13183, 2687, -9733, -7072, -6229, -6156, 13943, 22694, 20595, 14416, 21275, 16143, 12462, 8437, -1200, -10889, -6883, -8550, -15717, -7833, 3791, 4110, -2128, -11389, -16366, -13973, -12975, -5868, 2279, 10006, 2475, 7829, 8493, 9997, 10901, 9006, 7461, 11754, 7741, 4764, 12950, 17738, 5248, 3736, 13107, 14775, 16124, 17960, 6407, -10083, -16122, -2452, 1224, -9102, -8242, -9053, -9808, -3930, 11722, 17548, 6324, -5495, -8170, 928, 4797, 5758, 9792, 683, -9963, -12948, -10895, -913, 3699, 1397, -4381, -6430, 1717, -202, -893, 4537, 6249, 5094, -6592, -19787]
4637a9787L281Q482L804q488K923P256R877k703j1265o180J804J3698J7066o886
4623A2882j6811k047L175n464J3745N428M512P761r656j0685L874m262j971j213
4609g32Q21j3974o642O300M521r78L099J434K772m244j8506m202N087J6724K811
4594e709J1349M952j4919o691J997K89N040R493j353J362L22m587j1585k695J6826
4579D091M142j891n788J993P689L030n359k140l964j522O669P530n193n832j5879
4564a2424j0366K2352K2674r770k0875j916J035O908L792O928N817j0133j3128
4551i106l355n334Q978J8448R39p680p60K888R152Q259n554o080l60O662j9703
4536b606p845L378M090j090o864R922J21m809q797j6373q167M533J2449J4157
$$ y = [-19787, -16506, -8024, -4220, -12708, -9785, -2529, 7348, 4645, -6620, -12800, -10996, 2702, 19768, 12882, -3929, -5976, -2801, -8265, 5480, 10908, 15420, 23181, 13525, 2840, 6714, 2452, 481, -732, 89, -13885, -20527, -14227, -9706, -10684, -7585, -6151, -3379, -7623, -26129, -30331, -25244, -8520, -5709, 5640, 10592, -4327, -11018, -9021, -8732, -3692, 5801, 4448, 5810, 6132, 1545, -10040, -12735, 4091, 8233, 6342, 554, 2547, 10236, 13266, 7907, 5767, 1803, 281, 6950, 14480, 9287, 3455, -12424, -22790, -438, 22236, 12466, -8409, -10325, -9290, -2382, 1410, 8338, 14155, 4022, -9106, -12461, -17795, -8817, 9631, 10570, 2890, 2130, 5018, 14170, 22429, 16875, 10795, 10435, 17097, -2606, -10451, -7073, -2983, -4073, -10937, -1015, -894, -5703, -14500, -30873, -39040, -34507, -22058, -7901]
4522g901J8439J1193r285j4000j5472l648N733J3322q512o49J683L427m628J827
$$ y = [-7901, 10538, 21731, 12446, -1554, -17026, -20674, -14941, -1619, -10131, -10780, -9097, -5670, -10298, -8471]
$$ [...]
##END NTUPLES=NMR SPECTRUM
##END=
