##TITLE=Analysis number 329040
Compound Code cc 58704
Book Reference 486/174
Project Code adrs
Chemist Name simons
##JCAMPDX= 6.0         $$ Bruker NMR JCAMP-DX V2.0
##DATA TYPE= NMR SPECTRUM
##DATA CLASS= NTUPLES
##ORIGIN= Bruker BioSpin GmbH
##OWNER= nmr
$$ XWIN-NMR		Version 3.5
$$ Thu Jul 26 13:21:22 2007 GMT Daylight Time (UT+1h)  MAYBRIDGE\nmr@NMR_250MHZ
##.OBSERVE FREQUENCY= 250.131544655141
##.OBSERVE NUCLEUS= ^1H
##.ACQUISITION MODE= SIMULTANEOUS (DQD)
##.ACQUISITION SCHEME= undefined
##.AVERAGES= 16
##.DIGITISER RES= 18
##SPECTROMETER/DATA SYSTEM= dpx250
##.PULSE SEQUENCE= zg30
##.SOLVENT NAME= CDCl3
##.SHIFT REFERENCE= (INTERNAL, CDCl3, 0, 16.522)
##AUDIT TRAIL= $$ (NUMBER, WHEN, WHO, WHERE, WHAT)
$$ ##TITLE= Audit trail, XWIN-NMR		Version 3.5
$$ ##JCAMPDX= 5.01
$$ ##ORIGIN= Bruker BioSpin GmbH
$$ ##OWNER= nmr
$$ C:\u/data/dgb/nmr/ADRS/1530/pdata/1/auditp.txt
$$ ##AUDIT TRAIL=  $$ (NUMBER, WHEN, WHO, WHERE, WHAT)
(   1,<2007-07-26 13:20:59.37 +100>,<MAYBRIDGE\nmr>,<NMR_250MHZ>,
      <created by zg, POWCHK disabled, PULCHK disabled
       configuration hash MD5:
       76 6E 9A 78 1E 09 19 81 EC 84 63 8F B0 6A 59 2D
       data hash MD5: 64K
       42 EC 25 DF 7B 08 F7 BE B7 3E 94 16 BC 09 94 9B>)
(   2,<2007-07-26 13:21:12.75 +100>,<MAYBRIDGE\nmr>,<NMR_250MHZ>,
      <Start of raw data processing
       ef LB = 0.3 FT_mod = 6 PKNL = 1 SI = 32K 
       data hash MD5: 32K
       55 01 8E DC DA D2 AB 58 F8 DC 80 00 3E 20 85 FF>)
(   3,<2007-07-26 13:21:14.40 +100>,<MAYBRIDGE\nmr>,<NMR_250MHZ>,
      <apk 
       data hash MD5: 32K
       FD EA 1E 27 98 95 E6 AF 2E DB F4 A3 58 AE 3B 75>)
(   4,<2007-07-26 13:21:15.28 +100>,<MAYBRIDGE\nmr>,<NMR_250MHZ>,
      <abs ABSG = 5 
       data hash MD5: 32K
       A2 1E 57 E9 D7 24 84 81 1E 03 D2 FC FF 5E 37 BD>)
$$ ##END=
$$ 
$$ hash MD5
$$ 76 09 8E 6D 8F AA A8 7E 30 30 42 F5 45 95 28 42
##$RELAX= 
##$RELAX= 
##$RELAX= 
##$RELAX= 
##$RELAX= 
##$RELAX= 
##$RELAX= 
$$ Bruker specific parameters
$$ --------------------------
##$DU= <C:\u>
##$EXPNO= 1530
##$NAME= <ADRS>
##$PROCNO= 1
##$TYPE= <nmr>
##$USER= <dgb>
##$AMP= (0..31)
100 100 100 100 100 100 100 100 100 100 100 100 100 100 100 100 100 100 
100 100 100 100 100 100 100 100 100 100 100 100 100 100 
##$AQSEQ= 0
##$AQ_mod= 3
##$AUNM= <au_zg>
##$AUTOPOS= <22 >
##$BF1= 250.13
##$BF2= 250.13
##$BF3= 250.13
##$BF4= 250.13
##$BF5= 500.13
##$BF6= 500.13
##$BF7= 500.13
##$BF8= 500.13
##$BYTORDA= 1
##$CFDGTYP= 0
##$CFRGTYP= 5
##$CHEMSTR= <none>
##$CNST= (0..31)
1 1 145 1 1 1 1 1 1 1 1 1 1 1 1 1 1 1 1 1 1 1 1 1 1 1 1 1 1 1 1 1 
##$CPDPRG= <>
##$CPDPRG1= <>
##$CPDPRG2= <>
##$CPDPRG3= <>
##$CPDPRG4= <mlev>
##$CPDPRG5= <mlev>
##$CPDPRG6= <mlev>
##$CPDPRG7= <mlev>
##$CPDPRG8= <mlev>
##$CPDPRGB= <>
##$CPDPRGT= <>
##$D= (0..31)
0 1 0 0 0 0 0 0 0 0.06 0 0 0 0 0 0 0.0002 0 0 0 0 0 0 0 0 0 0 0 0 0 0 
0 
##$DATE= 1185452458
##$DBL= (0..7)
120 120 120 120 120 120 120 120 
##$DBP= (0..7)
150 150 150 150 150 150 150 150 
##$DBP07= 0
##$DBPNAM0= <>
##$DBPNAM1= <>
$$ [...]
##$SUBNAM7= <"">
##$SUBNAM8= <"">
##$SUBNAM9= <"">
##$SW= 20.6930455092707
##$SWIBOX= (0..15)
0 0 3 0 0 0 0 0 0 0 0 0 0 0 0 0 
##$SW_h= 5175.983436853
##$TD= 65536
##$TD0= 1
##$TE= 297.16
##$TE2= 300
##$TE3= 300
##$TEG= 300
##$TL= (0..7)
0 120 120 120 120 120 120 120 
##$TP= (0..7)
150 150 150 150 150 150 150 150 
##$TP07= 0
##$TPNAME0= <>
##$TPNAME1= <>
##$TPNAME2= <>
##$TPNAME3= <>
##$TPNAME4= <>
##$TPNAME5= <>
##$TPNAME6= <>
##$TPNAME7= <>
##$TPOAL= (0..7)
0.5 0.5 0.5 0.5 0.5 0.5 0.5 0.5 
##$TPOFFS= (0..7)
0 0 0 0 0 0 0 0 
##$TUNHIN= 0
##$TUNHOUT= 0
##$TUNXOUT= 0
##$USERA1= <user>
##$USERA2= <user>
##$USERA3= <user>
##$USERA4= <user>
##$USERA5= <user>
##$V9= 5
##$VALIST= <valist>
##$VCLIST= <CCCCCCCCCCCCCCC>
##$VD= 0
##$VDLIST= <DDDDDDDDDDDDDDD>
##$VPLIST= <PPPPPPPPPPPPPPP>
##$VTLIST= <TTTTTTTTTTTTTTT>
##$WBST= 1024
##$WBSW= 4
##$XGAIN= (0..3)
0 0 0 0 
##$XL= 0
##$YL= 0
##$YMAX_a= 476710
##$YMIN_a= -431362
##$ZGOPTNS= <>
##$ZL1= 120
##$ZL2= 120
##$ZL3= 120
##$ZL4= 120
##$ABSF1= 16.522
##$ABSF2= -4.171173
##$ABSG= 5
##$ABSL= 3
##$ALPHA= 0
##$AQORDER= 0
##$ASSFAC= 0
##$ASSFACI= 0
##$ASSFACX= 0
##$ASSWID= 0
##$AUNMP= <proc_1d>
##$AZFE= 0.1
##$AZFW= 0.1
##$BCFW= 0
##$BC_mod= 0
##$BYTORDP= 0
##$COROFFS= 0
##$CY= 12.5
##$DATMOD= 1
##$DC= 0
##$DFILT= <>
##$DTYPP= 0
##$F1P= 14.0000005364418
##$F2P= -0.99999901652339
##$FCOR= 0.5
##$FTSIZE= 32768
##$FT_mod= 6
##$GAMMA= 0
##$GB= 0
##$INTBC= 1
##$INTSCL= 1
##$ISEN= 128
##$LB= 0.3
##$LEV0= 0
##$LPBIN= 0
##$MAXI= 10000
##$MC2= 0
##$MEAN= 0
##$ME_mod= 0
##$MI= 0
##$NCOEF= 0
##$NC_proc= -2
##$NLEV= 6
##$NOISF1= 0
##$NOISF2= 0
##$NSP= 0
##$NTH_PI= 0
##$NZP= 0
##$OFFSET= 16.522
##$PC= 1
##$PHC0= -52.43171
##$PHC1= 4.634127
##$PH_mod= 1
##$PKNL= yes
##$PPARMOD= 0
##$PSCAL= 4
##$PSIGN= 0
##$REVERSE= no
##$SF= 250.13
##$SI= 32768
##$SIGF1= 0
##$SIGF2= 0
##$SINO= 400
##$SIOLD= 32768
##$SREGLST= <1H.CDCl3>
##$SSB= 0
##$STSI= 32768
##$STSR= 0
##$SW_p= 5175.98343685301
##$SYMM= 0
##$S_DEV= 0
##$TDeff= 65536
##$TDoff= 0
##$TI= <Analysis number 999999
Compound Code 99
Book Reference 9
Project Code 9>
##$TILT= no
##$TM1= 0
##$TM2= 0
##$TOPLEV= 0
##$USERP1= <user>
##$USERP2= <user>
##$USERP3= <user>
##$USERP4= <user>
##$USERP5= <user>
##$WDW= 1
##$XDIM= 32768
##$YMAX_p= 377254043
##$YMIN_p= -155173
$$ End of Bruker specific parameters
$$ ---------------------------------
##NTUPLES= NMR SPECTRUM
##VAR_NAME=  FREQUENCY,     SPECTRUM/REAL,   SPECTRUM/IMAG
##SYMBOL=    X,             R,               I
##VAR_TYPE=  INDEPENDENT,   DEPENDENT,       DEPENDENT
##VAR_FORM=  AFFN,          ASDF,            ASDF
##VAR_DIM=   32768,         32768,           32768
##UNITS=     HZ,            ARBITRARY UNITS, ARBITRARY UNITS
##FACTOR=    0.157963299565203, 1,           1
##FIRST=     4132.6476996994, 0,             0
##LAST=      -1043.33573715361, 0,           0
##MIN=       -1043.33573715361, -155173,     0
##MAX=       4132.6476996994, 377254043,     0
$$ Real data points
##PAGE= N=1
##DATA TABLE= (X++(R..R)), XYDATA
$$ [...]
17661A1107j872p701n952O772P247o084p89M105m648m999J582n4L457J220J489
17646D880Q6l086l129K311j84L020J943n540j893K774j19m938K448O410N22K332
17630G837K259n03m794O40R674O778r34p067o331k44o646q467L743k137L842L175
17614H25k955k559K800L901L141J074r33q279j800J486J638K858K180m327m818
17599e768O910J4281m291p886N07K799N648j624o688j037P9l295J978J072R14
17584C599k570N9Q03R52j708K908k964N540j357p455l679J344Q559Q226K230K325
17568A6812Q03j08m141k987l407l637J314J16m01k234Q68L419k934l672N676n339
17552A48J988M945J111k009j427N696M724Q81K407j164n637l016m696k956j8J585
$$ plain form
17661 11107 9235 1534 -4418 2354 9601 3517 2728 6833 2185 -2814 -1232 -1286 2171 3391 4880
17646 4880 4966 1880 -1249 1062 878 3898 5841 301 -1592 1182 1063 -3875 -1427 4983 5505 7837
17630 7837 10096 9593 4799 5439 15113 21891 20957 13890 7559 7315 669 -7798 -4055 -6192 -2350 825
17614 825 -2130 -4689 -1889 2012 5153 6227 5294 -2985 -4785 -3299 -1661 1197 3377 -950 -5768
17599 -5768 1142 15423 11132 3246 3753 6552 12200 10576 3888 2851 2930 -365 1613 2685 3599
17584 3599 1029 1088 1891 2843 1135 4043 1079 6619 5262 -2193 -5872 -4528 4031 12257 14487 16812
17568 16812 17615 17507 13366 10379 6972 3335 4649 4765 4364 2130 2998 6417 3483 -189 5487 148
17552 148 2136 7081 8192 6183 4756 10452 15176 16057 18464 17300 11663 8647 3951 995 977 2562
17536B562k129p67j068Q692M470K974M197L744l816m301l773M832k361M322J664
17521A9242m72Q582j765k483K611k19r51Q06q523n217J421Q26o745j664K992L066
17505A1507j957j530k123L994K345n325l775P465k294p682p302Q006M733j303
17491D759p478j103M52m87j28J965L248N03J243K901M63k553N709K010k60L175
17475A4419K92k737l912O403p28r493n185L226N945o25J681j149j586J533k750
17460E334m41L418P90k691n485J452L614j43J614j642j868L77K253l891o642L037
17444i14Q607J3243K2572K8671J3842j7926k8644j6866k988m330o848l142m585
17431F92O57P55p261m615J50K106L533M218M216k825R84L743l837q08K431m72
$$ plain form
17536 2562 433 -334 -1402 7290 11760 14734 18931 22675 18859 14558 10785 15617 13256 17578 19242
17521 19242 18770 27352 25587 23104 25715 25496 24545 25351 16828 11611 13032 13858 7113 5449 8441 11507
17505 11507 9550 8020 5897 9891 12236 6911 3136 10601 8307 625 -6677 1329 6062 4759
17491 4759 -2719 -3822 -3370 -3857 -3985 -2020 1228 1731 2974 5875 6338 3785 9494 11504 11244 14419
17475 14419 14711 11974 8062 14465 13737 4244 -941 2285 8230 7605 9286 8137 6551 8084 5334
17460 5334 4893 8311 9101 6410 925 2377 5991 5848 7462 5820 3952 4329 6582 2691 -3951 -914
17444 -914 7693 20936 43508 72179 86021 68095 39451 22585 19597 15267 8419 5277 692
17431 692 1349 2104 -5157 -9772 -9622 -7516 -3983 235 4451 1626 2610 6353 2516 1708 4139 3667
17415C667r506p384m1N981l58J551L900M413L98L803k094L124j634J678l970o259
17399b731j945J025Q87k772l230l863K659j695j611r78L243N44j494Q10k240K772
17383a0619Q465j225n649K264N067J145N755j453j645m154L09M675P50M405k336
17368E754k929l406p5q25K953j193K048L800k823l674k259o803n79P46m861j474
17352a5600Q092O057M69l741k855j197J297M891j895L13M063J68Q66K133P549
17337A0610J114k220m455l523m872r871l325K194L274P295L481j703m663J953
17323d711l815O436O983L377j2368j0437O923L033N157m307j2947o695L094J0181
17309a0096N042J221M402L28l532K718k347L4l113k653O573P388j023o281M112
$$ plain form
17415 3667 -5839 -13223 -13264 -7283 -7641 -6090 -2190 2223 2621 6424 4330 7454 5820 7498 3528 -2731
17399 -2731 -4676 -3651 -2764 -5536 -8766 -12629 -9970 -11665 -13276 -14254 -11011 -10467 -11961 -11151 -13391 -10619
17383 -10619 -2154 -3379 -9028 -6764 -1697 -552 5203 3750 2105 -2049 -1740 2935 3685 8090 5754
17368 5754 2825 -581 -656 -1481 1472 279 2327 6127 3304 -370 -2629 -9432 -10011 -9265 -14126 -15600
17352 -15600 -7508 -1451 -982 -4723 -7578 -8775 -7478 -2587 -4482 -4169 -106 62 928 3061 10610
17337 10610 11724 9504 5049 1526 -3346 -13217 -16542 -14348 -11074 -3779 -298 -2001 -6664 -4711
17323 -4711 -8526 -2090 4893 8270 -4098 -14535 -7612 -4579 578 -3729 -16676 -23371 -20277 -10096
17309 -10096 -5054 -3833 569 897 -2635 83 -2264 -2230 -5343 -7996 -1423 5965 4942 -1339 2773
17294B773k217k803k45K858K364k331n355K274K730K492L879k458J436J0292K604
17279A8293n57q779k519J955l893Q79J455m403l036l035J621K650k097P07o251
17264g010K30K495L034N749M008J84j25P016q91p666o466p987j363M601Q24L625
17248B58M711M789j451L31o166m231K171M560n857J178K496L920m081j448M471
17233E651R298O724P878J577p670k582J2193J4739K2265K8927L5309L1937K5419
17220A91665J8295L840o590j5549k3113k7834k6871k3918j6449j6331j8193o004
17208C2948j757o093j3031q770K335L744j807O584k792p73n156J026K694k005
17194G147o175k293L584K177L532l128p891M562K990M685M533L573J2707M871
$$ plain form
17294 2773 556 -2247 -2492 366 2730 399 -4956 -2682 48 2540 6419 3961 5397 15689 18293
17279 18293 17736 8957 6438 8393 4500 5379 6834 2431 -605 -3640 -2019 631 -1466 -759 -7010
17264 -7010 -6780 -4285 -1251 4498 8506 8690 8565 15581 14690 7024 558 -7429 -8792 -4191 -3367 258
17248 258 4969 9758 8307 8638 2472 -1759 412 4972 -885 293 2789 6709 2628 1180 5651
17233 5651 14949 21673 29551 31128 23458 20876 33069 47808 70073 99000 134309 166246 191665
17220 191665 209960 213800 207210 191661 168548 140714 113843 89925 73476 57145 38952 32948
17208 32948 31191 25098 12067 3297 5632 9376 7569 14153 11361 10588 5432 6458 9152 7147
17194 7147 972 -1321 2263 4440 7972 4844 -3047 1515 4505 9190 13723 17296 30003 34874
17180C4874N794J7392L4187M5453M4773M4949L4344J7047M721k1037j3147j0428
17168B38922j2058j1972j5497j9461l1525l1277k7706j8547j8075j4017k980n31
17156C5276k465l664k425q611l24m119M422J761n222j876j699j196n258O943L041
17141A4584K969J193N205R88L481J5642K9104M0074L1036L0957J8369P448J072
17128B02122r009l298O83o49r85K649j7660k9263k4999l5394k5823j1460l089
17115D3825K24j1479O99J611o226j454l656J72J82r66l846q004l446M123p892
17100C867m852P44j438J481J825P380L748o761j663N158l979N763P039K737M833
17085B5882P979K0941L2157K9955K4440J5673l050j3223k5400l3363l1357j9968
$$ plain form
17180 34874 40668 58060 92247 137700 182473 227422 261766 278813 283534 262497 249350 238922
17168 238922 226864 214892 199395 179934 148409 117132 89426 70879 52804 38787 35807 35276
17156 35276 32811 29147 26722 18111 17787 13668 18090 19851 14629 12753 11054 9858 4600 11543 14584
17141 14584 17553 18746 23951 24939 28420 44062 73166 113240 144276 175233 193602 201050 202122
17128 202122 193113 189815 190498 189849 188864 191513 173853 144590 119591 84197 58374 46914 43825
17115 43825 44049 32570 33269 34880 28654 27200 23544 23716 23898 22932 19086 11082 7636 11759 3867
17100 3867 -985 -241 -1679 -198 1627 9007 12755 5994 4331 9489 5510 11273 18312 21049 25882
17085 25882 33861 54802 86959 116914 141354 157027 153977 140754 115354 81991 50634 30666
17073C0666j0537o070j261p40k146k506n040R547p42j130o72l75K700j542k016
17058H136r20K757k040J261K944p176o937q806j81L008J301M423j096o639k890
17043a2855O157O745n08P007P202j187q848k315K816l135N879P187K085j740q685
17028E805j422m282m341M096p982j695Q117J559l876k913L70j761J236M652K281
17013a56N201P134L792l414p109j840k146j119K321j729l517O885M73K148j206
16998E718K817Q85O039l84j1259p341p43K088N11L71M434M184K545L514p197m566
16982A616K877m23n33k724N856P485k58J375O343M325k412k729K835L511O717
16967C3861k466p524L034J492l456m154K350k458l591J674K933o007K920k482
$$ plain form
17073 30666 20129 14059 12798 12058 9912 7406 2366 11913 11171 10041 9369 8994 11694 10152 8136
17058 8136 7216 9973 7933 9194 12138 4962 -1975 -10781 -10962 -7954 -6653 -2230 -3326 -9965 -12855
17043 -12855 -6698 47 -461 6546 13748 12561 3713 1398 4214 1079 6958 14145 16230 14490 5805
17028 5805 4383 101 -4240 -144 -8126 -9821 -1704 -145 -4021 -6934 -6564 -8325 -7089 -2437 -156
17013 -156 5045 12179 15971 12557 5448 3608 1462 343 2664 935 -2582 4303 4776 6924 5718
16998 5718 8535 9420 15459 15075 3816 -3525 -4268 -2180 -1669 -1298 3136 7320 9865 13379 6182 1616
16982 1616 4493 4070 3537 813 6669 14154 13896 15271 21614 25939 23527 20798 23633 27144 33861
16967 33861 31395 23871 26905 28397 24941 20787 23137 20679 17088 18762 21695 15688 18608 16126
16953A6126j234k878r200J355j630j408J671l64K107K101K713n603q810K809N838
16938C593N469m282P2R12m833M799L322k25L680n742J671J0514O259R04L79N998
16922C2490o766l78K604O922P50J1772j20L359L301p266p740j795l515l040r202
16907B1376p585k005q63l654p759k42m7J893o36L729K535n064K958P682j610j0937
16891b29j0390M098J157k182K612P944J934m657M520M669N107k405j213k274P978
16876A6669O907j60N305L010K291j603N316J037j899k571K144N148L934n872j1036
16861B8620m30l174m612k419l262k95P983k25l022m49M625k407L106R297L320
16846C6656J0399J8002Q943J2972J6813R825M939N303j0067j2638q024n027j5521
$$ plain form
16953 16126 14892 12014 2814 4169 2539 1131 2802 2438 4545 6646 9359 3756 -5054 -2245 3593
16938 3593 9062 4780 4852 5764 931 5730 9052 8827 12507 6765 8436 18950 25209 26113 26492 32490
16922 32490 25724 25346 27950 34872 35622 47394 47274 50633 53934 46668 38928 37133 33618 30578 21376
16907 21376 13791 11786 10923 7269 -490 -732 -779 1114 478 4207 6742 1678 4636 12318 10708 -229
16891 -229 -10619 -6521 -5364 -7546 -4934 3010 4944 287 4807 9476 14583 12178 10965 8691 16669
16876 16669 23576 23416 28721 31731 34022 32419 37735 38772 36873 34302 36446 41594 45528 39656 28620
16861 28620 28190 25016 20404 17985 14723 14428 22411 22186 19164 18715 23340 20933 24039 33336 36656
16846 36656 47055 65057 74000 86972 103785 113610 118549 123852 113785 101147 93123 88096 72575
16833G2575j5530r034r846j0023l082l625j081L545l28n6P674k131Q80K099Q13
16818C2850J027n6k408Q264Q231K710P25j721N49q42m798k986n399J191J844l256
16802C5925N299K151K242K770L127J0424O872J2899O860Q306J0459L509L876J93
16788A14912o222m513j190k98j2435j6936j214n195k707p053n78L712r874j961
16774D8448Q746M629n37o41N50L336J0181P333J019Q299P258j469K806p19k564
16759I6675L76m36J015N673R271J4224R255L821J158N436P656J6924J7523K4215
16745B12786J4801R582K3985K9793L4645M3820N6988O4306P8976R0175R4148J07602
16733H61607J04969J18905J34745J55584J80700K37120K79671L38202M42829N79419
$$ plain form
16833 72575 57045 48011 38165 28142 25060 21435 20354 23899 23571 23515 31189 29058 29938 32037 32850
16818 32850 33877 33821 31413 39677 47908 50618 51343 49622 50171 49329 44531 41545 36146 37337 39181 35925
16802 35925 41224 43375 45617 48387 51514 61938 68810 81709 88569 96875 107334 110843 114719 114912
16788 114912 108690 104177 102987 102689 90254 73318 72104 66909 64202 57149 56571 60283 50409 48448
16774 48448 57194 61823 61286 60645 61195 64531 74712 82045 83064 91363 98621 97152 99958 99239 96675
16759 96675 97051 96615 97630 103303 112574 126798 136053 139874 141032 146468 154124 171048 188571 212786
16745 212786 227587 237169 261154 290947 325592 369412 426400 490706 569682 659857 754005 861607
16733 861607 966576 1085481 1220226 1375810 1556510 1793630 2073301 2411503 2854332 3433751
16723C433751P78571J042112J418272J985377K799620L810383M759453N214410
16715B5241949M834495L573980J765191j21673j617660k578516l089344l373610
16707B4634812l499175l472480l282546k936625k508136k041798j580390j159815
16699D153847q13434n67183l85817k71252k06377j65455j40309j23801j05278
16690A374941q2966o9907l8067k3027n766O354J2271K3531K6882L6608N5027O8256
16678A384137Q8947J20510J57143K15918L00465M63754P28526J174943J843849
16669F478192K723840L625061M196569M136760L422769K430006J580370J089441
16661B9683008P88378K56188p57327k107708l281371l883442l784343l241400
$$ plain form
16723 3433751 4212322 5254434 6672706 8658083 11457703 15268086 20027539 25241949
16715 25241949 30076444 33650424 35415615 35293942 33676282 31097766 28008422 24634812
16707 24634812 21135637 17663157 14380611 11443986 8935850 6894052 5313662 4153847
16699 4153847 3340413 2773230 2387413 2116161 1909784 1744329 1604020 1480219 1374941
16690 1374941 1291975 1222068 1184001 1160974 1155208 1161562 1173833 1197364 1224246 1260854 1315881 1384137
16678 1384137 1473084 1593594 1750737 1966655 2267120 2730874 3459400 4634343 6478192
16669 6478192 9202032 12827093 17023662 21160422 24583191 27013197 28593567 29683008
16661 29683008 30471386 30727574 29970247 27862539 24581168 20697726 16913383 13671983
16653A3671983k600139k076215j710317j444617j206284r59859p21608n28130
16645B424814l85405k86494k24008j79358j50265j22452j06440j06947r8630q3537
16635F81278q2660o2166n0273m6335l3270k6201k6029k5513k3921k6475j4627
16624B63808j8001j4945j9762j0578l312o228j1340j1408l829m363j1006n162
16612A43874J406m884n246j728k714m623j3433o004m407p447m871n33K796J07
16598I2293j907N838L41l356P88p6o716r334q17j251q479q278q897o908r435M384
16582C8190j794o181l583J017M486k287M4O488K834l112n899m824N63k160j161
16567B2621m654p665Q07k078M57m328n599L725L443o37m014K33J1005J59J784
$$ plain form
16653 13671983 11071844 8995629 7285312 5840695 4634411 3674552 2952944 2424814
16645 2424814 2039409 1752915 1528907 1349549 1199284 1076832 970392 863445 764815 681278
16635 681278 598618 536452 486179 439844 406574 380373 354344 328831 304910 278435 263808
16624 263808 245807 230862 211100 200522 197210 190982 179642 168234 164405 160042 149036 143874
16612 143874 145280 140396 135150 133422 130708 126085 112652 106648 102241 94794 89923 89390 92186 92293
16598 92293 90386 96224 96565 93209 93997 93921 87205 77871 77054 75803 67324 59046 50149 43241 33806 38190
16582 38190 36396 30215 26632 27649 32135 29848 29892 36380 39214 36102 30203 25379 25942 23782 22621
16567 22621 17967 10302 11109 9031 9488 5160 -439 3286 6729 6092 2078 2311 13316 13475 15259
16552A5259L701M913O094m751J138J568L29l924l668N105L1M407m971m087p261
16537A3883K199j2518n412L067n994j5390m016N333P03J2044L023L60P602N81
16523E465l318J888O520M582N29j393k961r893L0J488l510J359L944l131j872
16508b73k71r06J11j540r107P261N822j824m872j086J296K241M354m384L072O561
16492F455L12n111Q6Q05J517J067O541N778K902j637r27o00l899j973j938k010
16476G368O80l227l62p84M056P024K671n013m124l025j706n247j968K017N524
16461C884L792n07j779m560p588l04j395j634j330L652L153n95O609L617n740
16446g25p992k973m480K570N043O941J951m958K469O529L011l44m058j871n342
$$ plain form
16552 15259 18960 23873 29967 25216 26354 27922 28251 24327 20659 25764 25795 30202 25231 21144 13883
16537 13883 16082 3564 -1848 1219 -4775 -20165 -24181 -18848 -18145 -6101 -3078 -2718 4884 5465
16523 5465 2147 4035 10555 15137 15666 14273 11312 1419 1449 2937 -573 786 4730 1599 -273
16508 -273 -544 -1450 -1339 -2879 -11986 -4725 1097 -727 -5599 -6685 -5389 -3148 1206 -3178 -106 6455
16492 6455 6767 1656 1742 2547 4064 5131 11672 17450 20352 18715 17788 17188 13289 11316 9378 7368
16476 7368 8048 4821 4459 3675 7731 14755 17426 12413 8289 5264 3558 -1689 -3657 -1640 3884
16461 3884 7676 7169 5390 830 -6758 -7062 -8457 -10091 -11421 -7769 -4616 -5211 1398 5015 -725
16446 -725 -8717 -11690 -16170 -13600 -8557 -1616 335 -4623 -2154 4375 7386 7042 2984 1113 -4229
16431d229k810Q160j238L263K93o53p658j588L964P140l944j248L877O589l976
16416E942p002o068K629p16N257Q951J284m304r851q92n40J950N339k85l986n87
16400b879M487l354K706J870O01M929J239n145q535l591J198P98J506l288K468
16385d990J467l826m194k7l954l403P449P683L082K904l090l85L018l565l032
16370d863J166J877J863k902m984j852L094L070N631K951N21j449m246j0374J279
16355i218P340k937K216J0789L04l042l886k892J191K949p582L83M526j257p73
16340a889M720L592O83J358J648j1091o083K765L680o184j40r51n355P46M004
16325h497L461Q692L160k512j728L301l994j392n064P97o02K509k39n8k578o641
$$ plain form
16431 -4229 -7039 1121 -117 3146 3439 2786 -4872 -6460 -2496 4644 700 -548 3329 9918 5942
16416 5942 -1060 -7128 -4499 -5215 42 8993 10277 5973 -3878 -4770 -5310 -3360 1979 1694 -2292 -2879
16400 -2879 1608 -1746 960 2830 3431 8360 9599 4454 -4081 -7672 -6474 -5676 -4170 -7458 -4990
16385 -4990 -3523 -7349 -11543 -11570 -15524 -18927 -11478 -3795 -713 2191 -899 -1284 1734 -1831 -4863
16370 -4863 -3697 -1820 43 -2859 -7843 -9695 -6601 -3531 2100 5051 5572 4123 -123 -10497 -9218
16355 -9218 -1878 -4815 -2599 8190 8494 5452 1566 -1326 -135 2814 -4768 -4385 141 -1116 -1889
16340 -1889 2831 6423 7106 8464 10112 -979 -7062 -4297 -617 -6801 -6941 -7892 -13247 -12501 -8497
16325 -8497 -5036 3656 6816 4304 2576 5877 1883 491 -4573 -3776 -4378 -1869 -2108 -2166 -4744 -11385
16309a1385P072M186k356m55L188j299r511J716n91K264M216o350J112J928R2
16294f173j860K113N418O226n36p300k47o798j0835J737J5704K285K0J478N461
16279F693n852q58k032Q519M660j257l657m172k710j1895o860O695O513L077k167
16264e303J16P324N071n618m201n993k235M131M777j639N70K476J680l137l418
16249e399l842M779K465p188l184k211O265O308r86n371j520O74j103m31M102
16234f642K694M592l830n37j384n113l36m162K760r58K984R156k033n125k505
16219a0439P588N601M252K525k082L449P994j259j869O720R419Q410P133K5444
16205G2886L4214K6861K5520K3975P080j2075k0277j6598k0969j7291j6476j3823
$$ plain form
16309 -11385 -4313 -127 -2483 -2938 250 -1049 -10560 -8844 -9435 -7171 -2955 -9305 -8193 -6265 -6173
16294 -6173 -8033 -5920 -502 5724 5188 -2112 -2359 -9157 -19992 -18255 -2551 -266 -246 1232 6693
16279 6693 841 -17 -2049 6470 11130 9873 6216 2044 -666 -12561 -19421 -12726 -6213 -3136 -5303
16264 -5303 -5187 2137 7208 1590 -2611 -8604 -10839 -6708 -1931 -3570 -3000 -524 1156 -1981 -5399
16249 -5399 -9241 -4462 -1997 -9185 -12369 -14580 -8315 -2007 -2993 -8364 -9884 -9210 -10313 -10744 -6642
16234 -6642 -3948 644 -3186 -3723 -5107 -10220 -10556 -14718 -11958 -12916 -9932 -776 -2809 -7934 -10439
16219 -10439 -2851 2750 7002 9527 7445 10894 18888 17629 15760 22480 31899 40309 47442 72886
16205 72886 107100 133961 159481 183456 190536 178461 158184 141586 120617 103326 86850 73027
16193G3027r253q246p842r224j0286j431j898q17j477m421j0791l955j013l061
16179f88l032j671J210m159K69K260m243M041M18L835O20N62l852M679J238l042
16163a555J24O524Q580M934P254J3154J4162L746N351M194L049N698J1168K0549
16149A06932K1422K4139J6804J629n267p998k0779l4709l4651j3481j5127j3362
16137B5552r327m758l161n818J921L227j86q641L178N217K628l038k116j54L743
16122H267P765j978p915k695k008K67J855J201k537j705l354k44M123o28k660
16107b246P73n190l548M04J885J3093M536l18m551l962L011K512j609q54L523
16092G459k791R1O167K200p079q251o081J654n228L351p65K992LJ484K747k124
$$ plain form
16193 73027 63774 55528 47686 38462 28176 26745 24847 24030 22553 18132 7341 3386 2373 -688
16179 -688 -3720 -5391 -4181 -8340 -8071 -5811 -10054 -6013 -5595 -1760 -1140 -578 -4430 249 1487 -1555
16163 -1555 -1431 5093 13673 18607 25861 39015 53177 56923 62274 66468 69517 75215 86383 106932
16149 106932 128354 152493 169297 170926 165659 157661 136882 102173 67522 54041 38914 25552
16137 25552 16225 11467 8306 2488 4409 7636 7450 -1191 1987 7204 9832 6794 4678 4524 8267
16122 8267 16032 14054 6139 3444 1436 1703 3558 4759 2222 517 -2837 -3081 1042 414 -2246
16107 -2246 -1473 -6663 -10211 -9807 -7922 5171 9707 9389 4838 876 3887 6399 4790 3936 7459
16092 7459 4668 4759 10926 13126 6047 -2204 -8285 -6631 -11859 -8508 -9273 -6281 -6278 -4794 -2047 -4171
16076d171m423K758L527M629k88p133o498J041k21j692J989k085k235J884N331
16061g587Q29k584l977K834M242K795k958K537K817J103o726J546O971M365m662
16046A545q019j162n529Q53L266p435R68P419J0946M340p571n831P489l173j559
16031c453N172j287k859k895r481O089P681P66r176J462J71l210J265P074m319
16016g000m258l13M11l351J929K312l317L788J1406J1356j997j0798p557j004
16002h393o075L941O842M669J171m156l038L328J2M3k510q169l840Q601N100j423
15986c897j895j2073j530L261K790L25k436l43O68M169R67N032J14K122J596l49
15970a479o7k106l687M063M0m634M61L325N052n096m55L581K050J991R04l969
$$ plain form
16076 -4171 -8594 -5836 -2309 2320 2032 -5101 -11599 -10558 -10779 -12471 -10482 -12567 -14802 -12918 -7587
16061 -7587 -6758 -9342 -13319 -10485 -6243 -3448 -6406 -3869 -1052 51 -6675 -5129 1842 6207 1545
16046 1545 -6474 -7636 -13165 -12312 -9046 -16481 -15513 -8094 2852 7192 -379 -6210 1279 -1894 -3453
16031 -3453 1719 432 -2427 -5322 -14803 -8714 -1033 -267 -9443 -7981 -7810 -11020 -9755 -2681 -7000
16016 -7000 -11258 -11571 -11160 -14511 -12582 -10270 -13587 -9799 1607 12963 10966 168 -7389 -8393
16002 -8393 -14468 -10527 -3685 984 2155 -2001 -5039 -1711 -1699 -1656 -4166 -12335 -16175 -7574 -2474 -3897
15986 -3897 -5792 -17865 -19395 -16134 -13344 -13019 -15455 -15798 -15130 -10961 -9994 -4962 -4848 -2726 -1130 -1479
15970 -1479 -1546 -3652 -7339 -3276 -3236 -7870 -7409 -4084 968 -4128 -4583 -1002 1048 3039 3943 -26
15954b6N98k17l827k399l796m71K844P09k930k818M46O973N590n091k666j932
15938i013j663j871l006L562M738j12L51O405j993K98L982k250k545q81l347J437
15922e908N381k386l840j835J065k089R713j239k936J855J323J702N349l996n476
15907c317J200k604M286M155q177j682j813l222P987K386J245n711J779N604j346
15892G70K34m816K028m954n56O66j416J487j23k27N051J155m010K472l062j137
15876f438L373K929o001m421N497N307J852J468K356r83n739j0316J296k089K472
15861i437l848m069Q492O412L362j136p387m50O525l41J29k076r85l564K372M409
15845a592k608q35j523l655N347R718j511n636m534m566K322K992l29J612q538
$$ plain form
15954 -26 572 355 -3472 -5871 -9667 -10138 -7294 -6585 -9515 -12333 -11887 -4914 676 -4415 -7081 -9013
15938 -9013 -10676 -12547 -15553 -11991 -7253 -7365 -7014 -609 -2602 -2304 1678 -572 -3117 -3998 -7345 -5908
15922 -5908 -527 -2913 -6753 -8588 -7523 -9612 101 -1138 -4074 -2219 -896 806 6155 2159 -3317
15907 -3317 -2117 -4721 -435 3720 -4457 -6139 -7952 -11174 -3187 -801 444 -5267 -3488 2116 770
15892 770 1004 -3812 -1784 -6738 -7294 -6628 -8044 -6557 -6680 -6907 -1856 -701 -4711 -2239 -5301 -6438
15876 -6438 -3065 -136 -6137 -10558 -5061 246 2098 3566 5922 4939 -800 -11116 -9820 -11909 -9437
15861 -9437 -13285 -17354 -8862 -2450 912 -224 -7611 -8061 -1536 -1877 -1748 -3824 -4809 -8373 -6001 -1592
15845 -1592 -4200 -5035 -6558 -10213 -4866 4852 3341 -2295 -6829 -11395 -9073 -6081 -6410 -4798 -13336
15830a3336k9P224P155K84m042K23J070q09L449J823j782m389P21l801j203M10
15814g032j654j525j662l934l608O858Q781j707l106N173K441j912J314K820o970
15799e723p421L722P021j111m443K88j11j10n14R5K044L217l362j010J394p429
15783a3453q94M686J403K307j657K668N41K592m312N504K538p73r07K929p43J56
15767B585R15j0137j3266o802L917N394J469k050P125J3110k038O13J986M274
15753G095m966q026m754O929J266M268m78o78k215n207n951l166J670R633j381
15738e961j412j419K058p252K30k4j664R37J736K767L323J347P859L532L064n515
15722C606k555J187n747k496L18j355o470m707k113K255k133O364J096J810N750
$$ plain form
15830 -13336 -13365 -6141 1014 1298 -2744 -2521 -1451 -2260 1189 3012 1230 -3159 -2438 -6239 -7442 -7032
15814 -7032 -8686 -10211 -11873 -15807 -19415 -12557 -3776 -5483 -8589 -3416 -975 -2887 -1573 1247 -5723
15799 -5723 -13144 -9422 -2401 -3512 -7955 -7667 -7778 -7888 -8402 -8307 -6263 -3046 -6408 -7418 -6024 -13453
15783 -13453 -14347 -9661 -8258 -5951 -7608 -4940 -4399 -1807 -6119 -615 1923 1150 243 3172 2429 2585
15767 2585 3500 -6637 -19903 -26705 -22788 -17394 -15925 -17975 -10850 2260 222 835 2821 7095
15753 7095 2129 -5897 -10651 -3722 -2456 1812 1334 656 -1559 -6766 -12717 -15883 -14213 -4580 -5961
15738 -5961 -7373 -8792 -6734 -13986 -13756 -13780 -15444 -14507 -12771 -10004 -6681 -5334 2525 6057 9121 3606
15722 3606 1051 2238 -3509 -6005 -5687 -7042 -13512 -18219 -20332 -18077 -20210 -13846 -12750 -10940 -5190
15707e190P75p529k334k628N977j448J161R23P13N980K456l00j203p50k032k001
15691g430k568l155L575L658K963O61j711k483k268K293J430M88K02O85j424O18
15675d466L434J368j2517o068M891R075O89m713Q73j583m201j626j790N306O399
15660d929M696n241L266R94p243N58K856k200l833k021M214m251m218k96q13K818
15644a5643K429j646P376K346M242p909o71M086L133N57L267J180k565J352l157
15629a623o260k824k198k921k603J760M703J980R1M311K665J072o84n248j580
15614i359j604j767O218K261J498m79l954K59L32m84j965J719L348L531m799j0191
15598a5436p306J1678J0848n23o27l172K96L231M351q322r402l75P174K21k465
$$ plain form
15707 -5190 -4415 -11944 -14278 -16906 -10929 -12377 -11216 -10293 -9580 -3600 -1144 -1444 -2647 -3397 -5429 -7430
15691 -7430 -9998 -13153 -9578 -5920 -2957 -2296 -4007 -6490 -8758 -6465 -5035 -4547 -4345 -3660 -5084 -4466
15675 -4466 -1032 336 -12181 -18249 -13358 -4283 -3594 -8307 -7434 -9017 -13218 -14844 -16634 -11328 -4929
15660 -4929 -233 -5474 -2208 -1214 -8457 -7899 -5043 -7243 -11076 -13097 -8883 -13134 -17352 -17648 -18461 -15643
15644 -15643 -13214 -14860 -7484 -5138 -896 -8805 -9476 -5390 -2257 -1700 1567 2747 182 1534 -1623
15629 -1623 -7883 -10707 -12905 -15826 -18429 -16669 -11966 -9986 -9895 -5584 -2919 -1847 -2531 -7779 -9359
15614 -9359 -10963 -12730 -6512 -4251 -2753 -3232 -7186 -6927 -6595 -7079 -9044 -7325 -3977 -446 -5245 -15436
15598 -15436 -22742 -11064 -216 -739 -1366 -4538 -4242 -1011 3340 -4982 -14384 -14759 -7585 -7364 -9829
15583i829L170j467m217P90K541k08N149O988o94j373j396J237o718m928j492
15568a2447l40j701L695P740m395r311N814K619O21M645j907k935J576l330m038
15553a3694K064N238m271J574M533K445n096l841K142N349L429j619k895Q951
15539D309M404k332l670k064p03k407l562P035m020k966p7L968Q687k002n373
15524g73j288l588N08P757L468k541K135p043K101K251K602n37k668l730k643
15509c989L292j8n771k702Q30J846j652J506j900k655M866L301N63P52l984M66
15493e249n268K219L673Q740J311o518j0170j006L776J577P841K137p870j632
15479f439O118M149M448r712j2158J706J874N561L400J464K697n227n221L163
$$ plain form
15583 -9829 -6659 -8126 -12343 -11553 -9012 -9220 -4071 2917 2223 850 -546 691 -6027 -10955 -12447
15568 -12447 -12787 -14488 -10793 -3053 -7448 -16759 -10945 -8326 -7705 -3060 -4967 -7902 -6326 -9656 -13694
15553 -13694 -11630 -6392 -10663 -9089 -4556 -2111 -7207 -11048 -8906 -3557 -128 -1747 -4642 4309
15539 4309 8713 6381 2711 647 -56 -2463 -6025 1010 -3010 -5976 -6053 -2085 6602 4600 -773
15524 -773 -2061 -5649 -5141 2616 6084 3543 5678 -1365 736 2987 5589 5052 2384 -1346 -3989
15509 -3989 -697 -715 -6486 -9188 -8358 -6512 -8164 -6658 -8558 -11213 -6347 -3046 -2483 -1731 -5715 -5249
15493 -5249 -10517 -8298 -4625 4115 5426 -1092 -11262 -12268 -8492 -6915 926 3063 -4807 -6439
15479 -6439 -321 3828 8276 -1436 -13594 -11888 -10014 -4453 -1053 411 3108 -2119 -7340 -4177
15465d177l562L979Q120L574n415l328m078J841P615N392n029l607j641m291M185
15450d22j584j1938j021P247Q408O460k235l539r401N105O246m59m607K471P828
15435H559O89p248J233j673l112M192m176L51L43m237L963J314o447K248j306
15420e307L259l81l364k521K500k29l302M51K077K590J708k288q08k773l779N652
15404f515J317K121M08K252M226r17l93o804K794L775J228l591k791R80l831p812
15388a3553N940L949J988M99N187J891J503k808n830R32k84o638r76L716o650
15373a1134m638J860l59l490L09J177N586K399j204L117L487R71m841k379L283
15358e856M335l172l347K92j342l578q80M648k827K183K560o20m749J194O090
$$ plain form
15465 -4177 -7739 -3760 4360 7934 2519 -809 -4887 -3046 4569 9961 4932 1325 -316 -4607 -422
15450 -422 -2006 -13944 -14965 -7718 690 7150 4915 1376 -8025 -2920 3326 2867 -1740 731 8559
15435 8559 9248 2000 3233 1560 -1552 2640 -1536 -1185 -842 -5079 -1116 198 -6249 -4001 -5307
15420 -5307 -2048 -2429 -5793 -8314 -5814 -6043 -9345 -8894 -6817 -4227 -2519 -4807 -5615 -8388 -12167 -6515
15404 -6515 -5198 -3077 -2669 -417 3809 2892 2499 -4305 -1511 2264 3492 -99 -2890 -1910 -5741 -13553
15388 -13553 -7613 -3664 -1676 -1177 4010 5901 7404 4596 -1234 -302 -586 -7224 -8200 -4484 -11134
15373 -11134 -15772 -13912 -14271 -17761 -17452 -16275 -10689 -8290 -9494 -6377 -2890 -1919 -6760 -9139 -5856
15358 -5856 -1521 -4693 -8040 -7748 -9090 -12668 -13548 -8900 -11727 -9544 -6984 -7604 -12353 -11159 -5069
15343e069j624k147j902k19r5J189N463l77n745P582K023l553L516m65m358j354
15327g135k298q476m700k009M606O625M092j328O138M829q22p535n179O343N888
15312i61j847k779J590J396k291l468K920J554N555P644j431j170l006p74j046
15297A886K697p695l522k00l109m89l365J4L78j24O149P006m029n552o359L679
15281a2635O83m400J394p06L769M570N639P03M598M408k141l061L313m495j539
15266A00J934k970J051o622l637K722J662M519K930K545N00K817j631K097M496
15251A2513q490r211J104J507K047n671k765N042K561l844r405j278R910R682
15237C702r42k804n021j0626k884J1521J2588l054k69l274q296M809L826n946
$$ plain form
15343 -5069 -6693 -8840 -10742 -10961 -11056 -9867 -4404 -4781 -10526 -2944 -921 -4474 -958 -1423 -5781 -7135
15327 -7135 -9433 -17909 -22609 -24618 -20012 -13387 -9295 -10623 -4485 344 -478 -8013 -13192 -6849 -961
15312 -961 -2808 -5587 -3997 -2601 -4892 -8360 -5440 -3886 1669 9313 7882 6712 3706 2932 1886
15297 1886 4583 -3112 -6634 -6834 -9943 -10432 -13797 -13783 -13405 -13529 -7380 -374 -4403 -9955 -16314 -12635
15281 -12635 -11952 -16352 -14958 -15664 -11895 -7325 -1686 -983 3615 8023 5882 2821 6134 1639 100
15266 100 2034 -936 115 -6507 -10144 -7422 -5760 -1241 1689 4234 4734 7551 5920 8017 12513
15251 12513 4023 -5188 -4084 -2577 -530 -6201 -8966 -3924 -1363 -5207 -14612 -15890 -5980 3702
15237 3702 2760 -44 -5065 -15691 -18575 -7054 5534 2480 2211 -1063 -9359 -4550 -724 -6670
15223f670J982P41J346o01l764j079M633M097J230N26j998J818K588o872j1962
15208a3985J139R450O433r436o72O376r12k064J627rL632o03p185p183k903l80
15192a6675M376N596N064J76m746l520k208Q27O751k510k498N633M531N331k035
15177D093n416k653K482k878j053r1N118q793o399K201J077k175J925L385J85
15162h992M007P841N99J98k596k840L504k330q960p455M801Q629P867J744m746
15147A271k519M096R65N21J488K503Q074j874q834l477n102j55j4K509q254m628
15131a3430O730K237o21L354L00K535k620L75Q093J779K313m071n216P57M958
15116G473m187m838L90Q553J902J950L579n843q949o528L37K247L335l737L105
$$ plain form
15223 -6670 -4688 -3947 -2601 -3202 -6966 -8045 -3412 685 1915 2441 443 2261 4849 -2023 -13985
15208 -13985 -12846 -3396 3037 -6399 -7071 -695 -1607 -3671 -2044 -2053 1579 976 -6209 -13392 -16295 -16675
15192 -16675 -12299 -6703 -1639 -1463 -6209 -9729 -11937 -11110 -4359 -6869 -9367 -3734 797 6128 4093
15177 4093 -1323 -3976 -1494 -4372 -5425 -5516 -398 -9191 -15590 -13389 -12312 -14487 -12562 -9177 -8992
15162 -8992 -4985 2856 3455 3653 1057 -1783 1721 -609 -9569 -17024 -12223 -3594 4273 6017 1271
15147 1271 -1248 2848 3813 4334 5822 8325 16399 14525 5691 2214 -2888 -3043 -3057 -548 -8802 -13430
15131 -13430 -6700 -4463 -5084 -1730 -1430 1105 -1515 -1140 6953 8732 11045 6974 1758 2515 7473
15116 7473 3286 -1552 -1162 7391 9293 11243 14822 8979 30 -6498 -6161 -3914 -579 -4316 -1211
15101a211p98N926J1345M813j338J0203L488L538J924K93k844j0011r593q254
15087G481p195R264K597n478l903j739N238p205j375J1826O081L893K292J161
15073B2938L515J0350M149l90o688J210K78M689J0387J2272O91j975o563j0621
15059D4242m004n24J813j53j1681p744m535j986L58k913m113p32K777j519n487
15044C799L140R006Q45j29K434l883j172M559M212L544M570L112l721j836m328
15029B4152k592o86q657q038N665L364L969n450p179n227k561o854K785L396k908
15014f821m968M743k102l560P3K244j913O977Q91R20p603K793K858n39N860O853
14998F706k353n076l89p25m523j162L49M611J497j333P822K540l311K492o78n065
$$ plain form
15101 -1211 -2009 3917 15262 20075 18737 28940 32428 35966 37890 38183 35339 25328 15735 7481
15087 7481 286 9550 12147 6669 2766 1027 6265 -940 -2315 9511 15592 19485 21777 22938
15073 22938 26453 36803 40952 40562 33874 35084 35362 40051 50438 62710 63401 61426 54863 44242
15059 44242 40238 39714 41527 41374 29693 21949 17414 15428 15786 12873 8760 8028 10805 9286 3799
15044 3799 6939 15945 16790 16661 19095 15212 14040 18599 22811 26355 30925 34037 30316 28480 24152
15029 24152 21560 20874 12217 4179 9844 13208 17177 11727 4548 -679 -3240 -10094 -7309 -3913 -6821
15014 -6821 -11789 -7046 -9148 -12708 -12635 -10391 -12304 -5327 -4436 -3516 -11119 -8326 -5468 -6007 -147 6706
14998 6706 4353 -723 -1112 -1837 -6360 -7522 -7173 -2562 -1065 -2398 5424 7964 4653 7145 6467 1402
14982A402l845N587L863P86j238k200n63L581L540k561j950k130J653J973l599
14967D299m920J740k928o461Q343J830N133r50n168j353k11L079j804k460Q606
14952F775k921j106j357O33l049l126K823j569p27K432K35j072J57M224j450l787
14936b885m236J798O83J508J379k630j20r85k796J212K26M024J843l901R62O18
14920c300K843P3K157M995k295k225J969n362j449M893M233M55k600J334m269
14905A452o60k59k543R28L44M69j599j107k004J877K214j124o802l879o80N365
14889h008L718J292m143p12M330L712O377k195q593K946M808M645p059q19j124
14874h25k610j143K214o471k032o704M001N369J52k264k963k128M928J1508N303
$$ plain form
14982 1402 -2443 3144 7007 7793 6555 4355 3792 7373 10913 8352 6402 4272 5925 7898 4299
14967 4299 -621 1119 -1809 -8270 73 1903 7036 6086 918 -435 -646 2433 629 -1831 6775
14952 6775 3854 2748 1391 2024 -1025 -4151 -1328 -2897 -3624 -1192 -957 -2029 -1872 2352 902 -2885
14936 -2885 -7121 -5323 -4640 -3132 -1753 -4383 -4503 -5488 -8284 -7072 -6846 -2822 -979 -4880 -3918 -3300
14920 -3300 -457 -384 1773 6768 4473 2248 4217 -1145 -2594 2299 6532 6987 4387 5721 1452
14905 1452 792 533 -2010 -1082 -738 -269 -1868 -2975 -4979 -3102 -888 -2012 -8814 -12693 -13373 -8008
14889 -8008 -4290 -2998 -7141 -7853 -3523 189 6566 4371 -4222 -1276 3532 8177 1118 299 -825
14874 -825 -3435 -4578 -2364 -8835 -10867 -17571 -13570 -8201 -8049 -10313 -13276 -15404 -10476 1032 6335
14859F335l959l392k523M314k030R1l907M64K508q0K803j041l503N233L122k802
14843A633l172r847K609n18j948L430J475L72n141k396N173K06L484P306j780
14828H86j0439o262M78L104K062Q10O218O52M149o86j46n343k686J554l038l79
14812i066o042m977L886M453J632L173l377k28Q420N787J993n492j793l475P63
14797d343l888j956M801k19l75J765J070l714J726K358j673l54k393j082J123
14782g154M658L220k560K209M617J297k637n45L30j071J885j980l953o50M85l666
14766e515k229j070p98J958K909N84m699K139J562N32M049L811l802k901M754
14751A284l984r07N845J370K352q580k591K482J0202R083J884l571J943p714k739
$$ plain form
14859 6335 2376 -1016 -3539 775 -1255 -1164 -5071 -4607 -2099 -2179 624 -417 -3920 1313 4435 1633
14843 1633 -1539 -11386 -8777 -9295 -11243 -7813 -6338 -5966 -11107 -13503 -8330 -8124 -4640 2666 886
14828 886 -9553 -15815 -15337 -12233 -10171 -9361 -3143 -2491 1658 972 826 -4517 -7203 -5649 -8687 -9066
14812 -9066 -15108 -20085 -16199 -11746 -10114 -6941 -10318 -10546 -2126 3661 5654 162 -1631 -5106 -4343
14797 -4343 -8231 -10187 -5386 -5605 -5980 -4215 -3145 -6859 -5133 -2775 -4448 -4802 -7195 -8277 -7154
14782 -7154 -2496 724 -1836 373 4990 6287 3650 3105 3435 2364 4249 2269 -1684 -2334 -1849 -5515
14766 -5515 -7744 -8814 -9612 -7654 -4745 -4161 -8860 -6721 -5159 -4627 -578 3233 -569 -3470 1284
14751 1284 -2700 -3607 2238 3608 5960 -2620 -5211 -2729 7473 16556 18440 14869 16812 9098 6359
14736F359j185p238m602K874r00j502n436J276K299P76P236j224j712Q98J683
14721c98J203k584J936k870j605L939k757l214k589q339l247J821M191O731N511
14706b271J304j47J537K852J7j2025l216Q624J531Q90j438l564O125j89q468j60
14690h598P03k825J681L408l55L548l121l218K983M49K563M880K347m666K11r06
14674i16J74N235M180N08o577m212J989K91L988j837J05J991l3O011K388r58k956
14657I371p648j394n05l222m59r102k043n16p18l250M257O517K532K56P863k597
14641f58r170K387K032o054j911K52j557N395L835L549r88j655m320K077L830
14626b956L540L599n020o718l705O095m05n392j027J870L741K284Q551j126k733
$$ plain form
14736 6359 5174 -2064 -6666 -3792 -4692 -6194 -11630 -10354 -8055 -7279 -43 -1267 -2979 -2081 -398
14721 -398 805 -1779 157 -2713 -4318 -379 -3136 -6350 -8939 -17278 -20525 -18704 -14513 -7782 -2271
14706 -2271 -967 -1114 423 3275 3292 -8733 -11949 -3325 -1794 -904 -2342 -5906 219 30 -8438 -8598
14690 -8598 -7895 -10720 -9039 -5631 -5986 -2438 -5559 -8777 -5794 -5345 -2782 2098 4445 -221 -10 -916
14674 -916 -742 4493 8673 9181 2604 -1608 381 672 4660 2823 2928 4919 4886 10897 13285 12327 9371
14657 9371 1723 329 -176 -3398 -3857 -12959 -15002 -15518 -16236 -19486 -15229 -8712 -6180 -5924 1939 -658
14641 -658 -9828 -7441 -5409 -11463 -13374 -13122 -14679 -9284 -5449 -1900 -2888 -4543 -8863 -6786 -2956
14626 -2956 584 4183 -837 -7555 -11260 -5165 -5570 -10962 -11989 -10119 -6378 -4094 4457 3331 598
14611E98k519q23K832J391n336o894q498J49J1586J0821L959o575J175q04l097
14596b035j0519j150N981L412N508K801j3167k730Q277o074j945J1217J002o137
14582e559m054O716J779l147P5J34m321N39j015L88K917J842N204k339l899J09
14566d631j339J058L116L533m532l53m247l28O809P20k84m936j250N667L626J373
14550D002o969n544J752O627K935p348m117L933L567J712m499m435O577j552n907
14535i266q679o927K283K478O738O558J138J82n96J999N97o893p20O464N634L783
14519D773k6j7O82m011p012l225j111O298L977L884n287j3703K63J0361N938k739
14503i55k954L161J128j0p986l820q90J198O119O327M037p980j2392n35N229O817
$$ plain form
14611 598 -1921 -2744 88 1479 -3857 -10751 -19249 -19100 -7514 3307 7266 691 1866 1062 -2035
14596 -2035 -12554 -13704 -7723 -4311 1197 3998 -9169 -11899 -3622 -9696 -11641 -424 578 -5559
14582 -5559 -9613 -2897 -1118 -4265 -4190 -4056 -8377 -7838 -8853 -8465 -5548 -3706 1498 -841 -4740 -4631
14566 -4631 -5970 -4912 -1796 1737 -2795 -3148 -7395 -7723 -914 -194 -478 -5414 -6664 -997 2629 4002
14550 4002 -2967 -8511 -6759 -132 2803 -4545 -8662 -4729 -1162 550 -3949 -8384 -1807 -3359 -9266
14535 -9266 -17945 -24872 -22589 -20111 -13373 -6815 -5677 -5495 -6091 -4092 -3495 -10388 -11108 -4644 990 4773
14519 4773 4747 4730 5412 1401 -5611 -8836 -9947 -3649 328 4212 -1075 -14778 -14515 -4154 1784 -955
14503 -955 -3909 -748 380 370 -7616 -11436 -12326 -11128 -5009 1318 5355 -2625 -15017 -15552 -10323 -3506
14487c506M954k289m244n1M868m720k712j229L071N225L773l44n750j013j171
14472e138n881k049n20J149J012K493P378O111M835o232m207M590O851n400k459
14457B533l726o510m084J585L450j252Q59J977k035L076R159J269k287j808R17
14442C123k649L662k634p093o24N065l398l228r19P19M564j074J281P29j150L688
14426F2m753l319n638o09P075R819o9j031l804j704k451P75K953k164r262J040
14410a3080J2190M320J449j759k221m814l257K941j72j590K962o56J775l623m688
14395a0223L456O31j064N786K780L60l760K2P97R9O944j124k720j741M712m401
14379E54m485k278N729L670k40j156L84r53o194O989K719m094l324O440O559j2992
$$ plain form
14487 -3506 1448 -841 -5085 -5136 -268 -4988 -7700 -8929 -5858 -633 3140 2796 -2954 -3967 -5138
14472 -5138 -11019 -13068 -13588 -12439 -11427 -8934 -1556 4555 9390 3158 -1049 3541 10392 4992 2533
14457 2533 -1193 -7703 -11787 -10202 -6752 -8004 -7145 -5168 -7203 -4127 5032 6301 4014 2206 3123
14442 3123 474 4136 1502 -5591 -6215 -1150 -4548 -7776 -8695 -7976 -3412 -4486 -3205 -2476 -3626 62
14426 62 -4691 -8010 -13648 -14257 -7182 2637 2568 1537 -2267 -3971 -6422 -5647 -2694 -4858 -14120 -13080
14410 -13080 -890 3430 4879 3120 899 -3915 -7172 -4231 -4403 -5993 -3031 -3687 -1912 -5535 -10223
14395 -10223 -6767 -6136 -7200 -1414 1366 1726 -2034 -2012 -1215 -1116 5828 4704 1984 243 4955 554
14379 554 -3931 -6209 -480 3190 2950 1794 2178 1225 -4969 2020 4739 645 -2679 3761 10320 -2672
14363b672r77k97N095N277n14K15M913p016n490j962l653Q23J643l908l169j346
14347a3038L008K642l514O381M150p32m37N606o688o192o330L978K284j225m450
14332a4557J315j470Q321M140j148K088K723j338k752o81o181M229M179n92k843
14317d567q77l667L061l371L824J1529j725j3938o15P0N7K662O386p03o741M710
14301c905Q819J048j0424o893J105l298k341Q70N797P941J230k810o168o918k28
14286a6175M911O44K047Q68o771k756M957N843J0076O448o685q81k634q476J840
14271f744r36k837L372R38O124P142m937k646p496Q236N548J20q054k138J263
14256c045n066j306Q199P206p333r376J699J2785K535l239l333l135k927J709
$$ plain form
14363 -2672 -3649 -3946 1149 6426 5912 6127 11040 4024 -1466 -3428 -7081 -6258 -4615 -8523 -11692 -13038
14347 -13038 -10030 -7388 -10902 -4521 -371 -1103 -1540 4066 -2622 -8814 -15144 -11166 -8882 -10107 -14557
14332 -14557 -13242 -14712 -6391 -2251 -3399 -1311 1412 74 -2678 -3359 -9540 -5311 -1132 -1724 -4567
14317 -4567 -5444 -9111 -6050 -9421 -5597 5932 4207 -9731 -10346 -10276 -10219 -7557 -1171 -1874 -8615 -3905
14301 -3905 4914 5962 -4462 -11355 -10250 -13548 -15889 -15019 -9222 -1281 -51 -2861 -9029 -15947 -16175
14286 -16175 -11264 -10620 -8573 -7705 -14476 -17232 -12275 -6432 3644 10092 3407 2526 -108 -8584 -6744
14271 -6744 -7680 -10517 -7145 -6207 -83 7059 2122 -524 -8020 216 5764 5884 -2170 -4308 -3045
14256 -3045 -8111 -9417 -1218 5988 -1345 -10721 -9022 3763 6298 3059 -274 -3409 -6336 -4627
14242d627K086k484K839p376k805M423K698O95Q47M714O53M20m051j60m576p351
14226a4055j328k989Q263L136L807L371L60j828k139N807L535k29n113J292k030
14211a40J951j776l864R329r04l452l257L731K04j501K181n675n114K876j177
14196f588K37j311J361M95N41j43N09j216K249O018o37L59m496n273pl743l511
14179a5156K071K851O621K358k118N63M66n100J326L055J070j301J210Q51K898
14164A665L488n04m57N042n385o201l543M449J716J519O370m761k39M911l48j096
14148F626j567N584J076n126P10K135J864m234l895M171L320n431j0255l904J0786
14133A860K721p633j014j805j498l619L819N902l918k769P33Q147K108K321m833
$$ plain form
14242 -4627 -2541 -5025 -2186 -9562 -12367 -7944 -5246 -4551 -3704 1010 1663 2083 -1968 -2128 -6704 -14055
14226 -14055 -15383 -18372 -10109 -6973 -3166 205 565 -1263 -3402 2405 5940 5711 598 1890 -140
14211 -140 1811 35 -3829 5500 4596 1144 -2113 1618 1822 321 2502 -3173 -8287 -5411 -6588
14196 -6588 -6351 -7662 -6301 -5806 -5265 -5408 -4899 -6115 -3866 2152 1515 1874 -2622 -7895 -7902 -11645 -15156
14179 -15156 -13085 -10234 -3613 -1255 -3373 -2810 -2344 -7444 -6118 -3063 -1993 -3294 -2084 -1233 1665
14164 1665 5153 4649 4192 9234 3849 -2352 -5895 -1446 270 1789 8159 3398 3159 8070 7722 6626
14148 6626 5059 10643 11719 6593 7303 9438 11302 7068 3173 7344 10664 5233 -5022 -8926 1860
14133 1860 4581 -3052 -4066 -5871 -7369 -10988 -7169 -1267 -5185 -7954 -7221 926 3034 5355 522
14118E22j143m837J983j521j755M524M99K39J321N994L519J547o46l784j0077
14103c615p112N28O041q98k416L475j389k548O35R30M53k282k718K512N507p327
14087a0224j789J470L966N795M810K391m48l761L432o439o188O82N880l126j462
14072e011J864j280k543K344K388l327K270M614K199j336j010m776k945J134M683
14057g32K84k245L971M113m447n42L120N447R7J391j035l312k950j559L377k153
14041B825J8M888J834j827l813p6k660l012L905J654J883J588j03j1286N048N845
14025F711j270l698N852m626L357O45o95m760k841j678M550R90o33m071J301O028
14009E162L648K76m012j060m882J667L480L812M62K82J629j379q70j011O622M194
$$ plain form
14118 522 -621 -5458 -3475 -4996 -6751 -2227 -1728 -1489 -168 5826 9345 10892 10246 6462 -3615
14103 -3615 -10727 -10199 -4158 -5056 -7472 -3997 -5386 -7934 -7299 -6369 -5916 -8198 -10916 -8404 -2897 -10224
14087 -10224 -12013 -10543 -6577 -782 4028 6419 5971 2210 5642 -797 -6985 -6303 -423 -3549 -5011
14072 -5011 -3147 -4427 -6970 -4626 -2238 -5565 -3295 1319 3518 2182 1172 -3604 -6549 -5415 -732
14057 -732 -448 -2693 1278 5391 944 402 3522 8969 9066 10457 9422 6110 3160 1601 4978 2825
14041 2825 2843 7731 9565 7738 3925 3849 1189 -1823 2082 3736 5619 7207 7104 -4182 866 6711
14025 6711 5441 1743 7595 2969 6326 6971 6276 1516 -1325 -3003 1547 2537 1904 -2167 -866 5162
14009 5162 8810 9086 5074 4014 -868 799 4279 8091 8553 8835 10464 9085 8215 7204 13826 18020
13993A8020m810j2260m231k664K660j738R7k472M99k202L128K344m545m481Q57
13978a1798O630J297K241Q8L848J513l63K83M433Q31m309n528O471J315o37J940
13962H255j03j543n671L505j199j352r33j325J326j593o049n347K525o146N731
13947i919Q138Q308n636j365o46n791J013L648k110l999J058L946k343o249N088
13932f859J434K989M695k132m43P60P261p24k870%k717l79K795J629N169j771
13916H837l143n938l622L670k825j008L10j292M342j815N667N919J155m543j670
13901D044M780k514n779J456k954R86j564n483k111K837M668J234P61Q715L18
13886I394p758q358j767J987N87L964R81k30j150j761K973L172k270m700L495
$$ plain form
13993 18020 13210 950 -3281 -5945 -3285 -5023 -4926 -7398 -6899 -9101 -5973 -3629 -8174 -12655 -11798
13978 -11798 -5168 -3871 -1630 -1542 2306 3819 3456 3739 8172 9003 4694 -834 5637 6952 6315 8255
13962 8255 8152 6609 938 4443 3244 1892 959 -366 960 -633 -6682 -12029 -9504 -15650 -9919
13947 -9919 -1781 6527 891 -474 -1120 -6911 -5898 -2250 -4360 -8359 -7301 -3355 -5698 -11947 -6859
13932 -6859 -5425 -2436 2259 127 -316 444 7705 6981 4111 4111 1394 1015 3810 5439 10608 8837
13916 8837 5694 -244 -3866 -196 -3021 -4029 -3719 -5011 -669 -2484 3183 9102 10257 5714 4044
13901 4044 8824 6310 531 1987 -967 19 -1545 -7028 -9139 -6302 -1634 -400 361 9076 9394
13886 9394 1636 -6722 -8489 -6502 -5915 -1951 -970 -1200 -2350 -4111 -1138 2034 -236 -4936 -1441
13871a441j369k524P4K92r76M072l801l235K923O03N228j312K301L514o833o795
13855i279O564Q528l054m26n437p334K710N300O285P643o282P3p219J141M166
13840C379n690n870J587K893O848r077l035J2604L80p311j619J425M536n343m392
13825h685N046L285J090R18L215Q46L271K421r34p599o07L04j539k051j99k109
13809c327K527R265J0739p452o250m26k672l527j831P437O77j559k236m070J853
13794h52o51p18l050J684J0115n40m748j308n172j011M494L029J61K580l899l553
13778c439K741O365k445l012J31O726L119m738n354m370l315K723M543l912L82
13763c855L557j756m414j064k703K491M941j236m116J505Q653m34o15N701m37
$$ plain form
13871 -1441 -2810 -5334 -5260 -4968 -5944 -1872 -5673 -8908 -5985 -5382 -154 -1466 835 4349 -2484 -9279
13855 -9279 -2715 5813 2759 2333 -3104 -10438 -7728 -2428 3857 11500 5218 5291 -1928 -787 3379
13840 3379 -2311 -8181 -6594 -3701 3147 -5930 -8965 3639 4019 -3292 -4911 -3486 1050 -4293 -8685
13825 -8685 -3639 -354 736 1654 4869 5715 8986 11407 10473 2874 2267 2571 1032 -1019 -1218 -3327
13809 -3327 -800 8465 19204 11752 5502 5076 2404 -1123 -2954 4483 5160 3601 1365 -2705 -852
13794 -852 -1503 -2221 -5271 -3587 6528 5988 1240 -68 -5240 -6251 -1757 1272 1433 4013 114 -3439
13778 -3439 -698 5667 3222 210 341 7067 10186 5448 94 -4276 -7591 -4868 -325 -4237 -3855
13763 -3855 -298 -2054 -6468 -7532 -10235 -7744 -2803 -4039 -8155 -6650 2003 1569 954 6655 6218
13748F218K238R46j770M966o111r778l191L558Q386l136r24L206K408n409j946
13733c39L308l983p425K207M09n67k417l194R66o402J556M437M246J36J199K24
13717e639N16k257j703L003M337L193M880k118L141M980o633m41j099j190j476
13702A494M25j594K013K404j420q793k398P78O382k612j565J589K725j948n061
13687g581m140q15P298J379n8L283L830j961o259j720N380O92k43N554n658m847
13671e866K940N238M275m814r21J806r33J2270R535r23p158m368k411k498n99
13656E573J347L544m424K65j332m76K36K996k687o359K527n369l028O205K000
13641A018j112O270N166j800j2752n029L572M609O324M493K947l303r420K58K398
$$ plain form
13748 6218 8456 9402 7632 12598 6487 -3291 -6482 -2924 5462 2326 1402 4608 7016 1607 -339
13733 -339 2969 -1014 -8439 -6232 -5823 -6390 -8807 -12001 -11035 -17437 -15881 -11444 -7198 -7062 -5863 -5639
13717 -5639 -5123 -7380 -9083 -6080 -1743 1450 6330 4212 7353 12333 5700 5259 4160 2970 1494
13702 1494 1919 325 2338 4742 3322 -5471 -7869 -7091 -709 -3321 -4886 -3297 -572 -2520 -7581
13687 -7581 -11721 -12536 -5238 -3859 -3917 -634 3196 1235 -5024 -6744 -1364 -672 -915 4639 -1019 -5866
13671 -5866 -2926 2312 6587 1773 852 2658 1725 13995 23530 22607 15449 11081 8670 6172 5573
13656 5573 6920 10464 6040 6305 4973 4497 4733 7729 5042 -1317 1210 -4159 -7187 -982 1018
13641 1018 -94 6176 11342 9542 -3210 -8239 -4667 -58 6266 10759 13706 10403 983 1241 3639
13626C639L028m281n684L574J228j435k147K543j40M869l76o516j296P902L381
13611H289K154K194j286K567k641r05l843q338r236L715Q423L305n61n85r57J346
13595C641J90L90n946K895j603L45j141k004P690M830m540j158N331R17l202J408
13579H043O04p843l229K415J772n47r09j0557m842L747N575M228p303l61O473
13564b734J626j050k841L603K447J1n982N170K602m36K749M385k639l637K577
13549E851N47R30j560k447j0K818l014J846J953K455L895J111o281o248k699K344
13533A491J0525O635P37p414q1O26o049l406n281o112J779M921L168j258q18o27
13517a164J314K262k76k491L130M792l216q67m510n880j262Q533M994j620K81
$$ plain form
13626 3639 6667 2386 -3298 276 1504 69 -2078 465 325 5194 4818 -1698 -2994 4908 8289
13611 8289 10443 12637 11351 13918 11277 10372 6529 -1809 -11045 -7330 1093 4398 3837 3252 2295 3641
13595 3641 3831 4221 -1725 1170 -433 -88 -1229 -3233 4457 9287 4747 3589 8920 9837 6635 8043
13579 8043 8647 804 -2425 -10 1762 1215 306 -10251 -15093 -11346 -5771 -1543 -8846 -9207 -2734
13564 -2734 -1108 -2158 -4999 -1396 1051 1062 -4920 250 2852 2416 5165 9550 6911 3274 5851
13549 5851 6398 7328 5768 3321 3311 6129 3115 4961 6914 9369 13264 14375 8094 1846 -853 1491
13533 1491 12016 18651 19388 11974 11893 12519 6470 3064 -2217 -8329 -6550 -1629 1539 281 -537 -1164
13517 -1164 150 2412 2136 -355 2775 7567 4351 3484 -1026 -6906 -8168 365 5359 3739 4020
13502D020L833R399K855p943o341q772j169N502L139k361L642q160n838J573N151
13487a470P881j308O98m58R07j643m768n9N267j579M452k396j049O105j038r17
13471H625o27k866q105K209J906J692P04j476n911j001M804K637k107j143k725
13456c384M782Q630L02l654j395O61p19J116N099K275n739r758q7j924j984M419
13440a360J100L388j090j841n8k019l622K239K372N601m58m7m400M230Q05L19
13424E159R35O19P64n785k614O217P254L237K545o210l111l458J577N359L981
13409A6469k67p963q29K289j088m751j514K966j51O729M909k875p983j0598N056
13394C99N566K36J218K537N920P45r098p230m342l097K689P069K103M00k628j926
$$ plain form
13502 4020 7853 17252 20107 12164 5823 -2949 -4118 1384 4523 2162 5804 -2356 -8194 -6621 -1470
13487 -1470 6411 5103 5801 5343 6250 4607 -161 -220 5047 3468 7920 5524 4475 10580 9542 8625
13471 8625 7998 5132 -2973 -764 1142 2834 3538 2062 -3849 -4850 -46 2591 484 -659 -3384
13456 -3384 1398 10028 10330 6676 5281 5942 5223 6339 11438 13713 7974 -1784 -1871 -3795 -5779 -1360
13440 -1360 -260 3128 2038 197 139 -1880 -5502 -3263 -891 4710 4252 4205 -195 4035 4840 5159
13424 5159 6094 6713 7477 1692 -922 5295 12549 15786 18331 12121 9010 5552 7129 12488 16469
13409 16469 16202 8239 7410 9699 8611 3860 2346 5312 5161 11890 16799 13924 5941 -4657 399
13394 399 5965 6201 7419 9956 15876 16621 7523 293 -4049 -7146 -4457 2612 4715 5115 2487 561
13378E61k838P894M193K353l055J899R87K248m464l981m120m912N686J664J303
13363E418K148m05k403M401O861K682J018o753o887l092N433J217J171o233k314
13348B262L345K900Q38j903m54J437n576N051J93j040K2J596J31J110K001j339
13332A0574K533M252O036l793M79j344m630m835l732q754j314M279N136M382j937
13317G332q689n838q393m78P849J957P710K638L65O897j821q918M864M461K837
13302A2773j55n496k054j961n361Q05M297Q833k981m259J86M849R004J117n362
13287A4235k581J73j381L289r28m953l225K545K711k83O503J176k129o013l465
13272E674L887j937q60N320O555l769l612r99R511l170m031K337M602p317n767
$$ plain form
13378 561 -2277 5617 9810 12163 9108 11007 11994 14242 9778 5797 1677 -3235 2451 4115 5418
13363 5418 7566 7161 4758 9159 16020 18702 19720 12967 6080 2988 8421 9638 10809 4576 2262
13348 2262 5607 8507 9345 7442 6988 8425 2849 7900 8093 7053 7075 8671 8802 9912 11913 10574
13332 10574 13107 17359 23395 19602 20081 18737 14107 9272 5540 -3214 -4528 -249 4887 9269 7332
13317 7332 -1357 -7195 -15588 -16066 -8217 -6260 1450 4088 4453 11350 9529 611 5475 9936 12773
13302 12773 12618 7122 5068 3107 -2254 -1449 2848 11681 8700 4441 4627 9476 18480 19597 14235
13287 14235 11654 11827 10446 13735 12807 7854 4629 7174 9885 9602 16105 17281 15152 9139 5674
13272 5674 9561 7624 6764 12084 18639 14870 11258 10259 19770 16600 12569 14906 19508 12191 6424
13257F424J378j068q80J013L815l827n02J753J674o17p289j175J372L364J324
13242F759p94K465l198j830n79m934j421P869O392N396N006O319O882J5634R780
13227E9746n524j8098k0805m042m219Q31o494L918R515K721k631p518m174N45
13213C771M918Q78Q517J949J625O253m010M2n251k512J968k483M79J166M254m323
13197A7241o245O328P095o641l435J845l949O64R66n244r7L681Q26J090K68j0332
13181D061k944M771j560J377P578K671n066l726q72R01P6O876R372k25L830N982
13165C3102J1770R724l021j8997p714m306J78M357l355j819Q035J3057K8829M6112
13151A15952M3746K2618k1733m9730m4044j9762j1562q712j952k114N955k023
$$ plain form
13257 6424 7802 6734 5854 6867 10682 6855 6353 8106 9780 9163 1874 699 2071 5435 6759
13242 6759 5965 8430 5232 3402 2823 -2111 -3532 4337 10729 16125 21131 27450 34332 49966 59746
13227 59746 54222 36124 15319 11277 7058 7889 1395 5313 14828 17549 14918 7400 3226 3771
13213 3771 8689 9567 18084 20033 21658 27911 23901 23943 18692 16180 18148 15665 16144 17310 21564 17241
13197 17241 10996 17324 24419 17778 14343 16188 12239 12903 13869 8625 8528 12209 13035 14125 14393 4061
13181 4061 1117 5888 4328 5705 13283 15954 10888 7162 6290 7191 7267 14143 23515 23290 27120 33102
13165 33102 44872 54596 51575 32578 24864 20558 20736 25093 21738 19919 27954 41011 69840 115952
13151 115952 159698 182316 160583 110853 66809 47047 35485 26773 24821 22707 28662 26639
13139B6639k747j587k520j095n27k974q23j178m735Q923K986n159K221k281l936
13124A1207j674K530O501J4266J2521J2549m787q408r223q517o729r71j047j876
13110A6342m697l304j888l250j582J2563L08m995n787r49L903K216M615N443m404
13095A4534l349O885j794l182n258l52L912n939k157N95Q633K871L268K89k310
13080A6646q21o069L984M793N606Q128K274P26j681q168r052k316l144n584J105
13065F427Q595P02J481k041L30J328l259n808o639n783J642K956K348P82R540
13050A2601M674k230n214m166j313J644J96L057L995J221P62r071m477M589M541
13035A0809o35k110N189k517l850K614Q413J343L186J535l321N96L270K418p6
$$ plain form
13139 26639 23892 22305 19785 18690 18163 15189 14366 13188 8453 17376 20362 15203 17424 15143 11207
13124 11207 9533 12063 18564 32830 45351 57900 53113 44705 35482 26965 20236 19265 18218 16342
13110 16342 11645 8341 6453 3203 1621 14184 14492 9497 3710 2761 6664 8880 13495 18938 14534
13095 14534 11185 18070 16276 13094 7836 7484 11396 5457 3300 3895 12528 15399 18667 18956 16646
13080 16646 15825 9756 13740 18533 24139 32267 34541 35267 33586 25418 16366 14050 10906 5322 6427
13065 6427 15022 15724 17205 15164 15494 16822 13563 7755 1116 -4667 -3025 -69 2279 3061 12601
13050 12601 17275 15045 9831 5665 4352 5996 6192 9249 13244 14465 15227 6156 1679 6268 10809
13035 10809 10174 8064 13253 10736 6886 9500 17913 19256 22442 23977 20656 21252 24522 26940 26864
13020B6864q163q371l577N643K482K076J119K104n790n300q89L311j083r4J401
13005A1733n947J630J071j066L843N795M79j1568J411P350N023j065l127K599
12991A8161Q06j471l273L837k554l223q62m623l008m558n634J243J1199L971k122
12976G889l051k870O466M691O84k608j409O198J338l129p813k786N192l272l726
12961A794N653J1385M583n354q039l824O646R186o064l518J231P36k48k016n019
12946G132j1917J596J0677J698j772j489k43L190q42l314J178l82M5O79n070l060
12930a894L017P626K497M595K128Q83n09L003N818j579j0157j598o95k319M976
12915A5792m83k580l856j802N982o090o54O408J204o90j016k30J074l591l691
$$ plain form
13020 26864 18701 10330 6753 12396 14878 16954 18073 20177 14387 9087 8198 11509 10426 10332 11733
13005 11733 5786 7416 8487 7421 11264 17059 17538 5970 7381 14731 19754 18689 15562 18161
12991 18161 18967 17496 14223 18060 15506 12283 11421 6798 3790 -768 -6402 -5159 6040 10011 7889
12976 7889 4838 1968 8434 13125 13809 11201 9792 15990 17328 14199 6386 3600 8792 5520 1794
12961 1794 7447 18832 23415 18061 10022 6198 12844 22030 15966 12448 13679 14415 14167 12151 7132
12946 7132 -4785 -3189 7488 9186 7414 5925 5682 8872 8030 4716 5894 5512 5557 6236 1166 -1894
12930 -1894 1123 8749 11246 15841 17969 18852 18343 21346 27164 25585 15428 13830 13135 10816 15792
12915 15792 15309 12729 8873 7071 13053 6963 6309 12717 13921 13231 12215 11985 13059 9468 5777
12900E777L692O756j089M375Q416l102l189M832J784j883o737o25N48j883N783
12885B3455J095n910K571m7P73j142N77p45k513r91m649m39J794j550l444K87
12869I122M344M810N361Q71k15O5L03P178j358M8m113m696m268R49J81N851M801
12852B9234P248p87l240r515p144j798J012O26o040k430K967m18J102m524l584
12837B709L649N505M328N802j314j360R63L108K184l363m59M984n482J083l236
12822A9101K115J105n11r502k204K893O34L72K686q4r219J294L154K135m424O803
12806A6348J4010M898j155q212k957P28P128L807L011L41l421k155o849P43K821
12791B9086Q399K071k455Q45p198o149l257r33M023M437j968j3170J32M235k645
$$ plain form
12900 5777 9469 16225 15136 19511 27927 24825 21636 26468 28252 26369 19632 19007 19555 17672 23455
12885 23455 24550 18640 21211 21164 21937 20795 21372 20627 18114 17123 12474 12035 13829 12279 8835 9122
12869 9122 13466 18276 23637 24508 24293 24358 24661 31839 30481 30529 26416 21720 17452 18401 18582 24433 29234
12852 29234 36482 35695 32455 22940 15796 13998 15010 15636 9596 7166 10133 9715 10817 6293 2709
12837 2709 6358 11863 16191 21993 20679 19319 20282 23390 25574 22211 21752 26736 21254 22337 19101
12822 19101 21216 22321 21810 12308 10104 12997 13631 14003 16689 16605 7386 8680 11834 13969 9545 16348
12806 16348 30358 35256 34101 25889 22932 23660 30788 34595 37606 37947 34526 32371 25522 26265 29086
12791 29086 37485 39556 37101 37946 30748 24599 21342 20409 24432 28869 26901 13731 13863 18098 15453
12776A5453k128j354O490J050N09j466J72l191k218N580N99k651M205J873P7k307
12760B0693J417m843p793k775J88P154P186Q167q13l309p039k090O995R322L4
12745C2494l902l345j850k243k816k183J801j27Q900J2705N987j702n240k943
12731C5536j768n07Q133Q95r392p254j2L570K744K843m42K812N782J0074M537
12716E7551O099R484J7195K3719L3890M5835N1905K1727l770l0937m5510m6492
12704A40696l3042j9657j5771q160l254m481n034p058l049M333m980m070k316
12691C4157k634j254L152m278Q39N228l967k790M487O893K286L408J2119K0187
12677G7833L0802M1800K9226o533k6537l2737k1504j3003o326p356K862M722J2745
$$ plain form
12776 15453 13325 11971 18461 19511 20020 18554 18726 15535 13317 18897 19496 16845 21050 22923 23000 20693
12760 20693 22110 17267 9474 6699 6887 14041 21227 29394 28581 25272 18233 16143 23138 32460 32494
12745 32494 28592 25247 23397 21154 18338 16155 17956 17829 26729 39434 45421 43719 38479 35536
12731 35536 33768 33261 41394 42289 32897 25643 25631 29201 31945 34788 34346 37158 42940 53014 57551
12716 57551 63650 73134 90329 114048 147938 193773 245678 267405 263635 232698 187188 140696
12704 140696 107654 87997 72226 64066 60812 56331 51297 44239 41190 45523 40543 36473 34157
12691 34157 31523 30269 33421 29143 29982 35210 31243 28453 32940 39833 42119 45527 57646 77833
12677 77833 108635 150435 179661 173128 146591 113854 92350 79347 73021 65665 68527 73249 85994
12664H5994R229M005J1952K8410M0912O5901R5639J02190O1610p714m8267n5682
12652C94179m7564n5979o2969n4036m1986k7139j8944j3617j1510q683m629j751
12640D5372k03L734n775n999Q67K293j950n037K750N9J258M84j366M058P186N602
12624E3333m677q463r784L178N204M68M120l089k74M220P789K80m853j780O512
12609E2184J0941J1450J5015J8753K6279N0510O9783O4577K3293k1411n6773o5548
12597A99053n8850l3274k2976j3119k204p448q903o426P44j141r011K388M966
12584D3799o245j2187n744N246P995J2211K503K58m78j2341j0007L81J1197N13
12570C7101q959K007O658O900J946o73j183k381q089p012Q213M80l365p89N440
$$ plain form
12664 85994 95223 99228 111180 139590 180502 246403 342042 444232 505842 498128 449861 394179
12652 394179 346615 290636 227667 173631 131645 104506 85562 71945 60435 51752 47123 45372
12640 45372 45169 48903 43128 37129 37996 40289 38339 33302 36052 36111 37369 37853 36487 40545 47731 53333
12624 53333 48656 40193 30409 33587 38791 39259 43379 40290 40016 44236 52025 52305 47452 45672 52184
12609 52184 63125 74575 89590 108343 134622 185132 254915 319492 342785 321374 264601 199053
12597 199053 140203 106929 83953 70834 68630 61182 52279 45853 46597 45456 36445 38833 43799
12584 43799 37554 25367 19623 24869 32864 45075 47578 47836 47358 35017 25010 25391 36588 37101
12570 37101 28142 30149 36807 43707 45653 44980 43797 41416 33327 26315 34528 35008 31643 30854 36294
12555C6294Q483K185K219L394L837L082k665p28r23q84j521m69j027M867J5096
12540G1240K1437K4083K6133K1351J2857j0699k0607k6682k3565j7684q689k700
12528F6475M136k296K059R667K897O895l169R58r768j0777m376J910j682q531
12514E4398l726k128J684L534l430n113j27n411r259J454n029m794L432L153O071
12499C4709L63J784L005j373M98j051k093n404L241L800p099P45m15K134K942
12484C5786M540K272J47M324N618M123j068N191P176j818M319J1784J152K864
12470H6410J2491J6376K154k063j1667j6818n601n944p485l489m680M480K013
12457F6177m17k607m955j016j580m534O326j046p479j2774m268m225Mm61K662
$$ plain form
12555 36294 44777 46962 49181 52575 56412 59494 56829 56101 55178 54294 52773 52304 51277 56144 71240
12540 71240 92677 116760 142893 164244 177101 166402 145795 119113 95548 77864 69175 66475
12528 66475 70611 68315 70374 80041 82938 89833 86664 87622 77854 67077 62701 64611 62929 54398
12514 54398 50672 48544 50228 53762 50332 45219 45092 39681 30422 31876 26847 22053 25485 28638 34709
12499 34709 35072 36856 39861 38488 38986 37935 35842 30438 33679 37479 30380 31125 30710 32844 35786
12484 35786 40326 42598 42745 47069 52687 56810 55742 60933 68109 66291 70610 82394 83546 86410
12470 86410 98901 115277 117431 115368 103701 86883 81282 75338 67853 64364 59684 64164 66177
12457 66177 65760 63153 58198 57182 55602 51068 57394 56348 48869 36095 31827 27602 27606 27145 29807
12442B9807J2J31k100O704N525K408J1824N663l189J47M74Q50m764j163O717N957
12426F5003J400L865O629l732P02L931J049j431k61J4104N397K302K612l433J1652
12411A09789j511j6517j5161r198M575K535J661K321L778M605M855J6332J5268
12398A23332J8348K6997K869n61M543j0806j9781k3500k2457j5850m478n55j221
12385G6880M714l086K571k04k301J202J2208K4085K8156L2460J2053j4437k1578
12372A52723k742o194p621j790n16l662M680R26m156l26M268J985L002L457O002
12357A50036P866K487L966J5685J9201K7759M6197N8997M7825L7615K4691J6989
12345D59314J1917q185j5131j7495k6558m2569n6713k6255j4660k4572l2371k3173
$$ plain form
12442 29807 29819 29950 27850 34554 40079 42487 54311 59974 56785 56932 57406 58256 53492 52329 59046 65003
12426 65003 66403 70268 76897 73165 73867 77798 78847 77416 77155 91259 96656 98958 101570 98137 109789
12411 109789 108278 91761 76600 67402 71977 74512 76173 78494 82272 86877 91732 108064 123332
12398 123332 141680 168677 171546 170985 175528 164722 144941 121441 98984 83134 78656 78101 76880
12385 76880 81594 78508 81079 80875 78574 79776 91984 116069 144225 176685 188738 174301 152723
12372 152723 149981 143787 136166 134376 133860 130198 134878 135804 131648 131322 135590 137575 140577 144034 150036
12357 150036 157902 160389 164355 180040 199241 227000 273197 332194 380019 417634 442325 459314
12345 459314 471231 463046 447915 430420 403862 361293 304580 278325 263665 239093 206722 183549
12333A83549k3850j5640k570l377l601J486K388k052L608N907P165J0142J5573
12320A78728L686Q408M683R864K1051P646K232Q488P159K023R28N055L987O361
12306B70299N959R123J1268K0924J8074K2959M1141N8003P4620R7744J25860J43544
12294H99518J21786O1857R675j1931P137K7159L4937J3940j711J8896N2418R2021
12282A325702J60657K29716L26162M32113N19653O20730Q10256J164614J813106
12273G402709L020791N007212P387085Q258072N688086J619569m6527n63017l433138
12264C4340842p001781p616862n733590l655140k233039j318410p29931n16692
12256E535397o51916q15975p47709n72406m12334k96160k14668j52446j12629
$$ plain form
12333 183549 159699 144059 141489 138112 134511 135997 138385 136333 139941 145848 153013 163155 178728
12320 178728 182414 190822 195505 205369 226420 234066 236298 244786 251945 253968 254896 259951 263938 270299
12306 270299 276258 285381 296649 317573 335647 358606 399747 457750 532370 630114 755974 899518
12294 899518 1021304 1083161 1092836 1080905 1088042 1115201 1150138 1164078 1162367 1181263 1233681 1325702
12282 1325702 1486359 1716075 2042237 2474350 2994003 3614733 4424989 5589603 7402709
12273 7402709 10423500 15430712 22817797 31075869 36763955 38383524 38336997 37773980 34340842
12264 34340842 27339061 19722199 13988609 10333469 8100430 6782020 6052089 5535397
12256 5535397 4883481 4067506 3319797 2747391 2335057 2038897 1824229 1671783 1559154
12247A559154q3113o2857l8089j3774J5728M0657P2688Q9306J00143R4829P8231
12236A852903M9481L4077M3048P7159J20293J71481K42866L28316M54961O22491
12226C997076Q18444J012542J223381J495616K005240L040809M974871Q068605
12218B6636584J2054366J5439081J6110594J2661396L930413p554480j2410290
12211F6867664q054707l985966o599447j1127143j0988058p652481m744303l059766
12203A0655793k120435j525736j137737q74654p03213n99937n09536m11304l17063
12194B456178k47014j96033j57831j25885r7395p7341n7160m0649j5869j683O8
12183A439386N121K1524N1127O3739O9624R2241J09457J29001J78881K62900L71838
$$ plain form
12247 1559154 1476041 1413184 1375095 1361321 1377049 1417706 1490394 1579700 1679843 1774672 1852903
12236 1852903 1902384 1936461 1979509 2056668 2176961 2348442 2591308 2919624 3374585 3997076
12226 3997076 4815520 5828062 7051443 8547059 10552299 13593108 18567979 26636584
12218 26636584 38690950 54130031 70240625 82902021 86832434 79277954 66867664
12211 66867664 58812957 54826991 48227544 37100401 26112343 18459862 13715559 10655793
12203 10655793 8535358 7009622 5871885 4997231 4294018 3694081 3184545 2773241 2456178
12194 2456178 2209164 2013131 1855300 1729415 1632020 1554679 1497519 1456870 1441001 1439318 1439386
12183 1439386 1444507 1466031 1517158 1580897 1650521 1742762 1852219 1981220 2160101 2423001 2794839
12172B794839N10097P00983R24324J195514J506775J765746K110665L261684N790748
12163B0561375R300424J1687362J0005535M722356l09164m723055r392072j1271389
12155C0581372r291925o209622l917444k555920j752199j255143r31858p44595
12147C922666o36402n34868m30204l44224k65752k19507j87471j54365j25279
12138A024594r8510r0022p8380n8789m2853m4350k9336k8281k6645l4456l4049
12127D58923k2378j1984j7341j2750j5118j8069k1210k4421k0395j9512j5118
12116B60627p387o087r594r606o747o001j0529r532j848j075J154K044l444L32
12102A92307J414l552n980n854m686p656k255K578K917J763J729j938j7233k6310
$$ plain form
12172 2794839 3304936 4005919 4930243 6125757 7632532 9398278 11508943 14770627 20561375
12163 20561375 29861799 41549161 51554696 56277052 55967888 51244833 41852761 30581372
12155 30581372 21289447 15079825 11162381 8606461 6854262 5599119 4667261 3922666
12147 3922666 3286264 2751396 2321192 1976968 1711216 1491709 1304238 1149873 1024594
12138 1024594 926084 836062 757682 698893 656040 611690 582354 554073 527428 492972 458923
12127 458923 436545 424561 407220 394470 379352 361283 340073 315652 295257 275745 260627
12116 260627 253240 247153 237559 227953 221206 215205 204676 195144 193296 192221 193375 195419 191975 192307
12102 192307 193721 190169 184189 178335 173649 165993 163738 166316 169233 170996 172725 170787 153554 127244
12088A27244j7998j8232k4994m962J432J807J003n968m11k13K843P741L871N67
12074G3730M442K904M230K332K599J191m002k694m087k697k469n676l680L2N846
12059G2001J3217K8835M5947N6218L9709o228m3174n2799l9448k0525q601J136
12047H6288J954L488J592n881j2507J126Q13K473L680l324o394r503q411q100
12033D7294j7315j5890l915l600O03p00N246Q982K14O194R355K469K571P439N256
12018E4203o946p262l665L010K868j951k585J194l369q624j2750p065k439M337
12004H956M339O18K008J346J230M224J0742K888K660N269O308m011l559L50Q743
11989E2111L358P452o85J14K060O847l063m310l501m323N356K838o711n809j0170
$$ plain form
12088 127244 109246 91014 66020 61058 62490 64297 65300 59332 58921 58708 61551 69292 73163 73730
12074 73730 78172 81076 85306 87638 90237 91428 87426 84732 80645 77948 75479 69803 66123 66155 72001
12059 72001 85218 114053 160000 216218 255927 249699 206525 153726 114278 93753 85152 86288
12047 86288 88242 91730 93322 87441 74934 76060 76873 79346 83026 79702 73308 63805 55394 47294
12033 47294 29979 14089 10174 6574 7177 6477 11723 20705 20919 27113 36468 38937 41508 48947 54203
12018 54203 47257 39995 36330 39340 42208 40257 37672 38866 35497 26873 14123 7058 4619 8956
12004 8956 13295 13913 15921 17267 18497 22721 33463 36351 39011 44280 50588 46577 43018 43368 52111
11989 52111 55469 62921 62236 62350 64410 71257 68194 63884 60383 56060 61416 64254 57543 51734 41564
11974D1564k238M280K137K14l401n826l571P49J0706O476L188O945o387j2471
11960D2365o406J754k485N145L355j842J312l687j975o432l593L97j271n562K267
11945B3342j235K803k59O907L447J108k49k607j954J531n518k848l63J852n03
11930B5454j414K070l928N184Q759o46m702N171k247o46K089N956k47j366O910
11915D6397O405K280l537o838l048k704o035N129N091J132o028j542M282K232
11901D3216m368n140q062J703Q050J106o153q982L174K288j181K742q57q68M671
11886C1339K704m98l104N452K699p98K037k093l547n38m255N402M286l63M241
11871D2964N838m437Q34J730R495J0912J3015J7339J9404J6014R740O943Q261
$$ plain form
11974 41564 39326 43606 45743 45957 42556 36730 33159 33908 44614 51090 54278 61223 54836 42365
11960 42365 35959 37713 35228 40373 43728 41886 43198 39511 37536 31104 27511 27908 26637 21075 23342
11945 23342 22107 24910 24651 31558 35005 36113 35864 33257 31303 32834 27316 24468 24105 25957 25454
11930 25454 24040 26110 22182 27366 36125 35479 30777 35948 33701 33055 35144 41100 40853 39487 46397
11915 46397 52802 55082 51545 44707 41659 38955 32920 38049 43140 44272 38244 36702 40984 43216
11901 43216 38848 33708 25646 27349 35399 36505 30352 21370 24544 26832 25651 28393 27536 26668 31339
11886 31339 34043 33545 30441 35893 38592 37794 39831 37738 34191 33653 29398 34800 39086 38723 42964
11871 42964 48802 44365 45199 46929 56424 67336 80351 97690 117094 133108 142848 149791 158052
11858A58052J6655J2713J5688J3085j691k362J486N831p727q236j6948k6378j6224
11845A43944q992j1377j6174j3874j0169j2096o208M891m188q942L57K697M902
11832F4771J0002J888j595Q240O963J1786K0919K0664K7473J544k0980k1833r626
11819A20216J930Q853K0912K8848K0559K63j2600j1282j0250K39J1160J8570K1225
11806B18643J9599J3941P922q72P712J5953J7504R754j3566k4156k1997p914p868
11793B34655o892j1784k6173k2528q233j3983j1736j6100o136K270K61M121K7607
11780A45349N5873O3143M4048m605m3962j8989J0049J5121J829j7134j1320J5488
11768B54890L6667L7089K5066R570j4014j7481j4217K447N26k0367m8112m8699
$$ plain form
11858 158052 174707 187420 203108 216193 214502 212140 213626 219457 211730 203494 186546 160168 143944
11845 143944 134952 123575 107401 93527 83358 71262 65054 69945 65757 56815 57172 59869 64771
11832 64771 74773 76661 75066 83306 90269 102055 122974 143638 171111 172655 151675 129842 120216
11819 120216 122146 130999 151911 180759 201318 201581 188981 177699 167449 167688 178848 197418 218643
11806 218643 238242 252183 260105 259233 266945 282898 300402 310156 296590 272434 250437 242523 234655
11793 234655 227763 215979 189806 167278 159045 145062 133326 117226 111090 113360 113621 117742 145349
11780 145349 201222 264365 308413 303808 259846 240857 250906 266027 267856 250722 239402 254890
11768 254890 291557 328646 353712 363282 349268 331787 317570 320017 320543 300176 252064 203365
11756B03365k9474j5281j5361n534k134J2170M137O766N742l888k862p159l288
11743A47199L677J853q442n592r366r946o204n642r121j1559j4454o956K754l989
11729F4212m019M702L734L092O207Q919J501O476R844J5948K5799M0385M8549
11716B35349M2883J2303j3017p838J575J6771Q315o196l4669n7645m5814k9948
11704A22069r990o441j1366p968l933j717m798K10N039K62k530L192M604q394
11690G8239l437Q226k691n014p512N83j925p475n072l273M479L760N459j173k238
11675F0936L617l04k229L193K119M877L507K470q029l403K405j073m301o87K847
11660F5945R86k683L282k118R36M873n44K53l372N288J42k340K757N32J046J05
$$ plain form
11756 203365 173891 158610 143249 137715 135581 147751 151888 158654 164396 160508 157646 150487 147199
11743 147199 150876 152729 144287 138695 129329 119383 113179 107537 98416 86857 72403 65447 68201 64212
11729 64212 60193 64895 68629 71721 77928 86847 88348 94824 104668 120616 146415 186800 235349
11716 235349 278232 290535 277518 269680 271255 288026 296341 290145 255476 197831 152017 122069
11704 122069 112079 105638 94272 86304 82371 80654 75856 76066 81105 81367 78837 82029 86633 78239
11690 78239 74802 83028 80337 75323 67811 68394 66469 58994 53922 50649 55128 58888 64347 63174 60936
11675 60936 64553 64249 62020 65213 67332 72209 75716 78186 70157 66754 69159 68086 63785 63098 65945
11660 65945 66931 64248 67530 65412 66348 71221 70677 70930 67558 72846 72988 70648 73405 73937 74983 75088
11644G5088J88M169R568Q192Q00l63l001j0167L31O131R537L487n774l062o801
11629H8323k226j104o687k604r624l139mP22N524l198k148k545K344Q793M483
11614G6910l949o953q939k256J0612M100j503J042R570O882o986r46P285N802
11600I0671R146J784J86L994N227J0607O716J105P475O696O903O997N880J2727
11586A76114J0724J3773K2267L0932M9862Q9412J69335K95145M47429N02684L07240
11575B114917o5754l93545n05336l78908k16386j27042p9450m1746l1178j6583
11565B58989q684q659q452j5152q778k654r971j4748r123j4515k3063p158L270
11552A31302L539J0569J0062J922J2552J9154J2047J807J138O339P067J4219K3834
$$ plain form
11644 75088 75276 79445 89013 97205 98005 97642 94641 84474 84805 90936 100473 103960 98186 95124 88323
11629 88323 86097 84993 78306 75702 66078 62939 62935 63657 69181 65983 63835 61290 63634 72427 76910
11614 76910 72961 66008 57069 54813 65425 69525 68022 69064 78634 85516 78530 77584 84869 90671
11600 90671 99817 101601 101787 105781 111008 121615 128331 129436 136911 143607 150510 157507 163387 176114
11586 176114 186838 200611 222878 253810 303672 393084 562419 857564 1304993 1807677 2114917
11575 2114917 2049163 1655618 1150282 771374 554988 427946 348496 306750 275572 258989
11565 258989 250305 241646 233194 218042 209264 206610 196639 181891 172768 158253 135190 128032 131302
11552 131302 134841 145410 155472 157394 169946 189100 201147 202954 204092 210431 217498 231717 255551
11539B55551J5946M476N947O215Q615O678J1771K1445M6844R7343J73094L13296
11527I67221N38914P23428N78299K8726n40504p06786n34247l17092j75455r8028
11517D64476n3404k9828j1296J816J415r693k2011j7649m386o098j4778j1004
11505B87560j1722j0910j0685j1223j0718m613j1350q278m378k653M048m860N94
11492B00812J3411J3072K239O43J044K181J818J0609K4035J4714J9762J9949L922
11479C28211o992p065L718J0179J5522K1763J3772N213J4844K8673L0607L1471
11467D89916L5287L1295M7555O5275O9510O1353O7604Q1839R2475R9859J08734
11456A250702J23299J57609K10153K65104L32060M30241N66366P82516J100123
$$ plain form
11539 255551 271497 275973 281920 288135 296750 303428 315199 336644 383488 480831 653925 967221
11527 967221 1506135 2229563 2807862 2836588 2296084 1589298 1055051 737959 562504 464476
11517 464476 411072 381244 369948 371764 373179 363486 341475 323826 319440 313342 298564 287560
11505 287560 275838 264928 254243 243020 232302 227689 216339 208061 203683 201030 205078 200218 200812
11492 200812 214223 227295 229534 230177 231221 233402 235220 245829 269864 284578 304340 324289 328211
11479 328211 321219 314154 317872 328051 343573 365336 379108 384321 399165 427838 458445 489916
11467 489916 525203 556498 604053 669328 738838 800191 867795 949634 1042109 1141968 1250702
11456 1250702 1374001 1531610 1741763 2006867 2338927 2769168 3335534 4118050 5218173
11447E218173J602253K275945K925852L263007L289990L001836K239046J381651
11439B5197753J079293J364614J561999J029281J40079l63310p06930j414846
11431B7887933k050938k308264k580355k917895l127490l125928k659712j920682
11423G196669j318568r48992p27728n92061m80494l64440k73123k09418j58010
11414B123835j10324p2458m7833k6030j1290K5483N2105P4458J01155J48571K18449
11403B476121K61883K70328K63058K98539L96462N79319Q78516J347493K018576
11394H790295K709529L089029L208651L554506M161551M633437M725301M676335
11386C9548634M214233K514083L49490m67702P83138K045049J055571j606451
$$ plain form
11447 5218173 6820426 9096371 12022223 15285230 18575220 21577056 23816102 25197753
11439 25197753 26277046 27641660 29203659 30232940 30373019 30009709 29302779 27887933
11431 27887933 25836995 23528731 20948376 18030481 14902991 11777063 9117351 7196669
11423 7196669 5878101 4929109 4201381 3609320 3128826 2764386 2491263 2281845 2123835
11414 2123835 2013511 1941053 1893220 1867190 1855900 1881383 1933488 2007946 2109101 2257672 2476121
11403 2476121 2738004 3008332 3271390 3569929 3966391 4545710 5424226 6771719 8790295
11394 8790295 11499824 14588853 17797504 21352010 25513561 30146998 34872299 39548634
11386 39548634 43762867 46276950 46626440 46158738 46941876 48986925 50042496 48436045
11378D8436045l630985m162593l882131l693144m026989m724310m861401m276354
11370A5178138l411498k499891j766799j279138r55540p48340o10798m79508l70974
11361C055652k85639k35820j96186j68929j24952r4634o7323n4517l6850j0547
11351A780255L795K6727O2783J16831J73498K17999K49824K82217L41932M63900
11341C719761O65991J014094J498590J953600K179466K150027K118003K008711
11333A7308243J594894J143705J016007R03620M58057o9761l7054L72493r284
11324B2680920j343683k314833k363494k132626k026797k054794k102671j904067
11316F437955j450049j014316p22598n45059m17104l21436k48625k01638j67065
$$ plain form
11378 48436045 44805060 40642467 36760336 33067192 29040203 24315893 19454492 15178138
11370 15178138 11766640 9266749 7499950 6220812 5265272 4516932 3906134 3426626 3055652
11361 3055652 2770013 2534193 2338007 2169078 2044126 1949492 1882169 1827652 1790802 1780255
11351 1780255 1784050 1810777 1873560 1990391 2163889 2381888 2631712 2913929 3255861 3719761
11341 3719761 4385752 5399846 6898436 8852036 11031502 13181529 15299532 17308243
11333 17308243 18903137 20046842 21062849 21966469 22424526 22354765 22317711 22690204 22680920
11324 22680920 21337237 19022404 16658910 14526284 12499487 10444693 8342022 6437955
11316 6437955 4987906 3973590 3250992 2705933 2288829 1967393 1718768 1517130 1350065
11307A350065j32245r8705o8243o5959p5130o9620o3521o3160n8948m1886l5971
11296E76677k5451k5992k3891j8972k1831j8784n522p620j2920o496o920k40R295
11283D11333J4228K2609M1527Q1695J33175J98129K12925J43331j0112j58341
11273A090499k23873k18260j52253j00794n5530k9647k2176k0867k1462j8793
11263B26844j2641o461J0508J0917k041k453n687j0250Q6N246M487M897k830l756
11249B16866j4951j1380k013J0264J0381l14o43q89L037L730l731j049Q24J09
11235B10241L048J471Q153L105J4611J0771J7794J7952N740l480o840j6692k3613
11222B42261p941J2700K2511J5834M919j6627k0969p604O700K6163M1779M3234
$$ plain form
11307 1350065 1217820 1119115 1050872 984913 909783 840163 776642 713482 654534 612648 576677
11296 576677 551226 525234 501343 482371 460540 441756 436234 428614 415694 409198 402278 402038 411333
11283 411333 425561 448170 489697 571392 704567 902696 1115621 1258952 1248840 1090499
11273 1090499 866626 648366 496113 395319 339789 310142 287966 267099 245637 226844
11263 226844 214203 207742 218250 229167 227126 224673 218986 208736 208822 214068 218555 223452 220622 216866
11249 216866 201915 190535 188522 198786 209167 208853 208210 207321 210358 214088 210357 209308 210132 210241
11235 210241 213289 214760 222913 226018 240629 251400 269194 287146 292886 289406 282566 265874 242261
11222 242261 234320 247020 269531 285365 290284 273657 252688 245084 251784 277947 319726 362960
11210C62960L1430J3322j69o3p630J415K329J1030J3186L950J5832J3390M774
11197D65756R202J2903K2638L0995N1132P1926O9411O3425M7409K0415n215k0053
11185H39944m731K9909O3990R7097J20440J25395J18615J19658J30438J47676
11175A788431J55490J69714J95451K33637K63296K86544L10419L41456L97973
11166D142411M78174N94714P91179J132977J623673K169867K544872K628488K584087
11157A8690442K976296M366188P315571J2860983K3291179M2692017P1813504
11150A84006180R3887425P7964645K1395793m2468591q5621500q6251032n8519979
11143A04392941l3887329j9905130j2436342q044970n274248l663036k914753
$$ plain form
11210 362960 394390 407712 407543 407480 399850 401265 403594 414624 427810 431760 447592 460982 465756
11197 465756 474958 487861 510499 541494 592626 664552 733963 797388 844797 865212 859997 839944
11185 839944 835213 865122 929112 1026209 1146649 1272044 1390659 1510317 1640755 1788431
11175 1788431 1943921 2113635 2309086 2542723 2806019 3092563 3402982 3744438 4142411
11166 4142411 4620585 5215299 6006478 7139455 8763128 10932995 13477867 16106355 18690442
11157 18690442 21666738 26032926 33348497 46209480 69500659 112192676 184006180
11150 184006180 277893605 355858250 377254043 334785452 249163952 162912920 104392941
11143 104392941 70505612 50600482 38164140 30119170 24844922 21181886 18267133
11136A8267133k664980k512246k229439j835462j426587j109967q74938p04567
11128D908947n75777m85146l88009l18301k67059k30269k01784j72117j41431
11119B129054j25209j10747j13540r5066n4938m7415n4282p8458j03805j12146
11109A233448j10596q0910m5756l7106j8289j2018j4345j9951l7993m0733l7821
11098G77930l6507k8599l0337k8981j8813j7041j8533k1119k7884l4545k8364
11087D87207k2513j947J1193K3984K2756Q536k2056l4582l3901k7512j0453m523
11075C96189k749j3450l0387k6137k7460k3350j3769j3636j057P623K028p813
11063B46032j2171m284r27k139q479o926o691r254P37m608m377l865p758j506
$$ plain form
11136 18267133 15602153 13089907 10860468 9025006 7598419 6488452 5613514 4908947
11128 4908947 4333170 3848024 3460015 3141714 2874655 2644386 2442602 2270485 2129054
11119 2129054 2003845 1893098 1779558 1684492 1629554 1582139 1527857 1449399 1345594 1233448
11109 1233448 1122852 1041942 996186 959080 940791 928773 914428 894477 856484 815751 777930
11098 777930 741423 712824 682487 653506 634693 617652 599119 578000 550116 515571 487207
11087 487207 464694 462747 473940 497924 520680 529216 507160 472578 438677 411165 400712 396189
11075 396189 393440 379990 349603 323466 296006 272656 258887 245251 244194 251817 253845 246032
11063 246032 233861 229577 228650 226511 218032 211106 204415 195161 195898 191290 186913 183048 175290 173784
11049A73784k207j2505j8520j1098n333J665M02P326P186P721Q035M809K447J3428
11035A77140J2385J5560m779o068j0649j1447q326N066J4074J3576q043m7209
11023A41280o6187q2018p7271n1925j9052L6852O5165O3176M8993L4967K2708
11012A16688J9033J5291P695J039j866k687j1098j6518j6771j3170n384j4218
11000G8034j6356j7130j5763j9783k7300k0987q487j738K004O388J9813K4952
10988C647K0365J0290K719K877J881l886j841l545N332P662J1923J0624L737O898
10974G8683J1063J5419J4913J1396O302N468R452P066N918J1603J2788J4186J6431
10961B20688J8494K3469J6631Q308Q786J3402J4436J1251j1020l1321l4091k1572
$$ plain form
11049 173784 171577 159072 140552 129454 124121 125786 126188 133514 140700 148421 156456 161265 163712 177140
11035 177140 189525 205085 200306 194238 183589 172142 163816 168882 182956 196532 188489 141280
11023 141280 75093 -6925 -84196 -136121 -155173 -118321 -53156 10020 59013 93980 116688
11012 116688 135721 151012 158707 159746 157880 155193 144095 127577 110806 97636 92252 78034
11000 78034 61678 44548 28785 9002 -18298 -39285 -47772 -49510 -47506 -41118 -21305 3647
10988 3647 24012 34302 37021 39898 41779 37893 36052 32507 37839 45501 57424 68048 71785 78683
10974 78683 89746 105165 120078 131474 137776 143244 152696 159762 165680 177283 190071 204257 220688
10961 220688 239182 262651 279282 287590 296376 309778 324214 335465 324445 293124 259033 237461
10949B37461l0264l2427l7328l8114k9123r756n640j5904q619m148L599K591q595
10936B3733r985p207o08P203K499K129M666L078m348K029J1634j059K469N883
10922D2116k69P238J1288J4701O339m484j1179j0822k492J0740J4357K0532L0780
10909A28845K7786J7019O668Q629R241q159p714K564P757J6711J7503J7501R30
10896B45281k6280l7301l8291l2409l7133k7495j9508j4120n177k463k529N533
10884H108k48P810L414k430m853q028K478k967l106Q173O012j243R97j654j1333
10869A130r439n25j165k553J348K027K764J0766k9n989j130l975l231j238J575
10854i664J0911p76q74L106p028r030j376K064Q989O903J5207L759o199l018j0379
$$ plain form
10949 237461 207197 174770 137442 99328 70205 60449 54809 38905 30286 26138 29737 32328 23733
10936 23733 13748 6541 5933 13136 15635 17764 22430 25508 21160 23189 34823 33764 36233 42116
10922 42116 41847 49085 60373 75074 81413 76929 65750 54928 52436 63176 77533 98065 128845
10909 128845 156631 173650 180318 188947 198188 190029 182315 184879 192636 209347 226850 244351 245281
10896 245281 219001 181700 143409 111000 73867 46372 26864 12744 7567 5104 2575 8108
10884 8108 7860 15670 19084 16654 11801 3773 6251 3284 178 8351 14363 13120 14117 12463 1130
10869 1130 -8309 -8834 -9999 -12552 -11204 -9177 -6413 4353 4324 -1665 -2795 -6770 -10001 -11239 -9664
10854 -9664 1247 471 -403 2703 -4325 -13355 -14731 -12667 -3678 3225 18432 22191 15992 12974 2595
10839B595J459K176n92k080q271j242j404k823l503L573Q276P73J386P50l030
10824a957m365o17P24o01l676l273l972K389M643N247J304n511L887O008M742
10809D972j666m71r94p234r207J635N272M143l148p54m15j822Q99L539M663n924
10793f512O125Q967Q85m788k853l532K380k8O908j758n588p120j074P287N146
10778D445M123P17K2J037p805O224Q605m532j1720L664n82p999p186N07J300M441
10762d739P2L161N591l700m202o61k52K320L567j212J312J653j257l369O579n256
10746c93p117M094P245J083R49J926k439j080m299m387P52J0194L552l511K517
10731I086J2309J6790J2444L031N680K351K56J3456J4651K1773L8740O1786R9368
$$ plain form
10839 2595 4054 6230 5638 3558 -4713 -5955 -7359 -10182 -13685 -10112 -1836 -1063 323 1073 -1957
10824 -1957 -6322 -6939 -6215 -6816 -10492 -13765 -17737 -15348 -10705 -5458 -4154 -9665 -5778 230 4972
10809 4972 3306 2835 1841 -5393 -14600 -12965 -7693 -3550 -6698 -7452 -7867 -9689 -8790 -5251 -588 -6512
10793 -6512 -387 8580 9465 4677 1824 -1708 672 644 7552 5794 206 -6914 -7988 -701 4445
10778 4445 8568 9285 9307 10344 2539 8763 17368 12836 1116 4780 4198 -3801 -10987 -10480 -9180 -4739
10762 -4739 -4667 -1506 4085 385 -3817 -4478 -4730 -2410 1157 -55 1257 2910 1653 -1716 4863 -393
10746 -393 -7510 -3416 3829 4912 5861 7787 5348 4268 -31 -4418 -3666 6528 10080 6569 9086
10731 9086 21395 38185 50629 53660 59340 61691 61947 75403 90054 111827 150567 212353 311721
10718C11721J85987L31985M80187M83053K14497j63339m39236m78798l38338k04334
10708C83385j16639p2562l9387l2453k3154j6732j6439j3729q260j3983j1518
10697A8529m901j426K433k096L310m629n704L237n733j829p007J646q568l058
10683a5796Q329M667K559K977L065q64k416p167n983K942J554k076J967m118m170
10668a4530J830N586j187O298M545j463m979j979Q22j15m176j90K920q348q815
10653b3781L945N926O354L794j171n232j643L971M906P48K575k952o018j664L64
10638i878O66N743j848q462m189K634J331J926k469j991n606q998L682L535j705
10623b5629K586L339M018P429N029m94O444p107j2627p505O461L250M021O217
$$ plain form
10718 311721 497708 829693 1309880 1792933 2007430 1844091 1404855 926057 587719 383385
10708 383385 266746 194184 154797 122344 99190 82458 66019 52290 44030 30047 18529
10697 18529 13628 12202 14635 12539 15849 11220 5516 8753 3020 1191 -5816 -4170 -12738 -15796
10683 -15796 -7467 -2800 -241 2736 5801 4937 2521 -4646 -10629 -7687 -6133 -8209 -6242 -10360 -14530
10668 -14530 -12700 -7114 -8301 -2003 2542 1079 -3900 -5879 -5057 -5172 -9348 -9538 -6618 -14966 -23781
10653 -23781 -19836 -13910 -7556 -3762 -4933 -10165 -11808 -7837 -2931 -2183 392 -2560 -8578 -10242 -9878
10638 -9878 -9212 -3469 -5317 -13779 -17968 -15334 -14003 -12077 -14546 -16537 -22143 -31141 -27459 -23924 -25629
10623 -25629 -23043 -19704 -15686 -8257 -3228 -3722 2722 -4385 -17012 -24517 -18056 -14806 -10785 -4568
10609d568o557k967L144O262M880l735M638k896o984k532K211j160n91J378q050
10594a7527L945k830K421L319R91K996l443m560p506m33j281M688K870j915m64
10579a8729N168Q498O442p398j1034l113O108O539N162j847K739k238o90R44p37
10564d186K550Q30J330l545j472K012N09L45O504l20k238p710n201k69R094J559
10548b08o377o185j726j536N864L000r66L142K969L22J756m427k317L172K44j189
10532d462O93p722J590k321k651m38P258L158K847j221k472p233m174l636J337
10517a9447N434M581O225r45M567J624J492J263p605j120m478l973O623L061j625
10502d323R6L32r09Q94l267j397J866K154j086k839M96j94n330j035L523q5O525
$$ plain form
10609 -4568 -11125 -14092 -10948 -4686 194 -3541 1097 -1799 -8783 -11315 -9104 -10264 -10855 -9477 -17527
10594 -17527 -13582 -16412 -13991 -10672 -9681 -6685 -10128 -14688 -22194 -22627 -23908 -19220 -16350 -18265 -18729
10579 -18729 -13561 -5063 1379 -6019 -17053 -20166 -14058 -7519 -2357 -4204 -1465 -3703 -4393 -3449 -4186
10564 -4186 -1636 -806 524 -3021 -4493 -2481 -1972 -1627 4877 4557 2319 -5391 -10592 -10861 -1767 -208
10548 -208 -6585 -12770 -14496 -16032 -10168 -7168 -8134 -4992 -2023 -1701 55 -4372 -6689 -3517 -3273 -4462
10532 -4462 -3769 -11491 -9901 -12222 -14873 -15311 -8053 -4895 -2048 -3269 -5741 -12974 -17148 -20784 -19447
10517 -19447 -14013 -9432 -3207 -4152 415 2039 3531 4794 -2811 -3931 -8409 -12382 -5759 -2698 -4323
10502 -4323 -4227 -3895 -4804 -3910 -7177 -8574 -6708 -4554 -5640 -8479 -7983 -8177 -13507 -14542 -11019 -11104 -4579
10485d579N579J94n304p88o782P68j264k00m848k108R07j171J398k442k045N89
10469b2096N801Q109M975N247L604K297l751k332q68o49L238j385j889l611R31
10454b379M647m248J576n899m604p227K67P132P509m739m139O075Q041Q35l503
10439f56j18P21O284M418l161o596l634J802Q4k256k792L653N862n187m434M51
10423e559k086o59k606l629Q72M256k297N457m326q804k26N778M101O21J0003
10408H96j01k749J197J04l350K948n581m581r74P156J248n001k189K167O503N211
10392B904p045n685k682l414M222L539N075N102j236L236N036K468l477k595l000
10377B448m255k201J279k348l018k67L531k262M546K952K450M821J0179J8267
$$ plain form
10485 -4579 1000 1194 -4110 -4898 -11680 -10912 -12176 -12376 -17224 -19332 -18425 -19596 -18198 -20640 -22685 -22096
10469 -22096 -16295 -8186 -3211 2036 5640 7937 4186 1854 986 337 3575 2190 301 -3310 -2379
10454 -2379 2268 -1980 -404 -6303 -10907 -18134 -17867 -10735 -3226 -7965 -12104 -6029 2012 2847 -656
10439 -656 -774 -53 6231 10649 7488 892 -2742 -940 -856 -3112 -5904 -2251 3611 -1576 -6010 -5559
10423 -5559 -7645 -8304 -10910 -14539 -13667 -9411 -11708 -6251 -10577 -19381 -19607 -13829 -9728 -9107 896
10408 896 795 -1954 -757 -653 -4003 -1055 -6636 -11217 -12191 -5035 -3787 -8788 -10977 -8810 -2307 2904
10392 2904 -4141 -9826 -12508 -15922 -11700 -8161 -3086 2016 780 4016 9052 11520 8043 5448 2448
10377 2448 -1807 -4008 -2729 -5077 -8095 -8362 -4831 -7093 -2547 405 2855 7676 17855 36122
10363C6122J9254K519p409p999q930j988n074j4209l939o129M661l099q580l901
10349h701n7n99l981l19K579n32P29n686K337J1757p44l594q653j867L363Q497
10333e471L080L193m186k23J259o64M364Q735O88K193J488l78J482M204J9447
10318C9211K1447K0844P067L324n375r690j4459j0651q012o657p427p725j0657
10305A1240r170j065K80R99r628q808P281L214K161M423q773k942J0259L563n874
10290b840J88k29M36j88p39n014K324O045k574O179L513r188m767p59n328N685
10274g256M419N57Q741J4792P800J1414J4622Q35l468l798j5486j1236n158o53
10260A6125o038q869j508J620Q327O125m419r819n149N168o043q661N185R266
$$ plain form
10363 36122 55376 57895 50486 42487 33557 31569 26495 12286 8347 2218 6879 3780 -4800 -8701
10349 -8701 -8758 -9357 -13338 -13657 -11078 -11610 -10881 -16567 -14230 -2473 -3217 -6811 -15464 -17331 -13968 -5471
10333 -5471 -2391 802 -3384 -3607 -2348 -3012 1352 10087 10775 12968 14456 14078 15560 19764 39211
10318 39211 60658 81502 88569 91893 86518 76828 62369 51718 43706 37049 29622 21897 11240
10305 11240 2070 1005 1285 2284 -7344 -16152 -8871 -5657 -3496 927 -7846 -10788 -529 3034 -2840
10290 -2840 -2652 -2881 -2445 -2633 -3372 -8386 -6062 -17 -2591 3588 7101 -2087 -6854 -7613 -12941 -7256
10274 -7256 -2837 -2280 6461 21253 29053 40467 55089 55924 52456 48658 33172 21936 16778 16125
10260 16125 10087 1218 -290 1330 9657 15782 11363 1544 -3605 1563 -4480 -13141 -7956 1310
10246A310J509m79L227m732r29L432J879r04l314o946M814J0346k213L092k861
10231G231m044J961m5P65J295l442j247n783m507K508K34L173j358M197Q035n380
10215C593l810j450N97k016l30o763o173N25J1163O735n690m863K1k694J121J560
10199h474N93L738P04L031Q60l050p950j004O654P351o07j830m350j225p143k417
10183a5119J531N883M796J488P625l371j1303J284R411O437n408J271k968J284
10169B841L527O059K708K092O718N187j423j687p771r019n111k296o683k162L758
10154c262l958p04o971K587m692N437Q34m521J803K574k429P224P408k239m128
10139e037M418N049m31r532k624P96o509J89J92K664j412l808P249N972N742O161
$$ plain form
10246 1310 2819 2340 5567 835 -94 3338 5217 4313 999 -5947 -1133 9213 7000 10092 7231
10231 7231 3187 5148 5103 5868 7163 3721 2474 -3309 -7816 -5308 -5074 -1901 -3259 938 8973 3593
10215 3593 -217 -1667 -1070 -3086 -3416 -10179 -16352 -15827 -4664 2071 -3619 -8482 -8461 -11155 -10034 -8474
10199 -8474 -7881 -4143 -3439 -408 452 -2598 -10548 -11552 -4898 2453 1846 16 -4334 -5559 -12702 -15119
10183 -15119 -13588 -7705 -2909 -1421 6204 2833 -8470 -7186 2225 8662 3254 4525 1557 2841
10169 2841 6368 12427 15135 17227 23945 29132 27709 26022 18251 9232 4121 1825 -4858 -7020 -3262
10154 -3262 -7220 -7924 -14895 -12308 -17000 -11563 -10729 -15250 -13447 -10873 -13302 -6078 1330 -909 -5037
10139 -5037 -619 4430 3999 -5533 -8157 -7361 -13870 -13681 -13489 -10825 -12237 -16045 -8796 -2824 2918 9079
10123I079J2612J5244N327J1374N400o948j1090j1747r770m414o572q860n766
10110f131R1O45l424L179L409M47O361j662Q83j784n532k854J648L007l312R015
10094C986K681k140j5787j0512P684M433J0387L931m489l791N157M871N286l582
10080H115n423m332p78J077j631q056r18L804j149L985M884J058p376m547L329
10065g958K747l511P18j320l068J552j850K854o91O667k532p23L514M271L723
10050D393J191m765N37M420o685l445O414n894p415M32P370P287K223P00l116
10035C647o134n820M661K331Q45m82k27K670K181m770l247p726J196P489j930
10020e316k960L650K200j542q40j013M193K382r035l355p90J860K346Q376Q926
$$ plain form
10123 9079 21691 36935 42262 53636 59036 52088 40998 29251 19481 15067 8495 -365 -6131
10110 -6131 -6040 -5395 -8819 -5640 -2231 -1784 4577 2915 3798 2014 -3518 -6372 -4724 -1717 -5029 3986
10094 3986 6667 4527 -11260 -21772 -14088 -9655 732 4663 174 -3617 1540 6411 11697 8115
10080 8115 2692 -1640 -2418 -1341 -2972 -11028 -11946 -8142 -9291 -5306 -422 636 -6740 -11287 -7958
10065 -7958 -5211 -8722 -8004 -9324 -12392 -10840 -12690 -9836 -10527 -3860 -6392 -7115 -3601 670 4393
10050 4393 5584 819 1356 5776 -909 -4354 2060 -3834 -11249 -10817 -3447 3840 6063 6763 3647
10035 3647 -2487 -8307 -3646 -1315 -470 -952 -1179 1491 3672 -1098 -4345 -12071 -10875 -3386 -5316
10020 -5316 -8276 -4626 -2426 -3968 -4808 -5821 -1628 754 -8281 -11636 -12426 -10566 -8220 156 9082
10005I082l290r83n662m696N163K394l037j559K279J342k465l306k371o9l943
9990a1121K148K794L322k49l97p75n666j74j109k17j73K495j398L70K561m494
9974a2083k157L595P255N2M039k96k172m863N13m184N558l088l581J916l515K081
9958a0930P02M560r160J323N110l9n958k948P410M81r90o816L491O18o84L402
9942a0428O541L110n658q342k86R81j781J167N837J1098O809k882l322k189m63
9927A92P70l133o328K133R342j42l282o080m040L43J635K674O9q30k645m189L046
9910a0465J2906J7011Q111n585j4335r861j269N479M873L432K157o678k62k479
9896C035l458o867n286Q921M66Q01M417K028K571j2n132p615j739j19l19L614
$$ plain form
10005 9082 5792 4809 -853 -5549 -386 2008 -1029 -2588 -309 1033 -1432 -4738 -7109 -7178 -11121
9990 -11121 -8973 -6179 -2857 -3106 -3503 -4278 -9944 -10118 -11227 -11444 -11617 -9122 -10520 -10150 -7589 -12083
9974 -12083 -14240 -10645 -3390 -3338 701 405 -1767 -6630 -6117 -10301 -4743 -7831 -11412 -9496 -13011 -10930
9958 -10930 -10228 -5668 -14828 -13505 -8395 -8434 -14392 -17340 -9930 -9449 -10439 -17255 -13764 -13146 -13830 -10428
9942 -10428 -3887 -777 -6435 -14777 -15063 -14082 -15863 -14696 -8859 2239 9048 6166 2844 655 192
9927 192 962 -2171 -8499 -6366 2976 2834 -448 -6528 -10568 -10225 -8590 -5916 -5847 -6677 -9322 -13511 -10465
9910 -10465 2441 19452 27563 21978 7643 -2218 -3487 1992 6865 10297 12454 5776 5514 3035
9896 3035 -423 -7290 -12576 -3655 -3189 -2388 2029 4057 6628 6616 1484 -6131 -7870 -7989 -8308 -4694
9880d694L075L789L36K064k034l754L140l09M874L106J199K60m083m202j798J0419
9864A1388P688l704j28m38J76j91j623o480J11Q895q224o665K336R798J27N45
9848A3611K760k085M73L947p455m468P429O073J642K500j066P947K887o620l761
9833B3814L388P667O827J221L043l960r264o981j432m863N17m364j471K564m88
9818A6218O166j212l023N562K929K702M686K580Q433j085n485k618L889P568K170
9803D9480K62K131l10j945M57L469K044M010j943K748k680r231n544L689j812
9788D4825J135l533p247J587O102m76m986l945k409N73N496k964K310q51J190
9773C6807N010K466o52L02p99P89O097O006L800o627m175Q63o199K453K037l425
$$ plain form
9880 -4694 -1619 2170 2506 4570 2536 -1218 1922 1613 6487 9593 10792 11052 6969 2767 969 11388
9864 11388 19076 15372 15244 14806 14982 14791 13168 6688 6799 15694 7470 805 3141 12939 13066 13611
9848 13611 16371 14286 14759 18706 11251 6783 14212 20285 21927 24427 23361 31308 34195 27575 23814
9833 23814 27202 34869 41696 42917 45960 42000 32736 25755 24323 19460 19977 15613 14142 16706 16218
9818 16218 22384 21172 18149 23711 26640 29342 34028 36608 45041 43956 38471 35853 39742 47310 49480
9803 49480 49742 51873 51563 49618 50075 53544 55588 59598 57655 60403 57723 48492 42948 46637 44825
9788 44825 45960 42427 35180 36767 42869 42393 37407 33462 31053 31626 37122 34158 36468 35617 36807
9773 36807 41817 44283 43631 43933 43134 43923 50020 56026 59826 53199 49024 49887 43688 46141 48178 44753
9757D4753l858j0256p39N787j670j792k63K726j959m151j91L542o175k786j079
9742B1889m054j22N389J058J355J878O441o291k663J141j292l561q48J132M586
9727B6038J316k020n629L87Q5J615j959o019M279L309j30m506p275P38O087K300
9711A8616K803K380N554Q09j2403j0480L254k18j50n62L360l213m413l187J123
9696C273J620l820o805J296N456K829j890J458J605l996L38P442L599o437l539
9681B429L449j830m180L160J58L927j87l117L21M964M204j175n056l460J260K728
9665G595R1l707l334k48P64K75M196J034J605k535m25o645l584K203j078K654
9649a139R92N423K94N74J112n57k486M854M920j159r608K599K520j954n02R39
$$ plain form
9757 44753 40895 30639 29900 35687 34017 32225 31962 34688 32729 28578 28387 31929 25754 22968 21889
9742 21889 17835 17713 23102 24160 25515 27393 33834 27543 24880 26021 24729 21168 20320 21452 26038
9727 26038 27354 25334 19705 20092 20177 21792 19833 13814 18093 21402 21272 16766 9491 10229 16316 18616
9711 18616 21419 23799 29353 30162 17759 7279 10533 10315 10165 9603 12963 9750 5337 2150 3273
9696 3273 4893 1073 -5732 -4436 1020 3849 1959 3417 5022 1026 1364 8806 12405 5968 2429
9681 2429 5878 4048 -132 3028 3186 7113 6926 3809 4130 9094 13298 12123 7067 3607 4867 7595
9665 7595 7686 3979 645 397 1161 1436 5632 6666 8271 5736 5311 -1334 -4918 -2715 -3793 -1139
9649 -1139 -147 5276 5570 6144 7256 6699 4213 9067 13987 12828 3220 5819 8339 6385 5883 6822
9633F822O15M327K556k920n541j288N51k196m57O048Q382K959M026R58o000q523
9617A0319j448N470K066L303J456j061l342k122J961q005J488N264L227K503J067
9602B2146o298k719R69p172m012J041P659Q414n334q367O093K445k40j583J989
9587A5031L011L583r09n229J55N92P32M686L579L48L637L664P037p816m300k19
9571B7582k951k940k250J693K972P867K814L724m769p650K064R239Q005L121l259
9556D5262J922L238k533o928m231q430O361M434q14J0856M605J0031k19k679K730
9541F3605R44l104m871P61O03J248N844n9K270L439N265O424M461K241O102R519
9525A04692P551M041L035N319M181M597Q711P927N737Q105R877O196N879O993
$$ plain form
9633 6822 7437 11764 14320 11400 5859 4571 5122 2926 2469 8517 16899 19858 23884 24842 18842 10319
9617 10319 8871 14341 16407 19710 21166 20105 16763 14641 16602 8597 10085 15349 18576 21079 22146
9602 22146 15848 13129 14098 6926 2914 3955 11614 20028 14694 6327 12420 14865 14625 13042 15031
9587 15031 18042 21625 20716 15487 15642 16234 16966 21652 25231 25579 29216 32880 39917 32101 27801 27582
9571 27582 24631 21691 19441 21134 24106 31973 34787 38511 33742 26092 28156 37395 45400 48521 45262
9556 45262 47184 50422 47889 40961 36730 28300 34661 39095 38281 49137 53742 63773 63554 60875 63605
9541 63605 64549 61445 56574 57335 57938 59186 65030 64971 67241 70680 75945 82369 86830 89071 95173 104692
9525 104692 112243 116284 119319 124638 128819 133416 142127 150054 155791 163896 173773 179969 185848 192841
9511A92841J2650Q220O034J4706J2315R156J7803K3550K5544J3955J3758K8071
9499C78603K4860K5633L2062L8666L5942L5745M2031L9837M6475M9644M7520N0728
9487H47746M9118M9873M5361M1727L3304K9977K7348J7372O106n56j7152k1378
9475A108846l2599l5656l5597m6654m7724n0770m5362m4235m1914m3022l4504
9464F50809l9207l7407l8718l4619l8710l9653k0729j7426k1109j4781j9855k1206
9452C07389j4437j5175j6114k0475j7470j1198j1877m15o587j3658j1524p330
9440A61129j0367n142r048j3142p470m130L924j803j0430n384j219p229n930l637
9426H0122j19o136j937J253J415k132M65o448q054J454O320N573n088q044k842
$$ plain form
9511 192841 205491 213711 219745 234451 246766 255922 273725 297275 322819 336774 350532 378603
9499 378603 403463 429096 461158 499824 535766 571511 613542 653379 699854 749498 797018 847746
9487 847746 896864 946737 992098 1033825 1067129 1097106 1124454 1141826 1147932 1147376 1130224 1108846
9475 1108846 1076247 1040591 1004994 958340 910616 859846 814484 770249 728335 685313 650809
9464 650809 611602 574195 535477 500858 462148 422495 401766 384340 363231 348450 328595 307389
9452 307389 292952 277777 261663 241188 223718 212520 200643 200228 193641 179983 168459 161129
9440 161129 150762 145620 136572 123430 115960 111830 115754 113951 103521 98137 96918 89689 83759 80122
9426 80122 80003 73867 71930 73183 74598 72466 72931 66483 58429 59883 66203 71776 66688 58644 55802
9411E5802o663M424K336R1M093N74j203j1413l336j231P41j005q529L957K845
9396D1483Q7m982q155k536l87O703L84K379k692j1234m079J522N871l243k077
9381A9044n50n631L372P114j176O379K553m112m689m096O391N472k829m691n925
9366A6626J03l911j873N707j193l416n235q24L680M862j449O35J456k541k232
9351A0395k656J539L423Q128k653j468J293m360m662j897O277K890m362m460M822
9336A2249l854q176J033N345J0024O4l530o299j757O197Q1N61j136n096j077J796
9320F425K78n86J217Q607O901m916r798q485q323J1634O166j89m865m95q763m745
9304i937R053N866N129O806J955j513M004J420m065r220n222J4273J717l429k328
$$ plain form
9411 55802 49139 53563 55899 55990 60083 60657 59454 48041 44705 43474 44215 43210 34681 38638 41483
9396 41483 41570 36588 28433 25897 25510 32213 32597 34976 32284 21050 16971 18493 24364 21121 19044
9381 19044 18494 12863 16235 23349 22173 28552 31105 26993 22304 18208 24599 30071 27242 22551 16626
9366 16626 16729 12818 10945 16652 15459 12043 6808 5984 9664 14526 13077 13712 15168 12627 10395
9351 10395 7739 9278 12701 20829 18176 16708 18001 13641 8979 7082 13359 16249 11887 7427 12249
9336 12249 8395 219 1252 6597 16621 16685 13155 6856 5099 11296 11377 11938 10802 5706 4629 6425
9320 6425 6703 6117 7334 15941 22842 17926 8128 -357 -8680 2954 9120 8931 4066 3571 -5192 -9937
9304 -9937 -884 4982 10111 16917 18872 17359 21363 22783 18718 9498 4276 18549 20266 16837 14509
9289A4509j479L368k775j0272L97Q817M797K157k801p94j639k384m112k051L325
9274I063O250N95o599m988o374J488N804J1070J0336K287m062J331j826k815l252
9259A8308m76K304K730J558M167r40o137m763P545L656K080M125n08K650p76k650
9243C2873l595m398M95K533N16J232K396j220J541j926l652k053K808k140o305
9228A9105j151K143K167J740K391k068k007O997l60k754r13k353o764K965O217
9213B5355M654M474L862l107o326q78L2k115P467m958J419L039j756r98m980m902
9197B0282K362P377J354k915n501K05j223o703O854j5p88J482l982l852n458K237
9181A1716N66K64L982j481k802J92M107J2312M414m833q32K026K433L590k439
$$ plain form
9289 14509 13030 16398 13623 3351 3748 12565 17362 19519 16718 15924 14285 11901 7789 5738 9063
9274 9063 15313 15908 9309 4321 -2053 -565 5239 16309 26645 28932 24870 26201 24375 21560 18308
9259 18308 17832 20136 22866 24424 28591 27651 21514 16751 24296 27952 30032 34157 33649 36299 35523 32873
9243 32873 29278 24880 25375 27908 28424 29656 32052 30832 32373 30447 26795 24742 27550 25410 19105
9228 19105 17954 20097 22264 24004 26395 24327 22320 29317 28957 26203 25290 22937 16173 19138 25355
9213 25355 30009 34483 38345 35238 28912 28034 28066 25951 33418 28460 29879 32918 31162 30164 25184 20282
9197 20282 22644 30021 31375 28460 22959 23164 21941 15238 22092 22077 21289 22771 18789 14937 9479 11716
9181 11716 12282 12546 16528 15047 12245 12437 16544 28856 33270 28437 27605 29631 32064 35654 33215
9166C3215j1472p529Q05N139N343Q195J0984M533k316n061o118j520l462O768
9152C7504p31n272n682J066L162J986K710m985j0085J031J149q28J119O9k003
9137B0210k489k59K906o592J446k848k342k70K115j459J715N145j154r684n019
9122A421K674M061J071N225N344P174L812j952j182l433L437J614p385l170L892
9107B2603N845j073m889r825o849J772K367M440m96m460k888Q239J0835o634j0708
9092H279j06J708K298M837j539o319Q7N792P32J497P123l526j839o739k138N056
9076A5203L417J052J099q88m422k622q84K263J953Q38k660k064M093m354j315
9061A0709q88M422M407k812k530n567k616p87O263O267j460n980n239l366L288
$$ plain form
9166 33215 21743 14214 15019 20158 25501 33696 44680 49213 46897 41836 35718 34198 30736 37504
9152 37504 36773 31501 25819 26885 30047 32033 34743 29758 19673 20704 21853 21025 22144 22213 20210
9137 20210 17721 17462 20368 13776 15222 12374 10032 9762 11877 10418 12133 17278 16124 6440 1421
9122 1421 4095 8156 9227 14452 19796 26970 30782 28830 27648 24215 27652 29266 21881 18711 22603
9107 22603 28448 27375 22486 12661 5812 7584 9951 14391 13895 9435 6547 14786 25621 18987 8279
9092 8279 8173 9881 12179 17016 15477 9158 9245 15037 15769 17266 24389 20863 19024 12285 10147 15203
9076 15203 18620 19672 20771 19883 15461 12839 11955 14218 16171 17009 14349 12285 16378 12024 10709
9061 10709 9821 14243 18650 15838 13308 7741 5125 4338 10601 16868 15408 9428 4189 823 4111
9046D111M043m528k70K128m734k199O9K659J21M561M265p54r179K295j631K559
9030C516K773O189j938r437m595M793L347J825J822m38o540j145m737K599P769
9015E803L264k955K403O088k091J586L127J818o920m248L036K9n455P813N103
9000A8401k348r252L979L706l782j853j157n713q73O030K919k39o218k840J163
8985A923m594M90R96P624J937m15n679L769l29J83j175j563K227J686j404k267
8969C409k231k850O14L700J992j436K900m216l143P796j872K243q89O67O538L640
8953A6862j301k920m244k141L710m722L774M697Q70q375r247k075J52L609m560
8938e911j314l5N739O445O490j126j152l043k564L655q409M680Q121N039r382
$$ plain form
9046 4111 8154 3626 3356 5484 750 -1449 -1380 1279 1400 5961 10226 9472 293 2588 957 3516
9030 3516 6289 12478 10540 1103 -3492 1301 4648 6473 8295 7857 1317 172 -4565 -1966 5803
9015 5803 9067 6112 8515 14603 12512 14098 17225 19043 12123 7875 10911 10940 5485 13298 18401
9000 18401 16053 6801 10780 14486 10704 8851 7694 1981 1108 7138 10057 9818 3600 760 1923
8985 1923 -2671 -2181 -1185 6439 8376 7961 2282 6051 5722 5905 4730 3167 5394 7080 5676 3409
8969 3409 1178 -1672 -1058 2642 4634 3198 6098 1882 -1261 6535 4663 6906 6017 6684 13222 16862
8953 16862 15561 12641 8397 6256 9966 5244 9018 13715 14585 6210 -3037 -5112 -4960 -1351 -5911
8938 -5911 -7225 -7260 -1521 4924 11414 10288 9136 6093 3529 7184 -1225 3455 11576 16615 7233
8923G233m821N262l46j298N707k258l667l432j786O07n810J883N719M746K885
8908A0624j869j60m80k121J882M731n557q03j539j649M463M265l121k362L679
8893I983m294o69O923j32p906k55M918o064j966N008N947j891k775k953Q84K910
8877G668o577k087M774N433L232k336m617L207J16K081k11P12L06l48k503k636
8861F214R424L039j501r660l397N656N031M948L578p9n903n021R01k710N509M055
8845B0084M43K416J487K757j036p716k070o409o235Q65k348L469M549N125K11
8830A5592M30K909m898j0439l540N717P830M086l010N916L860l072J075P82M134
8815B7372l718j294L408m969l264m557K703J129O842Q458j598o777K417R55k914
$$ plain form
8923 7233 2412 7674 7328 6030 11737 9479 5812 2380 594 1201 -4609 -2726 2993 7739 10624
8908 10624 8755 8595 8115 5994 7876 12607 7050 6247 4708 3059 7522 11787 8666 6304 9983
8893 9983 5689 5020 11943 11811 3905 3650 8568 2504 538 5546 11493 9602 6827 3874 4758 7668
8877 7668 1091 -996 3778 9211 12443 10107 5490 8697 8813 10894 10683 11395 11701 11353 8850 6214
8861 6214 15638 18677 17176 7516 4119 9775 14806 19754 23332 23253 17350 12329 13230 10520 16029 20084
8845 20084 20527 22943 24430 27187 26151 18435 16365 9956 3721 4586 2238 5707 10256 15381 15592
8830 15592 16022 18931 14033 3594 54 5771 13601 17687 14677 20593 24453 21381 22456 23238 27372
8815 27372 23654 22360 25768 20799 17535 12978 15681 16810 23652 32110 30512 23735 26152 27107 24193
8800B4193j854K384q93j139p019k454L159K743l013j211J854P716N433j693K518
8785C0724j363l687j692l681L239N207J470j142L6P73O896O194j774K820j039
8770D2981k0P9n833L415J967k062m505J1264M319j272l588k68r65J103k21j858
8754D4536M850O35R51L402J021O239Q641L045m30l434r75l035r07L93O054J576
8738G2562l287K689L531l409p156j316K351J175K061K841p07l048J0947R808l177
8723H5865j349n445k165J955P194m490P01N466P104N628k062M76O384L912m960
8708A04214l726M713j342n23N878j875m393N499O90P510M868K209K185M534K033
8693A32474J956L477M775N158L099k5m00K707k990P54M044q20m299J768O877r03
$$ plain form
8800 24193 22339 24723 23830 22691 15672 13218 16377 19120 16107 14896 16750 24466 29899 28206 30724
8785 30724 29361 25674 23982 20301 23540 28747 30217 29075 29111 29884 36780 42974 41200 44020 42981
8770 42981 42961 43040 37207 40622 42589 40527 36022 47286 51605 50333 46745 46477 45512 46615 46394 44536
8754 44536 49386 50021 50972 54374 55395 61634 70275 73320 72890 69456 68481 65446 64539 64932 70986 72562
8738 72562 69275 71964 75495 72086 64930 63614 65965 67140 69201 72042 71335 68287 79234 89042 85865
8723 85865 84516 79071 76906 78861 86055 81565 82266 87732 94836 100464 98402 98878 105262 109174 104214
8708 104214 100488 105201 103859 103336 109214 107339 102946 108445 109135 116645 121513 123722 125907 130441 132474
8693 132474 134430 137907 142682 147840 150939 150914 150514 153221 150231 150985 155029 154209 149910 151678 158555 157652
8677A57652L904m04J318q07N378Q806N438o43m37N640M917O133O045N605K261
8662B10806O337k774O83M734l24j798q50m82K275N901j167J952N299R856J2385
8647B52833M141L409l322L20n226K706O770P226J3553J1038J3378K5331K2875
8634C55032P691j5810n857M226l546l284J934k089k538L504k286L441N706O238
8620C52362Q644R584Q300J4886J4976J6665J7603K3042J5360K2902J4484J9042
8608E37850K3875J7913J9307K1746J4407K2248J9550J7633K0272J9201J5143J7838
8596G66983K0439J4950K3568K6817L2269N3282O4609M2419J2860J7901L7155L9835
8584A153087L0378R761k5428p9596j12590j18280j21596j02062q1853o8278n6502
$$ plain form
8677 157652 161556 161152 162470 161663 167041 175847 181285 180642 180205 185845 190762 196895 202940 208545 210806
8662 210806 217143 214369 215052 219786 219462 217664 216814 216332 218607 224508 223341 225293 230592 240448 252833
8647 252833 256974 260383 257061 257381 252155 254861 261631 268857 282410 293448 306826 332157 355032
8634 355032 362723 346913 341056 345282 341736 338452 340386 338297 335759 339263 336977 340418 346124 352362
8620 352362 361006 370590 378890 393776 408752 425417 443020 466062 481422 504324 518808 537850
8608 537850 561725 579638 598945 620691 635098 657346 676896 694529 714801 734002 749145 766983
8596 766983 787422 802372 825940 852757 885026 938308 1002917 1045336 1058196 1076097 1113252 1153087
8584 1153087 1183465 1193226 1167798 1088202 975612 857332 735736 633674 551821 483543 427041
8573D27041n9405m0968l4364k5612k3160l0332k0902j3648j2625j0614j1507n582
8561A38322m156n791j0238j6113p702j0768m105J56K377j01P24o217L049k45O863
8546H6055J4965J7783L070r338q891j4603j3215m5m328k865k181n919j2282l712
8532D4494o22k431j716K976o570M13M382O555r51n817J110J437q46j2836j434
8517B8144J1150n118j1407o588j361n47P032N209K506l488M76L705J866q56n284
8502B5439l031m744J138O466J952j950j631J400k042o02j257k915L126L149J626
8487B6124r371n092m306l312L749o44K585p49J193K263J096l685P817Q828l642
8472B2854L49j345o813o334M22N078J424P360o563l201K742R58J476m213k545
$$ plain form
8573 427041 367636 326668 292304 266692 243532 213200 192298 178650 166025 155411 143904 138322
8561 138322 134166 128375 118137 102024 94322 83554 79449 79605 81982 81881 82605 76388 79437 79192 86055
8546 86055 101020 118803 121873 112535 103644 89041 75826 75781 71453 68588 66407 60488 48206 44494
8532 44494 43872 41441 39725 42701 36131 36544 40926 47481 46530 40713 41823 43260 42414 29578 28144
8517 28144 39294 34176 22769 16181 14820 14273 21305 26514 29020 25532 26008 29713 31579 30723 25439
8502 25439 22408 17664 18802 25268 27220 25270 23639 25039 22997 22395 21138 18223 21349 24498 26124
8487 26124 16753 11661 7355 4043 7792 7148 9733 8984 10177 12440 13536 9851 17668 26496 22854
8472 22854 23203 21858 15045 8711 9133 14211 15635 22995 16432 13231 15973 16931 18407 14194 11649
8457A1649k548k809K946l322M127P336m60m09L057m954l524Q60J751p41m095k319
8441F545j476J077N207L023k079k386r53M159j946k08j162n62j392K647j245J709
8425A0958k88j087O021O836o715r072M12j104L352k984n029L313K122q087j358
8410b710P354R352J272k626j0563P93Q79J380K408k830m497k9P463M461n540k556
8394D011L281J578k059m336N897l95J733K574P9K30n203L827J579n914l358o314
8378b790P401O483j802r10l293N124N824M866k56q446j262K262k35K12o821n754
8362F03r094R35N204m09L023j814L470J40J234j601P99L273K133j659m832N98
8346B003n179j118M250M642q832m141M497m96L448j012O709M54J397n575r91J839
$$ plain form
8457 11649 9101 6292 9238 5916 10043 17379 16919 16510 19567 14613 11089 11949 13700 12959 8864 6545
8441 6545 5069 6146 11353 14376 12297 9911 8958 13117 11171 10963 9801 9239 7847 10494 9249 10958
8425 10958 10670 9583 15604 22440 15725 6653 7065 5961 9313 6329 1300 4613 6735 -1352 -2710
8410 -2710 4644 13996 15268 12642 2079 2872 3751 5131 7539 4709 212 183 7646 12107 6567 4011
8394 4011 7292 8870 6811 2475 8372 7977 9710 12284 12363 12593 7390 11217 12796 6882 3524 -2790
8378 -2790 4611 11094 9292 8382 5089 10213 16037 20903 20647 12201 10939 13201 12966 13178 6357 603
8362 603 -8491 -7556 -2352 -2761 262 -1552 1918 2058 3292 1691 2490 5763 7896 6237 1405 2003
8346 2003 -3176 -4294 -44 4598 -4234 -8375 -3878 -4374 -926 -1938 4771 5225 6622 1047 56 1895
8330A895j32k805k709k006L078O615N425k482j661P416J198n174j75J937q16k056
8314G548k697l288J705L829j17j347L40K582o882q226J373P553M753r37l091J643
8298D741P27K747j285j111M68J671J26j53N591L562k548q18n80q666r58J031l499
8281A046k427K405K454n283m080r21q70P217J0638N05P5l049k088n91j966O811
8265I876P457j101q419n489n217J457P205k470o599l922O336L149J590l31J521
8250E043l959m946n590N341O406Q88k08L231P96L076k556o611M433N735j988p824
8234A267k174M025Q027n946N190L846Q89o07o960k906m210n479Q253M262o637
8219H40P2J947R33Q195K284m301p976K883N422J149m433j282o787M45k712k696
$$ plain form
8330 1895 1763 -1042 -3751 -5757 -2679 3936 9361 6879 5218 12634 13832 8658 8483 10420 9604 7548
8314 7548 4851 1563 3268 7097 6980 5633 5973 8555 1673 -6553 -5180 2373 7126 6189 3098 4741
8298 4741 5468 8215 6930 5819 6287 7958 8084 7931 13522 17084 14536 13718 13138 4472 3514 4545 1046
8281 1046 -1381 1024 3478 -1805 -5885 -6806 -7676 -459 10179 10684 10759 7710 5622 5031 3065 9876
8265 9876 17333 16232 7813 2324 -2893 -1436 5769 3299 -3300 -7222 -886 2263 3853 3522 5043
8250 5043 1084 -3862 -9452 -4111 2295 3183 2975 6206 7002 10078 7522 911 5344 11079 9091 1267
8234 1267 -907 3118 11145 5199 10389 14235 15124 14517 7557 4651 441 -5038 3215 7477 840
8219 840 912 2859 3792 11987 14271 9970 1994 4877 10299 11448 7015 5733 -1054 -609 -3321 -6017
8203f017L653k08j19O960R556j789L623j835m426l078k645k914k238P04J331J496
8187B054J359j244K017j20J181J495n121m24L401M103j521o627j375L654j902
8172I30J034L483J552Q37l506J246L110q5q463n975M039j68J80L225m274m063
8156f898m294n82P363P495Q293n174n066m53k128P04L535M248k27n233k199m95
8140a111L692m62k696n280J127K997n99q78J779J0421j263n642l177l358k535
8125f985L367L829N043M373q573p145L051R38l482L042o93n29R135O175J081k442
8109A0185M554L068p785j763J2379O19j620k769N34k650M508l478j073q304P79
8094G184j600m822K332K248J909J415L01R89m558Q56O993J274l382m01J643M2
$$ plain form
8203 -6017 -2364 -2572 -2691 4269 13825 12036 15659 13824 9398 6320 3675 761 -1477 -773 558 2054
8187 2054 3413 2169 4186 4066 5247 6742 1621 1197 4598 8701 7180 553 -822 2832 930
8172 930 1964 5447 6999 7836 4330 5576 8686 8601 138 -5837 -1798 -1966 -1786 1439 -2835 -6898
8156 -6898 -11192 -11774 -4411 3084 11377 6203 1137 684 -1444 -740 2795 7043 6816 1583 -616 -1111
8140 -1111 2581 2119 -577 -5857 -4730 -1733 -2332 -3210 -1431 8990 7727 2085 -1092 -4450 -6985
8125 -6985 -3618 211 5254 9627 1054 -6091 -3040 -2102 -5584 -2542 -3235 -3764 5371 11546 12627 10185
8109 10185 14739 17807 10022 8259 20638 21257 19637 16868 17402 14752 19260 15782 14709 6405 7184
8094 7184 5584 762 3094 5342 7251 8666 8967 9956 5398 6254 13247 14521 11139 10738 12381 12423
8078A2423p27k371o22j509n07m033j211K821L335L790J817m245m04J380MN655
8062A5596j24m030k97N269Q629Q822N949K212j689o524n291q988o113J840L798
8047A9059L774Q68m531L638K644N411Q686L297p40L940P489L641J914L001M680
8032F6771N080L156J1528m520j655L259K451l12m905o625m080q376K429J0809
8018G5010j525o593l452L33N502n985J759P676J443L048R83m1J951n070p42m395
8002F9902k32P754k346l364N468J1315J3395R036J5101K9809K9777L7563L2201
7989B55379O320j9598l5240l8191k5984j9141j4587r241l783n901r076r207j4221
7976E7529L88M878k548l965k165J543o82m172l531M810q76P44L647j288m93R109
$$ plain form
8078 12423 11696 9325 8703 7194 6687 2654 1443 4264 7599 11389 13206 8961 8557 9937 9941 15596
8062 15596 15472 11442 11145 16414 25043 33865 39814 42026 40337 33813 28522 19534 13421 15261 19059
8047 19059 22833 23701 19170 22808 25452 30863 39549 42846 42106 46046 53535 57176 59090 62091 66771
8032 66771 71851 75007 86535 82015 80360 83619 86070 85758 80853 74228 70148 61772 64201 75010
8018 75010 73485 66892 63440 63773 69275 63290 65049 72725 74168 77216 78199 78158 80109 75039 74297 69902
8002 69902 69670 77424 75078 71714 77182 88497 101892 110928 126029 155838 185615 223178 255379
7989 255379 261699 242101 206861 168670 142686 123545 108958 99717 95934 90033 80957 71750 57529
7976 57529 57917 62795 60247 56282 54117 55660 54978 50806 47275 52085 51209 51953 55600 54312 53819 62928
7960F2928J0512p497o585L12M922J2764L897M325K702j123M914J6816J0049M864
7946A23800P110k475p937j0809r151r727m492l459j0194n686r725m064j712m581
7932D6898j854k389n450n92o34j831p96N997k585j856J715M289n968n971l348
7917B5625J134K000J036l77Q717J304K665j362l294l89K900L434l062N063N437
7902E0831m38j1959j7408J463M568M07K77J950j186m790N74j753k469n806o44
7887A3617p52J892O084M03k963n45p622l509o014J594R65M15j690n616K92M448
7871I99J0704j014k565k401j645j161O7O859P164L195p037N71m436k307M85j152
7855F326n21r184J562N543K969j328k434m657K997M532k875o826m707K859M11
$$ plain form
7960 62928 73440 65943 59358 59670 64592 77356 81253 85578 88280 87157 92071 108887 118936 123800
7946 123800 130910 128435 120498 109689 100538 90811 86319 82860 72666 66980 57255 53191 51479 46898
7932 46898 45044 42655 37205 36613 35979 34148 33352 39349 36764 34908 36623 40912 34944 28973 25625
7917 25625 26759 28759 29795 29418 38135 39439 42104 40742 37448 37059 39959 43393 40331 45394 50831
7902 50831 50393 38434 21026 22489 27057 27464 27741 29691 28505 23715 24289 22536 20067 14261 13617
7887 13617 12865 14757 20841 21244 18281 17736 10114 6605 591 2185 3150 3565 1875 -3741 -3449 999
7871 999 11703 10689 8124 5723 4078 2917 2984 9843 17007 20202 13165 13736 9300 6993 7478 6326
7855 6326 5805 -3379 -1817 3726 6695 5367 2933 -1724 1273 5805 2930 -3896 -8603 -5744 -5333
7840e333K89N928j881k691l489O092J227l995L066J549q1O540M385l907p800k253
7824b354m723k615J154j58r136Q90Q753N747P183k915m80M192k487J110j510j0432
7808g781J113L293K636k738n21N047k103m515N888N49o585k435j008m834M451
7793i543P94K772M303K821j273L661m02k002n442j0436j825J1624J198q298m132
7778a6180K97J549J018K453O89K207N817R71k061l608Q416K846n001q095K754
7763e928l872n221P362K756n69L334R18m876L368M253J622M168J71M49j785m855
7747A295n125N773j776K20K451j234k383K75P807N850m41l202l528R54J675k612
7731E999p175r778n939Q548P598J547j048l825o922l33j614J3923K599J186M397
$$ plain form
7840 -5333 -5044 884 -997 -3688 -7177 -1085 142 -3853 -787 762 681 7221 11606 7699 -101 -2354
7824 -2354 -7077 -9692 -8538 -8696 -17832 -16942 -8189 -2442 4741 1826 1346 5538 3051 4161 2651 -7781
7808 -7781 -6668 -3375 -739 -3477 -3998 1049 -1054 -5569 319 868 -5717 -8152 -9160 -13994 -9543
7793 -9543 -8749 -5977 -1674 1147 -126 3535 3133 1131 -4311 -14747 -16572 -4948 -3750 -12048 -16180
7778 -16180 -15883 -14334 -13316 -10863 -10174 -7967 -2150 -1179 -3240 -6848 1568 4414 -587 -8682 -5928
7763 -5928 -9800 -15021 -7659 -4903 -5472 -2138 -1220 -6096 -2728 1525 3147 7315 7486 7935 6150 1295
7747 1295 -3830 1943 167 387 2838 1604 -779 -504 7303 13153 12712 9510 5982 6936 8611 5999
7731 5999 -1176 -10954 -16893 -8345 -747 800 -248 -4073 -10995 -11328 -12942 981 3580 4766 9163
7716I163L076r216L23Q14l182M043J771o180k106m489K405L445k281k761O394
7701A219L232o380O4K960N36k255k167Q08p47l31o566n659L864R368k23j475j410
7684e162k08J757K431L527L394J521n628m008M982J19l069Lj243M185J527J370
7668E498K210o497p267l773L854Q469N491M520p013n700L904O04j861p28l611
7653a900m306L929k545l516p87P80L728M690L378j740j1841M076P280j43O81p095
7637e331J045L285l91k343k258j251j44k867J764J544M157O247k262q971N282
7622b494N561L54l960k743o99j422m830J877K385l130J95M771M520L246M613n286
7606B958n572j061o792j549M92k94k428M808K585J344k361k076K619M890L405
$$ plain form
7716 9163 12239 3023 3346 4160 978 5021 6792 612 -1494 -5983 -3578 -133 -2414 -5175 1219
7701 1219 4451 -1929 -1865 1095 1631 -624 -2791 -1983 -2730 -3061 -9627 -15286 -11422 -2054 -2277 -3752 -5162
7684 -5162 -5370 -3613 -1182 2345 5739 7260 1632 -2376 2606 2725 -344 -341 -1584 2601 4128 5498
7668 5498 7708 1211 -6056 -9829 -5975 2494 7985 12505 5492 -208 3696 4300 2439 1711 -1900
7653 -1900 -6206 -2277 -4822 -8338 -9125 -8345 -4617 73 3451 1711 -10130 -6054 1226 1083 1764 -5331
7637 -5331 -4286 -1001 -1392 -3735 -5993 -7244 -7388 -10255 -8491 -6947 -2790 3457 1195 -7776 -2494
7622 -2494 3067 3421 -539 -3282 -3981 -5403 -10233 -8356 -5971 -9101 -8906 -4135 385 3631 8244 2958
7606 2958 -2614 -3675 -10467 -12016 -11524 -11818 -14246 -9438 -6853 -5509 -7870 -9946 -7327 -2437 968
7591I68N885o377m664j442K094L996N903J89r031l817m544L752m76J1382N83k879
7575A522K223J517L24j218J367p009q050n724k459J0832P569k570k979N760q47
7560B58k583J269J076j350k427M33m0k282O72N848j468k585k170j1097j0531Q128
7544a8849P820J663j708Q46J26j529L225M169m77J714L30J195j40m788k367q9
7528h859K733J1993N058j3495p155R33J804l427R23R09N93j104M024j729k145
7513h944k879J176M333K182o180k255K036k322P58l141O958O733J74m852k046
7498h269M935N333n873l544J729N116j82m003N375P15n030p644k469L084O344
7483d383J741q427l756o78J777N314K399J994R68J120K359O149j702o473K5J270
$$ plain form
7591 968 6853 476 -4188 -5630 -3536 460 6363 6552 -2479 -6296 -10840 -7088 -7564 3818 4401 1522
7575 1522 3745 5262 5586 4368 5735 -1274 -9324 -15048 -17507 -6675 894 -1676 -4655 1105 258
7560 258 -2325 -1056 20 -1330 -3757 -3324 -3364 -5646 -4974 874 -594 -3179 -5349 -16446 -26977 -18849
7544 -18849 -11029 -9366 -11074 -10228 -10102 -11631 -8406 -4237 -4714 -3000 -2670 -1475 -1615 -6403 -8770 -8859
7528 -8859 -6126 5867 10925 -2570 -9725 -8792 -6988 -10415 -9492 -8583 -7990 -9094 -5070 -6799 -8944
7513 -8944 -11823 -10647 -6314 -4132 -10312 -12567 -10531 -12853 -12095 -15236 -8278 -1545 -1371 -6223 -8269
7498 -8269 -3334 1999 -3874 -7418 -5689 -573 -755 -4758 617 1332 -3698 -11342 -13811 -10727 -4383
7483 -4383 -2642 -11069 -14825 -15503 -13726 -8412 -6013 -4019 -3051 -1931 428 6577 4875 -1598 -1573 -303
7467c03J833K11m047k709j647J768K520o8m384n615m029N577N380R20l345J0940
7451C002J1471n765j2046o1L345J933l050j007j742k934L172K33J14K861n26l50
7435a350J556r367k916O056K836k251k644k912l152L104K022M235L042j079m969
7420g789L4R56L086M253K226J748j030k639l068j325J985l816l338J593L130N914
7404A920L591p247p784M896K573k205N38o95m085k979O368K893j697j183L063
7389b033J152j892k308j754j090L556l775m200M977p54P5J450K008K240N547m08
7373B791m266q322J691J673J643J947p589K590j35o2O198M073m999M613j765m329
7357d248j962K942J492M939J637K078j409l398j814J953k074m147k107n457L567
$$ plain form
7467 -303 1530 1741 -2306 -5015 -6662 -4894 -2374 -2442 -6826 -12441 -16470 -10893 -5513 -4593 -7938 3002
7451 3002 14473 8708 -3338 -3399 -54 1879 -1171 -2178 -3920 -6854 -3682 -3449 -3335 -474 -1000 -1350
7435 -1350 206 -9161 -12077 -6021 -3185 -5436 -8080 -10992 -14144 -11040 -9018 -4783 -1741 -2820 -7789
7420 -7789 -7755 -6799 -3713 540 2766 4514 3484 845 -2223 -3548 -1563 -5379 -8717 -7124 -3994 1920
7404 1920 5511 -1736 -9520 -4624 -2051 -4256 -3718 -4413 -8498 -11477 -5109 -2216 -3913 -5096 -2033
7389 -2033 -881 -2773 -5081 -6835 -7925 -4369 -8144 -12344 -7367 -8121 -8046 -6596 -4588 -2348 3199 2791
7373 2791 -1475 -9797 -8106 -6433 -4790 -2843 -10432 -7842 -7977 -8039 -1841 2232 -2767 1846 81 -4248
7357 -4248 -6210 -3268 -1776 3163 4800 6878 5469 2071 257 2210 136 -4011 -6118 -11575 -8008
7342h008K293o803j846L219K99O180M889l813m474L580L519l016k27K773r65k670
7326e070K271p29j125J007m592n220N246P545K984J976P43K434m002K810Q81k398
7310D761j1990m55P796N430j543o940j133P896k175p84L965J011p214n587m261
7295a1223O789Q855p60l921o675j365K08n687K993K886k217j371l302J144Q567
7280e079N313L255n36l969j835P804l276j1111R74P979O435J537r968l251K443
7265c285P39j377l557m8j276P666L638L49O3k475j757K457j0152l294K546p2J0086
7248B51K418L132j900o570o335k484K213K579n5P58R48J917p109k476O778J323
7232d612o953M751L687j540j942k895P097K301j698J525k934m192J948j05m940
$$ plain form
7342 -8008 -5715 -12518 -14364 -11145 -10846 -4666 223 -3590 -8064 -4484 -965 -3981 -4208 -1435 -2400 -5070
7326 -5070 -2799 -3528 -4653 -3646 -8238 -13458 -8212 -667 2317 4293 5036 7470 3468 6278 7159 4761
7310 4761 -7229 -7684 112 5542 3999 -2941 -4074 3822 1647 863 4828 5839 -1375 -6962 -11223
7295 -11223 -4434 4421 3661 -260 -6935 -8300 -8092 -13779 -10786 -7900 -10117 -11488 -14790 -13646 -5079
7280 -5079 234 3489 2953 -1016 -2851 4953 1677 -9434 -8460 -481 5954 7491 -2477 -5728 -3285
7265 -3285 -2546 -3923 -7480 -7528 -8804 -1138 2500 2849 2912 437 -1320 1137 -9015 -12309 -9763 -9835 251
7248 251 2669 5801 3901 -2669 -9004 -11488 -9275 -6696 -6751 -5993 -5045 -3128 -10237 -12713 -5935 -4612
7232 -4612 -11565 -6814 -3127 -4667 -6609 -9504 -2407 -106 -1804 -279 -3213 -7405 -5457 -5562 -10502
7217a0502j852J0618M282l839j778K957k523j970J771Q692l197N06K633q11r418
7202d431j359M957m117m589o672R89N859O944K969L03l305k975K806L487j805
7187i39l81p111k950O072J498N059k050l762k954K635J99p6J86l02l208n657M117
7170i624O547r27J641j168j009O59P256o03o774N90M540N178J5j354j179p292
7154c504p839l391K150R636M236Q609N303k189j873M157o329j566M183j0616o326
7139e359K740J654K737o049m998Q994j91j965m435L634N379l830k881j094J80
7124e484K248m640q07L780J279j653J753J241L258k12N85j633m084M895L083p244
7108c635M7j450K302l351R3K887L228L899m479n500k778k815J71O74N12K423O052
$$ plain form
7217 -10502 -12354 -1736 2546 -1293 -3071 -114 -2637 -4607 -2836 5856 2659 3165 5798 4987 -4431
7202 -4431 -5790 -833 -4950 -9539 -16211 -15222 -9363 -2419 550 853 -2452 -5427 -2621 866 -939
7187 -939 -1320 -8431 -11381 -5309 -3811 1248 -802 -4564 -7518 -4883 -4684 -4760 -4574 -4876 -8084 -13741 -9624
7170 -9624 -3077 -4004 -2363 -3531 -4540 -3881 3375 2772 -4002 -3412 1128 6306 6321 4967 3788 -3504
7154 -3504 -11343 -14734 -12584 -2948 1288 9897 15200 13011 11138 15295 8966 7400 11583 967 -5359
7139 -5359 -2619 -965 1772 -4277 -9275 -281 -472 -2437 -6872 -3238 2141 -1689 -4570 -5664 -5484
7124 -5484 -3236 -7876 -8683 -4903 -3624 -5277 -3524 -2283 975 763 1348 -285 -4369 526 3609 -3635
7108 -3635 -3588 -5038 -2736 -6087 -5994 -3107 121 4020 -459 -5959 -8737 -11552 -11381 -10707 -10195 -7772 -1720
7091a720L722m176l293J747K272K13P75P498J070n877l892l339K457L628L506
7076D591R64q448L69k321k045J470L424M164M416m875q61J984L080m500o590l199
7060h377J235r29L483P4M119j105k401K44k349K317j994n602M242J2M6K254j023
7043e754L951k322k019N892P44P49J57j974J791l059k699l748K613K402j968r93
7027f237r37K349r48K470L333r32J258K642j717K995J087J845k866m035r61l183
7011c837L903L968k734l38N7l929l932O182q621l413j558j37L796J0920K73Q23
6995A423p454m796o32J944R208m62n637P05L737l233j600J72j532l82l665L08
6979a1896m315M6O469K592k202l496m366O481L958N835j379N064k740o008j795
$$ plain form
7091 -1720 2002 -2174 -5467 -3720 -1448 -1235 -460 7038 8108 2231 -1661 -5000 -2543 1085 4591
7076 4591 5555 -2893 -2524 -4845 -6890 -5420 -1996 2168 6584 1709 848 2832 5912 1412 -5178 -8377
7060 -8377 -7142 -8071 -4588 -4514 -395 -1500 -3901 -3657 -6006 -3689 -5683 -11285 -7043 -7031 -6985 -4731 -5754
7043 -5754 -1803 -4125 -6144 -252 492 1241 1398 -576 1215 -1844 -4543 -8291 -5678 -3276 -5244 -6237
7027 -6237 -7174 -4825 -5773 -3303 30 -902 356 2998 1281 4276 5363 7208 4342 307 -654 -3837
7011 -3837 66 4034 1300 962 1019 -2910 -6842 -660 -9281 -12694 -14252 -14389 -10593 327 600 1423
6995 1423 -6031 -10827 -11459 -9515 -307 -769 -6406 -5701 -1964 -5197 -6797 -6625 -8157 -8539 -12204 -11896
6979 -11896 -16211 -16165 -9696 -7104 -9306 -12802 -17168 -10687 -6729 -894 -2273 2791 51 -5957 -7752
6964g752m266J577Q500n533p349j049R293o89o416k27N338k652L649j704J287
6949g993n62k057k380N876P642K311j2350L47M508M94K20n21q886J851L485j131
6933i146L698K540l119P76J879P73J192k703m517K978N1P75M84N475r427j0987
6917a9278J740Q110m00N218L776L631M377K622m0l009K734M08l104k949m527k892
6901c583m192K272L174o852K04K046p504k702O573M722J913Q127L924L944n711
6886F355j0204L440O884r44o198q671O83K21L925K828j875J968L80k375O655l979
6870i07P204o4o020L477P943m441n709o307k037k608K634J792P38K633J895j169
6854i46J412p005p965N318L088M592o55j988k494J314N000J431J154l824K759
$$ plain form
6964 -7752 -12018 -10441 -1941 -7474 -14823 -15872 -6579 -7268 -13684 -13911 -8573 -11225 -7576 -9280 -7993
6949 -7993 -8555 -10612 -12992 -7116 526 2837 -9513 -9166 -4658 -4164 -3944 -4465 -13351 -11500 -8015 -9146
6933 -9146 -5448 -2908 -6027 -5251 -3372 -2599 -1407 -4110 -8627 -5649 -5598 -4823 -4339 1136 -8291 -19278
6917 -19278 -17538 -9428 -9828 -4610 -834 2797 7174 9796 9756 6747 9481 9889 6785 3836 -691 -3583
6901 -3583 -7775 -5503 -2329 -9181 -8977 -6931 -14435 -17137 -10564 -5842 -3929 4198 8122 12066 6355
6886 6355 -3849 -409 6475 5531 -667 -9338 -8655 -8434 -4509 -1681 -3556 -1588 -1208 -3583 3072 -907
6870 -907 6297 6233 213 3690 11633 7192 1483 -4824 -6861 -9469 -6835 -5043 -4305 -1672 223 -946
6854 -946 466 -6539 -14504 -9186 -6098 -1506 -2161 -4149 -6643 -5329 -329 1102 2256 -1568 1191
6839A191k993r01M189m326J059J136L693j008N7P17J104o519n163Q572J0906J336
6823A3050J900p413j0619j738k278l3j714L468k684l786j180M691P790N370o571
6808a747q788L180j409n67q8J841M207N708O661j812q108P29j028K827Q033M464
6792A4103q277l643K547J384L042l415k674M8j426J25k880k810o836O32k969L067
6776i982K40K204j386k970P912L824L205j226K81m163j64J467L745j265L134j05
6760D751m032k922J695M145l399l477j318j379j838N565p13j291K649J223k238
6745b579k335M149l34j784K609K697o62k622K673l905l120N119O387J439O46j2331
6729c953k914q165m302J985P77N168Q160K248L587K39K321R304J813l065j3034
$$ plain form
6839 1191 -1802 -2703 1486 -2840 -1781 -645 3048 2040 2097 2814 3918 -2601 -7764 808 11714 13050
6823 13050 14950 7537 -3082 -4820 -7098 -7131 -8845 -5377 -8061 -11847 -13027 -8336 -546 4824 -1747
6808 -1747 -10535 -7355 -8764 -9331 -9419 -7578 -3371 2337 8998 7186 -922 -193 -1221 1606 9639 14103
6792 14103 5826 2183 4730 6114 9156 5741 3067 3115 1689 1814 -1066 -3876 -10712 -10080 -13049 -9982
6776 -9982 -9742 -7538 -8924 -11894 -3982 -158 3047 1821 2102 -2061 -2225 -758 2987 1722 4856 4751
6760 4751 719 -2203 -508 3637 238 -3239 -4557 -5936 -7774 -2209 -2922 -4213 -1564 -341 -2579
6745 -2579 -4914 -765 -1099 -2883 -274 2423 1761 -861 1812 -2093 -5213 -94 6293 7732 8378 -3953
6729 -3953 -6867 -15032 -19334 -17349 -16572 -11404 -3244 -996 2591 2830 5151 14455 16268 13203 169
6714A69l862j172J469L643N109l502p272K331O09n8j558R08m271p259l63J232
6698a3847Q150K462L33j995k595l11O899K883J026l247R13n653M999O896k019
6683D894o119p796J9O036K341o49K36J350N844j660j263j82j501k687K976k338
6667d99n593j554Q29l89M404K407K801N961k228k336l255m44j959l688R841J370
6651E668p287p24O25J279M523q11k647l209k304m23J0402J197m248q726o265o494
6635a9444K272N392P785m09l431n01L117N359L136p889j951l51n265k833J904
6620a3109k583N506M632L648O34o714L96K074k9J590J177n095k859N698P758J507
6604D231O207L33k231r010l870p41K34k548l77N791k352m523Q7K726K60p20Q259
$$ plain form
6714 169 -3693 -4865 -3396 247 5356 1854 -5418 -3087 -2478 -2536 -4094 -3186 -7457 -14716 -15079 -13847
6698 -13847 -5697 -3235 -2902 -4897 -7492 -7803 -904 1979 3005 -242 671 -4982 17 6913 4894
6683 4894 -1225 -9021 -9002 -2966 -625 -1274 -1038 312 6156 4496 3233 3051 1550 -1137 1839 -499
6667 -499 -6092 -7646 -6817 -7206 -2802 -395 2406 8367 6139 3803 548 104 -1855 -5543 4298 5668
6651 5668 -1619 -2343 -1718 -439 4084 3273 626 -2583 -4887 -5310 5092 6289 2041 -6685 -12950 -19444
6635 -19444 -17172 -11780 -3995 -4404 -7835 -8336 -5219 140 3276 -4613 -6564 -6915 -12180 -15013 -13109
6620 -13109 -15692 -10186 -5554 -1906 -1272 -7986 -7590 -5516 -5545 -3955 -2778 -7873 -10732 -5034 2724 4231
6604 4231 10438 10771 8540 -470 -4340 -5081 -4847 -7395 -7772 -1981 -4333 -8856 -8769 -6043 -5783 -6503 1756
6587A756N802l459j0857m000M013q91K28L733Q61j936o277N568k140k468L806
6572f261L685L829K520J76q535l855O64k180P78M721M213K694l032m330k172N998
6556a087L01k861p329Q24N452L307K20j484M559J661q019p273M301K678k01k201
6540g152q0j061L853J0233M248p170Q93L82O90j380l579l030j627j438J806n124
6524i536o759M832O409M407O85k288k222m812p593k56K604O910J1432M200j527
6509F486p263k70j003O67K139n103o268J816Q300m478J589L928J278M71O66j160
6493A795k561n905P894M259o163o564J77q08M349O254l164j404K752k436P89O42
6477i4m39K798k537l171m299q489M294J567K42m844K663J1275P72j268l116J148
$$ plain form
6587 1756 7558 4099 -6758 -10758 -6745 -7636 -7408 -3675 -2814 -4750 -11027 -5459 -7599 -10067 -6261
6572 -6261 -2576 1253 3773 3949 -4586 -8441 -7777 -9957 -9179 -4458 -245 2449 -583 -4913 -7085 -1087
6556 -1087 -786 -3647 -10976 -10152 -4700 -1393 -1173 -2657 1902 3563 -4456 -11729 -7428 -4750 -4951 -7152
6540 -7152 -7232 -8293 -4440 5793 10041 2871 3764 4146 4836 3456 -123 -3153 -4780 -6218 -4412 -9536
6524 -9536 -16295 -11463 -5054 -647 38 -2250 -4472 -9284 -16877 -17133 -14529 -7619 3813 8013 6486
6509 6486 -777 -1047 -2050 -1383 756 -4347 -10615 -8799 -499 -4977 -3388 540 1818 2289 2955 1795
6493 1795 -766 -6671 1223 5482 -681 -7245 -7068 -7876 -3527 2727 -437 -1841 911 -1525 -736 -94
6477 -94 -533 2265 -272 -3443 -7742 -16231 -11937 -10370 -10128 -14972 -12309 -1034 -262 -1530 -4646 -3498
6461c498J629n670r06J620m41N961k523j330l425M819P402j016j0209j011O273
6446b325L333o685m222l418N161K379M488m861J492N342j021o197J108P151k723
6431i98k040N31j328n553O954O221Q3L188K836Q71o385J591O55l566p285L515
6415g10O80M515m550k033K34N549M198p69R81p690j1114k967L039L824R792j720
6399A259l072K253Q30L658j90j870o501p073J709J840J794m23N92N867N615k59
6383F029j297q464n53J548R488k723o427m51j584Q91K526N672n186L477k151j897
6367a102J407P62K285p07q37L147n338l077K059J294j706k756j251j226n858k264
6351a5168N160P224k624l618j991n396N984Q669j563N656r848m884M533K415J862
$$ plain form
6461 -3498 -1869 -7539 -8445 -6825 -7266 -1305 -3828 -5158 -8583 -3764 3638 2622 -7587 -8598 -2325
6446 -2325 1008 -5677 -9899 -13317 -8156 -5777 -1289 -6150 -4658 684 -337 -6534 -5426 1725 -998
6431 -998 -3038 -2507 -3835 -9388 -2434 3787 3870 7058 9894 10765 4380 5971 6626 3060 -4225 -710
6415 -710 -30 4485 -65 -2098 -1864 3685 7883 7114 8095 405 -10709 -13676 -10637 -6813 2979 1259
6399 1259 -1813 440 1270 4928 4738 2868 -3633 -10706 -8997 -7157 -5363 -5786 -5194 673 6288 6029
6383 6029 4732 -3732 -4285 -2737 6751 4028 -2399 -2850 -4434 -3543 -1017 4655 -531 2946 795 -1102
6367 -1102 305 1067 3352 2645 1808 4955 -383 -3460 -1401 -107 -1813 -4569 -5820 -7046 -12904 -15168
6351 -15168 -10008 -2784 -5408 -9026 -11017 -16413 -10429 -1760 -3323 2333 -7515 -12399 -7866 -5451 -3589
6336c589M680O97J33k869p327J996m69K885M985j3074K77N346J072m600K66M730
6320d861L430l010J290N019l737j517L749J436N033K799M705o775q225l46k040
6305c050M83Q91N861J0323m28J241n642n226j942O89R93p34m278l397Q133j318
6289B599k349K586j129j360n581j946l157N309N536l203o253l164M394O93O221
6274h04K029K84N418j100k257J342n694l91m440O217O347q047J798M1p34j315
6258a306J350l717M906O248l584r62m147p83N359J475L736K485p233k451l876
6243b500j212k134n537O611J0775J45p284l793q339n831q64o59J829N802k295
6228a5286M598J440P170N53J517j520k827m771K511R497j432N11j143J08N647
$$ plain form
6336 -3589 1091 1788 1921 -948 -8275 -6279 -6748 -3863 1122 -11952 -11675 -6329 -5257 -9857 -9591 -4861
6320 -4861 -1431 -4441 -3151 1868 -1869 -3386 363 1799 6832 9631 14336 7561 -664 -1010 -3050
6305 -3050 -2567 -1676 4185 14508 14080 15321 9679 4453 2511 3200 4193 3459 -819 -4216 3917 2599
6289 2599 250 2836 1707 347 -5234 -7180 -10337 -5028 508 -2695 -8948 -12112 -7718 -7025 -804
6274 -804 1225 1509 6927 5827 3570 4912 -782 -1173 -5613 604 6951 -1096 702 743 9 -1306
6258 -1306 44 -3673 1233 7481 3897 2935 -1212 -1995 3364 4839 8575 11060 3827 1376 -2500
6243 -2500 -3712 -5846 -11383 -4772 6003 6148 -1136 -4929 -13268 -19099 -19963 -20622 -18793 -12991 -15286
6228 -15286 -10688 -9248 -2078 -1525 -8 -1528 -4355 -9126 -6615 2882 1450 1961 818 926 6573
6213F573j435n330k477J210n926j514l583m813r092O576Q549Q446K710J91p557
6198g472P595N027j586k672k006m427J497L447n690L468Q709n18l275m151M336
6183B282n877l500J967K279M979P588K189l018L440o952m799q801k721K789O096
6168b059j939Q23n14L039Q861K992k336m303l844k833o281K46J039n3l826l880
6152a4868M529M756k93k06j081L634O130J666O450o767p340m334p340N068P70
6137i226J857P261P09j600l18m32N34M892O71n578j162O910l862n961j869J952
6121e222j295j707N343L015M25L38q537n366L45J0022J717m13j726m320J768L597
6105b016N548m4o790m080J875j031O323K816L099k634k525n888l776n088O912
$$ plain form
6213 6573 5138 -192 -2669 -1459 -7385 -8899 -12482 -17295 -26387 -19811 -11262 -2816 -106 85 -7472
6198 -7472 123 5150 3564 892 -1114 -5541 -4044 -597 -6287 -2819 5890 5372 2097 -2054 2282
6183 2282 -3595 -7095 -5128 -2849 2130 9718 11907 8889 12329 5377 578 -8223 -10944 -8155 -2059
6168 -2059 -3998 -3175 -3689 -650 8211 11203 8867 4564 720 -2113 -8394 -8148 -7109 -7162 -10988 -14868
6152 -14868 -10339 -5583 -5876 -6082 -7163 -3529 2601 4267 10717 3950 -3390 -7724 -15064 -9996 -9226
6137 -9226 -7369 -108 601 -999 -1317 -1749 -1215 3677 4348 -1230 -2392 4518 656 -5305 -7174 -5222
6121 -5222 -6517 -8224 -2881 134 559 897 -7640 -13006 -12661 -2639 -922 -1335 -3061 -7381 -5613 -2016
6105 -2016 3532 3488 -3302 -7382 -5507 -6538 -215 2601 5700 3066 541 -5347 -9123 -14211 -7299
6090g299O616j106P06L8l78M650L797l857o217l518J22k920j914O747N359L632
6074D458p18j10O942r5l866l604m39O65o041P40j601L674L741N1r623L252P840
6057E266o923j947n207J609L073l023J75J930J530K701L360Q83R823L572k165
6042A4657m690j307n395k422r379k474K569j014p279k099J1014L090j935M890
6028a774M012p193k508O218R09K518k444J351N968K771n523o842L715N27K095
6013C800N474l898r163k706l061k159q34m981O787Q27k291p00P453K906o7k568
5997e181o075M341o06K297k132m99l845L672L475L98J52n227K596O190m116o837
5981a1397m241O31O236L049K102M492Q613m554k838l487l577l954P68O723M774
$$ plain form
6090 -7299 -683 -1789 -1083 -1045 -1423 3227 7024 3167 -3050 -6568 -6446 -9366 -11280 -4533 826 4458
6074 4458 3740 3630 10572 10477 6611 3007 2568 3233 -2808 -2068 -3669 5 3746 3797 -5826 -2574 5266
6057 5266 -1657 -3604 -8811 -7202 -4129 -7152 -6977 -5047 -3517 -816 2544 3427 13250 16822 14657
6042 14657 9967 8660 3265 843 -8536 -11010 -8441 -9455 -16734 -18833 -7819 -4729 -6664 -1774
6028 -1774 2238 -4955 -7463 -1245 -336 2182 -262 1089 7057 9828 4305 -2537 1178 1705 3800
6013 3800 9274 5376 -3787 -6493 -9554 -11713 -12547 -17528 -10741 -9914 -12205 -12905 -5452 -2546 -2613 -5181
5997 -5181 -11256 -6915 -7521 -5224 -7356 -7855 -11700 -8028 -4553 -4155 -4003 -9230 -6634 -444 -4560 -11397
5981 -11397 -15638 -15007 -8771 -5722 -3620 872 9485 4931 2093 -1394 -4971 -8925 -8157 -1434 3340
5966C340j37K379N1P91J899l760J312n697l696L11M416P92l9k974J481O672p735
5949e94J905k023q210m312N664L314J589L963j9l624j211J132m516o250K26L201
5933i765N060m712P012O654l937l613K223n470L645Q473r220r555P00M231N473
5918b801J969q848K664k314j637j2N206K029o714k244k427R93J97j709l479L404
5902a5723M817N783L180m561L768M297P10K944L287j1816j0065l459M949P314
5888d575L121K325K83p29O38K748K267n863o416K937J389M221m482n70K223L396
5872B913l041o01O544k267p293l50j463O158J598k760j330P27K13K097m674K314
5856a215L822k581j34L573k470j166K083M386P4p960n417q24L613M239J850N24
$$ plain form
5966 3340 3203 5582 5633 6424 8323 4563 5875 178 -3518 -3207 1209 2001 1962 -1012 469 7141 -594
5949 -594 1311 -712 -8922 -13234 -7570 -4256 -2667 1296 1277 -2347 -3558 -2426 -6942 -13192 -12966 -9765
5933 -9765 -4705 -9417 -2405 4249 312 -3301 -1078 -6548 -2903 5570 -3650 -13205 -12505 -8274 -2801
5918 -2801 -832 -9680 -7016 -9330 -10967 -10979 -5773 -3744 -10458 -12702 -15129 -14136 -13939 -15648 -19127 -15723
5902 -15723 -10906 -5123 -1943 -6504 -2736 1561 2271 5215 8502 -3314 -13379 -16838 -11889 -4575
5888 -4575 -1454 871 1154 425 1063 3811 6078 215 -6201 -3264 -1875 2346 -2136 -2706 -483 2913
5872 2913 -128 -729 5815 3548 -3745 -4095 -5558 600 2198 -562 -1892 -1165 -952 1145 -3529 -1215
5856 -1215 2607 26 -108 3465 995 -171 1912 6298 6372 -1588 -7005 -7829 -4216 23 1873 2397
5840B397n75l95k376J617M286N09p72k659k956l021K221q04J284l32L409J114
5824B947n641j616L3N618J060L078M822n346p355p820k346N204N235n637o205
5809a3969L55K094R010M323j049L466l687J768o22J625r554k249j668N030j914
5794g041j161L711R03j125K565J06Q85L287j571k209p93k029O57L875L80J018
5778A458L820m49L508n031q919K661N601l75q562k773R067O403J081L717j617
5763I590j1161p213M402J1939q62o623k461l118L278O512l222N8k37M152J864
5748F898l685l804j652Q77J675J378J660q16K964l040n411k459p970n012Q50K15
5732a7332Q941L706p668k470J482k113J625P267M215l348K641L003l156l661R61
$$ plain form
5840 2397 1822 1427 -949 668 4954 5463 4691 2032 -924 -3945 -1724 -2528 -1244 -1576 1833 2947
5824 2947 -2694 -4310 -4277 1341 2401 5479 10301 4955 -2400 -10220 -12566 -7362 -2127 -7764 -13969
5809 -13969 -13614 -11520 -2510 1813 764 4230 543 2311 1689 3314 -6240 -8489 -10157 -5127 -7041
5794 -7041 -8202 -4491 -3588 -4713 -2148 -2042 -1157 2130 559 -1650 -2443 -4472 -3815 60 440 1458
5778 1458 5278 4829 8337 3306 -5613 -2952 2649 2274 -6288 -9061 6 6409 7490 11207 9590
5763 9590 -1571 -8784 -4382 7557 6695 72 -2389 -5507 -2229 4283 1061 1119 882 5034 6898
5748 6898 3213 -591 -2243 -1366 309 1687 3347 2531 5495 2455 -2956 -5415 -13385 -18397 -17547 -17332
5732 -17332 -8391 -4685 -12353 -14823 -13341 -15454 -13829 -6562 -2347 -5695 -3054 -51 -3207 -6868 -5907
5717e907j564k139N955j138R836P649l261j2382j648l998k429N984P379o32k996
5702a291n773j653K530R643r538Q02M735l412j647n123k316P826J945L316K314
5687B358K833P79q36o606l971J380m413l908J512N940N114L9K14M004K067K424
5671H930M46l697n96N013K423n297j1136j0707n578Q423R550k00l060L791N284
5656C589L198j881J802n079m334K516j397j081l237K801N908j658k86j353k816
5641c308J511K172J340l246Q505Q06j686p68j905o1j70J663J783J074o338o074
5625d702N755O60n036k682l812j727M206J945JR91J623K326M350q451o434k12
5609a1199O993L611l089n618r83N207N882M426J843j705K23j098m123o929J44
$$ plain form
5717 -5907 -7471 -9610 -3655 -4793 5043 12692 9431 -2951 -4599 -8597 -11026 -5042 2337 1705 -1291
5702 -1291 -7064 -8717 -6187 3456 -6082 -5280 -545 -3957 -5604 -10727 -13043 -5217 -3272 44 2358
5687 2358 5191 5970 5134 -1472 -5443 -4063 -8476 -12384 -10872 -4932 182 221 435 4439 6506 8930
5671 8930 9376 5679 5083 10096 12519 7222 -3914 -14621 -20199 -11776 -2226 -2426 -5486 -1695 3589
5656 3589 6787 4906 6708 1629 -2705 -189 -1586 -2667 -5904 -3103 2805 1147 861 -492 -3308
5641 -3308 -1797 375 1715 -1531 6974 7780 6094 5326 3421 3360 3190 4853 6636 7710 1372 -4702
5625 -4702 1053 1713 -3323 -6005 -9817 -11544 -7338 -5393 -5392 -4401 -2778 -452 3898 -4553 -10987 -11199
5609 -11199 -4206 -595 -3684 -9302 -10285 -5078 804 5230 7073 5368 5591 4493 370 -6559 -6415
5594f415k227p23j91N851P081m175K909K464m587Q226J189n559M032N673L706
5579A7254n997n668m050j741k44k958J531n54m31j995p61J633l734M265q15M773
5563E08L202J54n160k482m06j056M740m256K063P762L900q752o862r711J072J279
5547a4005L903j221j364k335Q335N832L8r079j067m36J900J943L095j090J930
5532c621M172N59J348q467j2262l424O272O450k226l857K300K923P966L324K311
5517C768l083o114Q311M115N36k881m368L680J195j081l226m97k629k510K541
5502b243l851k986k722n166P983J0768P316j198K454M32j195q299l884j06J521
5487a176q63K9R17O509k00p0o525j431Q112j016l385l947K266P914L601k023n559
$$ plain form
5594 -6415 -8642 -9365 -9556 -3705 3376 -799 2110 4574 -13 8213 9402 3843 7875 13548 17254
5579 17254 11257 5589 1539 -202 -446 -3404 -1873 -2427 -2858 -4853 -5614 -3981 -7715 -3450 -4265 508
5563 508 3710 3864 -1296 -3778 -4184 -5240 -500 -4756 -2693 5069 8969 217 -6645 -16356 -15284 -14005
5547 -14005 -10102 -11323 -12687 -15022 -6687 -855 -817 -9896 -10963 -11399 -9499 -7556 -4461 -5551 -3621
5532 -3621 551 1110 2458 -6009 -18271 -21695 -15423 -8973 -11199 -15056 -12756 -9833 -1867 1457 3768
5517 3768 685 -5429 2882 6997 7533 4652 284 3964 5159 4078 852 355 -2274 -4784 -2243
5502 -2243 -6094 -9080 -11802 -16968 -8985 1783 9099 7901 10355 10787 9592 1293 -2591 -2697 -1176
5487 -1176 -2039 -2010 -1093 5416 5216 5146 -1379 -2810 5302 4286 901 -3046 -780 7134 10735 8712 3153
5470C153p314J891J881r84q628k91j378K660K622o51l209k984Q73N023L28o266
5454a3274n88J047MO670N494J141l697j72m113J160N21J932M004n48k688J501
5438a606O838K94J063k926j1357l38J0419K190m415k308p115l921k581j28N825
5423a0066q80J0797O604o848J185j940K529L455k139l777l145L756j904m877M795
5408b455P984J238l747k074R50n581l159K366J933N154r23p552j580J299L186
5393b961L918l973j346J685M53O386L106J610n340q566n389P302P484Q87l610
5378A646K519J16R03n415L009J453j106o525m695J71N008K353j1362o953N82P866
5362a0430L476P35K184j902l012M499K955J682O466m547l525P311J315m543L45
$$ plain form
5470 3153 -4161 -2270 -389 -1373 -10001 -10292 -11670 -9010 -6388 -7039 -10248 -13232 -12359 -7336 -7008 -13274
5454 -13274 -13862 -12815 -12811 -6141 -647 494 -3203 -3375 -7488 -6328 -5807 -3875 129 -419 -3107 -1606
5438 -1606 5232 5526 6589 3663 -7694 -8032 2387 4577 162 -2146 -9261 -13182 -15763 -15891 -10066
5423 -10066 -10946 -149 6455 -393 792 -1148 1381 4836 2697 -1080 -4225 -469 -2373 -7250 -2455
5408 -2455 5529 6767 3020 946 1896 -3685 -6844 -4478 -2545 2609 1686 -5866 -7446 -6147 -2961
5393 -2961 957 -3016 -4362 -2677 -2224 4162 7268 8878 3538 -5028 -10417 -3115 4369 5256 1646
5378 1646 4165 4281 5184 -231 2778 4231 3125 -3400 -8095 -7924 -2916 -563 -11925 -18878 -18296 -10430
5362 -10430 -6954 -6219 -4035 -5937 -8949 -4450 -1495 187 6653 2106 -1419 5892 7207 2664 3009
5347C009K06k756N29K399k049J965q436J894M773M422o76l416m724r24J074l812
5331f522J446k854k106M629N169n724J839O884J498m03n48p816l064P717M996
5316E141O18j638o713n199M053K8O87n047j488M517q762M194R768K240K065k177
5300B287j814K333o603K949p39M732L572P81n890M863L274o060l893k914m883
5285h005j660L689M56k676j961j71m922J439K679M04o090L272M158J351P644N047
5269D654o431m329j541n694J78n40M098L821k552J121J2587N965r068l270l21
5254a322O85J133k283Q98p774J831Q981J256o897n911j843O959P360N135m427
5239C781q02P24m607j813l809n353q460R209J0055k853P18p80j0329M114O003
$$ plain form
5347 3009 3215 459 988 3387 1338 3303 -5133 -3239 1534 5956 5280 1864 -2860 -3784 -2710 -6522
5331 -6522 -5076 -7930 -10036 -5407 -238 -5962 -4123 2761 4259 3856 3308 -4508 -7572 145 5141
5316 5141 5759 4121 -2592 -7791 -3738 -3710 -3023 -8070 -9558 -5041 -13803 -9609 159 2399 4464 2287
5300 2287 473 2806 -3797 -848 -1587 3145 6717 7498 1608 6471 9745 3685 -208 -3122 -8005
5285 -8005 -9665 -5976 -5520 -8196 -10157 -10328 -15250 -13811 -11132 -10728 -16818 -13546 -9388 -8037 -393 4654
5269 4654 -1777 -6106 -7647 -13341 -13163 -13703 -9605 -5784 -8336 -7215 5372 11337 2269 -1001 -1322
5254 -1322 -637 496 -1787 -889 -8663 -6832 2149 3405 -3492 -9403 -11246 -4287 3073 8208 3781
5239 3781 2979 3703 -904 -2717 -6526 -11879 -20339 -11130 -1075 -3928 -3210 -3990 -14319 -10205 -4202
5224d202l260K827l748O869P065J85L796l865l079o564l790j904L498K950m507
5209g729K861J798l016l39O027k025J58M055P87r082M276Q112N032r1l687N418
5193A2555L713o226j780N55J033k9J064o80o443n047m37M576M123j364r287k030
5177e704P39j775Q401n54L75l750p449N244P835k602j079k830l300j412J360k184
5161h685J305L739j297r39J951M604J3282R17q725j0078k959K179M651O562J0360
5146A6867N72l250r500k951L946o42O83k061J084r277l042K88m85L83R288p63
5130A140n027k921O591R54m786k508J218M22m284m040k976O300R947r83m336K656
5114b633Q863k733l186M00N428m627o949r038l404N060N51k181M958N385N706
$$ plain form
5224 -4202 -7462 -4635 -8383 -1514 5551 5736 9532 5667 2588 -3976 -7766 -9670 -6172 -3222 -7729
5209 -7729 -4868 -3070 -6086 -6425 -398 -2423 -2265 1790 2577 -6505 -2229 5883 10915 10824 7137 12555
5193 12555 16268 10042 8262 8817 9850 9821 10885 10205 3762 -1285 -1722 2854 6977 5613 -3674 -5704
5177 -5704 -4965 -6740 1661 1107 1482 -2268 -9717 -4473 3362 760 -319 -3149 -6449 -7861 -6501 -8685
5161 -8685 -7380 -3641 -4938 -5877 -3926 678 13960 14877 6152 -3926 -6885 -4706 -55 6507 16867
5146 16867 17439 14189 4689 1738 5684 5042 5725 3664 4748 -4529 -7571 -7283 -7768 -7385 1903 1140
5130 1140 -3887 -6808 -217 737 -4049 -6557 -5339 -4917 -9201 -13241 -16217 -9917 30 -953 -5289 -2633
5114 -2633 6230 3497 311 711 6139 1512 -5437 -14475 -17879 -12819 -12268 -14449 -9491 -4106 1600
5099A600M663K178l280m488m735L210N011J920P4L95m076k001n610k038O008M490
5083C321p97m989m420j661M514n369k326Q5L491L739j715p0K060n238M504O618
5067A747J88p288j443L564M993M633l199l226k746K582K492j212l289l691M362
5052a533N685j432J006k614m685l397k55l011O690M128j105P97o207m393p29Q012
5036c043P989N104L147l747n169k828j166L309k103J42M95j284K173k085m532
5021c598p377M509P797l584L993J421N97m59m875m855J0449L939o498K511Q52
5006D822J31K769p276j2086L961P829j732m365j143m785R58R437O995k262L438
4991F691J289l554j79K288R75r5m762l203J939m231L02j874n609l063R56N682
$$ plain form
5099 1600 6263 8441 5161 673 -4062 -852 4159 6079 6153 6548 2472 471 -5139 -7177 -1169 3321
5083 3321 2524 -2465 -6885 -8546 -4032 -9401 -11727 -11642 -8151 -4412 -6127 -6197 -4137 -9375 -4871 1747
5067 1747 1935 -5353 -6796 -3232 1761 6394 3195 -31 -2777 -195 2297 1085 -2204 -5895 -1533
5052 -1533 4152 2720 3726 1112 -3573 -6970 -7225 -10236 -3546 582 -523 274 -5933 -10326 -11055 -3043
5036 -3043 4946 10050 13197 9450 4281 1453 287 3596 1493 1635 2130 846 3019 934 -3598
5021 -3598 -10975 -6466 1331 -2253 1740 3161 3758 3299 -1576 -6431 4018 7957 1459 3970 4822
5006 4822 4953 7722 446 -11640 -7679 150 -1582 -5947 -7090 -11875 -10917 -1480 5515 3253 6691
4991 6691 7980 4426 4247 6535 7510 7415 2653 -550 1389 -2842 -2540 -4414 -10023 -13086 -12130 -6448
4975f448O704J715K456N202O9o022l407j682m349l660l188P63N558N969N08M949
4959E137L665k873k610K293j748K158o945m113j057k419M388n207j753L160J188
4944f736K796O140P26j435n830r03L487N726O863j0562l80l873P087P22r745J163
4928d754K240L359N608m335p474K7N184m458m273J947M716j383n643N785K504
4913i50q944p29O741Q008O384m056r079m853j329K850M214j155l149q12K788J695
4897b376N663L501M45P30q865q618n450L74N571n27O449L362O928m89m954l978
4881b234M17q56k754l505J663l401l262L816L913O217P553O250M581o617m808
4866F973n348N69J471k157K592k314n804J133O666L852J333P1q034k274l91r18
$$ plain form
4975 -6448 256 1971 4427 9629 9698 3676 269 -1413 -5762 -9422 -12610 -11847 -6289 -320 188 5137
4959 5137 8802 5929 3319 5612 3864 6022 -923 -5036 -6093 -8512 -4124 -9331 -11084 -7924 -6736
4944 -6736 -3940 2200 2926 1491 -4339 -5242 -1755 3971 10834 272 -108 -3981 3106 3828 -5917 -4754
4928 -4754 -2514 845 6453 2118 -5356 -5329 -145 -4603 -8876 -6929 -2213 -3596 -9239 -3454 -950
4913 -950 -9894 -10623 -3882 4126 10510 6454 -2625 -7478 -8807 -5957 -1743 -2898 -6047 -6859 -4071 -2376
4897 -2376 3287 6788 7233 7963 -902 -9520 -14970 -14596 -9025 -9552 -3103 259 7187 6698 1744 -2234
4881 -2234 -1817 -2673 -5427 -8932 -7269 -10670 -13932 -10116 -6203 14 7567 13817 18398 11781 6973
4866 6973 1625 2194 3665 1508 4100 1786 -4018 -2885 3781 7633 8966 9037 1003 -1271 -1662 -2580
4850b580K844N30j678L781r373K71O742J197M38n524K67O84O061l67k215j073
4834Ej826R54J204l15j180q37j672o799M088m75M51J802l923Q85L766N636L604
4817E368k287n677K695J0967k309n954o011l620r42K967q16J775K558j91N074
4802C597O42N281N574l281n951p196m514R97j156Q53O298j667n209J104Q62M7
4786c719M167K934l970n60k220k30Q8J190N448N935l419R52j855P6J423n105l738
4769b603k108P716L724j6Q6l465m751J993K014O941k463n102j142M647l836r396
4753g761M295N732L241k185n214j898j515j11o5k600L081Q371N20l311m117J241
4737b296L772K048k50P32j644n682k374L251L327r07L448J730m45N610L690K792
$$ plain form
4850 -2580 264 794 -884 2897 -6476 -6205 537 1734 2172 -3352 -3085 -2401 3660 3293 1078 5
4834 5 -1821 -867 337 22 -1158 -1995 -3667 -10466 -6378 -6853 -6402 -4600 -8523 -7638 -3872 1764 5368
4817 5368 3081 -2596 99 11066 8757 2803 -3208 -6828 -7770 -4803 -5619 -3844 -1286 -1477 3597
4802 3597 4239 9520 15094 11813 5862 -1334 -5848 -4851 -6007 -5154 1144 -523 -5732 -4628 -3766 -3719
4786 -3719 448 3382 -588 -1148 -3368 -3598 -3510 -2320 3128 9063 5644 6596 4741 4817 6240 1135 -2603
4769 -2603 -4711 3005 6729 6713 6799 3334 -1417 576 2590 9531 7068 1966 824 5471 1635 -7761
4753 -7761 -3466 2266 5507 3322 -1892 -3790 -5305 -5416 -5481 -8081 -5000 3371 3891 580 -3537 -2296
4737 -2296 1476 3524 3274 4006 2362 -3320 -5694 -2443 884 -23 3425 5155 4710 10320 14010 16802
4721A6802k717j2133n089J541O07J269N992m34M46j763n976j261l863k168L064
4706e683O921K843J597P755m853n271n864o199P9R737J411n609K213j022K507
4691E62n299L45O628j073o095o9M938k697M76J1834M85q663l440K39j272L216
4675A15R945K179l598p1m078j629J545Q681k088r390m87j715l032l482O59n739
4659a2185K68N482q09q82M86j031q832l652K667R468l064M824N774P563k735j697
4643A645l175m230K120J547j957M731J11M032m47K188K211n405k06K79L912k072
4627E284n614j616L623L692o310M95P937L231m639M95J763k068m739J794M128
4612G456n317o800Q084q03n748l425N117N287q19r186l385J540L191L333J667
$$ plain form
4721 16802 14085 1952 -3137 -1596 -989 280 6272 5838 6284 4521 -1455 -2716 -6579 -8747 -5683
4706 -5683 1238 4081 5678 13433 8580 3309 -2555 -8754 -8675 1062 2473 -3136 -923 -1945 562
4691 562 -4737 -4392 2236 1163 -4932 -5001 -63 -2760 -2284 9550 10035 1372 -2068 -1829 -3101 115
4675 115 10060 12239 8641 8570 4492 2863 4408 13089 11001 1611 1124 -591 -3623 -7105 -6446 -12185
4659 -12185 -11917 -6435 -7244 -8126 -7640 -8671 -17503 -21155 -18488 -9020 -12084 -7260 -1486 6077 3342 1645
4643 1645 -1530 -5760 -3640 -2093 -4050 681 792 4824 4377 6565 8776 3371 3165 3444 7356 5284
4627 5284 -330 -1946 1677 5369 -941 -446 7491 10722 6083 6578 8341 6273 1534 3328 7456
4612 7456 2139 -4661 3423 2620 -3128 -6553 -1436 3851 3032 -6154 -9539 -7999 -4808 -1475 192
4597A92n31j869n323M161N836K245k858n093J935k020k743N375n88l643j1579
4582a6503J187O764O294K241m16L295N34j012K960m247j053j194M046R482j468
4567A0910o540J425N064J347l704j372l245k815j238J506L387L492k984m660M794
4552E367L687q542p996M32L44q249K231k736m028J0500Q210J736P509j232k004
4537E229j557L774k257o363K310J975o65j364O923N493L528m554p959j044K329
4522E798k610j614n115j133J998l451q542l732L900M387L919L584O39O96k583
4507c859l146R422O201m226n171O1N908L970j011l938n567Q144k208l492n49R10
4491A449N288k587l385J703l931k6L89n033N62L765J011q40L7m816K100N63O111
$$ plain form
4597 192 -339 -2208 -7531 -3370 2466 4711 1853 -3240 -1305 -3325 -6068 -693 -1281 -4924 -16503
4582 -16503 -15316 -8552 -2258 -17 -433 2862 3396 2384 5344 1097 44 -1150 2896 12378 10910
4567 10910 4370 5795 10859 12206 8502 7130 3885 1070 -168 1338 4725 8217 5233 573 5367
4552 5367 9054 512 -7484 -7052 -6708 -14957 -12726 -15462 -19490 -8990 -780 956 8465 7233 5229
4537 5229 3672 7446 5189 -1174 1136 3111 2446 1082 8005 13498 17026 12472 4513 3469 5798
4522 5798 3188 1574 -3541 -4674 -2676 -6127 -14669 -18401 -14501 -10114 -6195 -2611 -1972 -1276 -3859
4507 -3859 -7005 2417 8618 4392 -779 -718 5190 9160 8149 4211 -1356 6788 4580 1088 539 1449
4491 1449 6737 4150 765 2468 -1463 -1489 -1100 -6133 -5571 -1806 -795 -1635 -1598 -6414 -4314 -3751 2360
4474B360K954J544q004l610m300K288K755M868O398N828J40k241J850k081L55
4459A1104o511n817J491M396o891l447P833K457j212m941j070N52M071Q871k622
4444H264k603m565l741l530K558M460J119j332J97k425m091k701k764m661N988
4429i827M996J092K759L410j514p67m581r35Q89m645k57m625R84M279P045j07
4413a804j635N792j717j310m313o771P15M097N078Q025p19j2365m263K086O16
4398h488O9M968K50J718K181m774K083M61M20J567Q12n934K2J0114J893J12j01
4381G373L034K939o882j1952J517O901N316k162j0078m265J2672N334p285o859
4367d397o629o99M537M949P180l471p272J53L572J176K080R86p112K56R836L781
$$ plain form
4474 2360 5314 6858 -1146 -4756 -9056 -6768 -4013 855 7253 13081 13221 10980 12830 10749 11104
4459 11104 4593 -1224 267 4663 -2228 -5675 2158 4615 3403 -1538 -2608 -2056 2015 10886 8264
4444 8264 5661 1096 -2645 -6175 -3617 843 1962 630 827 -1598 -5689 -8390 -11154 -15815 -9827
4429 -9827 -4831 -3739 -980 2430 916 149 -4432 -5367 -4478 -9123 -9380 -14005 -13021 -8742 -1697 -1804
4413 -1804 -3439 2353 636 -674 -4987 -11758 -11043 -6946 -1868 6157 5438 -6927 -11190 -9104 -8488
4398 -8488 -8419 -3451 -3201 -1483 698 -4076 -1993 -1532 -1112 455 1267 -4667 -4645 5469 7362 7474 7373
4381 7373 10407 13346 6464 -5488 -3971 2930 8246 6084 -3994 -8259 4413 9747 2462 -4397
4367 -4397 -11026 -11725 -7188 -2239 4941 1470 -5802 -5649 -2077 -901 1179 2165 -4947 -4691 5145 8926
4351H926l959K693M13n22J201n01k481k878L8K601l579q03j028m93m723k198l57
4334g650O682O49j168j134o015p840K138M106N944Q764k620k57R5l581L96L666
4318B175J267o334o058K866P859M319Q71M283k239q141J578j18m057j443L082
4303i0n942M979L958K059k811k572q01N00L517O021l45J693l921N560j311K160
4287A2654K943J191l756o478m500l549K536J043o378l21M116k492l735O576m197
4272d347L475J44j047L96J311q60K299k902M304k361R26K754l3K655P107k970
4256A0851l226m158j371l8m95j505k648M857n87K614K799L245l722q422k239N814
4240A769K634K583m802m654K414O717k05K482P77k998M548k589o300R64L909L906
$$ plain form
4351 8926 4967 7660 8073 7551 8752 8251 5770 2892 2930 5531 1952 1149 121 -372 -5095 -7293 -7650
4334 -7650 -968 -319 -1487 -2621 -8636 -16476 -14338 -10232 -4288 4476 1856 1599 1694 -1887 -1491 2175
4318 2175 3442 -2892 -8950 -6084 1775 6094 6965 11248 9009 868 2446 2328 -1729 -3172 -90
4303 -90 -6032 -1053 2905 4964 2153 -419 -1220 -720 2797 8818 8473 10166 6245 11805 10494 12654
4287 12654 15597 16788 13032 6554 2054 -1495 1041 2084 -4294 -4615 -499 -2991 -6726 -150 -4347
4272 -4347 -872 -728 -1775 -1379 -68 -928 1371 -1531 2773 412 1338 4092 4059 6714 13821 10851
4256 10851 7625 3467 2096 2058 1563 58 -2590 2267 1680 4294 7093 10338 6616 -1806 -4045 1769
4240 1769 4403 6986 2184 -2470 -56 6661 6456 8938 9715 6717 11265 8676 2376 3340 7249 11155
4224A1155Q93n62k22L86n006q006o21m989K401R93l711k565M518J211j881J010
4208d996N77K612J896L554j59M435q56m047j213n610L907j332j005L333J636n755
4192c023M992O962p234k648k512M833j08Q1M600o53j252q57j940n73J99k001k193
4175c327j41j041M840M242M455k225m718k225l26J393L600M446k672j654K600
4160G247L04J270l77k425m132M250L365l630l863N28O281l561m780J983L170M135
4144I765P82M75k418l345j0041j831L816Q576l890L361R844l576r792o271L041
$$ plain form
4224 11155 12048 11486 11264 11650 6644 -1362 -1983 -6972 -4571 -3578 -7289 -9854 -5336 -4125 -6006 -4996
4208 -4996 -4419 -1807 89 3643 3484 7919 7063 3016 1803 -3807 100 -1232 -2237 1096 2732 -3023
4192 -3023 1969 8931 1697 -951 -3463 1370 1262 1343 5943 5290 4038 3181 1241 668 867 -1134 -3327
4175 -3327 -3468 -4509 331 4573 9028 6803 2085 -140 -466 927 4527 8973 6301 4647 7247
4160 7247 7551 8821 8444 6019 1887 6137 9502 5872 2009 2537 8818 5257 477 2460 5630 9765
4144 9765 10547 11022 8604 5259 -4782 -6613 -2797 5779 1889 5250 15094 11518 1726 -4545 -1504
$$ [...]
##END NTUPLES=NMR SPECTRUM
##END=
