##TITLE=Analysis number 329555
Compound Code cc 58706
Book Reference 486/190
Project Code adrs
Chemist Name simons
##JCAMPDX= 6.0         $$ Bruker NMR JCAMP-DX V2.0
##DATA TYPE= NMR SPECTRUM
##DATA CLASS= NTUPLES
##ORIGIN= Bruker BioSpin GmbH
##OWNER= nmr
$$ XWIN-NMR		Version 3.5
$$ Thu Sep 13 10:06:46 2007 GMT Daylight Time (UT+1h)  MAYBRIDGE\nmr@NMR_250MHZ
##.OBSERVE FREQUENCY= 250.131544655141
##.OBSERVE NUCLEUS= ^1H
##.ACQUISITION MODE= SIMULTANEOUS (DQD)
##.ACQUISITION SCHEME= undefined
##.AVERAGES= 16
##.DIGITISER RES= 18
##SPECTROMETER/DATA SYSTEM= dpx250
##.PULSE SEQUENCE= zg30
##.SOLVENT NAME= CDCl3
##.SHIFT REFERENCE= (INTERNAL, CDCl3, 0, 16.522)
##AUDIT TRAIL= $$ (NUMBER, WHEN, WHO, WHERE, WHAT)
$$ ##TITLE= Audit trail, XWIN-NMR		Version 3.5
$$ ##JCAMPDX= 5.01
$$ ##ORIGIN= Bruker BioSpin GmbH
$$ ##OWNER= nmr
$$ C:\u/data/dgb/nmr/ADRS/1440/pdata/1/auditp.txt
$$ ##AUDIT TRAIL=  $$ (NUMBER, WHEN, WHO, WHERE, WHAT)
(   1,<2007-09-13 10:06:24.38 +100>,<MAYBRIDGE\nmr>,<NMR_250MHZ>,
      <created by zg, POWCHK disabled, PULCHK disabled
       configuration hash MD5:
       76 6E 9A 78 1E 09 19 81 EC 84 63 8F B0 6A 59 2D
       data hash MD5: 64K
       B1 90 E5 8C B9 EA 5A 5B 6C 0F 3E 53 98 64 EB 14>)
(   2,<2007-09-13 10:06:37.12 +100>,<MAYBRIDGE\nmr>,<NMR_250MHZ>,
      <Start of raw data processing
       ef LB = 0.3 FT_mod = 6 PKNL = 1 SI = 32K 
       data hash MD5: 32K
       F8 86 23 C1 7F A8 F8 FC 0D 16 E5 1D 38 FD 05 11>)
(   3,<2007-09-13 10:06:38.84 +100>,<MAYBRIDGE\nmr>,<NMR_250MHZ>,
      <apk 
       data hash MD5: 32K
       34 69 1F 1C B8 FD EE 85 3A 34 A1 4D A9 68 AD 25>)
(   4,<2007-09-13 10:06:39.56 +100>,<MAYBRIDGE\nmr>,<NMR_250MHZ>,
      <abs ABSG = 5 
       data hash MD5: 32K
       B1 E4 C2 16 F9 9B FD A8 3C 44 8E E4 97 30 DB F9>)
$$ ##END=
$$ 
$$ hash MD5
$$ 2E 28 08 F5 29 A3 D1 2E 2C 77 B2 88 A4 02 D2 89
##$RELAX= 
##$RELAX= 
##$RELAX= 
##$RELAX= 
##$RELAX= 
##$RELAX= 
##$RELAX= 
$$ Bruker specific parameters
$$ --------------------------
##$DU= <C:\u>
##$EXPNO= 1440
##$NAME= <ADRS>
##$PROCNO= 1
##$TYPE= <nmr>
##$USER= <dgb>
##$AMP= (0..31)
100 100 100 100 100 100 100 100 100 100 100 100 100 100 100 100 100 100 
100 100 100 100 100 100 100 100 100 100 100 100 100 100 
##$AQSEQ= 0
##$AQ_mod= 3
##$AUNM= <au_zg>
##$AUTOPOS= <56 >
##$BF1= 250.13
##$BF2= 250.13
##$BF3= 250.13
##$BF4= 250.13
##$BF5= 500.13
##$BF6= 500.13
##$BF7= 500.13
##$BF8= 500.13
##$BYTORDA= 1
##$CFDGTYP= 0
##$CFRGTYP= 5
##$CHEMSTR= <none>
##$CNST= (0..31)
1 1 145 1 1 1 1 1 1 1 1 1 1 1 1 1 1 1 1 1 1 1 1 1 1 1 1 1 1 1 1 1 
##$CPDPRG= <>
##$CPDPRG1= <>
##$CPDPRG2= <>
##$CPDPRG3= <>
##$CPDPRG4= <mlev>
##$CPDPRG5= <mlev>
##$CPDPRG6= <mlev>
##$CPDPRG7= <mlev>
##$CPDPRG8= <mlev>
##$CPDPRGB= <>
##$CPDPRGT= <>
##$D= (0..31)
0 1 0 0 0 0 0 0 0 0.06 0 0 0 0 0 0 0.0002 0 0 0 0 0 0 0 0 0 0 0 0 0 0 
0 
##$DATE= 1189674381
##$DBL= (0..7)
120 120 120 120 120 120 120 120 
##$DBP= (0..7)
150 150 150 150 150 150 150 150 
##$DBP07= 0
##$DBPNAM0= <>
##$DBPNAM1= <>
$$ [...]
##$SUBNAM7= <"">
##$SUBNAM8= <"">
##$SUBNAM9= <"">
##$SW= 20.6930455092707
##$SWIBOX= (0..15)
0 0 3 0 0 0 0 0 0 0 0 0 0 0 0 0 
##$SW_h= 5175.983436853
##$TD= 65536
##$TD0= 1
##$TE= 296.16
##$TE2= 300
##$TE3= 300
##$TEG= 300
##$TL= (0..7)
0 120 120 120 120 120 120 120 
##$TP= (0..7)
150 150 150 150 150 150 150 150 
##$TP07= 0
##$TPNAME0= <>
##$TPNAME1= <>
##$TPNAME2= <>
##$TPNAME3= <>
##$TPNAME4= <>
##$TPNAME5= <>
##$TPNAME6= <>
##$TPNAME7= <>
##$TPOAL= (0..7)
0.5 0.5 0.5 0.5 0.5 0.5 0.5 0.5 
##$TPOFFS= (0..7)
0 0 0 0 0 0 0 0 
##$TUNHIN= 0
##$TUNHOUT= 0
##$TUNXOUT= 0
##$USERA1= <user>
##$USERA2= <user>
##$USERA3= <user>
##$USERA4= <user>
##$USERA5= <user>
##$V9= 5
##$VALIST= <valist>
##$VCLIST= <CCCCCCCCCCCCCCC>
##$VD= 0
##$VDLIST= <DDDDDDDDDDDDDDD>
##$VPLIST= <PPPPPPPPPPPPPPP>
##$VTLIST= <TTTTTTTTTTTTTTT>
##$WBST= 1024
##$WBSW= 4
##$XGAIN= (0..3)
0 0 0 0 
##$XL= 0
##$YL= 0
##$YMAX_a= 427098
##$YMIN_a= -407292
##$ZGOPTNS= <>
##$ZL1= 120
##$ZL2= 120
##$ZL3= 120
##$ZL4= 120
##$ABSF1= 16.522
##$ABSF2= -4.171173
##$ABSG= 5
##$ABSL= 3
##$ALPHA= 0
##$AQORDER= 0
##$ASSFAC= 0
##$ASSFACI= 0
##$ASSFACX= 0
##$ASSWID= 0
##$AUNMP= <proc_1d>
##$AZFE= 0.1
##$AZFW= 0.1
##$BCFW= 0
##$BC_mod= 0
##$BYTORDP= 0
##$COROFFS= 0
##$CY= 12.5
##$DATMOD= 1
##$DC= 0
##$DFILT= <>
##$DTYPP= 0
##$F1P= 14.0000005364418
##$F2P= -0.99999901652339
##$FCOR= 0.5
##$FTSIZE= 32768
##$FT_mod= 6
##$GAMMA= 0
##$GB= 0
##$INTBC= 1
##$INTSCL= 1
##$ISEN= 128
##$LB= 0.3
##$LEV0= 0
##$LPBIN= 0
##$MAXI= 10000
##$MC2= 0
##$MEAN= 0
##$ME_mod= 0
##$MI= 0
##$NCOEF= 0
##$NC_proc= -2
##$NLEV= 6
##$NOISF1= 0
##$NOISF2= 0
##$NSP= 0
##$NTH_PI= 0
##$NZP= 0
##$OFFSET= 16.522
##$PC= 1
##$PHC0= -60.85135
##$PHC1= 5.158104
##$PH_mod= 1
##$PKNL= yes
##$PPARMOD= 0
##$PSCAL= 4
##$PSIGN= 0
##$REVERSE= no
##$SF= 250.13
##$SI= 32768
##$SIGF1= 0
##$SIGF2= 0
##$SINO= 400
##$SIOLD= 32768
##$SREGLST= <1H.CDCl3>
##$SSB= 0
##$STSI= 32768
##$STSR= 0
##$SW_p= 5175.98343685301
##$SYMM= 0
##$S_DEV= 0
##$TDeff= 65536
##$TDoff= 0
##$TI= <Analysis number 999999
Compound Code 99
Book Reference 9
Project Code 9>
##$TILT= no
##$TM1= 0
##$TM2= 0
##$TOPLEV= 0
##$USERP1= <user>
##$USERP2= <user>
##$USERP3= <user>
##$USERP4= <user>
##$USERP5= <user>
##$WDW= 1
##$XDIM= 32768
##$YMAX_p= 299257731
##$YMIN_p= -53722
$$ End of Bruker specific parameters
$$ ---------------------------------
##NTUPLES= NMR SPECTRUM
##VAR_NAME=  FREQUENCY,     SPECTRUM/REAL,   SPECTRUM/IMAG
##SYMBOL=    X,             R,               I
##VAR_TYPE=  INDEPENDENT,   DEPENDENT,       DEPENDENT
##VAR_FORM=  AFFN,          ASDF,            ASDF
##VAR_DIM=   32768,         32768,           32768
##UNITS=     HZ,            ARBITRARY UNITS, ARBITRARY UNITS
##FACTOR=    0.157963299565203, 1,           1
##FIRST=     4132.6476996994, 0,             0
##LAST=      -1043.33573715361, 0,           0
##MIN=       -1043.33573715361, -53722,      0
##MAX=       4132.6476996994, 299257731,     0
$$ Real data points
##PAGE= N=1
##DATA TABLE= (X++(R..R)), XYDATA
$$ [...]
22332 -8010 3706 6972 8125 6610 48 -8439 -12528 -12220 -5757 6816 5459 1731 1179 2648 -588
22317 -588 -64 6130 1619 -3154 -10744 -6705 -7391 -9634 -14671 -18202 -10826 -3182 129 -1319 5498
22302 5498 3663 3515 5622 5404 3058 -1075 -9024 -5835 1215 2082 935 -1556 810 4501 3415
22287 3415 4104 4098 2471 -4239 -7714 -10684 -9024 -5085 -1767 3589 4364 3328 4433 6547 7260 3822
22271 3822 -1702 -8080 -10366 -6998 972 7079 10398 15718 13773 2668 -670 2346 8524 8761 6318
22256 6318 3919 -4261 -9657 -12846 -8901 -3661 -1074 3948 8346 6631 4919 0 -64 -4931 -1206
22241 -1206 3222 839 -2375 -6581 -1626 2603 6360 1089 -1368 2690 -440 -2710 2925 11261 12096
22226 12096 2226 -3028 -10116 -5800 -11870 -12482 -4899 -1220 2391 3231 5945 2948 -4052 -4991 6838
22211 6838 11465 9332 -2610 -6353 -6869 -3783 575 -1850 -1346 -6236 -7438 -8020 -130 6138 2895
22196 2895 -3612 -1078 3737 2930 1708 4766 1429 1962 7026 -249 -6198 -5202 -7619 -4271 -3343 -4450
22180 -4450 115 1494 -261 -211 -187 -2780 -3963 60 2889 3551 7449 10783 7028 1235 1690 5642
22164 5642 -648 4162 6060 63 41 4841 2276 -827 2829 -1129 -3251 -3964 -3608 -2061 -6295 -8091
22148 -8091 -8523 -14015 -18327 -15231 -10577 -6962 -10122 -9015 -7314 -4192 -3663 -4378 -7178 -12437 -16458
22133 -16458 -11470 -2985 -222 2347 -6304 -6844 -4150 45 6802 7717 4693 2308 7443 3620 -14
22118 -14 2360 -452 -4487 -5280 -832 4263 4748 -1003 -4406 -1451 1645 2709 -1242 -3743 -8662 -6513
22102 -6513 -3732 -3752 -6409 -4562 5149 8688 6534 4190 3517 3468 755 1166 -1963 2272 3792 -6148
22086 -6148 -15195 -19713 -18699 -16275 -13015 -8005 -1668 1190 -1754 25 -5534 -3862 -855 -402 317
22071 317 1054 -2534 -5660 -4126 -5493 -2220 -3319 -1756 2344 -710 -2430 -1369 1401 4005 75
22056 75 -6263 -10376 -3095 -1669 -6900 -9819 -478 6699 7509 -901 -2658 -1879 3540 10747 7313 11355
22040 11355 15032 5425 -6606 -6505 -5267 -6185 -7750 -4904 -720 -172 -767 -164 -3944 -537 3237
22025 3237 -1638 -6027 1493 4080 2463 6047 6595 790 -2115 -6041 -11692 -9850 -5253 -1818 -951
22010 -951 -3299 -10414 -13185 -9049 -690 39 -4657 -7143 -6252 184 2221 -6177 -503 3134 126
21995 126 -65 1905 4516 2525 924 -978 1434 -11087 -14325 -9509 -6504 -3914 408 -145 -7774
21980 -7774 -6099 1155 6767 6039 14722 12019 2584 2345 12550 6877 -2500 -2132 -639 -6886 -4320
21965 -4320 -1138 5056 9435 9047 2406 1485 3712 2924 1502 -3011 -4789 -9363 -9616 -4084 -6802 -6066
21949 -6066 -6095 -5752 -6684 -6930 -2522 -5603 -4333 -2186 -4420 -7860 -6180 -7599 -4366 1022 -4210 -7252
21933 -7252 -8047 2002 2869 4140 6527 2662 5106 2910 1712 4645 4529 2053 -4126 -1304 163
21918 163 -6447 -9574 -7184 -2254 1254 -3928 -11778 -15051 -6822 -6004 -8437 -12219 -8932 -5890 -2183
21903 -2183 -5065 1005 8393 8534 7002 -3559 -3721 -43 10972 15995 13057 9511 2265 2350 5135
21888 5135 853 514 1499 2492 1742 6138 8791 -1341 -10541 -12784 -12686 -3165 -1720 -6991 -4183 -24
21872 -24 -1748 -2716 -5255 -1102 -1089 -1075 1808 1169 885 647 5590 13131 12870 9481 2342 5700 13104
21855 13104 9071 3815 10406 14813 15070 15179 13993 12156 8814 6504 5307 6205 4110 2154 -1417
21840 -1417 -2191 2201 6109 7097 -1659 -6849 -4309 -1696 -193 -6815 -8884 -3668 -2614 100 5535
21825 5535 1279 596 -2385 -3284 -3437 -4479 -7272 -8803 -5186 2315 3276 -1063 -9258 -7323 -852 -1749
21809 -1749 -3424 -2888 -3926 -1111 2311 -1045 -616 6990 7432 919 -6254 -11402 -4835 -5393 -11185 -8057
21793 -8057 -6714 -2373 -2981 -8730 -12286 -9606 -4525 -3313 -2108 -1283 -2721 -1406 2940 1899 10772
21778 10772 12056 155 518 -1273 -2347 -2778 -3056 -4531 -5393 -4624 -5514 -4574 -10252 -10013 -11999 -13076
21762 -13076 -11653 -1964 4010 -1035 -3838 -4328 -9577 -11864 -16178 -13441 -3728 -3231 -5153 -468 -136
21747 -136 -123 1709 133 4330 4696 5032 -2435 -1454 6101 6112 7945 3007 -8499 -13687 -14042 -11530 -5290
21730 -5290 5191 8863 6121 6489 3777 1106 2360 1651 -639 5796 4734 -1062 -7402 -12639 -15003
21715 -15003 -21116 -19047 -14020 -13048 -13228 -9426 -5199 -5722 -8186 -9265 -12332 -11205 -9949 -6499 -7346
21700 -7346 -6607 -6077 -9045 -7833 -6621 -5588 -939 7975 7548 6113 4532 942 -2892 -2421 -1444 -4175
21684 -4175 -6121 -5989 -11985 -10593 -7749 -7018 -5428 -3929 -4454 -5898 -10715 -11132 -6616 151 2958 6907
21668 6907 -634 -7033 -6017 -6214 404 2037 713 3502 12383 11984 3513 25 -9715 -12468 -9110
21653 -9110 -11310 742 5712 10389 7649 5797 4306 5779 1811 -1003 -4869 -3368 -5234 3243
21639 3243 2707 2296 1370 -1586 1858 2911 4133 1907 6804 7927 4989 1331 -3353 -2747 191 -1567
21623 -1567 653 2138 1274 3454 8522 4862 8590 11198 7277 6669 9628 7279 -1976 2455 4714
21608 4714 1262 -3114 -5181 -7306 -10785 -8831 -8354 872 4065 3511 8640 7740 2597 2260 1831 6449
21592 6449 4711 7197 5539 -782 -4592 -5303 1017 8550 4805 -5086 -10267 -2279 3134 2992 708
21577 708 4082 4891 7480 2611 535 -3053 -6444 -8014 -2930 295 -1738 -2926 -4734 -989 -1518
21562 -1518 -3964 -9441 -9550 -8996 -8919 -13624 -12826 -11263 -12160 -16417 -16352 -15604 -7441 -4875 -4044 1815 -604
21545 -604 -593 4019 3418 6875 10034 12328 12414 8408 6011 8672 6133 -4164 -5918 -6544 -4120 942
21529 942 5291 5673 572 -4711 -4963 -828 -5876 -10271 -6274 -827 2686 4262 -3661 -5360 -1043
21514 -1043 -3910 -5390 -7088 -14309 -11704 -8471 -7800 -4581 20 -575 364 5098 935 -2275 -6371
21499 -6371 2209 6345 6001 4635 -2115 -6573 -10129 -3948 -970 -5996 -7016 -2341 1612 -83 2759
21484 2759 5339 1584 -2736 -10675 -9780 -4559 -877 3161 2692 1550 1590 -2312 66 1635 658 419
21468 419 1011 -725 -911 152 4253 1860 -6532 -7052 -2455 -420 -2710 -1725 -3743 -8365 -13131 -12772
21452 -12772 -11150 -7401 -5933 -934 -4322 1166 1009 -4299 -8496 -9718 -7213 -5016 -1123 -3497 -4513
21437 -4513 -7414 -11485 -15704 -19389 -9938 -7224 -7615 -3793 -4362 -3493 -11978 -14821 -8736 -6116 -12174
21422 -12174 -12754 -8212 -936 4792 6290 1426 1299 1525 1895 -655 -2814 -7556 -4561 4332 10037
21407 10037 13960 12246 8725 7628 11891 5879 -680 -10518 -3885 -383 -6719 -12629 -8531 -1615
21393 -1615 -3745 -2469 2732 4895 4138 426 -4908 -9245 -11314 -8824 -12637 -12201 -10634 -10619 -3355 -3380
21377 -3380 -12614 -15301 -14430 -9579 -2630 -10466 -8277 -1990 -2791 -8099 -11501 -9840 -6350 -8692 -8706 -8766
21361 -8766 -8920 -13906 -12428 -6958 -6434 -862 -6362 -10348 -9832 -4453 5218 8356 5867 2712 4863
21346 4863 2317 1785 -2574 1937 4609 4830 5033 -85 -1774 3741 801 -1413 -2191 -3775 -8400 -3628
21330 -3628 6268 3157 -719 -5383 -3103 4067 6143 3777 3100 -398 -7191 -5772 -5778 3074 10660 4238
21314 4238 -1632 -5576 2328 1003 -6830 -11595 -5085 -1171 2418 2346 4397 1054 1822 6822 837
21299 837 2759 4032 4682 -773 -5876 -4465 -1199 3317 1067 -1290 1438 5728 5145 -334 -3838
21284 -3838 -2604 2807 -782 -6678 -6280 -5573 -5640 -4862 385 -2482 -12028 -17442 -18697 -18817 -13454 -11367
21268 -11367 -12459 -12580 -15634 -13102 -7968 -4301 -2355 1814 -475 -7213 -9472 -7945 -4837 -227 -10737
21253 -10737 -12024 -10970 -7918 -2619 330 -958 -490 4482 2641 1596 3630 1482 3464 7410 10515
21238 10515 5758 -5162 -8866 -4291 303 1640 -2211 -6742 -5562 -6983 -7302 -7365 -11210 -13756 -16353
21223 -16353 -10490 21 3143 7596 5057 -695 -5355 -1780 -3989 -8567 -8970 -9589 -7608 -6601 -1698
21208 -1698 4042 2819 2051 -52 4618 1293 -4835 1035 27 -7486 -5314 -7870 -5590 1612 -3951
21193 -3951 -2454 -4030 -11406 -11528 -10884 -8818 -9088 -6775 -7471 -16300 -14395 -16610 -19492 -13353 -10580 -4871
21177 -4871 1640 6498 4926 6029 8594 4847 -3281 -10476 -10973 -10600 -1700 7039 5257 -4676 -6815
21162 -6815 -1802 -174 -3747 -3915 -2958 -2743 -7747 -3697 -2481 2632 6960 4005 6467 7407 6331 -110
21146 -110 -4214 -5109 -7316 -7974 -7603 -7161 -1155 -479 -8315 -11152 -18408 -14790 -3561 -728 227 4008
21130 4008 9866 8461 3072 3018 -3278 -4073 -2770 -3864 -2459 -4043 -4029 -5437 -3411 -5667 -6306 -1936
21114 -1936 -8677 -9022 -8960 -12231 -6694 -4815 -816 -1072 -3329 -4455 -6839 -1107 -1564 -7746 -10390 -11873
21098 -11873 -8685 -10067 -8502 -3122 3270 2146 -208 5591 8385 11496 7318 2990 -2017 6043
21084 6043 10867 9789 6437 917 2460 3277 -315 -6857 -8239 -8512 -7803 -2013 3795 4394 618 -3465
21068 -3465 -5179 -8483 -11556 -8428 -6576 -5951 -236 1373 -3263 -3457 -2992 -5576 -7597 -8303 -11725 -636
21052 -636 3334 -4982 -9056 -8101 -4045 2518 3187 6664 4766 7030 7984 -3931 -2349 1152 1672 7766
21036 7766 14722 15777 9045 4896 -3470 -9815 -11094 -6479 -2395 -1303 -616 1867 4268 3846 -2416
21021 -2416 3772 7274 8308 7294 -180 -2479 4330 898 819 4451 2967 -1800 -9470 -11548 -11948
21006 -11948 -6479 -1370 5795 6493 8777 7279 4343 -2756 -4651 -3872 -4221 -8212 -11743 -12792 -12645
20991 -12645 -5589 -2653 -2878 -5659 -2926 -1968 741 6739 4964 1258 -2699 -1129 -1293 -7274 -12881
20976 -12881 -7887 -6333 -437 1752 3192 -4368 -10552 -8494 -1650 -5792 -3679 -1102 -5881 -4642
20962 -4642 406 4393 -2925 -225 4717 3902 8847 7433 3769 -4521 -12912 -9319 -8032 -8878 -9786
20947 -9786 -8520 -6279 2266 11756 4053 -5289 -9649 -8715 -4267 -4585 -5771 -6770 -5222 -6511 -11822
20932 -11822 -14097 -11162 -7962 -7391 -9042 -10381 -6080 -944 3839 2064 -3054 -3725 -1985 -6609 1189
20917 1189 6247 2597 -3970 -6415 -5035 -4938 725 8733 13085 8774 4416 1618 -3775 -4636 -2692
20902 -2692 -38 -461 -1898 -2196 3519 9874 10282 6501 9627 5810 -3590 3071 5743 9226 8498 7350
20886 7350 7562 5490 5148 7398 5804 384 2770 8241 7000 6532 12898 9222 -3233 -5023 -9598
20871 -9598 -7965 1346 937 -1514 1009 -233 -510 459 4424 5040 307 -605 -288 367 -1117 -9705
20855 -9705 -5376 -3894 -3502 1102 10307 9861 3017 -1213 1989 628 -574 -10632 -12463 -11614 -3116
20840 -3116 1385 4332 7612 7059 2828 2532 5380 6314 9277 10124 3616 4725 5599 1778 -4527 -4923
20824 -4923 518 -2451 705 243 -4737 -7661 -14619 -11611 -3623 -4783 -10056 -13996 -3775 267 -1592
20809 -1592 -1356 -99 -4144 -5324 -3656 -5685 -9229 -1010 4630 -1205 -10523 -6007 2538 4564 5364
20794 5364 5997 15105 16927 9840 2298 -121 3564 3758 35 -8951 -10391 -1104 2771 4992 2345
20779 2345 4158 547 -7785 -1473 1401 -6726 -11476 -10211 -9935 -6500 -142 -560 -1373 -5631 -7555
20764 -7555 -6066 -5766 -10171 -10942 -7372 -10990 -7354 835 1185 -2493 -2740 3153 4188 -231 2192 9218
20748 9218 9305 8885 6155 3443 4440 7485 8384 8184 8847 4621 -2972 -5370 -8777 -2498 6244 7267
20732 7267 3836 11356 10785 1241 1641 1256 6152 909 1918 197 6122 15590 8112 -5124 -6340
20717 -6340 -4634 -2014 3410 -3459 -8317 -10245 -1565 12346 14605 8103 2750 3736 2326 -3654 -7278
20702 -7278 -2234 6025 12769 15778 12005 1841 -844 441 3927 2651 3583 -6953 -13927 -6933
20688 -6933 -3807 4129 7389 2669 1786 -2513 -1345 7860 12700 4402 -1052 4197 7474 1791 -18
20673 -18 -3325 1210 7239 2593 -201 -820 937 5404 4356 -2973 -9634 -12099 -3081 -3356 -4237 -4071
20657 -4071 -1064 4170 2528 -1080 3323 2898 -590 1361 1435 2241 3370 5163 982 5268 2178 -2651
20641 -2651 -2031 -1465 -3540 -2549 -3603 656 5275 1346 2469 2879 -9003 -13079 -6230 -5918 -2125 -2303
20625 -2303 -2546 3203 -1061 -9011 -10524 -8165 -4465 -3832 371 -1518 -5747 6676 13425 5716 1487
20610 1487 -3876 -5545 -8865 -6848 -682 81 -2670 -8302 -9743 -7432 -1601 5927 11325 14601 9572
20595 9572 5351 2302 71 -4508 -10079 -12339 -9140 2678 7366 3290 5137 6523 4564 -548
20581 -548 -309 -1187 -7280 -8566 -8186 -5993 -10900 -9417 -3315 -6673 -13428 -12877 -7901 -8172 -12786 -11669
20565 -11669 -4450 -182 181 607 -4173 -11072 -7662 -1624 1862 669 -8369 -11686 -14294 -11088 -9257
20550 -9257 -5439 -2466 -4393 -10171 -12379 -10187 -4757 1678 -7307 -11664 -11242 -5738 -4491 -11283 -14595
20535 -14595 -14129 -4314 505 -3322 -7825 -3004 1009 7414 9262 6380 4724 1904 -1060 -8143 -13855
20520 -13855 -18182 -3738 -292 -7876 -10469 -5597 1290 -4985 -9826 -8325 -3730 1262 -4911 -10257
20506 -10257 -4135 -6187 -7965 -6758 -4298 2100 2288 -3422 223 -6013 -6200 -6626 -2518 2857 -2252
20491 -2252 -12528 -11398 -885 7863 837 -3013 -1694 -4275 -848 6297 12316 5303 -4821 -7349
20477 -7349 -8541 -12248 -11035 -17246 -17160 -12624 -7179 -2790 6824 6883 -3600 -5954 -8021 -11289 -12060 -13547
20461 -13547 -12188 -4485 -2280 4594 4844 7888 8388 -2966 -5517 -2031 957 -6719 -8646 -977 2177
20446 2177 1147 3241 3245 -81 -2650 -3544 -5158 -7240 -7246 -5394 -7613 -5851 -1672 -1739 -1235 -577 -5241
20429 -5241 -3497 -3355 -4407 -2711 -4661 -5642 -5823 -7646 -10334 -3885 881 2371 -2698 -3885 -913
20414 -913 -2406 -1329 302 -1777 1700 2180 -3850 -9280 -14748 -9669 -11090 -12505 -4021 -5342 -9630
20399 -9630 -4772 -5311 -13334 -8912 -446 378 4920 2018 232 -7953 -9707 -8035 -10772 -11473 -6453
20384 -6453 -2662 1473 6147 6767 5768 1787 -5237 -13833 -9189 -8136 -5892 -3566 -3132 -898 1124
20369 1124 -2328 -12661 -16556 -11764 -9943 -5970 -1145 161 2805 -2420 -5990 -11519 -9268 -6192
20355 -6192 -3991 -6047 -8018 -4115 -3083 -8174 -5710 -7380 -11043 -13867 -8991 -2983 -1595 -3831 -7754
20340 -7754 -8290 -12703 -14960 -13133 -13845 -15350 -15088 -12141 -12986 -14136 -8765 -8584 -7123 864 5600 2136
20324 2136 -8453 -5162 -7306 -3751 -1475 -3224 -5587 -6802 -9611 -13054 -15619 -12320 -4665 -2619
20310 -2619 -5369 -5679 -4580 -2291 -2610 -6930 -5669 -5888 -8137 -1181 4170 1245 -4351 -11203 -11111 -16254
20294 -16254 -11128 -8340 -7491 -4821 -5826 -935 3717 8216 5596 -4673 -15066 -12925 -9723 2556
20280 2556 12274 8065 8582 3103 5467 1776 2848 1561 -6155 -4714 -6157 -7451 -8094 -4436 2782
20265 2782 3827 3441 4276 2950 2209 -2848 -6866 1422 4727 4425 9943 5382 2481 362 -44 3418
20249 3418 2529 -1140 1544 5169 4908 3855 4968 12598 16698 15163 4367 -5603 -14599 -11062 -6180
20234 -6180 -1077 -1096 -583 -4094 -64 797 -246 -246 -1037 -798 1080 -4369 2381 2056 2439 2003 1297 -3697
20216 -3697 -6282 -4741 -1253 7327 10655 8157 5494 8486 6964 -634 2499 6582 -264 2255 5942
20201 5942 1454 6614 8085 706 -2523 4110 10164 13372 2545 -3586 -5897 -447 5970 4164
20187 4164 8880 14018 5820 -2801 -2757 -4427 -7687 -12241 -13269 -6283 428 -4581 -12941 -3876 -1651
20172 -1651 -725 -8082 -10173 -5637 -5924 -2530 -146 -4801 -4629 -85 6386 6835 -2734 -6134 -2116 -2140
20156 -2140 -4416 -8259 -9584 -2221 2188 2498 -4302 -11179 -15110 -10056 -2917 -2805 -4954 -2376 -8361
20141 -8361 -8409 -6904 -5881 -204 -4295 -13437 -13529 -12303 -8765 -7089 -9781 -5611 446 -1949 -1473 581
20125 581 2187 -1170 -2702 -2005 2880 7788 5218 1005 3473 2003 -5366 -4986 -1698 3341 -1240
20110 -1240 -10443 -5678 -859 2543 1848 -4245 -5586 -3658 -12618 -16847 -8728 136 434 2137 3684
20095 3684 -39 -1732 -6730 -8281 -9959 -8531 -16409 -16831 -7974 -4208 -908 -4339 -10769 -13268 -15712
20080 -15712 -11013 -6163 -4199 -3585 -7461 -5567 -9685 -2968 4063 12534 9062 8722 10973 9580 10084
20065 10084 5306 4625 -1188 -4573 -5063 -8395 -9025 -1313 1602 3201 5556 12205 10087 -425 -2734
20050 -2734 3179 -372 813 2285 -1214 -5910 -4101 -524 -2751 -1739 -557 -1404 -5792 -2545 -1151
20035 -1151 -3396 -4514 -7383 -7205 -9269 -11319 -11097 -5480 -8749 -16792 -16775 -13880 -12621 -8638 -4319 1053
20019 1053 415 -1086 -4241 -9981 -8300 -4167 -317 -1170 1168 -2574 -6363 -1404 3254 3390 3255 7655
20003 7655 8355 2452 418 -5005 -2948 4836 2455 970 -452 -2125 -67 3793 -2865 1806 5586
19988 5586 847 -6473 -4642 -7564 -3497 1736 2901 2263 -5118 -9767 -10757 -16912 -14537 -11374 -9179
19973 -9179 -11212 -5910 -2045 -411 760 6478 7572 1495 -2733 -9311 -15001 -8273 -11781 -12137 -3828
19958 -3828 -4153 -5543 -8203 -6761 -3959 -1512 3041 2982 -484 687 -7220 -10187 -7977 -4154 -1872
19943 -1872 2019 5365 2870 -1072 -726 1899 6807 4805 -1869 -1745 -4779 -1362 3605 5127 951
19928 951 -337 5088 3617 457 3138 969 -1562 -4533 -4096 -2662 796 -2661 -1063 829 2568
19913 2568 2901 2529 -418 -5743 4936 10085 12873 10550 7586 4577 1614 -1159 -4683 -9744 -9712
19898 -9712 -12098 -14227 -17623 -10039 -1571 -6866 -5522 -2514 -6353 -8255 -10290 -6802 2831 3291 -5320
19883 -5320 -3937 4065 3737 -4417 -4639 -4733 -10381 -9048 -2768 -1428 1864 -1861 -7899 -5696 -7151 -6203
19867 -6203 -6978 -5361 1421 2293 3922 6520 1382 1568 4590 9225 7671 4463 10065 11608 8224
19852 8224 3747 845 -3513 -6508 -9132 -9316 -15187 -8422 -4371 -3601 -7707 -10256 -10014 -13767 -13845 -10724
19836 -10724 -6982 -5491 -6429 -9750 -14428 -9327 -10466 -14451 -16476 -9419 -782 -3650 -9850 -11035 -11039
19821 -11039 -2629 -1249 -5453 -6981 -2030 2380 2439 2758 -6509 -12537 -4195 3439 1276 -2970 -2412
19806 -2412 1601 7104 5364 -2111 -4828 -1170 -5814 -8643 -755 -1776 -7295 -8867 -8777 -6990 -4174
19791 -4174 -3981 -6946 -13882 -13998 -9414 -3008 1891 8747 11539 8533 4940 -2504 -6618 -10136 -6741
19776 -6741 -7878 -10650 -13397 -16243 -10940 -5165 -1960 -769 -5879 -6355 -6969 5660 14352 11062 14178
19761 14178 7237 5797 6306 4987 3442 1198 2165 4373 7059 7313 -230 918 -1423 -4823 1739
19746 1739 -3462 -8607 -11176 -6711 -10477 -12984 -9717 -5575 -5946 -3818 -1417 -7324 -8468 -4186 -225
19731 -225 3143 982 -698 -5806 -7854 -3454 1900 3806 2640 5530 9999 6054 4677 -696 1736
19716 1736 4378 3904 9516 13979 12496 8591 1548 3319 426 3798 4601 11448 7522 -901 -5397
19701 -5397 -3614 -5952 -3686 7635 8018 8501 8250 3214 -997 -2938 1432 6215 3261 -2825 -593
19686 -593 5468 7297 2868 -2725 -126 -5518 -11584 -3043 -589 -4525 -5818 -7973 -6931 -7512 -6509
19671 -6509 -5420 -1868 -4471 -2875 933 7249 2765 -1327 1063 9154 9361 1999 -8835 -7519 -1761
19656 -1761 -538 -592 3918 7206 5795 1396 -7174 -12027 -9872 -4739 -5144 -3234 -469 2776 9184
19641 9184 16277 11091 6957 5025 8099 10434 6148 5498 6137 3313 -4168 -7417 -6915 -3155 3059
19626 3059 3934 2081 1168 3196 2799 -6387 -11210 -11894 -10722 -10350 -4457 -4418 -3362 -4295 -2075 -281 -2173
19609 -2173 -5123 -4949 1118 2181 -672 -1045 -1714 -4291 -6409 84 -3879 -9421 -889 11749 15742
19594 15742 17398 12882 5007 2558 820 1442 3542 4982 -2769 -4346 -1879 -3011 802 1614 -2086
19579 -2086 -3154 -3111 -9117 -10457 -11756 -5186 -1371 3280 2890 4777 3268 357 310 39 -3285 -2025
19563 -2025 -1969 1103 -8310 -15731 -11417 -10683 -7379 -2047 1603 4824 6893 1695 -1329 -378 -1037 -708
19547 -708 -2159 -4942 -8644 -11689 -9066 1811 5238 -1328 -800 -843 -390 -2666 -11662 -21750 -15924
19532 -15924 -7655 -6285 518 1080 -1316 -1108 140 747 2406 10574 13817 2174 -2607 -3040 -2042
19517 -2042 -1739 1743 6503 9499 8517 5771 654 2028 6440 5458 7063 9282 3759 -1248 2528
19502 2528 2215 -205 -1799 -3483 -1656 527 3782 -211 -3848 -7181 -13004 -13141 -7751 -5472 -5580
19487 -5580 -4241 -3738 2128 7108 6364 9116 6090 4239 1173 9342 8767 424 -4624 -5175 -4854 -1457
19471 -1457 3257 721 -6494 -7511 -9932 -2394 5465 5097 3716 642 673 5221 8084 5018 -2452
19456 -2452 -6368 -10798 -3197 8701 8335 3267 713 -6696 -10963 -2452 3622 9677 8127 -321 -926
19441 -926 139 4506 2288 -1376 -673 3265 6409 -5811 -7795 -5156 -7921 -10009 -1558 3677 1902
19426 1902 3359 5259 6121 334 3497 8423 9965 10007 9086 8847 10014 4381 -1203 1626 -5405 815
19410 815 9697 1652 -7160 -7407 -5993 -9536 -17603 -19684 -16901 -14655 -9445 -4851 -3126 5024 2393
19395 2393 -6259 -271 7027 1979 4335 5277 6636 8536 8922 8617 13268 8929 5422 6548 12946
19380 12946 19875 11016 2157 -1077 -3437 -870 1319 -1729 -3080 -1483 774 -1890 1429 2069 -4279
19365 -4279 -10558 -13243 -7707 -1806 6076 7842 9199 5669 6624 -183 101 530 -832 -3235 -9045
19350 -9045 -10580 -5451 1049 -1618 -2243 729 -5603 -5341 -6252 -9882 -10498 -3583 1815 6276 95 -7077
19334 -7077 -969 -224 -5334 -3623 534 -2089 -10164 -12762 -9806 -12274 -6130 1715 3742 4977 3123
19319 3123 -1060 2599 3390 1898 -400 217 4895 3186 5690 8985 7672 4869 -1187 -11549 -8945
19304 -8945 -4580 -3526 -3612 -3818 -251 7031 8090 1257 -3824 -5041 -9043 -5674 989 -803 -3922
19289 -3922 -7572 -9072 -9654 -5524 -1820 -5547 -7383 -10262 -10803 -5177 -4554 -10302 -6006 -4225 -4015 -6339
19273 -6339 -11534 -14869 -10972 -2411 -2857 -300 -6124 -2920 1611 8627 7426 5317 -10 -841 2127
19258 2127 -3563 354 10506 4514 1372 -66 1772 9950 18095 21857 9596 1183 972 6463
19244 6463 10431 11726 4866 -2004 -3180 -2069 -1688 -3420 -5735 -6417 -11716 -13447 -8936 -6117 3331
19229 3331 7744 -80 -6647 -9177 -16051 -17126 -11062 -7596 -10377 -13557 -10790 -11195 -7459 -1362 2538
19214 2538 1149 -2845 -1238 537 2480 -1043 -5041 -1792 759 282 1789 2792 4375 2981 -984
19199 -984 1416 -5031 -8535 -4670 -2989 -5168 -6012 -5822 -6228 -1020 -2752 -2343 -2850 -10891 -8664 -7300
19183 -7300 -1250 460 -604 7572 4511 2543 6609 6038 8707 7318 9389 11474 12424 12499 8799 4086
19167 4086 10445 12979 10593 4359 2868 6855 6093 4460 3725 6355 7480 -29 -5379 -2755 -5284
19152 -5284 -10341 -668 4354 5493 8320 7786 7990 4081 2690 5112 8494 11872 8664 9241 4671
19137 4671 -500 1299 5661 717 -4015 3095 9218 3249 -7020 -12089 -2063 8486 12363 5953
19123 5953 7680 7157 7267 2416 832 490 2895 720 -3092 -5492 -7335 -12565 -5278 -5140 -3202 -7857
19107 -7857 -8809 1705 -412 -3943 -3324 -1086 3059 6939 11092 4138 -2978 -3051 2348 7663 3912
19092 3912 6083 6962 5608 11091 7645 1979 2045 -4338 -6544 -6354 -10670 -6558 -5894 -9835 -13702 -10433
19076 -10433 -3089 -5843 -8459 -10664 -10616 -8568 -12896 -12573 -7051 -7656 -10702 -12719 -6485 -3468 1190
19061 1190 2325 8058 9846 7131 303 3528 2134 5203 7262 5885 1346 6387 13823 6744 167
19046 167 -4442 -6858 -3195 4424 -203 -576 -148 3762 382 -3243 2753 -2656 -2726 395 1134 4550
19030 4550 11192 12130 9607 9583 16869 16271 7153 4194 949 4357 13593 12321 1551 -1364 -1149 -92
19014 -92 1324 219 489 7856 6476 540 4753 9385 3420 -3587 -4422 2385 8245 2437 4034 6394
18998 6394 3462 -2930 315 6250 8473 6948 3984 -2007 -10452 -13506 -5591 3333 653 -4350 -4365
18983 -4365 -2972 -4476 -5792 -589 1493 4741 3797 4390 -566 -11948 -17096 -13624 -9799 -7236 -7883
18968 -7883 -9589 -8017 -4632 -4175 -221 -2392 -6723 -15225 -10093 -4359 -3428 -3111 -2285 -4316 -3964 -919
18952 -919 -1243 5419 6214 1305 -3161 1684 7153 7003 9837 8759 7688 7989 5757 9183 5232 3978
18936 3978 2943 2704 692 998 1060 -877 -479 4148 1697 3054 3154 -7525 -8587 443 8258 8195
18920 8195 8022 4739 3435 4712 7374 4925 1377 -2851 -3190 -6052 -5765 -8980 -8715 -7927 -1563 2454
18904 2454 -124 -251 2252 2486 34 -3730 -13337 -14298 -11292 -9428 -9910 -5272 7456 12073 6394
18889 6394 1890 3838 3126 764 1383 1175 2768 4037 4604 5363 8049 3642 1325 2436 417 7846
18873 7846 11522 4388 -1857 6635 8863 9191 4321 614 6350 8764 5518 5187 4726 6823 10103
18858 10103 4881 -124 -1210 -556 -2594 542 3276 1843 224 -2670 4251 6410 11243 9567 8265
18843 8265 8021 9167 8251 1753 -219 -8413 -8838 -5673 -2856 -323 1750 8222 8924 11062 8335 4923
18827 4923 6190 2874 5382 8944 10365 4083 5676 12435 9102 792 -3904 -11376 -8369 -5510 -2400
18812 -2400 2194 -1221 -9407 -4775 -3172 -1549 -3536 -7200 -3759 3067 7534 -634 -5404 -5463 -1828
18797 -1828 -1246 1140 8723 10207 8434 6898 5326 1206 -2512 -1376 3452 6811 2372 4304 1683
18782 1683 961 -652 108 3828 7741 7782 10140 6968 7486 7765 1940 1688 14045 33194 55183 70362
18766 70362 57705 41532 23794 13336 17200 20945 16867 13154 3352 -2676 2386 5207 11736
18753 11736 10438 7593 300 -924 5502 7496 7063 2133 -2818 -1505 4150 9483 9456 4415 4755
18738 4755 6307 8271 1813 -827 2652 471 113 3946 -102 2978 4609 5564 606 -9008 -9670
18723 -9670 -4616 -1294 -1780 -574 2492 2681 4686 6369 7449 10321 10930 6440 4237 1803 4378
18708 4378 5802 8787 12980 7316 -256 -3750 -10455 -11282 -7898 -5149 -4327 -2206 -3322 -5263 -6516
18693 -6516 -4233 -1659 601 -1256 122 -490 834 -3394 -6370 -3766 1438 4493 7787 8951 6100
18678 6100 3432 4686 1174 -1402 5556 5609 -145 -1421 -7416 -4703 -5946 830 4580 -967 -3348
18663 -3348 -1534 -538 -534 -3001 -6048 -8403 -9391 -9498 -4856 -366 -1750 -4845 -7535 -7357 -6292 -3238
18647 -3238 -2888 -919 3279 4289 3832 2037 571 7541 8607 5482 6028 5374 1995 3723 -78 413
18631 413 4113 2949 4217 5841 8008 10558 12262 10168 10885 8355 5271 -2837 -5787 -12 1625
18616 1625 8460 14886 11202 5574 6179 8967 11210 14059 10613 3031 -1306 1149 528 2519 1772
18601 1772 9 -3728 -6649 -7376 -2145 4027 1830 1423 476 -3140 -2159 -5619 -10960 -3948 -2716 -7228
18585 -7228 -8108 -9232 -905 964 -2291 -54 -1546 -1086 -1618 -1188 6091 1655 -272 -324 -44 4698
18569 4698 3016 3029 -833 368 3219 5467 1152 1316 5757 4068 1749 -300 -3320 -5775 -6005 -1427
18553 -1427 624 1757 -4691 -1207 -4669 -1691 5663 4786 -1761 -3393 -1418 2127 4184 -2893 -12402
18538 -12402 -7093 -2631 -6427 -7141 -743 3328 5651 -1650 -7718 -8769 -8886 -6529 -496 7102 13643
18523 13643 19906 20975 12379 2883 1914 4958 11371 13907 9564 1494 2867 6280 7129 8755 7357
18508 7357 2960 -3284 -4940 -262 -4517 -3244 3658 7923 12528 15726 9287 5290 6841 9766 12757
18493 12757 9777 3966 4495 2542 1700 -5612 -6449 -1772 2913 -972 1663 408 -2413 -4897 -4738
18478 -4738 -2378 -677 382 4506 7117 6006 5526 4980 5053 4387 2671 -2620 246 5459 3211 3198
18462 3198 8305 8062 3428 1135 5999 7122 7864 10728 8509 2380 1405 -4183 -6238 568 1935
18447 1935 2938 1837 3820 5472 5981 9270 10690 11522 8469 5313 5126 1308 6455 7767 -630
18432 -630 -3022 -2059 -4828 -4363 303 8049 488 2626 6874 8508 5636 3530 -1959 -2663 -1675 -330
18416 -330 -569 1718 8291 15669 13042 8220 8207 12546 13510 7814 -4244 -4289 4819 6086 206 -4943
18400 -4943 -11191 -14065 -8461 -7335 -7823 -604 3420 3959 3237 4230 6879 784 411 298 1375 1850
18384 1850 456 3989 5440 5111 -6052 -5119 4014 3896 4698 11873 16889 9148 9087 10952 10204 11726
18368 11726 12610 17371 16884 16729 17198 17999 15090 17578 15421 19000 19476 21626 21309 13990 6183 6089 7714
18351 7714 7799 9967 679 1911 9619 5969 1774 6839 8905 2307 8332 12063 10052 3393 -2909
18336 -2909 -6722 -13550 -14705 -9422 -2223 -79 7892 7104 12015 14185 13134 9250 9071 14326 5792
18321 5792 -3770 -2753 -3058 -2054 3701 9192 15791 20456 14285 2346 253 1217 -2006 663 1561
18306 1561 -1413 -6420 -6581 -2052 2100 2914 -504 -671 7985 11890 8112 6385 -1225 -6419 377
18291 377 4045 1964 5708 9326 5443 4145 7159 7950 1413 -5760 2470 14311 21360 20938 21472
18276 21472 19253 17918 22895 23871 18250 16436 15877 13239 11822 14571 19791 22711 14423 9916 17428
18261 17428 21146 18053 11026 12405 13369 11924 9198 13511 17645 27301 41514 68173 93121 96349
18247 96349 86583 89670 98994 97042 86184 73114 61849 51665 48587 67382 88912 101697 98929
18234 98929 97537 101981 103282 96923 76128 50550 31187 22428 14487 15707 14253 19064 16945 14887
18220 14887 12912 12863 17045 21470 21591 20655 22201 19757 13317 13140 15310 18217 20459 16896 11054 4372
18204 4372 942 5838 5967 7039 7002 3272 -986 1471 4317 7810 1121 -3064 1930 2518 5261 6655
18188 6655 3960 3634 12175 14922 10504 7223 9775 10741 9855 13391 6446 6879 12922 14785 15199 19868
18172 19868 11249 8688 17493 22726 15798 14299 16498 13456 17232 22874 22554 23369 21627 16376 22048
18157 22048 27842 26895 26259 32427 37999 40564 35671 27680 24310 29152 32949 30178 35932 40516 42646
18142 42646 44922 42968 37853 37437 44874 52404 57536 68904 71123 68430 71465 83620 97564 105700
18128 105700 114445 119209 134147 159016 184162 207451 232875 268169 318423 386272 486994 618872
18116 618872 805538 1084438 1549022 2351365 3781369 6253070 10030014 13795615 12989007
18107 12989007 8580491 5085592 3147619 2116869 1536280 1172478 934796 764069 629952
18098 629952 517360 433924 375181 332060 297856 272879 246979 225678 205901 182524 168306
18087 168306 159127 150396 135905 120154 115695 109734 95586 100054 105110 109369 102006 91934 91801
18074 91801 97256 98687 100252 96748 90637 82619 76405 73096 69455 70401 68799 62265 66772 70875 72648
18059 72648 76852 88716 97596 109818 114548 114364 118905 126945 127677 122934 111240 102041 93565 86604
18045 86604 75083 61280 47345 43848 46010 52484 56799 48486 45003 39796 32970 33065 35257 32360
18031 32360 29968 30706 27860 29729 29216 27566 25343 27704 31132 40641 44234 39242 38199 37672 38531
18016 38531 39696 33153 24040 23951 28699 29844 27370 23948 22620 20180 18560 17103 19025 21392 15682
18001 15682 15354 14225 22960 22292 18590 14237 13231 13306 9333 8563 12232 12263 11884 13772 11734 2563
17985 2563 986 916 -4012 1323 6023 12804 13833 14028 13959 16740 12110 14274 18934 19560 18123 21393
17969 21393 17875 12877 16646 16822 16546 11795 8080 10907 15804 19507 23003 24155 21881 15645 14685
17954 14685 12006 7502 6938 8143 4321 6211 12668 16253 17352 15534 17204 19591 24806 22774 22432
17939 22432 26382 32932 38852 51168 56746 68485 85119 96846 116369 138219 155587 172482
17927 172482 170618 165091 173271 183867 194185 193901 192958 194148 195992 196498 207561 216017 221808 229497
17913 229497 219196 201659 195446 199036 199301 191928 167120 136476 115695 113482 110884 107291 99893
17900 99893 91772 75302 57730 47810 44655 36571 29814 26711 22482 20267 17778 17503 15976 12856
17886 12856 19349 27879 36087 47463 61878 65248 63516 63068 76213 89457 97862 93330 86018 85569
17872 85569 87230 87295 87098 84003 88896 97372 94500 90510 97946 113554 119257 110541 95505 81518
17858 81518 81981 90309 87577 76555 69242 65246 63365 61376 63442 64467 62302 63261 68538 72416 85817
17843 85817 100868 115126 133949 149786 160357 165036 161753 149519 137926 122893 106189 95506
17831 95506 83968 74079 73808 75083 75828 80363 84481 90076 89145 97691 116287 132266 136058 132721
17817 132721 114256 97773 73643 55090 49863 46104 47485 44216 33115 32867 36403 31051 29111
17804 29111 27001 27863 26673 22228 22460 19871 21148 27903 25862 25513 23483 20103 23519 25163 18889
17789 18889 19791 23925 22339 20296 16995 20062 27267 29495 33175 28016 29358 28617 27966 21432 22883
17774 22883 36754 48029 50685 54226 46580 41455 44187 46259 47815 50310 46669 48167 37951 32218
17760 32218 30204 30210 31837 33861 31180 31074 34786 44281 56786 62328 57656 60802 67593 62725 49592
17745 49592 49903 53732 51577 48276 45810 42638 42848 42099 39543 41873 44603 38022 34888 36652 35780
17730 35780 41481 46075 53871 51622 41314 32161 32146 33812 32097 28253 23557 21007 13875 19320 24240
17715 24240 23179 24413 19462 21289 28193 29448 30304 32311 30019 24803 21101 22373 22601 29426 30067
17700 30067 29929 36756 40492 43748 55321 58580 60847 59265 53260 50774 54291 50567 55444 54672 57903
17685 57903 67820 75174 81581 94010 109171 123373 125610 125448 125239 115659 107844 100764 97943 88772
17671 88772 80039 78820 96134 108783 116645 115730 109722 103423 84642 67419 61704 63125 61520 61580
17657 61580 59901 61198 59390 63382 64100 66483 63172 64030 57200 51466 49960 46978 40937 42324 43668
17642 43668 38447 47475 53074 51452 50888 51575 54332 61767 61052 62776 66446 67592 60129 57927 58406
17627 58406 69498 91976 107681 110510 107806 97784 88197 85858 75020 68648 66683 67784 72251
17614 72251 78778 90303 102569 104208 95968 90806 75515 71256 63830 61387 55992 54733 53441 50198
17600 50198 49979 47085 51325 54709 50943 43888 31751 32215 40493 51111 56224 66243 69487 64236
17586 64236 60435 56159 55393 52918 49792 47937 43595 42912 44701 45930 46529 37629 35541 37185 53292
17571 53292 60998 57587 52886 54029 54647 55166 60868 65013 66222 70216 71521 66981 63536 64845 63863
17556 63863 59713 56793 56960 61742 69385 75544 85433 91910 90087 87438 85163 89858 96897 104069 108177
17541 108177 103248 95844 100208 102987 97708 99662 101895 97549 90650 92232 91458 85153 85760 87992 82961
17526 82961 84906 90372 89947 80197 77234 75664 80366 82422 77788 77683 74196 75183 71576 72720 72818 77970
17510 77970 79285 75643 76063 85654 92545 97569 101854 101472 105103 110085 113324 112288 116428 119152 123086
17495 123086 128260 126329 125299 122675 119144 123174 128410 128712 135400 135890 141723 153901 155702 159533
17481 159533 164650 158739 171268 181040 185661 191457 195363 200663 204959 208308 212892 217678 225942 234574
17467 234574 243554 253573 265637 278804 284867 301594 318939 331287 342498 351974 363165 372525
17455 372525 386285 413657 439669 477133 523917 585633 650288 718826 795852 862920 934290
17444 934290 1042084 1181703 1304988 1376534 1415904 1458004 1548097 1689385 1863232 2056475
17434 2056475 2290884 2593047 2992916 3574293 4427575 5595685 7147976 9250148 11878297
17425 11878297 14715402 18236731 23608591 30751620 36895824 39168868 40040266 42682084
17417 42682084 48331510 57268760 63880463 60450006 51961660 46496707 44292433 43151480
17409 43151480 41356766 37268590 32329746 29470732 28609688 26478752 21813412 17253686
17401 17253686 14369701 13078823 12976998 13400821 13059255 11267203 9003489 7102855
17393 7102855 5696429 4753974 4167879 3793487 3517207 3270360 3062653 2922321 2860433
17384 2860433 2887233 2997785 3200029 3550965 4163638 5175623 6768765 9024261 11565465
17375 11565465 13370221 14212135 15461379 18074078 21084727 21623510 19015003 16239054
17367 16239054 15035384 14822786 14075314 12511381 11335566 11004076 10814550 10417363 10522295
17358 10522295 11598358 13010618 13023689 11240493 9404667 8450277 7957492 7041934 5555001
17349 5555001 4137609 3132192 2468666 2025286 1729846 1524119 1368253 1228131 1102733
17340 1102733 1007536 936935 866494 792930 729248 670770 625805 578997 535356 499933 481540
17329 481540 463278 431733 401382 370486 348244 332271 314556 299675 286165 270760 257608
17318 257608 243662 228506 215004 202560 200192 200125 197437 185629 166974 160962 156144 148104 141066
17305 141066 138326 134663 131112 129609 120280 112948 108207 101336 86288 82680 82598 82692 80420 77971 71151
17290 71151 64509 59327 52974 57519 67378 67543 63078 53780 56784 58776 59862 62724 61472 55299 54268
17275 54268 53971 47849 44606 44576 48952 54626 53807 49856 50554 50194 42678 42784 44614 40793 31778 32092
17259 32092 42514 45406 47170 50643 43014 37766 39661 39153 32609 26401 22374 16414 16051 23541 32561
17244 32561 32643 29161 32120 34740 31992 23822 21468 32340 36323 35141 36874 37733 36428 41501 36943
17229 36943 26862 25296 30310 27420 31044 30084 30817 27862 25860 19699 18745 16641 27269 35703 31594
17214 31594 33631 35600 41704 55752 65106 81876 107267 150844 180757 197961 209898 205797 185218
17201 185218 157228 137025 116320 95545 81714 70695 64619 69568 69308 72665 76554 74444 79399
17188 79399 79335 77302 75788 69012 62846 47964 36571 33518 29854 36120 34253 29449 31482 24426
17174 24426 24046 25640 23395 23533 24003 31220 33735 35383 36414 33197 38370 41182 40595 39601 46135 44488
17158 44488 46484 48443 48870 53925 61774 60767 70281 87807 111780 132169 141313 134242 125963 112329
17144 112329 93675 76586 61987 44156 31264 32069 29330 31459 33014 32191 27973 21345 19110
17131 19110 23232 16905 15188 18164 12812 9280 13266 14129 7839 6384 5358 2561 6418 4691 4909
17116 4909 -238 1949 12282 10829 11447 14450 19623 13657 4551 264 66 5532 5774 406 -2796
17101 -2796 324 9769 15696 12794 6428 1487 1559 189 6277 10041 7250 7763 15054 19396 20294 26716
17085 26716 25224 22158 17139 19583 15031 13076 10132 8526 14622 12317 11701 14719 8631 -1026 -5217
17070 -5217 482 2739 4148 8007 7891 1292 -3466 1176 8810 14964 12669 2862 -8515 -7313 -1877
17055 -1877 -2476 3812 4667 9619 4742 -3173 -3078 2942 6434 5839 11961 13034 10210 4850 3332 6282
17039 6282 11449 13658 13231 16284 14391 4405 3060 3909 1676 -4068 -4768 -3564 -3906 -631 3866 4187
17023 4187 7362 4990 2992 8731 10942 3137 434 1358 4189 -2979 -12392 -4479 2520 6475 13744
17008 13744 12460 7022 10232 14091 10251 12940 13133 20518 19692 13686 12499 14250 12722 13900 4744
16993 4744 4833 7876 3964 6145 3796 5649 12324 12962 9894 13911 15357 15053 9213 13564 7826 -342
16977 -342 6340 10807 9118 5321 3216 854 7930 7521 10434 12599 8940 4533 -1199 1229 8074
16962 8074 8975 15701 27345 37646 41590 45052 43490 39179 36610 36575 34562 30106 33849 28849 15474
16947 15474 17341 24250 24952 27734 20778 16991 20601 19404 14079 15541 21465 24772 25336 27399 21978
16932 21978 15690 15984 19756 19524 20079 21249 23867 30641 37985 42526 54572 69646 83541 103174
16918 103174 118479 137146 159500 169624 173512 168077 173671 189641 203115 205610 206804 209357 209472
16905 209472 216225 229415 236189 241621 246611 236813 221485 208159 208555 204502 184754 166918 156806
16892 156806 134681 118211 110829 105589 96647 84613 71996 59939 52197 51767 44534 33710 30568
16879 30568 32394 39337 41778 38763 35850 36087 35801 36963 41476 57081 71966 79540 91253 100443
16865 100443 102636 115297 129016 125019 114411 102485 102138 102927 100073 94292 94621 96806 94012 94095
16851 94095 105626 123340 141576 139735 120792 105695 101362 89249 72153 55814 44972 46206
16839 46206 52133 51562 43351 45751 54193 60389 64727 67376 62900 63905 60227 58577 53273 47522 44810
16824 44810 50044 55934 50594 41287 40064 42540 48853 53616 47950 46486 46176 42749 42374 50661 59841
16809 59841 79744 103093 122125 126182 121918 119619 115764 118682 128026 137472 131574 119672 114019
16796 114019 114936 112589 102839 96203 96019 94112 96265 110326 118724 133149 147485 142176 136705 136440
16782 136440 147626 158989 148408 120477 96815 99048 104418 110880 120389 131639 131157 131839 133949
16769 133949 131375 125219 106745 106383 106826 93561 86583 83890 79598 82409 91174 94349 93325 100387
16755 100387 107720 111427 124931 134494 146647 149967 151091 160535 180399 191690 202762 209365 208390
16742 208390 212877 216174 219230 227686 250735 271841 302368 331419 362947 385783 398984 412144
16730 412144 425016 433840 451058 480896 513513 553619 613913 682924 745379 806188 864945 923515
16718 923515 999917 1110429 1265348 1492126 1819728 2295349 2998005 4077191 5738978
16709 5738978 8163229 11412233 15284296 19297398 22803138 25297815 26481988 26144324
16701 26144324 24337464 21352436 17773269 14348170 11643273 10041398 9670034 10418920
16693 10418920 11850497 13190700 13577374 12617677 10541736 8093745 5953721 4403367
16685 4403367 3394927 2754650 2333052 2023481 1789865 1613614 1497378 1417700 1366707 1326853
16675 1326853 1292948 1271815 1260702 1263100 1274083 1313041 1377264 1484237 1664779 1944134 2369407
16664 2369407 2984063 3792977 4745327 5767810 6829182 7870781 8764551 9301904 9441182
16655 9441182 9361697 9353487 9644625 10482781 12132571 14661898 17748326 20772835 22879247
16646 22879247 23500583 22525980 20301828 17367342 14216220 11265629 8760574 6735577
16638 6735577 5130983 3899620 3001723 2365696 1920739 1616007 1406519 1262894 1144868
16629 1144868 1048857 973652 903537 830079 758342 691296 633122 582029 539530 508608 488969
16618 488969 474198 456615 433266 404017 374573 340921 312549 278707 253021 233568 214016
16607 214016 191207 177377 168799 165011 157237 151489 140932 130362 125399 124172 119655 117630 108119
16594 108119 103536 100908 97775 88098 86135 85199 83325 76426 68219 63604 63402 63204 65084 59682 57640
16579 57640 50559 45928 46228 48224 46245 45802 50644 47687 43009 41396 39463 42366 40472 38656 38851
16564 38851 40839 41373 38495 38358 39898 37938 31193 30126 32734 32965 37994 31281 26000 26479 31055
16549 31055 37344 38573 33896 28697 24321 21713 20186 20109 11237 9324 8192 8656 13669 7337 3382
16534 3382 7006 12363 11575 15952 14063 12171 13997 19766 21236 17152 12565 10948 2470 1497 1239
16519 1239 7034 5720 5285 8754 9478 9358 9569 15767 10505 2423 -660 -3773 -2336 916 -4601 -1886
16503 -1886 2232 8508 9363 6814 4487 4942 9074 3711 -1346 -6651 -490 11147 3414 -1650 -1131
16488 -1131 -4240 -5101 -3666 -4446 -2276 1900 582 3065 6077 9853 11536 8340 7344 1302 5340
16473 5340 8989 8222 4461 3822 6357 8160 9203 7061 7183 2680 615 -4697 -7014 -6090 2512 5423
16457 5423 985 -2642 -1579 4119 2698 691 1243 1933 6351 13683 13733 10547 11115 9625 -1298 1093
16441 1093 4848 1704 4883 6051 -853 -2738 -1675 -1608 -3269 -8581 -9217 -9433 -7484 -3549 -4513 -429
16425 -429 2441 -2899 -1313 1181 1831 4997 3025 -2754 1165 -1715 -4129 -2901 5191 5645 3933
16410 3933 -1038 -4981 -4381 -6451 -8924 -3205 -543 3420 3265 2831 3575 7092 3131 4248 9158 5875
16394 5875 4667 1411 2138 403 1308 -7481 -10101 -7796 -2510 2896 2530 4156 1164 8197 8861 5834
16378 5834 3173 -2555 -4625 -3144 502 -4499 -2359 -3546 890 3590 -6806 -10732 -8633 -88
16364 -88 -4604 -11112 -9440 -10640 -3691 1544 5638 -3366 -8843 -7642 -10086 -9630 -10367 -8921 -3796 -8388
16348 -8388 -8369 -12109 -8259 1870 8145 916 -2269 -7756 -4466 -1969 -3051 -1947 -220 1305 -3295
16333 -3295 -3411 -2650 3610 4938 6254 2649 6976 7898 6935 8687 3707 -7457 -9131 -1673 -1982 -4020
16317 -4020 -6476 -7019 -12436 -16960 -19960 -14540 -6204 -3559 -10157 -10015 -1629 -2643 -5133 -824 -262
16302 -262 -1498 -1604 -7058 -5121 -2578 -6216 -12228 -18733 -15146 -10562 25 2536 12 -3004 -533
16287 -533 -1618 5970 4680 2370 1229 1373 2849 3474 7713 15163 16468 10849 6522 3761 4582 10295
16271 10295 8731 5833 903 -131 3459 7148 12566 13976 17020 21002 23124 29626 33091 27682
16257 27682 28367 29494 25903 27556 27633 25777 30982 30169 34008 27375 22135 21355 21445 19308 18372 17191
16241 17191 15177 16961 20708 19874 14033 8553 9328 11799 14646 5514 579 1413 2727 1436 6679
16226 6679 9213 10703 6848 7781 9709 11332 8093 8261 5201 5047 6957 7881 5072 7057 3643 3312
16210 3312 953 4755 10397 8950 8230 5793 12595 24875 33817 40327 42619 47752 53319 66571
16196 66571 87774 106593 119964 120210 120062 115674 108346 104459 114655 115658 112394 101921 89677
16183 89677 73004 58129 42008 25072 8387 5548 485 3392 5383 1667 2990 1355 405
16170 405 5365 4273 -2285 1050 7151 5706 10363 16108 12070 5753 5018 3729 -1583 -5223 -3766
16155 -3766 -2366 1220 6574 12846 22715 25915 33693 44787 58418 67999 80375 89236 96584 97715
16141 97715 107936 118446 119319 115881 109463 98038 86951 68340 52731 39489 34163 35856 34075
16128 34075 35662 34776 27948 19237 4902 1285 3455 963 -3762 5958 4920 2691 -707 315
16114 315 -5040 -5111 -2503 -206 2243 -2948 -5212 -5053 -10711 -12109 -14196 -13866 -12146 -13101 -5837 -20
16098 -20 591 -3389 -4820 4638 8274 8529 6893 2914 2991 3994 -393 -3837 -10135 -14726 -11135 -12812
16082 -12812 -15079 -4782 3285 4629 1726 -45 1802 1064 1029 -459 -3315 -11777 -13256 -15811 -7607
16067 -7607 -10441 -8278 1964 -625 -3907 -5734 -6892 -4061 162 -6342 -10982 -10979 -4920 -1458 6421
16052 6421 10683 13676 5848 -5763 -3311 4361 8498 10265 6425 9071 3086 -269 -7761 -13613
16038 -13613 -10888 -6097 -405 -3575 -3191 -1204 2910 5228 9611 3788 252 -3202 298 -5584 -12812
16023 -12812 -18253 -10180 -72 -711 -2604 -4619 -984 59 -3161 -5698 441 -1134 -5658 -383
16009 -383 4595 2068 -2026 -8790 -5656 -4268 -5114 -1361 -1746 -1501 -3543 -2388 -4767 -3851 213 -542
15993 -542 -6555 -7056 -1989 782 131 -37 1441 1540 -911 -2103 -7756 -2677 -351 -891 -5081 -5166 -3020
15976 -3020 -6975 -9035 -10227 -4217 1938 -4239 -6620 -137 3095 383 919 5055 7629 5753 7336
15961 7336 6873 2869 -71 2678 12267 11095 4331 -5672 -15853 -4420 6196 4494 3415 -1083
15947 -1083 371 -8623 -11574 -8972 -1664 1417 -916 -1342 -6743 -15284 -11389 -754 -2709 -4229 -5423
15932 -5423 -8779 -5956 -10061 -13067 -13844 -15550 -13811 -8539 -6152 -5406 -2976 -1777 -6861 -10970 -12728
15917 -12728 -14495 -13222 -7076 -4269 -885 5530 9806 10981 10321 8945 442 -5224 -1462 -4217 -7713
15902 -7713 -9263 -629 9836 9704 2777 -4554 -17203 -17438 -16378 -13329 -10920 -5607 -5356 -7276 -8376
15887 -8376 -12207 -7440 -7183 -15480 -11845 -7109 -7858 -1305 947 -6320 -6841 -9997 -8659 -9252 -8626 -8897
15871 -8897 -7774 -10609 -12916 -10293 -9534 -3916 -4329 -3931 -14640 -14356 -5889 -8040 -9861 -4801 2950
15856 2950 1679 -6418 -4592 159 -1631 -4040 -8528 -9147 -9920 -6425 -8421 -7967 -5706 -3519 4847
15841 4847 4016 5216 -1890 961 6498 944 -2106 -4182 655 1703 -462 -11779 -11053 -7980 -5351
15826 -5351 4253 8655 6044 -3773 -10693 -11415 -9709 -9270 -5623 -6056 -7371 -9614 -928 2305 -626
15811 -626 -5019 -6898 -10973 -17793 -15270 -3404 -843 -6120 -11731 -12857 -11577 -1609 1638 290 -4205
15796 -4205 -6841 -4618 -3387 -6362 -3578 4994 2358 -3119 -560 -3017 -2014 -5194 -5718 -143 5821
15781 5821 932 -4611 -2004 -95 1650 1925 5693 6804 -53 -2850 -5767 -7930 -9015 -5480 -4596
15766 -4596 -3207 -4628 -6118 -2626 2025 497 -2994 -4217 -2924 1943 -233 -4933 -5937 -8599 -11954
15751 -11954 -13648 -12095 -5490 -3471 240 5657 9475 9639 3548 5393 13034 10914 2460 -8203
15737 -8203 -13214 -8380 -5528 -1773 -1859 935 -1488 -11435 -11635 -8332 -8339 -7263 -1341 3546 455 -4848
15721 -4848 -5092 -2351 -7104 -6724 -4448 3213 4745 -507 -6670 -3962 -1051 -3058 -7700 -8202 -5687
15706 -5687 -4036 -7982 -11228 -8159 -1614 -745 879 -3068 -6137 -1152 -1246 -8853 -13499 -8318 -7289
15691 -7289 -11853 -12546 -10745 -9270 -7902 -9891 -10394 -10383 -14870 -11940 -9618 -11404 -9110 -5461 -2730 1716
15675 1716 1931 3933 676 -5862 -4476 -1984 506 3206 5236 3767 6523 8106 6288 611 -2755
15660 -2755 -4974 -6436 -3391 1491 6756 5797 6392 6604 7655 7424 4103 4627 8310 4270 1612 3832
15644 3832 1509 2466 585 -5683 -10622 -7727 -2846 1834 218 -4083 -1171 -1585 4506 7600 3661
15629 3661 4937 3448 3855 333 1864 -457 -3936 -5260 -2947 967 6485 10749 10652 10501 14692 15068
15613 15068 6584 5309 5500 6263 5337 9669 5881 -2351 -2778 -3624 -3914 -1670 -6346 -3223 -2837 -7697
15597 -7697 -5603 -10424 -13601 -6203 -7149 -13234 -12690 -8460 -3127 -3132 -5077 -7293 -4869 -5865 -6597 -1213
15581 -1213 -321 -13753 -14437 -9253 -7467 -6200 -4180 -1963 -1284 -3276 -7245 -4772 -221 -2070 -3507
15566 -3507 -3679 -4107 -5145 3580 13756 17171 11175 6541 236 2682 3148 -1352 3030 5538 4998
15551 4998 4649 107 -1661 -5592 -5133 4051 9218 2483 -5832 53 5517 4776 5791 3192 -4359
15536 -4359 -6821 -14603 -13675 -1865 -4278 -10452 -7123 -3748 4026 5918 -1019 -3752 -2953 -4066 -9463
15521 -9463 -5422 -7578 -4943 290 7214 8002 2696 -674 3371 2930 1334 1442 -1417 3712 11087
15506 11087 5299 -3283 -8475 -5148 -2127 -1501 1256 -5118 -9551 -7051 -220 778 1363 -2662 -4267
15491 -4267 -1385 -3063 -586 -1731 -6556 -10926 -8756 -9460 -6918 -5860 -5097 -3218 -1887 -578 3208
15476 3208 4245 6019 4949 7204 9918 -767 -11431 -15079 -9870 -1606 1329 1230 -3047 -3998 -778
15461 -778 2182 2551 5370 6648 4710 -517 -6328 -6461 -3603 -724 -361 1119 4574 3721 -5488 -8324
15445 -8324 -6800 -6119 -9079 -5675 -5890 -7602 -7435 -13309 -6611 -2619 -6632 -11098 -6560 2762 3423 -3388
15429 -3388 388 4314 4682 2428 1484 593 3034 1892 -4265 4386 3480 1118 -483 -963 3304 7268
15413 7268 4898 1879 4326 -1814 -7186 -1731 6183 4320 3116 871 -2577 3225 3472 6410 3979
15398 3979 -950 -4264 -7158 -6561 -5720 -1595 -4773 -7096 -4546 3207 7484 9141 3260 97 -2399
15383 -2399 -4420 -6734 -11208 -16136 -17390 -6801 -371 1178 1135 832 -814 1696 5022 1923 1495
15368 1495 56 -2051 -10079 -14384 -9939 -13923 -16622 -6905 -781 2520 6867 1261 -5168 2068 3303
15353 3303 10954 8690 -409 -4019 -6333 -7102 -3071 -827 118 1495 -85 -5135 -4281 -4697 -9019 -10936
15337 -10936 -7154 -9808 -12507 -14340 -14580 -8528 -4893 -301 -5783 -4967 -3358 -3750 -9023 -10937 -3503
15322 -3503 -3636 -3393 -6148 -3769 4957 389 -4891 -83 1666 10525 7610 3897 -5036 -13774 -19110
15307 -19110 -20945 -20871 -15462 -19996 -15819 -10742 -6339 -3977 -698 -1206 -2024 3534 1145 -3719 -10800
15292 -10800 -5851 -3372 -2084 731 2946 3217 4672 3419 -4204 -6124 -6847 -9696 -11615 -13392 -7908
15277 -7908 -3573 -5465 -11046 -10291 -4645 -8575 2145 7657 3476 3719 4775 7903 15596 17621 10248
15262 10248 6317 5424 5541 9540 5571 -277 -5352 -6774 -8942 -9665 -512 2953 6708 7978 3608
15247 3608 -2809 5446 12951 6473 -1429 -5897 -4164 5367 11495 7493 4670 6990 6069 6722 2086
15232 2086 748 -1922 -11955 -10678 -8285 -3476 826 5357 4319 587 -560 -461 -2923 423 375
15217 375 -5780 -5515 -6907 -10760 -460 3977 -2778 -5951 -4140 -4267 -3474 -2953 -651 -1548 -7154 -12977
15201 -12977 -11827 -4633 -104 -1065 -1859 -423 -2054 1320 2799 2481 -153 2760 8265 10793 5688
15186 5688 354 -5524 -8402 -10476 -8776 -5871 -3755 329 -2820 -6205 -2821 -2766 -3358 -2784 137 4452
15170 4452 6884 5485 9038 4486 7061 7838 6842 -416 -2384 -459 440 -2760 2593 -229 554 7209
15154 7209 4986 2745 4121 6269 -1017 -5670 -3410 -760 1320 -5623 -7234 -3612 -5626 -3728 827
15139 827 4385 1264 470 1474 -106 6737 8103 7814 2133 2675 -1089 1732 2447 -5999 -3557 -2309
15123 -2309 5011 6498 -721 -5621 -9286 -4177 2069 10086 11513 7714 10072 4407 5231 3511 116
15108 116 1840 1297 4237 2608 -1940 -5490 -8601 -8021 -11219 -17034 -16472 -16571 -14066 -12666 -10520 -5147
15092 -5147 -3185 2230 8202 10983 7389 -2343 -5758 -6896 -5904 -2288 -734 2264 4166 3387 4419
15077 4419 4592 3971 3698 -2424 -739 4196 2489 3103 2668 -1638 831 -1009 -5647 -9836 -1509 6862
15061 6862 11740 9693 -2854 -4107 -5664 -8339 -7760 -7355 -1398 4537 5419 -2823 -5455 -5829 -2874
15046 -2874 5441 3444 2955 13 -5263 -8940 -769 5708 8517 5582 5344 6358 6037 1226 527 2038
15030 2038 4245 -1988 -5290 -6490 -3129 -3724 -13431 -13246 -8314 -3377 -2751 -6503 -8975 -7956 -2584
15015 -2584 -3251 -7430 -2449 4504 -4174 -7791 -1971 -978 -207 827 -9394 -11325 -7997 -146 -105 2014
14999 2014 2988 1050 -3455 -5080 -6263 -10134 -6592 -10331 -7202 -971 4432 8941 8605 8238 10123
14984 10123 3760 643 2196 -1105 -7009 -9222 -13188 -10189 -11829 -10917 -6145 -3693 -1115 223 -930
14969 -930 -380 4263 2572 9191 11191 10500 8368 4668 336 4375 2934 -13206 -11172 -1587 -2502
14954 -2502 715 -8101 -11879 -14100 -8769 -6687 -9036 -6031 -5842 -6685 -3360 -4103 4663 15569 15104
14939 15104 5197 -6753 -2943 5 -1141 -2079 3315 9769 12323 9881 5693 3553 5210 5725 495
14924 495 4297 -5420 -9686 -5755 -6280 -7655 -1035 -2496 1079 4074 4386 -3489 -4218 -10 5476 2971
14908 2971 -7727 -9940 -3662 -1583 320 -1017 -433 1012 1192 -955 -5465 -14035 -9193 -7500 -4184
14893 -4184 -166 -9578 -12128 2718 2266 -491 -11 2468 -5044 -10698 -1496 1008 225 1926 735
14878 735 2154 6136 5315 7275 11953 10828 7409 4336 5520 4854 9065 9486 5727 -1897 -10592 -11660
14862 -11660 -8725 -3588 -5871 -7913 -8925 -11906 -16592 -21266 -24803 -20741 -6286 -3051 -11636 -18570
14848 -18570 -13469 -2957 -3295 1357 1410 -6174 -5280 -6543 -1926 2374 640 -276 1017 2682 4512
14833 4512 7182 -1202 -8992 -12440 -10650 -2531 -705 -3462 -5187 -1764 5303 6786 4202 4023 2804
14818 2804 -2581 -12821 -11663 -10379 -3137 3913 7203 1967 92 -1209 -2201 691 5734 8643 4617
14803 4617 8696 6286 712 -266 1844 8085 10453 5034 -6495 -11148 -11696 -6717 -6922 1839 6893
14788 6893 -1537 -7430 -2906 -2023 -3134 -2792 -2764 1688 -838 157 -2387 -7833 -4671 -1050 -3401 -5490
14772 -5490 -9549 -1555 1302 -206 -4061 -11696 -9509 -4146 1269 5316 2825 -2200 1233 9077 3715
14757 3715 -5733 -7079 -4964 -8167 -8929 -284 2391 1187 -7073 -5703 716 -1385 -8265 -9128 -7557
14742 -7557 -7081 -6111 -3935 -8313 -17122 -11968 -6295 -6648 -8069 -9758 -8338 -4377 -4528 -6051 -1946 1993
14726 1993 2770 5892 896 -1176 -1728 2186 1353 1432 281 -2100 -2839 -5214 -6886 494 5376 3137
14710 3137 5184 1298 -10011 -7349 -2918 -8414 -12316 -11470 -15138 -11292 -12669 -10033 -3641 -773 -7435
14695 -7435 -8478 -3366 3192 2908 7938 3196 -2960 1742 1791 -1389 -434 2676 -2695 2164 4164 3171
14679 3171 7194 7895 2739 -499 -4681 -5860 -7602 -5838 -1333 5092 6270 5579 4870 2296 8196
14664 8196 13362 4109 -2969 -10112 -10007 2171 3167 -1223 3440 1649 -2540 -1876 3917 441 3139
14649 3139 3528 -1279 5591 6522 -5454 -6893 -9782 -9930 -6715 -2680 -3848 -7361 -3698 4970 10117
14634 10117 10664 7756 812 794 702 3396 11474 14456 9568 9315 10392 4475 2372 7632 8510 7624
14618 7624 8168 6645 4269 -3557 -5945 1819 4792 1082 -1802 -3821 -6677 -6995 1969 3616 -391
14603 -391 -2956 2229 3528 2543 4476 559 -4255 -2187 922 -1464 -7878 -7704 -7803 -12009 -5135 -1429
14587 -1429 -5432 -1544 3434 2336 -1005 -2803 4523 10948 7906 903 -642 4227 2344 14597
14573 14597 15673 9613 8721 11737 12300 5728 -2359 2969 12861 13730 12671 11069 453 -2470 -1525
14558 -1525 1428 7840 16353 8413 2765 1654 1939 3644 -338 -6123 -7571 -5919 -1922 -2030 -8434
14543 -8434 -5716 -67 3436 7651 1231 -1764 -1884 3551 10687 8503 3732 5517 5028 2375 4284
14528 4284 2255 -1948 -3255 -1675 1295 -6103 -13512 -15331 -10209 -4464 -7217 1046 7305 9461 9032
14513 9032 5247 -1865 -1676 -5463 -11391 -11827 -11426 -10192 -4994 946 4709 -1076 -4142 -7898 -5707
14498 -5707 2187 9576 6194 209 952 -732 -10553 -10147 -8505 -5864 -2005 -803 1466 1952 3139
14483 3139 3875 10203 11630 4153 -5275 -3520 323 3569 9207 9493 -4854 -10727 -4474 -4702 -5953
14468 -5953 1205 7927 10180 12572 10480 3725 4848 2769 1384 -2435 -4832 3 6084 1541 -2379
14453 -2379 2052 8805 8890 9963 9395 2877 -4479 -4159 2649 11753 8585 5750 5562 -2406 -13709 -10140
14437 -10140 -1215 -4511 611 10549 16646 12761 10164 15480 13568 6990 3801 2908 6986 8420 5981
14422 5981 9066 11691 9922 12479 12765 11710 5000 -1550 4072 1265 3554 4708 1433 3023 -146
14407 -146 -617 -1797 -4231 -291 1351 -980 -3509 -1911 4548 8522 13418 8362 -466 -5859 -7388
14392 -7388 -10563 -13645 -12972 -5445 4183 4901 -308 962 4187 2268 3923 829 -4065 3875 4737
14377 4737 -2041 -3512 1377 3866 3659 5946 5962 451 -4388 -1080 4333 -4827 -4908 1069 5789 10446
14361 10446 7239 491 -5235 -2565 -2230 -2430 2495 5341 -1004 -6588 -8794 -13435 -13011 -8467 -2519
14346 -2519 1858 3892 -630 -4587 -1021 1775 -247 1510 -166 -2544 -1482 -7 -2321 -4623 -2980
14331 -2980 -4057 -1637 -1465 579 1243 4589 -3392 -3785 1000 5307 -1988 -8635 -9292 -8969 -5772 -4363
14315 -4363 -762 5614 12231 14061 7088 6321 11085 14794 16961 9484 3624 -1518 2137 2337 2137
14300 2137 -5140 -6694 -6191 -3974 -7442 -11384 -8521 -9643 -14963 -19906 -11480 888 2961 1356 425
14285 425 6517 2470 -5668 -1998 831 3634 1349 5545 5079 -1219 -4870 -7347 -9655 -7787 -312
14270 -312 -572 -6050 -3426 -5454 -1459 2269 3277 5881 1872 1354 1482 2789 5031 -2565 -7991 -3076
14254 -3076 288 6754 7911 5330 2019 7345 5544 7067 7914 4478 -641 -5012 -4068 -9301 -3455
14239 -3455 4977 3761 4844 5959 5473 5006 5532 809 -5613 -1451 3129 1089 -6 -3490 -6980
14224 -6980 -12443 -8631 -8750 -5998 -4534 -5562 -6478 -8815 -8147 -2138 -249 4293 4140 391 3096 6905
14208 6905 5540 1398 -2200 2377 484 -984 884 5289 12070 9487 7214 5996 1065 -126 8912
14193 8912 7313 822 3474 10385 14515 7795 2338 1936 3975 7402 12388 8892 4496 6800 1811
14178 1811 3397 1429 -1305 -6164 249 851 2461 6386 4939 2392 3336 663 -936 -9976 -7668
14163 -7668 -3446 271 -2775 605 1276 1873 -742 -3849 -1635 73 -1345 -5335 -1813 6522 8590
14148 8590 8281 9367 4511 -278 -1812 -5254 -5616 -1243 -4224 -5335 -7128 -6187 2800 2066 527 -228
14132 -228 -6679 -5804 -4575 -2179 -5427 -6777 -2673 375 3089 4795 9243 7624 2981 -1114 -3414
14117 -3414 4147 662 -81 -818 2397 3031 406 -944 6902 8815 3942 -1975 6316 8535 11088
14102 11088 12455 10887 5386 5166 14295 11860 5761 6611 10381 10117 6991 9599 4674 -836 -1534
14087 -1534 655 2641 868 3191 2411 1188 3303 4056 7196 12126 6689 -1970 -2092 4745 10785
14072 10785 11713 3283 609 2883 -272 -5532 -4605 -5262 -3483 -1615 -2570 -3036 2147 1185 -6571 -7113
14056 -7113 -8312 -4628 -4343 -2660 -1022 -2472 4277 -71 1414 1207 2366 3329 4704 3358 3728 3745
14040 3745 -1407 -157 426 4045 3762 2030 3508 7855 9942 11087 14660 14205 13230 12739 3437 278
14024 278 -2356 -2716 2000 -1499 -1251 2821 1322 -2887 -47 3571 5196 3221 109 3702 5866
14009 5866 1979 4429 7174 8576 3136 -3057 -9883 -318 67 -2240 5101 7674 388 -764 2495
13994 2495 4816 6533 6800 3518 1336 1142 -4042 -79 5530 6974 8463 4043 1901 3627 4960
13979 4960 6471 8407 7560 937 1956 2822 3270 -5235 -9239 -7497 -6832 -7514 -9220 -8356 -5246 -4580
13963 -4580 -1264 2285 4696 8750 4258 -1970 -7382 -7871 -7873 -4488 2359 4360 5865 5383 3394 5275
13947 5275 8164 11668 8264 1351 1319 718 -3001 -5007 -2527 60 5161 3808 7193 3825 1641
13932 1641 3990 978 860 3396 6704 5413 3417 3631 7968 5692 -3146 -4629 -249 1524 -530
13917 -530 -4260 -2749 3544 7576 6339 4892 7936 9671 12940 13082 10141 6422 4587 2025 5153
13902 5153 5038 1359 -2071 -1878 -1416 1550 2134 2484 7044 8979 8996 8418 5002 -748 -5762 -10669 -1792
13885 -1792 4932 7035 12550 10704 6334 5919 6507 13157 14152 6393 11560 14258 15150 8226 3850 5003
13869 5003 3537 2355 -1288 -1303 3663 455 1153 -5365 -5266 -1934 7521 4317 -2655 -12424 -15821 -11936
13853 -11936 -3397 4857 11987 3601 1347 1088 4258 5012 1442 5278 1309 -2764 249 -3103 -1713
13838 -1713 2408 5925 10327 5074 2313 851 2600 3493 5228 9102 10647 5719 -3898 -8984 -4423
13823 -4423 1489 -5303 -6568 -3077 3248 3163 3034 -4877 -10448 -8256 -3467 2573 -1707 -5253 -241
13808 -241 1195 -2376 -1196 8409 17740 16565 17531 19211 11248 2198 -4854 -4070 -3476 -5786 -6554 1424
13792 1424 1805 5743 6155 5793 8528 10480 7072 2052 -4953 -9852 -775 2431 -491 -2006 1700
13777 1700 4780 2070 3704 1593 5091 9019 11118 7150 1774 1144 1071 -384 2608 811 -864
13762 -864 -580 -2198 -5150 -6089 -3677 2643 6392 4602 1913 264 -5185 -3223 -4687 -7388 -2647
13747 -2647 3457 5204 6261 2815 5805 9192 14704 18300 12354 10466 15155 11136 3589 -969 -6008
13732 -6008 -4893 -5901 -730 5839 5756 -1673 -896 4987 3151 303 -402 -1217 5657 16314 14304 10462
13716 10462 8988 7443 7376 6673 2382 -4425 -5475 -7571 -13026 -11433 -5272 -510 599 -1946 -310
13701 -310 -4458 -3290 7631 11650 7751 8742 -1130 -74 1991 -4414 -4622 5962 2025 -1992 -7201
13686 -7201 -10398 1158 1403 3947 4517 4404 13227 17094 12607 8300 9042 7620 6503 9606 8653 3867
13670 3867 5465 5627 3405 5378 1711 -4814 -2515 372 4758 3938 9710 14005 7195 2365 -2520
13655 -2520 -3506 -1500 72 3132 14219 13787 5075 5052 -1183 -6911 -1018 5240 8427 3853 2110
13640 2110 4370 8840 10276 12022 17987 19803 18597 12351 14364 6496 2079 1871 2603 -5031 -909
13625 -909 2803 6111 7499 9720 9874 9402 -337 -3070 1200 3633 4925 6688 8523 5115 964
13610 964 2880 -1192 -3723 -7874 -4145 2607 807 2513 7040 7898 8912 6863 -83 1242 908
13595 908 413 -890 861 3985 -896 -3546 -1771 8144 15117 15646 9886 4038 1591 1362 2221 7591
13579 7591 2766 -5392 -4617 259 -3170 -4825 -7044 -5047 -4738 -3328 339 5877 670 -4776 -7227
13564 -7227 -771 2091 7820 7644 2460 -2290 -5154 -13070 -7644 -4961 -4020 -8733 -3068 7824 9929
13549 9929 7967 5397 2609 5286 4663 1855 6542 3464 1972 606 -2024 3295 2659 -2290 -3598
13534 -3598 18 -99 -1275 -2372 2161 7358 1253 -2564 821 2942 -2382 -10749 -6595 3278 373
13519 373 -4916 -4842 7236 12307 6069 -1256 -1157 3815 4972 11942 17016 5527 -3969 -7642 -11262
13504 -11262 -2299 3384 2868 -2693 -4125 -1695 3770 4288 135 1368 5486 6851 9588 12846 13501
13489 13501 7814 6491 9227 4297 4788 5290 7699 6808 3410 486 590 3910 4245 1857 1661 6476
13473 6476 11858 7056 814 5328 5957 2494 -1236 -1296 6063 13800 16588 12221 7605 9022 4128
13458 4128 3510 5764 7196 3718 -6155 -5568 4522 10335 9923 13130 8866 8768 6015 4866 837 2326
13442 2326 6909 9546 9049 10656 11372 8261 10152 12066 12831 17400 18504 14848 10404 2543 9948
13427 9948 14701 8161 6472 12562 13277 12706 5634 939 -1181 5384 10793 7370 4773 -238 6928
13412 6928 14520 15758 12264 4261 -721 -42 4445 1387 2224 8022 17785 12648 7917 4525 2440
13397 2440 8115 590 -3595 543 1011 1868 2751 3363 3252 -479 -2367 -2449 2092 118 2197 981
13381 981 -870 1725 -94 -2978 -1066 5506 11225 5164 -1793 -989 1705 3673 6060 3489 5731
13366 5731 3134 714 -2855 2478 4067 1538 -3607 -28 2297 -1132 3474 5511 3019 8446 7394
13351 7394 3283 -729 1116 889 -4090 -1402 6581 7610 14026 15445 15309 9149 7666 2411 -2608
13336 -2608 1368 2126 3205 5062 6319 4113 3637 7691 5174 1270 -3147 -824 4821 188 -4017
13321 -4017 -2076 2607 9960 9328 -505 -3144 597 3774 12103 9462 11778 13425 14074 5113 2443
13306 2443 -4449 -5331 -5462 -6320 -4817 -10982 -19691 -11098 784 2151 2980 1016 293 2714 129 -7981
13290 -7981 -2542 651 -5650 -7723 -2374 3732 1360 1236 -1062 659 16283 20035 17245 4802
13276 4802 -820 6007 6370 1693 -2399 -3280 -37 -1667 -1402 3568 8820 8093 1397 -3341 90 9036
13260 9036 5978 29 -1816 -5251 -10876 -10008 -6119 -6323 -2638 6623 11603 7291 6051 10169 15239
13245 15239 16020 9858 8996 11647 16021 12148 7947 7418 12878 10349 6081 4707 5326 -297 -4321
13230 -4321 -5130 1845 3336 -283 -6479 -10554 -8567 -3720 379 3018 9966 11051 6491 3700 4149
13215 4149 4589 13097 14674 19214 13642 12110 11925 11294 12054 5847 2392 1252 5418 6400 10146 13081
13199 13081 16087 21080 23059 15039 13228 11944 12247 18063 22675 21977 20648 16824 9389 9521 14135
13184 14135 14460 6890 5347 5508 8328 10459 2787 4700 15526 17643 17221 12371 11555 9973 16006
13169 16006 17516 14576 14891 16446 15703 13860 6957 -41 361 4319 5083 1993 2547 7777 13445 6212
13153 6212 2072 1837 5474 5146 12895 13213 11162 12060 11619 14879 10760 -218 -1854 -1155 -335 -5314
13137 -5314 -2225 -1856 -4394 -2158 -2985 4949 6452 8020 6022 4267 5813 10734 21455 21778 14594
13122 14594 9878 8599 5109 10331 17999 13716 3099 -5063 -9019 -9115 -5842 -6530 -3178 -1651 -3296
13107 -3296 -1716 1264 4215 6766 6178 3324 5342 2740 1785 4296 4896 1985 3092 1240 4168
13092 4168 9135 16578 12908 10300 6520 -1432 -4862 -1686 7055 10581 10010 5892 6526 12522 18432
13077 18432 16426 17206 15920 7880 5826 8441 12963 14160 11375 12262 19516 19013 19423 15261 13065
13062 13065 13511 14107 13636 8609 5192 2476 2272 5370 9687 15544 15807 12300 12719 15964 13583 14649
13046 14649 14035 16463 19197 17217 8826 9959 14185 15484 12412 6403 2000 3600 9932 13801 16699
13031 16699 16738 20078 20483 20075 10702 4384 3783 3412 6548 5909 10169 13895 14893 13248 12326 7965 9584
13014 9584 3215 2077 5059 4653 9963 10446 10546 10511 13507 15259 5891 1728 8530 14773 21126 18306
12998 18306 14147 10745 2220 -2639 4389 13454 17857 15236 5742 235 11504 13529 13809 18114
12984 18114 16015 18592 10497 2017 333 10968 10935 7528 10460 13712 13497 15019 11996 6389 2012
12969 2012 -740 2839 9891 10683 8436 8968 7569 5419 6904 5010 3324 3203 1106 -79 -6459
12954 -6459 -3246 12287 14552 13759 14935 11739 10882 7704 10112 5154 102 4911 6354 3480 5064
12939 5064 3987 5653 4039 66 -598 3150 11635 18524 16979 10912 14989 7621 -2472 492 7072
12924 7072 5911 4822 3322 -2964 -6336 -992 3276 3971 2719 4580 7046 435 414 -4329 -4606 6571
12908 6571 13832 16170 13481 5545 4744 1254 6296 6967 4388 3877 5427 5778 5881 8222 11253 8459
12892 8459 12915 11084 5097 12279 11156 8515 12442 13751 20061 18426 7130 5319 1960 -4046
12878 -4046 -4532 -2747 1700 2040 3793 652 2664 509 -3304 -3973 -594 6988 7475 4963 5823 6026
12862 6026 10053 16687 9144 10615 12049 13462 15919 12399 6817 2793 2917 6544 7139 7989 14305
12847 14305 11339 11694 15134 18341 9612 10728 13045 12675 11294 11136 11026 12342 14982 17763 24381
12832 24381 20631 14683 12263 8477 5681 1792 5721 15189 20542 21627 19189 21281 19138 11705
12818 11705 10473 13490 10606 9170 13100 15895 15750 16178 16949 20090 22245 17657 10798 14643 20621
12803 20621 16276 10720 5869 1709 7500 3307 2677 6479 7097 9143 6134 7696 13405 18056 14855
12788 14855 8012 543 5164 10178 12994 16467 12470 6907 3774 8965 13148 13992 7812 -2983
12774 -2983 1186 6908 8719 9481 6646 3763 4201 10116 10986 8841 3432 2439 7955 6914 3372 4293
12758 4293 6704 13104 13452 12243 8772 6388 5014 1404 5410 7872 9778 12023 14465 13839 16955
12743 16955 18199 14706 11022 13723 9118 10542 12540 12852 15202 14615 7189 9084 10817 12584 13035
12728 13035 12089 15863 20919 23185 12261 14286 18821 19118 9143 4385 12071 17369 16802 14469 17398
12713 17398 18531 22722 26229 19119 9469 9403 9480 11140 12507 14480 10126 10863 10308 10163 8378 6029
12697 6029 8147 9784 8930 4605 2644 2620 -775 4853 13085 15142 19693 22347 24329 20080 19161 19106
12681 19106 23618 24774 24118 18277 8344 10045 21052 27589 25050 20193 16537 10606 10105 13287 13991
12666 13991 10649 9755 13309 14715 13919 12826 17408 18725 15581 12265 13592 9260 10414 17492 22096
12651 22096 26792 31506 31956 29409 21120 20025 19664 14461 4786 5198 9826 15467 23721 29693 29195
12636 29195 26105 25293 21673 16973 19095 24567 30223 31090 32525 28183 29900 32378 34744 37334 40374
12621 40374 44403 51105 60295 76054 97223 131056 186170 277637 429559 622100 776536 790314
12609 790314 654273 459168 301423 197205 140252 106203 83852 71021 57623 52940 46977
12598 46977 41109 33323 25777 21785 24965 32164 30655 28391 32262 28209 17500 12804 13408 19348
12584 19348 19714 13891 12460 13435 14354 20130 17568 14513 23756 27826 23911 22533 18764 11846 13663
12569 13663 14152 17789 22759 20880 22427 24111 24999 23528 16445 16548 15806 22942 26383 24656 21368
12554 21368 21415 14550 16837 14244 13797 15478 18675 17938 18905 11608 17572 24398 23825 16261 6872 9996
12538 9996 17898 18712 23274 30827 27574 27209 23522 23991 19054 11774 6687 11158 16090 19469 20265 22589
12522 22589 21052 16139 10809 9992 4735 7356 14814 15417 12816 11618 10146 6953 7579 14258 13301
12507 13301 16534 13830 8134 7161 7575 19406 18536 19025 16684 14181 21362 22073 17607 10305 5211
12492 5211 2719 5608 7976 7701 9563 11882 13700 14463 15959 20691 18132 18672 21452 20885 19006 24866
12476 24866 26369 21080 20103 17882 16037 13826 11357 16917 21671 19719 14359 10260 17674 20092 23468
12461 23468 19975 15897 13760 14355 20811 16991 17155 16767 9127 11840 12946 12842 11070 11334 12353 18492
12445 18492 12670 9906 13497 15973 17798 16879 13709 10743 14842 14510 16107 14479 7812 11788 19641
12430 19641 19388 17322 14664 14039 18568 21600 28963 30191 27285 33366 30155 24580 23774 19954 18331
12415 18331 27647 30683 29340 30102 24406 22291 24734 13105 5515 3644 5526 10124 9766 8664 13511
12400 13511 14799 19256 18930 19955 23393 20073 9864 2938 3705 14550 16705 18637 21615 21516 20394
12385 20394 12244 12345 15311 14573 15611 22099 24904 17743 18172 13850 14832 14904 11730 14557 17097 16539
12369 16539 18174 22340 34682 41175 37652 34739 35317 36289 40370 38504 41253 51245 69793 81901
12355 81901 94535 116729 156971 189438 209252 205708 182711 147415 109951 88699 73083 62542
12343 62542 54062 47161 42631 35371 38844 36812 29249 27989 33768 37443 38009 29413 23214 21407 25481
12328 25481 24301 22225 20835 20577 30273 36644 37095 32894 31728 29028 31529 37335 47544 52457 48754
12313 48754 44739 52503 63341 65488 63385 61822 74750 95636 122584 164112 217396 280681 353095
12300 353095 413028 442422 425853 363773 288141 221425 169824 133114 108656 82927 69818
12289 69818 62956 54800 54120 53631 49469 43871 40001 40325 39552 32788 33817 38821 41545 39326 33228
12274 33228 30093 22579 24990 32733 35780 40125 40026 40243 45381 51620 54166 49592 46625 43695 50287
12259 50287 49489 46473 51165 52463 57227 72287 89456 109734 144193 182834 226218 259048 264035
12246 264035 234326 194517 155387 127831 104345 77271 68092 61018 57725 53135 56466 47071 44215
12233 44215 41943 44279 44807 33604 25235 25843 27737 33337 35142 31525 28749 35239 38568 36852 36408
12218 36408 34205 32124 35156 38267 38463 35375 28760 25188 31697 38169 32977 30141 23600 26861 26909
12203 26909 28363 36697 44145 45876 49733 48303 48684 49720 53942 53571 52889 48380 41793 34653 39113
12188 39113 44900 39532 35809 44315 50319 46026 50046 52606 52728 50854 47976 43331 42526 42481 42360 44384
12172 44384 50650 52523 47670 50603 51620 49239 51469 48320 35797 27962 31150 40579 41242 35196
12158 35196 25700 25738 31751 32114 34691 37123 37949 39135 37215 39849 38810 46733 51935 54426 49543
12143 49543 41669 39062 44598 48544 44506 45869 52273 54181 47169 45529 47256 52341 57703 58513 56588
12128 56588 46964 49425 62508 69160 73550 71870 69990 68789 69962 77599 86805 95144 92427 80010
12114 80010 71592 74333 74197 58623 54508 60497 58969 56791 49161 44514 46800 50865 58299 60893
12100 60893 61753 52710 51488 45362 40618 44365 46990 44012 46688 47282 50374 46091 51206 57859 58160
12085 58160 52901 47833 45292 50384 60787 59004 51095 53489 56126 61719 61268 62565 67747 73642
12071 73642 76681 78176 87283 92715 95529 104081 108881 106458 113734 117698 111821 97873 87503 77810
12057 77810 73048 82232 80354 69587 75145 81398 79277 68092 62327 60383 62587 72188 72167 74236
12043 74236 78728 77451 79690 74312 74504 82384 82856 84610 87550 84602 77877 80874 80086 72703 66825
12028 66825 69983 74671 79246 83719 93718 99944 101467 104270 113356 125084 133501 138110 131633 118426
12014 118426 115499 114387 113266 115290 110549 103110 98742 103144 105955 102183 96798 95579 102831 109612
12000 109612 110615 107475 111576 115754 112867 112495 115940 122350 131472 139725 144444 147272 151887 158827
11986 158827 158524 152122 152046 143607 142695 140377 128556 126645 127430 130197 138106 136641 139294 151411 156943
11971 156943 162071 166066 169686 175083 186758 190793 193480 194197 196123 199104 210925 215162 216689 216807
11957 216807 217689 227985 231437 229841 228419 236064 249210 263239 276488 288857 300637 320137 337715
11944 337715 357665 382264 404951 430818 461418 488196 514263 551189 593109 640455 689809
11933 689809 755687 839864 944230 1077756 1266597 1511623 1782947 2080316 2458098 2981373
11923 2981373 3693914 4670403 6102682 8345503 11848197 16855371 22490901 25888182
11915 25888182 25542648 24454234 24965577 25676074 23421493 18293629 13195739 9582670
11907 9582670 7354635 5991773 5042589 4229318 3555253 3061510 2698855 2417171 2171111
11898 2171111 1958461 1777105 1637460 1532111 1452756 1403938 1378737 1355917 1341874 1346570 1369463
11887 1369463 1403867 1444575 1499512 1573227 1670371 1787717 1937184 2121530 2377700 2707838
11877 2707838 3128566 3645990 4270614 5033988 6014157 7344179 9158292 11688089 15421789
11868 15421789 21088925 29272496 39426638 48894106 55329629 59068521 61721475 63790180
11860 63790180 61585669 53003100 39760341 27490859 19190035 14172499 11069724 9002771
11852 9002771 7530010 6468426 5676301 5023907 4411521 3825209 3328108 2936311 2627478
11843 2627478 2384731 2193990 2038075 1908455 1804135 1726583 1668742 1625567 1603651 1590350
11833 1590350 1584121 1597716 1620386 1669436 1739206 1837401 1968491 2145015 2381754 2692748 3071511
11822 3071511 3509106 4068904 4826538 5864108 7335418 9562538 13020815 18254032 25514973
11813 25514973 33785033 39492669 40501432 39899089 38892675 34516652 26661401 18998424
11805 18998424 13497565 9989336 7778181 6285484 5184804 4344330 3698319 3196699
11797 3196699 2770657 2394185 2074110 1809905 1596297 1427047 1286061 1167687 1069957 984015
11787 984015 909446 850325 800125 753342 711575 677669 643782 616235 589655 556394 530762
11776 530762 496494 461373 423254 392942 366954 349556 335211 316579 298917 282266 264668
11765 264668 243478 234587 227077 216329 211207 208133 199421 189539 187425 179589 173618 173741 167513 157180
11751 157180 148945 145403 141405 141898 139372 137311 132241 134494 131810 126409 125297 116989 112211 109928
11737 109928 105883 103728 107311 110616 124250 135253 139422 138933 134506 134861 129166 125231 123683 117406
11723 117406 107884 108653 104798 98668 102538 114336 117154 117988 122245 126381 136114 153954 176593 183290
11709 183290 164784 144129 123982 103409 88820 89523 100482 110203 121685 136903 150784 162837
11697 162837 172103 186394 198796 212451 220213 218922 218358 214264 209486 195806 183467 167457 155187
11684 155187 153936 147503 142030 138084 130811 120433 109049 101220 96794 87613 79297 68620 64122
11671 64122 63211 64229 62283 60866 61511 60586 61798 56747 50006 50589 57404 63201 70442 76063 87287
11656 87287 100223 117319 123009 129104 146186 155061 168194 184776 193065 193891 188133 181565 179833
11643 179833 178782 173536 171894 163691 153441 144372 135855 133196 129702 123950 122933 124130 123207 123488
11629 123488 123143 124517 114918 105127 94308 85265 88428 82165 79416 71303 70143 72355 69581 56628
11615 56628 52745 49597 48671 47360 46181 46395 47377 53326 59240 62914 66478 71280 69675 66265 71756
11600 71756 77466 81591 88653 81446 75371 67267 72832 85776 90302 87600 80588 80435 85182 95479
11586 95479 96402 90859 87982 82942 80020 71744 73822 75102 71126 70937 70079 61841 52312 51643 56039
11571 56039 60752 58626 56781 54245 53299 47599 46885 52500 56509 54198 45512 38496 38632 44208 47255
11556 47255 43606 41128 41797 46590 50681 50131 46278 43640 43014 45357 41812 43630 45911 48057 46827
11541 46827 45223 50333 50794 56484 56586 60182 60159 57421 58051 55019 53712 56789 66498 73261 71548 60152
11525 60152 55694 57098 57744 60971 60353 57153 56643 60434 61605 59555 58719 59971 52002 51054 50261 47266
11509 47266 40518 32124 35129 36352 43844 42508 34958 32933 39345 46964 53031 60240 58421 56963
11495 56963 61139 61781 62209 70799 74072 76328 85136 93375 91274 90275 94397 96029 108676 127161 142366
11480 142366 144131 135171 121643 101316 90619 85538 80714 72626 71670 71648 74682 76303 76744 81123
11466 81123 96426 113444 124787 123555 110431 97996 86470 85554 85030 77572 68208 63554 52451
11453 52451 51980 51899 60778 65227 69270 74918 73509 68125 69359 73857 77952 87812 97599 111190 130687
11438 130687 153911 169495 163567 142890 125597 106936 102086 104457 104563 109608 111899 104719 109937
11425 109937 121409 132099 140498 162165 191292 209728 209237 210940 242488 286329 322731 326058
11413 326058 284658 222142 179020 161643 160246 158370 156690 155589 158104 151800 146852 151293 149483
11400 149483 145997 141399 132243 129192 132593 141257 146277 156851 164288 176035 190486 201768 210434
11387 210434 219019 235447 253455 285494 329383 399927 519589 711072 1009145 1420533 1804773
11376 1804773 1927001 1696986 1269235 897786 659581 535621 471828 442523 444875 455140
11366 455140 440415 399059 353208 316886 284465 257650 242291 237399 222891 209791 209736 211767
11354 211767 217538 211978 207954 211080 214900 211319 208384 213972 225090 226778 219481 220823 220368 217054
11340 217054 216422 220227 220186 221536 221509 231493 244882 250196 249876 248222 249170 253313 253098 256395 260152 262957
11324 262957 266579 274847 289884 300861 319906 330535 347867 368559 389615 411946 426368 447230
11312 447230 480895 517189 548816 587435 629234 672442 722719 773691 827697 891286 972733
11301 972733 1067609 1173207 1298121 1458303 1648413 1890476 2204423 2619884 3180223 3949564
11291 3949564 5041338 6552800 8455656 10515960 12546724 14651705 16806826 18971534
11283 18971534 21233968 23195936 24193489 24622181 25058838 25070357 24151175 22669761 21043764
11274 21043764 19332098 17492757 15464621 13353259 11300617 9226487 7325261 5852565
11266 5852565 4797667 4046162 3498527 3093511 2792465 2555323 2367661 2222949 2107027
11257 2107027 2029608 1983718 1957044 1950199 1962488 1989774 2043055 2122388 2229889 2371420 2564311
11246 2564311 2813243 3128282 3533280 4086813 4849431 5940491 7531990 9774427 12629212
11237 12629212 15755654 18990760 22128068 25303665 28922898 32851853 36429145 38847889
11229 38847889 39977731 40209015 40042162 39660411 38493128 36406464 33615384 30326221
11221 30326221 26885381 23393905 20066768 16907729 13951380 11264610 9006056 7280485
11213 7280485 6032580 5134547 4470650 3956307 3551640 3235344 2996120 2792194 2590567
11204 2590567 2384357 2200577 2051877 1943707 1858463 1804379 1782934 1786961 1812214 1858204 1952980
11193 1952980 2101850 2297639 2560089 2908096 3401912 4118268 5103090 6334458 7615798
11184 7615798 8794838 10015768 11412184 13081662 14881046 16348391 17019847 16998464 17060973
11175 17060973 17449064 17561364 16903212 15656389 14273750 12793687 11279919 9887208
11167 9887208 8586237 7321217 5978055 4700826 3699508 2988440 2487908 2124474 1840241
11158 1840241 1610087 1427794 1280912 1164118 1054072 959490 874775 800293 733185 674479
11148 674479 616749 571156 533689 492431 454656 423513 408004 399883 380594 348777 297411 260458
11136 260458 234240 218584 221366 223371 217263 206845 210214 210044 220856 231067 229809 218456 201717
11123 201717 187558 177487 168815 169259 171330 173751 168813 168354 170664 176310 181819 196077 200529 200203
11109 200203 206599 203271 196542 192354 188763 174955 159984 158126 166014 170111 166031 157866 153098 156637
11095 156637 165881 172310 169459 172624 175159 180269 187990 186656 191531 197103 212123 225847 251177
11082 251177 289280 326271 355997 357002 345073 333833 313491 280226 246205 230491 218605 206115
11070 206115 199011 191156 195328 206019 218613 228769 236733 232847 240972 260592 284936 305875 313687
11057 313687 303276 280075 258605 232494 223902 210892 194472 189198 183922 182332 175689 169403 160823
11044 160823 163498 175097 189559 197844 205249 213486 221487 226861 236162 249006 255953 255885 260028 253858
11030 253858 243289 240054 240467 247660 257393 270331 278991 286356 299488 311008 320689 329007 339271
11017 339271 355133 376278 397326 420348 438222 455318 467062 476948 479241 478660 486782 498303
11005 498303 521840 546849 575211 608934 642972 687453 740321 788764 826667 845900 849789 859912
10993 859912 876226 891806 899700 911682 931175 965786 1020030 1095763 1186204 1274966 1370092 1479573
10981 1479573 1608245 1734549 1878124 2036789 2216136 2409028 2624403 2857368 3136923
10972 3136923 3477148 3925383 4518706 5320593 6391371 7734130 9239319 10808100 12353242
10963 12353242 13894671 15768055 18492806 22863518 29899958 41341504 60392591 92301455
10955 92301455 143282733 213925338 279950056 299257731 262274298 188547528 122039307
10948 122039307 79389667 54719877 40070212 30851957 24719427 20536264 17710192
10941 17710192 15732480 14159230 12700869 11199017 9699228 8279497 7094394 6182748
10933 6182748 5462961 4882203 4408910 4005564 3668645 3397548 3181000 3002881 2840483
10924 2840483 2658212 2454488 2250437 2068959 1929603 1814293 1717245 1629065 1537261 1432360
10914 1432360 1321086 1205786 1092115 997606 919115 839715 783023 756886 739290 716827 698079
10903 698079 682372 655971 630168 614694 600067 578516 546086 513930 480096 439106 411353
10892 411353 392806 378660 377331 382861 385923 381355 369899 362938 354885 345987 340864 333911 323824
10879 323824 325080 324249 329282 327043 307648 281913 265517 247368 236679 233260 228912 227651 236341
10866 236341 243682 255550 270491 287339 306953 318203 321398 325358 324372 317564 314368 307536 293409
10853 293409 277731 260446 256451 259979 248396 230659 202471 172003 155953 143383 135043 120474
10841 120474 111823 108110 101321 100458 97964 96610 95601 88192 74993 63179 50514 32375 3288
10828 3288 -31801 -53722 -51482 -27497 9983 31239 44593 45597 45229 51843 58473 63398 77371
10815 77371 91963 109788 126809 141503 164294 179680 188921 205473 223769 237766 246086 256130
10803 256130 260803 257020 248658 227565 202055 185474 160796 140497 121600 104637 95708 93457
10791 93457 83640 79127 79890 79155 72391 72468 67286 52706 46712 48120 40702 28618 19088 22341 23143
10776 23143 34764 54446 74059 87109 95730 101723 108920 118080 116725 100638 69608 45772 38641
10763 38641 43627 67187 89851 94912 95240 99290 100231 108585 108170 107100 107988 113171 111190 95384 86534
10748 86534 84390 76074 66536 60787 58622 55876 48903 40595 36772 34880 33375 28666 23915 20767
10734 20767 16526 20864 29231 31554 36130 34697 31083 31135 29914 28242 14906 8377 8401 9294 11851
10719 11851 3397 -265 -549 -4466 710 3982 10565 14306 19966 22528 20899 28353 35017 36919 37405
10704 37405 28994 30359 24971 16484 11439 12122 16838 15557 6973 -469 -457 5688 14069 13624 -4266
10689 -4266 -17051 -14141 -6907 -967 7859 15762 16181 16560 10284 10350 17256 20699 14307 9071 4088
10674 4088 1433 969 2676 3692 -2257 -1579 290 -1261 3800 8109 5890 -2408 -4578 -5587 -5915
10659 -5915 -1402 -168 665 187 -4912 1499 12253 12277 12189 12214 14570 14621 17647 15196 9068 11483 17914
10642 17914 15822 10762 1698 -4009 -2038 -3162 -4671 -4556 -3889 -1518 -885 4584 5853 3366 2550
10627 2550 4371 5348 1459 2017 3548 6266 8905 9309 6643 1049 -5260 -12723 -12716 -9679 -7962 -5215
10611 -5215 936 1442 1333 -153 -2005 -4350 -6291 -3815 -4357 -5734 -11681 -9587 -723 -3527 -15829
10596 -15829 -20344 -17895 -13481 -13051 -12116 -5101 -795 -4572 -801 4805 7361 6028 5515 4125 2055
10581 2055 1723 6917 19656 19513 11578 11462 7214 592 -2202 -4426 -5574 -6837 -8771 -2604 -1184
10566 -1184 -3954 -3495 -6800 -7268 -4263 -2091 -6390 -4042 -1100 -7969 -5833 -536 1668 -2080 -1815
10551 -1815 -2426 2589 8833 12337 12587 10411 -995 5039 7471 5260 6099 4563 10257 18667 19657
10536 19657 34143 43518 44001 51622 62865 72690 87899 107601 150909 221870 346080 538144
10524 538144 843454 1232706 1519908 1511821 1213741 819897 521848 344095 237282 177141
10514 177141 132664 106372 88240 78483 74733 72639 68619 58416 44285 30610 14059 -1095
10502 -1095 -28 3324 382 -9906 -11017 -7976 956 11224 15009 28045 37199 34667 32492 35800
10488 35800 40987 50978 50933 40933 33281 29008 32880 29803 19382 7686 11093 7972 12089 15982
10474 15982 14215 9250 1332 -1724 -935 -1364 5385 5669 1372 -7987 -15230 -13943 -16226 -12791 -10340
10459 -10340 -6462 -5398 -1136 -228 3520 1470 -351 3024 1093 -2871 -9873 -6407 -10439 -15394 -13457
10444 -13457 -10162 -7196 -11768 -13486 -17635 -13975 -10052 -15932 -13816 -13300 -14418 -15308 -8788 -2073 -3159
10429 -3159 -9688 -14664 -19001 -20034 -12600 -7254 -1338 -1843 -8739 -6678 -1145 -3480 -9374 -19444 -23488
10414 -23488 -19182 -16403 -17339 -9903 -3198 -4419 -19740 -28174 -26755 -16974 -11289 -14612 -12438 -4747
10400 -4747 -7471 -19397 -16509 -11807 -9622 -11083 -6777 -5351 -12079 -14530 -19043 -15275 -13055 -15498
10386 -15498 -18881 -16048 -7053 -8976 -14002 -15001 -11893 -6450 -5669 -1138 863 7818 12005 16794 13687
10371 13687 3398 -1522 -8729 -11957 -7295 -1425 -11139 -14126 -9599 -8398 -5029 -2879 -4364 -4577
10357 -4577 -11852 -17080 -11231 -8315 -12117 -7504 -2596 -5425 -8892 -12576 -17393 -14426 -12487 -12099 -6672
10342 -6672 -3459 1053 4877 5291 2118 -1153 -5300 -10031 -11832 -9468 -6056 -10583 -14978 -15634 -8858
10327 -8858 -7343 -9048 -13163 -10979 -3783 -1862 -1659 831 -1948 -3273 115 9480 15227 10249 5553
10312 5553 1160 -7610 -3386 2660 2084 603 156 244 -2623 -6965 -11145 -9556 -6050 -4577 1967 4982
10296 4982 -1655 -313 -6128 -54 5503 1705 -6105 -6599 -359 5055 7518 5223 8481 11698 8584
10281 8584 5678 3204 -420 -819 -2101 -6635 603 11466 9274 1971 -3043 -7819 -7340 -7603 -3818
10266 -3818 -1838 2661 1133 -3243 -5575 -5705 -10683 -11983 -11821 -10816 -278 3727 8257 9684 7211
10251 7211 3974 747 1680 6459 5918 2433 -1634 -2309 -1506 -5740 -4372 -2441 3289 9435 7861 -861
10235 -861 -7224 -13734 -15367 -13383 -9027 -2876 -3908 -7951 -5773 -4848 -1108 -5029 -6418 -8353 -6956
10220 -6956 -1820 4901 8115 1556 -4053 -6003 -784 2029 -3612 -4905 -3451 -1120 -5574 -9022 -13576
10205 -13576 -15940 -14884 -18192 -12099 -10967 -8988 -6732 -4883 -2285 -1229 -8196 -8004 -8706 -8677 -6483
10190 -6483 -8925 -13562 -13104 -9741 -8945 -9539 -11330 -8228 -5796 -7722 -11152 -4850 -9235 -14507 -18062
10175 -18062 -8419 -1914 -603 -3395 -1658 -8237 -11404 -4736 -1515 1938 8023 3581 -3671 748
10161 748 -1798 -1961 -1994 -3254 -6883 -5485 -2018 -3043 -2363 -2346 -4751 -3085 -1000 -1822 -5671 -9894 -6893
10144 -6893 -12323 -11342 -3721 -3457 -4077 -6485 -12841 -17323 -16603 -13892 -12203 -14731 -13278 -7467 -1082 1560
10128 1560 330 4264 2416 -2476 -6432 -3387 -2273 3223 1574 637 1681 -1969 -7917 -8692 -7644
10113 -7644 -5960 -7412 -6427 -7099 -8049 -10551 -10649 -13424 -13387 -10381 -9436 -9908 -15222 -19398 -19820 -20759 -17827
10096 -17827 -9905 -1780 440 -7773 -6915 -13696 -20668 -25437 -27463 -18770 -14614 -15019 -19376 -18372 -13457
10081 -13457 -7291 -7402 -10522 -5275 -1060 -329 -4529 -4147 -1280 -1067 511 1891 -1030 -1415 -2603 -9736
10065 -9736 -15015 -13421 -6701 394 1268 -2446 -8062 -13237 -11531 -7614 -3787 -7130 -9116 -8100 -6475
10050 -6475 -10458 -17672 -12775 -2713 6099 6716 7119 8766 8021 4817 9747 6101 -941 -7349 -11273
10035 -11273 -9706 -9464 -11383 -9812 -5833 -3116 -5425 4456 13008 13591 8470 -107 -7668 -3631 4511
10020 4511 5978 5630 7628 2897 -5556 -370 1219 2794 3933 7563 2118 -3098 -4193 -2598 2012
10005 2012 8898 7540 7661 4507 -4328 -5577 -7725 -6644 -9381 -2139 8937 19443 14700 9946
9991 9946 7010 517 -5151 -8179 -6006 -394 -2985 -13057 -14472 -8035 -7842 -6222 -5202 -3960 -1877
9976 -1877 -1804 -1292 1292 -1007 1630 2941 10865 5491 -2930 -9114 -9163 -12498 -11334 -7745 -4803 -1662
9960 -1662 4255 1565 -8831 -10335 -9893 -20080 -17818 -8815 -8954 -14481 -17797 -14766 -10313 -5120 1279
9945 1279 4051 -472 -7001 -950 -1781 -3119 -1108 -1054 -5378 -7517 -5802 -5491 -3605 -5913 -9904 -4808
9929 -4808 1992 -1024 2905 8684 22 -1900 -1208 -6169 -4662 3123 3695 3923 6909 7391 1073 -2781
9913 -2781 2118 6187 2610 4124 3697 -122 5982 -2572 -3928 5110 6319 2955 -595 5460 2545
9898 2545 1039 -4500 -3563 -2464 -2910 -1715 -4384 -13149 -6241 1813 622 -5100 -8869 -12220 -10841
9883 -10841 -4425 -6371 -11075 -8153 -9996 -10496 -9855 -8250 -5622 334 658 -6517 -542 3681 5638
9868 5638 6343 1353 -3130 -710 -163 8228 8360 8044 4485 7348 912 -3908 -618 5045 1519 -4958
9852 -4958 -3478 -3937 -9108 -6077 -322 -1811 -5022 -4882 -3371 -8145 -10491 -4899 -3087 -3734 1520 906
9836 906 -2890 -5017 1150 -2415 -5432 -4616 -5529 -7342 -8280 -12203 -8255 -5500 -1615 4155 5106 2107
9820 2107 687 -2305 -10106 -13313 -7738 -3947 -5067 -116 4142 -3011 -4122 -3080 -4257 945 -1089
9805 -1089 -2279 -2263 8087 11065 9365 4533 -2405 -8549 -5307 2698 4395 4198 -220 4617 9479
9790 9479 6711 5995 847 -6201 -9928 -663 3378 -1053 -2901 -7451 -10298 -9158 -4355 -6938 -9911
9775 -9911 -5541 -2683 -9401 -18791 -23165 -15735 -8104 -5602 1379 7339 2450 -779 6802 9057 7228
9760 7228 8436 4938 2103 -2431 -7939 -5764 -4053 -5702 -4283 -7798 -5226 -2403 -10255 -6570 -3351
9745 -3351 -5938 -8320 -3133 -5084 -15358 -15434 -8663 -7993 -6032 -3576 3006 2531 -9576 -8428 -4552
9730 -4552 -582 -871 -4463 -10762 -425 3633 -310 -5607 -3753 -3616 -629 6379 10464 10104 10510 9392
9714 9392 1569 -4122 -6361 -6786 -1291 4361 3896 2074 8373 10954 4716 3940 -2280 -5104 -4896 4551
9698 4551 -1324 -9083 -3930 483 2061 -1202 -7371 -598 3357 13 -7610 -7152 -4223 -2567 -5114
9683 -5114 -5006 -6 -4087 -2591 2068 381 -831 -5727 -8461 -4001 -5959 -10676 -1717 -3038 -5605
9668 -5605 -3101 2215 3770 5857 1084 -2648 -2430 706 -36 -7038 -16304 -17613 -17243 -12510 -6552 -6194
9652 -6194 -8232 319 4845 4271 4427 8016 5680 2581 4434 6963 6757 3137 5986 6987 -2609 -4262
9636 -4262 2440 5368 5802 -1269 -8757 -1773 1603 -823 -4143 -4086 -3156 -4450 -4731 2395 4931 5232
9620 5232 2707 1762 4550 -79 -6154 -6783 -5617 -2594 1921 3148 1301 -2603 -4676 -595 4235
9605 4235 8973 7375 10953 7789 7944 5180 -851 -976 5142 6652 2363 6854 1414 -2516 -5635
9590 -5635 -5982 -5369 -8709 -14861 -11466 -1443 135 -3830 -2232 -2661 -2447 -5307 -1769 -1911 1362 457
9574 457 9 2781 5410 4497 716 -1545 -2087 2395 11090 15124 8661 7987 6997 4954 11792 10618
9558 10618 8414 9941 7049 7366 6030 5495 4661 3265 7948 4274 3989 5420 10994 8848 4744 3769
9542 3769 9011 14306 13004 13851 11067 3844 1875 9915 16284 11607 8466 10080 8182 6832 269
9527 269 -3707 -4314 1439 1935 2290 -2249 237 -474 1342 3677 8680 4298 3444 11154 10045 12812
9511 12812 8344 5915 7627 10322 16640 13732 10628 4736 -7422 -8121 -7108 -1245 5565 7467 6229
9496 6229 7095 13271 17951 19013 15841 7836 7429 6908 12492 17897 11720 17171 19191 18035 15077 9232
9480 9232 6999 8264 9978 11769 12775 7880 6789 2032 1932 10943 12301 7763 1485 4902 15045
9465 15045 19543 15492 3845 7837 11798 7762 -1556 -2100 10140 10961 10133 14854 14118 2278 -3424
9450 -3424 4401 3218 1239 -271 3378 9853 8636 8228 13550 17999 15805 11092 12415 17269 12822
9435 12822 7161 6323 4103 -4154 -9624 -7178 -2864 3105 2881 4261 8269 11575 8194 -460 1567
9420 1567 5683 6462 2817 1524 6959 8666 6459 1289 5107 4795 825 2718 7730 5366 5548 4007
9404 4007 2760 9474 18468 15377 12129 12582 14579 12858 5703 10232 12540 7197 3290 -4227 -14663
9389 -14663 -8058 924 9285 11330 8601 10648 12486 10169 10284 9064 7998 11150 14932 12660 12622
9374 12622 10850 10531 6750 1442 6540 5510 7744 3012 2762 6428 4961 5752 6147 3741 226 7667
9358 7667 8165 6699 938 3660 6116 -876 -2634 -2435 272 2484 10105 15792 17045 18856 13545
9343 13545 10475 9273 10015 11757 9806 14598 22181 20817 11461 11685 12394 7701 2156 3417 5508
9328 5508 1301 99 6689 9041 10620 10999 12984 15123 18546 16940 13722 3746 2761 4335 13005
9313 13005 18976 21736 20422 18454 11598 9554 5784 -1337 -1068 6307 13581 21746 21612 20445 17845
9298 17845 16648 15112 17269 18892 14946 16058 19851 20762 17272 14365 8548 13552 20499 26324 28093
9283 28093 19765 17385 23601 14799 13942 9576 10670 10589 5223 8753 12074 17851 16179 15276 12756 14562
9267 14562 17172 15368 14095 8523 -2354 -1678 2798 5751 2192 6363 12052 13713 10577 14286 15779
9252 15779 16716 20784 24028 24314 26316 30721 30974 27595 28079 24776 27384 28845 29929 22110 23831 16904
9236 16904 11052 8493 11501 20211 23582 23240 20675 18717 11636 17512 23250 24751 24936 26439 21755
9221 21755 21098 18191 11589 13138 12144 18076 27441 29497 24038 20752 20155 18308 22320 19645 19903 23326
9205 23326 27206 29065 28083 33453 33445 30026 29195 29475 31272 35847 34869 29983 31214 32282 27780 29769
9189 29769 36097 44418 43223 41241 42719 43639 51579 49499 48111 48515 44923 43762 44065 51654 53748
9174 53748 52333 59992 63587 64739 61705 66939 63227 59110 56338 62373 68363 70163 77252 87512
9160 87512 96314 94130 93486 96704 105450 103782 115243 124359 129983 141826 158432 168328 171983 181749
9146 181749 202857 221691 242147 269213 298784 336912 383838 445760 522944 619787 735809
9135 735809 883708 1090405 1385441 1776050 2293506 2949264 3722652 4446316 4849795 4714021
9125 4714021 4121282 3348476 2628718 2057659 1630329 1320091 1083539 895671 748422 634654
9115 634654 547700 488017 435884 387348 338907 300949 278664 251607 224301 204167 195057 185953
9103 185953 173784 159961 144760 130966 124567 122610 119150 117628 112357 108435 106852 106215 97366 91736
9089 91736 84120 78038 78352 82367 82186 76378 65453 62239 63116 61512 62878 55451 51178 50786 47484
9074 47484 46972 46311 40963 39242 36480 37057 42439 45228 40051 36439 35358 35134 34860 35061 34057 36975
9058 36975 40878 39279 36980 36252 31835 33015 33912 36741 42997 36857 32804 29089 27480 29136 28485
9043 28485 25192 27564 29105 25981 22040 18596 15131 15479 19709 28045 38639 39401 34355 28116 22151
9028 22151 20969 16765 18551 17479 19547 25885 30812 32169 35566 34382 29986 26045 28251 23868 22090
9013 22090 26779 28911 27777 21143 19487 20631 19641 18023 11330 11397 9977 12824 16445 12527 10532
8998 10532 12151 18603 17509 15047 17207 18058 15792 13447 8923 7241 3300 8105 15241 11197 9521
8983 9521 13899 13030 11595 13405 17618 17685 19854 19827 23763 18446 11921 15120 9090 11161 12610 14101
8967 14101 17384 16035 10996 14415 8856 7783 11735 14764 17440 15258 13974 19867 22707 23104 17623
8952 17623 16342 12192 14490 16788 15025 15486 18103 15146 16448 21401 25715 23438 12808 9021 5652
8937 5652 4019 3395 6547 10240 12679 12975 7155 747 -3265 811 8180 12299 10428 15589 19425
8922 19425 15952 9564 9434 10785 9845 9081 7704 -905 -8224 -2306 -2147 786 6187 13183 10067 6853
8906 6853 8597 14128 18109 11287 11395 7680 2136 7681 11094 3828 10739 17365 18924 24058 25700
8891 25700 20081 20641 24707 25463 23449 21754 19586 17954 8074 5555 2154 -1417 3029 10508 11748
8876 11748 10836 3779 5908 14556 14370 7742 3336 -998 3602 9260 13140 10672 11897 17551 18637
8861 18637 22551 18654 11192 18543 23783 18128 14180 8091 10209 13382 19191 20539 19663 21409 13052
8846 13052 7261 10206 12245 18383 15172 19886 19585 14034 11467 7163 3403 5291 14688 17274 19300
8831 19300 9303 5975 9013 6263 4818 3217 5607 10762 3698 7882 9766 4570 -2716 279 4884
8816 4884 9605 11087 12364 13823 12600 14832 19414 25525 25602 20682 20710 20404 11174 11535 14085 13813 11765
8799 11765 14492 16356 7311 2858 9691 12093 15106 15969 15089 15742 16947 13266 13357 13847 10394 15048
8783 15048 13212 17758 14628 15149 16007 15554 15343 14575 16784 16956 13237 8644 11160 11124 16075 26592
8767 26592 27201 26891 26672 22675 17208 21624 27104 26226 20627 11546 8307 8747 11485 13627 14869 18799
8751 18799 16813 16591 18935 26948 22288 16307 18256 21570 20151 23465 19016 10018 9297 13869 12030
8736 12030 10333 2321 -2215 725 3114 8859 9512 4619 1555 1328 8155 18678 17888 14245 2588
8721 2588 -1089 -177 9624 13058 9942 10337 13364 15314 19029 20535 13658 11120 14811 14495 13121 10696
8705 10696 8393 9053 14339 13863 2395 -833 5780 7661 10224 14654 15919 17259 16719 17871 22070
8690 22070 15751 9086 11919 13441 15177 23770 26637 19719 12314 3864 3675 11027 19095 18678 20169
8675 20169 21333 22351 20416 23639 24689 26310 27314 22971 27901 24596 18721 14653 12465 12152 15015
8660 15015 19393 21055 23532 23085 29200 33237 32421 33369 32331 29653 21020 16215 19711 16901 12632
8645 12632 21988 30174 31322 28954 30735 25814 29039 34970 34987 40240 50672 56608 54122 51463 45628
8630 45628 51765 66672 70689 72634 75788 79469 87109 100735 117216 126082 127615 141271 158530
8617 158530 169582 164816 152472 135212 117057 114131 96642 74679 62684 56738 47582 43554 34425
8604 34425 31350 25370 19703 17258 21484 18957 18968 20812 16904 10613 13509 14380 11777 9401 9482 10781
8588 10781 13245 11888 11775 9990 10235 9430 6417 2144 7133 8494 6996 1609 -2504 1180 3566
8573 3566 7793 9666 8656 1510 3016 17738 26595 28585 22891 16217 16460 13159 13385 15576 19465
8558 19465 12767 4975 -4017 -9535 -6578 -4698 -1393 6368 8755 10333 16231 12369 12806 12076 19504
8543 19504 19751 15621 11474 6683 1820 -4315 -2209 4482 8699 7175 -761 8005 12895 13543 7018
8528 7018 3701 15029 15807 6111 4886 8462 9342 10550 11922 6203 326 7998 15755 20646 21644
8513 21644 17188 11940 11065 10092 14830 19642 18055 18611 10862 8460 12291 2674 -4135 -5135 -4270 -8890
8497 -8890 -6646 3920 7515 7036 6004 4988 6935 2833 -1960 -3598 652 403 534 3975 3044 3314
8481 3314 723 3840 2933 173 833 3390 12712 13891 5828 9860 13173 11450 10256 2385 4007
8466 4007 12013 6784 1841 6107 11773 16311 20193 19702 18456 11927 12270 9336 6683 6426 6964 7754
8450 7754 5667 -1173 4713 15931 9171 14275 13427 7963 13768 11375 4644 -1412 3321 9285 13782
8435 13782 5696 3495 4050 5511 6089 6070 4739 7791 4497 7476 5013 8086 6369 -4051 -5638
8420 -5638 6980 12229 17051 16226 5518 4809 -1769 -171 2441 -50 611 -954 4257 3411 -5752
8405 -5752 -7862 -1443 5430 4238 10636 8648 -3260 -978 3349 3229 -456 1229 2877 -1134 -1168
8390 -1168 -4607 -2040 3751 9425 8366 1485 732 -126 904 839 -603 -325 9036 13433 14736 15392
8374 15392 11732 7973 6943 5887 5610 5637 4183 4729 2059 -5393 93 8045 4295 1023 4067 5759
8358 5759 3230 982 -1833 -561 196 5238 11243 7585 3735 -1679 2133 8862 1395 -3534 -3035
8343 -3035 2602 -1373 -3588 3342 13050 14003 9663 5163 2454 -1893 -5504 1157 906 -2776 -2683 -213
8327 -213 5218 6298 2467 3051 -1807 -503 -924 2443 6300 7335 695 -83 180 -4229 -2056 3271
8311 3271 3830 5292 8375 13397 15618 14432 12091 10950 7652 11061 14865 15549 15671 11869 8449 7059
8295 7059 1101 5008 13103 15138 15155 12120 4517 1299 428 737 -349 -3292 1520 9315 9888 11361
8279 11361 6367 4643 7761 6738 4289 5225 -179 -3304 -2178 -4468 -7691 -1168 5641 16228 17505
8264 17505 6111 95 3163 6656 1372 4974 10196 11977 9859 8592 8703 13425 11329 7662 -495
8249 -495 -3719 -837 6909 11081 6467 6016 -237 -1909 4128 6598 6294 2873 6089 6355 564 -846
8233 -846 1963 3126 5082 669 1365 2183 -32 -3808 244 3929 5138 9415 11493 1965 -2662 -2453
8217 -2453 292 2380 6449 9676 7607 6744 1947 2499 -2636 -1062 5684 5707 7568 3178 2655 2445
8201 2445 -1789 -5091 -3602 -3762 -6116 -2253 -1365 699 5169 4151 3663 3344 3979 5895 6243 1822
8185 1822 4500 2471 342 3039 4765 10929 13843 9919 3058 1606 -1224 4637 6810 3301 4232
8170 4232 3978 6033 8706 4824 3686 3962 5318 -479 1408 8278 11370 9750 17232 19981 18782
8155 18782 16977 11149 6070 9739 9303 5909 8817 8063 11998 11207 11004 8674 13189 16417 11891 8004
8139 8004 7562 4465 4961 8320 12224 13184 15091 15719 10799 18183 19556 15413 13197 11702 6754 1550
8123 1550 1618 2829 3011 8125 8463 5412 2037 229 1173 3128 5236 4150 4243 1624 9697 8550 6530
8106 6530 10969 10384 9615 10983 15986 20770 16134 9514 12096 16938 17206 14358 18008 16672 22499 16163
8090 16163 11332 9660 11361 15999 14554 18003 16251 11713 3881 3180 7029 11666 7943 9971 16163
8075 16163 12997 11460 13010 16657 23337 25408 14956 10205 13732 18562 22618 30785 23075 11694
8061 11694 11567 20862 24269 19206 13015 7935 5996 7590 14569 20719 18113 21669 24952 28106 23108
8046 23108 22052 18642 16660 14884 13919 12919 12411 11763 14954 12200 16112 12277 8147 8481 8484 9379 12074
8029 12074 16118 19615 19189 17280 24326 29236 33833 32618 27923 27318 28872 24008 24826 18925 12998
8014 12998 6908 17838 23738 25086 25635 21048 16643 15719 14572 10010 16245 16331 19238 16539 10518
7999 10518 4661 8258 14971 19944 20428 18304 17985 17448 14848 19472 26111 26075 25960 24972 32520 37135
7983 37135 34977 35339 37536 33010 28631 26953 26128 24229 20431 22826 17041 17777 18692 18300 16876 14865
7967 14865 18080 16706 16672 14902 13216 9280 15227 19428 24084 17244 7012 5077 11424 15525 15438
7952 15438 10353 10217 16603 19340 18320 16661 12456 9084 11882 15284 10354 12273 16609 14981 12019
7937 12019 10430 10623 10340 7088 6214 12173 10955 6277 1238 1725 5826 13827 19793 18098 14102 18329
7921 18329 15116 4550 4967 9761 11809 9385 4156 2459 -164 2042 2483 2102 -2447 -6055 -1148
7906 -1148 4014 2439 -6957 -8781 -9179 -4993 -1545 -1080 3631 -2084 -8835 -9287 -5952 -2407 -1901 -388
7890 -388 4067 1737 -3591 -1928 1798 -5778 -5872 -4968 1436 7004 4062 5066 4791 8167 11069 12314
7874 12314 6567 9197 7257 1271 -7323 -10552 -15441 -6138 1024 5829 -2865 -4826 2042 2836 -2681
7859 -2681 -10207 -10651 -5509 10 -4679 -8036 -6840 -7759 -13131 -18880 -17682 -17376 -5876 6124 6401
7844 6401 7788 1857 359 -8305 -16376 -14613 -8272 2698 10014 12729 12250 7647 4148 -5275 -2720
7829 -2720 6890 -1442 -2178 872 -4514 -4554 -2017 -3492 195 -440 -640 -5511 -5325 -3505 -6005 -4922
7813 -4922 1613 -4705 -9668 -5959 -12512 -7260 -3294 -3404 -6617 -1383 9176 9963 3032 1104 595
7798 595 -2021 4157 1124 2284 1008 4213 775 -15 -891 -3484 -4818 -8494 -4766 -3593 -6369 -9844
7782 -9844 -8360 880 7139 5018 6152 956 -6766 -6861 -3844 -3405 -3111 -3009 -3309 2816 3943 -4654
7766 -4654 -9043 -11684 -6408 1083 3940 -4897 -13145 -13095 -10425 -5573 -1646 -777 -7980 -5338 -2409 -4360
7750 -4360 -5326 -3935 -4037 -7517 -11626 -10764 -8555 -590 5217 7322 -1210 -1746 -2732 3345 6407 -3473
7734 -3473 -5205 -7950 -7929 -3529 -3472 -1523 -3844 -3039 847 3398 -6082 -11545 -7577 -8485 -9528 -6817
7718 -6817 -6742 -8878 -10495 -10296 -7066 -7048 -9185 -12063 -12338 -4450 1398 7232 8535 8782 1571 -2875 -2764
7701 -2764 -1632 -199 3172 1661 -2436 -6183 -6837 -466 7809 8059 627 -2668 3037 -3482 -1219
7686 -1219 8594 8066 3656 5221 -559 239 1077 -2759 -5586 -1527 -7391 -8902 -222 -770 -7065 -3171
7670 -3171 -318 -1676 -9020 -11218 -14070 -15463 -9234 -4532 -11 3122 -1583 1625 -538 -4510 -9397
7655 -9397 -3865 -2996 -5791 -9318 -11932 -8991 -6942 -8479 -1320 1723 1571 -1182 -3044 880 813 738
7639 738 584 -3382 -4300 -2541 -4285 -5208 -7513 -5684 -5654 -257 1643 4261 -3253 -8110 -5046 -4402 -353
7622 -353 4854 -2823 -7847 -8455 -4726 -4961 -7404 -2335 -3399 -4789 -3076 -5646 -13640 -18480 -14686 -8128
7606 -8128 -5502 -9591 -9167 -4426 -3885 -12518 -11759 -12693 -14039 -11738 -3341 4495 4535 -1925 -2981 -3331 -5257
7589 -5257 -5439 -4731 -11319 -11526 -11455 -8865 -5637 960 3556 3595 7421 -2768 -10497 -8349 -10385 -8592
7573 -8592 -7207 -5944 2194 7451 -802 -4784 -5877 -2635 3358 6677 2067 -1531 -4102 -7143 -3844
7558 -3844 -2578 -2277 4973 397 929 6418 10339 372 -9437 -6678 -5591 -8396 -16411 -18036 -7973
7543 -7973 -3754 -6174 -7883 -1045 -1322 -8976 -13534 -6808 -5136 -10234 -10317 48 9056 11529 11025 9317
7527 9317 7222 3802 6715 6502 -1847 -2250 -341 3932 -2270 -5645 -619 663 5468 8033 9157
7512 9157 3864 -936 3362 4966 5838 -2217 -2844 -483 476 791 175 -1917 -3573 -5685 -7362 -3761
7496 -3761 212 -578 2335 -3501 -4583 3188 -2383 -6948 -12381 -12200 -4157 3907 -2876 -4107 -6735
7481 -6735 -5290 2388 -2192 435 3998 4437 4850 3766 -735 -4271 -8505 -14105 -9799 -4051 -5465
7466 -5465 -6971 -6884 -6329 -8488 -8030 -5163 -7006 -8575 -6839 -7106 -8809 -13968 -20126 -24701 -19850 -16789
7450 -16789 -14350 -10651 -6667 -1523 2942 2486 3608 960 2879 -806 -1498 5385 3462 -703 -2183
7435 -2183 -6657 -8903 -6523 -8361 -7884 -8678 -4224 1032 1106 -1567 -3104 -7849 -15099 -19623 -14172 -14123
7419 -14123 -15899 -13705 -5907 5363 5186 1807 4866 6142 5097 1395 752 526 -1786 -3060 -1958
7404 -1958 -2729 -2678 -3579 -3166 -3507 -1184 -894 -4028 -4887 -3460 -2443 -1606 -5037 -6410 -1248 -5456 -15480
7387 -15480 -18862 -13634 -9018 -9604 -7759 -9059 -7628 -14112 -9099 -9826 -6366 -4817 -8846 -4143 -6
7372 -6 -1496 1460 -3459 -8712 -3297 -2943 -2360 1067 -931 2188 -4289 -11867 -11908 -3517 -3429 -4870 -2420
7355 -2420 1725 8007 11988 8766 4306 5357 3566 3173 670 2587 3511 179 -629 2009 1082 117
7339 117 724 -4758 -8626 -6157 -5110 -242 4070 7123 4205 5770 9509 16212 15224 9520 1225 2377
7323 2377 -326 -1640 -2164 1000 -1135 -1430 -3642 -3017 -4415 -5359 -7474 -9059 -3471 -7960 -19079 -24795
7307 -24795 -18435 -12703 -10281 -5546 -10199 -9397 5983 6489 -4954 -9075 -5705 738 345 -5203 -6338
7292 -6338 1392 2134 -6474 -6806 -11416 -12318 -6377 1845 6888 5520 -612 -5366 -5098 -6401 -6312 -1635
7276 -1635 1297 1863 -2643 -10066 -9733 -12798 -14405 -8280 -4250 -6393 -7026 -10837 -11361 -7665 -8147 -14013
7260 -14013 -19759 -12620 -12434 -18864 -22766 -20980 -8517 -3904 -987 1392 799 -5629 -12613 -11138 -3259
7245 -3259 4231 9223 3892 -3834 -10011 -12783 -6459 -4769 -4814 -6399 -5828 -4402 -1102 -3620 -7128 -883
7229 -883 -1095 -3784 -6686 -10333 -11291 -4116 4919 8447 9273 7223 8622 10201 4113 -7034 133 3291
7213 3291 4512 8245 2914 -245 2532 5123 2123 3459 1385 -3745 -4604 -5347 -4325 -9885 -7833
7198 -7833 -1781 -3696 -4883 -3580 -10186 -10846 -13272 -13524 -13154 -9497 -7076 -7953 -3760 562 -474 2589
7182 2589 -2968 -3908 -2718 1418 86 -4092 -5791 -11281 -8258 -5131 -4867 -5994 -2897 3527 9802
7167 9802 9610 6864 6424 4410 488 -3837 -6069 -8943 -11676 -18402 -17108 -6641 -5837 207 -3946
7152 -3946 -6065 -9701 -10962 -9709 -9870 -7515 -6142 -7670 -4624 -5763 -7029 -8903 -6667 -5986 -6271 -7470
7136 -7470 1125 8681 10827 9023 6248 6283 8821 9016 3541 1952 1256 -610 7582 10552 5865 1846
7120 1846 -2015 -2373 -8933 -13453 -13958 -15694 -10375 -5314 -3383 -6883 -5727 -11467 -11864 -1783 -1267 -1690
7104 -1690 -9294 -11104 -4919 -4645 -3685 -1628 -3245 -3427 -2327 3697 14024 13120 3528 -6070 -12487 -3221
7088 -3221 1560 -2093 19 5755 6260 5488 5223 6729 4453 -2527 -1471 277 -198 1228 2990 2914
7072 2914 7799 12981 11348 7979 55 -5292 -8166 -10023 -6102 -6544 -6939 -5776 -2795 -1658 -2993
7057 -2993 -2467 -4458 -5357 -3750 -429 3831 7549 11229 3576 -3614 -9488 -10504 -13965 -16149 -19088
7042 -19088 -17564 -9154 -3771 -9918 -13306 -7606 -6731 -9668 -9753 -5088 -86 -217 -1857 -5277 -5817 -4565
7026 -4565 -3203 -1522 1374 2889 1888 -1442 1013 -1263 -6686 -5817 -2555 -6202 -5452 4752 8109
7011 8109 7507 7079 9969 7775 9879 5998 8316 6862 3891 9505 5509 3158 4326 2048 -5726
6996 -5726 -8452 -10696 -4144 -5098 -10290 -15610 -13813 -9898 -9917 -9240 -5419 -7234 -7778 -7076 -3571 138
6980 138 2671 5419 1912 2055 1691 -3690 -12540 -11314 -11727 -10922 -1295 -837 -6527 -6613 -3853 -5162 -5863
6963 -5863 -4716 -954 -2058 -1027 -7412 -6366 -6644 -1645 2336 2729 749 3643 244 -8917 -15729
6948 -15729 -14156 -8090 -4089 -3467 -7274 -1267 4532 6820 221 -4426 -4254 -3800 -12293 -17745 -9559
6933 -9559 -2190 -8818 -12196 -8307 -7948 -11389 -9645 -2613 -630 290 2572 2946 -30 -4140 -8431 -4800
6917 -4800 -5189 -2453 -1269 -6680 -11071 -8986 -9884 -4088 -2961 -9773 -13046 -2116 371 -3514 -1680
6902 -1680 -2123 159 1245 1266 3725 6668 9060 9849 6289 2105 1870 6590 8501 8634 5289 253
6886 253 -82 -657 -2291 -4215 -4732 -6324 -8879 -12264 -11427 -8567 -5155 -1585 -2104 -1965 -5761 -5082 -223
6869 -223 4029 3812 341 -5933 -5607 -2947 2966 9595 4263 -455 -3061 -4731 -4936 -1915 3734 7671
6853 7671 8811 5830 638 -5310 -1083 4210 2515 -3035 -3430 126 -1640 -3647 -2299 -5119 -4826
6838 -4826 -4031 -2206 315 1814 4736 1253 2473 1992 -721 -5910 -1297 330 668 -6076 -5711 2619
6822 2619 2818 3164 5293 3428 -4276 -2176 -507 -272 -1547 395 -273 -3387 -3843 -4007 -1506 -744 -2381
6805 -2381 2040 -3725 -4935 -2165 -4341 -6227 -6570 -5150 -7520 -7955 -4754 9030 13122 6331 -2061
6790 -2061 -6179 -4563 -7680 -5090 43 4363 6963 8153 8485 7068 895 -5152 -5526 -7152 -7300 -3044
6774 -3044 -3919 -5548 -1759 5715 8816 3696 -3787 -9784 -7178 -6985 -9718 -4894 2188 8120 12551
6759 12551 15178 22313 24320 27347 34140 35949 29226 25774 20598 2951 -8765 -4049 -5649 -3757
6745 -3757 -2962 -2417 -14506 -14478 -9603 -5435 -5726 -295 2334 4875 9021 656 -7475 -5048 -2041 -854
6729 -854 -3593 -5319 -4949 -3283 -756 -4304 329 6541 6521 8836 10062 8399 1007 -2211 -8223 -5683
6713 -5683 -2211 -5905 -2903 1306 3188 4764 409 -1677 -4810 -1513 2827 6509 5294 -5146 -9301
6698 -9301 -9355 -11718 -11396 -9486 -2369 -1546 -5060 -6384 -6140 -3620 -2562 -5189 7067 7279 -2258 -3164
6682 -3164 -10950 -12868 -13460 -7765 -8739 -7841 -2674 -5631 -4419 -546 -2576 -4363 -7157 -5092 -2222 -1083
6666 -1083 -5741 -10783 -13672 -3350 690 809 2463 -2279 -1653 -2308 -7201 -7482 -7536 -12878 -7791 3927
6650 3927 674 -985 -852 -8577 -10097 -7584 -7046 -3561 -8112 -13230 -13107 -10287 -10335 -7240 1749 7765
6634 7765 -3078 -9233 -9277 -14418 -21446 -18653 -6892 -2967 -4299 -3473 -5426 -9760 -10554 -5206 -2480
6619 -2480 1965 -1752 -9030 -5541 1451 1276 3108 4837 1661 429 7461 12353 6015 -7506 -11229
6604 -11229 -7604 160 4174 -1367 -2257 3604 407 -5770 -5662 -4877 -2282 -1361 -7767 -4889 -1257 1980
6588 1980 -309 2147 2052 3463 1845 2505 3797 -2060 -2357 -3116 -4961 2025 4903 486 -5596 -10149
6572 -10149 -8331 -5654 -7285 -11188 -9053 -5617 -4358 -2627 -1409 216 4818 546 -5065 -10443 -9261
6557 -9261 -6244 1379 77 1322 3588 4773 5233 -832 -6820 -4949 -3577 -4460 -6056 -5882 -3706 -2110
6541 -2110 -1167 2842 -566 -317 -1699 -4431 -8055 -5221 3893 900 -7220 -8628 -8820 -15923 -12374 -9973
6525 -9973 -14401 -16997 -14606 -13824 -14132 -12681 -13789 -13764 -10228 -4986 -5949 -14782 -16810 -9818 -6019 -6788
6509 -6788 -11041 -10313 -6884 -5839 -9119 -5688 -1371 4654 3920 -6266 -6810 -7935 -6964 7281 12838
6494 12838 11551 7924 6693 3381 4125 3553 1515 4098 1226 -1666 -278 -931 -4969 -5001 -286 3058
6478 3058 3605 -1292 3342 4305 11789 7691 1278 -6141 -7683 -3780 -4272 -1352 -1053 -406 -4078 -8903
6462 -8903 -8272 -5088 1217 -1325 -13027 -9809 -5057 -1813 491 -4700 -12510 -10620 -12094 -11004 -7396
6447 -7396 -2688 -2597 -10575 -9581 -3823 -10655 -12083 -9544 -4707 7965 7464 839 -5969 -5135 -2943 -4019
6431 -4019 -4055 1820 -2498 -2492 7747 14458 20998 18618 7066 3673 8399 11538 6350 -2059 -9246 -7937
6415 -7937 -5817 -8241 -3960 3944 7437 8880 11259 6773 3585 -2107 -5596 -13218 -19677 -16239 -6370
6400 -6370 -2936 -1642 -1280 -4330 -1688 2936 6468 12856 16493 9153 6085 9660 10671 14356 11739
6385 11739 9859 794 -1556 4994 5177 4957 6324 2406 -551 4554 6626 2115 -4442 -5854 -6238
6370 -6238 -5532 -13715 -16268 -12763 -2471 5318 5180 711 -825 -4284 -6397 -11706 -10887 -11458 -14326 -12607
6354 -12607 -11048 -9417 -11036 -13629 -12691 -14659 -12972 -12550 -966 1377 -4881 -3828 -5456 -1092 -7022
6339 -7022 -12153 -7451 -3529 -4986 -1847 -1055 141 -2554 -3911 -3852 1719 3061 1502 -928 -12196
6324 -12196 -17729 -11650 -11249 -14798 -12195 -26 -2367 -4992 -3143 1597 -2835 -7263 -5786 -4543 -531
6309 -531 370 3354 3782 -8470 -13676 -12521 -4875 -247 -1390 -3160 -13343 -12263 -9530 -10398 -10497 -9740
6293 -9740 -16300 -15276 -16093 -7225 -6095 -2282 -5228 -5087 1613 1251 -1387 2295 2727 -6554 -13447 -15065
6277 -15065 -12438 -9888 -2092 720 -229 9735 8873 4431 1952 570 2711 -1016 -1197 -1104 -10564 -10315
6261 -10315 -4364 -5567 -4298 1153 4338 315 -8102 -7442 -2918 -901 6870 11934 6377 10277 15337
6246 15337 13864 9027 3153 5753 11997 7539 4286 3671 387 -1965 3113 1616 650 -3673 -4013
6231 -4013 -3039 -8916 -11731 -10340 -5783 -3543 1498 2487 75 -7912 -8560 -10792 -12624 -12907 -12797 -5454
6215 -5454 -1430 -1263 -4479 -8339 -4788 -8025 -4011 1752 6494 -1571 -10287 -11202 -10171 -7912 -372
6200 -372 6760 5767 1852 3169 3429 793 2613 848 -6470 -9221 -7040 -664 4576 7436 6995 3604
6184 3604 3176 7531 10637 8192 10693 7764 -1154 -3476 -2896 -2603 1571 2458 -3190 -378 -2313 -2715
6168 -2715 -1929 822 -3014 -1149 -3121 -214 11011 14094 13422 10666 629 -7707 -9922 -15094 -14288
6153 -14288 -10992 -10210 -9662 -9839 -7735 -8343 -13975 -7282 -1675 -246 1642 -702 -833 -1656 -5955 2557
6137 2557 7080 3959 -5410 -7817 -6123 -3467 6970 5138 -4169 -2523 -4424 -1066 2740 -4900 -4463
6122 -4463 -8460 -6716 -5795 -8811 -6370 -4692 -1235 5094 13654 14604 6457 2829 2560 -3244 -7294 -7967
6106 -7967 -7555 -14059 -18767 -19351 -15133 -8478 783 -837 -6637 -5131 5662 5674 2360 484 1336 10406
6090 10406 10045 4682 6964 3571 3393 5314 -4943 -3574 1775 -3686 -7363 -8975 -12760 -4856 -2633
6075 -2633 -1800 -106 -9002 -10696 -11365 -7390 -6259 -1235 -570 -472 -911 432 4608 5962 3968 3255 -650
6058 -650 -1190 1594 10065 12277 11057 3825 151 3344 5694 7034 7063 -2890 -5564 -125 -2372 -7851
6042 -7851 -4165 289 2906 4991 -1337 -3150 -472 -2208 -4985 -7910 -11495 -6821 3913 2266 1493
6027 1493 -169 2788 -242 -1905 -2822 -2168 -2843 -4775 -7242 -10902 -5291 -240 -3277 -5525 -2604 -5207
6011 -5207 -6466 -4564 -7314 -5578 -6774 876 -2355 -11697 -14441 -6377 -3927 -5149 -4388 -9583 -6274
5996 -6274 2294 8453 4104 2219 816 -8416 -8348 799 -1829 -4953 -6238 -6066 -732 7214 11978 5269
5980 5269 -5079 -2477 -3103 -1870 4280 5869 1240 -3125 -1917 -2035 -5059 360 1904 -3228 -4252
5965 -4252 -5923 -10192 -8447 -6145 -2852 -5104 -6418 -2332 54 -1780 -9960 -12311 -6014 -3866 -6205
5950 -6205 -1129 -1099 5804 7326 708 -444 6446 6524 2803 4649 4510 -8262 -11800 -5561 -6867 -11839
5934 -11839 -15165 -11525 -6592 914 73 -6044 -10307 -9101 -8958 -7998 -3431 1379 893 -2596 -363 -2121
5918 -2121 -4328 310 -3574 -10783 -10150 -9723 633 3944 985 1406 -380 -3119 7567 12367 3864
5903 3864 -2781 -5725 -5603 -7303 626 2231 -2176 -694 818 1716 3377 3067 2754 5002 8325 877
5887 877 -5834 -15872 -16966 -17727 -12607 -14929 -19144 -10693 -6543 -7440 -6721 -5129 -5067 -7001 -10185 -11645
5871 -11645 -5342 -4926 -593 4100 -1868 -5397 -5594 -5109 -5154 -2072 1747 4770 2980 -860 -3011 -2695
5855 -2695 878 -2478 -1247 1361 -881 507 -265 -5655 -11306 -9369 -12001 -15729 -16146 -17080 -8788 -4534
5839 -4534 -3217 -6450 -6597 -2101 -4285 -12086 -10841 -8519 -1181 -462 -9027 -5839 3931 4426 -1350 -4871
5823 -4871 -791 -3163 -6127 -4800 -7450 -10796 -8586 -3526 384 5342 8111 5559 3601 6469 5248
5808 5248 -5426 -15846 -13386 -7018 -1245 2062 1950 6005 2689 -2858 -3496 -3460 -3776 -8119 -4951 1467
5792 1467 -1480 -200 3266 -2292 -1414 605 -2327 -3968 -2375 5145 11389 8547 1167 -405 4311
5777 4311 1127 -2537 -1266 3665 -935 -2386 3052 3136 1622 3703 -2727 -1032 1133 -2138 -8342
5762 -8342 -10167 -11751 -9158 -1664 -2102 4395 6675 4266 -1219 -2227 6 -4353 -10225 -14076 -12228
5747 -12228 -7392 -3477 -3759 -5741 -9542 -5227 2360 5540 610 140 4086 7122 5730 684 -568
5732 -568 -5737 -5464 -2206 -116 2805 3472 2865 -3822 -2164 -1453 -2058 -2753 -5432 -7832 -3664 2852 601
5715 601 -4174 -7776 -10251 -3325 4365 3357 2416 -3714 -8272 -10391 -6697 2225 6338 5695 7559 4925
5699 4925 4859 3531 -1811 -1122 -6337 -10258 -6414 -9740 -6996 7743 12740 15028 12289 8326 -3015
5684 -3015 -13253 -12797 -10049 -4638 -8302 -12725 -10208 -5010 -3132 52 -1318 -6673 691 -4696 -2508
5669 -2508 -1073 -1876 -2924 -3763 -6269 -3439 8396 4579 115 -974 -941 -3359 -6706 -12248 -7928 -1339
5653 -1339 6137 4890 7715 10644 2656 3982 765 -812 2858 4603 582 -4414 -11940 -18409 -13998
5638 -13998 936 340 -287 1811 3390 2743 1242 2199 -391 -10893 -14206 -14788 -10494 -12121 -7799
5623 -7799 -2728 2359 4473 1337 3015 9026 14873 14889 10457 2371 3260 -186 -3844 -11541 -9053 -2815
5607 -2815 -4937 -6188 -9828 -13184 -6245 -7817 -7393 -3413 -3354 -6378 -6391 -14905 -14383 -8950 -6076 -3464
5591 -3464 -3698 -1343 -994 2057 -1145 -3721 242 -302 -1263 871 -1864 -4533 -6136 1069 -4995 -11733
5575 -11733 -2556 -152 -3463 -7021 -10029 -13248 -10116 -4265 1890 4946 6934 6674 2669 5044 10283
5560 10283 8487 6761 5892 -491 -2678 -2615 529 9220 10839 11858 4885 -2262 -7556 -11180 -7468
5545 -7468 -9697 -9850 -4655 1644 3372 5835 7807 7521 4812 6504 1063 -3788 -1274 -3217 -6632
5530 -6632 -6702 -2514 -3420 -12850 -20752 -16361 -13351 -6456 -4254 -1678 -130 2270 -1631 -9184 -11490 -5275
5514 -5275 6627 7980 4027 -100 -2622 -3355 -4767 -5735 -4698 5793 7626 5517 7723 -1853 -4316
5499 -4316 -3752 -7656 -10634 -8606 -12837 -10898 -4735 28 2658 -3701 -8106 -5474 -937 -174 -2368
5484 -2368 -584 -3508 -4099 -4078 -11356 -14482 -11037 -3764 1914 -344 -457 -2686 -5654 -6992 -1426 2880
5468 2880 5692 4045 1608 -628 3298 6687 1026 607 3793 4661 2957 -5449 -5413 -5835 -3284 -3490
5452 -3490 911 2698 8073 5211 1911 -5154 -7806 -6563 -630 5115 1802 -2114 396 4420 2725
5437 2725 -2847 -6087 -1537 -1232 -1325 7750 6735 3115 3286 -2861 -6781 -8288 -3366 2767 6688 3550
5421 3550 -1837 -6016 -4864 -4297 -697 7193 662 -2599 1344 6161 3234 680 -3420 -3103 1530
5406 1530 8303 14585 15033 14635 9657 500 582 5567 -2032 -9982 -5488 -492 -2047 -4618 -3626 -10122
5390 -10122 -19218 -12057 -14824 -16081 -19251 -11730 -11847 -8333 -4027 -5676 -11273 -17323 -21114 -19997 -9732
5375 -9732 -5124 -5125 1548 594 -979 3817 361 -3683 -621 -2713 196 -388 -2229 -6891 -1128 -10
5359 -10 2472 2933 865 -1170 -2792 -2844 -4052 -6975 -9688 -10437 -6316 1608 -4286 -5908 -3067 -1482
5343 -1482 -5291 -1688 570 871 448 -4005 -7621 -500 3859 -682 1202 5047 142 -163 -1912 5039
5327 5039 1666 -5761 -9395 -6238 -1333 2226 -332 3101 -1037 -8866 -7183 -5980 -10309 -4936 -1034
5312 -1034 -3631 -5567 -706 -1635 -793 -640 2933 2018 2535 -4154 -6689 -7939 -6503 69 2504 -147
5296 -147 -3977 1022 2887 1547 -2497 -9553 -12312 -8286 -3809 -5940 -11082 -9820 -10246 -6731 -3621
5281 -3621 -149 4627 5481 -7202 -15643 -15413 -7977 -328 -2196 -5801 -7215 -10986 -14322 -10929 -10907 -12471
5265 -12471 -9203 -376 -4617 -6718 -4644 -1157 -9558 -11499 -12669 -7952 -3877 -5311 -4635 -1100 355
5250 355 -2346 -4573 412 -2445 -1513 5610 3346 -2823 -2298 1296 2807 9278 11957 -652 -5332
5235 -5332 -3428 -1686 3401 6141 2555 -533 -2130 -9076 -1693 2718 3074 3788 6049 10929 10071 6944
5219 6944 10082 5801 2909 -413 1679 7580 11799 8184 6681 1287 -8075 -11727 -8519 -11065 -7963
5204 -7963 -10776 -7860 2237 1597 -3256 -7290 -5584 -5285 -1300 433 3555 -768 -5576 -7371 -12151
5189 -12151 -13309 -8986 413 7627 1303 -851 -1970 -2850 -6357 -1155 705 4947 -3090 -9301 -6599
5174 -6599 -5263 -9578 -8328 -1295 6882 6353 2294 3290 -1616 6086 6033 -2010 -5103 -5652 1762 -6473
5158 -6473 -11593 -9526 -13017 -13542 -9496 -8709 -5449 478 -2696 -6648 -11393 -6313 -698 284 274 -7028
5142 -7028 -4349 -4344 -9273 -8454 -6415 -4495 1364 5387 2683 952 -3552 -4927 -5272 -22 -3825 -10320
5126 -10320 -3579 -5340 -10879 -12936 -10092 -5171 9196 15308 16186 11884 2377 -5093 -2196 -5838 -7948
5111 -7948 -5895 -7809 -2867 -3616 -9726 -15664 -9818 -1039 2411 3041 823 5463 7858 1283 1676 5434
5095 5434 5540 -974 -11032 -16373 -13413 -1230 6898 2369 3890 8467 6720 3298 -2734 -2177 -4829
5080 -4829 -5426 -4602 1130 595 -778 -4643 -5266 -4111 -3633 5316 12716 13276 13053 12480 10951 5789 5981
5063 5981 -2106 -5907 -3545 -2427 3744 -905 -2596 -2269 -5397 1883 4871 3992 3791 3160 1230 5328
5047 5328 11961 13020 8777 7001 3871 -1245 63 1496 1145 8353 5849 1584 1949 1934 -5966 -4628
5031 -4628 -4854 -4456 -17334 -18487 -12142 -7984 -4562 -11065 -3584 8197 10116 8465 4011 -7070 -12694
5016 -12694 -10837 -5230 -4882 -2558 313 3921 3593 3486 2422 6007 5941 -4697 -7826 -1674 6640 13615
5000 13615 8154 4202 11085 12168 13389 14162 15290 15524 16025 12569 10223 7282 7474 5373 169 -1739
4984 -1739 3641 -4475 -6461 -2931 -269 2217 3441 -356 -2896 335 -3154 -3362 -14 -1300 -1004
4969 -1004 -2325 -1798 46 5147 4691 -5415 -11095 -6383 -1312 7222 4661 5524 12451 10173 589
4954 589 -3635 -7265 -6470 -3149 -5310 -6235 -8632 -5628 306 1146 -7491 -9609 -13150 -7927 -4926 -5811
4938 -5811 -846 193 -2208 -648 3813 929 -11011 -11249 -4384 6421 10111 4688 1075 -4765 3202
4923 3202 4940 5791 3858 -937 2397 6938 5581 3412 1102 3020 5354 -1416 -7183 -9423 -7367
4908 -7367 -5499 -4154 -8418 -4323 -3669 -2546 2395 7644 4942 -3332 -129 4640 5259 9524 5423
4893 5423 3980 10046 10439 6089 3731 1247 1982 3327 -1634 -944 446 -421 3035 6212 12907 12979
4877 12979 9639 11672 12816 6202 -6072 -6544 -4326 4678 9396 11746 8372 2797 7038 11354 10429
4862 10429 11315 13609 10962 8758 3914 1527 -3596 -9160 -6125 -3294 409 458 -196 -5507 -6841 -8803
4846 -8803 -8713 -2852 1477 2097 5754 3823 7570 11882 6279 -2989 -6623 -16685 -14693 -6395 -3676
4831 -3676 -7389 -5397 -8185 -5708 -6278 -7459 -6800 1289 4382 1352 3016 9121 9453 7245 513 379
4815 379 1334 1570 -1135 -3305 -1201 1657 2065 9955 15095 12925 8802 5258 3049 1819 -4873 -745
4799 -745 3405 3655 -4384 -3943 -1783 -6475 -13512 -6100 1498 2576 -816 9268 19176 16129 10217
4784 10217 6880 3214 1418 -1809 -4069 -5209 3751 -2812 343 4898 8621 11856 14186 7654 6935
4769 6935 3612 2052 3891 5298 8294 13724 7736 1992 1621 -3226 -7269 -4762 -3865 -1005 -2577
4754 -2577 -497 738 4764 9731 11262 14536 16917 10891 1897 -574 327 -1962 -6755 -6371 4427
4739 4427 6941 3654 -3707 -8658 -11491 -11567 -4717 -453 -4491 -14832 -5269 -1045 493 2725 2554
4724 2554 -7140 -6472 -3175 1143 6232 5976 517 -2750 -6578 -10516 -5280 -362 -1216 417 4880 10862
4708 10862 12658 7655 8061 9678 5890 500 -626 -2695 -8181 -7586 -4175 2914 -2812 -4124 1344
4693 1344 4293 271 3853 2343 655 -5304 -11989 -9821 -2402 545 842 3426 -3289 -6199 -4464
4678 -4464 -4799 -1380 -5662 -1675 348 2891 1570 424 6514 7835 7236 8592 8995 5084 2354 2275
4662 2275 9231 12232 16078 16566 13571 5705 -270 -3137 -36 -613 -2148 -6697 -5614 -2164 2832
4647 2832 -51 2018 797 -7093 -1494 4390 1303 4396 3840 -2797 -11077 -7828 -726 406 -166
4632 -166 -718 -4885 -36 7400 8754 9168 7758 3219 -356 -4462 -5995 -6167 -3146 609 3764 1666
4616 1666 9304 6145 -1319 -10513 -10396 -923 1337 -3670 -3448 -4481 -12870 -18537 -10596 -4653 -1060
4601 -1060 1244 -2100 -3965 -8640 -9083 -8382 -5229 -7219 -10810 -5634 -1528 1295 -1384 4028 8012
4586 8012 2266 140 -3938 -4180 -4221 -8633 -4105 -8799 -5924 -742 3365 1971 4950 12263 9949 638
4570 638 -1707 1228 -208 -1516 -3192 -6541 -10311 -5107 2172 4172 6278 5581 1715 -2087 -2054 5220
4554 5220 14234 11307 4870 5657 12726 9114 5731 3849 6402 8223 -462 -3792 5065 1942 3139
4539 3139 4236 1135 6207 12341 16049 16551 12963 6633 4040 12136 16103 16143 13682 5540 -881 -2285
4523 -2285 3874 8464 9072 5372 5804 2858 130 2496 5155 2394 -2366 -7563 -5201 -5449 -736 -296
4507 -296 127 1842 6908 4883 2655 8727 9270 11578 11926 7504 5638 10108 17347 16441 11008 12975
4491 12975 16236 16543 6871 -2689 -8283 -9527 1343 6643 2420 375 2912 4877 316 -4340 -5401
4476 -5401 -3964 -4744 -6112 -7729 -11123 -5299 1823 -2838 -1350 -2425 -7409 -1611 1708 -1608 -2265
4461 -2265 709 1957 698 1372 3855 4749 7940 7125 2411 -150 -6136 -10619 -5782 -4519 -7839 -7176
4445 -7176 -1521 2811 3130 -545 2288 773 -2148 -15174 -18837 -8862 -4931 -7869 -8265 -3509 -4776
4430 -4776 -7314 -8722 -12803 -12060 -5713 -104 812 -5473 -5079 355 6169 12839 10372 6131 -1006 -3446
4414 -3446 -6409 -12979 -14885 -10446 -6452 2153 7147 7870 9211 12723 15833 11003 4549 -2972 646
4399 646 -400 -696 6181 13302 11869 4123 8442 9753 3280 871 2223 172 3414 480 2465
4384 2465 446 2622 604 -4392 -5120 -5086 738 270 -3457 -1713 5928 -1235 2462 8148 2992 -2358
4368 -2358 -4001 -4308 -3768 -1441 2414 997 -1529 27 1908 6975 10167 5122 2220 2142 3285 3860
4352 3860 5977 611 -6513 -11764 -12090 -11171 -7693 -2386 -6596 -11134 -9389 -7787 -8162 -5779 -4772 -3987
4336 -3987 -3826 -7882 -7695 -3163 2899 4928 6763 485 -429 4045 5346 4573 6868 6310 2287 1826
4320 1826 -1089 -1705 -5529 -6823 -3973 -5076 -5387 1441 3563 1761 5806 -144 -2449 62 -786 -4158
4304 -4158 -4179 -7423 -16476 -12931 -6321 -9113 -13456 -7226 -3939 -4241 -11396 -14177 -12661 -10669 -8877 -4863
4288 -4863 -465 -3430 -5800 -2344 -261 -383 -1759 -3770 -7547 1113 2073 3363 9523 12431 6918
4273 6918 4584 6585 5385 1392 1972 -516 -4018 -7414 -6388 -3416 -4539 465 5549 7048 7892
4258 7892 8465 7735 2813 1457 4461 4125 1983 2849 2217 3151 7813 13980 16158 12672 6246 -1858
4242 -1858 -1908 -6850 -2809 -2776 1408 4019 8633 8602 4054 324 163 5846 3993 -1780 -4538 -1765 -1836
4225 -1836 -363 -4785 15 -1551 3033 4223 2403 3681 9012 4518 3776 3126 1116 2723 -405
4210 -405 -4613 -5502 -4540 -12851 -16475 -14075 -12558 -10681 -7007 -12500 -15972 -10710 -5822 -2068 -3015 -4255
4194 -4255 -1247 -1706 2272 4143 -312 -2966 -3737 -3650 -7854 -7366 -5373 -954 -392 -2444 -8256 -7635 -9287
4177 -9287 -8043 -4448 1851 8387 6547 3933 900 743 6011 3980 -2271 -6007 -7826 -7686 -8050 -6465
4161 -6465 -7569 -9652 -5206 -3129 -2913 -5147 -5455 -4591 -3676 -487 3709 13640 4662 338 1793 5862
4145 5862 1522 2876 7043 9413 6051 6 -1170 -3430 -2117 -677 -2658 -5321 -7375 -3491 1188
4130 1188 5115 8063 4291 2842 -5790 -3673 -1704 1014 -179 -8704 -10294 -6574 -1662 6584 9187
4115 9187 10061 6125 1499 -4309 -8674 -8612 -4854 -5628 -10366 -14135 -10288 -5016 -643 2224 7101 14402
4099 14402 12747 8513 10265 823 -1803 -4046 -2394 -5022 -947 789 -2475 -7560 -4080 -548 3263
4084 3263 -3890 -11485 -8795 -13560 -19463 -17136 -10438 -6513 -3949 -538 -6253 -10666 -3435 -1754 -7391
4069 -7391 -3573 -1818 -3888 -3259 -4385 1178 6801 14858 11961 4724 1459 6953 8212 7662 8789
4054 8789 7525 8275 6692 442 -644 2671 2289 -581 -1098 -6713 -4922 -3505 2439 -1302 -2048 -2984
4038 -2984 -6454 113 2055 1700 1475 1964 -2622 3001 5638 9314 9096 9442 3658 -2502 2684 5493
4022 5493 2673 3850 -1967 -6544 -3239 -1041 3067 -1808 -1566 -1352 -2441 -4368 -4666 -7697 -8834 -15060
4006 -15060 -5297 -976 1782 2328 4401 2528 -4970 -6925 -7591 -3078 2587 1577 -5171 -11072 -10485
3991 -10485 370 2519 9124 7847 2370 185 4005 9379 8341 10297 7350 5502 7667 8896
3977 8896 9354 2761 -1545 -321 2849 5154 -382 -2150 -1041 -614 -2747 4177 2245 364 -1565
3962 -1565 -1302 2766 4961 -2214 -8625 -3202 2436 -3578 -1365 1705 -1823 -12424 326 789 94
3947 94 4730 10280 8028 5108 7316 2953 2207 7766 3908 1889 2111 3747 1373 -4346 -3765 -4581
3931 -4581 -9204 -9243 -4905 284 240 -3100 -3125 437 3767 4124 4648 2436 -3676 -10406 -8060 -4758 -5189
3914 -5189 -9064 -3260 2119 -5053 -3809 1307 -2823 -8286 -7489 -6668 -1752 738 -2594 1024 1082 -442
3898 -442 6902 5241 440 -4204 -2379 -479 4 1647 2896 -486 1577 -2700 -140 1424 5159
3883 5159 9209 13725 5342 967 -20 1573 2879 3379 2833 -3990 -6242 -616 2754 62 6649 5097
3867 5097 2550 1625 -4275 -6795 -2881 3973 -1178 -7094 -1416 8653 11033 5183 -5309 -9197 -10002
3852 -10002 -11240 -14583 -7907 -4204 -4899 -3701 -4566 -2506 -8164 -12088 -10047 -10366 -10219 -10936 -8599 -2198
3836 -2198 -1147 6379 15340 23673 14715 3616 968 -1383 -1162 203 -3236 -4832 -1069 3808 1709
3821 1709 -2416 -1198 -2444 -8087 -18828 -13565 -6275 -2923 1903 5846 11116 6754 -542 -3868 1733
3806 1733 10073 6326 5576 8899 11674 6786 -51 4825 1885 6187 12710 12961 8346 214 -460 585
3790 585 -8024 -11553 -3978 -2520 1345 9158 6474 3567 6 -2273 -2 -4883 -7789 -2818 5873
3775 5873 5124 9626 18357 10785 4157 2121 -889 -4985 -14803 -11739 -414 6241 2984 4492 12199
3760 12199 6681 -618 -6217 -6327 -8286 -11562 -11399 -9314 -7937 -620 19 -4418 -4950 1093 628 423
3744 423 -1039 -2904 -5902 -4240 -1494 4932 10187 10344 9225 6900 -1268 -2329 2964 3501 3129 1975
3728 1975 6807 8307 3624 3385 1577 -1863 -2530 -205 2052 -123 -1436 -2214 2574 7767 8317 6610
3712 6610 1413 246 1049 7743 6448 6638 8448 6210 4902 11561 12613 9319 5425 6093 9114 12339
3696 12339 14257 10556 9445 7894 6275 5309 4246 10790 13686 7631 3852 -5010 -7913 -7339 -7817
3681 -7817 -7359 -4614 -11013 -21035 -20207 -15147 -6220 3735 3305 447 -1997 -4598 -2655 -4909 -1717
3666 -1717 1052 5180 500 4472 7108 6964 15337 6742 -4878 -11456 -8356 -3469 -6043 -4795 -3046
3651 -3046 -6620 -9109 -7136 -10623 -6393 -1697 -1942 156 3953 6505 11451 8986 11838 5064 -20
3636 -20 4401 7928 -2402 -5704 -3904 -3182 -3730 -3881 -2867 -4637 -9723 -8610 -4844 -2131 -956 -661
3620 -661 3274 3578 -3437 -6699 915 1384 -88 -1729 -2139 -5831 -2598 -1334 9286 13473 13453 12997
3604 12997 12539 10995 12440 11014 8159 2045 -2732 -4878 -7386 -4354 -1730 -3642 -692 -5571 -505
3589 -505 3118 6245 2468 -4884 -14002 -14647 -9299 -6805 -6311 -4384 -5629 -14682 -17024 -19122 -10515 -8946
3573 -8946 -6754 -407 -237 -6286 -2348 1171 -1132 -2592 1203 1071 -5864 -12304 -12696 -6286 -6207 -9890
3557 -9890 -9972 -17028 -12458 -10623 -6424 -5366 -1639 -589 699 4894 497 -6775 -3748 -1540 -4303
3542 -4303 -5805 -7453 -8352 1798 6688 8077 1805 207 5260 6093 -98 1207 3420 4499 10583
3527 10583 14381 8456 742 6374 6398 7358 2869 -6971 -9861 -4898 4425 4933 321 -41 9637 16740
3511 16740 13114 7264 7603 8384 3348 -4284 -3877 1072 2564 5088 6027 -309 -8492 -15114 -16218 -9967
3495 -9967 -1643 -2202 175 -2756 -176 -1591 -6043 1335 4680 -5374 -8742 -11575 -5308 -554 1411
3480 1411 -6133 -4351 5234 9033 391 -10000 -13731 -8401 -1810 750 -13 -318 -3670 -7888 -4807
3465 -4807 -5285 -1307 1861 2822 2812 2819 3390 2340 -1782 -4792 -3861 2211 1046 662 1830 1344 4477 2287
3447 2287 -1549 -5198 -2029 2275 5446 3728 5571 6110 7389 6468 -2418 -7540 -39 4926 1280
3432 1280 -4632 -2140 4973 8582 5961 1845 -789 2719 1274 2296 -1243 443 2458 331 -4354
3417 -4354 -1819 -5231 -62 4872 5901 1224 -5336 -13714 -14169 -7199 2373 8421 13490 9241 -684
3402 -684 -1366 -4414 -2953 -4277 -2394 -3037 -4479 -6564 -3498 -3250 -3047 -5741 -2348 -4070 -9735 -5677
3386 -5677 -2546 -9199 -6784 -3043 1633 -4207 -6674 -2738 -3171 -4193 763 3761 5077 6010 9612
3371 9612 10281 10567 9772 9201 12212 12017 -2697 -8150 -1054 6995 10431 10447 9711 10039 6714 427 -918
3354 -918 -1702 152 -4775 -4552 1357 9432 4011 -3991 -4047 167 1570 1986 -2426 -2349 3561 5437 7378
3337 7378 5837 4758 7091 3910 -294 376 -4753 -11949 -1032 -436 -182 -2270 3350 4344 -290 -1113
3321 -1113 1063 -4130 2214 2851 -1574 -1 4606 1302 2315 7875 3936 5372 9921 12550 5541
3306 5541 489 -1486 -520 5777 8294 9271 6186 3875 5743 1556 -5055 -4596 207 2168 10331 14823
3290 14823 9759 8940 11846 7106 5164 -4866 -10252 -5232 336 118 1219 -57 -2343 -7216 -1835
3275 -1835 2142 -2344 -10266 -10503 -6920 -6112 -1707 6664 4535 2726 7391 -2332 -2909 2661 8401 11693
3259 11693 11121 12792 11590 5438 764 3190 12837 14418 9278 -839 -3521 -9009 -7039 -604 -1019
3244 -1019 -4973 -5594 -11802 -12461 -2872 -1592 -376 -4157 -4789 -3810 -4514 -7817 -5807 1841 5621 5314
3228 5314 5653 10366 8231 3136 -876 -5847 -11594 -4235 5680 9479 8088 1189 1127 7179 8478 -180
3212 -180 -3414 -1714 5008 3089 -1784 -6059 -3483 -3526 -2922 -1487 4259 7542 9092 6879 6025 5160
3196 5160 6811 759 829 2896 5810 11574 3591 224 -45 -5809 -11676 -7462 -5173 -5806 -6856 -3390
3180 -3390 3696 11019 15336 2445 1503 3384 -1768 -3023 -1279 -3449 -627 5274 -846 -4376 -131
3165 -131 736 3376 -2047 2771 5602 710 2459 10854 9620 4130 759 1507 1265 -2780 -6330 -7704
3149 -7704 2179 8298 416 -2534 2541 245 -161 -1969 1552 -1270 1725 -66 6847 9525 10907
3134 10907 12653 11352 9622 5703 -1260 -6683 -4165 1386 6155 6638 7384 10478 5737 -4551 -3527
3119 -3527 -4269 -1164 -2962 -4224 -4688 -2100 -4044 70 7883 7360 5739 -1778 -9199 -12220 -9406 -6052
3103 -6052 2819 5104 5568 7225 11124 7683 821 -1581 326 3091 9364 9332 7488 -265 -3790 -3271
3087 -3271 1445 3588 2309 3950 2388 3105 380 6686 10862 3752 1981 9482 11132 7955 -1728
3072 -1728 -795 -4848 -5909 -6934 -6441 -9177 -9633 -7479 1410 9941 9602 4077 -484 -2800 -1197 433
3056 433 -4795 -9688 -3642 1204 401 -665 -53 6176 8138 803 1588 -2696 -956 1358 -2221 -1956
3040 -1956 -7636 -8943 -8894 -6337 -9998 -4344 -3840 -4379 -6511 -5042 -200 -3158 1554 3139 -4872 -4986
3024 -4986 -159 -622 -984 -3534 1159 3974 2511 2678 8945 -9 901 1864 5259 9012 6981 2663
3008 2663 -7606 -7938 -5995 -10982 -17930 -14079 -12668 -13386 -6904 1572 6490 420 -10970 -11528 -14728
2993 -14728 -9430 -14384 -15725 -7566 684 4715 2629 3895 1501 -1556 -7513 -11107 -9912 -1198 1205
2978 1205 7217 12676 13282 9860 2145 853 -59 4379 7965 1144 -5968 -10445 -9108 -5636 -2833
2963 -2833 -2716 -3786 -7337 -15067 -13035 -11890 -5088 -2984 -3635 -2354 -1206 -1347 5279 3543 81 7301
2947 7301 2091 1068 3468 374 -711 -2515 3589 849 -8504 -4677 -2466 -1343 5023 9665 -900
2932 -900 -8470 -13541 -12704 -6059 -1132 -7887 -10774 -5386 -2224 -7634 -6910 -5359 -4353 -436 681 -538
2916 -538 4186 5559 -2887 -3266 -888 4176 4375 5607 7209 12956 13862 11271 2112 -3333 1436 579
2900 579 1163 1177 -3969 1219 -471 -8607 -10011 -7164 -3300 2144 3240 3698 4115 6059 6231 918 -3199
2883 -3199 -458 3216 409 -326 5044 1078 -1966 -4959 -4338 -49 91 3328 2597 -515 -2691 -4219
2867 -4219 -7055 -5554 9065 13324 7386 6016 6441 6956 12176 15429 10686 3928 5299 -1176 -11146
2852 -11146 -7200 854 2658 -601 1938 -2788 -4143 -2446 442 4144 16341 19381 11467 -371
2838 -371 -123 3847 -3710 -8997 -9194 -1084 2547 1938 6448 4659 4777 8094 2949 -3367 1545 6919
2822 6919 7260 8372 5666 1657 18 -2183 258 -494 398 3354 2073 -241 4576 3401 290 -2495
2806 -2495 -2518 -4424 -289 4381 -1886 -74 2575 7520 2461 -3245 -4023 368 2861 5040 8645 11991
2790 11991 17392 15755 7666 5058 4818 1472 2926 4897 -2219 -414 2905 2629 5143 1391 -10032
2775 -10032 -12791 -10428 -1968 -2001 -704 6641 4515 3215 3199 2012 1074 -52 4504 8725 1541 -6623
2759 -6623 -9152 -965 -1409 -1896 5249 10804 9693 5340 1440 6281 10215 15469 14756 12713 6589 6738
2743 6738 4803 2286 -1262 -5969 -9704 -10240 -3766 -1190 -6242 -6439 924 6919 9193 12817 14118
2728 14118 11469 11065 10856 12028 11223 8017 6149 6091 3861 4803 9061 6600 7830 980 -2789 -505
2712 -505 6291 710 -8170 -3548 4767 8172 6092 6824 2605 2226 10385 10852 5582 156 -8638 -10812
2696 -10812 -8841 -2537 -867 -5440 -10751 -10318 -7066 -917 3750 -202 -10916 -8862 -6520 -5040 -7927
2681 -7927 -8144 -7728 -4364 -601 691 1151 3869 1728 3987 -602 -6303 -6722 -4773 -8216 -14711 -16517
2665 -16517 -10782 -5095 -678 3167 3442 1979 3613 -1913 -3260 4975 7668 -1424 -8125 -4561 -1388
2650 -1388 1411 -1666 484 6534 9656 11171 5227 -2569 -2137 1163 6202 2097 1175 1622 -6019 -3926
2634 -3926 -4292 -3564 8298 12427 11026 5639 9309 11044 6293 6984 7860 5971 -1641 -7177 -11532 -18060
2618 -18060 -16963 -9606 1734 5003 1057 -9201 -7983 1895 9053 7325 4795 4291 932 2248
2604 2248 3373 3992 3136 -1530 -5985 -8046 -752 6947 10416 2724 -4147 -3008 1920 4398 877
2589 877 -7999 -9369 -898 1466 4152 4386 3530 2566 988 -4223 -6433 -9331 -4552 1188 -1293 -1104
2573 -1104 -3146 2147 932 3716 1217 1528 6143 10377 8950 7501 12856 9655 9257 10731 7068
2558 7068 -457 -534 -984 6102 13647 11333 3230 -3198 -5660 1716 15784 15285 7175 6793 4317 2357
2542 2357 6140 9096 11541 16684 17138 13304 3648 -1039 968 8767 5982 4784 1755 1010 632 1898
2526 1898 5564 4836 10663 10863 8801 11018 11791 14792 15313 13022 10015 8513 4951 -1638 -1060 -2999
2510 -2999 -760 -1410 -3244 2188 3898 4399 3243 -3500 -4123 1035 5628 9214 5564 246 -2352 -4828
2494 -4828 -8416 -3584 -2593 -4954 -721 1740 4892 4441 1776 4150 -650 -1726 6965 8951 7999 6054
2478 6054 -1236 -4366 2778 13556 14242 11503 3132 -4692 -7545 -6857 -8574 -15421 -10175 -2838 -1309
2463 -1309 3258 5064 5641 7301 12761 20822 12925 4805 9797 8550 4044 -1352 -6096 -1227 -181
2448 -181 -328 -200 -6032 -12009 -16219 -16925 -13189 -11574 -5679 -8870 -10079 -8977 -10080 -4666 443 -5564
2432 -5564 2144 7098 5528 1797 2623 2507 2152 2901 -4427 -3796 64 2045 -2411 -3552 4152 1306
2416 1306 -2025 -2388 1468 5738 2961 -6791 -3656 4376 10333 6866 2762 623 -1673 -331 -2768
2401 -2768 -10902 -14024 -24437 -13634 -4856 -4695 -7584 -7512 -7830 -3509 4680 4510 2548 2115 8728 -2966
2385 -2966 -1454 2904 -137 1413 4101 586 -3262 -7971 -6333 1935 6082 5639 6445 7859 8117 -649
2369 -649 -7035 -3268 2919 9147 14343 11903 11546 11452 5319 1580 -432 9464 9899 10974 8402 7067
2353 7067 6737 2792 5395 4114 5884 6953 2026 -2288 -1934 -9311 -2168 4631 6302 3706 3100 4808
2337 4808 5896 1312 -5352 -4402 -1884 -1828 -1053 4175 2091 -392 1015 6476 11926 11078 11159 9110 8194
2320 8194 6685 11633 10465 3074 3720 10992 9014 -1100 1819 2194 5938 14886 8788 -3158 -2093
2305 -2093 3074 53 -4551 -4643 -4366 2048 779 -1432 -4672 -4118 -747 1809 3948 3442 -1894 -9578
2289 -9578 -6014 -3973 310 3847 5733 2041 -1573 -5429 -5239 2578 35 2127 7211 2784 3452
2274 3452 1019 -2562 1573 -3023 -1927 1026 6549 2650 -4965 1913 1896 -1770 -6775 203 1808
2259 1808 -2009 -4366 -4830 -3047 231 5541 11719 18138 12104 8859 7903 4078 648 161 3915 5421
2243 5421 1924 -4420 -6178 -1390 4299 2547 -8236 -7078 -5539 -637 1278 -719 -6556 -11907 -8633
2228 -8633 -1643 7065 8305 1423 3429 8725 -978 -5370 -7311 -2721 748 2722 5232 3685 -2106
2213 -2106 -3677 3823 7767 9085 9582 10680 10363 5150 -1387 -1914 620 422 8542 6214 1326 -1395
2197 -1395 -3325 -7052 -11050 -10636 -1132 3400 3249 9245 13968 11377 4880 -2588 -6959 -29 12315
2182 12315 9777 -1841 -3842 -2427 -2951 -199 -3301 -4471 -6802 -5641 -2946 -2183 -623 -3453 397
2167 397 482 -4186 -3373 -804 -947 -10209 -13064 -6186 -6239 -10579 -11367 -7697 -10438 -1530 1948 6557 12213
2150 12213 16210 13238 10873 5928 988 3367 4338 2824 1644 502 3397 6673 1632 5354 1497
2135 1497 -366 -3418 -9415 -6592 -4479 -6581 -10552 -12302 -11678 -10069 -6361 3023 3401 -3025 -10594
2120 -10594 -15286 -7318 -778 -2761 -3234 568 -3182 575 1655 4728 5384 -1843 -4506 -5975 -3172
2105 -3172 4730 14019 12460 1210 -2901 -8932 -10507 -13976 -7289 -4698 -4494 -7326 -1305 5864 11012
2090 11012 8988 2261 -1429 -5965 -2913 3159 11424 11486 9161 10227 10542 12079 14159 13475 9731 11653
2074 11653 11071 1386 1226 5823 9941 9405 -6782 -7937 -4798 -4012 1389 334 2282 3825 3317 -5129
2058 -5129 -6278 -3033 -714 -5776 -7304 -3834 -8941 -12168 -5802 3434 -517 -3667 -3758 2057 4323
2043 4323 448 -10210 -3602 387 -3555 -1378 -2002 -7640 -3460 -2564 -7643 -1482 8020 6868 6223
2028 6223 -1138 -779 -7222 -5820 505 4184 -691 1353 1782 1500 600 1153 -3432 -182 1234 1280 -1085
2011 -1085 70 -3033 1729 -128 -6192 -5308 -646 -3790 -6096 -7694 747 8360 10691 9360 6785
1996 6785 2975 1949 5835 4175 4036 -93 -5567 -9180 -6702 -665 -2601 -1569 2310 3642 4042
1981 4042 822 7738 10309 4463 391 -3738 -6768 -11111 -6196 5660 2539 -2723 30 1559 2854
1966 2854 10015 8796 3234 758 -3570 -3840 3237 9439 -1849 -6802 -2393 -1484 1276 5922 4857
1951 4857 -289 -3053 1744 3405 1606 3324 2536 -5240 -5652 -6632 -4666 -11624 -10773 -4855 -3469 -1569
1935 -1569 -3369 -2412 -11301 -10127 -1858 3093 868 -2280 1133 2830 5351 6511 -1005 -1878 1098
1920 1098 -1309 -5853 -3374 -1948 1883 18 -5893 -5178 -6946 -3278 -787 2947 1451 4422 9007
1905 9007 9442 4776 2372 5686 3678 -3313 -7931 -154 2086 1004 4921 6706 5732 4265 2184
1890 2184 6631 8182 10099 11514 7349 1344 -5800 1691 10632 10599 8138 97 -2765 287 -5438
1875 -5438 -5077 -6328 -8985 -9742 -8373 -9328 -7792 -3562 -977 -4703 -3574 5096 15036 13092 8772 2745
1859 2745 -10006 -9861 -6617 -3362 -6293 -4008 -4631 -6717 -3369 -3033 -5068 -8284 -7010 -3620 -4451 -6638
1843 -6638 -120 3606 727 -2464 -7407 -741 6795 5835 2554 -3367 -884 -862 -4810 -6733 -6988 -10895
1827 -10895 -7921 -707 2814 1108 3983 4535 11955 12057 5527 992 -780 5055 7440 11130 15804
1812 15804 14617 14355 15998 12855 8733 7999 12229 18868 19774 9273 4578 3428 5281 849 -782
1797 -782 -1996 956 25 3801 2266 -2785 -12672 -16889 -12180 -8370 -1291 -4836 -7225 -121 2524
1782 2524 -2671 -4535 -3253 2382 -3345 -13207 -17557 -7435 2616 683 4546 6268 10172 12388
1768 12388 10453 3140 -3258 -1490 5471 11081 7118 -2359 -5298 2309 -2891 -3758 -5523 -3671 -1629
1753 -1629 1026 1821 1646 -1575 -670 3380 5984 11191 16251 10189 10965 3656 155 4287 5597 -1268
1737 -1268 1906 7470 11018 16224 14593 7936 12122 7186 4189 7501 4525 2459 1372 1974 5207
1722 5207 6453 2228 -5284 -4395 -2138 1828 3186 1379 4498 15213 11565 2313 1068 1210 -784
1707 -784 3690 3260 127 6868 9666 9818 6942 2256 -1648 -1892 -3540 -1951 549 -153 -1550 -1026
1691 -1026 2287 -3166 -5051 3220 4401 -7885 -14341 -13306 -9588 -5174 8651 12507 10885 4371
1677 4371 386 -2980 2802 11085 17434 16534 10226 12720 11263 4281 -1772 -9697 -9842 -8381 -3961
1662 -3961 2575 2987 3133 4264 1973 -6547 -9105 -7582 -3413 735 -3717 -8157 -3215 -3229 -5996 -6582
1646 -6582 -9362 -1675 3013 1279 3622 4876 5334 2624 -580 -3599 1406 2710 -781 -3193 -1269
1631 -1269 -3958 -10192 -2174 7453 8516 -5216 -3253 2586 368 2012 8864 7033 4784 1964 -5193
1616 -5193 -8200 -2699 -3091 -7906 -4750 -1518 2411 10184 5307 -4117 -4114 -3553 -269 2688 5882 2295
1600 2295 -2306 -2041 -3124 -2701 -1854 -12509 -8122 -2481 -6150 -6431 -5328 -3143 2289 4230 6644 -3909
1584 -3909 -1643 -1976 -6684 -1150 -3320 -9576 -12933 -12689 -15020 -12218 -6654 -1052 231 -1623 -4285
1569 -4285 -3194 -4306 -4789 -1895 1588 3626 7232 6060 5667 11516 7168 8467 11685 2152 -8902
1554 -8902 -10846 -6103 -8143 -9739 155 4785 2356 -4583 -7170 -7330 529 3404 42 640 -2898
1539 -2898 2594 12007 20820 22746 16786 9217 7754 5529 1577 4201 11158 15960 2841 2000 9068
1524 9068 11305 13052 6826 2443 -5208 -5728 1428 3973 8827 9282 729 2720 2360 2688 -867 -10703
1508 -10703 -13682 -5883 -2811 1954 6802 6937 3051 1433 1192 6315 6530 9997 16830 25089 22289
1493 22289 10724 779 1903 -771 553 5397 10142 10377 -2582 -7193 -3290 -11651 -25084 -25352
1479 -25352 -17287 -12625 -13177 -10911 -3911 -1055 -463 383 -3990 -3034 1548 6337 11719 12816 8318 5176
1463 5176 6514 14442 8865 4839 4662 8919 6206 -2996 848 1509 108 -1682 3684 4275 586 3620
1447 3620 -602 -9340 -7228 -6059 2446 5866 2723 6164 9109 7238 8449 3159 -1130 3927 2481
1432 2481 -1429 793 -2458 -2092 1648 -3722 -10310 -4122 -4928 -7311 -5545 -1730 1156 2866 4521
1417 4521 -2163 -6919 -6842 -3067 -2936 -11087 -13339 -10982 -11150 -12218 -12402 -10537 -4785 -5312 -447 5572
1401 5572 2095 1218 8175 6923 2173 6889 5801 5147 4191 -461 -1633 4060 1430 -799 1177 1710
1385 1710 2750 8937 5358 -804 -4036 -1588 4162 7656 1217 -5963 -3659 -4693 4621 10444 9212
1370 9212 2871 2589 2594 798 2470 1433 -214 -961 438 -4722 -5576 148 -784 -3394 -1763 -1699 -3568
1353 -3568 3406 6069 7647 1916 -3211 1286 1354 1143 -1591 -10548 -7694 1481 5223 6245 -1842 -1511
1337 -1511 2608 6974 9850 7175 6051 6231 4226 8195 9470 2746 -172 -1480 -2930 -1802 -1017
1322 -1017 6071 17889 19059 15960 5633 -3454 2912 6890 2349 -156 -2603 -2874 -2157 -1985 -2123
1307 -2123 -4779 -9120 -10767 -5978 352 5420 8464 4140 -2145 -9421 -8498 -1160 -1928 -2644 -6655 -2550
1291 -2550 2105 5721 1250 -2379 -3773 -2711 -14784 -24210 -27838 -17568 -10100 -10216 -10724 -6756 -7120
1276 -7120 -7806 -1866 -2793 -7910 -8966 -7559 -3184 -2015 -974 -1019 4916 10504 10616 4913 3858 -2959
1260 -2959 -5060 -3714 2552 5238 -338 1265 -2718 -7221 -5557 0 5115 5351 2939 4422 -600
1245 -600 -3566 -2120 -406 -3854 -3217 31 2464 11074 13672 5646 -1138 -3663 2311 12234 12794 13644
1229 13644 11871 3882 -994 -7440 -11345 -6990 -6611 -6619 2111 3038 3485 -1047 -1222 1111 4400 3010
1213 3010 3195 5769 7894 9721 5786 9840 7564 5407 582 -1497 4923 552 -2892 -6311 -4102
1198 -4102 -3463 -3225 93 -972 723 860 3572 6598 -4828 -6477 -1453 6434 -953 -5011 -3391
1183 -3391 2549 2650 -8765 -11108 -1868 -877 -1434 -1831 3638 7289 -62 -2705 98 -2444 -4937 -11808
1167 -11808 -11600 -4572 659 2383 4552 1672 -2309 176 2008 -1761 -2937 -4663 -1309 -3166 -4054
1152 -4054 -10632 -6442 834 6436 6602 2528 2481 3601 1883 5776 5814 -2055 -3098 -1992 -5628 -5819
1136 -5819 -10006 -9093 -50 1918 1943 5885 9329 9501 7962 2159 -3634 -8058 -5740 -1764 5636 9338
1120 9338 7271 12285 7216 2636 6312 6382 -1148 -4697 3753 7045 3171 6135 9182 8956 3278 -2042
1104 -2042 -2303 586 2129 1894 4707 7291 10438 4906 -1392 -1122 1663 4730 -2270 -4444 552 -2772
1088 -2772 -8042 -7399 -9841 -9068 -1937 -2293 -2935 1133 2059 2925 1212 -2728 2041 2462 4755 11942 10934
1071 10934 8779 8995 1208 -468 2452 -3928 -4967 -3437 -3319 -1257 -2070 -7188 -2684 3304 1873
1056 1873 5857 8085 8474 7693 8385 5763 3919 772 948 -5060 -5749 -986 -3495 -7360 -2144 1913
1040 1913 -2053 -3356 2304 -5404 -6382 -761 4513 12636 12075 4679 1715 4337 2449 175 5570
1025 5570 10898 12997 10418 9046 3354 -1480 -3972 -7785 -3018 3578 2653 -1125 -3899 -8292 -5388
1010 -5388 -1130 -2945 -1688 2954 3803 -2921 -2597 3046 7489 4361 6348 5227 -2229 -5137 -7312
995 -7312 -3954 -1334 -2986 -1344 -936 201 4778 8113 12888 6379 3864 3112 8574 10321 1444 -4119
979 -4119 1777 3354 111 1626 -1548 -7805 -8705 -10664 -12894 -13343 -15824 -13543 -11900 -14588 -15858 -8430
963 -8430 -2933 -7934 -6352 -3537 -3859 5827 -2587 -5620 -3807 -6963 -6798 -231 803 1418 4884 6149
947 6149 3425 -2128 -10539 -7775 -8786 -6921 -2967 -3227 -3724 -2055 -7095 -6598 1077 5963 7979 13164
931 13164 22662 17460 1790 -4553 -3144 -954 -6874 -14558 -14070 -8752 -1257 -4249 -3900 -3779 -9871
916 -9871 -8980 -4922 1884 1671 589 -1740 -5760 -4316 -5096 -112 -3799 -3512 -2715 2835 7250 644
900 644 3527 -3316 -5101 -2681 719 3768 5319 3699 -2595 5004 7162 1601 -2434 -7051 -6198 -4078
884 -4078 -4107 -5533 -2620 2162 9014 8857 4874 5246 132 -4664 -3563 -592 -828 -472 2328 641 2469
867 2469 4331 3417 10522 12262 6943 4820 -212 197 3714 1081 4214 10694 5107 -225 1523 -3990
851 -3990 -6829 -937 -1294 -5762 -3480 -3581 1000 2389 4064 5911 11595 9210 6109 16420 14771
836 14771 7478 10131 7083 3355 430 -4523 -4652 1398 -654 -1463 -3119 -3743 1743 1052 -4483 -11740
820 -11740 -8118 -8190 -6123 -5118 -1279 814 -5151 -7635 -2377 4547 1407 -1594 -319 2139 6797
805 6797 7678 1148 -2892 -1952 -6912 -3980 -3505 -12375 -10783 -8513 -6446 -7218 -1992 5437 -1166 -8013
789 -8013 -9341 -8203 -4683 -7901 -1054 3984 -1900 -5429 -4883 -5797 811 720 -734 -1436 5340 3581
773 3581 652 678 -1123 -3771 -2493 -1290 919 -111 5022 7519 14720 16950 14409 15034 10988 5274
757 5274 2216 -2934 -1300 -3037 -3660 802 6242 6289 7204 839 -3766 389 3914 -1862 -5477 -3424
741 -3424 1658 2447 3931 5834 12087 15387 18442 13569 1948 -2948 -799 4938 6780 -2938 -10112
726 -10112 -12975 -9680 -3575 911 -391 -2969 -9750 -6935 -8064 -13281 -10153 -5848 -7241 -8214 -881
711 -881 500 -4816 -6191 -5288 -7551 -9228 -4382 -4923 -4377 2217 8255 8974 2861 711 2391 5297
695 5297 9565 8133 8967 12277 12291 5564 -2941 -5300 -953 -651 2634 11867 9359 10329 10069 3435 -1413
678 -1413 2643 7052 6924 2945 1176 -326 99 -2733 1465 1164 -418 -2375 2856 1837 -4131 -6957
662 -6957 -982 1100 279 -1716 -500 -3630 -1279 -5461 -5515 -8040 -5020 1742 -460 -911 1616 -4737
646 -4737 -4118 -4102 -9609 -12580 -14432 -11714 -13001 -10207 -2091 -471 -5402 -12334 -11458 -8705 -6789 -4238
630 -4238 2823 11265 11417 9524 4600 4360 8386 10681 7444 7699 8873 902 -2324 1242 -928 -686
614 -686 -5511 -3344 -1472 2339 6357 5501 2416 -517 -3557 72 3504 2573 -3780 -6594 -7344 -4857
598 -4857 -5255 -1800 1962 555 -3005 2458 3149 21 -129 -6383 -4617 -4523 -4167 -1273 2436 3804 1065
581 1065 -1779 1615 46 -1730 2748 5509 -1078 -1275 -654 -2485 -4286 300 1513 2960 2983 4666
565 4666 5659 608 -10007 -7891 3242 799 -3598 -4480 -4387 -9450 -253 1732 -1615 -3020 379 -2940
549 -2940 -8067 -8787 -1407 -6564 -4073 -139 -3261 -3696 1052 -881 -321 7168 4205 1648 3236 3281
533 3281 1875 -427 -2423 440 263 -5143 -6779 -8094 -4014 -7363 -4241 -1741 2185 -2838 -6770
518 -6770 -4401 -7923 -15616 -14065 -6443 2025 4904 6872 6454 5588 5347 3832 2746 2801 1568 1422 1236
501 1236 -4323 -9006 -4370 -1724 752 -95 3761 4145 -2260 -5090 -3724 -1687 -8048 -8622 -7217 970
485 970 1258 3299 -1438 -39 -1987 -1950 -4030 -2953 965 2912 -7715 -10877 -12049 -18596 -7846 -5157
469 -5157 -7041 -5330 -6029 -9453 -10061 -10325 -9170 -5488 96 -5286 -11829 -10174 -7263 -5340 -14 -506
453 -506 -3645 -2341 -4591 -4175 1988 -4129 -2353 -3594 -4549 -129 -3597 -14026 -13526 -8559 -1310 384
437 384 -3072 2025 7930 5776 9651 7344 3233 5791 3738 2871 26 -924 130 -899 -5610 -2697
421 -2697 -3821 -6047 -2075 -4360 -4377 -5739 -2747 594 2502 6462 2087 -592 -1978 3779 7426 1609
405 1609 -3808 -539 -2409 -2765 -264 5241 3568 -672 -1125 1512 911 4635 8865 9065 -2683 -12187
389 -12187 -7986 -5918 -2208 -642 5344 9769 7275 6321 13089 15370 11298 5088 403 -3397 -3510
374 -3510 -2768 -6551 -3101 -1334 -3670 -2741 1471 10185 15009 9444 1664 -5008 -8299 -6952 -3559 -3643
358 -3643 -2222 341 4121 6825 8980 9535 2511 1582 -110 -445 4963 6804 9061 10364 13047 9969
342 9969 5499 6517 6878 5113 303 371 3114 4292 3388 5803 8066 6120 6255 -326 1206 1901 -2217
325 -2217 -3087 -617 4881 6988 8076 8236 4797 2596 2805 -441 -2858 1576 -71 -5207 -6363 -6841
309 -6841 -3892 3201 6371 5130 3784 5975 5993 3577 -2918 -2365 -1563 2339 2405 -3290 -1673 3032 4502
292 4502 -2893 -9762 -5536 -3726 -6534 -4073 -3098 576 3639 7833 14381 14823 14861 7923 6096 -723
276 -723 -7784 -8086 -5709 -9591 -2025 -3823 -7064 -9387 -6273 -4857 -5790 -4673 -4490 -3576 -1116 4074
260 4074 -217 -4873 -8148 -10958 -10462 -9914 -2155 -4253 -7976 -14022 -12757 -3051 -2254 -6928 -4912 -1441
244 -1441 -235 2611 2226 4977 -1526 -293 -218 -2377 -7905 -10441 -15221 -12178 -9997 -7842 -4499 -4352
228 -4352 -7249 306 899 2115 -365 -1072 552 3316 1823 -862 -3662 -4288 -1061 -740 -2192 -415
212 -415 2730 7296 9282 6893 5201 6664 5996 2543 826 -1839 -1805 1715 2823 1980 5941 8708
196 8708 5444 -2540 -3005 -4865 -7061 -3159 1667 2101 3642 7565 5784 2139 -3707 -7145 -7866 -11369
180 -11369 -10420 87 5354 3266 192 -2327 -4070 444 -845 -1754 -3233 -3867 834 2178 602
165 602 2432 3442 2542 3778 -1765 -5212 -4108 -2358 -3610 -1383 -1081 154 4258 2586 -2776 -10980
149 -10980 -6389 -1249 -2590 -4540 -2098 2532 1567 -4883 -6676 -5244 -2024 -1131 -3242 352 1416
134 1416 1803 2523 2911 3158 2258 -3079 -3143 -5786 -1929 -3749 -2850 -7732 -9894 -6927 -4455 -2681 380
117 380 4763 7474 7794 8375 10152 5715 -480 -1857 -659 -3367 -7608 -1932 1541 1747 3599 295
101 295 -3072 -1132 -119 -1134 163 1064 3454 3209 1342 1048 -3065 -899 2015 629 387 1663
85 1663 -2907 -6910 -8473 -9450 -5796 -1602 -2594 -5028 -5844 -9534 -9031 -6285 -4998 -3266 -1048 2003
69 2003 2392 2678 4155 4860 7778 3944 -887 650 2624 -59 -6340 -5026 -2004 1984 -581 -9454
53 -9454 -8045 -2293 891 3175 3327 3506 6527 1324 -1287 -2594 -4183 -4051 -4432 -5538 -5723 -2570 -3998
36 -3998 -2874 -6535 -3394 2271 594 3340 7546 6996 8163 8578 5886 899 -1893 -2427 -1499 -4162
20 -4162 -4391 483 -176 -714 -988 -208 2981 1940 -73 -2839 -2117 47 2665 5521 5867 2690 -1723
3 -1723 -2569 -1077 -3572
0 -3572
$$ Imaginary data points
##PAGE= N=2
##DATA TABLE= (X++(I..I)), XYDATA
32767 30613 32522 30225 22904 24098 26898 28199 31850 35194 35673 35642 30036 28203 27652 32292 39636
32752 39636 43594 43400 36974 37639 43101 41408 41264 45157 47721 45232 41950 47190 44408 43618 48541
32737 48541 47255 40877 40723 43900 41654 39658 38522 37619 39612 40553 42068 41868 42815 45265 48520 45627
32721 45627 41669 45265 47413 46209 44626 45165 46167 53951 57172 54653 50294 51340 56817 62047 62173
32706 62173 56215 55193 59235 60305 63654 59972 53323 54127 53546 55106 60700 59920 58304 60084 58957
32691 58957 53652 50356 52025 55235 57045 56712 56124 56848 61490 65874 64262 64608 65210 61744 55858 61857
32675 61857 72389 73771 65548 63778 62487 61376 63518 73824 78450 77364 76826 72312 72501 67777
32661 67777 64590 67719 67896 66227 65096 67799 70189 72371 73751 67847 67854 73225 73166 73009 71533 70986
32645 70986 69678 72049 73227 73839 77914 75450 70296 71818 77114 79275 77799 77200 80933 81701 78714
32630 78714 78917 80443 81486 80614 79152 76685 71878 75364 85014 87996 84547 83364 79748 78095 79345
32615 79345 76521 77664 79089 83742 86129 88051 85629 83956 86015 88001 87052 85773 83427 83665 89572
32600 89572 87859 85759 86719 83861 84446 84584 89846 91412 94143 93805 94163 86855 84014 87271 89657 85846
32584 85846 85728 89469 91833 93443 96908 93715 92906 91541 86297 87307 89697 94922 97058 97855 95548
32569 95548 94911 97684 99465 101540 94923 89983 94793 95957 94645 88334 88266 90173 91962 102339 106419
32554 106419 102884 98835 96361 98381 99357 98977 101550 105893 106081 109997 113372 111010 113457 115238 110387
32539 110387 107726 107953 106890 108966 113912 108998 101740 107410 107965 108736 104214 105623 109202 110003 118483
32524 118483 114950 108738 108836 108317 105682 103514 103942 99769 99981 98526 103600 113533 118370 115626 112261
32509 112261 108806 102670 103327 107739 105172 98587 98267 108388 112834 117350 120932 121572 124786 120459 117189
32494 117189 119801 120784 118661 114166 108802 113003 119077 120971 118828 120007 121321 117089 116244 121880 125607
32479 125607 122721 123018 124477 119727 114766 118833 122904 118931 117256 121366 117821 118105 123843 128523 126750
32464 126750 129466 130742 128948 128061 129065 125719 134736 140323 141963 138885 135487 124189 117816 117957
32450 117957 117586 123543 122993 120609 115488 115278 123840 129927 133426 127670 127008 129572 132070 136619 135766
32435 135766 136620 135811 132169 131636 132055 128372 121333 120959 127048 123889 120001 120966 123925 125927 123251 132246
32419 132246 134100 131192 132977 131275 133120 134526 131619 136251 135305 132230 123993 119740 121106 122475
32405 122475 129542 138381 138017 134030 130657 137569 137322 135007 132669 132120 138114 139099 133049 129086 128990 136287
32389 136287 139486 132694 134535 138527 140961 144101 139201 134920 136717 137230 143806 142082 144465 138977
32375 138977 137403 138617 142115 142828 137582 137936 136251 130717 137236 138570 136612 138644 141600 146434 147216
32360 147216 143100 140937 146260 146345 143158 142869 143605 143751 145540 142925 141615 138348 141171 146658 144173
32345 144173 141096 134206 131914 136155 142038 148960 149356 147411 144535 148232 142386 140087 142491 138386
32331 138386 127583 126368 129983 131966 130113 132608 137436 138349 140692 142879 142866 144098 141436 137005 133366
32316 133366 134698 133725 137994 143503 145553 146998 149338 145045 144131 144935 145408 143042 143192 139725 140277 139784
32300 139784 138189 143174 145358 141361 141112 136404 134357 136788 140121 138133 131159 128643 138604 145675
32286 145675 144729 143998 147019 153633 158199 154348 150347 147423 147632 142689 141098 138667 139914 144615 147178
32271 147178 143430 145569 146335 142327 139328 139287 137820 141889 143436 146103 148964 148729 147790 139394 149241
32256 149241 156120 153938 150200 146677 152011 156030 153016 152549 153197 154353 152488 147703 148196 143051 146557
32241 146557 153061 151049 153789 157462 157824 153331 146015 145864 144039 143155 143090 148549 153867 154600 148843 150375
32225 150375 156456 156403 154400 154465 157999 159948 155138 146607 145104 141573 138938 145293 149649 152224 150573
32210 150573 149907 150946 147457 142860 143544 146557 149695 147738 141086 133126 134769 141640 146848 150424 150648
32195 150648 153195 153182 146686 153577 156990 156465 152363 144490 141232 141704 146190 149900 146537 149498 152186
32180 152186 148788 149792 144054 148538 150600 144794 145110 146695 142744 142845 143273 144451 150997 150976 146769
32165 146769 140880 138289 136841 136403 141268 141419 135537 135106 141714 147192 149037 151543 153015 153513 150508
32150 150508 146525 147745 149450 152386 154834 156146 154520 153673 158286 156777 154857 147566 142796 141996 145505
32135 145505 143064 143858 147610 152381 156125 149751 150613 155120 158441 162607 162282 160817 156609 152861 149835
32120 149835 156991 157078 155265 149428 146176 144862 148638 157318 150523 149124 152992 152462 156085 160189 156850
32105 156850 153913 158910 155890 151803 143920 145559 153962 158051 162822 162014 158367 152108 153654 158884
32091 158884 159425 158615 155787 152464 153799 158137 158480 154463 153796 151137 151427 151530 146033 140338 140241 138560
32075 138560 141278 144163 142521 148151 153195 152473 150036 148544 151894 152041 153725 154391 153106 147296 142974
32060 142974 141203 147068 151864 154589 146744 138230 139160 146308 145646 149091 146154 146344 149211 157442 166563
32045 166563 160168 154511 154904 157106 161245 165166 164105 159885 155261 157847 161645 161572 162100 166751 165182
32030 165182 159751 152439 153648 149850 143869 145839 151850 157686 162094 159859 162361 160063 159915 154389
32016 154389 151996 145189 146112 153545 152481 152130 152935 155954 161498 158952 160737 150401 151491 148924 149420
32001 149420 153702 155037 154666 157384 161832 152010 149159 151307 150045 154638 159366 163379 162872 155287 152102
31986 152102 148783 153752 154820 157154 160292 162879 160923 158324 158148 163980 162815 158436 159361 159696 161361
31971 161361 163323 163617 160010 154336 154985 151136 152365 146290 137749 137294 144053 153503 157428 153308 149709
31956 149709 152564 154473 158579 160234 163520 161384 162931 162584 160761 158044 157246 152429 148831 152599 148763
31941 148763 140908 143799 148551 144027 147217 157125 162511 162579 153727 156219 159436 160650 165136 162302 159379
31926 159379 159786 160550 160783 160539 161741 163129 162558 158290 156109 155102 154579 156032 155539 155311 146830 142259
31910 142259 143988 145200 145189 135382 134938 134032 133989 142834 145207 145131 138398 147643 151437 152393 150841 154779
31894 154779 148579 148887 150615 155406 152585 145847 143909 145048 148037 151813 153478 155908 152061 151879 144071
31879 144071 147968 158166 165310 156370 148581 147562 154857 161147 158554 160824 154233 153058 156295 157534
31865 157534 158702 156749 156058 154516 150395 147734 148417 150603 150202 152300 149912 155510 153311 152455 154702
31850 154702 153861 151321 159631 156915 154615 148838 151775 153387 156712 151952 155265 150480 146011 147457
31836 147457 154001 161992 163140 165878 164218 163227 159652 161612 158494 155643 152432 148067 145770 147624
31822 147624 159345 168257 165661 161216 161131 152608 142039 142611 143924 154019 158968 158484 153913 147667
31808 147667 145683 145414 150960 156276 152018 154556 156236 159974 151955 142218 141901 138461 137396 143205 147143
31793 147143 151527 157712 157048 151182 150252 150842 147185 149392 157253 154470 160433 161824 157045 158302 160490
31778 160490 157747 157290 164721 161887 155954 153824 150340 153018 151735 146160 143072 148832 152448 160098
31764 160098 161238 152814 141283 140659 141856 142028 145099 150719 157140 157678 155735 157760 155243 149505 147526
31749 147526 147318 152378 150616 153024 155977 163227 166221 162820 157806 163586 167362 165512 157795 155442
31735 155442 156499 157841 159966 161238 161867 162636 160188 150894 151851 163820 161174 157510 152510 147531 149675
31720 149675 155231 157012 158292 158801 153561 150427 155117 157368 158910 163717 160996 153622 152411 147416
31706 147416 145203 150001 152495 157583 155772 160423 161196 154921 153937 156330 145681 149736 150389 155895 158058
31691 158058 154342 156089 161453 163863 159230 157455 155348 154715 155821 148591 146323 151336 154546 151219
31677 151219 149364 149265 146017 146010 148964 146505 146464 146307 149364 145063 149672 157759 159865 159949 154992 153216 143537
$$ [...]
##END NTUPLES=NMR SPECTRUM
##END=
