##TITLE=Analysis number 328841
Compound Code cc 58714
Book Reference 486/168
Project Code adrs
Chemist Name simons
##JCAMPDX= 6.0         $$ Bruker NMR JCAMP-DX V2.0
##DATA TYPE= NMR SPECTRUM
##DATA CLASS= NTUPLES
##ORIGIN= Bruker BioSpin GmbH
##OWNER= nmr
$$ XWIN-NMR		Version 3.5
$$ Mon Jul  9 13:21:40 2007 GMT Daylight Time (UT+1h)  MAYBRIDGE\nmr@NMR_250MHZ
##.OBSERVE FREQUENCY= 250.131544655141
##.OBSERVE NUCLEUS= ^1H
##.ACQUISITION MODE= SIMULTANEOUS (DQD)
##.ACQUISITION SCHEME= undefined
##.AVERAGES= 16
##.DIGITISER RES= 18
##SPECTROMETER/DATA SYSTEM= dpx250
##.PULSE SEQUENCE= zg30
##.SOLVENT NAME= CDCl3
##.SHIFT REFERENCE= (INTERNAL, CDCl3, 0, 16.4338)
##AUDIT TRAIL= $$ (NUMBER, WHEN, WHO, WHERE, WHAT)
$$ ##TITLE= Audit trail, XWIN-NMR		Version 3.5
$$ ##JCAMPDX= 5.01
$$ ##ORIGIN= Bruker BioSpin GmbH
$$ ##OWNER= nmr
$$ C:\u/data/dgb/nmr/ADRS/620/pdata/1/auditp.txt
$$ ##AUDIT TRAIL=  $$ (NUMBER, WHEN, WHO, WHERE, WHAT)
(   1,<2007-07-09 13:21:17.75 +100>,<MAYBRIDGE\nmr>,<NMR_250MHZ>,
      <created by zg, POWCHK disabled, PULCHK disabled
       configuration hash MD5:
       76 6E 9A 78 1E 09 19 81 EC 84 63 8F B0 6A 59 2D
       data hash MD5: 64K
       37 88 EA AE 3B 2E 68 9F 9F 6D F0 94 25 AD F7 74>)
(   2,<2007-07-09 13:21:29.95 +100>,<MAYBRIDGE\nmr>,<NMR_250MHZ>,
      <Start of raw data processing
       ef LB = 0.3 FT_mod = 6 PKNL = 1 SI = 32K 
       data hash MD5: 32K
       00 81 A7 B8 AB 1B 80 90 8A A0 11 0B 57 26 F0 8C>)
(   3,<2007-07-09 13:21:31.58 +100>,<MAYBRIDGE\nmr>,<NMR_250MHZ>,
      <apk 
       data hash MD5: 32K
       EE 19 B7 E0 32 D4 CB DD 37 C4 E8 B8 BB 6E 32 E4>)
(   4,<2007-07-09 13:21:32.25 +100>,<MAYBRIDGE\nmr>,<NMR_250MHZ>,
      <abs ABSG = 5 
       data hash MD5: 32K
       B8 ED 65 0B 9B 87 63 42 23 B7 D6 34 D0 75 6E 06>)
$$ ##END=
$$ 
$$ hash MD5
$$ E0 48 5F 91 A8 B3 41 CC E7 71 E3 CD 70 F6 5D 35
##$RELAX= 
##$RELAX= 
##$RELAX= 
##$RELAX= 
##$RELAX= 
##$RELAX= 
##$RELAX= 
$$ Bruker specific parameters
$$ --------------------------
##$DU= <C:\u>
##$EXPNO= 620
##$NAME= <ADRS>
##$PROCNO= 1
##$TYPE= <nmr>
##$USER= <dgb>
##$AMP= (0..31)
100 100 100 100 100 100 100 100 100 100 100 100 100 100 100 100 100 100 
100 100 100 100 100 100 100 100 100 100 100 100 100 100 
##$AQSEQ= 0
##$AQ_mod= 3
##$AUNM= <au_zg>
##$AUTOPOS= <44 >
##$BF1= 250.13
##$BF2= 250.13
##$BF3= 250.13
##$BF4= 250.13
##$BF5= 500.13
##$BF6= 500.13
##$BF7= 500.13
##$BF8= 500.13
##$BYTORDA= 1
##$CFDGTYP= 0
##$CFRGTYP= 5
##$CHEMSTR= <none>
##$CNST= (0..31)
1 1 145 1 1 1 1 1 1 1 1 1 1 1 1 1 1 1 1 1 1 1 1 1 1 1 1 1 1 1 1 1 
##$CPDPRG= <>
##$CPDPRG1= <>
##$CPDPRG2= <>
##$CPDPRG3= <>
##$CPDPRG4= <mlev>
##$CPDPRG5= <mlev>
##$CPDPRG6= <mlev>
##$CPDPRG7= <mlev>
##$CPDPRG8= <mlev>
##$CPDPRGB= <>
##$CPDPRGT= <>
##$D= (0..31)
0 1 0 0 0 0 0 0 0 0.06 0 0 0 0 0 0 0.0002 0 0 0 0 0 0 0 0 0 0 0 0 0 0 
0 
##$DATE= 1183983676
##$DBL= (0..7)
120 120 120 120 120 120 120 120 
##$DBP= (0..7)
150 150 150 150 150 150 150 150 
##$DBP07= 0
##$DBPNAM0= <>
##$DBPNAM1= <>
$$ [...]
##$SUBNAM7= <"">
##$SUBNAM8= <"">
##$SUBNAM9= <"">
##$SW= 20.6930455092707
##$SWIBOX= (0..15)
0 0 3 0 0 0 0 0 0 0 0 0 0 0 0 0 
##$SW_h= 5175.983436853
##$TD= 65536
##$TD0= 1
##$TE= 296.16
##$TE2= 300
##$TE3= 300
##$TEG= 300
##$TL= (0..7)
0 120 120 120 120 120 120 120 
##$TP= (0..7)
150 150 150 150 150 150 150 150 
##$TP07= 0
##$TPNAME0= <>
##$TPNAME1= <>
##$TPNAME2= <>
##$TPNAME3= <>
##$TPNAME4= <>
##$TPNAME5= <>
##$TPNAME6= <>
##$TPNAME7= <>
##$TPOAL= (0..7)
0.5 0.5 0.5 0.5 0.5 0.5 0.5 0.5 
##$TPOFFS= (0..7)
0 0 0 0 0 0 0 0 
##$TUNHIN= 0
##$TUNHOUT= 0
##$TUNXOUT= 0
##$USERA1= <user>
##$USERA2= <user>
##$USERA3= <user>
##$USERA4= <user>
##$USERA5= <user>
##$V9= 5
##$VALIST= <valist>
##$VCLIST= <CCCCCCCCCCCCCCC>
##$VD= 0
##$VDLIST= <DDDDDDDDDDDDDDD>
##$VPLIST= <PPPPPPPPPPPPPPP>
##$VTLIST= <TTTTTTTTTTTTTTT>
##$WBST= 1024
##$WBSW= 4
##$XGAIN= (0..3)
0 0 0 0 
##$XL= 0
##$YL= 0
##$YMAX_a= 390406
##$YMIN_a= -421049
##$ZGOPTNS= <>
##$ZL1= 120
##$ZL2= 120
##$ZL3= 120
##$ZL4= 120
##$ABSF1= 16.43384
##$ABSF2= -4.259331
##$ABSG= 5
##$ABSL= 3
##$ALPHA= 0
##$AQORDER= 0
##$ASSFAC= 0
##$ASSFACI= 0
##$ASSFACX= 0
##$ASSWID= 0
##$AUNMP= <proc_1d>
##$AZFE= 0.1
##$AZFW= 0.1
##$BCFW= 0
##$BC_mod= 0
##$BYTORDP= 0
##$COROFFS= 0
##$CY= 12.5
##$DATMOD= 1
##$DC= 0
##$DFILT= <>
##$DTYPP= 0
##$F1P= 14.0000005364418
##$F2P= -0.99999901652339
##$FCOR= 0.5
##$FTSIZE= 32768
##$FT_mod= 6
##$GAMMA= 0
##$GB= 0
##$INTBC= 1
##$INTSCL= 1
##$ISEN= 128
##$LB= 0.3
##$LEV0= 0
##$LPBIN= 0
##$MAXI= 10000
##$MC2= 0
##$MEAN= 0
##$ME_mod= 0
##$MI= 0
##$NCOEF= 0
##$NC_proc= -3
##$NLEV= 6
##$NOISF1= 0
##$NOISF2= 0
##$NSP= 0
##$NTH_PI= 0
##$NZP= 0
##$OFFSET= 16.43384
##$PC= 1
##$PHC0= -47.96043
##$PHC1= 1.852784
##$PH_mod= 1
##$PKNL= yes
##$PPARMOD= 0
##$PSCAL= 4
##$PSIGN= 0
##$REVERSE= no
##$SF= 250.130022050057
##$SI= 32768
##$SIGF1= 0
##$SIGF2= 0
##$SINO= 400
##$SIOLD= 32768
##$SREGLST= <1H.CDCl3>
##$SSB= 0
##$STSI= 32768
##$STSR= 0
##$SW_p= 5175.98343685301
##$SYMM= 0
##$S_DEV= 0
##$TDeff= 65536
##$TDoff= 0
##$TI= <Analysis number 999999
Compound Code 99
Book Reference 9
Project Code 9>
##$TILT= no
##$TM1= 0
##$TM2= 0
##$TOPLEV= 0
##$USERP1= <user>
##$USERP2= <user>
##$USERP3= <user>
##$USERP4= <user>
##$USERP5= <user>
##$WDW= 1
##$XDIM= 32768
##$YMAX_p= 477757658
##$YMIN_p= -58808
$$ End of Bruker specific parameters
$$ ---------------------------------
##NTUPLES= NMR SPECTRUM
##VAR_NAME=  FREQUENCY,     SPECTRUM/REAL,   SPECTRUM/IMAG
##SYMBOL=    X,             R,               I
##VAR_TYPE=  INDEPENDENT,   DEPENDENT,       DEPENDENT
##VAR_FORM=  AFFN,          ASDF,            ASDF
##VAR_DIM=   32768,         32768,           32768
##UNITS=     HZ,            ARBITRARY UNITS, ARBITRARY UNITS
##FACTOR=    0.157963299565203, 1,           1
##FIRST=     4110.59671103425, 0,            0
##LAST=      -1065.38672581876, 0,           0
##MIN=       -1065.38672581876, -58808,      0
##MAX=       4110.59671103425, 477757658,    0
$$ Real data points
##PAGE= N=1
##DATA TABLE= (X++(R..R)), XYDATA
$$ [...]
$$ plain form
16681 422447 515367 568771 592207 607313 607927 593539 543206 460340 384911 304213 252419 233066
16669 233066 216837 239035 270680 295987 306525 293935 251088 199988 165150 136955 122151
16658 122151 108793 102867 92272 82520 92081 88093 78139 65453 54893 57215 48661 46126 51261
16645 51261 52283 60686 51570 45595 52477 48798 54324 65161 62062 51066 56008 95441 135825
16632 135825 172371 219713 245841 236500 219643 195228 165901 147642 142342 150624 162323 178261
16620 178261 201068 228814 263923 266562 249704 208655 161885 131165 125490 117580 98128 84161
16608 84161 68368 70412 75648 82484 74588 79369 90618 92371 74633 66187 52320 52511 55413 42068
16594 42068 24868 22337 20846 26171 41374 59018 64231 61883 58979 46838 32633 38533 52183
$$ packed form
16681D22447R2920N3404K3436J5106O14j4388n0333q2866p5429q0698n1794j9353
16669B33066j6229K2198L1645K5307J0538j2590m2847n1100l4838k8195j4804
16658A22151j3358n926j0595r752R561l988r954j2686j0560K322q554k535N135
16645E1261J022Q403r116n975O882l679N526J0837l099j0996M942L9433M0384
16632A35825L6546M7342K6128r341j6857k4415k9327j8259n300Q282J1699J5938
16620A78261K2807K7746L5109K639j6858m1049m6770l0720n675p910j9452j3967
16608H4161j5793K044N236O836p896M781J1249J753j7738q446j3867J91K902j3345
16594D2068j7200k531j491N325J5203J7644N213k348k904j2141j4205N900J3650
$$ plain form
16581 52183 55548 49016 49831 44581 43877 41180 50281 48981 55443 53864 53032 40229 42230 56197 59630
16566 59630 48465 47158 44962 41972 41942 43834 35206 30904 30461 28016 28784 25175 22614 29301 32542
16551 32542 30303 30830 40685 32885 25430 23840 18565 12142 16770 12637 15272 13939 20705 33374
16537 33374 29255 36355 36777 32247 45958 55009 41741 30124 28648 21320 19258 24053 27255 29369
16523 29369 23575 33299 32536 27643 26963 23681 24880 12933 16052 26106 28834 29068 45067 39221
16509 39221 37451 45528 42531 36987 27428 22038 1099 -9966 453 11449 -4472 -9372 11094
16496 11094 23486 29298 43392 64066 60486 63492 65715 55365 50045 35770 25584 25794 24125
16483 24125 31959 37044 31709 20242 20214 30026 37120 33358 22689 -3339 14787 26486 29879 34333
$$ packed form
16581E2183L365o532Q15n250p04k697R101j300O462j579q32j2803K001J3967L433
16566E9630j1165j307k196k990l0J892q628m302m43k445P68l609k561O687L241
16551C2542k239N27R855p800p455j590n275o423M628m133K635j333O766J2669
16537C3374m119P100M22m530J3711R051j3268j1617j476p328k062M795L202K114
16523B9369n794R724p63m893o80l282J199j1947L119J0054K728K34J5999n846
16509C9221j770Q077k997n544r559n390k0939j1065J0419J0996j5921m900K0466
16496A1094J2392N812J4094K0674l580L006K223j0350n320j4275j0186K10j669
16483B4125P834N085n335j1467k8R812P094l762j0669k6028J8126J1699L393M454
$$ plain form
16469 34333 40607 28767 8326 9463 18015 17498 6810 5868 13795 13439 27713 37788 28552 25168
16455 25168 35418 51109 68700 88283 109188 122579 132042 152692 195327 235377 276983 305037
16443 305037 322363 311557 296214 286814 277793 264613 256736 254401 243788 257245 291371 328376
16431 328376 340620 348531 337336 310248 282296 252784 212659 176525 149964 126673 94888 65752
16419 65752 58276 59821 55657 39487 30050 26076 26765 21591 21431 11636 19460 5307 970 5552
16405 5552 13329 29823 39983 49064 51014 56928 55125 57527 39363 34839 36030 26098 25451 35381
16391 35381 44331 61744 71470 63394 48915 48984 35631 20625 7434 8061 30907 34083 43956 45928
16377 45928 45823 37789 33729 44408 50366 54040 65037 77064 70998 54433 39509 45738 49040
$$ packed form
16469C4333O274j1840k0441J137Q552n17j0688r42P927l56J4274J0075r236l384
16455B5168J0250J5691J7591J9583K0905J3391R463K0650M2635M0050M1606K8054
16443C05037J7326j0806j5343r400r021j3180p877k335j0613J3457L4126L7005
16431C28376J2244P911j1195k7088k7952k9512m0125l6134k6561k3291l1785k9136
16419F5752p476J545m164j6170r437l974O89n174j60r795P824j4153m337M582
16405E552P777J6494J0160R081J950N914j803K402j8164m524J191r932o47R930
16391C5381Q950J7413R726q076j4479O9j3353j5006j3191O27K2846L176R873J972
16377D5928j05q034m060J0679N958L674J0997J2027o066j6565j4924O229L302
$$ plain form
16364 49040 44806 39513 22948 31232 47398 34817 22965 30044 42321 46466 51220 48823 43048
16351 43048 42728 48820 50452 55838 70657 69716 49451 33900 25975 45080 55809 55221 59181 70762
16337 70762 70391 57304 72603 81655 78763 68225 57887 59251 55800 58697 67731 77217 85763 109213
16323 109213 123441 158000 207892 275283 365848 507033 699505 885642 1013015 1066929 1080081
16312 1080081 1095812 1138257 1150684 1078078 898129 699733 536030 398150 305071 236921
16302 236921 187270 169927 144154 127032 121993 129276 144160 150466 144763 145031 134661 134372 127489
16289 127489 118634 108071 99302 104814 102616 108487 113508 132206 137043 138454 148278 142209 124274
16276 124274 120576 129864 151387 178932 205666 235785 282893 354288 475763 644437 841160
$$ packed form
16364D9040m234n293j6565Q284J6166j2581j1852P079J2277M145M754k397n775
16351D3048l20O092J632N386J4819r41k0265j5551p925J9105J0729n88L960J1581
16337G0762l71j3087J5299R052k892j0538j0338J364l451K897R034R486Q546K3450
16323A09213J4228L4559M9892O7391R0565J41185J92472J86137J27373N3914J3152
16312A080081J5731M2445J2427p2606j79949j98396j63703j37880r3079o8150
16302B36921m9651j7343k5773j7122n039P283J4884O306n703K68j0370k89o883
16289A27489q855j0563q769N512k198N871N021J8698M837J411R824o069j7935
16276A24274l698R288K1523K7545K6734L0119M7108P1395J21475J68674J96723
$$ plain form
16265 841160 1006848 1069830 1069613 1073262 1121246 1133486 1068120 922660 730666 558063 425514
16254 425514 347978 296993 267984 233509 225090 231371 237077 230082 224867 224694 206848 194863 194703
16241 194703 183891 188448 189984 196257 193123 199767 190558 177252 171384 176151 181766 187290 206804
16228 206804 211280 206867 223599 245857 260216 273342 296720 325089 345778 358345 361902 371700
16216 371700 385932 420110 461820 514239 578621 662040 764839 852114 900885 929424 955348
16205 955348 994773 1061356 1146128 1218200 1288515 1380465 1504682 1691030 1936318 2219662 2563647
16194 2563647 3003489 3573064 4363716 5522733 7247275 9865004 13939444 20208163 28687465
16185 28687465 36877050 40453217 37778279 31083010 23764905 18097927 14638130 13068473
$$ packed form
16265H41160J65688O2982k17L649M7984J2240o5366j45460j91994j72603j32549
16254D25514p7536n0985k9009l4475q419O281N706o995n215j73j7846j1985j60
16241A94703j0812M557J536O273l134O644r209j3306n868M767N615N524J9514
16228B06804M476m413J6732K2258J4359J3126K3378K8369K0689J2567L557R798
16216C71700J4232L4178M1710N2419O4382Q3419J02799Q7275M8771K8539K5924
16205I55348L9425O6583Q4772P2072P0315R1950J24217J86348K45288K83344L43985
16194B563647M39842N69575P90652J159017J724542K617729M074440O268719Q479302
16185B8687465Q189585L576167k674938o695269p318105n666978l459797j569657
$$ plain form
16177 13068473 13008719 14462950 17872578 23913283 32506539 40966478 44427490 40910412
16169 40910412 32810794 23908522 16736094 11875622 8800456 6849097 5586328 4755479
16161 4755479 4212527 3826928 3512418 3253119 3065575 2942284 2855249 2788937 2727943 2668141
16151 2668141 2625101 2640005 2743866 2930366 3165016 3442812 3787048 4319874 5156590 6429903
16141 6429903 8378318 11424135 16216122 23250719 31309584 36671854 36384560 31326069
16133 31326069 24495936 18562601 14631494 12577022 12035295 12855484 15294949 19936807
16125 19936807 27227909 35790585 41398324 40538867 34103172 25531819 17916969 12481135
16117 12481135 8951871 6685500 5177272 4153268 3452469 2951702 2577348 2264714 1989921
$$ packed form
16177A3068473n9754J454231L409628O040705Q593256Q459939L461012l517078
16169D0910412q099618q902272p172428m860472l075166j951359j262769q30849
16161D755479n42952l85599l14510k59299j87544j23291q7035o6312o0994n9802
16151B668141m3040J4904J03861J86500K34650K77796L44236N32826Q36716J273313
16141F429903J948415L045817M791987P034597Q058865N362270k87294n058491
16133C1326069o830133n933335l931107k054472n41727Q20189K439465M641858
16125A9936807P291102Q562676N607739q59457o435695q571353p614850n435834
16117A2481135l529264k266371j508228j024004p00799n00767l74354l12634k74793
$$ plain form
16108 1989921 1780971 1615008 1498564 1414315 1323621 1228520 1148223 1064784 997954 948770 917714
16097 917714 869287 791612 707501 630947 591425 561939 533726 511857 492947 470328 450390
16086 450390 431208 426284 426752 442302 430573 434426 446925 424968 403858 391331 400127 403904 417675
16073 417675 440210 477864 532819 591890 678405 776412 890512 982625 1031217 1048104 1036197
16062 1036197 992198 953512 896991 810781 740666 672073 599790 521587 459584 410740 359137
16051 359137 315056 291551 272859 261003 254976 274047 297580 298383 289568 274040 253847 237854
16039 237854 224127 229038 241023 252531 256689 255901 252139 237141 238457 233862 234956 233546 237770
16026 237770 241816 240180 243297 249525 260387 263315 272088 261649 244469 241733 246170 244981 256076
$$ packed form
16108A989921k08950j65963j16444q4249r0694r5101q0297q3439o6830m9184l1056
16097I17714m8427p7675q4111p6554l9522k9486k8213k1869j8910k2619j9938
16086D50390j9182m924M68J5550j1729L853J2499k1957k1110j2527Q796L777J3771
16073D17675K2535L7654N4955N9071Q6515R8007J14100R2113M8592J6887j1907
16062A036197m3999l8686n6521q6210p0115o8593p2283p8203o2003m8844n1603
16051C59137m4081k3505j8692j1856o027J9071K3533Q03q815j5528k0193j5993
16039B37854j3727M911J1985J1508M158p88l762j4998J316m595J094j410M224
16026B37770M046j636L117O228J0862K928Q773j0439j7180k736M437j189J1095
$$ plain form
16013 256076 263474 282245 321072 348073 351726 344622 361846 359717 354002 373791 377714 382471 409079
16000 409079 434580 453275 476645 518935 569879 586906 596186 627108 649158 678744 734095 794409
15988 794409 858427 920957 1003790 1091092 1162757 1220131 1268892 1325933 1388073 1471625 1581814
15977 1581814 1725432 1886896 2079917 2311342 2549390 2793242 3083951 3448905 3896735
15968 3896735 4521967 5424028 6713870 8570234 11272401 15128104 20360291 27012700
15960 27012700 34860929 43231084 51004211 57021283 60277768 60282290 57233291 51906478
15952 51906478 45711392 40066289 36146372 34690844 35867673 39334452 44215931 49222790
15944 49222790 53091041 54729726 53559421 49643534 43565147 36370840 29087695 22486107
$$ packed form
16013B56076P398J8771L8827K7001L653p104J7224k129n715J9789L923M757K6608
16000D09079K5501J8695K3370M2290N0944J7027R280L0922K2050K9586N5351O0314
15988G94409O4018O2530Q2833Q7302P1665N7374M8761N7041O2140Q3552J10189
15977A581814J43618J61464J93021K31425K38048K43852K90709L64954M47830
15968C896735O25232R02061J289842J856364K702167L855703N232187O652409
15960B7012700P848229Q370155P773127O017072L256485M522l048999n326813
15952E1906478o195086n645103l919917j455528J176829L466779M881479N006859
15944D9222790L868251J638685j170305l915887o078387p194307p283145o601588
$$ plain form
15936 22486107 17050535 12899836 9871012 7754054 6282853 5249569 4507571 3955591
15928 3955591 3541420 3194843 2875443 2582469 2303021 2045310 1821175 1623561 1449796
15919 1449796 1322078 1190265 1081444 1007772 942973 890339 857800 829837 776107 717096 666102
15908 666102 626570 606804 587748 562205 545784 523942 519839 515231 530657 564248 582184 610785
15896 610785 650111 671546 682359 681068 650188 592882 546801 498007 444748 392773 358947 337491
15884 337491 328979 315824 305007 292948 285424 277931 260183 248589 246826 240159 221409 223613 218252
15871 218252 208678 194175 179284 199896 214272 205142 185526 171827 167193 166356 166561 171332 175866
15858 175866 166370 172932 177148 169654 147910 144593 154536 148783 143175 140418 143175 138085 122373 126956
$$ packed form
15936B2486107n435572m150699l028824k116958j471201j033284p41998n51980
15928C955591m14171l46577l19400k92974k79448k57711k24135j97614j73765
15919A449796j27718j31813j08821p3672o4799n2634l2539k7963n3730n9011n0994
15908F66102l9532j9766j9056k5543j6421k1842m103m608J5426L3591J7936K8601
15896F10785L9326K1435J0813j291l0880n7306m6081m8794n3259n1975l3826k1456
15884C37491q512j3155j0817j2059p524p493j7748j1594j763o667j8750K204n361
15871B18252r574j4503j4891K0612J4376r130j9616j3699m634q37K05M771M534
15858A75866r496O562M216p494k1744l317R943n753n608k757K757n090j5712M583
$$ plain form
15844 126956 135409 146003 152643 149998 156430 145009 136032 137168 152305 149913 149654 160757 157815
15831 157815 160020 176258 191687 188373 185859 169747 148955 142959 138453 125967 128109 139162 153768
15818 153768 162487 168416 170742 164852 160780 155377 154200 155269 142011 122355 112486 111402 104038 91568
15804 91568 75509 79126 70321 67752 66480 65974 64637 55056 49666 49889 50776 42967 44526 44702 49194
15789 49194 50404 32652 22227 33211 37905 34949 44780 48645 54979 59809 58973 43129 36539 45875
15775 45875 50891 53514 47467 45722 45665 55635 68952 60660 37390 34712 29975 31707 55383 55651
15761 55651 58798 66878 69884 69249 60186 51172 37631 40069 45640 58005 58526 46060 42220 56527
15747 56527 54455 44607 32692 25057 22021 30420 16399 -80 12782 35551 38041 48209 60026
$$ packed form
15844A26956Q453J0594O640k645O432j1421q977J136J5137k392k59J1103k942
15831A57815K205J6238J5429l314k514j6112k0792n996m506j2486K142J1053J4606
15818A53768Q719N929K326n890m072n403j177J069j3258j9656r869j084p364j2470
15804I1568j6059L617q805k569j272n06j337r581n390K23Q87p809J559J76M492
15789D9194J210j7752j0425J0984M694k956R831L865O334M830q36j5844o590R336
15775D5875N016K623o047j745n7R970J3317q292k3270k678m737J732K3676K68
15761E5651L147Q080L006o35r063r014j3541K438N571J2365N21j2466l840J4307
15747E6527k072r848j1915p635l036Q399j4021j6479J2862K2769K490J0168J1817
$$ plain form
15734 60026 47945 44893 48250 51597 60953 49089 56329 58307 44808 57371 45965 32516 46786
15721 46786 47082 42911 55095 59773 55407 59179 84949 85231 86149 85607 75312 52820 53964 49773
15707 49773 56036 46667 35183 37098 49748 51131 29436 30380 29308 40805 43978 51417 73570
15694 73570 75475 64691 71418 81259 91067 91877 115352 174027 231374 262019 272782 255102 211236
15681 211236 174443 135762 109387 98406 83427 85767 113750 149894 192810 232448 245176 225636
15669 225636 183165 151193 105858 71347 54857 52142 55260 52176 42305 41939 41482 34186 27872
15656 27872 26076 31856 36309 49374 42773 29767 26754 41056 57861 36377 26427 34485 36219
15643 36219 55953 73393 82160 90926 113982 154145 201554 235343 231361 207525 163126 124100
$$ packed form
15734F0026j2081l052L357L347R356j1864P240J978j3499J2563j1406j3449J4270
15721D6786K96m171J2184M678m366L772K5770K82R18n42j0295k2492J144m191
15707D9773O263r369j1484J915J2650J383k1695R44j072J1497L173P439K2153
15694G3570J905j0784O727R841R808Q10K3475N8675N7347L0645J0763j7680m3866
15681B11236l6793l8681k6375j0981j4979K340K7983L6144M2916L9638J2728j9540
15669B25636m2471l1972m5335l4511j6490k715L118l084r871l66m57p296o314
15656B7872j796N780M453J3065o601j3006l013J4302J6805k1484r950Q058J734
15643C6219J9734J7440Q767Q766K3056M0163M7409L3789l982k3836m4399l9026
$$ plain form
15631 124100 118514 100159 79585 85531 99130 122856 154726 200541 230888 229677 203423 150618
15619 150618 99033 67664 47680 36125 29652 36246 38818 54544 45155 44748 34344 32018 27198
15606 27198 13027 12824 7716 7254 16120 11798 638 -3123 5129 19172 16855 3752 -1546 7447
15592 7447 8281 11188 14474 8631 12326 17393 18999 9603 4239 8767 2071 10781 9287 -2214 -8647
15577 -8647 -8725 -8605 -3528 7279 12035 11359 14132 1370 12767 16233 26580 20649 16372 26887
15563 26887 25360 13374 17969 27848 30407 24018 19761 7315 -5681 -5438 2084 7228 21652 16765
15549 16765 -258 -5103 5084 3247 1972 -10070 -13079 -12841 -11365 -875 6627 9897 5654 3911
15535 3911 13102 17986 5905 4835 14350 13660 5598 3655 4239 -3217 -22155 -6392 3483 13006
$$ packed form
15631A24100n586j8355k0574N946J3599K3726L1870M5815L0347j211k6254n2805
15619A50618n1585l1369j9984j1555o473O594K572J5726r389m07j0404k326m820
15606B7198j4171k03n108m62Q866m322j1160l761Q252J4043k317j3103n298Q993
15592G447Q34K907L286n843L695N067J606r396n364M528o696Q710j494j1501o433
15577h647p8J20N077J0807M756o76K773j2762J1397L466J0347n931m277J0515
15563B6887j527j1986M595R879K559o389m257j2446j2996K43P522N144J4424m887
15549A6765j7023m845J0187j837j275j2042l009K38J476J0490P502L270m243j743
15535C911R191M884j2081j070R515o90q062j943N84p456j8938J5763R875R523
$$ plain form
15521 13006 22062 20924 28577 25902 22970 22707 21285 22555 10159 2716 12266 21841 43428 40635
15507 40635 28589 25035 6361 10444 12328 11113 5463 4673 3139 18690 41392 42003 43955 40059
15493 40059 34014 31983 25707 13202 13156 33782 33644 30024 43290 41397 39028 27957 24194 33053
15479 33053 34912 35068 42116 46396 50743 48514 54113 59275 76101 103314 138384 166497 201237
15466 201237 234698 279065 307458 311594 302593 273675 246724 225237 207001 181607 189901 208281
15454 208281 243959 258457 277674 299790 306163 290499 265145 210266 164479 126814 95602 74097
15442 74097 59294 44519 33830 24244 26536 24932 11031 9340 18371 27650 26492 14546 4320
15429 4320 8430 5154 -8112 -2654 15179 30827 33272 16827 15862 16073 1152 -8559 -6334 -3760
$$ packed form
15521A3006R056j138P653k675k932k63j422J270j2396p443R550R575K1587k793
15507D0635j2046l554j8674M083J884j215n650p90j534J5551K2702O11J952l896
15493D0059o045k031o276j2505m6K0626j38l620J3266j893k369j1071l763Q859
15479C3053J859J56P048M280M347k229N599N162J6826K7213L5070K8113L4740
15466B01237L3461M4367K8393M136r001k8918k6951k1487j8236k5394Q294J8380
15454B08281L5678J4498J9217K2116O373j5664k5354n4879m5787l7665l1212k1505
15442G4097j4803j4775j0689r586K292j604j3901j691R031R279j158j1946j0226
15429D320M110l276j3266N458J7833J5648K445j6445r65K11j4921r711K225K574
$$ plain form
15415 -3760 -345 1840 -9506 10557 25200 23807 18969 6564 3097 4758 -4863 -11611 -17997 -19350
15401 -19350 -12105 -3142 -4108 -1468 -2940 -12187 -24414 -17388 -5674 14575 23878 24968 11857 -442
15387 -442 -16920 -26512 -31685 -31751 -21545 -20405 -23347 -16898 -2450 -10843 -15981 -13645 -9975 4659
15373 4659 19453 17344 6281 4364 7160 19330 23396 23848 14323 8577 8777 -2484 -3195 1516
15359 1516 -127 -9838 -6194 1595 -2374 -3919 -5685 -13320 -11000 5278 16306 12528 16420 13015
15345 13015 928 -3937 14445 22034 7095 8792 24483 26580 9214 -5992 -13701 -4918 13088
15332 13088 13316 216 -11922 -22108 -11051 3784 8661 6065 1023 1584 -3549 -4035 -22825 -29673
15318 -29673 -29636 -15468 -11315 -1148 -560 -3142 2876 20085 7606 -5228 5012 14707 11071 9115
$$ packed form
15415c760L415K185j1346K0063J4643j393m838j2405l467J661r621o748o386j353
15401a9350P245Q963r66K640j472r247j2227P026J1714K0249R303J090j3111j2299
15387d42j6478r592n173o6J0206J140k942O449J4448q393n138K336L670J4634
15373D659J4794k109j1063j917K796J2170M066M52r525n746K00j1261p11M711
15359A516j643r711L644P789l969j545j766p635K320J6278J1028l778L892l405
15345A3015j2087m865J8382P589j4939J697J5691K097j7366j5206p709Q783J8006
15332A3088K28j3100j2138j0186J1057J4835M877k596n042N61n133m86j8790o848
15318b9673L7J4168M153J0167N88k582O018J7209j2479j2834J0240R695l636j956
$$ plain form
15304 9115 -1957 -7237 -6314 6104 19517 28518 19133 4273 -2294 -12373 -15111 -1710 8160
15291 8160 2999 1410 -8185 -4845 -17783 -10333 -5818 -7831 -13200 -9921 -468 16592 7372 -13088
15277 -13088 -31924 -42671 -40328 -29266 -16764 -20689 -22100 -22053 -10905 7430 14095 -3031 -7796
15264 -7796 2313 13341 14521 4913 -12233 -15198 -5951 -1101 -12867 -22120 -18910 -22623 -16686 -6039
15250 -6039 4910 5829 493 6178 3361 -6155 -16530 -17132 -9804 -6142 -9992 -8597 -7192 -3391 -12633
15235 -12633 -20371 -20712 -13829 -735 -16834 -28432 -16238 -8929 -25471 -36672 -32056 -29621 -17894
15222 -17894 -10621 6303 13384 239 -13550 -27615 -31670 -35600 -33559 -4568 -9354 -13233 -16185
15209 -16185 -3878 5222 -8970 -15378 -16074 -9722 -5348 -7654 -10104 -22706 -13337 -11564 -5906 7637
$$ packed form
15304I115j1072n280R23J2418J3413R001r385j4860o567j0079k738J3401R870
15291H160n161j589r595L340j2938P450M515k013n369L279R453J7060r220k0460
15277a3088j8836j0747K343J1062J2502l925j411M7J1148J8335O665j7126m765
15264g796J0109J1028J180r608j7146k965R247M850j1766r253L210l713N937J0647
15250f039J0949R19n336N685k817r516j0375o02P328L662l850J395J405L801r242
15235a2633p738l41O883J3094j6099j1598J2194P309j6542j1201M616K435J1727
15222a7894P273J6924P081j3145j3789j4065m055l930K041K8991m786l879k952
15209a6185J2307R100j4192o408o96O352M374k306k450j2602R369J773N658J3543
$$ plain form
15195 7637 5056 5330 10014 4305 12530 20582 14176 12736 14744 17701 13139 -4138 -17543 -21738
15181 -21738 -21022 -5208 6744 9395 7161 5649 -2981 -464 3032 -7629 -3283 473 -9827 -21004
15167 -21004 -22564 -13907 1957 7166 8489 4638 -5387 1834 684 7687 12393 12535 10752 5470
15153 5470 9731 -8358 -11139 -16085 -8268 -18597 -30938 -23728 -13652 -632 -2022 -7050 -12157
15140 -12157 -22740 3204 31018 42720 39265 22766 -3715 -6817 8166 20782 18513 4227
15128 4227 877 21628 22383 4584 -5554 541 -6701 -9756 -3325 -7583 -5283 5035 3279 5249
15114 5249 -7126 -11563 -13225 -18915 -4603 2468 -4779 -6526 -7759 -3722 -4019 -22206 -17688 -5565
15100 -5565 -2892 11237 3072 -16705 -21076 -2911 3522 7563 14367 21581 15128 1225 -9278
$$ packed form
15195G637k581K74M684n709Q225Q052o406j440K008K957m562j7277j3405m195
15181b1738P16J5814J1952K651k234j512q630K517L496j0661M346L756j0300j1177
15167b1004j560Q657J5864N209J323l851j0025P221j150P003M706J42j783n282
15153E470M261j8089k781m946P817j0329j2341P210J0076J3020j390n028n107
15140a2157j0583K5944K7814J1702l455j6499k6481l102J4983J2616k269j4286
15128D227l350K0751P55j7799j0138O095p242l055O431m258K300J0318j756J970
15114E249j2375m437j662n690J4312P071p247j747j233M037k97j8187M518J2123
15100e565K673J4129q165j9777m371J8165O433M041O804P214o453j3903j0503
$$ plain form
15087 -9278 -14428 -2462 15509 9328 3070 -4677 -3165 16495 14332 6702 4849 4070 8914 6943
15073 6943 13986 9546 -1306 7676 7651 6701 17294 21039 24733 15692 7084 -771 -3747 -3162 850
15058 850 -7341 -19774 -22355 -26282 -22446 -13906 5200 15562 12848 14827 11965 -10036 -20257 -16219
15044 -16219 -15490 -13365 -12778 -8054 -2565 -6913 6330 13677 21392 16808 18813 20998 20719 14160 11338
15029 11338 10700 10515 9674 7041 13034 7086 -1957 -11269 -3684 11226 23053 37859 52408 52475 49296
15014 49296 52785 82608 132477 175035 206483 274012 408226 606426 949823 1535117 2163701
15003 2163701 2297120 1945182 1387558 891425 579151 388899 260732 193206 149542 123867
14993 123867 98847 92204 86869 66133 67233 72407 64729 48653 36248 29462 32369 39786 31904
$$ packed form
15087i278n150J1966J7971o181o258p747J512J9660k163p630j853p79M844j971
15073F943P043m440j0852Q982k5r50J0593L745L694r041q608p855k976N85M012
15058H50q191j2433k581l927L836Q540J9106J0362k714J979k862k2001j0221M038
15044a6219P29K125N87M724N489m348J3243P347P715m584K005K185k79o559k822
15029A1338o38j85q41k633N993n948r043r312P585J4910J1827J4806J4549O7l179
15014D9296L489K9823M9869M2558L1448O7529J34214J98200L43397N85294O28584
15003B163701J33419l51938n57624m96133l12274j90252j28167o7526m3664k5675
14993A23867k5020o643n335k0736J100N174p678j6076j2405o786K907P417p882
$$ plain form
14980 31904 27147 27692 19002 9943 14713 23420 21085 1612 -10267 3954 18413 25307 23780 17940
14966 17940 12437 8756 3885 276 1089 -6971 -5967 3839 -1030 -9020 -3256 5347 -2611 -14478
14952 -14478 -4334 13638 6385 -703 -9352 -15486 -15554 -7415 -6547 -6267 4256 13345 2921 -5632
14938 -5632 -14499 -12290 -205 -970 -6814 -7548 8993 17764 12494 2310 9371 -220 -6941 900
14924 900 -1391 -9276 1318 15559 5417 3060 1605 -18359 -17589 -7838 -12151 -14474 -15455 -9764
14910 -9764 -882 -5322 -1172 14002 13091 4585 7840 14930 15666 24430 19571 9541 3016 8370 4689
14895 4689 1115 -2524 -7658 -7672 -8474 -16127 -3234 -7872 -33244 -28033 6809 16895 20169 4140
14881 4140 -16306 -15211 -4877 19404 20409 15606 6496 1269 1634 -1423 1065 -1376 -3063 -3922
$$ packed form
14980C1904m757N45q690r059M770Q707k335j9473j1879J4221J4459O894j527n840
14966A7940n503l681m871l609Q13q060J004R806m869p990N764Q603p958j1867
14952a4478J0144J7972p253p088q649o134o8Q139Q68K80J0523R089j0424q553
14938e632q867K209J2085p65n844p34J6541Q771n270j0184P061r591o721P841
14924I00k291p885J0594J4241j0142k357j455j9964P70R751m313k323r81N691
14910i764Q882m440M150J5174r11q506L255P090P36Q764m859j0030o525N354l681
14895D689l574l639n134j4q02p653J2893m638k5372N211L4842J0086L274j6029
14881D140k0446J095J0334K4281J005m803r110n227L65l057K488k441j687q59
$$ plain form
14867 -3922 -5273 -4143 775 7864 5825 -3725 -4600 -12895 -16832 -8678 10420 15518 20207 10656 7979
14852 7979 1525 -4067 -12646 -10798 -3332 -6723 -1655 2581 9308 9804 5577 -8555 -17551 -13495 -18516
14837 -18516 -21421 -17985 -8196 5861 7217 -3573 -14857 -9756 -8989 -23473 -15194 -1583 10351
14824 10351 4476 -837 7155 13596 19959 22855 31468 25336 22286 38641 35826 28064 18759 892
14810 892 3425 9278 20765 26687 30426 9721 -6332 -721 2917 14125 22714 3318 -11528
14797 -11528 -5109 -12931 -18239 -19834 -25421 -15988 -4298 -12217 -14875 -8319 -31 -18487 -29228 -25196
14783 -25196 -4063 -9967 -7563 5991 9311 7680 8336 4584 8450 3809 5439 3781 6034 5499
14769 5499 7805 -1579 -12002 -14154 3664 -367 -3568 5894 10738 9770 19670 9643 25 -4152
$$ packed form
14867c922j351J130M918P089k039r550q75q295l937Q154J9098N098M689r551k677
14852G979o454n592q579J848P466l391N068M236O727M96m227j4132q996M056n021
14837a8516k905L436R789J4057J356j0790j1284N101P67j4484Q279J3611J1934
14824A0351n875n313P992O441O363K896Q613o132l050J6355k815p762r305j7867
14810H92K533N853J1487N922L739k0705j6053N611L638J1208Q589j9396j4846
14797a1528O419p822n308j595n587R433J1690p919k658O556Q288j8456j0741M032
14783b5196K1133n904K404J3554L320j631O56l752L866m641J630j658K253n35
14769E499K306r384j0423k152J7818m031l201R462M844r68R900j0027r618m177
$$ plain form
14755 -4152 -13067 -1018 12299 21829 21458 20450 26351 26099 37279 46221 44176 31605 15706 -1608
14741 -1608 -11959 7002 21180 15435 18706 4786 1104 -8352 -13488 2662 13977 2891 -3924
14728 -3924 3377 7282 9785 13706 5682 17146 27998 25371 13220 2624 13463 10725 5009
14715 5009 5564 1894 7908 6054 6601 2232 -16544 -24994 -14759 -747 9614 -2781 -12645 -10878
14701 -10878 -10484 -10094 -6334 5549 6273 21716 29661 15062 -2308 -14277 -38979 -37654 -23551
14688 -23551 -14331 -12124 -9267 -8740 -9097 -8664 5903 17183 18047 23057 23828 12409 9808 2229 -7944
14673 -7944 -17498 -15111 -10422 -7235 -244 2125 -1586 2529 9535 20373 15814 2898 1249 676
14659 676 -1623 -9901 -9031 -10230 -8802 -3073 4197 2545 547 -636 -4995 -790 1538 -5239 -10376
$$ packed form
14755d152q915J2049J3317R530l71j008N901k52J1180Q942k045j2571j5899j7314
14741a608j0351J8961J4178n745L271j3920l682r456n136J6150J1315j1086o815
14728c924P301L905K503L921q024J1464J0852k627j2151j0596J0839k738n716
14715E009N55l670O014j854N47m369j8776q450J0235J4012J0361j2395r864J767
14701a0878L94L90L760J1883P24J5443P945j4599j7370j1969k4702J325J4103
14688b3551R220K207K857N27l57M33J4567J1280Q64N010P71j1419k601p579j0173
14673g944r554K387M689L187O991K369l711M115P006J0838m559j2916j649n73
14659F76k299q278Q70j199J428N729P270j652j998j183m359M205K328o777n137
$$ plain form
14644 -10376 -15395 -21453 -24255 -15611 -789 -5531 -26603 -28007 -22346 -15557 -7370 -4548 12784 19546
14630 19546 22438 14399 15241 16395 12770 -7034 -15617 -2410 16635 25349 24031 20289 13930 22454
14616 22454 18694 3227 13054 16430 12960 12867 19865 16297 13090 15198 23995 26212 17569 12777 17933
14601 17933 11057 -416 -6775 -6236 -13284 -3759 6528 5810 15451 12890 -8153 -16565 -23088 -13783
14587 -13783 11539 24048 18149 25599 25209 9313 -7872 -16637 3306 2733 -2613 -2903 -475 275
14573 275 -9967 -10113 -19248 -21660 -22590 -22391 -14531 -7818 -240 12670 18391 515 -1319 -1864 3843
14558 3843 10368 9853 15416 15706 13692 12374 8260 -253 -3821 5698 11927 4337 6933 19814 13809
14543 13809 15237 10369 2370 19521 10251 -867 1167 -1531 -10270 -25377 -20060 -11830 -3102 -1443
$$ packed form
14644a0376n019o058k802Q644J4822m742k1072j404N661O789Q187K822J7332O762
14630A9546K892q039Q42J154l625j9804q583J3207J9045Q714j318l742o359Q524
14616B2454l760j5467R827L376l470r3O998l568l207K108Q797K217q643m792N156
14601A7933o876j1473o359N39p048R525J0287p18R641k561k1043q412o523R305
14587a3783K5322J2509n899P450l90j5896j7185q765J9943n73n346k90K428P50
14573B75j0242j46r135k412r30J99P860O713P578J2910N721j7876j834n45N707
14558C843O525n15N563K90k014j318m114q513l568R519O229p590K596J2881o005
14543A3809J428m868p999J7151r270j1118K034k698q739j5107N317Q230Q728J659
$$ plain form
14529 -1443 -7086 4735 -2276 -9286 -4041 15866 24365 10882 17669 15688 4158 3602 10921 14976
14515 14976 17990 17319 16012 10559 -364 -9528 -17069 -14163 -9207 6327 17831 19444 9991 13128
14501 13128 19705 19047 15189 10285 -5442 -14149 -20816 -22691 -10949 -11588 -11289 -14038 -2064 5949
14487 5949 -5415 -15371 -11175 -5398 -14838 -17038 -8143 13332 4419 2004 1669 -8083 -11939 -2549
14473 -2549 -8909 -4335 -8769 -5752 6743 18936 18560 18700 5560 1417 -845 3090 -2788 -8744
14459 -8744 -2174 7000 2046 289 -1941 6997 9390 -583 -5209 -7401 -15910 -17514 -16363 -8768 8835
14444 8835 13295 4208 8623 4569 -2227 -1403 1294 -1904 -3016 -1514 7716 11097 9904 -4737 -15412
14429 -15412 -21221 -3882 15327 19250 7849 1524 -115 -4684 -13505 -10463 -4842 -7972 4629
$$ packed form
14529a443n643J1821p011p010N245J9907Q499j3483O787j981j1530n56P319M055
14515A4976L014o71j307n453j0923r164p541K906M956J5534J1504J613r453L137
14501A3128O577o58l858m904j5727q707o667j875J1742o39K99k749J1974Q013
14487E949j1364r956M196N777r440k200Q895K1475q913k415l35r752l856R390
14473b549o360M574m434L017J2495J2193l76J40j3140m143k262L935n878n956
14459h744O570R174m954j757k230Q938K393r973m626k192q509j604J151P595J7603
14444H835M460r087M415m054o796Q24K697l198j112J502R230L381j193j4641j0675
14429a5412n809J7339J9209L923j1401o325j639m569q821L042N621l130J2601
$$ plain form
14416 4629 10608 -1522 -72 5917 2576 3066 4517 -6755 -2675 -13457 -5834 10236 3330 -10440
14402 -10440 -20871 -12769 -7624 -1251 994 -3652 -10055 4007 9113 -1878 7461 18511 7326
14389 7326 11632 27668 34514 36099 28709 29636 23347 25494 13876 10663 12580 13322 2932 -2785
14375 -2785 -9563 -9093 2098 22424 24351 12988 3973 4227 8955 19777 21960 20985 27560 24137
14361 24137 15108 7121 6358 12384 5013 -13 3347 5214 -8990 -9310 4289 7099 3446 1696
14347 1696 3659 5572 13312 23193 26463 16863 15918 30400 13546 -7229 -25 3139 14249 16107
14333 16107 17922 10854 5367 11820 16402 21442 16440 11524 11724 13587 6070 5884 7238 4026 12328
14318 12328 5714 2781 9826 27330 32045 13673 -3508 -1677 2809 7015 -3138 5096 5106 1904
$$ packed form
14416D629N979j2130J450N989l341M90J451j1272M080j0782P623J6070o906j3770
14402a0440j0431Q102N145O373K245m646o403J4062N106j0991R339J1050j1185
14389G326M306J6036O846J585p390R27o289K147j1618l213J917P42j0390n717
14375b785o778M70J1191K0326J927j1363r015K54M728J0822K183r75O575l423
14361B4137r029p987p63O026p371n026L360J867j4204l20J3599K810l653j750
14347A696J963J913P740R881L270r600r45J4482j6854k0775P204L164J1110J858
14333A6107J815p068n487O453M582N040n002m916K00J863p517j86J354l212Q302
14318A2328o614k933P045J7504M715j8372j7181J831M486M206j0153Q234J0l202
$$ plain form
14304 1904 7149 -6586 -4602 563 19334 26331 12619 1762 -3772 6805 6854 -1108 1317 3767
14290 3767 5872 19847 23514 11064 -11988 -16660 -3921 -2162 -9270 -6837 17379 22003 18921
14277 18921 14639 20472 22699 3001 6488 499 -213 5479 11470 5439 -1176 2908 134 11770
14263 11770 14946 15052 4985 -4246 -13918 95 18484 18713 17006 10992 16163 20230 19601 6880
14249 6880 13450 25302 26494 40195 25333 3831 -11161 -9384 15092 24139 33607 32121 19631
14236 19631 10117 8696 -3640 -1966 3393 10119 19507 22097 7468 -3699 -894 9495 11401
14223 11401 12569 4535 3724 -2470 -462 9246 8418 10051 7275 3558 7975 15472 15151 5582 6198
14208 6198 1985 -602 2597 10041 4266 4960 -2119 -23255 -31011 -24398 -27527 -14628 -13628 -24285
$$ packed form
14304A904N245j3735J984N165J8771O997j3712j0857n534J0577M9p962K425K450
14290C767K105J3975L667j2450k3052m672J2739J759p108K433K4216M624l082
14277A8921m282N833K227j9698L487n989p12N692N991o031o615M084k774J1636
14263A1770L176J06j0067r231r672J4013J8389K29j707o014N171M067o29j2721
14249F880O570J1852J192J3701j4862k1502j4992J777K4476R047R468j486j2490
14236A9631r514j421j2336J674N359O726R388K590j4629j1167K805J0389J906
14223A1401J168q034q11o194K008R708q28J633k776l717M417P497l21r569O16
14208F198m213k587L199P444n775O94p079k1136p756O613l129J2899J000j0657
$$ plain form
14194 -24285 -29269 -17686 -8669 3999 8310 -7856 -16756 -9552 4328 16855 18759 14414 22128
14181 22128 20316 12943 9393 11254 4549 7658 3575 -3498 -598 -12374 -15881 -4194 -2238 4474
14167 4474 6940 15274 5914 2294 -7190 -6335 1500 -3093 5201 11286 16246 2640 -9834 -16191
14153 -16191 -6015 7732 17548 13764 6361 11677 19039 11361 11382 29068 37386 25250 7430 9972
14139 9972 20371 21466 17317 18966 17739 18568 16390 5585 1269 6945 17299 17152 20336 13950
14125 13950 776 -18101 -11679 7317 15209 12513 10235 10055 11529 12664 15821 8995 6620 11070
14111 11070 11054 17528 12497 3042 7226 13867 7161 -11854 -12635 -13489 -13200 -12196 -2354 1449 -5965
14096 -5965 -1405 4854 2729 8250 18020 7094 7087 11983 9599 -5069 -5356 12310 22818 9933
$$ packed form
14194b4285m984J1583R017J2668M311j6166q900P204J3880J2527J904m345P714
14181B2128j812p373l550J861o705L109m083p073K900j1776l507J1687J956O712
14167D474K466Q334r360l620r484Q55P835m593Q294O085M960j3606j2474o357
14153a6191J0176J3747R816l784p403N316P362p678K1J7686Q318j2136j7820K542
14139I972J0399J095m149J649j227Q29k178j0805m316N676J0354j47L184o386
14125A3950j3174j8877O422J8996P892k696k278j80J474J135L157o826k375M450
14111A1070j6O474n031r455M184O641o706j9015p81q54K89J004R842L803p414
14096e965M560O259k125N521R770j0926pM896k384j4668k87J7666J0508j2885
$$ plain form
14082 9933 1794 6488 17642 21458 18176 16411 5735 15558 28922 36665 32354 16633 17213 14478
14068 14478 7789 -1768 19878 26812 22337 19419 8584 3989 4464 12297 6228 -5099 -3463 -6016
14054 -6016 -9258 -7961 -866 -9843 -20730 -9464 2238 8213 13521 14286 10805 945 -3863 1027
14040 1027 6982 17485 12094 6038 6540 -1264 -9430 -2521 5946 8686 5484 5156 4278 8833 19054
14025 19054 22330 14598 1826 8413 19545 28233 28610 22611 24584 6983 -7691 -13294 -9259 -1002
14011 -1002 -9832 -22851 -17310 -7613 -735 19 -11099 -13885 6341 16613 8075 -7158 -6509 588
13997 588 -751 7307 -1018 -17204 -13057 4026 1313 -9135 -8743 -5360 -10091 -5730 -432 -1017 -1709
13982 -1709 -1854 4396 107 3669 7571 16284 18655 12173 8211 1653 408 8929 15982 4792 512
$$ packed form
14082I933q139M694J1154L816l282j765j0676R823J3364P743m311j5721N80k735
14068A4478o689r557K1646O934m475k918j0835m595M75P833o069j1327J636k553
14054f016l242J297P095q977j0887J1266J1702N975N308P65l481r860m808M890
14040A027N955J0503n391o056N02p804q166O909Q467K740l202l28q78M555J0221
14025A9054L276p732j2772O587J1132Q688L77n999J973j7601j4674n603M035Q257
14011a002q830j3019N541R697O878P54j1118k786K0226J0272q538j5233O49P097
13997E88j339Q058q325j6186M147J7083k713j0448L92L383m731M361N298n85o92
13982a709j45O250m289L562L902Q713K371o482l962o558j245Q521P053j1190m280
$$ plain form
13967 512 9006 10652 12622 18082 10105 -3679 -272 4533 -4142 -4779 6610 15969 23090 17207 14545
13952 14545 23891 26338 23439 16099 25368 29407 33906 29292 23510 33384 21597 10240 -2399 4165
13938 4165 19725 16094 4638 2237 5731 6183 8361 26500 30833 14142 8302 8372 880 -7832
13924 -7832 2556 19365 33636 25750 7487 -9470 -12259 -6065 5235 -836 7979 8242 6372
13911 6372 17468 16652 6097 -10353 -8884 7433 30338 43395 23734 8431 6668 4247 438
13898 438 2747 11517 6629 5078 -1405 10123 16457 26605 19775 12661 16831 27523 37181 33363
13884 33363 19780 10383 6979 7029 18627 23121 17180 3130 -6884 -6669 -14565 -10930 -9102 6616
13870 6616 12350 6644 10904 13382 14793 27538 29458 20548 13252 5910 -8218 -773 17047 21939
$$ packed form
13967E12Q494J646J970N460p977j3784L407M805q675o37J1389R359P121n883k662
13952A4545R346K447k899p340R269M039M499m614n782R874j1787j1357j2639O564
13938D165J5560l631j1456k401L494M52K178J8139M333j6691n840P0p492q712
13924g832J0388J6809J4271p886j8263j6957k789O194J1300o071Q815K63j870
13911F372J1096q16j0555j6450J469J6317K2905J3057j9661j5303j763k421l809
13898D38K309Q770m888j551o483J1528O334J0148o830p114M170J0692R658l818
13884C3363j3583r397l404N0J1598M494n941j4050j0014K15p896L635J828J5718
13870F616N734n706M260K478J411J2745J920q910p296p342j4128P445J7820M892
$$ plain form
13856 21939 21542 27509 42330 40159 36738 43358 50267 37020 27408 26230 25465 20917 21314 24241 20524
13841 20524 26874 24737 14066 8775 33994 19189 895 14422 25917 33596 29858 26811 18271
13828 18271 7513 11838 18314 30094 25461 14794 25579 25824 14686 11612 15202 9055 9407 8418
13814 8418 13921 29308 30644 28072 21502 17058 6442 5194 33612 39230 24925 19709 27092 31224
13800 31224 37318 34796 31058 37010 21202 13382 26558 23234 12404 9470 -6728 -10263 9051
13787 9051 19897 11253 7551 16271 15660 26448 36671 35730 22718 4569 4497 2147 12580 23607
13773 23607 14785 15408 17630 27630 28287 30891 28889 11528 10932 4513 10107 8256 4913 14217 20451
13758 20451 19621 12031 9787 16270 7572 1692 -1847 4177 583 -7743 -1608 3283 13180 6232 4761
$$ packed form
13856B1939l97N967J4821k171l421O620O909j3247r612j178p65m548L97K927l717
13841B0524O350k137j0671n291K5219j4805j8294J3527J1495P679l738l047q540
13828A8271j0758M325O476J1780m633j0667J0785K45j1138l074L590o147L52r89
13814H418N503J5387J336k572o570m444j0616j248K8418N618j4305n216P383M132
13800C1224O094k522l738N952j5808p820J3176l324j0830k934j6198l535J9314
13787I051J0846q644l702Q720o11J0788J0223r41j3012j8149p2k350J0433J1027
13773B3607q822O23K222J0000O57K604k002j7361n96o419N594j851l343R304O234
13758B0451q30p590k244O483q698n880l539O024l594q326O135M891R897o948j471
$$ plain form
13743 4761 21056 9763 10613 2670 7598 2720 -8273 -3439 -5955 4621 489 -2354 -5903 5741
13729 5741 18733 21876 20304 21549 23707 16389 19731 16245 3437 -853 4052 9174 -2219 1586
13715 1586 13995 19892 9003 17957 19793 14395 20309 36609 32971 25626 22377 27605 32005 25824
13701 25824 21082 23556 27146 31742 24773 24648 28011 22945 24716 18826 21072 26167 35253 36743 26590
13686 26590 23077 18472 10714 17577 18419 12739 20614 33385 26401 32212 32892 32527 17378 95
13672 95 5149 5573 9554 14424 28774 21172 22242 30768 38984 28273 7805 2965 1995 3659 25125
13657 25125 29275 37626 38652 49235 51243 52281 39469 35287 20311 14566 27560 51141 49450
13644 49450 39136 34973 24029 26879 24420 20450 22205 22629 29270 35415 32021 31895 41633 41610 33490
$$ packed form
13743D761J6295j1293Q50p943M928m878j0993M834k516J0576m132k843l549J1644
13729E741J2992L143j572J245K158p318L342l486j2808m290M905N122j1393L805
13715A586J2409N897j0889Q954J836n398N914J6300l638p345l249N228M400o181
13701B5824m742K474L590M596o969j25L363n066J771n890K246N095R086J490j0153
13686B6590l513m605p758O863Q42n680P875J2771o984N811O80l65j5149j7283
13672I5N054M24L981M870J4350p602J070Q526Q216j0711k0468m840r70J664K1466
13657B5125M150Q351J026J0583K008J038j2812m182j4976n745J2994K3581j691
13644D9450j0314m163j0944K850k459l970J755M24O641O145l394j26R738k3q120
$$ plain form
13629 33490 25707 14158 26673 24727 25840 8420 4991 12827 10804 22976 29390 28000 11110
13616 11110 15879 31800 30470 23388 30517 44572 34909 24305 22931 28545 38027 27308 32696
13603 32696 35045 28119 26647 18812 17257 25217 28005 27120 29228 30731 32013 39615 32334 16907
13589 16907 21965 39730 48253 46635 42599 46278 39029 39408 39453 34238 28958 31075 45960 47530 48332
13574 48332 40168 33990 37961 49091 48779 43782 50079 45170 40102 41068 30137 23630 24834 40422
13560 40422 45749 39509 32091 37874 37822 25352 18327 22977 25288 30866 36306 43237 43721 39014 36395
13545 36395 37480 42548 53827 56689 61626 44626 26767 35404 46392 48225 49888 65201 50706
13532 50706 31835 42881 40278 30767 31813 21922 17510 13410 17089 30034 35063 21017 14906
$$ packed form
13629C3490p783j1549J2515j946J113j7420l429P836k023J2172O414j390j6890
13616A1110M769J5921j330p082P129J4055r663j0604j374N614R482j0719N388
13603C2696K349o926j472p835j555P960K788q85K108J503J282P602p281j5427
13589A6907N058J7765Q523j618m036L679p249L79M5n215n280K117J4885J570Q02
13574D8332q164o178L971J1130l12m997O297m909n068R66j0931o507J204J5588
13560D0422N327o240p418N783n2j2470p025M650K311N578N440O931M84m707k619
13545C6395J085N068J1279K862M937j7000j7859Q637J0988J833J663J5313j4495
13532E0706j8871J1046k603r511J046r891m412m100L679J2945N029j4046o111
$$ plain form
13519 14906 19155 25117 38470 40136 20058 20068 35762 31841 33090 35071 51059 60494 50603 47374
13505 47374 48600 47831 47588 49796 42013 27729 29591 35135 49820 41903 37107 25492 30598 24670
13491 24670 17581 17879 18478 13718 19326 17473 20093 27257 37486 54030 47980 46544 38002 33194
13477 33194 28458 26747 37706 52285 38593 35813 38868 29803 25868 41357 52974 68074 67686
13464 67686 51794 42239 38947 32153 16759 37092 43057 31477 28587 28057 42060 37332 28226
13451 28226 26164 30055 37331 34106 37140 41284 38554 26342 24592 22316 33942 44416 42992 36067
13437 36067 28059 27822 28384 38701 42522 48701 56709 49881 33823 21353 30818 36626 18828 26962
13423 26962 30960 20859 16414 22469 25576 9975 -41 12666 16209 19489 25960 26783 28952 37246
$$ packed form
13519A4906M249N962J3353J666k0078J0J5694l921J249J981J5988R435r891l229
13505D7374J226p69k43K208p783j4284J862N544J4685p917m796j1615N106n928
13491B4670p089K98N99m760N608j853K620P164J0229J6544o050j436q542m808
13477C3194m736j711J0959J4579j3692k780L055r065l935J5489J1617J5100l88
13464F7686j5892r555l292o794j5394K0333N965j1580k890n30J4003m728r106
13451B8226k062L891P276l225L034M144k730j2212j750k276J1626J0474j424o925
13437C6067q008k37N62J0317L821O179Q008o828j6058j2470R465N808j7798Q134
13423B6962L998j0101m445O055L107j5601j0016J2707L543L280O471Q23K169Q294
$$ plain form
13409 37246 51440 53789 53738 51939 49750 36029 34305 32596 36366 35437 34706 30858 30177 25844 33943
13394 33943 37807 38197 13528 7997 11918 6673 -2735 -6360 -2329 831 18418 24982 23232 34699
13380 34699 35764 38280 32628 20311 26996 45747 48359 38666 37325 35337 27688 16324 10386 27921
13366 27921 40152 42105 45242 49904 50003 50760 39676 48248 60305 42856 21598 17158 23781 26134
13352 26134 38280 37729 50509 54679 57455 54170 33544 18701 39232 48085 51237 42543 29642
13339 29642 32136 29360 40819 57383 57506 60820 64423 57130 60612 54121 55417 58791 58953 57246
13325 57246 57318 58484 58287 63651 53822 53961 48406 53050 62651 69394 49614 40133 37738 33058 31153
13310 31153 47616 59889 62495 59811 59375 57278 53130 57340 62782 76457 80253 69744 65165 73632
$$ packed form
13409C7246J4194K349n1j799k189j3721j724j709L770r29p31l848o81m333Q099
13394C3943L864L90k4669n531L921n245r408l625M031L160J7587O564j750J1467
13380C4699J065K516n652j2317O685J8751K612r693j341j988p649j1364n938J7535
13366B7921J2231J953L137M662R9P57j1084Q572J2057j7449k1258m440O623K353
13352B6134J2146n51J2780M170K776l285k0626j4843K0531Q853L152q694j2901
13339B9642K494k776J1459J6564J23L314L603p293L482o491J296L374J62j707
13325E7246P2J166j97N364r829J39n555M644R601O743j9780r481k395m680j905
13310C1153J6463J2273K606k684m36k097m148M210N442J3675L796j0509m579Q467
$$ plain form
13296 73632 71631 75624 75888 68248 51632 49069 52668 42990 33435 40138 47858 44243 39374 46463
13282 46463 40195 51699 54121 67920 65030 69618 70636 81666 69259 70219 61902 55761 51816 47524
13268 47524 42820 56676 82130 73529 73401 62221 55269 46413 29957 18465 20353 34043 48362
13255 48362 53673 56303 66446 67545 54395 35601 46617 50549 41081 45741 59825 51676 45926
13242 45926 48242 44454 41970 39073 38436 49056 75390 85510 100334 108402 98407 98456 101191 103409
13228 103409 99089 100309 93040 92215 109467 115094 126934 140785 127374 116482 108398 96153 88324
13215 88324 81528 67196 56748 71758 88891 94368 94871 96805 88204 77891 79649 103371 102060
13202 102060 97725 86035 76928 88744 86708 75229 77115 75623 74819 76871 86305 87936 106506
$$ packed form
13296G3632k001L993K64p640j6616k563L599r678r555O703P720l615m869P089
13282D6463o268J1504K422J3799k890M588J018J1030j2407R60q317o141l945m292
13268D7524m704J3856K5454q601j28j1180o952q856j6456j1492J888J3690J4319
13255D8362N311K630J0143J099j3150j8794J1016L932r468M660J4084q149n750
13242D5926K316l788k484k897o37J0620K6334J0120J4824Q068r995M9K735K218
13228A03409m320J220p269q25J7252N627J1840J3851j3411j0892q084j2245p829
13215H8324o796j4332j0448J5010J7133N477N03J934q601j0313J758K3722j311
13202A02060m335j1690r107J1816k036j1479J886j492q04K052R434J631J8570
$$ plain form
13189 106506 130454 133700 137022 143739 137639 132629 119317 105135 107793 116551 128216 137717 145301
13176 145301 157238 151824 138932 116719 100968 84916 82370 88605 81748 85223 85490 79934 86244
13163 86244 82862 70931 63497 56781 51538 49825 51980 57617 59579 64357 67494 67088 65934 82398
13149 82398 99437 99944 83626 82308 101548 116097 106530 90675 81270 92775 88612 81111 75655
13136 75655 75031 65085 65634 77710 85969 87633 90654 79366 69906 72221 72902 82842 81607 72799 77159
13121 77159 87927 84582 78705 72952 86691 90703 89564 84657 70679 70021 64834 66930 77085 67690
13107 67690 62843 57646 72708 76678 73689 76292 83354 78028 67136 53749 58040 71062 68847
13094 68847 64715 58298 45661 49620 69460 73239 70498 69917 63704 58353 70464 71525 65760 66282
$$ packed form
13189A06506K3948L246L322O717o100n010j3312j4182K658Q758J1665R501P584
13176A45301J1937n414j2892k2213j5751j6052k546O235o857L475K67n556O310
13163H6244l382j1931p434o716n243j713K155N637J962M778L137m06j154J6464
13149H2398J7039N07j6318j318J9240J4549r567j5855r405J1505m163p501n456
13136G5655o24r946N49J2076Q259J664L021j1288r460K315O81R940j235q808M360
13121G7159J0768l345n877n753J3739M012j139m907j3978o58n187K096J0155r395
13107F7690m847n197J5062L970k989K603P062n326j0892j3387M291J3022k215
13094F8847m132o417j2637L959J9840L779k741n81o213n351J2111J061n765N22
$$ plain form
13080 66282 65388 75604 80958 75173 69974 69912 66058 66087 67957 64310 81296 95190 96945 95403 104436
13065 104436 103019 98743 89083 77009 85774 86233 90674 78720 80705 88462 89258 101432 95085 82221
13051 82221 84266 89422 96146 76436 77756 80087 62085 65256 73056 79388 85073 94336 90544 80936
13037 80936 81300 89436 107820 111484 125890 144512 152642 159575 147915 140386 131250 136927 130231 111428
13023 111428 111550 123712 120981 106502 90882 98760 124854 119463 104002 96785 86659 79745 69280
13010 69280 90365 106969 112097 105510 102351 99612 97992 106219 118374 113051 108300 124975 132342
12997 132342 120297 110063 105629 98107 97456 103167 113952 96620 99953 98658 102856 99422 90051
12984 90051 88728 86829 88532 97988 104745 96051 89969 87378 86089 97225 102353 92862 91647 98208
$$ packed form
13080F6282q94J0216N354n785n199o2l854K9J870l647J6986J3894J755j542R033
13065A04436j417m276r660j2074Q765M59M441j1954J985P757P96J2174o347j2864
13051H2221K045N156O724j9710J320K331j8002L171P800O332N685R263l792r608
13037H0936L64Q136J8384L664J4406J8622Q130O933j1660p529r136N677o696j8803
13023A11428J22J2162k731j4479j5620P878K6094n391j5461p217j0126o914j0465
13010F9280K1085J6604N128o587l159k739j620Q227J2155n323m751J6675P367
12997A32342j2045j0234m434p522o51N711J0785j7332L333j295M198l434r371
12984I0051j323j899J703R456O757q694o082k591j289J1136N128r491j215O561
$$ plain form
12970 98208 95229 84569 92887 103488 100393 100904 99283 100441 106454 100779 103443 99529 97908 90053
12956 90053 92808 93681 103979 101392 102792 120091 133342 129807 111258 106533 107802 117067 118465 111828
12942 111828 104682 112566 105398 98432 100887 109076 115495 103829 96996 108284 109337 105178 100476 113972
12928 113972 113436 109340 112875 98742 104154 112360 114923 111013 113568 121128 128993 132603 120490 127343
12914 127343 138051 140043 139396 132550 121333 102284 111539 120407 132046 113758 91269 94421 91271
12901 91271 90729 84492 83591 90108 104859 113207 116692 116961 126919 135326 131929 122425 123299 123368 118356 120669
12885 120669 131489 130453 120793 126502 131617 136141 115768 104996 114013 117811 129235 142297 143407
12872 143407 154052 163548 169951 151812 140532 121551 120818 135559 141817 138620 141772 140135 131183
$$ packed form
12970I8208k979j0660Q318J0601l095N11j621J158O013n675K664l914j621p855
12956I0053K755Q73J0298k587J400J7299J3251l535j8549m725J269R265J398o637
12942A11828p146P884p168o966K455Q189O419j1666o833J1288J053m159m702J3496
12928A13972n36m096L535j4133N412Q206K563l910K555P560P865L610j2113O853
12914A27343J0708J992o47o846j1217j9049R255Q868J1639j8288k2489L152l150
12901I1271n42o237r01O517J4751Q348L485K69R958Q407l397r504Q74O9n012K313
12885A20669J0820j036r660N709N115M524k0373j0772R017L798J1424J3062J110
12872A43407J0645R496O403j8139j1280j8981p33J4741O258l197L152j637q952
$$ plain form
12859 131183 149527 151667 152900 154740 144522 144305 143557 140289 142131 147228 146781 157310 156132 161075
12845 161075 165795 154737 149200 139391 130462 135149 142574 144430 160138 171285 174784 179766 166289
12832 166289 161230 170398 165225 173312 170436 158128 145627 143430 148476 151553 145574 150804 149749 146328
12818 146328 148104 149535 153518 162905 163538 169141 172845 158086 148802 147978 162517 177468 182624 184622
12804 184622 169527 159735 177935 175711 157014 140408 151355 181083 195552 201037 200778 186423
12792 186423 180329 180755 191901 200030 214131 224261 221586 214862 220434 216935 217858 219791 226226 229680
12778 229680 215218 216232 217873 207314 196667 188562 188996 202314 208498 209299 206396 203003 195224 193181
12764 193181 186400 191258 201309 209583 220325 213352 200754 189695 198111 193181 189100 191416 180936
$$ packed form
12859A31183J8344K140J233J840j0218k17p48l268J842N097m47J0529j178M943
12845A61075M720j1058n537r809q929M687P425J856J5708J1147L499M982j3477
12832A66289n059R168n173Q087k876j2308j2501k197N046L077n979N230j055l421
12818A46328J776J431L983R387O33N603L704j4759r284q24J4539J4951N156J998
12804A84622j5095r792J8200k224j8697j6606J0947K9728J4469N485k59j4355
12792A86423o094M26J1146Q129J4101J0130k675o724N572l499R23J933O435L454
12778B29680j4462J014J641j0559j0647q105M34J3318O184Q01k903l393p779k043
12764A93181o781M858J0051Q274J0742o973j2598j1059Q416m930m081K316j0480
$$ plain form
12751 180936 177717 177241 182814 193815 190112 192511 206022 224238 225037 214602 219967 230345 229056
12738 229056 244553 254522 244638 240198 236174 233090 221681 223266 226985 227417 227658 229945 230781 225472
12724 225472 216203 225003 225888 210103 204024 215696 224699 215753 212886 208874 207976 204188 211112 223260
12710 223260 237338 233862 234828 242523 243495 238300 254677 266456 266994 300239 324228 335989 338405
12697 338405 321359 324205 329039 325385 325768 324138 321149 325762 316132 296639 297700 306060 306366 298015
12683 298015 275158 265271 256642 253695 261132 264885 254659 252291 241779 244084 254034 260051 256854
12670 256854 256395 247037 231201 246651 272589 268754 262273 257660 270827 285532 296993 304299 300945
12657 300945 305800 310970 307243 311488 326838 332148 352116 376334 395084 387927 374276 373443 367248
$$ packed form
12751A80936l219m76N573J1001l703K399J3511J8216P99j0435N365J0378j289
12738B29056J5497R969r884m440m024l084j1409J585L719M32K41K287Q36n309
12724B25472r269Q800Q85j5785o079J1672R003q946k867m012q98l788O924J2148
12710B23260J4078l476R66P695R72n195J6377J1779N38L3245K3989J1761K416
12697C38405j7046K846M834l654L83j630k989M613r630j9493J061Q360L06q351
12683B98015k2857r887q629k947P437L753j0226k368j0512K305R950O017l197
12670B56854m59r358j5836J5450K5938l835o481m613J3167J4705J1461P306l354
12657C00945M855N170l727M245J5350N310J9968K4218J8750p157j3651q33o195
$$ plain form
12644 367248 359805 370722 381905 365027 363111 364491 352299 332993 336213 334026 327914 320115 312306
12631 312306 300565 292826 289432 290025 288821 301445 308589 306480 306561 304675 305966 320205 328991 330860
12617 330860 333590 347318 360209 356419 364488 378719 374751 361055 344606 343117 354701 374689
12605 374689 377033 370959 365410 360356 366808 364982 357340 356575 352790 347135 343978 346841 360279 356115
12591 356115 351414 360111 377162 368585 378574 383368 380323 389100 389030 392188 389209 382669 377572 376364
12577 376364 391130 398452 399377 396250 387847 404229 415894 421513 424230 421599 416236 428110 450603
12564 450603 494412 526636 529583 530467 524698 497198 473455 467334 470039 463965 475912 481043 482208
12551 482208 486430 479733 471938 489882 493897 493036 481248 456308 442172 436777 446806 452667 460328
$$ packed form
12644C67248p443J0917J1183j6878j916J380j2192j9306L220k187o112p799p809
12631C12306j1741p739l394N93j204J2624P144k109Q1j886J291J4239Q786J869
12617C30860K730J3728J2891l790Q069J4231l968j3696j6449j489J1584J9988
12605C74689K344o074n549n054O452j826p642p65l785n655l157K863J3438m164
12591C56115m701Q697J7051q577R989M794l045Q777p0L158k979o540n097j208
12577C76364J4766P322R25l127q403J6382J1665N619K717k631n363J1874K2493
12564D50603M3809L2224K947Q84n769k7500k3743o121K705o074J1947N131J165
12551D82208M222o697p795J7944M015q61j1788k4940j4136n395J0029N861P661
$$ plain form
12538 460328 477157 483622 467816 462563 466534 474851 486651 486316 472486 479968 488998 505494 514476
12525 514476 526084 539582 548500 566310 571709 582617 585923 570903 564115 576384 588097 604218
12513 604218 599439 592360 584188 585067 593069 594683 597571 597316 608184 619217 622793 635236 647929 641920
12499 641920 639119 647055 654501 663358 678941 685960 671849 664174 676453 681429 686539 689678 689677 695889
12485 695889 714600 729717 757561 786603 811455 843214 874932 903236 948665 1007034 1067089
12474 1067089 1124049 1165954 1187540 1200269 1203888 1197049 1169986 1121847 1092133 1071572 1048149 1019811
12462 1019811 988535 960812 952699 943554 921335 917477 923183 941622 964753 984166 1004195 1023326
12450 1023326 1057280 1119190 1183880 1231731 1297537 1426384 1629897 1948343 2461423 3238139
$$ packed form
12538D60328J6829O465j5806n253L971Q317J1800l35j3830P482R030J6496Q982
12525E14476J1608J3498Q918J7810N399J0908L306j5020o788J2269J1713J6121
12513F04218m779p079q172Q79Q002J614K888k55J0868J1033L576J2443J2693o009
12499F41920k801P936P446Q857J5583P019j4111p675J2279M976N110L139jO212
12485F95889J8711J5117K7844K9042K4852L1759L1718K8304M5429N8369O0055
12474A067089N6960M1905K1586J2729L619o839k7063m8139k9714k0561k3423k8338
12462A019811l1276k7723q113r145k2219l858N706J8439K3131J9413K0029J9131
12450A023326L3954O1910O4690M7851O5806J28847K03513L18446N13080P76716
$$ plain form
12440 3238139 4089574 4620682 4538383 3945948 3152932 2442907 1954609 1663854 1492116 1388054
12430 1388054 1335524 1293339 1266194 1258633 1246605 1218534 1196730 1185344 1184305 1201402 1217032 1237532
12418 1237532 1253209 1272031 1297580 1323705 1316913 1294382 1295532 1288885 1279772 1286835 1294830 1299074 1306957
12405 1306957 1325081 1337343 1339810 1348366 1363479 1385272 1384823 1366978 1373628 1391613 1407159 1424856
12393 1424856 1428174 1447077 1465569 1469484 1484570 1502040 1527973 1552446 1573804 1584978 1590828 1615114
12381 1615114 1643366 1647747 1677574 1702940 1736250 1772516 1795398 1805318 1813466 1830604 1857348 1870088
12369 1870088 1883874 1910575 1937786 1954763 1986996 2014578 2038524 2051120 2080437 2103231 2129964
12358 2129964 2163308 2209816 2242396 2262883 2301279 2333506 2372967 2418811 2441481 2469354 2504001
$$ packed form
12440C238139Q51435N31108q2299n92435p93016p10025m88298k90755j71738j04062
12430A388054n2530m2185k7145p561j2028k8071k1804j1386j039J7097J5630K0500
12418A237532J5677J8822K5549K6125o792k2531J150o647r113P063P995M244P883
12405A306957J8124J2262K467Q556J5113K1793m49j7845O650J7985J5546J7697
12393A424856L318J8903J8492L915J5086J7470K5933K4473K1358J1174N850K4286
12381A615114K8252M381K9827K5366L3310L6266K2882R920Q148J7138K6744J2740
12369A870088J3786K6701K7211J6977L2233K7582K3946J2596K9317K2794K6733
12358B129964L3344M6508L2580K0487L8396L2227L9461M5844K2670K7873L4647
$$ plain form
12347 2504001 2555373 2605735 2645621 2686751 2729205 2754946 2779424 2814870 2859662 2904819 2957123
12336 2957123 3023676 3085828 3141545 3187330 3228652 3281812 3330515 3378515 3439940 3512814 3574653
12325 3574653 3633396 3706447 3755778 3811134 3881833 3948290 4012094 4078216 4162308 4266555 4360028
12314 4360028 4418524 4486819 4567169 4662181 4763631 4848919 4952224 5041548 5144388 5260746
12304 5260746 5384479 5491963 5591492 5708146 5829815 5951241 6076581 6214871 6355737 6502477
12294 6502477 6644934 6784282 6931670 7089306 7251042 7424346 7600675 7786011 7973522
12285 7973522 8163857 8375512 8595502 8825348 9083067 9348626 9615974 9891201 10146878
12276 10146878 10376168 10571402 10779806 11002188 11225295 11475476 11729516 11992906 12276682
$$ packed form
12347B504001N1372N0362L9886M1130M2454K5741K4478L5446M4792M5157N2304
12336B957123O6553O2152N5717M5785M1322N3160M8703M8000O1425P2874O1839
12325C574653N8743P3051M9331N5356P0699O6457O3804O6122Q4092J04247R3473
12314D360028N8496O8295Q0350R5012J01450Q5288J03305Q9324J02840J16358
12304E260746J23733J07484R9529J16654J21669J21426J25340J38290J40866J46740
12294F502477J42457J39348J47388J57636J61736J73304J76329J85336J87511
12285G973522J90335K11655K19990K29846K57719K65559K67348K75227K55677
12276A0146878K29290J95234K08404K22382K23107K50181K54040K63390K83776
$$ plain form
12267 12276682 12589486 12900809 13217457 13535830 13861068 14184812 14518772 14868648 15224671
12258 15224671 15598405 15983658 16379655 16780310 17187961 17578487 17985667 18383270 18761465
12249 18761465 19129144 19496788 19834373 20181211 20525613 20841896 21151833 21455272 21750287
12240 21750287 22035859 22313378 22570477 22807185 23024124 23219151 23395118 23573657 23737162
12231 23737162 23865708 24012394 24151932 24260572 24312665 24269850 24124981 23911099 23652320 23387620
12221 23387620 23121842 22868675 22596949 22313689 22033317 21742671 21428743 21097158 20761026
12212 20761026 20431839 20087225 19724888 19360890 18993110 18620179 18266663 17898697 17515375
12203 17515375 17140419 16770422 16411498 16058694 15711463 15362130 15022493 14684232 14340266
$$ packed form
12267A2276682L12804L11323L16648L18373L25238L23744L33960L49876L56023
12258A5224671L73734L85253L95997M00655M07651L90526M07180L97603L78195
12249A8761465L67679L67644L37585L46838L44402L16283L09937L03439K95015
12240B1750287K85572K77519K57099K36708K16939J95027J75967J78539J63505
12231B3737162J28546J46686J39538J08640N2093m2815j44869k13882k58779k64700
12221B3387620k65778k53167k71726k83260k80372k90646l13928l31585l36132
12212B0761026l29187l44614l62337l63998l67780l72931l53516l67966l83322
12203A7515375l74956l69997l58924l52804l47231l49333l39637l38261l43966
$$ plain form
12194 14340266 14018799 13700433 13373346 13058755 12750165 12442878 12154563 11871222 11594414
12185 11594414 11327263 11077053 10841355 10600252 10360040 10155006 9968007 9816591 9675249
12176 9675249 9498128 9289794 9051116 8808916 8572367 8328436 8094626 7883487 7705042
12167 7705042 7538152 7367839 7193762 7039285 6898867 6766374 6611613 6470882 6349182
12158 6349182 6222387 6091573 5972955 5847015 5719780 5608157 5498116 5386376 5296560 5201390
12148 5201390 5099913 4999598 4898118 4820110 4740618 4655103 4570534 4490477 4412319 4346542 4277542
12137 4277542 4205648 4139118 4061081 3980784 3917076 3870575 3807716 3738174 3673479 3595849 3526773
12126 3526773 3465359 3416645 3363752 3312513 3257925 3207412 3160979 3118054 3075531 3037283 3003981
$$ packed form
12194A4340266l21467l18366l27087l14591l08590l07287k88315k83341k76808
12185A1594414k67151k50210k35698k41103k40212k05034j86999j51416j41342
12176I675249j77121k08334k38678k42200k36549k43931k33810k11139j78445
12167G705042j66890j70313j74077j54477j40418j32493j54761j40731j21700
12158F349182j26795j30814j18618j25940j27235j11623j10041j11740q9816r5170
12148E201390j01477j00315j01480p8008p9492q5515q4569q0057p8158o5777o9000
12137D277542p1894o6530p8037q0297o3708m6501o2859o9542o4695p7630o9076
12126C526773o1414m8714n2893n1239n4588n0513m6433m2925m2523l8248l3302
$$ plain form
12115 3003981 2959319 2923282 2880188 2837390 2794817 2760918 2718868 2680904 2645798 2614433 2579807
12104 2579807 2550313 2519147 2476967 2445286 2418243 2395025 2362112 2325525 2307526 2282957 2244073
12093 2244073 2193247 2152433 2121270 2090777 2059008 2038526 2019262 1993351 1977863 1954139 1930298
12082 1930298 1911871 1890239 1875711 1856815 1841836 1830849 1819917 1801147 1774582 1754545 1738313
12071 1738313 1715388 1683910 1654946 1638796 1626864 1600678 1580256 1574847 1569416 1552287 1531793 1505469
12059 1505469 1495866 1492527 1470044 1466780 1452034 1439438 1426971 1422245 1418002 1412570 1414489 1415929 1406342
12046 1406342 1393375 1379343 1363894 1339584 1306161 1276559 1256392 1239795 1231964 1217280 1213508 1211036
12034 1211036 1199089 1175274 1168515 1161697 1141860 1115057 1102946 1107201 1119310 1114516 1089814 1095478
$$ packed form
12115C003981m4662l6037m3094m2798m2573l3899m2050l7964l5106l1365l4626
12104B579807k9494l1166m2180l1681k7043k3218l2913l6587j7999k4569l8884
12093B244073n0826m0814l1163l0493l1769k0482j9264k5911j5488k3724k3841
12082A930298j8427k1632j4528j8896j4979j0987j0932j8770k6565k0037j6232
12071A738313k2925l1478k8964j6150j1932k6186k0422n409n431j7129k0494k6324
12059A505469r603l339k2483l264j4746j2596j2467m726m243n432J919J440r587
12046A406342j2967j4032j5449k4310l3423k9602k0167j6597p831j4684l772k472
12034A211036j1947k3815o759o818j9837k6803j2111M255J2109m794k4702N664
$$ plain form
12022 1095478 1088396 1080982 1065085 1051695 1041403 1021377 1004213 1001378 986774 980474 984170 984954 989269
12009 989269 1006003 1000317 980316 974462 975454 978939 982556 971527 964677 967487 968060 971695 986137 984858
11995 984858 979792 979009 970528 949880 917419 907830 909065 900600 881265 871882 851524 841948 840180
11982 840180 844099 833108 827335 818410 819809 821452 822054 812279 795245 791268 809812 809921 799543 805342
11968 805342 790955 796039 804508 794162 791056 797460 798557 792749 797165 803786 798902 794788 801988 802189
11954 802189 828787 852569 863041 875541 881398 899088 937402 996289 1076675 1188003 1350147
11943 1350147 1564104 1760160 1894849 1934326 1884685 1756188 1582306 1390888 1221256 1091500
11933 1091500 998812 937474 904500 881112 858378 847320 838375 843139 841091 831239 832534 835114
$$ packed form
12022A095478p082p414j5897j3390j0292k0026j7164k835j4604o300L696P84M315
12009I89269J6734n686k0001n854R92L485L617j1029o850K810N73L635J4442j279
11995I84858n066p83q481k0648l2461r589J235q465j9335r383k0358r576j768
11982H40180L919j0991n773q925J399J643O02r775j7034l977J8544J09j0378N799
11968H05342j4387N084Q469j0346l106O404J097n808M416O621m884m114P200K01
11954H02189K6598K3782J0472J2500N857J7690L8314N8887Q0386J11328J62144
11943A350147K13957J96056J34689L9477m9641j28497j73882j91418j69632j29756
11933A091500r2688o1338l2974k3388k2734j1058q945M764k048r852J295K580
$$ plain form
11921 835114 837234 849392 856716 861125 867600 875873 874311 885684 881959 877687 861950 860714 868902
11908 868902 868784 881078 887490 890049 914611 948740 982814 1018130 1056550 1119848 1199280 1296739
11896 1296739 1409484 1577758 1787910 2088332 2489621 2943145 3352304 3608156 3622990 3469217
11886 3469217 3191905 2825520 2444277 2090230 1828997 1668065 1567707 1508461 1480084 1435322
11876 1435322 1411735 1419147 1436732 1453291 1486671 1516556 1550214 1591058 1651194 1715475 1789351
11865 1789351 1870579 1957784 2058647 2190614 2353670 2547215 2786821 3108669 3536081 4068104
11855 4068104 4682399 5415706 6339179 7518470 9048324 11172073 14247759 18892652 25755818
11846 25755818 34533645 42291594 46194605 47361767 47815043 47063251 43091856 36286129
$$ packed form
11921H35114K120J2158P324M409O475Q273j562J1373l725m272j5737j236Q188
11908H68902j18J2294O412K559K4562L4129L4074L5316L8420O3298P9432R7459
11896A296739J12745J68274K10152L00422M01289M53524M09159K55852J4834j53773
11886C469217k77312l66385l81243l54047k61233j60932j00358n9246k8377m4762
11876A435322k3587P412J7585J6559L3380K9885L3658M0844O0136O4281P3876
11865A789351Q1228Q7205J00863J31967J63056J93545K39606L21848M27412N32023
11855D068104O14295P33307R23473J179291J529854K123749L075686M644893O863166
11846B5755818Q777827P757949L903011J167162M53276p51792l971395o805727
$$ plain form
11838 36286129 28578243 21908744 17056047 13714867 11384499 9750840 8605243 7691706
11830 7691706 6854143 6081133 5386726 4801065 4357800 4057814 3841502 3675081 3540756
11821 3540756 3453359 3418806 3401849 3416214 3439324 3493705 3582707 3705784 3856359 4058434 4332683
11810 4332683 4678301 5122616 5686048 6412170 7389344 8587313 10013354 11730352 13910838
11801 13910838 16746592 20552122 25840103 33552605 44865789 60195174 77355023 92568233
11793 92568233 103579140 110208997 111628870 106573471 93838708 75304448 56374594
11786 56374594 40784381 29882677 22818422 18186130 15008175 12731824 11008919 9654410
11778 9654410 8477824 7431920 6520330 5780584 5202892 4765041 4415865 4134505 3922973
$$ packed form
11838C6286129p707886o669499m852697l341180k330368j633659j145597r13537
11830G691706q37563p73010o94407n85661m43265k99986k16312j66421j34325
11821C540756q7397l4553j6957J4365K3110N4381Q9002J23077J50575K02075K74249
11810D332683L45618M44315N63432P26122R77174J197969J426041J716998K180486
11801A3910838K835754L805530N287981P712502J1313184J5329385J7159849J5213210
11793I2568233J1010907O629857J419873n055399j2734763j8534260j8929854
11786E6374594j5590213j0901704p064255m632292l177955k276351j722905j354509
11778I654410j176586j045904r11590p39746n77692m37851l49176k81360k11532
$$ plain form
11769 3922973 3751281 3623675 3523799 3455723 3401955 3366611 3354020 3399879 3490532 3611693 3786610
11758 3786610 4039309 4380329 4835645 5451865 6241825 7170256 8336848 9823679 11704458
11749 11704458 13992262 16974419 21298300 27909471 37753207 50167569 61132543 67362208
11741 67362208 69621741 67804841 60732248 49845981 38016350 27865707 20502500 15605682
11733 15605682 12396220 10197607 8598725 7371682 6357561 5488714 4730447 4076662
11725 4076662 3540503 3119145 2781465 2510762 2285844 2102537 1950743 1829823 1707452
11716 1707452 1600056 1517018 1428791 1341156 1270918 1215588 1147545 1106217 1078962 1039150 1007084
11705 1007084 998319 1000889 988416 966928 953404 917626 876968 837003 816784 791335 767561 733022
$$ packed form
11769C922973j71692j27606r9876o8076n3768l5344j2591M5859R0653J21161J74917
11758C786610K52699L41020M55316O16220P89960R28431J166592J486831J880779
11749A1704458K287804K982157M323881O611171R843736J2414362J0964974O229665
11741F7362208K259533j816900p072593j0886267j1829631j0150643p363207m896818
11733A5605682l209462k198613j598882j227043j014121q68847p58267o53785
11725D076662n36159m21358l37680k70703k24918j83307j51794j20920j22371
11716A707452j07396q3038q8227q7635p0238n5330o8043m1328k7255l9812l2066
11705A007084q765K570j2473k1488j3524l5778m0658l9965k0219k5449k3774l4539
$$ plain form
11693 733022 709509 692375 671387 651158 643954 635842 626613 628692 628533 633026 647479 661787 670578
11680 670578 666244 649313 632197 606949 574442 545388 522071 502469 488645 480120 496217 522725
11668 522725 555243 590837 628760 643798 659505 653586 619268 581739 525747 488694 472026 483581
11656 483581 494872 491466 509923 523119 516376 506021 507813 527094 550835 561762 562653 537915
11644 537915 496178 461323 418797 379786 362851 355782 345825 323734 311920 321018 312920 310841
11632 310841 310757 313128 293444 289548 307456 324302 325488 310646 297966 294091 297374 299806 302420
11619 302420 312668 343196 374211 387420 394723 401997 406418 388263 361343 339623 335889 324442
11607 324442 306308 301290 302796 295182 306496 313541 315897 327710 334419 322114 298318 279615 274181
$$ packed form
11693G33022k3513j7134k0988k0229p204q112r229K079j59M493J4453J4308Q791
11680F70578m334j6931j7116k5248l2507k9054k3317j9602j3824q525J6097K6508
11668E22725L2518L5594L7923J5038J5707n919l4318l7529n5992l7053j6668J1555
11656D83581J1291l406J8457J3196o743j0355J792J9281K3741J0927Q91k4738
11644E37915m1737l4855m2526l9011j6935p069r957k2091j1814R098q098k079
11632C10841q4K371j9684l896J7908J6846J186j4842j2680l875L283K432K614
11619C02420J0248L0528L1015J3209P303P274M421j8155k6920k1720l734j1447
11607C24442j8134n018J506p614J1314P045K356J1813O709j2305k3796j8703n434
$$ plain form
11594 274181 281129 286396 276547 280969 283833 293656 299634 290355 291430 298212 303606 312820 331375 356710
11580 356710 386181 386504 383039 413507 428915 446235 459141 478675 481632 465027 452049 428755
11568 428755 407938 411929 394265 361028 345983 326590 311695 291325 275861 258383 254021 257747
11556 257747 259403 253510 260007 248585 248254 252752 250917 260609 279424 277218 270610 271812 277349 286106
11542 286106 288256 293185 300696 300664 314218 343311 368282 377215 401571 425713 450715 468388 485542
11529 485542 483046 494548 501397 500491 511538 516893 499354 477567 448182 423037 408899 388355
11517 388355 367648 361933 358745 348963 343815 347990 349261 328861 315953 304213 284216 259766 243617
11504 243617 239443 241533 232400 218808 226397 233692 227697 230310 229622 241620 254969 243759 248262
$$ packed form
11594B74181O948N267r849M422K864R823N978r279J075O782N394R214J8555K5335
11580C56710K9471L23l465L0468J5408J7320J2906J9534K957j6605j2978k3294
11568D28755k0817L991j7664l3237j5045j9393j4895k0370j5464j7478m362L726
11556B57747J656n893O497j1422l31M498j835R692J8815k206o608J202N537Q757
11542B86106K150M929P511l2J3554K9093K4971Q933K4356K4142K5002J7673J7154
11529D85542k496J1502O849r06J1047N355j7539k1787k9385k5145j4138k0544
11517C88355k0707n715l188r782n148M175J271k0400j2908j1740j9997k4450j6149
11504B43617m174K090r133j3592P589P295n995K613o88J1998J3349j1210M503
$$ plain form
11491 248262 260652 262345 268294 272510 281131 284921 290500 303756 308227 313670 336956 340548 331619
11478 331619 315087 307518 299004 301855 311798 326366 330092 347213 340953 332265 335551 323362 323056
11465 323056 320929 314547 307573 302754 280733 251275 237334 237818 229330 233937 229619 216270 222801
11452 222801 239268 239266 249305 258992 262334 262553 262892 253358 248876 257441 269254 265714 262742 255001 248909
11437 248909 242276 244820 254714 265227 284094 284797 266035 250169 258038 262504 259723 253124 249002
11424 249002 251851 249469 251664 262216 291850 292717 302383 312386 310428 307086 322045 341502 363566
11411 363566 369564 380320 407026 405901 390845 378540 364613 348942 357794 361922 367788 380709
11399 380709 400016 424548 458073 471435 458729 434539 422946 401910 374225 368151 352307 327922
$$ packed form
11491B48262J2390J693N949M216Q621L790N579J3256M471N443K3286L592q929
11478C31619j6532p569q514K851R943J4568L726J7121o260q688L286j2189l06
11465C23056k127o382o974m819k2021k9458j3941M84q488M607m318j3349O531
11452B22801J6467kJ0039R687L342K19L39r534m482Q565J1813l540k972p741o092
11437B48909o633K544R894J0513J8867P03j8762j5866P869M466k781o599m122
11424B49002K849k382K195J0552K9634Q67R666J0003j958l342J4959J9457K2064
11411C63566N998J0756K6706j125j5056j2305j3927j5671Q852M128N866J2921
11399C80709J9307K4532L3525J3362j2706k4190j1593k1036k7685o074j5844k4385
$$ plain form
11387 327922 317141 307316 311555 314880 319497 327730 342447 361892 373755 389810 397853 398344 395858
11374 395858 389487 377533 358980 341038 352900 372288 400299 422377 442168 471827 506561 535867
11362 535867 549820 539746 516766 501719 500872 518744 555553 607601 657998 706771 753520 804962
11350 804962 885507 1032053 1236530 1510279 1891295 2373657 2833497 3028351 2813001 2294927
11340 2294927 1735398 1281657 986477 807354 697432 624292 572014 541984 548971 557247 541451
11329 541451 535727 512887 482669 473101 465029 460485 440448 434781 440034 443995 429145 426300 439507
11316 439507 448288 458627 470635 495081 517520 542802 596778 662363 730336 791834 832559 849225
11304 849225 862901 914544 998176 1097707 1212350 1331330 1475005 1722497 2178282 2918132
$$ packed form
11387C27922j0781r825M239L325M617Q233J4717J9445J1863J6055Q043M91k486
11374C95858o371j1954j8553j7942J1862J9388K8011K2078J9791K9659L4734K9306
11362E35867J3953j0074k2980j5047q47J7872L6809N2048N0397M8773M6749N1442
11350H04962Q0545J46546K04477K73749L81016M82362M59840J94854k15350n18074
11340B294927n59529m53741k95180j79123j09922p3140n2278l0030O987Q276j5796
11329E41451n724k2840l0218r568q072m544k0037n667N253L961j4850k845J3207
11316D39507Q781J0339J2008K4446K2439K5282N3976O5585O7973O1498M0725J6666
11304H49225J3676N1643Q3632R9531J14643J18980J43675K47492M55785P39850
$$ plain form
11294 2918132 3764566 4420263 4755764 4807705 4451176 3722693 2880817 2129474 1581510 1231237
11284 1231237 1018263 894275 806446 744000 707766 677003 654006 627913 586628 543702 507867
11273 507867 492146 486223 490560 499606 496814 502646 535232 573214 581628 559313 536285 523097 502989
11260 502989 499327 504507 504822 502374 493466 484645 483846 494489 507594 500871 483097 479289 479056 484127
11246 484127 495400 507430 505298 506109 518045 532752 553059 565829 583045 597144 609536 628751
11234 628751 630739 622664 619602 621004 618138 628409 641598 652816 635491 632162 634251 634083 632867
11221 632867 624551 630770 635923 657448 685846 688748 700907 721307 734412 744132 783123 821394
11209 821394 863929 903909 948449 1001372 1049894 1115517 1186773 1267242 1350668 1423150 1513705
$$ packed form
11294B918132Q46434O55697L35501N1941l56529p28483q41876p51343n47964l50273
11284A231237k12974j23988q7829o2446l6234l0763k2997k6093m1285m2926l5835
11273E07867j5721n923M337R046k792N832L2586L7982Q414k2315k3028j3188k0108
11260E02989l662N180L15k448q908q821p99J0643J3105o723j7774l808k33N071
11246D84127J1273J2030k132Q11J1936J4707K0307J2770J7216J4099J2392J9215
11234F28751J988q075l062J402k866J0271J3189J1218j7325l329K089j68j216
11221F32867q316O219N153K1525K8398K902J2159K0400J3105R720L8991L8271
11209H21394M2535L9980M4540N2923M8522O5623P1256Q0469Q3426P2482R0555
$$ plain form
11198 1513705 1635218 1764250 1907847 2127324 2479948 3032842 3787925 4600477 5118163
11189 5118163 5294681 5380834 5485861 5376753 4942537 4342523 3821332 3499773 3395146 3465713
11179 3465713 3650570 3934753 4351460 4923611 5673899 6626135 7794541 9310935 11426249
11170 11426249 14388488 18377309 23134767 28138454 33058227 37479040 40699761 42673613
11162 42673613 43885286 44471862 44442884 44076788 43314226 41529487 38492852 34451158 29688965
11153 29688965 24639262 19901646 15947537 12941596 10791485 9244062 8085464 7190059
11145 7190059 6476391 5899288 5438110 5075796 4789272 4563001 4389878 4269823 4190289 4164841
11135 4164841 4172825 4229793 4323729 4459235 4639951 4880262 5221011 5693103 6279230 7018460
$$ packed form
11198A513705J21513J29032J43597K19477L52624N52894P55083Q12552N17686
11189E118163J76518Q6153J05027j09108m34216o00014n21191l21559j04627P0567
11179C465713J84857K84183M16707N72151P50288R52236J168406J516394K115314
11170A1426249K962239L988821M757458N003687M919773M420813L220721J973852
11162D2673613J211673N86576k8978l66096p62562j784739l036635m041694m762193
11153B9688965n049703m737616l954109l005941k150111j547423j158598q95405
11145G190059p13668n77103m61178l62314k86524k26271j73123j20055p9534k5448
11135D164841P984N6968R3936J35506J80716K40311L40749M72092N86127P39230
$$ plain form
11125 7018460 7980395 9256964 10957577 13276091 16537014 21147630 27252393 34544086
11117 34544086 42452767 50355720 57488601 63426660 68072471 71416445 73532009 74546951
11109 74546951 74456567 72986991 70051408 65590066 59647530 52571249 44884519 37129138
11101 37129138 29893966 23708872 18834729 15233398 12625354 10725631 9276209 8128828
11093 8128828 7221208 6477551 5859347 5362238 4970802 4662205 4396107 4153992 3972607
11084 3972607 3821280 3705202 3651585 3652646 3707748 3824609 4033194 4303081 4623246 5011450
11074 5011450 5499743 6106430 6901028 8037417 9637702 11840701 14685192 17965925 21313420
11065 21313420 24532907 27566675 30188130 32146240 33548833 34463319 34604862 33973957
$$ packed form
11125G018460R61935J276569J700613K318514L260923M610616O104763P291693
11117C4544086P908681P902953P132881N938059M645811L343974K115564J014942
11109G4546951r0384j469576k935583m461342n942536p076281p686730p755381
11101C7129138p235172o185094m874143l601331k608044j899723j449422j147381
11093H128828r07620p43657o18204m97109l91436l08597k66098k42115j81385
11084C972607j51327j16078n3617J061N5102J16861K08585K69887L20165L88204
11074E011450M88293O06687P94598J136389J600285K202999K844491L280733L347495
11065B1313420L219487L033768K621455J958110J402593R14486J41543o30905
$$ plain form
11057 33973957 32841250 31210582 28958649 26233508 23212060 19882877 16418711 13148904
11049 13148904 10419799 8373079 6944655 5969071 5221988 4604626 4089121 3669512 3353094
11040 3353094 3107962 2921438 2766917 2626276 2488679 2347039 2235114 2149301 2071591 1991555
11030 1991555 1920358 1885027 1851018 1805854 1738751 1678334 1648747 1642186 1655582 1698395 1783238
11019 1783238 1902705 2054505 2224257 2422888 2614144 2778545 2908510 2981154 2993787 2959988
11009 2959988 2853380 2697349 2499491 2314070 2131885 1983429 1852680 1747427 1644372
11000 1644372 1535388 1472885 1434111 1407617 1401458 1405546 1453534 1521860 1559361 1573993 1575425 1577926
10988 1577926 1607228 1665254 1710365 1753921 1798040 1852224 1942584 2070666 2216398 2427407 2759740
$$ packed form
11057C3973957j132707j630668k251933k725141l021448l329183l464166l269807
11049A3148904k729105k046720j428424r75584p47083o17362n15505m19609l16418
11040C353094k45132j86524j54521j40641j37597j41640j11925q5813p7710q0036
11030A991555p1197l5331l4009m5164o7103o0417k9587o561J3396M2813Q4843
11019A783238J19467J51800J69752J98631J91256J64401J29965P2644J2633l3799
11009B959988j06608j56031j97858j85421j82185j48456j30749j05253j03055
11000A644372j08984o2503l8774k6494o159M088M7988O8326L7501J4632J432K501
10988A577926K9302N8026M5111M3556M4119N4184R0360J28082J45732K11009L32333
$$ plain form
10977 2759740 3235793 3812511 4399994 4900478 5197648 5164919 4802619 4288952 3802976 3479578
10967 3479578 3340325 3328185 3398209 3535228 3742273 3997261 4314492 4694591 5213869 5954105
10957 5954105 7122062 8981236 11478137 13584998 14091165 12732736 10503196 8416232
10949 8416232 6991949 6225074 5893463 5810391 5877251 6081058 6402145 6857568 7424829 8117031
10939 8117031 8944050 9925677 11176574 12816509 14934698 17427787 20261010 23445045
10931 23445045 27065475 31415926 37158235 45367553 57629932 76422919 105793970 152831011
10923 152831011 227872508 332453930 431592930 477757658 446210814 357931932 256588380
10916 256588380 172725745 116542858 81949239 60543017 46867513 37955289 32160280
$$ packed form
10977B759740M76053N76718N87483N00484K97170l2729l62300n13667m85976l23398
10967C479578j39253j2140P0024J37019K07045K54988L17231L80099N19278P40236
10957E954105J167957J859174K496901K106861N06167j358429k229540k086964
10949H416232j424283p66875l31611q3072O6860K03807L21087M55423N67261O92202
10939H117031Q27019R81627J250897J639935K118189K493089K833223L184035
10931B3445045L620430M350451N742309Q209318J2262379J8792987K9371051M7037041
10923A52831011P5041497J04581422R9139000M6164728l1546844q8278882j01343552
10916B56588380q3862635n6182887l4593619k1406222j3675504q912224n795009
$$ plain form
10909 32160280 28337207 25499940 22862563 20167579 17413856 14806591 12542578 10697236
10901 10697236 9229491 8092683 7223271 6512598 5909159 5375374 4934974 4607096 4376715
10892 4376715 4259746 4287726 4398817 4468041 4349283 4020798 3571531 3112300 2732157 2450679
10882 2450679 2264665 2150264 2091118 2069757 2035210 1968624 1886445 1805436 1710273 1618692 1524523
10871 1524523 1450943 1407436 1377875 1334425 1253231 1169875 1105273 1074770 1077537 1063515 1031025
10860 1031025 968033 915318 864064 821546 785435 746026 719510 700122 681293 646471 615057
10849 615057 597437 609878 641717 675476 708851 714543 693337 653253 614918 569866 532107 523148
10837 523148 519094 503717 481275 450938 429274 423542 419279 418201 417592 408226 380165 374632 381156
$$ packed form
10909C2160280l823073k837267k637377k694984k753723k607265k264013j845342
10901A0697236j467745j136808q69412p10673o03439n33785m40400l27878k30381
10892D376715j16969K7980J11091O9224j18758l28485m49267m59231l80143k81478
10882B450679j86014j14401n9146k1361l4547o6586q2179q1009r5163r1581r4169
10871A524523p3580m3507k9561m3450q1194q3356o4602l0503K767j4022l2490
10860A031025o2992n2715n1254m2518l6111l9409k6516j9388j8829l4822l1414
10849F15057j7620J2441L1839L3759L3375N692k1206m0084l8335m5052l7759q959
10837E23148m054j5377k2442l0337k1664n732m263j078o09r366k8061n533O524
$$ plain form
10824 381156 392908 398856 407576 408672 392336 379183 365407 344953 324680 309186 288856 283110
10812 283110 274704 286054 290907 301138 320689 314738 310327 311049 308513 292261 268776 240173 216994
10799 216994 180365 181989 279906 472488 727916 928995 991057 888088 703434 530893
10789 530893 416798 350501 298712 266957 262516 262057 262931 248408 237521 241698 264318 283880
10777 283880 268566 257569 252931 240552 231821 205212 178826 167342 143781 117688 108078 110452
10765 110452 112312 103807 93218 98918 109362 114522 115446 118718 123023 113720 111293 123336 149863
10752 149863 160097 166747 183403 191535 200017 206301 222297 245315 245231 249684 257482 265520 269452 293987
10738 293987 324902 343293 338161 322759 298551 270688 249159 232309 226564 214505 202349 183570
$$ packed form
10824C81156J1752N948Q720J096j6336j3153j3776k0454k0273j5494k0330n746
10812B83110q406J1350M853J0231J9551n951m411P22k536j6252k3485k8603k3179
10799B16994l6629J624R7917J92582K55428K01079O2062j02969j84654j72541
10789E30893j14095o6297n1789l1755m441m59Q74j4523j0887M177K2620J9562
10777B83880j5314j0997m638j2379q731k6609k6386j1484k3561k6093r610K374
10765A10452J860q505j0589N700J0444N160R24L272M305r303k427J2043K6527
10752A49863J0234O650J6656Q132Q482O284J5996K3018q4M453P798Q038L932K4535
10738B93987L0915J8391n132j5402k4208k7863k1529j6850n745j2059j2156j8779
$$ plain form
10726 183570 166242 142321 119154 96024 79729 91164 105322 105967 108076 114738 120374 108939
10714 108939 111003 113874 106840 94311 68183 48423 32529 11822 2059 12898 27092 45258
10702 45258 54478 75998 99339 117785 152800 209993 242717 267462 318545 388425 430955 444397
10690 444397 457980 465517 453790 454240 457605 437751 415839 397505 351693 279658 224804 189025
10678 189025 144240 108044 98895 103345 112285 108515 89726 82866 82627 94958 109705 134151 139149
10665 139149 121449 97438 100889 100408 93309 86679 84943 84394 97096 91524 83011 90705 99998 99816
10651 99816 106808 126254 143549 152855 171259 185592 186109 184664 193678 203737 225100 230191 229884
10638 229884 228808 216485 214276 203524 203408 196048 176013 145805 124101 94463 58533 29259
$$ packed form
10726A83570j7328k3921k3167k3130j6295J1435J4158O45K109O662N636j1435
10714A08939K064K871p034j2529k6128j9760j5894k0707r763J0839J4194J8166
10702D5258R220K1520K3341J8446L5015N7193L2724K4745N1083O9880M2530J3442
10690D44397J3583P537j1727M50L365j9854k1912j8334m5812p2035n4854l5779
10678A89025m4785l6196r149M450Q940l770j8789o860k39J2331J4747K4446M998
10665A39149j7700k4011L451m81p099o630j736n49J2702n572q513P694R293j82
10651I9816O992J9446J7295R306J8404J4333N17j445R014J0059K1363N091l07
10638B29884j076j2323k209j0752j16p360k0035l0208k1704k9638l5930k9274
$$ plain form
10626 29259 15046 18064 38812 45020 33383 42659 42111 44325 52276 40568 29374 24689 20592
10613 20592 27230 52086 59815 71840 85402 81931 75887 91515 77240 47131 44857 52048 45809
10600 45809 38367 58080 77310 87040 82823 56693 48414 59915 77842 81532 63264 49663 50907
10587 50907 40682 30706 32538 33703 28258 26474 27604 40105 46456 39646 24242 13503 9501
10574 9501 9619 20979 27438 37116 24262 20308 12203 18496 8180 -9185 -9891 2262 4319 14295
10560 14295 17498 4565 13216 17697 13391 14102 9185 6412 -705 -6630 -5858 -6781 -2061 7804 9007
10545 9007 15677 23476 32474 39801 34819 30204 26677 23733 22796 26444 18953 27313 33127 29456 21586
10530 21586 14930 10793 12349 24249 49998 65118 81296 99707 101332 93827 91565 98997 117950
$$ packed form
10626B9259j4213L018K0748O208j1637R276n48K214P951j1708j1194m685m097
10613B0592O638K4856P729J2025J3562l471o044J5628j4275l0109k274P191o239
10600D5809p442J9713J9230R730m217k6130q279J1501J7927L690j8268j3601J244
10587E0907j0225r976J832J165n445j784J130J2501O351o810j5404j0739m002
10574I501J18J1360O459R678j2854l954q105O293j0316j7365p06J2153K057R976
10560A4295L203j2933Q651M481m306P11m917k773p117n925P72r23M720R865J203
10545I007O670P799Q998P327m982m615l527k944r37L648p491Q360N814l671p870
10530B1586o656m137J556J1900K5749J5120J6178J8411J625p505k262P432J8953
$$ plain form
10517 117950 156385 196558 230897 251981 262637 256619 225365 188545 165418 132596 114466 119593
10505 119593 114129 124715 126699 136050 165666 200170 221190 265311 332064 458577 641131 929485
10493 929485 1378618 1936970 2385993 2472466 2147155 1627638 1136346 769191 536647 384314
10483 384314 299641 258722 221717 209062 211630 204772 187956 188763 187176 179788 169879 144223 126008
10470 126008 102657 84768 63674 56484 41657 32780 26212 20468 21149 30093 42517 47331 55782
10457 55782 60341 68123 65406 63742 69816 61379 54843 46587 15130 -2661 4745 17822 5918
10444 5918 10490 19643 2928 -15260 -17940 -17415 -21925 -6409 14332 32569 37877 17029 1463
10431 1463 -1056 3463 14104 6438 8184 -4684 -21285 -23732 -7269 -4308 16278 23159 15862
$$ packed form
10517A17950L8435M0173L4339K1084J0656o018l1254l6820k3127l2822j8130N127
10505A19593n464J0586J984R351K9616L4504K1020M4121O6753J26513J82554K88354
10493I29485M49133N58352M49023Q6473l25311n19517m91292l67155k32544j52333
10483C84314q4673m0919l7005j2655K568o858j6816Q07j587p388r909k5656j8215
10470A26008k3351j7889k1094p190j4827q877o568n744O81Q944J2424M814Q451
10457E5782M559P782k717j664O074q437o536q256l1457j7791P406J3077j1904
10444E918M572R153j6715j8188k680N25m510J5516K0741J8237N308k0848j5566
10431A463k519M519J0641p666J746j2868j6601k447J6463K961K0586O881p297
$$ plain form
10418 15862 3535 -1566 -1144 -7214 -425 13551 17890 224 -7800 -8967 -1875 3473 -795 -31
10404 -31 -12351 -13977 -4328 420 -1651 -6347 -7327 -18785 -30264 -35402 -41658 -43400 -27966 -11990
10390 -11990 -14652 -11366 -10722 2420 -2781 -23235 -22570 -14113 -17258 -16687 -158 19315 15564 -1638
10376 -1638 1303 13813 18207 17940 5256 -2903 -4759 -7733 -4216 -2242 -6430 -1429 6319 -10764
10362 -10764 -7545 -413 -11834 -20971 -8601 26612 36224 34500 42256 37525 26277 20895 29056
10349 29056 35962 46050 37460 17945 12886 17904 12083 25037 23774 25257 26902 24508 28958 38294
10335 38294 51535 53588 57485 67369 76518 93152 101300 94671 76002 51852 21344 31600 62369
10322 62369 65967 57535 47627 50379 66108 90439 106546 118735 143208 179661 228347 257064
$$ packed form
10418A5862j2327n101M22o070O789J3976M339j7666q024j167P092N348m268P64
10404c1j2320j626R649M748k071m696r80j1458j1479n138o256j742J5434J5976
10390a1990k662L286O44J3142n201k0454O65Q457l145N71J6529J9473l751j7202
10376a638K941J2510M394k67j2684q159j856k974L517J974m188N001P748j7083
10362a0764L219P132j1421r137J2370L5213R612j724P756m731j1248n382Q161
10349B9056O906J0088q590j9515n059N018n821J2954j263J483J645k394M450R336
10335C8294J3241K053L897R884R149J6634Q148o629j8669k4150l0508J0256L0769
10322F2369L598q432r908K752J5729K4331J6107J2189K4473L6453M8686K8717
$$ plain form
10310 257064 251580 202613 147524 92858 72574 61081 34130 21561 21513 22538 25266 23885 15966
10297 15966 11057 13552 26467 26010 17631 22000 39978 37279 22149 10545 14773 13411 18658 11217
10283 11217 8547 2620 -9441 -16474 -9744 2743 12771 8560 3484 5628 4253 4310 14594 18384
10269 18384 7276 1529 -8901 -17596 -14188 -14057 -1138 20329 25303 13031 -2466 3812 1581
10256 1581 -8259 -1330 -4647 -10658 -10621 -18994 -25997 -31557 -38495 -37051 -19657 2283 19034 23565
10242 23565 30269 20332 22659 19975 17234 17493 32599 33484 33858 38643 31009 34971 37734 19452 17417
10227 17417 21667 21471 13470 19814 5921 -4072 -10893 -17079 -28936 -21993 -20284 -9054 4252 12092
10213 12092 13130 -2032 -14311 -6082 11992 13874 5064 -5014 -5966 -1522 3257 -6444 939 1015
$$ packed form
10310B57064n484m8967n5089n4666k0284j1493k6951j2569m8J025K728j381p919
10297A5966m909K495J2915m57q379M369J7978k699j5130j1604M228j362N247p441
10283A1217k670n927j2061p033O730J2487J0028m211n076K144j375N7J0284L790
10269A8384j1108n747j0430q695L408J31J2919K1467M974j2272j5497O278k231
10256A581r840O929l317o011L7q373p003n560o938J444J7394K1940J6751M531
10242B3565O704r937K327k684k741K59J5106Q85L74M785p634L962K763j8282k035
10227A7417M250j96q001O344j3893r993o821o186j1857O943J709J1230J3306P840
10213A2092J038j5162j2279Q229J8074J882q810j0078r52M444M779r701P383P6
$$ plain form
10199 1015 -6741 -7475 -8018 13697 14863 12540 14631 16488 18021 18243 13313 11244 17624 13781 16069
10184 16069 4704 2698 2677 14500 20033 20531 24391 18884 9106 -7567 -23983 -19767 -2756 -1679
10170 -1679 -7380 -1750 6010 11116 21161 39225 36839 27015 12986 15276 12428 15487 28862 35919
10156 35919 34530 32455 26534 22365 14469 15774 13563 8572 6430 13948 6152 3343 -7206 -6084
10142 -6084 8898 3094 7010 9305 12441 7251 7683 4298 -3217 -6898 1251 2671 7302 12857 16137
10127 16137 22135 6506 -4433 418 6086 2310 -4308 -3556 8095 11539 24524 21204 15816 18014
10113 18014 26759 16621 12170 9955 10550 23795 18646 10377 6981 12506 25342 17144 18633 38564
10099 38564 39686 17591 13933 24759 23255 14414 13582 10256 13345 8442 5524 26526 47608 58053
$$ packed form
10199A015p756p34n43K1715J166k323K091J857J533K22m930k069O380l843K288
10184A6069j1365k006k1J1823N533M98L860n507r778j6673j6416M216J7011J077
10170a679n701N630P760N106J0045J8064k386r824j4029K290k848L059J3375P057
10156C5919j389k075n921m169p896J305k211m991k142P518p796k809j0549J122
10142f084J4982n804L916K295L136n190M32l385p515l681Q149J420M631N555L280
10127A6137N998j5629j0939M851N668l776o618P52J1651L444J2985l320n388K198
10113A8014Q745j0138m451k215N95J3245n149q269l396N525J2836q198J489J9931
10099C8564J122k2095l658J0826j504q841q32l326L089m903k918K1002K1082J0445
$$ plain form
10085 58053 57505 69307 84360 77930 66480 63524 58350 42162 33731 35580 33842 28114 37024 30645
10071 30645 25808 38822 42975 42577 46485 64184 86539 105546 147572 190446 185380 138109 100730
10058 100730 63424 34597 23399 33920 37939 38153 44410 56825 58677 68470 69317 56207 49291
10045 49291 50037 49790 49124 56529 70849 58847 46075 22997 16241 19442 17129 13991 19721 14820
10031 14820 21719 18118 3847 11230 8156 8654 25950 36663 34841 29977 37891 31006 12957 22488
10017 22488 38267 30363 19911 29014 27347 17417 21836 10086 11012 14473 12587 9101 2218 -1022
10003 -1022 8383 22008 39233 29259 34894 33981 35146 25004 11894 17510 20242 1673 270 2101
9989 2101 17098 12713 4267 -672 -11921 -9736 -59 7718 -1259 -1042 17333 25854 20957 10391
$$ packed form
10085E8053n48J1802J5053o430j1450k956n174j6188q431J849j738n728Q910o379
10071C0645m837J3014M153l98L908J7699K2355J9007M2026M2874n066m7271l7379
10058A00730l7306k8827j1198J0521M019K14O257J2415J852R793Q47j3110o916
10045D9291P46k47o66P405J4320j2002j2772k3078o756L201k313l138N730m901
10031A4820O899l601j4271P383l074M98J7296J0713j822m864P914o885j8049R531
10017B2488J5779p904j0452R103j667r930M419j1750R26L461j886l486o883l240
10003a022R405J3625J7225r974N635r13J165j0142j3110N616K732j8569j403J831
9989B101J4997m385q446m939j1249K185R677P777q977K17J8375Q521m897j0566
$$ plain form
9975 10391 16248 18516 21479 13954 14664 19930 25313 10320 5931 11741 23832 24426 25762 23032 23404
9960 23404 22856 12987 -529 2967 28164 44736 31393 26047 21440 21239 20660 20631 19246 20116 21282
9945 21282 24032 22563 29450 23707 17370 11381 10682 4103 20014 25028 21086 18569 26974 31092 31565
9930 31565 30442 35340 37917 25780 24742 31982 32636 42622 46326 34637 26655 10721 5113 18518
9916 18518 27059 16702 1302 -1515 7082 25235 38564 38649 43438 30022 25370 22581 30795 29967
9902 29967 48867 49308 39880 29278 25382 25385 26018 24024 33117 39607 40376 40765 35642 35354 35771 51362
9886 51362 50633 36342 40021 50560 42507 19388 17074 30205 44874 45338 46732 44946 42027 38720
9872 38720 37785 41196 33847 47891 64572 66177 58907 52269 38166 18547 20321 34594 46271
$$ packed form
9975A0391N857K268K963p525P10N266N383j4993m389N810J2091N94J336k730L72
9960B3404n48r869j3516L496K5197J6572j3343n346m607k01n79k9j385Q70J166
9945B1282K750j469O887n743o337n989o99o579J5911N014l942k517Q405M118M73
9930C1565j123M898K577j2137j038P240O54R986L704j1689p982j5934n608J3405
9916A8518Q541j0357j5400k817Q597J8153J3329Q5M789j3416m652k789Q214q28
9902B9967J8900M41r428j0602l896LO33j994R093O490P69L89n123k88M17J5591
9886E1362p29j4291L679J0539q053k3119k314J3131J4669M64J394j786k919l307
9872C8720r35L411p349J4044J6681J605p270o638j4103j9619J774J4273J1677
$$ plain form
9859 46271 39158 39003 49554 53762 49912 52081 50823 57222 54065 49168 48121 47400 65454 67617 57350
9844 57350 44492 47895 46393 52019 57423 57975 59311 54893 53831 39375 30395 45222 47189 62052
9830 62052 83144 79057 82106 69826 50549 49241 57329 58456 61746 64020 61916 51842 39100
9817 39100 34595 41833 52883 45026 55449 60259 63454 55153 47901 51383 63418 69679 67069 59465
9803 59465 63595 57378 67376 54402 46119 47166 54562 58824 43064 29020 28816 37770 43509 58426
9789 58426 62426 68708 76239 62459 42465 37928 37945 52378 57817 60011 58922 59482 60579 50734 50141
9774 50141 52802 71093 81226 67887 59765 56570 55605 56979 55061 58518 65444 60745 73048 75524
9760 75524 60594 57236 50574 41766 45215 53654 56136 61922 68522 66539 67536 76095 57326 47167
$$ packed form
9859D6271p113j55J0551M208l850K169j258O399l157m897j047p21J8054K163j0267
9844E7350j2858L403j502N626N404N52J336m418j062j4456q980J4827J967J4863
9830F2052K1092m087L049j2280j9277j308Q088J127L290K274k104j0074j2742
9817C9100m505P238J1050p857J0423M810L195q301p252L482J2035O261k610p604
9803E9465M130o217R998j2974q283J047P396M262j5760j4044k04Q954N739J4917
9789E8426M000O282P531j3780j9994m537J7J4433N439K194j089N60J097r845n93
9774E0141K661J8291J0133j3339q122l195r65J374j918L457O926m699J2303K476
9760G5524j4930l358o662q808L449Q439K482N786O600j983R97Q559j8769j0159
$$ plain form
9746 47167 46680 51677 48093 43237 46682 52285 36504 23644 35557 34619 29653 24347 26793 26953 33789
9731 33789 55814 59151 60842 60239 59884 70834 71678 73171 66002 65391 76858 80035 78561 77345 62076
9716 62076 62974 78719 94891 116963 121233 98770 80439 76282 70157 63079 69547 72242 66899 66162
9702 66162 66539 67779 63303 71139 80562 80588 70108 78150 93905 92505 73865 66351 66804 70064 62750
9687 62750 63288 59178 52799 42023 45488 61365 68802 75781 75989 77717 72266 56742 42127 43828
9673 43828 55003 52465 75964 94233 100703 109597 113714 102059 97108 104786 104807 103257 94647 89512
9659 89512 103484 116096 130678 132401 114663 100859 111669 105741 94831 82362 86903 86795 99278
9646 99278 100911 95960 97567 92022 92388 96104 86818 81320 82024 92497 103297 103039 88666 85752 95291
$$ packed form
9746D7167m87M997l584m856L445N603j5781j2860J1913r38m966n306K446J60O836
9731C3789K2025L337J691o03l55J0950Q44J493p169o11J1467L177j474j216j5269
9716F2076Q98J5745J6172K2072M270k2463j8331m157o125p078O468K695n343p37
9702F6162L77J240m476P836R423K6j0480Q042J5755j400j8640p514M53L260p314
9687F2750N38m110o379j0776L465J5877P437O979K08J728n451j5524j4615J701
9673D3828J1175k538K3499J8269O470Q894M117j1655m951P678K1j550q610n135
9659H9512J3972J2612J4582J723j7738j3804J0810n928j0910j2469M541j08J2483
9646I9278J633m951J607n545L66L716r286n498P04J0473J0800k58j4373k914R539
$$ plain form
9631 95291 101066 107782 111763 111003 96832 83821 93629 110969 111342 106588 99359 99424 101409 117555 119417
9616 119417 124853 125200 120985 121396 114085 109610 103363 81176 80245 109381 126679 123753 131110 139047
9602 139047 127977 128726 128957 116053 112563 115276 108779 94462 90282 90133 99046 114483 114602 117803
9588 117803 125226 129961 123229 119320 115837 128757 133558 133330 141517 156159 144766 133066 141330 148098
9574 148098 152795 139690 138462 135120 141280 148316 145495 145943 140379 123378 122113 117068 99472 108074
9560 108074 116784 129348 134972 135656 139719 139160 135706 141542 147381 119583 124038 135678 159493 166360
9546 166360 168300 168196 159518 148073 144187 144611 152875 149402 149717 155634 152663 141957 151363 160824 156994
9531 156994 138462 140452 145713 135150 143643 164342 170193 167866 151150 151513 157497 155984 151030 156219
$$ packed form
9631I5291N775O716L981p60j4171j3011R808J7340L73m754p229O5J985J6146J862
9616A19417N436L47m215M11p311m475o247k2187r31K9136J7298k926P357P937
9602A39047j1070P49K31j2904l490K713o497j4317m180j49Q913J5437J19L201
9588A17803P423M735o732l909l483J2920M801k28Q187J4642j1393j1700Q264O768
9574A48098M697j3105j228l342O160P036k821M48n564j7001j265n045j7596Q602
9560A08074Q710J2564N624O84M063n59l454N836N839k7798M455J1640K3815O867
9546A66360J940j04q678j1445l886M24Q264l473L15N917k971j0706R406R461l830
9531A56994j8532J990N261j0563Q493K0699N851k327j6716L63N984j513m954N189
$$ plain form
9517 156219 157896 156259 159728 162808 168312 163208 151888 147592 153860 159720 148748 149908 163123 159722
9503 159722 156854 151661 159955 169323 173645 174254 158846 153185 145332 146393 157463 162674 168308 154418
9489 154418 158564 171795 160604 162654 177932 179272 179572 179750 176409 163177 179470 192730 192349 179655
9475 179655 169352 178090 194082 203333 181614 166378 176562 187555 207328 201754 200913 176075 170424
9462 170424 188207 199195 211674 218849 211914 203563 202915 201082 194536 184828 176867 171975 184807 192734
9448 192734 203338 212280 215622 218841 214017 203078 203621 205021 205015 208940 219437 216642 216597 201862 192894
9433 192894 204721 210290 210064 210956 209091 216424 227086 222994 222900 224739 225117 217251 214177 234052 235144
9418 235144 228781 227987 223502 227052 240283 248341 245928 246749 249096 267177 272370 269199 255640 255153
$$ packed form
9517A56219J677j637L469L080N504n104j1320m296O268N860j0972J160J3215l401
9503A59722k868n193Q294R368M322O09j5408n661p853J061J1070N211N634j3890
9489A54418M146J3231j1191K050J5278J340L00J78l341j3232J6293J3260l81j2694
9475A79655j0303Q738J5992R251k1719j5236J0184J0993J9773n574q41k4838n651
9462A70424J7783J0988J2479P175o935q351o48j833o546r708p961m892J2832P927
9448A92734J0604Q942L342L219m824j0939N43J400oL925J0497k795m5j4735q968
9433A92894J1827N569k26Q92j865P333J0662m092r4J839L78p866l074J9875J092
9418B35144o363p94m485L550J3231Q058k413Q21K347J8081N193l171j3559m87
$$ plain form
9404 255153 246957 231329 225919 214908 217297 239004 251539 249304 260468 266328 269635 249137 243787
9391 243787 245324 251370 247876 243319 262923 278331 275254 260712 246005 235308 238430 252759 263926
9378 263926 263781 267323 272889 271311 271366 274040 268292 257076 249737 258154 258930 237526 229312 231212 233699
9363 233699 236215 244886 258532 276329 272190 253273 253070 262570 271402 267119 265646 244994 238110 255836
9349 255836 267203 274080 273425 268105 264207 273961 268631 253383 243659 236574 253660 261051 263290 265555
9335 265555 270706 269608 263129 273218 282708 278741 256863 243070 238348 244676 250089 257839 249448 240169
9321 240169 239584 238682 231909 233056 239888 253974 268691 273692 264472 254179 250405 259951 275078 279500
9307 279500 277084 268117 261303 257985 243097 241740 246039 249847 224318 217937 218519 222967 239838 256701
$$ packed form
9404B55153q196j5628n410j1011K389K1707J2535k235J1164N860L307k0498n350
9391B43787J537O046l494m557J9604J5408l077j4542j4707j0697L122J4329J1167
9378B63926j45L542N566j578N5K674n748j1216p339Q417P76k1404q214J900K487
9363B33699K516Q671J3646J7797m139j8917k03R500Q832m283j473k0652o884J7726
9349B55836J1367O877o55n320l898R754n330j5248r724p085J7086P391K239K265
9335B65555N151j098o479J0089R490l967k1878j3793m722O328N413P750q391r279
9321B40169n85r02o773J147O832J4086J4717N001r220j0293l774R546J5127M422
9307B79500k416q967o814l318j4888j357M299L808k5529o381N82M448J6871J6863
$$ plain form
9293 256701 242692 250156 256344 249368 245810 244919 231691 228575 228525 230416 229299 225634 226633 228793 225985
9278 225985 224219 255349 256543 251771 252673 251919 234169 228477 237869 233694 236490 237734 248312 261715
9264 261715 261722 256378 246557 253321 257275 252437 255943 257196 251748 250572 258483 274472 284902 289987 292459
9249 292459 268870 240400 239654 232602 233806 223754 218870 213085 226841 238290 236975 243861 247253
9236 247253 241093 232838 225131 217659 206633 186686 197140 209943 214029 222475 215993 202499 192324
9223 192324 197008 202982 193161 208206 208669 192094 189808 188594 194092 197391 210040 205808 210652 218092
9209 218092 215254 214398 206955 199938 200838 214960 212838 204077 191266 197121 196228 190196 199365 195682 187372
9194 187372 191299 201858 201689 200444 199342 211822 214758 200994 201555 209007 195945 174118 168812 158433
$$ packed form
9293B56701j4009P464O188o976l558q91j3228l116n0J891j117l665R99K160k808
9278B25985j766L1130J194m772R02p54j7750n692R392m175K796J244J0578J3403
9264B61715Pn344r821O764L954m838L506J253n448j176P911J5989J0430N085K472
9249B92459k3589k8470p46p052J204j0052m884n785J3756J1449j315O886L392
9236B47253o160q255p707p472j1026j9947J0454J2803M086Q446o482j3494j0175
9223A92324M684N974r821J5045M63j6575k286j214N498L299J2649m232M844P440
9209B18092k838q56p443p017R00J4122k122q761j2811N855q93o032R169l683q310
9194A87372L927J0559j69j245j102J2480K936j3764N61P452j3062k1827n306j0379
$$ plain form
9180 158433 141312 141351 149195 144409 138353 157181 166398 162411 156934 166998 171518 163433 166646 163971
9166 163971 170967 174156 183353 181416 172976 177346 167303 163599 173831 180642 173204 170310 177051 176902
9152 176902 181002 166416 144729 152583 165085 166050 151436 151656 141475 133809 139436 148988 152396 145063
9138 145063 152910 149352 150624 153741 159308 165704 179617 172128 153892 166315 164938 158898 159144 155768
9124 155768 151335 152360 159903 165223 178259 175593 155344 136038 126606 122832 128466 138088 135017 134767
9110 134767 147222 137531 126146 123014 112727 110504 100726 97468 96727 108544 118323 124942 120522 123386
9096 123386 119846 115151 117222 130534 136053 127342 134333 146443 143249 140967 142756 145654 138544 132084
9082 132084 140146 157887 155043 143887 139393 142815 159848 175554 174658 172740 179245 183680 189354 191049
$$ packed form
9180A58433j7121L9P844m786o056J8828R217l987n477J0064M520q085L213k675
9166A63971O996L189R197j937q440M370j0043l704J0232O811p438k894O741j49
9152A76902M100j4586k1687P854J2502R65j4614K20j0181p666N627R552L408p333
9138A45063P847l558J272L117N567O396J3913p489j8236J2423j377o040K46l376
9124A55768m433J025P543N320J3036k666k0249j9306r432l774N634R622l071k50
9110A34767J2455r691j1385l132j0287k223r778l258p41J1817R779O619m420K864
9096A23386l540m695K071J3312N519q711O991J2110l194k282J789K898p110o460
9082A32084Q062J7741k844j1156m494L422J7033J5706q96j918O505M435N674J695
$$ plain form
9068 191049 202501 231448 247940 265763 291669 319794 338533 339741 321914 297076 259192 240315
9056 240315 215168 189566 181350 179584 161349 144208 142817 143713 128450 129918 131831 121572 123620
9043 123620 122058 124863 137565 139536 138678 136213 123931 120249 122330 136136 142219 153603 169920
9030 169920 170133 169540 193046 208118 187454 180172 191318 211644 225927 236679 263842 299771 324703
9017 324703 336637 320361 296373 272469 244075 225273 206103 194620 198307 204541 229723 275599
9005 275599 315181 306269 274556 239267 198627 156482 136407 120872 123443 116455 111253 108622 122500
8992 122500 129298 126809 116599 117038 119221 113359 100183 83299 71617 78956 62658 58250 69235
8979 69235 81240 88558 82770 75049 69972 68034 58491 61750 70364 67150 70566 67638 62539 68295
$$ packed form
9068A91049J1452K8947J6492J7823K5906K8125J8739J208j7827k4838l7884j8877
9056B40315k5147k5602q216j766j8235j7141j391Q96j5263J468J913j0259K048
9043A23620j562K805J2702J971q58k465j2282l682K081J3806O083J1384J6317
9030A69920K13n93K3506J5072k0664p282J1146K0326J4283J0752K7163L5929K4932
9017C24703J1934j6276k3988k3904k8394j8802j9170j1483L687O234K5182M5876
9005B75599L9582q912l1713l5289m0640m2145k0075j5535K571o988n202k631J3878
8992A22500O798k489j0210M39K183n862j3176j6884j1682P339j6298m408J0985
8979F9235J2005P318n788p721n077j938r543L259Q614l214L416k928n099N756
$$ plain form
8965 68295 76749 72379 61329 51010 61930 70999 72835 72486 63569 53227 55638 58826 52859 46926
8951 46926 47498 42113 40361 40037 25595 32418 42396 51887 66532 60258 66468 64654 57167 55457 54835
8936 54835 61434 59386 59479 50016 35122 45309 62878 77027 82882 60982 52888 41834 53132
8923 53132 57282 55222 51568 40931 56244 77449 68698 68861 67248 50703 49536 58058 75048 84979
8909 84979 78228 69183 78195 84093 106417 121157 131841 157739 193473 232533 288300 307886 339568
8896 339568 409606 511378 656065 841452 1050570 1127133 1022567 825284 614596 440372
8886 440372 334897 258756 208089 172142 141026 130232 108196 93100 89044 85164 82261 81627
8874 81627 84055 92691 93310 82836 69097 58252 58485 50973 47859 46723 60029 69529 69674 60291
$$ packed form
8965F8295Q454m370j1050j0319J0920R069J836l49q917j0342K411L188n967n933
8951D6926N72n385j752l24j4442O823R978R491J4645o274O210j814p487j710o22
8936E4835O599k048R3r463j4894J0187J7569J4149N855k1900q094j1054J1298
8923E3132M150k060l654j0637J5313K1205q751J63j613j6545j167Q522J6990R931
8909H4979o751r045R012N898K2324J4740J0684K5898L5734L9060N5767J9586L1682
8896C39568P0038J01772J44687J85387K09118P6563j04566j97283k10688j74224
8886D40372j05475p6141n0667l5947l1116j0794k2036j5096m056l880k903o34
8874H1627K428Q636O19j0474j3739j0845K33p512l114j136J3306R500J45r383
$$ plain form
8860 60291 45533 43295 43997 54281 58772 54319 52257 50959 40795 27263 23071 21869 28740 31012
8846 31012 25844 22987 27513 40271 42604 32477 34806 38856 37355 33376 33343 23113 12345 13750
8832 13750 37624 49328 55871 53669 49862 42712 26523 19650 22775 27858 43270 52586 43607 46942
8818 46942 52287 58672 44026 27314 32302 40699 41063 51844 63694 68160 63361 58316 40208 28001
8804 28001 41520 50143 45653 45327 37460 46253 53560 56664 66926 58788 67351 81479 85707 84501
8790 84501 70850 51289 37962 28343 25263 30015 24604 18460 31841 36469 36937 35754 41212 43371
8776 43371 33740 43440 49810 43339 54170 57168 55114 56503 52502 49533 52260 48858 46670 55549
8762 55549 60106 69480 78329 75589 74262 77883 72369 67247 67604 79461 84822 76075 70463 70877 83430
$$ packed form
8860F0291j4758k238P02J0284M491m453k062j298j0164j3532m192j202O871K272
8846C1012n168k857M526J2758K333j0127K329M050j501l979l3j0230j0768J405
8832A3750K3874J1704O543k202l807p150j6189o873L125N083J5412R316q979L335
8818D6942N345O385j4646j6712M988Q397L64J0781J1850M466m799n045j8108j2207
8804B8001J3519Q623m490l26p867Q793P307L104J0262q138Q563J4128M228j206
8790H4501j3651j9561j3327r619l080M752n411o144J3381M628M68j183N458K159
8776D3371r631R700O370o471J0831K998k054J389m001k969K727l402k188Q879
8762E5549M557R374Q849k740j327L621n514n122L57J1857N361q747n612M14J2553
$$ plain form
8747 83430 75642 68063 72860 78895 73573 72714 72051 70024 68987 70440 77256 86288 75693 78176 79108
8732 79108 82404 75722 79548 97641 95045 89628 86405 91327 88363 97693 106832 102273 102065 106489 112493
8717 112493 117458 111693 99618 91220 98043 93619 84641 84538 113506 150801 164731 167418 186348
8704 186348 200284 176521 160123 150455 149225 148585 131651 132914 149453 149437 146095 136424 144735 148817
8690 148817 160318 168576 176327 174067 167174 154582 156659 171178 191152 236170 248192 238542 231901
8677 231901 221231 209843 208952 214037 206114 209187 229143 237752 240623 237703 240294 246717 257028 255439
8663 255439 259315 271522 294316 310519 349260 377991 372205 362368 358016 352036 363725 390292 403045
8650 403045 412610 421067 446556 472701 489436 492281 512363 530878 539490 547176 562959 575220 591665
$$ packed form
8747H3430p788p579M797O035n322q59o63k027j037J453O816R032j0595K483R32
8732G9108L296o682L826J8093k596n417l223M922k964R330R139m559k08M424O004
8717A12493M965n765j2075q398O823m424q978j03K8968L7295J3930K687J8930
8704A86348J3936k3763j6398r668j230o40j6934J263J6539j6l342r671Q311M082
8690A48817J1501Q258P751k260o893j2592K077J4519J9974M5018J2022r650o641
8677B31901j0670j1388q91N085p923L073J9956Q609K871k920K591O423J0311j589
8663B55439L876J2207K2794J6203L8741K8731n786r837m352n980J1689K6567J2753
8650D03045R565Q457K5489K6145J6735K845K0082J8515Q612P686J5783J2261J6445
$$ plain form
8637 591665 610028 640306 667459 675811 661791 632650 603767 599544 604444 603813 615913 639213 651436
8624 651436 669707 710816 755205 768530 768160 757663 715869 666184 612421 584386 555374 498837
8612 498837 434928 373394 328983 297803 270762 249761 238696 214884 195416 178094 157789 154879
8600 154879 140156 120348 107651 113794 117616 119183 121195 117853 131385 155644 156545 155550 139801
8587 139801 122637 121474 126107 102357 83449 86255 88619 84803 96075 84882 78500 68311 76954
8574 76954 74058 74892 75612 61860 50106 60121 75515 77467 76485 53640 43788 57020 59257 45518
8560 45518 54782 52945 49686 36795 30587 32158 34464 30711 21549 21463 26450 19903 24154 35226 35674
8545 35674 36094 31384 48275 57595 30982 31704 16827 22812 32421 42971 46131 50544 43383 30422
$$ packed form
8637E91665J8363L0278K7153Q352j4020k9141k8883m223M900o31J2100K3300J2223
8624F51436J8271M1109M4389J3325l70j0497m1794m9685n3763k8035k9012n6537
8612D98837o3909o1534m4411l1180k7041k1001j1065k3812j9468j7322k0305k910
8600A54879j4723j9808j2697O143L822J567K012l342J3532K4259R01r95j5749
8587A39801j7164j163M633k3750j8908K806K364l816J1272j1193o382j0189Q643
8574G6954k896Q34P20j3752j1754J0015J5394J952r82k2845r852J3232K237j3739
8560D5518R264j837l259j2891o208J571K306l753r162q6M987o547M251J1072M48
8545C5674M20m710J6891R320k6613P22j4877N985R609J0550L160M413p161j2961
$$ plain form
8531 30422 33489 27995 25565 38712 31924 38908 46353 32904 23440 19326 17319 26166 17718 15018
8517 15018 21444 16962 7522 1506 -6195 3968 23550 36066 44186 36169 33856 34077 36377 30616
8503 30616 29620 15013 21683 26732 25589 16992 10827 17887 31726 28174 30179 24823 30344 26633
8489 26633 23830 18750 30168 21662 26682 27942 28415 17012 4042 13095 25269 29573 35258 38580
8475 38580 36492 27916 28872 22361 15107 17706 26211 23361 15509 14298 21814 37228 45976 40498 32832
8460 32832 35090 24378 15375 9122 8542 14577 14587 23146 32781 31622 28971 21417 27156 32932 27795
8445 27795 28607 42369 58913 66800 59003 38176 29970 22881 4250 -3439 8093 13132 8403 -75
8431 -75 -10434 7633 9751 697 8439 7786 3225 -945 12199 27773 24315 21285 25460 28890 21046
$$ packed form
8531C0422L067n494k430J3147o788O984P445j3449r464m114k007Q847q448k700
8517A5018O426m482r440o016p701J0163J9582J2516Q120q017k313K21K300n761
8503C0616r96j4607O670N049j143q597o165P060J3839l552K005n356N521l711
8489B6633k803n080J1418q506N020J260M73j1403j2970R053J2174M304N685L322
8475C8580k088q576R56o511p254K599Q505k850p852j211P516J5414Q748n478p666
8460C2832K258j0712r003o253n80O035J0Q559R635j159k651p554N739N776n137
8445B7795Q12J3762J6544P887p797k0827q206p089j8631p689J1532N039m729q478
8431g5j0359J8067K118r054P742o53m561m170J3144J5574l458l030M175L430p844
$$ plain form
8416 21046 26080 32131 16581 7094 21035 37485 41380 39340 34915 30049 41082 33769 12492
8403 12492 24292 30160 30865 44536 47070 30260 29299 38576 25958 10525 6978 12996 28027 29490
8389 29490 25938 24587 17109 12216 6949 4682 5150 5975 6310 15388 14295 21832 26245 24268 34401
8374 34401 38928 36798 47824 41120 41126 40783 42394 28708 16509 21768 17940 22987 10747 10590 31235
8359 31235 28573 22172 30064 29538 32795 30792 36025 49958 46097 48045 38415 31989 19295 23166
8345 23166 17810 15565 2951 -2200 179 -493 18688 20970 19997 17020 15721 19885 28543 57994
8331 57994 56834 45610 35135 33366 36416 25283 25584 35117 48414 50292 40408 36305 35450 37038
8317 37038 40991 52096 44026 53077 58572 53165 37887 38292 37778 33520 25457 25573 25827 12215 5968
$$ packed form
8416B1046N034O051j5550r487J3941J6450L895k040m425m866J1033p313k1277
8403A2492J1800N868P05J3671K534j6810r61R277j2618j5433l547O018J5031J463
8389B9490l552j351p478m893n267k267M68Q25L35R078j093P537M413j977J0133
8374C4401M527k130J1026o704Ol43J611j3686j2199N259l828N047j2240j57K0645
8359C1235k662o401P892n26L257k003N233J3933l861J948r630o426j2694L871
8345B3166n356k245j2614n151K379o72J9181K282r73k977j299M164Q658K9451
8331E7994j160j1224j0475j769L050j1133L01R533J3297J878r884m103q55J588
8317C7038L953J1105q070R051N495n407j5278M05n14m258q063J16K54j3612o247
$$ plain form
8302 5968 11677 7492 3835 6318 15058 19673 25034 29488 15105 15220 13442 4299 6130 -745 4708
8287 4708 19562 20710 9831 14633 17430 16901 32560 46818 47882 33898 23557 28200 17796
8274 17796 16477 12700 14591 18385 24923 22981 31149 33363 39500 32552 34767 34387 30828 29713 20323
8259 20323 11646 26595 31293 8840 897 -5888 -3152 7178 8042 9759 9849 13067 23369 33715
8245 33715 37724 30732 28203 33960 27995 16287 8680 11054 7541 3209 -3002 4296 6492 -6275
8231 -6275 -13865 3059 -1373 15093 31191 21181 12960 372 -5388 6058 5992 -12373 -13425 -12785
8217 -12785 -9656 4809 21912 24472 18033 3994 -12334 -9247 449 2010 7934 8203 -2494 -2266
8203 -2266 7748 23036 4548 5173 24779 27926 26423 22581 33445 42302 46644 51863 51284 43226
$$ packed form
8302E968N709m185l657K483Q740M615N361M454j4383J15j778r143J831o875N453
8287D708J4854J148j0879M802K797n29J5659J4258J064j3984j0341M643j0404
8274A7796j319l777J891L794O538j942Q168K214O137o948K215l80l559j115r390
8259B0323q677J4949M698k2453p943o785K736J0330Q64J717R0L218J0302J0346
8245C3715M009o992k529N757n965j1708p607K374l513m332o211P298K196j2767
8231f275p590J6924m432J6466J6098j0010q221j2588n760J1446o6j8365j052O40
8217a2785L129J4465J7103K560o439j4039j6328L087R696J561N924K69j0697K28
8203b266J0014J5288j8488O25J9606L147j503l842J0864Q857M342N219n79q058
$$ plain form
8189 43226 62225 86395 110129 150523 230507 304183 315210 294539 232375 155872 107223 72173
8177 72173 37666 18412 25223 26713 14386 13254 12218 13963 9675 9438 18979 21753 29032 28481
8163 28481 20240 16261 18255 32905 36329 33058 23855 21439 23142 24089 37647 50582 44441 41217
8149 41217 49279 62956 86964 119459 162185 213040 278161 307887 285279 223642 172950 122520
8137 122520 82790 60409 52065 35334 30550 15483 5998 37 12746 19558 28426 25702 7840
8124 7840 3813 9214 10644 -4419 -18554 -20576 -2535 17803 19037 24818 25600 26612 18873 29379
8110 29379 29011 25973 29882 24649 22540 23935 36022 38166 32810 33891 36956 34187 20460 20746 20693
8095 20693 14536 10708 17113 11708 21874 26875 32304 46023 56660 69588 66308 62274 52992 51267
$$ packed form
8189D3226J8999K4170K3734M0394P9984P3676J1027k0671o2164p6503m8649l5050
8177G2173l4507j9254O811J490j2327j132j036J745m288k37R541K774P279n51
8163B8481q241l979J994J4650L424l271r203k416J703R47J3558J2935o141l224
8149D1217Q062J3677K4008L2495M2726N0855O5121K9726k2608o1637n0692n0430
8137A22520l9730k2381q344j6731m784j5067r485n961J2709O812Q868k724j7862
8124G840m027N401J430j5063j4135k022J8041K0338J234N781P82J012p739J0506
8110B9379l68l038L909n233k109J395J2087K144n356J081L065k769j3727K86n3
8095B0693o157l828O405n405J0166N001N429J3719J0637J2928l280m034r282j725
$$ plain form
8081 51267 60773 74189 94745 108726 121111 121891 134158 140242 141704 141238 141014 146838 149304 147418
8067 147418 143798 146030 147398 153961 142654 136090 142115 144669 136250 133838 149661 145136 130019 128281
8053 128281 123038 126511 122435 113803 128107 139817 125175 118058 113583 126299 148716 170192 167854
8040 167854 176696 206309 234227 258963 304775 360646 433550 489124 533400 532138 498429 446500
8028 446500 395739 349732 313541 290873 278619 270864 278481 288348 302431 290640 253893 211527
8016 211527 184018 172224 156898 132419 118806 115857 104434 101279 99220 92887 111376 122607
8004 122607 108671 101009 105625 109160 127618 136672 137570 138793 130671 136579 162344 192297 216859
7991 216859 242573 269722 310722 335813 347264 346012 314807 287423 261421 256098 243791 238001
$$ packed form
8081E1267R506J3416K0556J3981J2385P80J2267O084J462m66k24N824K466j886
8067A47418l620K232J368O563j1307o564O025K554q419k412J5823m525j5117j738
8053A28281n243L473m076q632J4304J1710j4642p117m475J2716K2417K1476k338
8040A67854Q842K9613K7918K4736M5812N5871P2904N5574M4276j262l3709n1929
8028D46500n0761m6007l6191k2668j2254p755P617R867J4083j1791l6747m2366
8016B11527k7509j1794j5326k4479j3613k949j1423l155k059o333J8489J1231
8004A22607j3936p662M616L535J8458R054Q98J223q122N908K5765K9953K4562
7991B16859K5714K7149M1000K5091J1451j252l1205k7384k6002n323j2307n790
$$ plain form
7979 238001 233576 235427 228062 199546 161990 141838 131575 105917 80100 70392 53091 47027 55260
7966 55260 61593 60587 55837 46313 40033 38553 39246 36428 45271 63249 71314 57456 42280 55017
7952 55017 76915 79689 89591 96716 113453 130363 128176 108765 97653 86859 90365 87488 96058
7939 96058 96759 93806 84419 75803 57668 45967 44989 44304 45555 37665 28254 26570 36912 48745
7925 48745 55977 49042 45346 50244 52049 48949 36537 29269 35517 31401 14326 11181 16775 32017
7911 32017 26342 17216 12367 -2948 -7606 -691 4223 3176 8686 8736 2265 -5853 -4641 1625 1197
7896 1197 -3508 -4904 7143 8005 -9109 -20659 -16961 -13430 -4729 1178 6736 5827 1348 9989 23830
7881 23830 26466 24470 19915 15119 -3768 -5677 1064 -14059 -29382 -28667 -11335 -15925 -27333 -20843
$$ packed form
7979B38001m425J851p365k8516l7556k0152j0263k5658k5817r708j7301o064Q233
7966E5260O333j006m750r524o280j480O93k818Q843J7978Q065j3858j5176J2737
7952E5017K1898K774R902P125J6737J6910k187j9411j1112j0794L506k877Q570
7939I6058P01k953r387q616j8135j1701r78o85J251p890r411j684J0342J1833
7925D8745P232o935l696M898J805l100j2412p268O248m116j7075l145N594J5242
7911C2017n675r126m849j5315m658O915M914j047N510N0o471q118J212O266m28
7896A197m705j396J2047Q62j7114j1550L698L531Q701N907N558r09m479Q641J3841
7881B3830K636j996m555m796j8887j909O741j5123j5323P15J7332m590j1408O490
$$ plain form
7867 -20843 -8332 -2357 -10869 -14727 -12148 -18359 -20519 -12942 -8126 -3376 8839 13298 5511 4733
7853 4733 -572 -1608 4504 -3940 -12785 -9145 -6191 -2470 -15593 -28985 -32284 -10641 9273 17639
7839 17639 21207 376 -21582 -19467 -18275 -6436 -10206 -7840 -11955 -17164 -14739 -5790 10141 1381
7825 1381 9416 19882 17833 14096 682 -1635 8843 10996 1141 -1541 -7524 -19178 -25563 -15192
7811 -15192 -3730 -4825 -9285 -8153 -25580 -22606 -5313 -357 -7202 -11782 -8951 3048 4965 -13775
7797 -13775 -22273 -29949 -18591 -24664 -27270 -22928 -22327 -17062 -21443 -26946 -32103 -32063 -30002 -31462 -33745
7782 -33745 -29287 -31023 -18837 -5400 2322 -4996 -6473 -5220 -12823 -18791 -19727 -27483 -27582 -29757 -31345
7767 -31345 -30855 -26715 -14896 -6493 1898 -5616 -16459 -18626 -25896 -35949 -30024 -22817 -10364 6391
$$ packed form
7867b0843J2511N975q512l858K579o211k160P577M816M750J2215M459p787p78
7853D733n305j036O112q444q845L640K954L721j3123j3392l299K1643J9914Q366
7839A7639L568k0831k1958K115J192J1839l770K366m115n209K425Q949J5931q760
7825A381Q035J0466k049l737j3414k317J0478K153r855k682n983j1654o385J0371
7811a5192J1462j095m460J132j7427K974J7293M956o845m580K831J1999J917j8740
7797a3775q498p676J1358o073k606M342O01N265m381n503n157M0K061j460k283
7782c3745M458j736J2186J3437P722p318j477J253p603n968r36p756r9k175j588
7767c1345M90M140J1819Q403Q391p514j0843k167p270j0053N925P207J2453J6755
$$ plain form
7753 6391 9255 6581 6187 11965 15436 8400 -26688 -28921 -27847 -20218 -20035 -24517 -29208 -11667 -17371
7738 -17371 -19526 -13312 -7931 -13441 -23985 -11471 -12708 -16577 3151 2054 -9588 4108 3819 -9876
7724 -9876 -5836 -7131 330 -5506 -7551 -10503 -4643 1864 6976 8264 -4328 -10290 -13109 -8970 -7453
7709 -7453 -15275 -15735 -17937 -13636 -10012 -14354 -13375 -17758 -20969 -18226 -8176 -869 -6301 -10723 -7430
7694 -7430 4384 7302 -92 -10371 -659 -9417 -12711 -23729 -24654 -7209 -8421 -24705 -28331 -30767
7680 -30767 -19933 -11213 -8392 -18521 -32664 -33327 -20982 -25250 -26644 -12488 -8205 -11280 -17086 -17510
7666 -17510 -17806 -21317 -13926 -3390 6588 7960 -811 -11263 -7708 -6460 -4685 -13765 -9765 -8378
7652 -8378 -154 9390 2109 -13339 -3524 4032 4293 204 420 -2929 -7099 3036 5026 4612 4251
$$ packed form
7753F391K864k674l94N778L471p036l5088k233J074P629J83m482m691J7541n704
7738a7371k155O214N381n510j0544J2514j237l869J9728j097j1642J3696k89j3695
7724i876M040j295P461n836k045k952N860O507N112J288j2592n962k819M139J517
7709g453p822m60k202M301L624m342R79m383l211K743J0050P307n432m422L293
7694g430J1814K918p394j0279R712q758l294j1018r25J7445j212j6284l626k436
7680c0767J0834Q720K821j0129j4143o63J2345m268j394J4156M283l075n806m24
7666a7510k96l511P391J0536R978J372q771j0452L555J248J775r080M000J387
7652h378Q224R544p281j5448R815P556K61m089K16l349m170J0135J990m14l61
$$ plain form
7637 4251 7964 7626 4292 3362 4784 178 7206 -4993 -6874 -4392 -16520 -12434 -17058 643 15925
7622 15925 15524 9329 5213 4277 7070 16747 16924 8792 -4546 -9868 -4719 -5346 -7345 -2169 -10710
7607 -10710 -14930 -3708 -3507 -12571 -15661 -20196 -29633 -34386 -39316 -33464 -29629 -29990 -33978 -20474 -9458
7592 -9458 -8606 -9107 4186 -188 -19567 -30191 -20224 4385 15944 5218 -5300 -10946 -14692 -17949
7578 -17949 -18592 -17629 -2948 9347 12105 536 -4603 -19836 -21638 -25198 -25592 -12834 -12365 -17572
7564 -17572 -23324 -21627 -13736 -5738 -6786 -7484 -9652 -14047 -16701 -7405 -2297 -7396 -5809 -7396 -14191
7549 -14191 -15491 -1898 -3576 12135 14533 6650 -5921 -5129 -2291 2767 3199 3179 -8259 -23664
7535 -23664 -29355 -33315 -26603 -21990 -22888 -19411 -9859 -16502 -18519 -15023 -14767 -14351 -6864 -14784 -23230
$$ packed form
7637D251L713l38l334r30J422m606P028j2199j881K482j2128M086m624J7701J5282
7622A5925m01o195m116r36K793R677J77q132j3338n322N149o27j999N176q541
7607a0710m220J1222K01r064l090m535r437m753m930N852L835l61l988J3504J1016
7592i458Q52n01J3293m374j9379j0624R967K4609J1559j0726j0518n646l746l257
7578a7949o43R63J4681J2295K758j1569n139j5233j802l560l94J2758M69n207
7564a7572n752J697P891P998j048o98k168m395k654R296N108n099J587j587o795
7549a4191j300J3593j678J5711K398p883j2571P92K838N058M32k0j1438j5405
7535b3664n691l960O712M613q98L477R552o643k017L496K56M16P487p920q446
$$ plain form
7520 -23230 -19639 -9245 9718 7263 -6238 -11864 -8120 -14719 -15955 851 -658 -6851 -12334 -10466
7506 -10466 2422 6071 -7121 -3087 -4628 11705 15771 10592 -5528 -11857 -13858 -14787 -5171 -1421
7492 -1421 7002 10115 -2188 -16028 -20709 -10991 5530 20065 9689 6599 4497 -5536 -14716
7479 -14716 -21959 -29307 -28203 -19371 -20194 -22718 -15881 -11247 -4787 6821 8731 -6507 -7993 8602
7465 8602 1326 1718 161 -14709 -19834 -6800 -2610 -11463 -17771 -17940 -16137 -17915 -16844 -33638 -41132
7450 -41132 -32672 -17418 -14869 -10938 -8410 -4422 -5136 -9155 -19118 -7212 3717 -1856 -7529 -14931
7436 -14931 -15848 -15229 -22481 -20700 -16391 -16413 -21532 -20800 -3830 -167 -1414 -10052 -18624 -17083 -12715 474
7420 474 1479 -19469 -26423 -25610 -32597 -40490 -43799 -41816 -36668 -20384 -16484 -18114 -18134 -21455 -28780
$$ packed form
7520b3230L591J0394J8963k455j3501n626L744o599j236J6806j509o193n483J868
7506a0466J2888L649j3192M034j541J6333M066n179j6120o329k001r29R616L750
7492a421Q423L113j2303j3840m681R718J6521J4535j0376l090k102j0033r180
7479a4716p243p348J104Q832q23k524O837M634O460J1608J910j5238j486J6595
7465H602p276L92j557j4870n125J3034M190q853o308j69J803j778J071j6794p494
7450d1132Q460J5254K549L931K528L988p14m019r963J1906J0929n573n673p402
7436a4931r17O19p252J781M309k2n119P32J6970L663j247q638q572J541M368J3189
7420D74J005k0948o954Q13o987p893l309J983N148J6284L900j630k0l321p325
$$ plain form
7405 -28780 -28597 -27362 -10596 -14838 -33775 -29977 -22462 -22905 -26633 -32676 -32791 -33605 -22234 -13334 -21034
7390 -21034 -24927 -25457 -18056 -23775 -23076 -21876 -25744 -41510 -28447 -17839 -19403 -13992 -8441 -10509
7376 -10509 -13925 -18872 -18005 -10090 -5609 -10 -4562 -29514 -47909 -47567 -47649 -40330 -33142 -20705 -19909
7361 -19909 -24121 -26243 -22710 -18367 -12541 -15305 -13747 -20180 -27770 -30430 -23622 -14201 -17165 -27740
7347 -27740 -27533 -25635 -20180 -14895 -9156 -6388 -596 -6610 -402 7007 -9185 -9211 -6035 -1050 -498
7332 -498 10735 19758 18954 4022 -19946 -24757 -16177 -4829 -3276 -9506 1442 -3911 -14331 -22082
7318 -22082 -18664 -3327 10050 -1406 -19902 -17049 -16899 -22769 -29246 -27784 -21484 -29533 -33782 -29031
7304 -29031 -20207 -26754 -29163 -19363 -26437 -30597 -32681 -43452 -36417 -30007 -20600 -11751 -21935 -16150
$$ packed form
7405b8780J83J235J6766m242j8937L798P515m43l728o043j15q14J1371Q900p700
7390b1034l893n30P401n719O99J200l868j5766J3063J0608j564N411N551k068
7376a0509l416m947Q67P915M481N599m552k4952j8395L42q2P319P188J2437P96
7361a9909m212k122L533M343N826k764J558o433p590k660O808R421k964j0575
7347b7740K07J898N455N285N739K768N792o014O208P409j6192k6L176M985N52
7332d98J1233R023q04j4932k3968m811Q580J1348J553o230J0948n353j0420p751
7318b2082L418J5337J3377j1456j8496K853J50n870o477J462O300q049m249M751
7304b9031Q824o547k409R800p074m160k084j0771P035O410R407Q849j0184N785
$$ plain form
7290 -16150 -8760 -8220 -17814 -18814 -11285 -8192 -5958 -10540 -30292 -21316 -832 2040 -3369 204
7276 204 -9477 -30944 -21915 -9150 -10511 -22465 -34743 -34130 -46030 -37917 -20396 -13313 997 8931
7262 8931 12447 6586 12773 15500 6605 -5749 -7626 -14285 -27510 -28724 -26895 -17655 -15721 -22852
7248 -22852 -18699 -18599 -21798 -28116 -41460 -25994 -4318 -12130 -25277 -34665 -22302 -10648 -4273
7235 -4273 -8348 -5678 -3315 -11214 -5246 -10335 -21509 -30053 -30717 -26653 -17350 -7486 -2505 399 -10955
7220 -10955 -14087 -1351 10486 176 -15717 -16084 -4494 10860 5026 -3108 -13341 -11359 -17489
7207 -17489 -14684 -3212 -4938 -530 -8992 -23176 -12471 -501 6275 2082 -10662 -19342 -16157
7194 -16157 -13153 -18531 -15052 4253 2543 -14407 -6876 14349 20199 23345 14162 3540 7599 7731
$$ packed form
7290a6150P390N40r594j000P529L093K234m582j9752Q976K0484K872n409L573
7276B04r681k1467R029J2765j361j1954j2278O13j1900Q113J7521P083J4310P934
7262H931L516n861O187K727q895j2354j877o659j3225j214J829R240J934p131
7248b2852M153J00l199o318j3344J5466K1676p812j3147r388J2363J1654O375
7235d273m075K670K363p899N968n089j1174q544o64M064R303R864M981K904j1354
7220a0955l132J2736J1837j0310j5893l67J1590J5354n834q134j0233J982o130
7207a7489K805J1472j726M408q462j4184J0705J1970O776m193j2744q680L185
7194a6157L004n378L479J9305j710j6950P531K1225N850L146r183j0622M059J32
$$ plain form
7180 7731 755 -16877 -27225 -27876 -26710 -30553 -30406 -23728 -23308 -10367 -6366 -1101 -6120 -19111 -22612
7165 -22612 -13969 -328 -14568 -23741 -20518 4232 15152 4016 -7062 -4475 394 1977 -4650
7152 -4650 -12370 -17006 -17472 -19166 -29187 -23180 -26295 -35342 -28683 -23182 -21906 -33117 -43635 -49084
7138 -49084 -42324 -29934 -22876 -19744 -21258 -8606 -13587 -24581 -25712 -19355 -15211 -9918 -6733 -12918
7124 -12918 -27655 -23321 -12902 -13818 -21946 -27077 -14925 -7686 -10499 -3004 2577 5862 -2633 2651
7110 2651 27351 19681 12504 15429 11566 3044 2971 5410 -4361 -11461 -6806 3850 1724 -4381 -13807
7095 -13807 -12740 -4141 -16052 -29762 -28543 -12752 -14943 -23661 -19692 -23732 -32701 -12474 -14908 -25503
7081 -25503 -30369 -31430 -22798 -12590 -938 3355 -5032 -9548 -64 2092 4242 10647 4439 -12448
$$ packed form
7180G731o976j7632j0348o51J166l843J47O678M20J2941M001N265n019j2991l501
7165b2612Q643J3641j4240r173L223K4750J0920j1136j1078K587M869J583o627
7152d650p720m636m66j694j0021O007l115r047O659N501J276j1211j0518n449
7138d9084O760J2390P058L132j514J2652m981j0994j131O357M144N293L185o185
7124a2918j4737M334J0419r16q128n131J2152P239k813P495N581L285q495N284
7110B651K4700p670p177K925l863q522p3K439r771p100M655J0656k126o105r426
7095a3807J067Q599j1911j3710J219J5791k191q718L969m040q969K0227k434j0595
7081b5503m866j061Q632J0208J1652M293q387m516R484K156K150O405o208j6887
$$ plain form
7067 -12448 -26490 -13395 -6597 -17096 -18523 -9432 -2232 -4682 -13093 -13316 4023 -992 -9591 -12718
7053 -12718 -15951 -19856 -24265 -20944 -12076 -13700 -18960 -17094 -4208 -1042 -3186 -5371 2771 8415
7039 8415 16307 20456 9239 -1510 1099 10659 189 -17756 -25977 -14049 -2773 -8905 -10518
7026 -10518 -9253 -10742 -9887 -10275 1679 865 -12922 -20279 -29411 -36363 -34587 -37073 -22079 -17028 -17253
7011 -17253 -14218 -21815 -26060 -36245 -32206 -32980 -45479 -25968 -13797 -15968 -12427 -11365 -16746 -17517
6997 -17517 -9238 -12680 -27256 -26972 -27557 -28605 -16263 264 343 2849 -4555 225 1757 -15015 -22089
6982 -22089 -14091 3387 8415 2027 -4908 -1388 10735 4533 1742 -5238 -18930 -20398 -27945 -21785
6968 -21785 -3265 929 -2970 -8892 -7374 2940 12568 543 -8775 -11788 -16116 -32058 -26218 -19056
$$ packed form
7067a2448j4042J3095O798j0499j427R091P200k450q411k23J7339n015q599l127
7053a2718l233l905m409L321Q868j624n260J866J2886L166k144k185Q142N644
7039H415P892M149j1217j0749K609R560j0470j7945q221J1928J1276o132j613
7026a0518J265j489Q55l88J1954q14j3787p357r132o952J776k486J4994N051k25
7011a7253L035p597m245j0185M039p74j2499J9511J2171k171L541J062n381p71
6997a7517Q279l442j4576K84n85j048J2342J6527P9K506p404M780J532j6772p074
6982b2089P998J7478N028o388o935L520J2123o202k791o980j3692j468p547O160
6968b1785J8520M194l899n922J518J0314R628j2025r318l013m328j5942N840P162
$$ plain form
6954 -19056 -9491 -13533 -9940 -764 -6109 5818 3441 -869 1436 -11556 -17191 -1367 14630 11281
6940 11281 -8331 -13846 -19007 -12734 -13913 -18181 -13325 -10522 -13483 -6194 13378 13388 6461 9006 9403
6925 9403 3678 1207 9028 15262 911 -17902 -17492 -13664 -21977 -25012 -19517 -6787 -10751 -24979
6911 -24979 -35488 -32980 -30509 -34367 -22650 -24392 -32045 -34760 -43716 -40850 -28798 -19071 -21289 -21698
6897 -21698 -13155 -17064 -25317 -10041 3337 4542 -2562 -19339 -20231 -12463 -9037 -8100 430 -6360
6883 -6360 -22768 -20750 -7398 4371 -4841 -14490 -21237 -26713 -24389 -6835 -11274 -9425 -6991 -13229
6869 -13229 -3422 -9966 -18585 -13368 -14334 -10259 -20698 -23606 -29033 -30810 -30300 -28336 -19649 -1487 7221
6854 7221 -12153 -9903 -9388 -7631 -6455 -19531 -15397 -6467 -14439 -29003 -29998 -24094 -12120 -2619
$$ packed form
6954a9056R565m042L593R176n345J1927k377m310K305j2992n635J5824J5997l349
6940A1281j9612n515n161O273j179m268M856K803k961P289J9572J0o927K545L97
6925I403n725k471P821O234j4351j8813M10L828q313l035N495J2730l964j4228
6911b4979j0509K508K471l858J1717j742p653k715q956K866J2052R727k218m09
6897b1698Q543l909q253J5276J3378J205p104j6777q92P768L426R37Q530o790
6883f360j6408K018J3352J1769r212r649o747n476K324J7554m439J849K434o238
6869a3229R807o544q619N217r66M075j0439k908n427j777N10J964Q687J8162Q708
6854G221j9374K250N15J757J176j3076M134Q930p972j4564r95N904J1974R501
$$ plain form
6840 -2619 5877 27938 34539 27708 19285 14097 14329 6417 -3898 -15218 -16872 -11851 -14876 -15374 -8749
6825 -8749 -5276 -11945 -10274 -3945 2323 484 -7822 -2579 -3912 -2034 -5305 1735 -5747 -13648 -7890
6810 -7890 -3941 3876 10156 5522 6772 2469 -9290 -12999 -3534 -4838 -6358 -4414 -947 -18505
6796 -18505 -25286 -23137 -29944 -28143 -22294 -16095 -14345 -14179 -31264 -23255 1532 1535 -4089 -3826 -7190
6781 -7190 -11211 -3629 12023 18646 8938 -120 -12896 -6015 5115 -2805 2428 15022 14773 7621
6767 7621 5101 13629 27755 29656 18279 17107 19765 31836 41174 36736 35692 33396 28053 29050
6753 29050 44058 59166 74343 90690 123457 171721 217948 259448 301675 289351 226828 161095
6741 161095 111683 74471 53465 38606 23961 2107 1371 -1430 7954 6661 6264 7137 3267 1701
$$ packed form
6840b619Q496K2061O601o831q423n188K32p912j0315j1320j654N021l025m98O625
6825h749L473o669J671O329O268j839q306N243j333J878l271P040p482p901N758
6810g890L949P817O280m634J250m303j1759l709R465j304j520J944L467j7558
6796a8505o781K149o807J801N849O199J750J66j7085Q009K4787Ln624K63l364
6781g190m021P582J5652O623r708r058j2776O881J1130p920N233J2594k49p152
6767G621k520Q528J4126J901j1377j172K658J2071R338m438j044k296n343R97
6753B9050J5008J5108J5177J6347L2767M8264M6227M1500M2227j2324o2523o5733
6741A61095m9412l7212k1006j4859j4645k1854p36k801R384j293l97Q73l870j566
$$ plain form
6727 1701 1510 -16581 -23169 -25655 -20786 -2840 -8040 5168 12161 -7173 3495 -2342 -11482 -22541
6713 -22541 -21253 -11644 -5634 -2510 -6763 10370 10370 -464 -9677 -15827 -26518 -27924 -13208 2245
6699 2245 2794 -5052 -12194 -6745 3222 938 -12897 -21024 -4514 14923 11384 -14103 -19796 -14657
6685 -14657 -21427 -38768 -38009 -24519 -18211 -20150 -1319 9487 -6846 -20862 -28991 -34316 -27871
6672 -27871 -19951 -10354 -14704 -15898 -17367 -19591 -23202 -25513 -26316 -23110 -18072 -6784 -4365 -4721 -7297
6657 -7297 -19163 -31440 -24800 -9139 -5250 -2597 -7105 -5434 -3393 -7628 -18813 -24657 -17520 -23438
6643 -23438 -30199 -23428 -4711 -7391 -10378 -1450 2177 -10248 -23782 -6891 3746 -2670 2529
6630 2529 21111 18920 12318 18 -5705 4645 8964 9064 250 2193 1368 820 3211 -4850 -3027
$$ packed form
6727A701j91j8091o588k486M869J7946n200J3208O993j9334J0668n837r140j1059
6713b2541J288R609O010L124m253J7133%j0834r213o150j0691j406J4716J5453
6699B245N49p846p142N449R967k284j3835q127J6510J9437l539k5487n693N139
6685a4657o770j7341P59J3490O308j939J8831J0806j6333j4016q129n325O445
6672b7871P920R597m350j194j469k224l611k311q03L206N038J1288K419l56k576
6657g297j1866j2277O640J5661L889K653m508J671K041m235j1185n844P137n918
6643b3438o761O771J8717k680k987Q928L627j2425j3534J6891J0637o416N199
6630B529J8582k191o602j2300n723J0350M319J00q814J943q25n48K391q061J823
$$ plain form
6615 -3027 -9003 -11247 -17030 -7237 -7660 -19603 -25445 -26218 -29013 -28198 -24350 -12640 -18114 -25500 -22221
6600 -22221 -26932 -27506 -23319 -19185 -21723 -25385 -23365 -15285 9756 8731 8797 9101 5700 1504 -50
6585 -50 -1858 -6151 -5558 -6087 -3484 4907 -404 4191 2558 271 -14796 -22417 -19707 -13264 -13999 -11938
6569 -11938 -6240 7226 2911 -3661 -6835 -1655 7688 1585 -8427 -8723 2728 7487 6483 5055
6555 5055 2065 11962 5105 -3055 9827 17902 11407 9249 13794 7374 8073 7839 5411 1874 -11330
6540 -11330 -13338 5263 1176 4772 -1767 -8347 3793 10496 5535 -6446 -22002 -21189 -20277 -8132
6526 -8132 -6537 -2592 -191 -9930 -5092 -7154 -5254 3935 14157 8251 -7124 -14779 -18207 -7679
6512 -7679 -5254 -11308 -13859 -1414 -5221 -20240 -18090 -25614 -25557 -21447 -16619 -13366 -25931 -25843 -14796
$$ packed form
6615c027n976k244n783R793m23j1943n842p73k795Q15L848J1710n474p386L279
6600b2221m711n74M187M134k538l662K020Q080K5041j025O6L04l401m196j554
6585e0j808m293N93n29K603Q391n311M595j633k287j5067p621K710O443p35K061
6569a1938N698J3466m315o572l174N180R343o103j0012k96J1451M759j004j428
6555E055k990R897o857q160J2882Q075o495k158M545o420O99k34k428l537j3204
6540a1330k008J8601m087L596o539o580J2140O703m961j1981j5556Q13R12J2145
6526h132J595L945K401r739M838k062J900R189J0222n906j5375p655l428J0528
6512g679K425o054k551J2445l807j5019K150p524N7M110M828L253j2565Q8J1047
$$ plain form
6497 -14796 -7343 -1006 6013 11927 -3086 -7788 -2557 6355 -53 349 4123 2671 2892 612 -17900
6482 -17900 -17741 1212 11298 13377 5430 -2729 -3133 -27530 -25267 -7351 391 13191 20334 2552
6468 2552 -1499 11155 9474 457 3876 8737 2815 -9031 -17554 -21217 -15882 -20992 -19270 -12252
6454 -12252 5544 10257 -2438 -10096 -3300 5555 16788 9968 -9136 -18339 -18743 -14231 -679 2031
6440 2031 -14461 -17883 -13825 -5523 -5809 -11683 -15641 -10741 -13358 -12870 -24333 -28573 -32402 -23584 -19104
6425 -19104 -3597 -10822 -20773 -19291 -13581 -1628 5818 1779 5197 15920 12582 2991 -4174 -3460
6411 -3460 -3912 -4954 -16650 -22403 -20022 -21526 -27287 -29575 -13749 -17196 -27611 -34492 -26245 -11872
6397 -11872 -9775 532 2427 -2941 -6738 -11163 -2854 1949 -2264 -451 -5155 -6974 2654 19
$$ packed form
6497a4796P453O337P019N914j5013m702N231Q912o408M02L774j452K21k280j8512
6482a7900J59J8953J0086K079p947q159m04k4397K263J7916P742J2800P143j7782
6468B552m051J2654j681r017L419M861n922j1846q523l663N335n110J722P018
6454a2252J7796M713j2695p658O796Q855J1233o820j9104r203m04M512J3552K710
6440B031j6492l422M058Q302k86n874l958M900k617M88j1463m240l829Q818M480
6425a9104J5507p225r951J482N710J1953P446m039L418J0723l338r591p165P14
6411c460m52j042j1696n753K381j504n761k288J5826l447j0415o881Q247J4373
6397a1872K097J0307J895n368l797m425Q309M803m213J813m704j819R628k635
$$ plain form
6383 19 -3304 -17767 -17571 -14472 -13834 -11209 -2636 4247 6679 -6230 -4790 -24554 -35377 -36815 -41432
6368 -41432 -44241 -40705 -35416 -31567 -17845 -5901 632 -8488 -16687 -20075 -17423 -16490 -32624 -27880
6354 -27880 -29979 -25455 -26039 -12616 -4545 -6220 -4396 -7619 -11598 -22239 -18202 -17277 -9614 3033
6340 3033 538 -5358 -10293 -13441 -18406 -6259 4731 8649 9500 -2364 -20 3036 1033 5842
6326 5842 6900 4943 -4009 -15373 -7026 15152 25578 17652 4939 -2880 -5660 -9467 -23456 -34124
6312 -34124 -12529 -1306 898 13825 23250 19021 6120 -2350 2132 -9558 -14406 -17455 -7257
6299 -7257 6186 -2513 -12343 -17533 -14772 -16524 -16343 -21173 -8651 4397 -797 -13098 -14288 -16506
6285 -16506 -1208 6009 7038 6256 7594 3119 6984 4335 15560 1686 -15287 -26702 -18950 -17814
$$ packed form
6383A9l323j4463J96L099O38K625Q573O883K432j2909J440j9764j0823j438m617
6368d1432k809L536N289L849J3722J1944O533r120q199l388K652R33j6134M744
6354b7880k099M524n84J3423Q071j675J824l223l979j0641M037R25P663J2647
6340C033k495n896m935l148m965J2147J0990L918Q51j1864K344L056k003M809
6326E842J058j957q952j1364Q347K2178J0426p926j2713p819k780l807j3989j0668
6312c4124K1595J1223K204J2927R425m229j2901q470M482j1690m848l049J0198
6299g257J3443q699r830n190K761j752J81m830J2522J3048n194j2301j190k218
6285a6506J5298P217J029p82J338m475L865k649J1225j3874j6973j1415P752J136
$$ plain form
6271 -17814 -23411 -22933 -19676 -25297 -11665 2759 1698 -5186 -12961 -8513 4230 10287 3800 -868
6257 -868 -2067 3623 -1387 -628 -1586 -2552 -1352 1581 6152 11105 4414 -11951 -4840 11572 13375
6242 13375 -741 -15715 -22335 -27321 -8069 1158 -7985 -6289 -4203 -8977 -23992 -19311 -15534 -9985
6228 -9985 -11367 -6098 2566 10983 6312 -2027 9730 5215 -3516 -2580 -9590 -14266 -17842 -17000 -10370
6213 -10370 -9130 -5825 -12138 -18560 -32055 -30339 -12136 -11938 -11311 -1049 -5347 -3759 7834 7437
6199 7437 -7370 -17633 -13262 -4412 -1089 -8611 -3961 -4339 6581 -3222 -8174 -11334 5565 6224
6185 6224 2546 -2447 -14835 -9516 -8179 -15883 -7437 -17848 -33788 -20689 -11617 -8852 -8558 -5279
6171 -5279 -24668 -13366 3841 -10510 -12031 -11405 -3909 4973 6068 7540 3894 -3382 -19714 -28568
$$ packed form
6271a7814n597M78L257n621J3632J4424j061o884p775M448J2743O057o487m668
6257h68j199N690n010P59r58r66J200K933M571M953o691j6365P111J6412J803
6242A3375j4116j4974o620m986J9252R227r143J696K086m774j5015M681L777N549
6228i985j382N269Q664Q417m671q339J1757m515q731R36p010m676l576Q42O630
6213a0370J240L305o313o422j3495J716J8203J98O27J0262m298J588J1593l97
6199G437j4807j0263M371Q850L323p522M650l78J0920r803m952l160J6899O59
6185F224l678m993j2388N319J337p704Q446j0411j5940J3099R072K765K94L279
6171e279j9389J1302J7207j4351j521O26P496Q882J095J472l646p276j6332q854
$$ plain form
6157 -28568 -8291 -4268 -4917 -13196 -16391 -4 12336 13917 10201 9110 10017 18179 24932 14147
6143 14147 -6559 1090 15500 14670 1399 -19521 -23943 -25858 -25566 -11560 -7356 -10603 -14418 -8148
6129 -8148 -9057 -11014 -8276 -5078 -3768 -5587 -2817 -7561 -15496 -14548 -1801 7403 2993 11931 6236
6114 6236 -1423 -2535 -10112 -8345 -11984 -1092 2600 -13745 -9063 -1878 -2403 -7740 -17604 -2359
6100 -2359 4401 -12109 -18871 -24959 -23993 -26540 -1680 1010 -6233 -8145 -17659 -19767 -15148 -12544 -7728
6085 -7728 -6923 -1538 -5698 -15325 -11195 7690 7743 -5820 -14537 -16244 -15480 -21198 -18742 -19863 -7506
6070 -7506 -6364 1392 25953 31438 13186 6520 7176 -7353 -13625 -2726 -9758 -18322 -18509 -27839
6056 -27839 -30415 -18582 -5583 -962 -13886 -17951 -24474 -20286 -11376 -9901 -14596 -14366 -4681 -4604 6844
$$ packed form
6157b8568K0277M023o49q279l195J6387J2340J581l716j091R07Q162O753j0785
6143A4147k0706P649J4410q30j3271k0920m422j915K92J4006M204l247l815O270
6129h148r09j957K738L198J310j819K770m744p935R48J2747R204m410Q938n695
6114F236p659j112p577J767l639J0892L692j6345M682P185n25n337r864J5245
6100b359O760j6510o762o088R66k547K4860K690p243j912r514k108M619K604M816
6085g728Q05N385m160r627M130J8885N3j3563q717j707P64n718K456j121J2357
6070g506J142P756K4561N485j8252o666O56j4529o272J0899p032q564j87r330
6056b7839k576J1833J2999M621j2924m065o523M188Q910J475m695K30R685P7J1448
$$ plain form
6041 6844 25085 24051 23832 14146 8620 -4587 -10632 -4238 4861 3336 -4914 -19013 -28556 -23007
6027 -23007 -20633 -22229 -20551 -4979 -6297 -8267 -7760 6337 -2587 -12458 -8404 -9860 -9921 -9567 -5716
6012 -5716 5751 15830 23986 20239 9208 4197 16687 27618 28203 10604 -5645 -15855 -18886
5999 -18886 -20190 -32795 -23243 -14489 -15600 -20898 -34071 -19908 -4298 9787 -2450 -16279 -24539
5986 -24539 -17225 -11221 -6672 -10197 -18567 -21885 -1665 8306 9264 9254 -126 -22433 -7459 10841
5972 10841 -746 -5722 -11998 -4215 6382 -1821 -8579 -7671 -5638 -1394 7760 25055 16829 5004
5958 5004 490 169 -8462 -7939 -6601 197 -7006 -5558 -3341 -5066 -2832 -5569 -25689 -36628 -34090
5943 -34090 -20374 -12888 -11991 -6739 1879 -2364 -1200 -5718 -11720 -11034 -18083 -11048 3476 12258 1183
$$ packed form
6041F844J8241j034k19r686n526j3207o045O394R099j525q250j4099r543N549
6027b3007K374j596J678J5572j318j970N07J4097q924r871M054j456o1L54L851
6012e716J1467J0079Q156l747j1031n011J2490J0931N85j7599j6249j0210l031
5999a8886j304j2605R552Q754j111n298j3173J4163J5610J4085j2237j3829q260
5986b4539P314O004M549l525q370l318K0220R971R58j0r380k2307J4974J8300
5972A0841j1587m976o276P783J0597q203o758R08K033M244R154J7295q226j1825
5958E004m514l21q631N23J338O798p203J448K217j725K234k737k0120j0939K538
5943c4090J3716P486Q97N252Q618m243J164m518o002O86p049P035J4524Q782j1075
$$ plain form
5928 1183 -2838 78 -4401 -1915 1339 597 -5916 -18355 -12105 -14479 -25021 -17971 4553 5944
5914 5944 5404 -3758 -307 1095 5314 1109 870 706 4119 4185 14171 6433 190 9508 23847 30635
5898 30635 20114 29730 30996 26605 17666 14753 22866 -78 -19262 -8017 8895 8594 19227
5885 19227 19689 28814 24618 12855 16728 11858 8955 2077 6137 10914 18380 7007 -19777 -30194
5871 -30194 -25584 -18169 -31224 -22834 -13014 -15452 -11006 -3040 319 -1605 -1912 -7096 -5008 -7833 -14772
5856 -14772 -17867 -18993 -15793 -14538 -11674 -149 13244 33070 20827 -7532 -13304 -6603 3310
5843 3310 5308 -3902 -4541 -9083 -5245 -4561 -15983 -23807 -11096 -1759 -9548 -18110 -5603 136 -1406
5828 -1406 -10416 -24162 -27738 -16375 -17422 -19068 -20769 -14514 -1739 -1259 10631 13644 10500 7621
$$ packed form
5928A183m021K916m479K486L254p42o513j2439O250k374j0542P050K2524J391
5914E944n40r162L451J402M219m205k39j64L413O6R986p738o243R318J4339O788
5898C0635j0521R616J266m391q939k913Q113k2944j9184J1245J6912l01J0633
5885A9227M62R125m196j1763L873m870k903o878M060M777P466j1373k6784j0417
5871c0194M610P415j3055Q390R820k438M446P966L359j924l07n184K088k825o939
5856a4772l095j126L200J255K864J1525J3393J9826j2243k8359n772O701R913
5843C310J998r210o39m542L838O84j1422p824J2711R337p789q562J2507N739j542
5828a406r010j3746l576J1363j047j646j701O255J2775M80J1890L013l144k879
$$ plain form
5814 7621 3568 -1332 -9749 -9857 -17261 -10864 -607 -6564 -16203 -20985 -25221 -21395 -24338 -18475 -19253
5799 -19253 -17963 -2581 1409 -8345 -13933 1552 -8117 -6732 -13810 -4680 16302 4271 -5613 -1128
5785 -1128 1501 6020 -7607 -515 15374 25937 9486 8909 4801 12066 10558 2479 -7746 9320
5771 9320 17759 14364 -3344 -14977 -25595 -23149 -27777 -33893 -29288 -33442 -40881 -35071 -25962 -9688
5757 -9688 4962 7114 2229 452 -14074 -16020 -16787 -20461 -13565 -4050 -12471 -4617 -1966 1411 8305
5742 8305 9953 1260 -11802 -15094 -3055 -876 11260 19641 15143 4707 -1859 -8615 -9 5723
5728 5723 6457 -642 -4479 -169 3422 336 -21883 -38577 -26800 -12950 3832 15900 10898 -5171
5714 -5171 -19297 -16166 -13062 -12071 -14294 -13591 -17202 -27619 -16956 -12387 1493 -4081 -6088 -11520
$$ packed form
5814G621m053m900q417j08p404O397J0257n957r639m782m236L826k943N863p78
5799a9253J290J5382L990r754n588J5485r669J385p078R130K0982j2031r884M485
5785a128K629M519j3627P092J5889J0563j6451n77m108P265j508q079j0225J7066
5771I320Q439l395j7708j1633j0618K446m628o116M605m154p439N810R109J6274
5757i688J4650K152m885j777j4526j946p67l674O896R515q421P854K651L377O894
5742H305J648q693j3062l292J2039K179J2136Q381m498j0436o566o756Q606N732
5728E723P34p099l837M310L591l086k2219j6694J1777J3850J6782J2068n002j6069
5714e171j4126L131L104R91k223P03l611j0417J0663M569J3880n574k007n432
$$ plain form
5700 -11520 -20296 -14782 -11552 -8936 -7711 -17327 -11179 -5715 -4487 -555 -4360 -11236 -14600 -18778 -19556
5685 -19556 -9000 4673 -4087 -4433 -11522 -29097 -19817 -1770 -5904 -6921 -16471 -10833 -3700 12751
5671 12751 21649 25321 9314 -1582 -13599 -28943 -36823 -39922 -33554 -20239 -13917 -18779 -25150
5658 -25150 -15866 -32 7400 4218 -4468 -12989 -25063 -10440 -6589 -3560 1602 -5036 -25575 -32798
5644 -32798 -23854 -14902 -9426 -10493 -5405 5244 9939 16278 7592 495 -4708 -9909 -979 -8693
5630 -8693 -16934 -18855 -18471 -34496 -37113 -30745 -14411 -13629 -22856 -34469 -21142 -10795 -4532 3249
5616 3249 6470 8932 4625 -243 -10405 -6553 -4652 -5048 -633 -2820 -16102 -28118 -20554 -9817
5602 -9817 -18523 -15249 -13536 4251 3753 -17421 -13746 10503 14423 26121 22447 6937 -10253 -6393
$$ packed form
5700a1520q776N514L230K616J225r616O148N464J228L932l805o876l364m178p78
5685a9556J0556J3673q760l46p089j7575R280J8047m134j017r550N638P133J6451
5671A2751Q898L672j6007j0896j2017j5344p880l099O368J3315O322m862o371
5658b5150R284J5834P432l182q686q521j2074J4623L851L029N162o638k0539p223
5644c2798Q944Q952N476j067N088J0649M695O339q686p097n203n201Q930p714
5630h693q241j921L84j6025k617O368J6334P82r227j1613J3327J0347O263P781
5616C249L221K462m307m868j0162L852J901l96M415k187j3282j2016P564J0737
5602i817q706L274J713J7787m98k1174L675K4249L920J1698l674j5510j7190L860
$$ plain form
5588 -6393 -2511 -6330 -8676 -14141 -14408 -8802 -3497 -8877 1452 6678 -2171 -6235 -9400 -2074 289
5573 289 -8973 -13418 -29510 -31334 -34655 -13823 -3315 -5518 -3360 -14517 -26761 -18548 -7526 7851
5559 7851 9418 11493 7659 744 -4764 -6126 -6364 -1792 2617 14871 2309 -7690 -14104 -4997 8740
5544 8740 13732 9076 -9888 -14398 -5069 -2693 -7532 -15838 -7078 -10791 -25557 -36028 -20233 -9345
5530 -9345 -10369 -17978 -17742 -11346 -6948 -9105 -1282 856 -7009 -1281 856 12993 19951 -5154 -22293
5515 -22293 -20251 6204 18156 12999 9474 -4062 -2862 -3140 -5331 592 -4743 -21270 -28098 -19350
5501 -19350 -16784 -27888 -31548 -33855 -19317 790 -8660 -24855 -23388 -20256 -15941 -24277 -28318 -18201
5487 -18201 -15082 -12536 -19351 -15945 -11184 5194 2904 -6352 638 -1214 -9392 -18902 -19468 -11239 6903
$$ packed form
5588f393L882l819k346n465k67N606N305n380J0329N226q849m064l165P326K363
5573B89r262m445j6092j824l321K0832J0508k203K158j1157j2244Q213J1022J5377
5559G851J567K075l834o915n508j362k38M572M409J2254j2562r999o414R107J3737
5544H740M992m656j8964m510R329K376m839q306Q760l713j4766j0471J5795J0888
5530i345j024p609K36O396M398k157P823K138p865N728K137J2137O958k5105j7139
5515b2293K042K6455J1952n157l525j3536J200k78k191N923n335j6527o828Q748
5501a9350K566j1104l660k307J4538K0107r450j6195J467L132M315q336m041J0117
5487a8201L119K546o815L406M761J6378k290r256O990j852q178r510n66Q229J8142
$$ plain form
5472 6903 9589 7386 2292 -661 4610 4279 10713 12541 3766 256 5035 -5442 -13773 -19284 -26520
5457 -26520 -25352 -24773 -22798 -19004 -16791 -7316 5316 -1181 -11073 -16402 -17020 -26264 -32318 -23353 -4634
5442 -4634 3028 816 4669 5600 -9370 -3424 1355 4174 7659 10088 9371 -955 -11467 -8079 -13398
5427 -13398 -7763 -2760 -3413 13818 12559 -895 -13915 -8684 -8805 -7107 -2663 -1148 -16618 -26388
5413 -26388 -22603 -13019 963 3475 -8611 -8958 1902 1812 -3134 -7970 -16510 -4123 6668 -5343
5399 -5343 -1599 3391 -4219 -1135 -4215 -7806 -7498 -5473 5560 11452 14143 15587 3071 -7859
5385 -7859 -12777 -3435 -9723 -10478 -10680 -16347 -26767 -29690 -16061 -12636 -13209 -24669 -19984 -8076 -3855
5370 -3855 -5832 497 -5231 -10589 -20006 -15522 -16267 -8456 -11995 -7165 -12578 -13013 -19957 -17354 -10450
$$ packed form
5472F903K686k203n094k953N271l31O434J828q775l510M779j0477q331n511p236
5457b6520J168N79J975L794K213R475J2632o497r892n329o18r244o054Q965J8719
5442d634P662k212L853R31j4970N946M779K819L485K429p17j0326j0512L388n319
5427a3398N635N003o53J7231j259j3454j3020N231j21J698M444J515j5470r770
5413b6388L785R584J3982K512j2086l47J0860r0m946m836q540J2387J0791j2011
5399e343L744M990p610L084l080l591L08K025J1033N892K691J444j2516j0930
5385g859m918R342o288p55k02n667j0420k923J3629L425n73j1460M685J1908M221
5370c855j977O329n728n358r417M484p45P811l539M830n413m35o944K603O904
$$ plain form
5355 -10450 -3166 -6931 -2915 4553 -12631 -21430 -16166 -14020 -10188 -12515 -22092 -22831 -20707 -25689 -15944
5340 -15944 -15267 -21172 -25602 -16309 1937 10543 8082 3089 -13176 -11864 -12160 4336 1755 285
5326 285 -2905 -1649 9549 13393 10740 15709 16599 1709 -12417 -9381 8155 -901 1129 -2132
5312 -2132 -13500 -31943 -33560 -16321 -2254 7226 2928 3530 6629 1957 111 -4355 -8497 -19179
5298 -19179 -13431 -5462 -4882 5095 5415 -5152 -8739 -504 -2265 -4290 -9681 -13595 -10230 -5466 -18527
5283 -18527 -30295 -25005 -21516 -8991 -12073 -16966 -19183 -24248 -24267 -37460 -34694 -5353 7313 4354
5269 4354 4150 10811 6975 -7944 -4816 -8504 -3041 3074 8514 -4565 -21042 -38805 -31668 -17450
5255 -17450 -24504 -27663 -17124 -5535 -3253 -2291 -7644 -7631 -22103 -26998 -24505 -21805 -30969 -35457 -20906
$$ packed form
5355a0450P284l765M016P468j7184q799N264K146L832k327r577p39K124m982R745
5340a5944O77n905m430R293J8246Q606k461m993j6265J312k96J6496k581j470
5326B85l190J256J1198L844k653M969Q90j4890j4126L036J7536r056K030l261
5312b132j1368j8443j617J7239J4067R480m298O02L099m672j846m466m142j0682
5298a9179N748P969N80R977L20j0567l587Q235j761k025n391l914L365M764j3061
5283a8527j1768N290L489J2525l082m893k217n065j9j3193K766K9341J2666k959
5269D354k04O661l836j4919L128l688N463O115N440j3079j6477j7763P137J4218
5255a7450p054l159J0539J1589K282R62n353J3j4472m895K493K700r164m488J4551
$$ plain form
5240 -20906 -21191 -26267 -22124 -22810 -31613 -29305 -13946 -33252 -44407 -31412 -14332 -5294 -5189 -8185
5226 -8185 -2063 -9034 -26473 -24595 -11195 -3646 -3604 -1369 -5639 -13996 -7455 8951 17960 1858
5212 1858 -14275 -20660 -21157 -12753 -3122 3051 -5766 -14574 -22463 -22317 -10738 -17455 -18203 -16358 -721
5197 -721 18915 24446 7510 -1414 -4270 -6589 -2860 -182 -17072 -23535 -27363 -22832 -9541 -4196
5183 -4196 1658 -4069 -4626 1522 13884 14986 10492 2742 -1386 -7513 -13590 -9109 -2473 5458 6833
5168 6833 1787 -6500 -236 -3971 -3813 -163 -9038 -1728 7585 2310 10030 10809 12415 1907 -7611
5153 -7611 -6162 -18314 -25260 -17398 -15933 -13497 -14035 -6282 -16096 -23104 -20303 -15486 2600 12295 16546
5138 16546 10200 909 7120 2820 6349 8539 -2323 -6871 -15750 -27294 -26338 -22478 -26841 -21146
$$ packed form
5240b0906k85n076M143o86q803K308J5359j9306j1155J2995J7080R038J05k996
5226h185O122o971j7439J878J3400P549M2K235m270q357O541J6406R009j6102
5212A858j6133o385m97Q404R631O173q817q808p889J46J1579o717p48J845J5637
5197g21J9636N531j6936q924k856k319L729K678j6890o463l828M531J3291N345
5183d196N854n727n57O148J2362J102m494p750m128o127o077M481O636P931J375
5168F833n046q287O264l735J58L650q875P310R313n275P720P79J606j0508r518
5153g611J449j2152o946P862J465K436n38P753r814p008K801M817J8086R695M251
5138A6546o346r291O211m300L529K190j0862m548q879j1544R56L860m363N695
$$ plain form
5124 -21146 -16603 -8747 -1130 2841 11520 16521 12317 8496 13052 12306 3613 -7845 -6849 7609 1385
5109 1385 902 -936 -4696 4586 3396 -9214 -8840 -16899 -7836 1499 -4146 -9381 -6028 -7239 -14769
5094 -14769 -18127 -7578 1249 7362 -2013 5825 6912 -1558 -11687 -13861 -3228 8960 481 -5874
5080 -5874 -6444 -18285 -15092 -2902 2397 2361 -14528 -4349 -4775 -128 683 -1665 -378 6776 6424
5065 6424 -1836 -21729 -19959 -5045 18866 19891 7925 4632 5233 4788 1518 1088 10071 19225 17387
5050 17387 12997 -4323 -11429 5974 24258 16368 -993 -11638 -17323 -20899 -25262 -13642 2275
5037 2275 14178 9543 -713 -9502 -9720 -14542 -13343 -11920 -2727 -4285 3054 9605 -2081 -12074
5023 -12074 -11560 -2810 -5633 -2961 4164 11307 7789 -7388 -11664 -12058 -947 -5216 -5431 -7028 -20986
$$ packed form
5124b1146M543P856P617L971Q679N001m204l821M556p46q693j1458R96J4458o224
5109A385m83j838l760R282j190j2610L74q059R063R335n645n235L353j211p530
5094a4769l358J0549Q827O113r375P838J087q470j0129k174J0633J2188q479o355
5080e874n70j1841L193J2190N299l6j6889J0179m26M647Q11k348J287P154l52
5065F424q260j9893J770J4914K3911J025j1966l293O01m45l270m30Q983R154j838
5050A7387m390j7320p106J7403J8284p890j7361j0645n685l576m363J1620J5917
5037B275J1903m635j0256q789k18m822J199J423R193j558P339O551j1686r993
5023a2074N14Q750k823K672P125P143l518j5177m276l94J1111m269k15j597j3958
$$ plain form
5008 -20986 -21697 -18984 -12814 1910 2379 -1926 -1185 3255 411 7535 16320 31919 32408 22061 14937
4993 14937 9209 4131 4039 13150 18821 17928 8415 -8439 -15771 -17760 -26569 -47807 -28972 406
4979 406 -94 1012 -8367 -8633 -11551 -4891 5345 12696 13732 13750 -452 -7931 -12750 567 1499 -8249
4963 -8249 -15854 -16462 9306 21322 11608 12711 18188 19224 16823 19902 18115 7001 22833 23792
4949 23792 12224 2141 -1062 -5068 -10595 -5688 14439 22075 22911 18336 -4046 -14987 -14127 -1373
4935 -1373 6638 16075 23663 -1199 -9551 -7413 -10 12053 5420 1972 4357 5405 999 -11327
4921 -11327 528 -5371 254 -92 -960 2069 6310 14898 6313 -4367 -451 -9274 -20990 -16070
4907 -16070 -27624 -32331 -27740 -19771 -23882 -14877 4461 4899 -11286 -25141 -29304 -14177 -1307
$$ packed form
5008b0986p11K713O170J4724M69m305P41M440k844P124Q785J5599M89j0347p124
4993A4937n728n078r2R111N671q93r513j6854p332j989q809k1238J8835K9378
4979D06n00J106r379k66k918O660J0236P351J036J8j4202p479m819J3317R32r748
4963h249p605o08K5768J2016r714J103N477J036k401L079j787j1114J5832R59
4949B3792j1568j0083l203m006n527M907K0127P636Q36m575k2382j0941Q60J2754
4935a373Q011R437P588k4862q352K138P403J2063o633l448K385J048m406j2326
4921a1327J1855n899N625l46q68L029M241Q588q585j0680L916q823j1716M920
4907a6070j1554m707M591P969m111R005J9338M38j6185j3855m163J5127J2870
$$ plain form
4894 -1307 4517 6619 10852 12285 15997 24311 14267 -5742 -10332 -13622 -21021 -12224 -7050 1924
4880 1924 9588 10933 -1148 -8340 -9171 -9419 -10119 -16238 -5677 -542 -6129 6793 8421 -9059 -29595
4865 -29595 -24938 -15177 -23060 -23521 -2243 2673 -3987 -10132 -8262 -235 9227 10543 -3467 -12623
4851 -12623 -15014 -3361 -2417 -13746 -12761 -11657 -4051 -90 -5043 -11224 -5933 -15545 -21148 -17030 -4201
4836 -4201 -5724 -755 -3022 10636 3747 268 -3670 -18415 -16289 -12709 -9836 -9873 -7814 3092 -3040
4821 -3040 585 -5742 -12779 -16962 -5442 -6100 -18039 -22486 -12984 -13379 -12790 -3268 -13917 -22641 -20676
4806 -20676 -22923 -11581 -648 -4127 -4948 -1634 -11101 -9057 -2787 -8712 -11739 -19682 -12428 -8468
4792 -8468 -632 3883 4196 488 -5008 -9132 -6841 -5342 -2379 4960 17072 18260 5524 -1536 -7776
$$ packed form
4894a307N824K102M233J433L712Q314j0044k0009m590l290p399Q797N174Q974
4880A924P664J345j2081p192q31k48p00o119J0561N135n587J2922J628j7480k0536
4865b9595M657R761p883m61K1278M916o660o145J870Q027R462J316j4010r156
4851a2623k391J1653R44j1329R85J104P606L961m953o181N291r612n603M118J2829
4836d201j523M969k267J3658o889l479l938j4745K126L580K873l7K059J0906o132
4821c040L625o327p037m183J1520o58j1939m447R502l95N89R522j0649q724J965
4806b0676k247J1342J0933l479q21L314r467K044O270n925l027p943P254L960
4792h468P836M515L13l708n496m124K291J499K963P339J2112J188j2736p060o240
$$ plain form
4777 -7776 -6673 -2286 -7310 -9806 -12321 -27276 -24613 -10331 179 -453 -5232 -23647 -19030 -11289
4763 -11289 -14611 -11351 -6473 -13014 -13246 -18606 -16799 -15848 -2726 10159 -176 -2142 9974 10581
4749 10581 -2245 -1440 318 6285 5255 11991 -2344 -3768 5796 4843 -916 -8717 3599 9197
4735 9197 8705 248 -7854 -14888 -2487 1417 14039 14404 5447 -13365 -15608 -8153 -6760 -17622
4721 -17622 -19518 -13209 -134 12555 8155 -1258 5679 -4654 -13083 -17764 -16109 -26810 -17098 -9635
4707 -9635 -21621 -8563 5328 -5943 -18481 -11244 -4594 -15766 -7364 -3481 3372 -2495 -12190
4694 -12190 -12465 -12063 -6236 8389 -9117 -8752 1372 -3360 -5611 1402 7485 5011 10700 8789 -10683
4679 -10683 -13523 -14902 -16628 -5485 -4960 -11347 2560 6777 8466 16192 14697 7025 -5917 -8528
$$ packed form
4777g776J103M387n024k496k515j4955K663J4282J0510o32m779j8415M617P741
4763a1289l322L260M878o541k32n360J807R51J3122J2885j0335j966J2116O07
4749A0581j2826Q05J758N967j030O736j4335j424R564r53n759p801J2316N598
4735I197m92q457q102p034J2401L904J2622L65q957j8812k243P455J393j0862
4721a7622j896O309J3075J2689m400r413O937j0333q429m681J655j0701R712P463
4707i635j1986J3058J3891j1271j2538P237O650j1172Q402L883O853n867r695
4694a2190k75M02N827J4625j7506L65J0124m732k251P013O083k474N689j911j9472
4679a0683k840j379j726J1143N25o387J3907M217J689P726j495p672j2942k611
$$ plain form
4665 -8528 1317 751 -4052 -6429 9244 2664 1829 15368 23955 16258 9655 12517 2852 13716 26057
4650 26057 8629 7096 21995 35354 34786 12440 2774 -9334 -3880 11370 19531 25612 25796 14038
4636 14038 -10024 -7804 10298 19029 14221 3418 15875 32364 28981 15990 10191 1923 -15751
4623 -15751 -10870 -10616 2076 6852 10173 4609 13741 2933 -3466 7496 9059 20300 23231 22323
4609 22323 20263 24020 19936 3164 -4763 13373 34778 37000 32719 15972 9884 5739 -7942
4596 -7942 -13601 -11006 -3284 8632 10599 10918 4601 5231 60 -6235 -14896 -6319 27203 32585 14843
4581 14843 6400 16207 17080 5405 -12263 -13192 -10123 -14378 -14656 -5923 690 1507 -6504 -8986 -6111
4566 -6111 -7841 -4101 4862 348 -15003 -16433 -10720 -10026 -6261 -15960 -18108 -7547 -12355 -15859 -16894
$$ packed form
4665h528R845n66m803k377J5673o580q35J3539Q587p697o603K862r665J0864J2341
4650B6057j7428j533J4899J3359n68k2346r666j2108N454J5250Q161O081J84j1758
4636A4038k4062K220J8102Q731m808j0803J2457J6489l383j2991n799q268j7674
4623a5751M881K54J2692M776L321n564R132j0808o399J0962J563J1241K931r08
4609B2323k060L757m084j6772p927J8136K1405K222m281j6747o088m145j3681
4596g942n659K595P722J1916J967L19o317O30n171o295q661Q577L3522N382j7742
4581A4843q443R807Q73j1675j7668r29L069m255k78Q733O613Q17q011k482K875
4566f111j730L740Q963m514j5351j430N713O94L765r699k148J0561m808l504j035
$$ plain form
4551 -16894 -17679 -24262 -22598 -18529 -17645 -10632 -1073 -8267 -10881 -6415 -5703 1786 -2099 14844 16468
4536 16468 9716 -5373 -7264 -10414 1486 1327 -4061 999 -5470 -8939 -11616 -627 4354 2985
4522 2985 -8854 -18464 -32798 -33459 -24589 -19799 -21110 -6876 12153 15314 12595 13993 10542 3181
4508 3181 7267 5418 -1196 -1410 -296 9548 3341 -19646 -13410 -9760 -21065 -7352 -6490 -11171 -10057
4493 -10057 -6096 -1394 -11702 -14202 -16343 -19933 4120 4464 -8976 -17311 -7189 -5155 -11466 -15469
4479 -15469 -8831 2106 -4124 -8002 -8875 483 8769 11365 1145 -4050 5177 9724 12236 9932
4465 9932 13751 15736 -4574 -5521 -7010 -9779 6542 13688 -2765 -20907 -16632 -15763 -3223 -5597
$$ packed form
4551a6894p85o583J664M069Q84P013R559p194k614M466P12P489l885J6943J624
4536A6468o752j5089j891l150J1900j59n388N060o469l469k677J0989M981j369
4522B985j1839r610j4334o61Q870M790j311J4234J9029L161k719J398l451p361
4508C181M086j849o614k14J114R844o207k2987O236L650j1305J3713Q62m681J114
4493a0057L961M702j0308k500k141l590K4053L44j3440q335J0122K034o311m003
4479a5469O638J0937o230l878q73R358Q286K596j0220n195R227M547K512k304
4465I932L819J985k0310r47j489k769J6321P146j6453j8142M275Q69J2540k374
$$ [...]
##END NTUPLES=NMR SPECTRUM
##END=
