##TITLE=Analysis number 329009
Compound Code cc 58746
Book Reference 486/176
Project Code adrs
Chemist Name simons
##JCAMPDX= 6.0         $$ Bruker NMR JCAMP-DX V2.0
##DATA TYPE= NMR SPECTRUM
##DATA CLASS= NTUPLES
##ORIGIN= Bruker BioSpin GmbH
##OWNER= nmr
$$ XWIN-NMR		Version 3.5
$$ Wed Jul 25 09:52:15 2007 GMT Daylight Time (UT+1h)  MAYBRIDGE\nmr@NMR_250MHZ
##.OBSERVE FREQUENCY= 250.131544655141
##.OBSERVE NUCLEUS= ^1H
##.ACQUISITION MODE= SIMULTANEOUS (DQD)
##.ACQUISITION SCHEME= undefined
##.AVERAGES= 16
##.DIGITISER RES= 18
##SPECTROMETER/DATA SYSTEM= dpx250
##.PULSE SEQUENCE= zg30
##.SOLVENT NAME= CDCl3
##.SHIFT REFERENCE= (INTERNAL, CDCl3, 0, 16.522)
##AUDIT TRAIL= $$ (NUMBER, WHEN, WHO, WHERE, WHAT)
$$ ##TITLE= Audit trail, XWIN-NMR		Version 3.5
$$ ##JCAMPDX= 5.01
$$ ##ORIGIN= Bruker BioSpin GmbH
$$ ##OWNER= nmr
$$ C:\u/data/dgb/nmr/ADRS/1410/pdata/1/auditp.txt
$$ ##AUDIT TRAIL=  $$ (NUMBER, WHEN, WHO, WHERE, WHAT)
(   1,<2007-07-25 09:51:53.98 +100>,<MAYBRIDGE\nmr>,<NMR_250MHZ>,
      <created by zg, POWCHK disabled, PULCHK disabled
       configuration hash MD5:
       76 6E 9A 78 1E 09 19 81 EC 84 63 8F B0 6A 59 2D
       data hash MD5: 64K
       4A A8 9C 7E 28 5D 35 E2 50 2D F2 87 38 15 43 92>)
(   2,<2007-07-25 09:52:06.15 +100>,<MAYBRIDGE\nmr>,<NMR_250MHZ>,
      <Start of raw data processing
       ef LB = 0.3 FT_mod = 6 PKNL = 1 SI = 32K 
       data hash MD5: 32K
       F0 02 0A 6A F9 CA 43 45 E3 8B 92 CC B2 F3 26 EB>)
(   3,<2007-07-25 09:52:07.94 +100>,<MAYBRIDGE\nmr>,<NMR_250MHZ>,
      <apk 
       data hash MD5: 32K
       09 72 64 FE D6 7E D9 7D F3 C2 47 CF 00 E1 0E 5C>)
(   4,<2007-07-25 09:52:08.66 +100>,<MAYBRIDGE\nmr>,<NMR_250MHZ>,
      <abs ABSG = 5 
       data hash MD5: 32K
       23 5E 03 80 B8 2B 45 73 E9 EC A8 97 61 78 67 1D>)
$$ ##END=
$$ 
$$ hash MD5
$$ 3C 2F DE DE EA CD 64 CB 70 68 62 D3 A7 95 29 C7
##$RELAX= 
##$RELAX= 
##$RELAX= 
##$RELAX= 
##$RELAX= 
##$RELAX= 
##$RELAX= 
$$ Bruker specific parameters
$$ --------------------------
##$DU= <C:\u>
##$EXPNO= 1410
##$NAME= <ADRS>
##$PROCNO= 1
##$TYPE= <nmr>
##$USER= <dgb>
##$AMP= (0..31)
100 100 100 100 100 100 100 100 100 100 100 100 100 100 100 100 100 100 
100 100 100 100 100 100 100 100 100 100 100 100 100 100 
##$AQSEQ= 0
##$AQ_mod= 3
##$AUNM= <au_zg>
##$AUTOPOS= <5 >
##$BF1= 250.13
##$BF2= 250.13
##$BF3= 250.13
##$BF4= 250.13
##$BF5= 500.13
##$BF6= 500.13
##$BF7= 500.13
##$BF8= 500.13
##$BYTORDA= 1
##$CFDGTYP= 0
##$CFRGTYP= 5
##$CHEMSTR= <none>
##$CNST= (0..31)
1 1 145 1 1 1 1 1 1 1 1 1 1 1 1 1 1 1 1 1 1 1 1 1 1 1 1 1 1 1 1 1 
##$CPDPRG= <>
##$CPDPRG1= <>
##$CPDPRG2= <>
##$CPDPRG3= <>
##$CPDPRG4= <mlev>
##$CPDPRG5= <mlev>
##$CPDPRG6= <mlev>
##$CPDPRG7= <mlev>
##$CPDPRG8= <mlev>
##$CPDPRGB= <>
##$CPDPRGT= <>
##$D= (0..31)
0 1 0 0 0 0 0 0 0 0.06 0 0 0 0 0 0 0.0002 0 0 0 0 0 0 0 0 0 0 0 0 0 0 
0 
##$DATE= 1185353512
##$DBL= (0..7)
120 120 120 120 120 120 120 120 
##$DBP= (0..7)
150 150 150 150 150 150 150 150 
##$DBP07= 0
##$DBPNAM0= <>
##$DBPNAM1= <>
$$ [...]
##$SUBNAM7= <"">
##$SUBNAM8= <"">
##$SUBNAM9= <"">
##$SW= 20.6930455092707
##$SWIBOX= (0..15)
0 0 3 0 0 0 0 0 0 0 0 0 0 0 0 0 
##$SW_h= 5175.983436853
##$TD= 65536
##$TD0= 1
##$TE= 296.16
##$TE2= 300
##$TE3= 300
##$TEG= 300
##$TL= (0..7)
0 120 120 120 120 120 120 120 
##$TP= (0..7)
150 150 150 150 150 150 150 150 
##$TP07= 0
##$TPNAME0= <>
##$TPNAME1= <>
##$TPNAME2= <>
##$TPNAME3= <>
##$TPNAME4= <>
##$TPNAME5= <>
##$TPNAME6= <>
##$TPNAME7= <>
##$TPOAL= (0..7)
0.5 0.5 0.5 0.5 0.5 0.5 0.5 0.5 
##$TPOFFS= (0..7)
0 0 0 0 0 0 0 0 
##$TUNHIN= 0
##$TUNHOUT= 0
##$TUNXOUT= 0
##$USERA1= <user>
##$USERA2= <user>
##$USERA3= <user>
##$USERA4= <user>
##$USERA5= <user>
##$V9= 5
##$VALIST= <valist>
##$VCLIST= <CCCCCCCCCCCCCCC>
##$VD= 0
##$VDLIST= <DDDDDDDDDDDDDDD>
##$VPLIST= <PPPPPPPPPPPPPPP>
##$VTLIST= <TTTTTTTTTTTTTTT>
##$WBST= 1024
##$WBSW= 4
##$XGAIN= (0..3)
0 0 0 0 
##$XL= 0
##$YL= 0
##$YMAX_a= 478253
##$YMIN_a= -617012
##$ZGOPTNS= <>
##$ZL1= 120
##$ZL2= 120
##$ZL3= 120
##$ZL4= 120
##$ABSF1= 16.522
##$ABSF2= -4.171173
##$ABSG= 5
##$ABSL= 3
##$ALPHA= 0
##$AQORDER= 0
##$ASSFAC= 0
##$ASSFACI= 0
##$ASSFACX= 0
##$ASSWID= 0
##$AUNMP= <proc_1d>
##$AZFE= 0.1
##$AZFW= 0.1
##$BCFW= 0
##$BC_mod= 0
##$BYTORDP= 0
##$COROFFS= 0
##$CY= 12.5
##$DATMOD= 1
##$DC= 0
##$DFILT= <>
##$DTYPP= 0
##$F1P= 14.0000005364418
##$F2P= -0.99999901652339
##$FCOR= 0.5
##$FTSIZE= 32768
##$FT_mod= 6
##$GAMMA= 0
##$GB= 0
##$INTBC= 1
##$INTSCL= 1
##$ISEN= 128
##$LB= 0.3
##$LEV0= 0
##$LPBIN= 0
##$MAXI= 10000
##$MC2= 0
##$MEAN= 0
##$ME_mod= 0
##$MI= 0
##$NCOEF= 0
##$NC_proc= -2
##$NLEV= 6
##$NOISF1= 0
##$NOISF2= 0
##$NSP= 0
##$NTH_PI= 0
##$NZP= 0
##$OFFSET= 16.522
##$PC= 1
##$PHC0= 158.3259
##$PHC1= 4.569937
##$PH_mod= 1
##$PKNL= yes
##$PPARMOD= 0
##$PSCAL= 4
##$PSIGN= 0
##$REVERSE= no
##$SF= 250.13
##$SI= 32768
##$SIGF1= 0
##$SIGF2= 0
##$SINO= 400
##$SIOLD= 32768
##$SREGLST= <1H.CDCl3>
##$SSB= 0
##$STSI= 32768
##$STSR= 0
##$SW_p= 5175.98343685301
##$SYMM= 0
##$S_DEV= 0
##$TDeff= 65536
##$TDoff= 0
##$TI= <Analysis number 999999
Compound Code 99
Book Reference 9
Project Code 9>
##$TILT= no
##$TM1= 0
##$TM2= 0
##$TOPLEV= 0
##$USERP1= <user>
##$USERP2= <user>
##$USERP3= <user>
##$USERP4= <user>
##$USERP5= <user>
##$WDW= 1
##$XDIM= 32768
##$YMAX_p= 281226665
##$YMIN_p= -136367
$$ End of Bruker specific parameters
$$ ---------------------------------
##NTUPLES= NMR SPECTRUM
##VAR_NAME=  FREQUENCY,     SPECTRUM/REAL,   SPECTRUM/IMAG
##SYMBOL=    X,             R,               I
##VAR_TYPE=  INDEPENDENT,   DEPENDENT,       DEPENDENT
##VAR_FORM=  AFFN,          ASDF,            ASDF
##VAR_DIM=   32768,         32768,           32768
##UNITS=     HZ,            ARBITRARY UNITS, ARBITRARY UNITS
##FACTOR=    0.157963299565203, 1,           1
##FIRST=     4132.6476996994, 0,             0
##LAST=      -1043.33573715361, 0,           0
##MIN=       -1043.33573715361, -136367,     0
##MAX=       4132.6476996994, 281226665,     0
$$ Real data points
##PAGE= N=1
##DATA TABLE= (X++(R..R)), XYDATA
$$ [...]
17538F9321k251N278K907j798m197k747J138P21r05l288O06j618K68k399m88m666
$$ 69321 67070 72348 75255 73457 69260 66513 67651 68372 67467 64179 64785 63167 63435 61036 60548 55882
17522E5882q598m441m379l161K937K97l984m494k178l738p20N20l164j374j785
$$ 55882 47284 42843 38464 35303 38240 38537 34553 30059 27881 24143 23423 23943 20779 19405 17620
17507A7620L72r83m629J663K737M80J054J991k461n779j02O10J244K073l356j759
$$ 17620 17992 17009 12380 14043 16780 17260 18314 20305 17844 12065 11963 12573 13817 15890 12534 10775
17491A0775M350P99M499j572l240l07j303p5M719J084k147J414k140k895r93j214
$$ 10775 15125 15924 20423 18851 15611 15304 14001 13926 18645 19729 17582 18996 16856 13961 12968 11754
17475A1754J137l363q41J639O83J716r33l255m041j374J611R01j922l066r8M821
$$ 11754 12891 9528 8687 10326 11009 12725 11792 8537 4496 3122 4733 5634 3712 646 548 5369
17459E369R62K363J664Q52J161j198L35j738N60k935n222L664L084M76O421N650
$$ 5369 6331 8694 10358 11210 12371 11173 11508 9770 10330 7395 2173 5837 8921 9397 15818 21468
17443B1468Q584J7166J0635j1739j2834o402j0084p591m767j163L362Q96P54j873
$$ 21468 30052 47218 57853 46114 33280 26878 16794 9203 4436 3273 6635 7531 8285 6412
17429F412q61Q62m612l649M150L908m57J617J250K700l201m489j17o46k711K290
$$ 6412 5551 6413 1801 -1848 2302 6210 5753 7370 8620 11320 8119 3630 3513 2867 156 2446
17413B446m76k920l82N53j159K889r13n80j133m3M647M720j129m47J231J740p81
$$ 2446 1970 -950 -1332 -779 -1938 951 38 -542 -1675 -1718 2929 7649 6520 6073 7304 9044 8263
17396H263m492j005M6K291P402Q34m330k054k290j905K138O09j284K334N43l030
$$ 8263 3771 2766 2812 5103 12505 13339 9009 6955 4665 2760 4898 5507 4223 6557 7100 4070
17380D070K314M181J397o33o012k951Q47j510K638J005r71J737j513J506j707
$$ 4070 6384 10565 11962 11329 5317 2366 3213 1703 4341 5346 4375 6112 4599 6105 4398
17365D398p05j421j544L894j293O87M05L153J029o55l262Q97J292J011j309m53
$$ 4398 3693 2272 728 4622 3329 4016 4421 7574 8603 7948 4686 5583 6875 7886 6577 6124
17349F124L078M607J391k832l382K77J976J422K2r66J411M820M8m46L900L666
$$ 6124 9202 13809 15200 12368 8986 9263 11239 12661 12683 11717 13128 17948 17996 17550 21450 25116
17333B5116Q831J3736J8591J8111K4315K3149J5217J5210R820K96j1336j5671
$$ 25116 33947 47683 66274 84385 108700 131849 147066 162276 172096 172392 161056 145385
17321A45385k0513k3691j8685j7602j3383j2638m097p10N013O633P508N197J736
$$ 145385 124872 101181 82496 64894 51511 38873 34776 34066 39079 45712 53220 58417 60153
17308F0153L867Q094J0518Q252R763J1131Q958R405Q776N547Q51p43O25J391M020
$$ 60153 64020 72114 82632 90884 100647 111778 120736 130141 138917 144464 145315 144572 145197 146588 150608
17293A50608l685R18J798n844p075p154q227q868p553o476k761J541P315J3325
$$ 150608 146923 147841 149639 143795 136720 129566 121339 112471 104918 98442 95681 97222 104537 117862
17279A17862J1035J4032J0593M720o570q635j0496j4702j5720k0772k2321j2212
$$ 117862 128897 142929 153522 158242 151672 143037 132541 117839 102119 81347 59026 46814
17267D6814o275m374p121n711l997m369R89K934j76O23j225l45J258L118N243
$$ 46814 40539 36165 29044 23333 19336 14967 15956 18890 18714 19337 18112 17767 19025 22143 27386
17252B7386L997N902O118M683N141Q724R011N17l574l209K887K296r08k574p86
$$ 27386 31383 37285 43403 48086 53227 61951 70962 71479 67905 64696 67583 69879 68971 66397 65611
17237F5611l04o46j673O45j848j720o763p833l217o568q854q674N82m501k134
$$ 65611 65307 64661 62988 63633 61785 60065 53302 45469 42252 35684 26830 18156 18738 14237 12103
17222A2103j246l011n14J77k214J044J014l284J061K161l19L866K301M447N579
$$ 12103 10857 7846 7332 7509 5295 6339 7353 4069 5130 7291 6972 10838 13139 17586 23165
17207B3165P250J1727J6324K6679M0824M8967N4845M2072J0516j7413l5306l9740
$$ 23165 30415 42142 58466 85145 125969 174936 229781 271853 282369 264956 229650 189910
17195A89910l4433k4891j6311r460n325n651j619k572k875O4n82J252l599q011
$$ 189910 155477 130586 114275 104815 99490 93839 92220 89648 86773 86837 86255 87507 83908 75897
17181G5897m272k035m280q607q537j203r391o185l258m567j195k450j316j15j531
$$ 75897 71625 69590 65310 56703 48166 46963 37572 31387 28129 23562 22367 19917 18601 18486 16955
17166A6955K004K868Q33L211O251P734O903J7636L0527M4057N7168N9268N3000
$$ 16955 18959 21827 22660 25871 32122 39856 46759 64395 94922 138979 196147 255415 308415
17153C08415K6892l467l4867n9763n9760m6946l7383l2111j5847q231p222p53
$$ 308415 335307 331840 296973 237210 177450 130504 93121 61010 45163 36932 29710 28957
17141B8957k319m079k187k245K316N21j615J797l814n563K731o70j877j754J035
$$ 28957 26638 22559 20372 18127 20443 20964 19349 21146 17332 11769 14500 13830 11953 10199 11234
17126A1234J920j597K826j71L15O66p15l468m249R72N243M367K012o88Q667J5548
$$ 11234 13154 11557 14383 14212 14527 15193 14478 11010 6761 7733 12976 17343 19355 18667 27334 42882
17110D2882J4334K4978L6274L2802J2901j0794l0802l9749k8004j9318q093n296
$$ 42882 57216 82194 118468 151270 164171 153377 122575 82826 54822 35504 27411 22115
17098B2115n798k887K028p07j663k525L8K86O44J024J866q75l87q42J364J864
$$ 22115 16317 13430 15458 14751 13088 10563 10601 10887 11531 12555 14421 13546 13159 12317 13681 15545
17082A5545L81Q73K18M34P39j229p53j156M984N56m778m654m317l656J815K575
$$ 15545 15926 16799 17017 17451 18190 16961 16208 15052 20036 20592 15814 11160 6843 3187 5002 7577
17066G577j001k58L483j692M283L488l782P75M3m171j628L864j955j906l027J49
$$ 7577 6576 6318 9801 8109 12392 15880 12098 12873 12916 8745 7117 10981 9026 7120 4093 4242
17050D242J921k81P13J406q22M325L074j561j825M264k793O21J590j574K025K275
$$ 4242 6163 5882 6595 8001 7179 11504 14578 13017 11192 15456 12663 13284 14874 13300 15325 17600
17034A7600J630l82m465m573L954J217l78M08l887j252J65L56l010m634j166L59
$$ 17600 19230 18848 14383 9810 13764 14981 14603 15011 11124 9872 10037 10393 7383 2749 1583 1942
17018A942j413j006L015o02K33N568L528n12k059n776RL804P14n67l39J873J679
$$ 1942 529 -477 2538 1936 2169 7737 11265 10753 8694 2918 2927 6731 7445 6878 6539 8412 10091
17001A0091j932P09N20j624q48m174j739j276J222k142l314M05K012j214k745
$$ 10091 8159 8868 9388 7764 6916 2742 1003 -273 949 -1193 -4507 -4102 -2090 -3304 -6049
16986f049L648o84P245M942M025J975J4J427J764r63J799M90J195k008n278m525
$$ -6049 -2401 -3085 4160 9102 13127 15102 15116 16543 18307 17344 19143 19633 20828 18820 13542 9017
16970I017p34P893L741L61l157o089j420K130J1688J0205N011J3544J5062J0434
$$ 9017 8283 16176 19917 20278 17121 11032 9612 11742 23430 33635 38646 52190 67252 77686
16956G7686J3114J2392M221j618n815q688j2394j1819j2510r850r198q777m657
$$ 77686 90800 103192 107413 105795 99980 91292 78898 67079 54569 44719 35521 26744 22087
16943B2087k762m817l482m22p96K155L669K163J148M061M061K751J715K779M313
$$ 22087 19325 14508 11026 10604 9808 11963 15632 17795 18943 23004 27065 29816 31531 34310 38623
16928C8623L346o123m095j869j024j56K382K542k728l761l142j607L457N102K197
$$ 38623 41969 35846 31751 29882 28858 28702 31084 33626 30898 27137 23995 22388 25845 30947 33144
16913C3144p46P696Q857Q279J1306J3564J5327P165M455L616j552m741q209q163
$$ 33144 32398 40094 48951 57230 68536 82100 97427 104592 109047 112663 111111 106370 98161 89998
16899H9998r429q187j4444o749j143J475M973J068K216L58K470M191O735J1073
$$ 89998 80569 72382 57938 51189 50046 51521 56494 57562 59778 60136 62606 66797 73532 84605
16885H4605J1009M792j351m678J073o527o202m000k393o513k221p14J573O905
$$ 84605 95614 100406 99055 94377 95450 88923 82721 78721 76328 69815 67594 66880 68453 75358
16871G5358P805O732O734P652R172N011L433P170J0883N954J1047J3060J4611
$$ 75358 83163 89895 96629 104281 113453 118464 121897 129067 139950 145904 156951 170011 184622
16858A84622K0462K7129M1044M8458N5251O1416O9634P5449P6487O5277N1906
$$ 184622 205084 232213 273257 321715 376966 438382 508016 583465 659952 725229 777135
16847G77135M4770M3160M9771O1696Q5300J13657J73946K69825M15493O43371
$$ 777135 821905 865065 914836 976532 1061832 1175489 1349435 1619260 2034753 2678124
16837B678124J009535J562566K296776L138450L912718M374448M308029L588711
$$ 2678124 3687659 5250225 7547001 10685451 14598169 18972617 23280646 26869357
16829B6869357K313040O83930j040884k605076l755190m297850m211132l662201
$$ 26869357 29182397 29866327 28825443 26220367 22465177 18167327 13956195 10293994
16821A0293994k886695k101307j446949r55892o25904m18630k79418j85986j16500
$$ 10293994 7407299 5305992 3859043 2903151 2277247 1858617 1579199 1393213 1276713
16812A276713o5336l0335N76K4384L4033L2636K4534J0689n652k2608l0634m0852
$$ 1276713 1211377 1181042 1181618 1206002 1240035 1272671 1297205 1307894 1302242 1279634 1249000 1208148
16800A208148l8425k9593k4168j9019m064N283K2924N7201R8068J66150K64931
$$ 1208148 1169723 1140130 1115962 1096943 1092879 1098162 1121086 1178287 1276355 1442505 1707436
16789A707436M13335O43379J011752J554202K238858K985680L622628L944611
$$ 1707436 2120771 2764150 3775902 5330104 7568962 10554642 14177270 18121881
16781A8121881L745757K969355J715230K04547j336668k675562l586034l913339
$$ 18121881 21867638 24836993 26552223 26756770 25420102 22744540 19158506 15245167
16773A5245167l706299l140387k418087j723542j164177p66860n00274l37357
$$ 15245167 11538868 8398481 5980394 4256852 3092675 2325815 1825541 1488184
16765A488184k32835j53113r8535n3814k5520o293Q338J4169L675j1565l3062
$$ 1488184 1255349 1102236 1003701 949887 924367 918074 926412 940581 944256 932691 899629
16754H99629n8689p6917q6102r5345q1553p3136o3508m9194l9681l2109k2430
$$ 899629 840940 764023 677921 582576 501023 427887 364379 315185 275504 243395 220965
16743B20965j3009j6890j6875r846l988l802j5708j1591n353p199m891k900k567
$$ 220965 207956 191066 174191 164345 160357 156555 140847 129256 123903 116704 111813 108913 106346
16730A06346q7l726l105p97k255l136n30k597n114l664p038n077m461o085l226
$$ 106346 106259 102533 99428 98631 96376 93240 92710 90113 84999 81335 74297 69220 64759 58674 55448
16715E5448m155k039j144n592l901l015m500k329l577l014m277k373J031N097
$$ 55448 51293 49254 48110 42518 38617 35602 31102 28773 25196 22182 17905 15532 16563 21660
16701B1660n24q38M911J667K843k82P67J854r4K905M339J964l834k664p971k445
$$ 21660 21136 20298 25209 26876 29719 29437 30204 32058 31964 34869 39208 41172 37338 34674 26703 24258
16685B4258j430n204n320j094k626J608J656j016J12m02r5L927M794K745K911
$$ 24258 22828 17624 12304 11210 8584 10192 11848 10832 10944 10542 10447 14374 19168 21913 24824
16670B4824k014Q57M15n24k444p092j920K85j130j551l274m035o112k754q149
$$ 24824 22810 23667 24082 23558 21114 14022 12102 12387 11257 9706 6432 2397 -3715 -6469 -14618
16655a4618j803j368l90K975M593L890K211N226P977M804K537Q12j028j68j877
$$ -14618 -16421 -17789 -18179 -15204 -10611 -6721 -4510 716 8693 13497 16034 16846 15818 15650 13773
16640A3773j559o74M459m1l319j886l057k972k280K382K448l093j710j456q36
$$ 13773 12214 11540 15999 15958 12639 10753 7696 4724 2444 4826 7274 4181 2471 1015 179
16625A79J527K407M112j425Q54L758k04L53N03j509J348j138k94k341k103j057
$$ 179 1706 4113 8225 6800 7654 11412 11208 11561 12064 10555 11903 10765 10471 8130 6027 4970
16609D970K295j63p47l936m298k490k27K667M050J069J092K226J054k374m211
$$ 4970 7265 7102 6355 2419 -1879 -4369 -4596 -1929 2121 3190 4282 6508 7562 5188 977
16594I77M8K400j923j905L69J995L654K001o37r92L311J247l018Q58J465l603
$$ 977 1025 3425 1502 -403 -34 1961 5615 7616 6979 5987 9298 10545 7527 8385 9850 6247
16578F247r16J585J988R35j176m851k973K867K662k723J258J773R01o50j832j064
$$ 6247 5331 6916 8904 9839 8663 3812 839 3706 6368 3645 4903 6676 7577 6927 5095 4031
16562D031K27K178N9n254k271l020J782j23n08K717k991j341M116l95l301Q82
$$ 4031 4258 6436 6495 1241 -1030 -4050 -2268 -2391 -2899 -182 -3173 -4514 -398 -793 -4094 -3212
16546c212J749J489J966k221j055Q04j28n065j557M553O315J548K179j833q74
$$ -3212 -1463 26 1992 -229 -1284 -480 -608 -5673 -7230 -2677 3638 5186 7365 5532 4658
16531D658M695j168J096Ll052m616q72M47K354P090r97n288o308K375J336k375
$$ 4658 9353 8185 9281 9284 6232 1616 744 1191 3545 10635 9638 4350 -1958 417 1753 -622
16515f22j849j830k233j679L132J351L829l517l88j204j590j305K990r4l200j071
$$ -622 -2471 -4301 -6534 -8213 -5081 -3730 99 -3418 -3806 -5010 -6600 -7905 -4915 -5009 -8209 -9280
16499i280M051q23M025L815j308m567l661J847K797k321m27K89R38k679J60j06
$$ -9280 -5229 -6052 -2027 1788 480 -4087 -7748 -5901 -3104 -5425 -5852 -5563 -4625 -7304 -7144 -7250
16483g250k328P35o74K05L515K847L246j918j900K012K728J187l29j152k912m112
$$ -7250 -9578 -8843 -9517 -9312 -5797 -2950 296 -1622 -3522 -1510 1218 2405 2076 924 -1988 -6100
16467f100l346j91K332K773j496p67l52m099k920N80J779M694N047O583L842j757
$$ -6100 -9446 -9637 -7305 -4532 -6028 -6795 -7147 -11246 -14166 -13586 -11807 -7113 -2066 4517 8359 6602
16451F602k784o25l541O75N21r26m479k601J374K698p43P43K159j290k568M098
$$ 6602 3818 3193 -348 327 848 -78 -4557 -7158 -5784 -3086 -3829 -3086 -927 -2217 -4785 -687
16435f87L218m73l530j187j275J408L069j862J970J345L381l378K78J428n39j041
$$ -687 2531 2058 -1472 -2659 -3934 -2526 543 -1319 651 1996 5377 1999 2277 3705 3166 2125
16419B125K84j849n832m609P93N067J621m027M66m56J631j455J736J94L1O70O654
$$ 2125 2409 560 -5272 -9881 -9088 -4021 -2400 -6427 -5961 -6417 -4786 -6241 -4505 -4311 -4280 -3610 3044
16402C044L59j219N44K159k642l560p60l791n70L274K062k45K373K91m929k219
$$ 3044 3403 2184 2728 4887 2245 -1315 -2075 -5866 -6436 -3162 -1100 -1345 1028 1319 -3610 -5829
16386e829j637k740J400N630j408j869r43K224R12j113J017M936k9r79J800j76
$$ -5829 -7466 -10206 -8806 -3176 -4584 -6453 -7396 -5172 -4260 -5373 -4356 580 551 -428 1372 1196
16370A196j614J530l1j687j387J018L112j457l912q94K978M81J394K69l177J474
$$ 1196 -418 1112 1081 -606 -1993 -975 2137 680 -3232 -4126 -1148 -667 727 996 -2181 -707
16354g07K52n227k199j046K636K946K515O601J380J212l707l039L121r07k777
$$ -707 -455 -5682 -7881 -8927 -6291 -3345 -830 5771 7151 8363 4656 1617 4738 3831 1054
16339A054J869Q63j502j422L629L268J4203J4860J6720K2472K2312K3110J8247
$$ 1054 2923 3786 2284 862 4491 7759 21962 36822 53542 76014 98326 121436 139683
16326A39683J0694o60j0676j4554j6307k2286j7873j0393r365j2067j1027m365
$$ 139683 150377 149717 139041 124487 108180 85894 68021 57628 48263 36196 25169 20804
16314B0804l319j827n735k591l70j53j892n99k708J61K685l310k814l448j975
$$ 20804 17485 15658 9923 7332 6962 6809 4917 4318 1610 1771 4456 1146 -1668 -5116 -7091
16299g091N055K820M278O386M08o904j628P27l284j458k36N282L422J502M909
$$ -7091 -2036 784 5062 11448 11856 4952 3324 4051 767 -691 -927 4355 7777 9279 14188
16284A4188M812Q837J3433J9960J9428K2821K3832J4112O250k603m302j1131k4012
$$ 14188 19000 27837 41270 61230 80658 103479 127311 141423 147673 145070 140768 129637 105625
16271A05625k3735j6179k0038j4999r766m86k532o664l666j296k088l451p85j453
$$ 105625 81890 65711 45673 30674 20908 20422 17890 11226 7560 6264 4176 725 -60 -1513
16257a513k133J616m17k320J927J514Rl082j320J090L653J096k337j680K052M78
$$ -1513 -3646 -2030 -2447 -4767 -2840 -1326 -1317 -4399 -5719 -4629 -976 120 -2217 -3897 -1845 -1367
16241a367pK06j365q71k365J185K198P80Q88o26j848o430q42L430k387j808M018
$$ -1367 -1374 -1168 -2533 -3404 -5769 -4584 -2386 -1606 -718 -1344 -3192 -9622 -10464 -7034 -9421 -11229 -7211
16224g211J531K49j546L077m261l587J155L752K223K704K89j053j054L298K335
$$ -7211 -5680 -5431 -6977 -3900 -8161 -11748 -10593 -6841 -4618 -1914 -1625 -2678 -3732 -434 1901
16209A901o878n270R92R95k497J745M320O48j15K905k893k777r71K16K758k250
$$ 1901 -4977 -10247 -9255 -8260 -10757 -9012 -4692 -4044 -4159 -1254 -4147 -6924 -7895 -7679 -4921 -7171
16193g171j808L103K166l358p23L320K804L99K00k757l34M20j764j506j548k46
$$ -7171 -8979 -5876 -3710 -7068 -7791 -4471 -1667 -1268 -1068 -3825 -4159 -3739 -5503 -7009 -8557 -8803
16177h803J885O589j913m806k114J286J486L985l128k209n95J259K036k701l550
$$ -8803 -6918 -329 -2242 -7048 -9162 -7876 -6390 -2405 -5533 -7742 -8337 -7078 -5042 -7743 -11293
16162a1293n70J250J190J263M905O37L2m79K031k05K67k071j887J881K682l918
$$ -11293 -11863 -10613 -9423 -8160 -3255 -2618 -2586 -3065 -1034 -1239 -972 -3043 -4930 -3049 -367 -4285
16146d285k308M50K844p91r5j461j340M508M249J6k441n16q33k447j626J727M05
$$ -4285 -6593 -6143 -3299 -4090 -4185 -5646 -6986 -2478 1771 1787 -654 -1170 -2003 -4450 -6076 -4349 -3944
16129c944k498k745J250N130J970l361j192K69P90J391l704j666j075J238O87
$$ -3944 -6442 -9187 -7937 -2807 -837 -4198 -5390 -5121 -4331 -2940 -6644 -8310 -9385 -8147 -7460
16114g460L836j171k050J471L062J500J361k067n27K440O273m084m499k244p05
$$ -7460 -3624 -4795 -6845 -5374 -2312 -812 549 -1518 -2045 395 6668 2584 -1915 -4159 -4864
16099d864l909l050J214M843M230k81l568l596j953L653l268j381M840M47l792
$$ -4864 -8773 -11823 -10609 -5766 -1536 -1817 -5385 -8981 -10934 -7281 -10549 -11930 -7090 -6643 -10435
16084a0435l537O888L954j566j257r09l780L639L261m441k632J991P90J480j042
$$ -10435 -13972 -7084 -3130 -4696 -5953 -6862 -10642 -7003 -3742 -8183 -10815 -8824 -8034 -6554 -7596
16069g596j561K902R23J715j77L059l189o00J712J168q84Q23K036m13l656J299
$$ -7596 -9157 -6255 -5332 -3617 -3794 -735 -3924 -4524 -2812 -1644 -2528 -1705 331 -82 -3738 -2439
16053b439P36j62L610J526j017m081k146l412J7k664J074K348j087n07M753J593
$$ -2439 -1703 -1865 1745 3271 2254 -1827 -3973 -7385 -7368 -10032 -8958 -6610 -7697 -8204 -3451 -1858
16037a858k506j40l9M01J413L108l172J656j281k860p46j461l844j325M931k29
$$ -1858 -4364 -4504 -4543 -4142 -2729 379 -2793 -1137 -2418 -5278 -6024 -7485 -11329 -12654 -7723 -7952
16021g952k14N693L908m027j581M26L38k027K134J707K25j269K524q76k620J194
$$ -7952 -8166 -2473 1435 -2592 -4173 -3747 -3409 -5436 -3302 -1595 -1370 -2639 -115 -991 -3611 -2417
16005b417O16k080m428p62L540r40j602K83L642J014J51Q26J960k060j694O98
$$ -2417 -1801 -3881 -8309 -9071 -5531 -6471 -8073 -7790 -4148 -3134 -2983 -2157 -197 -2257 -3951 -3253
15989c253M479M15K963q73K326J243k901k906l082l544j191L044M434k2j665k755
$$ -3253 1226 1641 4604 3731 6057 7300 4399 1493 -1589 -5133 -6324 -3280 1154 1132 -533 -3288
15973c288n92k408o041J809O220k703j779O036q77j64K32O11K101k692M71j019
$$ -3288 -3880 -6288 -12329 -10520 -4300 -7003 -8782 -2746 -3623 -3787 -3555 -2944 -843 -3535 -3064 -4083
15957d083j348l017j22K7M702K767N517J937J417j588n94k275P17m001o603n98
$$ -4083 -5431 -8448 -8570 -8543 -3841 -1074 4443 6380 7797 6209 5615 3340 4057 56 -6547 -7145
15941g145O85K390K393K449l085j038m459K923L662L71L217k714k387Q94l591
$$ -7145 -6460 -4070 -1677 772 -2313 -3351 -7810 -4887 -1225 -854 2363 -351 -2738 -1844 -5435
15926e435o670L300O307J143l421k999p70J726M698J677J614k27m62k004k10o911
$$ -5435 -12105 -8805 -2498 -1355 -4776 -7775 -8545 -6819 -2121 -444 1170 943 481 -1523 -1733 -8644
15910h644m707L927k1j122J06k761L244J780k815p58J316o9M971K673j817k794
$$ -8644 -13351 -9424 -9445 -10567 -10461 -13222 -9978 -8198 -11013 -11771 -10455 -10524 -5553 -2880 -4697 -7491
15894g491l240K405J229j677K952O86m099J83O050J77n308l452O628N388j567
$$ -7491 -10731 -8326 -7097 -8774 -5822 -5136 -9235 -9052 -3002 -2825 -8133 -11585 -4957 431 -1136
15879a136l475k20k879p78M281M312K547R87j852l296j394j508k236N54R68K899
$$ -1136 -4611 -4831 -7710 -8488 -4207 105 2652 3639 1787 -1509 -2903 -4411 -6647 -6093 -5125 -2226
15863b226k339N12J268N09J407J290l142n355j317M21O329L632j995j143k855
$$ -2226 -4565 -4053 -2785 -2276 -869 421 -2721 -8076 -9393 -8972 -2643 989 -1006 -2149 -5004
15848e004j869J841K48L440J188J881k957k132l348l195k9J493l66Q33J03L111
$$ -5004 -6873 -5032 -4784 -1344 -156 1725 -1232 -3364 -6712 -9907 -9936 -8443 -8809 -7976 -7873 -4762
15832d762K627j095j840j580o30L136K91L808j045l372m0J39j105j009K33J227
$$ -4762 -2135 -3230 -5070 -6650 -7280 -4144 -3853 -45 -1090 -4462 -4502 -4363 -5468 -6477 -6244 -5017
15816e017l42n49l842l874L298J487L950K371l264k088K330K644l542m329p94
$$ -5017 -5359 -5908 -9750 -13624 -10326 -8839 -4889 -2518 -5782 -7870 -5540 -2896 -6438 -10767 -11561
15801a1561j332M137O232k046n318k158J495j482L367K064M557jL92J424J657
$$ -11561 -12893 -8756 -2524 -4570 -9888 -12046 -10551 -12033 -8666 -6602 -2045 -2046 -1654 -230 1427
15786A427l491n367j621k487L320O177J796m526k706j683L87k076R48J476k0R55
$$ 1427 -2064 -7431 -9052 -11539 -8219 -2042 -246 -4772 -7478 -9161 -8774 -10850 -9902 -8426 -8446 -7491
15770g491L589O133L743l974n548J967j823k242K194l56L255L065K01k276l691
$$ -7491 -3902 2231 5974 2000 -3548 -1581 -3404 -5646 -3452 -3808 -553 2512 2713 437 -3254
15755c254k248J237l026j545M73j3l74k61k76L054L29j215k202J389K308J140
$$ -3254 -5502 -4265 -7291 -8836 -8363 -8376 -8750 -9011 -9287 -6233 -5904 -7119 -9321 -7932 -5624 -4484
15739d484P22j086j99L561k94o64l162j978m514m116L927M796J81j604P92K242
$$ -4484 -3762 -4848 -5047 -1486 -1780 -2444 -5606 -7584 -12098 -16214 -12287 -7491 -7310 -8914 -8122 -5880
15723e880L143l390j836K829K338K67j000R3m50l365l909J370L113L006L01l276
$$ -5880 -2737 -6127 -7963 -5134 -2796 -2529 -3529 -3436 -3886 -7251 -11160 -9790 -6677 -3671 -3370 -6646
15707f646j534k993j117J454M379J762l928j190P99J102Q9J033j99L07l85J122
$$ -6646 -8180 -11173 -12290 -10836 -6457 -4695 -8623 -9813 -9014 -7912 -7823 -6790 -6989 -6682 -7067 -5945
15691e945m13J592Q98k621j321K800n82K48M111K098n161j725M267m77k298r89
$$ -5945 -6358 -4766 -3868 -6489 -7810 -5010 -5592 -5344 -1233 865 -4296 -6021 -1754 -2231 -4529 -5518
15675e518j74K530O145j169l77j319n981m599r16K767N100m6l398n18L715J034
$$ -5518 -5692 -3162 2983 1814 1437 118 -5863 -10462 -11378 -8611 -3511 -3557 -6955 -7473 -3758 -2724
15659b724j677K689m48k833M581N822p78j981l567l610k971q23J898N386j255
$$ -2724 -4401 -1712 -2160 -4993 -412 5410 4632 2651 -916 -4526 -7497 -8320 -6422 -1036 -2291
15644b291l372K80k56k773K472J144P55J079K02K407L89j224K837l083k930j153
$$ -2291 -5663 -5383 -5639 -8412 -5940 -4796 -4041 -2962 -2760 -353 36 -1188 1649 -1434 -4364 -5517
15628e517n22J008m33M602P28j206L062o786m227J008J308m75k78K850J777J48
$$ -5517 -6039 -5031 -5464 -862 -134 -1340 1722 -5064 -9291 -8283 -6975 -7450 -7728 -4878 -3101 -2953
15612b953P9r19o12k01m345M490L647J673l774n060k476K340M007r79K539L512
$$ -2953 -2874 -3793 -4405 -4606 -8951 -4461 -814 859 -2915 -7975 -10451 -8111 -4104 -5083 -2544 968
15596I68P86k087m115k653M06R0K060m148m031k50L558N563J668m95n40j23K043
$$ 968 1754 -333 -4448 -7101 -6695 -6605 -4545 -8693 -12724 -12974 -9416 -3853 -2185 -2680 -3220 -3343 -1300
15579a300k054l070J274K360j523j642m200r27J724K468N74J115j482l97O35M277
$$ -1300 -3354 -6424 -5150 -2790 -4313 -5955 -10155 -11082 -9358 -6890 -6316 -5201 -6683 -7080 -6445 -2168
15563b168j73J155J27M366m791n597K850l897j736N091N280m64n789R54J589k416
$$ -2168 -2341 -1186 -1059 3307 -1484 -7081 -4231 -8128 -9864 -4773 507 43 -5746 -4792 -3203 -5619
15547e619l708K20L029k00K40l47L136K125j438j292O1l65J959q98m311j903j203
$$ -5619 -9327 -9107 -6078 -6278 -6038 -6385 -3249 -1124 -2562 -3854 -3793 -4158 -2199 -3097 -7408 -9311 -10514
15530a0514K321M677J594j512o27J878l07l943j131K013M746Q31O2l353j134J128
$$ -10514 -8193 -3516 -1922 -3434 -4061 -2183 -2490 -6433 -7564 -5551 -805 26 88 -3265 -4399 -3271
15514c271M682k397r83l998L79J143M633L937k667m434K08j767l551j263M080
$$ -3271 1411 -986 -1969 -5967 -5588 -4445 188 4125 1458 -2976 -2768 -4535 -8086 -9349 -5269
15499e269L042O60j27L35J430L750r56J253k262n825M74k337J035J487K175j32
$$ -5269 -2227 -1567 -1694 -1359 71 3821 2865 4118 1856 -3969 -3495 -5832 -4797 -3310 -1135 -1267
15483a267l046n459l571J121O345l36k488L67K204L558P670O11n179j352j631
$$ -1267 -4313 -9772 -13343 -12222 -5877 -6213 -8701 -8334 -6130 -2572 5098 5709 530 -822 -2453
15468b453m124k72P60J197M074J35l32J197j950j882m22j54L614L36J266k335
$$ -2453 -6577 -6849 -6089 -4892 -818 -683 -1015 182 -1768 -3650 -4072 -4226 -612 -276 990 -1345
15452a345j584J303r64j836j419M52L744J212l192K951R45l735k879L86O831j68
$$ -1345 -2929 -1626 -2590 -4426 -5845 -5393 -1649 -437 -3629 -678 267 -3468 -6347 -5961 870 702
15436G02j116n284r19K356K440k473M965K70j231k893n568j393J673J716m55l48
$$ 702 -414 -5698 -6617 -4261 -1821 -4294 671 941 -290 -3183 -8751 -10144 -8471 -6755 -7210 -7558
15420g558M304k755n81O132j552m17m011k567M265N58L33j984j325j478N230J325
$$ -7558 -3254 -6009 -6590 -458 -2010 -2427 -6438 -9005 -4740 -4182 -3849 -5833 -7158 -8636 -3406 -2081
15404b081j290j147l915J712O92J864K790K317L296M017k944p795m531N94K770
$$ -2081 -3371 -4518 -8433 -6721 -6029 -4165 -1375 942 4238 8255 5311 -2484 -7015 -6421 -3651
15389c651j405J08K395L971L277j625k970l874J714P101K486k571l336j170j365
$$ -3651 -5056 -4948 -2553 1418 4695 3070 100 -3774 -2060 5041 7527 4956 1620 450 -915
15374i15J370p81M01k424j31j661l526K912M683N529p88l012K308R98Q68l202
$$ -915 455 -326 75 -2349 -2480 -4141 -7667 -4755 -72 5457 4669 1657 3965 4963 5831 2629
15358B629o58j138K34l365l318N48J594l143J198J854L201O16O16l028n46p2L199
$$ 2629 1971 833 1067 -2298 -5616 -5068 -3474 -6617 -5419 -3565 -364 252 868 -2160 -2706 -2778 421
15341D21j421k073J499k975J102K49j768k399L120J157j058R83K301o533n55M667
$$ 421 -1000 -3073 -1574 -4549 -3447 -3198 -4966 -7365 -4245 -3088 -4146 -3163 -862 -7395 -7950 -3283
15325c283j738l292o54L143K65L286k75L4J299j483l871J074M294K141K05k417
$$ -3283 -5021 -8313 -8967 -5824 -5559 -2273 -2548 -2514 -1215 -2698 -6569 -5495 -1201 940 1145 -1272
15309a272m153J409J404k395j587j183J870J664M218r39j821k493L795K481o070
$$ -1272 -5425 -4016 -2612 -5007 -6594 -7777 -5907 -4243 -25 -964 -2785 -5278 -1483 998 -5072
15294e072m55K243J930p45k438o34k896o50J516J947K143P97J327J289J332k090
$$ -5072 -5527 -3284 -1354 -2099 -4537 -5171 -8067 -8717 -7201 -5254 -3111 -2314 -987 302 1634 -456
15278d56J447k34J62J832j887k487j301j191k590j056q7J818p23n682N76M485
$$ -456 991 757 919 2751 864 -1623 -2924 -4115 -6705 -7761 -7848 -6030 -6753 -12435 -11859 -7374
15262g374M185K477j71k945M294Q67j825J873k407n566o23J67N292L194l148k842
$$ -7374 -3189 -712 -883 -3828 466 1333 -492 1381 -1026 -6592 -7215 -7048 -1756 1438 -1710 -4552
15246d552k52K559J350k810o091j700K436O390L456j34j287n53J605J510k881
$$ -4552 -4804 -2245 -895 -3705 -9796 -11496 -9060 -2670 786 652 -635 -1188 417 1927 -954
15231i54k216k493J333J571N4n09Q98N525M876l957k497l511m807k739R72R47
$$ -954 -3170 -5663 -4330 -2759 -2705 -3214 -2316 3209 8085 4128 1631 -1880 -6687 -9426 -8454 -7507
15215g507M859j401o45l75J74N76j033K084L3l659j606K186N184k616j243p25
$$ -7507 -2648 -4049 -4694 -5069 -4895 -4319 -5352 -3268 -3235 -6894 -8500 -6314 -1130 -3746 -4989 -5714
15199e714J033K083J339k883O69Q10L97N21j543J490k637m79L75j577J927N10
$$ -5714 -4681 -2598 -1259 -4142 -3473 -2663 -2266 -1745 -3288 -1798 -4435 -4914 -4539 -6116 -4189 -3679
15183c679o95O47L601j665r78P564k000l944J679j583k383O3K239j944m016L513
$$ -3679 -4374 -3727 -126 -1791 -2769 4795 2795 -1149 530 -1053 -3436 -3373 -1134 -3078 -7094 -3581
15167c581N798K047l63o158nj353m261K342M642N888L17l509m398l282o274k79
$$ -3581 2217 4264 3901 -2257 -2262 -3615 -7876 -5534 -892 4996 5313 1804 -2594 -5876 -12150 -12429
15151a2429l48K603N217J204j357J331k588M700O770k958m341J300l101O69m98
$$ -12429 -12777 -10174 -4957 -3753 -5110 -3779 -6367 -1667 5103 2145 -2196 -896 -3997 -3328 -3826
15136c826j443j599Q73L983L590l833k889j448L198k974k900K265k050M501J414
$$ -3826 -5269 -6868 -5995 -2012 1578 -2255 -5144 -6592 -3394 -6368 -9268 -7003 -9053 -4552 -3138
15121c138N289M370j904k255m59k299l873P807P33j386m23j23k99j692L103k472
$$ -3138 2151 6521 4617 2362 1903 -396 -4269 3538 4271 2885 2462 2339 2040 348 3451 979
15105I79m297L12K604q01K08K113J83R57k69l87m032l043J708j704m259K174L557
$$ 979 -3318 -3006 -402 -1203 -995 1118 1301 2258 1989 1602 -2430 -5473 -3765 -5469 -9728 -7554 -3997
15088c997j210l841p54J968J559j965O93j773M101L044L484l009p31q35O04j909
$$ -3997 -5207 -9048 -9802 -7834 -6275 -8240 -7547 -9320 -5219 -2175 1309 -1700 -2431 -3266 -2662 -4571
15072d571P26L823k677l046j371j136M05O737N305P13l253L741k340j452k256
$$ -4571 -3845 -22 -2699 -5745 -7116 -8252 -7847 -1110 4195 4908 1655 5396 3056 1604 -652
15057f52m519J890k830q99K30l59J40J314r12j08J458P98K346k120m510p31N658
$$ -652 -5171 -3281 -6111 -7010 -6780 -7139 -6999 -5685 -6597 -6705 -5247 -4449 -2103 -4223 -8733 -9464 -3806
15040c806J964J148N86m684J532l528l177L201k630J209L518J736j737M378n107
$$ -3806 -1842 -694 -108 -4792 -3260 -6788 -9965 -6764 -9394 -8185 -4667 -2931 -4668 -290 -5397
15025e397m834M79M113O536k451J357L4K54J332j145k995k340o82N69j366k044
$$ -5397 -10231 -9752 -5639 897 -1554 -197 -163 91 1423 278 -2717 -5057 -5739 -5170 -6536 -8580
15009h580n93K310J134k378K13K691m56K550j100k537q71K946n357l078J14N173
$$ -8580 -9173 -6863 -5729 -8107 -7894 -5203 -5659 -3109 -4209 -6746 -7617 -4671 -10028 -13106 -12992 -7819
14993g819J338J383k47L574M256J694j067J837m466o741N268M503k400k614k441
$$ -7819 -6481 -5098 -5345 -1771 2485 4179 3112 4949 483 -6258 -990 3513 1113 -1501 -3942
14978c942L615J717J539K962l030l828m008J78m280j954M26J359K551N207K472
$$ -3942 -327 1390 2929 5891 2861 -967 -4975 -4797 -9077 -11031 -10605 -9246 -6695 -1488 984
14963I84J224j707k65k44l149j408l505k633M447M377J821P36o85K534O36j397
$$ 984 2208 501 236 -8 -3157 -4565 -8070 -10703 -6256 -1879 -58 678 -7 2527 3163 1766
14947A766R09J994n80pk123m444l472l226K490J979o4K304L729j873m904K355
$$ 1766 2675 4669 4089 4082 1959 -2485 -5957 -9183 -6693 -4714 -4778 -2474 1255 -618 -5522 -3167
14931c167M048K769m498k981l562K519L956n08K23J347K21k52j838o84K875M65
$$ -3167 881 3650 -848 -3829 -7391 -4872 -916 -1424 -1201 146 367 115 -1723 -2407 468 933
14915I33q14l094J478j083j285J680o59p14N443N626k071p195k435o25J471P44
$$ 933 119 -2975 -1497 -2580 -3865 -2185 -2844 -3558 1885 7511 5440 -1755 -4190 -4815 -3344 -2600
14899b600P39J376k797l471J806K829J37m292j687L197k21O95R05K946M860O88
$$ -2600 -1861 -485 -3282 -6753 -4947 -2118 -1981 -6273 -7960 -4763 -4984 -4289 -3384 -438 4422 5110
14883E110j740p59J471p41l199n62M145n534j433j525m350K992L790m92R28q66
$$ 5110 3370 2611 4082 3341 142 -420 3725 -1809 -3242 -4767 -9117 -6125 -2335 -2827 -1899 -2765
14867b765l04j473P98K938K980Q2k879k331J113O81j785O33Q59J589n41J368l051
$$ -2765 -3069 -4542 -3744 -806 2174 2256 -623 -2954 -1841 -1160 -2945 -2312 -1453 136 -405 963 -2088
14850b088k809J629J282k713j481M02K971L387j338j223Q95l07j669K197L91j182
$$ -2088 -4897 -3268 -1986 -4699 -6180 -5778 -2807 580 -758 -1981 -1086 -1393 -3062 -865 -474 -1656
14834a656m012n051L6N080L518J068M303l12K646J527K676j981l493j891j363
$$ -1656 -5668 -10719 -10683 -5603 -2085 -1017 3286 2974 5620 7147 9823 7842 4349 2458 1095
14819A095K842K197j18o22l600Lj295l460K810R37J601l800m096j341K565N171
$$ 1095 3937 6134 6016 5394 1794 1797 502 -2958 -148 789 2390 -1410 -5506 -6847 -4282 889
14803H89o05J82p04K144j807N54K27O93r93k704k453J842j667K36L113M149N40
$$ 889 284 466 -238 1906 99 653 880 1573 580 -2124 -4577 -2735 -4402 -4166 -1053 3096 3636
14786C636J627j081m097k849J619k741k520k4L598J703K43K109L803o70j560k659
$$ 3636 5263 4182 85 -2764 -1145 -3886 -6406 -6430 -2832 -1129 -886 1223 5026 4356 2796 137
14770A37k014J072r42k48M83p68n76L51M700R35l281j91L39k16k625k474k106
$$ 137 -1877 -805 -1747 -1995 -1512 -2280 -2856 -2505 2195 3130 -151 -342 -3 -219 -2844 -5318 -7424
14753g424P93k065J663o99J865N17L31K91J075J302j750J205OJ26k061K737L80
$$ -7424 -6631 -8696 -7033 -7732 -5867 -5350 -5019 -4728 -3653 -2351 -4101 -2896 -2890 -2764 -4825 -2088 -1708
14736a708k960M69L671J822J823K06n028k279m37l589O89j97N175j518j376K500
$$ -1708 -4668 -4199 -528 1294 3117 3323 -1705 -3984 -4421 -8010 -7321 -7518 -2343 -3861 -5237 -2737
14720b737K43J787j569M72J46J658p62J057K116o5M18l932l833P63j598k186J856
$$ -2737 -2494 -707 -2276 -1804 -1658 0 -762 295 2411 2346 2764 -1168 -5001 -4238 -5836 -8022 -6166
14703f166j528l875R67M104O361N445k808m00J582M80k138L15m720m877K28J955
$$ -6166 -7694 -11569 -10602 -6498 -137 5308 2500 2100 3682 4162 2024 2339 -2381 -7258 -7030 -5075
14687e075K379J622L632K236O398n08n757k700N59J181j180k102J836J964j627
$$ -5075 -2696 -1074 2558 4794 11192 10684 4927 2227 2786 3967 2787 685 2521 4485 2858
14672B858m469l466K729L056J346n051j213j547L330K252k854r3O4j857k632k409
$$ 2858 -1611 -5077 -2348 708 2054 -2997 -4210 -5757 -2427 -175 -3029 -3122 -3058 -4915 -7547 -9956
14656i956L727J400K700M841k980p40J604P61J740J433J358K467n52k612l128
$$ -9956 -6229 -4829 -2129 2712 -268 -1008 596 1357 3097 4530 5888 8355 7803 5191 2063
14641B063M13L84p91m949L656K367k303l67n05j423j010J106J974J211J941p30
$$ 2063 2476 2860 2069 -2880 776 3143 840 473 -32 -1455 -2465 -1359 615 1826 3767 3037
14625C037j584K674q03l38o12k789j629L370l401m584j774J968L485K573L170
$$ 3037 1453 4127 3324 2986 2374 -415 -2044 1326 -2075 -6659 -8433 -6465 -2980 -407 2763
14610B763J821k023j793n39r2k610j057l95k425L149K039N65K113K326J337k991
$$ 2763 4584 2561 768 229 137 -2473 -3530 -3925 -6350 -3201 -1162 -597 1516 3842 5179 2188
14594B188N58k26Q1K258K618l178o226n726R97M058R88o91K933K107j14j449j73
$$ 2188 2746 2520 2601 4859 7477 4299 -1927 -7653 -6656 -2598 -1610 -2301 632 2739 2625 1176 1003
14577A003J969Q94l99j77M554N49k603p271M17M654j426m556k061k70K85J668
$$ 1003 2972 3866 3467 3290 7844 8393 5790 -1481 -1064 3590 2164 -2392 -4453 -4723 -4438 -2770
14561b770k099j293P78j392k907K326N01l43J962J84J324L442r76j891J51p04
$$ -2770 -4869 -6162 -5384 -6776 -9683 -7357 -6856 -7199 -5237 -5053 -3729 -287 -1263 -3154 -3003 -3707
14545c707J843J301Q74J277j347J22Q71j294m270j621L764J028p810m081J400
$$ -3707 -1864 -563 311 1588 241 363 1234 -60 -4330 -5951 -2187 -1159 -8969 -13050 -11650
14530a1650M752K487K54k260l6O530M09j434j101k48r03L500J419m122n566j286
$$ -11650 -6898 -4411 -4157 -6417 -6453 77 486 -948 -2049 -2297 -3200 300 1719 -2403 -7969 -9255
14514i255L034J244L83L054Q89J320j611j007J880L624O51k1n207N8P77J724J747
$$ -9255 -6221 -4977 -4594 -1540 -651 669 -942 -1949 -69 3555 4206 4185 -1022 -964 -187 1537 3284
14497C284M465k669l999J528J719j813k984j013l875K054L198l310k189K783K888
$$ 3284 7749 5080 1081 2609 4328 2515 -469 -1482 -5357 -3303 -105 -3415 -5604 -2821 67
14482F7J846J710k818n556l43M547k288k542j769Q00K204P17k351J11N403M628
$$ 67 1913 3623 805 -4751 -5094 -547 -2835 -5377 -7146 -6346 -4142 -3425 -5776 -5665 -262 4366
14466D366M66k601l525l5J869K560O59K833j543n719m411P31l704J303N492L087
$$ 4366 4832 2231 -1294 -1329 540 3100 3759 6592 5049 -670 -5081 -4350 -8054 -6751 -1259 1828
14450A828J729k085j396J842L046p75k084m22Q04l814k755M48P05k99J407M962
$$ 1828 3557 1472 76 1918 4964 4189 2105 1683 2487 -1327 -4082 -3634 -2929 -3228 -1821 3141
14434C141M276r51O08m15m001o20j205K117k37j003l202J69K876P59j132m23j212
$$ 3141 7417 6466 7074 6659 2658 2038 833 2950 2713 1710 -1492 -1323 1553 2312 1180 757 -455
14417d55K189K445N74M67m768K187J077L43P52O37j83l100N75k490k754p52M477
$$ -455 1734 4179 4753 5220 452 2639 3716 4059 4811 5448 5265 2165 2740 250 -2504 -3256 1221
14400A221N62J959k113l309L388l54j675p47j872j461J507O2M200K289J332n089
$$ 1221 1783 3742 1629 -1680 1708 1354 -321 -1068 -2940 -4401 -2894 -2832 1368 3657 4989 -100
14384a00k283K480R42k690j218k40o71L671or14J280k41J029j334O9J592N67R20
$$ -100 -2383 97 1039 -1651 -2869 -3109 -3780 -109 -115 -1029 251 10 1039 -295 -226 1366 1933 2853
14366B853J495p95J848J93l020l456o027N2j920M303K841L93O98L794K143N53
$$ 2853 4348 3553 5401 5594 2574 -882 -6909 -6857 -8777 -4474 -1633 -1240 -542 3252 5395 5948
14350E948p31o77J808l413o22J598j85L655L537J283o64l640k380r30o025k066
$$ 5948 5217 4540 6348 2935 2313 3911 3726 7381 10918 12201 11537 7897 5517 4587 -1438 -3504
14334c504j297J077L92P411L278j102k870J031l114j987K529L040j612M08k480
$$ -3504 -4801 -3724 -3332 4079 7357 6255 3385 4416 1302 -685 1844 4884 3272 3680 1200
14319A200k349j28k270m149M563M879k01K13k822J183J410j99n93m192k474M442
$$ 1200 -1149 -1277 -3547 -7696 -3133 1746 1545 1758 -1064 119 1529 1330 737 -3455 -5929 -1487
14303a487K850l800k316J691j592k60O240J919M99j294n523l08K79K44k56L584
$$ -1487 1363 -2437 -4753 -3062 -4654 -4914 1326 3245 3744 2450 -3073 -3381 -3102 -2858 -3114 470
14287D70M334K099j572n191l284l154J887P670L004l481l526K223J889j230m099
$$ 470 4804 6903 5331 140 -3144 -6298 -4411 3259 6263 2782 -744 1479 3368 2138 -1961
14272a961o35O51j637J023N124L744k047l313o72l52j274j496l156L09K03M350
$$ -1961 -2596 -1945 -3582 -2559 2565 6309 4262 949 277 -75 -1349 -2845 -6001 -5692 -5489 -1139
14256a139K561n33j956K031j330j301J193K501k649l355K81K925k666j051j279
$$ -1139 1422 889 -1067 964 -366 -1667 -474 2027 -622 -3977 -3696 -771 -3437 -4488 -5767
14241e767M426o27k472M409M698r75l167k21L417n44n544n21J824J513L5k451
$$ -5767 -1341 -1968 -4440 -31 4667 3692 525 304 3721 3177 -2367 -2888 -1064 449 484 -1967
14225a967k075L37j098j171M219J745J751K060J383k837L032K259q95J873J227
$$ -1967 -4042 -3705 -4803 -5974 -1755 -10 1741 3801 5184 2347 5379 7638 6743 8616 9843
14210I843k079j431m6J521l583k115k059J76k00N04K170p83l584p83L250J928
$$ 9843 7764 6333 6287 7808 4225 2110 51 227 27 531 2701 1918 -1666 -2449 801 2729
14194B729K77L54j644l413r36K299J434J16J725O16k12l588k666L578R09M06j802
$$ 2729 3006 3360 1716 -1697 -2633 -334 1100 1216 2941 3557 3345 -243 -2909 669 1578 1984 182
14177A82j488K448L083J783L62K206L598o825n832k114L95L135K599J204o92r33
$$ 182 -1306 1142 4225 6008 6370 8576 12174 5349 -483 -2597 -2202 933 3532 4736 4044 3111
14161C111r72j229m90L18j039k165J056k60j479r54L540M678l708n5L675J840
$$ 3111 2139 910 420 738 -301 -2466 -1410 -1670 -3149 -4103 -563 4115 407 352 4027 5867
14145E867m987l412r71J670k575Q60N939K220L784p95l078l168l443p92J7P36
$$ 5867 880 -2532 -3503 -1833 -4408 -3548 2391 4611 8395 7600 4522 1354 -2089 -2881 -2864 -2128
14129b128J348r96j218K671O057L859m837l579j18o18M12n8k397n05J986K82K67
$$ -2128 -780 -1776 -2994 -323 5734 9593 4756 1177 1059 441 853 795 -1602 -2107 -121 161 428
14112D28n18M00N200L748j572l295L40K539j758k218n81p69J486j638n548M19
$$ 428 -90 310 5510 9258 7686 4391 4731 7270 5512 3294 2713 1944 3430 1792 -3756 -3337
14096c337j762j954j798m53L276J9L40L647J444J247M381J551k228l756k739l615
$$ -3337 -5099 -7053 -8851 -9304 -6028 -6009 -5669 -2022 -578 669 5050 6601 4373 617 -2122 -5737
14080e737J739K883K562J775l314j336R71k087l370K079R49P18K535l495m538
$$ -5737 -3998 -1115 1447 3222 -92 -1428 -457 -2544 -5914 -3835 -2886 -2168 367 -3128 -7666
14065g666M072p89J825J998q87N833J796l118M7J678l506j8M482n07l844L302
$$ -7666 -3594 -4383 -2558 -560 -1447 4386 6182 3064 3111 4789 1283 1265 5747 5240 1396 4698
14049D698O36j472Q35P09m822m06j873J242k78L793l856j828L238J380r64L427
$$ 4698 5334 3862 4697 5406 584 178 -1695 -453 -731 3062 -794 -2622 616 1996 1032 4459
14033D459J5J119j109k987n069J192J438K509k88M27J860J543k303k401L95J115
$$ 4459 4474 5593 4484 1497 -3572 -2380 -942 1567 1279 1706 3566 5109 2806 405 800 1915
14017A915l10J256N1m071J207K284m206l620O006K661n62Q6j791l210K293j198
$$ 1915 1605 2861 2912 -1159 48 2332 -1874 -5494 512 3173 2611 2697 906 -2304 -11 -1209
14001a209K499K429j93M8M244K845k644L240Q27k775n067n043r90N93L520m88
$$ -1209 1290 3719 3526 3574 7818 10663 8019 11259 12086 9311 4244 -799 -1789 -1196 2324 1836
13985A836k919J632J449J34l358l295k353L956L973M2j512k789L33L404M729Q80
$$ 1836 -1083 549 1998 2132 -1226 -4521 -6874 -2918 1055 1097 -415 -3204 -2871 533 5262 6142
13969F142k835j485l540N201L473j648M62k136K02l554J702L465j6m362l225j645
$$ 6142 3307 1822 -1718 3483 6956 5308 5770 3634 3836 282 1984 5449 5433 1071 -2154 -3799
13953c799J258K101j038N92M98o30L988J639O59j088Q28m73Q60l18q68l675R19
$$ -3799 -2541 -440 -1478 -886 -388 -1018 2970 4609 5268 4180 5008 4535 5395 5077 4209 534 1453
13936A453K827P69J471o065j530K433l952L280O601K096K32n264j927l07k198
$$ 1453 4280 5049 6520 455 -1075 1358 -2594 686 7287 9383 9615 4351 2424 2117 -81
13921h1m64q53j21L89J069K91M416Q51Q12L62J61j186J500k241O09k46k473J788
$$ -81 -545 -1398 -1519 -1130 -61 230 4646 5497 6309 6671 6832 5646 7146 4905 5514 5268 2795 4583
13903D583o12J091m45l384K190J011k426O195j168n707j03j266j155p11J008O35
$$ 4583 3971 5062 4617 1233 3423 4434 2008 8203 7035 1328 1225 -41 -1196 -1907 -899 -264
13887b64J848L046K276J429K857l422m337K049J726j300L919m034k931J712Q93
$$ -264 1584 4630 6906 8335 11192 7770 3433 5482 7208 5908 9827 5793 2862 4574 5467
13872E467R01M36R16k941O2L983J250n849l479l971P25J444L433L941l725n15
$$ 5467 6368 6804 7720 4779 4841 8824 10074 4225 746 -3225 -2500 -1056 2377 6318 2593 2078
13856B078l43j692L559L008L88j754k579j245m516l26L123K406N06l422j738J363
$$ 2078 1735 43 3602 6610 6998 5244 2665 1420 -3096 -3422 -299 2107 2613 -809 -2547 -1184
13840a184R57k02N963j994m361k050K374J478O14j701k42q33K285L24J445k17
$$ -1184 -227 -429 5534 3540 -821 -2871 -497 981 1595 -106 -348 -1181 1104 1428 2873 2656
13824B656N48R64K237k309j987j517L934L097j360K227J623k983l576q60L63j032
$$ 2656 3204 4168 6405 4096 2109 592 4526 7623 6263 8490 10113 7130 3554 2694 3057 2025
13808B025n31R20K491J505n18k820o81k033R59M479K678J880k12p75l092l983
$$ 2025 1494 2414 4905 6410 5892 3072 2391 358 1317 5796 8474 10354 10142 9367 6275 2292
13792B292l333J218J028J067k484k3O83K657J847M73j062j454N14L476o74k380
$$ 2292 -1041 177 1205 2272 -212 -235 448 3105 4952 5425 4363 2909 3423 6899 6225 3845
13776C845j889K243j90j463m54J595q90n06J158K88l396k822K985K139Q72L934
$$ 3845 1956 4199 4009 2546 2092 3687 2797 2291 3449 3737 341 -2481 504 2643 3515 7449
13760G449L4k931k624o7l21L032j719j259r52K572n13j797J296K741J609k204
$$ 7449 7483 4552 1928 1861 1540 4572 2853 1594 642 3214 2701 904 2200 4941 6550 4346
13744D346K45l446l852M339J726k427j243K313K137J947J274J706m326N83K22
$$ 4346 4591 1145 -2707 1632 3358 931 -312 2001 4138 6085 7359 9065 4739 5322 5544
13729E544P83J931K596K531j946l342K355J321m147l421j277k184N44k0M384L1
$$ 5544 6327 8258 10854 13385 11439 8097 10452 11773 7626 4205 2928 744 1288 1268 5652 5683
13713E683j306p24M25L03j375l191N20K874P96J368R87j741l870k600P84K419
$$ 5683 4377 3653 4078 4381 3006 -185 335 3209 4005 5373 6360 4619 749 -1851 -1067 1352
13697A352L249k58l328m473O04K691K187J015L12l641J761N363L752J75m23j071
$$ 1352 4601 4343 1015 -3458 -2854 -163 2024 3039 3351 -290 1471 6834 10586 10761 10338 9267
13681I267j747P28R64R15J786K338K391n217o374P61L000k858k359J807j757J88
$$ 9267 7520 8248 9212 10127 11913 14251 16642 11425 5051 5812 8812 5954 3595 5402 3645 3833
13665C833M484J322n38k640K666m69K090O55k964j87k766J280k61m87P29k286
$$ 3833 8317 9639 9101 6461 9127 8658 10748 11403 8439 8252 5486 6766 6505 6018 6747 4461
13649D461p65j966K372O884L660j785j637j672j694J641K873k774o527J493M182
$$ 4461 3696 1730 4102 10986 14646 12861 11224 9552 7858 9499 12372 9598 3071 4564 8746
13634H746Q38p02L57Q99k589L004k591Q87J622K057k631k333k603J053o75o496
$$ 8746 9584 8882 9239 10138 7549 10553 7962 8849 10471 12528 9897 7564 4961 6014 5339 -1157
13618a157K562K017j487K883J13j878m110k667L508L703k042j914K289j747l393
$$ -1157 1405 3422 1935 4818 4931 3053 -1057 -3724 -216 3487 1445 -469 1820 73 -3320
13603c320K353K733K425J292o59K62j492J479j02j427n80o93K47m86j83o92J641
$$ -3320 -967 1766 4191 5483 4824 5086 3594 5073 4971 3544 2964 2271 2518 2032 1849 1157 2798
13586B798R28K739k67l053m38k322l32P49J411P76K436j137K320N201j180J887
$$ 2798 3726 6465 6198 3145 2707 385 53 802 2213 2989 5425 4288 6608 11809 10629 12516
13570A2516K960l014p42L862k152p060J053K269L683J788j926m313L049K343j049
$$ 12516 15476 12462 11720 15582 13430 6370 7423 9692 13375 15163 13237 8924 11973 14316 13267
13555A3267k593J65p45k482J816J945k748j473j778L519M087P83j186l420J483
$$ 13267 10674 10839 10094 7612 9428 11373 8625 7152 5374 8893 12980 13763 12577 9157 10640
13540A0640j265J609m38j800J483j22k387m26j58j642J602J287j906K131l927
$$ 10640 9375 10984 10546 8746 10229 10107 7720 7294 7136 5494 7096 8383 6477 8608 4681
13525D681R56K132L951L119j69j51k154k641l098j282k123L120J670R8r79k514
$$ 4681 5637 7769 11720 14839 14670 14519 12365 9724 6626 5344 3221 6341 8011 8109 7130 4616
13509D616j468r43j157J974J478P81M475M96J208J435O51m076j572r82M373J205
$$ 4616 3148 2205 1048 3022 4500 5281 9756 10252 11460 12895 13546 9470 7898 6916 11289 12494
13493A2494j354m496J554J488k710k753J640j24L458J323P26m252j129p66j014
$$ 12494 11140 6644 8198 9686 6976 4223 5863 5739 9197 10520 11246 6994 5865 5099 4085
13478D085K80J712O185k37k424j301m688N82j446j223O346M806l43N95k184l31
$$ 4085 4365 6077 12262 12025 9601 8300 3612 4194 2748 1525 7871 12677 12334 12929 10745 10414
13462A0414M150K73o747m111j439L435J384m638J065K212R29L63j484K624J264
$$ 10414 14564 14837 8090 3979 2540 5975 7359 2721 3786 5998 6927 7290 5806 8430 9694
13447I694r22m221K76j507q14o7Q1O75j455M540J245p33O05j613k330N3N64J307
$$ 9694 8772 4551 4827 3320 2506 2439 2520 3195 1740 6280 7525 6792 7397 5784 3454 3507 4071 5378
13429E378N005K39l580m181O87M075L810K406m534j002K71J137l32j173l564Q19
$$ 5378 10383 10622 7042 2861 3548 7623 11433 13839 9305 8303 8574 9711 9379 8206 4642 5461
13413E461M876K756j50j004O01j057K25j975k891M73J41L6k376k424J524j364
$$ 5461 10337 13093 12943 11939 12540 11483 11708 9733 6842 7315 7456 7492 5116 2692 4216 2852
13397B852j25L346l306M26O57L475R52k622J161J850j210J494K989j042k681N40
$$ 2852 2727 6073 2767 3193 3850 7325 8277 5655 6816 8666 7456 8950 11939 10897 8216 8756
13381H756k459j652L121M695j18K016K843l103j533m077j055J207N643K033l165
$$ 8756 6297 4645 7766 12461 12343 14359 17202 14099 12566 8489 7434 8641 14284 16317 13152
13366A3152K538k295j841n196p55J484J255K68J321j404q67J494K093k109n51
$$ 13152 15690 13395 11554 6358 5603 7087 8342 8610 9931 8527 7660 9154 11247 9138 8587
13351H587J936m57r5k728K988O634J19m260m472J22N331J435J298l243j517J546
$$ 8587 10523 10066 9971 7243 10231 16865 16984 12724 8252 8374 13705 15140 16438 13195 11678 13224
13335A3224J611O64l545n603k225J380J543M222J431n352L222K760O87K165k279
$$ 13224 14835 15499 11954 6351 4126 5506 7049 11271 12702 7350 10572 13332 14019 16184 13905
13320A3905r478o604j21l958k381Q24M338M129L713J320p51K657K163L80N29M507
$$ 13905 4427 -2177 -2298 -6256 -8637 -7813 -3475 654 4367 5687 4936 7593 9756 10136 10665 15172
13304A5172R48j824q697p096K285L958K136k046J379M682p26n937k018M97N207
$$ 15172 16120 14296 5599 -1497 788 4746 6882 4836 6215 10897 10171 4234 2216 2713 7920
13289G920K442L395J20p276l57P89R68J842L404J467l08l089l340k93k0k478q1
$$ 7920 10362 13757 13877 6601 6244 7033 8001 9843 13247 14714 14406 11317 7977 7684 7664 5186 5105
13272E105j888P00N886k32r75K423k414j043K888Q57J438J54K299j298p905J067
$$ 5105 3217 3917 9803 9571 8596 11019 8605 7562 10450 11307 12745 12899 15198 13900 5995 7062
13256G062L818J122L426n121l554L439M102J860j578k144k257j789L575L052n266
$$ 7062 10880 12002 15428 10307 6753 10192 14294 16154 14576 12432 10175 8386 11961 15013 9747
13241I747k301m405m275Q97N707N137P06k493m388j142L930L828J951M59j659
$$ 9747 7446 3041 -1234 -337 5370 10507 11213 8720 4332 3190 7120 10948 12899 13358 11699
13226A1699l266L84k338j908j055J524O014N746k777l781J359K834J98k555L150
$$ 11699 8433 8817 6479 4571 3516 5040 11054 16800 14023 10242 11601 14435 14633 12078 15228
13211A5228N862l41R26q146j0976o40O143O373M476k976k718O18J049j21J397
$$ 15228 21090 20749 21675 13529 2553 1913 8056 14429 18905 15929 13211 13829 14878 14757 16154
13196A6154k817k737k014M187O539k115k936j544j9Q3R29k70l571o04O09J304
$$ 16154 13337 10600 8586 12773 19312 17197 14261 12717 12698 12781 13710 13440 9869 9265 9874 11178
13180A1178j081O41n83K868L757p5l646J278m163K258J066n7j645N29K836m595
$$ 11178 10097 10738 10155 13023 16780 16705 13059 14337 10174 12432 13498 13441 11796 12325 15161 10566
13164A0566N12J382k373k599L761j096L024K157k0k490n35K308J507K680m18j502
$$ 10566 11078 12460 10087 7488 11249 10153 13177 15334 15314 12824 12289 14597 16104 18784 18366 16864
13148A6864n382k508N814P24m349N15L723K763k714K55L767L02m654P92J97m332
$$ 16864 11482 8974 14788 15512 11163 11678 15401 18164 15450 15705 19472 19774 15120 15912 16109 11777
13132A1777n80J595J465k843M8K03J451K799J284J629J434n537m091n94L686l00
$$ 11777 11197 12792 14257 11414 11462 11665 13116 15915 17199 18828 20262 14725 10634 10040 13726 13426
13116A3426l391m193J091n94J370J635k647L757O606K260n369q67L74j939j278
$$ 13426 10035 5842 6933 6339 7709 9344 6697 10454 17060 19320 13951 13084 13458 11519 10241
13101A0241k02r28Q70q00l665j614J509O455N052n530P79K267J850j563l761J74
$$ 10241 10039 9111 9981 9181 5516 3902 5411 11866 16918 11388 12167 14434 16284 14721 10960 11134
13085A1134O413M010K982k917j802j668J331j867k744k232K553R72l316L2J441
$$ 11134 17547 21557 24539 21622 19820 18152 19483 17616 14872 12640 15193 16165 12849 12881 14322
13070A4322l22k037m15k004P3K776P039j327j034j079j050j682J189J514J725
$$ 14322 14000 11963 11548 9544 9617 12393 19432 18105 17071 15992 14942 13260 14449 15963 17688
13055A7688L27k91j959n257o17J208K203J857J138J181N838J0726R210J6439L4208
$$ 17688 18015 17724 15765 10508 9891 11099 13302 15159 16297 17478 23316 34042 43252 59691 93899
13040I3899K5637j5478k9040k2287j3130n568O03n12p966m974J556K428l66l935
$$ 93899 119536 104058 75018 52731 39601 34033 34636 34124 26158 21184 22740 25168 24802 20867
13026B0867k880P70J488K420j714k945m85j914q57n320l168R86J398j086M060
$$ 20867 17987 18757 20245 22665 20951 18006 17521 15607 14750 9430 6262 7248 8646 7560 11620
13011A1620M578K638J128K296j575k489l064K31N502L687j388J250k489o86K148
$$ 11620 16198 18836 19964 22260 20685 18196 15132 15363 20865 24552 23164 24414 21925 21239 23387
12996B3387j907j251k881L595M79r22k283K959J196k790j818m273M355M391J169
$$ 23387 21480 20229 17348 20943 21422 20500 18217 21176 22372 19582 17764 13491 17846 22237 23406
12981B3406N01j315K121r81l194n768l246K365J688r88k518Q40L295J276j317
$$ 23406 23907 22592 24713 23732 20538 14770 11524 13889 15577 14589 12071 12911 16206 17482 16165
12966A6165o04j933J041K382P93k959K6Q80K317L996j672Q73m216k342K753J323
$$ 16165 15561 13628 14669 17051 17844 14885 14911 15791 18108 22104 20432 21305 17089 14747 17500 18823
12950A8823J23J399j703m810P71M242L541k017j742K830M45j202J465L99J241
$$ 18823 18946 20345 18642 13832 14603 18845 22386 20369 18627 21457 21902 20700 22165 22564 23805
12935B3805p07o80p59n956j056K314l095K013M00J485P31J583K647j356m163k063
$$ 23805 23098 22418 21659 15703 14647 16961 13866 15879 16279 17764 18495 20078 22725 21369 17206 15143
12919A5143O145M038k253n02M24o31L460n00L7Q0j791l637l209j484m227N587
$$ 15143 21288 25326 23073 22571 22995 22364 25824 25324 25361 25441 23650 20013 16804 15320 11093 16680
12903A6680N029M47K345L777J060j730r59m6j441m300p36K844M62m66l011m044
$$ 16680 21709 22156 24501 28278 29338 27608 26649 26603 25162 20862 20126 22970 23432 22966 19955 15911
12887A5911o082m573J829L867L230N288N280K825n044l153r67J426k601P26J140
$$ 15911 9829 5256 7085 10952 14182 19470 24750 27575 22531 19378 18411 19837 17236 17962 19102
12872A9102L644M640k17M21n179L10K918O8K379j998m942n124Q43K56J606K234
$$ 19102 22746 27386 27169 27590 22411 22721 25639 25707 28086 26088 21146 16022 16865 17121 18727 20961
12856B0961k190q77J811J271J993K535K830M37n375J023N350L964P2k156J498
$$ 20961 18771 17894 19705 20976 22969 25504 28334 28771 23396 24419 29769 33733 33805 31649 33147
12841C3147L668P709J2005R560M020J142O40L371M470o046j5261j1715j1174j506
$$ 33147 36815 44524 56529 66089 70109 71251 71891 75262 79732 73686 58425 46710 35536 34030
12827C4030M93o82K501j482l662j653K78n51j580j382Q47J752J765k186m927k589
$$ 34030 34523 33841 36342 34860 31198 29545 29823 29272 27692 26310 27157 28909 30674 28488 23561 20972
12811B0972K84N290P85l786m007J85M024O138K460J622M187K320N075R332O057
$$ 20972 21256 26546 27331 23545 19538 19723 23747 29885 32345 33967 38154 40474 45549 54881 60938
12796F0938j634j925J287J828l915j973k588k072K867K624k054Q01J312L254K207
$$ 60938 59304 57379 58666 60494 56579 54606 52018 49946 52813 55437 53383 54184 55496 58750 60957
12781F0957L919Q500J2861K0402K2699L8523N6993O7425P4577P4769O4069M2305
$$ 60957 64876 73376 86237 106639 129338 167861 224854 292279 366856 441625 505694 547999
12769E47999R733k3804n2683o5957o8812o3867n7565m9814l3228j6869j0756j1745
$$ 547999 557732 533928 481245 415288 346476 282609 225044 175230 142002 125133 114377 102632
12757A02632m184o982r361j1176j0188o124n767k547m65M7J320j445p85k388k512
$$ 102632 98448 91466 82105 70929 60741 54617 48850 46303 45838 45885 47205 45760 44975 42587 40075
12742D0075j075j71l32J249j545o33L812L53m621n607p25R19j044M394M59o517
$$ 40075 39000 38829 38497 39746 38201 37568 41380 41733 37112 31505 30780 31699 30655 35049 35508 28991
12726B8991l198j59K737J717K229o86k661k318K199M262N93j517l107M585J901
$$ 28991 25793 25634 28371 30088 32317 31631 28970 26652 28851 33113 33706 32189 29082 33667 35568
12711C5568r92R32N545n651o186j683j150P50M000N839K568L037L657P333K482
$$ 35568 34576 35508 41053 35402 29216 27533 26383 27133 31133 36972 39540 42577 46234 53567 56049
12696E6049K168J487J853k194L23o068k076r86n268m511k652j894P80j731J10
$$ 56049 58217 59704 61557 59363 59686 53618 51542 50556 45288 40777 38125 36231 37011 35280 35390
12681C5390O365L045m749m86K447r43L041q95m916l982j895K769J031J337J116
$$ 35390 41755 44800 40051 39565 42012 41069 44110 43215 38299 34317 32422 35191 36222 37559 38675
12666C8675j42K919L338j180J867K211n575p285l711J583L417k21l110K032m382
$$ 38675 38533 41452 44790 43610 45477 47688 42113 34828 31117 32700 36117 35896 32786 34818 30436
12651C0436m79K073K553L410L924j307R25q71O06N529q3n047n185K474k046k963
$$ 30436 29957 32030 34583 37993 41917 40610 41535 40664 41270 46799 46716 41669 36484 38958 36912 33949
12635C3949j040J668J690K349N200n72j074N658l88k062J518M058K973j541K245
$$ 33949 32909 34577 36267 38616 43816 43244 42170 47828 47440 45378 46896 50954 53927 52386 54631
12620E4631K185M010N968l1J42O75J365L271R167O191P830N513L989Q227P658
$$ 54631 56816 60826 66794 66763 66905 67580 68945 72216 81383 87574 95404 100917 104906 113133 120791
12605A20791M721J1580J2444J0578R074J2840K1146K9579L6619L2977L4594N4702
$$ 120791 125512 137092 149536 160114 169188 182028 203174 232753 269372 302349 336943 391645
12593C91645R8189J54100J88683J86823J47824P8925K956q3760j47876j91236
$$ 391645 489834 643934 832617 1019440 1167264 1246189 1249145 1165385 1017509 826273
12583H26273j95324j60981j12089p8090m8412k8586j8044j0924q023m319M745
$$ 826273 630949 469968 357879 279789 231377 202791 184747 173823 165800 161481 166226
12572A66226J3645K3479J9679K4794K4241J6719R525J735r336r831r600q232j7181
$$ 166226 179871 203350 223029 247823 272064 288783 298308 300043 290707 280876 271276 263044 245863
12559B45863l3974m0414l3146k4973j6257r528r685p121o423p955l139j840K320
$$ 245863 211889 171475 138329 113356 97099 87571 77886 70765 64342 56387 53248 51408 53728
12546E3728k182j591J142J793R53R13M326P438K854J176j956n476j010K886J766
$$ 53728 51546 49955 51097 52890 53843 54756 59082 66520 69374 70550 68594 63118 62108 64994 66760
12531F6760m553j792N561N567L255L901J260k934m456j555l260k721q05k217J009
$$ 66760 62207 60415 65976 71543 74798 78699 79959 77025 72569 71014 67754 65033 64228 62011 63020
12516F3020l216j008k557o41J289J294k545L278N063L991O823R772O202J968O490
$$ 63020 59804 58796 56239 55598 56887 58181 55636 58914 63977 67968 74791 84563 90765 92733 99223
12501I9223M889M280K868k368l045J830k963j153J892l449m994j542r59J181J339
$$ 99223 104112 108392 111260 108892 105847 107677 104714 103561 105453 102004 97010 95468 94509 95690 97029
12486I7029O746J6419K1182L2026M2635N3924N2173M1109L2941K0717L464k1025
$$ 97029 103775 120194 141376 173402 216037 269961 322134 363243 396184 416901 420365 399340
12474C99340l4435l5903l8917m4941l8027l2949k3903j6499j0695n234l59Q69
$$ 399340 364905 329002 290085 245144 207117 174168 150265 133766 123071 117837 117478 118347
12462A18347K879k806j449N26J93K229K295Q5J186J044K852K510J298K095J627
$$ 118347 121226 118420 116971 117497 117690 119919 122214 122299 123485 124529 127381 129891 131189 133284 134911
12447A34911k622k623o41L110L388M682K707K648J757O93n023k359M910J581K267
$$ 134911 132289 129666 129025 132135 135523 140205 142912 145560 147317 148010 142987 140628 145538 147119 149386
12432A49386K484J096K298L791q21L951P222O303N047O498J0999N576O872J0514
$$ 149386 151870 152966 155264 159055 158234 162185 169407 175710 180757 187255 198254 203830 210702 221216
12418B21216J2743Q479M863Q471O777N987R259N982O412m03K745P304J1601J2664
$$ 221216 233959 242438 247301 255772 262549 268536 277795 283777 290189 289786 292531 299835 311436 324100
12404C24100Q198J2523N595O00k692N001P688J6757J7281K0833K2313K0822K7390
$$ 324100 332298 344821 350416 351016 348324 353325 361013 377770 395051 415884 438197 459019 486409
12391D86409K5951K8697L4865L7242L9599L9757M7497M8523N8292N9978O9456
$$ 486409 512360 541057 575922 613164 652763 692520 740017 788540 846832 906810 976266
12380I76266P8905Q6101J00436J25767J52073J85165K25738K79871L57882M50525
$$ 976266 1055171 1141272 1241708 1367475 1519548 1704713 1930451 2210322 2568204 3018729
12370C018729N39481O04038O45500O66677O72295O62391O74729P87046J070784
$$ 3018729 3558210 4162248 4807748 5474425 6146720 6809111 7483840 8270886 9341670
12361I341670J584207K465650L978606O412670R804945J3402477J5619993J5626691
$$ 9341670 10925877 13391527 17370133 23782803 33587748 46990225 62610218 78236909
12353G8236909J4068530J1177194N991334j181472p814106j2072500j4497184
$$ 78236909 92305439 103482633 109473967 108292495 100478389 88405889 73908705
12346G3908705j5711600j5016848j2230996q653667n643985l597359k316190j534204
$$ 73908705 58197105 43180257 30949261 22295594 16651609 13054250 10738060 9203856
12338I203856j055776p76162o58733o43804o54154o50269o29413n90325n19344
$$ 9203856 8148080 7371918 6713185 6069381 5415227 4764958 4135545 3545220 3025876
12329C025876m23417l27296k56052k06821j73575j47239j28615j13220r8335p9988
$$ 3025876 2602459 2275163 2019111 1812290 1638715 1491476 1362861 1249641 1151306 1071318
12319A071318p7358p3633o1946n1469m2487l5741m0100l5972l2273l0751k2940
$$ 1071318 993960 920327 858381 806912 764425 728684 688584 652612 620339 589588 566648
12308E66648k3790k8852k1224j5977k0091j8478k0417k1957j4810j1358j1049
$$ 566648 542858 514006 492782 476805 456714 438236 417819 395862 381052 369694 358645
12297C58645o613j293N710J5396J6702J0538N618p840k6931m3341l7968k0167
$$ 358645 352032 350739 356449 371845 388547 399085 404703 396863 369932 326591 288623 268456
12285B68456j2452j0370j2679j3772q302m819r3l722q870j311j43m255m200k530
$$ 268456 256004 245634 232955 219183 210881 206062 205969 202247 193377 192066 191923 187668 183468 180938
12271A80938o112n762l352R84n974n116o021n062j034Q50n590P77j409n752o089
$$ 180938 174826 169064 165712 166696 160722 155606 149585 144523 143489 144339 138749 139526 138117 132365 126276
12256A26276k032j144j14J296L196j08L161Q529R780R932R989K0726L6626N3754
$$ 126276 124244 123100 122986 124282 127478 127370 130531 139060 148840 158772 168761 189487 226113 279867
12242B79867O4236O0428M0560k79m5922p5279p8041n5557l4064k9162k7852k6508
$$ 279867 344103 404531 445091 444812 398890 323611 245570 190013 155949 126787 98935 72427
12230G2427j7355j8711j8392j4242J074l096p20L267J3441J4886J5572J4558J1846
$$ 72427 55072 36361 17969 3727 4801 1705 985 4252 17693 32579 48151 62709 74555
12217G4555O352N833K128n460o103q541l238l759m793j854p872m807q55k339R59
$$ 74555 80907 86740 88868 83408 77305 68764 65526 61767 56974 55120 47248 42441 41586 39247 40206
12202D0206l050K196N815M845R871P837P678R290J3387K5727L1955L6656M5090
$$ 40206 37156 39352 45167 50012 59883 67720 75398 84688 98075 123802 155757 192413 237503
12189B37503K7065l359k6786l5068l7807k8578k2662j8867j3035p274p913r763
$$ 237503 264568 261209 234423 199355 161548 132970 110308 91441 78406 71132 63219 53456
12177E3456m781J351M456J451k101k048k508M829L292j22Q67n96j589P51PK0N307
$$ 53456 48675 50026 54482 55933 53832 51784 49276 54105 57397 57275 58142 57546 55957 56708 56715 56735 62042
12160F2042L592M185J308l343m409K030k594l958K385j108l749m681J588j449
$$ 62042 65634 69819 71127 67784 63375 65405 62811 58853 61238 60130 56381 51700 53288 51839
12146E1839M858k146o53j787j42l622L643R94J330k67p470n388M481L052j179
$$ 51839 56697 54551 53898 52111 51969 48347 51990 52984 54314 54047 46577 41189 45670 48722 47543
12131D7543j208k40m076j022j449j244k067O97J111M610N100j294l344m95J110
$$ 47543 46335 46095 42019 40997 39548 38304 36237 36934 38045 42655 47755 46461 43117 42622 43732
12116D3732k18K706M109M334P69l017m18M004L948L241j345o67M038l806n94J153
$$ 43732 43514 46220 50329 54663 55432 52415 51997 56001 59949 63190 61845 61178 65216 61410 60816 61969
12100F1969N74l5k161l72K033k143l476L4m05l215n32P17l127L69j072J234N66
$$ 61969 62543 62508 60347 59975 62008 59865 56389 56423 56018 52803 52271 52988 49861 50230 49158 50392 50958
12083E0958K785l773k386j324m402l017k316R68K026Q4j274J121P706K076J937
$$ 50958 53743 49970 47584 46260 41858 38841 36525 37493 39519 39603 38329 39450 47156 49232 51169
12068E1169L970Q877L194l975m87k284K297K052m772l578J016K918L348N134q
$$ 51169 55139 64016 67210 63235 62748 60464 62761 64813 60041 56463 57479 60397 63745 68879 68871
12053F8871J891J346J47k478r74j770l648k401J93k464r21n157m176l456k711
$$ 68871 70762 72108 72255 69777 68803 67033 63385 60984 61177 58713 57792 52635 48459 45003 42292
12038D2292P13K231k286J552M983M44l489j145R97M695Q54N94K722J406O185J365
$$ 42292 43005 45236 42950 44502 49485 49929 46440 45295 46292 50987 51841 52435 55157 56563 62748 64113
12022F4113M282P019K579o269o505j404J742K295J568k427j777j955R02k634j38
$$ 64113 68395 75414 77993 71724 65219 63815 65557 67852 69420 66993 65216 63261 64163 61529 61391
12007F1391L701K168j01J753l426k623J723J798j478k980l017K475P449J942l319
$$ 61391 65092 67260 67159 68912 65486 62863 64586 66384 64906 61926 58909 61384 68833 70775 67456
11992F7456q40O824R069Q210J1801R482J4396J7023J6411J1739J1283J1923J5067
$$ 67456 66616 73440 82509 90719 102520 112002 126398 143421 159832 171571 182854 194777 209844
11979B09844M219k389p824j0396j3473j9256j8930j2600j0758r663p357k166k619
$$ 209844 214063 211674 203850 193454 179981 160725 141795 129195 118437 108774 101417 99251 96632
11966I6632m662m107J86L538K857N300J3317J2967M250l650m618M35K178l031
$$ 96632 91970 87863 88049 91587 94444 99744 113061 126028 130278 126628 122010 122445 124623 121592
11952A21592J432K212l518J287R418O846J0521J7763K4891L9464N8645N8049J9176
$$ 121592 123024 125236 121718 123005 132423 139269 149790 167553 192444 231908 290553 348602 367778
11939C67778p576J0239L7462L6726J2925P528K2046M6392O1181P1877P4427N6252
$$ 367778 360202 370441 407903 444629 457554 465082 487128 533520 594701 666578 741005 797257
11927G97257K7274p594m0737p5864r7150j08423q8229o4852m6431l2568k1607
$$ 797257 824531 816937 776200 700336 603186 494763 406534 341682 295251 262683 241076
11916B41076j5872j2502j1626r812k330o766L816R030Q403j775k947P260O748
$$ 241076 225204 212702 201076 191264 188934 182168 185984 195014 203417 201642 198695 205955 212703
11903B12703N226O006O216L690M312L717P216J3434J8642J9382K9158L8573N1187
$$ 212703 217929 223935 230151 233841 238153 241870 249086 262520 281162 300544 329702 368275 419462
11890D19462P8592J03716R8881P7095N8471N5413M7026K5207Q572k9025n9105
$$ 419462 498054 601770 700651 777746 836217 891630 938656 963863 972435 943410 884305
11879H84305m2670l018J6656K7366M2597N7690Q1980J11417J46317J94812K10662
$$ 884305 841635 838617 855273 882639 925236 982926 1064906 1176323 1322640 1517452 1728114
11868A728114K26176L11537M68267O61764R23982J392654K288060L737611N215333
$$ 1728114 1954290 2265827 2734094 3395858 4319840 5712494 8000554 11738165 16953498
11859A6953498M483855N93614k076170r53926J425934J577381j618267m566830
$$ 16953498 21437353 22030967 19954797 19000871 20426805 22004186 20385919 15819089
11851A5819089m608652l194386j947311j168642p65488o22147n31574l74531k19966
$$ 15819089 11210437 8016051 6068740 4900098 4134610 3512463 2980889 2606358 2386392
11842B386392j23458m5209L3294R6219J29850J38940J24996Q2700J2660r1222
$$ 2386392 2262934 2217725 2251019 2347238 2477088 2616028 2741024 2823724 2836384 2745162
11832B745162j72963j75611j67944j68382j50009q4688l277O4299J12896J48091
$$ 2745162 2572199 2396588 2228644 2060262 1910253 1825565 1822288 1886587 1999483 2147574
11822B147574J82676K41430L11862L82837M57219N66433P64373J061537J479450
$$ 2147574 2330250 2571680 2883542 3266379 3723598 4290031 5054404 6115941 7595391
11813G595391K067288L048994M756293P150911Q745546P407200M591354K495736
$$ 7595391 9662679 12711673 17467966 24618877 33364423 40771623 45362977 47858713
11805D7858713K193608M214862K882730m143271j1641760j3182863r468098n579536
$$ 47858713 50052321 54267183 57149913 53006642 41364882 28182019 18713921 13134385
11797A3134385l294576k113573j469168j038534p24961n53922n12332m97292m40694
$$ 13134385 9839809 7726236 6257068 5218534 4493573 3939651 3427319 2930027 2489333
11788B489333l48529k55956j88919j41085j03848p3892n5931m5487k8537n070
$$ 2489333 2140804 1884848 1695929 1554844 1450996 1377104 1321173 1275686 1247149 1242079
11778A242079M255J3390J7908L1476M5253N7659P9088R6528J29734J78203K35959
$$ 1242079 1246334 1259724 1277632 1309108 1354361 1412020 1491108 1587636 1717370 1895573 2131532
11767B131532L02771L54557M06180N28459P41694J017289J444330K226598L542826
$$ 2131532 2434303 2788860 3195040 3723499 4465193 5482482 6926812 9153410 12696236
11758A2696236N468811P551103P158648K571881r45843j45807k3744l931915p341178
$$ 12696236 18165047 25716150 32874798 35446679 34500836 34355029 34331285 30399370 23058192
11749B3058192o940647m837623l068446j947196j306335r60433p25978n32455
$$ 23058192 16117545 11279922 8211476 6264280 4957945 3997512 3271534 2739079
11741B739079m05498l46694l14414k59965k03104j59434j32545j03215p3835n4056
$$ 2739079 2333581 1986887 1672473 1412508 1209404 1049970 917425 814210 740375 686319
11731F86319m5260m4075m1960l8089k7842k4507k5953k3100k1429k0496j7812
$$ 686319 641059 596984 555024 516935 489093 464586 438633 415533 394104 373608 355796
11720C55796j5107j9060j5184j5719j3098q734p021q770n962J059R48L921M066
$$ 355796 340689 321629 306445 290726 277628 268894 261873 253103 247141 248200 249148 253069 257135
11707B57135O422J1296M532M048N357N340N622K586L3m913n621n719r975j5972
$$ 257135 263557 274853 279385 283433 288790 294130 299752 302338 302371 297458 291837 286118 276143 260171
11693B60171j3055j5623j9073j7458j1798j2095j5842j2986j2819r865j4156j2058
$$ 260171 247116 231493 212420 194962 183164 171069 155227 142241 129422 119557 105401 93343
11681I3343j1733o925l311No8N316R469N370M047P801R935M121M949K011M165
$$ 93343 81610 74685 71374 71379 71311 76627 86096 91466 95513 103314 113249 117370 122319 124330 128495
11666A28495J3997J3337R127P332R296J1722R139J2340J5770K0854J6926o564
$$ 128495 142492 155829 164956 172288 181584 193306 202445 214785 230555 251409 268335 261771
11654B61771k5258k7779k0661j3950j3909j2288j6044j1446j1297j0069p734m874
$$ 261771 236513 208734 188073 174123 160214 147926 131882 120436 109139 99070 91336 86462
11642H6462k277m363l533p34j959n461k873o601l508L212p37j795n969k171J546
$$ 86462 84185 79822 76289 75555 73596 68135 65262 58661 55153 58365 57628 55833 49864 47693 49239
11627D9239K679J777K818N304L881j912L272L44k835nM662O183J99O03K504R90
$$ 49239 51918 53695 56513 61817 65698 63786 67058 67402 64567 64562 69224 75407 75606 76209 78713 79703
11611G9703J712M55j454O87o619p209r310m406M060L449k032J413M159L643M623
$$ 79703 81415 81870 80416 81103 74484 67275 57965 53559 57619 61068 59036 60449 64608 68251 72874
11596G2874M136k35J935L749k81j910K259J427m82m563j2141o602m107l004k540
$$ 72874 77010 76775 78710 82459 82178 80268 82527 83954 83472 78909 66768 60166 56059 53055 50515
11581E0515j08m750J264M64q27j43k786r84K456j096l542L604L663L09J218k410
$$ 50515 50407 45657 46921 47385 46558 46415 43629 42645 45101 44005 40463 44067 47730 48039 49257 46847
11565D6847m967K148P522K959q68J244r77M251O238M533K08l242J674q8M817k085
$$ 46847 41880 44028 51550 54509 53641 54885 53908 58159 64397 68930 69138 65896 67570 67482 72299 70214
11549G0214n212J765L193l814k539K495k598k741l743k112L687K51l504O61P93
$$ 70214 65002 66767 69960 66146 63607 66102 63504 60763 57020 54908 58595 58846 55342 56003 56796
11534E6796q84l402l213l424L044L644q94l53L604K189p11R53j646m129m73k814
$$ 56796 55912 52510 49297 45873 48917 52561 51667 51314 54918 57107 56396 57349 55703 51574 51101 48287
11518D8287n207J37K834j568n79M12l025L567L364j305L133N139L172N164K413
$$ 48287 43080 43217 46051 44483 43904 44316 41291 44858 48222 46917 50050 55189 58361 63525 65938
11503F5938K25N86L670O339K078j255k398L698Q264J8952J0974j0683j6686j0446
$$ 65938 66163 66749 70419 76758 78836 77581 75183 78881 87145 106097 117071 106388 89702 79256
11489G9256l405k486q42k665m261Q30k894r29J880j083K21L067J779l930l910
$$ 79256 75851 73365 72523 69858 65597 66427 63533 62604 64484 63401 63622 66689 68468 64538 60628
11474F0628J011J047J032J11J57O07k662n41j047j437J04J069M863K02L82j917
$$ 60628 61639 62686 63718 63829 63986 64593 61931 61390 60343 58906 59010 60079 64942 65144 65526 63609
11458F3609k310J327j521J037L024J712J419L948L278M176k42n464j187k120j274
$$ 63609 61299 62626 61105 62142 65166 66878 68297 72245 75523 79699 79457 73993 72806 70686 69412
11443F9412o778Q02K3153K9597R303j0903k0754r723R18Q152J2193J3842R947
$$ 69412 62634 63436 86589 116186 125489 114586 93832 84109 85027 93179 105372 119214 129161
11430A29161l786p890q71K719M138K26k380K295O886M445R766Q828J637J059j47
$$ 129161 125375 117485 116614 119333 123471 123697 121317 123612 130498 134943 144709 153537 155174 156233 156086
11415A56086J722M881M1p041l321L328n8O086J236Q34n704j2459r040o275j79
$$ 156086 157808 162689 162730 155689 152368 155696 155638 161724 162960 163794 158090 145631 136591 130316 130137
11400A30137Q513J1287P047O469P829L534r8O959R583L276N310R092J3541K7382
$$ 130137 138650 149937 156984 163453 171282 174816 174718 181677 191260 194536 199846 208938 222479 249861
11386B49861M6142Q0359J39125K39228L76878L74558J14746k31816l93050l20898
$$ 249861 296003 376362 515487 754715 1131593 1506151 1620897 1389081 996031 675133
11376F75133j82875j02164n4159k9771j2012r004R71J0752J2913Q030R134J3262
$$ 675133 492258 390094 335935 306164 294152 285148 286119 296871 309784 317814 326948 340210
11364C40210K2315L5580L7961L4071K2880j664l7453o3754o4076m2636k7267j1860
$$ 340210 362525 398105 436066 470137 493017 491353 453900 390146 326070 283434 256167 244307
11352B44307o639j933k365m800n480o830o158N03N835N931K433J712M933J1128
$$ 244307 237668 235735 233370 228570 223090 216260 210102 210605 216440 222371 224804 226516 231449 242577
11338B42577Q755R511R545J0747J3886K0308K2225L4951M6461N8251M7406K9260
$$ 242577 251332 260843 270388 281135 295021 315329 337554 372505 418966 477217 524623 553883
11326E53883J2051L835K1785N0526P8372P7387N3782K1256P340K5917M7798O4440
$$ 553883 565934 569769 591554 642080 720452 797839 851621 872877 880217 906134 953932 1018372
11314A018372Q4018J15800J57536K21803L42235N47130R11756J274734Q85496
$$ 1018372 1102390 1218190 1375726 1597529 1939764 2486894 3398650 4673384 5558880
11305E558880j27721l81446J77329Q45131J350415J619204J733369J882148K031538
$$ 5558880 5431159 5049713 5227042 6072173 7422588 9041792 10775161 12657309 14688847
11296A4688847K019743J845546J613020J248895P40987L20781N2022l08680q59593
$$ 14688847 16708590 18554136 20167156 21416051 22157038 22477819 22529841 22221161 21361568
11287B1361568j342209j616378j823109j978697j988597j902015j841927j730673
$$ 21361568 20019359 18402981 16579872 14601175 12612578 10710563 8868636 7137963
11279G137963j440720j050586o94035m15183k99938l64505l96904l14419k06176
$$ 7137963 5697243 4646657 3952622 3537439 3237501 2872996 2476092 2161673 1955497
11270A955497j31123q8006n2161k6797o807J4125L1817N7166Q0764J05302J39765
$$ 1955497 1824374 1736368 1684207 1657410 1650603 1664728 1696545 1753711 1834475 1939777 2079542
11259B079542J81095K32027L01550L89786N22482P47043J080752J558999K116222
$$ 2079542 2260637 2492664 2794214 3184000 3706482 4453525 5534277 7093276 9209498
11250I209498K567029K800738K872352K911983L020193L114143L086640K735526
$$ 9209498 11776527 14577265 17449617 20361600 23381793 26495936 29582576 32318102
11242C2318102J968789J101375L46162j80969o17387j138029j776132k508900
$$ 32318102 34286891 35388266 35734428 35553459 34936072 33798043 32021911 29513011
11234B9513011l071856l314199l243926l004751k763116k527242k263110j911152
$$ 29513011 26441155 23126956 19883030 16878279 14115163 11587921 9324811 7413659
11226G413659j490947j106097q03805n96162m58894l57628k72909k01142j52822
$$ 7413659 5922712 4816615 4012810 3416648 2957754 2600126 2327217 2126075 1973253
11217A973253j22155r7497p7674n7711l9603k6608j2024N051K2911M6793Q0193
$$ 1973253 1851098 1753601 1675927 1618216 1578613 1552005 1539981 1545032 1567943 1614736 1694929
11206A694929J16071J57569K02156K75005L88609N66957P94612R81775J037634
$$ 1694929 1811000 1968569 2170725 2445730 2834339 3401296 4195908 5177683 6215317
11197F215317J029380J078857J220505J375136J402253J222367Q81077M55172
$$ 6215317 7244697 8323554 9544059 10919195 12321448 13543815 14424892 14880064
11189A4880064J45309L1861l1030k51418o77336j083446j321653j394875j327904
$$ 14880064 15025373 15057234 15026204 14774786 14097450 13014004 11692351 10297476 8969572
11180H969572j209264j133999j132219j114920r70150p33973n27887l84962k86233
$$ 8969572 7760308 6626309 5494090 4379170 3409020 2675047 2147160 1762198 1475965
11171A475965k18374j73329j35398j04732q4916p0851o6565n8083m4069l3836
$$ 1475965 1257591 1084262 948864 844132 759216 688365 621800 563717 519648 485812
11161D85812k9716k6729k5748l2079l4080l0955k4455j5166q982m374J905j306
$$ 485812 456096 429367 403619 371540 337460 306505 282050 266884 257902 253528 255433 254127
11149B54127j6288k1627j9664m270J0249J7099J8322j147p902j9151j9812j1826
$$ 254127 237839 216212 196548 192278 202527 219626 237948 236801 228899 209748 189936 178110
11137A78110m463L367j185R73l848k576L608j783l796q169j1141q603j1134j2675
$$ 178110 173647 177014 175829 176802 172954 170378 173986 172203 168407 160238 149097 140494 129360 116685
11123A16685r591p917o02J549j823l204l934J003n98k239M423Q826J6283K5814
$$ 116685 107094 99177 98575 100124 98301 95097 91163 92166 91568 89329 93752 102578 118861 144675
11109A44675K7309J8455O852o988r993l771r55m530l209J730K34j0649j0398r441
$$ 144675 171984 190439 197291 190303 180310 176539 175584 171054 167845 169575 169809 159160 148762 139321
11095A39321m209p491m907r71N072K2348N0923R0798J21050J25103J33910J45845
$$ 139321 135112 127621 122714 121743 126815 149163 200086 290884 411934 537037 670947 816792
11083H16792J00207k6391j41543j83482j46850r7169o6481m0773k4218j7680j6143
$$ 816792 916999 890608 749065 565583 418733 321564 255083 214310 190092 172412 156269
11072A56269o729m02M981L79j433q653j1811q979J911J5907J1513K879n506l986
$$ 156269 149540 149138 154119 154498 153065 144412 132601 123622 125533 141440 152953 155832 150326 146340
11058A46340N451J4374J0994M217k091P93m861p636o695L139Q929R828M048o9
$$ 146340 151791 166165 177159 181376 179285 180078 175217 167581 160886 164025 172954 182782 186830 186761
11044A86761K372K308J752Q056N893k184l783p732p323p72J3229J4139J5146Q409
$$ 186761 189133 191441 193193 201249 207142 204958 201175 193443 186120 185348 198577 212716 227862 236271
11030B36271L501J1151J0877J5622J8889J7592J1384P189M588J1971Q269j596
$$ 236271 239772 250923 261800 277422 296311 313903 325287 332476 337064 349035 357304 355708
11018C55708o45j938M371J2781P943L360M814R579J3351K0696J9776P541J90r767
$$ 355708 355063 353125 357496 370277 378220 381580 386394 395973 409324 430020 449796 457337 457527 447760
11004D47760o776J4736K9736L9540L6186L9806L4955K3932K2050L9748O2328P5151
$$ 447760 440984 455720 485456 524996 561182 600988 635943 659875 681925 721673 784001 859152
10992H59152O8841N1381M7232O4597Q5506R3135R0960Q2197Q7056J07421J66367
$$ 859152 927993 979374 1026606 1091203 1176709 1269844 1360804 1443001 1530057 1637478 1803845
10981A803845K37309K98589L21111L35094L52102L96278M78311O12906Q36504
$$ 1803845 2041154 2339743 2660854 2995948 3348050 3744328 4222639 4835545 5672049
10972E672049J072121J170944J204300J235333J263042J430230K057865L376901
$$ 5672049 6744170 7915114 9119414 10354747 11617789 13048019 15105884 18482785
10964A8482785N535460R033478J5231053K6331120M5602356O9832526O8103948
$$ 18482785 24018245 33051723 48282776 74613896 120216252 190048778 258152726
10957B58152726K3073939l6869003p2550750o4231065l9321895k2115192j3064943
$$ 258152726 281226665 244357662 171806912 107575847 68253952 46138760 33073817
10950C3073817q227585n449435l687020k434117j627253j236005j139740j155014
$$ 33073817 24846232 19396797 15709777 13275660 11648407 10412402 9272662 8117648
10942H117648j200783j214920j066251q13113n86882m21629k93840j85241j22303
$$ 8117648 6916865 5701945 4635694 3822581 3235699 2814070 2520230 2334989 2212686
10933B212686j05399j25726j47667j54178j34438j05079p8370p0606p5988q6540
$$ 2212686 2107287 1981561 1833894 1679716 1545278 1440199 1361829 1291223 1215235 1128695
10923A128695q1680n4188k7206j7959k7310m4054n6429n9920m4955k3770q593
$$ 1128695 1047015 992827 965621 947662 920352 876298 819869 759949 714994 691224 682631
10912F82631l725j0546l0336n3332m4705k9396j7800p302j0836j0173n199L558
$$ 682631 678906 668360 638024 584692 539987 510591 492791 485489 474653 464480 459281 462839
10900D62839J3881L0485N9283J02569J80375K98202L74951J83450j98301l81444
$$ 462839 476720 507205 566488 669057 849432 1147634 1522585 1706035 1507734 1126290
10890A126290l18837j96002j13710o4601m2591l0969j9736j4481p105l857Q49
$$ 1126290 807453 611451 497741 433140 390549 359580 339844 325363 318258 314401 315250
10879C15250J411J525o450n630m370j668L340L68k948k864o309p502p756n846
$$ 315250 316661 318186 311736 306106 301736 300068 303408 303776 300828 297964 291655 284153 276397 270551
10865B70551q390j5843j4598j5101k0734k2282q260o988q790q831j2878r295k185
$$ 270551 262161 246318 231720 216619 195885 173603 165343 158355 149565 140734 127856 118561 116376
10852A16376M913J0883N533n320j5609j1855o578o49M657M411l713j2500j2365
$$ 116376 121289 132172 137705 132385 116776 104921 98343 97694 102351 106762 103049 90549 78184
10839G8184J525q936k5465l1046k9736k5650l7174k7957L564M3169O4803N6498
$$ 78184 79709 70773 45308 14262 -15474 -41124 -78298 -106255 -102691 -59522 5281 61779
10827F1779M8128M9903N3608M5556K0764K668j107r30j445m683j3898j4986j2067
$$ 61779 109907 159810 213418 258974 279738 282406 281299 280369 278924 274241 260343 245357 233290
10814B33290j6678j9737k2025k6024k2822k3363k4533j9837p414P320J6247J5807
$$ 233290 216612 196875 174850 148826 126004 102641 78108 58271 50857 58177 74424 90231
10802I0231O579K852j718j661j214m302L847K056j648m841k114k360o68m206q910
$$ 90231 96810 99662 97944 96283 95069 90767 94614 96670 95022 90181 88067 85707 85039 80833 71923
10787G1923k162m432n462m671j072k651K232J319m112K798J3648J5107M308m218
$$ 71923 69761 65329 59867 55196 54124 51473 53705 55024 50912 53710 67358 82465 86773 82555
10773H2555m968K268P764K7934L6073J8716k727j5194j4369l842R516O770M855
$$ 82555 77587 79855 87619 115553 151626 170342 167615 152421 138052 134210 143726 150496 155351
10760A55351o985j6923j9646j9507j7966r744l706J615M694L008j172m77k95l917
$$ 155351 148366 131443 111797 92290 74324 64580 60874 62489 67183 70191 69019 68542 68247 64330
10746F4330m120m17j954J64J227L633J516m472M276N199J1117J3889N133l712
$$ 64330 60210 59793 57839 58003 59230 62863 64379 59907 64183 69382 80499 94388 99521 95809
10732I5809j170L894K385n8o759n868j686K649K727L781M17q531j1507k514J376
$$ 95809 94639 98533 100918 100860 94101 88233 86547 89196 91923 95704 96121 87590 76083 73569 74945
10717G4945n424q827l61k36O976R469J2387P331K876K495p438j0298p520p382
$$ 74945 69521 60694 60333 60097 67073 76542 88929 96260 99136 101631 94193 83895 76375 68993
10703F8993L107M607K758K156l266o043m159l933l689n092n245n402J293N89j727
$$ 68993 72100 76707 79465 81621 78355 72312 68153 64220 60531 55439 50194 44792 46085 46674 44947
10688D4947n966m214J079J640l16j337k638k891P89O492N811M39n171l929j1256
$$ 44947 38981 34767 35846 37486 37170 35833 33195 30304 31093 37585 43396 43835 38664 34735 23479
10673B3479p415q0k543O025J6808J2977o100j2375j1557l496J9320K7851J4710
$$ 23479 16064 15984 13441 19466 36274 49251 43151 30776 19219 15723 35043 62894 77604
10660G7604M72q336o876m677M474N782N974M481j102m010n638J792N39p932n997
$$ 77604 78076 69740 62864 58187 62661 68443 74417 78898 77796 73786 68148 69940 70479 62547 56550
10645E6550k296P98k707n362l371o34P15J694M467k883J097Q95L099R746M206
$$ 56550 54254 55052 52345 46983 43612 42978 43693 45387 49854 46971 48068 48963 52062 61808 66014
10630F6014M919J2581K1762L1418K3006l118r107m123j765l654n509n095l158
$$ 66014 70933 83514 105276 136694 159700 156582 147475 143352 141587 137933 132424 127329 124171
10617A24171k749n967r243o862j2327n462q52N284R283J9948N2991R2440J16603
$$ 124171 121422 115455 106212 99350 87023 81561 80709 85993 95276 115224 168215 260655 377258
10604C77258J19197J18715J30370J09092k5226j62978j62738j15490r2328p1922
$$ 377258 496455 615170 745540 854632 829406 666428 503690 388200 295872 223950
10594B23950m0451j8661j8220j3476q046K043J5227K0630J8172K2008J3671o747
$$ 223950 183499 164838 146618 133142 125096 127139 142366 162996 181168 203176 216847 210100
10582B10100j4502p004L594K327M831J9612L1487J5545p781k1247k7702k1555
$$ 210100 195598 188594 192188 194515 199346 218958 250445 265990 258209 236962 209260 187705
10570A87705j2646n720m853J791J0978O968m178m260J4O006N869P560Q022N358
$$ 187705 175059 169339 164486 166277 177255 184223 180045 175785 175799 181805 187674 195234 203256 208614
10556B08614l587q115m686Q127K0426J9701J8187Q282O208Q588J8662K6605K6328
$$ 208614 205027 196912 192226 200353 220779 240480 258667 266949 273157 281745 300407 327012 353340
10543C53340K0499K0092K0245K5131K5956K0266J2772J7930L6722M8569P1237
$$ 353340 373839 393931 414176 439307 465263 485529 498301 516231 552953 601522 672759
10532F72759J10587J71599K90769M20385L48997M8165k54898l43316k19421p6033
$$ 672759 783346 954945 1245714 1666099 2015096 2063261 1808363 1465047 1245626 1169593
10522A169593L0955J42448K93818N25941Q26521R07141K62143o43084q85833o21866
$$ 1169593 1200548 1342996 1636814 2162755 2989276 3896417 4158560 3515476 2629643 2007777
10512B007777l30172j54844q3637m8612k4934N031N5534R1628J06492J07863J10244
$$ 2007777 1677605 1522761 1439124 1390512 1365578 1370609 1426143 1517771 1624263 1732126 1842370
10501A842370J31562J86549K71970L49650M03955M61635N57236O81953O79732
$$ 1842370 1973932 2160481 2432451 2782101 3186056 3647691 4204927 4886880 5566612
10492E566612M25444J96464K93990N76028Q97121J276189J673177K146908K902706
$$ 5566612 5992056 6188520 6482510 7058538 7955659 9231848 10905025 13051933 15954639
10483A5954639M163286O149307R425388J5150240K5314263M2519277O5152099
$$ 15954639 20117925 26267232 35692620 50842860 76157123 118676400 183828499
10476A83828499O9532613K1039498m7071071p1308244n4816117l3617956k0230801
$$ 183828499 253361112 274400610 227329539 156021295 101205178 67587222 47356421
10469D7356421j2764916q483219n841792m185451l091186k242326j617282j221810
$$ 47356421 34591505 26108286 20266494 16081043 12989857 10747531 9130249 7908439
10461G908439r49400o85010m26670l14851m82893p03894o89088n10588l34367
$$ 7908439 6959039 6274029 5847359 5532508 5049615 4345721 3656633 3146045 2811678
10452B811678k08576j58846j65381j84839j81568j55887j17714r6453q9138r4823
$$ 2811678 2603102 2444256 2278875 2094036 1912468 1756581 1638867 1542414 1453276 1358453
10442A358453j04339r5034o7976m3033l3150l7722n5807n6545m2850l0745l2357
$$ 1358453 1254114 1159080 1091104 1048071 1014921 977199 921392 864847 821997 791252 758895
10431G58895k8072k0245k5603m0502m9790n0266l6642k3537j8646j8046j7564
$$ 758895 730823 710578 684975 644473 594683 544417 507775 484238 465592 447546 429982
10420D29982j9527k1721k1057j2876n300j3961j9687j9702j6017j0150q691r076
$$ 429982 410455 388734 367677 354801 349501 335540 315853 296151 280134 269984 261293 252217
10408B52217n983n173q0R77n9n022j1037k870O248N701O368k331r231j7324j8538
$$ 252217 246234 241061 240981 241958 241899 236877 225840 222970 229218 234919 241287 238956 229725 212401 193863
10393A93863j1322j374k330R52q62o724j0640j0977k354N823k124p753q248o541
$$ 193863 182541 181167 178837 179789 178927 172203 161563 150586 148232 154055 151931 144178 135930 129389
10379A29389r434j2827l862Q606Q779m7l984j1517m920N622R749M836p577j5788
$$ 129389 119955 107128 103266 111872 120651 120604 116620 105103 100183 105805 115554 120390 112813 97025
10365I7025j1148m703j075K711k516n551r652p692j584j0134l3358l5723k0927
$$ 97025 85877 81174 80099 82810 80294 74743 65091 57399 55815 45681 12323 -23400 -44327
10352d4327k7209l9581k5250N30L1304N5808M6298K3828K3777L0466J7738L353
$$ -44327 -71536 -111117 -136367 -135837 -104533 -48725 -2427 21401 45178 75644 93382 96735
10340I6735o103j2520j1327m669j2458j6460j1669m566j828m525l163j205l251
$$ 96735 90632 78112 66785 62116 49658 33198 21529 16963 15135 10610 7447 6242 2991
10327B991q434j1946p894J022J1452J9474J8383J1412P495K252J175j115k320
$$ 2991 -5443 -17389 -25283 -24261 -12809 6665 25048 36460 43955 46207 47382 46267 43947
10314D3947m433j007K776J836o33j427o019o425o327o409p131n023m444M696P011
$$ 43947 39514 38507 41283 43119 42486 41059 35040 28615 22288 15879 8748 3725 -719 3977 10988
10299A0988l07L407R671Q916Q048P143O17n630p817l732J634Q198J3199L332j5850
$$ 10988 10681 14088 23759 32675 40723 47866 48483 42853 35036 31304 32938 41136 54335 57667 41817
10284D1817j2432n532N00J3415J6444N164K66o189j2872j1220j0718m715P831
$$ 41817 29385 23853 24353 37768 54212 59376 59642 53453 40581 29361 18643 13928 21759
10271B1759R623M739j864o69l562p189m982K204j252n284N58K918L382n13l649
$$ 21759 31382 36121 34257 33588 30026 22837 17855 20059 18807 13523 14081 16999 20381 19868 16219
10256A6219j564j767n051o896k027L931L944J810M197L905n735q044j850n119
$$ 16219 14655 12888 7837 941 -1086 2845 6789 8599 12796 16701 10966 2922 1072 -4047
10242d047p960m66L178O430P122P900O285K917J829K463nK303K270K385k735L240
$$ -4047 -12007 -12473 -9295 -2865 4257 12157 18442 21359 23188 25651 25646 27949 30219 32604 29869 33109
10226C3109M264L32k840K408J582L805K501l69L897N348J941m660l238J83l827
$$ 33109 37373 37705 34865 37273 38855 42660 45161 44792 48689 54037 55978 51318 48080 48263 44436
10211D4436j1930j6836o961J538k9m4J987m728k496l84k265j838k041M265J786
$$ 44436 32506 15670 8709 10247 10218 10174 12161 7433 4937 4553 2288 450 -1591 2674 4460
10196D460j043L119N760K89M737M266j924o931k186k247m517l847M24M092J81
$$ 4460 3417 6536 12296 12585 17322 21588 19664 12733 10547 8300 3783 -64 360 4452 4633
10181D633J914R4k054K593R53N404M891J510P356O276k386j0557r271n063m835
$$ 4633 6547 6641 4587 7180 8133 13537 18428 19938 27294 33570 31184 20627 11356 6293 1458
10166A458m779o077m859J408J579K682J0908R014M468K899K190j019j980J420
$$ 1458 -3321 -9398 -14257 -12849 -11270 -8588 2320 11334 15802 18701 20891 19872 17892 19312
10152A9312L348P226P125R2J31N981R680J5611J2139P805Q732J6983K0882J8480
$$ 19312 22660 29886 37011 37103 37234 43215 52895 68506 80645 88450 97182 114165 135047 153527
10138A53527J4366J8811K2207J6619J8106K7921M2180N5577P6472J15554J76287
$$ 153527 167893 186704 208911 225530 243636 271557 313737 369314 445786 561340 737627
10127G37627K73752M52773P40202J169334J596229J517762M68855r49147j617635
$$ 737627 1011379 1464152 2204354 3373688 4969917 6487679 6956534 6007387 4389752
10118D389752j430422r67770o01968l79054k55161j74180j19561q4755o1709m6138
$$ 4389752 2959330 1991560 1389592 1010538 755377 581197 461636 376881 315172 269034
10108B69034l2602k2919j2587j4151j4430j7985k2469k0141j6361p521o341n282
$$ 269034 236432 213513 200926 186775 172345 154360 131891 111750 95389 87868 81527 76245
10096G6245n555m041m407P17P14m872o379K68J885M305L877L765o311j3275r251
$$ 76245 70690 66649 62242 62959 63673 58801 52422 52690 54575 58880 62757 66522 60211 46936 37685
10081C7685k559j910Q95m41J39j057r38J53k302q53M743M994O059o17m926j249
$$ 37685 35126 33216 34111 33670 33809 32752 31814 31967 29665 28812 33555 38549 44608 43991 39065 37816
10065C7816j581M55Q637J3602J1253J5146J8933L5744N3832P5321J24486K10746
$$ 37816 36235 36690 45327 58929 70182 85328 104261 140005 193837 269158 393644 604390
10053F04390L25928L75904J55688k27483l80928k97167j88548j13310o7321m6043
$$ 604390 930318 1306222 1461910 1234427 853499 556332 367784 254474 187153 141110
10043A41110l3691k7479j6600r932n968m362j049l956l700l766m809j039K272
$$ 141110 107419 79940 63340 53408 47440 43078 42029 38073 34373 30607 25798 24759 27031
10030B7031k257k837J21m523j0611p932J851O542N190N324r70l548k388k247r29
$$ 27031 24774 21937 22058 17535 6924 -1008 843 7385 12575 17899 16929 13381 10993 8746 7817
10015G817L06j705l697M948J541J907j111n661l155K232M191M065L373O9L211
$$ 7817 8123 6418 2721 7669 9210 11117 10006 4345 1190 3422 7613 11678 15051 15120 18331
10000A8331J5259K3749K0920K6109M5655N8495K8354j6559n5210o3438l9567j4139
$$ 18331 33590 57339 78259 104368 150023 208518 236872 220313 165103 101665 62098 47959
9988D7959j1010j6581j1249r90l370n457NQ27p58p70L61j423j372k783J116j292
$$ 47959 36949 20368 9119 8129 4759 -698 -693 134 -624 -1394 -1033 -2456 -3828 -6611 -5495 -6787
9972f787J1M93k038k354L313L166M441j295k378L107J735j334j212j492L59L85
$$ -6787 -6776 -6283 -8321 -10675 -7362 -4196 245 -1050 -3428 -321 1414 80 -1132 -2624 -2265 -1880
9956a880k395N33j905K473J375m099p9l270j635j99k392j421j674L56o43j734
$$ -1880 -4275 -3742 -5647 -3174 -1799 -5898 -5977 -9247 -10882 -11081 -13473 -14894 -16568 -16212 -16855 -18589
9940a8589J834j917j284NK461M789Q75j288m214J188N952L02l101j376J601J71
$$ -18589 -16755 -18672 -19956 -19951 -17490 -12701 -11826 -13114 -17328 -16140 -10188 -9886 -12987 -14363 -12762 -12591
9924a2591P84O091M376M96l525j838m613Q06k340j036N90N87L033J143m453j375
$$ -12591 -11807 -5716 -1340 -844 -4369 -6207 -10820 -10014 -12354 -13390 -12800 -12213 -9180 -8037 -12490 -13865
9908a3865Q8m130p51L849L80O21O64J787l369P4L608J551K46l00r27K201O40l263
$$ -13865 -13777 -17907 -18658 -14809 -14429 -13808 -13144 -11357 -14726 -14652 -11044 -9493 -9247 -9547 -10474 -8273 -7633 -10896
9890a0896J561J322K300O104K213k516k363l297k893j952m88J841J554L90l303
$$ -10896 -9335 -8013 -5713 391 2604 88 -2275 -5572 -8465 -10417 -10905 -9064 -7510 -7120 -10423
9875a0423k962K363l20j466j459k603r92K648j149R66L840M020J43l145l017L468
$$ -10423 -13385 -11022 -11342 -12808 -14267 -16870 -17862 -15214 -16363 -15397 -11557 -7537 -7394 -10539 -13556 -10088
9859a0088M782j682K65r38L87P024k750n155P60J30P03j357n17K73J483o14o785
$$ -10088 -5306 -6988 -6723 -7661 -7274 -250 -3000 -8155 -7395 -7265 -6562 -7919 -8436 -8163 -6680 -7294 -14079
9842a4079m305L61K302K068M636L363q67o92k16j050K167o39n777m897N18K440
$$ -14079 -18384 -18023 -15721 -13653 -9017 -5654 -6521 -7213 -7429 -8479 -6312 -6951 -12728 -17625 -17107 -14667
9826a4667J33L683N606k04m921M543K11m50k140Q20O70K9k223J70j629N424L165
$$ -14667 -14534 -10851 -5245 -5449 -10370 -5827 -5616 -6066 -8206 -7386 -6716 -6687 -8910 -8740 -10369 -4945 -1780
9809a780k976m044k870J084k736M418O326K018l284p26J694M65P4j889m616J10
$$ -1780 -4756 -8800 -11670 -10586 -13322 -8904 -2578 -560 -3844 -4570 -2876 -2411 -2337 -4226 -8842 -8732
9793h732j233K679L85j044j967j780N56J197K731M930j551m735j529k54L231r2
$$ -8732 -9965 -7286 -6901 -7945 -9912 -11692 -11136 -9939 -7208 -2278 -3829 -8564 -10093 -10347 -7116 -7208
9777g208r98P95q63q95J279k025J895K869K99m20N92Q12r72k559J23q78J65M46
$$ -7208 -8206 -7411 -8274 -9169 -7890 -9915 -8020 -5151 -4852 -5272 -4680 -3868 -4840 -7399 -7276 -8154 -7989 -7543
9759g543p33L892K340P69n634l608R12K695R62l804k19r14j356N29P17P50j503
$$ -7543 -8276 -4384 -2044 -1275 -6909 -10517 -9605 -6910 -5948 -9752 -9971 -10885 -12241 -11712 -10995 -10245 -11748
9742a1748J363L702N62k780k093k93j375m83M74M711M541K99Q2l732l758M160
$$ -11748 -10385 -6683 -6121 -8901 -10994 -11287 -12662 -13145 -12671 -7960 -3419 -3120 -3038 -6770 -10528 -6368
9726f368L651J374P39L906K942M25k398J808j40m270j90j570o112k168k222j092
$$ -6368 -2717 -1343 -604 3302 6244 6669 4271 6079 5939 1669 1479 -91 -6203 -8371 -10593 -11685
9710a1685K663O294K756N74k048J103M191p53j015L29M824N385K400k904m530
$$ -11685 -9022 -2728 28 602 -1446 -343 3848 3095 2080 2409 7233 12618 15018 12114 7584
9695G584J679n11m813j461R79l06l411j131K407j616n282m672J545J0417M507
$$ 7584 9263 8752 3939 2478 3457 3151 -260 -1391 1016 -600 -5882 -10554 -9009 1408 5915
9680E915j065m35L719l625m723j440k723n00J378J928j310l623m078K955L99j830
$$ 5915 4850 4415 8134 4509 -214 -1654 -4377 -4877 -3499 -1571 -2881 -6504 -10582 -7627 -7228 -9058
9664i058Q34j802K066M47m22K081p81L078J162q30j992k46p80O15l2L08m13k447
$$ -9058 -8224 -10026 -7960 -7513 -7935 -5854 -6635 -3557 -2395 -3225 -5217 -5463 -6243 -5628 -5660 -5352 -5765 -8212
9646h212l516j247j890L963M531L587N030J059J357j226l130p90l728j915L999
$$ -8212 -11728 -12975 -14865 -10902 -6371 -2784 2246 3305 4662 3436 306 -484 -4212 -6127 -2128
9631b128P756Q396l613j1740k673L118N889k609l298l480n434k342j635R45K820
$$ -2128 5628 14024 10411 -1329 -4002 -884 5005 2396 -902 -4382 -9816 -12158 -13793 -12848 -10028
9616a0028L556l775l69o75J017j514J985K600k040N275L568l025J016J324K410
$$ -10028 -6472 -10247 -10616 -11291 -10274 -11788 -9803 -7203 -9243 -3968 -400 -3425 -2409 -1085 1325
9601A325j323k157L232n691k976j9J422L403l282k797J019N261j759j691O0J423
$$ 1325 2 -2155 1077 -4614 -7590 -7609 -6187 -2784 -6066 -8863 -7844 -2583 -4342 -6033 -5973 -4550
9585d550J65r1J973K750l438l144Q25k615j414L227M207O72j435l04j542p66M523
$$ -4550 -4385 -4476 -2503 247 -3191 -6335 -5510 -8125 -9539 -6312 -2105 -1433 -2868 -3172 -4714 -5480 -957
9568i57L147n16k567j701K004o29j89L040J236r49K05j171l826N3J572m279k697
$$ -957 2190 1674 -893 -2594 -590 -1219 -1408 1632 2868 1919 2124 953 -2873 -2820 -1248 -5527 -8224
9551h224o5K501O31M324J072n71P12M12J248p38l484j273J465m537J375N456j127
$$ -8224 -8289 -5788 -5157 -833 239 -332 380 792 2040 1302 -2182 -3455 -1990 -6527 -5152 304 -823
9534h23k10J14L201J586k112n461K201K013j703Q39L888j802p223K28M844M019
$$ -823 -1033 -919 2282 3868 1756 -3705 -1504 509 -1194 -355 3533 1731 -5492 -5264 -420 3599
9518C599q08M431J840m762p451r751n837k339O700J2600R399l705o650k608k51
$$ 3599 2791 7222 9062 4300 -3151 -12902 -18739 -21078 -14378 -1778 7621 3916 -2734 -5342 -5593
9503e593L529o08l136m55j071Q96l376L176l06j665L54NJ706J667J129K293K782
$$ -5593 -2064 -2672 -5808 -6263 -7334 -6438 -9814 -6638 -6944 -8609 -8255 -8250 -6544 -4877 -3748 -1455 1327
9486A327n19p000l302j04L915O449M29K992j427k911j123K737K057m67K60j081
$$ 1327 808 -6192 -9494 -9598 -5683 766 1195 4187 2760 -151 -1274 1463 3520 3053 3313 2232
9470B232K944n24k768k920K239J570r14o029l621N76J418N524M077j146J422L71
$$ 2232 5176 4652 1884 -1036 1203 2773 1859 -4170 -7791 -7215 -5797 -273 3804 2658 4080 4451
9454D451k486k13M66k37J980O99l805j491j703K20J490k055L34O60o271l581M084
$$ 4451 1965 1752 2218 1981 3961 4660 855 -636 -2339 -2119 -629 -2684 -2350 -1690 -7961 -11542 -7458
9437g458L53j534J960K997K553M24l845L70k60K392M15J822Q40q14j149m245N381
$$ -7458 -7105 -8639 -6679 -3682 -1129 -705 -4550 -4180 -4440 -2048 -1633 189 1029 215 -934 -5179 202
9420B02J216j990j652J250L897j031j698l46j356P55q80J511j973r75k611K293
$$ 202 1418 -572 -2224 -974 2923 1892 194 -152 -1508 -753 -1633 -122 -2095 -3070 -5681 -3388
9404c388J588M091R17j511r5k606k265L304r65M38N737k587l14K285j138l783
$$ -3388 -1800 2291 3208 1697 1602 -1004 -3269 35 -930 -492 5245 2658 2344 4629 3491 -292
9388b92J001K666J516J555m00k985J583k038k796m084Q53M609N079R38j116k534
$$ -292 709 3375 4891 6446 6046 3061 4644 2606 -190 -4274 -3421 1188 6267 7205 6089 3555
9372C555j084N25j84J187k250O63o47J652O98j470M055K045J944J485m71l205
$$ 3555 2471 2996 2812 3999 1749 2412 1765 3417 4115 2645 6700 8745 10689 12174 11703 8498
9356H498J452p04l274l67M357K996j091k520k297o219n09O131J35L237l918m137
$$ 8498 9950 9246 5972 5605 9962 12958 11867 9347 7050 831 322 6453 6588 9825 5907 1770
9340A770J451m9J033J304l57j384J368m80J828J58r23J497K563o81p436k088N906
$$ 1770 3221 3172 4205 5509 5152 3768 5136 4656 6484 6642 5719 7216 9779 9098 1662 -426 5480
9323E480J475L27K430J57p43k512N04K883m727k179J442N651O512Q08k469j412
$$ 5480 6955 7282 9712 9869 9126 6614 7118 10001 5274 3095 4537 10188 16700 17508 15039 13627
9307A3627k884R2J497p213k913M605M287j442o046n14l338K684j373Q76J279j780
$$ 13627 10743 10835 12332 5119 2206 6811 11098 9656 3610 3096 -242 2442 1069 1945 3224 1444
9291A444K993O228k127j922J90Q16j836K484K346j853Q70K389L685K120k47l801
$$ 1444 4437 10665 8538 6616 6806 7622 5786 8270 10616 8763 9633 12022 15707 17827 17580 13779
9275A3779l310j252O47j022j031m128l73M841L357n68n02k264j569L523j774q19
$$ 13779 10469 9217 9864 8842 7811 3683 3310 8151 11508 10940 10438 8174 6605 10128 8354 7535
9259G535o04J554j171k63n98L071J495m597L72N768K753p36j647j177n174J558
$$ 7535 6931 8485 7314 7051 6453 9524 11019 6422 6794 12562 15315 14579 12932 11755 6581 8139
9243H139L902m20J512L327n934l217M239k617n836P99L290M965O66m94o49o3P37
$$ 8139 12041 11621 13133 16460 10526 7309 11548 8931 3095 3894 7184 12149 12815 12321 11672 11609 12346
9226A2346K881n605j668K443J705j791n960p69Q28k185k98K253K196J157J644
$$ 12346 15227 9622 7954 10397 12102 10311 4351 3582 4410 2225 1927 4180 6376 7533 9177
9211I177q72L33J389N817l13j103K87j179m977q52N96K354L86K648J233Q40O08
$$ 9177 8305 8638 10027 15844 15531 14428 14715 13536 8559 7707 8303 10657 11043 13691 14924 15764 16372
9194A6372O57l765K026M371P20j144n121j993m12j995k677P93L726q86K907J253
$$ 16372 17029 13264 15290 19661 20381 19237 14116 12123 11711 9716 7039 7832 11558 10672 13579 14832
9178A4832k80J683m641l551N070M502j833k864k97j059k94o06K980M603J386J375
$$ 14832 14552 16235 11594 8043 13113 17615 15782 12918 12621 11562 11268 10662 13642 18245 19631 21006
9162B1006l630K766J559m899K192k510n887K872J996p01o8P78j287P74K894K618
$$ 21006 17376 20142 21701 16802 18994 16484 10597 13469 15465 14764 14696 15474 14187 14961 17855 20473
9146B0473J2l529J818K879n16N21m961l247p39k576p70J820N747L451n497o10
$$ 20473 20485 16956 18774 21653 21137 21658 16697 13450 12711 10135 9365 11185 16932 20383 14886 14276
9130A4276K115j155k989l368J042J177J539j352N120K01k088j381k019o29M634
$$ 14276 16391 15236 12247 8879 9921 11098 12637 11285 16405 16606 14518 13137 11118 10489 15123
9115A5123K307p73j129N366L58N847K199k684q020l317P31M691j808n218J733
$$ 15123 17430 16657 15528 20894 21252 27099 29298 26614 18594 15277 16008 20699 18891 13673 15406
9100A5406j905L899q15l172k061M299L756J289J833j36m162J755J671K044N90
$$ 15406 13501 17400 16585 13413 11352 15651 19407 20696 22529 22393 18231 19986 21657 23701 24291
9085B4291M860O282L504L485L625m16r433q816o187o254m971m065L939O745O35
$$ 24291 29151 35433 38937 42422 46047 45631 36198 27382 21195 14941 9970 5905 9844 16589 17224
9070A7224J636J946j471N44L081P12r36k758j022L67N395J464M914K071j501j066
$$ 17224 18860 20806 19335 19879 22960 23672 22736 19978 18956 19323 24718 26182 31096 33167 31666 30600
9054C0600j935P54k556n241K81k468Q3r35M275J531J534l5j554l3r17L123L790
$$ 30600 28665 29419 26863 21622 21903 19435 19518 18583 22858 24389 25923 25888 24334 24301 23384 26507 30297
9037C0297J802j052q055o424J081P808Q035P1n204n538l296l745l3Q381N327N07
$$ 30297 32099 31047 22992 16568 17649 25457 33492 33563 28359 22821 19525 15780 15747 24128 29455 29962
9021B9962k371L283K375N32L3L019j27m75o90q02o8L055l559j123j589l678L407
$$ 29962 27591 30874 33249 33781 33814 36833 36706 36231 35541 34739 34671 37726 34167 33044 31455 27777 31184
9004C1184R30K880K248j080j420k129J041K0j120l721k441j936L616M250J34R93
$$ 31184 32114 34994 37242 36162 34742 32613 33654 33674 32554 28833 26392 24456 28072 32322 32456 33449
8988C3449J865k788l446J267K753k101q91L200J742k930k24J767K099Q48m868
$$ 33449 35314 32526 29080 30347 33100 30999 30108 33308 35050 32120 31896 33663 35762 36610 31742
8973C1742l064J41K985M291K827M107J032P97R38n654m134j581K385M21K276K87
$$ 31742 28678 28819 31804 36095 38922 43029 44061 44858 45796 40142 36008 34427 36812 37233 39509 39796
8957C9796J593K384l399n147k890K697L342J179j278j005k957n42k98o12o71K015
$$ 39796 41389 43773 40374 35227 32337 35034 38376 39555 38277 37272 34315 33773 33475 32863 32192 34207
8941C4207K220lq998j297O267M466N981N14j178l375J131K08k025K546K489K016
$$ 34207 36427 36424 27426 26129 32396 36862 42843 43357 42179 38804 39935 40143 38118 40664 43153 45169
8925D5169J189j487j014K384n91P46q56k335P334K624k035m177j898N888K886
$$ 45169 46358 44871 43857 46241 45650 46396 45540 43205 50539 53163 51128 46951 45053 50941 53827
8910E3827K700K530q85L272L93m388p928k892L291O051K384l188k167J924L033
$$ 53827 56527 59057 58172 61444 61837 57449 49521 46629 49920 55971 58355 55167 53000 54924 57957
8895E7957M773Q70R78K873L584O766R825J5191L1608N4245O8127K8569l9135o4513
$$ 57957 62730 63600 64578 67451 71035 77801 87626 102817 134425 188670 256797 285366 246231 181718
8881A81718m4332k5921j7098r339m762l662j72l289k526M46J821L731M130L321
$$ 181718 137386 111465 94367 85028 80266 76604 76432 73143 70617 71063 72884 76615 80745 84066
8867H4066O259L601p321q991k548k594n240j739K127l87J91j57P00K517l929j986
$$ 84066 90325 93926 86605 77614 75066 72472 67232 65493 67620 67233 67424 67267 67967 70484 66555 64569
8851F4569l392J935J894L205n0J400L308J168L470p42j622R93K790N757k655R05
$$ 64569 61177 63112 65006 68211 68161 69561 72869 74037 77507 76765 75143 76136 78926 84683 82028 82933
8835H2933M49k337k025k512K391J162L101J111j092o21k319j693k068N04m94Q05
$$ 82933 83382 81045 79020 76508 78899 80061 83162 84273 83181 82560 80241 78548 76480 76984 76490 77295
8819G7295R16L346j168p61J733K535P42j478R23L09J659M032L826N043k729j357
$$ 77295 78211 81557 80389 79628 81361 83896 84638 83160 84083 84392 86051 90083 93909 98952 96223 94866
8803I4866J61m264n30M324L188J843R31l81J395k525M018M453N83K732k85r71
$$ 94866 95027 90763 90233 94557 97745 99588 100519 100138 101533 99008 103026 107479 108062 110794 110509 109538
8787A09538N27M015J89k912j482N01k21J323N474J795K09J603k610J69K186N31
$$ 109538 110065 114080 114269 111357 109875 110376 110155 111478 116952 118747 118956 120559 117949 118118 120304 120835
8771A20835O30N552M054j268J087K139K905l642q93j794nK430K962R5J296L178
$$ 120835 121465 127017 131071 129803 130890 133029 135934 132292 131399 129605 129600 132030 134992 135087 136383 139561
8755A39561q93j153k759L253K706L232J425j495l070L392M823L956J908K153J001
$$ 139561 138668 137515 134756 138009 140715 143947 145372 143877 140807 144199 149022 152978 154886 157039 158040
8740A58040J366J782j999j185o32M683L821J135J964M939O145K163k888j678L540
$$ 158040 159406 161188 159189 158004 157372 162055 165876 167011 168975 173914 180059 182222 179334 177656 181196
8725A81196K596J09k044J935P588P433L365L600K953J776m500m88K634l613M532
$$ 181196 183792 183901 181857 183792 191380 198813 202178 205778 208731 210507 206007 205519 208153 204540 209072
8710B09072N786N81K616N145P50n5J781N295M267J082L10j380O894J656M32M250
$$ 209072 214858 215439 218055 223200 223950 223895 225676 230971 235238 236320 236630 235250 242144 243800 244232 248482
8694B48482M642M878N845K098L600N027L190K158J414J074M894Q478J977p87R57
$$ 248482 253124 258002 263847 265945 269545 274572 277762 279920 281334 282408 287302 295780 297757 296970 297927
8679B97927Q521J0730M646J428O282P47K022N719P184r52K72O652L813L372R537
$$ 297927 306448 317178 321824 323252 329534 330281 332303 338022 345206 344254 344526 351178 354991 358363 367900
8664C67900P715M958O982L500M417Q859O408L714L751O237Q363M724N941O320
$$ 367900 375615 380573 387555 391055 395472 404331 410739 414453 418204 424441 432804 437528 443469 449789
8650D49789R266Q665M413M870M895P370R485Q757N821Q540J0216P865P904R550
$$ 449789 459055 467720 472133 477003 481898 489268 498753 507510 513331 521871 532087 539952 547856 557406
8636E57406Q473M326L710R895J2817J3453J4827J1779J0543J0550J1055J1477
$$ 557406 565879 570205 573915 583810 596627 610080 624907 636686 647229 657779 668834 680311
8624F80311R738J7312J7313J6935J4694J9289J8007J6631J8768K1283K1925K4311
$$ 680311 690049 707361 724674 741609 756303 775592 793599 810230 828998 850281 872206 896517
8612H96517J7628P530J0561J1606O435P947R232J0157J7249J6493J7699J8994
$$ 896517 914145 921675 932236 943842 950277 958224 967456 977613 994862 1011355 1029054 1048048
8600A048048J6364J6790K3060K5784K5228K3326K4626K9039K6574K3539K9425
$$ 1048048 1064412 1081202 1104262 1130046 1155274 1178600 1203226 1232265 1258839 1282378 1311803
8589A311803L4788L3462L6198L6049L4000L6479L9813M2739M6844M1308M6058
$$ 1311803 1346591 1380053 1416251 1452300 1486300 1522779 1562592 1605331 1652175 1693483 1739541
8578A739541N1034M9378M7882N3461O1117O1793O0533O3465O5821O6331P0735
$$ 1739541 1790575 1839953 1887835 1941296 2002413 2064206 2124739 2188204 2254025 2320356 2391091
8567B391091P3713P8132Q3597Q6790Q4371R0326R9341R8692J04910J10869J09803
$$ 2391091 2464804 2542936 2626533 2713323 2797694 2888020 2987361 3086053 3190963 3301832 3411635
8556C411635J13434J18357J26303J31990J34978J37314J43216J46305J49184J54090
$$ 3411635 3525069 3643426 3769729 3901719 4036697 4174011 4317227 4463532 4612716 4766806
8546D766806J62049J67534J73988J70498J70655J76703J75206J77301J79907J74803
$$ 4766806 4928855 5096389 5270377 5440875 5611530 5788233 5963439 6140740 6320647 6495450
8536F495450J73947J65022J59617J54167J49517J43048J29083J16552J01388R3864
$$ 6495450 6669397 6834419 6994036 7148203 7297720 7440768 7569851 7686403 7787791 7881655
8526G881655P8598O0832L7111J7135L301j4495l7001n7370p2685q3623r6844j11620
$$ 7881655 7960253 8021085 8058196 8075331 8078632 8064137 8027136 7969766 7897081 7813458 7716614 7604994
8514G604994j27219j39974j45579j59038j60798j69129j75540j75281j75455j75645
$$ 7604994 7477775 7337801 7192222 7033184 6872386 6703257 6527717 6352436 6176981 6001336
8504F001336j76043j74886j72641j72679j69751j63909j59863j56160j57479j45970
$$ 6001336 5825293 5650407 5477766 5305087 5135336 4971427 4811564 4655404 4497925 4351955
8494D351955j38352j41214j39095j28942j30503j29059j20597j08943j06527j04130
$$ 4351955 4213603 4072389 3933294 3804352 3673849 3544790 3424193 3315250 3208723 3104593
8484C104593j00317r6650r0287r2770r3126q1878p7030p4344p4317o8456o4731
$$ 3104593 3004276 2907626 2817339 2724569 2631443 2549565 2472535 2398191 2323874 2255418 2190687
8473B190687o5801o1975n6150n8843n8591n2762n1826n5797m7625m5057m2445
$$ 2190687 2124886 2062911 2006761 1947918 1889327 1836565 1784739 1728942 1681317 1636260 1593815
8462A593815m1364m0773l9554l8508l6792l2637l0990l2983l4421k7774l1308
$$ 1593815 1552451 1511678 1472124 1433616 1396824 1364187 1333197 1300214 1265793 1238019 1206711
8451A206711l0203k5692k5266k7697k7366k4418j9036k4672k6239k1396j9004
$$ 1206711 1176508 1150816 1125550 1097853 1070487 1046069 1027033 1002361 976122 954726 935722
8440I35722j7847j7958k0489j6598k0115j8390j9456j8792j6295j5015j4858j8274
$$ 935722 917875 899917 879428 862830 842715 824325 804869 786077 769782 754767 739909 721635
8428G21635j3135r408j3415j8408j5779n329q481j4297j7682j2785j1574p092
$$ 721635 708500 699092 685677 667269 651490 646161 637680 623383 605701 592916 581342 574250
8416E74250j0753q391p763r414j0908p632l791p549j0129r867j1232m529o951
$$ 574250 563497 555106 547343 537929 527021 519389 515598 508049 497920 488053 476821 472292 465341
8403D65341p867o468o472o157p439j1783q008r927p837o105L30l752o768o629
$$ 465341 457474 451006 444534 438377 430938 419155 411147 401220 393383 387278 387608 383856 377088 370459
8389C70459q506m065m549l413j930m559p774o770m167n985m241n948j025q03p118
$$ 370459 361953 357888 353339 349926 347996 343437 335663 328893 324726 318741 314500 308552 307527 306724 299606
8374B99606j379k486m195n440o666k974l517j432j751l860m261l435m062n638
$$ 299606 298227 295741 291546 286106 279440 276466 272949 271517 269766 265906 261645 258210 254148 248510
8360B48510j160j939N99Q74J448j598j0345j1113o418J23j047q86j859j873j630
$$ 248510 247350 245411 246010 246884 248332 246734 236389 225276 218858 218981 217934 217048 215189 213316 211686
8345B11686j517Ol660l279K737l480k470k545J75k123k126j781l687l108j384
$$ 211686 210169 210175 206515 203236 205973 202493 200023 197478 197653 195530 193404 191623 187936 184828 183444
8330A83444J759n036k002N711K498k123k206l781o232J413L179M381J510L328
$$ 183444 185203 180167 178165 183876 186374 184251 182045 178264 172032 173445 176624 181005 182515 185843
8316A85843J0155J3674K0620L7706O0093N8877J5593m4878n7989n1018l8224k0332
$$ 185843 195998 209672 230292 267998 328091 386968 402561 357683 299694 248676 210452 190120
8304A90120j4348j1340l859n16n404m050o040o481m457l73J539p11l346m955J260
$$ 190120 175772 164432 160573 160057 154653 150603 144563 138082 133625 133252 134791 134080 130734 125779 127039
8289A27039m34l539l990k584k000K633N649K744k111J64J760M859l529p85P342
$$ 127039 126605 123066 119076 116492 114492 117125 122774 125518 123407 123571 125331 130190 126661 125876 133218
8274A33218R384J2545K7476M7702O1611N3692j022n7026o3301m2774k1872j3812
$$ 133218 142602 155147 182623 230325 291936 345628 344606 287580 224279 181505 159633 145821
8262A45821j1777r900o774o349n762m865l152Q73L128l834p348k540O17K872J294
$$ 145821 134044 124144 117370 111021 105259 100394 97242 98115 101243 97409 90061 87521 88138 91010 92304
8247I2304o452J280M284r26k896Q06J203m174k690O18l145j041m886l449J95L741
$$ 92304 85852 87132 91416 90490 87594 88400 89603 85429 82739 83357 80212 79171 74285 70836 71031 74772
8231G4772L996k06j6k878n790n87M994j520n162j523K243N561J036j157l681r68
$$ 74772 78768 78562 78546 75668 69878 69291 74285 72765 67603 66080 68323 73884 74920 73763 70082 69114
8215F9114l785K22O23j593o21K480K397R19j474l899j855M65j469m025k885r5
$$ 69114 65329 65551 66174 64581 63960 66440 68837 69756 68282 64383 62528 62993 61524 57499 54614 54519
8199E4519M999L393n019j299k464o549j228R71O319M652K224l393k258M60j452
$$ 54519 59518 62911 57892 56593 54129 47580 46352 47323 53642 58294 60518 57125 54867 55327 53875
8184E3875k831L766l62q58M59K704N88l600n544L740L125J400m612R4J296K68
$$ 53875 51044 54810 54448 53590 54049 56753 57341 53741 48197 51937 55062 56462 51850 51944 53240 53508
8168E3508M891m224k466N63l319M44m801J888P84k818j997L431K485M530L412
$$ 53508 58399 54175 51709 52272 48953 49397 44596 46484 47268 44450 42453 45884 48369 52899 56311
8153E6311m206l318o79m65K977J593k222o050j009r80K813M628j117j542M021
$$ 56311 52105 48787 48108 47643 50620 52213 49991 43941 42932 41952 44765 49393 48276 46734 50755
8138E0755k79o227m346P97J075J160K94n82r25L261M178n69n574q369m470M578
$$ 50755 50476 44249 39903 40700 41775 42935 43229 42647 41722 44983 49161 48592 43018 34649 30179 34757
8122C4757M494N68m254j359M579R34l449k370j698J980L458N08k577j844L632
$$ 34757 39251 39819 35565 34206 38785 39719 36270 33900 32202 34182 37640 38148 35571 33727 37359
8107C7359M071R12M65r17k080m886l867L52Q7P7J765M78K026K028L29l047O40
$$ 37359 41430 42342 42807 41890 39810 34924 31057 31409 31496 31573 33338 33816 35842 37870 38199 35152 35792
8090C5792l68k720k327J699l839Q89J798M060K595L571j781k319n776r1N440K034
$$ 35792 35424 32704 30377 32076 28237 29126 30924 34984 37579 41150 39369 37050 31274 31183 36623 38657
8074C8657m606r68O4J930j370j343K888L821l697J402J572k487J56Q9K213L142
$$ 38657 34051 33083 33147 35077 33707 32364 35252 39073 35376 36778 38350 35863 36019 36108 38321 41463
8058D1463K992K176j001j629k342j944l579J81J596J457k417q84J560J769M751
$$ 41463 44455 46631 45630 44001 41659 39715 36136 36317 37913 39370 36953 36069 37629 39398 44149
8043D4149O09k306j752j705k566l352J719N532m9l288L247K423j18K082O250k790
$$ 44149 44758 42452 40700 38995 36429 33077 34796 40328 40279 36991 40238 42661 42543 44625 50875 48085
8027D8085k337j57p34J317q71J195O733M634J731L008L239J778m217M86K536P55
$$ 48085 45748 45591 44857 46174 45303 46498 53231 57865 59596 62604 65843 67621 63404 63890 66426 67181
8011F7181o432k694o461o272j608Q60j794k446K258J396J565k30j266k628k675
$$ 67181 60749 58055 51594 45322 43714 44574 42780 40334 42592 43988 45553 45323 44057 41429 38754
7996C8754l439K684M815k572k236k523R4L886N381K409L545k111l096L76L678
$$ 38754 35315 37999 42814 40242 38006 35483 35577 39463 44844 47253 50798 48687 45591 45967 49645
7981D9645M168N669K943M5k455l360j681j713n85P2M446K138K00p664j18k631
$$ 49645 53813 59482 62425 62470 60015 56655 54974 53261 52676 52748 57194 59332 59532 51868 51750 49119
7965D9119j526l445Q93k994k242j009j001l60j769m134L78q32J797O27R28j096
$$ 49119 47593 44148 45041 42047 39805 38796 37795 37435 35666 31532 31910 31078 32875 33502 34430 33334
7949C3334m067l200J856J125J086j014k709k528N20K72L174L484J990k249J002
$$ 33334 29267 26067 27923 29048 30134 29120 26411 23883 24403 24675 27849 31333 33323 31074 32076
7934C2076L632Q08N29l166p85K035l050n254j900l083K097M180m957m747K944
$$ 32076 35708 36516 37045 33879 33094 35129 32079 26825 24925 21842 23939 28119 23162 18415 21359
7919B1359M556J738j238j054K380k122m605j753J85J666K303K88J607J16r51l023
$$ 21359 25915 27653 26415 25361 27741 25619 21014 19261 19446 21112 23415 23703 25310 25426 24475 21452
7903B1452l997L50m13M45R88m122J219J207k042q53j922O94j511k21N474O33k529
$$ 21452 17455 17805 17392 17837 18825 14703 15922 17129 15087 14234 12312 13006 11495 11274 16748 17381 14852
7886A4852m133l819K189J579j824r62L278J725l711J582K423k425k46O421M997
$$ 14852 10719 6900 9089 10668 8844 7882 11160 12885 9174 10756 13179 10754 10508 16929 21926
7871B1926J830m591o387l081J991L07J983J233j0m113k805K68M110K562j226J073
$$ 21926 23756 19165 12778 9697 11688 11995 13978 15211 15201 11088 8283 8551 12661 15223 13997 15070
7855A5070L50Q55j773m49J011j888m038K077m190J476K726J082j298m008k954
$$ 15070 15420 16275 14502 14053 15064 13176 9138 11215 7025 8501 11227 12309 11011 7003 4049
7840D049P333R38k975l725k477J976L137m03J651J302K804n433N03M02j402M23
$$ 4049 11382 12320 9345 5620 3143 5119 8256 7853 9504 10806 13610 8177 8680 9082 7680 8103
7824H103J035L17k956J494L528n448l236M730o86j876M163M750j51k452l891k744
$$ 8103 9138 9455 6499 7993 11521 6073 2837 7567 6881 5005 9168 13918 13767 11315 7424 4680
7808D680J73J760l379J482J100K680j108M61j431n874O6N441K798o86j39n084
$$ 4680 4853 6613 3234 4716 5816 8496 7388 7849 6418 544 610 6051 8849 8163 8024 2940
7792B940k022K725Q96K352M574k09j363m824k759K466q06J055K4n758j804N680
$$ 2940 918 3643 4539 6891 11465 11256 9893 5069 2310 4776 3970 5025 5049 -709 -2513 3167
7776C167J11RN407L904k958l126J002k819j204J690o22j834J429J809k30q21k879
$$ 3167 3278 3287 8694 12598 9640 6514 7516 4697 3493 5183 4561 2727 4156 5965 5735 4914 2035
7759B035N17j659k900m430O813N020j303j725n3N91m94R48m23L91n423j53M712
$$ 2035 2552 893 -2007 -6437 376 5396 4093 2368 2315 2906 2412 3360 2937 3328 -2095 -2248 2464
7742B464J539M357K486m329r37K36m996r99K344m829k56K130m33O25K087m93J31
$$ 2464 4003 8360 10846 6517 5580 5816 820 -179 2165 -2664 -2920 -790 -1223 -598 1489 996 1127
7725A127K864p7k151p49l718k323L417L985K334j586M68k10N77j060L2J48j325
$$ 1127 3991 3914 1763 1014 -2704 -5027 -1610 2375 4709 3123 3591 3381 3958 2898 2930 3078 1753
7708A753K526K796k956j719R26K622l62k485l364o54K179k30m38M83Q03j964M5
$$ 1753 4279 7075 4119 2400 3326 5948 5586 3101 -263 -917 1262 1032 594 1077 1880 -84 -39
7691c9p44j961m881L68M009K986k368q28J021K992M80K292M00j126l417q24M196
$$ -39 -783 -2744 -7625 -7257 -3248 -262 -2630 -3458 -2437 555 1035 3327 3727 2601 -816 -1640 2556
7674B556J223J819J387k684k323L678k087j159M491n21j954L81j98J259j386j843
$$ 2556 3779 5598 6985 4301 1978 5656 3569 2410 6901 6380 4426 4807 4609 5868 4482 2639
7658B639J049L177J248n329L61J736r99R58K185N04O54j987J117K335J982N7p510
$$ 2639 3688 6865 8113 2784 3145 4881 3882 4840 7025 7529 8183 6196 7313 9648 11630 11687 4177
7641D177j046J479n28l26j999j194l92K205j722r68J680r55M06j41J278J009k091
$$ 4177 3131 4610 4082 3756 1757 563 171 2376 654 -314 1366 411 817 676 1954 2963 872
7624H72L89J269k500l630k415J487M154J004N46L98n21j205l770J959J424n174
$$ 872 1261 2530 30 -3600 -6015 -4528 -374 630 1176 1574 1053 -152 -3922 -1963 -539 -5713
7608e713J216M756j16m140l47J018j028J948J313j873j554L95K181M296m478k29
$$ -5713 -4497 259 143 -3997 -4344 -3326 -4354 -2406 -1093 -2966 -4520 -4125 -1944 2352 -2126 -2355
7592b355J598l491m77J994L455J966j439P69k059m311J872J247L09j563l017k811
$$ -2355 -757 -4248 -4725 -2731 724 2690 1251 2020 -39 -4350 -2478 -1231 -922 -2485 -5502 -8313
7576h313K32Q710M326k016N2J512O13n464r67J47q96m77J917O93j061N225l79
$$ -8313 -8081 629 4955 2939 2991 4503 5116 -348 -1315 -1168 -2064 -2541 -624 69 -992 4233 3854
7559C854j256J345L815K537j413k116k815m160j735J892J350k48k781l382r13
$$ 3854 2598 3943 7758 10295 8882 6766 3951 -209 -1944 -52 1298 1050 -1731 -5113 -6026
7544f026Q71L201M655j288j060m139j210K794L33q43K369L49o47m375k332j340
$$ -6026 -5155 -1954 2701 1413 353 -3786 -4996 -2202 -1869 -2712 -343 6 -641 -5016 -7348 -8688
7528h688N50K880N285J886N16j646n81m098k430m94j687Q74K318K668K861J09
$$ -8688 -8138 -5258 27 1913 2429 783 202 -3896 -6326 -6820 -8507 -7633 -5315 -2647 214 323
7512C23j197m781N44K223L71L825J454K005l884k061l777O41J051R78J28l489
$$ 323 -874 -5655 -5111 -2888 -2517 1308 2762 4767 883 -1178 -4955 -4314 -3263 -2285 -2157 -5646
7496e646l61L986L277L66j658O47J104j689Q75k024m26K047j216j150j553j480
$$ -5646 -6007 -2021 1256 1622 -36 611 1715 26 901 -1123 -1549 498 -718 -1868 -3421 -4901
7480d901J506L448L683j427l602j19J676L076M902K0l716m39j551J060K104l044
$$ -4901 -3395 53 3736 2309 -1293 -1412 264 3340 8242 8262 4546 4107 2556 3616 5720 2676
7464B676j075l058k99j800l726L34K904O81K706K915j18J016J205k676j575k622
$$ 2676 1601 -1457 -1756 -3556 -7282 -6948 -4044 -3363 -657 2258 2140 3156 4361 1685 110 -2512
7448b512j063K405Q55k431N24n24q66k943n10J099J336L930N835j431p376l29
$$ -2512 -3575 -1170 -315 -2746 -2222 -2746 -3612 -6555 -7065 -5966 -4630 -700 5135 3704 -3672 -4001
7432d001k58m68K228L328l683k705J700J427M90J272j926N15l24K352L933J326
$$ -4001 -4259 -4727 -2499 829 -2854 -5559 -3859 -2432 -1942 -670 -2596 -2081 -2405 -53 3880 5206
7416E206P36k325l618l247k514J034L534L165J449m173m109k786l397K877L664
$$ 5206 5942 3617 -1 -3248 -5762 -4728 -1194 1971 3420 -753 -4862 -7648 -11045 -8168 -4504
7401d504N98K370M933p36m234M664K632J009k794m286o37n14K16n717k360J480
$$ -4504 -3906 -1536 3397 2661 -1573 3091 5723 6732 3938 -348 -985 -1499 -1283 -7000 -9360 -7880
7385g880K537O00K707M380k402n07m3j910l377J563k02J585J77J215j666j122
$$ -7880 -5343 -4743 -2036 2344 -58 -565 -608 -2518 -5895 -4332 -4534 -2949 -2772 -1557 -3223 -4345
7369d345K45k014n23L670J607j366m581OJ881K697j916m391K588M656O07j753
$$ -4345 -4100 -6114 -6637 -2967 -1360 -2726 -7307 -7301 -5420 -2723 -4639 -9030 -6442 -1786 -1179 -2932
7353b932q95L529m93j437n297L30L116M622J700P27j384j563j582K458J262K353
$$ -2932 -3827 -298 -791 -2228 -7525 -7195 -4079 543 2243 2970 1586 23 -1559 899 2161 4514
7337D514J426n961R63m107k648M918j122k541j616L336L103k256N0k21k215m149
$$ 4514 5940 -21 942 -3165 -5813 -895 -2017 -4558 -6174 -2838 265 -1991 -1941 -2162 -4377 -8526
7321h526L94K29l02K411M083J687k903J588L011k069J34j481m268k107J119J997
$$ -8526 -8132 -7903 -8205 -5794 -1711 -24 -2927 -1339 1672 -397 -263 -1744 -6012 -8119 -7000 -5003
7305e003J350J947o94J35J318J225O7J083j968j355p06k069j001N750j53q86J641
$$ -5003 -3653 -1706 -2400 -2265 -947 278 345 1428 -540 -1895 -2601 -4670 -5671 79 -74 -960 681
7288F81R97l003l456j515N57M002O79j037M3K874R9l93J168K525j856l495o79
$$ 681 1678 -1325 -4781 -6296 -5739 -1737 -1058 -2095 -2052 822 921 528 1696 4221 2365 -1130 -1809
7271a809K156l94p726m405K093O168N451j295j730k500j301K756O28N288J081
$$ -1809 347 -47 -7773 -12178 -10085 -3917 1534 239 -1491 -3991 -5292 -2536 -1908 3380 4461
7256D461l637l039K637J79J381m691j412K10J802M192O11J878r63o292K331q83
$$ 4461 824 -2215 422 601 1982 -2709 -4121 -3911 -2109 2083 2694 4572 3609 -2683 -352 -1235
7240a235k527J403n39q79j52m889J444K495k100l775M055J02J057J998l248k102
$$ -1235 -3762 -2359 -2898 -3777 -3929 -8818 -7374 -4879 -6979 -10754 -6699 -6597 -5540 -3542 -6790 -8892
7224h892j145l554J040J631L970P993j683k629j21k958J06n61K337K89l641k611
$$ -8892 -10037 -13591 -12551 -10920 -6950 1043 -640 -3269 -3390 -6348 -6242 -6803 -4466 -4177 -7818 -10429
7208a0429J429K989M285l156n0O03K2l94J064K202K489j224j304M624M748m53
$$ -10429 -9000 -6011 -1726 -4882 -4932 -4329 -4307 -4701 -3637 -1435 1054 -170 -1474 3150 7898 7445
7192G445o483n511l059j546P10k987l493L997O52L976j954K574k440n004j09P15
$$ 7445 962 -4549 -7608 -9154 -8444 -11431 -14924 -10927 -10275 -6299 -8253 -5679 -8119 -13123 -13232 -12517
7176a2517O737l4L95N60M28K146J406L666J488k44n093j036L007L895k5p05q29
$$ -12517 -5780 -5814 -5419 -4859 -4431 -2285 -879 2787 4275 4031 -1062 -2098 909 4804 4779 4074 3245
7159C245j450l608j599j804N003J941J148k972J380J808K366q92l065R98l57l925
$$ 3245 1795 -1813 -3412 -5216 -213 1728 2876 -96 1284 3092 5458 4566 1501 2499 2142 -1783
7143a783j314j96K283J790j105J685L93L567k478o870J104L417L43o74P38k830
$$ -1783 -3097 -3293 -1010 780 -325 1360 1753 5320 2842 -4028 -2924 493 836 162 900 -1930
7127a930O58J299m44m343k113L800l030N914K047n099j224J488j111j851K825
$$ -1930 -1272 27 -417 -4760 -6873 -3073 -6103 -189 1858 -3241 -4465 -2977 -4088 -5939 -3114
7112c114K073O136K200l114m060k815K255l662RP70K55L070P25j270m277j354
$$ -3114 -1041 5095 7295 4181 121 -2694 -439 -4101 -4092 -3322 -3067 3 728 -542 -4819 -6173
7096f173Q03J012J699K237n03k77l308j191J923p39j968J924j172J375J136M04
$$ -6173 -5370 -4358 -2659 -422 -925 -1202 -4510 -5701 -3778 -4517 -6485 -4561 -5733 -4358 -3222 -2818
7080b818l44k813j152J479J64P75m334J462L371p37K398M028N109k55l306k754
$$ -2818 -3162 -5975 -7127 -5648 -5484 -4709 -9043 -7581 -4210 -4947 -2549 1479 6588 6333 3027 273
7064B73k513j085J631j962P33P17k571L593J388k515l17p02J278j388l959l355
$$ 273 -2240 -3325 -1694 -3656 -2923 -2206 -4777 -1184 204 -2311 -2628 -3330 -2052 -3440 -7399 -10754
7048a0754J96K548O304L424N36j775j356J86J871J821p24Q41k781q42k130o6l572
$$ -10754 -10558 -8010 -1706 1718 2254 479 -877 -691 1180 3001 2277 3118 337 -505 -2635 -2701 -6273
7031f273K48n35k936L122J188J365K87J232m330k030O161K370k014j154j616k765
$$ -6273 -6025 -6560 -9496 -6374 -5186 -3821 -3534 -2302 -6632 -8662 -2501 -131 -2145 -3299 -4915 -7680
7015g680j876P72j261l848n21L762N395L519M436j087j894m34k251j435M127m39
$$ -7680 -9556 -8784 -10045 -13893 -14414 -10652 -5257 -1738 2698 1611 -283 -717 -2968 -4403 -276 -715
6999g15R01L36l912n113m19P77N105J881q33j679j713L182M537K864m99K434p98
$$ -715 186 522 -3390 -8503 -8922 -8145 -3040 -1159 -1992 -3671 -5384 -2202 2335 5199 4700 7134 6336
6982F336j333n321o78M549n0k498j437l6j457k61J030P26J877j957m359m331O37
$$ 6336 5003 -318 -996 3553 3503 1005 -432 -468 -1925 -2186 -1156 -430 1447 -510 -4869 -9200 -8563
6965h563L810K566l412K679J997j097K151n95n325P75q7J113K95K668K725j294
$$ -8563 -4753 -2187 -5599 -2920 -923 -2020 131 -464 -5789 -5014 -5101 -3988 -3693 -1025 1700 406
6949D06n295j174Q62J803K423K568l551J273l05m296n667L374O237K320j968l798
$$ 406 -4889 -6063 -5201 -3398 -975 1593 -1958 -685 -990 -5286 -10953 -7579 -1342 978 -990 -4788
6933d788o68K645k87p71K249l31k333J287J394m636O86M725J805l331n081L931
$$ -4788 -5456 -2811 -3098 -3869 -1620 -1951 -4284 -2997 -1603 -6239 -5553 -828 977 -2354 -7435 -3504
6917c504L508M811k565m711j450J61j731L937M186J798k016k983lJ25J408l238
$$ -3504 4 4815 2250 -2461 -3911 -3750 -5481 -1544 2642 4440 2424 -559 -562 -437 971 -2267
6901b267k252m914j79j739L6J449K155K496K686j739m377j704M111L601K264M088
$$ -2267 -4519 -9433 -9612 -11351 -11315 -9866 -7711 -5215 -2529 -4268 -8645 -10349 -6238 -2637 -373 3715
6885C715n32n118l250q98K93K203l73L74J332L668o08k625K743l539m467K317
$$ 3715 3183 -1935 -5185 -6083 -5790 -3587 -3960 -3586 -2254 1414 806 -1819 924 -2615 -7082 -4765
6869d765J618O211L476k571l434m167m663L42J907o9l076l460J433M137O671k301
$$ -4765 -3147 3064 6540 3969 535 -3632 -8295 -7953 -6046 -6115 -9191 -12651 -11218 -7081 -410 -2711
6853b711l53M298k272r46j104J678Q20k923j379J303k293j852Q01L615j88M46
$$ -2711 -3064 1234 -1038 -1984 -3088 -1410 -590 -3513 -4892 -3589 -5882 -7734 -6933 -3318 -3506 -3060
6837c060J840K947l038j592k076j179K277M610j449j10J372l104L239L273l958
$$ -3060 -1220 1727 -1311 -2903 -4979 -6158 -3881 729 -720 -830 542 -2562 677 3950 -8
6822hk372n385j942K744J233k348J522M737K371j642kl443J813J432j414q42L187
$$ -8 -2380 -7765 -9707 -6963 -5730 -8078 -6556 -1819 552 -1090 -1092 -4535 -2722 -1290 -2704 -3546 -359
6805c59n86j168k29L00L466j877m488N97P75k335m75M479j00M3l966J713m04J111
$$ -359 -945 -2113 -2342 -2042 1424 -453 -4941 -4344 -3569 -5904 -6379 -1900 -2000 -1957 -5923 -4210 -4614 -3503
6787c503J302o47P71M951O59l013m285q65k959J158j980k400J329P74N810N014
$$ -3503 -2201 -2848 -2077 2874 3533 520 -3765 -4630 -7589 -6431 -8411 -10811 -9482 -8708 -2898 2116
6771B116l627k316L171M66N377j758l404l000K577Q31M426O175k770m915q37j200
$$ 2116 -1511 -3827 -656 -190 5187 3429 25 -2975 -398 433 4859 11034 8264 3349 2512 1312
6755A312R33L307K333O82n320j951p76L646J693O09J678j558J572k296K771n53
$$ 1312 2245 5552 7885 8567 3247 1296 520 4166 5859 6468 8146 6588 8160 5864 8635 8082
6739H082L533J302n573m190j006l095j292R69J845K342o30p22o98R74N40l982
$$ 8082 11615 12917 7344 3154 2148 -947 -2239 -1270 575 2917 2287 1565 867 1841 2381 -1601
6723a601j56P5Q70L092P06K010j987p630k160R15k129n975K45N198K215K163L786
$$ -1601 -1757 -1682 -812 2280 2986 4996 3009 -4621 -6781 -5866 -7995 -13970 -13725 -8527 -6312 -4149 -363
6706c63N2k193n45L977j54m537r32N080M422R7j183m444l688J370J041J381j203
$$ -363 -311 -2504 -3049 928 774 -3763 -4695 385 4807 4904 3721 -723 -4411 -3041 -2000 -619 -1822
6689a822j440L403M684J387k264m312k254m793j124Q80J704j039k655M26J897
$$ -1822 -3262 141 4825 6212 3948 -364 -2618 -7411 -8535 -7655 -5951 -6990 -9645 -9219 -7322
6674g322K724N474J59m03j936m061j721J156K06M848J115K173n836j630q39j192
$$ -7322 -4598 876 1035 632 -1304 -5365 -7086 -5930 -5724 -876 239 2412 -3424 -5054 -5893 -7085
6658g085k236L202K708N16J035K312n554j874L878N66l153K945n90M742K197k389
$$ -7085 -9321 -6119 -3411 -2895 -1860 452 -5102 -6976 -3098 -2532 -5685 -2740 -3330 1412 3609 1220
6642A220l888j387k267N33K275J300j000p5J228p93l590J728k02O71j027R95L196
$$ 1220 -2668 -4055 -6322 -5789 -3514 -2214 -3214 -3289 -2061 -2854 -6444 -4716 -4918 -4247 -5274 -4279 -1083
6625a083M383R29n390r77N322j263j469k667k077K897k04j903J365M56n841L641
$$ -1083 3300 4229 -1161 -2138 3184 1921 452 -2215 -4292 -1395 -1599 -3502 -2137 -1681 -7522 -3881
6609c881O777Q812q52o475l962l576j070j134J354K937l679K266L034J756k694
$$ -3881 2896 11708 10856 4381 419 -3157 -4227 -5361 -4007 -1070 -4749 -2483 551 2307 -387
6594c87k573j423m88m024M217O113l845n308K599N321J961k094j592l617p71L031
$$ -387 -2960 -4383 -4871 -8895 -4678 1435 -2410 -7718 -5119 202 2163 69 -1523 -5140 -5911 -2880
6578b880K249J197k692J166j36r12J243j163l314M44n199l601K768K632M686M289
$$ -2880 -631 566 -2126 -960 -1096 -2008 -765 -1928 -5242 -4798 -9997 -13598 -10830 -8198 -3512 777
6562G77j263k416j940j496k212k362o29N410O039K138O86O95j120j512n221m119
$$ 777 -486 -2902 -4842 -6338 -8550 -10912 -11541 -6131 -92 2046 2732 3427 2307 795 -4426 -8545
6546h545j690M536J364l866K35O890j231m355j681J49J502k79J782J785M12k546
$$ -8545 -10235 -5699 -4335 -8201 -7966 -1076 -2307 -6662 -8343 -8194 -6692 -6971 -5189 -3404 -2992 -5538
6530e538j577K126L366L92J59m959j525O11L38K835o40M45L395P20l501k155K369
$$ -5538 -7115 -4989 -1623 -1231 -1072 -6031 -7556 -6945 -6607 -3772 -4412 -3967 -572 148 -3353 -5508 -3139
6513c139K391k116j959M22P56l37J347L73l192J327J127J364J542J419K503K063
$$ -3139 -748 -2864 -4823 -4401 -3645 -3982 -2635 -2262 -5454 -4127 -3000 -1636 -94 1325 3828 5891
6497E891o07p09J431o84j523l394m320n94r93L484J35N7K825J991O44l14J697
$$ 5891 5284 4575 6006 5322 3799 405 -3915 -4509 -5502 -2018 -1883 -1826 999 2990 3634 3320 5017
6480E017k038m254k770j522j462K004M275o18L87L287j305k974k90j166O62R80
$$ 5017 2979 -1275 -4045 -5567 -7029 -5025 -750 -1368 -981 2306 1001 -1973 -2263 -3429 -2767 -1787
6464a787l40l228k089K508K984M773l052n892m655o40L508J063l52J453N38J963
$$ -1787 -2127 -5355 -7444 -4936 -1952 2821 -231 -6123 -10778 -11418 -7910 -6847 -7199 -5746 -5208 -3245
6448c245R45K769J201p79J736J870p36j210j148l900l030J356P41k233p15J919
$$ -3245 -2300 469 1670 891 2627 4497 3761 2551 1403 -2497 -5527 -4171 -3430 -5663 -6378 -4459
6432d459N89l611j521m85k249J801M064J098K617K57k300j691N64M181K90k220
$$ -4459 -3870 -7481 -9002 -9487 -11736 -9935 -5871 -4773 -2156 -1899 -4199 -5890 -5326 -1145 -855 -3075
6416c075m005j687L644R04J670R66K123j368J261Q82m313n523k827J749L316M703
$$ -3075 -7080 -8767 -5123 -4219 -2549 -1583 540 -828 433 1315 -2998 -8521 -11348 -9599 -6283 -1580
6400a580P058j159k374k310n709Q6L277K146k682l640K836J498Q8j406p06k452
$$ -1580 5478 4319 1945 -365 -6074 -5988 -2711 -565 -3247 -6887 -4051 -2553 -2465 -3871 -4577 -7029
6384g029r01j634l412n77Q521K417q07k703l388K482Q129o64m540j204l283K486
$$ -7029 -7930 -9564 -12976 -13553 -5032 -2615 -3422 -6125 -9513 -7031 1098 434 -4106 -5310 -8593 -6107
6368f107N35K389K723Q27J551l965m16J870k326j775m08M272Q55k172j990J868
$$ -6107 -5572 -3183 -460 367 1918 -2047 -2463 -593 -2919 -4694 -5102 -830 25 -2147 -4137 -2269
6352b269O77l198O29M34n30m21K850o61l250m53M4q02j559n172J47N389L377K823
$$ -2269 -1592 -4790 -4161 -3727 -4257 -4678 -1828 -2489 -5739 -6192 -6148 -6950 -8509 -13681 -13534 -8145 -4768 -1945
6334a945L695J628l046k505k847j453L415j694r0N11l377K068M775l446l803J965
$$ -1945 1750 3378 332 -2173 -5020 -6473 -3058 -4752 -4842 -4331 -7708 -5640 -865 -4311 -8114 -6149
6318f149K090l16j831L659L483k295k365L12K8L143P75j560k354l880L081M435
$$ -6149 -4059 -4375 -6206 -2547 936 -1359 -3724 -3412 -3384 -241 534 -1026 -3380 -7260 -4179 256
6302B56P7K274M647j380m445M13J040l628j18Q11l805J081K810j158k51M133r04
$$ 256 333 2607 7254 5874 1429 1842 2882 -746 -864 -53 -3858 -2777 33 -1125 -1376 2757 1853
6285A853l548j533j552K118J437J205k208J237K17n141K222K623n611Q01K432
$$ 1853 -1695 -3228 -4780 -2662 -1225 -20 -2228 -991 -774 -5915 -3693 -1070 -6681 -5880 -3448
6270c448Q57k93j248k718J852L850L539l860j694p04k249J843J179m148n692K152
$$ -3448 -2591 -2884 -4132 -6850 -4998 -1148 2391 -1469 -3163 -3867 -6116 -4273 -3094 -7242 -12934 -10782
6254a0782O86m59R17O87L373J970O73R04j912j281j277n373L109K418L345J293
$$ -10782 -10096 -10555 -9638 -8951 -5578 -3608 -2935 -2031 -3943 -5224 -6501 -11874 -8765 -6347 -3002 -1709
6238a709k283j328k04K80J019k144r44O51k243L240N012l038j282L63L68r49J575
$$ -1709 -3992 -5320 -5524 -5244 -4225 -6369 -7313 -6662 -8905 -5665 -653 -3691 -4973 -4610 -4242 -5191 -3616
6221c616K440J638J094q57J561m162m179L170J814m038K0K752m7J119N79K30R59
$$ -3616 -1176 462 1556 699 2260 -1902 -6081 -2911 -1097 -5135 -5115 -2363 -2410 -1291 -712 -482 477
6204D77k980o686L29M382J742j185j046k141P34L198N092j401l889L639N569k559
$$ 477 -2503 -9189 -8860 -4478 -2736 -3921 -4967 -7108 -6374 -3176 1916 515 -3374 265 5834 3275
6188C275n872L97p9N74J943L632n83j244j724m744l065o20M143M089j394k391
$$ 3275 -2597 -2200 -2279 -1705 238 3870 3287 2043 319 -4425 -7490 -8110 -3967 122 -1272 -3663
6172c663N64L032L543k522m112P61J562M80k47m561l170j179M312J756j669k234
$$ -3663 -3099 -67 3476 954 -3158 -2397 -835 -355 -602 -5163 -8333 -9512 -5200 -3444 -5113 -7347
6156g347k540L41j171L57L225J071j04k726M78N76n054J349O925J38N83Q30o34
$$ -7347 -9887 -9546 -10717 -10360 -7135 -6064 -6168 -8894 -8416 -7840 -12894 -11545 -4620 -4482 -3899 -3069 -3703
6139c703J82j230QK74k532k196M413j389R07L031Q08M959n478J626M563p31m146
$$ -3703 -3521 -4751 -4743 -4469 -7001 -9197 -4784 -6173 -5266 -2235 -1427 3532 -1946 -320 4243 3512 -634
6122f34K87P29J141k867p86J891Q23p30J431j588k301j251K293R68L183j263j511
$$ -634 -347 382 1523 -1344 -2130 -239 584 -146 1285 -303 -2604 -3855 -1562 -594 2589 1326 -185
6105a85J004k103k974k804K867L059K53n24l118n342j774j900K184K715r20L81
$$ -185 819 -1284 -4258 -7062 -4195 -1136 -883 -1407 -4525 -9867 -11641 -13541 -11357 -8642 -9562 -9181
6089i181K579P362M525o566m364L938K005M46M03K059l207k186L014Q98j215j340
$$ -9181 -6602 760 5285 -1281 -5645 -1707 298 744 1147 3206 -1 -2187 827 1725 510 -830
6073h30M9p29R77O393L958J553m936j721J038j319R61P38j624J620R61o36l456
$$ -830 -781 -1510 -533 5860 9818 11371 6435 4714 5752 4433 5394 6132 4508 6128 7089 6453 2997
6056B997o577k318j346L490M949r67J048M101k275n111J340j714n307L340O021
$$ 2997 -3580 -5898 -7244 -3754 1195 228 1276 5377 3102 -2009 -669 -2383 -7690 -4350 1671
6041A671j340m00Q74J48j407j394j058J554M438j442M17o737k979O5j008L83j268
$$ 1671 331 -69 805 953 -454 -1848 -2906 -1352 3086 1644 2061 -4676 -7655 -7590 -8598 -8215 -9483
6024i483Q32Q64j074o50l386O44L769K19l409J43M093O222j193l404J278L76R52
$$ -9483 -8651 -7787 -8861 -9511 -12897 -12253 -8484 -8265 -11674 -11531 -7438 -1216 -2409 -5813 -4535 -4159 -3207
6007c207L228L308k158k844j742L885L257k0m085n81O2l756l814K804j393j185
$$ -3207 21 3329 1171 -1673 -3415 470 3727 3707 -378 -959 -897 -4653 -8467 -5663 -7056 -8241
5991h241J443Q30K111L29l757J197O764J443l711O05J552p1J781j744j441m59
$$ -8241 -6798 -5968 -3857 -3528 -7285 -6088 676 2119 -1592 -987 565 494 2275 531 -910 -1369
5975a369L41R2m386J857L693k578J259R73j244J165P71l41m484K17l488l423L704
$$ -1369 -1028 -936 -5322 -3465 228 -2350 -1091 -118 -1362 -197 574 233 -4251 -4034 -7522 -10945 -7241
5958g241L601J493j517k20J780L3k560K059L014J833J351j596r2j160J261J738
$$ -7241 -3640 -2147 -3664 -3884 -2104 -2071 -4631 -2572 442 2275 3626 2030 1938 778 2039 3777
5942C777k35j519m603K276P87l983j978O20j148L620j03J372O63k838l125J229
$$ 3777 3542 2023 -2580 -304 483 -3500 -5478 -4858 -6006 -2386 -2489 -1117 -454 -3292 -6417 -5188
5926e188O094K621m363q09r61J020M10J443J87M77J062j880m194m37L386k079
$$ -5188 906 3527 -836 -1645 -2606 -1586 -1176 267 454 931 1993 113 -4081 -4518 -1132 -3211
5910c211j299L765K579n407k14Q4o76J265Q37j777n56L104Q88l457k826k089L313
$$ -3211 -4510 -745 1834 -3573 -3787 -3703 -4379 -3114 -2277 -4054 -4610 -1506 -618 -4075 -6901 -8990 -5677
5893e677L69k871J37K073K080p97j971N080L014k107J400l786n549J95L571L266
$$ -5677 -5308 -8179 -8042 -5969 -3889 -4686 -6657 -1577 1437 -670 730 -3056 -8605 -8410 -4839 -1573
5877a573j895q05l095L418M853L289L478j543n425K346q39j78K21O68r39J611
$$ -1573 -3468 -4273 -7368 -3950 903 4192 7670 6127 702 3048 2209 2031 2252 2920 1981 3592
5861C592j171j932k043p31l20j715J022j239P86r15j320K752J805K856l104k905
$$ 3592 2421 489 -1554 -2285 -2605 -4320 -3298 -4537 -3751 -4666 -5986 -3234 -1429 1427 -1677 -4582
5845d582r48K552K128p49j325P68l26J919J231m264J052K700n96M42M247k491
$$ -4582 -5530 -2978 -850 -1599 -2924 -2156 -2482 -563 668 -3596 -2544 156 -440 2 4249 1758
5829A758o763J399L098j003j830J55J427j160J839L319j721n65K047L059m21l199
$$ 1758 -5005 -3606 -508 -1511 -3341 -3186 -1759 -2919 -1080 2239 518 -47 2000 5059 4638 1439
5813A439j039J286j670j18Q19j29k620M338k289k132j469J725j681m953R97L019
$$ 1439 400 1686 16 -102 717 588 -2032 2306 17 -2115 -3584 -1859 -3540 -8493 -7496 -4477
5797d477N724m89k904l712O54K023L482M81r31j536m81K991K033P17k002J268
$$ -4477 1247 758 -2146 -5858 -5204 -3181 301 782 -149 -1685 -2166 825 2858 3575 1573 2841
5781B841j309J398k622m018j810M454K43R32L83j327l239l06j986j008J748K470
$$ 2841 1532 2930 308 -3710 -5520 -1066 -823 109 492 -835 -4074 -4380 -6366 -7374 -5626 -3156
5765c156K237j661J351m289k838J665j588l382K984R196L297m107k691L285m43
$$ -3156 -919 -2580 -1229 -5518 -8356 -6691 -8279 -11661 -8677 519 3816 -291 -2982 303 -140
5750a40j63j160L219m16k074r30N660n62o33k548k511j03J711K83l026K188R90
$$ -140 -303 -1463 1756 1340 -734 -1664 3996 3434 2801 253 -2258 -2361 -650 -367 -3393 -1205 -215
5733b15J231j606q76n86n15J418m721r70J131J244K847r83O27J998L17m529j104
$$ -215 1016 -590 -1466 -2052 -2567 -1149 -5870 -6840 -5709 -4465 -1618 -2601 -1974 24 341 -4188 -5292
5716e292L015J097K3K24k774l937K886M468j125n53m28J125K483j221Q51J260
$$ -5292 -2277 -1180 -1157 -933 -3707 -7644 -4758 -290 -1415 -1968 -2396 -1271 1212 -9 842 2102
5700B102M96J12l650l425P87n266k842M282L283Q92j046j647M11J651J285J362
$$ 2102 2598 2710 -940 -4365 -3578 -8844 -11686 -7404 -4121 -3229 -4275 -5922 -5511 -3860 -2575 -1213
5684a213j578j165l9J383l062o40N604k079K23j826j027M151K765k902k537r91
$$ -1213 -2791 -3956 -3995 -2612 -5674 -6314 -710 -2789 -2566 -4392 -5419 -1268 1497 -1405 -3942 -4933
5668d933K389J714j4P19L102k675m480m074M729J285P03j555k120K027L840L518
$$ -4933 -2544 -830 -844 -125 2977 302 -4178 -8252 -3523 -2238 -1535 -3090 -5210 -3183 657 4175
5652D175K601k047l785p94j728J766k616k074K086J045o36L963P31l361j989K05
$$ 4175 6776 4729 944 150 -1578 188 -2428 -4502 -2416 -1371 -2007 1956 2687 -674 -2663 -2458
5636b458J658p87K441J688K002p75O01l25l241k907R18j92m481o648J445L688
$$ -2458 -800 -1587 854 2542 4544 3769 4370 4045 804 -2103 -1185 -1377 -5858 -12506 -11061 -7373
5620g373K518L748j556L617M010m272R59m56n790j001O93J134q72k026J846J778
$$ -7373 -4855 -1107 -2663 954 4964 692 1651 1195 -4595 -5596 -4903 -3769 -4641 -6667 -4821 -3043
5604c043j180k121J023J037j915R6L780K366J483l859m210j023K427J40K419m929
$$ -3043 -4223 -6344 -5321 -4284 -6199 -6103 -2323 43 1526 -2333 -6543 -7566 -5139 -4999 -2580 -7509
5588g509l259M623L914J719j36l750m076r12l41o31K796K502j021r8N31l348o99
$$ -7509 -10768 -6145 -2231 -512 -648 -4398 -8474 -9386 -9727 -10358 -7562 -5060 -6081 -6179 -5648 -8996 -9695
5571i695L205K249J230L972K632r15p94J824j953j788L094k56P58j000j019l935
$$ -9695 -6490 -4241 -3011 961 3593 2678 1884 3708 1755 -33 3061 2805 3563 2563 1544 -2391
5555b391m354K50J829j479j964M357N366J686j288k980k091O07L47J601P41o16
$$ -2391 -6745 -6495 -4666 -6145 -8109 -3752 1614 3300 2012 -968 -3059 -2452 -2105 -504 237 -379
5539c79n37k733l425J186M120j816j586J426K177K740L582l667n868J318J284
$$ -379 -916 -3649 -7074 -5888 -1768 -3584 -5170 -3744 -1567 1173 4755 1088 -4780 -3462 -2178
5524b178p56J643L868R97M56P37n435m244L660r13Q33L339Q12j338r42j08L106
$$ -2178 -2934 -1291 2577 3574 4030 4767 -668 -4912 -1252 -2165 -1332 2007 2819 1481 539 431 3537
5507C537K432J090l626l509l273k144J319J19J11n153N05N791M476K229k5m58
$$ 3537 5969 7059 3433 -76 -3349 -5493 -4174 -4055 -3944 -9097 -8592 -2801 1675 3904 3879 3421
5491C421j637L32L906K133j198l568j468k322k218Q45J061j274k266J737J084
$$ 3421 1784 2116 6022 8155 6957 3389 1921 -401 -2619 -1774 -713 -1987 -4253 -2516 -1432
5476a432L140K001N65k624k977l19J068o27k224o3L95M53Q74M03l174j754K446
$$ -1432 1708 3709 4274 1650 -1327 -1646 -578 -1205 -3429 -3492 -3097 -2644 -1770 -1367 -4541 -6295 -3849
5459c849j681q42p39N5r79m5Q320L769k061K582k907q49K881k691N79k994o80
$$ -3849 -5530 -6372 -7111 -7056 -8035 -8080 240 4009 1948 4530 1623 774 3655 964 1543 -1451 -2131
5442b131l083p94l412k202M6O153R018J932j631l975J132j306l706j742p61L803
$$ -2131 -5214 -6008 -9420 -11622 -11576 -5423 3595 5527 3896 -79 1053 -253 -3959 -5701 -6462 -2659
5426b659k58K88J592K556J828J972J007l780l438j662J342K785J256q11l90M467
$$ -2659 -2917 -2629 -1037 1519 3347 5319 6326 2546 -892 -2554 -1212 1573 2829 2018 1628 6095
5410F095k223j668J258j432k24K592j028k511m540L307M457N26l512m42K194P64
$$ 6095 3872 2204 3462 2030 1806 4398 3370 859 -3681 -374 4083 4609 1097 655 2849 3613
5394C613k17k103n34L091j815k143j11k75k37n02N85K530j896M06l732j541K850
$$ 3613 3396 1293 759 3850 2035 -108 -219 -494 -731 -1233 -648 1882 -14 392 -3340 -4881 -2031
5377b031J71n05r95p44N754J47l807k148n86J438K400p2l940K640P87j809J738
$$ -2031 -1860 -2365 -3360 -4104 1650 1797 -2010 -4158 -4744 -3306 -906 -978 -4918 -2278 -1491 -3300 -1562
5360a562J167N38M4K725j051M39J209q92k041j749K190J02J529J438J797k282
$$ -1562 -395 143 187 2912 1861 2300 3509 2617 576 -1173 1017 1119 2648 4086 5883 3601
5344C601p246n464m26M855K797M27k628j122j886K858n83J903j434l11K618N595
$$ 3601 -3645 -9109 -9535 -4680 -1883 -1456 -4084 -5206 -7092 -4234 -4817 -2914 -4348 -4659 -2041 3554
5328C554j354j503J838k442m355k214R96m129j318k501K491K380J049J152K762
$$ 3554 2200 697 2535 93 -4262 -6476 -5480 -9609 -10927 -13428 -10937 -8557 -7508 -6356 -3594
5313c594Q34k165k710o75j197J904M676L674P44j432j648J646M757j149j969P89
$$ -3594 -2760 -4925 -7635 -8310 -9507 -7603 -2927 747 1491 59 -1589 57 4814 3665 1696 2485
5297B485r32J432J098n813k158k489J89j299L793Q66l84L717k487m79o45J855
$$ 2485 1553 2985 4083 -1730 -3888 -6377 -6188 -7487 -3694 -2828 -3212 505 -1982 -2461 -3106 -1251
5281a251j489P75l13k293P17N262P94q72N80J715J414k167l692j330L564m53O54
$$ -1251 -2740 -1965 -2278 -4571 -3854 1408 2202 1330 1910 3625 5039 2872 -820 -2150 1414 961 1615
5264A615k157m872j883J752L120K165R01J920p22o820m167J444O670M966L35p27
$$ 1615 -542 -5414 -7297 -5545 -2425 -260 641 2561 1839 -4981 -9148 -7704 -1034 3932 4267 3540
5248C540J795j068n96j670p015k522j402J192j416r77K31M200J656L567L521j63
$$ 3540 5335 4267 3671 2001 -5014 -7536 -8938 -7746 -9162 -10139 -9908 -5708 -4052 -485 3036 2873
5232B873k095J353j762j311L479J697J338j223k970m103N71M115l811j477L933
$$ 2873 778 2131 369 -942 2537 4234 5572 4349 1379 -2724 -2153 1962 -1849 -3326 607
5217F07J503M92M85j001j716l197j835m716K044P681O348J647m892k476K866q32
$$ 607 2110 2602 3087 2086 370 -2827 -4662 -9378 -7334 347 6695 8342 3450 974 3840 3008
5201C008k206o568R74M632L685K352j160o584R63l44P41K94J74M84O02J373j540
$$ 3008 802 -5766 -4792 -160 3525 5877 4717 -1867 -904 -1248 -507 -213 -39 445 1047 2420 880
5184H80k112J654k244J436J294n004M85l51J453J044L219L29j853j832O53J54
$$ 880 -1232 422 -1822 -386 908 -4096 -3611 -3962 -2509 -1465 1754 2083 230 -1602 -949 -795
5168g95J849j751j242R21J816K478L434J52l019j369k869j613R26L381m880K637
$$ -795 1054 -697 -1939 -1018 798 3276 6710 6862 3843 2474 -395 -2008 -1082 2299 -2581 56
5152E6K816p67n035N94M874K747p13k198J172j154k391j946Q5K767j49J004j056
$$ 56 2872 2105 -2930 -2336 2538 5285 4572 2374 3546 2392 1 -1945 -1860 907 758 1762 706
5135G06l24K704K12j188R9j538K310K888k380k271J982m10j439M029l15j37J247
$$ 706 382 3086 3298 2110 2209 671 2981 5869 3489 1218 3200 2790 1351 5380 5065 4928 6175
5118F175l956l057n95K666l59M01k031j994L413k97l409k111J080L924R03k568
$$ 6175 2219 -838 -1433 1233 874 1275 -756 -2750 663 366 -3043 -5154 -4074 -150 753 -1815
5102a815p22J571L272J920j950J381J051j212j111n48p52j431L73m102l004P81
$$ -1815 -2537 -966 2306 4226 2276 3657 4708 3496 2385 1837 1085 -346 27 -4075 -7079 -6298
5086f298K331L452K840J769J334p7m051Q19rq46J666j623L43l266L368N34J264
$$ -6298 -3967 -515 2325 4094 5428 5351 1300 2119 2110 1264 2930 1307 1650 -1616 1752 2286 3550
5069C550l29P92J132R97J192P58j197k809j995K029R70K0O98n97j404o345r35
$$ 3550 3221 4013 5145 6142 7334 8092 6895 4086 2091 4120 5090 5110 5808 5211 3807 -2538 -3473
5052c473j456r10M71L196L540L790m503l517L224P74r64J491N92j236j628m08
$$ -3473 -4929 -5839 -5368 -2172 1368 5158 655 -2862 362 1136 172 1663 2255 1019 -609 -1017
5036a017k207j775K636J193m427K330l67J770K079j333j310l411K671K485Q2l687
$$ -1017 -3224 -4999 -2363 -1170 -5597 -3267 -3634 -1864 215 -1118 -2428 -5839 -3168 -683 -601 -4288
5020d288K750O019N167K287l082j13m310j870j452l438r9M85N136J84n655j561
$$ -4288 -1538 4481 9648 11935 8853 8740 4430 2560 1108 -2330 -2429 -1944 3192 3376 -2279 -3840
5004c840l177J886N447K144J157p16l129l186K510L27l012K59m658k037J257k03
$$ -3840 -7017 -5131 316 2460 3617 2901 -228 -3414 -904 -577 -3589 -3330 -7988 -10025 -8768 -8971
4988h971J688L077K774J206l38L844R31r6l687k190N74J135q4j860k33l643k051
$$ -8971 -7283 -4206 -1432 -226 -564 3280 4211 4115 428 -1762 -1188 -53 -137 -1997 -2230 -5873 -7924
4971g924N298J246q21l450J1J641K945J810L263K92l834q6L460k281m141m63J597
$$ -7924 -2626 -1380 -2201 -5651 -5640 -3999 -1054 756 4019 4311 477 391 3851 1570 -2571 -3034 -1437
4954a437L386L359m413K91o28K235M60J631k141r78k421k422J646L256L851Q7
$$ -1437 1949 5308 895 1186 558 2793 3253 4884 2743 1765 -656 -3078 -1432 1824 5675 5762
4938E762j026k832l537j967J982m45J512j908J355L782l79m80K893K346L59Q83
$$ 5762 4736 1904 -1633 -3600 -1618 -2063 -551 -2459 -1104 2678 2299 1819 4712 7058 7417 8300
4922H300l57k520j593k874k98N651M62J783J549l584o149J062q59J290j737L148
$$ 8300 7943 5423 3830 956 658 6309 6771 8554 10103 6519 370 1432 573 1863 126 3274
4906C274M131n456j025L84M74n9k717r1K811K440K272k011k118m4J336K567l658
$$ 3274 7405 1949 924 1308 1782 1723 -994 -1085 1726 4166 6438 4427 2309 2265 3601 6168 2510
4889B510m312l25j81k518L111M763n76k678K56k72K440J288n876o81O91q69K643
$$ 2510 -1802 -2127 -2308 -4826 -1715 3048 2472 -206 50 -222 2218 3506 -2370 -3051 -2360 -3229 -586
4872e86o57j766K230qj45O57q39j371j749l86J033k316N72M996k603J17k401o3
$$ -586 -1243 -3009 -779 -787 -932 -275 -1114 -2485 -4234 -4620 -3587 -5903 -5331 -335 -2938 -2821 -5222 -5285
4854e285M513j008l896K793K188K457l339Q90O21j76m011n68j056j533M625Q204
$$ -5285 -772 -1780 -5676 -2883 -695 1762 -1577 -687 -66 -242 -4253 -4821 -5877 -7410 -2785 5419
4838E419K647j316l443j660o31M569m625k082n46m03L661M834p09r67J528k733
$$ 5419 8066 6750 3307 1647 1016 5585 960 -1122 -1668 -2071 1590 6424 5715 4748 6276 3543
4822C543m688K861j68L96p87q21k230J190n75j096k759J222K160K250L423J272
$$ 3543 -1145 1716 1548 1944 1157 336 -1894 -704 -1279 -2375 -5134 -3912 -1752 498 3921 5193
4806E193K03n7P0m15J093J349j098n704k972K229O02m44J148n811m666K778M603
$$ 5193 5396 5339 5409 4994 6087 7436 6338 634 -2338 -109 493 49 1197 -4614 -9280 -6502 -1899
4789a899M168k115m126L905k503J824J73J478j475l155P67L414N9k166J214J863
$$ -1899 2269 154 -3972 -67 -2570 -746 -573 905 -570 -3725 -2958 456 515 -1651 -437 1426
4773A426M765j241l255k892n278l323p55L846K631j163K936K99M654K183L380
$$ 1426 6191 4950 1695 -1197 -6475 -9798 -10553 -6707 -4076 -5239 -2303 -2004 2650 4833 8213
4758H213j521j541m099j845j567J639l20N78N565K481k375j472k327j941N743
$$ 8213 6692 5151 1052 -793 -2360 -721 -1041 -463 5102 7583 5208 3736 1409 -532 5211
4743E211j225l150k08j532j034J403L485L129l344l090j912Q36m074K277R773
$$ 5211 3986 836 628 -904 -1938 -535 2950 6079 2735 -355 -2267 -1431 -5505 -3228 6545
4728F545N008j579n009m872n741p37N909L016J364k197l968k573J800J658k362
$$ 6545 11553 9974 4965 93 -5648 -6385 -476 2540 3904 1707 -2261 -4834 -3034 -1376 -3738
4713c738q66j94p93K260k112O17l699L198O023j598k190k084l710O880M349L186
$$ -3738 -4604 -4798 -5591 -3331 -5443 -4826 -8525 -5327 696 -902 -3092 -5176 -8886 -2006 2343 5529
4697E529J685j551J392K445n708j097M879k081m806m664k766J21J477r13j060
$$ 5529 7214 5663 7055 9500 3792 2695 7574 5493 687 -3977 -6743 -6622 -5145 -6058 -7118
4682g118N894M114M3k239K765J034j464k519J159J874k19l319P17m37j40J243
$$ -7118 -1224 2890 2933 694 3459 4493 3029 510 1669 3543 3324 5 722 285 145 1388
4666A388J367j440l999k663j383M414R55j694m53K970L032j983J334L758j254
$$ 1388 2755 1315 -2684 -5347 -6730 -2316 -1361 -3055 -3508 -538 2494 511 1845 5603 4349
4651D349K49m280j897j099j960k704M261M620m738m247l20m3J313M947L242l09
$$ 4349 4598 318 -1579 -2678 -4638 -7342 -3081 1539 -3199 -7446 -7766 -7809 -6496 -1549 1693 1384
4635A384p37j381n48K413M323j512p866o014p21K819N68L671J101N83r06m91L663
$$ 1384 647 -734 -1282 1131 5454 3942 -3924 -9938 -10659 -7840 -7272 -3601 -2500 -1917 -2823 -3314 349
4618C49L299K395l950l074P43k818p20r74K836J780P362L723J34m587k101N60
$$ 349 3648 6043 2093 -981 -238 -3056 -3776 -4750 -1914 -134 7228 10951 11085 6498 4397 4957
4602D957l78n217l840j162M127R94k821o13K277j152k803k36j325K386M16J92
$$ 4957 4579 -638 -4478 -5640 -1513 -519 -3340 -3953 -1676 -2828 -5631 -5867 -7192 -4806 -4390 -4198
4586d198M187J823o67l112K080m6l386K618K653J127R62K75M402O10m666l565
$$ -4198 -11 1812 1145 -1967 113 67 -3319 -701 1952 3079 4041 4316 8718 9328 4662 1097
4570A097l646n623l77K350j512J776J952o23j854J820K252K118k375j342k280
$$ 1097 -2549 -8172 -8549 -6199 -7711 -5935 -3983 -4606 -6460 -4640 -2388 -270 -2645 -3987 -6267
4555f267m38K488j196l690L314K358K105J712o83p04k873J491K001j877m882k706
$$ -6267 -6705 -4217 -5413 -9103 -5789 -3431 -1326 386 -297 -1001 -3874 -2383 -382 -2259 -7141 -9847
4539i847J937M751O19J164L332J784l350k46j597n815L136O570K863l859o451
$$ -9847 -7910 -3159 -2540 -1376 1956 3740 390 144 -1453 -7268 -4132 2438 5301 1442 -5009
4524e009k68K623l026J97J899J259j747J161L400L37k72J805m69j364k351N74
$$ -5009 -5277 -2654 -5680 -5483 -3584 -2325 -4072 -2911 489 826 554 2359 1890 526 -1825 -1251
4508a251m625k314O996P729j000m134j059K6l921l379K254L844J72P46n59k426
$$ -1251 -5876 -8190 -1194 6535 5535 1401 342 368 -3553 -6932 -4678 -834 -662 84 -475 -2901
4492b901J932l91J884q86j261j534l873m595M765R73n367M95L859J096M628K800
$$ -2901 -969 -1360 524 -362 -1623 -3157 -7030 -11625 -6860 -5887 -11254 -10759 -6900 -5804 -1176 1624
4476A624K534j849j954n14j585Q64N34J46j822k113m27J401K23J477l22p88l63
$$ 1624 4158 2309 355 -159 -1744 -880 -346 -200 -2022 -4135 -4562 -3161 -2938 -1461 -1783 -2571 -2934
4459b934j124M679J664j928J433n694o354J509L75L790M494K467k450j644N13
$$ -2934 -4058 621 2285 357 1790 -3904 -10258 -8749 -8374 -4584 -90 2377 -73 -1717 -1204
4444a204l509M223N335j052j831M410j638n99l84r74j766J817R08k390o76J843
$$ -1204 -4713 -490 4845 3793 1962 6372 4734 4135 3751 2777 1011 2828 3736 1346 670 2513
4428B513J873J030K650k120p068M90q18k184r61J475N091k384N81L630K038k904
$$ 2513 4386 5416 8066 5946 -1122 -632 -1450 -3634 -4595 -3120 1971 -413 168 3798 5836 2932
4412B932J86L050K48l865k130N21K135k777k726j097J110M499M28p08m212L430
$$ 2932 3118 6168 6416 2551 421 942 3077 300 -2426 -3523 -2413 2086 2514 1806 -2406 1024
4396A024P03n07k234r47l056L101J259r34J671j932K486J829J762J01k373l40
$$ 1024 1727 1220 -1014 -1961 -5017 -1916 -657 -1591 80 -1852 634 2463 4225 4326 1953 1613
4380A613N816l963m992J261O84k80P80k0l25j96K024R74l777j138L0N36O89L267
$$ 1613 7429 3466 -1526 -265 419 139 919 899 574 378 2402 3376 -401 -1539 -1509 -973 -284 2983
4362B983j13k191l854o8L794M013j880P39m118N81M19M505k788k632p30J916J934
$$ 2983 2870 679 -3175 -3243 551 4564 2684 3423 -695 -114 305 4810 2022 -610 -1340 576 2510
4345B510O42N73m32K661j060l503l301j766J653M849K100L07k011j764l517j167
$$ 2510 3152 3725 3293 5954 4894 1391 -1910 -3676 -2023 2826 4926 5233 3222 1458 -2059 -3226
4329c226J365N956J090n349r62M985M250j303m992l714J389m41j288j023p91p6
$$ -3226 -1861 4095 5185 -164 -1126 3859 8109 6806 1814 -1900 -511 -952 -2240 -3263 -4054 -4130
4313d130j345k417k565n70K144L373N381k509l649K069j016J985L785P583n29
$$ -4130 -5475 -7892 -10457 -11027 -8883 -5510 -129 -2638 -6287 -4218 -5234 -3249 536 8119 7590
4298G590j799j763l630k37J31M9Q10M57l401n113J906Q029L347Q53m544n872l27
$$ 7590 5791 4028 398 161 292 341 1151 1608 -1793 -6906 -5000 3029 6376 7229 2685 -3187 -3514
4281c514j300K725K740l3j503m176L539M363k306j264M028K618j999l802j611
$$ -3514 -4814 -2089 651 618 -885 -5061 -1522 2841 535 -729 3299 5917 3918 116 -1495
4266a495l334k250L185K706K359M670j435k932m442l838k929J724J825N8p55q87
$$ -1495 -4829 -7079 -3894 -1188 1171 5841 4406 1474 -2968 -6806 -9735 -8011 -6186 -6128 -6883 -7770
4250g770K881L623j64j557J506J62m208L27O208J487L592K954j266n506l104k667
$$ -7770 -4889 -1266 -1430 -2987 -1481 -1319 -5527 -5200 1008 2495 6087 9041 7775 2269 -835 -3502
4234c502j255J466K764K033N087M302Q10L47n439l750l800L007P857J566l325
$$ -3502 -4757 -3291 -527 1506 6593 10895 11705 12052 6613 2863 -937 2070 9927 11493 8168
4219H168n465m388J901J259m098o05q78K932k6l123j946N947p46o909pM699M535
$$ 8168 2703 -1685 216 1475 -2623 -3228 -4106 -1174 -1200 -4323 -6269 -322 -1068 -7977 -7984 -3285 1250
4202A250l563j227k998O20M413L286K15N57n264j145J08R25l287n65l74o90k70
$$ 1250 -2313 -3540 -6538 -5918 -1505 1781 1996 2553 -2711 -3856 -3748 -2823 -6110 -6675 -7049 -7739 -8009
4185h009J167J767k921J666K422K319N304J366P82k02l654j727K957j432M41K255
$$ -8009 -6842 -5075 -7996 -6330 -3908 -1589 3715 5081 5863 5661 2007 280 3237 1805 2246 4501
4169D501L78k352l696q44j621J171L350J50L794J998k592m606l465j720O378K871
$$ 4501 4879 2527 -1169 -2013 -3634 -2463 887 1037 4831 6829 4237 -369 -3834 -5554 824 3695
4153C695n64J029O95j795K45j377l00n34P92j64K198n40k17M34k7Q28l124k164
$$ 3695 3131 4160 4855 3060 3305 1928 1628 1094 1886 1722 3920 3380 3163 3597 3570 4398 1274 -890
4135h90O5n06k100N86L597K215O15K510O81n886j790M865L189L194k235k470J448
$$ -890 -825 -1331 -3431 -2845 752 2967 3582 6092 6773 887 -903 3962 7151 10345 8110 5640 7088
4118G088P16k44m149l95O12k92M116l630k894l66k150j122j457L03J086r58L212
$$ 7088 7804 7560 3411 3016 3628 3336 7452 3822 928 562 -1588 -2710 -4167 -3864 -2778 -3736 -524
4101e24J062K062l752l26n44N301Q51M057o43j731k104m28m058j044J136M889
$$ -524 538 2600 -1152 -1478 -2022 3279 4130 8187 7544 5813 3709 3281 -777 -1821 -685 4204
4085D204J254o435J417M113J89m32k52K697k666m954M401k586p79K21k605P2L967
$$ 4204 5458 -977 440 4553 4742 4310 4058 6755 4089 -865 3536 950 171 392 -2213 -2141 1826
4068A826M142K956o28q29n808m939o05J16J763j013L891J243j925j80k392J45
$$ 1826 5968 8924 8296 7467 1659 -3280 -3885 -3769 -2006 -3019 872 2115 190 10 -2382 -2237
4052b237L034k10O34M549L20j080R56L10K08r90p85k177m44p51K91Q92k982j985
$$ -2237 797 587 1221 5770 6090 5010 5966 6276 6484 5494 4709 2532 2088 1337 1628 2520 -462 -2447
4034b447R32L170L87l793J180J663j532o0k234Q73N458K13k632K424K390J252
$$ -2447 -1515 1655 2042 -1751 -571 1092 -440 -500 -2734 -1861 3597 3810 1178 3602 5992 7244
4018G244P31J801n383j893k785Q48j160N265K18n044J270m77l387k876J873O096
$$ 7244 7975 9776 4393 2500 -285 563 -597 4668 4886 -158 1112 635 -2752 -5628 -3755 2341
4002B341N420Q20l763N25K377J194j349o243r97j945K28j916m0L005J965j570
$$ 2341 7761 8581 4818 5343 7720 8914 7565 1322 325 -1620 -1392 -3308 -3348 -343 1622 52
3986E2J288P62j66j106J01o28j404k448Q90o05K594J812l056O29N92K196J323
$$ 52 1340 2102 1936 830 931 303 -1101 -3549 -2659 -3264 -670 1142 -1914 -1285 -693 1503 2826
$$ [...]
##END NTUPLES=NMR SPECTRUM
##END=
