##TITLE=Analysis number 329748
Compound Code cc 59001
Book Reference 546/32
Project Code adrs
Chemist Name craigr
##JCAMPDX= 6.0         $$ Bruker NMR JCAMP-DX V2.0
##DATA TYPE= NMR SPECTRUM
##DATA CLASS= NTUPLES
##ORIGIN= Bruker BioSpin GmbH
##OWNER= nmr
$$ XWIN-NMR		Version 3.5
$$ Wed Sep 26 10:57:09 2007 GMT Daylight Time (UT+1h)  MAYBRIDGE\nmr@NMR_250MHZ
##.OBSERVE FREQUENCY= 250.131544655141
##.OBSERVE NUCLEUS= ^1H
##.ACQUISITION MODE= SIMULTANEOUS (DQD)
##.ACQUISITION SCHEME= undefined
##.AVERAGES= 16
##.DIGITISER RES= 18
##SPECTROMETER/DATA SYSTEM= dpx250
##.PULSE SEQUENCE= zg30
##.SOLVENT NAME= DMSO
##.SHIFT REFERENCE= (INTERNAL, DMSO, 0, 16.522)
##AUDIT TRAIL= $$ (NUMBER, WHEN, WHO, WHERE, WHAT)
$$ ##TITLE= Audit trail, XWIN-NMR		Version 3.5
$$ ##JCAMPDX= 5.01
$$ ##ORIGIN= Bruker BioSpin GmbH
$$ ##OWNER= nmr
$$ C:\u/data/dgb/nmr/ADRS/2430/pdata/1/auditp.txt
$$ ##AUDIT TRAIL=  $$ (NUMBER, WHEN, WHO, WHERE, WHAT)
(   1,<2007-09-26 10:56:31.98 +100>,<MAYBRIDGE\nmr>,<NMR_250MHZ>,
      <created by zg, POWCHK disabled, PULCHK disabled
       configuration hash MD5:
       76 6E 9A 78 1E 09 19 81 EC 84 63 8F B0 6A 59 2D
       data hash MD5: 64K
       58 8E 0A 86 FA 74 18 F2 80 63 34 F5 6B F3 B9 98>)
(   2,<2007-09-26 10:56:58.42 +100>,<MAYBRIDGE\nmr>,<NMR_250MHZ>,
      <Start of raw data processing
       ef LB = 0.3 FT_mod = 6 PKNL = 1 SI = 32K 
       data hash MD5: 32K
       46 FE EA 04 3D 8D 37 18 FD F5 D4 28 E2 6A 96 59>)
(   3,<2007-09-26 10:57:00.06 +100>,<MAYBRIDGE\nmr>,<NMR_250MHZ>,
      <apk 
       data hash MD5: 32K
       0C 17 51 68 88 81 96 2E C5 3E 7D D6 3C 35 74 B4>)
(   4,<2007-09-26 10:57:00.81 +100>,<MAYBRIDGE\nmr>,<NMR_250MHZ>,
      <abs ABSG = 5 
       data hash MD5: 32K
       23 97 75 39 FD 02 84 9B 6B F0 78 E3 24 6C 5D 91>)
$$ ##END=
$$ 
$$ hash MD5
$$ 27 C6 73 A3 45 0B A1 0A B2 89 28 D1 82 8C 4A 20
##$RELAX= 
##$RELAX= 
##$RELAX= 
##$RELAX= 
##$RELAX= 
##$RELAX= 
##$RELAX= 
$$ Bruker specific parameters
$$ --------------------------
##$DU= <C:\u>
##$EXPNO= 2430
##$NAME= <ADRS>
##$PROCNO= 1
##$TYPE= <nmr>
##$USER= <dgb>
##$AMP= (0..31)
100 100 100 100 100 100 100 100 100 100 100 100 100 100 100 100 100 100 
100 100 100 100 100 100 100 100 100 100 100 100 100 100 
##$AQSEQ= 0
##$AQ_mod= 3
##$AUNM= <au_zg>
##$AUTOPOS= <45 >
##$BF1= 250.13
##$BF2= 250.13
##$BF3= 250.13
##$BF4= 250.13
##$BF5= 500.13
##$BF6= 500.13
##$BF7= 500.13
##$BF8= 500.13
##$BYTORDA= 1
##$CFDGTYP= 0
##$CFRGTYP= 5
##$CHEMSTR= <none>
##$CNST= (0..31)
1 1 145 1 1 1 1 1 1 1 1 1 1 1 1 1 1 1 1 1 1 1 1 1 1 1 1 1 1 1 1 1 
##$CPDPRG= <>
##$CPDPRG1= <>
##$CPDPRG2= <>
##$CPDPRG3= <>
##$CPDPRG4= <mlev>
##$CPDPRG5= <mlev>
##$CPDPRG6= <mlev>
##$CPDPRG7= <mlev>
##$CPDPRG8= <mlev>
##$CPDPRGB= <>
##$CPDPRGT= <>
##$D= (0..31)
0 1 0 0 0 0 0 0 0 0.06 0 0 0 0 0 0 0.0002 0 0 0 0 0 0 0 0 0 0 0 0 0 0 
0 
##$DATE= 1190800588
##$DBL= (0..7)
120 120 120 120 120 120 120 120 
##$DBP= (0..7)
150 150 150 150 150 150 150 150 
##$DBP07= 0
##$DBPNAM0= <>
##$DBPNAM1= <>
$$ [...]
##$SUBNAM7= <"">
##$SUBNAM8= <"">
##$SUBNAM9= <"">
##$SW= 20.6930455092707
##$SWIBOX= (0..15)
0 0 3 0 0 0 0 0 0 0 0 0 0 0 0 0 
##$SW_h= 5175.983436853
##$TD= 65536
##$TD0= 1
##$TE= 296.16
##$TE2= 300
##$TE3= 300
##$TEG= 300
##$TL= (0..7)
0 120 120 120 120 120 120 120 
##$TP= (0..7)
150 150 150 150 150 150 150 150 
##$TP07= 0
##$TPNAME0= <>
##$TPNAME1= <>
##$TPNAME2= <>
##$TPNAME3= <>
##$TPNAME4= <>
##$TPNAME5= <>
##$TPNAME6= <>
##$TPNAME7= <>
##$TPOAL= (0..7)
0.5 0.5 0.5 0.5 0.5 0.5 0.5 0.5 
##$TPOFFS= (0..7)
0 0 0 0 0 0 0 0 
##$TUNHIN= 0
##$TUNHOUT= 0
##$TUNXOUT= 0
##$USERA1= <user>
##$USERA2= <user>
##$USERA3= <user>
##$USERA4= <user>
##$USERA5= <user>
##$V9= 5
##$VALIST= <valist>
##$VCLIST= <CCCCCCCCCCCCCCC>
##$VD= 0
##$VDLIST= <DDDDDDDDDDDDDDD>
##$VPLIST= <PPPPPPPPPPPPPPP>
##$VTLIST= <TTTTTTTTTTTTTTT>
##$WBST= 1024
##$WBSW= 4
##$XGAIN= (0..3)
0 0 0 0 
##$XL= 0
##$YL= 0
##$YMAX_a= 338311
##$YMIN_a= -384416
##$ZGOPTNS= <>
##$ZL1= 120
##$ZL2= 120
##$ZL3= 120
##$ZL4= 120
##$ABSF1= 16.522
##$ABSF2= -4.171173
##$ABSG= 5
##$ABSL= 3
##$ALPHA= 0
##$AQORDER= 0
##$ASSFAC= 0
##$ASSFACI= 0
##$ASSFACX= 0
##$ASSWID= 0
##$AUNMP= <proc_1d>
##$AZFE= 0.1
##$AZFW= 0.1
##$BCFW= 0
##$BC_mod= 0
##$BYTORDP= 0
##$COROFFS= 0
##$CY= 12.5
##$DATMOD= 1
##$DC= 0
##$DFILT= <>
##$DTYPP= 0
##$F1P= 14.0000005364418
##$F2P= -0.99999901652339
##$FCOR= 0.5
##$FTSIZE= 32768
##$FT_mod= 6
##$GAMMA= 0
##$GB= 0
##$INTBC= 1
##$INTSCL= 1
##$ISEN= 128
##$LB= 0.3
##$LEV0= 0
##$LPBIN= 0
##$MAXI= 10000
##$MC2= 0
##$MEAN= 0
##$ME_mod= 0
##$MI= 0
##$NCOEF= 0
##$NC_proc= -4
##$NLEV= 6
##$NOISF1= 0
##$NOISF2= 0
##$NSP= 0
##$NTH_PI= 0
##$NZP= 0
##$OFFSET= 16.522
##$PC= 1
##$PHC0= 144.9151
##$PHC1= 6.256923
##$PH_mod= 1
##$PKNL= yes
##$PPARMOD= 0
##$PSCAL= 4
##$PSIGN= 0
##$REVERSE= no
##$SF= 250.13
##$SI= 32768
##$SIGF1= 0
##$SIGF2= 0
##$SINO= 400
##$SIOLD= 32768
##$SREGLST= <1H.DMSO>
##$SSB= 0
##$STSI= 32768
##$STSR= 0
##$SW_p= 5175.98343685301
##$SYMM= 0
##$S_DEV= 0
##$TDeff= 65536
##$TDoff= 0
##$TI= <Analysis number 999999
Compound Code 99
Book Reference 9
Project Code 9>
##$TILT= no
##$TM1= 0
##$TM2= 0
##$TOPLEV= 0
##$USERP1= <user>
##$USERP2= <user>
##$USERP3= <user>
##$USERP4= <user>
##$USERP5= <user>
##$WDW= 1
##$XDIM= 32768
##$YMAX_p= 420393042
##$YMIN_p= -205913
$$ End of Bruker specific parameters
$$ ---------------------------------
##NTUPLES= NMR SPECTRUM
##VAR_NAME=  FREQUENCY,     SPECTRUM/REAL,   SPECTRUM/IMAG
##SYMBOL=    X,             R,               I
##VAR_TYPE=  INDEPENDENT,   DEPENDENT,       DEPENDENT
##VAR_FORM=  AFFN,          ASDF,            ASDF
##VAR_DIM=   32768,         32768,           32768
##UNITS=     HZ,            ARBITRARY UNITS, ARBITRARY UNITS
##FACTOR=    0.157963299565203, 1,           1
##FIRST=     4132.6476996994, 0,             0
##LAST=      -1043.33573715361, 0,           0
##MIN=       -1043.33573715361, -205913,     0
##MAX=       4132.6476996994, 420393042,     0
$$ Real data points
##PAGE= N=1
##DATA TABLE= (X++(R..R)), XYDATA
$$ [...]
15617A20092j2522n5384n5566j5548j7542J0745j703j7573j2802M31k9154P2199
15605a4327K2715K7080Q744J901j8419o901m6187l4032j3375k5327N905Q6764
15593e459j0469l0532L1045r753j9828J6760L0522L0240j770k2472j0447R138
15581F975p954J2077L6964j3434n2816n6396n1054k5960K4574P8694L5160l3713
15569d6883J1191N5440N7946N4080l5996n6592l0357k3900j5979j475K3782k909
15557a1652l9528o2408J7320J2741K9575l1371j8113L0702k0465K077K1258L0006
15545c9858J4782R870k9903k8964O1958R629o613q676N1102L6530l8872l3592
15533b607j4847L1597k971m2698j4676M7126M1635M5648j6727o4569n2135K0409
$$ plain form
15617 120092 107570 52186 -3380 -18928 -36470 -25725 -27428 -45001 -57803 -57372 -86526 -14327
15605 -14327 8388 35468 44212 46113 27694 20793 -25394 -59426 -72801 -98128 -92223 -5459
15593 -5459 -15928 -46460 -15415 -25168 -44996 -28236 2286 32526 30756 8284 -2163 6975
15581 6975 -979 11098 48062 34628 -18188 -74584 -125638 -151598 -127024 -48330 -13170 -46883
15569 -46883 -35692 19748 77694 131774 95778 39186 8829 -15071 -31050 -32525 -8743 -11652
15557 -11652 -51180 -113588 -96268 -83527 -53952 -85323 -103436 -72734 -93199 -91122 -69864 -39858
15545 -39858 -25076 -15206 -45109 -74073 -12115 -2486 -9099 -17775 33327 69857 30985 -2607
15533 -2607 -17454 14143 11172 -31526 -46202 924 42559 88207 71480 6911 -45224 -24815
15521b4815l1607j5437K5562j9684j679L5551J8673p250p499J8075J1227L2718
15509C3835J1970j2580m9671P626l5054q171K3584P333K9428J8273j8596k3825
15497a5848k24j0454L2470L1515J512j960k5740q221K2899l7603m4599k9308K5947
15484e9614M2286N8124K4752k6309K1877l0500m4380m8479m9914n345j038L4846
15472h3694J5248N5106M377q9285j4536O2331L175n3355m5974N4065K4201m301
15460g2642K6875j240o282K1927K2885l0352l2355k207k7059m649N9331J0726
15448c5042N536L4916P1353K7613k1347l8196k5261K0576j4771l1337j9110K8302
15436C232j4760p7934j4275M9322L2139K4996L644m1746j230j3360n472K5901
$$ plain form
15521 -24815 -56422 -71859 -46297 -65981 -67660 -32109 -13436 -20686 -28185 -10110 1117 33835
15509 33835 45805 33225 -16446 -8820 -43874 -52045 -28461 -21128 8300 26573 7977 -15848
15497 -15848 -16072 -26526 5944 37459 38971 37011 11271 3050 25949 -11654 -56253 -85561 -59614
15484 -59614 -17328 40796 65548 39239 61116 30616 -13764 -62243 -112157 -117502 -118540 -83694
15472 -83694 -68446 -13340 -8963 -98248 -112784 -50453 -47278 -100633 -146607 -92542 -68341 -72642
15460 -72642 -45767 -47007 -53289 -31362 -8477 -38829 -71184 -73391 -100450 -105099 -45768 -35042
15448 -35042 -29506 5410 76763 104376 83029 44833 19572 40148 25377 -5960 -25070 3232
15436 3232 -11528 -89462 -103737 -54415 -22276 2720 6364 -35382 -36612 -49972 -55444 -29543
15424b9543j4793j0769J5598K0416n590l0151M3988M5342M1635O708o0129k49
15412B2463J6333n4728j7390j9521J8432K2597J9725l5596l2037K6615N099K0968
15400g040M8212l2923k3522O2484K861j2500K1956J0869J6777j0499l5098j742
15388C9835O6720R328p0781o558Q015l4095O740K394o1136m8319l1513K416M4246
15375g2708N7085L6824N803j9947n3955L1361J3940j2247M5233k0447j9818J3534
15363D658K9855L214n1200K6743L4180l1334l2550j6008R520l556J4999K2153
15351A0674q148j9972j5665j1457j6067J1825R3094K0445J7027J427q567n4099
15339B0517J89J504l1092J518m500K3913J360l6695j8193M6038l741m1621l0982
$$ plain form
15424 -29543 -44336 -55105 -39507 -19091 -24681 -54832 -10844 34498 76133 82841 22712 22463
15412 22463 38796 -15932 -33322 -52843 -34411 -11814 7911 -27685 -59722 -33107 -28008 -7040
15400 -7040 41172 8249 -15273 47211 50072 37572 59528 70397 87174 76675 41577 39835
15388 39835 106555 115883 45102 38544 46559 12464 19204 21598 -39538 -87857 -119370 -116954 -72708
15375 -72708 -15623 21201 27004 7057 -46898 -15537 -1597 -13844 31389 10942 -8876 4658
15363 4658 34513 37727 -13473 13270 47450 16116 -16434 -32442 -22922 -26478 -11479 10674
15351 10674 2526 -17446 -33111 -44568 -60635 -48810 44284 64729 81756 83183 74616 20517
15339 20517 20706 22210 -8882 -7364 -11864 12049 13409 -23286 -41479 4559 818 -40803 -71785
15326g1785m8936J3041M0211k8484L0292M7453K8314p4712p861M1755l591n3941
15314h8244m9941J7583j5330N193Q5100O5900m0536m1471J9020P127r088l1672
15302g6359j0357N4479p834M676O108J504j6184Q449l4016m7159J484M0796j2404
15289h6817L7911N8706K7680n500l6096j5648j6174J2606M1089L4244K1105j6435
15277E6671Q497m7650n1238N852P345l5716J2130M170M86l0350R350k9947J795
15264h8605M8522N382m3808j3123N0572L4909m2609K414k3866k533K6209n385
15252e1921j3216k3953K971M4276L5623J2236K3411J2725k6848J3098O422m057
15240C0767l2949J9341k6023o122j083j362L4625n6675m4181M6305K3316k1375
$$ plain form
15326 -71785 -120721 -107680 -67469 -95953 -65661 -18208 10106 -64606 -72467 -30712 -34303 -88244
15314 -88244 -138185 -120602 -135932 -130739 -45639 20261 -20275 -61746 -42726 -35599 -44687 -76359
15302 -76359 -86716 -32237 -40071 -35395 -29287 -27783 -43967 -35518 -69534 -116693 -115209 -74413 -86817
15289 -86817 -48906 9800 37480 31980 -4116 -19764 -35938 -23332 17757 52001 73106 56671
15277 56671 65168 17518 -33720 -27868 -20523 -56239 -44109 -39939 -39453 -69803 -60453 -90400 -88605
15264 -88605 -40083 -34701 -78509 -91632 -41060 -6151 -48760 -46346 -70212 -72745 -46536 -51921
15252 -51921 -65137 -89090 -86119 -41843 -6220 6016 29427 42152 15304 28402 34824 30767
15240 30767 -2182 17159 -8864 -14986 -16069 -17431 17194 -39481 -83662 -37357 -14041 -35416
15228c5416j1870N1923j247j2124K4924N699m4611N95M2568L226J0706N5908K5229
15215A15510m0354o9121k0957m0982k5820K0948l46p505k4911n258J604j3040
15203a10232L3126P1211k239m444n8244j3715l1634j9645L8536l3072M794m824
15191a30382n065J9964N9702O7587J3034k5628J0339K2392J5840N961l1621j7041
15179E082O499L7747m4790q3187q901K5082O0759N1049K2831P6125k323o1494
15167H4479k9600n1738n1685q476K8036K5588M6791p922k7259N9210M6447j6693
15155I7178n7458L2183M1246m9368n3673k7305l210J3979k6758l490m454K787
15143c8343k2042p734K2515j7999k3108k5331M352J4313M9433K9327Q4223L6718
$$ plain form
15228 -35416 -47286 4637 3390 -8734 16190 21889 -22722 -22127 20441 23667 34373 90281 115510
15215 115510 75156 6035 -14922 -55904 -81724 -60776 -61122 -68627 -93538 -98796 -97192 -110232
15203 -110232 -77106 -5895 -8134 -12578 -70822 -84537 -116171 -135816 -97280 -130352 -125558 -130382
15191 -130382 -135447 -115483 -55781 11806 24840 -788 9551 31943 47783 53744 22123 5082
15179 5082 11581 49328 4538 -78649 -87550 -62468 -1709 49340 72171 148296 145973 84479
15167 84479 54879 3141 -48544 -57020 -28984 -3396 43395 35473 8214 67424 113871 97178
15155 97178 39720 71903 113149 63781 10108 -17197 -20407 -6428 -33186 -36676 -41130 -38343
15143 -38343 -60385 -68119 -45604 -63603 -86711 -112042 -107690 -93377 -43944 -14617 69606 106324
15131A06324p0354n1230J0184L9086Q760N3638R187k7312m0111m4478m3071N2212
15119B835O855K6298l312m7850o8801l6055O7523L5209M0970O620N847J581l573
15106C4147N7107o256l4660o256o117N0194k1137k5294k9816K112J3732K867j6168
15093A4455K4377j0248l6438l7739K9683K6223j5795j6995K3845N2527j5068l1613
15081G214p2781J1433L0784o715l4002j8454L3938O8413R9285M996l0725O341
15069I9727k9948o797L959J484K731m2204r472j7742M6937K3433R57l6722n240
15056C1103m6485j785M9597L1196j8637J8484j2061K8563K6856r514l9389k8020
15044B9908q95L312L5927m6513m1614M6845j5597m7482J3210J4118k2593N207
$$ plain form
15131 106324 35970 -15260 -5076 34010 42770 96408 105595 78283 38172 -6306 -49377 2835
15119 2835 9690 35988 32676 -15174 -83975 -120030 -52507 -17298 23672 30292 36139 37720 34147
15106 34147 91254 84998 50338 44082 37965 88159 67022 41728 11912 14024 27756 30623 14455
15093 14455 38832 28584 -7854 -45593 -15910 10313 -5482 -22477 1368 53895 38827 7214
15081 7214 -65567 -54134 -23350 -30065 -64067 -82521 -48583 19830 119115 124111 93386 99727
15069 99727 69779 62982 66941 68425 71156 28952 19480 1738 48675 72108 73065 36343 31103
15056 31103 -15382 -17167 32430 63626 44989 63473 51412 79975 106831 97317 57928 29908
15044 29908 29013 32325 68252 21739 -19875 26970 11373 -36109 -22899 -8781 -31374 -26167
15032b6167j512j0237K2885L2316R261j6895j4036K4723l249k6554l3950l5061
15020g8476P166O6510O7220L5970p943j0362q6297m7944j6484N467P6383J7327
15008B8537N9815j4634r715l8323l5481P542P771J8469j1139J9651j0787m4104
14996b2398j8990O6426L4716k2391l2178p231j511l8541m4277N0038Q045j6535
14984d4827K6822k1556L0256L8989Q4K6107J2329L187k7001m2018J0698N5858
14972F8928k9872J4398n628j865J8858K2932j3425l1232o596l3523J8105M3501
14960F4581l8787M396k1196Q829K2459l2447k3379M772J5971m6758j3591J8345
14948c6805L9479k016J0761k6726R656K7566J910J6818M9271p264k210n479k2255
$$ plain form
15032 -26167 -27679 -37916 -15031 17285 26546 9651 -4385 20338 17089 -9465 -43415 -78476
15020 -78476 -71310 -4800 62420 98390 90447 80085 -6212 -54156 -70640 -65173 11210 28537
15008 28537 88352 73718 64003 25680 -9801 -2259 5512 23981 12842 32493 21706 -22398
14996 -22398 -41388 25038 59754 37363 5185 -2046 -3557 -42098 -86375 -36337 -28292 -44827
14984 -44827 -18005 -39561 -9305 29684 29768 55875 68204 71391 44390 2372 13070 68928
14972 68928 39056 53454 47826 45961 64819 87751 74326 43094 36498 2975 21080 64581
14960 64581 25794 30190 8994 17823 40282 7835 -15544 -10772 5199 -41559 -55150 -36805
14948 -36805 2674 658 11419 -15307 -5651 21915 23825 40643 89914 82650 80440 74961 52706
14935E2706J0807J8566L627j7686R251j1376J7286j6169m8819l3377j1376J3688
14923a2872K1903k7275o6465J4073k0855M2905J4110n226j9329j0571J1431J0654
14911d7517O2113O365l288M342J0247m3648r124p747j5038L0604K9672m5511k4014
14898e2544p331K4836j170R249K8312J7533j39r595r4j6824l8550q281j0251M9852
14884a4997M3435l9203m4120j2196M8668J28748n2249k6936l697O1079J9848o518
14872A01862q8208l6364q058l623L7263L3531M3827J2336k6765l6300L0102j9578
14860D0025r757K7966n5984p3918K8682N7046l0009j4913J7832M2310N7933n0654
14848C6559r1488j1379l631L9767L1004l313K3659J6012N8404K2461k0896k1335
$$ plain form
14935 52706 63513 82079 85706 68020 77271 65895 83181 67012 18193 -15184 -26560 -12872
14923 -12872 9031 -18244 -84709 -70636 -91491 -48586 -34476 -39702 -59031 -69602 -58171 -47517
14911 -47517 14596 20961 17673 22015 32262 -11386 -20510 -28257 -43295 -12691 16981 -28530 -52544
14898 -52544 -59875 -35039 -36209 -26960 1352 18885 18746 9151 9057 -7767 -46317 -54598 -64849 -14997
14884 -14997 28438 -10765 -54885 -67081 -18413 110335 58086 31150 27453 88532 108380 101862
14872 101862 13654 -22710 -30768 -34391 2872 36403 80230 92566 65801 29501 59603 40025
14860 40025 30268 58234 2250 -71668 -42986 14060 -15949 -30862 -13030 29280 87213 36559
14848 36559 -54929 -66308 -69939 -30172 832 -2481 21178 37190 95594 118055 97159 75824
14836G5824j0035n534L0509j4241o7760m3067j7324L9769n782J4204M024n2191
14824e1604L8398M9471N932o9495n2063p165J1600J5581K8233N6717M1453n5749
14812A1309l8791k112M8809J6606J9506J9172k8682k3141m428J6798L093J6807
14800E4946O4231q265l8368m0205j3296q2015N208O1028k1467j8957m4594K6565
14788e5189K355J0943j3500l686M182K9130K9603n3698R276K3562j7148k1405
14776e5575L5178M4922j8989l1370J226m6635n2163P917n06J7666N8604J011P7261
14763C8547K2645j5096m7112Q327q381L1287K9847m0700o9629J9777J7453r279
14751b2314r970l5902n0954J296k70j2314L7423J1043j254k7945R556L7852L6537
$$ plain form
14836 75824 65789 60255 90764 76523 8763 -34304 -51628 -11859 -17641 -3437 587 -51604
14824 -51604 -13206 36265 42197 -27298 -79361 -86526 -74926 -59345 -31112 25605 67058 11309
14812 11309 -27482 -29594 19215 35821 55327 74499 45817 22676 18248 35046 38139 54946
14800 54946 119177 110912 72544 32339 19043 -62972 -57764 3264 -18203 -37160 -81754 -55189
14788 -55189 -52834 -41891 -55391 -59077 -54895 -25765 3838 -49860 -40584 -17022 -34170 -55575
14776 -55575 -20397 24525 5536 -25834 -24608 -71243 -123406 -115489 -115995 -98329 -39725 -38714 38547
14763 38547 61192 46096 -1016 7311 -1070 30217 60064 19364 -50265 -30488 -13035 -22314
14751 -22314 -32284 -68186 -119140 -117844 -118114 -130428 -93005 -81962 -83216 -111161 -101605 -63753 -27216
14738b7216m5249k4065J1779L0188L8735N441K3692K1470q893j763p116N61L207
14725B0771j4761L2936N1322l9279p4175O124K4925J7869K043j9745m9783j6874
14713e8627J6366J5346k969M9810P4837m182m3641r0032r795p3J4540M1472N0587
14700E3639j9009K5039K8357m2435k9556J0303R434K0270k4929k936m9225Q629
14688a2419K9998Q523J4434M9199j5504k9229k784j1470M665J6425l3968q379
14676I491m666K9784M9333J7368j3414n7692J3198k3131j3222j4147K2206j2922
14664B186K0658K0100p6937j6271j6059O652Q9552j2982l235J0310l4098j3707
14652b3831M1984l6742l1339k4597J1151M0371J9145K0298O715K0705j9777J5717
$$ plain form
14738 -27216 -72465 -96530 -84751 -54563 -15828 -10387 13305 34775 25882 24119 17003 17564 20771
14725 20771 6010 38946 90268 50989 -23186 -17062 7863 25732 27775 8030 -41753 -58627
14713 -58627 -42261 -26915 -29884 19926 94763 90581 46940 -43092 -52887 -52960 -38420 3052 53639
14700 53639 34630 59669 88026 45591 16035 26338 35772 56042 31113 28177 -21048 -12419
14688 -12419 17579 26102 40536 89735 74231 45002 42218 30748 35413 51838 17870 9491
14676 9491 4825 34609 83942 101310 87896 30204 43402 20271 7049 -7098 15108 2186
14664 2186 22844 42944 -33993 -50264 -66323 -59671 29881 16899 13664 23974 -10124 -23831
14652 -23831 18153 -18589 -49928 -74525 -63374 -23003 -3858 16440 23155 43860 24083 39800
14640C9800k2251j5340j4890m4846J8588K7568j3236J1061M653j3845M170Q849
14628i719J3812k3635k3393j4859P4542j4252m6004N785J8387o742N0406L1130
14616E5458J9130j3238m3629l7430k0218N0021M9894l3158l8381J6499L9989L2608
14604G7545J4900J9967K4070j0902n1428l3025L0211M4484K5696j0044n7536J9757
14592I3695N5558n857n9019n0056l134L2361J0561j2114j5517M5852l7071j1297
14580D3962j3178l4507M2956N2838o9835k5657r943k6278k6601q220m581N9372
14568a9672N8375l3907L0978M4982K899k2702k9000m657j271k0417M319j7121
14556g194N2618j719J7652n488K9508j6170k9631o211j6813n4542l258q905J6393
$$ plain form
14640 39800 17549 2209 -12681 -57527 -38939 -11371 -24607 -13546 -8893 -22738 -18568 -9719
14628 -9719 4093 -19542 -42935 -57794 16748 2496 -43508 -37723 -19336 -26078 24328 55458
14616 55458 74588 61350 17721 -19709 -39927 10094 59988 26830 -11551 4948 44937 77545
14604 77545 92445 112412 136482 125580 74152 41127 71338 115822 141518 131474 73938 93695
14592 93695 149253 143396 84377 34321 31187 63548 74109 61995 46478 92330 55259 43962
14580 43962 30784 -3723 39233 92071 22236 -3421 -13364 -39642 -66243 -74463 -79044 -19672
14568 -19672 38703 4796 35774 80756 83655 60953 31953 27296 26025 5608 9927 -7194
14556 -7194 45424 43705 61357 55869 85377 69207 39576 33365 16552 -37990 -41248 -50153 -33760
14543c3760Q805Q248L6988O464j4426l6079o172j1360L1315m4967M1489J1413
14531b042k7975N9269L4067m6640k1033k1330r10J1388K0222L5650O1320p094
14519I4892m099o458L660Q008k4446n6645o1927p555p222r799O382J5261L5037
14506a4911P3743M3729j4357n6321M819l815m827j6704l9721L0575L3548k092
14494C3666r06K1445J6025p920n293k6729k6498j6985j6896J7055P30J2701o309
14481e914j7635K6382J6524P239m342j4792l640n5754l2340L5845M2080O8175
14469F1828j4919p306K7060J3979m6422k7205k1246L8602j3515J60K9035L6560
14457G6611r384k0880n0895n648O3645J5956j7953J4156J4643l9740q6326K1970
$$ plain form
14543 -33760 -24955 -16707 20281 26745 12319 -23760 -29932 -41292 -9977 -54944 -13455 -2042
14531 -2042 -30017 29252 63319 16679 -4354 -25684 -26594 -15206 5016 40666 101986 94892
14519 94892 90793 84335 87995 96003 71557 14912 -47015 -54570 -61792 -71591 -65209 -49948 -14911
14506 -14911 58832 102561 88204 31883 36702 32887 28060 11356 -28365 2210 35758 33666
14494 33666 32760 54205 70230 62310 57017 30288 3790 -13195 -30091 -13036 -12306 395 -5914
14481 -5914 -23549 2833 19357 26596 22254 7462 3822 -51932 -84272 -48427 -6347 61828
14469 61828 46909 39603 66663 80642 34220 7015 -14231 24371 10856 11016 40051 76611
14457 76611 67227 46347 -4548 -10196 53449 69405 51452 65608 80251 40511 -45815 -23845
14445b3845J2536k7722m514M2458J7404k0484L3156J8940l9123k7404o8801j6014
14433a03413M641P6712K3215k3027K8640K8952k8237q901J813K3437K4303m3864
14421D271L0163P2683M845k8980l3101N017L726k1975j4768m6449M9O8452N7537
14408A01470p988m7292p1727M2148K0563k4909J1803k4239l1297l2039L0122L8630
14396E245l8714l0616L5236m6817m9957R3974M5767j1017l462L9333l5687L894
14384G179N1496r267m6279J2264j6054K4364N8503K9289m163J2632l7748k4881
14372E7335l3011J8551J4898J3462o9916j0460K2385N7053L0104n6815n5738R351
14360b801J7906k3262n9510m417k5305l1770O6921O5455L378J1513K0545o953
$$ plain form
14445 -23845 -11309 -39031 -43545 -1087 16317 -4167 28989 47929 8806 -18598 -87399 -103413
14433 -103413 -98772 -22060 1155 -21872 6768 35720 7483 -1418 395 23832 48135 4271
14421 4271 34434 107117 111962 82982 49881 54898 58624 36649 21881 -24568 -24519 43933 101470
14408 101470 93482 46190 -25537 16611 37174 12265 24068 -171 -31468 -63507 -33385 5245
14396 5245 -33469 -64085 -28849 -75666 -125623 -31649 14118 3101 -361 38972 3285 7179
14384 7179 58675 49408 3129 15393 -661 23703 82206 111495 107332 119964 82216 57335
14372 57335 24324 42875 57773 71235 1319 -9141 13244 70297 100401 43586 -12152 -2801
14360 -2801 15105 -8157 -67667 -72084 -97389 -129159 -62238 3217 6595 18108 38653 31700
14348C1700P304m5786K7161J7724n4024J7052M6429r259o8684k1027O9331N2558
14336G0479K768n3569k7543J5921m3880m6903K6150k952J2600N0896m30k6129
14324b2592N4873J3909l7827o4693O072L8984o591j7503L8006R935m2664N8144
14312B8053O7943j0686k0846L229r843j2998J4025n7769m7322J3140L5802O036
14300H764k956L644J7039N53k5464M1009l5762m3545j6921j9805J6060K8200L3744
14287D560L7964J9310M171J3153J4303k5577l1982r43m4085j9627o70K6055j9396
14274b2764k2217k8809J9614O0728P9313P506l8627L026m035n5305k2179q316
14262c2065J6065M7399j8100r247k0985L3590M4569j9967l1860K9677M76k0257
$$ plain form
14348 31700 39004 -6782 20379 38103 -15921 1131 47560 38301 -30383 -51410 17921 70479
14336 70479 73247 19678 -7865 8056 -35824 -82727 -56577 -59529 -46929 3967 3537 -22592
14324 -22592 32281 46190 8363 -56330 -50258 -11274 -17865 -35368 2638 12573 -30091 28053
14312 28053 95996 85310 64464 67693 57850 44852 58877 1108 -46214 -33074 2728 8764
14300 8764 5808 9452 26491 27044 1580 42589 6827 -36718 -53639 -73444 -57384 -29184 4560
14287 4560 42524 61834 66005 79158 93461 67884 35902 34959 -9126 -28753 -29423 -3368 -22764
14274 -22764 -44981 -73790 -54176 6552 85865 93371 54744 57770 53735 -1570 -23749 -32065
14262 -32065 -16000 31399 13299 4052 -16933 16657 61226 41259 9399 39076 39552 19295
14250A9295m247N2720O6922R778n1571n5877q310J580O178k9661J8447J3229J5732
14237E4215J4176n6832p870K0577N923K0122l2249n2751J2900J7960N2770M8930
14225I7871o7739n2267j4881L3180l5k1894n387N0232l5553o5881k3433K7274
14213g8513K2682K2536j3606J758N5178M3128J3983k6148O216J3123j0045J3602
14201F3894k1562k7458m531j6428L7676O9239j5079j7212l0171o2986m8088N4365
14189a8341O8516M9156J0013l1014P1129n5326m7481J3478k8326n06n4817n7838
14177h1357L2422O2450J1083M9397r827j0939m0402m5014M0599R951J5072r5625
14165f2190k5696N1141k205k4974L3667N9554L0834o4474k9985M7434J4736q661
$$ plain form
14250 19295 15048 67768 134690 144468 92897 37020 28710 30290 36468 6807 25254 38483 54215
14237 54215 68391 11559 3689 24266 30189 50311 18062 -34689 -21789 -3829 48941 97871
14225 97871 30132 -22135 -37016 -3836 -3871 -25765 -31152 19080 -16473 -82354 -105787 -78513
14213 -78513 -55831 -33295 -46901 -45143 10035 53163 67146 40998 47214 60337 50292 63894
14201 63894 42332 14874 10343 -6085 31591 100830 85751 68539 38368 -24618 -72706 -18341
14189 -18341 50175 99331 109344 78330 149459 94133 46652 60130 31804 31298 -23519 -81357
14177 -81357 -48935 13515 24598 73995 64168 53229 12827 -32187 8412 18363 33435 -62190
14165 -62190 -87886 -36745 -38950 -63924 -30257 29297 60131 -4343 -34328 13106 27842 19181
14153A9181m4749J8720N5942k402m1799n1197J0900L6212J9911N1094q742q406
14141E4665K1154J8369q785l3625l1067k6514q505R707L4714L9626Q80K0306k2638
14128F8287l9879m6746L3640R592j8233m6661O2538K9604M4408L0755m6892m3483
14116C6930o8277n871J7295O1563M368l1408l9862L1733j0156n727l6560k2637
14104f8609K7860N8624p8098l2141M6770j8644K5073k6287N4127L3516K3915q990
14092C7116p3592j7274L1025m032K9156M7457N079k6217j5584K3412L3205l1403
14080C8348k497K6241J4489m1536L113O2733k3145m1685j7908J4302J5032l8842
14068H645J0061J1698K0909n6831l5964M4078K1424M497m281K7694p154K4054
$$ plain form
14153 19181 -25568 -6848 49094 46692 4893 -46304 -35404 808 20719 71813 63071 54665
14141 54665 75819 94188 85403 51778 20711 -5803 -14308 -4601 30113 69739 70619 90925 68287
14128 68287 28408 -18338 15302 24894 6661 -40000 22538 52142 96550 127305 80413 36930
14116 36930 -31347 -37218 -19923 41640 46008 14600 -25262 6471 -3685 -9412 -45972 -68609
14104 -68609 -40749 17875 -60223 -92364 -45594 -64238 -39165 -65452 -11325 22191 46106 37116
14092 37116 -36476 -53750 -22725 -26757 2399 49856 54935 28718 13134 36546 69751 38348
14080 38348 35851 62092 76581 35045 38158 100891 77746 36061 18153 32455 47487 8645
14068 8645 18706 30404 51313 -5518 -41482 2596 24020 28517 24236 51930 44776 68830
14056F8830l2452o644M2477n0452K8303J6759J3624K0382j2936j9625n9510j0523
14044a767O1024j534n4672j4301J1118M2666j4929n0375j5887J7212L9191L1893
14032D9639k1305J2302J6424j0551n545J5701J2007K5687j4821n1451K3586J8434
14020G0107Q937l9100K7245r539p2050o9101L7401O2856k0978j8274o0356j2672
14008i5524Q6246N8645j498k1380j23410k5009M1190N8593L3489L818m0084j1577
13996c6501J3164J8063O3460P30j2093k2772j3586K382j0000K6973K0200j3260
13984C6760J8349N409k108J3354M6576J9929K8861k9969o2349r955j3836k009
13972D9012j125K6542O0502L4598j561m8222j9864k0789J7116J2934K7454L0615
$$ plain form
14056 68830 36378 29734 72211 21759 50062 66821 80445 100827 87891 68266 8756 -1767
14044 -1767 59257 57723 3051 -11250 -132 42534 27605 -22770 -38657 -21445 17746 49639
14032 49639 28334 40636 57060 46509 40964 56665 68672 94359 79538 28087 51673 70107
14020 70107 79044 39944 67189 57650 -14400 -83501 -46100 16756 -4222 -22496 -82852 -95524
14008 -95524 -9278 49367 47869 26489 -96921 -121930 -80740 -22147 11342 15160 -24924 -36501
13996 -36501 -23337 -5274 58186 58916 46823 24051 10465 12847 2847 29820 50020 36760
13984 36760 55109 60518 58410 71764 118340 138269 167130 137161 74812 64857 51021 49012
13972 49012 47887 74429 134931 169529 167968 119746 99882 79093 96209 109143 136597 167212
13960A67212m5882j6789M9296K8883l6019K097L7363k2102J5550k3056J309K4564
13948A82426n2797J5496M2910k7744K154m6776m5246k1239j4864m344j2423J7082
13936C4635N7333N3245O4401J9136l5665M232k2517j6826n6044k150M4998j3882
13924A30896M351r451n0692k3617l7648l3133k9318q375L1347L3288n742O163
13912H069L2288o453k7109j1732P435J2940K62p166J4686k569m6745k4357O0942
13899A0491j6423k8469N6301K932l0355K8618J8348J2255J0422L1411O367J4668
13887A16566j0192K0695K6956p172j7332j5196q122j304N686J157m7577K5050
13875H9215P880k0540J4269o603M5555J2546M332r826J0193m1474p8127m8434
$$ plain form
13960 167212 121330 104541 153837 182720 146701 148798 186161 164059 179609 156553 157862 182426
13948 182426 129629 145125 188035 160291 162445 115669 70423 49184 34320 29976 17553 34635
13936 34635 91968 145213 209614 228750 193085 197317 174800 157974 101930 99780 144778 130896
13924 130896 135247 125796 75104 51487 13839 -19294 -48612 -56987 -25640 7648 1906 8069
13912 8069 40357 33904 6795 -4937 2498 15438 15700 8534 23220 20651 -26094 -50451 10491
13899 10491 -5932 -34401 21900 24832 -5523 23095 41443 53698 64120 95531 101898 116566
13887 116566 106374 127069 154025 146853 129521 114325 106203 104899 110585 111742 64165 89215
13875 89215 97095 76555 90824 84221 129776 142322 146654 136828 147021 105547 27420 -21014
13863b1014M9138L5730O0705L6631J1347j5503O3616N3955r469n5664l8159j4196
13851A57117K901j0049m764J514J1530l5891j482l036k1363N0232m8153m0066
13839E8490j1674j2840j8O260J0070k0920J8703m0329J5745J6798L5563j5288
13827F0560l8097L2980K2125j8612j9609m5194J7062P300K379Q843K2828k0464
13815C2101K0195K4844l6707m1969j9205j1941j6328N5398K6938L3075K7027L6171
13803A29599n513J0399j6267k9531n13J8446m7614M289j0787r293J075j7011J8204
13790D5483L8878p699N517K7476m5909j5727k088n918M8044o186o4159J8864K0772
13777E7348K76K856j4564j6654m9398j6040K199J0447N9032N5315O526n7197K0578
$$ plain form
13863 -21014 28124 63854 124559 161190 172537 157034 220650 274605 265136 209472 171313 157117
13851 157117 160018 149969 145205 146719 158249 122358 120876 117840 96477 146709 98556 58490
13839 58490 46816 33976 33958 40218 50288 29368 48071 7742 23487 40285 75848 60560
13827 60560 22463 55443 77568 58956 39347 -5847 11215 18515 20894 29737 52565 32101
13815 32101 52296 77140 40433 -1536 -20741 -32682 -49010 6388 33326 66401 93428 129599
13803 129599 124086 134485 118218 88687 88174 106620 59006 63295 52508 43215 44290 27279 45483
13790 45483 84361 76662 82179 109655 63746 48019 45931 40013 88057 81871 17712 36576 57348
13777 57348 57624 60480 45916 29262 -20136 -36176 -33977 -23530 35502 90817 97343 40146 60724
13764F0724L4019j4316l691J0155O576j0270n3744k2465m0221l2136O5737O4600
13752F4968J7226L1272M8460j4312k2560k7841o1471n5948J356L2747L8761k0216
13740C2442k3249J1620M4539l4691J7769K7407M2607l4158k8923k1591K9741k0874
13728D2639p210J8442K5980p642K3051j1537j470K2397M2611K3412l7237k9252
13716A04184r215O319K3936m5313n9296J5282p591P221P2946M2452k8633j8714
13704A03578k2007J9359L3873J0597J176O454j4442m0704j3149N577J6013J9452
13692A25777k4599j7577p321k438k4929J4948M5283K1508j2208k1899j1470L1004
13680A16079k765J2956M5187k7323l6919K6980k5261N916J0388j0648K0333k5763
$$ plain form
13764 60724 94743 80427 76736 86891 93467 83197 29453 6988 -33233 -65369 368 64968
13752 64968 82194 113466 161926 147614 125054 97213 35742 -20206 -18850 13897 52658 32442
13740 32442 9193 20813 65352 30661 48430 75837 118444 84286 55363 33772 63513 42639
13728 42639 35429 53871 79851 72209 95260 83723 82253 104650 147261 170673 133436 104184
13716 104184 94969 101288 125224 79911 20615 35897 28306 35527 108473 150925 122292 103578
13704 103578 81571 100930 134803 145400 146576 153030 138588 97884 84735 90312 106325 125777
13692 125777 101178 83601 76280 73842 48913 63861 109144 130652 118444 96545 85075 116079
13680 116079 113314 126270 171457 144134 107215 134195 108934 114850 125238 114590 134923 109160
13668A09160O0967L2885o3058k6999K6845n7247M002O3360N4817j9984q2790m0438
13656F1520k911N27O894K6777J7829M1982K0725l9548k896K3413m88k4861j4864
13643A14099Q436L600L4337p516r033j4367J2840o904m23k8141p485m5240k6074
13630B8129J4383N110K5768M2967K6416m1874j7908k2135j9942K3551M5282j3255
13618I6492L8046M3496p457k2392M7871j8272l979o888P834o081O562L4661j4545
13605A95348k4365m0191L6720J8401K6788O018q163k3157j5001N4052j8898K5744
13593B33296K1039J7607k5723k2007m7879J0063P2019K0725L7898j0991n0504
13582B55543L9665L1092m1007n6905j5899K5596j3162M768N1798O0477n020j2032
$$ plain form
13668 109160 170127 203012 139954 112955 139800 82553 86555 149915 204732 184748 101958 61520
13656 61520 58609 59136 66030 92807 110636 152618 173343 133795 130899 154312 153824 128963 114099
13643 114099 122535 126135 160472 152956 143923 129556 142396 135492 135069 106928 99443 54203 28129
13630 28129 42512 47622 73390 116357 142773 100899 82991 60856 40914 64465 109747 96492
13618 96492 134538 178034 170577 148185 196056 177784 173805 166917 174751 168670 175232 209893 195348
13605 195348 170983 130792 167512 185913 212701 218719 210556 187399 172398 226450 207552 233296
13593 233296 254335 271942 246219 224212 176333 186396 258415 279140 317038 306047 255543
13582 255543 295208 326300 285293 228388 212489 238085 224923 229691 281489 341966 336946 324914
13570C24914M32J9473k805k6742K9629M0249K2386M0020L3203J6709L7122j590
13558E33000p1307k4012M1482R0058L7163j6441l5728L4714J44576R4328K2828
13547H50661J3911J06831J06519M7847Q1825O5390Q6409J03060J47250J84263
13537A793966K02248L13813K97431L94847M31209N04423O76949Q24389R39946
13528F379221J065462J229842J212896J172037J102183R35632Q97896R14411R31563
13519A5841143J024145J089476J013208P32443L00387j19135n44258p11349o53195
13510A7972865n48169m05349k82471k52747l15652l21115k08917j98977o3657
13501A5375811J59463L11738L78629K98384K87406L57118N80041P14989Q40599
$$ plain form
13570 324914 325346 344819 342014 315272 344901 385150 407536 447556 480759 497468 534590 533000
13558 533000 461693 437681 479163 569221 606384 589943 554215 588929 733505 827833 850661
13547 850661 864572 971403 1077922 1125769 1207594 1272984 1359393 1462453 1609703 1793966
13537 1793966 1996214 2310027 2607458 3002305 3433514 3937937 4614886 5439275 6379221
13528 6379221 7444683 8674525 9887421 11059458 12161641 13097273 13995169 14909580 15841143
13519 15841143 16865288 17954764 18967972 19700415 20000802 19881667 19337409 18626060 17972865
13510 17972865 17424696 17019347 16736876 16484129 16168477 15847362 15638445 15439468 15375811
13501 15375811 15535274 15847012 16225641 16524025 16811431 17168549 17748590 18463579 19304178
13492A9304178P71091M91466R1510l68317q42196j074604j141315j023283q28442
13483A5380088q09560q55655r32306j082892j258585j265089j216686j112504
13475F846811r50806p83244o12723m85691l39162l42460k99429j57331j64853
13466B711112p6304o2812m8190p8780k0496n7113o0346K0097J04481R6721Q6549
13455B614919R8024J63353K69103L23263M04185M62813N28422O13392Q31031J068105
13445G376610J171206J243084J298219J266282J102428R85418Q96735R11524J002587
13436A7254093J112129J146539J105011Q45938L92611r2919n54672p56198p73569
13427A9678963o25419m46024l64063l26402l49014l66647l42655j96738o3419
$$ plain form
13492 19304178 20075269 20566735 20658245 20289928 19447732 18373128 17231813 16208530 15380088
13483 15380088 14570528 13714873 12782567 11699675 10441090 9176001 7959315 6846811
13475 6846811 5896005 5112761 4500038 4014347 3675185 3332725 3033296 2875965 2711112
13466 2711112 2634808 2571996 2523806 2445026 2424530 2367417 2307071 2327168 2431649 2528370 2614919
13455 2614919 2712943 2876296 3145399 3468662 3872847 4335660 4864082 5477474 6308505 7376610
13445 7376610 8547816 9790900 11089119 12355401 13457829 14443247 15339982 16251506 17254093
13436 17254093 18366222 19512761 20617772 21463710 21856321 21763402 21208730 20452532 19678963
13427 19678963 19053544 18607520 18243457 17917055 17568041 17201394 16858739 16662001 16598582
13418A6598582J74867L01028L85350L65504L82158M14453N30236O77842Q10840
13409B0640860P79410N80827J71137l26808q12316j064860j156024j070519r27152
13400A6814555r72526r89039j049188j156684j338473j419956j352019j240600
13392G296070j068025q73877p76565n93248m37726l80420l82613k33543k09232
13383B340821j86964k14110j79654j53029j38694q2499p8659q1189j08881q7956
13373A029186j03972m7617n2280j7708p2477l2487m2060l9268R996n510L9885
13362F65688R345o4266l9788j6657l0929J9378J1258k6188k8355k0103K9399l8462
13350D70320o0173l8729j1191K1280L1631P122m587M3671k1597m4388l5776m7249
$$ plain form
13418 16598582 16773449 17074477 17459827 17825331 18207489 18621942 19152178 19830020 20640860
13409 20640860 21420270 22001097 22172234 21845426 21033110 19968250 18812226 17741707 16814555
13400 16814555 15842029 14852990 13803802 12647118 11308645 9888689 8536670 7296070
13392 7296070 6228045 5354168 4577603 3984355 3546629 3166209 2783596 2550053 2340821
13383 2340821 2153857 1939747 1760093 1607064 1468370 1385871 1307212 1226023 1117142 1029186
13373 1029186 925214 877597 825317 807609 735132 702645 660585 621317 631313 625803 665688
13362 665688 675033 610767 570979 554322 523393 542771 554029 527841 499486 479383 508782 470320
13350 470320 410147 371418 360227 381507 413138 420260 415673 459344 437747 393359 357583 310334
13338C10334o1908K2815N0334J7635m1030p1033k8261J2273L4472P865J7278k2322
13326B48452j3798K502l9941L2890K2193j6343m3035J737J1844k1970k1271j5736
13314A47524O8393n302o279J8521j2031l5512K6566j105K4098N2813j686K0453
13302B96453j3453l3902l8802l2453m1117J8156N753n4485N4345L9818p838j6939
13290A75536n7797m5093L4559L0924J6990L1744M0146K4149j5083m9719r945K6655
13278B03066N344J2053m4260n3766J7166M6052l1825k7428K2652N0350k5382o9859
13266A04163m5933K5698N5755N8961K8402O905l3059r988l0100l54K0612j7157
13254A63905J3224o0622j9747M3168k5965r354L6941K5713j4935k6131J500j5469
$$ plain form
13338 310334 248426 271241 321575 339210 298180 227147 198886 211159 245631 253496 270774 248452
13326 248452 234654 237156 197215 230105 252298 235955 192920 194657 206501 184531 163260 147524
13314 147524 215917 210615 204336 222857 210826 175314 201880 200775 224873 277686 276000 296453
13302 296453 283000 249098 210296 177843 136726 154882 160635 106150 160495 200313 192475 175536
13290 175536 117739 72646 107205 138129 155119 186863 227009 251158 236075 186356 176411 203066
13278 203066 208410 220463 176203 122437 139603 185655 153830 126402 149054 199404 174022 104163
13266 104163 58230 83928 139683 198644 227046 233951 200892 190904 160804 160450 181062 163905
13254 163905 177129 116507 96760 139928 113963 104609 141550 167263 152328 126197 127697 112228
13242A12228R118J368j5661L6016J3555O9584j807n4132J1349p1967l1754K6537
13230A04434K9844J5385j9308l0087K3235J1349j0201l7338k9953R421N3493J8153
13218A38427j3914j9424O6518j7885J0517k211m4254r204J8382k2019L5135M851
13206A44919j6986j0487N8635k551P196r054k6276k5064m3791r387N3785O244
13194A27183J1277K6223j2781j1561k2756l8740l141L0717L4059M4682L4876n886
13182B14152L0787k9062m4489K8533K0408l1895m0001j064q197l8278O9830O0927
13170B31651k5170o2535j3984L6541M1726m1943l4777L8646M0766k7431m8445
13159A35045k8116K5098N5145l6459o7900L653L1874r872K2443N8433K5409k0200
$$ plain form
13242 112228 121346 122714 107053 143069 156624 226208 224401 170269 181618 109651 77897 104434
13230 104434 134278 149663 130355 100268 123503 134852 124651 87313 57360 66781 120274 138427
13218 138427 124513 105089 171607 153722 164239 162028 117774 108570 126952 104933 140068 144919
13206 144919 127933 117446 176081 173530 180726 171672 145396 120332 76541 67154 120939 127183
13194 127183 138460 164683 151902 140341 117585 78845 75704 106421 140480 185162 220038 214152
13182 214152 244939 215877 171388 199921 220329 188434 148433 147369 139172 100894 170724 231651
13170 231651 206481 143946 129962 166503 208229 166286 131509 170155 210921 183490 135045
13159 135045 106929 132027 187172 150713 82813 86466 118340 108468 130911 189344 214753 194553
13147A94553l1793J7533k2504l1596O669N3276L709O769J09l211K5593J1152J1012
13134B41271N501M053l5219j4825L8206J2014P917Q807N816p774K2721J943j2484
13121B77947r083J9212j8693k4488O2495N4765K2571J4534j9877o1867n649k0848
13109B91019J7616M5559j2647K6109k125K166K2723O0636N0110K5286j3361L228
13097E16319O6233M5680N339N1000J00106O3822l4892k2975L204M4009P2992O1839
13085I72676N3224Q1222P9066J7451Q0433L8864N2285J06123J38209J38901J43157
13074A901611K39711K61133K59840K85233L19976M20778M19354M48010N09838
13065E065484M68597M79501N08989M35201M41988M37032M60029M23451L43836
$$ plain form
13147 194553 162760 180293 157789 126193 132862 186138 189847 196616 196725 193514 219107 230259 241271
13134 241271 246772 250825 215606 200781 238987 251001 258918 267725 273541 265767 288488 290431 277947
13121 277947 268864 288076 269383 244895 307390 362155 384726 399260 379383 317516 311867 291019
13109 291019 308635 354194 341547 367656 365531 367697 390420 451056 501166 526452 513091 516319
13097 516319 582552 628232 633571 684571 784677 848499 813607 790632 793836 837845 910837 972676
13085 972676 1025900 1107122 1186188 1203639 1284072 1322936 1375221 1481344 1619553 1758454 1901611
13074 1901611 2141322 2402455 2662295 2947528 3267504 3688282 4107636 4555646 5065484
13065 5065484 5534081 6013582 6522571 6957772 7399760 7836792 8296821 8720272 9064108
13056I064108K59294K22780J88024J42267J01610J63139K06540J73321J73219
13047A0694302K74640L51419M20639M77530O34127P39099P41614P86383P65195
13038A5884948P02592O93601N67552N26836M65142L23533J64598n7410k51266
13029A9020126m44976n76929o84254p06257o99739p64323p46994q04680p91763
13020A2800211q05130p06735n41714l74181k08761p5976K5405O9720N4239J67374
13010A0404452J48901O6312J19295J22479P3534p7553j55020j94006l07829m06198
13000I794367m45267l83570l89947m38147m57262m78477m62623l86885l69721
12991E982468l32028j60335j0877Q5417K47530K72972K79802M04877N09804M71540
$$ plain form
13056 9064108 9323402 9546182 9734206 9876473 9978083 10141222 10347762 10521083 10694302
13047 10694302 10968942 11320361 11741000 12218530 12852657 13591756 14333370 15119753 15884948
13038 15884948 16587540 17281141 17848693 18375529 18840671 19164204 19328802 19271392 19020126
13029 19020126 18575150 17998221 17313967 16607710 15907971 15143648 14396654 13591974 12800211
13020 12800211 11995081 11288346 10746632 10372451 10163690 10087714 10113119 10182839 10237078 10404452
13010 10404452 10553353 10619665 10738960 10861439 10934973 10857420 10702400 10508394 10200565 9794367
13000 9794367 9349100 8965530 8575583 8137436 7680174 7201697 6739074 6352189 5982468
12991 5982468 5650440 5490105 5479228 5564645 5812175 6085147 6364949 6769826 7279630 7751170
12981G751170M48041M13007L36010L47998L73113L08287L04084K97050K53381
12972A0832141J66926J49446Q5686Q7500K9793J11637J61717K77493L36375L92649
12962A2631363N95633O58647P36371Q50953R30132R45881R17497P61601P05584
12953A9733662O48590N58729M83815L29410J48646j85083m52158o29025p32731
12944A9903855q18791q29547q29105r02927r15782r18215q88889q67303p13804
12935A2219492n34271l31437j83278j52429p2648j8336k4321M8307J00355O2758
12925A1114192L9654m2439j42359j92257k55942l91374m51420m85463m92759n46502
12915H153331n82547n19442n81630o00640o01588n53386n16072m71082l98285
$$ plain form
12981 7751170 8199211 8612218 8948228 9296226 9669339 9977626 10281710 10578760 10832141
12972 10832141 10999067 11148513 11234199 11321699 11351492 11463129 11624846 11902339 12238714 12631363
12962 12631363 13226996 13885643 14622014 15472967 16403099 17348980 18266477 19028078 19733662
12953 19733662 20382252 20940981 21424796 21754206 21902852 21717769 21265611 20636586 19903855
12944 19903855 19085064 18255517 17426412 16523485 15607703 14689488 13800599 12933296 12219492
12935 12219492 11685221 11353784 11170506 11018077 10945429 10927093 10902772 10951079 11051434 11114192
12925 11114192 11153846 11111407 10969048 10776791 10520849 10129475 9678055 9192592 8699833 8153331
12915 8153331 7570784 7051342 6469712 5869072 5267484 4714098 4198026 3726944 3328659
12906C328659l87982l08294j99081k32322k03818j14827j49789j81248j34698
12897A416600j42428j04804o7512l2691o1208m8175p9610k0656j213k3829k6307
12886H08167n5537p6071p8699m4250j7733J2283o847k6371L0445m1037o5100o239
12874D33011m5065k4500K1224M1201J2760n3741q092M2517q334n4138L338n4821
12862C05360k6526J3370N060j7699K0154K5362M0391K1005n3783j1057k5637Q053
12850C04053Pn5740o29o427p609J2931K4448k5773O593L0685J8423k1840q4089
12837A95033j4353j906J5924P0598R8816l6918l5137o317J2581m1725l2285o8199
12825A56112k1977j5360K8584M0149M8818K9552m601m4585J7486J431J0112k437
$$ plain form
12906 3328659 2940677 2632383 2433302 2200980 1997162 1882335 1732546 1551298 1416600
12897 1416600 1274172 1169368 1101856 1069165 1007957 959782 880172 859516 858303 834474 808167
12886 808167 752630 676559 597860 553610 535877 548160 541313 514942 545387 504350 439250 433011
12874 433011 387946 363446 384670 425871 438631 384890 376798 419315 410981 356843 360181 305360
12862 305360 278834 292204 297264 279565 299719 325081 365472 386477 332694 321637 296000 304053
12850 304053 304060 248320 247691 241264 233655 246586 271034 245261 251854 282539 300962 279122 195033
12837 195033 180680 178774 194698 265296 364112 327194 292057 285740 298321 256596 224311 156112
12825 156112 134135 118775 147359 187508 236326 265878 261277 216692 234178 235609 245721 243284
12813B43284k7052r1225p7261j6903J8419N5335r05k1356K2831N8853j7723n6870
12801H9427K1781k0983J1564M0820K3077r987O093k2340j528K2619K2791o524
12789A76810l1844k7572k911J0048j7819k9947R149J1903Q306p351k805k6289
12777F9678j5800j11N7488L0903J7911p49m669P3748m2865o4302K5183j7931l002
12764A25482n082K6634j946l8990P956L0197r197n1690M1279K9609L18l353K1714
12751A72931M345l3865l2841L9811J4707k0055m7417n996L6548O06K6148k9805
12739A25117m9976n7558k7741M3766J2367j3603Q186J4353N622L0858N159l320
12727I3230m9975p700k6004k156J1530K0752N1068j745j4025j5202j7671M425
$$ plain form
12813 243284 216232 125007 47746 30843 49262 104597 103692 82336 105167 164020 146297 89427
12801 89427 111208 90225 101789 142609 165686 155699 161792 139452 137924 160543 183334 176810
12789 176810 144966 117394 114483 124531 106712 76765 85914 97817 106123 98772 95967 69678
12777 69678 53878 53767 111255 142158 160069 159320 154651 228399 185534 121232 146415 128484 125482
12764 125482 120400 147034 145088 106098 114054 144251 135054 83364 124643 154252 154570 151217 172931
12751 172931 177276 143411 110570 150381 165088 145033 97616 91620 128168 128774 154922 125117
12739 125117 75141 17583 -10158 33608 45975 32372 40558 54911 60533 91391 96550 93230
12727 93230 43255 35555 9551 7395 18925 39677 90745 89000 74975 59773 42102 46527
12715D6527J2107J1721K3176M1806J2198M3086N359j5941l6272m2180j7905j4429
12703F9253m7730L775Q1270M1385J7750K0095l9980o1993J0746j5043k2018j1525
12691D5985j0029L5634R134K7921K8424n0102o0090k2061k3480N4335M7174M3059
12679A25904k6620J8457k7530p4389o131m283K1312J1324n228l0736k8288L6221
12667A0013Q9969L2372q417k1171m5610m3026L5278L9448J5549K3252k2866J8965
12655A23756j631M9936q743k9025l2305k5154l0339m61K2469O839K3675q862p3414
12642A6741j5410L02j739J2345K8665K8567o841k0204k5125K2298j315J4976N7644
12629A10904j2868l5151k164M1400L3543J1312m1231j0039O4210j0234n4885j5310
$$ plain form
12715 46527 58634 70355 93531 135337 147535 190621 195980 180039 143767 101587 83682 69253
12703 69253 21523 25298 106568 147953 165703 185798 145818 83825 94571 79528 57510 45985
12691 45985 35956 71590 80724 108645 137069 86967 26877 4816 -18664 35671 82845 125904
12679 125904 99284 117741 90211 15822 9691 5408 26720 38044 32816 2080 -26208 10013
12667 10013 99982 132354 123937 102766 57156 14130 49408 88856 104405 127657 104791 123756
12655 123756 122125 172061 163318 134293 101988 76834 46495 46034 68503 75342 99017 90155 16741
12642 16741 1331 1633 -106 12239 40904 69471 62630 42426 17301 39599 38284 53260 110904
12629 110904 98036 62885 60721 102121 135664 146976 105745 95706 159916 149682 94797 79487
12617G9487P539M6727L2944k584K559k5772m1684j7740j2488O0715J4889l8339
12605A06253Q367J3588o782k4608K514K0336O713M195J3913Q019O004r871k7784
12592A20857l7615n668k8348O0147M5778j4304K7929L7424N387j304j2922k8627
12580A68734j2252k8581o945q139n912m301k2339O943k7294M751K0246K5921L0953
12567A41785J3499k4670k3582L9153K2405K3770K4082k0111k9555J3504j8001
12556A62279r2937m0959K6854Q5139P913o962j5438o0495o2156M410P2903L8476
12544A19027l3140l6861M090j0477K3142l7722K2133L1900m322j0483L6910L1102
12532A35299j7854m5645j735J3251J8010N1580R436J206Q584M93K6899J5109r214
$$ plain form
12617 79487 87026 133753 166697 164113 166672 140900 99216 81476 68988 129703 144592 106253
12605 106253 114620 128208 121426 96818 99332 119668 126381 130576 144489 152508 158512 148641 120857
12592 120857 83242 77574 49226 109373 155151 140847 168776 206200 211587 210283 197361 168734
12580 168734 156482 127901 120956 112817 106905 102604 80265 87208 59914 64665 84911 110832 141785
12567 141785 155284 130614 107032 146185 168590 192360 216442 196331 166776 180280 162279
12556 162279 69342 28383 55237 140376 148289 141327 125889 65394 3238 7648 80551 119027
12544 119027 85887 49026 53116 42639 65781 28059 50192 82092 77770 67287 104197 135299
12532 135299 117445 71800 70065 83316 101326 152906 162342 163548 172132 172625 199524 214633 205419
12519B05419j8159J3796o33K416j5334j3792j564K0778o882k7774p306j8336M2736
12506A75365K4379l5360l6505k4364J6679j5160M5655J9120k2966j7708K2804
12495A51939r230j4586m1770M8154N7783k1950n1319p4968L2683O3570M5757m9604
12483A36459k4537M285N2843L5721k5605L727J9095j8572n807m4937k1621K217
12471A13268j4753O540k3098j8413M9844m5045O714m493N562N2958J3375L9136
12459A81595o433k6048l6004n1338l0732L3511K0206L8032L3529J1829p4858K303
12447I5592K8229l0599k5755J023j3629M4286j3923l0856J8658M2098k1065j8215
12435G5844k621M8267N4358j5188l3818l9336r8414k9910O1807O3169j5265k0298
$$ plain form
12519 205419 187260 201056 200423 202839 187505 173713 172149 192927 186045 158271 150965 132629 175365
12506 175365 199744 164384 127879 103515 120194 105034 150689 169809 146843 129135 151939
12495 151939 142709 128123 86353 134507 192290 170340 119021 44053 76736 140306 186063 136459
12483 136459 111922 116207 169050 204771 179166 182893 201988 183416 177609 132672 111051 113268
12471 113268 98515 105055 81957 63544 113388 68343 75057 70564 76126 129084 142459 181595
12459 181595 175162 149114 113110 61772 31040 64551 84757 122789 156318 168147 93289 95592
12447 95592 123821 93222 67467 68490 54861 99147 85224 54368 73026 115124 94059 75844
12435 75844 73223 121490 175848 160660 126842 87506 -10908 -40818 20989 84158 68893 48595
12423D8595m9845J9250N3681N0436J219m6155O530K3110j7775Q589P3760O45l8833
12410A33207q689Q422J2187P11k135J6745m6250l9227L5994K7891j1041J9687
12398A47502K3114J8263K338k1021k6195k4979L1914m414K5188P080l1485K342
12386A49647L9167l1908k5462n964m5879J1027M864L8241n1336k4334K4032k932
12374G9163L0952J0475K2906K179n1220o0607M1504M0965k5139O55j6693m7284
12362B7856q6369L1201N0230L3557J9324j8018L8069l1007J1067J5119k0413n096
12350F5520O0503J7103p889J4374L109l4927l18P1282N4728o330r0935J5588m3047
12337A18761M7565j4563m6136J82N4177j944J4405J3378l1422l3784Q409K1662
$$ plain form
12423 48595 -1250 18000 71681 122117 123336 77181 83711 106821 89046 97635 171395 172040 133207
12410 133207 124518 132940 145127 145838 143703 160448 114198 74971 110965 138856 127815 147502
12398 147502 170616 188879 191217 170196 144001 119022 150936 146522 171710 178790 147305 149647
12386 149647 188814 156906 131444 125480 79601 90628 95492 133733 82397 58063 82095 79163
12374 79163 110115 120590 143496 145675 94455 33848 75352 116317 91178 91833 75140 27856
12362 27856 -58513 -27312 22918 56475 75799 57781 95850 64843 75910 91029 70616 65520
12350 65520 126023 143126 135237 149611 152720 117793 117475 188757 243485 237155 146220 161808 118761
12337 118761 166326 151763 105627 105809 159986 158042 172447 185825 154403 120619 129028 150690
12325A50690j8932k5034K8946l4417l0154R682J7293P7485L7771j5337o8684n5337
12313G3972K0810L852R281L2384j676L275M0864J0278J9940l0511q1587J7652
12301A18534N326k5653Q639L0630K5717K4516J2378k843o7455l946l4894j1928
12289G9021M1647M9079L595k9499k558J1623k7547N652K7016K465n2511k1807
12277H6176n315j0645J449J2735L6644P8668q622N28L6930j5580J6957K1944n417
12264B46452k5140J3820k078k6655k4590k391L3672N4174L2770k4627m7412q729
12252B19266j4033K648J4654K666k9687n1491n3787P154O6409N4850R096m6400
12240A81345n7507j9215P345K2149K4011K2098k3583j0967K2666Q295j5886p332
$$ plain form
12325 150690 131758 106724 135670 101253 71099 80781 98074 175559 213330 197993 129309 73972
12313 73972 94782 98634 107915 140299 138623 141898 182762 193040 212980 182469 100882 118534
12301 118534 123860 98207 106846 137476 163193 187709 200087 197244 129789 125843 90949 79021
12289 79021 120668 169747 173342 143843 141285 152908 125361 131013 158029 160494 107983 86176
12277 86176 80861 70216 71665 84400 121044 199712 191090 191618 228548 212968 229925 251869 246452
12264 246452 221312 235132 233054 206399 181809 179418 213090 267264 300034 275407 227995 219266
12252 219266 205233 207881 222535 225201 195514 144023 90236 97390 163799 218649 227745 181345
12240 181345 123838 104623 111968 134117 158128 180226 156643 145676 168342 176637 160751 153419
12228A53419N2450K3450n9046p43k4669K2478J2768P626N0454l211l6494r866
12216A88616m3895k6645K6309M6149L6645M6075l2078m2446j7672l355O4339K6168
12204B68210P99k8568j9042j3735Q33k622Q046N1003J5917l3785j2018K9521Q213
12191B72772j2599m777K207P391M4082N4732l4212j3075m889m8074k7169L1484
12179B67873n617K240p476r551N3652o870R625q111k3979Q404L9288j7847r429
12166B92202l305m4456k8280L4954K1349M2136N4542L3452k7021j2102J5003R064
12154C87538j8977l7293j074K6119K9524K0765q50j3674l3067l8302j6660K6622
12142C30671N1078j7462k0592l3142k312Q3367N0127k4797l7777m4670O3421M6699
$$ plain form
12228 153419 205869 229319 170273 169530 144861 167339 180107 187733 238187 234976 198482 188616
12216 188616 144721 118076 144385 190534 227179 273254 241176 198730 181058 177703 242042 268210
12204 268210 269009 240441 221399 207664 208497 205875 213921 264924 280841 247056 235038 264559 272772
12191 272772 260173 255396 257603 264994 309076 363808 329596 316521 311632 263558 236389 267873
12179 267873 262256 264496 257020 247469 301121 294251 303876 295765 271786 280190 319478 301631 292202
12166 292202 288897 244441 216161 251115 272464 314600 369142 402594 375573 363471 378474 387538
12154 387538 368561 331268 330194 356313 385837 406602 405752 392078 359011 320709 304049 330671
12142 330671 381749 364287 343695 310553 308241 391608 441735 416938 379161 334491 397912 444611
12130D44611O1477K7470n2268l8764l2441j6641J3533O285j3388M4934M7224l0056
12118D61976r923j1985j4620k030N7658K2047m460j9082j2059P560p616J617K1024
12105D90107n021L0760P948j4538M0264L202l9981J3665L279m510O8142k211J2568
12092F03674j121l5364N125j2205K1377N527L5629N1544J4791J5929O9111l738
12080G70279j33398m1217n6M9894J5156O2433K0899p946m8651K725J5110p341
12068F97887K3098M0540K1295k74N5631O3822M2805n5255j7694J2427m2113o424
12056H35745l5906j1247O0222M8986J05953K0105m6716K5401R287O1224J642O209
12044A080905l4952K3689l843j2937Q4114P1769J6687L5795K8799q316r267P095
$$ plain form
12130 444611 506088 533558 481290 442526 410085 393444 406977 413262 399874 444808 492032 461976
12118 461976 452053 440068 425448 423418 481076 503123 498663 479581 467522 475082 467466 469083 490107
12105 490107 485086 515846 523794 509256 549520 552722 512741 526406 529685 525175 593317 591106 603674
12092 603674 602553 567189 572314 560109 581486 587013 622642 674186 688977 704906 774017 770279
12080 770279 636881 595664 595608 645502 660658 723091 743990 736044 687393 690118 705228 697887
12068 697887 720985 761525 782820 782546 838177 901999 944804 889549 871855 884282 842169 835745
12056 835745 799839 788592 848814 897800 1003753 1023858 977142 1002543 1011830 1073054 1074696 1080905
12044 1080905 1045953 1069642 1065799 1052862 1136976 1208745 1225432 1261227 1290026 1281710 1272443 1279538
12032A279538M5813P4052K6976J5524L4815K5454n4364n202O8306K778k9988J7798
12020A501500J5800L9010O1638J3253K9018M4167K9817m475P1854N8992J3906
12009A874480J6772k547P8855M6138N9851L2619N1090L9672J9486P7614N2925
11998B346955M1957K3857N9340M4913J24286J37604J07743O2885M4599K0396K4570
11987C039105N9510J24479R8061J13003J27453O7520N9016R3607J13007R8607
11977C993368J51295J91896J45892J56883J11697J10768J74016K47709K63038
11968E546562J55673J34908J49464J97978K40570K06144K12798J81409K49669
11959G275175K49454K73536K69235L26505L56234L53682L95639L34425L84347
$$ plain form
12032 1279538 1325351 1399403 1426379 1441903 1476718 1502172 1447808 1442606 1510912 1513690 1483702 1501500
12020 1501500 1517300 1556310 1617948 1631201 1660219 1704386 1734203 1729728 1801582 1860574 1874480
12009 1874480 1891252 1888705 1967560 2013698 2073549 2106168 2157258 2196930 2216416 2294030 2346955
11998 2346955 2388912 2412769 2472109 2517022 2641308 2778912 2886655 2949540 2994139 3014535 3039105
11987 3039105 3098615 3223094 3321155 3434158 3561611 3629131 3688147 3781754 3894761 3993368
11977 3993368 4144663 4336559 4482451 4639334 4751031 4861799 5035815 5283524 5546562
11968 5546562 5702235 5837143 5986607 6184585 6425155 6631299 6844097 7025506 7275175
11959 7275175 7524629 7798165 8067400 8393905 8750139 9103821 9499460 9833885 10218232
11950A0218232M12264L90020M26586M57472M11533N22670N76525N46510N25209
11941A4487021N27130O35235O41443O11573O82915O85573O63064O41332O81496
11932B0256782O07601N79199O41957O42744O03465M84751M75851M21293L74227
11923B5087870L34674K43021J32412L0809L1522q8501j66050k54155l48171m21400
11913B4582031m83946n32693n76262n74255o26716o47125o43361o91004p03928
11904A9102741o51446o98148o83069o21038n98015o10519n74711n59956n17342
11895A3588497n25836n36630m70879m30140m15270m11740m00554l91539l22507
11886I683402l02165l37303l99738l22209l15163k91220k42456k56970k35251
$$ plain form
11950 10218232 10630496 11020516 11447102 11904574 12316107 12838777 13415302 13961812 14487021
11941 14487021 15014151 15649386 16290829 16902402 17585317 18270890 18933954 19575286 20256782
11932 20256782 20864383 21443582 22085539 22728283 23331748 23816499 24292350 24713643 25087870
11923 25087870 25422544 25665565 25797977 25828786 25860308 25771807 25605757 25351602 25003431 24582031
11913 24582031 24098085 23565392 22989130 22414875 21788159 21141034 20497673 19806669 19102741
11904 19102741 18451295 17753147 17070078 16449040 15851025 15240506 14665795 14105839 13588497
11895 13588497 13062661 12526031 12055152 11625012 11209742 10798002 10397448 10005909 9683402
11886 9683402 9381237 9043934 8644196 8321987 8006824 7715604 7473148 7216178 6980927
11877F980927k15578k09411j63813k16324k16935k47330k02708j83402j62233
11868E163193j73832j23190j36640j56497q3031j05922j55685j60348j36751j16355
11858C814942l8036j05779j22975m8316j01198r4707o5108p9680p0860n5341j01521
11847B931421j25959p0430q4954p5083o8792n1192p8821p6617o4640m8534k0228
11836B166171k4586N550n1516p9994o3561m4923j5286l6442k6395l628k3674l4443
11824A767273j3114k9385n2334m918l1196k3465k5880K0213k6218n8483l8213
11813A484280j7008j8119J8487m9644j8094J88j0202k0295n239m7531k2768k393
11801A291662m431k4483k1859l2121q6157k5319J8970l808k7936R810k1397k0228
$$ plain form
11877 6980927 6765349 6555938 6392125 6175801 5958866 5711536 5508828 5325426 5163193
11868 5163193 4989361 4866171 4729531 4573034 4490003 4384081 4228396 4068048 3931297 3814942
11858 3814942 3776906 3671127 3548152 3499836 3398638 3303931 3238823 3159143 3088283 3032942 2931421
11847 2931421 2805462 2735032 2650078 2574995 2506203 2455011 2376190 2299573 2234933 2186399 2166171
11836 2166171 2141585 2147135 2095619 2015625 1952064 1907141 1891855 1855413 1829018 1825390 1801716 1767273
11824 1767273 1754159 1724774 1672440 1667522 1636326 1612861 1586981 1607194 1580976 1522493 1484280
11813 1484280 1467272 1449153 1467640 1417996 1399902 1400090 1389888 1369593 1364354 1316823 1294055 1291662
11801 1291662 1287231 1262748 1240889 1208768 1122611 1097292 1116262 1112454 1084518 1094328 1072931 1052703
11789A052703K7997K0459M0167K7276k4371l0271o3604o916l3248j3544j2002
11778I84646k8458l1802j4697r880L9822K0926m5501o3217O588o739k0940k5691
11766H05057m806K8501N2455N8197n6426q7857j0873Jp6118k9994j8697J9017
11754F78457m559j2662R529l2387n8363K2420L9481L2366K2292Q135j6537j4253
11742F73919m4062o550O0899n3322l7023R89J8706J7423O659n0664l7049q439
11730E41486P628L8089m701l3637L971m0401o0839L2524M1130M213m9788J2544
11718D92219P5556K2183j9689j2873R394k2348L7714m422J9736R220m7300N044
11706E64434M7883J1953k9365N772J266j4857l9392j9255K4770k6153j6812L4737
$$ plain form
11789 1052703 1080700 1101159 1141326 1168602 1144231 1113960 1050356 1043440 1010192 996648 984646
11778 984646 956188 924386 909689 899809 939631 960557 915056 851839 858427 851688 830748 805057
11766 805057 800251 828752 881207 939404 882978 795121 784248 784249 708131 678137 659440 678457
11754 678457 673898 661236 670765 638378 580015 602435 641916 674282 696574 704709 688172 673919
11742 673919 629857 623307 684206 630884 593861 594850 613556 630979 637638 586974 549925 541486
11730 541486 549114 587203 582502 548865 552836 512435 451596 484120 525250 529463 479675 492219
11718 492219 567775 589958 570269 557396 566790 544442 582156 577734 597470 606690 559390 564434
11706 564434 612317 624270 594905 600677 601943 587086 547694 528439 553209 527056 510244 544981
11694E44981m56l2851J2686J0868K4826r02n6292J804R519m4248j6493Q5214N4184
11681E92840p5335j12760p4683K6086O7585O9051L4247k2544m2073J8569k157
11670D78826r695J6567J0845R43o380m4298p522K2300Q1120m9204L4221P4752
11658F02475k0632k5550K3714j9943K923J5835J684J3572j1712J6879N915j3964
11646E91196l817l7533K1330L8749K3934M3078j3109j1024l5238k1742N8446R4439
11634G48709L87n952L4115L5880N9236J8113J9295J6724N1626n353j3362Q1291
11622A040709O2760M9648O3261R8554J79648J15434K339L7046J13179K04787K10359
11611B177724J97029K11279K65945M10734M44060M63038O79277Q48425J016137
$$ plain form
11694 544981 544525 511674 524360 535228 560054 559152 502860 504664 514183 469935 453442 538656 592840
11681 592840 517505 404745 330062 356148 423733 492784 527031 504487 462414 480983 478826
11670 478826 469131 485698 496543 497486 491106 446808 439286 461586 542706 493502 527723 602475
11658 602475 581843 556293 580007 560064 562987 578822 580506 594078 582366 599245 605160 591196
11646 591196 587379 549846 571176 609925 633859 676937 663828 652804 617566 595824 654270 748709
11634 748709 749096 743144 777259 813139 872375 890488 909783 926507 978133 972780 959418 1040709
11622 1040709 1103469 1153117 1216378 1314932 1494580 1610014 1612353 1649399 1762578 1967365 2177724
11611 2177724 2374753 2586032 2851977 3262711 3706771 4169809 4849086 5697511 6713648
11602F713648J288180J677980K319262L074383L990176M810063N272697M850608
11594C3996997K925383j24155l108687m970539n327975m724857l777362k839325
11586A2049480k087682j580980j181626r70472p95712o43535n60880m75971k99646
11577C452976k53301k14222j43256q1977j32916j66602j13874k3044J7704J4306
11567B355794l5359n4251q044K7879Q6135P6093J2200N1424R4083Q6771Q9865
11556B782590Q3194J34114K62188J51803K10114K30487K33294L57303M52882N24592
11546E422561N52217O09147P12953Q77449J099291J378289J719229K171176K748342
11537A7290654L497249M439191N520674O375012O764252N952558L617468J25642
$$ plain form
11602 6713648 8001828 9679808 11999070 15073453 19063629 23873692 29146389 33996997
11594 33996997 36922380 36798225 33689538 28718999 23391024 18666167 14888805 12049480
11586 12049480 9961798 8380818 7199192 6228720 5433008 4789473 4228593 3752622 3452976
11577 3452976 3199675 2985453 2842197 2760220 2627304 2460702 2346828 2323784 2341488 2355794
11567 2355794 2320435 2266184 2258140 2286019 2372154 2448247 2460447 2511871 2605954 2692725 2782590
11556 2782590 2865784 2999898 3262086 3413889 3624003 3854490 4087784 4445087 4897969 5422561
11546 5422561 5974778 6583925 7296878 8174327 9273618 10651907 12371136 14542312 17290654
11537 17290654 20787903 25227094 30747768 37122780 43887032 49839590 53457058 53582700
11529E3582700l254606n249061n725729n191584m237520l129338k165815j380342
11521B3248705o83779j00791N29637J171402J841575K660929L585030M393441
11513C6646149M774917M325803K515678k87627l254239n201439n844403n500152
11505B8174687m654809l742099k970070k345637j912229j588545j225367j021235
11497H714696q64004o84926n80094n15413m24399k94212k39148k30049j48257
11488D734194p6403q3559p1994o2128l9755J9751Q5355N4749J44783J71850K53024
11477E129867K85117L01188L77008M98010N85115P03460Q66006J100803J381362
11468A1227936J628843J870973K021804J944792J725841J237740N41836p1584
$$ plain form
11529 53582700 50328094 45079033 39353304 34161720 29924200 26794862 24629047 23248705
11521 23248705 22564926 22464135 22993772 24165174 26006749 28667678 32252708 36646149
11513 36646149 41421066 45746869 48262547 47974920 44720681 39519242 33674839 28174687
11505 28174687 23519878 19777779 16807709 14462072 12549843 10961298 9735931 8714696
11497 8714696 7850692 7165766 6585672 6070259 5645860 5351648 5112500 4882451 4734194
11488 4734194 4657791 4574232 4502238 4440110 4400355 4420106 4505461 4560210 4704993 4876843 5129867
11477 5129867 5414984 5716172 6093180 6591190 7176305 7879765 8745771 9846574 11227936
11468 11227936 12856779 14727752 16749556 18694348 20420189 21657929 22199765 22128181
11460B2128181m79667n05899k04280K77431R00324J661992K671333L889108N187632
11451C5526155O445847P246699P063038N163698J907617j705997m383178n643467
11443E1620412n684616n213569m670707m134996l605155l046875k539672k074377
11435B0650445j613785j158350p97416n27591l03146k02260j17408k48698n43302
11426A5138489q07122r43296j063016r96885j006603r66539r14895r06181p65217
11417F768735o43716n78810m56080l77973l22861l19503k24570j93023j17722
11408C534477j65758j13679j04849q6911q6610m1867K0797K6734L138J4034L4989
11397C034495L0885J09372J59878K01465K56895K59375L41271N03381O14112P89366
$$ plain form
11460 22128181 21648514 21142615 20938335 21215766 22116090 23778082 26449415 30338523 35526155
11451 35526155 41972002 49218701 56281739 61445437 63353054 61647057 57263879 51620412
11443 51620412 45935796 40722227 36051520 31916524 28311369 25264494 22724822 20650445
11435 20650445 19036660 17878310 17080894 16553303 16250157 16047897 15930489 15681791 15138489
11426 15138489 14331367 13388071 12325055 11328170 10321567 9355028 8440133 7533952 6768735
11417 6768735 6125019 5546209 5090129 4712156 4389295 4069792 3845222 3652199 3534477
11408 3534477 3368719 3255040 3150191 3063280 2976670 2934803 2955600 2982334 2985472 2999506 3034495
11397 3034495 3065380 3174752 3334630 3536095 3792990 4052365 4393636 4897017 5511129 6300495
11387F300495R47944J137273J437705J703718J829823J748110J341298N89079
11379A7035445j83965r36042j529532j643943j497765j172693q16059m96665k40618
11370H518163l2166J57806L76062N84549P30655Q62735Q36425O66267M58756O6176
11360A3225428k86971o42949r61347j129308j193755j166716j117543r74500p95352
11351D956987o53552n43897m57790l94383l05259k81998j68266j67349j71625
11342A812868j92119j81919j44805l0478n9319r2386n110n0845n3951r5248K774
11331I09462m6499q7168k7000j3383J9724P234j0449j3277o0167k8163P181K4947
11319F82442L0260l5798o6925o1574m9525K210k2193n053k6858K1812M0386J8772
$$ plain form
11387 6300495 7248439 8385712 9823417 11527135 13356958 15105068 16446366 17035445
11379 17035445 16851480 15915438 14385906 12741963 11244198 10071505 9255446 8758781 8518163
11370 8518163 8485997 8643803 9019865 9604414 10335069 11197804 12034229 12700496 13159252 13225428
11360 13225428 12938457 12295508 11334161 10204853 9011098 7844382 6726839 5752339 4956987
11351 4956987 4303435 3759538 3301748 2907365 2602106 2320108 2151842 1984493 1812868
11342 1812868 1620749 1438830 1294025 1263547 1204228 1111842 1106732 1055887 1001936 906688 909462
11331 909462 862963 775795 748795 735412 755136 762370 751921 738644 678477 650314 657495 682442
11319 682442 712702 676904 609979 548405 498880 501090 478897 473844 446986 468798 509184 527956
11307E27956n3421l8492M763L7326k84L913j7191m5191q103J7447j178m3301j9761
11294C64483k4612p5069k9153P543M7725k4712m163o8305m0846M3807P2151K7159
11282B96008N234M5782m3338m0733q141K391j3308l0755l2861j9005k4044P616
11270A44846N6564N0782M5237j1986j7798m5894L3810M5632J6492m0922K96J1300
11258B88359J7735K5398j4899r364L1669n6087m2579p770M581j3242O951j3103
11246B17649l184J4400M6744K516l8198n3280j6146O250O8210k5083j1820m567
11234B03491K1859M2928m7959l3046l9541M567m1527l6316Q233O8120J4222l6663
11222A28368J6798L2587j8343l7396r933j9394N5560l8763p4697N2629N2072J709
$$ plain form
11307 527956 474535 436043 440806 478132 477848 481761 464570 419379 411276 428723 427545 384244 364483
11294 364483 339871 264802 235649 243192 290917 266205 262042 193737 152891 196698 268849 296008
11282 296008 301242 347024 303686 262953 254812 257203 243895 213140 180279 161274 137230 144846
11270 144846 201410 252192 297429 285443 267645 221751 255561 301193 317685 276763 277059 288359
11258 288359 306094 331492 316593 307229 338898 282811 240232 232462 237043 223801 230752 217649
11246 217649 214465 228865 275609 278125 239927 186647 170501 176751 244961 219878 208058 203491
11234 203491 225350 268278 220319 187273 147732 152299 110772 74456 82689 150809 165031 128368
11222 128368 145166 177753 159410 122014 112081 92687 148247 109484 34787 87416 139488 141197
11210A41197K0055J5919O59j76K9954k7411o7198k280K0839k992k798J9065r921
11197A34912k7619L4575L1673l8599m2089L1820J4364J3951l3869j5834p345P428
11185A03368O9209n218O655K9311j0399p844k3195J046M502K6348n443n1119R607
11172A46828M4085K9280j9789j3614J6068r790K4318K6579N832R53j0496n8290
11160A81964j5708J2720J7420P3366J4978J1877j378m9544L3850j2406k0537m4318
11148B02284p0122l454k6777K1431J5785K9233M0593j7685k31m0810n8739l6167
11136E5341j3053M5245L1825L1642l1531k7078K4086K2348q748K4912J6288J6062
11124A87339N6524m2427m7994o898k932L0946J3870k1295L299M2081k8452l604
$$ plain form
11210 141197 161252 177171 177830 177654 207608 180197 112999 110719 131558 128566 125768 144833 134912
11197 134912 107293 141868 173541 134942 92853 124673 139037 152988 119119 103285 95940 103368
11185 103368 172577 167359 174014 203325 192926 185082 161887 162933 167435 193783 188340 137221 146828
11172 146828 190913 220193 200404 186790 202858 193068 217386 243965 249797 250750 240254 181964
11160 181964 166256 178976 196396 269762 284740 296617 295239 245695 279545 267139 246602 202284
11148 202284 132162 128708 101931 123362 139147 168380 208973 191288 191057 150247 91508 55341
11136 55341 42288 87533 119358 151000 119469 92391 116477 138825 130077 154989 171277 187339
11124 187339 243863 201436 153442 146544 143612 174558 188428 167133 170432 212513 184061 180457
11112A80457L8672k6242l0249K7903L5642k6525l5153J1930j4313n3973P1375
11101A79524K6699N590o4L5991M7052Q397k0946k8019O777Q2342O0787j1899r0176
11088C02055o823k0141k5970m2162j4548J7781m7457j0063K8997M4576N035k3310
11076B07970j068M0840L8321N8229M7607L062k7606o4566j9073k6691m6602J0661
11064B21084N2974O187k6843o3105l1964l609m508m3436m5894K2041L9036L4515
11052A56478J1746Q3033K7187L578N895O2915R35m3722L9283j1872j3605K0785
11040C42636l643J4649n28N6988J26853P7591J5099k4594l9494m1721J330n232
11028E19934j7501J7595J00260J05033Q4181K0194k9210n8586p4494l6555o8081
$$ plain form
11112 180457 219129 192887 162638 190541 226183 199658 164505 176435 162122 108149 179524
11101 179524 206223 211813 211749 247740 294792 303189 282243 254224 261001 343343 404130 392231 302055
11088 302055 295232 275091 249121 206959 192411 210192 162735 152672 181669 226245 231280 207970
11076 207970 206902 247742 286063 344292 391899 394961 367355 302789 283716 257025 210423 221084
11064 221084 274058 280245 253402 190297 158333 154724 150216 106780 60886 82927 121963 156478
11052 156478 168224 251257 278444 282022 287917 350832 351767 308045 347328 335456 321851 342636
11040 342636 338993 353642 353114 410102 536955 614546 629645 605051 565557 523836 525166 519934
11028 519934 502433 520028 620288 725321 809502 829696 800486 741900 667406 630851 562770
11017E62770j4431L6156P3012L2023O6439K6333N5778m2706k6420k8149j16160
11006F24645q1701n0646m8199j0418J9361l6314J7663L8403n0810n4844k2560
10995C44580o7011k3594M4669n033j9629q3802k3350j7605j5747K5548O5333K288
10983B26647l3215l6890o534P6776L8302n887l2434j3538O105k4363M62J0284
10971B05715k4310K7777K9687r368j7254J9919j8587j1178m2224J2992J593K8907
10959B03669K2688P845R375L461p805l3234J2169L791l2232K089q91M8916M3147
10946B82988j134j6210m357k9261J9963K1187m601l9882n60l5074r380J7795J3423
10933B14897m6871j0030k263n105K1605p663o783l7098N0592O2611J0156M232
$$ plain form
11017 562770 548339 584495 657507 689530 755969 782302 838080 795374 768954 740805 624645
11006 624645 542944 492298 444099 433681 453042 416728 434391 472794 421984 367140 344580
10995 344580 277569 253975 298644 293611 273982 190180 166830 149225 133478 159026 224359 226647
10983 226647 193432 156542 150008 226784 265086 259199 226765 213227 219332 194969 195431 205715
10971 205715 181405 209182 238869 229501 212247 232166 213579 202401 160177 173169 174762 203669
10959 203669 226357 234202 243577 247038 239233 205999 218168 221959 189727 191816 190925 239841 282988
10946 282988 281854 265644 261287 232026 251989 273176 268575 228693 228133 193059 183679 201474 214897
10933 214897 168026 157996 155733 150628 172233 164570 157787 120689 171281 233892 244048 248280
10921B48280k6806K3670M6346o196o7268m4958j2196J9597m531k0109O077Q7841
10909B49747J8960r699j742L2950j1321o7239p3026j5185l7217L9116O647L3987
10897A65978O0820O1829j9486l100P0788K5405k4985k3501J9297l8769K360M5706
10885C42342J8634J9129j9335l3139m2965k182L772j8762k8514p3841J3563N1066
10873B29768l5987m8708o322r118J4371M6261L426k2593n880J5447L96J7442j691
10860A96812j1949j1227P5429P6061K5326k9831k9353n8660j9027J7260J8499
10849B49340K6089J3122L95l0550j1139K4570K659K5408j1237n7887k6898M397
10837B08269J4758J8362K5012m914J1737L1593l7918q7077K9360M2092l7261L9042
$$ plain form
10921 248280 221474 245144 291490 285294 218026 173068 160872 180469 175938 155829 161906 249747
10909 249747 268707 259008 257266 290216 278895 211656 138630 123445 86228 125344 131991 165978
10897 165978 226798 288627 269141 266041 336829 362234 337249 313748 333045 294276 296636 342342
10885 342342 360976 380105 360770 327631 284666 282484 286256 267494 238980 165139 178702 229768
10873 229768 193781 145073 138751 129633 144004 190265 193691 171098 165218 180665 181061 198503 196812
10860 196812 184863 173636 249065 325126 350452 320621 291268 232608 213581 230841 249340
10849 249340 275429 288551 288946 258396 247257 271827 274486 299894 288657 230770 203872 208269
10837 208269 223027 241389 266401 261487 273224 304817 266899 179822 209182 251274 214013 253055
10825B53055Q670j105P893k8392k3869j922j2404J2609k6543l1276L2925L0282
10813B19923j0524j9065l19k8225m635N5557k8540m5922L6179M4285N433q274
10801B15873K3804L1628j4639k1407j4907l7399p0394k6236R887l518K9775Q935
10789A31402K0056n391K806k640L2101N2304J2493l6201K8771n3652p892P9325
10777B53482j7084j791q275j6858j0761J5500p667j3924j6108K2695N4470M995
10765B58674M0769J1739m949m0908k302N558L5561M0236k0853k8888j1617j1125
10753B71895k3596J5830l902P965J5925j8248j1870r865J152n4614l2468K0533
10741A78737P5154J8359m671m2257l4639k3251P076L0236O0127k6886m0436j5386
$$ plain form
10825 253055 261725 260620 268513 240121 216252 214330 201926 214535 187992 156716 189641 219923
10813 219923 209399 190334 190015 161790 157155 212712 184172 138250 174429 218714 224147 215873
10801 215873 239677 271305 256666 235259 220352 182953 112559 86323 96210 92692 122467 131402
10789 131402 151458 146067 148873 146233 178334 230638 243131 206930 235701 182049 174157 253482
10777 253482 236398 234607 226332 209474 198713 214213 206546 192622 176514 199209 253679 258674
10765 258674 299443 311182 306233 265325 263023 268581 304142 344378 323525 294637 283020 271895
10753 271895 248299 264129 260227 268192 284117 265869 253999 244134 245286 190672 158204 178737
10741 178737 253891 272250 267579 225322 190683 167432 174508 204744 264871 237985 197549 182163
10729A82163L2364J305p594M5488l8695l0042J1321o7922Q0649Q7544K6286o445
10717C16422J7610K9533K152k2329j9270k906J5326R941n2315k1800k5003n9259
10705A88102K235Q9891P6087L5687p0707l993j5065L107j9542o8186j960O5034
10693B80690N3605J2829L8750L8343J8491q548J0718k3144o239m3561l6453K4486
10681C59967J9148M3534j2103M5783K6313K6664J5867K821J9725P5125l024o7341
10669E52479m7442O7293K9305N5048J5468N8716P2028M6792Q6362J24562J17642
10658A178253J16596K13578K66510K78444K85005K39637K22851J65595J01065
10649C067534m1639q1941j83768k12415k37690j94967j39313q1398l1093k765
$$ plain form
10729 182163 214527 215832 208238 253726 215031 184989 196310 128388 209037 296581 322867 316422
10717 316422 334032 363565 365717 343388 324118 321212 336538 346479 294164 272364 247361 188102
10705 188102 190337 280228 356315 392002 321295 317302 302237 305344 285802 217616 215656 280690
10693 280690 334295 347124 385874 424217 442708 434160 444878 421734 415495 371934 335481 359967
10681 359967 379115 422649 410546 456329 482642 509306 525173 527994 547719 622844 619820 552479
10669 552479 505037 572330 601635 656683 672151 730867 802895 849687 936049 1060611 1178253
10658 1178253 1294849 1508427 1774937 2053381 2338386 2578023 2800874 2966469 3067534
10649 3067534 3025895 2943954 2760186 2547771 2310081 2115114 1975801 1894403 1863310 1860545
10639A860545K9955P2215J24541J79713J83344K28888K28719K20222J75480K41933
10629C545555L36856L63100M64387P25332R72449J330590J829258K549427L410709
10620A5527663M470539N475106N985978N181927K682436l98523k231511k285681
10612C4407934j125483O90554K881006N422344Q322487J1075179J2210512R748296
10604H3632829K753168n106050q825493p949331m820432j168991K704176O769205
10596F7989081J0975070J4457153J5192443J0400586o13897j1788137j6165324
10589I0446975j4262677r921261n494332j446298K213835N549801P971972Q148475
10581H3206490M224610l329932j0268198j2286138j0255848o896840l847893j362276
$$ plain form
10639 1860545 1890500 1962715 2087256 2266969 2450313 2679201 2907920 3128142 3303622 3545555
10629 3545555 3882411 4245511 4709898 5435230 6407679 7738269 9567527 12116954 15527663
10620 15527663 19998202 25473308 31459286 36641213 39323649 38925126 36693615 34407934
10612 34407934 33282451 33973005 36854011 42276355 50598842 61674021 73884533 83632829
10604 83632829 86385997 81279947 72454454 64505123 59684691 58515700 61219876 67989081
10596 67989081 78964151 93421304 108613747 119014333 118400436 106612299 90446975
10589 90446975 76184298 66263037 60768705 59322407 61536242 67086043 75058015 83206490
10581 83206490 87431100 84101168 73832970 61546832 51290984 44394144 40546251 39183975
10573C9183975N40026J793356K307896J636288l98727l484243n983667o606256
10565B8988648n772020m529810l357836k357270j705631j212576q35327m76059
10557H742119k06609J6168J58723L28317N50747Q18691J115896J368972J447389
10548A4340413J237412P17616K777p02587j165171j388189j368142j162400j015419
10539I496310q69672p04927n52631m54880l43307k23416j81847j8976M3249J30195
10529F320098L00800M02356N83889O88625Q36563R57146Q95331O08308J81870
10520A1774986j53917l20928k63465o7592J82097M74792P55413J029247J296221
10511A4706854J281794J114553P35432O7817n47717j043091j325290j350639j261216
$$ plain form
10573 39183975 39724001 41517357 43825253 45461541 45062814 41578571 35594904 28988648
10565 28988648 23216628 18686818 15328982 12971712 11266081 10053505 9218178 8742119
10557 8742119 8535510 8551678 8710401 9038718 9589465 10408156 11524052 12893024 14340413
10548 14340413 15577825 16295441 16298218 15595631 14430460 13042271 11674129 10511729 9496310
10539 9496310 8626638 7921711 7369080 6914200 6570893 6347477 6165630 6146654 6189903 6320098
10529 6320098 6620898 7023254 7607143 8295768 9132331 10089477 10984808 11593116 11774986
10520 11774986 11621069 11300141 11036676 10969084 11151181 11625973 12381386 13410633 14706854
10511 14706854 15988648 17103201 17838633 17906450 17358733 16315642 14990352 13639713 12378497
10502A2378497j037535p99707n43871l55127k33294q3211J40424K52154M98055
10493A0216385P68076J038589J287687J669629K026660K410710K761031K729508
10485B4908275K326829J467763K56103j042093j989781k560513k704979k486245
10477A8175359k261007j805171j445994j159395q66989n98110l95367k39294m1662
10468I362370Q5701K28083M84441O74285Q09332R57275J064358J161010J122464
10459A5949319P74697J81243l70042q60000j043441j075711r09858p27845m18160
10450A1500202j04852P9851K12636J86202M4657k27977m52865p24766q72560r18239
10440H722289r35311o82826m92298l21632k03673j37385k4229J18531J54277J84255
$$ plain form
10502 12378497 11340962 10541255 9997384 9642257 9408963 9325752 9466176 9718330 10216385
10493 10216385 10984461 12023050 13310737 14980366 17007026 19417736 22178767 24908275
10485 24908275 27235104 28702867 28958970 27916877 25927096 23366583 20661604 18175359
10477 18175359 15914352 14109181 12663187 11503792 10636803 10038693 9643326 9404032 9362370
10468 9362370 9448071 9676154 10160595 10834880 11644212 12601487 13665845 14826855 15949319
10459 15949319 16724016 16905259 16535217 15675217 14631776 13556065 12646207 11918362 11500202
10450 11500202 11395350 11475201 11687837 11874039 11918696 11690719 11237854 10513088 9640528 8722289
10440 8722289 7786978 7104152 6611854 6290222 6086549 5949164 5924935 6043466 6197743 6381998
10430F381998L27737M26619O06780Q06258Q81448J040194J102537J041980R45501
10421A3561052O61266J92832l18819q18081j186472j387839j368602j213918r48141
10412G173278p29412n87807m45810k71663j94762j51087j0483M3392O4704P8184
10402D968534J67509K54551L70959L99320M42170L05529J74450O0250j28496l62123
10392F652653n50765o64338o85592o02428n07562l85842l58268l17640k39185
10383B341033j82129j75506j45693j61626j15633p8897q5023K995J7752q0228
10373A337045q2224p3984l5064k4252n9206o7824n734J7579m5963k4886m1618
10362H93869r806j668j2643l3122Q373m567L4778K7540k7495k0833R618l9409
$$ plain form
10430 6381998 6709735 7136354 7743134 8549392 9430840 10471034 11573571 12615551 13561052
10421 13561052 14222318 14415150 14096331 13278250 12091778 10703939 9335337 8121419 7173278
10412 7173278 6443866 5856059 5410249 5138586 4943824 4792737 4782254 4825646 4890350 4968534
10402 4968534 5136043 5390594 5761553 6160873 6603043 6908572 7083022 7143272 7014776 6652653
10392 6652653 6101888 5437550 4751958 4149530 3641968 3256126 2897858 2580218 2341033
10383 2341033 2158904 1983398 1837705 1676079 1560446 1481549 1396526 1399521 1417273 1337045
10373 1337045 1254821 1180837 1145773 1121521 1062315 994491 988757 1006336 960373 935487 893869
10362 893869 884063 882395 869752 836630 845003 840436 875214 902754 875259 854426 864044 824635
10350H24635k3741L2564J0635k6640N526K5745J2076L8000K9751N9431M6594R772
10338A044348M6247K2810K84K8454r110k7191j6876N334l905O387m97M4677O621
10325A147583K3127M8873L0212L6293K9874m2734l9088J6412J8787P8031Q9154
10314A436524K9200l647k8665J6842M464M6427O1802R4485K0322O3843L3423R6483
10302A871503J26680M2016M9836J06403J03339J45802J23203J13211J16100J71781
10292B969874J41272J17913K46927J65666J72709K47012K31258L33940L11616
10283D938187L31397L61028M19928M66194N85502O69280P59555Q50612R44372
10274A0326055J144458J292025J423765J567622J777526J862986K067303K441692
$$ plain form
10350 824635 800894 833458 844093 817453 822979 848724 860800 898800 928551 987982 1034576 1044348
10338 1044348 1090595 1113405 1113689 1142143 1133033 1105842 1088966 1094300 1090395 1096782 1096285 1140962 1147583
10325 1147583 1170710 1219583 1249795 1286088 1315962 1273228 1234140 1250552 1269339 1347370 1436524
10314 1436524 1465724 1462077 1433412 1450254 1454718 1501145 1562947 1657432 1677754 1741597 1775020 1871503
10302 1871503 1998183 2040199 2090035 2196438 2299777 2445579 2568782 2681993 2798093 2969874
10292 2969874 3111146 3229059 3475986 3641652 3814361 4061373 4292631 4626571 4938187
10283 4938187 5269584 5630612 6050540 6516734 7102236 7771516 8531071 9381683 10326055
10274 10326055 11470513 12762538 14186303 15753925 17531451 19394437 21461740 23903432
10266B3903432K944795L583466M508829N809245P684990J0434071J4457968K0415903
10258I3742699K8691871L8967668M9303118N5085374M9542314L8875741L5648760
10251C89857545K9143193J392304l2428530m2976380m0587006m6025914n4198069
10244B04177143m9810309l7734034k6699489j8763177j3487095r963741p493737
10237D0225561n720303m496743l522612k888160k454851k086612j747718j524918
10229A5783644j453406j327229j158406j062284r68677r62160q77306o93093n43171
10220F737912m84218l76967l56831l33144l19797k41848k31741j83936k09309
10211D000121k63068k75343j38767j22032p8558j56417j46620q8535p2315p4506
$$ plain form
10266 23903432 26848227 30431693 34940522 40749767 48434757 58868828 73326796 93742699
10258 93742699 122434570 161402238 210705356 265790730 315333044 354208785 389857545
10251 389857545 419000738 420393042 387964512 344988132 304401126 258375212 204177143
10244 204177143 154366834 116632800 89933311 71170134 57683039 47719298 40225561
10237 40225561 34505258 30008515 26485903 23597743 21142892 19056280 17308562 15783644
10229 15783644 14330238 13003009 11844603 10782319 9813642 8851482 7974176 7281083 6737912
10220 6737912 6253694 5876727 5519896 5186752 4866955 4625107 4393366 4209430 4000121
10211 4000121 3737053 3461710 3322943 3200911 3122353 2965936 2819316 2730781 2658466 2583960
10201B583960q1225j13139n8975k9021r419r7042p2278m1492o4211n8716l7485
10190A920957J0157o9168o9314j7150m6869p7766j16642k8300N2798J4376l1405
10179A541674l3735l0730m6777m9819j400l7602o6129q188L1607R5997P3406J8291
10167A486595M000r6099j03953m5470N675O171l1751L1100M2279J05207N7625
10156A461379J5076l2759j08760j34197j552j9708m0066p0285p382N7074j2932
10145A105888R921j694q4093n9933o1236j8823k7722J8313M6230k6435n0114n6577
10133G93725r454m375N6m0481k2790J9185r333L1239J8158L8276L5342p417l8118
10120H04013k0801k3519p3113l316o747m7024m0802l2321q69l7687o5137r562
$$ plain form
10201 2583960 2502735 2389596 2330621 2301600 2292181 2195139 2122861 2081369 2017158 1958442 1920957
10190 1920957 1931114 1861946 1792632 1775482 1728613 1650847 1534205 1505905 1558703 1573079 1541674
10179 1541674 1507939 1477209 1430432 1380613 1379213 1341611 1275482 1267294 1298901 1394898 1468304 1486595
10167 1486595 1490595 1394496 1290543 1245073 1250748 1256919 1225168 1256268 1298547 1403754 1461379
10156 1461379 1476455 1443696 1334936 1200739 1199187 1179479 1139413 1069128 1061746 1118820 1105888
10145 1105888 1115809 1114115 1030022 970089 908853 890030 862308 880621 926851 900416 850302 793725
10133 793725 784271 779896 779952 739471 716681 735866 726533 757772 775930 814206 849548 842131 804013
10120 804013 783212 759693 686580 683264 676517 629493 588691 556370 555501 517814 452677 443115
10108D43115M3010L0908K9912M5981Q984P521l3575k4741l7484o3674l0789j5753
10096D03415n3563j0172o990J0115N760O58m8493l3486M7354m3230m5263K517
10084B28622l2083J9894J11748K2773k6552M0435L667M0419m0093k4267M1945
10073C86508j8465k6111K1459m7115l8125m5290k4780J9643k0416l6319j315N3605
10061B23279K5615q972L6160L1958m6725m6794N2680J5206k6961J5240k477l2046
10049B36163l4898K0019N5541j666J6274K0649L6119q391p843k4909p5431j22347
10037A09280L247L9733k3285j2061M5875M3539M840q251K208L1833M960l0298
10025B11620l0737J4516J8684J0994l9387n980J0305M1585P130m3617j2674K7107
$$ plain form
10108 443115 486125 517033 546945 592926 601910 609431 575856 551115 513631 449957 419168 403415
10096 403415 349852 339680 332690 342805 348565 349223 300730 267244 314598 271368 226105 228622
10084 228622 196539 216433 328181 350954 324402 364837 368504 408923 368830 344563 386508
10073 386508 368043 341932 363391 316276 278151 232861 208081 227724 207308 170989 169674 223279
10061 223279 248894 239922 276082 308040 261315 214521 267201 282407 255446 270686 268209 236163
10049 236163 201265 221284 276825 275159 291433 312082 348201 339810 331967 307058 231627 109280
10037 109280 112527 152260 128975 116914 162789 206328 211168 202917 205125 236958 241918 211620
10025 211620 180883 195399 214083 225077 185690 179710 190015 231600 238730 195113 182439 209546
10013B09546M343J3390k4576p35Q672O263M366P3242n059j9940j8901K4835j3217
10000B62229O4525l286k0037M7181K9420j752p0456k2922L3945k2512j4033m2744
9988B39558K7669K0432o319M861o1310k241k5944k6492R52P3067P949L0451j8176
9975B64457n8655k8410j1567o438J0779J1383n02N470l0721L0852n3551K9840
9963A62937N1699L1468J4836k415p316r266o0606n4709J1227q261n1576j5689
9951F2329j7817J8079J8926J7472L960J4968P5446R776m8069j8271m825J0893
9939A42867l5807r755K4042O3525N5524K2066P4593P9139m8302n9830l2355l4992
9927B40715k5234K950P245Q611n452J3861Q637o173l9946k6022K1139l3483J6525
$$ plain form
10013 209546 213889 227279 202703 201968 210640 216903 221269 294511 289452 269512 250611 275446 262229
10000 262229 326754 323468 303431 350612 380032 378280 307824 284902 318847 296335 282302 239558
9988 239558 267227 287659 281340 286201 224891 222650 196706 170214 171166 244233 252182 282633 264457
9975 264457 205802 177392 165825 159387 170166 181549 181047 186517 155796 186648 133097 162937
9963 162937 214636 246104 260940 258525 251209 241943 181337 126628 137855 129594 78018 62329
9951 62329 44512 62591 81517 98989 102949 117917 193363 203139 155070 136799 131974 142867
9939 142867 107060 97305 121347 184872 240396 262462 337055 416194 367892 308062 275707 240715
9927 240715 215481 218431 225676 234287 228835 242696 251333 245160 205214 179192 200331 166848 183373
9914A83373M3437J075P5693O6041j4834k1530m3772m8091K3078n1930M565K205
9902B19310n9253l7569J653N9533M797J7494J03271L3285l852l9595P299l1261
9890B75112o024O0539J6246m7701k8664M5316L6837R442j1238J8497p833J6658
9878C77187P3828J8703k6958R839l1142k3378j806k0330L2575K5924J0436R223
9866D54101O7617O0779L5797k4673K1654M6945N0060N8315M9119M1730P8956J70117
9854A110517K06977J87338K37004L04325L34562L51026K97933L16225K62103J50830
9844C758840J1079m7635l989j00413j31179o8789o8212r4746p1809j1756k6920
9833C144471j6495j0536l7331l8660o3149k6934j1104m9722n7060j0869L2157
$$ plain form
9914 183373 226810 227885 303578 369619 354785 333255 289483 241392 264470 212540 217105 219310
9902 219310 160057 122488 124141 183674 188471 205965 309236 342521 338669 299074 306373 275112
9890 275112 269088 329627 345873 298172 269508 314824 351661 361103 349865 368362 360529 377187
9878 377187 451015 469718 442760 452599 421457 398079 396273 375943 408518 434442 444878 454101
9866 454101 521718 582497 618294 593621 615275 662220 712280 770595 819714 861444 940400 1110517
9854 1110517 1317494 1504832 1741836 2046161 2380723 2731749 3029682 3345907 3608010 3758840
9844 3758840 3769919 3722284 3718295 3617882 3486703 3417914 3349702 3254956 3183147 3171391 3144471
9833 3144471 3127976 3117440 3080109 3041449 2978300 2951366 2940262 2890540 2833480 2822611 2854768
9822B854768O4321L6017N2191P7341J59710J38384J87219J85852K59219K69746
9812D284768K78707L85333M62709M64555M60714M70577M29958M11175M21318M64606
9802H534420M51287M60627M68063M16837K82576K04064J80795J21524L1161k377
9792A1148977n4882j9287o4680j62701j91305j73074q8471o0428K9800J36819
9782A0500768J78747K85350L56337L75811M37510M92651M69796N28919L56855
9773A3982744K80426K05274J43362R4707q6439j88466j87117k99578l66081m03317
9763A3175515m82574n33004m74233m50770l93064l03877k63062j82242r0164L4353
9753A0036878J16976K33024K52871L25344L44669L40624K98790K72111J88969
$$ plain form
9822 2854768 2919089 2955106 3007297 3084638 3244348 3382732 3569951 3755803 4015022 4284768
9812 4284768 4563475 4948808 5411517 5876072 6336786 6807363 7237321 7648496 8069814 8534420
9802 8534420 8985707 9446334 9914397 10331234 10613810 10817874 10998669 11120193 11151354 11148977
9792 11148977 11094095 11074808 11010128 10847427 10656122 10483048 10394577 10334149 10363949 10500768
9782 10500768 10679515 10964865 11321202 11697013 12134523 12627174 13096970 13625889 13982744
9773 13982744 14263170 14468444 14611806 14706513 14620074 14431608 14244491 13944913 13578832 13175515
9763 13175515 12692941 12159937 11685704 11234934 10841870 10537993 10274931 10092689 10002525 10036878
9753 10036878 10153854 10386878 10639749 10965093 11309762 11650386 11949176 12221287 12410256
9744A2410256J09243N4520o5995j25016j70161k45124k91091l04329k87375k86856
9734A0798072k65395k20616j70904q5289J5237J41373K99196L93009L94448M47476
9724A1746607M57201M74516M75872M78501M92065M37227L57041K29541J73864
9715A5322435J35715M7369l1786j01176q8727j59745k15117j95722j49711j36105
9705A4427430n4964P4522J57573K20477K45512K10040J45813J25958N6985O9560
9695A5678906J19917L3147k9434o6859j89610k69551l86282m80883n17947n15215
9685A3376189n12932n18730m69976m15118m15630l60816l11124k21472j38494
9676A0011897j07916L116k720k3099j0578k861k3963l0549q8504j61862k04872
$$ plain form
9744 12410256 12519499 12574019 12508024 12383008 12212847 11967723 11676632 11372303 11084928 10798072
9734 10798072 10532677 10312061 10141157 10055868 10071105 10212478 10511674 10904683 11299131 11746607
9724 11746607 12203808 12678324 13154196 13632697 14124762 14561989 14919030 15148571 15322435
9715 15322435 15458150 15505519 15473733 15372557 15283830 15124085 14908968 14713246 14563535 14427430
9705 14427430 14372466 14446988 14604561 14825038 15070550 15280590 15426403 15552361 15609346 15678906
9695 15678906 15798823 15831970 15802536 15735677 15546067 15276516 14890234 14409351 13891404 13376189
9685 13376189 12863257 12344527 11874551 11459433 11043803 10682987 10371863 10150391 10011897
9676 10011897 9903981 9907097 9904377 9881278 9870700 9867839 9843876 9813327 9724823 9562961 9358089
9665I358089l29313m67474n07777m38236m64950m81302m50334m74715m18439l82598
9655D942951m10157l58686k58333m24492m12740l06055k82752k50617k75247j76967
9645A786905j12672j18225j27207r0292q1901j23226o6131o2926j6264l7695m6341
9634I04025L51q228p1413k9452M7118j27341n5610j9716j9971J7448m2877L37
9622E94671k9738n6098l1383L2290J2897j8735k3484L6617j1782L1008J2849k3395
9610E25717m6750m6223L069o3400q071q052K5944L8221M6755j8985o610m0501
9598D01114q433K3490N8920j0299l5279J9695k216m9225K933J4783r387J8024
9586D24120N121m7830l7734M3319l5411j3977M9343N7358m2378p3510l5012L5515
$$ plain form
9665 9358089 9028776 8561302 8053525 7615289 7150339 6669037 6218703 5743988 5325549 4942951
9655 4942951 4532794 4174108 3915775 3491283 3078543 2772488 2489736 2239119 1963872 1786905
9645 1786905 1674233 1556008 1428801 1338509 1256608 1133382 1067251 1004325 988061 950366 904025
9634 904025 904376 896148 824735 795283 842401 715060 659450 639734 619763 637211 594334 594671
9622 594671 564933 508835 477452 509742 522639 503904 480420 517037 505255 536263 549112 525717
9610 525717 478967 432744 435813 372413 364342 356290 382234 420455 467210 448225 441615 401114
9598 401114 392681 416171 475091 464792 429513 449208 446992 397767 400700 415483 406096 424120
9586 424120 429241 381411 343677 386996 351585 337608 386951 444309 401931 328421 293409 328924
9574C28924M2604L4575J155M645k1248j1778j4684P129k5648N761j4736M112k284
9561C38527m1963k8455k1779k3159L8560Q1151L6331R153K3248k9011j0071l338
9549C69194l5122k9061k1973l1238l000j4255O221K203J5902J2772K4646l2782
9537B63507K272J1472k2314j8434k8521K1876L6117R289K3133k6670M7668J192
9525C20587J8775L5200L025r483j007j1962j9705M2726J8987n3671q5466m2708
9513B15298J2682R7835M3173k0866j740K8498m1757l1392n272j6721J8582l0292
9501B68028K2272L8772J2094o6142m5144m6362K5414P2294K3642n809L3990k702
9489C30347j2637j5238M2965L0304L347k4616n9683n142j4049J6755K48j5241
$$ plain form
9574 328924 371528 406103 407258 411903 390655 378877 364193 371322 345674 351435 336699 340811 338527
9561 338527 296564 268109 246330 223171 261731 342882 379213 388366 411614 382603 372532 369194
9549 369194 334072 305011 283038 251800 248800 234545 240766 242969 258871 271643 296289 263507
9537 263507 265779 277251 254937 236503 207982 229858 265975 275264 298397 271727 319395 320587
9525 320587 339362 374562 377587 368104 367097 355135 335430 378156 397143 343472 258006 215298
9513 215298 227980 325815 368988 348122 346382 374880 333123 301731 296459 279738 298320 268028
9501 268028 290300 329072 341166 275024 229880 183518 208932 281226 304868 299059 333049 330347
9489 330347 317710 302472 345437 375741 379088 354472 294789 289647 275598 292353 292601 277360
9477B77360O877K6044j753J5206N1141m4221k4665k8651j5522R208L5057J374
9465C07455K9822L7150K3511j3332k7027k6684n4523M8869N6541K4097j4845j0051
9453C80983N2524j384m0897O565k2377j3106N3312O4491J4466j8440Q553N3590
9441E38280p4822n1325J2437J6681J2828J9139k0276k505j8688r651N6390N4815
9429E33303P7585M330o587N7520J687P1264J1114O718M1536N6652M087N9155J10764
9416A029128O6064N8487J06392J15459K00818J57696J26054J49520J99066K47530
9406B456214K27037K70135K46921K00468K01036J45221O1244l8250q0657m0883
9396C648486K9834N8146J14097K77609L64554L42339M01745M83701O08737O72527
$$ plain form
9477 277360 284237 310281 308528 323734 374875 330654 305989 277338 261816 271024 306081 307455
9465 307455 337277 374427 397938 384606 357579 330895 276372 325241 381782 405879 391034 380983
9453 380983 433507 432123 391226 397791 375414 362308 415620 480111 494577 476137 484690 538280
9441 538280 463458 412133 424570 441251 454079 473218 452942 450437 431749 422098 478488 533303
9429 533303 610888 615218 608631 666151 667838 739102 750216 756934 798470 855122 859209 918364 1029128
9416 1029128 1095192 1153679 1260071 1375530 1576348 1734044 1860098 2009618 2208684 2456214
9406 2456214 2683251 2953386 3200307 3400775 3601811 3747032 3808276 3770026 3689369 3648486
9396 3648486 3678320 3736466 3850563 4128172 4492726 4835065 5236810 5720511 6329248 7001775
9386G001775O50603O14635M78634L62193K30097J58535Q3439j913r5098j76457
9376I306443j81884k33203k83038k50507k07689j19608L6507J72096L47674N20532
9366I107323P37712Q67939R34656J001597R73501R70861R02656Q29893P20296
9357A7046434N70116K46790j27557m43055p77170r61196r48141r18604q78995
9348A2808622q19567o55594m83159k56966r4333J33933L41928N45486P78778J022108
9338A3321236J243620J384236J511150J580604J531595J286502Q60629L01965
9330B3021537l05335q19088j185410j377780j469392j449614j395376j341204
9322A3678338j110943r36485p46137n87407l39610j31583R9468K60604M25536
$$ plain form
9386 7001775 7652378 8267013 8745647 9107840 9337937 9496472 9579911 9577998 9482900 9306443
9376 9306443 9124559 8891356 8608318 8357811 8150122 8030514 8067021 8239117 8586791 9107323
9366 9107323 9845035 10712974 11647630 12649227 13622728 14593589 15496245 16326138 17046434
9357 17046434 17616550 17863340 17735783 17292728 16515558 15554362 14606221 13687617 12808622
9348 12808622 11989055 11333461 10850302 10593336 10499003 10632936 10974864 11520350 12299128 13321236
9338 13321236 14564856 15949092 17460242 19040846 20572441 21858943 22719572 23021537
9330 23021537 22716202 21897114 20711704 19333924 17864532 16414918 15019542 13678338
9322 13678338 12567395 11630910 10884773 10297366 9957756 9826173 9925641 10186245 10611781
9313A0611781N55760P81174Q87104Q94817R27595P73511N53538L74784O2589k63236
9303A6159417m90687n90173n76123n73140m62656l52486j75570o401K10760M92625
9293A3635566O42404Q25618J106572J321540J578492J801298J979883J938627
9285B4830000J984212J984121J912733J892897J639392J109457M65743k31937
9277C5586618p98320j080233j095657r59406o76663m73527k35540L8787K41981
9268C0548040M87099O88040Q60336R18691R66270Q62754N19335J48962k76955
9259C5722572o45535r39708j145635j513721j896574k238200k386928k391054
9251B2565217k180051j818460j491556j138958q39228n43673l19419k44970k11980
$$ plain form
9313 10611781 11167541 11948715 12835819 13730636 14658231 15431742 15985280 16360064 16422653 16159417
9303 16159417 15668730 15078557 14502434 13929294 13466638 13114152 12938582 12932181 13142941 13635566
9293 13635566 14277970 15103588 16210160 17531700 19110192 20911490 22891373 24830000
9285 24830000 26814212 28798333 30711066 32603963 34243355 35352812 35818555 35586618
9277 35586618 34788298 33708065 32612408 31653002 30976339 30502812 30267272 30306059 30548040
9268 30548040 31035139 31723179 32583515 33502206 34468476 35331230 35850565 35999527 35722572
9259 35722572 35077037 34137329 32991694 31477973 29581399 27343199 24956271 22565217
9251 22565217 20385166 18566706 17075150 15936192 15096964 14553291 14233872 13988902 13776922
9242A3776922k61381l73107n15487o78932p27479p36574p72892p16789n90587
9233H403694n03224m41337m14480k89535j64963j01253j9129Q9217J16821K46593
9223F922404L39938L98355N18105O36664Q25852J028891J079926J113428J069798
9214A3933361R08931M04770j48101n07344o58044o61553m69128j83895J56659
9205A2775656N53368R43197J218803J470502J549379J385641Q77695J90749m09366
9196B0555624q40726r78646q37545n88916l48459l09862m28872o63349r64389
9187A4594860j075095r92420q86394o78822l83119j91661l471J65527L44503K56212
9177A1150120J13614m5724k65218o21226q68073r29242r41702q85940p89757p02331
$$ plain form
9242 13776922 13515541 13142434 12626947 11948015 11220536 10483962 9711070 8994281 8403694
9233 8403694 7900470 7459133 7044653 6755118 6590155 6488902 6469773 6558990 6675811 6922404
9223 6922404 7262342 7660697 8178802 8815466 9641318 10670209 11750135 12863563 13933361
9214 13933361 14842292 15247062 15098961 14591617 13933573 13272020 12802892 12618997 12775656
9205 12775656 13329024 14272221 15491024 16961526 18510905 19896546 20774241 20964990 20555624
9196 20555624 19714898 18736252 17898707 17309791 16961332 16651470 16222598 15559249 14594860
9187 14594860 13519765 12527345 11640951 10962129 10579010 10387349 10383878 10549405 10893908 11150120
9177 11150120 11263734 11218010 10952792 10331566 9463493 8534251 7592549 6706609 5916852 5214521
9167E214521n41043m70536m36482l18646k17276j87080j65193j79703j54875j26825
9157B416862q6279l1409n2077K0435K2819K7873l4915K4826K2120L0691J17200
9146B478146R2831J18508J51580J53121K41609L29786M08749M99475O86347Q63998
9136F024150R27193J048619J048635Q96796M41804q1231n44650r05908j011547
9127G843861r15029p01967n08439l57769j81921j9928J46049K64658L75227N09565
9117F454307O26969O68019O12519N39184L58147O8360k25384m89550n74047o92875
9107G345649p16168p67993o72090n53346n06788m34011l00020k30801k46066j49144
9097B769222q1651j8852o8565Q414J06402J14762J02193J05583J04608J64500
$$ plain form
9167 5214521 4673478 4202942 3766460 3447814 3230538 3043458 2878265 2698562 2543687 2416862
9157 2416862 2330583 2299174 2247097 2267532 2290351 2318224 2283309 2308135 2330255 2360946 2478146
9146 2478146 2570977 2689485 2841065 2994186 3235795 3565581 3974330 4473805 5160152 6024150
9136 6024150 6951343 7999962 9048597 9945393 10387197 10305966 9761316 8855408 7843861
9127 7843861 6928832 6226865 5718426 5360657 5178736 5158808 5304857 5569515 5944742 6454307
9117 6454307 7081276 7749295 8361814 8900998 9259145 9327505 9102121 8612571 8038524 7345649
9107 7345649 6629481 5861488 5189398 4636052 4129264 3695253 3395233 3164432 2918366 2769222
9097 2769222 2687571 2668719 2600154 2608568 2714970 2829732 2931925 3037508 3142116 3306616
9087C306616J68925J78935K06528K24818K99961M06273M39331L81571L32830L93428
9077F339216L33043K65045J66778M8035j03579j89107j80054k24306j74707p8017
9067F202347l9627K7504K6004k9752j14699j73912o9286j5128l7127J1144Q4221
9056E871689K37635L37586L75107M13296M72654N29842M10309K59104J33203P647
9046I048072J334n1839j02639k08068k44722k61565l00860k75777l72761m39448
9036F791727m54637m75802m55096m28091l87971l33335k30001j73368j29827p5019
9026C648580k4168L1919M8714N9028J22807J99824K53247L28832L92700N00858
9016E562341N78854N90444O93529Q29342P66937P52102P09464N32966L42705J91467
$$ plain form
9087 3306616 3475541 3654476 3861004 4085822 4385783 4792056 5231387 5612958 5945788 6339216
9077 6339216 6672259 6937304 7104082 7152117 7048538 6859431 6679377 6455071 6280364 6202347
9067 6202347 6162720 6190224 6216228 6186476 6071777 5897865 5828579 5813451 5776324 5787468 5871689
9056 5871689 6109324 6446910 6822017 7235313 7707967 8237809 8648118 8907222 9040425 9048072
9046 9048072 9049406 8997567 8894928 8686860 8442138 8180573 7879713 7603936 7231175 6791727
9036 6791727 6337090 5861288 5406192 4978101 4590130 4256795 4026794 3853426 3723599 3648580
9026 3648580 3624412 3656331 3705045 3764073 3886880 4086704 4339951 4668783 5061483 5562341
9016 5562341 6141195 6731639 7425168 8254510 9021447 9773549 10483013 11015979 11358684 11550151
9006A1550151J60301J24264K9172j9605N8833L7653o2375K4031J2869r4092k50763
8995A1570439k72744k57018k17642j34300J9985J99049L29188L84542M23541L77777
8985A2422817K48043J44087R4805M9991L1338J74656K62136L27566L95815M86673
8975A4637927L48945J46717m2282k85178m98333p09061p64182p80171p47123o23344
8965A0683915n34686m11060l57740k71632l01747l89810l95472l84859k79188
8956G357721k27080j91964l0718J05557Q5278J65715J61717n84N1543L8370P140
8945G522695n2521p0882J5493p0574m6963j02031K758J30745J84186K85442M05054
8934H203402L98786M11124L39691R6077j51477k57493k92076k66093j30239O317
$$ plain form
9006 11550151 11710452 11834716 11863888 11844283 11903116 11940769 11878394 11902425 11915294 11821202 11570439
8995 11570439 11297695 11040677 10823035 10688735 10708720 10907769 11236957 11621499 12045040 12422817
8985 12422817 12670860 12814947 12909752 12959743 12991081 13165737 13427873 13755439 14151254 14637927
8975 14637927 14986872 15133589 15091307 14806129 14307796 13598735 12834553 12054382 11307259 10683915
8965 10683915 10149229 9738169 9380429 9108797 8807050 8417240 8021768 7636909 7357721
8956 7357721 7130641 6938677 6907959 7013516 7098794 7264509 7426226 7425642 7477185 7515555 7522695
8945 7522695 7470174 7399292 7414785 7344211 7297248 7195217 7197975 7328720 7512906 7798348 8203402
8934 8203402 8602188 9013312 9353003 9449080 9297603 9040110 8748034 8481941 8351702 8358019
8924H358019K11819L66796L74787M54457M35176L69710J63702M332j31411j57989
8914A0449398q1552N6925J49844K69963L29058L72650K41281K5261k28363m15307
8904A1169158o45526p72011p81148n81033m28353l59363k59285j68615j19500
8895G054324j96696j76620j82663k60720k97651k62819k80445j81135p6066J9804
8885E159313Q3166O5973J14295L2193O045p1634j82110k00861k48732j89233j32538
8874D435877q9493p0086k1421R388J1359M6255J14919R5389N9467K89o1188j36743
8862D394012r7203j94764l01526k80840k21683j70215j50152j50681j65223j09705
8852B552020q5172m9244p9345n0842J5880J3464O322j5750J7676l7601m573L8869
$$ plain form
8924 8358019 8569838 8936634 9311421 9765878 10201054 10570764 10734466 10738798 10607387 10449398
8914 10449398 10367846 10424771 10574615 10844578 11173636 11546286 11787567 11812828 11584465 11169158
8904 11169158 10523632 9751621 8970473 8389440 7961087 7601724 7342439 7173824 7054324
8895 7054324 6857628 6681008 6498345 6237625 5939974 5677155 5396710 5215575 5139509 5159313
8885 5159313 5242479 5308452 5422747 5454940 5460985 5389351 5207241 5006380 4757648 4568415 4435877
8874 4435877 4346384 4276298 4254877 4264265 4275624 4321879 4436798 4532187 4591654 4591943 4530755 4394012
8862 4394012 4296809 4102045 3800519 3519679 3297996 3127781 2977629 2826948 2661725 2552020
8852 2552020 2466848 2417604 2338259 2287417 2303297 2316761 2323083 2307333 2325009 2287408 2282835 2321704
8840B321704O8457j1286k8903j6286J0451K2142l2368p9176p8251p7203n1618
8829B047663m5248m1221n0795m3107j9059m5476n7485L2466M544j3787n1169l7724
8817A679602r739n8327o2523m1208N223j6698l5619M0906R9603L9146L4290Q0395
8805A755051O5891l8711q8482o9071j13389j21811j59430j54017p5934n0698q8379
8794H61020j31208q4096n0113m5046L9689N277p0275o855p4435k4680j8607k2982
8782C77689J7501p274L909J897j0301j3757l8275k0367m8862j8814j534J7535
8770B59347O236L547O5164l4008o5643K3554k4198O10L7292k6851q368N2128N610
8757B94420j8001K235m2346j8248J7979m457k7022p910l7287K1878l7422N795
$$ plain form
8840 2321704 2390161 2378875 2349972 2333686 2344137 2366279 2333911 2254735 2176484 2099281 2047663
8829 2047663 2002415 1961194 1910399 1867292 1848233 1802757 1745272 1777738 1782282 1768495 1717326 1679602
8817 1679602 1669863 1611536 1549013 1507805 1513028 1496330 1460711 1501617 1601220 1640366 1674656 1755051
8805 1755051 1820942 1782231 1693749 1624678 1511289 1389478 1230048 1076031 1000097 949399 861020
8794 861020 729812 645716 595603 550557 590246 595523 525248 518393 443958 419278 400671 377689
8782 377689 395190 387916 391825 393722 383421 369664 331389 311022 262160 243346 241812 259347
8770 259347 265583 269130 334294 300286 234643 258197 233999 234609 271901 245050 236682 288810 294420
8757 294420 276419 278654 236308 218060 236039 231582 204560 196650 159363 181241 143819 149614
8745A49614Q171m4060L8758k7J8401L7161K5288j3937j4692n856r815p645l7724
8732A43637m0622L165N7806K5646L4654j7185m2873k575q097K5023j5966j970
8720A60643L928r749l4129L1676j675K9731P1132O4898K8469m4636j12257j711
8708A86320O1024o345j8151j8150k7495O973m4450j9198m814K196m7950Q39J2199
8695H2998L099L4385p850k3244J4474M1422j9777J0279L2606L3283o2513o2134
8683G7028L2211R9669j1049j7236L2467m2180m9203J3767l0064N1626L629j2648
8671A48017K411j441m5698j3449O1665K9242l3240j1611j5244J370J6198k0865
8659A17355P339m375K6476K9691J7091k7061l5198N0155j3826l2175J6755L4350
$$ plain form
8745 149614 157785 113725 152483 152456 170857 208018 233306 219369 204677 198821 189006 181361 143637
8732 143637 103015 106180 163986 189632 224286 207101 164228 161653 153556 178579 162613 160643
8720 160643 164571 154822 120693 152369 150694 180425 251557 316455 344924 300288 188031 186320
8708 186320 247344 240999 222848 204698 177203 184176 139726 120528 115714 117910 69960 70799 82998
8695 82998 86097 120482 112632 89388 103862 145284 125507 135786 168392 201675 139162 77028
8683 77028 109239 208908 197859 180623 213090 170910 121707 135474 105410 157036 160665 148017
8671 148017 150428 148987 103289 89840 151505 180747 147507 135896 120652 122022 138220 117355
8659 117355 124694 120319 146795 176486 193577 166516 131318 181473 167647 135472 152227 186577
8647A86577j7342j1331p121K4140L838j3429M3063K7735K6719l5868o6449n583
8635A54949L5533k775Q869k9060j4554q725l8750p4246K3973L9128l5002L0670
8623I0010j8248J2996L7931J5213p792p83L160L2012P5434No1563m2975R760k2710
8609A22450k6710k380P1368M0757J691l5472m4175M422n3782J486O0844L1910
8597A72409j2852k3854l0034J6876K1789Q2693J5508n07K1109K8424L064m5604
8585B49021l4298q76M6969j0210j0027M3788o8808l6149j4622J9392R4316j6469
8573B62027n4811j8743m2756M11L803j163K777K0236q698p1496k1139P0079R1203
8560B31730l3577n427j4330j4045O779j5083j9318l0112j6127M8034O0023m0066
$$ plain form
8647 186577 169235 157904 150783 174923 178761 165332 208395 236130 262849 226981 160532 154949
8635 154949 190482 187707 196576 167516 152962 144237 105487 31241 55214 94342 59340 90010
8623 90010 71762 84758 122689 137902 130110 129327 132487 164499 239933 239938 178375 135400 145160 122450
8609 122450 95740 93360 164728 205485 207176 171704 127529 131951 78169 79655 140499 172409
8597 172409 159557 135703 105669 122545 144334 227027 242535 242028 263137 291561 294625 249021
8585 249021 214723 213847 260816 250606 240579 284367 215559 179410 164788 184180 278496 262027
8573 262027 207216 188473 145717 146128 149931 148768 151545 171781 163083 91587 70448 140527 231730
8560 231730 198153 192726 178396 164351 171130 156047 136729 106617 90490 138524 198547 158481
8548A58481l4404J3793O477j0110q917K7466M995R137j670J3842L3120m0902j0189
8535A61119J6947L933j4009J0970r014R860j0930j9398L6049k3837M7698j2425
8523A96963o1505k3625K4414j9812l52l6627L2948N0458l5903o787J958J1224
8511A33354O4336k5864j8008L9931J4307l0120N446R8693N173p1524o0837k8247
8499A26640n126M4532L4733J8018K0969J4574K369J9913l5002o8657L7021M9985
8487B59969m7342m5065n2057k1026L1319O1848n094m1662l0162K6140J8540j8848
8475A36560k3283K160m4740j9030l8123m807J6695M4308j9210l6103K5568K4757
8463F4752N1597K3105j5685q883k3122m029J3478j4137L872p250L5958k6739l8843
$$ plain form
8548 158481 124077 137870 144347 134237 125320 152786 157781 166918 165248 179090 212210 171308 161119
8535 161119 178066 181999 167990 178960 169946 179806 168876 149478 185527 161690 209388 196963
8523 196963 135458 111833 136247 116435 116083 79456 112404 162862 126959 120172 122130 133354
8511 133354 197690 171826 153818 193749 208056 177936 183382 282075 287248 215724 154887 126640
8499 126640 121514 166046 200779 218797 239766 254340 256709 276622 241620 172963 209984 259969
8487 259969 212627 167562 115505 94479 125798 187646 182552 140890 110728 136868 155408 136560
8475 136560 113277 115437 70697 51667 13544 8737 25432 69740 50530 14427 39995 64752
8463 64752 116349 139454 123769 114886 91764 87735 101213 87076 90948 83698 119656 92917 54074
8450E4074o686J5167l297j361K5473M7690k9566J1583N8414j1125p7415l6176
8438D6775M2035Q6456O734K0018k537k5477L087p493k1286k3201k3714J2907j3414
8425A00890j1506n724L3781j3790N4440N7811k3999p706l8865l9352J3502m1074
8413G8408k474j8432N0913K9623l1468N5982J3404k8281l5343j1247j9348J0413
8401I2150N5635k454k5555M9373Q3512l0958j3248l7565l1460n3092L5314N6541
8389A78193o331l923m0615k47k0598k7906N4700M986m6979l6090k95l8316O406
8376B2985O7353M8681K8407P433m4861l1147K6785K1812n128k4904p086p717K5449
8363A28062L4826L4228k7539k5109L056o860O17K6768J6248K6853l4392j5367
$$ plain form
8450 54074 47388 62555 59258 57897 83370 131060 101494 113077 171491 160366 82951 46775
8438 46775 88810 175266 182000 202018 199481 174004 177091 169598 148312 125111 101397 114304 100890
8425 100890 89384 83660 117441 103651 158091 215902 191903 184197 145332 105980 119482 78408
8413 78408 75934 57502 108415 138038 106570 162552 175956 147675 112332 101085 81737 92150
8401 92150 147785 145331 119776 169149 252661 221703 208455 170890 139430 86338 121652 178193
8389 178193 171862 167939 127324 127077 106479 78573 133273 138259 91280 55190 54895 16579 22985
8376 22985 90338 139019 167426 174859 129998 98851 125636 147448 142320 117416 110330 102613 128062
8363 128062 162888 197116 169577 144468 147524 140664 141281 168049 184297 211150 176758 161391
8351A61391m0689R921p2075l3296J1677K66m2999m27K2618k609K1048k1312J1675
8338B5189N5154R619j1658j7352K191K7490L9675K6226O32j3974j1480l5009K5008
8325A21711O5288L9508J429J1453n7683p6654R26O3480L0070l3657m0897j7244
8313A07730m234j6442q807L137K601N6257K5416j1957K9601K9902k96Q562J3545
8300B35015L3875o5879n4685L2054K669j844L085j1589k5868l7084k1768J8661
8288A06642j1033l8765N2187L8051m4730L278L7478M8687L7491k8283j5314m2248
8276A43441q797q932M365L4565M8192J3840p3549k7706j7659K8020L649m5269
8264I4160k9278M2615K7591K2143K397m5668K2213L5458J276n982K7974k6080
$$ plain form
8351 161391 120702 130623 58548 25252 36929 37195 -5804 -6231 16387 13778 34826 13514 25189
8338 25189 80343 89962 78304 60952 63143 90633 130308 156534 157166 143192 131712 96703 121711
8325 121711 186999 226507 227936 239389 181706 105052 105978 169458 199528 165871 124974 107730
8313 107730 103496 87054 78247 81384 83985 140242 165658 153701 183302 213204 212908 221470 235015
8300 235015 268890 203011 148326 180380 183049 181205 184290 172701 146833 109749 87981 106642
8288 106642 95609 56844 109031 147082 102352 105630 143108 191795 229286 201003 185689 143441
8276 143441 134644 125712 130077 164642 212834 226674 153125 125419 107760 135780 139429 94160
8264 94160 64882 107497 135088 157231 159628 113960 136173 171631 172907 166925 194899 168819
8252A68819o9055j356M6343M2561O840L453Q256j8091l1187O2009K9768p245n4741
8239A86374k4644m5953j384M3691j8843J4633J4216o2484o997O417j8652L6567
8227A22941J541K4913J4658j6082j3805K0686M234j0275k2857j9894k6737M5069
8215A24392K7709N7916N9244o4396n8488j8391K4562L6245L794Q937P1431K99
8203B73254O974l0993l0438j6427l4630M0883M985Q574P810l3891p494L1818q398
8190B12027j3358m2430k7003N9032K8455k216l2126l9120n8673l2898L6931K1284
8178A09905K9825R1713L554n2905j9164L9033o884k4889J1835l8692o1048j6730
8166F5553M5426K8662k5460j9917j6034m507J0589P0998L7593k009n019m8861
$$ plain form
8252 168819 99764 98408 144751 187312 194152 197605 205861 187770 156583 218592 248360 241115 186374
8239 186374 161730 115777 114393 158084 139241 153874 168090 105606 98609 105026 86374 122941
8227 122941 124482 149395 164053 147971 134166 154852 159086 148811 125954 106060 79323 124392
8215 124392 152101 210017 269261 204865 146377 127986 152548 188793 192587 201524 272955 273254
8203 273254 280228 249235 218797 202370 167740 208623 213608 222182 229992 196101 188607 220425 212027
8190 212027 198669 156239 129236 188268 216723 214507 182381 143261 84588 51690 88621 109905
8178 109905 139730 231443 234997 182092 162928 201961 195077 170188 182023 143331 82283 65553
8166 65553 110979 139641 114181 94264 78230 73723 84312 155310 192903 190894 185875 137014
8154A37014j7370L4804J3158Q618m51R923L626n8406l2409L3800L7569Q519k0020
8141A58375j2757k6514M320J5110j6248m748j4237Q005K1435J9396J233l0820
8129A22550R564l893j238k2462k7477j1993P0302J9800o2670P726l7934m2618
8117A9657O030J2346K6951M8536J3856L9625l6992j6922k3364k330P2010j0459
8105A48944j8785k2770j5137j0115J1742L6952K6327l4645l4850l8845r302L9431
8093G8947J9184j157l6185k1166J5738J9881k7292O362J8248J442K7136l3102
8081F8036l60k4474n67Q884l1315L3919L866L3563O7396L4305O098m8875m9930
8068A00546O149j9820k1924l5183L7678J6257O953M4460j1329J0196M5306n9761
$$ plain form
8154 137014 119644 154448 167606 176224 175773 185696 189322 130916 98507 132307 169876 178395 158375
8141 158375 145618 119104 123424 138534 122286 117538 103301 111306 132741 152137 153370 122550
8129 122550 132114 128221 126983 104521 77044 65051 135353 155153 92483 100209 62275 19657
8117 19657 25687 38033 64984 113520 127376 167001 130009 113087 89723 87393 159403 148944
8105 148944 130159 107389 92252 82137 93879 130831 157158 122513 87663 48818 39516 78947
8093 78947 98131 96974 60789 39623 55361 75242 47950 54312 72560 74002 101138 68036
8081 68036 67676 43202 42635 51519 20204 54123 57989 91552 158948 193253 199351 150476 100546
8068 100546 106695 86875 64951 29768 67446 83703 90656 135116 123787 133983 179289 119528
8056A19528k3074l006n245q578p415L995j1807n3232l0524M4849L8005L5387o780
8043I2103l531j6353L3083N8558k7496q9422r655j7793l6527m896Q0171K4808
8031H3050O0226r13l8908O191K5301o61l4631o1382n570l333j6339k208N8118
8018F8941K7961j1426j7244k020k6150L2057L7175n5141n4957L9350N1671n5885
8006C4332K91k1371k7797r13J184J3983O422L535R892K8636J5908J2338p919j2012
7992E6509l8570K659L6421P033k5795J6100M4168J5938l2410l8764J4790m5474
7980A2605n5785k1683K322j1859M3022O8614m299M5228n636L4100j4979K2320
7968A13970k0277n8459L152o360L7643K1117k991j1789j8776m536l012O5154K843
$$ plain form
8056 119528 96454 93448 88203 79625 72210 76205 64398 11166 -19358 25491 63496 98883 92103
8043 92103 88572 72219 105302 163860 136364 46942 37287 19494 -17033 -21929 58242 83050
8031 83050 143276 142363 103455 109646 134947 134286 99655 38273 32703 29370 13031 10823 68941
8018 68941 96902 85476 68232 66212 40062 72119 109294 54153 -804 38546 90217 34332
8006 34332 34623 13252 -14545 -15458 -14274 -291 6131 9666 19558 48194 64102 76440 68521 56509
7992 56509 17939 20598 57019 64052 38257 54357 98525 114463 82053 43289 58079 12605
7980 12605 -43180 -64863 -62541 -74400 -31378 37236 32937 78165 72529 106629 91650 113970
7968 113970 93693 35234 38386 32026 69669 90786 87795 76006 57230 52694 49682 114836 117679
7955A17679K6658J1402p9267J9137k6084k8410L80k7112l2410L0876O4491j5390
7943F1950m4966j7165m6888k3438K0255O513L7651J6466j739J3247n5198J5251
7931a8061N0511O3579o452l9926n0203J1032J3054j4910k3854N3076R4929J372
7919A34147p2240k6745k111K9859R981j2170L1817K4768k9618l0100j6238N561
7907D6911j3272j2484J5976K9859N089o445Q103k5858j7727m830l322J4466n675
7894C0791L230K8028J5049m1340j9670J8627N500j9172k4645M3530j8301k483
7882A9144K4004j8754l9930l5556j3408L44P2562N1879l3627M212m587k8153j2230
7869a4100j6691J4021L8638K8141o1957p1416P502L4709L3026J1570P8059l617
$$ plain form
7955 117679 144337 155739 76472 95609 69525 41115 41495 14383 -18027 12849 77340 61950
7943 61950 16984 -181 -47069 -70507 -50252 -43739 -6088 10378 8639 21886 -33312 -18061
7931 -18061 32450 96029 89577 49651 -552 10480 23534 8624 -15230 37846 132775 134147
7919 134147 61907 35162 33051 62910 72891 60721 92538 117306 87688 57588 41350 46911
7907 46911 33639 21155 37131 66990 72079 65634 73737 47879 30152 25322 22000 36466 30791
7894 30791 34021 62049 77098 35758 16088 34715 40215 21043 -3602 39928 21627 19144
7882 19144 43148 24394 -15536 -51092 -64500 -64156 8406 60285 26658 30870 26283 -1870 -14100
7869 -14100 -30791 -16770 21868 50009 -11948 -83364 -75862 -41153 -8127 3443 81502 77885
7857G7885l7834k8151j6448J9041L1633j3964j3036n3373n4001Q312J7598n3832
7845a16170j3208M5505L3647M504N7958J24042K1234o3321o3399o0597K3873j2540
7833a8472L6317j467j7013O3709r779j6569l692M707L4048L3035k2626k1260j2964
7820D7974K4230M7198k9203n010l2420k4887j8526l0913K9281j0326r144j7298
7808b9044K8333J4680j5447K6240J4481J8907k9091m8024O2863j4003m6898l0687
7796d7690J9795N5780P836J2613L9278p212N469K3403M170J2887m5339o0690K9362
7783D9662Q657k4575L1386M6689p314n6590l0889J7470L9440j7806K997M6113
7771A05240l1446n139J0607l2536k0594k6766j1876M6833K0581J1778J2644K5285
$$ plain form
7857 77885 40051 11900 -4548 14493 46126 32162 19126 -34247 -88248 -79936 -62338 -116170
7845 -116170 -129378 -83873 -50226 -45722 12236 136278 157512 94191 30792 -29805 -5932 -18472
7833 -18472 17845 16378 -635 63074 53295 36726 33034 37741 71789 104824 82198 60938 47974
7820 47974 72204 119402 90199 85189 52769 27882 9356 -21557 7724 -2602 -11746 -29044
7808 -29044 -711 13969 -1478 24762 39243 58150 29059 -18965 43898 29895 -17003 -47690
7796 -47690 -27895 27885 35721 48334 87612 80400 85869 109272 113442 126329 80990 20300 49662
7783 49662 58319 33744 65130 111819 104505 47915 17026 34496 73936 56130 59127 105240
7771 105240 73794 68655 79262 46726 26132 -634 -12510 34323 54904 66682 79326 104611
7759A04611L49M898m6453l3629k5683o5365k3646j560K0166j00n417J0867j6759
7746g7721K4501J2994K1550J8515j6520K6460k0419J6265l2991J3121Q7913K2795
7734I6463m0234L869k1463k7359J0295K0668m2953m4579j4943j71O6375N1043
7722E7011M6755P674p6336j0493K8212k8383m4755k2757L0413N447J6730k4109
7710a4591L4419L0940o013l6130K2189K8090O1671J2260o5913l2982P184n196
7698C5928o524j5455N5688J0754n8560k5821L6030P530M9784P474n0719p353j2817
7685B5939j5582J2556k5757k5065M4264K115j2473m5767l725L017J4687N8155
7673C2364M7602M2943Q785j8505k5254K1143j0338n2088K3843K6262j8184L990
$$ plain form
7759 104611 104960 109858 63405 29776 4093 -61272 -84918 -86478 -66312 -66412 -71829 -60962 -77721
7746 -77721 -53220 -40226 -18676 -161 -16681 9779 -10640 5625 -27366 -14245 73668 96463
7734 96463 56229 60098 38635 11276 21571 42239 -714 -45293 -60236 -60407 5968 57011
7722 57011 103766 111440 35104 24611 52823 24440 -20315 -43072 -12659 -7212 9518 -14591
7710 -14591 19828 50768 44755 8625 30814 58904 120575 132835 66922 33940 41124 35928
7698 35928 29404 13949 69637 80391 21831 -3990 32040 39570 89354 96828 46109 38756 25939
7685 25939 10357 22913 -2844 -27909 16355 18470 5997 -39770 -43495 -40478 -25791 32364
7673 32364 79966 122909 131694 113189 87935 109078 98740 46652 70495 96757 78573 82563
7661H2563J944j0003r167K3440o5172k0202M3901J3189K8309K197n0637P070N1606
7648I9038l4112O930k4247M354L2977R692M398r233q233k6094m9409k7265K5568
7635D364K1045m0477j3809L6590L5719k0282k5185j5149R860M8353P229l7466
7623A0792J0422k3938J9201N0043K0701k508l0289n355m8640q935J8533Q083l855
7610A4255J7769J1009P546K2525N7099m311l3402K3634n084m8535k7255R62l5068
7597A144o2317K4637P5096k520m5208R607L5150J159j4269m6054K2452L6384L399
7584C8660J3045l1693j0494L0339j2217J147p0338p133Q1980r022Q087J1430K9292
7571G3083J5256m8019l1698M4349N2145m0897m7831j7538J3903N7428O4133j0643
$$ plain form
7661 82563 84507 74504 65337 88777 23605 3403 47304 60493 88802 90999 40362 47432 99038
7648 99038 64926 71856 47609 51963 84940 94632 99030 89797 81564 55470 6061 -21204 4364
7635 4364 25409 -15068 -28877 7713 43432 23150 -2035 -17184 -7324 41029 48258 10792
7623 10792 21214 -2724 16477 66520 87221 84713 54424 49069 429 -8506 10027 18110 14255
7610 14255 32024 43033 50579 73104 130203 125892 92490 116124 111040 62505 35250 36212 1144
7597 1144 -61173 -36536 38560 36040 -9168 439 35589 36748 22479 -23575 -1123 35261 38660
7584 38660 51705 20012 9518 39857 27640 28787 -41551 -48684 33296 24274 32361 43791 73083
7571 73083 88339 40320 8622 52971 105116 64219 16388 -1150 12753 70181 134314 123671
7559A23671l5604n0002l2972o7082k2926N6629N9216J6310M0492M0799l57l2027
7547I6147l3751o1192k2235O792K5178J818m5037R931K1413p694O066K9869m9020
7534b1715l8018M8553P003k0982K6177J6575j4239k3421l1538M2279M7620j680
7522C6614j6701j0563l0472K5219m3173n8732J9006R0518O4853j1014K1579n1403
7510C5731n6970J2401J1866M533L3596q251L3225k4968r363j4032k4344o812l71
7497a3759k8882K5534N9672K0374L7495j6545j5549n6765k1134k6357k9544N622
7485e9838K2463k1530L2582N3832J9633R394j7956j7583k7668j0533L1925L9766
7473E4487J5260r611Q271l7273l5282n604L84l904m8690j1868K2144M6220k4246
$$ plain form
7559 123671 88067 38065 5093 -61989 -84915 -28286 30930 47240 87732 128531 128174 96147
7547 96147 62396 1204 -21031 -14239 10939 12757 -32280 -22349 -936 -8630 -2564 27305 -21715
7534 -21715 -59733 -11180 -4177 -25159 1018 17593 3354 -20067 -51605 -9326 38294 36614
7522 36614 19913 9350 -21122 4097 -39076 -97808 -78802 11716 76569 65555 87134 35731
7510 35731 -21239 -8838 3028 7561 41157 32906 66131 41163 31800 17768 -6576 -13388 -13759
7497 -13759 -42641 -17107 42565 62939 100434 83889 68340 11575 -9559 -35916 -65460 -59838
7485 -59838 -37375 -58905 -26323 27509 47142 56536 38580 20997 -6671 -17204 14721 54487
7473 54487 69747 60136 68407 31134 -4148 -9752 -9368 -13272 -61962 -73830 -51686 -5466 -29712
7460b9712j4102K4484L0596l2171k7083m09J1123L6595J3076j236m3809k3217
7448e5865K5774j4166L471J2178J0046M8279p332K9712j670k2983j0999j4554
7436A891L3877K4191n9566k5393M4841k00k1380n7022K846j9748J2885M5735J8576
7423A533k2750l1733M5295M3328l1511p099j8038l1178r29N5384O960k2962j0760
7410b4460Q534j6080k3576J2458P4343P9221O274m6173m7319o0954j1952O542
7398d3142l5330j479J760J6862p521k7112J2552L6355N6659j4408J9113O47M192
7385A9148K4421r584K0490n2537j8619L635l0678P3J9109O2645J3162j5276k919
7372C3070K8132k9817j7156K0017J793m996N8812J3527n7523n5889l5384j2665
$$ plain form
7460 -29712 -43814 -19330 11266 -20905 -47988 -48397 -37274 -679 12397 11161 -32648 -55865
7448 -55865 -30091 -44257 -40786 -28608 -18562 29717 22385 52097 50427 27444 16445 1891
7436 1891 35768 59959 393 -25000 19841 19641 -1739 -58761 -55915 -75663 -62778 -17043 1533
7423 1533 -21217 -52950 -7655 35673 4162 -2937 -20975 -52153 -53082 2302 9262 -13700 -24460
7410 -24460 -15926 -32006 -55582 -43124 31219 110440 116714 70541 23222 -37732 -49684 -43142
7398 -43142 -78472 -79951 -78191 -61329 -68850 -95962 -83410 -47055 9604 -4804 14309 14956 19148
7385 19148 43569 33985 54475 1938 -16681 -13046 -43724 -43651 -24542 38103 51265 35989 33070
7372 33070 61202 31385 14229 34246 36039 31043 89855 103382 45859 -10030 -45414 -58079
7360e8079J8572K1487M5012P5603L7716J2957m8869q6103l276L1343N3246q7483
7348A2126l1148J8782J8443k7659m0836n474K1113M2169K9122L946K0010k663
7336E7931J1799J3828j3740j3391K0539J8110j0580k0815p924j3347m7304r070
7324a3964l0668K3115J0418K7572O6362K7267o612n4749J5225l3498m2868L0430
7312A8030J1338l4332L795K806J2113j2816m7057l077J9379J9649K1439k8025
7300a6758l1349p9985l1110J7912N8302L843r222o82N1712o974j96Q488j3173
7287d9192k3583j6990J1217P226r172m6913L1229k8673n917m289n535O022K0301
7274a14269N1086j0361K4931O1808K9154K0910k3898m2793j8990j3253K6204M499
$$ plain form
7360 -58079 -39507 -18020 26992 102595 140311 153268 104399 18296 15020 46363 99609 12126
7348 12126 -19022 -240 18203 -9456 -50292 -55766 -34653 7516 36638 40584 60594 57931
7336 57931 69730 83558 69818 56427 76966 95076 84496 63681 55757 42410 -4894 -13964
7324 -13964 -44632 -21517 -11099 16473 82835 110102 103490 48741 63966 30468 -12400 18030
7312 18030 29368 -4964 -1169 1637 13750 934 -46123 -49200 -29821 -10172 11267 -16758
7300 -16758 -48107 -128092 -159202 -141290 -82988 -79145 -88367 -89049 -37337 -44311 -44507 -36019 -49192
7287 -49192 -72775 -89765 -78548 -71322 -80494 -127407 -96178 -124851 -130768 -135057 -140592 -134570 -114269
7274 -114269 -63183 -73544 -48613 13195 42349 63259 39361 -3432 -22422 -35675 -9471 -4972
7262d972M1266m612l9612j3544k2562J2117n30J0094L6257N619m7905L9716j1628
7249b96k1626J1521j4827o698j7387j1950J525j365J5170j1105l2015J7634Q7214
7236A5795M5013l8715m9979O088m2595P5301O6468n184n2198k4577r701L816n1582
7223f2050J3551q167O7056N7234K605k2746K5148q471m9375J1799q076m1233l1655
7210e4380L0278M4024L5233J221k8942m66J2120o344l0802j0882N8084M4690o7309
7197B6525k1289l67N545Q292k1680k0757L791K1451j4640j176J8805K4010J2246
7184D0756K0725r699k75k8984l6436K8640m833k3870J848k6262k8887Q3695L5115
7171E1533j0952n4686j5818M7700j7378J2679L8651N583j4270q389j0929J048
$$ plain form
7262 -4972 36294 31682 -7930 -21474 -44036 -31919 -32449 -22355 13902 19521 -28384 11332 -296
7249 -296 -21922 -10401 -25228 -31926 -49313 -61263 -59738 -61103 -45933 -57038 -89053 -71419 15795
7236 15795 60808 22093 -27886 -21798 -64393 10908 77376 72192 19994 -4583 -14284 -10468 -62050
7223 -62050 -48499 -56666 10390 67624 70229 47483 72631 64160 14785 26584 18508 -22725 -54380
7210 -54380 -24102 19922 55155 56376 27434 26968 39088 32744 1942 -8940 49144 93834 26525
7197 26525 5236 4869 10414 18706 -2974 -23731 -19940 1511 -13129 -14305 4500 28510 40756
7184 40756 61481 51782 51507 22523 -13913 14727 9894 -13976 -12128 -38390 -67277 16418 51533
7171 51533 40581 -14105 -29923 17777 399 13078 51729 57312 43042 34653 23724 24772
7159B4772j3253m9013j3236j8645k3836M6886O5598k5961K9P2556M4615l1634
7147G8878j8361l3641m6688k459K0164j8495k506j0366j7628O611O1025n55K2770
7134C8749J5074m2748k0403J48j4422j7504L3112L1506L932j8120q997l1256m1526
7121g2455J1850p156M1479K2037k3178J4066k8681m8548J0974Q8995N0647P102
7109F7132o6462l6837n363K1964l1253j9577l0713l1089P6234O9483m9367L0964
7097d884j6543L0018j7101j309K2252O594n4493l8840K9636K9646K1004R213m1188
7084b5995j2054L9549k7354n0292J909P2792K4510j3543q363L5020M9931M9441
7072A35551k9702n8918l5092m1891n075K9757K8049L9233l5125n9996M5516M6524
$$ plain form
7159 24772 11519 -37494 -50730 -69375 -93211 -46325 19273 -6688 -6659 65897 110512 78878
7147 78878 60517 26876 -19812 -22271 -2107 -20602 -23108 -33474 -51102 -44491 16534 15979 38749
7134 38749 53823 11075 -9328 -9180 -23602 -41106 -7994 23512 27444 9324 327 -30929 -72455
7121 -72455 -60605 -67761 -26282 -4245 -27423 -13357 -42038 -90586 -79612 9383 60030 67132
7109 67132 670 -36167 -41530 -19566 -50819 -70396 -101109 -132198 -55964 13519 -35848 -4884
7097 -4884 -21427 8591 -8510 -9819 12433 19027 -35466 -74306 -44670 -15024 5980 15193 -25995
7084 -25995 -38049 1500 -25854 -76146 -74237 -1445 23065 9522 1159 36179 86110 135551
7072 135551 105849 46931 11839 -30052 -35127 -5370 22679 61912 26787 -33209 12307 58831
7060E8831r503J0266n8652j3490k4016J2445L462q017k5088j3895L3690J5231
7048a8736l9050o1940K0761J9238K3977Q5674J7251j7808j5429k2101n8734l4487
7036a01384Q665J4060R3958K4170L741l3737k5325l183k0034j3303J4310Q618
7024b9444L0850L4023L7248k2719r731k8567j0322K4402j3890K1472K181n5483
7012a9980k9450N8153K6347K7765o462l7056l975L6428M6440m3206p6791J6433
7000e354N5710K3878r788l058j1228j6915P641k9700l4238m1354K8763O1230k7146
6987a559P354J7980r799K379n1587K7454k716K549J0458m9957m1690P023N4765
6974b7346K3685J9275L9793M8720l8987p6899O867j2167l5586O0555M485o3495
$$ plain form
7060 58831 49328 59594 942 -12548 -36564 -24119 -20657 -28674 -53762 -67657 -33967 -18736
7048 -18736 -57786 -119726 -98965 -79727 -55750 29924 47175 29367 13938 -8163 -66897 -101384
7036 -101384 -92719 -78659 15299 39469 43210 9473 -15852 -19035 -39069 -52372 -38062 -29444
7024 -29444 1406 35429 72677 49958 40227 11660 1338 25740 11850 33322 35503 -19980
7012 -19980 -49430 8723 35070 62835 56373 19317 15342 51770 98210 55004 -21787 -5354
7000 -5354 50356 74234 64446 61388 50160 33245 40886 11186 -23052 -64406 -35643 25587 -1559
6987 -1559 5795 23775 13976 16355 -35232 -7778 -10494 -7945 2513 -47444 -89134 -82111 -27346
6974 -27346 -3661 15614 55407 104127 65140 -11759 -4892 -17059 -52645 7910 12395 -51100
6962e1100l8225M1776m4170k5284L4321N9999K7247j8977l2142l9825N5684j0519
6950d1215k6726K2387j340k2840n3020q905N1384O0527j1263l4398j9238n7913
6938a42560L9015O1140j3845K5949O260k2232n925J4376J9152K1425K5743p3782
6926d5284K2996K7745n8320J2245N2961j573k6249j4927J0755O383L9132K7007
6914E2871l6380J3732J6196M4337k6998J5926j2283p4535m2623L0951O0221l2780
6902H635N09K3131j1609k4480M364k4821l0389K3067L8117K5337J7892p3677o6221
6889i0145k2332K2645K0945j7292M4849R2802N37p3609p5191M4513l8957K4760
6877f6475M2868K7057p065L1236q747k7484J3227J578J3850j5542J8599p439m1898
$$ plain form
6962 -51100 -89325 -47549 -91719 -117003 -82682 -22683 4564 -14413 -46555 -86380 -30696 -41215
6950 -41215 -67941 -45554 -46894 -69734 -122754 -131659 -80275 -19748 -31011 -65409 -84647 -142560
6938 -142560 -103545 -42405 -56250 -30301 -24041 -46273 -52198 -37822 -18670 2755 28498 -45284
6926 -45284 -22288 5457 -52863 -40618 12343 10770 -15479 -30406 -19651 -13268 25864 52871
6914 52871 16491 30223 46419 90756 63758 79684 67401 -7134 -49757 -18806 41415 8635
6902 8635 9144 32275 20666 -3814 550 -24271 -54660 -31593 6524 31861 49753 -23924 -90145
6889 -90145 -112477 -89832 -68887 -86179 -41330 51472 52009 -21600 -96791 -52278 -91235 -66475
6877 -66475 -23607 3450 -3615 27621 18874 -8610 4617 6195 20045 4503 23102 15663 -26235
6864b6235L1816k3150O940P6921M8818m8294o3190n809N016j128K2456Q920m133
6851B8948o5639J6503L129J0419K733L6143J8926l2092n6749j5968L3848P2122
6839E2323L9365j5581O903l2203l6759L8043J6184k8078J6299p202j4598l4584
6827A12p437M2917O88l0753J7206m2676M494N7451J6264n4498l01K9070k2400
6814A0137p857q22J0011k1488k5474r688L0695k3180m5144K7745L4679P3610J0046
6801F3270q817J4271k1649J2365K436J4173J1871m41k3972Q115p368k0373k2683
6788B1198j6091K677l312L4274j2401j8931j2259K4678k1119j8128n091m5740
6776g0245N159K6983j6244P564O7188K2219l4437n0078n5100k7116J4099K0996
$$ plain form
6864 -26235 5581 -17569 -10629 66292 115110 66816 3626 -2183 2833 1705 24161 33081 28948
6851 28948 -36691 -20188 -17059 -6640 -3907 32236 51162 19070 -37679 -53647 -19799 52323
6839 52323 91688 76107 83010 50807 14048 52091 68275 40197 56496 49294 34696 112
6827 112 -7325 35592 36280 5527 22733 -19943 -15449 42002 58266 3768 3467 32537 10137
6814 10137 2280 1458 11469 -10019 -35493 -45181 -14486 -37666 -82810 -55065 -20386 53224 63270
6801 63270 54453 68724 47075 59440 61876 76049 87920 87479 63507 71622 64254 43881 21198
6788 21198 5107 7784 4472 38746 26345 7414 -4845 19833 -1286 -19414 -24505 -70245
6776 -70245 -65086 -38103 -54347 -46783 20405 42624 8187 -41891 -96991 -124107 -110008 -89012
6764h9012N5043L0867L1575J7834K4233m0332q0513k9253q139M2172R2618j4839
6752C2254k5647n057K1071Q967k828j8083l0302N6505P9736R372O781m2043j5171
6739G5555O385k7236m5223p9239j5809P1333L7010o8950p5076j0452K4247M6823
6727f0632m61N474L5229l7131M0080L3683l0193j9090n9000j1824L9375K4461
6715d0029j1228k5541P972J5504M8899J4325p202M0739j825J4175K4422k9818
6703E0393N1040J7044j2991m068n7846l1208l7708J4580M5074o75l2860m164N120
6690A731M6661k0435j7517q322j6961M1775P493j3721m7541P023L2820j2251K1017
6677B1772K3410K2163L3948k7297l6232J9573m1183l7243M9220J7273j4028J2842
$$ plain form
6764 -89012 -33969 -3102 28473 46307 70540 30208 -50305 -79558 -87697 -45525 47093 32254
6752 32254 6607 1550 22621 31588 28760 10677 -19625 36880 116616 125988 132769 90726 75555
6739 75555 81940 54704 9481 -69758 -85567 -14234 22776 -46174 -121250 -131702 -107455 -60632
6727 -60632 -61093 -55619 -20390 -57521 -17441 16242 -13951 -33041 -92041 -103865 -64490 -40029
6715 -40029 -51257 -76798 -68826 -53322 -4423 9902 2700 43439 41614 55789 80211 50393
6703 50393 101433 118477 105486 101418 43572 12364 -25344 -10764 34310 33635 775 -3389 1731
6690 1731 48392 27957 10440 2118 -14843 26932 34425 20704 -26837 -19814 13006 755 21772
6677 21772 45182 67345 101293 73996 37764 57337 16154 -21089 28131 45404 31376 44218
6665D4218O830K0621k856l4962N357L5205k2292k4303Q848K3507l8484l5017j6127
6652b9455K1963j1941j0673P6557Q013l1602j0895p7892m1970P0600M5897Q515
6640A7117K2699l4752o7156r309J4323L8000J7406K90j0051N326q369k1545K2487
6627a3534j7094K4939O2181L501r529k7495l2786K2178m3677Q378J2158k8315
6615c9095n857K8381o958k4580L9063J5971o3399k159L2541l1339o3917L7782
6603h3566J05579J3240n220k9905n0687L8659J4253j3710L5940L5013J3388J6310
6591H9294k2118p4935j4419N4952m1881k9859K2265M4368J5670k7889k5296M4119
6579C4271N3742J201p9805l6834J8601K1007k5668N8056O911J7016N186o920p3642
$$ plain form
6665 44218 51048 71669 68813 33851 39208 74413 52121 27818 36666 60173 21689 -13328 -29455
6652 -29455 -7492 -19433 -30106 46451 54464 22862 11967 -65925 -107895 -37295 8602 17117
6640 17117 39816 5064 -62092 -71401 -57078 -19078 -1672 -1382 -11433 -6107 -14476 -36021 -13534
6627 -13534 -30628 -5689 56492 59993 50464 22969 -9817 12361 -31316 -22938 -10780 -39095
6615 -39095 -44952 -16571 -23529 -48109 -9046 6925 -56474 -58633 -26092 -57431 -121348 -83566
6603 -83566 22013 35253 30033 128 -50559 -11900 2353 -11357 24583 59596 72984 89294
6591 89294 67176 -7759 -22178 32774 -9107 -38966 -16701 27667 43337 15448 -9848 34271
6579 34271 88013 89214 9409 -27425 -8824 12183 -13485 44571 51482 68498 73684 66764 -6878
6566f878J8282L598j920K7647l5974k2488M75L0714K0871L8501o399j7889m2503
6553F037k3076K5272J2714K0365K0355j5056j3661K5550j6600k103j9073L7750
6541E8474J1447p435k8118k0212m537J1111J5411J6292l0313p5670l2119j855
6529h7524K9117J1536j2474N543L9379j2317j7282M7618K8813K0942k8419q135
6517A6797l0751n5116R576K3363J7065R518k4978l0340r297P643K0202L8354J6649
6504H685K121M919N9331K247m5790J4879l499M530J3676j2671q530O566L0691
6491G7155Q060n4145k8766N5533J2071P025k1091j8710l9404n1195Q049R951L635
6478c1832o3241K3585L6354m039L5150K1403q672l8958L3960N2599m4898j7190
$$ plain form
6566 -6878 11404 15002 13082 40729 4755 -17733 -17258 13456 34327 72828 66429 48540 6037
6553 6037 -17039 8233 20947 41312 61667 46611 32950 58500 41900 39797 20724 58474
6541 58474 69921 62486 34368 14156 9619 20730 36141 52433 22120 -53550 -85669 -87524
6529 -87524 -58407 -46871 -59345 -53802 -14423 -26740 -44022 3596 32409 53351 24932 16797
6517 16797 -13954 -69070 -59494 -36131 -19066 -9548 -34526 -64866 -74163 -66520 -46318 -7964 8685
6504 8685 10806 15725 75056 77303 31513 46392 42893 47423 61099 48428 39898 46464 77155
6491 77155 85215 31070 2304 57837 69908 76933 55842 37132 -2272 -53467 -45418 -35467 -31832
6478 -31832 -95073 -71488 -35134 -39173 -4023 17380 8708 -30250 3710 56309 11411 -5779
6466e779j731k5025R031L8300k81M6445j8831p3048n4237M0295Q286j7865m9829
6453a04269J5930N2223k47L8101j4643m0763o181K6987N2015J9287J7680J2438
6441F8558l153k6718k3560k7131k1849J9369k2712k2974J597L2783m1598n3727
6429a21115M0273O0712j642n9788R771K1755J1292j2610k3087P670J3846J8653
6417c4270q518J3186J0922M6941J5976j520k4982l3680J888K2676J2860n4696
6405c3217P572J8921j7326k4683K2222n839Q3176k4261q3367R951k9975L6945
6393c9881O0274K8371m544N6893L5730L6271n7631p3260n2148K5754N61l4616
6381a8226N178K0543j8858K586j5081k6504J9199n554j2956k1078n869K4091l1610
$$ plain form
6466 -5779 -7510 -32535 -23504 14796 14515 60960 42129 -30919 -85156 -44861 -36575 -54440 -104269
6453 -104269 -88339 -36116 -36363 1738 -12905 -53668 -59849 -32862 19153 38440 56120 68558
6441 68558 65405 38687 15127 -12004 -33853 -14484 -37196 -60170 -58573 -25790 -67388 -121115
6429 -121115 -80842 -20130 -21772 -81560 -71789 -50034 -38742 -51352 -74439 -66769 -52923 -34270
6417 -34270 -42788 -29602 -18680 28261 44237 42717 17735 -15945 -14057 8619 21479 -33217
6405 -33217 -25645 -6724 -24050 -48733 -26511 -32350 50826 26565 -56802 -46851 -76826 -39881
6393 -39881 20393 48764 44220 101113 136843 173114 115483 42223 -9925 15829 16390 -18226
6381 -18226 -13048 7495 -11363 -8777 -23858 -50362 -31163 -36717 -49673 -70751 -76620 -52529 -84139
6368h4139J7633K6169L2817J609J5569l5762K6134j6771r0110m0100K5731L8692
6356h2528j5602O1919K8422L3336m8275l9868k1565J1525n609K9057K8202k0500
6344d1486L573m8269K5585K9046R1259M7614r3456n5538Q952L9556J7952o7316
6332d2528k3727l836O2292N4108l4242j8474K787l499J7498J4334J3073K2516
6320F0302k5821l7268k6286J0060j1424K6862L2283K1215j0388l755l5915n97
6308g32k3152m9002p3537J8334K4161N7742m1491K4177P303k1741K2689J0837
6296d4412m331J193J0092K8204M6424l0462m1463L3865J6918l9881O986L2703
6284A5836L6476o675q423r0482L2337M1757K3807L7431l4928n3610L439J3485
$$ plain form
6368 -84139 -66506 -40337 -7520 -5911 9658 -26104 30 -16741 -106851 -146951 -121220 -82528
6356 -82528 -98130 -36211 -7789 25547 -22728 -62596 -84161 -72636 -78245 -49188 -20986 -41486
6344 -41486 -37913 -86182 -60597 -31551 59708 107322 13866 -41672 -32720 6836 24788 -42528
6332 -42528 -66255 -70091 -7799 46309 12067 -6407 -3620 -7119 10379 24713 37786 60302
6320 60302 34481 -2787 -29073 -19013 -30437 -3575 28708 49923 39535 35780 -135 -732
6308 -732 -23884 -72886 -146423 -128089 -103928 -46186 -87677 -63500 -56197 -77938 -55249 -44412
6296 -44412 -48743 -47550 -37458 -9254 37170 6708 -34755 -890 16028 -23853 -16867 15836
6284 15836 52312 45637 37214 -53268 -20931 20826 44633 82064 47136 -6474 -3035 10450
6272A0450l2812n3318K457J3176J9832R747o477O156r054K6771k3857J6721l603
6259b3811j1875n3972L707L1851K583M9106K9667J177n9094J7437R060l8647O0811
6246A8000N1328k4912k2508j8397o6924n828j2528J1156l2924L5818M1396m528
6234c0851L5026M4545j4714J9486L3686j9762l9907l7311J1646R495p592m2821
6222c9074K3730L3842K535L831m0712j3978K5496J1016L0396J6938l2624J7108
6210C8504j0484l5341k9509L1105j936k2752j0594m88L7463L2793J4380K0862
6198F4003L909J0527j5104R619l6810L96r876j0589L995j1581k3779j4408k278
6185c1976N3824J3365r289m190j7409m3906m148K2638L4634K720M3943L6567j5010
$$ plain form
6272 10450 -22362 -75680 -73223 -60047 -40215 -30468 -36945 -30789 -39843 -13072 -36929 -20208 -23811
6259 -23811 -35686 -89658 -85951 -54100 -51517 -2411 27256 28433 -30661 -13224 -4164 -42811 18000
6246 18000 69328 44416 21908 3511 -63413 -69241 -81769 -70613 -103537 -67719 -26323 -30851
6234 -30851 4175 48720 34006 53492 87178 67416 27509 -9802 1844 11339 3747 -39074
6222 -39074 -15344 18498 21033 24864 -15848 -29826 -4330 6686 37082 54020 21396 38504
6210 38504 28020 -7321 -36830 -5725 -7661 -30413 -41007 -41495 -4032 28761 43141 64003
6198 64003 67912 78439 63335 72954 36144 36540 26664 16075 20070 8489 -15290 -29698 -31976
6185 -31976 21848 35213 25924 21734 4325 -39581 -43729 -21091 13543 16263 60206 96773 81763
6172H1763j6652m1914K4997j4185l1624j4543k4330k4238P34Q052k3824j0066
6160h5830L8907O2451j1584j8736K2353L3847J4799m8125m2249l4778j3658L6146
6148d6457p57L8026M2394j6501k2244j44K4466m9L8092L2166m3609k4562m4561
6135b3740l3500P865L6784j9207r56j1281m1043k508K6933p834Q25M8176K6164
6122F678L377j6421J058L9521J2695p9791k5072n6040P890L8612P31j0233L2865
6109d4130L9621J0743Q531p774j1365J1496L48r161N788l4283N709j4990j2784
6096e2251j1089J0411j715k3249p306j1952k0773L640N6779r20L0943k7660k5112
6083h0254L8296M9316K553l3565j9321j7767M0007K1565n5159m5075J3274K9851
$$ plain form
6172 81763 65111 23197 48194 34009 2385 -12158 -36488 -60726 -59992 -51940 -75764 -85830
6160 -85830 -46923 15528 3944 -14792 7561 41408 56207 8082 -34167 -68945 -82603 -46457
6148 -46457 -47214 -9188 33206 16705 -5539 -5683 18783 18734 56826 88992 45383 20821 -23740
6135 -23740 -57240 -49375 -12591 -31798 -32754 -44035 -85078 -87586 -60653 -68487 -67662 -19486 6678
6122 6678 10055 -6366 -5308 34213 46908 -32883 -57955 -113995 -106105 -67493 -66762 -76995 -44130
6109 -44130 -4509 6234 14765 6991 -4374 7122 7470 -1691 4097 -30186 -24477 -39467 -52251
6096 -52251 -63340 -52929 -54644 -77893 -85199 -97151 -117924 -114284 -57505 -58425 -27482 -55142 -80254
6083 -80254 -41958 7358 9911 -23654 -42975 -60742 -20735 830 -54329 -99404 -86130 -56279
6071e6279L533J7285k9848l8657j6905K2647J4168J0511M9106K7386K2093M4199
6059F9239k1300p117K114k296l1339m9805j7611O210o654N5868M9155K5732l8623
6046C3573j6297p3925l980K9500R2916P934j1281l4532p9600k607M6651L275l0052
6033c8425n1448R794J0456J9309m137M7408L8628l224k8821m5715j9183j9477
6021h4835L901P4669J2023l1720J8891K385m0527l907J3968K2980J0850L9654
6009C8332l1183N406M2069j4100k5959k0277N5597J1240l6299J4577k0311m0685
5997b1593j9659J036J5239j8439l7010L693m949n759M4779R660l0299l4062K8712
5984f8651J4965l7306J7915Q4614k4738n663P581o666K9657j8000j8642N6655
$$ plain form
6071 -56279 -52746 -35461 -65309 -103966 -120871 -98224 -84056 -73545 -24439 2947 25040 69239
6059 69239 47939 40822 42936 40640 9301 -40504 -58115 -51905 -58559 -2691 46464 72196 33573
6046 33573 17276 -56649 -60629 -31129 61787 69721 58440 23908 -55692 -58299 -11648 -8373 -38425
6033 -38425 -89873 -80079 -69623 -50314 -54451 -7043 31585 28361 -460 -46175 -65358 -84835
6021 -84835 -80934 -6265 5758 -25962 -7071 -4686 -45213 -49120 -35152 -12172 -1322 38332
6009 38332 7149 12555 54624 40524 14565 -5712 49885 61125 24826 39403 19092 -21593
5997 -21593 -41252 -40216 -24977 -43416 -80426 -76733 -81682 -87441 -42662 -33002 -63301 -97363 -68651
5984 -68651 -53686 -90992 -73077 11537 -13201 -18864 -11283 -17949 11708 -6292 -24934 31721
5972C1721J5300n2293n6221J6279M9187P171n872M347R717J7431m7215k0457L5687
5959D782n560J0558O978M079P525L6742m8544M944J826J083M0974K61k6562l2684
5945F402k9284k3245k1383N0930Q2662n268p4483k1857K1334N9575k8214m7720
5933c0551j7977k3908K4692J1913J8037J080m8575r963M2677Q929j3887M9006
5921A1473L3970j4295j9166K0263k5459q71k0121k2815n45J7807N5827Q416k8520
5908A5964l2377j5290M7255R505l5945j1614J0007P189M823n4095l4117m0382
5896a29077L8776R2277j0551m545K5883K821l56o837l2476L8003N0789L4647q949
5883I0405l2477m2985l7069l9179j9615J9445N3302K0620p2403k6676J24L851
$$ plain form
5972 31721 47021 -5272 -61493 -45214 3973 11144 5272 9619 19336 36767 -10448 -30905 4782
5959 4782 -778 9780 16758 20837 28362 65104 16560 21504 23330 24413 65387 65648 39086 6402
5945 6402 -22882 -46127 -67510 -16580 66082 60814 -13669 -35526 -14192 45383 17169 -30551
5933 -30551 -48528 -72436 -47744 -35831 -17794 -16714 -65289 -75252 -32575 -23646 -37533 11473
5921 11473 45443 31148 11982 32245 6786 5915 -14206 -37021 -37566 -19759 36068 44484 15964
5908 15964 -16413 -31703 15552 25057 -10888 -22502 -12495 -5306 -483 -54578 -88695 -129077
5896 -129077 -90301 1976 -8575 -13120 12763 15584 15228 8391 -24085 13918 64707 99354 90405
5883 90405 57928 14943 -22126 -61305 -80920 -61475 -8173 12447 -59956 -86632 -86508 -82657
5871h2657K3445K4440j1313J6671K0853K6387J9268K0731m8991r939J3586k391
5859A0090J2071J5335L1225l643n104m1587l0381m3486J7996J5319Q458J2118
5847a589L190K1025l825l476O9432N4857k1669N96m4297l8619l3643q909l3851
5834d0778L698k6755j6897m322j9992M4900O5316n321L0825k1618j3052R654L9622
5821D5280p014l5224j7652q914n2494p8476O9151O5618j4400n8742J456l5388
5809a26799M5951j2831j5667K2938K4788l356K070k9886M5068K6013p822j1041
5797d0574j426j3771K1837L1328j4791o577k5965K2515J0095K3172J390p606j1075
5784a1448k9052K659k0285n613p748j4039M9736M2092L728k4066l2809o5342L1390
$$ plain form
5871 -82657 -59212 -34772 -46085 -29414 -8561 17826 37094 57825 8834 -1105 12481 10090
5859 10090 22161 37496 68721 65078 59974 18387 -11994 -55480 -37484 -22165 -13707 -1589
5847 -1589 1601 22626 18801 15325 84757 139614 117945 118541 74244 35625 1982 -6927 -40778
5834 -40778 -37080 -63835 -80732 -85054 -105046 -60146 5170 -151 30674 9056 -3996 5658 45280
5821 45280 38266 3042 -14610 -23524 -76018 -154494 -85343 -19725 -34125 -92867 -91411 -126799
5809 -126799 -80848 -93679 -109346 -86408 -61620 -64976 -62906 -92792 -47724 -21711 -29533 -40574
5797 -40574 -42000 -55771 -33934 -2606 -17397 -23974 -49939 -27424 -17329 5843 7233 -373 -11448
5784 -11448 -40500 -37841 -58126 -63739 -71487 -85526 -35790 6302 10030 -14036 -46845 -112187 -80797
5771h0797M0023J6943J3329k0497j7540J5905n9122j2383K2998L3773k581K1645
5759b8304J7333R029O297K6601m4431k1320m2278J6336M8557K047o865n422M9307
5746B6887K4331m6878k2116L0291L3262k9294l0836k6300j164J2286J8773l5664
5734d6422K318M6370M7922Q269l1108m1315N809M616K049j3972K858J6749r548
5721e405k6903q869l3026j0974q084O8344L6037l6606j9554j179L3557M7026m2772
5708h408k7199L0319l3935J7191L3370J6983o7442m1743J1995J5120J6943k1822
5696e8628l4728K0338P0299L3436q0994n7802j253K4873l0775K791O4508j3709
5684f1644K370K1645k6910l2582N8073N6550j0230j4554j4719K1154K2523j5480
$$ plain form
5771 -80797 -40774 -23831 -10502 -30999 -48539 -32634 -91756 -104139 -81141 -47368 -49949 -28304
5759 -28304 -10971 -1942 4355 30956 -13475 -34795 -77073 -60737 -12180 -10133 -16998 -22420 26887
5746 26887 51218 4340 -17776 12515 45777 16483 -14353 -40653 -41817 -29531 -10758 -46422
5734 -46422 -44104 2266 50188 58457 27349 -13966 -8157 -3541 -1492 -15464 -12606 4143 -5405
5721 -5405 -32308 -41177 -74203 -85177 -93261 -24917 11120 -25486 -45040 -46219 -12662 34364 -8408
5708 -8408 -35607 -5288 -39223 -22032 11338 28321 -39121 -80864 -68869 -53749 -36806 -58628
5696 -58628 -93356 -73018 -2719 30717 -50277 -108079 -109332 -84459 -115234 -112443 -47935 -61644
5684 -61644 -59274 -37629 -64539 -97121 -39048 17502 7272 -7282 -22001 -847 21676 6196
5672F196n53j8379k1948L4999N5789K9416k6154o3949o5818M2619J173N871j0219
5659c0957j0189k1242K3340M3885n1994k3215l140J3835L1393j3767l060K9606
5647a5505q874K140M081R981m5255o3257M968M2157k0808Q383J0143O1566Q3471
5634G3191K6120J3226j8291l0916J8105j6497k2418o096P748p5373L917J4954
5622a2330M4643O3443M118L2306m0819k7499j6571l0416m2216l0086J7637K5406
5610a2384K1853L7502K3781n1111j2575M2543J1300q1892k4888K9373P873j5238
5598b3863L2855P317Q828K7299Q463j4485j3284n161l9428n2997m5278k0849L1325
5585i9258O8098L4479J0960K1441K2619j8174o4404R661j1546k2230J9497O4248
$$ plain form
5672 6196 5643 -12736 -34684 315 56104 85520 59366 -4583 -70401 -27782 -26609 -20738 -30957
5659 -30957 -41146 -62388 -39048 4837 -47157 -70372 -73512 -59677 -28284 -42051 -45111 -15505
5647 -15505 -24379 -22239 -18158 -8177 -53432 -116689 -111721 -69564 -90372 -81989 -71846 -10280 73191
5634 73191 99311 112537 94246 63330 81435 64938 42520 36424 44172 -31201 -27284 -12330
5622 -12330 32313 95756 99874 132180 91361 63862 47291 16875 -25341 -55427 -37790 -12384
5610 -12384 9469 46971 70752 19641 7066 49609 60909 -20983 -45871 -16498 -8625 -23863
5598 -23863 8992 16309 25137 52436 60899 46414 33130 27969 -11459 -64456 -109734 -130583 -99258
5585 -99258 -31160 3319 14279 35720 58339 40165 -24239 -14578 -26124 -48354 -28857 35391
5573C5391L2754m4983l2602l9366l7778j7589j9074J4487L2069N6116k0911j3051
5561e4537j8971q009j2803M2350P0277K0519k2652l4203J8005j5228l5111j091
5549e1454l6837J2648j1914K5648P4474L2082l3445j9745K0124k782j1606J937
5537h70j4226k1744J9850p13M619j2952l0424K4272K2844j6285m4533n5006M9263
5524g5905N7728J8838O0163K4201j3007j7745j4904j2807j5463J3009l2684J6237
5512G661J3503M7L6130K803n9020j2478j0179l4882p607l9989q45J255K1548J3444
5498f8609k3219K472j8813J2795M8903M627j152K1755J15K9826L5243k8574J4690
5485C0059l694J1961P5099K487m9232m8347Q011k9150j4563J9852k909R748j493
$$ plain form
5573 35391 68145 23162 -9440 -48806 -86584 -104173 -123247 -108760 -76691 -20575 -41486 -54537
5561 -54537 -73508 -81517 -94320 -51970 18307 38826 16174 -18029 -24 -15252 -50363 -51454
5549 -51454 -88291 -75643 -87557 -61909 12565 44647 11202 -8543 11581 8799 -2807 -870
5537 -870 -15096 -36840 -16990 -17703 -13084 -26036 -56460 -32188 -9344 -25629 -70162 -125168 -75905
5524 -75905 -18177 661 60824 85025 72018 54273 39369 26562 11099 24108 -8576 7661
5512 7661 21164 21211 57341 60144 1124 -11354 -21533 -56415 -64022 -104011 -104856 -103601 -82053 -68609
5498 -68609 -91828 -89356 -108169 -95374 -46471 -41844 -42996 -21241 -21126 8700 43943 15369 30059
5485 30059 26365 38326 113425 115912 66680 18333 26344 -2806 -17369 2483 -426 9322 7829
5472G829J763r982l7124m5516n977J2842K0486M1304L8445j8634M046m090j6817
5459a1425J2086K3161n6000m9765J6806N2939M7679L617J6352N946l6586n9794
5447c4984J5795q59K7286J8991m100j6669n0939l1040J4627M1245J3996J4027
5435G376o145j2528K8200k6501l8310k8260n552J0101J8404O9366K2987J9586
5423E8724j8216n1410n2893m991M8230j6650J7702M8656j6112j8087j6751J538
5411b0260J7274K4729r198l5746J4608J6818J7603n990m8500J5808J1695L2296
5399C1137P726J1483J0641j8486m9645j7694p225K7309L5202m1244L373K039M0262
5386C4878L713j2150k8826j7327K4245p448j2120j6599L113j7853l6048L4898
$$ plain form
5472 7829 9592 -390 -37514 -83030 -89007 -76165 -55679 -14375 24070 5436 9482 5392 -11425
5459 -11425 661 23822 -32178 -81943 -65137 -12198 35481 39098 55450 61396 24810 -34984
5447 -34984 -19189 -20048 7238 26229 22129 5460 -45479 -76519 -61892 -20647 -6651 7376
5435 7376 1231 -11297 16903 -9598 -47908 -76168 -81720 -71619 -53215 16151 39138 58724
5423 58724 40508 -10902 -63795 -68786 -20556 -37206 -19504 29152 13040 -5047 -21798 -20260
5411 -20260 -2986 21743 12545 -23201 -8593 8225 25828 19838 -28662 -12854 -1159 31137
5399 31137 38863 50346 60987 42501 -7144 -24838 -32063 -4754 30448 -10796 -7423 -5384 34878
5386 34878 38591 26441 -2385 -19712 4533 -2915 -15035 -31634 -28521 -46374 -82422 -47524
5374d7524Q117M2218M0175k0190J452j2596N141k8676l093K0153k022l7086k8531
5361f2462N271J8715Q146J401J1895p039K429J1031K9707l5519j0455J7756J2161
5348C037Q220J9854L735p987K743K687m0159k5798K3354j283j6795m1922L653
5335f6661o643l9676J0938L7318K4095P16N8890J2334j01344j986J24305J7737
5323G0023o6466n2834J6556L1441n5169o8934K8056M2943m557Q089J8347L700
5311b8805r440q500L0646N5393M3304J4823J609j5190m4719J2847m2708J2339
5299B1599J2729l149M2697j3913m742k3392q711K5973m7507k5648P16l6601k8430
5286h8379L9186M716j4512l7694P9958Q9931m9467q4074J4135M1939K3755l0269
$$ plain form
5374 -47524 -39407 2811 42986 22796 24248 11652 16793 -11883 -14976 5177 3155 -33931 -62462
5361 -62462 -57191 -38476 -30330 -28929 -17034 -24073 -21644 -10613 19094 -16425 -26880 -9124 3037
5348 3037 11257 31111 34846 26859 29602 32289 -7870 -33668 -10314 -11597 -28392 -70314 -66661
5335 -66661 -73304 -112980 -102042 -64724 -40629 -39913 18977 31311 -70033 -72019 52286 70023
5323 70023 3557 -49277 -32721 -1280 -56449 -125383 -97327 -54384 -58941 -50852 -32505 -28805
5311 -28805 -38245 -46745 -16099 39294 82598 97421 99030 83840 39121 51968 9260 21599
5299 21599 34328 31179 73876 59963 55221 31829 23118 49091 1584 -24064 -23348 -59949 -88379
5286 -88379 -49193 -44477 -58989 -96683 -16725 73206 23739 -60335 -46200 -4261 19494 -10775
5274a0775k1979M1801j4323K008L0992P109p2073j0763K1897o096J8025j2243
5262b6420p0232M1317O8678O9591j2269p650J5061K4273m6520q9712l4136m009
5250g2028M0156L9952k5652n9848o5144L9827N2222L2024L2565m3277k0958l9375
5238h9536l7438L6684J3997l292L4938m4865p867M6594K5963k9620Q3170L8978
5226F7706k0016K7629K6474j3601l5003l0677J3672M8965N876l4173k8076l7575
5214h799L6228Q1055r704j7433k9122m8728l9448L8377Q4434N830m3242O99Q496
5201E8643k0511p5636j7704K0700j7905m1813K9353M6015j2062N706k8911K9550
5189b4575N7230J2174k6266j6888k8503K119L6368j4013j399P976q803j0784j4945
$$ plain form
5274 -10775 -32754 9047 -5276 -3268 27724 34833 -37240 -48003 -26106 -32202 -14177 -26420
5262 -26420 -96652 -55335 13343 82934 70665 63015 78076 102349 55829 -33883 -68019 -72028
5250 -72028 -31872 8080 -17572 -77420 -142564 -102737 -50515 -18491 14074 -29203 -50161 -89536
5238 -89536 -126974 -90290 -76293 -79585 -44647 -89512 -97379 -50785 -24822 -54442 28728 67706
5226 67706 47690 75319 101793 88192 53189 22512 36184 85149 91025 56852 28776 -8799
5214 -8799 27429 108484 98780 81347 52225 3497 -35951 2426 86860 92690 49448 50147 58643
5201 58643 38132 -37504 -55208 -34508 -52413 -94226 -64873 -18858 -30920 -25214 -54125 -24575
5189 -24575 32655 44829 18563 1675 -26828 -24709 11659 -2354 -3753 4223 -4580 -15364 -30309
5176c0309j9234k3711M2897J8643k2187o736M8921o887l0845L2881K3344m1314
5164a4537J0192L3365q623l5464L2385J3464l094K2749j1160l866n6940p778J5042
5151a4265r441L9332j1228l8303J7092j0777j7757p256J2474k2603k4222J0637
5139g6317j8850k5606j369M0473j4353N389L8410K6817K3472m749j0885k810M9692
5126B9314L2783J2641l8076j534J3552L2055P598n8071j3228l1690m0879J4734
5114d0801M7846P0541m7914n6014J4344K3136n6064o700Q786M7116q210M086Q391
5101H543O9380O963j8370l3161j9689l3688j9214o144K3463O156K3436L323j516
5088I482M1885j2505l8297j9872j4584N43L5011q761k393Q062l4364M7201k74
$$ plain form
5176 -30309 -49543 -73254 -30357 -11714 -33901 -40637 8284 1397 -29448 3433 26777 -14537
5164 -14537 -4345 29020 20397 -15067 17318 30782 27688 50437 39277 35411 -21529 -29307 -14265
5151 -14265 -23706 15626 4398 -33905 -16813 -27590 -45347 -52603 -40129 -62732 -86954 -76317
5139 -76317 -95167 -120773 -122142 -81669 -96022 -90633 -52223 -25406 -1934 -6683 -17568 -20378 29314
5126 29314 62097 74738 36662 35128 48680 80735 88333 30262 17034 -14656 -55535 -40801
5114 -40801 7045 77586 29672 -26342 -11998 11138 -44926 -51626 -42840 4276 -3934 152 8543
5101 8543 77923 84886 66516 33355 13666 -20022 -39236 -45380 -21917 -15761 7675 10998 9482
5088 9482 51367 38862 565 -19307 -33891 -33348 1663 -7098 -9491 -1429 -35793 11408 11134
5075A1134q4083j5118Q4738M5205J2396R51K3737J6303j3854m8879o5713j654
5063c4837K1454l1062L579J1906l1256L2629L9326n663k8394P264j61J3420K2019
5050B0224K8466J4871m2900q981M595M193l3728q5874j2963P7565N2993j5036
5038C425J9453o785l1196k4515l2616Q313P7244m736m6682L7428k2355q560J5025
5025a6557K3142j296k905m6200K3382L56n8995p860K3678K6147M275L355j6776
5012d6254k0097J3211Q605O1939k4938j26047Q570L0217O970N2056O6278J6534
5000D7044n0335n1368N224J7461j3524j0545M6940L3319M1884l4837k8862Q278
4988A0679n4272l8131L6960P8691O7760j7908m3538r186J735M917o327Q679j7787
$$ plain form
5075 11134 -72949 -88067 -3329 41876 54272 55223 78960 95263 81409 32530 -33183 -34837
5063 -34837 -13383 -44445 -40866 -28960 -60216 -27587 11739 6076 -22318 -15054 -15215 -1795 20224
5050 20224 48690 63561 20661 11680 16275 20468 -13260 -99134 -112097 -34532 18461 3425
5038 3425 22878 16093 -15103 -39618 -72234 -63921 13323 8587 -38095 -667 -23022 -31582 -16557
5025 -16557 6585 5289 2384 -43816 -20434 -20078 -79073 -86933 -63255 -37108 -32833 -29478 -46254
5012 -46254 -66351 -53140 -44535 17404 -7534 -133581 -125011 -94794 -87824 -35768 30510 47044
5000 47044 -3291 -54659 -49435 -31974 -45498 -56043 -9103 24216 66100 31263 2401 10679
4988 10679 -43593 -81724 -44764 33927 101687 83779 40241 31055 32790 37707 31380 40059 22272
4975B2272j872j5060q258l7464j8039J8151N060K5540o404J604j3151j148k0307
4962d9076j7478J7755j6126m6959K3720K2166J7938J1142L6422r656l7082k3267
4950g0501L6025p0428j2663l0395L7437k254m360M443J9179J2919q385j3623Q459
4937i4147J4240J3094L590K4948K8283k3667n46M4223M9691m6177j0981P194j1516
4924a771J9400m5345k4399K3773n1370J8656M4719j1017N158O2274J228l3876
4912G430l4584K1635K1531J3022J5826o483j6509k5429k8135K6324M4881K2614
4900F2123o0701k8831l9906m447j778L4750K8761P334J9406O173p63J1332j7305
4887A6148m2376q2174L2908L6710J407N5980N4293k934n6536l2490r784M7051
$$ plain form
4975 22272 20400 5340 -2918 -40382 -58421 -40270 -35210 -9670 -16074 -14470 -27621 -28769 -49076
4962 -49076 -66554 -48799 -64925 -111884 -88164 -65998 -48060 -36918 -496 -10152 -47234 -70501
4950 -70501 -34476 -104904 -117567 -147962 -110525 -112779 -117139 -112696 -93517 -80598 -88983 -102606 -94147
4937 -94147 -79907 -66813 -63223 -38275 -9992 -33659 -34205 10018 59709 13532 2551 9745 -1771
4924 -1771 17629 -27716 -52115 -28342 -79712 -61056 -16337 -27354 -22196 40078 41306 7430
4912 7430 -27154 -5519 16012 29034 44860 38377 21868 -3561 -31696 -5372 39509 62123
4900 62123 1422 -27409 -67315 -71762 -73540 -38790 -10029 -2695 16711 22884 22121 33453 16148
4887 16148 -26228 -108402 -75494 -38784 -37377 18603 72896 69962 13426 -19064 -28848 18203
4875A8203N2887n5909j5525J0050k2637K4732L4912L5301m2781k6658J5765O3088
4863I1428m3091j03669m5412O6630P0003q193J5540l8590j6841K4081J0780L2976
4851E5642m6861r917J1037l7192j8296J6940J0446O2210Q2240m2128r4848k5318
4839c6045L3712N0993J7271k2780m2482q439j5490l3130J9N1469k4342j7727L331
4826d3640m71P0487K9861k6701k7814J715Q454J2184p266P044n2949j0006L0654
4813h448L9126P8818J2374o3328k3132j532K893n758l8648K299N176O657J093
4800G590P474k4396M029J5598J686k5097M1237O4809k0951n2828j1413l473o994
4787b729L5341L4360l4568r982j5102l5864n143L731L9732L3360m3706J3527L0998
$$ plain form
4875 18203 71090 15181 -344 9706 -12931 11801 46713 82014 39233 12575 28340 91428
4863 91428 48337 -55332 -100744 -34114 35889 27696 43236 4646 -12195 11886 22666 55642
4851 55642 8781 -1136 9901 -27291 -45587 -28647 -18201 44009 126249 84121 -10727 -36045
4839 -36045 -2333 48660 65931 43151 669 -7770 -23260 -56390 -56371 -4902 -29244 -46971 -43640
4826 -43640 -44111 26376 56237 29536 1722 3437 11891 24075 16809 23853 -29096 -39102 -8448
4813 -8448 30678 109496 121870 58542 35410 33878 36771 31013 -7635 -5336 -160 6497 7590
4800 7590 15064 -9332 -5303 10295 11981 -13116 28121 92930 71979 19151 7738 4265 -2729
4787 -2729 32612 66972 32404 22422 7320 -28544 -33687 -29956 9776 43136 -570 12957 43955
4774D3955j2315l6211M1878L7055k1783l3173L1235M869k9400k5695m0244o1400
4762a01229O9813P056j7467K2173K0771N873l5404o381m173K3769K0278Q7705
4750I2784j5564q874J3985j8356o247k105J7549l0027o2954L3271L7764m7264
4738C962l5988R452P046o1540j4773J0387K0479M7782N8818J7260r774L804j3873
4725D3042o2705j3768k6042N32l383k481L0356m896L075O165L0911M1865o953
4712C5718n4394o9248Q320O9177L2563Q672K4068K8706k4223m7585l9979J6898
4700a1307J9172L3934n810j4610M514j589n293k937N898l792k928K9189P7504
4687A21945m9151m4863r942K178l8865k0999L823p93m518k0205J1432n6073J0372
$$ plain form
4774 43955 31640 -4571 37307 74362 52579 19406 50641 55510 26110 415 -39829 -101229
4762 -101229 -31416 -24360 -41827 -19654 1117 6990 -28414 -34795 -38968 -15199 5079 92784
4750 92784 77220 68346 82331 63975 57728 55623 73172 43145 -19809 13462 51226 3962
4738 3962 -32026 -22574 -15528 -77068 -91841 -81454 -60975 -13193 45625 62885 53111 56915 43042
4725 43042 -19663 -33431 -59473 -58941 -62324 -64805 -34449 -39345 -36270 -30105 806 42671 35718
4712 35718 -18676 -87924 -79604 -10427 22136 30808 54876 83582 59359 11774 -28205 -11307
4700 -11307 7865 41799 35989 21379 25893 24304 19011 16074 21972 18180 15252 44441 121945
4687 121945 72794 27931 17989 20167 -18698 -39697 -35874 -36667 -41185 -61390 -49958 -106031 -95659
4674i5659P1209N215k0050P207k5771j6553j98M2220L7428j5938j5292K7262L9458
4661D0538q360k5768j8369Q418L1353J2720l6613o8256o2617K4277L0509J7501
4649e4667P886J8714M8828n9077n2090P399M5004m174M257L174K2589K479k7659
4636c7337K7428q103j270K1125J0453m5706p238J2608M1039L1468Q766K2655o537
4623F9351n601Q265l7897J2829l9626r616n087M3184M6506j0813j5317j2020m5139
4610i81o4900J0785N0983j5832q853j8604L046N926l1567k6460J5301o874M3440
$$ plain form
4674 -95659 -24450 -19235 -39285 -32078 -57849 -74402 -74600 -32380 5048 -10890 -26182 1080 40538
4661 40538 32178 6410 -11959 -3541 27812 40532 3919 -64337 -126954 -102677 -72168 -54667
4649 -54667 -46781 -28067 20761 -38316 -90406 -83007 -38003 -42177 -37920 -34746 -12157 -9678 -37337
4636 -37337 -9909 -18012 -19282 1843 12296 -33410 -40648 -28040 12999 44467 53233 75888 69351
4623 69351 63750 72015 34118 46947 7321 -2295 -7382 35802 82308 71495 56178 44158 -981
4610 -981 -65881 -55096 -4113 -19945 -28798 -47402 -44356 -38430 -69997 -96457 -81156 -88030 -44590
$$ [...]
##END NTUPLES=NMR SPECTRUM
##END=
