##TITLE=Analysis number 329391
Compound Code cc 59023
Book Reference 546/18
Project Code adrs
Chemist Name craigr
##JCAMPDX= 6.0         $$ Bruker NMR JCAMP-DX V2.0
##DATA TYPE= NMR SPECTRUM
##DATA CLASS= NTUPLES
##ORIGIN= Bruker BioSpin GmbH
##OWNER= nmr
$$ XWIN-NMR		Version 3.5
$$ Tue Aug 28 12:03:04 2007 GMT Daylight Time (UT+1h)  MAYBRIDGE\nmr@NMR_250MHZ
##.OBSERVE FREQUENCY= 250.131544655141
##.OBSERVE NUCLEUS= ^1H
##.ACQUISITION MODE= SIMULTANEOUS (DQD)
##.ACQUISITION SCHEME= undefined
##.AVERAGES= 16
##.DIGITISER RES= 18
##SPECTROMETER/DATA SYSTEM= dpx250
##.PULSE SEQUENCE= zg30
##.SOLVENT NAME= CDCl3
##.SHIFT REFERENCE= (INTERNAL, CDCl3, 0, 16.522)
##AUDIT TRAIL= $$ (NUMBER, WHEN, WHO, WHERE, WHAT)
$$ ##TITLE= Audit trail, XWIN-NMR		Version 3.5
$$ ##JCAMPDX= 5.01
$$ ##ORIGIN= Bruker BioSpin GmbH
$$ ##OWNER= nmr
$$ C:\u/data/dgb/nmr/ADRS/1150/pdata/1/auditp.txt
$$ ##AUDIT TRAIL=  $$ (NUMBER, WHEN, WHO, WHERE, WHAT)
(   1,<2007-08-28 12:01:33.73 +100>,<MAYBRIDGE\nmr>,<NMR_250MHZ>,
      <created by zg, POWCHK disabled, PULCHK disabled
       configuration hash MD5:
       76 6E 9A 78 1E 09 19 81 EC 84 63 8F B0 6A 59 2D
       data hash MD5: 64K
       6D 92 97 31 AE 78 2C 47 45 D8 7A C7 A6 8C 79 AB>)
(   2,<2007-08-28 12:02:04.40 +100>,<MAYBRIDGE\nmr>,<NMR_250MHZ>,
      <Start of raw data processing
       ef LB = 0.3 FT_mod = 6 PKNL = 1 SI = 32K 
       data hash MD5: 32K
       27 CB 84 98 A8 25 ED DA F7 50 08 F8 26 9A 00 8C>)
(   3,<2007-08-28 12:02:09.84 +100>,<MAYBRIDGE\nmr>,<NMR_250MHZ>,
      <apk 
       data hash MD5: 32K
       4E 24 D2 E8 BB 01 5F CB 6F A5 03 82 8D 29 1B AE>)
(   4,<2007-08-28 12:02:15.26 +100>,<MAYBRIDGE\nmr>,<NMR_250MHZ>,
      <abs ABSG = 5 
       data hash MD5: 32K
       34 5A DD 11 1F D4 33 CE 56 33 73 E9 FF 5C 12 4F>)
$$ ##END=
$$ 
$$ hash MD5
$$ 36 89 2E CC 8F E3 B7 18 1F A6 E4 3C 4E B1 75 69
##$RELAX= 
##$RELAX= 
##$RELAX= 
##$RELAX= 
##$RELAX= 
##$RELAX= 
##$RELAX= 
$$ Bruker specific parameters
$$ --------------------------
##$DU= <C:\u>
##$EXPNO= 1150
##$NAME= <ADRS>
##$PROCNO= 1
##$TYPE= <nmr>
##$USER= <dgb>
##$AMP= (0..31)
100 100 100 100 100 100 100 100 100 100 100 100 100 100 100 100 100 100 
100 100 100 100 100 100 100 100 100 100 100 100 100 100 
##$AQSEQ= 0
##$AQ_mod= 3
##$AUNM= <au_zg>
##$AUTOPOS= <32 >
##$BF1= 250.13
##$BF2= 250.13
##$BF3= 250.13
##$BF4= 250.13
##$BF5= 500.13
##$BF6= 500.13
##$BF7= 500.13
##$BF8= 500.13
##$BYTORDA= 1
##$CFDGTYP= 0
##$CFRGTYP= 5
##$CHEMSTR= <none>
##$CNST= (0..31)
1 1 145 1 1 1 1 1 1 1 1 1 1 1 1 1 1 1 1 1 1 1 1 1 1 1 1 1 1 1 1 1 
##$CPDPRG= <>
##$CPDPRG1= <>
##$CPDPRG2= <>
##$CPDPRG3= <>
##$CPDPRG4= <mlev>
##$CPDPRG5= <mlev>
##$CPDPRG6= <mlev>
##$CPDPRG7= <mlev>
##$CPDPRG8= <mlev>
##$CPDPRGB= <>
##$CPDPRGT= <>
##$D= (0..31)
0 1 0 0 0 0 0 0 0 0.06 0 0 0 0 0 0 0.0002 0 0 0 0 0 0 0 0 0 0 0 0 0 0 
0 
##$DATE= 1188298890
##$DBL= (0..7)
120 120 120 120 120 120 120 120 
##$DBP= (0..7)
150 150 150 150 150 150 150 150 
##$DBP07= 0
##$DBPNAM0= <>
##$DBPNAM1= <>
$$ [...]
##$SUBNAM7= <"">
##$SUBNAM8= <"">
##$SUBNAM9= <"">
##$SW= 20.6930455092707
##$SWIBOX= (0..15)
0 0 3 0 0 0 0 0 0 0 0 0 0 0 0 0 
##$SW_h= 5175.983436853
##$TD= 65536
##$TD0= 1
##$TE= 296.16
##$TE2= 300
##$TE3= 300
##$TEG= 300
##$TL= (0..7)
0 120 120 120 120 120 120 120 
##$TP= (0..7)
150 150 150 150 150 150 150 150 
##$TP07= 0
##$TPNAME0= <>
##$TPNAME1= <>
##$TPNAME2= <>
##$TPNAME3= <>
##$TPNAME4= <>
##$TPNAME5= <>
##$TPNAME6= <>
##$TPNAME7= <>
##$TPOAL= (0..7)
0.5 0.5 0.5 0.5 0.5 0.5 0.5 0.5 
##$TPOFFS= (0..7)
0 0 0 0 0 0 0 0 
##$TUNHIN= 0
##$TUNHOUT= 0
##$TUNXOUT= 0
##$USERA1= <user>
##$USERA2= <user>
##$USERA3= <user>
##$USERA4= <user>
##$USERA5= <user>
##$V9= 5
##$VALIST= <valist>
##$VCLIST= <CCCCCCCCCCCCCCC>
##$VD= 0
##$VDLIST= <DDDDDDDDDDDDDDD>
##$VPLIST= <PPPPPPPPPPPPPPP>
##$VTLIST= <TTTTTTTTTTTTTTT>
##$WBST= 1024
##$WBSW= 4
##$XGAIN= (0..3)
0 0 0 0 
##$XL= 0
##$YL= 0
##$YMAX_a= 357198
##$YMIN_a= -427531
##$ZGOPTNS= <>
##$ZL1= 120
##$ZL2= 120
##$ZL3= 120
##$ZL4= 120
##$ABSF1= 16.522
##$ABSF2= -4.171173
##$ABSG= 5
##$ABSL= 3
##$ALPHA= 0
##$AQORDER= 0
##$ASSFAC= 0
##$ASSFACI= 0
##$ASSFACX= 0
##$ASSWID= 0
##$AUNMP= <proc_1d>
##$AZFE= 0.1
##$AZFW= 0.1
##$BCFW= 0
##$BC_mod= 0
##$BYTORDP= 0
##$COROFFS= 0
##$CY= 12.5
##$DATMOD= 1
##$DC= 0
##$DFILT= <>
##$DTYPP= 0
##$F1P= 14.0000005364418
##$F2P= -0.99999901652339
##$FCOR= 0.5
##$FTSIZE= 32768
##$FT_mod= 6
##$GAMMA= 0
##$GB= 0
##$INTBC= 1
##$INTSCL= 1
##$ISEN= 128
##$LB= 0.3
##$LEV0= 0
##$LPBIN= 0
##$MAXI= 10000
##$MC2= 0
##$MEAN= 0
##$ME_mod= 0
##$MI= 0
##$NCOEF= 0
##$NC_proc= -4
##$NLEV= 6
##$NOISF1= 0
##$NOISF2= 0
##$NSP= 0
##$NTH_PI= 0
##$NZP= 0
##$OFFSET= 16.522
##$PC= 1
##$PHC0= -40.7018
##$PHC1= 3.622314
##$PH_mod= 1
##$PKNL= yes
##$PPARMOD= 0
##$PSCAL= 4
##$PSIGN= 0
##$REVERSE= no
##$SF= 250.13
##$SI= 32768
##$SIGF1= 0
##$SIGF2= 0
##$SINO= 400
##$SIOLD= 32768
##$SREGLST= <1H.CDCl3>
##$SSB= 0
##$STSI= 32768
##$STSR= 0
##$SW_p= 5175.98343685301
##$SYMM= 0
##$S_DEV= 0
##$TDeff= 65536
##$TDoff= 0
##$TI= <Analysis number 999999
Compound Code 99
Book Reference 9
Project Code 9>
##$TILT= no
##$TM1= 0
##$TM2= 0
##$TOPLEV= 0
##$USERP1= <user>
##$USERP2= <user>
##$USERP3= <user>
##$USERP4= <user>
##$USERP5= <user>
##$WDW= 1
##$XDIM= 32768
##$YMAX_p= 482783107
##$YMIN_p= -115085
$$ End of Bruker specific parameters
$$ ---------------------------------
##NTUPLES= NMR SPECTRUM
##VAR_NAME=  FREQUENCY,     SPECTRUM/REAL,   SPECTRUM/IMAG
##SYMBOL=    X,             R,               I
##VAR_TYPE=  INDEPENDENT,   DEPENDENT,       DEPENDENT
##VAR_FORM=  AFFN,          ASDF,            ASDF
##VAR_DIM=   32768,         32768,           32768
##UNITS=     HZ,            ARBITRARY UNITS, ARBITRARY UNITS
##FACTOR=    0.157963299565203, 1,           1
##FIRST=     4132.6476996994, 0,             0
##LAST=      -1043.33573715361, 0,           0
##MIN=       -1043.33573715361, -115085,     0
##MAX=       4132.6476996994, 482783107,     0
$$ Real data points
##PAGE= N=1
##DATA TABLE= (X++(R..R)), XYDATA
$$ [...]
20248 8647 8501 -34121 -33366 -21514 -16372 -35135 -35835 -23534 -23919 508 -12388 -6331 -3644 6789
20234 6789 24229 -10755 -35124 -15868 -18821 -20455 -7123 -17921 -10492 17399 28322 22655 20940
20221 20940 -3718 -15971 -5494 5103 5216 -8487 -6671 -32788 -51181 -4234 19230 28981
20209 28981 66517 64609 40859 31439 53282 58072 18034 -12377 -4205 -17249 -24019 -32882 -1456
20196 -1456 3614 6594 -904 -5516 -25845 -20235 -27643 -47990 -60542 -51893 -20484 -35015 -31602
20183 -31602 -14077 7494 3540 -17360 -15842 -960 -20283 -19021 -11527 -20931 -23236 -20396 -22394
20170 -22394 -22639 -14679 -8185 -29424 -31405 -32659 -44897 -44198 -38668 -22086 -24764 4546 933 -30839
20156 -30839 -42078 -29656 -18393 -12372 -20288 -34725 -44562 -14323 15032 12589 -14130 10813
20144 10813 19638 8055 13078 18717 33117 14089 -30520 -46215 -45444 -48053 -27991 -25746 1781
20131 1781 -10008 -6602 122 -3062 14476 29265 37772 19366 -3332 -18309 -32225 -35520 -17999
20118 -17999 -18306 -11231 -3728 -1523 -19475 -48444 -32199 -30878 -8311 4696 -12860 -13653 5552
20105 5552 -21234 -28908 -11555 -15286 -32279 -22732 14199 25703 4486 -24056 -29646 -53842 -36629
20092 -36629 -29210 -45131 -42989 -47130 -46819 10681 28341 13506 13570 16431 3962 -7041 29922
20079 29922 33637 7691 -45 -10947 -6934 10185 20760 14782 -15027 -33919 -41922 -13550 3789
20066 3789 16068 48923 41431 17828 20858 6548 7109 20363 33193 58257 56215 34350 14053
20053 14053 1452 -20787 -4329 -7184 -21827 -10158 -16227 -49752 -56107 -30357 -3426 17177
20041 17177 8924 24004 12864 -5385 -13708 -21956 -36624 -43776 -28796 -26965 -17081 11112 30092
20028 30092 24882 32876 50459 39500 1408 -7146 15452 41783 54511 62997 64845 37626 24301
20015 24301 19494 31469 42457 25153 21461 23027 40634 49517 36945 22108 -4777 -25655
20003 -25655 -39917 -30329 -17819 -704 13409 28724 29565 22516 14947 27090 26074 4807 -21617
19990 -21617 -15487 -26656 -50077 -45321 -36049 -53679 -56910 -30191 -216 -2981 -18983 -31301 -15986
19977 -15986 -7487 -21760 -41758 -27690 -19359 2669 -9582 -21283 -13609 -2466 -22267 -32492
19965 -32492 -5906 24778 3594 7725 18833 35544 32364 -1171 2912 11387 20936 24194 3788
19952 3788 -2985 -16137 -14755 -21770 -24245 -25181 -44839 -33514 -18755 7979 18845 -11360 -16824
19939 -16824 -22778 -8474 22536 36643 51758 48494 59475 67797 71687 118480 170638 197939
19927 197939 276543 361830 394066 428246 517629 594378 610396 555558 482409 455132 429234
19916 429234 339637 260291 216179 214218 212591 165118 150969 145459 108896 60863 30119 40744
19904 40744 38065 30826 11953 16667 25421 15768 9910 19070 -1715 10872 12834 3706 -19306
19891 -19306 -26939 -13904 -11650 -7934 -38288 -49084 -40584 -7219 9297 -6121 -15342 -2585 -4090
19878 -4090 7346 8262 1560 18646 34497 40994 55612 58398 23804 22713 28250 26280 22436 -4117
19864 -4117 -1863 27437 26301 14886 22403 22637 7050 27621 28637 14970 39823 68494 50818
19851 50818 38130 51429 55943 58676 110601 162770 228379 312092 391952 460874 517022 597911
19839 597911 671019 693402 656213 575205 502748 447593 354115 242652 202060 167796 138897
19828 138897 102401 90432 70507 53235 46814 24095 24095 19998 25806 14652 7055 15534 326
19815 326 -26582 -47790 -60698 -24568 -388 26265 13104 -6956 29884 53293 55124 44137
19803 44137 39121 39161 29471 36882 51387 24177 27064 34499 38332 31225 40043 63396 71918 78876
19789 78876 122472 152897 172771 210736 231918 271842 344321 412251 492828 533749 548581 577044
19777 577044 578906 557494 519823 485082 448044 425578 375300 297537 233491 191144 155342 138030
19765 138030 90414 55209 24876 19020 26777 21192 18376 21031 20232 26952 36275 30604 42118
19752 42118 39576 21082 14778 24844 21168 14801 16294 10966 9777 36251 70437 67062 48991
19739 48991 36373 50376 73139 98834 74365 37418 48065 62637 69795 64885 52778 19448
19727 19448 25823 47479 35222 15388 11999 20854 40210 26012 12531 1041 -36053 -27007
19715 -27007 -23768 -18215 -27068 -41547 -15186 34784 41989 44376 44061 35106 18790 27129 5393
19702 5393 -2407 10056 -1934 -20062 -9207 -3496 -24972 -50303 -74505 -88033 -77341 -54641
19690 -54641 -32995 -17672 -26224 -35830 -14640 -2848 -933 12034 -4277 -18233 -19562 -31572
19678 -31572 -27919 -7999 -22331 -8970 13063 21092 41310 40030 28177 -3083 -14588 -21607
19666 -21607 -15408 -34508 -59867 -45627 -18691 -7244 -1583 -12384 -22608 -19917 6847 2557
19654 2557 1990 -6605 -41774 -49865 -45900 -29952 -30903 -12333 -30577 -59820 -63120 -63023 -47644 -8142
19640 -8142 10478 15423 14807 2925 -2430 -3783 -15803 -52633 -42043 -59864 -82242 -89024 -82840
19627 -82840 -64697 -54253 -49165 -48460 -51300 -20202 -18565 -3917 12520 18186 34385 64962 30953
19614 30953 37579 58752 77190 55315 48687 64811 61874 55602 50682 25756 35133 41143 -11523
19601 -11523 -22682 -5140 4574 15946 1023 -14966 -5458 -4522 5437 -9469 -13728 -17085 -8263
19588 -8263 26537 41704 29450 651 -10078 -6373 -877 -4213 -4206 21635 21013 -1475 -10764 -14092
19574 -14092 -16742 -31666 -47882 -53932 -51673 -21382 -2240 -6761 3589 -1393 -20112 -28119 12389
19561 12389 39078 33029 11325 -4661 -30227 -49542 -40556 -20771 -16798 -38045 -24662 -24072 -38929
19548 -38929 -34101 -36333 -15730 -3121 7399 14078 45141 48308 51924 65231 49758 -3041 -22506
19535 -22506 -32325 -21448 653 -1991 17046 12898 3679 2299 -16903 -26147 -31478 -51696 -19614
19522 -19614 18424 35724 37115 17461 26936 8765 36050 51607 74727 96545 109340 124575
19510 124575 102520 65548 65419 66265 43391 25080 22889 5792 -28458 -42489 -24149 13286
19498 13286 22659 20174 17492 15354 27429 16089 -2422 -12357 -34920 -35793 -24246 -25611 -25775 -4778
19484 -4778 35850 34049 -5684 -23507 -24381 -64018 -56144 -23009 -35382 -16980 17614 22053 20564
19471 20564 33203 74594 82827 72576 65836 57731 38929 24459 16036 18796 18121 5036 8625
19458 8625 44813 66719 62117 61832 81720 93024 101353 65047 36225 31874 9625 13404 25305
19445 25305 52167 43028 46344 64138 68661 52288 23934 27471 19496 22579 -6672 -20159 -18663
19432 -18663 -9070 1344 -3438 -11511 -12258 -7348 -2940 28033 9385 -22904 -15867 -8074 -22520
19419 -22520 -38762 -45780 -29314 -28827 -37231 -10918 12946 14657 19247 41802 33605 35196 29027
19406 29027 35053 19287 23939 45611 48575 25083 24181 27748 21872 -1358 -14934 -5773 2814
19393 2814 9396 15421 -2993 -3308 14033 21926 30890 47309 38663 9963 -3875 3155 7894 25254
19379 25254 35860 29923 31584 26629 23347 2547 -6468 23971 49089 51594 48267 58622 99582
19366 99582 162522 217452 292434 384765 463241 538251 610691 663490 721635 748461 717354 660829
19354 660829 595287 530742 460179 366309 282098 219757 168889 164885 153029 130110 119081 158221
19342 158221 158421 159134 158515 187114 193947 181187 189111 204179 220292 193680 177014 185160 169996
19329 169996 148413 129862 110640 92868 72284 59354 33398 7685 4031 2560 -11465 -3574
19317 -3574 25040 29862 16434 -19 -27441 -17526 7419 3713 5038 18401 14592 12287 16351
19304 16351 -9926 -19530 17811 42567 20545 20710 48663 72132 86229 108619 125822 141631
19292 141631 166750 182159 180012 178531 152282 145351 151063 167595 174153 178399 199227 196983 183310
19279 183310 157237 151437 156971 148616 130270 135209 161619 202161 221662 217751 218200 209763 219355
19266 219355 246057 245050 257410 249094 240125 268307 280634 283372 302051 299985 312877 334537
19254 334537 342148 375085 434201 491265 529642 576672 619607 699347 797525 891316 992295
19243 992295 1088475 1214347 1399742 1616567 1819896 2032560 2224581 2409219 2578596 2728927
19233 2728927 2863307 2986849 3066167 3101309 3135078 3216652 3338631 3520671 3769342 4090907
19223 4090907 4508528 5133649 5958056 7080243 8632299 10793144 13916339 18353969 24422012
19214 24422012 32133953 41297097 52128263 64961519 78939735 91732972 101817660
19207 101817660 110144805 117006994 119940763 117353028 111162290 103579991 93953647 81366184
19199 81366184 67592506 55072950 44462734 35320354 27524287 21326323 16706173 13357226
19191 13357226 10905904 9100974 7749588 6687537 5873217 5253794 4775604 4445770 4214049
19182 4214049 4016778 3853690 3721549 3623594 3551857 3470068 3369388 3238322 3063216 2878254
19172 2878254 2674805 2506394 2339537 2132925 1910984 1712693 1537535 1405247 1308600 1225881
19162 1225881 1140355 1072218 1050333 1003471 925889 851715 781796 752913 705363 680781 643163
19151 643163 648279 663065 627072 593186 574588 563150 566542 568498 544181 518195 517887 479201
19139 479201 420681 391638 379309 363020 385153 390310 386255 377223 368617 384001 384851 339456 306751
19126 306751 307379 299576 298284 335353 345525 349537 319540 311619 289224 292014 264641 261292 257417
19113 257417 255984 246512 277907 275095 253800 261686 259958 280110 262228 235014 228872 247324 244176
19100 244176 226508 233274 224131 232299 240288 250706 231009 201851 192719 207353 213843 219724 221002
19087 221002 228377 263613 279380 270118 216580 173207 169213 178486 188583 177498 156804 157525 149809
19074 149809 138598 151480 157139 150475 115360 100999 100877 122038 116609 110425 131848 166791 160095
19061 160095 132037 125500 129511 118107 103183 102318 96407 105770 110269 119404 131276 114172 94351
19048 94351 115112 156777 156689 138658 132426 120562 159133 180268 144548 134032 154087 184526
19036 184526 223135 218195 222762 194165 188201 159880 122113 124558 146068 135352 160423 189957
19024 189957 182899 180268 120480 96279 139120 164109 146429 134581 135294 137991 128548 99548 94669
19011 94669 77696 49253 61403 96141 75620 39473 34693 25509 42022 48635 28474 32877
18999 32877 29804 46069 62939 64089 82363 69291 42158 44034 89489 128656 126823 112400
18987 112400 115013 135329 140110 90406 56854 56268 58920 61496 63972 83557 81920 46431 36497
18974 36497 38144 34711 39401 40271 38627 52973 61246 59435 60064 41806 9909 14626 25383 20316
18960 20316 21741 14155 13788 -5260 -18199 4531 8556 20573 40508 49958 51538 72750 89728
18947 89728 83955 96360 102057 93097 77952 55829 70378 84267 90879 93596 81287 72937 67184
18934 67184 72334 63624 70668 79850 66251 54480 50083 53537 48380 48180 83625 110785 92179
18921 92179 100819 128802 146325 163345 232744 265360 278217 263473 256337 260893 227917 198068
18909 198068 176698 131410 105366 120700 83542 55177 43774 15337 32601 26788 24702 22441
18897 22441 25436 7360 -2111 -3378 8895 23857 24602 31544 15101 5555 24170 29281 51849
18884 51849 43928 43722 39999 52801 85084 110776 106469 80077 90762 125016 144268 141201 134229
18871 134229 127223 104168 94661 110513 101963 83420 75713 84398 111156 155093 134619 98606
18859 98606 101787 102663 135554 162505 181388 195131 205488 199156 194580 208194 224110 236670 217429
18846 217429 239646 242881 275424 298697 303966 316511 318468 296217 286060 280647 307999 342396
18834 342396 376940 383768 401022 457401 510754 551315 613817 706211 797418 915056 1087066
18823 1087066 1284125 1524421 1752048 1980778 2188426 2365872 2505640 2577800 2594060 2578033
18813 2578033 2522685 2436524 2359042 2329629 2349415 2396568 2504412 2700442 2952977 3262228
18803 3262228 3676369 4177855 4832767 5731091 6892395 8485606 10750093 14045372 18918277
18794 18918277 25929141 35329780 46967753 61097699 77994929 95463663 109738307
18787 109738307 120816380 130143939 134019356 129394158 120251511 109440396 95006467
18780 95006467 77741521 61665154 48332515 37230352 28193520 21414866 16586289
18773 16586289 13172083 10711204 8900196 7565326 6535773 5751392 5182418 4744567
18765 4744567 4266004 3764671 3400060 3164800 2969397 2838195 2789249 2794376 2839038 2899057
18755 2899057 2936192 2957720 2904172 2807458 2729792 2592554 2375835 2150635 1948539 1735394
18745 1735394 1556803 1386856 1226303 1109786 1037828 950841 855188 799138 752127 740607
18735 740607 723258 702844 661945 588930 570384 562027 551891 546975 537142 535407 513612 475149
18723 475149 465587 455600 437072 413833 421265 441305 407726 388077 376493 358201 343750 343147
18711 343147 330201 343706 381894 377623 366645 353074 339318 308186 276702 270409 300338 298226
18699 298226 297542 293743 264717 244006 244709 254270 243765 230518 210991 221809 204696 181988 213541
18686 213541 244699 251359 257804 253994 244919 249284 212213 202277 214377 230266 241484 241864 226183
18673 226183 235738 231477 231725 228505 236448 230379 229014 218290 210448 228031 229798 202668 171448
18660 171448 159839 165436 155768 148222 145501 162145 182083 176194 152977 144254 144713 151050 144762
18647 144762 169635 182664 190935 176383 164561 163039 172686 163825 165388 171117 210054 253654 275647
18634 275647 318560 403898 436282 449557 523941 630477 685209 703886 691222 660208 643739
18623 643739 591241 544588 492966 455876 392181 326913 280829 247160 206924 145705 144418 158079
18611 158079 154035 156479 153539 153788 159555 121240 87958 79341 94537 122510 137998 150798 136421
18598 136421 128460 140550 168484 158551 137769 139869 126544 108870 91800 77284 84499 76984
18586 76984 65725 72646 55772 60718 55540 26061 43909 49599 63976 61986 43784 83191 101929
18573 101929 95710 89640 81920 77376 88913 113093 111108 94532 64648 79557 107601 116191 118441
18560 118441 104769 89630 82694 89718 73656 71670 59388 44645 35360 57090 93167 63210
18548 63210 40079 44570 38418 37461 27773 49425 59114 65698 49987 31081 49983 70697 62020
18535 62020 77195 78333 84074 91078 83302 74548 75472 65635 55652 39506 42496 65995 69419 46270
18521 46270 55104 65730 42322 44095 60841 28374 11597 18767 15417 28253 37778 41797 38525
18508 38525 27333 20427 26763 51094 65232 63030 50299 44287 64320 60533 55193 57946 45987
18495 45987 49234 66499 70891 45824 23807 38759 40630 38632 55816 72350 51959 25115
18483 25115 3818 9330 5207 3907 13833 9161 10070 44370 85831 95451 63964 34278 21908
18470 21908 36662 43898 61537 39892 25141 23253 43723 42657 63466 44072 28002 53703
18458 53703 51439 62936 76637 52850 49607 67131 40653 38534 41763 44209 72672 105054 75177
18445 75177 79285 86361 115507 149795 146652 152327 193886 195850 209427 239964 238628 242111 215029
18432 215029 179408 162266 165548 158025 152799 135593 105631 84369 63268 50490 56396 55932 62681
18419 62681 82886 54237 51330 30797 46978 38816 50703 53474 21651 -3329 7073 14085
18407 14085 19341 26082 86781 132192 158311 153600 151025 160243 192175 280482 305403 282449 267375
18394 267375 246897 229107 198455 168943 155296 162178 138439 57228 32402 22211 19306 42455
18382 42455 31744 21013 32607 16856 1523 13341 36824 40008 32350 31965 10541 2636 30615
18369 30615 35779 30970 15223 8762 9193 19680 21204 28647 31782 24422 15532 28832 36448 40584
18355 40584 30043 40528 61837 55234 59881 38136 11980 -13275 -2961 -6305 -4946 17456
18343 17456 50960 44355 32367 29119 45930 54058 39083 20515 4915 6201 20221 61862
18331 61862 71433 71349 22187 -13450 -535 6153 5903 26839 66518 55236 31114 16534 4372
18318 4372 17940 34955 13501 19391 31666 20877 30465 20685 15193 36470 35917 35610 30559 31967
18304 31967 55345 46694 24171 10367 6161 33425 48689 24920 11595 14994 25101 20104
18292 20104 -9311 -9920 46283 56884 62630 49450 36689 41644 11120 -13675 8761 18255 -1421
18279 -1421 -28076 -51469 -29401 -1218 13641 341 -4646 23861 38002 49627 42018 1951
18267 1951 -960 16407 27589 47401 69870 43684 25546 23730 42001 45381 38538 36593 34807
18254 34807 30736 9649 -4904 12817 23708 29524 38211 43277 44321 8270 15978 53284 80499
18241 80499 90335 102587 118467 156235 135418 129013 168096 178984 167411 145173 118393 98022
18229 98022 91176 102733 122073 75898 72570 77374 68556 72893 55766 47551 64179 90589 80966
18216 80966 83731 133708 191503 259767 366132 460975 531843 575979 638164 669634 665079 647733
18204 647733 626643 558141 479617 389123 306286 254695 181901 169542 138584 120375 103808
18193 103808 62489 46139 49287 53181 45286 34973 46025 49060 38377 46335 54877 49717 16905
18180 16905 18647 32796 39282 49611 63148 82456 100811 93053 80226 66726 48691 68149
18168 68149 68181 55882 65557 64863 85320 74576 87980 120722 110026 84687 62780 63568 67049
18155 67049 82494 134745 173442 174833 123910 67174 86885 77548 81876 120610 138950 160751
18143 160751 170477 160518 158546 184946 208833 203398 202086 204695 204061 189417 184138 199667 239107
18130 239107 273490 319978 382445 416805 457856 491005 545096 620874 735265 873923 1007073
18119 1007073 1184272 1425571 1751863 2225432 2841336 3790785 5352541 7958893 12586493
18110 12586493 21675498 39024161 63962989 70771870 47739265 26624993 16058216
18103 16058216 10791705 7798952 5887023 4537286 3557105 2847628 2358407 1988008 1672356
18094 1672356 1458078 1270741 1114792 1012570 895191 760948 672935 628942 573498 507214
18084 507214 474342 437736 424948 422133 436665 426362 390123 353713 330069 322138 301626 298203
18072 298203 280705 236914 197031 162859 159200 179726 157081 157515 154056 170423 195864 149854
18060 149854 84111 55376 91455 102960 106318 122466 114196 123068 145280 156225 127979 96728
18048 96728 107945 77788 73638 77625 77654 76767 72684 65562 95925 96586 105684 99180 106424 101852 94322
18033 94322 94276 104234 87807 79125 83248 96457 88771 97181 94260 88590 47109 36347 38733 26115
18019 26115 -1985 -6149 -10764 20998 43013 29288 35315 60582 58510 40229 27077 58219
18007 58219 67370 73281 99223 137894 158575 112705 89673 80738 75036 91901 98339 82210 65051
17994 65051 48511 58425 78874 68736 54325 49444 55058 46789 35898 43510 43794 47289 38327
17981 38327 39568 43906 16689 2299 10815 5662 24870 35016 27335 29325 49019 82740 87231
17968 87231 81317 47036 30719 57512 62387 52224 47717 48705 35472 54670 85786 85234 67455
17955 67455 49538 39493 22863 2288 23125 46532 45950 45654 39197 46319 46496 21599 -21557
17942 -21557 -31906 -40826 -7079 11279 8331 23389 34676 20021 16627 35915 46886 39916
17930 39916 26803 2782 -20710 2098 6267 -2193 -14474 -23701 -33806 -5344 26099 36053
17918 36053 29684 10744 -5379 4379 27992 48486 65682 76459 83680 69464 68414 45598
17906 45598 25509 24778 4584 8677 14815 -1727 12253 50729 58319 68748 33721 17234 28208
17893 28208 47150 7019 24194 63647 38536 24309 24918 52841 35130 22603 16306 36877
17881 36877 40562 24171 4767 -9470 -14498 -15971 -13484 -18983 -7271 -16035 -19206 5721 25383
17868 25383 12001 -83 -15385 -8685 14693 32526 2113 -5958 -1636 13078 33973 37137
17856 37137 46238 36915 26846 39777 32206 18354 22182 9413 20727 19750 -1373 -2317 2143
17843 2143 22940 11732 17653 28422 -4475 -32656 -36882 -4118 7039 -18537 -12108 -25105
17831 -25105 -43367 -32557 -4143 28087 16505 -22058 -37712 5023 3424 -20476 -28267 -7986
17819 -7986 5238 25437 19726 4996 -21017 -10625 11572 -4772 -702 -14493 -2836 31315
17807 31315 22891 22409 31060 -19570 -42201 -36500 -10004 -19557 -34259 -13896 17481 47621 68636
17794 68636 46397 15003 13832 26337 2353 -10990 -10837 -14585 329 12868 -356 -17196
17782 -17196 8471 22053 -293 -24570 -13637 -10508 -33916 -36770 -25250 -16633 -2994 7444
17770 7444 4297 -2632 1970 6539 11320 597 -42115 -34597 -3628 11539 19988 27410 27701 -5598
17756 -5598 -14539 -291 16169 12889 4992 -8311 -29587 -21493 -19651 -32926 -5560 10996 2381
17743 2381 -19525 -5877 -6017 -20275 -47 9060 15397 12868 21780 29586 21251 18098 10761 33826
17729 33826 25887 9534 4722 995 10137 -6524 -12419 -4306 -8403 4640 16808 24907 37039
17716 37039 61669 39189 15333 4891 9853 15625 7718 -3368 28707 50109 29642 3366
17704 3366 20032 15864 -16706 -47555 -47934 -4854 20655 23149 14752 353 -4456 -10928 20666
17691 20666 48138 29893 -14002 -37013 -19469 -19378 -17533 -23275 -37290 -46700 -32493 -2972 -16156
17678 -16156 -38720 -46049 -21279 8797 12981 21234 7019 17870 46020 42776 22303 21636 16100
17665 16100 -1410 -4825 6717 6332 -465 -6482 -8312 13280 30537 19533 7050 9435 6454
17652 6454 -1050 -1841 479 -2392 -17038 -18323 -11649 -34189 -45927 -37889 -23143 -43768 -44248 -19312
17638 -19312 11912 21017 -2499 -22277 -36328 -19186 -3747 -2260 -2239 9325 28307 21658 13871
17625 13871 -5911 -62037 -69003 -63498 -60730 -45823 -34816 -16263 -5748 -4318 -10592 -28995 -25232
17612 -25232 -27090 -47127 -41679 -34982 -12394 11265 -2633 -602 14201 8512 3500 14127 12597
17599 12597 16919 -10168 -46831 -72853 -45077 -13856 -22985 -6634 -15452 -5336 -3960 -38197
17587 -38197 -48175 -45492 -25183 13594 5586 -16114 -9521 -20538 -28389 -32925 8493 22225 19337
17574 19337 19440 -6752 -8550 -19377 -18936 7109 36791 23014 27439 36173 5340 -11052 22078
17561 22078 26891 17563 -6750 15997 -1360 -54313 -61049 -28149 -14505 -18190 -37942 -37120 -43083
17548 -43083 -15057 1305 -13668 -7593 20831 7573 8907 21355 36650 51572 62109 41675
17536 41675 15700 25077 27896 35462 42228 39322 44696 21251 20665 32761 45323 46922 14967
17523 14967 -2792 -22613 -25952 -6826 15530 25479 25124 6978 13389 38545 36284 22312 15334
17510 15334 18020 18927 -2859 -8587 7235 2983 5269 981 -10638 -11930 -8255 -5585 -2596 3062
17496 3062 12432 5406 -7516 -25100 -47403 -34280 -39592 -29683 -19852 -303 1821 -5445 25947
17483 25947 41014 41146 10029 -15737 1854 13983 12818 6459 29470 42253 6697 -21291
17471 -21291 -27575 -18606 -7480 -8117 -14670 -10531 19986 13909 -8003 -9843 -23057 2316 17645
17458 17645 10958 -2633 1953 23146 20648 74 -1506 -20319 -22433 -5980 -22171 -11902 6379
17445 6379 4552 59275 174340 318667 423492 367291 217169 101648 48620 36473 24888
17434 24888 -3862 -1487 3190 -299 47553 52739 22934 13890 31570 41939 36383 24495 11300
17421 11300 -2892 -8895 -14778 -29760 -23697 -11825 -3993 13111 17547 18737 -9622 -34767 -27436
17408 -27436 -10458 130 -2317 -10529 -26240 5078 -15184 -35666 -20418 -23457 -39583 -3887
17396 -3887 6731 -19389 -23733 -24592 -25603 -17762 -18562 -40998 -26179 -29602 -44352 -36063 -23008 -38486
17382 -38486 -34295 374 13206 10983 3468 14467 11417 18816 -2128 -10890 -12742 -19088 -10580
17369 -10580 -710 -16740 -14091 2277 -4951 -3107 14879 29499 16985 3444 8202 12953 8465
17356 8465 -10301 -3580 -16612 -30646 -25918 -8711 -14773 -32088 -17115 13284 36947 44240 53806
17343 53806 46785 28751 12982 21076 36280 25337 13936 -9076 -35763 -40533 -53879 -58121
17331 -58121 -44532 -47188 -62235 -64040 -40541 -35072 -38987 -31061 -26566 -12399 -13050 -3862 -6779 -8188
17317 -8188 -3402 18893 34371 7743 13639 37927 47514 39272 28215 7911 -3178 -91 15538
17304 15538 25713 36329 16658 140 12903 29410 26576 36600 26388 -17286 -17291 -22369 -22004
17291 -22004 -14823 -18839 -39264 -35453 -18563 1440 13251 1222 -29993 -22207 21549 60537
17279 60537 41911 24666 19302 16518 -9079 -19717 -22148 -31798 -8365 10497 9962 9645 -11524
17266 -11524 -1071 36590 37368 32254 12020 -1986 -3988 2230 1670 386 -7470 -19833 -22790 -35507
17252 -35507 -19800 8824 19458 8532 1809 23301 19168 16525 35226 26809 -12291 -21853 -17750
17239 -17750 -16082 -11169 -18913 -48524 -44746 -13636 34449 47394 31969 33624 43781 19605 10709
17226 10709 26995 36463 16073 16829 11969 7010 -23518 -10113 7719 -8610 -32611 -13012 9092
17213 9092 19489 20866 15241 20781 28456 29499 6683 -8734 -32381 -49680 -46291 -54480 -42302
17200 -42302 -854 -5729 -16752 12182 32337 34503 14693 2153 -4408 -31822 7005 73589
17188 73589 58676 57635 62707 18907 12659 18486 10653 19168 35158 33744 26927 -7981 -3487
17175 -3487 13729 -9778 -22680 -41795 -27892 -24197 -9648 4535 28295 22261 29195 18979
17163 18979 -6367 -11128 -31239 -19795 -20058 -15683 -4296 -19414 -45036 -61638 -23957 -421
17151 -421 28820 25386 -9845 -18661 -21302 -16743 -40664 -42368 -6800 -2242 -17735 -35989 -39242
17138 -39242 -35841 -44143 -47358 -19793 3201 -4871 -32881 -42956 -75810 -69567 -59679 -45340 -45993
17125 -45993 -39017 -25915 -17746 -25854 -42208 -38008 -39451 -42181 -38656 -43035 -7576 12486 20741
17112 20741 14047 3175 -6474 -30203 -45234 -25924 -19809 -31681 -6667 11047 22853 16376
17100 16376 18847 18047 21211 3604 -8470 -8707 -14867 -12777 -44225 -50069 -33518 -26035 -20036 -6291
17086 -6291 -22857 -9529 -12488 -17493 -17402 3170 9359 -19609 -30726 3672 7299 -15981 -10680
17073 -10680 5525 5908 14933 3670 -21407 -44417 -4108 23064 -13881 -17019 -20106 -8067 9964
17060 9964 3711 2694 -6341 -14682 9117 18584 60422 65910 38826 4163 -11698 -1633 -24343
17047 -24343 -20982 -12082 -26054 -22401 -20323 -23664 -16087 -8845 -3584 356 394 508 -15735 -34124
17033 -34124 -39844 -20527 -8592 -5785 12167 25322 2743 -25603 -50757 -60075 -17636 948
17021 948 -7391 -10481 9454 12960 11879 -12616 -30208 -49797 -56332 -12526 4774 -14460 -7294
17008 -7294 -16655 -18362 11005 29832 -4691 -18241 -36610 -21608 -5741 310 -25755 -4327
16996 -4327 -870 256 -10555 -32170 -40270 -61358 -62385 -48224 -35182 -23283 -17153 -15347 -15110
16983 -15110 -16193 -6584 -5722 -25709 -29678 -14956 27849 25906 15013 30207 27757 -16163 -20685
16970 -20685 -8721 2732 9565 -9533 4939 12852 29926 30772 23109 11730 3122 11861 16183
16957 16183 2366 11461 -3052 -21268 -14164 -4934 -13593 -30210 -36952 -28467 4973 -16653 -33146
16944 -33146 -50692 -26427 -4722 -1771 -11975 -16757 -21697 -18035 -28835 -38458 -42302 -34887 -45365
16931 -45365 -44884 -48211 -68298 -90749 -97109 -96895 -61043 -28379 -6048 -11079 -18909 -25728 -21807 -34921
16917 -34921 -42559 -20098 -31376 -12367 20151 35050 36977 6186 -20245 -3898 4101 -17047
16905 -17047 -31133 -33726 -15830 -24296 -22163 -12298 6552 -9527 -32096 -34347 -37062 -32759 -27103
16892 -27103 -17437 -23067 -32559 -50687 -45666 -40719 -25311 -25162 -27767 6354 19341 17566 5933
16879 5933 -8407 -1006 -9216 -35265 -71591 -41679 5473 -7011 -22690 -38224 -13149 13005
16867 13005 -6791 14883 8274 4612 9178 -487 -2828 -5185 11921 31108 37487 19614 -24461
16854 -24461 -33346 -8107 14679 21785 20995 34817 39035 29874 25109 -14889 -39652 -38764 -9830
16841 -9830 1755 -7769 -28850 -25344 -17605 -28019 -28878 -35962 -45081 -46914 -44829 -32071 -37321 -33316
16827 -33316 -29749 -21830 -32042 -21669 -1907 7631 9703 7570 -15079 -1138 4314 -3022 -31960
16814 -31960 -35345 11812 23612 8490 6553 -22473 -52661 -38274 -18423 -8152 -542 299 6682
16801 6682 18937 25296 26694 1423 -30509 -25873 -3494 7137 2060 -29929 -51625 -17570 -4514
16788 -4514 -11335 -17182 -11013 -15532 2073 685 8864 26216 17285 -9587 17336 24242 8242
16775 8242 4894 -12348 -34264 -36189 -20930 7651 33508 23748 27722 24071 -1164 -1904 20549
16762 20549 28819 29202 20865 17576 -4640 2360 -4116 -13501 -22421 -29659 -35017 -38424 -16920 5380
16748 5380 16718 -5700 -3191 -275 -15914 -4313 -3466 -7956 -2021 -16776 -2408 362 12910
16735 12910 10279 24287 36937 32500 19256 11472 681 -7167 -8678 8460 20819 5510 -10308
16722 -10308 -30878 -21178 3402 -5252 -6497 -7814 -31163 -45794 -46055 -47333 -32726 -26529 -36563
16709 -36563 -14433 -405 -33505 -23271 -20545 -4769 -262 6514 -12988 -16981 -12381 -16171 -1936
16696 -1936 9226 -7644 -9774 -2620 24344 26169 32572 45073 13658 -17494 -12470 -2743 3900
16683 3900 9031 26184 19091 -12693 -55736 -37232 -25763 2117 2021 7295 18856 35787 26605
16670 26605 -5568 -18920 -5358 -4926 -8435 -28904 -15716 -16081 -2580 11249 -1858 18996 -3520
16657 -3520 -22531 -38378 -40486 -23484 -4064 19329 6871 -11204 -19249 -17480 -5369 -21487
16645 -21487 -11139 -11419 -13144 -25964 -43106 -34341 -34156 -55883 -43377 -14135 -7033 -20873 -43813
16632 -43813 -3623 6167 -12449 7684 16772 -6554 -32431 -58927 -41502 -12230 -14383 -29833
16620 -29833 -36535 -45786 -36256 -23859 -34744 -24727 -25787 -36782 -32783 -22242 -15250 -17566 -17084
16607 -17084 5903 8275 -16146 -33783 -33237 8461 63 -12056 13607 17405 22895 11851 -9063
16594 -9063 16939 31537 11046 8917 15572 12599 40161 13050 5414 13057 8864 8150 3314 7746
16580 7746 7495 10972 19713 19937 36347 27144 -8086 -24713 -27962 -15962 -19992 -43110 -29256 -42578
16566 -42578 -29857 -17193 -21707 -14615 -15198 -13571 -3867 -16227 -35217 -39862 -63332 -47241 -46442
16553 -46442 -39083 -9857 2580 -25783 -33520 -11759 26424 34732 26650 -9157 9513 18508 9527
16540 9527 22649 22784 22801 6181 1041 15023 21381 15652 3371 29095 61893 50669 22107
16527 22107 31913 25463 15662 6367 9732 29536 26887 15023 10063 -3655 -3286 12404 36984
16514 36984 13586 1066 14496 18459 29730 34571 21020 47670 44523 42346 49080 73591 67615
16501 67615 43362 18285 17514 10662 3441 20780 11336 -16648 -13722 -38094 -65476 -60692 -56360
16488 -56360 -45550 -23418 8940 14492 10524 4022 -3504 -11037 -24497 -27107 -17617 6375 2139
16475 2139 -10089 -9722 -12679 9561 -119 -31406 -53120 -37902 -17733 -11151 -11456 -16462 -8461 4341
16461 4341 13454 10165 -15744 -26914 -20211 -18409 -37361 -39906 -27721 -8073 -19172 -2722 16728
16448 16728 -28779 -61433 -45196 -5523 21235 20270 -8573 -9944 -6700 -20648 -29997 -6811 12659
16435 12659 9422 6857 28885 27281 7923 -13390 -20275 -11888 -1193 -1400 -5302 2168 -3668 -5775
16421 -5775 -14011 -26898 -8109 -16756 -49478 -60438 -40946 -23536 -20110 816 21388 16397 16385
16408 16385 7153 -21330 -17385 -25804 -53521 -60543 -31304 -27871 -26570 -11328 17880 -18059 -24452
16395 -24452 -6170 1904 9175 25145 12132 -4113 -2838 -13596 -24256 -21540 -584 -26582
16383 -26582 -27851 -36809 -65267 -76643 -58853 -38976 -18849 -12932 -24386 -57653 -32910 -38162
16371 -38162 -55055 -30255 -21080 -27214 -33515 -27582 -21702 -13574 -17948 -10736 -8045 -17385 -37128 -16894
16357 -16894 -4875 8254 15241 3180 21332 -213 -7439 -29274 -22320 -39788 -27142 -22021
16345 -22021 -46758 -62407 -39730 -30243 -25724 -27085 -2454 68 -13454 -24298 -9208 -3964 21359
16332 21359 10960 371 -4569 -7373 18360 12065 -7684 -14502 -10080 18524 16762 -2289 602
16319 602 12044 -2671 -4810 6122 -1023 5291 1796 -15597 -22098 -16995 -11284 -21981 571
16306 571 15658 19628 5290 -4702 -2938 -1458 -5723 18681 26206 28104 12260 -14376 -3583
16293 -3583 3634 10276 8984 4242 19348 18366 -803 -36176 -54205 -41696 -34407 -18999 -5467
16280 -5467 -11980 -25654 -7406 21368 3866 7766 32983 1577 -49280 -39584 -34249 -35322 -19538
16267 -19538 -21469 -5471 -14278 -20199 -14385 -7011 -15262 -5612 -3863 -20821 -32224 -44599 -56319
16254 -56319 -49114 -46621 -50661 -41877 -41174 -36824 -53946 -43841 -25972 -37052 -56761 -40826 -38259
16241 -38259 -32140 -16298 3291 27752 24756 3576 -15429 -17403 -4362 5151 7229 26044 28527
16228 28527 15871 -989 -3740 -3548 4944 -19879 -47619 -46710 -50101 -43497 -51982 -63457 -23853
16215 -23853 14253 11044 -12006 -37942 -41389 -38812 -17052 26633 27396 1065 4647 25186 30322
16202 30322 22537 -2927 -17635 -31125 -33214 -38320 -15235 12127 -1979 -12463 -12818 -9772 -26655
16189 -26655 -27856 25480 10132 -8018 4348 22681 28535 3426 -16644 -9930 8607 14464
16177 14464 19018 5264 6294 -15902 -19488 -31377 -35570 -21354 -21086 -22527 -44282 -51999 -50248
16164 -50248 -55942 -61021 -44301 -48590 -41402 -15226 -19109 -18214 -16757 -684 24896 19906 -2304
16151 -2304 -5590 14527 33434 26927 4246 10490 12397 27352 36147 24343 14937 1386 -23574
16138 -23574 -67511 -65153 -59240 -53741 -39308 -32716 -44404 -16678 9179 39749 32468 33720 47108
16125 47108 9512 -11597 -23170 -19080 -10331 -1580 14407 3422 5606 19145 42558 40100 36570
16112 36570 24455 10312 -13709 -18065 2098 34043 55187 33855 24832 43187 34361 19749
16100 19749 -19281 -37170 -30799 690 9561 -4915 -48927 -45353 -31148 3466 29648 42610
16088 42610 30693 -3265 -18560 2747 -19755 -40931 -51263 -50593 -45318 -5996 -18060 -2256
16076 -2256 14081 20414 20369 5746 -2048 -5402 -27736 -36704 -4249 13455 -9035 -14890 -18508 -39895
16062 -39895 -39444 -33234 73 -4876 -11697 5838 17953 542 -9188 -41680 -39681 -17315 -1769
16049 -1769 5366 941 -82 18475 9783 -16928 -5739 -23981 -36137 685 27033 33195 7962
16036 7962 4079 1674 -2339 4309 7886 -932 -5497 2908 9153 5334 -11841 -23187 6106 31028
16022 31028 37808 41577 17457 4951 4797 21975 26412 4777 -27032 -39922 -53526 -60549 -41019
16009 -41019 -13701 -24 -19314 -55859 -70303 -46970 -8001 -7774 -15491 -15234 3272 -2951 -9307
15996 -9307 13887 23995 39839 8498 -2617 -6587 -22576 -28140 -19628 -2984 4748 3481 6904
15983 6904 -16480 -12215 -19212 -12389 -660 31619 30399 27478 26324 7578 -7354 -6023 3815
15970 3815 13023 3865 -25580 -13603 7528 18546 19577 -11812 -21877 -27113 -18936 -33050 -48611
15957 -48611 -58318 -54161 -38049 -34040 -24670 -28422 -18831 -19712 -10883 -23115 -940 -9289 -32030 -34244
15943 -34244 -31390 -22721 -34922 -65075 -69898 -55080 -36294 -47116 -57549 -63706 -69793 -76523 -83249
15930 -83249 -64201 -57795 -39276 -17407 -16332 -43883 -45259 -18445 -13504 -27886 -33855 -1727 7777
15917 7777 -1930 24995 35796 30344 42032 33311 -8404 -34472 -34598 -43017 -29233 -2768 19193
15904 19193 15415 -4219 -2909 16335 -8801 -14918 -10605 -19912 -15119 -3234 12163 3237 -10942
15891 -10942 -40034 -64612 -79412 -72703 -37099 -18464 5599 14129 26942 13901 -6105 -7086
15879 -7086 -16795 -5500 2708 -9838 -24212 -8970 -5014 -33567 -41566 -27260 1104 537 9324
15866 9324 39931 29529 15979 3032 -14112 -7424 -10633 -11142 -38592 -48437 -37301 -15273 -14774
15853 -14774 -33145 -42896 -33862 -27205 -21410 -25421 -12820 -1848 -32459 -76821 -65480 -25507 -22538
15840 -22538 -33030 -8297 1795 -17895 -52391 -63075 -71468 -68445 -71184 -43782 -52734 -80984
15828 -80984 -61616 -37680 -31634 -27461 1588 -11519 4897 -5304 -3755 -30947 -58941 -58220 -58264
15815 -58264 -63778 -62179 -49951 -48657 -26796 -10971 -9980 -11410 2918 132 -7502 -15851 -20339 -23589
15801 -23589 -51673 -46222 -22277 -13275 -40086 -39829 -53251 -63229 -38228 -23306 -42056 -12690 19693
15788 19693 17883 14973 -8298 -24264 -29149 -17666 1690 987 -15378 -36713 -30712 -31140 -34405
15775 -34405 -36900 -24307 4375 -10424 -49207 -49452 -24739 -36826 -45502 -31552 -6456 -17440
15763 -17440 -47676 -45834 -37097 -59755 -52710 -37800 -17705 5562 -9089 -13950 -19214 -36470 -32009
15750 -32009 -33200 -25337 -30090 -41197 -35741 1501 21308 13188 8293 25976 27265 18997 15728
15737 15728 13591 1679 -43616 -36521 -34056 -38857 -42579 -2573 6529 1929 7957 2453 4902 15076
15723 15076 39114 46427 47544 36759 15763 5318 10482 7561 34466 39373 16810 4777 -18022
15710 -18022 -30143 -44431 -17242 -43739 -30379 -2392 12186 -1218 -25632 -52448 -47145 -31263
15698 -31263 -12404 -13463 -17056 -13422 -24969 -19147 -10484 -42420 -44717 -41835 -40887 -9851 2458
15685 2458 -26118 -34579 -12012 -28955 -24690 -4741 -12449 -5389 1829 -17994 -13886 -11700 -23095
15672 -23095 -24151 -20922 -17276 1513 25765 34370 18471 -21447 -38984 -30935 -30850 -16107 -19404
15659 -19404 -41652 -22210 -3459 -6101 -7624 2484 18460 32073 28534 22235 25549 40392 31274
15646 31274 30720 35865 41807 35665 3394 3367 2587 -36835 -37442 -28941 -32659 -15311 -104 3681 26954
15631 26954 31274 12584 -13504 -33026 -30051 -14618 -18585 -29594 -39538 -41183 -18115 -13588 -29594
15618 -29594 -19157 8768 2537 -6967 -8769 -20569 -25970 -14760 -10009 -21914 -37445 -31230 -45314
15605 -45314 -59115 -60188 -60214 -17050 -11780 -31602 -39953 -41668 -41655 -11647 -2184 -1416 -11830 -25216
15591 -25216 -12707 -17969 5692 21955 709 -171 -5428 4657 15420 1146 -22113 -20892 -28012
15578 -28012 -23665 -8164 -12266 -11283 -9316 13095 -3482 -14567 -17970 -25700 -23970 -34303 -49749
15565 -49749 -50458 -44456 -44422 -28037 -13748 -5756 11963 -11996 -26298 5374 12342 -1037 -46538
15552 -46538 -39368 -37500 -29569 -17016 -8671 -29381 -6349 -17461 -34010 -17710 -9435 -4763 3244
15539 3244 20398 51589 36425 29459 13033 -14360 -8929 8065 14061 -7699 -24544 -45402
15527 -45402 -49347 -52817 -58524 -37671 -23513 -26213 -11229 -1657 9555 31747 14724 24918 33804
15514 33804 11978 -17471 -25732 17936 15832 -53 -2077 5505 4302 6085 -8952 -37631 -71013
15501 -71013 -78089 -66028 -40085 -33124 -36514 -1241 -15309 -31527 -26745 9648 25201 -31
15489 -31 -5698 -16906 -18562 -10461 -23445 -25468 -22716 -34487 -23522 -21537 -42678 -50801 -31675 -14177
15475 -14177 -9470 -12321 -19333 -21880 -10195 -37787 -60815 -69899 -46592 -50966 -30862 -30133 -17561
15462 -17561 11499 20070 -913 -13718 -14536 2092 12504 17723 -761 -9324 1333 -3859 9404
15449 9404 27784 23377 32313 24795 28611 50098 57680 50844 22714 2640 -18577 -52466 -48629
15436 -48629 -76627 -54616 -7166 5149 -18484 -34114 3683 17913 17293 28305 32639 28037
15424 28037 23786 12000 -9834 -15509 -21465 -41769 -45613 -11872 -3780 -1857 22200 24083 -4112
15411 -4112 -25143 -45802 -65334 -61081 -46214 -59928 -78212 -77951 -50399 -32774 -17806 -9695 -20100
15398 -20100 -17273 -7219 -11485 -14228 7754 9936 11464 12702 3757 -2279 -14654 -48674 -68675
15385 -68675 -56619 -41617 -17901 -7630 -15857 -6213 10724 22795 9605 6960 1817 13954
15373 13954 16445 6278 -19545 -29204 -33081 -31290 -38409 -9210 16386 24337 42713 37696 24179
15360 24179 38415 55949 28609 -20419 -63739 -38299 -32369 -53195 -30146 -1236 29477 26878
15348 26878 34847 17441 16747 39150 27215 -712 14287 21232 2565 11224 1033 -36027 -43873
15335 -43873 -10437 -11665 -41829 -52542 -45052 -27913 -11503 12211 18143 -20717 -53059 -48430
15323 -48430 -23810 -8442 -1337 4856 -4288 -22709 -10509 9345 -26730 -45963 -26520 -6428
15311 -6428 -10295 -22114 -28209 -19922 -5502 -1909 15305 27892 29153 1330 -12468 -33035 -18957
15298 -18957 -11514 -45044 -55574 -47585 -24004 -2148 -12804 -55123 -63939 -41228 -7138 -17260
15286 -17260 -23725 -33879 -27949 -9762 -9775 -7167 -3697 -4206 21215 -7237 -31918 -28587 -17150 -32868
15272 -32868 -37929 -28335 6141 -530 -12334 -11553 -5862 -3777 11764 -13993 -26361 -16175 -24109
15259 -24109 -48857 -57463 -30679 -25921 -49683 -31990 -30151 -30227 -25685 -27463 14200 56241 42257
15246 42257 33726 54456 38452 32158 30711 18247 14316 11266 21714 39548 22339 -1656 -22522
15233 -22522 -114 17241 1813 -26216 -16813 1587 39700 37478 15705 3438 3511 -27688 -42439
15220 -42439 -42199 -20756 -31703 -66105 -47390 -19496 -17164 -13657 2018 -1085 8658 9130 -24750
15207 -24750 -25411 -35239 -42085 -16495 17665 27267 13268 8285 -8901 -42232 -48219 -60748 -90921
15194 -90921 -80174 -52953 -34400 -35836 -40254 -46858 -8560 8824 20181 24847 37404 35934 37518
15181 37518 25860 18885 -17716 -9027 6910 -3141 -12666 -22840 2347 20341 4061 -10054
15169 -10054 -20686 20219 25632 14468 -3752 -12600 -40586 -61996 -43708 -31020 -15099 -18173
15157 -18173 -42664 -32945 -50899 -69145 -55700 -67576 -68751 -41417 -26219 -37483 -57872 -47605
15145 -47605 -57101 -60741 -42627 -19005 -4666 3485 -12439 -12675 -20690 -34982 -43366 -23529 -21143
15132 -21143 -13515 3416 -24451 -25766 -53192 -59278 -11351 -2317 -24691 -34281 -31754 -7288 -7926
15119 -7926 -8782 3655 10696 -1360 -2691 13453 19358 -9996 -18467 8351 8074 -25840 -21498 -21711
15105 -21711 -16282 -2381 12190 17018 15925 23070 -9630 -28846 -24780 -26991 -55385 -42061 -23964
15092 -23964 -22297 -23216 -16027 -35193 -35121 -24034 -3937 -428 -12213 -15827 -925 7503 -2182 -10897
15078 -10897 5910 5383 -7080 -25306 -29645 -20347 -40457 -51315 -51719 -26512 -36326 -30638 -14354
15065 -14354 1115 -4670 -34 12467 -8347 -19981 -4980 -12299 16171 18921 36664 3394
15053 3394 -1536 28170 42405 30113 23175 28919 29507 48739 48571 27897 26914 23593 12683 -1453
15039 -1453 -23519 -51213 -54007 -18550 130 9193 -2410 -2139 3221 13834 33796 1090 -10895
15026 -10895 -18993 -6187 -8571 -36222 -28362 3198 19476 17683 11313 16555 -8476 -30998 -35103
15013 -35103 -10621 -3693 10517 6048 22176 28152 24956 28139 27619 -3606 -14302 -25040 -22578
15000 -22578 -33851 -20081 -11038 -17502 -17383 -20953 -28050 -35506 -56136 -75534 -73196 -59890 -59374 -63956
14986 -63956 -41250 7811 39701 62562 44607 7107 26676 36176 -2992 -22271 -1023 3803
14974 3803 20945 9900 -19659 -34598 -15915 -19053 -34146 -42358 -46913 -56130 -51762 -66620 -46175
14961 -46175 -19095 5607 -17810 -35498 -16477 -7725 -14895 -39042 -37177 -63594 -90690 -115085
14949 -115085 -87384 -57452 -35365 -11524 -20082 -37094 -40387 -44915 -32600 -8303 -9072 -27076
14937 -27076 -19490 -12182 2965 24767 -2302 738 -1597 -25207 -30663 -35749 -48116 -45593 -28056
14924 -28056 -19066 -41871 -47451 -38990 -39028 -24095 -2954 4508 -9756 -34355 -27732 -18056 -18235 -27954
14910 -27954 -45327 -40808 -13564 5690 -10032 -37546 -64245 -68963 -58134 -44875 -66155 -81919
14898 -81919 -76330 -36618 -1647 4248 13822 361 -4792 11112 -6871 1790 31904 12057 20193
14885 20193 -1615 -25931 -31504 -31129 -23264 7741 13802 16559 2185 -9932 -3467 14983 5374
14872 5374 -21634 -43575 -27136 -32142 -46594 -45954 -27866 -25696 -33683 -42836 -55625 -29315 1551
14859 1551 14284 7079 710 12358 32472 17635 3498 27805 12058 -30334 -23290 -23604 -31199
14846 -31199 -37502 -44914 -24988 4521 -9378 -15875 -13904 -2273 25677 15412 14263 19397 29794
14833 29794 22975 -3755 -11472 -27486 -19411 -32407 -29981 -3838 24531 22539 77 -32491 -36520
14820 -36520 -31370 -2640 5023 -7960 -18773 -32220 -44426 -55070 -35453 -4191 7054 7963
14808 7963 688 -7439 -40247 -45350 -55394 -34213 -16323 -9501 -12370 -38928 -30113 -13006 -12679
14795 -12679 -34585 -11818 -8386 -8618 -17559 -24083 -17259 -18516 -13929 -4458 -29022 -26430 -30965 -57374
14781 -57374 -57354 -23224 -17286 -16580 -36847 -35343 7780 13875 -5717 -27095 -5902 47462 60205
14768 60205 39940 13228 15696 5341 7640 13115 -7115 -843 -7539 -21302 -30913 -14937 800
14755 800 -18551 -45569 -28244 -26158 -43264 -38499 -67220 -54961 -36036 -4550 -3682 -975 16022
14742 16022 6653 9835 4828 3960 21265 26995 774 1360 1012 -15094 -35016 -16374 -20625 -48246
14728 -48246 -51514 -66535 -71402 -70550 -55314 -27299 -19371 -20537 -36336 -59120 -30007 -10480 -9517
14715 -9517 -11082 5569 6379 805 -729 14238 7142 -30872 -41705 -58840 -48421 -36905 -29203
14702 -29203 -31347 -15296 6900 16449 20337 27084 26296 12299 6895 -13732 -2300 -3310 -22789
14689 -22789 -31455 -41356 -37615 -37935 -42256 -53453 -65355 -47275 -10324 9423 24419 6994 10489
14676 10489 11966 17993 23095 45265 32262 16780 -1387 -12405 -25298 -9304 12324 1888
14664 1888 15147 35062 17425 -23795 -42779 -50446 -37363 -14991 -27678 -24079 732 14964
14652 14964 5113 -13899 -20956 -28389 -33736 -52134 -35407 -31118 -70733 -67019 -47689 -55359 -55381 -68040
14638 -68040 -53404 -1721 -5645 162 25866 35086 19123 19146 8163 -19552 -18308 -21191 -19685
14625 -19685 -15794 -18542 -10347 699 -831 -1976 14679 29933 18436 10043 -5922 924 20220
14612 20220 9133 -8764 -8202 20500 12075 -26835 -22076 -17083 -29830 -10295 1495 4686 9805
14599 9805 5327 12138 30904 39045 74525 111952 120067 93861 86073 54516 30046 6924 -27602
14586 -27602 -12569 33997 29890 9486 14945 14136 20635 23955 1364 -16163 -20395 -12135 -13369
14573 -13369 4154 -4901 -28092 -21461 -36419 -32714 -12786 -25898 -30643 -17193 22803 33061
14561 33061 35217 32822 33417 48578 44354 89805 149466 194649 196626 160735 114331 77761 78708
14548 78708 81097 40500 -12791 -49875 -54773 -42276 -18779 5737 -28146 -59179 -94457 -89941
14536 -89941 -53072 -21249 -28216 -4355 -5773 -11909 -18554 22333 17448 -5270 -17596 -22431 -50051
14523 -50051 -31442 -7690 1468 13232 49508 79524 85829 75479 129215 175981 174233 141966
14511 141966 72686 37154 29939 21924 25968 22947 37352 40341 20485 19343 -1966 -15720 -7954
14498 -7954 -1709 -10696 -14183 -4832 23495 43872 55413 46212 44919 21984 2508 -2989 18248
14485 18248 38199 56781 45071 30001 10520 23686 42158 35860 32082 3615 265 13621
14473 13621 27102 14214 -7025 -7854 -5913 14790 6969 -28796 -40388 -34199 -8614 -5704 -6600
14460 -6600 4180 -11271 -18125 10217 11594 -9311 -18836 13725 -1556 -42976 -24312 -9346
14448 -9346 -6467 -6766 5743 9112 -729 17071 40380 42168 17186 -3455 -22002 -44011 -12615
14435 -12615 20212 28444 31919 20941 -2239 1083 -5944 -6671 -25781 -33868 -34608 -17063 -9528 -26574
14421 -26574 -9526 8115 6137 -9358 -13061 -25661 -13789 -30461 -25914 5339 123 -28605
14409 -28605 -11143 17619 26612 19102 19047 4364 -5743 -22004 -30300 -47585 -58991 -54278 -39632
14396 -39632 -22175 -7135 13494 30800 38429 15681 -6680 -30430 -41545 -20830 -4208 -17177
14384 -17177 -3001 345 2554 32687 29619 -23825 -29764 -20795 -29990 -35541 6730 22863 58404
14371 58404 49315 28602 4800 -12373 -29910 -37742 -49799 -45346 -12751 -8238 -18763 -34225
14359 -34225 -50026 -56268 -39620 -29962 -21178 15543 16006 25276 15653 -6175 -678 -1789 -21498
14346 -21498 -45274 -42904 -24436 -1383 1334 26177 24478 -8962 -25110 -38205 -36305 -44714 -55396
14333 -55396 -30350 26173 61220 40188 15279 22785 30920 27047 30410 5183 10411 10379 -6214
14320 -6214 903 -15174 -22059 -36226 -41397 -14346 -4692 -2414 -30731 -45633 -55408 -61797 -59897
14307 -59897 -49849 -50423 -24616 3531 -5932 -21158 -49520 -67426 -60800 -65380 -40636 -6930 2507
14294 2507 -6987 -26269 -19696 -7402 16756 17001 33234 25858 22262 30549 23243 -17182 -33345
14281 -33345 -32840 -14277 -26336 -60743 -68036 -2581 482 -18011 -796 -2232 -15735 -873 41175
14268 41175 36686 20363 -13722 -19981 -29840 -47355 -69431 -54387 -40486 -42424 -52763 -41071
14256 -41071 -30551 -23207 -51228 -82712 -86443 -58395 -39746 -36790 -39809 -30148 -45239 -44292 -36740
14243 -36740 2472 5584 -7096 -8317 -28672 -40912 -24338 -15980 -18041 -31217 -32664 -4400 6802
14230 6802 34391 37566 -10491 -21294 -13144 -24332 -16839 -3152 -17250 -9962 13485 -1522 -7576
14217 -7576 -5796 -17226 -21948 -6427 -3284 -15416 -44909 -36722 -9782 4458 -19440 -30183 -25822
14204 -25822 -14245 -16123 -17944 -8209 -335 -16899 -44998 -60490 -48429 -12719 -14487 -31972 -28881
14191 -28881 -27737 -29218 -24229 -24594 -35658 -49680 -39831 -32790 -12806 -7243 -12752 15949 8453 15419
14177 15419 8773 -38211 -78039 -91287 -72586 -58292 -25370 -18467 -8953 -23672 -47007 -37489
14165 -37489 -24995 -26869 -40616 -41672 -46383 -76668 -86239 -77643 -54791 -33459 -36787 -54429 -63629
14152 -63629 -41143 -33402 -66975 -36676 -446 -3263 -6906 -21110 -34426 -23797 -25245 -8470
14140 -8470 15922 17263 26607 8961 17519 21171 22749 12663 -2330 -21354 -23394 -12932 -16713
14127 -16713 -34029 -39507 -27193 -2624 27164 18118 -3567 -11558 44138 69777 40891 11775
14115 11775 -593 4491 10827 13432 12082 -3760 -4032 14345 12576 -6772 3839 18397 6430
14102 6430 -16998 8028 -7952 -25055 -38106 -26466 -10309 15233 21217 39901 43283 24840
14090 24840 3701 16147 26425 7979 -23575 -39481 -24146 21275 37268 7764 -16811 -10511
14078 -10511 16077 17039 1857 -11319 -10502 760 -8340 -21676 -20476 -23131 -42830 -48922 -44384
14065 -44384 -7043 14850 21218 -1793 -9078 -30016 -37300 -34830 -17079 16233 2916 20937
14053 20937 31422 9949 -21193 -54777 -78930 -48383 -25051 -7952 19686 58164 62237 38125
14041 38125 -5615 -5758 -15307 -8338 7448 10845 -26708 -45372 -17302 3558 -7137 -12025 -12434
14028 -12434 6828 2830 -10954 -27977 -3105 -11906 -20701 11031 1043 -26751 -12379 12476
14016 12476 31899 9437 -2256 24289 54906 40701 7465 2679 20965 16689 23638 23133 8870
14003 8870 10547 9961 23587 54270 79357 80433 57860 48069 57550 56661 73652 90302 106389
13990 106389 126142 120223 118022 97936 87128 90695 108882 86073 64756 67335 75858 97420
13978 97420 86808 74383 65038 54294 106077 120130 93027 47308 51948 63426 72010 101844
13966 101844 128021 127778 124892 112994 113127 114453 112296 102299 120237 128480 122956 122499 103830 43024
13952 43024 1152 23105 39812 56609 57756 28860 11642 5310 -8178 -3973 12748 14558
13940 14558 19882 31780 8308 23567 24859 27054 33434 16156 8896 37390 53805 59907 72653
13927 72653 44495 22414 5173 4484 25359 36205 36085 21212 19440 36412 30063 33860 54380
13914 54380 77228 81213 72753 66136 58675 65846 81031 112856 106438 114177 112374 86714 59072
13901 59072 69089 86814 113395 97503 110624 112835 98326 100988 99507 82763 79862 98443
13889 98443 76445 61922 52955 69972 75120 79411 101175 132960 125675 121895 126959 110151 75729
13876 75729 63453 73742 76840 68642 51225 54300 38754 26671 25821 21433 4560 4267 18715
13863 18715 15092 30362 44190 25501 -4642 -12538 -5687 14662 29378 22645 58434 49308 39314
13850 39314 48339 30611 52921 47838 21097 16823 20899 35630 37272 483 -77 9797 9556 6767
13836 6767 16387 18681 18590 4934 12872 5672 -28239 -30106 379 851 3803 -11179 6310 4112
13822 4112 6339 14375 -1225 -3240 -3367 -13697 -36300 -8399 -12379 -21988 -19883 978 4803 1658
13808 1658 -6176 -11392 -4930 26898 68066 40407 24830 18275 51024 67668 75724 49216 20897
13795 20897 -7112 -28594 -42320 -27434 -8430 13350 5778 -16301 -521 883 7805 42629
13783 42629 52912 51446 54442 32572 11744 35548 51298 22269 14346 -650 7162 -4869
13771 -4869 -1928 7909 30682 57595 42739 29030 39641 49317 43172 43508 31947 6934 5819
13758 5819 14024 30485 42248 25815 2485 2510 -26403 -34673 -13380 9460 10880 1647 4170
13745 4170 19312 5986 -4005 19290 26116 14166 29153 14838 10250 -2946 -4268 -8701 -24289
13732 -24289 -12494 22235 22404 11025 17079 30973 33308 36542 71833 99040 89085 83430 69395
13719 69395 69163 90758 90424 89455 100717 148628 215619 287747 326471 310937 231965 155772 115537
13706 115537 101901 103444 92198 80363 77212 84571 71294 45443 47804 31458 54557 43993
13694 43993 20093 17408 26694 68273 101571 86827 82987 89106 73789 88027 91243 88919 72429
13681 72429 62129 90124 102611 120312 151941 163369 176614 197429 218639 224813 231065 322631
13669 322631 475550 692025 879555 950027 861814 696064 531947 400657 278790 206816
13659 206816 159556 142103 169779 159688 137948 132061 156593 179224 147253 117786 116175 129017
13647 129017 119376 123628 116263 83586 87108 71849 41055 65511 74129 86782 76073 60446
13635 60446 71987 108596 148149 220109 289631 341583 366798 369019 379000 405036 435928 522573
13623 522573 710640 923013 1073375 1041138 847438 644616 492585 400615 368984 314948
13613 314948 243918 209950 190222 198141 221571 227984 219460 216103 235723 243214 260884 276167
13601 276167 304201 309663 292530 291305 272533 285598 309236 333131 332456 317576 339280 359217
13589 359217 383936 408970 488890 566696 618557 648317 608544 590340 603671 651138 742971
13578 742971 833290 950934 1063453 1103381 1081693 1071745 1120057 1178285 1290863 1415127 1582819
13567 1582819 1817353 2125567 2498735 2986956 3636514 4562007 5908141 7683815 9702364
13558 9702364 11566705 12754911 13056121 12737185 12400345 12533679 13537159 15543438 18355715
13549 18355715 21262442 23318085 23660572 22146555 19535062 17023935 15350285 14684975
13541 14684975 14933568 15740974 16613404 17088699 16995383 16514758 16203048 16341437 16723420
13532 16723420 16881173 16525578 15736282 14919917 14649783 15274842 16939473 19489440 22262086
13523 22262086 24250564 24475289 22797486 19983129 17145752 15025881 13895430 13650136
13515 13650136 14002113 14435647 14335143 13319008 11537810 9419704 7512289 5987550
13507 5987550 4869949 4067695 3480620 3028793 2704146 2406374 2176195 2021987 1907465
13498 1907465 1815580 1742305 1666763 1595188 1577653 1567402 1572506 1590288 1623740 1668397 1738225
13487 1738225 1829392 1944603 2121494 2340971 2601561 2951284 3428004 4007504 4872409 6159894
13477 6159894 7890455 10016227 12188542 13842489 14529051 14358142 13931005 13840022 14556061
13468 14556061 16296447 19023312 22261119 25056434 26267920 25340126 22834934 19941282
13460 19941282 17669610 16462764 16291753 16916190 17880970 18636354 18786879 18408427 17985640
13451 17985640 17911122 18220480 18483280 18309654 17603170 16717828 16160078 16403104 17724300
13442 17724300 20099510 23058434 25620890 26660000 25633195 23004531 19884130 17227774
13434 17227774 15565817 14949426 15137669 15625873 15714460 14949066 13227230 11002620 8789181
13425 8789181 6945357 5580954 4572210 3823747 3267545 2826435 2505950 2198104 1918605
13416 1918605 1712688 1552838 1424261 1288797 1172650 1097451 1041542 984741 942568 887786
13406 887786 847708 823702 832575 815650 745323 687274 651106 641633 588707 532801 505522 471540
13394 471540 455002 446951 455931 467868 462127 439934 455320 436460 409508 395826 380152 371745
13382 371745 370615 380355 365092 377970 387729 399158 386577 376367 357688 336623 319822 335169
13370 335169 332523 336547 338217 328653 316416 315154 297420 305876 358065 403462 432192 447612 416398
13357 416398 393095 401114 359701 356859 340073 337875 349806 339830 311797 298229 307154 321137
13345 321137 318617 306409 310804 320034 314838 299544 287398 304150 335648 359144 401096 454469
13333 454469 470947 431162 399706 381246 361019 304151 284444 256242 266420 276093 271337 284223
13321 284223 289273 295391 315859 356686 388583 385855 392224 439710 455680 424504 352281 321116
13309 321116 291723 256619 242481 241920 272105 286280 293130 314392 319778 304551 306270 295960
13297 295960 282629 299734 356725 375583 409692 461825 511783 588749 645583 686398 664783
13286 664783 636976 621873 622533 604251 616640 632570 640057 636632 655948 694535 731550 817685
13274 817685 984076 1152895 1266585 1260065 1268285 1310486 1354468 1424291 1454308 1514858 1633468
13263 1633468 1834518 2110285 2460169 2875769 3422439 4108600 5016971 6180502 7849443
13254 7849443 10452426 14741409 21714085 32144896 44583092 53484000 52881598 43298920
13246 43298920 31194504 21750246 15712527 11951316 9532666 7922548 6774716 5872929
13238 5872929 5120789 4508996 4046740 3697826 3397385 3183036 3061844 2973479 2990317 3077884
13228 3077884 3211855 3350013 3400409 3369241 3418360 3569094 3778794 4018865 4300265 4696618
13218 4696618 5224328 5952470 6911065 8134587 9714337 11756279 14258192 17433255 21940203
13209 21940203 29036866 40663949 59797901 90025095 130754308 167143956 173624568
13202 173624568 143900098 101175282 67875854 47308505 34918241 27089289 21916544
13195 21916544 18278913 15573678 13353857 11378499 9697411 8415926 7479648 6800453
13187 6800453 6282709 5875824 5612578 5499582 5468859 5434625 5353239 5224496 5131292 5138994
13177 5138994 5227348 5367263 5594864 5922263 6432017 7080287 7890376 9027439 10606692
13168 10606692 12608647 15048308 18093508 22347080 28944332 39688389 57310347 85667848
13160 85667848 126365390 168126217 182573402 155795400 110280417 73434905 50504212
13153 50504212 36762493 28168929 22556484 18698192 15872295 13506121 11403039 9628974
13145 9628974 8301757 7306021 6566718 6030555 5662282 5473947 5448078 5512461 5449587 5184386
13135 5184386 4875131 4540122 4244120 4061824 3973422 3949522 3986117 4091917 4258406 4495397
13125 4495397 4867762 5385601 6024446 6859156 7944945 9418468 11659219 15205640 20884578
13116 20884578 29899197 43020300 57162735 63490738 56614676 42698990 30635855
13109 30635855 22975445 18593537 16051395 14415859 13259893 12454204 11954929 11816418
13101 11816418 12081833 12602065 13130783 13501554 13611143 13428543 13119671 12903266 12890199
13092 12890199 13005644 13052476 12926479 12649821 12282977 12052971 12155449 12672398 13664851
13083 13664851 14850514 15909614 16570230 16690654 16562300 16648986 17293617 18566612 20140092
13074 20140092 21523456 22221727 21957548 20825918 19207799 17645059 16597345 16188062
13066 16188062 16189495 16128119 15567650 14353625 12769809 11214723 10086919 9501012 9469786
13057 9469786 9784807 10200142 10442382 10413441 10257177 10260653 10613478 11313805 12114390 12844546
13047 12844546 13197937 12986381 12265800 11275675 10291890 9591380 9224050 9073770 8877605
13038 8877605 8387392 7565644 6590578 5697012 4976936 4461522 4145749 4022401 3994279 4115716
13028 4115716 4413818 4923736 5641770 6516794 7330713 7922004 8300735 8612487 8975848
13019 8975848 9465946 10130197 10864068 11508013 11900341 12001030 11830260 11558773 11366691
13010 11366691 11339887 11505789 11718920 11830119 11783298 11718724 11769252 12139187 12960640 14278073
13000 14278073 15888428 17491667 18661395 19193540 19261811 19271714 19713277 20731379 22132094
12991 22132094 23413854 24115480 24008601 23089950 21556131 19859210 18422104 17537939 17153866
12982 17153866 16878989 16196467 14897760 13258334 11734086 10669162 10189611 10227292 10526518
12973 10526518 10794281 10812420 10576634 10290541 10272145 10671125 11414235 12317350 13079102 13364523
12963 13364523 12993819 12083439 10917841 9844891 9067560 8663787 8503213 8327402 7886530
12954 7886530 7095017 6069601 5015283 4144325 3459427 2941980 2541678 2238918 2005292
12945 2005292 1764154 1588254 1444034 1317720 1216582 1145464 1076923 1017418 945751 897698
12935 897698 826041 740499 661264 612919 598559 588103 578167 562108 540027 525268 522454 490600
12923 490600 443024 420844 413268 391379 384641 384685 380984 362761 354344 362129 357836 344368 353622
12910 353622 341896 336170 330292 350038 358832 383106 368928 327845 330959 338231 338150 343929 335028
12897 335028 311603 300470 298011 302242 292192 289120 273593 278975 265125 251008 245855 240651 235414
12884 235414 223497 211477 203158 187849 177670 188838 222510 219948 207389 192280 170903 173353
12872 173353 164489 155599 176464 179622 160054 142484 129905 127226 129943 151989 168015 173593 193872
12859 193872 201089 205212 219656 213223 213407 186869 182853 185197 184427 177516 167338 154884 167971
12846 167971 174522 187959 177437 155838 129377 123951 133491 145458 118796 106124 111991 124782
12834 124782 114130 107852 110620 114220 93924 118465 118267 108309 101669 90833 64516 73184 102305
12821 102305 121585 124404 121114 142273 134359 129351 123847 138552 140000 161702 166856 152651 130050
12808 130050 120215 100045 92907 78616 93721 132660 146714 123198 103413 102370 93973 80220
12796 80220 85956 98584 116587 122053 123917 108136 86187 78497 70703 95365 110563 118177 94749
12783 94749 107748 136305 198619 270566 334394 370477 376571 330862 259168 199018 169875 157818
12771 157818 122105 92532 75718 95106 108396 104077 80347 60636 86811 121256 133530 108777
12759 108777 104263 97923 105523 91506 100020 88315 96127 112855 98737 96106 122007 110241 102775
12746 102775 134794 144616 136505 143839 152529 150138 152987 180522 216603 293259 387605 529180
12734 529180 737515 908696 933854 834506 656372 489956 337477 255992 180336 153680
12724 153680 125216 119939 138686 134572 113594 105839 122106 99367 87233 93694 94874 104030 106011
12711 106011 107064 88943 89800 74220 62064 89651 91721 110337 128283 113853 91343 71843
12699 71843 94409 128647 162480 176008 195427 220671 248737 270282 345383 477307 679105
12688 679105 880850 951331 861302 686284 518608 393818 288517 218129 177740 167034
12678 167034 139952 109953 116235 109022 125515 141568 133465 115667 123321 139850 131093 121823 139173
12665 139173 150927 149699 165903 156656 156848 158687 160301 171197 181052 184989 162148 163001 155724 166330
12651 166330 179415 190065 234557 261105 273348 300868 339903 412955 457152 487815 463343
12640 463343 433157 392193 329856 276805 241503 242708 236377 247352 258724 243078 220111 225578
12628 225578 235009 214714 196328 184378 190618 208230 220707 216303 196761 186122 167560 156550
12616 156550 136147 152422 151329 156152 152629 123684 106262 112520 120164 129822 130173 114519 99995
12603 99995 116786 99094 89057 66094 64569 41236 41723 43716 40949 76425 80005 60999 79082
12590 79082 86784 78968 89571 83169 93655 105765 121593 124727 143561 146376 69020 57547 87321
12577 87321 113861 156384 174681 169958 160499 184412 187107 170961 162372 178505 204148 206437 184109
12564 184109 179506 174174 188283 208589 192191 184483 193646 202053 189428 213112 196081 184992
12552 184992 211283 236276 253651 278641 272436 263828 241631 250710 224378 187903 180871 182619
12540 182619 180012 227080 256863 259685 239812 224096 233284 217737 216775 199981 203668 208117 192313
12527 192313 155487 148187 138747 149471 149187 149494 132156 129600 118563 125371 110704 95691 90353
12514 90353 96952 97019 92498 105763 96606 90047 49162 43409 54049 59187 83977 97567 77322
12501 77322 91418 84536 85206 100502 106843 135044 105959 92124 103039 97806 94944 103896 81976
12488 81976 74670 65184 79995 102443 117845 141881 135629 120450 108862 96641 113997 141607
12476 141607 174694 199705 250356 371783 565200 819321 1018587 942764 684808 440472
12466 440472 307170 237637 204068 189993 178007 148905 151493 129046 112581 111284 103996 61704
12454 61704 48408 74501 81158 67302 35515 32547 43699 46024 33787 32730 31576 47047 39644
12441 39644 25778 14435 -5599 6964 25203 18350 19421 23986 34585 19299 6128 -2268
12429 -2268 -8387 9039 30620 63125 42241 32038 25299 30671 22198 39854 51499 34219 24577
12416 24577 19686 23992 25057 16270 20139 32921 23470 3842 8308 28105 27531 3729 10141 18751
12402 18751 26510 39410 36715 32430 9634 154 10017 17965 -3806 2370 24382 41824 24373
12389 24373 37027 46256 62341 71237 65060 55628 21559 19502 11547 28558 62338 50318 25058
12376 25058 29007 17930 16222 32279 44761 36482 31298 31194 15902 9676 4619 40350 63705
12363 63705 59736 32543 -13317 -27666 -13716 23894 18851 2657 26650 27899 29256 51600
12351 51600 40065 30404 60065 60318 71218 71546 70702 65980 69448 84534 78553 76291 97930 104140
12337 104140 129286 145335 108292 100085 117938 98124 91921 79173 61832 46112 43029 41696
12325 41696 16609 4900 54334 78255 30295 13660 42929 62555 71265 78969 61926 74757
12313 74757 74101 57831 30151 14084 47447 74478 65136 47091 53457 57647 69003 41281 12332
12300 12332 16514 40852 37324 58584 49293 25285 4581 10316 37233 49469 53320 19172 28028
12287 28028 43896 51928 21517 -23371 -27883 -11486 14950 15805 1184 1731 35067 42926 56745
12274 56745 55561 46454 38802 37887 27947 17536 18116 13224 16093 50860 75565 73584 51735 58158
12260 58158 74793 75707 42189 46660 65742 62037 46404 45703 72539 76804 69060 83545 87192
12247 87192 62717 35790 58071 69476 94089 99623 96152 86739 61328 65211 76653 87335
12235 87335 81964 72194 50203 28465 21372 45407 87579 96442 94281 99309 93184 81046 97778
12222 97778 104972 91357 90070 112029 89377 108163 109317 101980 113396 101924 92004 103407 128508
12209 128508 126800 112557 91773 94434 102638 105949 98773 77930 82113 66415 54157 96461 107224
12196 107224 88256 58648 57889 79154 83251 60342 79699 117621 167003 247697 297410 271611
12184 271611 235334 178185 136959 115699 113308 112026 120366 133398 129258 135472 124531 100285
12172 100285 96601 107882 110078 108677 111056 109805 109966 116450 118640 105828 121657 132819 131095
12159 131095 132800 134446 130601 139144 143349 132307 113585 91830 75253 57277 60224 49042 51112
12146 51112 63613 61657 59041 61267 68812 87927 98042 106213 113531 136843 144103 173313 192774
12133 192774 187522 194941 213583 212582 223051 231624 206732 205832 239550 305288 355997 359887 317007
12120 317007 253382 203912 175011 145826 151088 136903 110885 109880 120995 119929 115390 137321
12108 137321 174870 185546 172968 202399 222710 219214 218390 222448 198273 180666 156774 158602
12096 158602 155062 131147 94465 73825 56511 37476 19354 31831 57033 40367 46714 73489
12084 73489 85126 50364 29727 43501 63638 55797 58168 55543 45570 57380 71660 46421
12072 46421 28682 44507 53634 68707 93550 119245 109407 94626 127081 122179 109924 112706
12060 112706 109709 87009 62219 36516 15002 36335 70643 55375 45874 65204 65569 36209
12048 36209 53438 73195 83376 82078 87481 121977 160320 174481 220918 256542 232664 202171
12036 202171 182577 138536 109860 117132 116946 95990 99513 99492 48549 23916 5684 22842 12043
12023 12043 3309 41114 39457 24270 25324 25023 20238 13091 -8283 1070 10469 18816 60924 77359
12009 77359 83947 69974 43912 12828 4120 -20964 -19476 -8130 5588 5734 15805 23052 48290
11996 48290 56451 37539 177 -4379 5582 18208 38610 58840 23002 -755 24223 40473
11984 40473 53830 29718 42218 54806 37420 33670 36742 35730 54632 51747 40915 59451
11972 59451 60741 65718 54742 64856 61587 51305 65898 99583 113053 104243 92283 82249
11960 82249 85193 106193 118905 108636 104243 73923 68327 87680 111977 120342 123730 101651 101037
11947 101037 101664 85289 81651 89133 49739 17380 17497 39937 48511 27268 33647 67980 67295
11934 67295 51837 60012 64466 75099 82908 76303 62037 37978 33858 39853 50242 60180 90620
11921 90620 64584 31195 30678 38412 40063 58175 84453 76191 77833 57748 35732 22380 18213
11908 18213 45810 86141 85485 94049 95123 133532 181114 179451 154898 157011 150792 144831 130981
11895 130981 116078 113830 98904 75774 78687 107942 116956 118573 151039 192383 220250 248944
11883 248944 263910 266424 253737 266753 261855 230678 190030 152209 122873 92465 100790 123676
11871 123676 140586 106158 97711 143605 164341 149323 111587 114025 126672 127968 84199 91903
11859 91903 75095 61611 45187 64519 79718 53107 26852 23902 28427 43302 70601 116593
11847 116593 154389 137597 121396 106804 85769 77967 97612 121365 132817 125254 113610 115788
11835 115788 107798 108572 91252 75738 80429 81944 99179 76146 57805 65622 45255 61826 87652
11822 87652 122337 176188 202253 215876 250790 285743 257010 256742 255651 198041 181102 203698
11810 203698 214384 220611 224422 237621 219722 223399 264443 276818 276383 310706 353323 373526
11798 373526 421184 474981 490967 444604 405080 374891 344287 330988 347418 382021 378501 398984
11786 398984 421657 414507 423919 429710 388365 395152 428749 469542 509518 538247 553597 602703
11774 602703 658654 726801 802401 854469 934685 1052463 1177973 1341262 1518971 1775365
11764 1775365 2108140 2520707 3065194 3696229 4459369 5403705 6708776 8610779 11583232
11755 11583232 16293681 23425192 32839040 42448343 48460384 48042712 41524979 32020046
11747 32020046 23125311 16599942 12348582 9581171 7670298 6316966 5345097 4579532
11739 4579532 3952021 3434738 3016503 2677694 2396948 2177001 1971342 1789706 1662984
11730 1662984 1530242 1401046 1295554 1223026 1176884 1127644 1106292 1065858 1021061 1016813 990750
11719 990750 985889 1003969 1042174 1062631 1084810 1118742 1172093 1209563 1236416 1316281 1387052 1451721
11707 1451721 1559305 1697973 1854073 2038420 2290723 2573294 2923127 3371276 3960362
11698 3960362 4703580 5577431 6648688 8032199 10105377 13314714 18291528 25785915
11690 25785915 35800048 46421689 53799588 54564140 48392665 38303154 28316329 20820324
11682 20820324 15939328 12908647 11007005 9835455 9184951 8937342 8974077 9319657 10196406
11673 10196406 11969667 15147678 20353673 27888169 36657595 43602549 45479961 41415839
11665 41415839 33419810 24861248 18088717 13465288 10431959 8397881 6971018 5925888
11657 5925888 5085748 4408663 3817832 3336597 2967316 2695583 2470655 2243743 2071915
11648 2071915 1918334 1778513 1653716 1542906 1445082 1407277 1367411 1343328 1336344 1278006 1224165
11637 1224165 1174214 1132677 1101453 1084434 1121627 1167606 1215139 1227579 1260018 1322807 1407338
11626 1407338 1459712 1475250 1543691 1599603 1702924 1831281 1957223 2142393 2454617 2831093
11616 2831093 3290600 3862274 4575766 5446093 6567429 8143585 10551223 14379317 20315984
11607 20315984 28884561 39104002 47773893 51130500 47515220 38711201 28656288 20440759
11599 20440759 14801830 11177630 8774775 7164000 5995197 5061839 4326751 3699581
11591 3699581 3146849 2707474 2351467 2081047 1862149 1690886 1549207 1439901 1357977 1255308
11581 1255308 1167335 1093942 1042889 1028950 1010829 971182 921473 914699 906870 906585 930778 942350
11569 942350 936812 914598 934291 994476 1067522 1084842 1107042 1161722 1201359 1249025 1344104 1411686
11557 1411686 1505517 1669987 1851985 2074934 2374514 2749231 3232030 3899940 4780429 6037733
11547 6037733 7819862 10115348 12782229 15317393 17169186 17911285 17414213 15872264
11539 15872264 13783235 11727783 10117683 9116262 8677894 8727848 9138098 9732185 10243092
11530 10243092 10601998 10960440 11525506 12472823 13715833 15074658 16263522 16959441 16888838
11521 16888838 16021573 14654133 13096718 11511429 9823199 8120610 6634093 5425546
11513 5425546 4514367 3845206 3319897 2956585 2664139 2390244 2186235 2045622 1909795
11504 1909795 1814762 1755964 1735475 1736599 1734162 1744096 1769513 1784414 1803011 1805295 1819362 1849029
11492 1849029 1892054 1974730 2072639 2202018 2342339 2565440 2842022 3157641 3571193 4104527
11482 4104527 4811538 5837797 7286633 9374744 12363592 16197469 20323803 23692366
11474 23692366 25152664 24202363 21271064 17590725 14299203 11992003 10622456 10033825
11466 10033825 10146132 10850518 12271102 14477917 17375006 20635345 23967112 27216992
11458 27216992 30299753 33003132 34741271 34857900 33114656 29911315 25985159 21979550
11450 21979550 18528457 15960668 14238890 13120218 12448788 12169595 12421721 13281809 14470945
11441 14470945 15566653 16187946 16068788 15253118 13945083 12508478 11139632 9880332
11433 9880332 8671403 7526563 6402735 5403416 4575144 3903596 3383129 2970131 2633767
11424 2633767 2382754 2165606 1996534 1875122 1775628 1706702 1642147 1577946 1530948 1488427
11414 1488427 1458464 1487893 1522542 1559515 1605211 1662694 1742477 1802504 1874535 1988739 2170961
11403 2170961 2397147 2682874 3039650 3476983 4090557 4966434 6273578 8212941 11024168
11394 11024168 14718779 18663869 21621689 22536368 21193335 18109852 14426808 11182392
11386 11182392 8846173 7320812 6377189 5846903 5603160 5607490 5875807 6462340 7457828
11377 7457828 8958406 11061508 13663574 16328273 18353968 19135018 18539438 16926051
11369 16926051 14702258 12172053 9711030 7608939 5963687 4784447 3928299 3290127
11361 3290127 2798027 2410250 2089394 1833572 1616743 1431851 1285656 1150772 1059224 962602
11351 962602 879735 838409 791941 767261 717065 675544 633200 589731 567346 538675 531368 524553
11339 524553 486784 470950 446907 438436 441612 422471 413742 425650 452038 465279 424643 406875
11327 406875 401066 383247 384338 370922 355626 362160 397504 395056 388909 377820 351572 332747
11315 332747 349613 354680 384765 433346 422554 403867 400689 355369 273434 229765 211967 222543
11303 222543 219789 176324 172722 208426 214423 213478 190819 212361 240897 224160 194655 197770 215996
11290 215996 200640 184377 171665 157508 153212 184123 200279 173250 174936 160357 192854 243999
11278 243999 208157 187238 218172 239490 245093 244682 215568 200931 223324 246626 255328 270960
11266 270960 317127 344987 369112 350739 302311 266478 249149 239212 257517 276740 274898 304159
11254 304159 356288 378195 380113 363017 406636 464241 492341 497315 465420 427120 369595 343145
11242 343145 326382 309777 280844 269744 246631 240753 248175 257728 258076 237088 220367 220355 246308
11229 246308 285422 340343 350268 325752 305209 293101 257834 238665 194218 160718 169091 176940
11217 176940 151931 130231 120404 132221 122562 133611 151115 113050 84785 71540 80293 87753
11205 87753 115736 142717 122259 93433 73280 75613 82287 86520 102062 144661 181683 181883 153329
11192 153329 123344 98586 107202 110032 113630 117619 145930 162020 179885 202184 206915 212351 212847
11179 212847 171376 130313 130292 132707 165371 190583 194190 244744 271880 246617 239176 260192 285691
11166 285691 316732 345753 347803 332136 331232 324557 312615 317213 307909 286724 281336 281415 257728
11153 257728 234658 213930 212696 212005 178747 135449 146561 118910 104139 99623 86711 66848
11141 66848 66021 95204 110233 102091 103360 114041 136629 181454 235470 244488 217671 186558 152326
11128 152326 125704 93940 86555 102642 100592 116307 115567 136725 116334 104339 124326 150362
11116 150362 162574 175807 192358 195553 160677 178390 181795 194413 221282 242094 231864 201427
11104 201427 170252 162115 152836 159942 156288 165103 175298 203393 237409 253787 275496 284612 307693
11091 307693 317433 298974 264390 191096 191011 201705 223079 232692 230129 222493 201518 159577 141429
11078 141429 111094 119124 136509 137690 149444 183156 192979 185812 222794 271252 330188 332447
11066 332447 333843 315597 289230 276709 233737 203153 168345 168887 157633 169900 185707 181078
11054 181078 197749 212956 202914 189234 191361 169170 170999 184561 194527 250119 287993 298595
11042 298595 303325 312072 320044 310620 314373 283982 227682 217238 217514 195583 196733 190163 199076
11029 199076 242183 276307 273376 278954 288911 302275 310988 334723 316799 278513 231156 208927
11017 208927 206874 213099 204211 199254 188411 187253 165418 168102 204285 235400 256829 267161 275725
11004 275725 240532 217024 224529 230734 221618 197259 197593 181345 179948 199303 164524 109404 98642
10991 98642 123282 135377 123221 117823 119447 123812 124750 147199 131866 120657 104868 137957 154333
10978 154333 148889 148031 161056 153957 164609 175672 171528 167712 165131 116967 107155 124811 120891
10965 120891 139112 135376 125656 142155 146118 154442 174900 186110 181735 173433 148621 123770 128605
10952 128605 129416 111131 109123 119231 113557 104903 114630 122190 104152 141177 203952 204660 214100
10939 214100 208852 191082 178356 180543 167049 154604 141140 88196 57451 47065 43648 28775
10927 28775 12663 7692 62606 72713 83739 56824 19776 25610 39748 43828 39473 41586 65129
10914 65129 80065 79013 64888 97635 118954 93749 72809 65924 57194 68375 76388 74266 89153
10901 89153 118729 124929 95240 71387 46127 59061 56874 83706 84259 61854 36211 7661
10889 7661 7123 22969 53776 53753 61750 99061 94453 94024 70806 66564 85454 83987 106054 108778
10875 108778 95394 68333 57389 59217 38130 21455 20390 38154 58444 50723 72339 99695
10863 99695 104106 89580 64267 51456 57025 53392 76426 120089 143319 146560 135337 128034 125662
10850 125662 124043 128827 114929 84065 74907 73674 66135 84199 102422 107794 120931 102804 108077
10837 108077 127924 122418 122965 118676 148164 131331 121660 131408 157693 196470 191821 175604 166920
10824 166920 156446 155561 145428 133691 131113 121704 139848 132408 129007 144143 159363 192857 191443
10811 191443 172091 169152 162098 145226 133893 144472 147427 130522 190093 232143 214052 193691
10799 193691 224927 245254 263187 249585 232696 226911 264625 328335 346612 339737 334899 344782
10787 344782 329073 329744 339735 339930 357178 357796 365250 377248 407859 409944 427944 457556 510080
10774 510080 532871 569433 622410 643445 710806 781274 826158 864841 925829 957337 1012353
10763 1012353 1079705 1141897 1190839 1253170 1345743 1502248 1702580 1966797 2369202 2960734
10753 2960734 3786329 4920736 6451549 8124107 9462383 9961158 9492401 8419806 7244532
10744 7244532 6222734 5421288 4800050 4360297 4089013 3987336 4020795 4254382 4618945
10735 4618945 4938559 5218525 5693331 6301730 6779855 7166421 7936930 9332157 11403851
10726 11403851 14168880 17386066 20029894 20776585 19352652 16633940 13728892 11276726
10718 11276726 9415601 7991049 6913551 6077498 5404122 4900647 4486248 4143737 3951110
10709 3951110 3901988 3968061 4103366 4291965 4606450 5128066 5966931 7238918 9076890
10700 9076890 11274908 13142472 13826147 13104953 11575116 10064159 9015317 8530184 8560232
10691 8560232 9094274 10121591 11643956 13634215 15898615 17881409 18932872 18727866
10683 18727866 17484009 15627933 13511185 11461331 9708407 8399162 7486223 6885625
10675 6885625 6550828 6383825 6348369 6495786 6806535 7318313 8044401 9020584 10318453
10666 10318453 12116054 14709010 18281769 22984060 28462400 33575246 36708780 36866641
10658 36866641 34296338 30105140 25343703 20936254 17420755 14622932 12500191 11256428
10650 11256428 10624487 9942016 8964369 8210183 8002739 7955651 7737021 7667957 7905972 8487107
10640 8487107 9543512 11217611 13646343 16762640 19946439 22171195 22638139 21224967
10632 21224967 18567633 15567269 12936163 11087294 9966823 9415851 9326978 9569800 9897920
10623 9897920 10217024 10464605 10563144 10352508 9709385 8622594 7374894 6186212 5277533
10614 5277533 4694073 4348046 4123735 3992489 3989761 4097469 4287126 4602310 5012484 5529327
10604 5529327 6170490 6981624 8002434 9320649 10980632 12918105 14998824 16930302
10596 16930302 18159199 18118460 16661011 14203626 11414247 8959222 7109272 5792365
10588 5792365 4883312 4279556 3874261 3599763 3452129 3425740 3484330 3595969 3768704 3979668
10578 3979668 4223842 4569546 5158627 6004926 7139354 8432644 9716001 10568064 10544475
10569 10544475 9601269 8089530 6470670 5070682 3979869 3177414 2629513 2235644 1927272
10560 1927272 1724383 1555863 1387128 1257499 1153883 1094147 1026622 941721 888493 826455
10550 826455 766707 725232 694217 675382 640649 600589 585302 609156 628422 619630 602552 609354
10538 609354 579226 554210 548387 505535 495938 488241 508545 525729 519218 506121 485680 493924
10526 493924 451303 370074 344341 369415 377528 399983 417059 425936 437859 462868 462032 466710
10514 466710 505369 526079 547306 544397 486164 475850 534552 551132 505651 455270 420364 414994
10502 414994 392676 333009 319420 316985 294684 286204 283527 291869 287417 297175 302002 297135 316943
10489 316943 333803 382308 412203 418583 421659 424479 423086 407602 374442 349722 377801 382674
10477 382674 341703 327898 328428 337763 341853 325213 330516 346285 386396 428557 492918 583438
10465 583438 686793 810644 929475 961404 964917 980423 959657 919422 829350 706659 602107
10454 602107 533609 478623 425498 355120 305350 281255 263576 242349 232911 229963 278343 292609
10442 292609 304816 303838 293714 304697 285949 275660 288959 324615 340219 340505 330454 331893
10430 331893 355810 378429 414063 427671 407329 394963 413791 462583 529331 557168 557109 567254
10418 567254 588619 603859 590544 584169 579231 591396 622018 650841 693164 680239 700065 765965
10406 765965 801975 816337 871270 920275 940650 960433 983644 1073458 1158982 1205455 1218269
10395 1218269 1288906 1361004 1429944 1458684 1434681 1407456 1454492 1490979 1449134 1427724 1469287
10384 1469287 1513907 1576463 1637357 1670228 1745736 1843209 1929056 2006707 2072159 2123772 2171795
10373 2171795 2266800 2401537 2541188 2669000 2788581 2966814 3177899 3351206 3511562 3696269
10363 3696269 3908520 4151641 4441074 4775388 5208177 5768592 6476497 7335474 8273073
10354 8273073 9153721 10132646 11409200 12885084 14230759 15541549 17076899 19097498
10346 19097498 21619676 24596015 28124311 32892270 39914912 50240639 65692282 90156230
10338 90156230 130147977 192025375 267859004 322288434 351209280 400828405 468495945
10331 468495945 482783107 424413715 365853683 337374908 296438745 223208038 154859934
10324 154859934 109596174 81482524 63261503 50749843 41803373 35264439 30271096
10317 30271096 26237751 23110156 20724329 18578790 16606626 15145315 14048242 12793724
10309 12793724 11379259 10223026 9330669 8443142 7489902 6679609 6045195 5510939 5073584
10300 5073584 4698209 4343061 4012598 3697261 3461992 3298526 3186212 3067794 2981290 2935346
10290 2935346 2886312 2853597 2864971 2838657 2785805 2691128 2587604 2499347 2379108 2250082 2039348
10279 2039348 1882896 1837391 1800120 1728506 1650108 1587166 1556435 1534541 1459289 1382155 1332076
10268 1332076 1301520 1256602 1203227 1167455 1146091 1140816 1127437 1131486 1113333 1108240 1103431 1067081
10256 1067081 1030310 1026003 1045296 1075909 1075586 1060846 1056502 1104595 1152106 1168533 1133353 1108674
10244 1108674 1096870 1062752 1059217 1033167 990424 969180 963651 962095 932195 902178 856618 839676
10232 839676 819763 801248 797497 774881 736694 736649 754687 766244 782438 813897 846965 849153
10220 849153 827045 798641 758355 751827 722226 708240 715334 710401 688286 695797 699641 685604
10208 685604 661895 590714 528650 483458 477346 461300 435223 414646 416520 425414 422824 424419
10196 424419 425731 434163 455717 432332 396102 377248 396035 388138 368907 375375 378851 342379
10184 342379 316526 315847 319056 311982 251473 229963 239547 241512 239646 254386 276744 292720 301346
10171 301346 329269 336794 351574 378843 384477 388243 374789 378280 371906 403002 439064 427873
10159 427873 417044 438596 440636 419112 389007 367453 363424 346539 293356 278257 293466 293956
10147 293956 302784 314491 318730 343922 373437 372252 316722 288158 278369 248931 233237 204327
10135 204327 198563 198696 187328 166473 161741 140817 125087 159383 203417 262652 262917 300033 316663
10122 316663 330636 332658 349366 336537 312307 310066 323560 354892 338368 318627 313576 311350
10110 311350 299832 304536 300949 295532 282839 262923 211737 158984 138457 128932 141123 160535
10098 160535 175715 177173 198747 208661 215811 211967 204501 189538 185845 191971 178752 161880 145159
10085 145159 166773 204280 246963 289575 305518 321623 300364 284708 287693 283577 294548 336848
10073 336848 342476 324551 303098 274635 265371 250643 230264 228132 222339 215063 208002 198060 183910
10060 183910 154301 113609 119328 134285 160682 152222 157445 182639 197272 204566 224689 221410
10048 221410 220055 217021 229488 238279 248717 266673 270136 268649 272073 272935 286782 284390 273771
10035 273771 283931 303283 324540 329945 335885 351368 369611 394837 395344 406877 405116 444221
10023 444221 489346 520520 558665 630888 698426 792638 875860 976046 1078629 1237139 1402529
10012 1402529 1563704 1682045 1816031 1957415 2063937 2189905 2283860 2340762 2374230 2348610
10002 2348610 2281540 2218735 2206099 2219822 2239066 2207830 2159836 2077186 1982224 1955490 2014800
9991 2014800 2090603 2202782 2351554 2527981 2741601 2939182 3118060 3255678 3381574 3564019
9981 3564019 3817004 4157183 4665457 5296754 5962271 6570913 7078982 7451048 7716943 7967049
9971 7967049 8255909 8582325 8946107 9450806 10068061 10668527 11180643 11474702 11468426 11186367
9961 11186367 10830725 10524786 10235928 10043421 9937343 9942246 9897359 9778120 9579853 9364228
9951 9364228 9222353 9160295 9207328 9322091 9478795 9765516 10228196 10840593 11486596 12124209
9941 12124209 12741565 13304961 13815421 14289237 14638043 14790770 14814584 14710159 14584136 14483771
9931 14483771 14418238 14320927 14097820 13836732 13656458 13323960 12554603 11588345 10822666 10351445
9921 10351445 9966361 9676258 9620764 9810123 10148053 10550705 11056385 11608496 12165483 12723145
9911 12723145 13224337 13596121 13780204 13727867 13445773 13020791 12526296 12037811 11668519 11377599
9901 11377599 11163714 10931548 10649378 10297649 9967231 9725448 9646528 9876137 10403409 11139688
9891 11139688 11900023 12548182 12983277 13328139 13706644 14197976 14842639 15567634 16228960
9882 16228960 16591105 16564899 16248983 15795980 15343516 15002283 14787023 14632905 14377726 13857995
9872 13857995 13080404 12230519 11512069 11135359 11191409 11645138 12353348 13103741 13673819 13989767
9862 13989767 14083448 14134666 14359237 14750807 15226733 15627052 15838522 15799546 15488746 15046557
9852 15046557 14618601 14278359 13988008 13679127 13338595 12891624 12347382 11807606 11396627
9843 11396627 11188585 11211422 11364961 11417860 11261124 10883824 10447078 10204183 10262814 10625148
9833 10625148 11257361 12109466 13105485 14254516 15086477 14656860 12578742 10023796 8179924
9824 8179924 7187118 6647693 6238331 5776432 5177203 4453260 3746596 3172454 2710897 2401115
9814 2401115 2172643 1962868 1778604 1620937 1497262 1401349 1351572 1286709 1181810 1137799
9804 1137799 1073886 1038152 1036389 990514 931850 866942 851050 804803 758739 753565 744152 705247
9792 705247 662935 638521 626989 595563 566165 507340 511092 484046 497526 466729 430379 400675
9780 400675 401826 423686 459478 461391 452296 427652 422988 438062 444546 469770 477466 463091 460119
9767 460119 449737 455843 471075 489309 496667 480038 448736 453318 445940 416817 393509 396038 398832
9754 398832 361352 363726 395552 437255 444457 439976 408751 376279 362159 366819 351015 338505
9742 338505 313398 295639 297827 349150 352596 331802 340568 370273 396764 428464 411783 396752
9730 396752 380921 367217 367964 390175 392033 370682 321547 331615 359096 374335 353228 368221
9718 368221 398116 386143 352495 323160 288742 263346 268669 283800 272934 266329 253534 249056
9706 249056 259384 272653 301857 288493 281192 316678 380308 405867 391567 395541 394823 384767
9694 384767 381658 353278 321793 304736 312644 289928 264170 276278 296539 286104 263880 258640
9682 258640 235839 214152 213247 247799 274617 302696 304187 286290 259190 249299 253782 270980 278552
9669 278552 285585 303082 311280 323069 326006 330009 331810 354524 372759 385393 387005 374733 368720
9656 368720 354686 320373 302214 294035 310941 304432 289971 298253 290124 275781 293243 323546
9644 323546 337070 334696 304761 308739 341093 355934 379091 367631 322953 309007 302234 315960
9632 315960 349665 374297 376094 366933 379663 374965 398585 416495 428952 419465 430051 421618 425510
9619 425510 418965 427456 465297 479164 488077 507244 519698 542992 559981 574622 588258 596231
9607 596231 635577 653129 664271 684995 694899 707809 741574 775715 824954 877328 913983 941154
9595 941154 989237 1061796 1108197 1163665 1264307 1358522 1429692 1520208 1648620 1805818 1986832
9584 1986832 2211670 2460538 2742619 3098996 3509020 4045349 4704728 5557152 6686492
9575 6686492 8118458 10012537 12512446 15739084 19714903 24049528 27744366 29389895
9567 29389895 28240440 24925182 20826700 17013036 13831489 11364950 9468285 8032595
9559 8032595 6919040 6069012 5445733 4985898 4702229 4557758 4614735 4850073 5240943 5637202
9549 5637202 5912196 5945508 5677320 5218090 4708058 4214582 3860688 3620716 3483774 3445878
9539 3445878 3509149 3656301 3928772 4381888 5066194 6024559 7298422 8778097 10235416
9530 10235416 11291084 11814564 11902140 11801960 11842307 12103678 12473849 12699640 12646175 12529258
9520 12529258 12605997 12889718 13017505 12593885 11683363 10593761 9727073 9316833 9447513
9511 9447513 10105652 11177028 12476285 13746837 14931075 16065265 17172173 18104511 18708837
9502 18708837 18807105 18554467 18273586 18163168 18427625 19086962 20151810 21300276 21787033
9493 21787033 20962493 18851257 16105310 13540006 11635731 10419058 9811095 9767460 10230351
9484 10230351 11063496 12158948 13292363 14298498 15062504 15465645 15347433 14981382 14717733
9475 14717733 14774049 14986217 14884305 14076216 12616668 10889323 9323375 8121739 7278352
9466 7278352 6760229 6497724 6407795 6515717 6814927 7340286 8168877 9393588 11092231
9457 11092231 13322341 16040410 18887982 21283204 22630777 22686486 21589481 19960027
9449 19960027 18504847 17700373 17700348 18501296 20226277 22992657 26531243 29971706 31904515
9440 31904515 31554959 29427697 26986214 25679548 26155559 28326893 31628762 35167708
9432 35167708 37877626 38931966 38221875 36364600 34412239 33117130 32573615 32512594 32637899
9423 32637899 32846708 33423156 34501010 35510315 35727795 35057646 33645474 31696161 29676048
9414 29676048 28111426 27276073 27209132 27756832 28323066 28145272 27071379 25515001 23832138
9405 23832138 22030645 19866023 17405915 14942488 12769168 11051479 9788981 8894533
9397 8894533 8293417 7978070 7932710 8193417 8780425 9729290 11073219 12708714 14390093
9388 14390093 15657648 16128747 15742738 14771123 13645500 12661120 11937491 11569903 11789512
9379 11789512 12771685 14573699 16876594 18894809 19723471 18897508 16842982 14471292 12499581
9370 12499581 11218156 10662713 10764333 11505672 12975949 15263925 18314241 21876477 25297558
9361 25297558 27652752 28196488 26778867 24074067 21151450 19028970 18244291 18563895 19257312
9352 19257312 19405924 18448410 16455811 14029661 11767339 10047695 8926730 8326689 8117150
9343 8117150 8280119 8772469 9711177 11134439 12815777 14256495 14879336 14392269 12912636
9334 12912636 10892811 8821658 7099513 5764999 4773413 4041908 3479663 3075556 2784143
9325 2784143 2507285 2284793 2094480 1960985 1852620 1743255 1618593 1552519 1512531 1462454
9315 1462454 1404753 1357855 1345735 1364474 1394886 1395920 1416827 1475137 1576327 1671608 1790297
9304 1790297 1966075 2153283 2360855 2639130 3045847 3651159 4582991 5951666 7869792
9295 7869792 10218263 12401769 13603245 13372597 11858083 9761425 7766505 6264244
9287 6264244 5326035 4780524 4479733 4355480 4390265 4474232 4660682 4996968 5589268 6510234
9277 6510234 7828566 9453696 10944903 11863272 12029556 11701980 11151478 10334717 9140932
9268 9140932 7699341 6253040 5068318 4155201 3516064 3072480 2743502 2464330 2264283
9259 2264283 2089967 1959170 1843561 1736346 1641238 1592473 1577118 1565161 1562219 1587630 1646061
9248 1646061 1700004 1763693 1871328 1997954 2185526 2427689 2736847 3249502 3908712 4801553
9238 4801553 5978852 7482718 9228397 11047413 12522041 13094567 12562736 11165011 9484133
9229 9484133 8009434 6906504 6213657 5922207 5958487 6233365 6535079 6537411 6088400 5395063
9219 5395063 4742378 4248419 3955574 3793353 3790531 3959880 4295179 4843065 5641232 6617679
9209 6617679 7547946 8055402 8015187 7813953 7738974 7924144 8348845 8861492 9406235 10029615
9199 10029615 10576007 10794352 10665254 10223888 9309601 8036453 6727672 5644025 4830608
9190 4830608 4147400 3594398 3178043 2883475 2651328 2535714 2436069 2401735 2399830 2451541
9180 2451541 2517726 2596421 2700255 2891321 3142524 3495435 4020433 4786485 5863350 7247577
9170 7247577 8822341 10164961 10847319 10987675 11030907 11202589 11415027 11549493 11828460
9161 11828460 12584723 13882707 15365939 16292494 16111372 15074216 13868154 12684758 11408605
9152 11408605 10185817 9280891 8872732 9012952 9683706 10821993 12290537 13830262 14987799
9143 14987799 15378719 14940478 13976353 12856265 11767365 11000515 10815097 11350907 12595071
9134 12595071 14362999 16151941 17226929 17362355 16904013 16098247 14751849 12889943 11024431
9125 11024431 9543198 8579671 8130702 8105835 8441510 8836226 8855186 8293437 7353001 6488811
9115 6488811 5879867 5526380 5375736 5424876 5680593 6188427 6941879 7814185 8446236 8449971
9105 8449971 8036613 7735872 7780653 7947788 7980014 7666323 7055188 6427442 6035157 6005750
9095 6005750 6356843 7050558 8054092 9250052 10408980 11202109 11149631 10251027 9054809
9086 9054809 7988329 7284411 6937370 6840059 7028433 7540548 8474126 9761294 11168976
9077 11168976 12182827 12367417 11787471 10771924 9641644 8628169 7910178 7610649 7787814
9068 7787814 8546685 9951128 11869963 13698355 14394892 13497581 11661190 9753576 8302541
9059 8302541 7378460 6871116 6647240 6608163 6739816 7034876 7530795 7990086 7969648 7404261
9049 7404261 6604595 5962502 5658758 5655418 5729537 5646422 5569420 5743310 6222104 6830720
9039 6830720 7289739 7190880 6496113 5619112 4968152 4607408 4567975 4758187 5043873 5302430
9029 5302430 5533812 5686048 5607877 5222920 4662486 4192303 3894091 3830566 3820487 3639155
9019 3639155 3251972 2855069 2578549 2403816 2278324 2194889 2069732 1889455 1759374 1671036
9009 1671036 1598794 1554481 1553739 1585404 1668549 1842390 2119738 2583108 3247644 3938909 4132238
8998 4132238 3876301 3672603 3596592 3438355 3156880 2928327 2817746 2854606 2982287 3113879
8988 3113879 3121236 3017894 2930553 2963177 3081204 3178062 3116176 2821148 2411995 2058418 1778201
8977 1778201 1528474 1355944 1233038 1125745 1061667 1041833 1017735 1031700 1093088 1191205 1303738
8966 1303738 1492053 1766974 2123019 2560289 2899955 2996529 2808101 2441993 2084505 1878888
8956 1878888 1872058 1944929 1857862 1550205 1213074 970011 802541 711573 639205 585535 566006
8945 566006 544770 499772 483443 470420 453194 443080 463397 451141 417622 396410 429028 466011
8933 466011 463586 445375 423704 387671 372930 343910 324565 329826 352949 327954 324228 317630
8921 317630 295331 293274 303366 296509 260962 261942 241226 215621 194580 212660 244558 239014 240431
8908 240431 250677 247640 256817 252192 251177 224364 222769 209607 180132 156448 182754 203546 209056
8895 209056 220448 226472 219622 196990 199407 215541 236674 233477 218382 224718 227153 252627 266651
8882 266651 301818 367512 419384 413309 357235 315977 300054 291891 288167 282130 267585 235377
8870 235377 237838 250780 223779 187992 217782 237973 251565 247198 212652 150498 134559 149196
8858 149196 169921 195281 213326 183858 165167 161492 195949 211913 244554 292621 334617 322450
8846 322450 313451 283088 243309 236788 221429 222617 215189 228044 302377 407635 515756 571715
8834 571715 517942 409512 351537 287765 247670 225997 242100 235952 189537 168615 178042 143329
8822 143329 163011 191125 211272 212343 188553 161336 162820 187879 188814 216258 227350 206888
8810 206888 163702 176354 141504 125792 161268 178386 220277 297178 383178 396889 378263 318214
8798 318214 241377 214816 185980 189954 191085 219901 267272 342397 375023 352734 284372 256511
8786 256511 268457 279072 282234 254434 228152 202202 229836 276778 319411 353916 390509 391733
8774 391733 410467 375234 361911 363846 302780 252588 225790 255609 278559 283297 239282 218944
8762 218944 213789 199738 205220 241766 274215 332378 383267 418643 427045 395684 379227 381002
8750 381002 343962 322921 318307 330035 310042 282974 292061 334757 335621 369212 409200 404060 411639
8737 411639 428067 399815 437987 528594 628326 730719 836207 871168 847968 807627 789032
8726 789032 742037 656424 598183 597622 578151 545886 526772 482483 468269 465412 454777 419791
8714 419791 423796 465576 511097 556969 556265 544588 521492 508194 533835 561256 594374 623327
8702 623327 654672 648589 676880 716112 717121 699911 691366 680120 729136 806742 895220 943204
8690 943204 983035 1007541 1103187 1226498 1312607 1365417 1383474 1417069 1455228 1475715 1530673
8679 1530673 1616595 1706119 1726301 1686430 1712380 1767619 1842438 1920961 2003779 2107977 2247491
8668 2247491 2429099 2621191 2833875 3098616 3446301 3808148 4224595 4868248 5712674 6657386
8658 6657386 7525466 8319530 9330278 10846733 13034800 16151746 20836306 28162212 40014815
8649 40014815 59839519 93262211 143332833 192659022 195482866 147908670 97558657
8642 97558657 65092847 46028890 34382369 26738788 21429303 17621463 14834770 12848205
8634 12848205 11477197 10557507 9922824 9565762 9449262 9411704 9185311 8531594 7829413
8625 7829413 7392926 7204970 7252987 7431209 7764587 8277034 8834251 9386263 10055121 11129836
8615 11129836 12659506 14212758 15397602 16430652 18033782 20556878 24266032 29687890
8607 29687890 37862889 50652681 71302880 106111273 166956809 266289270 382304205
8600 382304205 408258029 311181976 201671111 131467108 91017753 66655968 50853556
8593 50853556 39903446 32050728 26358893 22260127 19352842 17312084 15979438 15378624
8585 15378624 15169321 14890023 14333901 12900860 11202031 10092377 9519166 9306101 9382938
8576 9382938 9652470 9995252 10178433 10111167 10006494 10275704 10787068 10979448 10924339 11044691
8566 11044691 11592013 12640537 14349862 16975511 20921795 27004971 36582242 52194112
8558 52194112 78440260 120335284 171599651 195260532 162355893 109437831 71169081
8551 71169081 48651613 35246014 26654577 20795952 16592776 13556997 11389280 9765418
8543 9765418 8631724 7898940 7536082 7425560 7342281 7177189 6675836 5800429 5010476 4391373
8533 4391373 3936040 3671545 3522660 3467202 3429444 3358856 3256691 3208292 3207765 3056310 2795438
8522 2795438 2622005 2548470 2400037 2194923 1975742 1742688 1553398 1407116 1305966 1265299
8512 1265299 1252734 1249998 1215171 1142361 1059650 1025942 1007721 952093 911341 882091 859431 853727
8500 853727 810887 745797 673749 686436 722666 694466 676302 681623 662721 644622 620193 592687
8488 592687 606311 644901 671929 680918 659776 643370 595567 566817 558994 581586 597095 602811
8476 602811 562963 521929 451234 383279 378523 405912 411645 455418 473513 491398 486816 464011
8464 464011 430543 387524 388978 387125 404851 401275 383396 386414 386942 406990 395659 376380 367060
8451 367060 368844 350533 295814 266748 235211 220637 221382 268373 352863 408072 405891 369001
8439 369001 354324 331734 316231 314884 308385 313786 344597 354067 327115 314488 306029 292091 286190
8426 286190 268928 293267 319877 310398 269290 217124 181876 158227 183930 181555 186482 177161
8414 177161 229635 249265 253733 266701 249653 217596 202104 190848 189067 188250 162693 117192
8402 117192 92620 58973 30003 46568 82188 140028 203729 266582 286794 284808 249244 210554
8390 210554 197476 205495 217491 213458 209188 200439 197165 201368 207933 212504 210038 223779 228771 229316
8376 229316 219400 206423 163863 122815 93578 89702 76089 105591 124049 148667 171572 183022
8364 183022 193807 194528 182766 182649 156495 132542 155936 133117 99135 92431 97529 106304 140742
8351 140742 162897 182870 229653 243094 227303 220763 205406 195245 199114 197356 187794 211204
8339 211204 195690 171866 183460 200989 180502 184144 171899 134152 148258 163952 128230 128579
8327 128579 123295 90830 61607 53377 89001 70919 67945 76364 84612 81922 82933 78079 78295 82769
8313 82769 73983 63820 63045 35465 39388 45826 62880 71271 113791 140282 140909 163080 160430 163275
8299 163275 172551 170997 178375 190473 184855 166141 143956 123161 103044 69951 83822 109365
8287 109365 138500 147203 113929 95786 71357 48358 88405 107166 102439 99758 95347 104088 119951
8274 119951 120633 124396 135180 143073 126640 119877 106352 92151 68564 19946 25615 64748 78957
8261 78957 72097 76440 87884 94324 94196 72266 104786 121937 130207 130991 123327 135866 150037 179045
8247 179045 212377 272475 358809 450054 630628 859896 1077026 1076487 823699 592425 432026
8236 432026 329665 279640 237906 193201 157630 128750 119622 115207 112946 109365 114552 118387 114398
8223 114398 115187 103568 97098 104285 100641 96670 99103 119925 135845 130338 111447 113982 148357
8210 148357 122223 120502 182219 206973 194040 185485 211166 240554 296659 336024 458029 690252
8198 690252 1066881 1610923 2166134 2192772 1678820 1146813 765650 508700 360147 308221
8188 308221 253661 211291 198215 176287 150338 142278 141817 144238 161392 165503 143521 126930 138106
8175 138106 140017 104913 91453 85881 84441 84581 88054 92019 68133 75936 97693 114599 114935 106041
8161 106041 100756 127880 133396 112042 107028 135502 213948 301497 485554 711876 966886 1037959
8149 1037959 856933 613039 449465 298804 245682 224590 177125 176901 178222 163238 134289
8138 134289 132477 95834 80686 91004 98683 120413 129016 93303 55936 46971 49116 46360 42107
8125 42107 44199 32798 42509 42924 60294 75553 78216 79524 74234 61655 77299 98275 105161
8112 105161 93424 67849 57342 83638 95047 87853 87158 110973 62682 19169 25599 74812
8100 74812 109780 110757 109715 125195 98522 53128 73353 95532 87982 70128 79640 69059 45605
8087 45605 14368 17888 49379 58203 48549 54312 50887 58753 77922 65037 39196 62928 82702
8074 82702 83858 78041 69530 43999 36321 35864 58981 71248 62898 57170 78200 80949 75071 58397
8060 58397 52786 56976 67201 82340 57376 48719 45902 33179 31984 34876 59335 88996 83454
8047 83454 77218 82600 104385 95739 69944 35580 37895 50882 50665 56576 83172 110035 118855
8034 118855 124479 133210 133195 147349 158885 157563 120324 96064 98790 110129 119113 109585 106017 118068
8020 118068 113515 103662 108629 110709 103960 91410 91379 116760 106017 93998 99263 109139 118144 130855
8006 130855 146005 147027 131116 140298 130797 114852 100972 117264 103452 72501 64199 76586
7994 76586 95818 106133 106471 118955 126763 120792 114863 139153 144900 157286 190067 224322 250313
7981 250313 238733 200325 192707 187569 170790 164193 120583 132659 155681 133763 113471 82160
7969 82160 89395 132488 117979 125641 109765 109993 117179 119470 108062 107575 113759 123964 127078 110948
7955 110948 117040 127250 145086 173510 167884 163210 133167 124859 146795 153773 168942 169125 172163
7942 172163 191221 216045 223089 223071 228284 237024 220246 198894 169699 147779 163170 176636 146428
7929 146428 121411 96878 101703 121183 126870 121195 132151 122284 120711 128931 90957 66496 84435
7916 84435 102990 105200 103310 115379 119838 109232 86199 92477 107207 148046 157634 151720 147929
7903 147929 117145 92267 98341 140231 127820 160305 198843 202982 162846 141659 148135 134358
7891 134358 102140 88258 87662 81478 90080 66359 84096 73998 71317 93277 124931 125620 119370
7878 119370 118484 120684 112054 130767 132642 96458 76459 68306 90847 99166 116064 123043 90688
7865 90688 69892 34588 43060 34211 17488 -2977 17299 59458 82168 70180 52103 44358
7853 44358 49801 42106 34618 54426 80764 45619 9279 3573 20968 29008 31888 33992 40512
7840 40512 59188 55899 70405 78411 82098 98309 83976 58474 41971 60877 55077 30972 -1439
7827 -1439 30457 51123 51056 57877 46028 53730 21117 -12085 -8360 20055 36204 25495 32030
7814 32030 47192 44137 45872 47102 19797 12240 35109 58681 35231 39126 62166 72573 64572
7801 64572 55364 38239 40430 47687 34669 14142 -2186 3727 28318 47560 63082 60944 80863
7788 80863 65222 60527 62226 64277 77423 76878 61806 10771 -8182 -9370 -3504 -5619 8716
7775 8716 4680 9358 21648 28415 14999 3062 20945 476 -4234 -18430 -24569 -44271 -28020
7762 -28020 -20395 -8683 8003 3495 -30628 -24964 -30612 -24032 -981 3383 10979 29070 24909
7749 24909 17827 -6868 -40734 -19619 7429 2665 -11091 -1231 -20098 -30423 -33229 -48686 -44872
7736 -44872 -35339 -14812 -26695 -41474 -37880 -13382 -202 8708 28119 45337 52038 64483 22772
7723 22772 4359 2691 13344 -10796 -31559 -14052 2744 -3789 8038 -1887 3247 -319 -2457
7710 -2457 14848 34809 13790 11143 5529 3629 14701 2345 442 520 -1530 -241 -13662 -37433
7696 -37433 -28881 -3981 22690 52863 50281 76671 77978 63554 59337 48563 31221 16306 -3495
7683 -3495 -9795 -19686 -4411 -7070 -24251 -12133 8401 31269 44137 51191 47983 45246 48260
7670 48260 43151 10390 -7117 -3649 -4317 -18741 -19758 14061 31234 35296 31562 28878 26261 30542
7656 30542 43902 22892 23833 -16229 -45033 -8805 -12184 -4237 32367 351 -6762 -2269 1619
7643 1619 20115 32048 -1811 -56713 -70019 -48124 -39497 -54985 -46015 -45275 -27690 -16273 -31713
7630 -31713 -28637 -32122 -18751 -5795 -4738 7214 8185 21527 15429 -4908 -44848 -64591 -59591
7617 -59591 -30469 -20687 -18436 -12248 -11804 -1699 -12130 15549 28817 -1198 -1236 -1937 -4361 3340
7603 3340 5654 -1470 -32108 -41705 -44552 -51899 -72796 -50913 -26315 -10739 -2876 -35615 -43541
7590 -43541 -26579 -19401 -15390 -30128 -41317 -55393 -33627 -10540 -10735 -18176 -10635 3577 6925
7577 6925 -5123 -23399 -38635 -20439 -3533 -7439 -8561 13105 24809 -9403 -43624 -34825 -19903
7564 -19903 -28633 -2175 25859 13131 3449 21825 53255 67334 63068 22273 312 9908 19986
7551 19986 31684 42680 34767 20704 37315 72265 72241 33345 -697 -9272 -14472 -27106 -47605
7538 -47605 -41077 -21600 -4237 -8763 -24260 -38354 -22094 -13334 -35093 -53095 -53506 -23385 5136
7525 5136 25877 42675 21905 5978 19298 24398 16795 28166 44220 59113 59909 33756 19014
7512 19014 -2943 -7340 7793 4916 15713 18417 13619 49153 50405 33815 19294 52676 56235
7499 56235 14088 24340 19328 13808 24515 45727 54521 48981 64124 57545 37535 6571 -8856
7486 -8856 -21525 -28998 -21016 -15295 -15803 -6644 -8552 -21799 -19044 -7827 -6950 -3337 -6526 -14458 -22358
7471 -22358 -20008 -30173 -30474 -7966 6140 21195 37212 24877 11495 43385 38675 40923 31256
7458 31256 -5667 -22925 14191 35480 29073 9255 1177 1902 3660 14849 -3316 -19249 -10825
7445 -10825 3247 19965 26885 44286 53034 33261 22916 25033 58180 71378 50287 31048
7433 31048 42616 34619 7835 18282 42974 12321 8517 -8589 609 16981 -3410 -13921
7421 -13921 2235 -5207 -25001 -54901 -33096 1050 43351 44460 56748 34546 8242 24989
7409 24989 2434 4814 6437 26182 -19732 -36133 -29837 -21661 -10274 -16765 -23934 -5442 -17323
7396 -17323 -25367 -32795 -20519 -9627 -17815 -46506 -68970 -29394 20359 30830 3741 -9139
7384 -9139 -8987 14249 5432 -11687 1064 -11415 -40552 -54935 -25512 -11622 -14311 -26757 -20196
7371 -20196 -10431 -39972 -45998 -30668 -14284 -30160 -39991 -26038 -533 12301 26840 36039 7016
7358 7016 1979 9874 20274 18797 4484 -5092 1052 11575 5241 8644 12461 8082 -1092 -3679
7344 -3679 -11186 -26045 -16564 26123 31567 10776 15058 -15439 -52768 -49517 -57816 -38133 -19326
7331 -19326 11742 32497 31898 1413 1135 -8913 -29125 -48608 -20171 15479 12346 17036 119
7318 119 20411 36782 9329 -20949 -24373 -13217 32249 50839 41366 18285 22697 51185 47612
7305 47612 49530 44868 -11194 -10821 -7918 8005 25324 23342 -6772 -6083 15710 19924 1899 -10162
7291 -10162 16813 16109 8448 7692 7608 9839 -3381 147 -7250 -14866 184 37621 45849 36821 8482
7276 8482 -3504 -14556 -18297 7119 13665 -1436 3643 14733 -20249 -36870 -20249 -21632 -20626
7263 -20626 -2033 1326 16210 23748 15240 -2172 -19162 -12332 -16006 -13164 -1056 4687 36952
7250 36952 32161 -15022 -61810 -56788 -27888 -31218 -21434 -8801 -9917 -6345 -7267 -18198 -36461
7237 -36461 -14115 -19527 -32205 1325 4964 7564 7645 -18383 -20066 -799 12293 8851 7265 3603
7223 3603 4914 -12285 -17113 -37241 -13960 2836 7233 -4929 6007 -2314 -11625 -12225 8280
7210 8280 16046 10962 -7633 -5012 9916 29808 7363 -1503 32845 16204 -6821 -27064 -7714
7197 -7714 -5755 5894 -4551 -16582 1548 25267 10687 9525 36411 34704 12957 -12131 -31911
7184 -31911 -25202 -17805 8730 26952 6472 -22554 -42845 -25721 -29737 -30786 -38575 -21673 -16275
7171 -16275 -13870 11000 14999 20371 8966 -8690 -35347 -46276 -34296 -18585 -14192 -7590 -20890
7158 -20890 -25909 -5064 -5864 -7167 -3470 -39898 -30847 -14567 -9301 -21756 -30405 -18563 -14561 4173
7144 4173 15700 19954 27669 37715 26629 1176 -2705 5280 2690 -9179 -7624 2909 4606
7131 4606 9762 29253 25796 -4207 9149 13186 2845 -20410 -20665 -10758 -20896 -8642 -8816 -19915
7117 -19915 -33427 -38558 -16654 697 -19365 -33413 -18360 -2108 -44787 -70548 -54992 -45390
7105 -45390 -45061 -33175 -9023 17189 33267 18377 5389 11637 29320 6687 -12431 -7904 -15708
7092 -15708 -9538 -897 16608 22960 44980 47900 37553 48333 54941 24236 -9985 3197 29890
7079 29890 36248 20456 -14288 -34897 -14291 -1493 13574 7135 4696 -9326 -26612 -30652 -26456
7066 -26456 8724 25509 793 -2089 -20267 -26274 -18102 -39621 -37687 -44811 -34109 -10634 -13351
7053 -13351 -8473 -28890 -31268 -20517 -32101 -40564 -35191 -37439 -25379 -22897 -57802 -38842 -3925
7040 -3925 12988 -7808 10193 18689 13939 11028 16799 -457 5778 20347 15283 9275 -11827
7027 -11827 -21656 -2743 5903 -21232 -14534 -26448 -54526 -49195 -22241 -21954 -17276 -17866 -10857 -3751
7013 -3751 -5665 -5733 -16018 -47412 -49601 -30164 -34788 5740 20108 1803 -17604 -1564 6188
7000 6188 -7355 -7990 -8675 2233 -2369 6290 -14918 -15479 -31267 -17829 -7674 -558 -9620 -13012
6986 -13012 -14410 -17770 -10886 -17043 -17084 -14723 7406 6521 -1637 10052 634 16150 48700 47998 29201
6971 29201 23420 2501 -17982 -32261 -15595 703 23717 16264 -9982 -21921 -26623 -29370 -3551
6958 -3551 22735 31824 -7358 -30888 -6287 23737 16441 12386 26202 27756 21382 8992 -3440
6945 -3440 -25539 -29717 -18184 -14923 33 -8689 -17821 -14110 -16452 -29942 -15228 -3448 -6494
6932 -6494 -10059 3797 13381 5269 -11677 -45554 -44589 -15367 -12940 14119 -3645 -27900 -9676
6919 -9676 -2776 -3572 -10768 7706 12446 -6159 -11443 -2236 16774 43113 30496 1160 -6768 -21638
6905 -21638 -21617 -22412 -489 6071 4855 -5390 -14085 -7927 -42478 -54118 -36108 6931 4965 -14744
6891 -14744 -33603 -15721 -36469 -31147 3386 843 -7210 -2160 -25050 -20246 7116 15690 8861
6878 8861 4262 -34988 -57833 -31607 -20606 -17701 -9650 43327 52333 40248 18168 -25010 -34353
6865 -34353 -12193 -24839 -48520 -9515 18247 12822 21367 38293 27990 17601 24334 33330 8029
6852 8029 -9451 6224 10935 5654 -7679 11137 5858 -1338 19770 23551 7000 4388 19562
6839 19562 11187 11734 25108 52868 42414 28817 57259 49252 57457 65577 58770 21206 -5422
6826 -5422 13096 26946 18946 10730 20269 10109 3157 17427 17141 12517 691 17914 -497
6813 -497 -33865 -31200 -28590 -30484 -37236 -1364 -16466 -11736 1306 -2830 -13607 -4584 -6456 -655
6799 -655 4578 16579 21607 33170 40128 29422 5014 -12708 -12956 15066 24741 14259 21309 42036
6785 42036 12037 -2155 -35283 -50092 -42683 -47392 -54703 -26352 -13100 -5891 -7510 -9073 -38454
6772 -38454 -30946 -25131 16422 27512 16168 -12210 -24961 -21161 14667 28336 6521 -3281 -20386
6759 -20386 -8129 2808 811 -32668 -64209 -43632 -51156 -23481 17490 34479 7349 -8489
6747 -8489 12578 3984 -633 -7096 25568 15597 -43912 -36751 -29517 -11951 -21502 -37133 -15171
6734 -15171 -22540 -61195 -48595 -23483 -24825 -29295 -19493 9759 33954 46896 25827 17968 32024
6721 32024 -857 -40491 -31421 -23371 -44419 -44906 -22642 19577 10753 -2051 -3714 -13534 -3409
6708 -3409 4499 17297 4116 2936 13651 40346 44169 18553 -16375 -13083 -18427 -29116 -24604
6695 -24604 -26963 -37066 -24816 -15568 -5485 -2724 -36180 -71997 -95606 -56012 -23347 -16545 -6000
6682 -6000 12289 -8067 -23949 -10976 20759 11080 25583 24602 25202 20037 -222 -4325 25768
6669 25768 9540 -23400 -31215 -21864 -31164 -39951 -49959 -35354 -26670 -18026 -15676 11891 16992
6656 16992 14181 4555 -3358 -7543 -21007 -21017 2851 12542 -2064 15238 43076 15034 -16440
6643 -16440 299 6052 7693 -3369 641 -4889 -23960 -17833 -43754 -44295 -21561 -57736 -74958
6630 -74958 -71851 -52291 -41349 -24801 3951 -6902 -39379 -69759 -78978 -65778 -24762 -9146
6618 -9146 -10536 -6775 -11879 -27270 -30746 -26947 -14593 -17282 -11616 -16438 -24553 -15256 -6127 16128
6604 16128 -3937 -15815 -29346 -38326 -16319 -29405 -24904 3988 32767 43597 40537 27443
6592 27443 -1462 -16781 -24484 -15613 -2497 1566 10409 16926 34588 22735 13949 38423 23029
6579 23029 -6210 -17323 -23121 -17683 -8710 -6164 20175 774 -20812 -29028 -19089 6944 2793
6566 2793 -14303 -34305 -47928 -39636 -10264 -8809 -11335 -795 -25559 -42991 -28502 -8663 11268
6553 11268 4209 15022 8063 2450 6116 292 11687 13574 2550 1186 14587 34679 10058
6540 10058 5869 8421 1521 2175 9742 47009 37557 26373 26926 17982 165 -21163 -26524 -18093
6526 -18093 -23197 4667 -192 6605 -12042 -22198 -860 14662 22274 27883 20500 1223 -5591
6513 -5591 2733 -5077 7966 -695 -5103 -28540 -30726 -23239 -33692 -26421 -6136 -4819 -19820 -18222
6499 -18222 -25674 -9817 -10669 -8819 -19541 -22850 -21137 -19894 -22380 12997 26067 6562 -28861
6486 -28861 -21493 9291 2260 13030 33051 10085 14282 -8184 -16539 -31194 -37865 -31727 -30653
6473 -30653 -20562 -6170 -9930 4458 17923 23465 18474 6533 -20217 2982 30054 22246 -753
6460 -753 -11467 -2394 29205 30619 13328 1586 23101 43903 54112 63208 49872 -2235 -18429
6447 -18429 -13881 -8014 9435 27633 46581 35684 19371 -4517 -23870 -9565 9082 -32270
6435 -32270 -57359 -45892 -20921 -4551 13363 32522 3426 -10429 -172 -15749 -32070 -16937
6423 -16937 13457 11218 -17475 -10943 -16194 -38023 -31792 8356 32411 14016 -14485 -10061 -14197
6410 -14197 -24223 -13489 4078 13893 21340 4380 12020 26354 29527 21994 17098 5290 20121
6397 20121 21509 5941 -4637 -4881 15579 52773 53245 33064 10250 12867 22396 40605 32446
6384 32446 10345 264 -13606 -19897 -4497 10770 -4733 -5808 -495 -6798 -17145 -4095 -21587
6371 -21587 -44733 -44345 -30346 -33185 -35830 -22758 11522 14080 20718 24460 16113 8584 5207 18324
6357 18324 10642 16623 13654 22420 34277 11167 13420 13021 13292 -1764 3003 -3188 -700 27528
6343 27528 8326 12721 20639 6885 6240 -8374 -23229 -19358 -12777 -13407 -41530 -59772 -61332 -62166
6329 -62166 -73688 -62213 -45951 -21416 -18633 -21804 -17692 -20402 -22258 -20722 -37169 -25398 654
6316 654 34939 32332 -20798 -28942 -8881 -7412 -16604 -8289 -18592 -9854 -3810 -1101 -30894 -37433
6302 -37433 -3265 19596 26406 15077 9029 7746 -14429 -13847 -12381 -5625 -10512 -25401 -36779
6289 -36779 -31864 -26352 -36150 -38791 -6297 25607 43938 31183 -10800 -17933 -15109 -26129 -45577
6276 -45577 -60269 -67853 -57651 -35273 -29371 794 33296 45047 1930 -18170 608 7699
6264 7699 21305 27806 26816 24492 20133 32039 24999 -2167 -5243 4284 5696 -21073 -22051 -18247
6250 -18247 -3586 -19991 -34430 -37055 -52844 -33322 -18820 -8847 4777 24675 42249 5205
6238 5205 -26330 -30965 -22922 -17374 -24288 -27640 -6446 45751 50407 28762 22526 25779 36980 24933
6224 24933 4583 5278 -20959 -26839 -23202 -22573 -21501 -18101 -17120 -32160 -31377 -35640 -1199 30237
6210 30237 27533 12146 5627 -2339 19797 18630 -1316 -29145 -33572 4174 33761 35893 27203
6197 27203 -6442 -21167 -3936 -8259 24507 38092 8690 -42346 -58631 -64457 -37950 927
6185 927 -6973 286 1564 6629 22695 12818 12164 30530 54227 32281 -31284 -62060 -53287 -31203
6171 -31203 -10771 -17871 -32712 -17596 -9330 -1068 -4769 4355 -5539 -34091 -49059 -22499 -16875
6158 -16875 -9842 -40728 -37233 -5973 -10345 -15522 1350 16560 23207 13973 6895 14882 25328
6145 25328 35194 30720 25953 25580 26268 6112 -9277 9608 29224 1134 -23531 -36805 -14800
6132 -14800 7176 7663 6399 -943 -15073 -590 -5125 -16966 8023 21663 16914 15758 10808
6119 10808 11733 7941 -20771 -23622 -603 18412 12528 10326 20784 -21182 -43685 -36169 -71749
6106 -71749 -38004 -7933 9529 1144 -22743 -30381 -42168 -74621 -44900 -7806 -11890 -4715 -26739
6093 -26739 -33002 -46561 -48939 -16923 -23485 -8734 13001 4511 10760 15061 12428 3336 -4233 -20391
6079 -20391 -8306 -2175 -3833 651 11426 40430 15050 -21599 -52292 -48348 -16647 -11981 -15197
6066 -15197 -17174 -33801 -18528 16692 -4756 3417 -9252 -35809 -33064 -14205 19579 41214
6054 41214 44655 18240 -3470 -27064 -35531 -6479 19372 14747 15936 -9688 -15392 -572 13098
6041 13098 3129 -2199 31656 36466 14894 22215 10267 10183 13345 4752 3779 -32732 -28608 -7763
6027 -7763 -2737 -21436 -9554 6646 21079 7971 -14211 7722 17801 6734 -21385 -32047
6015 -32047 -11021 -27556 -20753 -10828 29093 42355 28631 25733 22304 -8560 -7531 7462 -30997
6002 -30997 -12323 -4502 -3778 -24442 -26291 -14685 -10389 -3650 12767 2895 -7626 -9231 -331 -14572
5988 -14572 -1426 7500 2733 -12017 -14876 3169 -9545 -24288 -37055 -49548 -9838 -5081 -31618
5975 -31618 -14049 -9759 17079 37000 26713 34742 34128 5948 -15913 -11142 -34054 -43421 -24760
5962 -24760 -8928 -7009 -5710 -14450 -13858 -13036 -22465 -30718 -18480 -19323 -34674 -23824 -28188 -24047
5948 -24047 -42977 -36422 -20420 -3768 -26139 -29992 -16077 4350 25576 1152 -13888 3769
5936 3769 18072 17351 -16243 -15158 -10616 2212 -13350 -20093 -25223 -12657 -19219 -22090 -13321 -35681
5922 -35681 -40736 -13905 10461 1550 -3923 34929 41379 53371 23916 -13110 -19872 -34853 -35400
5909 -35400 -17935 -3434 4148 -21819 -37981 -31626 -55723 -44933 -4929 -28387 -58951 -62932
5897 -62932 -30127 -7057 593 24802 29175 39181 40057 -1116 -12395 -25294 10134 19818 4428
5884 4428 -2472 -4043 -16471 -30433 -46280 -30695 -3669 34271 15219 984 -22562 -25855 -21116
5871 -21116 -12454 9741 27616 718 -31907 -22206 7777 -1318 -25629 -62464 -45342 -18946
5859 -18946 5191 14278 -455 -9191 -1753 16763 -1556 -15218 -17795 -13929 -1685 -15806 -42326
5846 -42326 -41243 -43037 -52009 -32381 -7708 -1545 23941 60102 56921 23763 13922 9306 -5814
5833 -5814 9661 14395 29221 47341 50268 42491 16326 -1797 -10678 -42448 -57392 -76342 -53921
5820 -53921 7923 43415 43099 24910 22950 -1816 -19094 -19238 6014 -344 -13134 -4596 -27658
5807 -27658 -50663 -32912 -4266 2981 3521 -19119 -44270 -51072 -44697 -43742 -45382 -59537 -47977
5794 -47977 -26884 -29453 -3871 10346 -5102 -35711 -27565 -1481 -17663 -14551 7074 1943 -20739
5781 -20739 -19183 7911 30376 26934 8542 -18081 18808 36337 1707 -8888 -15430 -3950
5769 -3950 12395 15384 421 15441 15442 13830 20521 19076 11788 18923 7517 -13216 -3884 33743
5755 33743 44074 13349 28702 -1314 -19740 3598 6397 -23160 -32257 -25357 -26376 -38537 -30001
5742 -30001 -32666 -21784 -27273 -30569 -31877 -280 -13504 -34632 -32432 -26732 -26111 -16910 19248 63796
5728 63796 50584 31938 34200 5076 -6700 22623 12563 -8447 -10582 5351 5247 354 23409
5715 23409 3292 -23933 -19630 -5486 -16682 -21272 1532 30279 -3842 -6081 19955 25406 15537
5702 15537 -4888 -46299 -26698 8372 9776 -6248 -16331 -18826 -3887 14927 21170 27390 27706
5689 27706 26027 26555 11096 -30557 -4866 2410 7054 23773 54546 55930 63597 61152 6246
5676 6246 4196 13097 607 -1649 -14398 -6751 -7796 18716 40695 26612 17052 -25221 -39124
5663 -39124 -17851 -38290 -40335 -12484 -30429 -22698 -28268 -11340 7820 2087 -3190 -3378 -28585
5650 -28585 -26829 8074 5335 18250 24663 3907 -34017 -36863 -30511 -42122 -31193 -13589 9746
5637 9746 7609 -10082 -17125 -4735 -27060 -20626 -12310 -20678 -17266 -7590 -13824 -21245 1047 12380
5623 12380 24799 24956 21039 8494 20287 1672 -15711 -12628 14076 5761 -3577 -20194 -27874
5610 -27874 -40774 -40523 -10449 4728 -4651 -27857 -46490 -29220 -15976 7358 11166 6698 -26778
5597 -26778 -9319 -2194 -25920 -43162 -42959 -28468 -13239 10063 3599 -3329 22489 16581 10829
5584 10829 6064 -5649 14133 8630 431 1058 -1921 -65 8523 2567 -1316 -42275 -49676 -28704
5570 -28704 -13185 -12087 -35527 -37193 -38798 -27920 -17165 9810 2274 -15215 -13831 -3574 10098
5557 10098 18991 -24625 -27517 -1437 4124 -13993 -5425 -7376 -34986 -25651 -6620 237 -9427
5544 -9427 -35822 -45846 -51387 -50540 -41233 -21732 -12645 8347 4173 -18582 -19949 -15209 -48 -13410
5530 -13410 -6652 34791 46641 44392 21125 -16572 -46200 -62744 -43219 -21736 -42341 -24236
5518 -24236 -14028 -5545 2613 17818 14052 -6806 -15325 -10010 -3011 18176 5259 14931 12904
5505 12904 1030 19701 16005 31937 34419 26481 -4392 7166 41172 47999 24134 -2146 -14334
5492 -14334 -28580 -40444 -13957 1722 25676 6696 -27991 -38657 -34269 -17500 3097 2270
5480 2270 -14074 -34438 -41603 -40414 -33223 -23914 -40667 -38537 -26956 -3721 2919 -10180 4477
5467 4477 18516 38775 38189 -15700 -29062 -8619 -7434 3233 13615 23565 33611 30041 15278
5454 15278 26388 4445 -18213 -19475 -15989 -21449 -30806 -32610 -15850 -5932 -12593 -7928 14420
5441 14420 7961 12435 13426 6768 18739 23886 3154 -8562 -18599 -24512 -9104 -19160 -20748
5428 -20748 7820 20144 6190 -4098 13222 4836 8973 5648 7688 -6644 -18026 -11290 -1880
5415 -1880 9764 -4932 -31445 -34628 -33167 -39042 -38721 -25938 -10788 1574 17768 18737 1258
5402 1258 -15157 1210 13075 6670 -13347 -21941 -13745 -8450 4235 24957 -7567 -40499 -46687
5389 -46687 -32820 -24447 -29339 -39379 -31717 2512 28262 28582 317 12022 6294 -4733 -6244
5376 -6244 -17756 -14558 3150 9418 -17516 -15534 2644 15056 22289 22462 40411 47973 73415
5363 73415 63962 34787 7299 -6989 7213 8120 -6574 -9221 -14432 10405 13938 -19988 -51071
5350 -51071 -48138 -22175 -7637 -2687 21187 17462 8593 23669 37193 33660 39149 27775 26147
5337 26147 16924 2888 15874 22927 12455 -20621 -10961 -23716 -25335 -6244 -929 -4240 -20800
5324 -20800 -20601 18031 18069 -14331 -23728 -30730 -38279 -50429 -44143 -45073 -31413 -40783 -44437 -50280 -55958
5309 -55958 -28299 34109 58027 58741 19592 11643 12373 -4401 6601 -636 40362 53946 28193
5296 28193 -12717 -10272 -4180 1274 -12928 -26646 -20356 18457 15461 -9520 -4749 -14411 -23441
5283 -23441 -44421 -77676 -56101 -53634 -37155 -33045 -28953 -33206 -28802 -1597 -2882 -6281 -7577
5270 -7577 -28047 -32441 5632 17578 23005 46129 44956 25196 -16458 -44619 -48414 -28839 -28
5257 -28 4245 -9411 -42549 -63466 -66101 -40170 -31511 -34110 -24859 -37216 -29683 -14784 -8223 -22717
5243 -22717 -6623 -7004 -38700 -48991 -33979 -41382 -46174 -58744 -64062 -54754 -62079 -51641 -10090
5230 -10090 17574 5759 -21698 -18859 -1065 -26626 -39749 -46441 -21883 -803 -20912 -23945
5218 -23945 -3602 9591 22347 10548 11725 18108 17064 17080 7676 31922 38196 23956 37338
5205 37338 41809 14133 23303 19458 18363 5256 -10565 2264 17360 5032 -10970 -4414 24321
5192 24321 46768 49653 26362 24086 17921 31428 5928 -32409 -31015 -22421 -16018 -26461 -31937
5179 -31937 -33551 -9816 -1289 18272 13938 13055 2465 -5131 -54 11213 23047 20339 -22847
5166 -22847 -48172 -14676 571 -8563 4205 5253 -29680 -43353 -35078 -45400 -23069 -4124
5154 -4124 -9317 -2719 2714 1906 -11985 -32614 -18706 9134 -2759 -5289 -2419 20216 -1330
5141 -1330 -19164 -24156 -23957 23090 20392 7118 -3802 -12208 -22256 -37500 -29884 -26669 -40929
5128 -40929 -29302 -38056 -32669 -20416 -32181 -40761 -41599 -42582 -10553 -17226 -20824 5365 5345 21187
5114 21187 26393 19671 22581 35736 36225 9257 16690 42174 46933 -4773 -19902 -13255 -19492 -27826
5100 -27826 -39193 -32168 -21287 -27002 -21244 -33042 -29457 -22449 -25709 -19899 -17107 2061 14955
5087 14955 34928 19700 -8789 6849 15084 15542 22341 14177 19650 18267 14241 20983 18094 17376
5073 17376 19273 21038 20632 18544 1623 -5140 -25769 -39800 -24648 -19702 -16008 -11447 4379 1677
5059 1677 -8309 -26197 -32481 -18880 16518 26442 18264 1167 749 -23957 -5446 6549 1544
5046 1544 -20220 -21153 -41136 -61282 -41476 -15454 -9085 -10444 -1328 -22216 -5506 -3837 -15307
5033 -15307 -7578 -12360 -33924 -11189 -14829 -13670 -11114 10828 24681 33665 23484 16340 14937
5020 14937 23764 11382 -4609 -19775 -5997 -13465 -24058 -30516 -9939 -41455 -25433 -9782
5008 -9782 2399 201 15997 28866 26193 11541 20101 40057 47553 20992 -29524 -15953 -10480
4995 -10480 -11778 -14650 -19017 -17542 -21465 -17782 -75 -7962 -28013 -47490 -26026 -20003 -18918 -24437
4981 -24437 -22525 -14943 -5158 13359 12890 10925 33926 31854 11574 949 -9319 -4243 27012
4968 27012 4759 12063 14250 9892 28694 25507 -7846 -19743 9277 25108 16621 -2043 -15443
4955 -15443 -32417 -44386 -39341 -2441 -6780 -29325 -31007 -9515 320 -32527 -46295 -64661 -67384
4942 -67384 -41149 -29712 -33000 -59425 -62030 -39887 -20071 -13213 -13086 -23079 -17400 3051 31161
4929 31161 29364 516 11320 21763 13901 4359 7634 46278 59881 41272 -6218 -42061 -26702
4916 -26702 8817 23074 -8019 -9568 7754 2871 2047 7602 2664 -3329 1237 -11316 -14530 -24070
4902 -24070 19179 26951 13055 -18393 -17665 -30369 -49465 -49515 -26330 -12308 13787 8459 -16571
4889 -16571 -34609 -49616 -42672 -30947 -18698 -27440 -9253 -12153 -9457 -2429 -2804 -10526 -9187 561
4875 561 -24105 -26500 -14394 -2773 -15329 -27742 3226 -11599 1871 20113 12960 31550 30409
4862 30409 25595 36211 59613 59903 26320 19597 35760 34811 5996 1280 13137 30051 18808
4849 18808 10676 -3551 -33027 -43610 -19784 -16570 -6055 -1540 -10404 -30622 882 25336 8192
4836 8192 -10272 24890 33493 28159 22139 6171 28617 19733 11677 5471 -3304 2081 2595 -1190
4822 -1190 -7361 -32005 -30447 -14240 -19301 -38771 -29119 -29403 -15283 -8622 8517 35532 39130 21269
4808 21269 11904 -386 3393 6426 2815 -10766 -28353 -46286 -16745 20054 29562 20630 15871
4795 15871 -6956 -27555 -6019 35733 45173 35398 32474 31558 37005 -6854 -28060 -18712 -2523
4782 -2523 16784 -8679 -29754 -35704 -37764 -45161 -26567 -8473 -4983 -21544 -51791 -57112 -36831
4769 -36831 -63354 -71271 -71735 -60006 -34903 3827 8884 -5408 -18578 -20204 -22547 -14816 -28773
4756 -28773 -12781 -16526 -19309 -14909 -2419 -11167 10504 24125 17925 7940 -27438 -40661 -22493
4743 -22493 -14915 -20597 -6085 5382 5856 17096 -22192 -45731 -70259 -48310 -10607 3542 8130
4730 8130 463 -20775 -14941 -8543 26165 9843 -15934 -15308 -22286 -18591 -24095 -47283 -68732 -54493
4716 -54493 -44403 -26187 -5810 -30764 -40489 -37255 -1087 26249 35364 27352 -8290 -16567 2983
4703 2983 -13106 -33855 2904 29835 34514 34145 10426 -12709 -11415 27198 57532 49828 24100
4690 24100 6519 21109 33722 16586 -3235 -7878 -6854 5667 -13487 -13073 12190 33199 14430
4677 14430 5014 -5886 2793 2262 -8114 -7797 16868 10669 17928 30396 19177 -78 -2841 220
4663 220 12097 31030 32004 18809 1875 -3585 -14329 -12549 -21594 -7941 -4826 -3129 -6028 -19786
4649 -19786 -21515 -11512 -11404 -9184 16626 2661 -4225 -15118 -30493 -12919 11927 49244 68470
4636 68470 44067 9911 7438 15807 9964 -4332 -19331 -11211 -8599 -16734 -17361 -27017 -35010 -24548
4622 -24548 -19337 -51595 -17830 -14247 -20574 -18177 -14519 5275 6450 18019 48123 61398 39000
4609 39000 -6885 -24963 -39271 -32403 -35479 -7962 -5644 7582 18125 -716 -45029 -21803
4597 -21803 -23174 -41223 -69768 -57432 -40954 -47167 -21996 -1514 -7171 -17812 -27687 -19348 -18794
4584 -18794 -20882 -25157 -36527 -22153 13711 17531 6612 -8776 -8230 -3614 8739 -6888 -25401
4571 -25401 -13566 -12613 -9798 -11263 -13492 -27264 -33503 -38832 -22433 -18358 -4827 23187 25882 22061
4557 22061 11586 -12783 -9050 2412 3056 1322 -9674 -19291 -24252 1592 17444 25070 24220 12990
4543 12990 -807 -37124 -37330 -28758 -19284 -9013 -4921 -4577 2684 4425 13362 24265 13635 -1309
4529 -1309 4967 19557 18930 12966 4296 9552 26090 15784 -15698 -2486 -3396 -13347 -9575 -29549
4515 -29549 4685 60873 67563 56355 22991 325 -8322 3276 5777 14134 -1035 3630 -2020
4502 -2020 9706 32858 29983 30424 33609 26616 3721 -19883 -18355 -9883 7685 14463 8005 28810
4488 28810 3213 -4196 -9393 -37552 -26677 701 -2430 -19003 -20244 -6726 -5660 -108 2128
4475 2128 -6927 -12277 -5793 -5515 -7444 -1475 940 22758 -2681 -10772 -4195 11947 34777 38183
4461 38183 28890 29435 18067 16088 21821 24356 33643 18861 5337 -5230 -29998 -61111 -80794
4448 -80794 -62539 -43166 -15999 -7379 -15090 -55254 -58063 -12507 -8356 -13842 -10319 -24264 14806
4435 14806 27483 27459 11774 -3082 6991 3960 -12422 -8441 -31138 -15770 16286 11061 -15271
4422 -15271 -25921 -48411 -56145 -46885 -35402 -18381 -34684 -15547 6864 18596 -26056 -21441
4410 -21441 4586 18311 39353 30026 14927 21493 15188 3358 -10221 -18646 -36112 -31158 -6499
4397 -6499 12794 10954 17094 -399 -2440 -18524 -954 13041 11986 -15157 -4903 -161 1605
4384 1605 7869 8088 12610 25849 37310 10100 -13675 -3605 26493 -4074 -28816 -65878 -50885
4371 -50885 -39198 -6527 -18164 -6233 12105 -16219 -28287 -16094 13791 4208 -20714 -29133
4359 -29133 -45424 -55807 4949 22562 3701 3342 -6369 7387 -5696 -19991 3928 21798
4347 21798 8372 -3432 11005 -13928 -47152 -55862 -52782 -31938 -33508 -30215 -9657 9473 3933
4334 3933 6838 -23050 -43959 -50139 -45676 -27303 -5668 -882 -6308 -27356 -24894 -4211 -5312
4321 -5312 -5166 14782 28791 15418 -24789 -48217 -22390 3884 -11146 -22956 -24217 -27574 -31952
4308 -31952 -36605 1203 13726 12548 6984 10749 -3068 -10110 -30408 -6655 10592 5770 759
4295 759 -12307 -3987 13407 22413 43510 17986 -8166 -28400 -35314 -20573 -21256 2245 -767
4282 -767 23972 25164 10050 -25872 -33485 -21075 6154 25941 20324 -7000 -13816 -23738 -24377 -2140
4268 -2140 -9863 -12715 -7534 7632 33400 33743 6242 -8022 -21492 -11651 2982 -21798 -23022
4255 -23022 -21217 -31292 -50461 -35981 -40514 -61682 -62625 -64525 -45913 -32243 -5922 20211 5472
4242 5472 -20600 -51909 -50200 -27609 -19944 -25897 -25961 -24638 2001 26691 16390 -11240 -33796
4229 -33796 -65014 -86626 -65951 -17778 -5702 -3426 7688 45709 32237 -3625 -24787 -15085
4217 -15085 -12151 -46362 -51999 -38127 9566 38031 43642 18476 14926 37001 25703 8624 36894
4204 36894 23537 -20029 -23150 25292 34160 23592 32505 28994 16545 -1292 1602 -27290 -47675
4191 -47675 -46629 -21987 -13463 5105 2666 -42272 -57089 -41963 -37678 -20907 -6660 1672 -4093
4178 -4093 -17466 -22322 14749 18283 -7798 -10164 -21423 -29852 11283 27191 58285 62112 37806
4165 37806 -14309 -25960 -6798 -20935 -39718 -56233 -34777 -28614 11794 31398 17126 8197
4153 8197 -9077 15206 28362 -9284 -4569 -5310 -18316 -38427 -17388 12456 16583 16470 -18218
4140 -18218 -11579 3 -25855 -10992 -4307 -12957 -9245 -4835 -18578 -9831 -1299 35892 51517
4127 51517 25845 -3315 -11284 -7819 -2612 -3804 -6925 -5194 29361 28533 25160 32639 8848 -16980
4113 -16980 1776 11808 19261 27632 3964 -31466 -45063 -65946 -69285 -53678 -60422 -43301 -20339
4100 -20339 -15020 -6682 -12084 -7853 3041 45018 35274 9096 -25133 -52243 -24722 -7023 -2879
4087 -2879 3985 -5629 -10500 -2438 -8417 -24278 -5136 41591 39127 4828 -8183 -5904 -4196 -34656
4073 -34656 -53222 -33931 -18149 -8806 -14894 3809 3968 11514 25574 45091 21293 15953 18723
4060 18723 -7109 -22353 8152 13845 17395 21898 -527 -14633 -10428 9390 814 -3620 -22823
4047 -22823 -56285 -54105 -33055 14142 53789 71806 16269 -12685 -14426 2116 20833 23031
4035 23031 13632 -15386 -10709 -5944 26793 38160 30934 27379 35707 28204 17578 5280 -3949
4022 -3949 -888 11812 18131 -33242 -55090 -47145 -34839 -2095 24038 47077 33856 8171 -3231
4009 -3231 1185 -20871 -36363 -9444 -24112 -63736 -68814 -36339 -33700 17019 81978 86675 53862
3996 53862 6887 -8025 -37640 -64616 -56797 -53904 -16455 15769 29985 16011 -7520 -2217
3984 -2217 -1015 -15450 -17060 -22625 -37067 -49935 -47632 -22307 -34416 -41706 -12848 10426 -5680
3971 -5680 -11213 -17593 16678 9836 11945 -2830 -16751 -48551 -53447 -41751 -7662 15354 13022
3958 13022 -18530 -28072 -16388 13889 20463 -3418 -1008 -486 12658 10015 7602 -3985 16764
3945 16764 -12305 -20314 442 -3248 6859 6730 -9699 -48145 -61930 -53026 -27588 -1394 -8206
3932 -8206 -32255 -36851 -84782 -88975 -43122 -29047 -47043 -38886 -19578 -2329 -12324 11862 8256
3919 8256 13048 6536 7615 668 12805 12717 -4104 -11499 1079 2544 -8891 -31634 -31208 -27251
3905 -27251 -16533 9859 -15196 -19631 -7609 14377 1008 -22172 -7511 14347 14218 28650
3893 28650 26573 22353 21428 -22773 -48826 -48726 -17191 -16207 -15153 -16812 -68798 -75219 -42200 -28858
3879 -28858 -21785 -19646 -41023 -40362 -5502 3953 14213 -1437 -10580 51 23874 26002 9135
3866 9135 -2379 -6211 10025 29139 21560 -720 29398 49771 37195 15278 -11987 -44278
3854 -44278 -13891 -1797 -22180 -32424 -41753 -60282 -48316 -37458 -11467 -619 18165 20977
3842 20977 25780 49892 48290 30199 -3992 -340 7284 -12748 -22832 -1522 28120 12262 -15563
3829 -15563 -8764 21103 68148 73247 45264 2553 -5929 -7629 -14587 11391 27628 -15246 -36981
3816 -36981 -21870 -4377 -8160 -18708 -12591 16262 23142 -10552 -2909 -11628 -34377 -22452 -18249
3803 -18249 -39151 -16717 -2160 20828 26616 22907 3156 5601 -1678 -1500 -5269 15496 42132
3790 42132 32255 -16175 -33425 -46248 -48995 -48884 -39649 -41255 -52437 -61456 -61126 -53782 -24668 -5038
3776 -5038 3210 22055 32135 40535 53225 37628 7446 -16579 -11757 15311 10296 4287 15806
3763 15806 1025 -147 5487 6963 3194 -12766 -7010 -133 1293 -25087 -33596 -35005 -29929 -28903
3749 -28903 -13876 22842 61878 33931 12087 -15670 -30921 -17466 -30470 -38799 -33997 -22173
3737 -22173 -4320 10148 2673 -2500 -4777 16078 -3615 -33946 -21246 -6894 -16618 -11377 -23185
3724 -23185 -22211 -30036 -45437 -75205 -67728 -38381 -7399 15418 22646 4828 892 -2414 -22516
3711 -22516 -67190 -36693 -7620 -9318 -16711 -2832 11378 14899 1545 6371 39114 41270 25417
3698 25417 18216 3037 -5579 -19216 -54199 -38479 -27160 -36343 -39330 -20907 2058 10106 10090
3685 10090 13201 -8232 -8704 4615 -17404 8113 28751 15342 13597 -26246 -44542 -28482 -25931
3672 -25931 -26762 -24638 -4989 17375 16608 1516 25785 52473 19931 -10122 3057 9339 12849
3659 12849 20935 47202 25946 -1450 8092 6664 13150 12877 8440 -1183 13855 161 -3526 7641
3645 7641 -17958 -17188 -12810 -21094 -27267 -14176 12017 55851 45501 25960 22136 31617 34759 31875
3631 31875 32962 14990 -7163 -22547 -38614 -35483 -22474 6597 7826 5752 -9133 -15836 -11558
3618 -11558 -2982 -2011 -11352 4421 15377 -484 -30669 -25346 983 14574 23430 4651 28922
3605 28922 31251 14298 38951 29387 25501 -14729 -38629 -36820 -36330 -35454 -13539 -31991 -25783 -16657
3591 -16657 -9050 -11251 -2893 28731 34664 35881 26677 600 -36955 -36531 -14232 -31723 -34231 -31445
3577 -31445 -4869 9903 -4047 -23438 -51474 -52324 -25035 14612 18291 2558 3563 -4040 5778
3564 5778 16245 9609 32490 51965 47802 26081 4962 19028 38711 39700 27871 30222 36374
3551 36374 28148 14075 19299 5930 -20341 5519 26146 24842 7852 -21933 -48191 -44431 -32889
3538 -32889 -34033 -13121 -1772 -17327 -41412 -22485 -24595 -31994 -21747 -20660 -14953 20234 28144
3525 28144 16890 6994 2552 -4890 -43039 -31889 -33066 -27079 15058 9401 -8709 -17713 -31035
3512 -31035 -1395 11857 -1187 13559 37596 33430 42838 44892 24824 19229 -4745 735 23803
3499 23803 40222 41657 39371 47922 33337 13793 7033 -2683 12017 2137 9051 11550 15296 24217
3485 24217 26128 30005 44581 50109 47815 49331 56600 57261 46479 16955 6399 -1773 -14081 -5420
3471 -5420 4336 38840 34427 3685 2875 11683 15336 14145 -11699 -36578 -27235 -18037 -26360 -23897
3457 -23897 -27913 -28198 -49509 -42371 -52476 -41660 -43996 -53473 -41042 -30211 -44905 -47971 -35859
3444 -35859 -16308 13775 6051 -17169 -40871 -30641 -23402 -10663 9888 -2156 -9207 3108
3432 3108 -4416 -21410 -6293 -10686 -3874 2217 -20477 -25895 9086 6646 -5017 5804 36537
3419 36537 48050 42856 44153 25697 43849 61471 40310 19961 12006 -3771 -24131 -50514
3407 -50514 -37123 -12436 4101 14791 30761 28112 8304 3334 886 -7837 -21646 -15982 11799
3394 11799 32816 -12632 -61988 -74371 -47652 363 12761 -18563 -74130 -50185 -23139 -30445
3382 -30445 -64525 -61836 -44872 -11733 -5541 -18121 -10253 -20895 -26127 -36650 -24086 2132 21153
3369 21153 25205 -2487 -5656 -17722 -46893 -74108 -62463 -23812 -17516 -22335 -19162 -21472 -15418
3356 -15418 -8350 -14111 -21334 -31077 -23191 -1645 5908 4859 -7707 -22349 7722 17706 20165 9486
3342 9486 -4863 -1099 -3732 8226 -2134 -4102 -17010 -29121 -21642 -17091 -13839 -7835 -32110
3329 -32110 -35176 -37471 -38510 -31856 -833 -25442 -54960 -41554 -39674 -14281 -19730 -28056 -12795
3316 -12795 10876 14214 938 -4715 -40121 -51859 -47784 -46937 -51827 -65396 -28282 -15648 -13092
3303 -13092 -28833 10510 22968 3082 7914 25570 38643 13682 -7208 -4150 4202 11826 23363
3290 23363 22246 10065 -3456 -4476 13025 23304 -1930 -25776 -30432 -24579 -16513 1656 -8555
3277 -8555 -4523 12059 12767 8980 20075 36648 34464 31858 11776 11448 50645 63673 44803 23144
3263 23144 18357 4963 10730 14113 18873 19832 16689 -4310 -22837 -35727 -16365 10965 28086
3250 28086 39486 29381 5857 4397 16620 9052 12411 10373 34135 20746 -2060 3643 4221
3237 4221 11839 11948 27594 14772 5932 14032 15058 6289 -10752 -14748 -9194 -15831 -4767 34742
3223 34742 24783 12435 15151 17626 7941 359 -11801 -36906 -39855 -45159 -30646 -21561 -18479 -22023
3209 -22023 -31611 -54834 -17741 1855 -2766 -7235 -24099 -39066 -23902 -10702 6125 17167
3197 17167 23686 20046 1675 -11342 -12518 -12471 -12577 -11313 -2580 -13160 -40731 -38431 -36125 -44205
3183 -44205 -54165 -52783 -20624 13417 17162 322 -21267 -9437 -8955 -42884 -68727 -43262 -25155
3170 -25155 -18979 -1415 1170 6485 4035 32340 53413 66318 70727 63462 60254 18405 4356
3157 4356 -4373 -10718 -8845 -11245 -20466 -35818 -39761 -14801 7039 16738 19545 20357 22225 25025
3143 25025 27693 13954 -6636 -10446 -6995 -21156 -26849 5088 -8080 -41747 -53080 -64143 -58822
3130 -58822 -45118 -27836 -14380 -28258 -15634 17790 10386 -2217 -5349 -15031 -12518 -55225 -61937
3117 -61937 -38908 -21396 -3657 -11169 -26997 -36112 -47060 -43868 -9286 -9715 10428 14961 2882
3104 2882 1139 -32058 -33009 -25367 -21430 10088 -5762 -14555 -3191 6174 10060 12543 16275 4452
3090 4452 -336 -5361 -9788 -5377 -8288 -15461 -12860 -27119 -47750 -57857 -49903 -33576 -25262 -15149
3076 -15149 -7939 6692 21604 34856 19425 25574 33228 32905 49908 45931 29182 13178 22663
3063 22663 22496 38585 25062 5378 7096 -77 3979 6858 -1658 -24928 -26534 -10427 -14148 -19506
3049 -19506 -32700 -22148 -4117 -4514 -17437 -29600 -35204 -10261 5667 11075 14717 15447 -802
3036 -802 2082 -4781 17466 29665 26279 11565 -7434 -17494 -5854 -5723 -11573 528 19983
3023 19983 21034 38213 35805 48484 46605 34614 6371 -248 10382 849 -16782 2525 -22745
3010 -22745 -44491 -58672 -58954 -43497 -32952 -12192 23854 35476 -177 -9035 17205 45883
2998 45883 43164 26015 37608 51973 37575 18698 18790 30895 23003 14311 12774 20623 25028 30065
2984 30065 25932 11323 2772 -737 13254 9197 47914 42298 20091 20717 12750 15554 5841 -28274
2970 -28274 -17930 8190 7769 -10573 -6520 -28111 -43947 -39922 -35876 -46038 -11176 13989 177
2957 177 -5403 -6814 -16321 21331 46133 32677 15861 1928 9620 30060 21266 20241 24189 23191
2943 23191 6517 28220 32445 2186 -4578 -9035 -22026 -15912 2716 23494 8597 -33337 -39544
2930 -39544 -13150 -13764 -20108 -8614 -11546 -16267 -11271 -14614 -4298 1167 12578 65397 77718
2917 77718 45945 33986 32299 34344 5621 -2557 23758 40617 32918 5267 -14813 -15974 1108
2904 1108 2678 13496 10285 19455 16521 20924 30420 43237 31836 30037 42754 44956 56544 39877
2890 39877 25978 43168 21386 -12058 -35803 -29015 10082 23831 15403 21785 32209 26344 -895
2877 -895 -24787 -2839 24015 35506 17526 164 -4938 -2433 -14689 -4280 15004 23279 18522
2864 18522 -5905 -7751 -16092 -14723 -13964 -16827 -8417 -9011 9473 4762 2211 15497 19491 23850
2850 23850 -1388 -37208 -21712 20296 49845 23183 26586 12848 -25529 -17514 -4236 -26431
2838 -26431 -8139 -30417 -36862 -15556 3641 14148 -2481 -22596 -27060 -16178 -19673 -32499
2826 -32499 -26462 -7267 -4332 -9609 -11550 -27494 -24440 -7597 -902 21265 24145 27778 22848 7029
2812 7029 25348 41273 32043 5124 -25536 -36875 -28010 -5755 25656 42173 21037 -522
2800 -522 -15242 -27494 -40599 -12567 8167 -3061 10750 1315 16088 10767 9520 -2991 12239
2787 12239 18079 -1566 -2147 -14573 4155 5266 24331 34466 13723 -15451 -20332 -6669 -9702
2774 -9702 -1019 -4795 -16332 -26237 -48016 -54143 -49062 -61222 -67213 -48674 -7376 -7605 -7616 18731
2760 18731 11604 -10684 -45576 -44033 -5085 20481 19480 12950 -6205 -13339 -23165 -46084 -23022
2747 -23022 11323 38092 65867 59088 42198 7993 -1106 45589 43798 31058 15179 14044 21496
2734 21496 20321 17906 -18711 -44356 -38757 -10095 -5433 12083 23196 15505 -488 -19067 -28020
2721 -28020 -3225 24670 34481 30975 16161 12571 10445 22753 12216 -12422 -19753 6988 -7141
2708 -7141 -13174 -36638 -31805 -4295 -7591 -28317 -38970 -24675 -9166 2263 479 -5681 -4333
2695 -4333 -18125 -5845 -14178 -8174 -2140 21517 36375 18335 4981 1817 -15694 2319 -3133
2682 -3133 2797 133 -14035 -18662 -29326 -23566 4299 8103 -4495 -13019 920 -1462 -15480
2669 -15480 -4352 311 -2146 22855 44972 33200 13644 2595 -7171 -13267 236 13853 5179
2656 5179 2994 10108 13255 27545 28304 12312 28500 47422 34687 14778 -28216 -36003 -8205
2643 -8205 25631 30275 21541 25750 5145 -39886 -45978 -24709 -19661 -15616 19109 15781 14222 23353
2629 23353 14749 138 -19862 -7246 23331 16051 -9096 -30242 -23890 -11503 -20175 -3460 -10592
2616 -10592 -25632 -21960 -11276 -7275 3064 6881 18016 48702 45373 30946 15238 6446 24374
2603 24374 63471 99313 77898 60671 48488 29371 13453 -16301 -1685 2282 -2978 -13644
2591 -13644 -15586 3050 23485 12401 -18022 -8067 -4699 -4441 -8299 -45547 -29325 5885 41762
2578 41762 51160 40470 24305 16719 20270 42636 37819 32602 -4204 -17384 -20910 7856 22794
2565 22794 14430 10497 6101 17201 35039 5074 3957 15283 15774 43139 78909 104526 68598
2552 68598 39511 31408 24816 39861 31477 6567 3675 21820 21215 27812 67981 80154 72714
2539 72714 25058 9468 28789 13059 -19815 -15821 -10063 -6738 1 -900 -2340 13861 -778
2526 -778 3733 3460 -5124 5496 11448 22306 20329 5740 -795 -3190 -6533 -2853 -12719 -220
2512 -220 55141 59343 26566 15059 -4596 -16595 -10676 6255 12002 15347 -5172 -15519 -31202
2499 -31202 -12666 21263 25948 15575 25505 17527 24921 26355 22298 16595 11668 3033 -6727 -3528
2485 -3528 12991 18755 9189 25988 29229 18169 22013 29719 3830 -8477 -12031 -14025 11835
2472 11835 10707 23562 27466 -2737 15786 43178 13482 6789 16236 51140 57169 18004 28100
2459 28100 26048 9463 25789 16317 22486 16237 1143 -12641 -6364 3843 5754 25352 25438 9272
2445 9272 22393 -1504 -21015 -29603 -11928 15831 341 -22147 -25712 -19682 -31581 -30377 -26340
2432 -26340 -12863 8915 3737 5792 -6354 -8797 -9530 4818 -6441 554 6962 -7665 -1992
2419 -1992 -4123 18330 18092 20302 20635 2219 -2656 -3846 -13222 -4007 19024 40024 23255 -9153
2405 -9153 8338 848 -13139 1020 17484 19846 15683 -9618 -11392 -1700 -5016 -14311 -4123
2392 -4123 -7245 7664 28716 15305 -18874 -24341 -8142 -6085 11373 22838 4299 -421 11188
2379 11188 12232 8106 -4336 -4866 8674 -2396 -2532 7794 727 -8449 -30931 -75267 -70858 -50823
2365 -50823 -34682 -12701 -30331 -34778 -21605 -21108 -13826 -7885 -14947 -8528 4226 1427 7223 23888
2351 23888 36732 62823 58088 32009 38975 43065 28370 12619 12606 -15497 -22054 -10854 -15123
2338 -15123 16742 46991 13474 20532 13955 -2935 1282 -675 1893 -4153 11938 20152 8354
2325 8354 14413 226 -16985 -13498 3011 18523 32907 11903 -28107 -31566 -18396 -42612 -46860
2312 -46860 -45567 -33293 -11837 8304 -4298 -19337 -7307 7363 -13619 -31158 -7024 -14831
2300 -14831 -27611 -33449 -20328 -42687 -61885 -51407 -32778 -17761 -39065 -32798 -32168 -20560 -13297
2287 -13297 -18115 -34558 -36993 -27483 -24572 -1324 -5194 -35288 -20145 -31827 -62461 -46807 -2292
2274 -2292 33448 6447 -20328 -9923 -5928 -57863 -74188 -54684 -72687 -75245 -29341 -3577
2262 -3577 11609 -3675 -11252 -28185 -37751 -19495 -8627 -13983 -14183 1928 -10075 -64013 -56287
2249 -56287 -20447 -1648 13645 34254 16059 8059 -8900 -10528 -16308 -9548 -33845 -22070 -30507
2236 -30507 -15091 -9519 -20361 -33655 -33363 -35431 -26127 -22313 -2854 5757 -8434 -17500 -33863
2223 -33863 -11233 22064 24545 40491 35552 39221 42115 39874 31633 38955 54807 36728 28606
2210 28606 7581 7486 18966 19678 34415 17372 3906 8766 -6997 -58172 -70556 -46277 -33745
2197 -33745 -23698 4866 16836 14468 15120 8874 29888 49672 55422 26892 10163 19576 13734
2184 13734 40116 40586 39312 -5967 -7452 24310 25635 19789 5875 3613 7964 13667 29300 48835
2170 48835 20609 7073 23706 24543 23838 18328 5073 22814 49636 52040 12598 -17180 -19900
2157 -19900 -15671 4758 16117 5327 -21449 -2718 8274 10210 12261 15900 5099 48 3794
2144 3794 15966 11754 4602 -1548 -32716 -35958 6954 19241 230 -5833 -4590 3538 1634 -35665
2130 -35665 -41095 -8378 -6686 -34243 -49830 -40549 -28646 -40409 -2610 46108 47259 17718 21000
2117 21000 25259 40780 49923 35542 24722 12127 25179 7116 -7425 -26040 -50429 -34930
2105 -34930 -11013 33423 20411 13154 14127 5025 -4502 -10745 4782 -12824 -14905 -3153 -15866
2092 -15866 -14100 -19621 -30773 -32857 7294 41873 31865 4688 18112 65553 64181 32240 8434
2079 8434 -7905 1093 16489 17953 26906 27811 5014 24841 10784 -6582 3613 -7907 -25259
2066 -25259 -2640 2357 -7783 -1476 -1888 -16555 -26800 -16813 3580 18820 -6489 -7062 22835
2053 22835 24225 26605 20868 -5965 -6678 -1962 -2211 -359 6959 -1593 3050 7269 -13029 -18070 5227
2038 5227 4668 2423 6296 -6794 -23190 -7018 16992 37879 35576 34069 26418 -8405 -23584
2025 -23584 -25925 -24114 -11654 8024 42637 41560 35706 28525 28443 29648 23435 10559 -23311 -34838
2011 -34838 -20978 -16049 -21952 -14778 5741 17477 4264 -11304 -10515 3443 2390 -872 9614
1998 9614 14057 7256 15196 11276 -6771 -20059 -33914 -19962 -6934 -6090 -2962 -12019 -10 13743
1984 13743 -1170 -44446 -51481 -42462 -24082 -13906 -20041 -7566 -10290 -12064 -8110 -13047 -15384
1971 -15384 -17565 -17205 48 29392 26929 47047 44816 37026 11992 -1543 13142 24568 16211
1958 16211 -1379 19032 21776 11830 7883 32071 38281 20685 -28665 -36586 -22754 -2192 26548
1945 26548 48401 52225 50019 53915 46255 43060 1462 -30659 -29776 -19702 17219 45397 42575
1932 42575 44249 44718 44252 28608 3625 -32171 -50272 -33032 -48732 -48371 -45357 -57998 -58499 -37655
1918 -37655 -32970 -17448 5933 27646 30005 9389 22351 28531 30532 42875 46295 49425 41763
1905 41763 43496 30689 18265 22069 -9767 -22529 13693 47431 34678 -2533 -30574 -34155
1893 -34155 -23447 33 10184 -2456 14930 29375 35280 30446 -18204 -30406 -21716 29101
1881 29101 51811 34158 -5083 -38533 -39679 -34388 -25527 -13723 -4806 -8708 -20487 -9656 4921
1868 4921 -21333 -27067 8278 -4963 -9836 2386 -20970 -18899 -27633 -22115 -9567 8526 11291
1855 11291 27246 24948 41719 34444 22029 45719 52070 7072 -24795 -43176 -23387 -11768
1843 -11768 -1362 13452 45282 42397 19024 29066 19058 -27516 -61195 -48820 -40898 -33719
1831 -33719 -26946 -16822 -7276 4879 -504 -14926 -8508 13783 -5371 -15579 1774 8660 18352
1818 18352 20753 -11583 -33071 -26251 -10198 20348 42790 16589 -26522 -21972 -422 12791
1806 12791 -1734 -28760 -22526 -3692 28912 27456 -13540 -22079 -20944 -17320 22835 23059 13728
1793 13728 33034 15904 -35566 -53886 -7090 3337 31250 73480 72100 73948 81113 77497 64725
1780 64725 53251 24681 3655 -8134 -27617 -12142 10202 47945 48641 35399 8936 14168
1768 14168 31140 28726 32617 64852 80589 61245 55788 54733 30928 5936 -9602 -15183 4247
1755 4247 17472 6638 13653 10266 8024 20504 23470 4181 10581 8881 -293 28774 46718
1742 46718 48319 25870 -5748 -19303 -11757 -8925 8612 32359 25458 14052 -7790 33219 15872
1729 15872 8167 14085 19242 9204 -2909 -13317 -7078 4518 24588 7145 -8688 -14766 -52380
1716 -52380 -57930 -23562 -28376 -27881 5739 -3968 -31578 -39048 -29315 -5569 -8179 -14046 -14185 -20053
1702 -20053 -26839 -28357 -37839 -44300 -23412 -1590 2429 -4202 -14338 -3882 -1488 -1344 -14286 -112
1688 -112 -30288 -27345 -5468 3258 26457 31572 31588 40959 40554 23304 5449 15178 9636 -4077
1674 -4077 -681 -5450 7760 23328 30301 51042 52918 54485 36538 24861 18523 11029 20939 29049
1660 29049 12302 16659 -7061 -8162 -6250 -1660 13430 15028 14744 16219 2221 1703 10617 14584
1646 14584 24377 35672 36957 44036 32916 42345 61002 45686 8958 -5751 -24904 -43792 -32187
1633 -32187 -14453 -22163 -11455 2582 -3422 3781 -6174 -15018 -7824 26458 12150 669 2670
1620 2670 13242 6474 6956 -16533 -12647 2444 16572 28609 21539 20791 -14311 -13881 -8527 -10143
1606 -10143 -19400 -41622 -38023 -36624 -3656 25125 30463 50208 24294 1226 -19406 5842 15914
1593 15914 2826 -12373 -4124 5477 451 18611 34075 44068 6836 919 22862 23500 16411
1580 16411 30028 17315 17293 25014 26884 21657 23025 19084 1245 20419 25517 17227 6193 -1630
1566 -1630 -14237 682 10802 16234 31936 78691 57699 19623 17140 37418 17401 14272 -4790
1553 -4790 -4689 29396 14193 538 19298 19551 12052 -4023 -18430 -30401 -44934 -17844 -29915
1540 -29915 -48000 -55296 -39526 -27679 -23222 -9805 -28674 -30123 -32950 -37189 -30490 -8534 -20008
1527 -20008 -31980 -34218 -11948 11295 29822 26389 20670 1691 -5011 -26914 -29204 -18726 -10018
1514 -10018 18899 -11 -16040 -5531 24179 36572 -10354 -8749 -12610 -30939 -42792 11644
1502 11644 22865 -2813 -12862 -23193 -45645 -32471 -21206 -26293 1821 -15600 -7138 -11621
1490 -11621 -24157 -16053 -36739 -6355 40356 59351 58259 44412 45636 57486 41786 24897
1478 24897 45773 33506 -9059 -18484 17207 46699 55124 27990 15946 -11504 -23736 -23201 5993
1465 5993 11729 16227 19352 23224 2689 7243 20118 18990 23472 22653 11083 1220 -12813 -16894
1451 -16894 -20490 13183 26963 5669 14424 30339 1648 -6591 -2039 4758 26016 36623 40468
1438 40468 33535 51387 61612 64800 46434 43047 35614 20047 -16374 -65532 -54113 -17500 -33255
1425 -33255 -46008 -22070 -8218 2053 38605 56597 50713 27232 -11913 -25315 -13839 -23379
1413 -23379 -10813 3461 -4366 -7823 -6864 14979 14688 4077 -6787 -10095 6862 -2340 8121
1400 8121 21311 5063 -11984 -24083 -20476 -17752 -39675 -38626 -41541 -52720 -28709 -5632 -1796
1387 -1796 9144 41340 57765 35726 26647 -3418 -33984 -27573 -39441 -30366 -9959 -4311 -7457
1374 -7457 17556 35072 51513 56982 46738 5231 -17571 -32997 -27832 -19227 11501 13117 21054
1361 21054 -922 -45155 -41787 -2572 -5347 -28447 -31868 -20003 -28365 -25555 7521 22443 12391
1348 12391 -14417 -37222 -22885 -21770 -19765 -2791 -27895 -14176 -19538 -41758 -62811 -71326 -64390
1335 -64390 -34677 -2054 17059 28466 10861 4950 16355 8036 4950 25687 24411 8609 7655
1322 7655 31198 54297 34763 13097 -19920 -21039 -5487 1135 778 -13990 6205 2270 -10901
1309 -10901 -12084 1909 9618 6996 20754 25905 15357 32869 28304 18152 33884 45936 17166
1296 17166 210 -1170 -389 10222 41485 36997 21042 -285 -10712 -18456 -8094 -13056 15772
1283 15772 8404 6135 8092 -5114 -18617 3645 29479 27588 16842 60450 64820 31250 35363
1270 35363 27537 29404 34375 6114 -8497 10751 17930 28498 -13170 -40251 -28993 -14096 -9999
1257 -9999 377 9531 -3057 -5764 4598 16881 -20658 -26557 -47762 -64812 -40721 -33087 -20297
1244 -20297 -13119 -12303 2284 9993 11324 23624 18224 1744 24135 21803 -2589 -10517 -4789 -13185
1230 -13185 13896 24032 35023 51403 29348 26488 29039 44030 14944 11476 -9109 -27182
1218 -27182 -30493 -13095 -39325 -49812 -43923 -42759 -25803 -4686 -6400 6178 -11633 -33517 -37779
1205 -37779 -18432 21623 30500 8022 8117 -1868 4029 -361 -13473 1383 9466 14958 32254 39571
1191 39571 36101 38276 46186 42384 22183 18412 13923 6018 -953 -8389 -29867 -28156 -35198 -38147
1177 -38147 2448 28684 38854 -19281 -51968 -71592 -51276 -27817 -14039 29223 31860 20561
1165 20561 3696 -4643 -24831 -6010 15661 23618 -4113 2641 31910 62740 36561 18548
1153 18548 16987 27995 19749 -5519 -25603 -59223 -53755 -39192 -31563 -16087 13555 7671 18114
1140 18114 -3655 -22782 -11924 -7457 6786 1560 -10434 2298 -19043 -29764 -27085 -19409 1887
1127 1887 14663 10585 4827 -16289 -4767 7363 -9681 -8196 10572 22988 21213 26419 39623
1114 39623 39169 40043 23135 3519 -4861 5059 10648 -8708 -3484 3795 -9551 -24145 16824 24894
1100 24894 13010 21011 22547 16640 38332 43206 19441 28375 58621 39311 16165 10804 12663
1087 12663 19127 11176 33895 34758 6707 -12276 -11625 -19215 3484 37926 42784 6018 -7987
1074 -7987 1399 19484 -7107 3575 18395 26020 32396 29578 46471 35693 8712 -15263 -9571
1061 -9571 1520 8044 -13339 -27931 -18934 -7785 4335 4887 -12961 -9199 19772 28574 24384
1048 24384 6422 22796 10444 -27956 -33321 -924 1154 -3096 -1597 -17185 -20453 -15452 -7759
1035 -7759 8072 21504 2612 -414 5695 14149 -1483 -5142 -4290 -33184 -30540 -32467 -33995 -2390
1021 -2390 37390 7635 -16088 14598 18874 9924 -6680 -33506 -21363 8214 41800 19822
1009 19822 16252 8922 14901 9922 8513 -5981 16823 -4149 -83 18989 27475 45031 41566
996 41566 28829 -4199 -22057 -12237 -11272 -13046 -4525 17 -10989 -2856 10225 11527 11169 -8843
982 -8843 -24958 -12397 -2485 3593 20933 36331 32623 39303 40515 34792 9563 19312 51943 55379
968 55379 46739 25687 -4279 -31059 -5549 7863 12052 14885 3078 -23210 -19585 -14492 -2183
955 -2183 -14827 -11529 -1558 1691 2388 14490 17901 28982 20455 -2632 -32646 -24837 -9678 -2331
941 -2331 24071 1574 -7404 -5657 3166 9397 7818 10810 -8445 -31786 -31504 -35727 -50521 -47306
927 -47306 -33284 -18835 -28541 6215 11439 8622 3524 23621 18397 21696 5352 -8032 -14433
914 -14433 -15499 -13827 -4243 1004 -12388 -16547 727 11772 29092 32451 656 -25582 -26515 -3747
900 -3747 418 7805 3603 -3357 12484 28916 15653 747 -1255 327 -10851 -287 33216
887 33216 39871 49420 41256 1402 -3411 -4274 -9776 -12431 -6848 -17186 10110 13650 10178 26626
873 26626 26217 19780 17984 9806 7811 20646 44556 73587 67213 50080 41009 35650 51495 34175
859 34175 -860 -17320 -15973 -13045 -23571 -24352 -25669 -2097 2140 -3122 -3933 25357 12536 -5015
845 -5015 -11099 -5908 -19526 7559 18019 23856 341 -8098 -34298 -42433 -15082 33214 18638
832 18638 -10544 -13729 12212 9774 -2538 40 -850 3475 22998 33911 30370 11628 -2595
819 -2595 -31503 -10470 -19684 -36690 -25904 -8280 -4674 -11242 318 1765 -616 -9100 4877
806 4877 168 4096 -7094 -32659 -20798 18878 38056 30395 7034 -1534 16148 31212 131
793 131 -28208 -30468 -16856 -17942 -29012 -19942 -27927 -44557 -31586 -18598 -11708 2553 23258
780 23258 16531 12356 37658 25865 10871 17922 -129 -86 4145 15518 27701 9559 -17384
767 -17384 -40707 -55636 -28819 3869 30198 26120 15095 26122 33284 5561 -35389 -46017
755 -46017 -38284 -33724 -12143 -5121 -10142 18313 34836 29329 12632 27816 76110 72938 24151
742 24151 17657 36935 44608 24290 12774 28374 40095 27419 -13035 -59440 -60161 -35079 4187
729 4187 26356 45242 42621 18729 34986 18566 11857 1965 -9311 16050 30229 36151 43084
716 43084 29535 29173 19634 21875 4297 21607 24621 5170 -18776 -22491 -21097 -14201 1007 23388
702 23388 18702 8586 -4805 356 4029 -3969 10348 22031 -5270 -2029 10296 13344 -11177
689 -11177 -29582 -8433 -4186 -23524 11767 19317 -6779 -15628 -24783 4933 3176 -4715 11800
676 11800 29414 29394 7249 -11144 -1353 24196 22125 4946 -3841 -1957 9294 33995 41401 31145
662 31145 325 -25469 -39546 -52317 -45874 -26111 -25865 -24293 -12640 24302 36871 6280 4181
649 4181 25300 11571 -18339 -1561 24170 12355 -36821 -65480 -16757 22764 34759 35644 42603
636 42603 25167 28825 12729 -3508 -9967 -29898 -59066 -70461 -46859 -24942 -42106 -53795
624 -53795 -33934 -18065 13550 5517 -20028 -6256 8495 22503 33910 -2918 -9635 8979
612 8979 8171 6393 33398 3451 -7647 -13545 -27043 -31141 -41304 -12397 3658 -16767 -15729
599 -15729 11232 -12605 -39074 -17154 27170 32612 24378 12057 13427 23262 27562 16421 42106
586 42106 49732 43627 52562 26956 6791 -10233 -22041 -22993 -16619 -11824 -26456 -23277 6222 8932
572 8932 -1243 -2662 -6465 4882 -11528 -25079 -14952 3564 569 29784 40433 35458 15194
559 15194 -3824 -18771 -15307 -6822 -23846 -27372 -3992 17677 7904 -6247 -13874 20139 19950
546 19950 -11290 -10389 -7675 -24456 -20640 -20791 -1319 -12128 703 18971 24376 29852 13332 8727
532 8727 -6447 -19295 -47953 -10186 27605 38570 25477 6915 6743 29385 15178 -9531 -1009
519 -1009 1836 -11020 -29318 -30718 -34506 -32168 -5156 -14964 -23910 10180 8628 17158 35018 19037
505 19037 -14451 2834 8319 -1467 -3390 3483 23686 10624 5751 -22250 -17655 6611 25379
492 25379 24146 -2030 16742 37717 34146 39312 21051 33858 24362 5301 -10108 -8895 -14203
479 -14203 -49651 -50865 -45639 -14799 -2357 -1034 1960 1765 18747 38215 10428 -28741 -29079 -24952
465 -24952 -553 13590 -19462 -17374 -3681 -7277 -11596 -34102 -40946 -51310 -29690 -2133 20214
452 20214 -2218 -8645 -11184 -13658 -1841 -15029 -30072 -48670 -42601 -16094 -24596 -6422 20171
439 20171 -2394 -3358 -18712 -24189 3136 -9531 -8814 19312 18085 13292 16456 1357 10507 -24759
425 -24759 -14831 -7284 -11392 -20883 -36425 -10499 15904 -3780 8413 32986 9332 8678 7773 9986
411 9986 20897 26248 40350 49972 38657 -4417 -9505 11069 21191 40465 30426 21067 34328
398 34328 39874 40340 40903 48233 61309 49000 40502 29493 27074 29238 24348 7891 2896 -9750
384 -9750 -6489 -5980 -3975 -4267 15225 1310 -16802 10895 14404 9825 31781 40505 45252 28353
370 28353 3111 -2412 3844 11055 -3822 -14721 -26859 -20044 12840 26033 3362 -18589 -19659
357 -19659 -17641 -6426 -1315 2403 1740 3922 -5932 5819 10554 12030 4866 -1602 1938 23842
343 23842 16554 15972 18807 2704 -3472 -5745 -996 1502 1678 2014 -6753 8845 17114 8791 -10792
328 -10792 -27850 -6525 -26749 -69021 -65379 -26989 -19545 -19700 2358 -11349 -14057 16969 14436
315 14436 21354 19570 4338 2181 18250 23867 35442 48898 32317 29241 30571 34118 20690
302 20690 4276 5429 -804 -1151 12122 10423 3547 -11969 -18314 -9024 4326 17536 26198 32189
288 32189 45479 62179 56177 33867 13801 -19222 -35684 -15614 7548 28383 26914 25633 31243
275 31243 51730 38012 15833 -3912 -1697 3750 -6546 6321 -1227 -14424 -4165 12038 22060
262 22060 7245 -9754 12597 22740 -4801 -12526 -6493 18848 39992 46867 22841 43319 25071
249 25071 5801 33671 62751 55005 51554 41300 46424 33602 25210 21742 37901 42928 35095
236 35095 22642 19280 31002 20343 6072 7085 17776 19231 21030 2754 -21601 -19856 -27100
223 -27100 -16535 -13221 -19416 -7106 -24983 -38104 -44522 -54382 -47018 -19032 -13232 -17572 -35197
210 -35197 -36932 -14105 -17710 -13768 -11716 -3036 4896 16142 15603 4006 -6016 -24984 -7496 4708
196 4708 -1566 1343 109 2397 10928 22921 7520 -555 3616 -8781 -9173 -12090 4394 11251
182 11251 27685 33039 21293 5103 -13644 -22765 -22042 -6092 -19381 -17341 -9715 -42314 -48661
169 -48661 -42449 -34711 -38472 -36431 -14227 -776 -22090 -19434 -19102 -35221 -35434 -32441 -3567 31182
155 31182 35009 25232 8733 22980 6403 -7829 -8412 5839 30477 27486 27148 29451 34777 41904
141 41904 44271 38206 7815 -23093 -18250 -9342 14520 5268 -9961 -11950 -24776 -6140 27061
128 27061 25098 1815 -7139 2354 3523 -344 13379 25931 15356 -8193 -7425 -6759 -21566 -34081
114 -34081 -13452 -8825 1609 5709 -1486 11513 11595 10410 3075 -18173 -11721 -11173 -14838 -12657 -565
99 -565 7471 474 3023 -4219 260 26945 23332 2791 14357 21669 16768 24275 44568 48675 36216
84 36216 11526 8935 24561 20153 5110 20517 17569 4119 8810 7356 23180 11123 6152
71 6152 1836 -12129 -6757 1325 8609 11384 12971 12448 14010 25337 35996 49134 41084 23857
57 23857 19488 21806 18541 9171 -9073 -11425 12012 27901 9219 4254 16535 17100 8666 -5361
43 -5361 -15804 -12764 -10985 -1459 -17565 -2954 13283 20189 19511 -964 -12479 -8022 6616 16246
29 16246 4099 -1495 -6176 -11045 -11562 -13069 -10190 8479 14408 -2230 -16825 -2289 9487 -11094
15 -11094 -16228 755 17584 13856 17089 15702 13238 -6287 -21718 4630 18090 19594 34954
2 34954 44099 32488
0 32488
$$ Imaginary data points
$$ [...]
##END NTUPLES=NMR SPECTRUM
##END=
