##TITLE=Analysis number 329760
Compound Code cc 59024
Book Reference 546/38
Project Code adrs
Chemist Name craigr
##JCAMPDX= 6.0         $$ Bruker NMR JCAMP-DX V2.0
##DATA TYPE= NMR SPECTRUM
##DATA CLASS= NTUPLES
##ORIGIN= Bruker BioSpin GmbH
##OWNER= nmr
$$ XWIN-NMR		Version 3.5
$$ Wed Sep 26 13:38:06 2007 GMT Daylight Time (UT+1h)  MAYBRIDGE\nmr@NMR_250MHZ
##.OBSERVE FREQUENCY= 250.131544655141
##.OBSERVE NUCLEUS= ^1H
##.ACQUISITION MODE= SIMULTANEOUS (DQD)
##.ACQUISITION SCHEME= undefined
##.AVERAGES= 16
##.DIGITISER RES= 18
##SPECTROMETER/DATA SYSTEM= dpx250
##.PULSE SEQUENCE= zg30
##.SOLVENT NAME= CDCl3
##.SHIFT REFERENCE= (INTERNAL, CDCl3, 0, 16.522)
##AUDIT TRAIL= $$ (NUMBER, WHEN, WHO, WHERE, WHAT)
$$ ##TITLE= Audit trail, XWIN-NMR		Version 3.5
$$ ##JCAMPDX= 5.01
$$ ##ORIGIN= Bruker BioSpin GmbH
$$ ##OWNER= nmr
$$ C:\u/data/dgb/nmr/ADRS/2500/pdata/1/auditp.txt
$$ ##AUDIT TRAIL=  $$ (NUMBER, WHEN, WHO, WHERE, WHAT)
(   1,<2007-09-26 13:37:46.67 +100>,<MAYBRIDGE\nmr>,<NMR_250MHZ>,
      <created by zg, POWCHK disabled, PULCHK disabled
       configuration hash MD5:
       76 6E 9A 78 1E 09 19 81 EC 84 63 8F B0 6A 59 2D
       data hash MD5: 64K
       FC 6D F0 4F A7 F5 5F D1 2E 14 9D 91 3D 22 D9 F8>)
(   2,<2007-09-26 13:37:57.78 +100>,<MAYBRIDGE\nmr>,<NMR_250MHZ>,
      <Start of raw data processing
       ef LB = 0.3 FT_mod = 6 PKNL = 1 SI = 32K 
       data hash MD5: 32K
       5F 34 9E BA 33 D0 07 33 66 E5 1E FF 5E 74 76 8D>)
(   3,<2007-09-26 13:37:59.40 +100>,<MAYBRIDGE\nmr>,<NMR_250MHZ>,
      <apk 
       data hash MD5: 32K
       AD 25 A3 96 3C 71 1E 8E 10 5C 7F B7 7D AC 7F 8C>)
(   4,<2007-09-26 13:38:00.28 +100>,<MAYBRIDGE\nmr>,<NMR_250MHZ>,
      <abs ABSG = 5 
       data hash MD5: 32K
       D3 CB FA A8 30 8F 49 76 39 41 C1 00 62 02 B1 33>)
$$ ##END=
$$ 
$$ hash MD5
$$ 63 FC B7 C7 85 00 EB A2 DB 8C 20 6E 6F 3D CB 3B
##$RELAX= 
##$RELAX= 
##$RELAX= 
##$RELAX= 
##$RELAX= 
##$RELAX= 
##$RELAX= 
$$ Bruker specific parameters
$$ --------------------------
##$DU= <C:\u>
##$EXPNO= 2500
##$NAME= <ADRS>
##$PROCNO= 1
##$TYPE= <nmr>
##$USER= <dgb>
##$AMP= (0..31)
100 100 100 100 100 100 100 100 100 100 100 100 100 100 100 100 100 100 
100 100 100 100 100 100 100 100 100 100 100 100 100 100 
##$AQSEQ= 0
##$AQ_mod= 3
##$AUNM= <au_zg>
##$AUTOPOS= <5 >
##$BF1= 250.13
##$BF2= 250.13
##$BF3= 250.13
##$BF4= 250.13
##$BF5= 500.13
##$BF6= 500.13
##$BF7= 500.13
##$BF8= 500.13
##$BYTORDA= 1
##$CFDGTYP= 0
##$CFRGTYP= 5
##$CHEMSTR= <none>
##$CNST= (0..31)
1 1 145 1 1 1 1 1 1 1 1 1 1 1 1 1 1 1 1 1 1 1 1 1 1 1 1 1 1 1 1 1 
##$CPDPRG= <>
##$CPDPRG1= <>
##$CPDPRG2= <>
##$CPDPRG3= <>
##$CPDPRG4= <mlev>
##$CPDPRG5= <mlev>
##$CPDPRG6= <mlev>
##$CPDPRG7= <mlev>
##$CPDPRG8= <mlev>
##$CPDPRGB= <>
##$CPDPRGT= <>
##$D= (0..31)
0 1 0 0 0 0 0 0 0 0.06 0 0 0 0 0 0 0.0002 0 0 0 0 0 0 0 0 0 0 0 0 0 0 
0 
##$DATE= 1190810265
##$DBL= (0..7)
120 120 120 120 120 120 120 120 
##$DBP= (0..7)
150 150 150 150 150 150 150 150 
##$DBP07= 0
##$DBPNAM0= <>
##$DBPNAM1= <>
$$ [...]
##$SUBNAM7= <"">
##$SUBNAM8= <"">
##$SUBNAM9= <"">
##$SW= 20.6930455092707
##$SWIBOX= (0..15)
0 0 3 0 0 0 0 0 0 0 0 0 0 0 0 0 
##$SW_h= 5175.983436853
##$TD= 65536
##$TD0= 1
##$TE= 296.16
##$TE2= 300
##$TE3= 300
##$TEG= 300
##$TL= (0..7)
0 120 120 120 120 120 120 120 
##$TP= (0..7)
150 150 150 150 150 150 150 150 
##$TP07= 0
##$TPNAME0= <>
##$TPNAME1= <>
##$TPNAME2= <>
##$TPNAME3= <>
##$TPNAME4= <>
##$TPNAME5= <>
##$TPNAME6= <>
##$TPNAME7= <>
##$TPOAL= (0..7)
0.5 0.5 0.5 0.5 0.5 0.5 0.5 0.5 
##$TPOFFS= (0..7)
0 0 0 0 0 0 0 0 
##$TUNHIN= 0
##$TUNHOUT= 0
##$TUNXOUT= 0
##$USERA1= <user>
##$USERA2= <user>
##$USERA3= <user>
##$USERA4= <user>
##$USERA5= <user>
##$V9= 5
##$VALIST= <valist>
##$VCLIST= <CCCCCCCCCCCCCCC>
##$VD= 0
##$VDLIST= <DDDDDDDDDDDDDDD>
##$VPLIST= <PPPPPPPPPPPPPPP>
##$VTLIST= <TTTTTTTTTTTTTTT>
##$WBST= 1024
##$WBSW= 4
##$XGAIN= (0..3)
0 0 0 0 
##$XL= 0
##$YL= 0
##$YMAX_a= 342684
##$YMIN_a= -428821
##$ZGOPTNS= <>
##$ZL1= 120
##$ZL2= 120
##$ZL3= 120
##$ZL4= 120
##$ABSF1= 16.522
##$ABSF2= -4.171173
##$ABSG= 5
##$ABSL= 3
##$ALPHA= 0
##$AQORDER= 0
##$ASSFAC= 0
##$ASSFACI= 0
##$ASSFACX= 0
##$ASSWID= 0
##$AUNMP= <proc_1d>
##$AZFE= 0.1
##$AZFW= 0.1
##$BCFW= 0
##$BC_mod= 0
##$BYTORDP= 0
##$COROFFS= 0
##$CY= 12.5
##$DATMOD= 1
##$DC= 0
##$DFILT= <>
##$DTYPP= 0
##$F1P= 14.0000005364418
##$F2P= -0.99999901652339
##$FCOR= 0.5
##$FTSIZE= 32768
##$FT_mod= 6
##$GAMMA= 0
##$GB= 0
##$INTBC= 1
##$INTSCL= 1
##$ISEN= 128
##$LB= 0.3
##$LEV0= 0
##$LPBIN= 0
##$MAXI= 10000
##$MC2= 0
##$MEAN= 0
##$ME_mod= 0
##$MI= 0
##$NCOEF= 0
##$NC_proc= -4
##$NLEV= 6
##$NOISF1= 0
##$NOISF2= 0
##$NSP= 0
##$NTH_PI= 0
##$NZP= 0
##$OFFSET= 16.522
##$PC= 1
##$PHC0= 156.8407
##$PHC1= 3.536701
##$PH_mod= 1
##$PKNL= yes
##$PPARMOD= 0
##$PSCAL= 4
##$PSIGN= 0
##$REVERSE= no
##$SF= 250.13
##$SI= 32768
##$SIGF1= 0
##$SIGF2= 0
##$SINO= 400
##$SIOLD= 32768
##$SREGLST= <1H.CDCl3>
##$SSB= 0
##$STSI= 32768
##$STSR= 0
##$SW_p= 5175.98343685301
##$SYMM= 0
##$S_DEV= 0
##$TDeff= 65536
##$TDoff= 0
##$TI= <Analysis number 999999
Compound Code 99
Book Reference 9
Project Code 9>
##$TILT= no
##$TM1= 0
##$TM2= 0
##$TOPLEV= 0
##$USERP1= <user>
##$USERP2= <user>
##$USERP3= <user>
##$USERP4= <user>
##$USERP5= <user>
##$WDW= 1
##$XDIM= 32768
##$YMAX_p= 485270093
##$YMIN_p= -422303
$$ End of Bruker specific parameters
$$ ---------------------------------
##NTUPLES= NMR SPECTRUM
##VAR_NAME=  FREQUENCY,     SPECTRUM/REAL,   SPECTRUM/IMAG
##SYMBOL=    X,             R,               I
##VAR_TYPE=  INDEPENDENT,   DEPENDENT,       DEPENDENT
##VAR_FORM=  AFFN,          ASDF,            ASDF
##VAR_DIM=   32768,         32768,           32768
##UNITS=     HZ,            ARBITRARY UNITS, ARBITRARY UNITS
##FACTOR=    0.157963299565203, 1,           1
##FIRST=     4132.6476996994, 0,             0
##LAST=      -1043.33573715361, 0,           0
##MIN=       -1043.33573715361, -422303,     0
##MAX=       4132.6476996994, 485270093,     0
$$ Real data points
##PAGE= N=1
##DATA TABLE= (X++(R..R)), XYDATA
$$ [...]
15907c899R136n938k126k1049M91K3441J0556r223O531n331k6610J6047M7m548
$$ -3899 5237 -701 -2827 -23876 -23385 56 10612 1389 7920 2589 -24021 -7974 -7927 -12475
15893a2475M0874j3734j3324k4268k4771J9627K3195J7998J3047k2923P306J7717
$$ -12475 28399 14665 1341 -22927 -47698 -28071 -4876 13122 26169 3246 10552 28269
15881B8269J3107k9908k714J3489Q197k3826k2296J252m181J9174K380k2359o636
$$ 28269 41376 11468 8754 22243 30440 6614 -15682 -14430 -18611 563 2943 -19416 -26052
15868b6052l639L2129K6289O188Q335k6559k4652J3927n086l7939K6862Q330P012
$$ -26052 -29691 2438 28727 34915 43250 16691 -7961 5966 880 -37059 -10197 -1867 5145
15855E145P763O008q67k022k0945p060J8401j4527k0505K9345l059o239j9605
$$ 5145 12908 18916 18049 16027 -4918 -11978 6423 -8104 -28609 736 -2323 -8562 -28167
15842b8167M823J4593R618m0456R740L963J2754K6774Q578p185k0705O685M699
$$ -28167 -23344 -8751 867 -39589 -29849 -25886 -13132 13642 22220 15035 -5670 1015 5714
15829E714l9745j6194K7199M005N023M185j6267j3181j3598M807L1530K3807o958
$$ 5714 -34031 -50225 -23026 -19021 -13998 -9813 -26080 -39261 -52859 -48052 -16522 7285 327
15816C27j6865J9475j1822l3389n99n992N920J2601j0585O878M4700Q509k9143
$$ 327 -16538 2937 -8885 -42274 -42873 -48865 -42945 -30344 -40929 -34051 10649 19158 -9985
15803i985n483j049k0599M827K3282J2131J0406J1250r967L7k1135j0650j566
$$ -9985 -15468 -16517 -37116 -32289 -9007 3124 13530 24780 14813 14850 -6285 -16935 -18501
15790a8501J1767J034k0521m152K8051R156k4128O59j6678r539L3017L2490Q014
$$ -18501 -6734 -5700 -26221 -30373 -2322 6834 -17294 -16635 -33313 -42852 -9835 22655 30669
15777C0669n499j0569l367r094r228j0337R512q213k2699j8675J1345j1435p324
$$ 30669 25170 14601 11234 2140 -7088 -17425 -7913 -16126 -38825 -57500 -46155 -57590 -64914
15764f4914J8402K6687K3915o535L626J0986k7784l5397L14K0731J8716J0649
$$ -64914 -46512 -19825 4090 -2445 1181 12167 -15617 -51014 -50700 -29969 -11253 -604
15752f04J5814k9439j1874j1435m009o523k197L33J2986l936N375j9774l381P9
$$ -604 15210 -14229 -26103 -37538 -41547 -48070 -50267 -49934 -36948 -40884 -35509 -55283 -58664 -58585
15738e8585J2768j8p489J5109K877J9146j0644L692M253k0162q726l805J0663
$$ -58585 -45817 -45835 -53324 -38215 -35338 -16192 -26836 -23144 -18891 -39053 -47779 -51584 -40921
15725d0921j5696m702J6730J8499K399n624r600J0258J1656L2268M155K689j1725
$$ -40921 -56617 -61319 -44589 -26090 -23691 -29315 -38915 -28657 -17001 15267 19422 22111 10386
15712A0386J2647m160k4866j4927n208K1305m38l332R706J5202J1768J6832J4250
$$ 10386 23033 18873 -5993 -20920 -26128 -4823 -5261 -8593 1113 16315 28083 44915 59165
15699E9165j3500l4616j5106L3257R517l0220l2177j4297k198J5165J8035J2158
$$ 59165 45665 11049 -4057 29200 38717 8497 -23680 -37977 -40175 -25010 -6975 5183
15687E183J2034j5023j3335o603J5110J5742k1101J237J845j5014J8721Q20j8926
$$ 5183 17217 2194 -11141 -17744 -2634 13108 -7993 -6756 -4911 -19925 -1204 -384 -19310
15674a9310Q616J4392Q589m252k5050j3309j2370Q366K6025k0075k3850j9880
$$ -19310 -10694 3698 12287 8035 -17015 -30324 -42694 -34328 -8303 -28378 -52228 -72108
15662g2108N611K2146K5466k6701j3407K0433J6411l019K1724K5592p899K71l2743
$$ -72108 -66497 -44351 -18885 -45586 -58993 -38560 -22149 -25168 -3444 22148 14249 14520 -18223
15649a8223l197k0341K8228L060l7026j312R609J9656n025l901l114K257N284
$$ -18223 -21420 -41761 -13533 -10473 -47499 -48811 -39202 -19546 -24571 -28472 -31586 -29329 -24045
15636b4045L456J7067j455J7512k806j2931r18k3628j8483J394L8341J5073M74
$$ -24045 -20589 -3522 -4977 12535 9729 -3202 -4120 -27748 -46231 -44837 -6496 8577 9051
15623I051M113m7243k5992J6039K3410l208k630j614J4696L2234L98j0375o074
$$ 9051 13164 -34079 -60071 -44032 -20622 -23830 -26460 -28074 -13378 18856 19254 8879 2805
15610B805L076N001M738J4469J4465j1326r73j5015k9301n159J8615L004j9762
$$ 2805 5881 10882 15620 30089 44554 33228 32255 17240 -12061 -17220 1395 4399 -15363
15597a5363J1183J6659l629j667j0556M338j8231k0926J3340j3559L0072j8539
$$ -15363 -4180 12479 8850 7183 -3373 965 -17266 -38192 -24852 -38411 -8339 -26878
15585b6878N413Q70K0595J1191j496J673K8966n911k4430k4276j0271r849j2997
$$ -26878 -21465 -20595 0 11191 9695 11368 40334 34423 9993 -14283 -24554 -34403 -47400
15572d7400l014k93K7428J6644j6860J3701j0249j312j308Q273K6937k422p273
$$ -47400 -50414 -50707 -23279 -6635 -23495 -9794 -20043 -21355 -22663 -14390 12547 10125 2852
15559B852m934M515J6391k9520r973o443L4298K2960j1275k2342K3527j5646p122
$$ 2852 -2082 2433 18824 -10696 -20669 -27112 7186 30146 18871 -3471 20056 4410 -2712
15546b712J1032l1686N732J1872m75K603j064j4985m711o944K5013k1945l8016
$$ -2712 8320 -23366 -17634 -5762 -6237 -3634 -4698 -19683 -24394 -31338 -6325 -28270 -66286
15533f6286J106J0906J6398R032L7848J0078q099j1972j0735l024j8768K372J3800
$$ -66286 -65180 -54274 -37876 -28844 9004 19082 10983 -989 -11724 -14748 -33516 -31144 -17344
15520a7344p709k1627N64L1225K4336M306m129j3898k1361R718K2637q079n528
$$ -17344 -25053 -46680 -46116 -14891 9445 13751 9622 -4276 -25637 -15919 6718 -1361 -6889
15507f889R109R679M554k8417p621M934O557m037J835L0630k2969k6230m822R968
$$ -6889 2220 11899 16453 -11964 -19585 -14651 -8094 -12131 -10296 20334 -2635 -28865 -33687 -23719
15493b3719J8335K940J2070J6654j0822K63J0301R133J7237O261n588r923k5124
$$ -23719 -5384 -2444 9626 26280 15458 15721 26022 35155 52392 58653 53065 43142 18018
15480A8018j3245j4301j5451O409J3896K2090J2917q612r431J5097J397l8021
$$ 18018 4773 -9528 -24979 -18570 -4674 17416 30333 21721 12290 27387 28784 -9237
15468i237p822O368J8610N975q241J7670J5196o760J41k6370l4453J909O838l783
$$ -9237 -17059 -10691 7919 13894 5653 23323 38519 31759 31900 5530 -28923 -27014 -20176 -23959
15454b3959r071J5744O161R527l8015k1699R645R482J8207K8353k803J9722J0886
$$ -23959 -33030 -17286 -11125 -1598 -39613 -61312 -51667 -42185 -23978 4375 1572 21294 32180
15441C2180l9549m8287j9276K8464K9496J3720j4450n1554k8948K7901J0456J5213
$$ 32180 -7369 -55656 -74932 -46468 -16972 -3252 -17702 -69256 -98204 -70303 -59847 -44634
15429d4634m492J6077L4336Q141j3284j7840J4936K1158J0136k222k0911j2656
$$ -44634 -49126 -33049 1287 9428 -3856 -21696 -6760 14398 24534 22312 1401 -11255
15417a1255k591J4003j9131r643J151j1208K451n195m52Q245K8097O245k9888
$$ -11255 -13846 157 -18974 -28617 -27466 -38674 -36223 -41418 -41870 -33625 -5528 717 -29171
15404b9171J5628P880q834j2737N088K3555Q98j870L0830Q891q143J4439l1895
$$ -29171 -13543 -5663 -14497 -27234 -22146 1409 2307 437 31267 40158 32015 46454 14559
15391A4559j8273m476K610p124o376N359j3204r335j896K2959J8266K7586n399
$$ 14559 -3714 -8190 -5580 -12704 -19080 -13721 -26925 -36260 -38156 -15197 3069 30655 25256
15378B5256j0998L169k5738j4558j6802k7070L2034K3164J6276r614o131J358
$$ 25256 14258 17427 -8311 -22869 -39671 -66741 -34707 -11543 4733 -4881 -11012 -9654
15366i654n025k0553L4423J9711J6684k610j1434j5522k4537n830j4485R64j2868
$$ -9654 -14679 -35232 -809 18902 35586 32976 21542 6020 -18517 -24347 -38832 -37868 -50736
15353e0736K3852J4165M71l553Q000J8468j0582j1425n829j0438j0275J9809Q239
$$ -50736 -26884 -12719 -12248 -15801 -7801 10667 85 -11340 -17169 -27607 -37882 -18073 -9834
15340i834q574O389J687M719Q98P716K8010Q123r120k0574J1643j4911n871k108
$$ -9834 -18408 -12019 -10332 -5613 -4715 3001 31011 39134 30014 9440 21083 6172 301 -1807
15326a807R160o797J0265o960J623K5945j689k5460J705r493N706K9134k253j1352
$$ -1807 7353 556 10821 3861 5484 31429 29740 4280 5985 -3508 2198 31332 29079 17727
15312A7727n734p804m913L6829K9688p009k6447k2238q622P428k729j2389j2969
$$ 17727 11993 4189 -724 36105 65793 58784 32337 10099 1477 8905 6176 -6213 -19182
15299a9182j1662k090j1339M370k445J4222J0280j335k19J364l619p016J5700
$$ -19182 -30844 -32934 -44273 -39903 -42348 -28126 -17846 -19181 -19400 -18036 -21655 -28671 -12971
15286a2971J3819j1418j7713K3034L1949j9321k3799j1745l72k29O789J7111O015
$$ -12971 848 -10570 -28283 -5249 26700 7379 -16420 -28165 -28537 -28766 -21977 -4866 1149
15273A149j4006k7827J4345r298r222Q961J4336j3718P074K5585K3987J5750k4542
$$ 1149 -12857 -40684 -26339 -35637 -44859 -35898 -21562 -35280 -28206 -2621 21366 37116 12574
15260A2574k7544k1217L5578m146k676l521K944J5987k2429K0361J2325r046r823
$$ 12574 -14970 -36187 -609 -4755 -7431 -10952 -8008 7979 -14450 5911 18236 9190 -633
15247f33J5640R771M261k25j0252J4550M371k6416J0788r305k2022J208l02o616
$$ -633 15007 24778 29039 28814 18562 33112 37483 11067 21855 12550 -9472 -8264 -8566 -15182
15233a5182K6113l282j8287J442J9243n175j5711j4041l949R743j1573J247L5879
$$ -15182 10931 7649 -10638 -9196 10047 4872 -10839 -24880 -28829 -19086 -30659 -29412 6467
15220F467n76j6029J8644K4509o609K295j9405j6658J2057l752J948J552k8844
$$ 6467 5891 -10138 8506 33015 26406 28701 9296 -7362 4695 943 2891 4443 -24401
15207b4401J2302L0828J5016R519r154k8468q232J0042k097k4268J7967L3637
$$ -24401 -12099 18729 33745 43264 34110 5642 -2590 7452 5355 -18913 -946 32691
15195C2691j1235j4071J4867K9334j922q252j3017r594m105J1231j7344k7496
$$ 32691 21456 7385 22252 51586 49664 41412 28395 18801 14696 25927 8583 -18913
15183a8913J3133j2636j4266J1381K6550J5441j2229P793L1907j3590l3166j0778
$$ -18913 -5780 -18416 -32682 -21301 5249 20690 8461 16254 48161 34571 1405 -9373
15171i373J4018L88L02m744J1209J7085M302p817J1909n670k7295k5715N331K1426
$$ -9373 4645 5033 5335 591 11800 28885 33187 25370 37279 31609 4314 -21401 -16070 5356
15157E356j6804j5112n74N514J0373K089j0586Q437O976N699j3099J075J9366
$$ 5356 -11448 -26560 -27134 -21620 -11247 -9158 -19744 -11307 -4331 1368 -11731 -10656 8710
15144H710j049j8842j1480k3668j0977J964J0458L6383Q893M33j4557L863J7040
$$ 8710 7661 -11181 -22661 -46329 -57306 -55342 -44884 -8501 392 825 -13732 -9869 7171
15131G171K2512O38q779k3316j1845k141J932k028L357J1635J4432j117q955J6469
$$ 7171 29683 30321 21542 -1774 -13619 -15760 -13828 -15856 -12499 -864 13568 12451 3496 19965
15117A9965J0758N703J7659j1743o69o667m822j486J669l308j5448l3731K2610
$$ 19965 30723 36426 54085 42342 41673 35006 30184 28698 30367 27059 11611 -22120 490
15104D90K9023q345k2316K677L7096j291p90M100k565k6946j212q226k745j2591
$$ 490 29513 21168 -1148 1529 38625 37334 36544 40644 38079 11133 9921 1695 -1050 -13641
15090a3641n773K1761k898j939N315O458l859k3555m430O229K5885q79j9635O789
$$ -13641 -19414 2347 -551 -2490 2825 9283 5424 -18131 -22561 -16332 9553 8674 -10961 -4172
15076d172N978K8180j858j7356r750r858j1945n104K7310J3143j5221r655N962
$$ -4172 1806 29986 28128 10772 1022 -8836 -20781 -25885 1425 14568 -653 -10308 -4346
15063d346j4468k3312Q265P76n262j516K8542K3444j0417J8411o81l2594j219
$$ -4346 -18814 -42126 -33861 -33085 -38347 -39863 -11321 12123 1706 20117 19436 -13158 -14377
15050a4377p518k5167J6341J5225J4647Q765J6883K645o321j5015L836K871R542
$$ -14377 -21895 -47062 -30721 -15496 -849 7916 24799 27444 21123 6108 9944 12815 22357
15037B2357J9188L140M681k5165l7743M036j4030L348P415K2974j0906J3672l544
$$ 22357 41545 44685 49366 24201 -13542 -9506 -23536 -20188 -12773 10201 -705 12967 9423
15024I423j3490O402N060J10k1831N374K0461R244M886k5940J0746p317l7436
$$ 9423 -4067 2335 7395 7505 -14326 -8952 11509 20753 25639 -301 10445 3128 -34308
15011c4308j0270L0648K6176j5256k7787R404J2725k1408K4952J7957J9426M486
$$ -34308 -44578 -13930 12246 -3010 -30797 -21393 -8668 -30076 -5124 12833 32259 36745
14999C6745j5782l432M3392K8790N6120M9241J49730K55650J26888j27646j14559
$$ 36745 20963 17531 60923 89713 145833 195074 344804 600454 727342 599696 485137
14988D85137j55202j31750p5366l0801n1032j4461Q221j0258j8754N397K686K1368
$$ 485137 329935 198185 122819 92018 40986 26525 34746 24488 5734 11131 13817 35185
14976C5185j5284n06M534J0739m706l6947j4907J8890l972J9442j2637m458m435
$$ 35185 19901 19395 23929 34668 29962 -6985 -21892 -3002 -6974 12468 -169 -4627 -9062
14963i062k079L4326n203k707N7q243k2201j9627K8570K8915J9448m2961j2184
$$ -9062 -11141 23185 17982 15275 15332 7089 -15112 -34739 -6169 22746 42194 -767 -12951
14950a2951J7955j026l2772r570J3760J5459L594r085j8308J7657j7951j2277
$$ -12951 5004 3978 -28794 -38364 -24604 -9145 -5551 -14636 -32944 -15287 -33238 -45515
14938d5515J9875M298p663n675J2085J855m941m130m44J2072L6609j716r535J6616
$$ -45515 -25640 -21342 -29005 -34680 -22595 -20740 -25681 -29811 -30255 -18183 18426 16710 7175 23791
14924B3791j4586l1720K577K752k994J530q22J5307J6356J0039m916l9107k8097
$$ 23791 9205 -22515 -19938 -17186 -20180 -18650 -19472 -4165 12191 22230 17314 -21793 -49890
14911d9890k9289N959J8887L3169k260J291J4164K334l1052m5396J55L1994L7662
$$ -49890 -79179 -73220 -54333 -21164 -23424 -22133 -7969 -5635 -36687 -82083 -81928 -49934 -12272
14898a2272K2305j0547R189n911J2531m291l8214l148L6054j4397n018R78o370
$$ -12272 10033 -514 8675 2764 15295 11004 -27210 -30358 5696 -8701 -13719 -12741 -19111
14885a9111j4066K5360K9475q029j9575k7687j6800K9360L660N494L8017J6214
$$ -19111 -33177 -7817 21658 13629 -5946 -33633 -50433 -21073 -17413 -11919 26098 42312
14873D2312p030l1693j1223n905J7995j3317l1127O55L6183L456J4052J0390l6
$$ 42312 35282 3589 -7634 -13539 4456 -8861 -39988 -39333 -3150 306 14358 24748 24712
14860B4712m2984j5828j555K2649l355o366J9773L594l353p541J751J0407j1983
$$ 24712 -18272 -34100 -35655 -13006 -16361 -22727 -2954 640 -2713 -10254 -8503 1904 -10079
14847a0079p042k4447J1086K3547O75n456k2822j64M532n489m3984J9767M5461
$$ -10079 -17121 -41568 -30482 -6935 -6260 -11716 -34538 -34702 -30170 -35659 -79643 -59876 -14415
14834a4415J4349p579n40N996j0946l124K0683M078J3201j3892j8801J5385J5391
$$ -14415 -66 -7645 -8185 -2189 -13135 -16259 4424 8502 21703 7811 -10990 4395 19786
14821A9786J7399j4241k3878P11m133k9117Q831l949K1244O478J2859L0242k2262
$$ 19786 37185 22944 -934 -223 -4356 -33473 -24642 -28591 -7347 -869 11990 42232 19970
14808A9970k5162n42j2410m216k2383j2827M0753M2468K2241P183k1989k0147
$$ 19970 -5192 -5734 -18144 -22360 -44743 -57570 -16817 25651 47892 55075 33086 12939
14796A2939j4042N803q782K1412K1577j1179j5636l5996q829K1855K2791m262
$$ 12939 -1103 4700 -4082 17330 38907 27728 12092 -23904 -32733 -10878 11913 7651
14784G651l468j1667p817r840k12J914p687j6037K3361L7244J829j6040K710J2991
$$ 7651 4183 -7484 -15301 -25141 -25353 -23439 -31126 -47163 -23802 13442 15271 -769 1941 14932
14770A4932j5253j5248K0090K8423j8344l0659J419j5574q543q193r582p105J5599
$$ 14932 -321 -15569 4521 32944 14600 -16059 -14640 -30214 -38757 -46950 -56532 -63637 -48038
14757d8038L4583K5851m3132j4825k885N669o291j5674K945n570J9890K2661Q757
$$ -48038 -13455 12396 -30736 -45561 -48446 -42777 -49068 -64742 -61797 -67367 -47477 -24816 -16059
14744a6059P855l483j1644J785J6844j3277j8644l121J490J1904m996K8741J8693
$$ -16059 -8204 -11687 -23331 -21546 -4702 -17979 -36623 -39744 -38254 -26350 -31346 -2605 16088
14731A6088k2315j7939j4975L0719q472K806M041M788j3146k5524O522k493J1667
$$ 16088 -6227 -24166 -39141 -8422 -16894 -14088 -10047 -5259 -18405 -43929 -37407 -39900 -28233
14718b8233j081J6237k891o425K1734J0966n885J2020m444j8057K3006r0j8911
$$ -28233 -29314 -13077 -15968 -22393 -659 10307 4422 16442 11998 -6059 16947 16857 -2054
14705b054M942J826j85k609j9387K3624K1476M836q699k3621K7060K2164m7101
$$ -2054 2888 4714 4529 1920 -17467 6157 27633 32469 23770 149 27209 49373 2272
14692B272k2632N869K3915K6396K638j8865j1251q596k2922L3j6711R49P614J3470
$$ 2272 -20360 -14491 9424 35820 38458 19593 8342 -254 -23176 -23143 -39854 -38905 -31291 -17821
14678a7821L931l6234N579L2863J4385p791o928j7612r540P985J3648r255R145
$$ -17821 -13890 -50124 -44545 -11682 2703 -5088 -12016 -29628 -39168 -31183 -17535 -26790 -17645
14665a7645K2476Q351k5641n867k136J4892K4985k7863m0493l9270K1790L1803
$$ -17645 4831 13182 -12459 -18326 -20462 -5570 19415 -8448 -48941 -88211 -66421 -34618
14653c4618O670M076P519K6722l5018j3670J306Q195m490j1391q399M3139K3270
$$ -34618 -27948 -23872 -16353 10369 -24649 -38319 -37013 -28818 -33308 -44699 -53098 -9959 13311
14640A3311j0667k143r03j3963j6600j1538M272k933J9009J9980Q856J7884N137
$$ 13311 2644 501 -402 -14365 -30965 -42503 -38231 -41164 -22155 -2175 6681 24565 29702
14627B9702Q01K0577K559m908p788n311l4778j6618J853m376p643P128K7900J303
$$ 29702 30503 51080 53639 48731 40943 35632 854 -15764 -13911 -18287 -25930 -18802 9098 10401
14613A0401R662j0873m2157q395J8220N4575J4594j4157l4781k5775K8858l526
$$ 10401 20063 9190 -32967 -41362 -23142 31433 46027 31870 -2911 -28686 172 -3354
14601c354m4576L61J2811P278q308n972J0638j7824J6981j2140J1492R959j4011
$$ -3354 -47930 -47569 -34758 -27480 -35788 -41760 -31122 -48946 -31965 -44105 -32613 -22654 -36665
14588c6665K4630J0849j7708k6126r625l667Q25o895L1686Q294j5808Q228K8744
$$ -36665 -12035 -1186 -18894 -45020 -54645 -58312 -57487 -64382 -32696 -24402 -40210 -31982 -3238
14575c238K3739k5315j4908k425K0171J3165J0166L744q401n274k5606j6307M5417
$$ -3238 20501 -4814 -19722 -22147 -1976 11189 21355 25099 16698 11424 -14182 -30489 14928
14562A4928R749l5R456L961k8260o989P337k6811n5903N911M2748J4489K185J2125
$$ 14928 24677 24642 34098 38059 9799 2810 10147 -16664 -72567 -66656 -23908 -9419 -7234 4891
14548D891q680k7640P393M610k939q671J337l453j6281Q61J9239K355J3641K7057
$$ 4891 -3789 -31429 -24036 -19426 -22365 -31036 -29699 -33152 -49433 -48572 -29333 -26978 -13337 13720
14534A3720K1257L758k0861J762j31k2986j7285N841L193k6970j0912J3611L0156
$$ 13720 34977 38735 17874 19636 19505 -3481 -20766 -14925 -11732 -38702 -49614 -36003 -5847
14521e847K3597j89o077J4554n924k0412j3685n681R573J7002o980l2370K12J7146
$$ -5847 17750 17561 11484 26038 20114 -298 -13983 -19664 -10091 6911 -69 -32439 -32227 -15081
14507a5081n483K6147q421n9079J0035J140K3882J2670J9607M007p027l7062l4149
$$ -15081 -20564 5583 -2838 -61917 -51882 -50742 -26860 -14190 5417 9424 2397 -34665 -68814
14494f8814j6025J4189L9125K9049o573j0247J718J1002M488k4028k3600j1870
$$ -68814 -84839 -70650 -31525 -2476 -9049 -19296 -17578 -6576 -2088 -26116 -49716 -61586
14482f1586J5072n086j6348J2888L1244P767k795o868R934J0113L254Q600Q150
$$ -61586 -46514 -51600 -67948 -55060 -23816 -16049 -18844 -25712 -15778 -5665 -2411 6189 14339
14469A4339K091p895k9457l0758J4962K4551j0202P247p106k9870r71j381J1490
$$ 14339 16430 8535 -20922 -51680 -36718 -12167 -22369 -15122 -22228 -52098 -53069 -54450 -42960
14456d2960j2898q22J5529K8196M1135J3667k647L0908m78l8239k0956p09j5360
$$ -42960 -55858 -56680 -41151 -12955 28180 41847 39200 70108 69630 31391 10435 9726 -5634
14443e634J4790J1036n046J754O770N66o499j3233K8816p93m348J485k3531k9879
$$ -5634 9156 20192 15146 16900 23670 24236 17737 4504 33320 32527 28179 29664 6133 -23746
14429b3746R392L0106k463m761J3464J1842M61Q863j179k9357j4834l050N48j0930
$$ -23746 -14354 15752 13289 8528 21992 33834 34295 43158 41979 12622 -2212 -5262 -4714 -15644
14415a5644m643O608j6893j9767Q200k101J8943K8674K0170P381l627K758j9374
$$ -15644 -20287 -13679 -30572 -50339 -42139 -44240 -25297 3377 23547 30928 27301 30059 10685
14402A0685N285J5403K6459j4863k9294j7792P162L551j3335m992k645k2911M321
$$ 10685 15970 31373 57832 42969 13675 -4117 3045 6596 -6739 -11731 -14376 -37287 -32966
14389c2966K2879K8704Q009j1975p045K2628j8805k3458o685R15k219r686j6380
$$ -32966 -10087 18617 26626 14651 7606 30234 11429 -12029 -18714 -17799 -20018 -29704 -46084
14376d6084q996K2689K3184K657J0102j7409L17o496j0403K2166j238m205J4806
$$ -46084 -55080 -32391 -9207 -6550 3552 -13857 -13540 -20036 -30439 -8273 -9511 -13716 1090
14363A090Q70j1710J0040K4708j5159k0929q598K363O105K0866j1948Q310n830
$$ 1090 1960 -9750 290 24998 9839 -11090 -19688 -17325 -11220 9646 -2302 6008 178
14350A78l2494k197J1943p718k6145j1754K7007K2263Q574N361M983o838m386
$$ 178 -32316 -34513 -22570 -30288 -56433 -68187 -41180 -18917 -10343 -4982 1 -6837 -11223
14337a1223j0504J2514q821R393n526j2027P473Q260l444n516J9342Q739n452
$$ -11223 -21727 -9213 -18034 -8641 -14167 -26194 -18721 -10461 -13905 -19421 -79 8660 3208
14324C208L590K6711J3849m5232k9378J37J0531K2393J6211J680l073k537k9775
$$ 3208 6798 33509 47358 2126 -27252 -27115 -16584 5809 22020 23700 20627 18090 -11685
14311a1685r601n097k3138l761k410J9536K9991r071J0306M163P21L701O20j6383
$$ -11685 -21286 -26383 -49521 -53282 -55692 -36156 -6165 -15236 -4930 -767 -46 3655 4275 -12108
14297a2108j3975K154L8926K6420j72N365k0659l5791l217K2119J4334r080j5927
$$ -12108 -26083 -23929 14997 41417 41245 46610 25951 -9840 -13057 9062 23396 14316 -1611
14284a611N292J9980J6476j8134J0579N513j8327j3187O425M944J0680J8458k600
$$ -1611 3681 23661 40137 22003 32582 38095 19768 6581 13006 17950 28630 47088 44488
14271D4488l9198J075j5K1508J804j7838j5170J0461J489n660Q877R356l05L0875
$$ 44488 5290 6365 6350 27858 29662 11824 -3346 7115 8604 2944 11821 21177 20872 51747
14257E1747j1111k7799j3832M975O503m409K398L097j2729o778J607k953j3268
$$ 51747 40636 12837 -995 3980 10483 6074 8472 11569 -1160 -7938 -6331 -9284 -22552
14244b2552l759K4707j0183j4639j114J9012L2455K646j0885l3829m3025j5846
$$ -22552 -26311 -1604 -11787 -26426 -27540 -8528 23927 26573 15688 -18141 -61166 -77012
14232g7012J3608j0922J416L5626O469k1955m497N202j301J6862Q399J4597K2546
$$ -77012 -63404 -74326 -72910 -37284 -30815 -52770 -57267 -52065 -53366 -36504 -28105 -13508 9038
14219I038j1098P48K405q819j1766k6752J55M758r645j0559J8181K1459K5829
$$ 9038 -2060 -1312 1093 -7726 -19492 -46244 -46089 -41331 -50976 -61535 -43354 -21895 3934
14206C934J2307j3991j3207R404L622m498j15j0576M30R741P169m708p083j3971
$$ 3934 16241 2250 -10957 -1553 2069 -2429 -2544 -13120 -12690 -2949 4220 -488 -7571 -21542
14192b1542l4970j7973J6635J4365J8572m633m730n538P817K6813J2120j1334
$$ -21542 -56512 -74485 -57850 -43485 -24913 -29546 -34276 -39814 -31997 -5184 6936 -4398
14180d398L048M505j549J4433j459n668p620j4150Q084K2498j0493o152j8444
$$ -4398 -1350 3155 1606 16039 14580 8912 1292 -12858 -4774 17724 7231 1079 -17365
14167a7365n183J5522J3983M73J6209K0921J1982l6814j6774j279O536K0482O306
$$ -17365 -22548 -7026 6957 7430 23639 44560 56542 19728 2954 1675 8211 28693 34999
14154C4999k0175P680q993l017j8657O267j5615J8126Q007k3131j5768k1805J6088
$$ 34999 14824 22504 13511 10494 -8163 -1896 -17511 615 8622 -14509 -30277 -52082 -35994
14141c5994L9132k131P21q956j0852Q964L7699k592q171M351q097j2348m927K066
$$ -35994 3138 1007 1728 -7228 -18080 -9116 28583 25991 17820 22171 14074 1726 -3201 -1135
14127a135J4472Q532j1282n037j8254j0022L0396l492L837R613J1198m2607l4481
$$ -1135 13337 21869 10587 5550 -12704 -22726 7670 4178 8015 17628 28826 -13781 -48262
14114d8262m434P628J6524P471q079R347K9304Q687j9104k2552j6520Q369q94
$$ -48262 -52696 -45068 -28544 -21073 -29152 -19805 9499 18186 -918 -23470 -39990 -31621 -32515
14101c2515P462N288J2426J6637O860j1871n670Q767J3921N0356p443j0382j2114
$$ -32515 -25053 -19765 -7339 9298 16158 4287 -1383 7384 21305 71661 64218 53836 41722
14088D1722j2447l0310k2045J4281J1699J6192N403J5410j0975k0875j0422J165
$$ 41722 29275 -1035 -23080 -8799 2900 19092 24495 39905 28930 8055 -2367 -1202
14076a202J6258J791m26j163L115j3644Q752P394k5202j8057K1036J6867j6840
$$ -1202 15056 16847 16421 15258 18373 4729 13481 20875 -4327 -22384 -1348 15519 -1321
14063a321k5315K9986m457m183m386J1724L049q797K220J2319j1522k1231j2582
$$ -1321 -26636 3350 -1107 -5290 -9676 2048 5097 -3700 -1480 10839 -683 -21914 -34496
14050c4496n498J9248M0383q730O606l089j65N908K924j6665l5472K564J4947
$$ -34496 -39994 -20746 19637 10907 17513 14424 14259 20167 23091 6426 -29046 -26482 -11535
14037a1535K5269l100k3147l5606J715J0560J0101L0463M0639J987N840j2338
$$ -11535 13734 10634 -12513 -48119 -46404 -35844 -25743 4720 45359 47346 53186 40848
14025D0848o231k130L735m469j5069k3582J7402k45m910j0534L028J2494P864
$$ 40848 34617 32487 36222 31753 16684 -6898 10504 10259 5349 -5185 -2157 10337 18201
14012A8201l053J5235J6583M285k9949K168k1299k7530J3151J6032J0621j8245
$$ 18201 15148 30383 46966 51251 21302 23470 2171 -25359 -12208 3824 14445 -3800
14000c800m376J6047j145p170j2485J4774p329k1559l989J9708J4271J1486p980
$$ -3800 -8176 7871 6726 -444 -12929 1845 -5484 -27043 -31032 -11324 2947 14433 6453
13987F453R808K3289M93j8924j7672j573J9314k142r293J9947J2486j6559J7152
$$ 6453 16261 39550 40043 21119 3447 1874 21188 19046 9753 29700 42186 25627 42779
13974D2779M317p692J8803K1403j4718J3407N341j5359k7317k7638K7801L9114
$$ 42779 47096 39404 58207 79610 64892 78299 83640 68281 40964 13326 41127 80241
13962H0241J1806O552J6021K1104k1569k7810r67j881K5262m55Q115J0021L2298
$$ 80241 92047 98599 114620 135724 114155 86345 85378 83497 108759 108304 116419 126440 158738
13949A58738K8600N255j5126l3375j9530Q797Q494j8849Q791J0464R750R37k2791
$$ 158738 187338 192593 177467 144092 124562 133359 141853 123004 131795 142259 152009 152946 130155
13936A30155l228j1696q990n103j7591N777K0683l619j9353j0924m961K907r024
$$ 130155 126927 115231 106241 101138 83547 89324 110007 106388 87035 76111 71150 74057 65033
13923F5033k1056q912k8560R41o166J0047K1431R222j5075N35R389K5447J219
$$ 65033 43977 35065 6505 7446 1280 11327 32758 41980 26905 27440 36829 62276 63495
13910F3495k4531l172k6011J743L1858j6115k5187L1414r55q693J9565j090j029
$$ 63495 38964 35792 9781 11524 43382 27267 2080 33494 32539 23846 43411 42321 41292
13897D1292j9617p865k017J0042J9719P449m171K1276J6479J1141O736K510P10
$$ 41292 21675 13810 11793 21835 41554 49003 44832 66108 82587 93728 100464 102974 103684
13884A03684J5229J1857k7369k816M988L89p759k34K5820K0549P840j7074j1743
$$ 103684 118913 130770 103401 100585 105573 105962 98203 97969 123789 144338 152178 135104 123361
13871A23361k2276k13K8922J3354J9371j2019m0807O681K1938j46P75M169j9443
$$ 123361 101085 100872 129794 143148 162519 150500 109693 116374 138312 138166 138941 143110 123667
13858A23667j4683k5413l8009N832K0759N573j7273m407o472N71L3125j0006k0987
$$ 123667 108984 83571 45562 51394 72153 77726 60453 56046 49574 50145 83270 73264 52277
13845E2277K1160K4162J1562J0034J882Q33j6573j1097k8211k2654N799k8822
$$ 52277 73437 97599 109161 119195 121077 121910 105337 94240 66029 43375 49174 20352
13833B0352l9005J1461M0396Q357k5048j4454j9419K8555J0555q168j3028K0074
$$ 20352 -18653 -7192 33204 41561 16513 2059 -17360 11195 21750 13582 554 20628
13821B0628K7812k6029k1239J2709J6915J4350J3594Q617k4921j5526J235j4203
$$ 20628 48440 22411 1172 13881 30796 45146 58740 67357 42436 26910 28145 13942
13809A3942m684J0855m422j9696j2327j9853K0323K4623J9317K0825J8072r627
$$ 13942 9258 20113 15691 -4005 -16332 -36185 -15862 8761 28078 48903 66975 57348
13797E7348k0740j3499R313n154j9399r178L9080J6860k7303P471K6161l3139
$$ 57348 36608 23109 32422 27268 7869 -1309 37771 54631 27328 34799 60960 27821
13785B7821j2238Q201k810Q394J9084J2104r697j52J5358j4413k8484L696P520
$$ 27821 15583 23784 20974 29368 48452 60556 50859 50707 66065 51652 23168 26864 34384
13772C4384j4127J2571j486k416O076J9802N670n919j6165k6685J2277J5529l3495
$$ 34384 20257 32828 31342 28926 35002 54804 60474 54555 38390 11705 23982 39511 6016
13759F016k0433K9498K9732Q412j4167N339l9l2846N770J05L537r913n310K243
$$ 6016 -14417 15081 44813 53225 39058 44397 44358 11512 17282 17387 20924 11011 5701 7944
13745G944K3342J4252o054q757J5029k0570P61L7649p306O078j0359k3923n126
$$ 7944 31286 45538 39484 30727 45756 25186 25947 63596 56290 62368 52009 28086 22960
13732B2960q269k780P075J399j3454k7610K8699J5555K8938O355j9393Q028M9873
$$ 22960 14691 11911 18986 20385 6931 -20679 8020 23575 52513 58868 39475 47503 97376
13719I7376L8973M3538L1134j209J355R149q865n1374l7060m6931m5576j6566
$$ 97376 136349 179887 211021 209812 211167 220316 211451 160077 123017 76086 30510 13944
13707A3944O22J8353K6046K1541J4950j630l855k0743k7700O770J7705j4639r427
$$ 13944 14566 32919 58965 80506 95456 93826 89971 69228 41528 48298 66003 51364 41937
13694D1937o945p141o953J3831Q654n86o066K7063J1390o272k8965j1931O358
$$ 41937 34992 27851 20898 34729 43383 42797 36731 63794 75184 68912 39947 28016 34374
13681C4374l743j7702L39N0890J3278k8581j3761j5306k171J6017J4687k1700
$$ 34374 30631 12929 13268 64158 77436 48855 35094 19788 17617 33634 48321 26621
13669B6621j2688J2940K47O266m629k873O532O246j5704J4009J996k39J81q592
$$ 26621 13933 26873 27120 33386 28757 25884 32416 38662 22958 36967 38963 38724 38905 30313
13655C0313K200L2987K621l0830K0110M713l5684k1064J1187O876J4452K4331
$$ 30313 32513 65500 68121 37291 57401 62114 26430 5366 16553 23429 37881 62212
13643F2212j5k0773n244R202J6670l847l1330K091p537K0720O226K2380J9478
$$ 62212 62197 41424 36180 45382 62052 58205 26875 28966 21429 42149 48375 70755 90233
13630I0233l3015j857j2903Q572K6285n465j416L0911J1485n532j7065r808k691
$$ 90233 57218 55361 42458 51030 77315 71850 70434 101345 112830 107298 90233 80425 77734
13617G7734N710K7470J5606J7043K2629N727k4405q00L674J522K3448L58j1586
$$ 77734 83444 110914 126520 143563 166192 171919 147514 146714 150388 151910 175358 175716 164130
13604A64130J4122K540j5324m486M034P363M843j3868j5179l47q430m096J2050
$$ 164130 178252 180792 165468 160982 165016 172379 177222 163354 148175 147828 139398 135302 147352
13591A47352k0863O551l581P304J1806J9734K0910K6494K2106K1012k4888k8528
$$ 147352 126489 133040 129459 136763 148569 168303 189213 215707 237813 258825 233937 205409
13579B05409j2697j4L5560P128j5583j7980J0716K4984k630l2577n10J646J3887
$$ 205409 192712 192698 228258 235386 219803 201823 212539 237523 234893 202316 201806 203452 217339
13566B17339k2767J9401L4979L7111J9994Q531j845K1127M1728M0271M6783N2623
$$ 217339 194572 213973 248952 286063 306057 314588 312743 333870 375598 415869 462652 515275
13554E15275L1267K9433P0919R9098O5423N7134P6057J14557R9722J20296J60486
$$ 515275 546542 575975 646894 745992 811415 868549 944606 1059163 1158885 1279181 1439667
13543A439667J97868L04955L95719N02234O70816R24187J244124J589045J746456
$$ 1439667 1637535 1942490 2338209 2840443 3511259 4435446 5679570 7268615 9015071
13534I015071J611838J200461O85051K02408o4670J0674M02252J031019J712487
$$ 9015071 10626909 11827370 12512421 12714829 12650159 12660833 13063085 14094104 15806591
13525A5806591K162559K197333J653603P30119l52934j251883j687825j560560
$$ 15806591 17969150 20166483 21820086 22550205 22197271 20945388 19257563 17697003
13517A7697003r89282k16439N52623J137349J469197J429975R53049J86206o53859
$$ 17697003 16707721 16491282 17043905 18181254 19650451 21080426 22033475 22219681 21565822
13508B1565822j224698j416331j282058q12417j02816P16679J478273J796250
$$ 21565822 20341124 18924793 17642735 16830318 16727502 17444181 18922454 20718704
13500B0718704J616393R37310o1638j089343j850667k154613j971151j432979
$$ 20718704 22335097 23272407 23210769 22121426 20270759 18116146 16144995 14712016
13492A4712016p01559k4283L65373K26107k96588r64640j531883j831405j797100
$$ 14712016 14010457 13986174 14351547 14577654 14281066 13316426 11784543 9953138 8156038
13483H156038j570133j236361r01646o69984m80992l58996k92487k35090k05821
$$ 8156038 6585905 5349544 4447898 3777914 3296922 2937926 2645439 2410349 2204528
13474B204528j67059j25986p4230q4965m9160k1564K793m321K9143O0259N4132
$$ 2204528 2037469 1911483 1837253 1752288 1703128 1681564 1684357 1680036 1709179 1769438 1823570
13463A823570J10383J40453J83136K75829L87445M92694O63387R53904J294940
$$ 1823570 1933953 2074406 2257542 2533371 2920816 3413510 4076897 5030801 6325741
13454F325741J582538J776905J736780J369663Q01801K33953j12523j42396K17923
$$ 6325741 7908279 9685184 11421964 12791627 13593428 13827381 13714858 13572462 13790385
13445A3790385Q63802J602704K188719K339044J969329J144318M9604r77719j582621
$$ 13790385 14654187 16256891 18445610 20784654 22753983 23898301 23947905 22970186 21387565
13436B1387565j609658j084589l69771L60233J008492J385500J334071Q57145
$$ 21387565 19777907 18693318 18323547 18683780 19692272 21077772 22411843 23268988
13428B3268988J83093m00843q36526j089611j154879r12697m78090R6846O47315
$$ 23268988 23452081 23051238 22214712 21125101 19970222 19057525 18579435 18676281 19323596
13419A9323596J189172J463392J251746N41051n18228j479783k022334k058854
$$ 19323596 20512768 21976160 23227906 23768957 23250729 21770946 19748612 17689758
13411A7689758j601852q69992j70326K65479K28586k34734r11870j523793j895743
$$ 17689758 16087906 15217914 15047588 15313067 15541653 15306919 14395049 12871256 10975513
13402A0975513j925917j714343j385358j058725q19619n85764m39289l57933l32246
$$ 10975513 9049596 7335253 5949895 4891170 4071551 3485787 3046498 2688565 2356319
13393B356319k68639k13283j81238j71226j23002r3393j14478p7605p3394o2741
$$ 2356319 2087680 1874397 1693159 1521933 1398931 1305538 1191060 1113455 1040061 977320
13383I77320o2979o3448j6130n1973n3664n4860k8768q493k5404l1632j8304k5016
$$ 977320 914341 850893 834763 782790 729126 674266 645498 637005 611601 579969 561665 536649
13371E36649j8928j986l792k9592k0720L714K799k7688j3668j6847N066l744l4749
$$ 536649 517721 515735 511943 482351 461631 465345 468144 440456 426788 409941 415007 411263 376514
13358C76514m1766o833m221o0614Q507M4259L91m7318j7453j7285j353L1624j6943
$$ 376514 334748 327915 323694 263080 271587 315846 316237 268919 251466 234181 232828 264452 247509
13345B47509J1256J5355P334j2689l0252l045M296k6073M014p00k0683o183J1082
$$ 247509 258765 274120 281454 268765 238513 235468 239764 213691 217705 217005 196322 190139 201221
13332B01221K5042L12k1745q230J7689O866J7885k69j2337l28O473J4671K4301
$$ 201221 226263 226575 204830 196600 214289 221155 239040 238771 226434 226106 232579 247250 271551
13319B71551J136p685J0977k287l0841j8321K634k71J9342O113K021p568n972
$$ 271551 272687 265002 275979 273692 242851 224530 227164 226893 246235 252348 254369 246801 240829
13306B40829j2476M488J1566J6548k5897l6296o232L759l498j0376J3808M0241
$$ 240829 228353 232841 244407 260955 235058 198762 192530 196289 192791 182415 196223 236464
13294B36464J6316k4305l9277k0244J2425L6658R350J2861K966l1578q744K4016
$$ 236464 252780 228475 189198 168954 181379 218037 227387 240248 243214 211636 202892 226908
13282B26908j6540p350l565M054m515j2462M821N45P093q185m685K737m384j840
$$ 226908 210368 203018 199453 203507 198992 186530 191351 191896 198989 190804 186119 188856 184472 182632
13268A82632N554m902l168k1520k9111K9368M6618J6724m937J274k0316n004m320
$$ 182632 188186 183284 180116 158596 129485 158853 205471 222195 217258 218532 198216 193212 188892
13255A88892J5980p541p75k6270j1054J3250J0586q455J6906K7333N45k6965J9707
$$ 188892 204872 197331 196556 170286 159232 172482 183068 174613 191519 218852 219397 192432 212139
13242B12139J4405O11J5031L0212R670J1643J1997J1391N588L3719K6358j8634
$$ 212139 226544 227155 242186 272398 282068 293711 305708 317099 322687 356406 382764 364130
13230C64130J0482J0853J7935J5336K2712L6471M5484N9257Q3593M7420J8226
$$ 364130 374612 385465 403400 418736 441448 477919 523403 582660 666253 713673 731899
13219G31899N7912Q9373R8665J38282J81529K08143K84136L83187N16584P05742
$$ 731899 789811 879184 977849 1116131 1297660 1505803 1789939 2173126 2689710 3395452
13209C395452Q89797R98621R70258P74508N01557K99694K82402M36545O83416
$$ 3395452 4285249 5283870 6254128 7028636 7530193 7829887 8112289 8548834 9232250
13200I232250Q79630Q77702O31555J69914k43794n32337o01998m81338k52322
$$ 9232250 10111880 10989582 11621137 11791051 11547257 11014920 10412922 9931584 9679262
13191I679262k632J20666P4145q8828j71957K6611M40726R44049J420479J633391
$$ 9679262 9676630 9797296 9871441 9782613 9610656 9637267 10077993 11022042 12442521 14075912
13181A4075912J498256J107613P23195N72650O98795J014568J279326J248762
$$ 14075912 15574168 16681781 17404976 17977626 18676421 19690989 20970315 22219077
13173B2219077Q33590J73106n32040j059100j347654j255794r39598n58981m09002
$$ 22219077 23052667 23225773 22693733 21634633 20286979 19031185 18091587 17532606 17123604
13164A7123604o49666j115066j517836j601079j320379q16364k98955J17374K87681
$$ 17123604 16473938 15358872 13841036 12239957 10919578 10103214 9804259 9921633 10209314
13155A0209314K54555J18947N4999P6328K39331M31807N67154M85580K49807p5012
$$ 10209314 10463869 10582816 10637815 10714143 10953474 11385281 11952435 12438015 12687822 12612810
13145A2612810m78226p42416p62270o98136m89116l16809l45339n18393p49346
$$ 12612810 12134584 11392168 10629898 9931762 9442646 9125837 8780498 8262105 7512759
13136G512759q78767q75328p73884o01801l57062j45532O4818K84579M97394P39759
$$ 7512759 6633992 5758664 4984780 4382979 4025917 3880385 3945203 4229782 4727176 5466935
13126E466935R35043J009226Q94170O58585L79441K35065L03822O00421Q61093
$$ 5466935 6401978 7411204 8305374 8963959 9343400 9578465 9882287 10482708 11343801
13117A1343801R61420P67870L69224j13055n14367o89645o83725m11905j14417
$$ 11343801 12305221 13073091 13442315 13329260 12814893 12125248 11441523 11029618 10915201
13108A0915201Q5741R5885p9189k04942j41505J84924P18771J263584J655510
$$ 10915201 11000942 11096827 11017638 10812696 10671191 10856115 11574886 12838470 14493980
13099A4493980J698241J381786R83374O50882N88485P95832J196605J400451J290432
$$ 14493980 16192221 17574007 18557381 19208263 19796748 20592580 21789185 23189636 24480068
13090B4480068Q50038Q5603o40524j190870j445633j365169j034997o80273o13714
$$ 24480068 25330106 25415709 24775185 23584315 22138682 20773513 19738516 19058243 18444529
13081A8444529q72329j245275j545787j561476j254851p59909k14122J69758K81508
$$ 18444529 17572200 16326925 14781138 13219662 11964811 11204902 10990780 11160538 11442046
13072A1442046J88643j0607m6230L3426K64068M88467N72245M83998J86654k73428
$$ 11442046 11630689 11620082 11573852 11607278 11871346 12359813 12932058 13416056 13602710 13329282
13062A3329282o53583q59368q92862p16119n07834l88953m26940o52836q94091
$$ 13329282 12675699 11816331 10923469 10207350 9699516 9310563 8883623 8230787 7336696
13053G336696j014689j015595r17331p50812n80585m50345l66051k43789k22359
$$ 7336696 6322007 5306412 4389081 3638269 3057684 2607339 2241288 1997499 1775140
13044A775140j57889r8892j10237j07165j17897j31660r1125p2900m0609l4993
$$ 1775140 1617251 1518359 1408122 1300957 1183060 1051400 960275 887375 846766 811773
13034H11773j4146l1597m0450n3145l8620l421k3310l0186l6379j9042l7274O2
$$ 811773 797627 766030 725580 672435 633815 630394 607084 576898 540519 521477 484203 484265
13022D84265L0501p291j7818J0169K4839j1018k1889j8370J4355j836p707r092
$$ 484265 514766 507475 489657 499826 524665 513647 491758 473388 487743 485907 478200 469108
13010D69108l538j1437l3248q371J2935J5851l179l6750r969L339M851J4907L077
$$ 469108 465570 454133 420885 412514 425449 441300 438121 401371 391402 394741 399592 414499 417576
12997D17576P808L233K425k354j7436J97m8194k2662K3777L1692j4045M826K5803
$$ 417576 425384 428617 431042 428688 411252 411449 363255 340593 364370 396062 382017 386843 412646
12984D12646L3974L1513K486p307l3810k8514r989j3110n217l716k1216k489n880
$$ 412646 446620 478133 480619 473312 439502 410988 400999 387889 382672 378956 357740 355251 349371
12971C49371Q478L180k2452Q950r434k1158l574N507q870j7169J4191M729M368
$$ 349371 357849 361029 338577 347527 338093 316935 313361 318868 309998 292829 307020 311749 316117
12958C16117Q335j1695k5836p905N058j5503q695l0273k2539J3691p120O843J0269
$$ 316117 324452 312757 286921 279016 284074 268571 259876 229603 207064 220755 213635 220478 230747
12945B30747J5973m465N768N81n948p871L859J4344R074k2319j6746J1368K2102
$$ 230747 246720 242255 248023 248604 242656 234785 238644 252988 262062 239743 222997 234365 256467
12932B56467K8762J2100K177n459J3488O188j9739l825p59k0207N847j2672l9097
$$ 256467 285229 297329 299506 294047 307535 313723 293984 290159 289400 269193 275040 262368 223271
12919B23271n800L660l5430l7288O487J5099p20p60M059K1508j7633j7273L569
$$ 223271 217471 221131 185701 148413 154900 169999 169279 168519 172578 194086 176453 159180 162749
12906A62749j8521p919M091K1731r094j5008j4469J9037l0286j7641K9799N908
$$ 162749 144228 136309 140400 162131 153037 138029 123560 142597 112311 94670 124469 130377
12894A30377L6373M125j1081m2229N849K2136r70Q837p347J5384Q578K868P030
$$ 130377 166750 170875 159794 117565 123414 145550 144580 153417 146070 161454 170032 172900 179930
12881A79930M3257L4623M108j8139l8215k6743M888j2474k9836j6173K1585j6181
$$ 179930 223187 257810 261918 243779 205564 178821 183709 171235 141399 125226 146811 130630
12869A30630j728j0124o518K0878K2117N866Q520R981j961j2302L908K0960q914
$$ 130630 128902 118778 112260 133138 155255 161121 169641 179622 177661 165359 169267 190227 181313
12856A81313Q730K7906l043j0712j0309l6866l2667K1770K6520j0995k5699j784
$$ 181313 190043 217949 214906 204194 193885 157019 124352 146122 172642 161647 135948 134164
12844A34164K551J638L483P820j7884m0000j8456O82L2696K2793J897J3052K1408
$$ 134164 136715 138353 141836 149656 131772 91772 73316 73998 106694 129487 131384 144436 165844
12831A65844k3146j1351j5907R145N852L641J4896r089L67j8640J2287q525l3730
$$ 165844 142698 131347 115440 124585 130437 134078 148974 139885 140252 121612 133899 125374 91644
12818I1644J3252P481l405j4986R983J9634L5429j3766q473j0511j8999K828K0828
$$ 91644 104896 112377 108972 93986 103969 123603 159032 145266 136793 126282 107283 110111 130939
12805A30939k7223k0465k2793j634N378j498N591K249K0144J0670K1420n102k577
$$ 130939 103716 83251 60458 58824 64202 62704 68295 70544 90688 101358 122778 117676 115099
12792A15099J2595L096j6766j5941K0020p169j9516K1382K4147p156q425K09M113
$$ 115099 127694 130790 114024 98083 118103 110934 91418 112800 136947 129791 121366 121575 125688
12779A25688j5565k8733p315O289J2920J0765l249o667R638N257p31j2080J3779
$$ 125688 110123 81390 74075 80364 93284 104049 100800 94133 103771 109028 108297 96217 109996
12766A09996Q303P612K2446J1581J2769J300n310k2315j7494n909m819J7477K6901
$$ 109996 118299 125911 148357 159938 172707 174007 168697 146382 128888 122979 118160 135637 162538
12753A62538N606J192q393l0018p377K817Q400M942K2695J9112j7796k2255J3344
$$ 162538 168144 169336 160943 130925 123548 126365 134765 139707 162402 181514 163718 141463 154807
12740A54807J3742o365O121N454j6318J2667M2182J6490p649n27j8628j1147M487
$$ 154807 168549 162184 168305 173759 157441 170108 212290 228780 221131 220604 201976 190829 195316
12727A95316j146j1944j2473N000J8126j8109j5873j3422R628j5275j7303k708
$$ 195316 194170 182226 169753 174753 192879 174770 158897 145475 155103 139828 122525 119817
12715A19817j8854k6259J4630L8467J5438m508o972j644J6635J0450M4746K7025
$$ 119817 100963 74704 89334 127801 143239 138731 131759 130115 146750 157200 201946 228971
12703B28971m634k6225j2233J5700o471l7187k9239J7449l314m656P433k223o428
$$ 228971 224337 198112 185879 201579 195108 157921 128682 146131 142817 138161 145594 143371 136943
12690A36943q68m65K0008l175L510Q470O636j0086K827j2588K9970K8834j8763
$$ 136943 136075 135610 155618 152443 155953 164423 171059 160973 163800 151212 181182 210016 191253
12677A91253j4737J7134K3132N366m4777j8660K7199R180k8332j737L5003L8439
$$ 191253 176516 193650 216782 222148 177371 158711 185910 195090 166758 165021 200024 238463
12665B38463L5344K328n9587k7251J766j0751J3319J3546j183k909K7750o142
$$ 238463 273807 276135 216548 189297 191063 180312 193631 207177 205994 203085 230835 224693
12653B24693q95K9046M155K1501J3967k2187R906J8539J7783L927K2420O665l3257
$$ 224693 223798 252844 256999 278500 292467 270280 280186 298725 316508 320435 342855 349520 316263
12640C16263J1254M3421N7070R1834P4934Q6697M3529j498j284K421q058k6013
$$ 316263 327517 370938 428008 519842 594776 681473 725002 723504 722220 724641 716583 690570
12628F90570o2858o3964m8544p2172n1229n9809k5057j0161l3826l2256k9495
$$ 690570 627712 563748 515204 443032 391803 331994 306937 296776 262950 230694 201199
12617B01199P710K7078j5293q760r955K003K4581q501M121J4803O195o043j055
$$ 201199 208909 235987 220694 211934 201979 203982 228563 220062 224183 238986 245181 239138 238083
12604B38083Q620J2133L370M3974N7717O3173K3410L8373K0198j8815Q073J4949
$$ 238083 246703 258836 262206 306180 363897 427070 450480 488853 509051 490236 498309 513258
12592E13258J3696K3901O1406L7963k4684r1973j05495o8057o4935m6310n4360
$$ 513258 526954 550855 612261 650224 625540 533567 428072 360015 295080 248770 194410
12581A94410l4890N260M0415l6204k4019k0195k6906j5768J704K974P451K5037
$$ 194410 159520 164780 205195 168991 144972 124777 97871 82103 83807 86781 94232 119269
12569A19269J0220Q308J6076k6738L500J6568r389n903j0350m109k3069J4056
$$ 119269 129489 137797 153873 127135 130635 147203 137814 131911 121561 117452 94383 108439
12557A08439k6898o373J5570K4490J8735J635l413R69j2529j0138N469K2249j0364
$$ 108439 81541 75168 90738 115228 133963 135598 132185 133154 120625 110487 115956 138205 127841
12544A27841m031j2309L564K0301n830J1457j1433j5244j8518j0989n691J5058
$$ 127841 123810 111501 115065 135366 129536 140993 129560 114316 95798 84809 79118 94176
12532I4176k356o547q224k0116L2915K4563j58j5843r33J7211J9170k7635k9154
$$ 94176 91820 85273 77049 56933 89848 114411 114253 98410 97477 114688 133858 106223 77069
12519G7069P964K3258l1725j654K4326J1878J3129k4098o099j8754J0259n005
$$ 77069 85033 108291 76566 74912 99238 111116 124245 100147 94048 75294 85553 80548
12507H0548n584k6353K5226M521k3914j3862O486j1595P402M060J8048j660j2689
$$ 80548 74964 48611 73837 78358 54444 40582 47068 35473 42875 46935 64983 63323 50634
12494E0634K2919L118n409l156P967k4433k4413m90j9348O456J208J0812K8057
$$ 50634 73553 76671 71262 68106 76073 51640 27227 26737 7389 13845 15053 25865 53922
12481E3922J4391m38M90O138L735J4687J6217J5399J0380j8146k1957K2815M960
$$ 53922 68313 67875 68365 74503 78238 92925 109142 124541 134921 116775 94818 117633 122593
12468A22593k6278j5649N987m037r262M221P350k6954Q371K0095k3772p576K2409
$$ 122593 96315 80666 86653 82616 73354 77575 84925 57971 66342 86437 62665 55089 77498
12455G7498K3338J549l243N604M11k5353j8466K1095M162j1558j3210M741N03
$$ 77498 100836 102385 99142 104746 105157 79804 61338 82433 86595 75037 61827 66568 67071
12442F7071m353N401n790P660L0608K3252O125J3413j2316j1826K0907j0060j2438
$$ 67071 62718 68119 62329 69989 100597 123849 129974 143387 131071 119245 140152 130092 117654
12429A17654K309J1987k6291l3562j935m775j0252Q573K7326K8722J8120n623
$$ 117654 119963 131950 105659 72097 70162 65387 55135 63708 91034 119756 137876 132253
12417A32253L725K3794q353k0546p75J1754K818k4724r28k1090j9581k7134R675
$$ 132253 135978 159772 151419 130873 130098 141852 144670 119946 119018 97928 78347 51213 60888
12404F0888k873j8464J7460n435J128n847j3483k0225j3347J6905k735p330R371
$$ 60888 58015 39551 57011 51576 52704 46857 33374 13149 -198 16707 13972 6642 16013
12391A6013J4302N762J7702k27j2674J8252J8405R564K8835M9928L3399o876j5423
$$ 16013 30315 36077 53779 53552 40878 59130 77535 87099 115934 165862 199261 192385 176962
12378A76962k1474j9834M966J256m7706J2598J1548n885K9445m0173m7609p157
$$ 176962 155488 135654 140620 141876 94170 106768 118316 112431 141876 101703 54094 46937
12366D6937K3670J3518m462k4722Q747l6537r58o269j619L1129J7801m243J8270
$$ 46937 70607 84125 79663 54941 63688 27151 26193 19924 18305 49434 67235 62992 81262
12353H1262J6226j5680l3416K9959J0813p028j2341l3338L260o430L3554Q487
$$ 81262 97488 81808 48392 78351 89164 82136 69795 36457 39717 33287 66841 75328
12341G5328M816K3801K8412L32J0894r527l2748m814J9127M822j2614m0097P239
$$ 75328 80144 103945 132357 132689 143583 134056 101308 96494 115621 120443 107829 67732 74971
12328G4971M4137j5027j3270j1122j2110R190N315J8344j7430l2198j5714L1988
$$ 74971 119108 104081 90811 79689 67579 76769 82084 100428 82998 50800 35086 67074
12316F7074J5365J0187K0009L5074J7869o649K1175r995R485J9007N163j2739
$$ 67074 82439 92626 112635 147709 165578 158929 180104 170109 179594 198601 203764 191025
12304A91025L324j1453o415k112r143k365j4073p151J0178L009n1035k661j4868
$$ 191025 194349 182896 176481 174369 165226 162861 148788 141637 151815 154824 103789 101128 86260
12291H6260j2322J9971L3214J2149J3278J1116R547K8193j977j4336K2341K0425
$$ 86260 73938 93909 127123 139272 152550 163666 173213 201406 199429 185093 207434 227859
12279B27859n297q672j4069K5257M3498L5323M1060J9603r513j0290k1815l514
$$ 227859 222562 213890 199821 225078 268576 303899 344959 364562 355049 344759 322944 319430
12267C19430L4869R435J3033l184j2529J0163Q232J1558N61o83k0825l8230k8201
$$ 319430 354299 363734 376767 373583 361054 371217 379449 391007 391568 390885 370060 331830 303629
12254C03629l2102j5695L8035M0732J0146L56M5186N0708L1182K2173O0770Q7832
$$ 303629 271527 255832 293867 334599 344745 345101 390287 440995 472177 494350 555120 642952
12242F42952Q0399J30997K11150K51290L63202M19446L90286K29569o8108k84174
$$ 642952 723351 854348 1065498 1316788 1679990 2099436 2489722 2719291 2651183 2367009
12232B367009l48855l33166k80695k03160j58957j02619m9682j2764M109k6390
$$ 2367009 2018154 1684988 1404293 1201133 1042176 939557 889875 877111 881220 854830
12222H54830m7803j7045M0091J5793M7K4253M5328N2329L1641J1992L3917N6335
$$ 854830 807027 789982 830073 845866 845913 870166 915494 967823 999464 1011456 1045373 1101708
12210A101708P5646P7835R1731J11504J52192J68817K12583K92677L98476N72603
$$ 1101708 1177354 1255189 1346920 1458424 1610616 1779433 1992016 2284693 2683169 3255772
12200C255772Q34294R15564O84346K75618j28901m39340n60505n08482l81275
$$ 3255772 4090066 5005630 5689976 5965594 5836693 5397353 4836848 4328366 3947091
12191C947091k06313k9232O9188J53504K77462L99510M71927N74570O43312P23776
$$ 3947091 3740778 3711546 3780734 3934238 4211700 4611210 5083137 5657707 6301019 7024795
12181G024795Q47046J024041J148841J253667J351927J515731J896319K519452
$$ 7024795 7871841 8895882 10044723 11298390 12650317 14166048 16062367 18581819
12173A8581819L420187M737898O700941R689110J3894165J8564191K1401245J9747101
$$ 18581819 22002006 26739904 33440845 43129955 57024120 75588311 96989556 116736657
12165A16736657J3756591O847600J055383m638830j1020381j6235780j8256537
$$ 116736657 130493248 137340848 138396231 133757401 122737020 106501240 88244703
12158H8244703j7411520j4671697j1247726q107386n762919m166716l086100k407394
$$ 88244703 70833183 56161486 44913760 36806374 31043455 26876739 23790639 21383245
12150B1383245j914065j532206j193354r03971o53953m64749k99645j15020Q1571
$$ 21383245 19469180 17936974 16743620 15839649 15185696 14720947 14421302 14306282 14387853
12141A4387853L04614O15020R61832J315944J741119K292440L179526M515400
$$ 14387853 14692467 15307487 16269319 17585263 19326382 21618822 24798348 29313748
12133B9313748O435975Q996836J1673709J3393778J3208289J0718676O411677
$$ 29313748 35749723 44746559 56420268 69814046 83022335 93741011 100152688
12126A00152688J886833n20314Q6077K059262K184572q15559n519188j0074570
$$ 100152688 102039521 101519207 101605284 103664546 105849118 105033559 99514371 89439801
12118H9439801j3145788j3973149j2781510j0459077p878526n559901l814805
$$ 89439801 76294013 62320864 49539354 39080277 31201751 25641850 21827045
12111B1827045k712054k033302j677977j562350j504721j365921j250345j132465
$$ 21827045 19114991 17081689 15403712 13841362 12336641 10970720 9720375 8587910
12103H587910r85553q28091o59258n64947m36213l24964k01607n7449R9562K12070
$$ 8587910 7602357 6774266 6115008 5550061 5113848 4788884 4587277 4529828 4629390 4841460
12093D841460J96376J5953k12518m37839m98773m57768l77856k96945k48393j60546
$$ 4841460 5037836 5053789 4841271 4403432 3904659 3446891 3069035 2772090 2523697 2363151
12083B363151j36891j42433j41341r8539r4293r8745r6237m6640k6270l5442n0660
$$ 2363151 2226260 2083827 1942486 1843947 1749654 1650909 1554672 1508032 1481762 1446320 1395660
12072A395660m7846q965n3104k5311Q907k0042O417m054M923K2735J7629K8693
$$ 1395660 1347814 1338849 1285745 1260434 1269341 1249299 1255716 1251662 1256585 1279320 1296949 1325642
12060A325642N0565J16097J74766K16692L20017M80031O18293O53456N45157L21325
$$ 1325642 1376207 1492304 1667070 1883762 2203779 2683810 3302103 3955559 4500716 4822041
12050D822041k6211m04110o21493o87556n99355m30793k89829j73892j16417q5584
$$ 4822041 4795830 4391720 3770227 3082671 2483316 2052523 1762694 1588802 1472385 1386801
12040A386801n9725m3372n1812p1949m1155m5540n9701p9744o4387n0454n7828
$$ 1386801 1327076 1283704 1231892 1159943 1118788 1073248 1013547 933803 869416 818962 761134
12029G61134o3527l3519j7016N13k0254l3240m7710l5892k8142N058O606j5834
$$ 761134 697607 664088 647072 647585 627331 594091 546381 510489 482347 487405 494011 478177
12017D78177j3194j334P101k1330O914q746j6709m441r123k4134k9696K7822K8871
$$ 478177 464983 463649 470750 449420 456334 447588 430879 426438 417315 393181 363485 391307 420178
12004D20178j940m084L481L2175j9098k6440Ok275j0204K5802J7551k6965k0297
$$ 420178 418238 414154 417635 449810 430712 404272 404278 402003 391799 417601 435152 408187 387890
11991C87890j8859m5204N530J9712k4928l381O592j4728k1702K7290L3134J6337
$$ 387890 369031 323827 329357 349069 324141 320760 327352 312624 290922 318212 351346 367683
11979C67683j8729l5628J2753j6915m676K6721o188j8347k1992j2160j3935j3711
$$ 367683 348954 313326 326079 309164 304488 331209 325021 306674 284682 272522 258587 244876
11967B44876J2337J3817K5598J2868j124k3428m7880l4313k4158k847O745J2163
$$ 244876 257213 271030 296628 309496 308372 284944 237064 202751 178593 175746 182491 194654
11955A94654l015P763K5406k861J15J0347l0620l1753m572j08M1789K2851l6379
$$ 194654 191639 199402 224808 221947 222062 232409 201789 170036 165464 165356 207145 229996 193617
11942A93617p237k6096r634j486j9964m25n987K4505K2347M1818J20j6318m831
$$ 193617 186380 160284 150650 149164 129200 128775 122788 147293 169640 211458 211578 195260 190429
11929A90429L0732J1189k2756O24m24j7198r896m617L318O81K111K8475M0r642
$$ 190429 221161 232350 209594 210218 209794 192596 182700 178083 181401 182082 184193 212668 212708 203066
11915B03066k0103L251L418J3331j147J4663M126n2058k8157o721k1k0636j3197
$$ 203066 182963 186214 189632 202963 201816 216479 220605 168547 140390 133669 133648 113012 99815
11902I9815O814K9434k370Q738K9960j5260j829J4084L463n088j5356j1440k0918
$$ 99815 106629 136063 133693 142431 172391 157131 155302 169386 172849 167761 152405 140965 120047
11889A20047l5327N020L553J3849L0795K7374m915n162M623J7324J0179p493k2729
$$ 120047 84720 89740 93293 107142 137937 165311 160396 155234 159857 177181 187360 179867 157138
11876A57138o22n312j7492m648K1499M734j1743R137K6505J2313o030k0200l145
$$ 157138 156516 151204 133712 129064 150563 155297 143554 152691 179196 191509 185479 165279 162134
11863A62134J2639j9527j609k7631o863r779k651m1444J9021K2434m627j912K6752
$$ 162134 174773 155246 153637 126006 119143 109364 106713 65269 84290 106724 102097 100185 126937
11850A26937N4104Q647n28j5601L4007J1703k2497j7354j9268j5261p80j557P944
$$ 126937 181041 189688 189160 173559 207566 219269 196772 179418 160150 144889 144109 142552 150496
11837A50496l222p786K1333K1582M874p334k3945m565L2644K6574L3370K9355
$$ 150496 147274 139488 160821 182403 187277 179943 155998 151433 184077 210651 244021 273376
11825B73376l3143m7409k3390n245L92k7751k3137k786q97k3615j8861R291K4519
$$ 273376 240233 192824 169434 164189 164581 136830 113693 110907 110010 86395 67534 76825 101344
11812A01344j516j5973k5299J7376K7718n130J81Q417j379N481J8976p466j4464
$$ 101344 99828 83855 58556 75932 103650 98520 98701 107118 105739 111220 130196 122730 108266
11799A08266r192j731Q106P533J322P873q475j0325k2084k8713J2623L8637Q013
$$ 108266 99074 97343 105449 112982 114304 122177 113702 103377 81293 52580 65203 103840 111853
11786A11853J426J0401j819P256K7018J4719N409O0277K0822j1916k8893l7589
$$ 111853 113279 123680 121861 129117 156135 170854 176263 236540 257362 245446 216553 178964
11774A78964k4041N416P148j0348J1952J6979K8660K8424R277N572q287M2651
$$ 178964 154923 160339 167487 157139 169091 186070 214730 243154 252431 258003 249716 292367
11762B92367L4362o608j4032k8500k5983P377K6585k3602m3214j8573l4205k0494
$$ 292367 326729 320121 306089 277589 251606 258983 285568 261966 218752 200179 165974 145480
11750A45480J5188K3136J8617K5348J2256K0367l5409l6607j0997M844k5579k4643
$$ 145480 160668 183804 202421 227769 240025 260392 224983 188376 177379 182223 156644 132001
11738A32001J8577J2179j2994j1035j227o157J3404J3251k3629l9146K075Q637
$$ 132001 150578 162757 149763 138728 137501 131344 144748 157999 134370 95224 97299 105936
11726A05936J0085k1994J4938J1429J4137J5344j8422L549j3510J099k8164m054
$$ 105936 116021 94027 108965 120394 134531 149875 131453 135002 121492 122591 94427 90373
11714I0373R071J9407K900j0735J4567J2760N016K1871J4462K813l0479J0134
$$ 90373 99444 118851 121751 111016 125583 138343 143359 165230 179692 182505 152026 162160
11702A62160j775K8091L9785K6102J1696N779O1603N3819L8654P0123Q4881J05103
$$ 162160 160385 188476 228261 254363 266059 271838 333441 387260 425914 496037 580918 686021
11690F86021J18257L8948J5351k8121m7545n3791q9668p8083r0630q4676k0525
$$ 686021 804278 843226 858577 830456 782911 729120 639452 561369 470739 386063 365538
11679C65538k4364j7430J2926J9551j2877j3525l1778l182m5889r951N251j1242
$$ 365538 341174 323744 336670 356221 343344 329819 298041 294859 248970 239019 244270 233028
11667B33028j7545p878N285P833K9609J4011j8198m077k5654Q369K7136L8835
$$ 233028 215483 207605 212890 220723 250332 264343 246145 242068 216414 224783 251919 290754
11655B90754L9244O5833O2300J00348Q7259N9594J6580l136j8696l5472k1669
$$ 290754 329998 395831 458131 558479 645738 705332 721912 718776 700080 664608 642939
11644F42939l3347p8355m2567o4390o1200n3152n2448n5580k8629o588J4443L514
$$ 642939 609592 531237 488670 424280 363080 309928 257480 201900 173271 166683 181126 184640
11632A84640j4412l6963O035k221l9814j9710L098J9987L840J2717j0846l8792
$$ 184640 170228 133265 139300 137079 97265 77555 80653 100640 104480 117197 106351 67559
11620F7559j649j262o293K2953L721j0914j2102L3915J2316j2650J383j1868R923
$$ 67559 65910 64648 58355 81308 85029 74115 62013 95928 108244 95594 96977 85109 95032
11607I5032K222K331R386J4763K1186j9779k0137k1652k0032j0121J0623K6175
$$ 95032 97254 99585 108971 123734 144920 125141 105004 83352 63320 53199 63822 89997
11595H9997K404K1982J3049j0077p622L296M0739J9215j3057Q886J3327M509O420
$$ 89997 92401 114383 127432 117355 109733 113029 153768 172983 159926 168812 182139 186648 193068
11582A93068K3060J7714J8490J0821L8427K7615J8208r29l6684m6206l6589l7042
$$ 193068 216128 233842 252332 263153 301580 329195 347403 346474 309790 263584 226995 189953
11570A89953k1422L133r593k7193j2979p269l266M954l33K7272K5811p309k8074
$$ 189953 168531 171664 162071 134878 121899 114630 111364 116318 115985 143257 169068 161759 133685
11557A33685o618j5804k0342l484J7708k660K4916K4172J174l1440k4751J6712
$$ 133685 127067 111263 90921 87437 105145 102485 127401 151573 152747 121307 96556 113268
11545A13268r390l56l5260K301J3913K992n421j5661R819R299K525n33m189o659
$$ 113268 103878 103522 68262 70563 84476 87468 82047 66386 76205 85504 88029 87496 83307 76648
11531G6648p25k670J1551J1205L5836K0466k1222R368K1899J0033M3993K1732
$$ 76648 75923 73253 84804 96009 131845 152311 131089 140457 162356 172389 216382 238114
11519B38114L6049L5956K5301K0795K0460k919l9948n0366m6844k2063M204q288
$$ 238114 274163 310119 335420 356215 376675 373756 333808 283442 236598 214535 218739 210451
11507B10451J1078O717J9268K617k6423l4766J8708P029p125N5105M2366J6625
$$ 210451 221529 228246 247514 250131 223708 188942 207650 214679 207554 262659 305025 321650
11495C21650j7610k9401l9244J3833L109k9331K559j1661l6130J0098J0374R118
$$ 321650 304040 274639 235395 249228 252337 223006 225565 213904 177774 187872 198246 207364
11483B07364L149l7922j6375O799l165m0O821K0834j5363P248K5095j8107R27
$$ 207364 210513 172591 156216 163015 159850 159810 166631 187465 172102 179350 204445 186338 187265
11470A87265j8142m708O738k4538j1334K0145K9572K9978K1809J8565o170k9780
$$ 187265 169123 164415 171153 146615 135281 155426 184998 214976 236785 255350 249180 219400
11458B19400J8916M7468M686J3096p290J4269L0388N9261L9436J319J0607l422
$$ 219400 238316 285784 290470 303566 296276 310545 340933 400194 439630 440949 451556 448134
11446D48134L05M3651M0170M6662M3429N5470O1399J05810J11437J26715J31070
$$ 448134 448439 492090 532260 578922 622351 677821 739220 845030 956467 1083182 1214252
11435A214252J54221K26648K76187L56189M47268N59735P36649J049601J500249
$$ 1214252 1368473 1595121 1871308 2227497 2674765 3234500 3971149 5020750 6520999
11426F520999K101641K881212L541107L642144K910860J186900j013429k733818
$$ 6520999 8622640 11503852 15044959 18687103 21597963 22784863 21771434 19037616
11418A9037616l391738l229460k570738j822510j190414p43620m33970j38074
$$ 19037616 15645878 12416418 9845680 8023170 6832756 6089136 5655166 5517092
11410E517092J03375L48099P07746J148379J781247K687715L711965M206606L393923
$$ 5517092 5620467 5968566 6676312 7824691 9605938 12293653 16005618 20212224 23606147
11401B3606147J347742j233011l204771m009383l783671l044843k220259j503678
$$ 23606147 24953889 23720878 20516107 16506724 12723053 9678210 7457951 5954273
11393E954273j057574p58674n69480m45843l45690k82384k44347k10566j92638
$$ 5954273 4896699 4138025 3568545 3122702 2777012 2494628 2250281 2039715 1847077
11384A847077j75759j07136m8112n8528r0125l407j7205l0281J4289N954M385
$$ 1847077 1671318 1564182 1516070 1457542 1367417 1364010 1346805 1316524 1330813 1336767 1341152
11373A341152L6849K2875N0154P5217J08135J54115J73090K14951K96151L50295
$$ 1341152 1378001 1400876 1451030 1526247 1634382 1788497 1961587 2176538 2472689 2822984
11363B822984M68818O52444Q62159J155773J607733K123300K635812K986710L172637
$$ 2822984 3291802 3944246 4806405 5962178 7569911 9693211 12329023 15315733 18488370
11354A8488370L028552K249931O70525j239805k677627l163620k779025j959659
$$ 18488370 21516922 23766853 24437378 23197573 20519946 17356326 14577301 12617642
11346A2617642r78321r706R27999J967273K953640L661100L663037K727509J111584
$$ 12617642 11639321 11629615 12557614 14524887 17478527 21139627 24802664 27530173 28641757
11337B8641757k67921n02739J91020J027695J221352N00366j027152k751116l770018
$$ 28641757 28373836 27871097 28062117 29089812 30311164 30811530 29784378 27033262 23263244
11328B3263244l823940l201395k184788j068667k2637R87714K078635L043928
$$ 23263244 19439304 16237909 14053121 12984454 12961817 13949531 16028166 19072094
11320A9072094L141375J959057j03998k165922l462319l755603l305562k519140
$$ 19072094 22213469 24172526 24068528 21902606 18440287 14684684 11379122 8859982
11312H859982j806105j259145q93523o70893n12101m05748l25157l12564k96402
$$ 8859982 7053877 5794732 4901209 4230316 3718215 3312467 2987310 2674746 2378344
11303B378344k16371j66278j32344j03125r6432r2085p5978o3365k0744k0631
$$ 2378344 2161973 1995695 1863351 1760226 1663794 1571709 1495731 1432366 1411622 1390991
11293A390991k5602J0482J3520L272L315M6951O0157P8170P6025Q9316J63456
$$ 1390991 1365389 1375871 1389391 1392663 1395978 1442929 1503086 1581256 1657281 1746597 1910053
11282A910053K51489K92619L81627N48873P28376J010757J423648K040891K714053
$$ 1910053 2161542 2454161 2835788 3384661 4113037 5123794 6547442 8588333 11302386
11273A1302386L192714L320112K892228J712919j30029k056491l240248l446242
$$ 11302386 14495100 17815212 20707440 22420359 22290330 20233839 16993591 13547349
11265A3547349k992289k217522j454479q95705n38129k26259J9217K08136M13353
$$ 13547349 10555060 8337538 6883059 5987354 5449225 5222966 5242183 5450319 5863672
11256E863672P77596J218369J823946K622522L349665L411475K558823Q88386
$$ 5863672 6641268 7859637 9683583 12306105 15655770 19067245 21626068 22514454
11248B2514454j083500k676047l413434l298479k739181k061085j466183j017750
$$ 22514454 21430954 18754907 15341473 12042994 9303813 7242728 5776545 4758795
11240D758795p21807n81539m92860l69907l24519k70015k31185j69222j69033
$$ 4758795 4036988 3455449 2962589 2592682 2268163 1998148 1766963 1597741 1428708
11231A428708j78482j18066q2190n5030k7453n6540l9828p958n1653o0119k8781
$$ 1428708 1250226 1132160 1049970 994940 967487 910947 871119 863161 811508 751389 722608
11220G22608j6654J3448l1327o0920m667O022K3543R795k5102p310k0001l4316
$$ 722608 705954 719402 688075 627155 622488 628510 652053 661848 636746 629436 609435 575119
11208E75119j5844l882r599l1863l5364K9938J5967j8108j1412l779L9853K5757
$$ 575119 559275 555393 545794 513931 478567 508505 524472 506364 494952 491173 531026 556783
11196E56783J4424j6364P090N3505K6812j1527J3386K3844L240J7109J8970K865
$$ 556783 571207 554843 561933 615438 642250 630723 644109 667953 671193 688302 707272 710137
11184G10137J8349L2189M5199M7099N8220L9872M2432P8302J14851J05580R4526
$$ 710137 728486 760675 805874 852973 911193 951065 993497 1071799 1186650 1292230 1386756
11173A386756J15167J59971J91252J75064K34364K78562L43245M61122O00322
$$ 1386756 1501923 1661894 1853146 2028210 2262574 2541136 2884381 3345503 3945825
11164C945825P50577R39755J159525J380061J652222K165808L057184M379092
$$ 3945825 4696402 5636157 6795682 8175743 9827965 11993773 15050957 19430049
11156A9430049N927728O683534N640774K678165j127551m248831n782852n873405
$$ 19430049 25357777 32041311 37682085 40360250 39232699 34983868 29201016 23327611
11148B3327611n013037l826960k798541k050368j506485j190040r76719p68909
$$ 23327611 18314574 14487614 11689073 9638705 8132220 6942180 5965461 5196552
11140E196552o29418n39731m30793l33805k72877j97892j91871j48015j22933
$$ 5196552 4567134 4027403 3596610 3262805 2989928 2792036 2600165 2452150 2329217
11131B329217j01836r3410q3672p9294o6520m2724m9176r352L6424L1368K3808
$$ 2329217 2227381 2133971 2050299 1971005 1904485 1861761 1812585 1803233 1839657 1871025 1894833
11120A894833K4656N2727O3480L9279J8454J639K7654O0874P7057J03217R6098
$$ 1894833 1919489 1972216 2035696 2074975 2093429 2095068 2122722 2183596 2260653 2363870 2459968
11109B459968J28725J80769K43095L37808M27000N57428P71579R96941J239033
$$ 2459968 2588693 2769462 3012557 3350365 3777365 4334793 5106372 6103313 7342346
11100G342346J585245K028530K656984L602707M854262O085386O573721N606698
$$ 7342346 8927591 10956121 13613105 17215812 22070074 28155460 34729181 40335879
11092D0335879K780977r65951m062464n725411n937430n031794l659975k332688
$$ 40335879 43116856 42150905 38088441 32363030 26425600 21393806 17733831 15401143
11084A5401143j244247n51426j21086J23081K29137L91576O54663J065777J890327
$$ 15401143 14156896 13605470 13484384 13607465 13836602 14228178 14882841 15948618 17838945
11075A7838945L133785M639796N558298M885903K432172q85702l781322n443109
$$ 17838945 20972730 25612526 31170824 36056727 38488899 37603197 33821875 28378766
11067B8378766n682616m878694l727580k610775j816559j311810j007190q42305
$$ 28378766 22696150 17817456 14089876 11479101 9662542 8350732 7343542 6501237
11059F501237p45021o39803n23774m32617l97578l49848k98292k42206j82221
$$ 6501237 5756216 5116413 4592639 4160022 3762444 3412596 3114304 2872098 2689877
11050B689877j36037j31532j11107j18547p9109m2212K174k2691n71k5971m9646
$$ 2689877 2553840 2422308 2311201 2192654 2113545 2071333 2073507 2050816 2050245 2024274 1974628
11039A974628j792K1142l097k2718l8373j3792j7545K7541P2780J08394J39206
$$ 1974628 1972836 1993978 1990881 1968163 1929790 1915998 1898453 1925994 1998774 2107168 2246374
11028B246374J60709J93127K02898K54238L06226L83363M72626O09434P88956
$$ 2246374 2407083 2600210 2803108 3057346 3363572 3746935 4219561 4828995 5617951
11019E617951R61330J225563J585401K084247K882110M028442N236911N968888
$$ 5617951 6579281 7804844 9390245 11474492 14356602 18385044 23621955 29590843
11011B9590843N546680L449864J21290l025690n064287n734479n189947l992546
$$ 29590843 35137523 38587387 38708677 35682987 30618700 24884221 19694274 15701728
11003A5701728k760578j785154j147822q07360p43036q22058r63006r46215q89872
$$ 15701728 12941150 11155996 10008174 9200814 8457778 7635720 6672714 5726499 4836627
10994D836627p50225o12301m59852l50024l11279k66606j89654j80648j19341
$$ 4836627 4086402 3474101 3014249 2664225 2352946 2086340 1896686 1716038 1596697
10985A596697j00289r2154o1537r3476j23259p5653p8735q8054j3670l1273n1462
$$ 1596697 1496408 1404254 1342717 1249241 1125982 1050329 971594 883540 869870 838597 787135
10974G87135l5999k5544O635J8695o614k2233j0361j3746l8758k8485l4044l5893
$$ 787135 751136 725592 732227 750922 744308 722075 711714 697968 659210 630725 596681 560788
10962E60788n2733k9757N18k3736l1134J8430j6576p580L71k4877J5611O379j3665
$$ 560788 508055 478298 478816 455080 423946 442376 425800 418220 418591 393714 409325 415704 402039
10949D02039q207j8284M113p36j8891k316J2143J3543n983r738Q650J934L1220
$$ 402039 393832 375548 379661 378925 360034 357718 369861 383404 377421 367683 376333 378267 409487
10936D09487J6780m5581l2824J2790Q877p730m4475j652L20J1840J9741K1464
$$ 409487 426267 380686 347862 360652 369529 361799 317324 315672 315992 327832 347573 369037
10924C69037K1399K6090J2486k2255k3981k2717n0849k6933J9784N211j0936q332
$$ 369037 390436 416526 429012 406757 382776 360059 309210 282277 302061 307272 296336 288004
10912B88004K3661P487j7843j4707K8648K1011j2290j753l0816j4822M971Q521
$$ 288004 311665 319152 301309 286602 315250 336261 323971 322218 291402 276580 281551 290072
10900B90072M2182j810n73l7911l1477j5092J634n840j1409N986K4954J2937o746
$$ 290072 332254 330444 329871 291960 260483 245391 247025 241185 229776 235762 260716 273653 266907
10887B66907J131L9111K5155k2866k0711l0981k8409O63l884l6348N068l0021
$$ 266907 268038 307149 332304 309438 288727 257746 229337 230000 226116 189768 194836 164815
10875A64815j3153J7597J8059J2407R908K1534m708P249N707r809J7133j94j7499
$$ 164815 151662 169259 187318 199725 209633 231167 226459 233708 239415 229606 246739 246545 229046
10862B29046l8407r528N503l5610Q474J4875K2316j7689m4161j6504Q930q643
$$ 229046 190639 181111 186614 151004 159478 174353 196669 178980 134819 118315 127245 118602
10850A18602k427Q598L4531L424J1994J1694L1889o695l0870K2646L0926Q750
$$ 118602 116175 124773 159304 162728 174722 186416 218305 211610 180740 203386 234312 243062
10838B43062J1024l973j3775j5602k9212M7p223O656Q986K2231j8660l3255j3681
$$ 243062 254086 250113 236338 220736 191524 191571 184348 191004 199990 222221 203561 170306 156625
10825A56625M672K1887L0640M0853K9466j930K7431K9451P039l3606m6922l2037
$$ 156625 161297 183184 213824 254677 284143 282213 309644 339095 346134 312528 265606 233569
10813B33569k3393k2045p956r223O896j6048j6420l168j2509P75j3413j8583n476
$$ 233569 210176 188131 180175 170952 177848 161800 145380 142212 129703 130478 117065 98482 93006
10800I3006K0760J3325j2146l4745n882J2941J6781L068J3443m2698J457L2655
$$ 93006 113766 127091 114945 80200 74318 87259 104040 107108 120551 77853 79310 111965
10788A11965M967L005j2342K3489N627j0560j3098j0800P973n555L0028j3537
$$ 111965 116932 119937 107595 131084 136711 126151 113053 102253 110226 104671 134699 121162
10776A21162K2147K4793J0071J5426L1532J316l5661k4492q699k2358j910L1706
$$ 121162 143309 168102 178173 193599 225131 226447 190786 166294 157595 135237 133327 165033
10764A65033K793O929O005l111j1268J052K7817J2533K0572L0446L4572L5376
$$ 165033 167826 174755 180760 177649 166381 167433 195250 207783 228355 258801 293373 328749
10752C28749M5768N5626L9307J01977J36380K68750L79862L32619K02104L03006
$$ 328749 374517 430143 469450 571427 707807 976557 1356419 1689038 1891142 2194148
10742B194148L96782K00409j20679k03239j67933k51127l46765l40686l29268
$$ 2194148 2590930 2791339 2670660 2467421 2299488 2048361 1701596 1360910 1031642
10733A031642k45794j42511r1939n0655k6568k5044k722r04j5762o820m816R410
$$ 1031642 785848 643337 551398 500743 474175 449131 446409 445505 429743 422923 418107 427517
10721D27517K671k4190k9327m9712m8057n3952j8895l4281n434m139R72J1931
$$ 427517 430188 405998 376671 326959 278902 224950 206055 171774 166340 162201 163173 175104
10709A75104K2586k6480j0434L4308r906j7017k1782q079l3962p383J1021K9641
$$ 175104 197690 171210 160776 195084 185178 168161 146379 138300 104338 96955 107976 137617
10697A37617J8243J1567J1813J1700K8755l044j5446l64M430J0486R955j1810
$$ 137617 155860 167427 179240 190940 219695 216651 201205 200841 205271 215757 225712 213902
10685B13902J2594k296j2823j5438q831p420k0626n870K1541J1253Q389K0523
$$ 213902 226496 224200 211377 195939 187108 179688 159062 153192 174733 185986 194375 214898
10673B14898P623m448J5103L5276J8543K6315N3008Q7105Q1636K3181m534j7213
$$ 214898 222521 218073 233176 268452 286995 313310 366318 453423 535059 558240 553706 536493
10661E36493k7388m2480o0276n3820l2191K5880P443J1988K8654L2534J428k6017
$$ 536493 509105 466625 406349 352529 320338 346218 353661 365649 394303 426837 428265 402248
10649D02248K8832L0940j562l4962l887k168r452k2494k5429m2056j362j6988
$$ 402248 431080 462020 460458 425496 421609 419441 409989 387495 362066 320010 318648 301660
10637C01660j844j7152k4080j3422j3890j0421K957J0111p326j6066k1198K419
$$ 301660 299816 282664 258584 245162 231272 220851 223808 233919 226593 210527 189329 191748
10625A91748K2325L0390l1048j7340m484N96K3915k629K601K0704Q544l248R353
$$ 191748 214073 244463 213415 196075 191591 192187 216102 213473 216074 236778 245322 242074 251427
10612B51427L0750K560J4272K1311N185J8885n81J3011L7064N875M4257M5266
$$ 251427 282177 284737 299009 320320 325505 344390 343809 356820 393884 399759 444016 489282
10600D89282o085K1359K1776K3267K7421l442j0001j3998p582m2029k6643k918
$$ 489282 483197 504556 526332 549599 577020 573578 563577 549579 541997 499968 473325 470407
10588D70407j8159k4506o444l670n552J202J2808j59J587j9101k3604j7095k5849
$$ 470407 452248 427742 421298 417628 412076 413278 426086 425927 427514 408413 384809 367714 341865
10575C41865k0351k4289n3068P52J1584J4804r827k2714O503j6936j7644K444
$$ 341865 321514 297225 244157 244909 256493 271297 261470 238756 245259 228323 210679 213123
10563B13123J7171J3724L550r502k4658J6543j5137m875Q487p895j4067M38K1705
$$ 213123 230294 244018 247568 238066 213408 229951 214814 209939 218426 210531 196464 196902 218607
10550B18607j88m391O163j1319R099j1437k1280K4803L0738o761j6700k9883j6467
$$ 218607 218419 214028 220191 208872 217971 206534 185254 210057 240795 234034 217334 187451 170984
10537A70984n115o539j9424M3934N6654J5716j9313j9374N487j295k3409l155
$$ 170984 165869 159330 139906 183840 240494 256210 236897 217523 223010 221715 198306 195151
10525A95151J6585l7482j8911M9430N6129N5036J7626K7158L3727J1391q787J0704
$$ 195151 211736 174254 155343 204773 260902 315938 333564 360722 394449 405840 397053 407757
10513D07757M2459P640P496n177k1223q579j9470Q27P237Q700L037L808M3653
$$ 407757 450216 457856 465352 460175 438952 430373 410903 411730 418967 427667 430704 434512 478165
10500D78165Q2365J16482O1452n495k3783l2383l874k0092m0474p0825m9719k9326
$$ 478165 560530 677012 738464 732969 709186 676803 672929 652837 612363 541538 491819 462493
10488D62493k7417l3383m2467M790p137k8097L185r336k4330j9110r789M495k6092
$$ 462493 435076 401693 359226 364016 356879 328782 331967 322631 298301 279191 269402 273897 247805
10475B47805k0090j2086m8079j10220o0507J6717n2996q0976K8362R1495M4057
$$ 247805 227715 215629 167550 57330 -3177 13540 -39456 -120432 -92070 -575 43482
10464D3482m430Q9281J17225N1426L7728J1112r026n4K83n613j2818r175K8671
$$ 43482 39052 128333 245558 296984 334712 345824 336798 336744 337027 331414 318596 309421 338092
10451C38092K4476J3884j1220j389O882J7788J9644K5524R884k7651k6000o145
$$ 338092 362568 376452 365232 363843 370725 388513 408157 433681 443565 415914 389914 383769
10439C83769O546J6096L6250J1896j1412l305m74j5345p075k036o289j2635k1074
$$ 383769 390315 406411 442661 454557 443145 439840 439366 424021 416946 414910 408621 395986 374912
10426C74912J9255m818L72L0121K4535K9856K3184J4555J9785K5176K434k3203
$$ 374912 394167 389349 389721 419842 444377 474233 497417 511972 531757 556933 559367 536164
10414E36164M1058L7598j4601K0264M0469M4964O3779R910J9623M0282L5054R501
$$ 536164 577222 614820 600219 620483 660952 705916 769695 779605 799228 839510 874564 884065
10402H84065j2481j2916O479K9080K8107J4797N7994J04153R5479J17461J40562
$$ 884065 871584 858668 865147 894227 922334 937131 995125 1099278 1194757 1312218 1452780
10391A452780J55999J06367P8413N7101R743j3383l2713o156L11J7458L2385M1808
$$ 1452780 1608779 1715146 1793559 1850660 1860403 1847020 1814307 1808151 1808462 1825920 1858305 1900113
10379A900113P0908R5474R9242J41717J68099J62206J98218K46284K53546L11328
$$ 1900113 1971021 2066495 2165737 2307454 2475553 2637759 2835977 3082261 3335807 3647135
10369C647135L81308M67918N94988P70302Q66340Q61924R25218J161985J329405
$$ 3647135 4028443 4496361 5091349 5861651 6727991 7589915 8515133 9677118 11006523
10360A1006523J248383J270431J416677J687754K101834K628719L289287M428301
$$ 11006523 12254906 13525337 14942014 16629768 18731602 21360321 24649608 29077909
10352B9077909O441073R376689J3367246J9391230L0195246M9884764P1862455
$$ 29077909 35518982 44895671 58262917 77654147 107849393 157734157 229596612
10345B29596612O2624890L7461533N1395821O9793253L4397984k6068364l6446794
$$ 229596612 292221502 329683035 381078856 450872109 485270093 459201729 422754935
10338D22754935k9681989m4929218o7410643o2453072n4609986m5046761l0566341
$$ 422754935 393072946 348143728 280733085 218280013 163670027 118623266 88056925
10331H8056925j9469593j2982884r090796o794071n420329m300011l403692k957638
$$ 88056925 68587332 55604448 46513652 39719581 34299252 29999241 26595549 23637911
10323B3637911k634242k099866j703332j651207j613229j378464j187014j162141
$$ 23637911 21003669 18903803 17200471 15549264 13936035 12557571 11370557 10208416
10315A0208416j072472r15356q05671p04813n75954m61506l80006l48413l01267
$$ 10208416 9135944 8220588 7414917 6710104 6134150 5672644 5292638 4944225 4642958
10306D642958k50898k24257k33222k44954k40368k07538k08423k09601j64207
$$ 4642958 4392060 4167803 3934581 3689627 3449259 3241721 3033298 2823697 2659490
10297B659490j55640j76854j38006q7285q6199q7860j02652m5939j1690j7107
$$ 2659490 2503850 2326996 2188990 2101705 2015506 1927646 1824994 1779055 1767365 1750258
10287A750258l4672m7650m5327o1534o3037l8250o3519p2907l8756k8537r084
$$ 1750258 1715586 1667936 1622609 1561075 1498038 1459788 1396269 1323362 1284606 1256069 1246985
10276A246985l2358n7569k0481m400l2719q911j4245j2992m345P705j762k6472
$$ 1246985 1214627 1157058 1136577 1132177 1099458 1090547 1076302 1063310 1058965 1066670 1064908 1038436
10264A038436l5886l6095p089j9493k6109j427N809J3469k1072l3405m3367k9845
$$ 1038436 1002550 966455 959366 939873 913764 912337 918146 931615 910543 877138 833771 803926
10252H03926o391j3806j6738m3589j4086K3140R708j3096k2756O706k876j8745
$$ 803926 797535 783729 766991 723402 709316 732456 742164 729068 706312 713018 710142 691397
10240F91397N760m290J4465O709P880m3806l2714p778l293k3254k0967l3523J1997
$$ 691397 697157 692867 707332 714041 721921 678115 645401 637623 634330 611076 590109 556586 568583
10227E68583j698n17r653J0512K8383r728k655N3480N8704K8528M3804R1203J21785
$$ 568583 566885 566368 556715 567227 595610 585882 583227 636707 695411 723939 767743 858946 980731
10214I80731M1955j0675R08l456l3129m0729n4831l8236m4137l2260j8697m7846
$$ 980731 1022686 1012011 1012919 1009463 976334 935605 880774 842538 798401 766141 747444 699598
10202F99598n8696m7280j9211k5113l4554m1527k9617m0316l2602J5375o543j2588
$$ 699598 640902 593622 574411 549298 514744 473217 443600 403284 370682 386057 379514 366926
10190C66926Q833J4545J8001L6697K1941J7838L509K0572L0883M1213Q4m4854
$$ 366926 375759 390304 408305 445002 466943 484781 488290 508862 539745 580958 581042 536188
10178E36188m6005k5388L386j3411l59m301J868P536j4483j1196J4064K6151L578
$$ 536188 490183 464795 468181 454770 454411 450110 451978 459514 445031 433835 447899 474050 477628
10165D77628M3247L6337j788o629N6641K1696o500j5310R330K1562l9049m3507
$$ 477628 520875 557212 555424 548795 605436 627132 620632 605322 614652 636214 597165 553658
10153E53658K909m53J751K1287j5927p958n787K2173K3044J2054Q473J4923M810
$$ 553658 556567 556114 557865 579152 563225 555267 549480 571653 594697 606751 615224 630147 634957
10140F34957j1917j5904n7114k9419j5718j9476j9907Q752K511J4509j887k1343
$$ 634957 623040 607136 550022 520603 504885 485409 465502 474254 476765 491274 489387 468044
10128D68044n005k627q464O198L4856L1349k7634k2610J4222K7781l742l691j5095
$$ 468044 463039 460412 451948 458146 493002 524351 496717 474107 488329 516110 512368 508677 493582
10115D93582J2595J4025K0553j4307k8929j7034N465M1078K9747K6964J8954J6975
$$ 493582 506177 520202 540755 526448 497519 480485 485950 527028 556775 583739 602693 619668
10103F19668N76L332m595L391j2484R73K5530R842q947k1896k7032j3764n022
$$ 619668 620244 623576 618981 622372 609888 610861 636391 646233 637286 615390 588358 574594 569572
10090E69572k2638j8383k749J8955K3168m4363m0555J2862K0672J3268Q853J0430
$$ 569572 546934 528551 525802 544757 567925 523562 483007 495869 516541 529809 538662 549092
10078E49092J6180j0498r725j0935R932O980m149k1204K963K8170J2665J1550
$$ 549092 565272 554774 545049 534114 544046 551026 546877 525673 528636 556806 569471 581021
10066E81021n521q671J8275j868k8059p365J4948J3870l656j5158K0714M3687
$$ 581021 575500 566829 585104 583236 555177 547812 562760 576630 572974 557816 578530 622217
10054F22217J718j5408k9045k348J2714l177j5755j2165K9599K5779M119N384
$$ 622217 623935 608527 579482 577134 589848 586671 570916 558751 588350 614129 618248 623632
10042F23632j4544l0750l2573k7292K8926M6236l2846o0812k7735j7191j9196
$$ 623632 609088 578338 545765 518473 547399 593635 560789 499977 472242 455051 435855
10031D35855j4021J6917K6103j85L5464J7908K4314J9348L7976J7645O721N229
$$ 435855 421834 438751 464854 464669 500133 518041 542355 561703 599679 617324 624045 629274
10019F29274J3924J1999J035j0004J8043J3383j7361O771L1625Q122j2620n575
$$ 629274 643198 655197 656232 646228 664271 677654 660293 667064 698689 706811 694191 688616
10007F88616l5541j1850M6296K1196K0500J0045k017K1810K9678L1699M42J8314
$$ 688616 653075 641225 687521 708717 729217 739262 737245 759055 788733 820432 820874 839188
9995H39188M35K5056N5312p027j3924J6000J0776L0568J9346P277j82K763O727
$$ 839188 839623 864679 919991 912964 899040 915040 925816 956384 975730 983007 982825 985588 992315
9982I92315M3495K3102J3658K0252M707L5220M9647K2869n889o183J030J9919
$$ 992315 1035810 1058912 1072570 1092822 1097529 1132749 1182396 1205265 1199376 1193193 1194223 1214142
9970A214142J5897J1016j1086P572L1929P030m124J5483L8839J4543K8008K1002
$$ 1214142 1230039 1241055 1229969 1237541 1269470 1276500 1272376 1287859 1326698 1341241 1369249 1390251
9958A390251o61L5261J8475J4838P98K0195M2408J6970J9733N5132N9082K8124
$$ 1390251 1389590 1424851 1443326 1458164 1458962 1479157 1521565 1538535 1558268 1613400 1672482 1700606
9946A700606M3082N5911J09304J47369K09244L18138M02760K62517K29867L49484
$$ 1700606 1743688 1799599 1908903 2056272 2265516 2583654 2986414 3248931 3478798 3828282
9936C828282L12260L489k26218j95362j93530l09249l58570k95053k59606k03213
$$ 3828282 4140542 4144031 3917813 3722451 3528921 3219672 2861102 2566049 2306443 2103230
9926B103230j32672p5921j9114j6212R265O3917J54049K83997L79589K27607p9595
$$ 2103230 1970558 1894637 1875523 1859311 1868576 1932493 2086542 2370539 2750128 2977735 2898140
9915B898140k74257l16307k73751k05167j34141j02879j00890p3580m1068R115
$$ 2898140 2623883 2307576 2033825 1828658 1694517 1591638 1490748 1417168 1376100 1385215
9905A385215l1186k4509k1717K178N0377J13994L5838o8398o9055n0996m2156
$$ 1385215 1354029 1329520 1307803 1309981 1360358 1474352 1510190 1441792 1372737 1321741 1279585
9894A279585n2425k0561j5217k9125j8859j6070j8046j6028o30l8163m2033L411
$$ 1279585 1227160 1206599 1191382 1162257 1143398 1127328 1109282 1093254 1092624 1054461 1012428 1015839
9882A015839r073j3064K621P723k1010k4948J0233K8903K4921L8257J3380L1756
$$ 1015839 1006766 993702 996323 1004046 983036 958088 968321 997224 1022145 1060402 1073782 1105538
9870A105538P8913J16257J37152J24765K06240L16333M02616M04861K64604K8095
$$ 1105538 1184451 1300708 1437860 1562625 1768865 2085198 2487814 2892675 3157279 3185374
9860C185374j87840l07817l35432l59829k57228j52122p7565m0153l0512j8770
$$ 3185374 2997534 2689717 2354285 1994456 1737228 1585106 1507541 1467388 1436876 1418106
9850A418106Q442M8503O1027N0121R3922J77685L03707M02432N47971P37529R70613
$$ 1418106 1426548 1475051 1536078 1586199 1680121 1857806 2161513 2563945 3111916 3849445 4820058
9839D820058J063075Q75391L30718l33189p70356r01894q47446o40037m35375
$$ 4820058 5883133 6758524 7089242 6756053 5985697 5083803 4236357 3596320 3160945
9830C160945k41926j03086K0629J56717L03693M74252N56481N44720M77685L31884
$$ 3160945 2919019 2815933 2836562 2993279 3296972 3771224 4327705 4872425 5350110 5681994
9820E681994J84431l7169j96981j55689q926J23446P1568o2050k39773l78553
$$ 5681994 5866425 5829256 5632275 5476586 5467660 5591106 5662674 5600624 5360851 4982298
9810D982298l66788l24871k19406m0802J10892K90437N44349Q55611J259255J623428
$$ 4982298 4615510 4290639 4071233 4030431 4141323 4431760 4976109 5831720 7090975 8714403
9800H714403J833614J736941J381202O94701j72069r97106j578558j758246j619651
$$ 8714403 10548017 12284958 13666160 14360861 14188792 13191686 11613128 9854882 8235231
9791H235231j307416r53812n60798k80315o6627O8914K68017M23786O44407Q33022
$$ 8235231 6927815 5974003 5413205 5132890 5066263 5135177 5403194 5826980 6471387 7304409
9781G304409R41332J043965J289231J632858K010069K123706J865712J194330
$$ 7304409 8245741 9289706 10578937 12211795 14221864 16345570 18211282 19405612
9773A9405612K43861p32943j417553j704779j667656j414370j112637p44388l21967
$$ 19405612 19649473 18916530 17498977 15794198 14126542 12712172 11599535 10855147 10533180
9764A0533180R0101N62707J014627J342240J597862J758535J670302J267432O55389
$$ 10533180 10623281 11185988 12200615 13542855 15140717 16899252 18569554 19836986 20492375
9755B0492375K22251R5824K86966N82253P73702O83702L20975j16072l91599m84990
$$ 20492375 20714626 20810450 21097416 21679669 22453371 23137073 23458048 23341976 22950377 22465387
9745B2465387l59002q3308L28205Q28734J352444J821812K136236K068838J714493
$$ 22465387 22106385 22023077 22351282 23180016 24532460 26354272 28490508 30559346 32273839
9736C2273839J234573O84146k18419j187244j783812j855966j446049p24532m0954
$$ 32273839 33508412 34192558 33974139 32786895 31003083 29147117 27701068 26976536 26935582
9727B6935582L82456O34583P51629P73820P25390N40429K06618j80787n48945
$$ 26935582 27318038 27952621 28704250 29478070 30203460 30743889 30950507 30769720 30220775
9718C0220775p14258p18666n11271j76379J88351M24563N84249N01451j53405
$$ 30220775 29506517 28787851 28276580 28100201 28288552 28713115 29297364 29798815 29645410
9709B9645410j022447j541521j584436j322380r72879p87578p64871o86167n29960
$$ 29645410 28622963 27081442 25497006 24174626 23201747 22414169 21649298 20963131 20433171
9700B0433171k47333J10909M37359N15097M00018J64792L6575R9235L53822O72412
$$ 20433171 20185838 20296747 20734106 21249203 21649221 21814013 21850588 21949823 22303645 22976057
9690B2976057R31285J151791J140160N11332n74503j598137k153934k132062j761239
$$ 22976057 23907342 25059133 26199293 26710625 26136122 24537985 22384051 20251989 18490750
9681A8490750j346144q67800l90167p1700K32829M99444O74374O69889O77556
$$ 18490750 17144606 16276806 15886639 15814939 16047768 16547212 17221586 17891475 18569031
9672A8569031P20181Q70179J146502J461615J636059J580149J404977J181799
$$ 18569031 19289212 20159391 21305893 22767508 24403567 25983716 27388693 28570492
9664B8570492O49210k64788j097776j452209j401006j192543j005682r53233r77190
$$ 28570492 29219702 28954914 27857138 26404929 25003923 23811380 22805698 21852465 20875275
9655B0875275r09737o79691l87623p6957K42053M15992K66906p9720l39992k54337
$$ 20875275 19965538 19285847 18898224 18821267 19063320 19479312 19746218 19666498 19326506 19072169
9645A9072169N7434L82390M90251L88950J45066m0535j73672k35048j94526o3835
$$ 19072169 19129603 19511993 20002244 20391194 20536260 20495725 20322053 20087005 19892479 19828644
9635A9828644n288k0380j59830l74591n21972m55554k61141K4651K33350J57709
$$ 19828644 19823356 19802976 19643146 19268555 18746583 18291029 18029888 18054539 18287889 18445598
9625A8445598k90694r43476j478623j683084j531119j260682r58675p49065n72692
$$ 18445598 18154904 17211428 15732805 14049721 12518602 11257920 10299245 9550180 8977488
9616H977488l75847k17051j17811O9263J47674J39940O0025r5781k07978l00610
$$ 8977488 8601641 8384590 8266779 8336042 8483716 8623656 8683681 8587900 8379922 8079312
9606H079312k88976j62480n96J28826M1982k20703n21941p87658q68269q38120
$$ 8079312 7790336 7627856 7627260 7756086 7798068 7577365 7055424 6267766 5399497 4561377
9596D561377p18578n59427m30959l34188k37339j60880j34127j29300j28153j21423
$$ 4561377 3842799 3283372 2852413 2518225 2280886 2120006 1985879 1856579 1728426 1607003
9586A607003j42394q5353o1379l1948l6831o1257n9461m3065k2170j2333j5441
$$ 1607003 1464609 1379256 1317877 1285929 1249098 1187841 1128380 1085315 1063145 1050812 1035371
9575A035371k9937n6286j6239L4844n28j0742j1001r347R685K39J5184J2112j9214
$$ 1035371 1005434 949148 932909 967753 967225 956483 945482 936135 945820 946059 961243 973355 954141
9562I54141j8599n046n875l684l870L1022L1119l1177j9354L8947N0911L0030
$$ 954141 935542 930496 924621 920937 917067 948089 979208 948031 928677 967624 1018535 1048565
9550A048565K1575N2192Q0123J00673J27430J82773K25478L14520M19094N74783
$$ 1048565 1070140 1122332 1202455 1303128 1430558 1613331 1838809 2153329 2572423 3147206
9540C147206O96792P18543N45100K75079p2144l95959n55102n67056m35859l48016
$$ 3147206 3843998 4562541 5107641 5382720 5310576 4914617 4359515 3792459 3356600 3008584
9530C008584k37716j53087n8309J1895R2197J42393K05018L15276M46363O43727
$$ 3008584 2770868 2617781 2559472 2571367 2663564 2805957 3010975 3326251 3772614 4416341
9520D416341R06691J119912J249052J217939J198043J107785R81017P75975L71267
$$ 4416341 5323032 6442944 7691996 8909935 10107978 11215763 12196780 12972755 13344022
9511A3344022j87370p01795j077381j251705j282830j144512r21503o57815m44280
$$ 13344022 13156652 12454857 11377476 10125771 8842941 7698429 6776926 6119111 5674831
9502E674831k99999j54165o570J42597L42083N75301Q75861J167965J459798J681996
$$ 5674831 5374832 5220667 5214097 5356694 5698777 6274078 7149939 8317904 9777702 11459698
9492A1459698J747190J536131J162631P46864M96208J77604k85282q63482j385537
$$ 11459698 13206888 14743019 15905650 16652514 17148722 17326326 17041044 16177562 14792025
9483A4792025j683271j772354j636298j311647j018729p10585m92777l28125k08377
$$ 14792025 13108754 11336400 9700102 8388455 7369726 6659141 6166364 5838239 5629862
9474E629862q9316L1893K11237M02044O65454R33952J237336J354097J286192
$$ 5629862 5540546 5572439 5783676 6185720 6851174 7785126 9022462 10376559 11662751
9465A1662751R40422M62292M8203k40712m73810o58083p36900o76839l88097J1819
$$ 11662751 12603173 13065465 13113668 12872956 12399146 11741063 11004163 10327324 9939227 9951046
9455I951046L91244N76940M34365j6735n42311r00562r92826r47286p16818m10089
$$ 9951046 10342290 10919230 11353595 11336860 10794549 9893987 8901161 7953875 7237057 6826968
9445F826968k01154o305J98750K98519M43504M61343L44582K81162L49114O72404
$$ 6826968 6625814 6619509 6818259 7116778 7560282 8021625 8366207 8647369 8996483 9668887
9435I668887J111645J558096J928358K074664K052862J966776J852806J495315
$$ 9668887 10780532 12338628 14266986 16341650 18394512 20361288 22214094 23709409
9427B3709409P29484m11369j545896k385717k685348k529925k137392j660427
$$ 23709409 24438893 24027524 22481628 20095911 17410563 14880638 12743246 11082819
9419A1082819j205864q04438m10318j57553R9719M14501P50426J217532J801766
$$ 11082819 9876955 9072517 8662199 8504646 8604365 9018866 9769292 10986824 12788590
9410A2788590K390043K933588L201150L017378K478746J807704J199232O43301
$$ 12788590 15178633 18112221 21313371 24330749 26809495 28617199 29816431 30459732
9402C0459732q0954j133394k255500l053459l341930l180530k724958k131264
$$ 30459732 30378778 29245384 26989884 23936425 20594495 17413965 14689007 12557743
9394A2557743j552257j079355o73680m08618j65767R4043M14065P65824J183505
$$ 12557743 11005486 9926131 9252451 8843833 8678066 8772109 9186174 9951998 11135503
9385A1135503J713727K218327K449193K209255J448750L47211o72290j346629
$$ 11135503 12849230 15067557 17516750 19726005 21174755 21521966 20849676 19503047
9377A9503047j613454j737012j824962j863061j796716j589828j325844j040951
$$ 19503047 17889593 16152581 14327619 12464558 10667842 9078014 7752170 6711219
9369F711219p86386n85088m70727l05350j47421l8632Q1543J86488L15602M41016
$$ 6711219 5924833 5339745 4869018 4563668 4416247 4377615 4459158 4645646 4961248 5402264
9359E402264N29696N31919L96181K5853l82983p12383q30847p84950o90760n55842
$$ 5402264 5931960 6463879 6860060 6885913 6502930 5790547 4959700 4174750 3483990 2928148
9349B928148m08689k94899k24180j87298j05558p2707q0233n8620o1851o4980
$$ 2928148 2519459 2224560 2000380 1813082 1707524 1634817 1554584 1495964 1434113 1369133
9339A369133p5555m5849n4298m7551l3926m0136p466q749j3240k4997m8018k6151
$$ 1369133 1293578 1247729 1193431 1145880 1111954 1071818 1064352 1055603 1042363 1017366 969348 943197
9327I43197p886n7345n0730K417j6322p801P351l418m396p274k0209k1395j4350
$$ 943197 935311 877966 827236 829653 813331 805530 812881 809463 805067 797793 777584 756189 741839
9314G41839j0971J7555N699m2397l1082N242K1258K3164r60k3760k3646k2863
$$ 741839 730868 748423 754122 711725 680643 685885 707143 730307 729347 705587 681941 659078
9302F59078K9467K8709J2826N366j4971l832L776K6816K4363J0498n59m913Q443
$$ 659078 688545 717254 730080 735446 720475 716643 720419 747235 771598 782096 781537 776624 785067
9289G85067M2220J8621K041j5147K2903K0382L4713Q2817J07851R3606J06854
$$ 785067 827287 845908 847949 832802 855705 876087 910800 993617 1101468 1195074 1301928
9278A301928J18325J69669K54397L71625M76837O76595Q91413J153490J339595
$$ 1301928 1420253 1589922 1844319 2215944 2692781 3369376 4260789 5414279 6753874
9269F753874R44110J11260n93334j000240j062232r26666o89200m76851l20302
$$ 6753874 7697984 7809244 7215910 6215670 5153438 4226772 3537572 3060721 2740419
9260B740419k28068j44620j14261m8486J8213O0359J04008K05231K79770L77304
$$ 2740419 2512351 2367731 2253470 2204984 2223197 2283556 2387564 2592795 2872565 3249869
9250C249869N32896P59516J066247J492961J880531J857175J380670O25510m41573
$$ 3249869 3782765 4542281 5608528 7101489 8982020 10839195 12219865 12845375 12403802
9241A2403802j396719j771900j780549j487370j092472p69013n74734m07378k74759
$$ 12403802 11007083 9235183 7454634 5967264 4874792 4105779 3531045 3123667 2848908
9232B848908j96125j67912q7309o3210o6089M2972J34135J94460K48257L88406
$$ 2848908 2652783 2484871 2397562 2334352 2268263 2311235 2445370 2639830 2888087 3276493
9222C276493N84111Q82660J193494J151178M11334m32170q54293r80858q85126
$$ 3276493 3860604 4743264 5936758 7087936 7499270 7067100 6212807 5231949 4346823
9213D346823n98985l57180j78940m3348J7609R5604J99546K74469M58735P34745
$$ 4346823 3747838 3390658 3211718 3168370 3185979 3281583 3481129 3755598 4214333 4949078
9203D949078J103777J488935J873244J951105J635992R18645o7208r55854j416146
$$ 4949078 6052855 7541790 9415034 11366139 13002131 13920776 13853568 12897714 11481568
9194A1481568j503807j314736r81063o86503l82084j16009R9850L35085O21065
$$ 11481568 9977761 8663025 7681962 6995459 6613375 6497366 6597216 6932301 7553366
9185G553366P52830N64884K60770J10724K19473N60170J120668J820947K474492
$$ 7553366 8306196 8871080 9131850 9242574 9462047 10022217 11142885 12963832 15438324
9176A5438324K695198K349436J755722Q71171j47354j121373k090807k577622
$$ 15438324 18133522 20482958 22238680 23109851 22962497 21841124 19750317 17172695
9168A7172695k521113k131248j596885j085103o00366j70819J32510K38694K21566
$$ 17172695 14651582 12520334 10923449 9838346 9237980 9067161 9199671 9438365 9659931
9159I659931K32058R8652k03658l70347k99727n1609L26754Q01823J286794J441783
$$ 9659931 9891989 9990641 9786983 9416636 9116909 9065300 9392054 10193877 11480671 12922454
9149A2922454J001929K69557p07246j549238j854439j699987j337688r60283o04801
$$ 12922454 13924383 14193940 13486694 11937456 10083017 8383030 7045342 6085059 5480258
9140E480258l70533j58764L4954K07871L66959M05801K61533N9537N7433K83742
$$ 5480258 5109725 4950961 4985915 5193786 5560745 5966546 6228079 6287616 6345049 6628791
9130F628791O90788J032494R97718L41902l19231p19076r07042q12742n73184
$$ 6628791 7319579 8352073 9349791 9691693 9372462 8653386 7746344 6933602 6360418
9121F360418l39890k3127K55069N21419Q62372J190754J236028J089977P85670
$$ 6360418 6020528 5997401 6252470 6773889 7636261 8827015 10063043 11153020 11938690
9112A1938690J67636m01463n49601l74285k8988M59728R16514J096747Q53166
$$ 11938690 12106326 11704863 11155262 10780977 10751989 11211717 12128231 13224978 14078144
9103A4078144M59319K25959k30525q15651j076154j022875q48378m50535J6493
$$ 14078144 14537463 14763422 14532897 13717246 12641092 11618217 10769839 10319304 10335797
9094A0335797M07453O85715Q74953R89299J015545P45731L51600P5611m06063
$$ 10335797 10743250 11428965 12303918 13293217 14308762 15054493 15406093 15481704 15075641
9085A5075641r93003j165121j063983p76887l44217O9773K43121k9757o25591
$$ 15075641 14082638 12917517 11853534 11076647 10732430 10802203 11045324 11015567 10389976
9076A0389976j038969j146311j033343q20117n21675k30114J0138J93452L19516
$$ 10389976 9351007 8204696 7171353 6351236 5829561 5599447 5609585 5803037 6122553
9067F122553M53629N28504M83084L25528j17765o14743r17357r72896r11623p25791
$$ 6122553 6576182 7104686 7587770 7913298 7795533 7180790 6263433 5290537 4378914 3653123
9057C653123m94242l54050k38432j52717r9296n7619L4818Q3793J59482K71186
$$ 3653123 3158881 2804831 2566399 2413682 2314386 2256767 2291585 2375378 2534860 2806046
9047B806046L80670O38139R42438J140046P64863r452n46336p70029q19033o82723
$$ 2806046 3186716 3824855 4767293 5907339 6672202 6662750 6116414 5346385 4527352 3844629
9037C844629n37654l91935k64916j48724n5435k3643M1844J57401K37786L05715
$$ 3844629 3306975 2915040 2650124 2501400 2445965 2422322 2464166 2621567 2859353 3165068
9027C165068L92978M86964O35054P25222P70967P74846P15822N39556L23778K26467
$$ 3165068 3558046 4045010 4680064 5405286 6176253 6951099 7666921 8206477 8530255 8756722
9017H756722J3029m46479q58406j019123r83392q61422o77049m56924k73419k00293
$$ 8756722 8769751 8323272 7464866 6445743 5462351 4600929 3923880 3466956 3193537 2993244
9007B993244j41623r1573l1696L9422J31185K14209K91526L93453M74724N08658
$$ 2993244 2851621 2760048 2728352 2767774 2898959 3113168 3404694 3798147 4272871 4781529
8997D781529M82270L26960J26575k01739n87582p44918p28485o37189n12786l68066
$$ 4781529 5263799 5590759 5717334 5515595 4928013 4183095 3454610 2817421 2304635 1936569
8987A936569k61071j78148j35633q8723n8012n6876n0167q9179o6839m3718l9233
$$ 1936569 1675498 1497350 1361717 1272994 1214982 1158106 1107939 1018760 951921 908203 868970
8976H68970k4191j0105m1642k3542O819r264j6140l1657o208N307j0935j8838
$$ 868970 844779 834674 793032 769490 776309 767045 750905 719248 713040 718347 707412 688574
8964F88574N895L3410L4199J6983L4439N6088N7544N2486M8948O5012O2699P7343
$$ 688574 694469 727879 762078 779061 813500 869588 927132 979618 1028566 1093578 1156277 1233620
8952A233620J09587J37458J60121J86561K38974K76235L42283M25328M71793N91517
$$ 1233620 1343207 1480665 1640786 1827347 2066321 2342556 2684839 3110167 3581960 4173477
8942D173477P73753J026959J260985J383736J320809R81428M24741k20253p16360
$$ 4173477 4947230 5974189 7235174 8618910 9939719 10921147 11345888 11125635 10409275
8933A0409275j022550j159552j063998q51206o04911l93232k38371j55464j34290
$$ 10409275 9386725 8227173 7163175 6311969 5707058 5313826 5075455 4919991 4785701
8924D785701r2648n3254q958P0746J79387K64330M48989O84228Q30650R36361
$$ 4785701 4693053 4639799 4630841 4701587 4880974 5145304 5594293 6278521 7109171 8045532
8914H045532R30901P02784L84042q7360n17948q18706q51716o97961m26292k23722
$$ 8045532 8976433 9679217 10063259 9975899 9457951 8639245 7787529 7089568 6663276 6439554
8904F439554j69396k05104k77770l92383m43812m48922l88048l66490l13349k49649
$$ 6439554 6270158 6065054 5787284 5394901 4951089 4502167 4114119 3747629 3434280 3184631
8894C184631k16576j97703j55336j47670j12065p2901o1120m1819J3034P437L8739
$$ 3184631 2968055 2770352 2615016 2467346 2355281 2282380 2221260 2179441 2192475 2199912 2238651
8883B238651J11891Q1297J14056J67989K00598K64847L08835M22471N40663P50891
$$ 2238651 2350542 2431839 2545895 2713884 2914482 3179329 3488164 3910635 4451298 5202189
8873E202189J018070J345186J804852K301438K687433K659827K094845J065113
$$ 5202189 6220259 7565445 9370297 11671735 14359168 17018995 19113840 20178953
8865B0178953j64366j271302j906951k003600j763713j279425o36251O5868O97786
$$ 20178953 20014587 18743285 16836334 14832734 13069021 11789596 11153345 11219213 11916999
8856A1916999J297624J714722J771818J409470O19710l28024j095652j418081
$$ 11916999 13214623 14929345 16701163 18110633 18730343 18402319 17306667 15888586
8848A5888586j275742p33145N3595Q87066J587725J886673J570235O77229m47381
$$ 15888586 14612844 13879699 13933294 14820360 16408085 18294758 19864993 20542222 20094841
8839B0094841j441579k001692j964666j511626r47401m40868o8980K64098O29639
$$ 20094841 18653262 16651570 14686904 13175278 12227877 11787009 11718029 11982127 12611766
8830A2611766R31495J122800R73777L65683m93033j312025j816993j951369j781028
$$ 12611766 13543261 14666061 15639838 16005521 15512488 14200463 12383470 10432101 8651073
8821H651073j426018j058021p57183n65786m11745l22917k74196j84969j58779
$$ 8651073 7225055 6167034 5409851 4844065 4432320 4109403 3835207 3650238 3491459
8812C491459j03538n4362k1328K6273M628L8974P7749R5106J17520J97565K81123
$$ 3491459 3387921 3333559 3312231 3338504 3343132 3382106 3459855 3554961 3672481 3870046 4151169
8801D151169M42040O56434R15673J197040J304814J193484Q32325K50624l25026
$$ 4151169 4593209 5249643 6165316 7362356 8667170 9860654 10692979 10943603 10618577
8792A0618577p29113p87006o33474l13803J15614N23444R73564J500671J910033
$$ 10618577 9889464 9102458 8468984 8155181 8270795 8794239 9767803 11268474 13178507
8783A3178507K093589J878092J174585J14098r50297j678557j893256j640912
$$ 13178507 15272096 17150188 18324773 18438871 17488574 15810017 13916761 12275849
8775A2275849r86964k72295K98883O58004O42021L33254j91048o77097r00171
$$ 12275849 11288885 11016590 11315473 11973477 12615498 12948752 12757704 12080607 11180436
8766A1180436r25467p71832m93973j82818K17305O72981J054662J315070J383384
$$ 11180436 10254969 9483137 8989164 8806346 9023651 9696632 10751294 12066364 13449748
8757A3449748J095344M55020l27226j043554j492990j670217j617225j444816
$$ 13449748 14545092 15000112 14672886 13629332 12136342 10466125 8848900 7404084
8749G404084j213462r95482p76941n69259m18304l55509k75402k01229j96924
$$ 7404084 6190622 5195140 4418199 3848940 3430636 3075127 2799725 2598496 2401572
8740B401572j96011j71098j03156q7385o6167j7795k1154j3415o199j6989m339
$$ 2401572 2205561 2034463 1931307 1843922 1777755 1759960 1738806 1725391 1719192 1702203 1697864
8729A697864k0879q369j627J0348K9557J00039J57400J61349J19711R2870J30900
$$ 1697864 1676985 1668616 1666989 1677337 1706894 1806933 1964333 2125682 2245393 2338263 2469163
8718B469163J79163K55406L38127M20373N01522N43506M80567L43515J50412j22129
$$ 2469163 2648326 2903732 3241859 3662232 4163754 4707260 5187827 5531342 5681754 5559625
8708E559625l71979n24321n72399m90374m27903l26875j79343j11082q1495k0388
$$ 5559625 5187646 4663325 4090926 3600552 3172649 2845774 2666431 2555349 2473854 2453466
8698B453466J2897Q0877J50036K38384K81416L27268L48712L35114K76849J92063
$$ 2453466 2466363 2547240 2697276 2935660 3217076 3544344 3893056 4228170 4505019 4697082
8688D697082R9427k7668j40674k43727l57348m49845m50980m37304l92215l16806
$$ 4697082 4796509 4768841 4628167 4384440 4027092 3577247 3126267 2688963 2296748 1979942
8678A979942k40690j80286j74724j50069j08671p1053q5824n0844l2258l1259
$$ 1979942 1739252 1558966 1384242 1234173 1125502 1054449 968625 917781 885523 854264
8668H54264m840j0672l5189k9447n7063l3742j4328l1177m6892Q300N624O023
$$ 854264 849424 838752 803563 774116 717053 683311 668983 637806 590914 599214 604838 610861
8656F10861Q01K1023K213m3826o1670k9785l129K9385P897j1004j0984P966j447
$$ 610861 611662 632685 634898 591072 529402 499617 496488 525873 533770 522766 511782 519748 518301
8643E18301k4354O272K5956J1995Q716K4408M9445j6141m5709m7018l2824l8636
$$ 518301 493947 500219 526175 538170 546886 571294 620739 604598 558889 511871 479047 440411
8631D40411K924J7074j8129p827o62K099J5594j0114p74l60k2704j3169K7018
$$ 440411 443335 460409 442280 434453 433791 435890 451484 441370 440596 440236 417532 404363 431381
8618D31381m169N831J44J8919L9659J3350L5338n662L1542K9091K7699K843p149
$$ 431381 427212 433043 433187 452106 491765 505115 540453 534791 566333 595424 623123 625966 618817
8605F18817m8465l8015J7149J2921J3375J1545K5698O4615Q1174Q4687P3172R0160
$$ 618817 570352 532337 549486 562407 575782 587327 613025 677640 758814 843501 916673 1006833
8593A006833J36416J74963M9916k6205k9588n3091p5813p6878o4602o8863p0017
$$ 1006833 1143249 1318212 1368128 1341923 1312335 1259244 1183431 1106553 1041951 973088 903071
8582I03071p2486m7998l4268n6258o7666l1066j1862k0527m9216m8693q144l1437
$$ 903071 830585 782587 748319 692061 624395 593329 581467 560940 511724 463031 454887 423450
8570D23450l3134j541l6900j2578K120j3730o289k895K5015J4371q973j2445O003
$$ 423450 390316 388775 351875 339297 341417 327687 321398 318503 343518 357889 348916 336471 342474
8557C42474m4254j5161p939j3514J4109J9901j6833j0850K2024L2862N9484K7869
$$ 342474 298220 283059 275120 261606 275715 295616 278783 267933 289957 322819 382303 410172
8545D10172m7770l8435j4829l8686l8806r927K3410L0322j3160J4109K8337o408
$$ 410172 362402 323967 309138 270452 231646 221719 245129 275451 262291 276400 304737 298329
8533B98329j7084k3115J771k1805l7056k7092k8607J2324K0923L6387J7128K0252
$$ 298329 281245 258130 259901 238096 201040 173948 145341 157665 178588 214975 232103 252355
8521B52355K282k86L0728j3703n3615Q814J0725J6818r450r015r796M971l053
$$ 252355 254637 254351 285079 271376 217761 226575 237300 254118 244668 235653 225857 230828 227775
8508B27775k7473l7709k2768k0309Q443J0087J8601j2279J5595M272J4437P634
$$ 227775 200302 162593 139825 119516 127959 138046 156647 144368 159963 164235 178672 186306
8496A86306r830k3417N068n401j958J8210p699k3014n325O941l233p126k0406
$$ 186306 176476 153059 158127 152726 150768 168978 161279 138265 132940 139881 136648 129522 109116
8483A09116J2862P119J6842R786j9613l744j5471J0429K7301n657k2123J0950
$$ 109116 121978 129097 145939 155725 136112 132368 116897 127326 154627 148970 126847 137797
8471A37797N1167J54m68K3257R238k7718K453m064J9331k0411O351p323k2656
$$ 137797 188964 189118 188650 211907 221145 193427 195880 191816 211147 190736 197087 189764 167108
8458A67108J785k3731k7273m504K255K1024k893J2066K2828J1381j2740k336p482
$$ 167108 168893 145162 117889 113385 115640 136664 133771 145837 168665 180046 167306 164970 157488
8445A57488q483j2644J5802P638K2307j2022P82L4075r2J365l9250k5906j0228
$$ 157488 149005 136361 152163 159801 182108 170086 170868 204943 204851 206216 166966 141060 130832
8432A30832n100L967J0011K9991K758p099J869k0864k2181j6611j0224K1820m372
$$ 130832 125732 129699 139710 169701 172459 165360 167229 146365 124184 107573 97349 119169 114797
8419A14797j4934j2165Q433M403k4577j3302j2408O079J0891J9177R980J1844
$$ 114797 99863 87698 96131 100534 75957 62655 50247 56326 67217 86394 96374 108218
8407A08218P189L3427J8561P236j0375M613j3810N965K0158q703p202J5640L1168
$$ 108218 115407 148834 167395 174631 164256 168869 155059 161024 181182 172479 165277 180917 212085
8394B12085O017l4693j7571K8021P839o881k5704k1668J8747p201k0276m0029
$$ 212085 218102 183409 165838 193859 201698 194817 169113 147445 166192 158991 138715 98686
8382I8686P921N4213J5771k8411k4118j6540k2425K4374L8962j8402J704K5731
$$ 98686 106607 160820 176591 148180 124062 107522 85097 109471 148433 130031 131735 157466
8370A57466O531p739k5659K0097M8158j311k1422k0415L3185J3198l5813k2281
$$ 157466 163997 156258 130599 150696 198854 197543 176121 155706 188891 202089 166276 143995
8358A43995j4637Q090p924m0144l6361K2500n35j1071M926J5086J7645j9219k0126
$$ 143995 129358 137448 129524 89380 53019 75519 74984 63913 68839 83925 101570 82351 62225
8345F2225K2057r940K973Q724O308k2105j4891Q495M961l06M805R114j1572j0964
$$ 62225 84282 74342 77315 86039 92347 70242 55351 63846 68807 68501 73306 82420 70848 59884
8331E9884k206M052k0611r828R723J5662O011K0308M938Q478m33P856K985p788
$$ 59884 57678 61730 41119 31291 41014 56676 62687 82995 87933 96411 95978 103834 106819 99031
8317I9031j8213k9687l3335O294J162q690k092k8221J3902L1767K4357L0261L982
$$ 99031 80818 51131 17796 24090 25252 16562 14470 -13751 151 31918 56275 86536 90518
8304I0518k3911p792j5459p952K638m610J5732J2275J9493j7799k1274m211j8057
$$ 90518 66607 58815 43356 35404 38042 33432 49164 61439 80932 63133 41859 37648 19591
8291A9591r161J9627j012J9647K4168K6640m198K703j4854n381K351P602N458
$$ 19591 10430 30057 29045 48692 72860 99500 95302 98005 83151 77770 80121 87723 93181
8278I3181k1725j107L1030J1689j3362l7086k1540P19O286r045O355l138L469
$$ 93181 71456 70349 101379 113068 99706 62620 41080 41799 48085 39040 45395 42257 45726
8265D5726k338m014K4042j175l0441j4439j0249J562K372o31l986Q357J0980k148
$$ 45726 43388 39374 63416 62241 31800 17361 7112 8674 11046 10415 6429 14786 25766 23618
8251B3618j9105l800J0431o338j0214L5512L2857M805J2469K8282P354k3194k2690
$$ 23618 4513 713 11144 4806 -5408 30104 62961 67766 80235 108517 115871 92677 69987
8238F9987k9230p72j9473j5494J006J8861L2057J8885k916k6644j2385J1565K344
$$ 69987 40757 39985 20512 5018 6024 24885 56942 75827 72911 46267 33882 45447 47791
8225D7791j0617n440M1597R958J7489l4775j9646m197R337m517J364j205K0216
$$ 47791 37174 31734 73331 83289 100778 66003 46357 42160 51497 46980 48344 47139 67355
8212F7355m555j0796j3985k7339q59j9190K3489L0623J8321J8998Q351J8224o527
$$ 67355 62800 52004 38019 10680 9821 -9369 14120 44743 63064 82062 90413 108637 102110
8199A02110k9464l6506O161O745o987J3978J2699j5048k755m280J4588L320P844
$$ 102110 72646 36140 42301 49046 42059 56037 68736 53688 50933 46653 61241 64561 72405
8186G2405J6167q897l4921j5365J2774K6138m361m62j045k3125q18J4264k403
$$ 72405 88572 79675 44754 29389 42163 68301 63940 63478 62433 39308 38490 52754 50351
8173E0351k2305J7321j881j1992n910J5128M63k140r11M560P692l297j6196N909
$$ 50351 28046 45367 43486 31494 25584 40712 41175 39035 38124 42684 50376 47079 30883 36792
8159C6792K6092q201o948j3299j3220P21K3308J6770j19q179k36j284Q678j2157
$$ 36792 62884 54683 47735 34436 21216 21937 45245 62015 61896 53717 53481 52197 60875 48718
8145D8718q552j167K7058M0860k2066l1984K0033o058L447r537q398p539N564
$$ 48718 40166 38999 66057 106917 84851 52867 72900 66842 70289 60752 52354 44815 50379
8132E0379N0q026j285J520j5425N549O736O371r292j2219J4737j6959O96O558
$$ 50379 50429 42403 41118 42638 27213 32762 39498 45869 36577 24358 39095 22136 22832 29390
8118B9390K8564J6393j1422j4500J0134N340J5333J8734j6584k5083J2185j1005
$$ 29390 57954 74347 62925 48425 58559 63899 79232 97966 81382 56299 68484 57479
8106E7479k4191K7140K7542K764k7832k1104O480J3122M625j0733l895r581k0108
$$ 57479 33288 60428 87970 90734 62902 41798 48278 61400 66025 55292 51397 41816 21708
8093B1708j315K3974J924K583N620K1194J0665k7799J198J3219n836M106R371
$$ 21708 20393 44367 46291 48874 54494 75688 86353 58554 59752 72971 67135 71241 80612
8080H0612j1430j0015l381j728O045K0672P290M917j936p881J4093k571k323o366
$$ 80612 69182 59167 55786 54058 60103 80775 88065 92982 91046 83165 97258 94687 92364 85998
8066H5998k731J68R453k587k0081k7664K1107L9301L208j479j4080j8379J5298
$$ 85998 83267 83435 92888 90301 70220 42556 63663 102964 106172 104693 90613 72234 87532
8053H7532m976J0690J1690k103k227j2659p33r88l490L515k3051J267K2144K2108
$$ 87532 82556 93246 104936 102833 100606 87947 87214 86226 82736 86251 63200 64467 86611 108719
8039A08719J4017J9015R454j3524l492K9633J3984l232J8418L328j9769j5234
$$ 108719 122736 141751 151205 137681 134189 163822 177806 174574 192992 196320 176551 161317
8027A61317l1184L99m658j5094K3715J4372n912L916j3264j2387J3545K405k7857
$$ 161317 130133 130532 125874 110780 134495 148867 142955 146871 133607 121220 134765 137170 109313
8014A09313l088L4742K6098K3173k821P185r586l4875K0885J3223l7974P532k7070
$$ 109313 106225 140967 167065 190238 187417 194602 185016 150141 171026 184249 146275 153807 126737
8001A26737R207j132J6285J9966J7396J2624K416M908N0614J2339L8844K4086
$$ 126737 135944 134812 151097 171063 188459 201083 203499 208407 259021 271360 310204 334290
7989C34290j3882j6768k3853k9173j5420o28N758j5014j5046k292l393M30q144
$$ 334290 320408 303640 279787 250614 235194 234566 240324 225310 210264 207972 204579 205009 196865
7976A96865l3519j3662o862l8422R475P101L050L0891R324K0728r047j8906J9371
$$ 196865 163346 149684 142822 104400 113875 120976 124026 154917 164241 184969 175922 157016 176387
7963A76387K0494j0179R668k1620l2209N263P866L4253R31j8560J7960J318L9364
$$ 176387 196881 186702 196370 174750 142541 147804 155670 189923 190854 172294 190254 191572 230936
7950B30936K7418j1792M566L8529r4o328N929l4340n2617J0806J5154j3650m5014
$$ 230936 258354 246562 251128 289657 289563 283235 289164 254824 202207 213013 228167 214517 169503
7937A69503j1409P398j1081k0767n2K1670j2650k2756O727J6694j1164l1285M485
$$ 169503 158094 165492 154411 133644 133592 155262 142612 119856 126583 143277 132113 100828 105313
7924A05313j0680N875J2314J6830K6095l927q625r735j7028m378K5386r020L413
$$ 105313 94633 100508 112822 129652 155747 151820 143195 133460 116432 112054 137440 128420 131833
7911A31833j7957J2967J2168N63n627M429J715r966j6665j9079J9892J6132o552
$$ 131833 113876 126843 139011 139574 133947 138376 140091 130125 113460 94381 114273 130405 123853
7898A23853k3552r876J0510j2850k5409M718J1644j4522L568k157k635K9966q947
$$ 123853 100301 90425 100935 88085 62676 67394 79038 64516 68084 65927 63292 93258 84311
7885H4311k1453k1974j7663P445j464L809j1632j7195L4351K2423j0489J792K7839
$$ 84311 62858 40884 23221 30666 29202 33011 21379 4184 38535 60958 50469 52261 80100
7872H0100o920L134O215j9134k3728j2259J3833J5990j8581j5783j770L5416L1165
$$ 80100 73180 76314 82529 63395 39667 27408 41241 57231 38650 22867 21097 56513 87678
7859H7678k907M000j7391j8496k3907J7880j9796p269j4886J9369J5410j3876
$$ 87678 84771 88771 71380 52884 28977 46857 27061 19792 4906 24275 39685 25809
7847B5809J6695J9194j4334k715K4524j8587k7969j4444N737l265j8497J436K6071
$$ 25809 42504 61698 47364 44649 69173 50586 22617 8173 13910 10645 -7852 -6416 19655
7834A9655O709M709m142J8830j0832q685P161o702R898n223n170K1296q574M0362
$$ 19655 26364 31073 26931 45761 34929 26244 33405 26703 36601 31378 26208 47504 38930 79292
7820G9292o883j5469j0176o872m124R418J8050k124j4462l8176j2286O67J1618
$$ 79292 72409 56940 46764 39892 35768 45186 63236 61112 46650 8474 -3812 -3145 8473
7807H473m261k3163k594j2431N856J9405R197J4431j2692M00L785r055J3148R340
$$ 8473 4212 -18951 -21545 -33976 -28120 -8715 482 14913 2221 2621 6406 -2649 10499 19839
7793A9839N201J6201J816J7285m414k2623k48j290k08p73j472J4656r889P425
$$ 19839 25040 41241 43057 60342 55928 33305 33057 31767 31559 30786 29314 43970 34081 41506
7779D1506J9125o856k7856l966k903M347k2956j7384N381K0146j740j8808o129
$$ 41506 60631 53775 25919 21953 19050 23397 441 -16943 -11562 8584 6844 -11964 -18093
7766a8093k088R990l39P056J5392R029k0596R173k407J4314N660J0144J0410j5926
$$ -18093 -20181 -10191 -10530 -3474 11918 20947 351 9524 7117 21431 27091 37235 47645 31719
7752C1719J2477P901k2952j5997j731m356j0601j7213J6771J8477L387K578J353
$$ 31719 44196 52097 29145 13148 11417 7061 -3540 -20753 -3982 14495 17882 20460 21813
7739B1813k9626m064J4967j0864j3713J2080M67K394L8083p824j0240J0819j8384
$$ 21813 -7813 -11877 3090 -7774 -21487 -9407 -8940 -6546 31537 23713 13473 24292 5908
7726E908Q160J4623Q862j3878j7500J7408J239J1216K0947M713j8538l1220M848
$$ 5908 14068 28691 37553 23675 6175 23583 24822 36038 56985 61698 43160 11940 16788
7713A6788K1616J1834q119k9339k526k9168l8810J7542L4718l637o088J0594J3213
$$ 16788 38404 50238 42119 12780 10254 -18914 -57724 -40182 -5464 -9101 -15189 -4595 8618
7700H618j2372P620j0586j2743l549K418r471j5775R988L2416J832J742j5194
$$ 8618 -3754 3866 -6720 -19463 -23012 -20594 -30065 -45840 -35852 -3436 -1604 138 -15056
7687a5056k990J9031Q378j8698m4307J7975j814R743L3171j1122j3018j864M592
$$ -15056 -18046 985 9363 -9335 -53642 -35667 -37481 -27738 5433 -5689 -18707 -20571 -15979
7674a5979J1583J4373p905o96L8209j0153j0247j3427l251q247K3118J9416j9786
$$ -15979 -4396 9977 2072 1376 39585 29432 19185 5758 2507 -5740 17378 36794 17008
7661A7008j316k4191p013J2905l7863m780K9393L4037J2234j4987k8080j8951
$$ 17008 15692 -8499 -15512 -2607 -40470 -45250 -15857 18180 30414 15427 -12653 -31604
7649c1604K604M380k929J3383J4463Q757J1059j3315r377l95J3389n938P118M622
$$ -31604 -29000 -24620 -27549 -14166 297 9054 20113 6798 -2579 -2974 10415 4477 11595 16217
7635A6217N536R193l1280k2650J5276K0167J5111k1252j9516J7895R641n723K2324
$$ 16217 21753 30946 -334 -22984 -7708 12459 27570 6318 -13198 4697 14338 8615 30939
7622C0939J1619O785r044p387K0344m4661m155j829k4317q598r209j1410M0649
$$ 30939 42558 49343 40299 32912 53256 8595 4440 2611 -21706 -30304 -39513 -50923 -10274
7609a0274L3581l496k259k6251l787Q803L791J5443Q30q145K190O370K6164O693
$$ -10274 23307 19811 17552 -8699 -12486 -3683 108 15551 16381 8236 10426 16796 42960 49653
7595D9653P287j2595m0093j1751J1988L04K383j7142J9141J5644J160J20j6788
$$ 49653 56940 44345 4252 -7499 4489 4793 7176 -9966 9175 24819 25979 26099 9311
7582I311k5417O844J7284P019J0871k2411j8307K1647J1116j8312k682J0874J0365
$$ 9311 -16106 -9262 8022 15041 25912 3501 -14806 6841 17957 -355 -3037 7837 18202
7569A8202m748k8378K0245M6787q58j4971k6541j8000Q171j2887k3326p951q408
$$ 18202 13454 -14924 5321 52108 51250 36279 9738 -8262 -91 -12978 -36304 -44255 -52663
7556e2663l671J8026K8509J0985J176O642o941Q354o55k7361P994J2308p218k2046
$$ -52663 -56334 -38308 -9799 1186 2362 9004 2063 10417 9762 -17599 -9605 2703 -4515 -26561
7542b6561j3673N550R473m431n667L9580L4275j7734p391P314j664j6915m632
$$ -26561 -40234 -34684 -25211 -29642 -35309 4271 38546 20812 13421 20735 19071 2156 -2476
7529b476J6233P319j5006j6982o435O510o324J6247j422k0418j9725k659J7773
$$ -2476 13757 21076 6070 -10912 -17347 -10837 -17161 -914 -2336 -22754 -42479 -45138 -27365
7516b7365o542J5133J8987J3234j0406m5108p371J0535J6982J9966j2235r120
$$ -27365 -33907 -18774 213 13447 3041 -42067 -49438 -38903 -21921 -1955 -14190 -23310
7504b3310Q616J1070J0911k8603j4684J5018J058l250m314j27M986J5536J917
$$ -23310 -14694 -3624 7287 -21316 -36000 -20982 -19924 -23174 -27488 -27615 -22629 -7093 -5176
7491e176k8487K0995P888q055J7349j160k308K3026R341M89J0441l2090j9661
$$ -5176 -33663 -12668 -4780 -12835 4514 3354 1046 24072 33413 33902 44343 12253 -7408
7478g408K2687j6371j0544j7549m400K9490K0870k329j4974J6556P066M274J3852
$$ -7408 15279 -1092 -11636 -29185 -33585 -4095 16775 14446 -528 16028 23094 27368 41220
7465D1220q326k3816l5045p519J9791K0678L6906O511k2352j1058j3969j052J2705
$$ 41220 32894 9078 -25967 -33486 -13695 6983 43889 50400 28048 16990 3021 1969 14674
7452A4674l2077m426J7280J3193J5272O951j5394j0935j936k0574k0249O493N008
$$ 14674 -17403 -21829 -4549 8644 23916 30867 15473 4538 2602 -17972 -38221 -31728 -26720
7439b6720L3181J0038l2253n7223j7130M0691M5620j5780j3295J9415K4701k1424
$$ -26720 6461 16499 -15754 -72977 -90107 -49416 -3796 -19576 -32871 -13456 11245 -10179
7427a0179j5351K6975K4049l4987l3841M783K4079J2305J6926J8296l220J043
$$ -10179 -25530 1445 25494 -9493 -43334 -38551 -14472 -2167 14759 33055 29835 30878
7415C0878K4217m676N603j4747j4221k0962K9825J4486l959L782k6540k4816K7541
$$ 30878 55095 50419 56022 41275 27054 6092 35917 50403 46444 50226 23686 -1130 26411
7402B6411K0074m13j9404k8342N457O345j5823l271J6082J4053P025J0945l3958
$$ 26411 46485 46072 26668 -1674 3783 10128 -5695 -8966 7116 21169 28194 39139 5181
7389E181l3764l813L925N141J2669P301J1208k2540P214r676P886K2105K9069
$$ 5181 -28583 -32396 -28471 -23330 -10661 -3360 7848 -14692 -7478 -17154 -9268 12837 41906
7376D1906R285P383l7049j7040K4276j454r256j9280O323p221j1898l453K4345
$$ 41906 51191 58574 21525 4485 28761 27307 18051 -1229 5094 -2127 -14025 -17478 6867
7363F867M023k0985k2916j0659K8617J9997O245J1464K1567j2732o405L612r522
$$ 6867 10890 -10095 -33011 -43670 -15053 4944 11189 22653 44220 31488 25083 28695 19173
7350A9173r518J1519p410R00J724k8322j5555M2189K0274k5598j8183p105J9185
$$ 19173 9655 21174 13764 14664 16388 -11934 -27489 14700 34974 9376 -8807 -15912 3273
7337C273J4160j3361m861o88J1337R984j7596p730R841r089k3885J3156J7544
$$ 3273 17433 4072 -789 -1477 9860 19844 2248 -5482 4359 -4730 -28615 -15459 2085
7324B085J1429j9508j0710J5981j346N931K833j6846o74O340j9907q300J902K4015
$$ 2085 13514 -5994 -16704 -723 -2069 3862 6695 -10151 -10825 -4485 -24392 -32692 -30790 -6775
7310f775q31P003K0738K0416j8898K903j9033J247J1589n84J4347q232j6136L607
$$ -6775 -7606 -603 20135 40551 21653 24556 5523 6770 18359 17775 32122 23890 7754 11361
7296A1361j977r573n584j4566l0471P388J6623K4824k144l1028K353K6786K1609
$$ 11361 9384 -189 -5773 -20339 -50810 -43422 -26799 -1975 -4119 -35147 -32794 -6008 15601
7283A5601J205R150j0696J5811M396j1024o90o406K44k1337K2402J01r994n006
$$ 15601 16806 25956 15260 31071 35467 24443 23753 17347 17591 -3746 18656 18757 8763 3757
7269C757J7564J8737N42m268P950j7432j6467j3748q87J45k3815R141Q81N661
$$ 3757 21321 40058 40600 36332 44282 26850 10383 -3365 -4252 -4107 -27922 -18781 -17900 -12239
7255a2239p336k206Q109j5237J0490n374p247J5564M2126R759l5102k2055M140
$$ -12239 -19575 -21781 -13672 -28909 -18419 -23793 -31040 -15476 26650 36409 1307 -20748 -16608
7242a6608Q188j2704r74J7594J864J3783N968J1002n607J4524J0379l5235k687
$$ -16608 -8420 -21124 -22098 -4504 -2640 11143 17111 28113 22506 37030 47409 12174 9487
7229I487P499j730k8183l3255J3244L1761J3658j9367k9059m247K2367l579k219
$$ 9487 16986 15256 -12927 -46182 -32938 -1177 12481 -6886 -35945 -40192 -17825 -21404 -23623
7216b3623k28r49K647p90J8243K3464j1748j8691n861L2476K7405l0068l2328
$$ -23623 -23851 -24800 -22153 -22943 -4700 18764 7016 -11675 -17536 14940 42345 12277 -20051
7203b0051J6044r228M608J5345j113j9673k132J8909M654l998k5037k56K7263
$$ -20051 -4007 -13235 -8627 6718 5605 -14068 -16200 2709 7363 3365 -21672 -21928 5335
7190E335J4418r409j8954r908m73o528j980j7761L6760L3834l2493j2418J9368
$$ 5335 19753 10344 -8610 -18518 -18991 -25519 -27499 -45260 -8500 25334 -7159 -19577 -209
7177b09J8314K2232K67j0993k0763j4593M945o054M136k7742k6436K4158M0289
$$ -209 18105 40337 40604 29611 8848 -5745 -800 -6854 -2718 -30460 -56896 -32738 7551
7164G551L7009J5818l1865j9434n591r323R238K1513j9349k0224j1375j0303K2396
$$ 7551 44560 60378 28513 9079 3488 -5835 3403 24916 5567 -14657 -26032 -36335 -13939
7151a3939J3768Q485j4053k69P602m525j5642p70J5096K2979n121k0696l6858
$$ -13939 -171 8314 -5739 -6008 1594 -2931 -18573 -19343 -4247 18732 13611 -7085 -43943
7138d3943p681j0279J5637K6300J3382N584J8418l5521j8777L3393K9453J569
$$ -43943 -51624 -61903 -46266 -19966 -6584 -1000 17418 -18103 -36880 -3487 25966 27535
7126B7535n142n6P124J4203J4323R578l1826j5502p624k8374q933J1901j7255
$$ 27535 22393 22337 29461 43664 57987 67565 35739 20237 12613 -15761 -24694 -12793 -30048
7113c0048J0644R097o086j7335L3588K3861j0181M482K647k521p974K4026L712
$$ -30048 -19404 -10307 -16393 -33728 -140 23721 13540 18022 20669 18148 10174 34200 37912
7100C7912n733l228r560k2818l5332k512j4843J4387L8231N09l035j7996k4700
$$ 37912 32179 28951 19391 -3427 -38759 -41271 -56114 -41727 -3496 -2987 -6022 -24018 -48718
7087d8718j0364j0184J4326M0712J080J5242J83P402k653J427n382J6603O697
$$ -48718 -59082 -69266 -54940 -14228 -13148 2094 2277 9679 7026 8453 3071 19674 26371
7074B6371j1342p105N237k1186J7308O719j8966l4659o677L7128J8863O772R561
$$ 26371 15029 7924 13161 -8025 9283 16002 -2964 -37623 -44300 -7172 11691 18463 28024
7061B8024N563J4315K583J0213j6553m1286j6949J8311n326j110M039N741P129
$$ 28024 33587 47902 50485 60698 44145 2859 -14090 4221 -1105 -2215 1824 7565 14694
7048A4694n495j6993M571J4284l2701k4044K6577J5736j8471P484N669r319K7713
$$ 14694 9199 -7794 -3223 11061 -21640 -45684 -19107 -3371 -21842 -14358 -8689 -18008 9705
7035I705K344j5108r247k8952l015J4866K2237J3750J2055j9555p439K465j9189
$$ 9705 12049 -3059 -12306 -41258 -44273 -29407 -7170 6580 18635 -920 -8359 -5894 -25083
7022b5083J13K3433J083R791J5768M049N824n534m633k6984r530J0394N401r681
$$ -25083 -24970 -1537 -454 9337 25105 29154 34978 29444 24811 -2173 -11703 -1309 4092 -5589
7008e589l4100J453k321J3271J183j4982l15K1299L606j416J5732j98j4776j450
$$ -5589 -39689 -38236 -40557 -27286 -26103 -41085 -41400 -20101 -16495 -17911 -2179 -2377 -17153 -18603
6994a8603K3942n317k0580J1193L983Q108j1487k1383j9284K6284K6850j722M912
$$ -18603 5339 22 -20558 -9365 -5382 2726 -8761 -30144 -49428 -23144 3706 1984 6896
6981F896J1187k6508k2209K238K0669p473p622L923R882m670o912n594K8593K9631
$$ 6896 18083 -8425 -30634 -28396 -7727 -15200 -22822 -18899 -9017 -13687 -20599 -26193 2400 32031
6967C2031P916M284j1105J9939j5279j1452k9708L459J4775K0118j0970l1788
$$ 32031 39947 44231 33126 53065 37786 26334 -3374 85 14860 34978 24008 -7780
6955g780J5292J3826j1404J5648l181k981N237m0632m596j4234J0971K3527k1062
$$ -7780 7512 21338 9934 25582 22401 19420 24657 -15975 -20571 -34805 -23834 -307 -21369
6942b1369j6855k289K0333K0234k676K400R763q555L109J232M4467P195k0617
$$ -21369 -38224 -40513 -20180 54 -2622 -222 9541 986 4095 5327 49794 56989 36372
6929C6372J5380K795j2490n2129k2162L1470J1562k582j9777k0625J3425K8229
$$ 36372 51752 54547 42057 -10072 -32234 -764 10798 8216 -11561 -32186 -18761 9468
6917I468K5443j3936L330j2074L528j5306j0031j2695L478K1097J0829q361J044
$$ 9468 34911 20975 24305 12231 15759 453 -9578 -22273 -18795 2302 13131 4770 5814
6904E814k4027N950J743N209K3795K0219o659j9619J7297J536j0848K30n894r071
$$ 5814 -18213 -12263 -10520 -5311 18484 38703 32044 12425 29722 31258 20410 20640 14746 5675
6890E675l0518Q429j0066J0271L1077L0503J2289q249r765R013q654r595l0817
$$ 5675 -24843 -16414 -26480 -16209 14868 45371 57660 49411 39646 48659 40005 30410 -407
6877d07k2430J6142L168j2864K3775J899j3678j8589p580K5326J0002N394k5388
$$ -407 -22837 -6695 -3527 -16391 7384 9283 -4395 -22984 -30564 -5238 4764 10158 -15230
6864a5230q860J4130j5398N062J7746m206K2643J7061N768J128K080j4890n0813
$$ -15230 -24090 -9960 -25358 -20296 -2550 -6756 15887 32948 38716 39844 41924 27034 -23779
6851b3779m35k210j851K2314J1255j9653k3367q828l199l141L74J5767P468J253
$$ -23779 -24214 -26424 -28275 -5961 5294 -14359 -37726 -46554 -49753 -52894 -52520 -36753 -29285 -28032
6837b8032P865M216n946j249o92K3273Q610j1145O545j3218j9542K022K5099J4211
$$ -28032 -20167 -15951 -21897 -23146 -23838 -565 8045 -3100 3445 -9773 -29315 -27293 -2194 12017
6823A2017M146J3852J7080J1837P65j0263m5961k563J9069j5191j8868j3441L819
$$ 12017 16163 30015 47095 58932 59697 49434 3473 910 19979 4788 -14080 -27521 -23702
6810b3702R242J8722K6728o898j9048l5568k3190L0323K5621r994J8841r126j1555
$$ -23702 -14460 4262 30990 24092 5044 -30524 -53714 -23391 2230 -7764 11077 1951 -9604
6797i604j9893k3544J198o59K6145O839J407Q310M922l429r860O779j8464R54
$$ -9604 -29497 -53041 -51843 -52502 -26357 -19518 -18111 -9801 -4879 -8308 -18168 -11389 -29853 -28899
6783b8899r723Q637K7636O525j2708l665J2363o260q570K8006L1470J0866j2633
$$ -28899 -38622 -29985 -2349 4176 -8532 -12197 166 -6094 -14664 13342 44812 55678 43045
6770D3045N272J7040J3705k6400j2180j7729l1987o216O219k5195o43J7824J1681
$$ 43045 48317 65357 79062 52662 40482 22753 -9234 -15450 -9231 -34426 -35069 -17245 -5564
6757e564n800l377P965j320j8738j613K1363J5381j0654K874K7595K2029L280
$$ -5564 -11364 -14741 -6776 -8096 -26834 -28447 -7084 8297 -2357 517 28112 50141 53421
6744E3421m844k0673l9692k5502o18K3045K3859j4924M519M3649L0196j249o214
$$ 53421 48577 27904 -11788 -37290 -37908 -14863 8996 -5928 -1409 42240 72436 71187 64973
6731F4973K126j0677j1391k1954O934j100j9154L628N118K2815j9782k8663j777
$$ 64973 67099 56422 45031 23077 30011 28911 9757 13385 18503 41318 21536 -7127 -8904
6718h904K5477Q579L9932L1787M8093M3486L5511k20m1788l4068l9323n0170j8001
$$ -8904 16573 25152 65084 96871 144964 188450 223961 223741 181953 147885 108562 58392 40391
6705D0391r374j6064J5250K7715m698k7009Q878j1394O119k2033l087J3785O260
$$ 40391 31017 14953 30203 57918 53220 26211 35089 23695 29814 7781 4694 18479 24739
6692B4739M780k2946j7084J4219J9684K2768R651j4668j4853o4Q495K3527q188
$$ 24739 29519 6573 -10511 3708 23392 46160 55811 41143 26290 26226 34721 58248 50060
6679E0060k3995j8326M099j0224k1571M617K2958J4737o963j1424O670J8984J1720
$$ 50060 26065 7739 11838 1614 -19957 -15340 7618 22355 15392 3968 10638 29622 41342
6666D1342j6128k5574l1430L5434K3929K053j9855J4218K6514J8987l1644L210
$$ 41342 25214 -360 -31790 3644 27573 29626 9771 23989 50503 69490 37846 41056
6654D1056J1793j7732j6637k8269r99o141k8101o365l891q38J6028j6557J7669
$$ 41056 52849 35117 18480 -9789 -10788 -16929 -45030 -51395 -55286 -56124 -40096 -56653 -38984
6641c8984L3984j1876Q069K1224j4695P472L056L1800J6151k5859L930J4704l6502
$$ -38984 -5000 -16876 -8807 12417 -2278 5194 8250 40050 56201 30342 34272 48976 12474
6628A2474l2416l3723N770J8492k414L1410l254k4273N429J7803j3787J1576K6750
$$ 12474 -19942 -53665 -47895 -29403 -31817 -407 -3661 -27934 -22505 -4702 -18489 -6913 19837
6615A9837J3395k0179k049p812p053K5761j4996k2598R725L2207K2724j4989j7398
$$ 19837 33232 13053 11004 3192 -3861 21900 6904 -15694 -5969 26238 48962 33973 16575
6602A6575j5645L987O73j137j4393J1426j6701l0772J47P707K81L1899K6760K670
$$ 16575 930 4917 5590 4453 -9940 1486 -15215 -45987 -45840 -38133 -37852 -5953 20807 23477
6588B3477j3522k2716J1899J6505J2220m107J1323l0832j4106J3061j5233j1903
$$ 23477 9955 -12761 -862 15643 27863 23756 35079 4247 -9859 3202 -12031 -23934
6576b3934L0851j0725k9128L2816P551j96J698k0885j7839j900K784p240j3415
$$ -23934 6917 -3808 -32936 -120 7431 7235 8933 -11952 -29791 -31691 -28907 -36147 -49562
6563d9562K1088j0677R360j2418j8j7986j6133J7001K1719r272l69J9389n763
$$ -49562 -28474 -39151 -29791 -42209 -42227 -60213 -76346 -59345 -37626 -46898 -47267 -27878 -33641
6550c3641L62p879j5263J1820J2707M944J4729j044n938R705J4184k217N990J1384
$$ -33641 -33279 -41158 -56421 -44601 -31894 -26950 -12221 -13265 -19203 -9498 4686 2469 8459 19843
6536A9843R999J2348o428J4566k645j4262j1134l954K8336j6826l0486J9054K2775
$$ 19843 29842 42190 35762 50328 47683 33421 22287 18333 46669 29843 -643 18411 41186
6523D1186r320k2242j4778o216j6029k593K6440l543j7301K8708J5508l0446j1609
$$ 41186 31866 9624 -5154 -11370 -27399 -29992 -3552 -7095 -24396 4312 19820 -10626 -22235
6510b2235J3372m02J1997K7251J5536r621r723k496m294R776J463M082n146k0161
$$ -22235 -8863 -9265 2732 29983 45519 35898 26175 23679 19385 29161 30624 34706 29560 9399
6496I399n722K0703M676j5199j6664n549K7891l208K72P958m745K737p19N051
$$ 9399 3677 24380 29056 13857 -2807 -8356 19535 16327 16599 24557 19812 22549 21830 26881
6482B6881j5571J3035M841l669r797j8750j3074j6132K6584L9491J4124l5244
$$ 26881 11310 24345 29186 25517 15720 -3030 -16104 -32236 -5652 33839 47963 12719
6470A2719k4657k0717N424K0533P87O028m708k6109k5446J849L819J7287j4648
$$ 12719 -11938 -32655 -27231 -6698 -5911 117 -4591 -30700 -56146 -54297 -50478 -33191 -47839
6457d7839K2382J9722R049j198J6139J1929J714k1621j9431n467j688K6095J0856
$$ -47839 -25457 -5735 3314 2116 18255 30184 31898 10277 -9154 -14621 -16309 9786 20642
6444B0642O232Q954J6389j4182j495l5547m895O579L087m685l1442j5905O115
$$ 20642 26874 35828 52217 38035 36540 993 -3902 2677 5764 1079 -30363 -46268 -40153
6431d0153M928K4479M0130K2489J069l5694j6494r828j960M3576J2752q386J8440
$$ -40153 -35225 -10746 29384 51873 52942 17248 754 -9074 -11034 32542 45294 36908 55348
6418E5348K7963m0554p6080m1009K0407K7036K2569O944k6967k1278j4746N060
$$ 55348 83311 42757 -33323 -74332 -53925 -26889 -4320 2624 -24343 -45621 -60367 -55307
6406e5307R315l3092j4705J5278J9226L836m860k9418K487J1654K4780J6758J589
$$ -55307 -45992 -79084 -93789 -78511 -59285 -55449 -60309 -89727 -87240 -75586 -50806 -34048 -32459
6393c2459j4109M023Q509K3180J2293n850j2188Q459M24K7636P307l5118j0520
$$ -32459 -46568 -42545 -34036 -10856 1437 -4413 -16601 -8142 -7718 19918 27225 -7893 -18413
6380a8413O658p490P726K6777N284r081q934l2661j2518K6866Q176L443n45k2566
$$ -18413 -11755 -19245 -11519 15258 20542 11461 2527 -30134 -42652 -15786 -7610 -4167 -4712 -27278
6366b7278J4790N203j060j2526p822l019N959Q577R372M554Q141o05k4132o509
$$ -27278 -12488 -7285 -8345 -20871 -28693 -31712 -25753 -17176 -7804 -3250 4891 4286 -19846 -26355
6352b6355r907j1680k347O162P66L3984K7086j6302r429L4017k7167P323K0072
$$ -26355 -36262 -47942 -50289 -44127 -43361 -9377 17709 1407 -8022 25995 -1172 6151 26223
6339B6223k302j4300q477j811q686j5985N491J1094o252p784K293o528J454N81
$$ 26223 23921 9621 1144 -667 -9353 -25338 -19847 -8753 -15005 -22789 -20496 -27024 -25570 -24989
6325b4989m368L806k4715j887N275J6065M4104K6518k1791m0278l072K646J8729
$$ -24989 -29357 -25551 -50266 -52153 -46878 -30813 13291 39809 18018 -22260 -25332 -22686 -3957
6312c957M6953k286o294r680k2939j7803j8326L793K6192N421N460J1393O683
$$ -3957 42996 40710 34416 24736 1797 -16006 -34332 -30539 -4347 1074 6534 17927 24610
6299B4610J1553o589K437j759j1996j3649M057j7414j2954l679L8039R211J732
$$ 24610 36163 29574 32011 30252 18256 4607 8664 -8750 -21704 -25383 12656 21867 23599
6286B3599J5531L435j9023J1229N069n669j3700p806r660M424j1731j5228J6561
$$ 23599 39130 42565 23542 34771 39840 34171 20471 12665 3005 7429 -4302 -19530 -2969
6273b969J0349M993j4453k2511p003K9204R537J1813k3528l689J6804J31k5817
$$ -2969 7380 12373 -2080 -24591 -31594 -2390 7147 18960 -4568 -8257 8547 8678 -17139
6260a7139j1844k0129n776K9740L5502N157j7405k314j268J5605m825j6348q496
$$ -17139 -28983 -49112 -54888 -25148 10354 15511 -1894 -4208 -5476 10129 5304 -11044 -19540
6247a9540K3789Q867m303j4533L1184L8453r601k6100k3629l0279k1745J5323
$$ -19540 4249 13116 8813 -5720 25464 63917 54316 28216 4587 -25692 -47437 -32114
6235c2114K4031R307J9137j874j3208j0807j338n540k2324J1246M6935J2018l3686
$$ -32114 -8083 1224 20361 18487 5279 -5528 -6866 -12406 -34730 -23484 23451 35469 1783
6222A783l0312n156L9931j0874k5994L761k831r392J0259k549Q726M898J0632
$$ 1783 -28529 -33685 6246 -4628 -30622 -26861 -29692 -39084 -28825 -31374 -22648 -17750 -7118
6209g118P175k937J2797j5483j8787O602L037j4625K1658O530k2677m910P869
$$ -7118 57 -2880 9917 -5566 -24353 -17751 -14714 -29339 -7681 -1151 -23828 -28738 -20869
6196b0869J3968J8015K174L089L303j1232m856J3661o420l941l107o909k0116
$$ -20869 -6901 11114 13288 16377 19680 8448 3592 17253 10833 6892 3785 -3124 -23240
6183b3240o5Q67M91K0397j183k3093J4324K7623k6871J145J3044J6544j4526j3026
$$ -23240 -23305 -22438 -21947 -1550 -2733 -25826 -11502 16121 -10750 -9605 3439 19983 5457 -7569
6169g569M146q336j4680L2584K3204L729k583J7279j0383k8454M88J0592K3587
$$ -7569 -3423 -11759 -26439 6145 29349 33078 30495 47774 37391 8937 9425 20017 43604
6156D3604o1768j3702K4900L540J6106p397P816k052j1276k870K9565p207j2009
$$ 43604 -18164 -31866 -6966 -3426 12680 5283 13099 11047 -229 -3099 26466 19259 7250
6143G250o611J1039O93p83J575P957N676j738o355l5171J7839L04j6933j3416
$$ 7250 639 11678 12371 11588 13163 21120 26796 25058 18703 -16468 1371 1675 -15258 -28674
6129b8674J3667o989K65Q657J8729J8796K466j7355k1461J3404J3502j2134k9239
$$ -28674 -15007 -21996 -21731 -13074 5655 24451 26917 9562 -11899 1505 15007 2873 -26366
6116b6366r261o608j7546K125J3934k8427J2607J7698J0713J7265j695P993J9588
$$ -26366 -35627 -42235 -59781 -57656 -43722 -72149 -59542 -41844 -31131 -13866 -15561 -7568 12020
6103A2020j1807l2677J6341K6042j7327O185Q398j0055j3351Q118J5742Q423j8207
$$ 12020 213 -32464 -16123 9919 -7408 -1223 7175 -2880 -16231 -8113 7629 16052 -2155
6090b155k9775J1745P694J6550J8210J6168j3936k6968k4742j1247J6173N588
$$ -2155 -31930 -20185 -12491 4059 22269 38437 24501 -2467 -27209 -38456 -22283 -16695
6078a6695p279R638K0688j6164k0491j739p820J4973O843k7027K2731K7555j5270
$$ -16695 -23974 -14336 6352 -9812 -30303 -32042 -39862 -24889 -18046 -45073 -22342 5213 -10057
6065a0057n439k293j1972k7231R347J5806q065p492k78R19K450L8266J4753j9443
$$ -10057 -15496 -17789 -29761 -56992 -47645 -31839 -39904 -47396 -47674 -46755 -44305 -6039 8714 -10729
6051a0729O617J8842l1560j7918K1788N412k52Q333k4610q503J2725K5020j3660
$$ -10729 -4112 14730 -16830 -34748 -12960 -7548 -7800 533 -24077 -32580 -19855 5165 -8495
6038h495m4497J6359J457j0623J6196L6684J8665q539j4449n188l71o499R057
$$ -8495 -52992 -36633 -35176 -45799 -29603 7081 25746 17207 2758 -2430 -2801 -9300 -243
6025b43R261j8470L431j8477j705K5890k6596N452K2142n393r382P277R340K2878
$$ -243 9018 -9452 -6021 -24498 -26203 -313 -26909 -21457 685 -4708 -14090 -6813 2527 25405
6011B5405o108k1076k1637Q946l446K4932N137Q574j0703j0741L446r270L376
$$ 25405 19297 -1779 -23416 -14470 -17916 7016 12153 20727 10024 -717 2729 -6541 -3165
5998c165K5201m074j3547o289J433K7261p688J627j49k8612k1956J0343Q25k3978
$$ -3165 22036 17962 4415 -1874 -441 26820 19132 20759 20610 -8002 -29958 -19615 -18790 -42768
5984d2768P265K0363M2248J2037N07k1198k3084O298m890m183J2582n471K0842
$$ -42768 -35503 -15140 27108 39145 39652 18454 -4630 1668 -3222 -7405 5177 -294 20548
5971B0548j0780j609k5275k6159n193K1884K8252j3584L440L7785J3889l1946
$$ 20548 9768 8159 -17116 -43275 -48468 -26584 1668 -11916 -8476 29309 43198 11252
5959A1252P587J2264m3310j9897n419O341L8487j3168k7818J5918j7494j0799
$$ 11252 18839 31103 -12207 -32104 -37523 -31182 7305 -5863 -33681 -17763 -35257 -46056
5947d6056J372K0450L1746k201k7210L869J2282j2187j4768N093J6715m007M235
$$ -46056 -44684 -24234 7512 5311 -21899 -18030 -5748 -17935 -32703 -27610 -10895 -14902 -10667
5934a0667M783j3950N721j2906l96p928n144K9226J2442j7235o389o829Q78k068
$$ -10667 -5884 -19834 -14113 -27019 -27415 -35343 -40487 -11261 1181 -16054 -22443 -29272 -28394 -30462
5920c0462K1766K8102Q379N1J5470k4000J879J204j4059k6230K9302m221j3776
$$ -30462 -8696 19406 27785 27836 43306 19306 21185 22389 8330 -17900 11402 7181 -6595
5907f595j4605k8030J6085K0204j5567k7604k041J738p670R744J5903K7060l081
$$ -6595 -21200 -49230 -33145 -12941 -28508 -56112 -58153 -56415 -64085 -54341 -38438 -11378 -14459
5894a4459k3806k640J6215J5829o893J9153K277N611M594m864j065N605o774q03
$$ -14459 -38265 -40905 -24690 -8861 -15754 3399 5676 11287 15881 11017 9952 15557 8783 7980
5880G980j6774k4409J8331J7316N533k5503j3856J7398J628M091N854J7321J8478
$$ 7980 -8794 -33203 -14872 2444 7977 -17526 -31382 -13984 -12356 -8265 -2411 14910 33388
5867C3388J2195K163K8436j0551K945M518l5807p107j4177r289K4959J6148r460
$$ 33388 45583 47746 76182 65631 68576 73094 37287 30180 16003 6714 31673 47821 38361
5854C8361k2242j2456P634O52q411J0088J9500j344k4007l670j615l7247o046
$$ 38361 16119 3663 11297 11949 3538 13626 33126 31782 7775 4105 2490 -34757 -40803
5841d0803J9387J0898p36l475J4209M0569q971P43k8602k4756Q652k395j2571
$$ -40803 -21416 -10518 -11254 -14729 -520 40049 31078 31821 3219 -21537 -12885 -15280 -27851
5828b7851r507l330J466L7424L7844K2824j141j1743P00r748j5692j2355n362
$$ -27851 -37358 -40688 -39222 -1798 36046 58870 57729 45986 46686 36938 21246 8891 3529
5815C529m050j1371l0122M107J1289J8647J8604K5373P864k6147k4428L7103J1150
$$ 3529 -521 -11892 -42014 -37907 -26618 -7971 10633 36006 43870 17723 -6705 30398 41548
5802D1548j5226k2310k7127k2379L1677L704j3152J5876N200j5493k3294j5527
$$ 41548 26322 4012 -23115 -45494 -13817 -10113 -23265 -7389 -2189 -17682 -40976 -56503
5790e6503K9213M4047k349n222j367R169j6001L499N094m642L184J2624r119p648
$$ -56503 -27290 16757 14408 9186 7819 16988 987 4486 9580 4938 8122 20746 11627 3979
5776C979K7942j9778k6004l831K523M588J0999p817J2788K5544k834L98J486k4
$$ 3979 31921 12143 -13861 -17692 -15169 -10581 418 -7399 5389 30933 28099 28497 29983 29959
5762B9959J1784N301j5859l1391j3969J7212j5861j1726J0654n380K3771p345
$$ 29959 41743 47044 31185 -206 -14175 3037 -12824 -24550 -13896 -19276 4495 -2850
5750b850j7686J9100k581J331j1981j8027k791n417M4924L5102k9213p863K5137
$$ -2850 -20536 -1436 -4017 -2686 -14667 -32694 -35485 -40902 4022 39124 9911 2048 27185
5737B7185Q958o505j1414K4381J555J7421l789k3103q535j6516l1553l3622j2554
$$ 27185 36143 29638 18224 42605 44160 61581 57792 34689 26154 9638 -21915 -55537 -68091
5724f8091K4260N4077J1174J3489l118J837J5996j6194l1796k6033j1030K9460
$$ -68091 -43831 10246 21420 34909 31791 33628 49624 33430 1634 -24399 -35429 -5969
5712e969K2218k0831k2563M70Q704K0048J1243J0534j276n479J1662J2056k9553
$$ -5969 16249 -4582 -27145 -26675 -17971 2077 13320 23854 22578 17099 28761 40817 11264
5699A1264k1933P756J3687J6859j7657m130k2761j1358M2354o224r678l776P907
$$ 11264 -10669 -2913 10774 27633 9976 5846 -16915 -28273 14081 7857 -1821 -5597 2310
5686B310J8867K596j368R873j4902l5827j1457J5082J2051j0244k1618K7757P560
$$ 2310 21177 23773 22405 32278 17376 -18451 -29908 -14826 -2775 -13019 -34637 -6880 680
5673F80k598m35o756J4003Q479k2372J4735J0001M561J2625m125j9314K7111M028
$$ 680 -1918 -2353 -9109 4894 13373 -8999 5736 15737 20298 32923 28798 9484 36595 40623
5659D0623k8047L832q878K3643m592j5242L4295n69j3981j401j9816j7861j0217
$$ 40623 12576 16408 7530 31173 26581 11339 45634 45065 31084 29683 9867 -7994 -18211
5646a8211k468o814j2888J0870J9883O447J2527K710K6741Q151q981o068K475
$$ -18211 -20679 -27493 -40381 -29511 -9628 -3181 9346 12056 38797 46948 37967 31899 34374
5633C4374k599j8420K1109J6392L823p371j5152Q238j9891M066J1318j5780k5391
$$ 34374 31775 13355 34464 50856 54679 47308 32156 40394 20503 24569 35887 20107 -5284
5620e284J8981K590j0090p71o161l870J2036M714j567k6421K4028N505j6620M731
$$ -5284 13697 16287 6197 5426 -735 -4605 7431 12145 10578 -15843 8185 13690 -2930 1801
5606A801J7697k1670M729K3277k8938L983R738p207K446J5734n14k0532j1274
$$ 1801 19498 -2172 2557 25834 -3104 879 10617 3410 5856 21590 21076 544 -10730
5593a0730P258K4781J3041j9729j4131M568l3525m460k195K876j9244L7688M9056
$$ -10730 -3472 21309 34350 14621 490 5058 -28467 -32927 -35122 -32246 -51490 -13802 35254
5580C5254L060K101j1963p753K4718Q007m3182n4701j7238M2496M7581j094l7652
$$ 35254 38314 40415 28452 20699 45417 53424 10242 -44459 -61697 -19201 28380 27286 -10366
5567a0366j5735m383n795L128J608K2881J0977P284j1064r418p877L122Q922j2558
$$ -10366 -26101 -30484 -36279 -33151 -31543 -8662 2315 9599 -1465 -10883 -18760 -15638 -6716 -19274
5553a9274p589K5027k0331Q05J7536k8507o310J8505K78J3464J2320J1232K8238
$$ -19274 -26863 -1836 -22167 -21362 -3826 -32333 -38643 -20138 -19860 -6396 5924 17156 45394
5540D5394l108m0473q601k227J0427j2566J1473L3444j6096K767P471j8310L566
$$ 45394 42286 1813 -6788 -9015 1412 -11154 319 33763 17667 20434 27905 9595 13161
5527A3161J0164j1261j5740j5026N991q396L959J1662K8243J9426k6126j7350
$$ 13161 23325 12064 -3676 -18702 -12711 -21107 -17148 -5486 22757 42183 16057 -1293
5515a293M481q88j7619j6553M827J0951J9455j3662q442j9976k966P959J5750
$$ -1293 3188 2300 -15319 -31872 -27045 -16094 3361 -10301 -18743 -38719 -41685 -33726 -17976
5502a7976L5024j5984l6656J3158J5417k616j0532r167J8965l802J1241J0002
$$ -17976 17048 1064 -35592 -22434 -7017 -9633 -20165 -29332 -10367 -14169 -2928 7074
5490G074k6454o025P043J6381r791n430j009K494p799l2236J0662n495l509l263
$$ 7074 -19380 -25405 -18362 -1981 -11772 -17202 -18211 -15717 -23516 -55752 -45090 -50585 -54094 -57357
5476e7357J300Q791K2028J9737o77P576m676j4501j3401k809J3457q697j3227
$$ -57357 -56057 -47266 -25238 -5501 -6178 1398 -3278 -17779 -31180 -33989 -20532 -29229 -42456
5463d2456k395q437O174J4704j3682L375K119J5584L8672l955n945k2234L624
$$ -42456 -44851 -53288 -47114 -32410 -46092 -42717 -40598 -25014 13658 9703 3758 -18476 -14852
5450a4852M220q989J118j495o556P069K0319K8519j7166j5948R063K495q764j2597
$$ -14852 -10632 -19621 -18503 -19998 -26554 -19485 834 29353 12187 -3761 5302 7797 -967 -13564
5436a3564q650R092Q630Q838j9395l1042J1690L6782k0184k9717r638k629K9573
$$ -13564 -22214 -13122 -4492 4346 -15049 -46091 -34401 2381 -17803 -47520 -57158 -59787 -30214
5423c0214M0155l885n846P648J326n440j3140L332K3982K3971K699j180L0917
$$ -30214 9941 6056 210 7858 9184 3744 -9396 -6064 17918 41889 44588 43408 74325
5410G4325k4214k3760k8207j1836J9723p654k0432k1760N401M6603J2389J4898
$$ 74325 50111 26351 -1856 -13692 6031 -1623 -22055 -43815 -38414 8189 20578 35476
5398C5476n892j9965k6643j3296P130J0337j3513oJ1631j3189J7297J8302q012
$$ 35476 29584 9619 -17024 -30320 -23190 -12853 -26366 -26372 -14741 -27930 -10633 7669 -343
5385c43j9132J1583J8266k2258j0335m626k7685P67Q297K3890K8377L3838J27
$$ -343 -19475 -7892 10374 -11884 -22219 -26845 -54530 -53763 -45466 -21576 6801 40639 40766
5372D0766j7121J2664J9779j8742k1448j1178j2066K421j854k4727L294N170L3175
$$ 40766 23645 36309 56088 37346 15898 4720 -7346 -4925 -6779 -31506 -28212 -23042 10133
5359A0133K6154l5970k6289K1028o904j240r262j2559K3414K923j2284j0183Q399
$$ 10133 36287 317 -25972 -4944 -11848 -13088 -22350 -34909 -11495 -8572 -20856 -31039 -22640
5346b2640l445p689M023L510l782J4899j2394j0794J2206j93k640j7070q960M677
$$ -22640 -26085 -33774 -29751 -26241 -30023 -15124 -27518 -38312 -26106 -26299 -28939 -46009 -54969 -50292
5332e0292K9708J9118P034J837q859R406n306j0600k348J6643N161q279J8147
$$ -50292 -20584 -1466 5568 7405 -1454 7952 2646 -7954 -10302 6341 11502 3223 21370
5319B1370J847j1116J263j2619N147O906M901O922R456k2305K976J2633j0551
$$ 21370 23217 12101 13364 745 5892 12798 17699 24621 34077 11772 14748 27381 16830
5306A6830k5424j1862J0750J8633J2329l0994k791J5974M442k441R203m147l9796
$$ 16830 -8594 -20456 -9706 8927 21256 -9738 -12529 3445 7887 5446 14649 10502 -29294
5293b9294J156K1093R637j2489m314k2788Q618L7615j9761k1952N854j436O129
$$ -29294 -28138 -7045 2592 -9897 -14211 -36999 -28381 9234 -10527 -32479 -26625 -28061 -21932
5280b1932n544o734m005l285K6228j4409K2529N722j2853m03N526J1392P382k6223
$$ -21932 -27476 -34210 -38215 -41500 -15272 -29681 -7152 -1430 -14283 -14686 -9160 2232 9614 -16609
5266a6609m4747l285Q211L6318Q210l0978L189k793J0024J623J8281J1051N616
$$ -16609 -61356 -64641 -56430 -20112 -11902 -42880 -39691 -42484 -32460 -30837 -12556 -1505 4111
5253D111o983j7282K5218K0440j1598N440J4947j8629k7218j9271k0915l477P996
$$ 4111 -2872 -20154 5064 25504 13906 19346 34293 15664 -11554 -30825 -51740 -55217 -47221
5240d7221R099N331J4782K7263O6j7252J0465J7085j1061l4793K103J2250P65
$$ -47221 -38122 -32791 -18009 9254 9320 -7932 2533 19618 8557 -26236 -24133 -11883 -11118
5227a1118K912Q569j1943k514R64L874J853k4622j1660P595M39J8183k135j4396
$$ -11118 -8206 363 -11580 -14094 -13130 -9256 -7403 -32025 -43685 -36090 -35651 -17468 -19603 -33999
5213c3999n610J5465P141Q676k5202O866P16R167J4378k326m796r380K5083M0764
$$ -33999 -39609 -24144 -17003 -8327 -33529 -26663 -25947 -16780 -2402 -4728 -9524 -18904 6179 46943
5199D6943J4495k2477j3629m512j95k8233k8456l401J3712r938P684J3757L919
$$ 46943 61438 38961 25332 20820 20625 -7608 -36064 -39465 -25753 -35691 -28007 -14250 -10331
5186a0331L2092K4526p192k7531j8311j2686j5311o508N6525L3121p227k1342
$$ -10331 21761 46287 39095 11564 -6747 -19433 -34744 -41252 15273 48394 41167 19825
5174A9825m3848j6131j0939K2908M2549J7036J6103j7778m705K1578j3914k2130
$$ 19825 -24023 -40154 -51093 -28185 14364 31400 47503 29725 25020 46598 32684 10554
5162A0554n581n334J7420P664q5k282l603O476N08J7243k5011l3824M327J7479
$$ 10554 4973 -361 17059 24723 24638 22356 18753 25229 25737 42980 17969 -15855 -11528 5951
5148E951J833p276J4515R50P32L1109m313l0452l3048J2354P967O362J1698j3789
$$ 5951 7784 508 15023 15973 16705 47814 43501 13049 -19999 -7645 322 6684 18382 4593
5134D593k9833M469r945l773J2086J2773J6115J3526R62J0259Q243j2181k7764
$$ 4593 -25240 -20771 -30716 -34489 -22403 -9630 6485 20011 20973 31232 39475 27294 -470
5121d70j3351k2072j8659J9151J3169l483r02o606K620j3157j3921J6857J0590
$$ -470 -13821 -35893 -54552 -35401 -22232 -25715 -26617 -33223 -30603 -43760 -57681 -40824 -30234
5108c0234K0883Q247r762K2459K9623j0778l0172j4293j0134j5668J715L946K0402
$$ -30234 -9351 -1104 -10866 11593 41216 30438 266 -14027 -24161 -39829 -38114 -34168 -13766
5095a3766N808r149J612k0263j6878k868R378R800J0127l784R680j6935r155L278
$$ -13766 -7958 -17107 -15495 -35758 -52636 -55504 -46126 -36326 -26199 -29983 -20303 -37238 -46393 -43115
5081d3115K1723K5101J8634l127m308l308p923o233l2666L422k1502Q118J962
$$ -43115 -21392 3709 22343 19216 14908 11600 3677 -2556 -35222 -31800 -53302 -45184 -43222
5068d3222K2991J0891j1975J7021o953K081P234M1282M96j1618R198j5829O68
$$ -43222 -20231 -9340 -21315 -4294 -11247 -9166 -1932 39350 39846 28228 37426 21597 22265
5055B2265J0120j9838p699K1028P05m4941n296J0709L056k4581o560J3781o567
$$ 22265 32385 12547 4848 25876 26581 -18360 -23656 -12947 -9891 -34472 -41032 -27251 -33818
5042c3818J084j0599J4273J8619R630k818k6434K111K068K5875J2201j8128j6539
$$ -33818 -32734 -43333 -29060 -10441 -811 -3629 -30063 -27952 -25884 -9 12192 -5936 -22475
5029b2475j0213P600K3272L959R10P95l1330k9069m208r274J7173K8006m884j2057
$$ -22475 -32688 -25088 -1816 2143 3053 3848 -27482 -56551 -60759 -70033 -52860 -24854 -29738 -41795
5015d1795P359J4847m085j9837J0302J1088l476j083K4818j3803L180K733J3348
$$ -41795 -34436 -19589 -23674 -43511 -33209 -22121 -25597 -26680 -1862 -15665 -12485 -9752 3596
5002C596N775q908L583R096q531j2036j2573N632k834K2753l289L0576q459l4913
$$ 3596 9371 463 4046 13142 4611 -7425 -19998 -14366 -17200 5553 2264 32840 24381 -10532
4988a0532l9316r809K94K1226K2251K726j0086L533K0889j1560J4878K4265P455
$$ -10532 -49848 -59657 -59363 -38137 -15886 -13160 -23246 -19713 1176 -10384 4494 28759 36214
4975C6214r934n4164o548M6790R417j3033l259p373l140K6241m637m440m312J740
$$ 36214 26280 -27884 -34432 12358 21775 8742 5483 -1890 -5030 21211 16574 12134 7822 9562
4961I562k734J883N395k364j6872L416R254j549N554K2O804p711j2390q83k0083
$$ 9562 6828 8711 14106 11742 -5130 -1714 7540 5991 11545 11567 18371 10660 -1730 -2613 -22696
4946b2696j1868M663J247Q691n557P226j1530q336K5859L4737Q533j4772m215
$$ -22696 -34564 -29901 -28654 -19963 -25520 -18294 -29824 -38160 -12301 22436 30969 16197 11982
4933A1982k2882J2730K8520j3101r424L9694K9252l353k4386j1022L776j7877
$$ 11982 -10900 1830 30350 17249 7825 47519 76771 73418 49032 38010 41786 23909
4921B3909j5376R189L6889p593l0688j505j1069o918j850k3110Q898L0928n456
$$ 23909 8533 17722 54611 47018 16330 14825 3756 -3162 -5012 -28122 -19224 11704 6248
4908F248j6637j0403m5669l0782J9205J7259N834J3272J6106K420k5410k116J8922
$$ 6248 -10389 -20792 -66461 -97243 -78038 -60779 -54945 -41673 -25567 -23147 -48557 -50673 -31751
4895c1751J1904j3777K7311J6989q427L896k8326o852K87J0657L1009O960J1722
$$ -31751 -19847 -33624 -6313 10676 2249 6145 -22181 -29033 -28746 -18089 12920 19880 31602
4882C1602j3447j7697m318k948J668Q457J6782m826k4592J0463O754K65J4576
$$ 31602 18155 458 -3860 -6808 -5140 3317 20099 15273 -9319 1144 7898 8163 22739
4869B2739j6061n394J2541O131Q101j5053q550k536n800K1912j6490k6316N015
$$ 22739 6678 1284 13825 19956 28057 13004 4454 1918 -3882 18030 1540 -24776 -19761
4856a9761j3146K46Q213o701M984M0r693K5381K7768Q343l2775j0523M158K400
$$ -19761 -32907 -32661 -24448 -31149 -26165 -26125 -35818 -10437 17331 25674 -7101 -17624 -13466 -11066
4842a1066M837J0707J3105L023j0385K5278j9638K861m702J1792j704j1737j1148
$$ -11066 -6229 4478 17583 20606 10221 35499 15861 18722 14020 25812 24108 12371 1223
4829A223k7432r170K0584J6303m369O142N712K1985o504j0921n135K3829K496
$$ 1223 -26209 -35379 -14795 1508 -2861 3281 8993 30978 24474 13553 8418 32247 34743
4816C4743k3200L373J1997M91l802J5890R117j3434j0671l1502l232r30K5040
$$ 34743 11543 14916 26913 27404 23602 39492 48609 35175 24504 -6998 -10230 -11160 13880
4803A3880O079k4213j7821n097j1119K4031K0679N020R682J0307l265k0057P451
$$ 13880 19959 -4254 -22075 -27172 -38291 -14260 6419 11439 21121 31428 28163 8106 15557
4790A5557O479j3170l5443Q528J072Q639M0334O639p857k9364k7405P265j1413
$$ 15557 22036 8866 -26577 -18049 -16977 -8338 31996 38635 30778 1414 -25991 -18726 -30139
4777c0139k5238N805J494J203J2970O704j8604j5740K481p025j8432L3528O281
$$ -30139 -55377 -49572 -48078 -46875 -33905 -27201 -45805 -61545 -59064 -66089 -84521 -50993 -44712
4764d4712j664L8724Q725k3571k8024J6645J3481J8470M361j3677J536o075N638
$$ -44712 -46376 -7652 1073 -22498 -50522 -33877 -20396 -1926 2435 -11242 -9706 -15781 -10143
4751a0143Q884j4752j1052o697J2571J9045j695K909n221Q193R137L3015j2364
$$ -10143 -1259 -16011 -27063 -33760 -21189 -2144 -3839 -930 -6151 2042 11179 44194 31830
4738C1830p535l352j7452K1989Q062k6049j363O749R43k0938m857L9482J1279
$$ 31830 24295 20943 3491 25480 33542 7493 6130 12879 13822 -7116 -11973 27509 38788
4725C8788n3878k2326r178J4724K7622p874K8598L5042n868n5565j1248K3975
$$ 38788 -15090 -37416 -46594 -31870 -4248 -12122 16476 51518 45650 -9915 -21163 2812
4713B812M952j731j8820r333n26J6965J0909k66J635p789M204R070Q16N325r695
$$ 2812 7764 6033 -12787 -22120 -22646 -5681 5228 4962 6597 -1192 3012 12082 12898 18223 8528
4698H528r559J5942K6483l233n555q796J3690N943k3392k3787l89j0860R637p680
$$ 8528 -1031 14911 41394 38161 32606 23810 37500 43443 20051 -3736 -4125 -14985 -5348 -13028
4684a3028j6882P849J2109p05k4205j1826R449J1815J0698N738R107j5234j2680
$$ -13028 -29910 -22061 -9952 -10657 -34862 -46688 -37239 -25424 -14726 -8988 119 -15115 -27795
4671b7795Q293K9309j1067k8015j962J6279J5367j6870j2381Q7L440J5716J033
$$ -27795 -19502 9807 -1260 -29275 -31237 -14958 409 -16461 -28842 -28755 -25315 -9599 -8566
4658h566K2144j6937k0161j1430J456q392K3036L064L0113J1493l784M673k3326
$$ -8566 13578 -3359 -23520 -34950 -33494 -41886 -18850 -15786 14327 25820 22036 26709 3383
$$ [...]
##END NTUPLES=NMR SPECTRUM
##END=
