##TITLE=Analysis number 328559
Compound Code cc 60506
Book Reference 494/184
Project Code adrs
Chemist Name craigr
##JCAMPDX= 6.0         $$ Bruker NMR JCAMP-DX V2.0
##DATA TYPE= NMR SPECTRUM
##DATA CLASS= NTUPLES
##ORIGIN= Bruker BioSpin GmbH
##OWNER= nmr
$$ XWIN-NMR		Version 3.5
$$ Fri Jun 15 13:15:31 2007 GMT Daylight Time (UT+1h)  MAYBRIDGE\nmr@NMR_250MHZ
##.OBSERVE FREQUENCY= 250.131544655141
##.OBSERVE NUCLEUS= ^1H
##.ACQUISITION MODE= SIMULTANEOUS (DQD)
##.ACQUISITION SCHEME= undefined
##.AVERAGES= 16
##.DIGITISER RES= 18
##SPECTROMETER/DATA SYSTEM= dpx250
##.PULSE SEQUENCE= zg30
##.SOLVENT NAME= CDCl3
##.SHIFT REFERENCE= (INTERNAL, CDCl3, 0, 16.522)
##AUDIT TRAIL= $$ (NUMBER, WHEN, WHO, WHERE, WHAT)
$$ ##TITLE= Audit trail, XWIN-NMR		Version 3.5
$$ ##JCAMPDX= 5.01
$$ ##ORIGIN= Bruker BioSpin GmbH
$$ ##OWNER= nmr
$$ C:\u/data/dgb/nmr/ADRS/990/pdata/1/auditp.txt
$$ ##AUDIT TRAIL=  $$ (NUMBER, WHEN, WHO, WHERE, WHAT)
(   1,<2007-06-15 13:15:11.25 +100>,<MAYBRIDGE\nmr>,<NMR_250MHZ>,
      <created by zg, POWCHK disabled, PULCHK disabled
       configuration hash MD5:
       76 6E 9A 78 1E 09 19 81 EC 84 63 8F B0 6A 59 2D
       data hash MD5: 64K
       60 8E 61 1A 9A 44 F1 47 E1 7C 28 7C 31 56 F1 16>)
(   2,<2007-06-15 13:15:22.72 +100>,<MAYBRIDGE\nmr>,<NMR_250MHZ>,
      <Start of raw data processing
       ef LB = 0.3 FT_mod = 6 PKNL = 1 SI = 32K 
       data hash MD5: 32K
       18 05 CB 6B 91 D4 BC A6 AD 8D 7A 1E EB AB 0C 20>)
(   3,<2007-06-15 13:15:24.44 +100>,<MAYBRIDGE\nmr>,<NMR_250MHZ>,
      <apk 
       data hash MD5: 32K
       6D C3 CC 7C 60 43 33 87 1B 9A 3D 47 E4 B0 D6 86>)
(   4,<2007-06-15 13:15:25.19 +100>,<MAYBRIDGE\nmr>,<NMR_250MHZ>,
      <abs ABSG = 5 
       data hash MD5: 32K
       88 07 BF 85 A6 7C 5C 1B 31 C7 30 D2 AB 3A 6A 03>)
$$ ##END=
$$ 
$$ hash MD5
$$ C5 F6 78 63 ED 6C 7A 62 35 1A 1B 3E DA 8B 29 0F
##$RELAX= 
##$RELAX= 
##$RELAX= 
##$RELAX= 
##$RELAX= 
##$RELAX= 
##$RELAX= 
$$ Bruker specific parameters
$$ --------------------------
##$DU= <C:\u>
##$EXPNO= 990
##$NAME= <ADRS>
##$PROCNO= 1
##$TYPE= <nmr>
##$USER= <dgb>
##$AMP= (0..31)
100 100 100 100 100 100 100 100 100 100 100 100 100 100 100 100 100 100 
100 100 100 100 100 100 100 100 100 100 100 100 100 100 
##$AQSEQ= 0
##$AQ_mod= 3
##$AUNM= <au_zg>
##$AUTOPOS= <22 >
##$BF1= 250.13
##$BF2= 250.13
##$BF3= 250.13
##$BF4= 250.13
##$BF5= 500.13
##$BF6= 500.13
##$BF7= 500.13
##$BF8= 500.13
##$BYTORDA= 1
##$CFDGTYP= 0
##$CFRGTYP= 5
##$CHEMSTR= <none>
##$CNST= (0..31)
1 1 145 1 1 1 1 1 1 1 1 1 1 1 1 1 1 1 1 1 1 1 1 1 1 1 1 1 1 1 1 1 
##$CPDPRG= <>
##$CPDPRG1= <>
##$CPDPRG2= <>
##$CPDPRG3= <>
##$CPDPRG4= <mlev>
##$CPDPRG5= <mlev>
##$CPDPRG6= <mlev>
##$CPDPRG7= <mlev>
##$CPDPRG8= <mlev>
##$CPDPRGB= <>
##$CPDPRGT= <>
##$D= (0..31)
0 1 0 0 0 0 0 0 0 0.06 0 0 0 0 0 0 0.0002 0 0 0 0 0 0 0 0 0 0 0 0 0 0 
0 
##$DATE= 1181909710
##$DBL= (0..7)
120 120 120 120 120 120 120 120 
##$DBP= (0..7)
150 150 150 150 150 150 150 150 
##$DBP07= 0
##$DBPNAM0= <>
##$DBPNAM1= <>
$$ [...]
##$SUBNAM7= <"">
##$SUBNAM8= <"">
##$SUBNAM9= <"">
##$SW= 20.6930455092707
##$SWIBOX= (0..15)
0 0 3 0 0 0 0 0 0 0 0 0 0 0 0 0 
##$SW_h= 5175.983436853
##$TD= 65536
##$TD0= 1
##$TE= 297.16
##$TE2= 300
##$TE3= 300
##$TEG= 300
##$TL= (0..7)
0 120 120 120 120 120 120 120 
##$TP= (0..7)
150 150 150 150 150 150 150 150 
##$TP07= 0
##$TPNAME0= <>
##$TPNAME1= <>
##$TPNAME2= <>
##$TPNAME3= <>
##$TPNAME4= <>
##$TPNAME5= <>
##$TPNAME6= <>
##$TPNAME7= <>
##$TPOAL= (0..7)
0.5 0.5 0.5 0.5 0.5 0.5 0.5 0.5 
##$TPOFFS= (0..7)
0 0 0 0 0 0 0 0 
##$TUNHIN= 0
##$TUNHOUT= 0
##$TUNXOUT= 0
##$USERA1= <user>
##$USERA2= <user>
##$USERA3= <user>
##$USERA4= <user>
##$USERA5= <user>
##$V9= 5
##$VALIST= <valist>
##$VCLIST= <CCCCCCCCCCCCCCC>
##$VD= 0
##$VDLIST= <DDDDDDDDDDDDDDD>
##$VPLIST= <PPPPPPPPPPPPPPP>
##$VTLIST= <TTTTTTTTTTTTTTT>
##$WBST= 1024
##$WBSW= 4
##$XGAIN= (0..3)
0 0 0 0 
##$XL= 0
##$YL= 0
##$YMAX_a= 475933
##$YMIN_a= -302661
##$ZGOPTNS= <>
##$ZL1= 120
##$ZL2= 120
##$ZL3= 120
##$ZL4= 120
##$ABSF1= 16.522
##$ABSF2= -4.171173
##$ABSG= 5
##$ABSL= 3
##$ALPHA= 0
##$AQORDER= 0
##$ASSFAC= 0
##$ASSFACI= 0
##$ASSFACX= 0
##$ASSWID= 0
##$AUNMP= <proc_1d>
##$AZFE= 0.1
##$AZFW= 0.1
##$BCFW= 0
##$BC_mod= 0
##$BYTORDP= 0
##$COROFFS= 0
##$CY= 12.5
##$DATMOD= 1
##$DC= 0
##$DFILT= <>
##$DTYPP= 0
##$F1P= 14.0000005364418
##$F2P= -0.99999901652339
##$FCOR= 0.5
##$FTSIZE= 32768
##$FT_mod= 6
##$GAMMA= 0
##$GB= 0
##$INTBC= 1
##$INTSCL= 1
##$ISEN= 128
##$LB= 0.3
##$LEV0= 0
##$LPBIN= 0
##$MAXI= 10000
##$MC2= 0
##$MEAN= 0
##$ME_mod= 0
##$MI= 0
##$NCOEF= 0
##$NC_proc= -2
##$NLEV= 6
##$NOISF1= 0
##$NOISF2= 0
##$NSP= 0
##$NTH_PI= 0
##$NZP= 0
##$OFFSET= 16.522
##$PC= 1
##$PHC0= -55.39609
##$PHC1= 6.656821
##$PH_mod= 1
##$PKNL= yes
##$PPARMOD= 0
##$PSCAL= 4
##$PSIGN= 0
##$REVERSE= no
##$SF= 250.13
##$SI= 32768
##$SIGF1= 0
##$SIGF2= 0
##$SINO= 400
##$SIOLD= 32768
##$SREGLST= <1H.CDCl3>
##$SSB= 0
##$STSI= 32768
##$STSR= 0
##$SW_p= 5175.98343685301
##$SYMM= 0
##$S_DEV= 0
##$TDeff= 65536
##$TDoff= 0
##$TI= <Analysis number 999999
Compound Code 99
Book Reference 9
Project Code 9>
##$TILT= no
##$TM1= 0
##$TM2= 0
##$TOPLEV= 0
##$USERP1= <user>
##$USERP2= <user>
##$USERP3= <user>
##$USERP4= <user>
##$USERP5= <user>
##$WDW= 1
##$XDIM= 32768
##$YMAX_p= 361816830
##$YMIN_p= -91627
$$ End of Bruker specific parameters
$$ ---------------------------------
##NTUPLES= NMR SPECTRUM
##VAR_NAME=  FREQUENCY,     SPECTRUM/REAL,   SPECTRUM/IMAG
##SYMBOL=    X,             R,               I
##VAR_TYPE=  INDEPENDENT,   DEPENDENT,       DEPENDENT
##VAR_FORM=  AFFN,          ASDF,            ASDF
##VAR_DIM=   32768,         32768,           32768
##UNITS=     HZ,            ARBITRARY UNITS, ARBITRARY UNITS
##FACTOR=    0.157963299565203, 1,           1
##FIRST=     4132.6476996994, 0,             0
##LAST=      -1043.33573715361, 0,           0
##MIN=       -1043.33573715361, -91627,      0
##MAX=       4132.6476996994, 361816830,     0
$$ Real data points
##PAGE= N=1
##DATA TABLE= (X++(R..R)), XYDATA
$$ [...]
24213 -449 5095 2746 1083 4765 567 -4181 -3502 -3566 2073 3617 -5928 -5837 -2784 1032 2811 993
24197 993 -54 1592 7365 6182 9660 11002 9646 1375 -4602 -7638 -8121 -6645 -1359 -575 -126 5367
24181 5367 8688 11204 6740 4835 3845 1356 -3162 -4898 -5272 -3854 1043 6251 2367 -946 2843
24166 2843 2141 -4431 -9081 -4726 -4230 -6213 -8992 -11056 -9345 -6794 -5855 -776 283 -5621 -12113
24151 -12113 -10603 -7439 -797 3067 -2613 -7284 -7668 -9788 -8317 -4472 -3367 -4386 541 3029 11062
24136 11062 14847 9061 6038 4316 1954 3888 7268 9032 4381 -6319 -5756 -6853 -8844 -10706
24122 -10706 -12669 -16044 -12676 -4456 -6400 -8248 -12398 -9463 -5122 4411 9425 3693 2572 -1564
24108 -1564 -7838 -2301 416 2181 5614 3464 2164 6456 2878 2683 -1301 -4528 -5248 369 6957
24093 6957 6259 8199 7439 5533 4241 2910 -3416 -7290 -4522 -3535 -3176 2133 -65 -6607 -5779 993
24077 993 3140 3041 -1670 -1999 581 -2492 4591 5338 569 -5724 -12918 -12117 -11354 -1415 2484 -1166
24061 -1166 1733 4053 7711 2804 198 3242 -2180 -6661 -5962 -4935 -3130 -6331 -4410 -5698 -8886
24046 -8886 -4853 105 -3493 -5316 -1391 605 -5632 -4758 -1968 -3506 531 615 7488 13490 9632
24031 9632 10275 8403 4177 6861 15388 18074 19819 15134 12082 6194 4257 7034 8235 7939 6540
24016 6540 3923 2774 1626 843 -9 245 156 1974 2760 3534 8217 7631 7062 13218 10442 9460 6245
23999 6245 964 2980 -5440 -5017 -5075 1170 4854 3966 3852 -2978 -6098 -5160 10011 15493 11116 9908
23983 9908 11694 4912 -4010 -13671 -4195 6324 6331 2204 6271 2684 -1980 -4465 -8203 -11940 -4958
23968 -4958 -6742 -2445 2970 -2415 -5780 -9906 -9774 -4701 -7043 -12048 -7878 -628 8181 8128 6325
23953 6325 12476 15214 8996 9926 9079 2333 -3530 5776 7754 9723 9531 5928 666 -4888 -7332
23938 -7332 -7118 -3210 -4102 -4720 -9541 -6490 515 -1024 -7686 -3734 2103 6158 7762 4636 -389
23923 -389 1442 -1609 -2394 4960 3400 2153 920 358 4315 5741 6491 -883 828 1465 4813 5009
23907 5009 9201 12352 9708 8472 11093 6924 -2384 -2079 -5265 -3987 17 4514 2550 -3822 -2842
23892 -2842 -3764 -4529 2196 3827 -7902 -9082 -7115 -8611 -7249 -8857 -4418 1131 8806 12634 5802
23877 5802 7697 6705 5885 -2283 -6738 -219 1586 2948 2137 -2723 -2606 -6038 -9166 -10796 -8762 -6011
23861 -6011 -4894 -1758 -2091 4730 4226 2293 7213 8754 -689 -5254 1244 -3802 -9014 -10733 -5338
23846 -5338 4303 5943 9473 8192 2676 5047 6811 7020 3251 6168 13375 11257 5298 1622 -1000
23831 -1000 -808 3668 7941 5536 10095 8218 5925 5069 722 -3148 -706 2469 2769 -2066 -4446
23816 -4446 -9423 -4448 -4506 -7929 -4673 -5860 -11213 -15919 -9935 -15263 -14397 -7434 -12631 -9764 -5374
23801 -5374 -12375 -15687 -13700 -7147 -5347 -2544 325 -1220 -3150 -3603 -4540 -5523 -8202 -3617 3718
23786 3718 5719 12023 8641 -1922 -2622 -9125 -7745 -8615 -7439 -190 3801 3098 -709 -4896 -1586
23771 -1586 1317 -2355 -10536 -12840 -15679 -12830 -6666 -3024 3854 3965 3364 3138 9373 5677 -8969
23756 -8969 -9388 -7651 -4938 -2285 267 3113 5094 -783 -6451 -6898 -3048 -2862 -10977 -16074 -14199
23741 -14199 -10286 -9293 -12542 -9855 -7316 -6402 -4585 -2240 -4640 1259 6020 2493 425 2369 -1693
23726 -1693 -5119 -3136 3613 3483 464 3445 -1265 -4596 -5910 -11230 -13543 -6761 -9280 -5721 -9672
23711 -9672 -12381 -13146 -7299 -2457 4341 5896 -2436 -12343 -12480 -5204 -1743 -6332 -6251 -2954 -1390 1233
23695 1233 1433 -1045 1185 3418 166 5741 2319 -7271 -10727 -10494 -4034 -1872 -3190 -2404 -7811
23680 -7811 -11199 -10774 -7936 -7245 -6630 -2327 -1840 765 6268 5469 3053 5429 4528 258 1325 108
23664 108 8010 10641 7707 4617 -2992 -5095 -2839 -1719 -602 1009 5811 3845 -4388 -5874 -5324
23649 -5324 -2956 -2049 -2360 -5019 -6562 -9484 -8779 -9596 -5178 -4631 -1692 754 -1061 -3444 -3721 4923
23633 4923 4697 1445 1312 8047 -6004 -11758 -9344 -4096 3181 9531 12191 7424 3233 -3345 -7531
23618 -7531 -7930 -10613 -10479 -9793 -4633 7993 9420 5394 4259 249 -378 806 4079 371 -5900
23603 -5900 -5655 710 9728 4929 -627 -10519 -12927 -9858 -4828 1254 -3076 -17364 -17688 -12597 -805
23588 -805 2900 -3226 -55 -1218 -1327 -2679 1606 -333 1438 8199 10592 8570 970 -8463 -6672
23573 -6672 -5115 -2516 -4960 -5841 -5006 -4473 -264 5473 2675 -6509 -9240 -16404 -16165 -13008 -8458 -5715
23557 -5715 -2576 -3894 -6194 -4980 -2170 4169 728 2871 8190 5877 3558 2980 1399 -2079 -2267
23542 -2267 -1007 -3808 -1542 456 -1280 -900 11884 10197 6248 -3356 -14501 -8019 1013 -1116
23528 -1116 -9343 -3407 3753 1938 370 202 4325 7407 11590 5572 -2111 -3426 4065 6609 7262
23513 7262 2042 2343 2857 5532 6617 1892 1525 2537 -4 -5300 -9447 -4396 -8086 -11373 -11709 -6334
23497 -6334 1439 4807 8203 -325 423 380 4415 5709 7235 1337 1060 2780 -108 -9052 -14005 -9039
23481 -9039 -7607 -9665 -2927 -5359 -7837 -8640 -4982 2055 4090 3998 -656 -5622 -4033 3104 4881
23466 4881 2812 -784 1799 5574 787 -2842 -2298 -3641 -5791 2466 5853 2634 3731 5313 2086
23451 2086 6435 10858 6006 5572 3628 -1737 -5817 -1587 4775 12090 14242 9886 3716 -2949 -2140
23436 -2140 4324 246 3819 4932 5747 4473 4901 5051 3243 4128 166 1234 -6443 -8176 -5775 764
23420 764 2938 2323 -5568 -8460 -5064 -4821 -2363 -1769 -5573 -2588 -437 776 2185 -4162 -6667 -925
23404 -925 4936 9003 8768 2864 -2205 4087 7592 10261 11661 9163 205 762 7028 7064 2587 -1194
23388 -1194 5357 2655 -1187 -2724 -8417 -13662 -7399 -320 -4876 -10649 -7739 -3589 -700 -74 -4376
23373 -4376 -5618 -4956 -5271 -1389 -1102 -2202 -6290 -7240 -2556 1452 -1115 484 5006 4092 3953 5317
23357 5317 2309 -2060 -3307 -4230 -11809 -7892 3381 -725 -8897 -1458 4578 12517 14624 14980 9227
23342 9227 -712 -741 4796 7637 5966 7259 3882 1695 49 -336 2219 5180 -7034 -10257 -5807
23327 -5807 -6969 -8498 -9228 -4307 5572 8907 6185 1266 -6351 -10376 -8763 -4759 -3730 -4236 -5282
23312 -5282 1073 5111 4435 1633 -1617 -1991 -2163 -3033 -1330 -1080 -4098 -4583 2788 1787 -6480 -10907
23296 -10907 -11069 -12817 -15631 -15096 -8860 -4263 -92 5069 4835 2599 84 3543 -7049 -11716 -8901
23281 -8901 -8455 -6826 -2464 -3933 -2992 2739 1441 -4107 -4685 -2390 -9640 -14351 -7226 3045 9065
23266 9065 8749 5434 2207 -2505 -1031 2203 3656 -3389 -1962 1400 5291 3981 -3756 -9428 -5074
23251 -5074 -7522 -11167 -11184 -10457 -10911 -3198 2752 1516 1590 3200 -4398 -3961 -7821 -5896 -1321 -4121
23235 -4121 1128 4457 13337 13592 11690 6218 -371 -2663 167 5422 -678 2597 2293 -8709 -7567
23220 -7567 -2686 -834 3927 215 -272 2400 7642 4673 1008 -4159 -4428 -5046 -3933 -3056 -109 -5143
23204 -5143 -9704 -17099 -11478 -5235 -188 8603 15152 15744 7452 12 -3197 -7463 -1052 -1509 -3296
23189 -3296 -2249 -5251 -8235 -5551 -6349 1081 4001 -923 -9485 -18196 -11214 -625 1067 -2554 -1423
23174 -1423 7072 6904 9661 3982 -820 -1471 -3621 -4188 -1532 -3550 -9978 -12375 -9380 -6959 -3012
23159 -3012 827 1246 2611 -1182 -1517 1281 956 -4331 -8576 -8050 -10595 -7983 -5635 -5719 -12690 -13352
23143 -13352 -13480 -11741 -8957 -4807 251 -546 -941 -4496 1616 -1599 -4455 -4346 49 -3513 -6538
23128 -6538 -8011 -8249 -5799 -3504 -3016 1556 -4115 -6601 -2479 -1058 -5399 -9431 -6182 511 1533
23113 1533 3175 6946 3463 4947 10295 8425 11282 16199 9950 4686 4337 1273 -2529 -3800 -7354
23098 -7354 -8476 -952 215 1541 1291 -170 1618 3069 3090 2377 1282 6478 6824 -524 -291 -7296
23082 -7296 -8202 -9857 -5680 462 -2053 1335 5972 5378 6075 7062 15588 17465 9582 3973 2590 -331
23066 -331 874 -3326 -4970 3806 10417 2438 727 2124 4347 5675 6166 3974 -934 4810 5686
23051 5686 7353 9072 11339 11847 8555 1985 3456 -933 -7700 -6438 -6838 -10763 -12797 -6956 1973
23036 1973 6750 1777 -5326 -7512 -3842 1608 876 -1934 595 -1867 -4753 -2094 -5367 -5316 -16384
23021 -16384 -18028 -13412 -13546 -14818 -12823 -11931 -6653 -4084 -1569 1069 2721 -1840 3765 3914 -6333
23006 -6333 -14110 -15179 -3329 2882 -4164 -8224 -6893 -2289 1018 -5171 2520 5620 2335 3376
22992 3376 2221 2120 -2204 -3412 2473 8258 3597 425 4612 6264 1492 -332 3777 3764 6580
22977 6580 17016 13655 1851 -4854 -6925 -6296 -6067 -2081 980 -1243 -10801 -9317 -365 7465 14291
22962 14291 14633 6014 -94 -9216 -13232 -7447 -470 -2201 -8614 -12734 -17782 -15071 -6144 -2743 -1305
22947 -1305 -2731 -2223 1433 2018 -669 -3418 -6201 -4970 -5963 -6963 -4104 -2781 1038 4149 5990
22932 5990 737 -3276 -6050 -4886 -4268 -4522 1803 -63 1579 4248 4314 1623 3059 1619 7203 10637
22916 10637 14245 12869 5672 7682 4015 -3001 -6520 -10939 -11992 -11077 -6040 -2107 1163 1235 632
22901 632 -3473 -4162 -7972 -15840 -11371 -2785 -2800 -11781 -10425 -2945 -3376 -2618 4335 5412 1251 -1333
22885 -1333 543 7327 8057 3084 -514 -3993 -6700 -6340 -2095 3874 4923 3938 7598 11209 9485
22870 9485 9222 10455 9279 9425 4979 3643 3913 3086 945 -398 -4233 -5547 -405 808 -2957 -9814
22854 -9814 -11673 -8395 -12263 -14185 -15886 -10986 -2790 -1025 -1157 -3553 -3093 6446 5241 653 1585
22839 1585 -2570 -2714 3290 11041 10952 8354 8643 4910 776 510 4523 10546 10438 5645 2950 2867 1864
22822 1864 1101 -10235 -14149 -15726 -2388 6602 4875 5287 6939 5311 5472 11948 11732 646 -9900
22807 -9900 -17545 -13359 887 3925 -1007 6599 6686 6122 6319 3102 -244 1814 3014 4431 6766
22792 6766 5598 7664 3480 5158 10518 5825 1241 394 -3934 -7155 -4063 -3351 -3583 -2459 -7284
22777 -7284 -1611 -976 138 297 590 798 1831 -1215 -11101 -10187 -5956 -4802 581 6499 3336 7805
22761 7805 2501 -459 -2798 -5152 1057 -1680 -1872 -265 2927 4195 3183 745 -697 606 2576
22746 2576 -4257 -11842 -16047 -16572 -11604 -12632 -16348 -12120 -4529 -3164 -11420 -10286 -4075 -6971 -4665
22731 -4665 -545 1295 4998 5035 222 5610 1263 -1210 -1947 -2822 -3892 -3812 -7629 -2962 -2018 -5762
22715 -5762 -4923 -8848 -13250 -7675 3374 5945 4340 5593 -3034 -7505 -3105 -3884 -1096 -376 3157
22700 3157 2168 -3241 -5972 -4351 -5089 -3173 964 5490 8166 2710 976 -101 443 -3283 -664
22685 -664 2017 -1165 2701 -1341 -2904 -1620 3246 6013 4357 -787 -4611 -5785 -4150 1006 2988
22670 2988 1613 2410 3765 -1116 -5634 865 -2411 1038 6036 8843 9444 -638 -4101 -9275 -9839
22655 -9839 -13544 -16107 -11002 119 3895 645 -6976 -5115 -338 -4899 -8801 -8432 -4597 -3771 -6294
22640 -6294 -5740 -4432 -3454 -5913 -2155 -4851 -3193 -3097 -4369 -3691 -1702 -2158 -10781 -10933 -9176 -5545
22624 -5545 -8253 -8159 -8246 -3125 1583 4595 5547 4753 1048 2794 5074 4929 -329 -7122 -7056 -10355 -7268
22607 -7268 -1472 -2362 -2149 -184 5585 6163 -3119 -2056 -757 -6068 -6152 -7169 -2996 868 -1 -6147
22591 -6147 -7559 -3207 36 1911 4154 -1059 -9966 -4725 2269 2986 172 -1541 -3149 -5297 -4927
22576 -4927 -10111 -3372 -3928 -4825 1463 1813 -1501 -572 1685 2885 4442 3896 -2454 -5224 -3366 -171
22560 -171 755 -1199 -467 -4907 -10405 -3395 4948 1502 -2341 -6878 -10871 -9905 -7372 -4339 4184 8456
22544 8456 3778 3703 4247 2756 3884 1318 7405 13449 9109 5438 3662 3993 1965 3389 -1584 -8595
22528 -8595 -8273 -7221 -10707 -10966 -3633 1840 4116 8125 1904 1902 -3 4288 3142 2076 -142 7940
22512 7940 10828 14198 16426 14679 8811 2874 16 4702 1159 -5852 -1977 75 -964 -3894 -2090
22497 -2090 -2862 -4794 -5181 -8961 -6615 -6759 -7605 -4410 1699 6082 3372 -936 20 3353 1320 192
22481 192 -1642 258 4230 6194 9901 9846 5371 4262 698 -6053 -642 2043 2107 8170 5447 1052
22465 1052 -519 -9166 -14664 -4246 -118 -2545 -8375 -8841 -5446 -5444 1236 3167 -92 -3370 -2868 -2282
22449 -2282 1855 1951 9092 13085 7173 4994 10369 14144 9555 4396 1891 -743 -1658 -1510 2732 2828
22433 2828 3277 2760 -13 2995 1116 -577 -2416 -7919 -8144 -2742 -2530 -1928 56 3873 1406 -262
22417 -262 -4535 -5205 -2206 -4371 -9034 -10642 -12223 -16261 -14271 -6392 -2045 169 1222 -2069 1937
22402 1937 6270 9013 8702 12520 3893 395 6063 4365 -1587 -1774 -1710 -3710 -6204 -8185 -10165 -4326
22386 -4326 2739 9149 11706 9806 1414 -4306 -2704 -1467 -1763 -3946 -1926 1163 2334 -217 -3007
22371 -3007 -5862 -4551 -4772 -7105 -5526 -4643 -4169 -1616 -9597 -14939 -13546 -9858 -10473 -11725 -8091 -5398
22355 -5398 -5918 -8401 -2545 2362 -266 -5734 -9035 -9932 -10396 -9164 -5428 -8628 -9107 -7537 -5712 1567
22339 1567 1173 -3870 -6009 -4646 -2836 2090 2791 1104 -2817 -4188 -5519 -7328 -3781 -4053 -11173
22324 -11173 -19788 -14925 -8120 -4884 -1418 -4332 6942 8120 -5518 -7948 -4221 3113 3159 957
22310 957 -7948 -4833 3266 8863 8562 8211 1215 3484 6339 -2830 -8523 -3926 2240 5050 7361
22295 7361 1570 -10079 -14908 -16826 -13922 -11363 -10027 -8557 -4283 -2957 -5908 -7427 -7387 -6958 -10520
22280 -10520 -12529 -16463 -15580 -13547 -7102 -2376 1803 4882 7389 4708 502 1469 -3458 -8146 -9086
22265 -9086 -5514 -460 -10006 -12426 -9459 -3232 -1340 2921 1445 1034 447 -2340 1978 828 2142
22250 2142 -857 -2186 -3122 -2255 132 -7582 -12291 -18395 -13521 -6224 -8135 -11770 -19287 -17949 -11084
22235 -11084 -4028 -1334 969 -228 -4728 -2759 569 5663 8007 2647 -2231 -8504 -10609 -8323
22221 -8323 -7233 908 1327 -522 -2721 918 4465 1991 -1520 -5366 -2018 -1826 -1755 -1929 -3436 -3687
22205 -3687 183 -5622 -15604 -8408 1410 4745 7306 2468 2417 4477 4110 -577 -4672 -3107 -3383 2691
22189 2691 2048 180 1250 -2690 -8838 -7736 3345 8564 8585 12308 15686 7097 2978 -125 2931
22174 2931 4278 5597 7671 4154 -1297 6216 9955 8146 13905 15843 10323 8669 8809 2451 1743
22159 1743 391 -7844 -6857 -8809 -7568 -5369 -13979 -14314 -11352 -4786 -3830 -3807 -3658 -1021 -3708 6262
22143 6262 8058 5475 3760 1213 -3784 -7898 -9659 -10279 -3808 -2811 -4285 -6599 -4843 -5279 -838
22128 -838 -4315 -8012 -3870 2716 5584 1389 -2587 -5536 -10728 -8845 -6659 -12804 -9319 2708 5449
22113 5449 2601 8117 10959 4759 -5063 -14187 -16116 -13351 -11451 -6561 -5047 -7714 -8372 -9920 -5523
22098 -5523 -2094 -4714 -5103 -5309 -4267 -2911 -1823 -4305 -7415 -708 3841 8770 17070 14940 7370
22083 7370 3296 -664 -7282 -7892 1865 9405 10425 7733 4890 8607 1904 -4003 -5411 -2763 5586
22068 5586 2924 1426 -4245 -9334 -9772 -4675 -6534 -2366 -2938 -2022 1561 -3777 -13951 -13591 -8215
22053 -8215 -1120 2389 3614 5075 3678 3625 4528 5172 3390 4785 10377 9494 8879 3551 -6775 -9457
22037 -9457 -3542 -2303 2648 5156 236 -981 1807 982 1068 1621 3671 7685 777 -1439 -392 520
22021 520 -4960 -10964 -7510 -311 407 5735 2413 -7116 -8169 -2430 2319 1097 -2273 -1936 -1987 -290
22005 -290 2927 3116 2069 2565 2605 -5374 -9149 -9074 -8909 -9782 -6395 -7998 -10323 4307 10147 4045 2825
21988 2825 48 -7714 -9890 -3309 -5127 -8478 -9069 -2506 4207 3385 887 -1156 -1702 874 10264
21973 10264 9130 -2958 -2362 -1636 -2880 -4235 -5911 -7916 -9195 -6500 -4779 -6066 -7781 -10155 -8346
21958 -8346 -8380 -6681 -5994 -8072 -17338 -12460 -9036 -2289 -2091 -7044 -2352 2412 4979 4333 3308 789
21942 789 -3074 -6870 -8660 -3303 -552 3586 -1343 -3696 -1771 1666 -2533 -2758 155 -1223 -435
21927 -435 9118 11471 12627 7669 -4633 -4367 -2235 266 5377 6525 3171 -1171 2040 2265 1432
21912 1432 -971 1261 2665 5220 4843 499 1457 67 -3064 -7693 -3319 -621 -1787 -3420 -3359 -6850
21896 -6850 -2230 1018 -4363 -8892 -4011 188 1473 4218 1385 -1759 -3208 935 -7164 -6515 -3535
21881 -3535 -2256 -6574 -5280 -3448 -2916 -6026 -6352 -5164 -5726 -4859 -1187 1979 878 -297 -5665 -8926
21865 -8926 -3110 630 -7755 -9167 -6218 -3885 -1363 2422 7924 7055 739 1954 2051 6164 9407
21850 9407 12449 8549 2940 -2584 -624 1567 -1547 500 -1472 -5029 -6101 -9982 -2224 -865 -4047
21835 -4047 -1090 6674 6561 1919 8929 8763 7575 1358 -3084 -5067 -5218 -3635 -3091 1155 -1663 1573
21819 1573 4393 3004 -5116 -7822 -2258 -4454 -6090 -7138 -6069 -3470 -8722 -9561 -7281 -10980 -11389
21804 -11389 -8126 -6500 -10551 -7560 -2758 -4396 -6934 -3549 -5728 -6735 -6368 -9713 -8330 -7496 -11369
21789 -11369 -14424 -14703 -12692 -7953 -7341 -11912 -10008 -5693 -542 2070 9956 4398 -2948 -3076 1046
21774 1046 4467 2701 3802 -1150 -10444 -6658 -7451 -17940 -20005 -17639 -14075 -4662 849 1672 4557
21759 4557 752 -1421 -3693 -13870 -13513 -4751 -285 3033 73 -4511 -11606 -12145 -8449 -2364 3655
21744 3655 4397 -3413 -10644 -13840 -4389 -801 -4016 -2576 -2258 -184 2669 -2004 -5163 -4255 1530
21729 1530 -2393 -5248 -2430 -8691 -10364 -8700 -5185 -3655 -5184 -5041 -502 3515 -2682 -5651 -9003
21714 -9003 -6669 -7189 -10894 -12763 -9765 -1545 8373 9828 10042 7888 -1721 -11921 -14749 -10059 -970
21699 -970 -1194 -314 5421 3485 -666 -566 -451 -900 -4781 -2668 -651 2750 2982 4825 1389 -5979
21683 -5979 -6745 -3436 3087 -2371 4 8094 8410 5133 -376 -2083 -706 2213 3812 4630 1400
21668 1400 -6523 -12284 -6382 843 3958 6383 9792 3272 -2006 -826 3816 4631 3492 -734 -7844
21653 -7844 -3466 1707 376 -4226 -2657 -5796 -4215 -3486 -4529 -6547 -10842 -6335 -407 -1782 -1386
21638 -1386 -3916 -7879 -7644 -4178 -8714 -5094 1355 3572 2808 1152 3573 3225 5067 1195 -1755
21623 -1755 -2219 -6547 -7789 -7053 -7344 -5514 -3868 -6364 -2178 711 -459 -321 -936 -1749 -11179 -12182
21607 -12182 148 5605 1615 -3717 318 -4513 1047 1489 389 2648 6264 3454 -850 -2382
21593 -2382 -2098 -2234 -6863 -9151 -10684 -7467 -3646 1718 1241 -2633 -2337 -6278 -8110 -8444 -6635 -2720
21577 -2720 1645 2596 -1309 -8672 -4486 -3680 427 3363 2805 -213 -666 2435 6203 491 -2674 -2207
21561 -2207 657 -62 -8461 -13461 -17334 -16177 -12011 -8691 -10441 -7029 -5660 -6179 -13510 -13673 -7393
21546 -7393 -2669 -7691 -3026 3979 7147 12472 8371 9096 9659 10338 5034 1964 493 -407 1062 3131
21530 3131 3713 3120 832 5266 2134 -10856 -11954 -11090 -8020 -8649 -17803 -10165 -6348 -5569 2164 1908
21514 1908 -1276 -2100 937 -926 -1077 1464 2657 444 1482 1031 1812 -774 -1561 6476 -1996 -3702
21498 -3702 -3202 -3075 -3311 -391 1617 1597 4583 3320 2632 -771 -3990 -1486 -3048 -3036 -4546 -7914 -93
21481 -93 4186 4277 4594 8090 9500 17245 23945 17209 11580 12398 13105 8909 10512 12604 13350 16211 16011
21464 16011 12901 16002 18583 25513 21652 11383 5706 5207 6268 9878 6802 2203 1651 4978 7201
21449 7201 32 -2763 937 1196 7897 13949 10451 6994 10732 2142 -3784 -4587 -2670 -5124 -10497
21434 -10497 -7367 -4255 2414 933 -4633 -9070 -6156 1719 1896 -5199 -8257 -7470 -1749 2111 1447
21419 1447 7128 12462 7058 -4683 -12286 -16585 -9785 -6410 -4089 -5577 -1793 4228 3533 -2322 -12107
21404 -12107 -6900 -5819 -3010 -5032 -1294 1325 -1046 -5240 -11492 -6895 -2552 499 -2274 -9426
21390 -9426 -8036 -1308 1323 -1138 -5503 1572 6569 1643 -1799 -1946 -7406 -12491 -7566 -1278 -7135
21375 -7135 -14839 -14524 -11069 -8128 -2414 -2152 -7298 -6143 -1354 -408 200 4046 3409 -3842 -7750 -8067
21359 -8067 -6865 -1316 -67 -2093 3055 -339 -3445 -5112 -2082 -631 1098 2841 5412 7867 3195
21344 3195 -4625 -10070 -11030 -7220 -914 9313 3120 -6198 -7282 -2297 1123 -989 -184 268 561
21329 561 193 4552 5578 3118 -1581 -3993 -3770 2642 2658 -6235 -9418 -3771 -922 -671 687 5226
21313 5226 4832 1151 -989 -5332 -6727 -345 540 1275 -1647 -4199 3422 2057 -485 2509 1524 1779
21297 1779 208 -3361 -4650 -4654 -10480 -9561 -8196 -1752 -802 1488 2135 -4579 -10242 -7354 -7638 -11713
21281 -11713 -13327 -13384 -17311 -23707 -22003 -12542 -2125 3946 4855 4588 9720 7166 7110 175 -1249 -2741
21265 -2741 -1233 7756 6960 -209 -4418 -2376 -2550 -12145 -14929 -12304 -13068 -8958 -2473 3135 -5
21250 -5 -1670 3832 684 -753 -6748 -8227 -7016 -10575 -4073 -3787 -4814 -6227 -4287 -7093 -7896 -1303
21234 -1303 -448 -227 -1916 -3206 461 -4269 -8563 -6080 808 -4745 -13785 -14419 -9908 -6603 -2828
21219 -2828 -201 2964 -691 -5472 -4041 -5151 -11580 -10509 -8757 -1711 -1199 -7119 -5219 1027 7292
21204 7292 -3605 -4267 81 1232 3645 -4325 -3344 6532 5750 3363 1458 -1359 -39 18 472 3434
21188 3434 8839 4461 -3899 -10098 -10718 -15190 -7894 614 4976 -1391 -902 -464 -2124 5203 9623
21173 9623 2301 -1170 25 29 5872 5759 6899 5175 -95 5653 2412 5738 10236 10339 5633 2675
21157 2675 756 -1270 -5333 -15556 -19572 -13640 -7449 -4139 -3672 -2535 -1886 -3336 -989 5262 4719
21142 4719 3104 -1398 -5767 -6411 -7876 -9456 -1149 -4316 -5778 -877 -4502 -1326 -666 -2018 -5493
21127 -5493 -7180 -4689 -2632 -1529 2146 4861 3150 3552 -1235 -6064 -9868 -5617 -1228 -3123 -262
21112 -262 6815 9047 8989 4971 6627 1591 747 -6009 -15264 -11872 -4855 -7277 -11484 -10968 -9182 -2909
21096 -2909 4487 -2511 -7798 -8867 -4660 -1235 -4059 -8509 -9158 -8537 -2978 -1094 2374 444 -810
21081 -810 -6844 -10042 -6350 -5223 -7673 -6463 -2082 7657 13159 12683 7411 -4392 -11727 -5457 3480
21066 3480 6960 5069 7258 4988 6098 6848 7718 9837 9177 7684 8967 4097 1870 1258 -5834 -7762
21050 -7762 -7869 -9046 -8524 -3365 -3059 -4398 3145 8556 8612 7392 1076 2800 8074 8000 5097 -2236
21034 -2236 -6539 -3218 -2377 772 -4030 -9447 -5583 -5056 -2009 -5346 -5853 -6356 -8454 -5936 -3146 -3662
21018 -3662 -7667 -6325 -6843 -5487 -5453 -12922 -17807 -21367 -18397 -11688 -6567 1442 5865 -3159 -13761
21003 -13761 -14148 -13728 -9938 -8956 -6294 893 8577 12791 15664 15974 11705 3992 -1766 -512 1463
20988 1463 349 2942 3612 4180 3713 6022 10319 10394 8741 7048 -251 -2795 976 -1954 -578 -1624
20972 -1624 -1390 -6759 -11719 -14360 -9608 -6384 -982 2280 1893 7948 4788 2435 -2066 -5539 -2312
20957 -2312 -6988 -6743 -3666 -5136 -4290 -3474 -3915 -7095 -6064 -2173 -591 850 -3958 -8338 -7927 -8574
20941 -8574 -2319 -8639 -5438 -2027 404 3824 2906 -1309 -2027 1762 4042 8494 15264 16343 18528
20926 18528 14592 2623 -698 -4370 -2256 2322 2511 -2606 2355 2465 2175 366 -4045 -8958 -5006
20911 -5006 -4803 -6559 1578 6231 6440 -1239 -4391 -4730 -9003 -6958 -569 3880 12085 10776 1617
20896 1617 2630 4958 -297 -1957 46 5551 9143 7695 -1040 -3273 3406 696 -1711 455 1988
20881 1988 1590 4739 9189 5517 89 3805 4831 5070 12111 20943 14460 8702 4997 60 2527
20866 2527 5511 -1258 -4236 -1538 190 1109 229 -5814 -9061 -6083 329 -744 80 -1309 -2686
20851 -2686 2029 -2188 -6098 -4088 4745 5146 7563 6003 7937 7860 2692 3956 3193 -1913 -1863 6108
20835 6108 3981 10818 14296 11504 8121 -783 -7394 -8803 -15872 -13910 -1696 -5004 -5823 -77 -4159
20820 -4159 -8669 -5634 -2236 376 156 1446 2808 -2641 -2644 -3797 -5993 -2895 -133 6832 13728 11439
20804 11439 8611 2020 -3345 -6803 -10213 -9664 -5945 -1963 4536 3411 4950 12339 17182 11989 4616
20789 4616 -739 -3628 1083 3442 7271 3803 4375 8326 -1440 -6777 3187 4217 -3719 -9662 -746
20774 -746 16052 20577 13400 4943 3394 7401 7160 6567 2599 -2471 -3970 -6723 -2407 -3669 -3976
20759 -3976 -2712 -4108 169 807 -1114 -6454 -6254 -371 2937 -511 -433 -2305 -2334 -7062 -8704 -6128
20743 -6128 -4626 -2621 -3350 4673 10648 13457 4688 -2533 -998 -1905 -4354 -6828 -4938 -353 -5773
20728 -5773 -6510 -5593 -2930 -8558 -13004 -3860 6120 7332 1706 -1946 -5164 -10715 -12885 -9921 4312
20713 4312 4154 2495 4203 3280 285 -1038 -6158 -5693 -1956 -5408 -169 1322 -1279 -3336 -2632 -3674
20697 -3674 -5130 -5737 -1733 -2370 -7302 -2113 -1248 1076 -127 -186 -531 -2671 284 3372 -8381 -5123
20681 -5123 167 650 1283 5932 5777 7709 11496 9879 2710 -1678 -3457 -9917 -11924 -12309 -4674 -1624
20665 -1624 -3126 -4450 -5605 -8960 -6445 -5191 -8229 -10214 -13860 -6294 -5524 -5037 -518 -894 -703 -3704
20649 -3704 -5781 -2000 -1834 1800 -1501 -11643 -13507 -6928 -2471 -3323 -11073 -3211 3330 -991 -4624
20634 -4624 -3952 -2275 1963 4631 5489 7156 6605 5581 9484 8773 1918 -4640 -17 7542 7155 10778
20618 10778 2979 556 4473 1042 7563 7330 -254 -2915 -805 2628 303 -3777 648 6711 1567
20603 1567 -11109 -11157 -7715 -6760 -754 1562 -1090 -2050 -1721 1012 3803 5406 755 -2271 -645 -3206
20587 -3206 -4386 602 5993 10580 12176 5487 -816 -5806 -8580 -805 4100 7342 10185 11245 11809
20572 11809 16172 15590 8133 1033 5125 5714 10055 15446 15662 8543 -1738 -3565 -2707 -9194 -11212
20557 -11212 -10061 -1348 8410 11128 8403 7088 5594 2829 -1422 -8709 -10919 -10913 -5497 -1404 -982
20542 -982 -2481 -7114 -751 2048 -1576 2883 12023 3558 4850 4735 2085 1197 991 2296 3283 -74
20526 -74 4582 9142 10837 9303 466 -382 787 2313 -2053 -4952 -3382 741 -684 826 -2116
20511 -2116 -4056 -2885 -5669 -8895 -11671 -12940 -13358 -16610 -12491 -11887 -9630 -4298 -1754 -4099 -474
20496 -474 3245 4011 1378 2019 4992 9129 5780 4695 8674 2430 1007 1072 -2820 -4255 -8499 -7082
20480 -7082 -2168 3441 -2427 -5668 -4346 -1159 -5706 -7866 -4043 -2749 -5470 -5894 -4586 -3690 -6800
20465 -6800 -3573 2483 3143 -879 -1388 866 959 -2230 -6098 -10381 -11184 -9545 -11204 -4909 -3162 -7354
20449 -7354 -5872 -7239 -955 3094 4219 2186 2348 5508 8127 4195 2502 -195 3024 2593 3182
20434 3182 4855 3201 4511 6013 7525 6276 1538 -1435 2947 7605 13788 12002 6489 951 -4025
20419 -4025 -6542 -4197 -3643 -1001 2823 859 -2052 3171 -3194 -3588 -2244 -6210 -7597 -1350 6834
20404 6834 3889 -4377 -7844 -8043 -10737 -3998 2431 -6602 -12825 -9968 -5791 -7492 -9398 -14069 -13237
20389 -13237 -8612 -3217 -5595 -7193 -8039 -11518 -12009 -11962 -13688 -9369 -5537 -7083 -5069 2097 -1908
20374 -1908 -5307 -3039 -2373 -3894 -6204 -4460 -4743 -6957 -13797 -9667 -6074 -6237 -12399 -9856 -4733
20359 -4733 -366 -2628 -4131 2739 1387 -2204 -2691 5497 11598 12048 8919 1816 -5522 -6414 -16
20344 -16 6528 6708 2772 -179 62 1258 455 710 -1117 647 7679 6726 3127 4254 2926 668
20328 668 1410 1350 10128 9218 2890 854 56 -1446 -1032 -5031 -863 4553 3223 2423 -6678 -11126 -9989
20311 -9989 -8246 2726 -223 -6197 -8581 -8918 -4754 -508 997 735 806 3595 4820 5211 5329 3056
20295 3056 6759 10698 16658 14008 15554 11644 12931 6305 2179 7783 11178 7777 5070 -258 -673
20280 -673 -2597 -2866 -3439 1978 1003 -2377 274 3904 9281 8354 6848 4220 -3231 -3004 6457 7699
20264 7699 501 -12572 -8645 -6334 1110 7073 6008 7296 8904 8997 5929 6710 4242 1823 -851
20249 -851 1683 3767 1860 -2022 -5986 -4372 -6592 -6516 12 4647 9342 12954 10109 2970 2564 5685
20233 5685 4346 -705 -4962 -4146 428 -1269 -9113 -13525 -12904 -5998 -7605 -2003 3564 -3624 -7756
20218 -7756 -753 -2227 -6015 -7064 -4543 -2924 -2694 2315 2566 -106 -704 -5576 -4053 -2984 6822
20203 6822 11279 3384 7224 4212 5490 9886 9550 4410 804 2131 8487 10742 9085 10776 8394
20188 8394 9000 10765 6858 7540 2771 -1015 -2026 -3914 -9532 -12625 -13981 -12359 -11657 -2875 -8277
20173 -8277 -10846 -11653 -480 964 -3426 -3489 849 1784 -4704 -5369 5450 6212 4539 -4191 -8080 -5788
20157 -5788 -5822 -1197 -1531 2857 3225 2731 2538 472 699 -1275 -111 -257 5345 8798 6146 172 -6946
20140 -6946 -10814 -3285 -1299 -6408 -8500 -321 6353 10751 16773 14810 3979 24 -1037 -4645
20126 -4645 -4726 -2679 -5314 -2367 -680 -2267 -2446 -208 1035 4069 9023 11403 11214 12044 6688 -4978
20110 -4978 -14070 -13739 -9062 -10773 -12811 -8174 -11293 -11186 -10094 -10208 -9601 -7335 -5048 -953 -43 293
20094 293 -2319 737 3327 1050 -4285 -8400 -10829 -10251 -4097 -2008 -1419 3105 8974 10172 4644
20079 4644 5342 8062 14201 16407 14128 8957 6734 1316 -3263 -5813 -11525 -10417 -8486 -3584 124
20064 124 4814 4666 6616 7507 6985 -1181 -1884 -4033 -9775 -6117 -1932 -1868 -4108 -3081 1670 -11469
20048 -11469 -11962 -9784 -9960 -8114 -3690 -4887 -99 3751 -1031 20 -1211 -2743 -161 5861 2795
20033 2795 1167 5786 8138 11914 2895 -2684 -2581 -2305 -1220 5015 3074 -4920 -13887 -12202 -3713
20018 -3713 -697 8558 14028 7147 4030 1454 -3762 1705 4490 1831 3259 5465 9414 8297 2739
20003 2739 2783 -2107 -7189 -2757 -3014 -10311 -10422 -2049 3971 7408 5782 -2256 -3345 4783 7536 4324
19987 4324 1591 4999 -1061 -3852 -4661 1876 4158 3106 -2872 -6452 -8800 -3176 -639 -2024 -4327
19972 -4327 -7649 547 10041 14717 11273 9094 577 -4614 -4970 -2058 1617 -4895 -6704 -1243 2528
19957 2528 4276 -247 3392 7638 11172 9790 9697 4809 3364 2499 2484 7451 11216 14997 12060 8434
19941 8434 3547 -3812 -366 9407 6356 -84 -2978 103 5795 7273 11026 6043 88 2128 5570
19926 5570 7505 5187 3120 330 -273 -1244 -1223 3035 2602 3890 3947 5562 9050 14532 10942 14952
19910 14952 19682 22730 25443 15409 15181 24375 23592 19511 17093 15783 18557 17053 13204 10628 14672
19895 14672 22500 22801 19829 17822 10597 5394 9630 19250 22317 20021 20327 24394 28921 28948 33233
19880 33233 38796 45635 47114 46058 45251 48350 56210 57997 55759 53764 61384 68564 77874 86843 93654
19865 93654 101779 122338 132904 141080 158089 174654 188851 207898 224713 235151 249487 260431
19853 260431 264245 264526 263216 252271 239871 231324 223470 210781 188962 169462 160510 147254 130507
19840 130507 113463 101754 93833 83958 74325 69120 60345 53118 40116 36686 30943 28475 29513
19827 29513 30559 27891 28488 29023 33248 34505 29713 24761 25115 29845 23181 20476 25570 28771 23192
19812 23192 17555 14644 18491 21171 21500 24727 27794 23181 14161 20434 31056 31022 22045 13096 15480
19797 15480 10340 1846 -3010 -2178 2796 3138 -4308 -1159 9058 12406 9556 11869 13788 5052 1670
19782 1670 7425 8645 8610 4061 181 4784 12882 11553 -1341 -4837 7501 12234 9007 13828 16851
19767 16851 9558 -3606 -251 -1820 650 4151 8921 5294 6640 5445 2392 -2897 -2873 2722 -520
19752 -520 -3078 980 4540 8478 9340 7168 3552 3306 1419 3140 11895 10359 3905 3302 1151 -500
19736 -500 4431 6565 8699 3621 6227 4387 -2076 1172 -3725 -8637 -8203 1322 4521 1885 2576
19721 2576 -2624 -856 1511 2333 8025 3466 10308 17052 12345 5555 7765 6503 5471 6336 341
19706 341 -4757 -14917 -10379 -3115 4153 8281 8339 1688 -1490 -4582 -4401 -5264 -626 5087 5467 8121
19690 8121 5130 4376 5093 3582 5620 7068 13718 19474 9741 13223 13023 3182 5055 4812 6618 8916
19674 8916 8210 3201 -3121 2236 3476 338 8020 6023 2805 1845 3904 1364 -1087 2590 6370
19659 6370 11461 8511 8030 8056 6232 8677 9526 9643 13714 18292 13111 7095 3800 5552 9444 13858
19643 13858 17033 14008 6703 9984 7044 7750 11667 7407 7237 10916 2256 2685 910 2176 5200
19628 5200 6970 4599 2836 1842 5442 2225 -976 10580 12338 6364 1177 1105 -2484 891 6859
19613 6859 5378 -2607 -796 -569 -4097 -3729 -3247 1146 3922 8343 4856 2545 10885 11524 11632 14719
19597 14719 9598 4775 1338 -122 -876 5222 5443 7679 6127 -781 -1987 -508 1572 3987 7287
19582 7287 8763 7007 7678 12474 14479 12480 9844 7715 9547 12617 10531 9040 5749 1547 5994
19567 5994 7142 6053 6027 8000 8086 9413 9929 7872 1115 -323 78 5614 10611 13173 16541 19216
19551 19216 19486 12313 12567 12555 10545 6922 2857 -3905 -5681 206 2002 2266 2714 5081 9849 3739
19535 3739 -1453 -149 -3640 -3555 2746 5817 10576 7495 6013 13577 18356 17738 15215 16038 20081 13338
19519 13338 9849 8008 10881 14772 15110 13866 14820 16423 11297 3180 7223 11331 21818 22598 18207
19504 18207 13300 9026 7831 6059 966 -272 5893 8796 8548 7997 12456 14325 9853 10285 6107
19489 6107 8920 10709 4818 5738 8877 10521 10131 7388 7408 6234 8937 11169 6689 7712 14222 26798
19473 26798 29805 26219 11237 8741 17029 22749 29093 24611 15821 4675 3931 10314 12881 5697
19459 5697 3304 8361 16335 15421 7718 3594 5007 13357 11583 6946 3281 3551 563 -549 -5799
19444 -5799 -5583 -3404 -987 -2973 -937 2480 4675 7216 5539 11343 13190 6220 2779 1391 -771
19429 -771 261 2769 4537 5340 6212 6146 8414 14980 14992 10009 -503 3563 16463 19148 12115 9308
19413 9308 12481 15770 13660 19996 25419 25479 28486 36292 45874 46000 51944 58747 59161 69312 73620
19398 73620 73986 65261 53913 52290 58636 63510 51528 46070 42011 32943 28779 23826 16335 10948
19384 10948 5624 6987 7442 9996 16766 17339 19848 19850 12418 3804 4369 8975 11537 12615 11025 15275
19368 15275 22973 24689 19382 11444 9827 9043 7514 4908 5006 4939 3310 966 1637 7444 9060 6689
19352 6689 8124 11458 14649 13212 6651 10304 15440 17701 11168 12952 12518 6521 8285 7889 8489
19337 8489 5995 10447 11791 8226 2738 2308 5820 8719 3263 6201 13986 16420 16131 18916 15151
19322 15151 13694 11629 10555 2036 5068 6193 2469 600 4844 6258 2229 5419 1637 -2255
19308 -2255 -1731 -1480 5140 15492 13004 11211 10736 13385 25003 18742 3732 -1792 5903 10103 8749
19293 8749 11379 12405 6549 3526 4123 5268 11985 17574 20445 16667 7762 7301 11333 9863 5923
19278 5923 3169 507 813 2279 11939 17226 14636 13738 18707 19210 13703 6867 3261 3119 5805 9205
19262 9205 4232 6778 8932 6182 9198 10861 5944 11437 17864 16636 13517 3999 -1338 4881 13235
19247 13235 17238 17414 11083 9465 7846 13102 13182 12040 11592 14178 8997 -2192 -663 8750 16479
19232 16479 13711 18522 18678 19544 18362 12163 12729 13861 16272 8641 1412 3886 4173 7268 2710
19217 2710 5521 8220 5777 -899 -1907 904 7477 8055 8477 12221 9818 16321 17232 17880 25169 28142
19201 28142 32917 33708 38225 43893 44223 39982 39030 34637 28267 28961 27515 27504 27896 25326 27056 29858
19185 29858 22936 22172 16627 10729 12030 12065 11998 12078 13424 12631 6503 2528 5208 6251 3880 9699
19169 9699 10359 16348 26670 28450 25302 20932 16505 17293 21069 28783 24225 18975 21476 34760 45079
19154 45079 40971 33982 28428 25468 29394 34833 29161 24854 21672 26326 25957 25812 23024 25687 28410
19139 28410 34782 32944 29590 28323 30691 27398 20897 17980 26762 30091 32306 26535 23676 17410
19125 17410 16245 15960 19925 21282 16566 12924 12689 11211 13116 16601 25800 24383 18584 16114 25188
19110 25188 28182 30776 33030 33007 26565 26503 32219 32492 31240 30845 22125 31567 46526 49652 56033 70525
19094 70525 83375 103056 127503 162711 207469 243644 256988 237196 188898 149389 123980 112334
19082 112334 115533 123556 143992 179340 213789 238753 257870 244384 194738 137587 105296 84286
19070 84286 65643 52401 44082 41824 45379 43331 32548 34711 29021 29466 30823 24318 24079 27342
19056 27342 28964 26875 28180 25109 28465 28071 24131 24351 18973 15909 26117 26889 29848 26425 26724
19041 26724 27558 25399 24966 28852 25951 24755 25135 19874 16169 13499 6810 14620 19623 17020 15772
19026 15772 17877 16807 19998 19995 21374 20891 19876 18898 16545 21214 23531 24803 24695 23363 21064 17431
19010 17431 17221 18474 15647 17308 13846 15821 26269 25851 19988 17210 17438 18711 17181 18449 16504
18995 16504 15925 18250 20743 20490 19369 25907 21898 19012 21317 15043 9321 13617 12524 14367 18509
18980 18509 16023 10784 9515 6129 5489 14313 13099 7928 11735 17869 22847 27247 19326 15024 21460
18965 21460 16464 15836 24683 29921 21792 20604 24886 27424 25141 20461 20377 18563 20574 17025 20825
18950 20825 22199 19590 23304 20607 23353 21886 23056 16010 12498 15876 21977 27400 27035 27200 32857
18935 32857 35063 34299 33518 33687 35839 36691 32431 26534 20234 24491 30558 37300 37067 31157 28491 26024
18919 26024 20574 20044 19908 15174 15555 23585 29199 24300 18793 15419 18061 24746 26966 27169 29472
18904 29472 42588 46499 62715 84326 104481 126591 132499 120013 92696 68988 53619 43273
18892 43273 36917 34739 31151 31321 31942 34023 33931 42230 48638 47870 50414 50078 46486 45177 47353 38752
18876 38752 36249 43611 43857 41542 35175 32442 35098 34945 34395 40693 36653 32456 37823 47545 59140
18861 59140 71721 68557 62255 63141 55963 50489 55232 62557 74147 93920 123512 169770 196635
18848 196635 198308 173256 156839 165501 176564 174934 147858 108113 82530 65905 56759 52093
18836 52093 49070 43929 40551 34590 36513 43829 47680 57603 65070 63500 55394 55457 54474 50086 39771
18821 39771 34760 41221 52534 51460 49997 53395 55876 51529 48510 46596 44592 49473 53616 53331
18807 53331 55302 57950 54283 42457 42302 45847 50803 54326 65829 83030 106226 140638 171381
18794 171381 175286 154338 125094 101057 83303 69518 57518 50810 58099 57401 57857 57967 57470 50254
18780 50254 42264 48248 50004 47181 45111 47329 49487 53422 50475 52029 55853 63275 71561 86917
18766 86917 113797 124882 111844 91311 82326 74306 64606 66438 66718 64103 58997 53421 50011 54703
18752 54703 52769 57480 54722 53883 58656 72304 78290 67713 63516 68259 64638 57367 51663 46346
18738 46346 37879 40533 44353 44321 44706 50829 53878 56837 56013 52700 43597 42472 48749 57298 57729 54299
18722 54299 52046 52859 54161 49692 42209 42526 42305 43825 46754 45307 47305 51814 58401 58124 55318
18707 55318 50095 37153 38690 43826 44733 43269 39029 37816 42758 40320 36125 31253 33547 38423
18693 38423 45082 47061 48250 40527 37956 43398 48306 52019 58340 64182 71192 66902 63859 63606 70220
18678 70220 79114 83883 85892 83532 82929 74221 73425 69895 65127 70370 78856 81216 80396 80354 84397 91849
18662 91849 107663 117928 121188 117325 111057 113671 128862 146507 166355 186662 196954 196383 198154
18649 198154 196441 179170 158910 147496 160897 195636 234607 247784 233039 217070 223053 242580
18637 242580 263806 300002 348063 393454 412248 407435 389741 360076 327078 315077 330157 368191
18625 368191 421764 479982 542038 606587 643806 633377 581804 522539 479333 442000 422520
18614 422520 428053 453768 483404 517259 529990 505480 475652 447161 431337 419494 425303 418058
18602 418058 403635 389790 374292 334718 298127 276251 276207 285699 308180 315397 287925 252502
18590 252502 234404 220709 206347 197848 192059 192540 196592 199335 200914 204471 216918 226748 239867
18577 239867 259304 282290 316919 365672 421783 456481 470271 465811 465861 463886 451793 444928 465645
18564 465645 505965 539083 563992 578310 578580 588947 610132 602739 591816 601231 592147 559949
18552 559949 534382 530163 544045 575497 617978 646622 667625 702674 735741 755047 766217 789074
18540 789074 841449 908914 955461 971493 969718 968310 985284 1031858 1100632 1176516 1238868 1305317
18528 1305317 1400110 1523345 1662992 1783386 1895435 2031076 2218571 2439691 2678003 2950438
18518 2950438 3275082 3697128 4269031 5072550 6198503 7767348 9993777 13197375 17850141
18509 17850141 24493648 33376639 43409457 50725809 49865328 40788993 30134934 22621230
18501 22621230 18661712 17379652 18196077 21048967 26216102 33900582 43181130 50528714
18493 50528714 50285024 41096109 29111520 19714603 13664698 9909574 7532737 5952696
18485 5952696 4860600 4075286 3503828 3082860 2783112 2570026 2398866 2215359 2014351
18476 2014351 1835661 1723775 1696909 1753483 1856492 1924374 1861103 1674477 1486804 1348538
18466 1348538 1244912 1177888 1142822 1122210 1129056 1191094 1295531 1387865 1357023 1181210 979503
18455 979503 827668 737159 680815 631913 572771 513626 466560 444206 434840 429399 421895 413318
18443 413318 414165 423130 430685 439893 442598 442454 445993 451136 442304 430207 432747 449044 481789 524182
18429 524182 582379 645440 699987 742437 753660 737323 728258 724781 719333 718211 732325 749139
18417 749139 762121 782370 831719 881954 897906 871687 810278 750536 727158 742245 786753
18406 786753 849801 919161 985144 1045722 1113065 1214435 1347374 1537393 1839171 2302236
18396 2302236 3016493 4135546 5868373 8484337 12074627 15817223 17539907 15639162
18388 15639162 11128240 7128496 4766835 3497765 2793642 2368627 2082762 1885390 1771233
18379 1771233 1760711 1877220 2157064 2670375 3459341 4426478 5014039 4450691 3237300
18370 3237300 2331676 1858918 1592878 1399825 1279539 1234620 1251195 1292409 1338403 1388100
18360 1388100 1472660 1618849 1853265 2202470 2722451 3488259 4509526 5517876 5878360
18351 5878360 5291331 4551407 4291543 4559462 5329360 6698670 8927614 12430488 17652759
18342 17652759 24336852 30142072 30522669 25918866 22712516 23318050 25379523 24722356
18334 24722356 20214921 14311913 9624111 6733826 5054223 4066836 3487621 3200090
18326 3200090 3161912 3411550 4001158 4936372 5945166 6153312 5037152 3637933 2704683
18317 2704683 2201917 1970133 1902430 1923690 1980711 2070685 2296328 2744357 3467468 4472930
18307 4472930 5608122 6411659 6118611 4901532 3736146 2978410 2555296 2344663 2262475
18298 2262475 2290054 2450794 2781997 3290463 4024545 5102945 6729746 9200966 12981136
18289 12981136 18667538 26187209 33164442 33645822 25696394 16330783 10168556 6744048
18281 6744048 4803159 3603077 2783637 2199498 1774752 1467524 1248406 1074507 939496
18272 939496 832214 748226 673901 614265 570307 536222 511402 481504 462689 466233 495397
18261 495397 540965 598614 655936 679640 692224 718328 749836 747332 697135 606094 514221 443272
18249 443272 393894 355064 323742 298931 288468 287022 293059 307374 301444 300761 305792 298210 273475
18236 273475 257708 257441 251866 242180 221760 198528 183348 181313 185179 193307 202271 212145 218994
18223 218994 213029 209656 200442 191745 189630 193304 190644 187052 183415 173633 165841 164552 162338 166458
18209 166458 175000 188678 215614 243976 277734 292442 296763 288942 277571 261294 250482 231800
18197 231800 224216 236872 260215 295244 339683 370946 376603 376976 377089 347204 291659 253798 234701
18184 234701 226462 224136 222930 214828 209015 211305 222434 228299 228509 232454 238627 243040 254471 260537
18170 260537 258958 264664 270667 268417 252718 240458 232525 227733 224359 222649 217532 211910 209718 215573
18156 215573 223126 229877 233522 243281 257131 269760 273773 275304 283681 295643 319899 349460 393071
18143 393071 437441 455487 467808 481161 488947 481941 466148 468046 493957 527513 561113 596315
18131 596315 644523 695292 736206 777264 816632 847133 893924 974152 1088840 1236804 1425739
18120 1425739 1615419 1778067 1939244 2152165 2454593 2862064 3445559 4331076 5686146
18111 5686146 7757984 10935709 15748977 22407861 29384694 31333085 26084454 19211481
18103 19211481 15146149 14290369 15942322 19861835 25740100 31711936 33880660 30979745
18095 30979745 24817749 18462535 14598912 13415282 14386660 17143434 20735813 22347658
18087 22347658 18880866 12912666 8466588 5938143 4451322 3510102 2901838 2504707
18079 2504707 2247899 2088111 1970364 1869324 1791179 1722824 1650568 1596612 1589631 1608736 1622922
18068 1622922 1654188 1728397 1852706 2052671 2372749 2845319 3507802 4488032 5983855 8184987
18058 8184987 11027963 13520086 13483927 11130361 9362471 9302889 10776639 13496383 16768244
18049 16768244 18930787 19240467 19409767 18863166 15595409 11775331 9839385 9849565 11329009
18040 11329009 13597509 14901711 12918121 8883031 5714233 3909886 2885615 2239138
18032 2239138 1817659 1539254 1342121 1200354 1101747 1024819 951440 875035 803840 737530
18022 737530 686613 647700 615093 586168 558849 539992 525573 512196 496245 469979 435289
18011 435289 400509 376758 360371 353625 343158 328982 317734 315727 323228 329527 335169 336844 338257
17998 338257 336734 331224 325574 326737 329384 323650 319337 313299 317227 324029 326477 328584 332337 337159
17984 337159 336989 337305 338417 344776 350645 356123 363390 377003 398220 409336 422665 437249 451077
17971 451077 465573 488874 517466 542487 572500 601587 624382 643414 666952 701306 749218
17960 749218 809997 873591 942745 1018396 1106745 1195866 1288552 1392219 1502382 1633213 1814396
17949 1814396 2072259 2424190 2884651 3498075 4322988 5372768 6456250 6964230 6575948
17940 6575948 6129504 6288600 7112674 8628395 10824071 13420553 15659354 17435097 20461347
17931 20461347 26211783 34808326 44385405 50398275 52159066 54456016 56477348 54101183
17923 54101183 48181531 44554515 44167786 41962524 36873561 34385873 37141905 43764183
17915 43764183 49908644 50031413 45490018 40271105 32747167 24127466 17669357 14052607
17907 14052607 12629003 12847517 14510253 17629189 21934280 25767245 25321637 19655294
17899 19655294 13472533 9554026 7477862 6480043 6131995 6225745 6705631 7703371 9476461
17890 9476461 12363774 16475252 20828012 22266262 18935472 14799212 12961567 13511560
17882 13511560 15928243 19237098 20940015 18353303 13742041 10748129 9945709 10649798
17874 10649798 11771454 11463399 9290608 7248433 6381018 6595075 7614254 8874235
17866 8874235 9049649 7257877 4950328 3378019 2482134 1970376 1689861 1541977 1423789
17857 1423789 1263717 1084232 929099 807992 724391 667330 619033 574044 532358 479418
17847 479418 440174 404002 382608 369126 364542 356845 338191 318245 299551 287706 282140 276567
17835 276567 265695 257244 251494 240396 241706 258952 275467 299598 323938 335320 323559 306662
17823 306662 291499 302040 325935 361110 385236 385328 379563 380453 384160 387213 391697 392311 365178 335158
17809 335158 324456 297000 259951 233125 219432 206672 178249 139203 113818 108085 97129 83661
17797 83661 78337 80675 80592 82228 89109 88374 86169 81413 77493 73963 66264 60124 66554 87243 114514
17782 114514 143250 160998 180748 194901 191178 178527 170890 173805 189469 208071 232161 244291
17770 244291 239460 242008 234682 208643 180209 167522 163551 175355 192305 207798 205456 188682
17758 188682 163507 126125 91767 64282 43491 38263 41602 45508 50334 49966 50465 48052 45741
17745 45741 40906 40369 36921 31077 30583 20647 17282 22831 34937 44314 44017 45392 50477 57280 61210
17730 61210 57214 56069 58554 57219 57902 58520 52374 50256 55530 57632 60861 64194 71742 92497 125940
17715 125940 152288 145832 116210 95383 96730 104807 126462 143564 131275 107885 97348 97927
17703 97927 110516 126238 142797 138718 108307 93577 95013 99802 116962 124875 108060 79189
17691 79189 60455 58312 52847 44646 43269 45140 42555 37796 34297 34019 36949 34877 29941 28168
17677 28168 37281 49296 41160 33406 27705 27414 32196 34767 42648 58914 66144 84122 109526 115653
17663 115653 106295 87185 81836 84288 107965 128914 123395 103605 85903 84495 89779 99531 107188
17650 107188 96902 80751 74890 79717 86932 92806 96068 83072 61706 37826 26726 24802 26217
17637 26217 24254 27361 29772 21620 13238 12585 20770 26638 23471 23175 20775 11533 7441 180 2117
17622 2117 6314 8196 11838 19178 14219 16536 11517 1908 -1354 1915 3910 6174 8122 4292 536
17607 536 3619 6793 8819 7121 -1039 2010 10335 10348 8421 9468 10186 18355 31377 38522 44017
17592 44017 69749 92990 89582 77393 66508 60866 68146 83538 98630 115822 130576 125948
17580 125948 113853 89583 64815 51689 53686 66289 74688 77128 65683 42336 30177 20444
17568 20444 10837 12100 10032 7413 7887 6159 5117 3408 4581 13020 11720 9449 11924 19779 23001
17553 23001 24662 20355 15076 11487 11877 16838 26223 25449 35290 53551 66519 77954 83354 75174
17539 75174 63159 56428 55399 66412 88101 105520 112631 113670 111521 93913 63138 48250 50416
17526 50416 57242 65461 68447 63281 49797 30893 19835 19740 7119 3001 1725 699 -2868 -5472
17512 -5472 -497 2324 3594 -1054 -8542 -8554 -12369 -13748 -12554 -4662 3513 3080 3136 2820 4699 -1470
17496 -1470 -5937 -10238 -11199 -8187 -6895 -4545 -7294 -11276 -9720 -7720 -9749 -1095 171 -6646 376
17481 376 4717 5871 6930 4460 -8425 -19235 -19978 -15452 -10633 -6555 -7463 -9270 -9735 -3987 2208
17466 2208 2005 3858 2400 3124 5162 7757 5571 174 2053 6996 12262 8296 11522 11054 5570
17451 5570 -1764 -9434 -14856 -5375 3673 3210 8693 16177 29688 46109 65839 76264 61989 30930
17437 30930 13944 5260 2137 -591 6896 8797 9933 10357 10589 10319 19292 27825 33117 39855 49019
17422 49019 61596 76006 98646 115906 109276 99350 100059 113997 137769 177477 209684 226633
17410 226633 220782 209163 204578 197287 181950 167054 168015 169641 186964 217601 246883 267537 282463
17397 282463 282139 247650 205163 177591 143871 115758 102622 104977 116488 128358 134987 132166
17385 132166 121861 120363 108550 89828 72119 59633 46381 37175 38827 38068 40446 43602 52947
17372 52947 61434 68587 87677 102869 94631 87475 79092 72055 74689 82912 92040 91873 74669 57513
17358 57513 52931 57830 71568 83939 83904 69412 48725 45473 50739 48697 48731 43782 36000 24821
17344 24821 12796 11962 13257 10286 2304 -529 -864 -709 -654 -9740 -10993 -5927 -7006 -12097 -9642
17329 -9642 -984 -331 -7129 -10126 -1356 2574 2296 4181 -109 3966 -280 -7991 -10852 -5440 -4349
17314 -4349 -7688 -5560 -6339 -4274 -4300 -9932 -8607 -3848 -2759 -5521 -7597 -5617 -2130 -2351 -1905 -4439
17298 -4439 -8588 -9051 -12440 -7064 -3004 -64 2442 6364 114 -10349 -8553 1468 10466 9949 7250
17283 7250 4709 4998 5028 4445 2925 5017 2203 3109 8061 -2351 -6096 -876 -2247 -4336 778 12119
17267 12119 13877 8444 6334 4553 7764 8293 4912 2447 1095 579 -1344 4770 10521 10552 3283
17252 3283 -2214 -1038 -7588 -9575 -8481 -1997 -6594 -8050 -2851 -4323 -6686 -4542 -10015 -10362 -14289
17237 -14289 -9802 -10183 -9499 -9749 -6264 -5954 -5652 -4539 1334 6921 5132 3812 3590 5869 5546 -707
17221 -707 -4935 -10474 -12204 -4226 4409 -627 -4941 -4932 -5232 -6413 -2410 -6193 -2699 4631 5806 -554
17205 -554 -6731 -8611 -6210 -5114 4821 6419 921 -1974 -281 573 -1224 -8660 -8590 -2214 1341 4683
17189 4683 -2058 -3942 -4067 -491 686 -478 2572 3380 2383 7788 4189 -644 -1236 -3468 -3816 7372
17173 7372 13425 10295 6913 3929 3291 7370 10378 17570 16252 21723 29273 32348 36653 44424 54083
17158 54083 72610 95355 132215 185748 249430 308046 309782 248205 167877 119013 88852 76557
17146 76557 79754 100755 138552 182558 242921 292204 298067 250431 179899 120418 79926 55916
17134 55916 44988 37345 24849 14337 12153 12894 13564 13353 14496 17692 16164 16301 14543 19692 20284
17119 20284 14623 11442 4878 1927 6733 5784 4367 3784 3829 7169 6469 3462 -168 -5394 -1836 -3196
17103 -3196 1704 4371 3986 5695 4129 -6581 -14062 -14621 -9919 -5841 -91 -5898 -1955 -5543 -9108
17088 -9108 -4886 -6806 -8837 -7753 -7667 -6113 1005 2040 4020 5857 -3925 -8474 -5446 -5083 -3880
17073 -3880 1245 2582 6891 6595 -116 -464 3410 3457 2612 -2226 -5603 -9753 -1854 3257 525 1572
17057 1572 6854 7095 8091 9404 178 -8038 -7115 333 1032 -5127 -7745 -9144 -9723 -1739 1686 1456
17041 1456 9635 13165 11704 8335 9515 20589 26629 29928 31855 29524 24793 23042 20127 20200 12928
17026 12928 10080 6012 2476 -721 4264 13691 13123 11825 19730 22637 23747 24945 22657 18810 12492
17011 12492 7208 1050 767 -2596 -315 -3171 -3663 -2917 5089 11234 13329 11712 17594 14636 9028
16996 9028 4453 2289 12610 17953 16386 15314 9412 3603 3581 -2283 2526 8144 14995 13149 6610
16981 6610 -1679 377 6521 11370 10957 4027 5160 13288 12463 -2067 -6379 984 6183 6533 10784
16966 10784 6105 5742 4263 17450 19824 12664 9105 12916 15589 12696 6833 4965 7816 6492
16952 6492 6273 10591 18429 22084 27393 31032 32566 32866 37847 45155 51633 67234 90795 131618
16938 131618 182430 252063 328867 360967 306934 211927 142055 96025 76816 72618 72154 79583
16926 79583 91821 115967 157037 216008 290259 354754 343501 250635 158370 104651 80746 62963
16914 62963 43807 32374 21395 18549 14733 6316 2961 4941 7147 9456 12021 15973 20163 15501
16900 15501 8622 6949 8054 12230 7290 4581 10916 17389 22506 24260 21715 19731 10968 13247
16886 13247 12704 7130 9728 12122 13455 16809 16819 15229 17169 22865 23363 19726 14154 8604 6524
16871 6524 5941 11653 19170 22742 19666 13752 6834 2920 481 -5940 -11961 -9729 3837 12883 12679
16856 12679 17195 27227 32377 35507 45143 47468 42751 34488 26021 16932 8917 7756 12882 18487
16842 18487 23559 31478 43321 48284 41139 27629 18144 12479 9353 9361 13594 13857 12563 8027 6666
16827 6666 13047 17104 16247 4652 -1623 -1850 -5559 704 7577 11032 15291 18998 19983 16578 17687
16812 17687 12401 14166 16034 20745 21588 17150 20247 20981 23156 25123 18318 14460 12324 9420 11161
16797 11161 8874 3730 -3828 -311 -366 -282 2953 9264 4314 -122 2359 6051 7460 977 5319
16782 5319 7176 -2975 -8356 -3853 828 -5219 2731 12778 22706 27778 23414 25807 26420 25758 22551
16767 22551 22756 16305 13894 23411 25818 25969 29587 29024 28897 31824 27182 19671 18221 11846 -2460
16752 -2460 -9852 -17167 -10015 6098 23195 37710 39915 39592 37721 30293 27518 17126 11443 11760
16738 11760 18619 28917 39813 47874 54353 66012 75037 85254 90435 97867 119026 142946 165072
16725 165072 171723 155506 122403 88630 72809 67488 74766 77712 75518 92010 128184 162399
16713 162399 176378 161534 127833 93726 71237 64240 58799 55382 58585 54689 52354 56494 62735
16700 62735 58172 62866 70055 74075 78082 80116 75651 74483 64653 54104 57411 61889 67173 75483
16686 75483 76610 83872 85895 81371 73968 78169 80467 81469 78563 89397 95251 99505 108966 115364
16672 115364 127957 140608 141761 143532 155470 169140 176128 180118 181647 182051 179971 179428 171640 170946
16658 170946 177047 176150 174561 182875 196065 193308 185482 186623 192577 198460 203541 213789 228287 244065
16644 244065 257744 272406 281408 291721 304308 309022 311837 324101 345307 368399 390308 415490
16632 415490 445080 475590 511580 540235 573208 617726 667119 743628 853462 985293 1081126
16621 1081126 1110461 1121500 1164310 1264728 1411070 1599044 1803047 1998998 2182201 2398624
16611 2398624 2698124 3064310 3492434 4084363 4967970 6270081 8181429 11064421 15431240
16602 15431240 22042085 31849422 44903552 57679018 60954294 49641394 33732849
16595 33732849 22760524 17230517 15166666 15475253 17949113 22976215 31300001 43071109
16587 43071109 55486874 60108377 50050536 33357146 20675422 13402103 9352239
16580 9352239 6946026 5398184 4305321 3515794 2960883 2583104 2342511 2221785 2198079
16571 2198079 2210411 2204353 2109643 1871055 1555946 1271035 1074222 968273 928219 938064 998035
16560 998035 1089108 1171202 1190090 1127873 950321 723193 549025 445105 386609 350054 314530
16549 314530 283034 264221 249460 232955 216602 197843 186538 187871 181890 175862 174293 167746
16537 167746 155982 148656 133571 126475 125911 124501 122469 125329 119552 107876 101385 94790 88381 86128
16523 86128 86845 86955 83456 86507 92165 92458 77421 73716 76949 78294 80566 76827 73880 67327 63043
16508 63043 68672 72356 70232 68592 61684 58039 55335 48262 47452 47501 41161 40208 41709 42534 37181 35125
16492 35125 31102 29479 29546 26238 25617 24098 21254 27557 34720 40535 39511 36560 41311 42680 45150
16477 45150 48262 41492 22662 4931 -6929 -10625 -10531 -879 13248 23030 28178 26644 26286 29898
16463 29898 26645 16519 340 -12647 -13925 -6250 -5343 -8445 -2054 -1147 -3346 56 -262 5131
16449 5131 13966 32004 43872 54373 54760 43509 31134 23683 17110 7450 9456 12399 18675 31784
16435 31784 39408 45500 47874 42482 35126 27908 16399 10838 11650 13228 10454 12259 12314 13885 14205
16420 14205 12764 17569 20608 20990 16814 14506 10995 9795 3938 3872 4336 8787 11751 18915 25590
16405 25590 26750 20304 15146 18937 17639 7584 925 2205 11079 14240 20275 26870 26575 19273
16391 19273 21601 19021 17401 18281 16514 13219 6346 1404 -2948 -2630 -11706 -11509 -3143 8085 1791
16376 1791 -11309 -11892 -4427 2284 -136 -7273 -8948 -9911 -6368 -7738 -7540 -4254 -4803 -4033 2375 7206
16360 7206 7654 14242 16267 11474 8750 6491 -5630 -16134 -13830 -1598 7599 11167 9717 10701
16346 10701 11372 13118 16940 13057 8391 14699 23498 27989 19963 7378 1163 3245 4557 2731
16332 2731 -1210 5103 14944 16076 15199 10924 12051 12943 12907 8913 -172 -8530 -4295 3136 2702 -2651
16316 -2651 -7554 -6315 -2732 -1817 362 1723 -1515 -5404 -6885 -1787 -4897 -4836 -813 5169 9109
16301 9109 12182 5650 -3968 -11742 -4144 -5753 -4233 -1535 1325 -2153 1830 5744 8365 8186 2074
16286 2074 -143 234 74 2211 -734 5515 -378 -1271 -4418 -3422 -5991 -3934 -1717 -2405 -31 3713
16270 3713 9 170 -5442 -4271 -4951 -8608 -6707 465 -4249 -6588 -1992 -374 -13392 -13271 -8768
16255 -8768 -6484 -9162 -9250 -8837 -5737 -3972 -8538 -8751 -12488 -12847 -6367 -5629 -5878 -4806 1422 5626
16239 5626 -3318 1354 1872 -4488 -2148 -4328 -7355 -9731 -10249 -7496 -4343 -2152 867 6222 10343
16224 10343 12083 12375 6166 -255 -12153 -14955 -11548 -8228 -11155 -15843 -13040 -10475 -18447 -16406
16210 -16406 -17134 -12682 -11372 -10531 -1531 -3405 -6463 -3050 3315 8882 6922 -1353 -3029 -2668 -2583 -2234
16194 -2234 -2453 -5492 -4132 -1298 -2688 -3026 -10714 -10434 -8927 -6814 -4853 -5412 -11561 -10718 -2434 -8976
16178 -8976 -6470 -3769 -4061 -5460 -8098 -2115 -3951 -5578 -4257 -2361 -167 226 -1328 331 883
16163 883 -6166 -15408 -17723 -20890 -21172 -20567 -14693 -15640 -20405 -21898 -16206 -14539 -6461 -2010 -6828 -11255
16147 -11255 -7831 -7070 -12841 -9285 -9115 -3722 -1455 4070 7000 8273 12085 4588 -5420 -10472 -10757
16132 -10757 -13663 -8962 -10827 -14139 -11136 -5801 -6964 -6354 -3024 -1691 1106 2979 3774 7078 2236
16117 2236 1179 -1239 -3257 1264 -317 -1511 938 3151 6201 3865 2900 -1216 -5146 -7416 -6825
16102 -6825 -4098 -1959 -8867 -12185 -8044 -12848 -9128 -4739 -5384 -10234 -12044 -5026 -3799 -5516 -7449
16087 -7449 -1759 3064 -1126 -2143 -3761 -5317 -5624 -5264 -3167 -2452 -8731 -7027 -8027 -6463 -11052
16072 -11052 -15048 -18763 -12829 -6461 -4915 2371 450 -2543 -4862 -4501 4479 7213 1507 1033 2690
16057 2690 -1599 -3504 -379 1745 -3466 -3829 6782 13848 17559 23193 30235 30824 36203 46427 70928
16042 70928 96631 137907 186058 246960 289435 281111 222826 155569 112304 92726 89824 101217
16030 101217 125040 154641 196338 252205 299535 288911 228787 157658 104814 71926 58853
16019 58853 47992 35712 24955 14294 16929 22328 16281 11847 15904 16220 7298 2967 -2381 -1118
16005 -1118 -688 4607 10644 5445 2191 765 6262 8123 6337 5133 11678 13694 8455 71 -9974
15990 -9974 -9781 -10517 -3535 1188 2274 -199 472 2727 2061 1181 2999 783 -2609 -5707 -3015 1596
15974 1596 540 -2162 146 -1205 3009 640 -8240 -15895 -10932 -11531 -12598 -16220 -12555 -8625 652
15959 652 8701 6043 7385 2537 -2297 -5334 -2943 -7642 -6711 -6003 -8956 -3981 -4414 -1506 -9048 -7587
15943 -7587 -209 -3255 6481 12729 1697 -7001 -10087 -6212 -4888 -6132 -4875 -3719 -10563 -6544
15929 -6544 -2814 -1638 6053 5384 -1151 2920 4137 -3724 -2636 1060 -552 -7719 -4828 -1506 -2567
15914 -2567 -2310 -1127 -396 -1998 1315 905 -5257 -4777 -3682 -4733 -2845 -9269 -16729 -19512 -18270 -14388
15898 -14388 -9848 -8194 -7662 -9769 -8770 -2681 -5291 -10161 -5418 -5943 -8211 412 4254 3735 -1283
15883 -1283 -2781 -4575 -9047 -8051 -5890 -3300 -8474 -2027 7649 11392 10187 14323 13332 4903 6500
15868 6500 5369 -6391 -10999 -7976 -2437 -4334 -8810 -2712 -2215 3278 2449 -5093 -7465 -11586 -16567
15853 -16567 -21724 -15354 -10057 -4723 -7032 -13598 -13956 -6291 -721 -1919 -6016 -14226 -17373 -12416 -1431
15838 -1431 3064 8597 8223 9977 10304 3519 -1848 -3231 -8172 -12666 -7742 -5389 695 4666 -478
15823 -478 -8499 -15854 -18044 -19088 -12610 -6937 -8834 -12283 -12957 -12420 -15107 -20180 -22030 -13495 -6401
15808 -6401 -5894 -12991 -9087 -8470 -7839 -2756 -1773 1073 9818 8394 5196 4610 2415 -9034 -9335 -7985
15792 -7985 -9788 -8647 -3366 -3891 -6595 -5981 -8138 -5744 -8325 -3160 5780 4398 3016 6611 -1145
15777 -1145 -10096 -19110 -17415 -10151 -10200 -12354 -9161 -4149 1296 8812 12733 7313 301 -1676 -308
15762 -308 -150 7030 5553 4384 2780 -2179 -4115 -377 -6368 -642 6132 11502 8482 4037 -2266
15747 -2266 696 -2183 -5259 -2036 -345 -5448 -4627 -2184 -5014 -1272 1186 -405 -1335 -2622 -4059
15732 -4059 -6454 -2044 -4162 -5069 -3960 -5171 3372 6330 9102 9737 919 -396 4696 6790 3282
15717 3282 2588 -4247 -6460 -6747 -3498 963 6688 5946 5272 -3553 -5675 1512 -519 -10237 -14622 -11953
15701 -11953 -4861 -5469 -10075 -7281 268 2271 396 -2598 -2188 5156 134 -778 2108 -2462 -10477
15686 -10477 -18338 -20643 -12387 -6415 -6972 -6178 -7975 -10866 -15676 -15351 -8692 -8546 -7120 -2807 1659
15671 1659 950 -590 3149 -156 -7058 -3355 579 -362 -4010 -9873 -8489 -7601 -5608 666 10609
15656 10609 7482 3730 5965 5344 4189 5842 4193 -2099 -899 4364 1281 3479 904 -1796 -2416
15641 -2416 -1627 1400 6742 5521 -7404 -3626 5179 4031 2375 1536 1241 -599 -8766 -10747 -10006
15626 -10006 -10289 -11159 -9655 -7607 -8673 -2302 6605 10519 707 -4350 -11063 -12649 -1241 5146 4105
15611 4105 -2487 -1674 -3890 -4717 -5364 -10710 -15873 -8595 -2805 -5807 -8346 -6642 -10327 -12643 -9530
15596 -9530 -5034 -3623 -5021 -4241 -5725 -10031 -11491 -14604 -10135 -9050 -7452 -11360 -10743 -9556 -17868
15581 -17868 -23213 -18116 -16202 -15015 -9866 -4827 -5956 -7836 -2867 -5250 -7731 -6364 -8852 -3242
15567 -3242 2909 -325 -4683 -12350 -14108 -12731 -9559 -7756 -5609 -2057 -4836 -13156 -9351 -5998 -2998
15552 -2998 -4876 -7593 -13896 -19181 -22069 -21525 -12493 -13109 -12533 -9132 -8610 -9998 -5994 -1791 -4404 -8660
15536 -8660 -7170 -7726 -5015 4 9342 14774 2556 -8243 -8917 1440 6029 1806 -5987 -10220
15522 -10220 -7380 -7259 -5765 -5817 -10177 -7776 -7692 -11360 -9052 -4019 -3004 -6857 -6285 -12184 -6705 -1743
15506 -1743 1685 1983 -3512 -6813 -3247 -1999 -3005 2385 9275 8831 10685 10250 3521 -79 -4182
15491 -4182 -8158 -9941 -7250 1326 8685 5586 -1543 -2905 -11463 -11552 -6362 507 -253 -9527 -6471
15476 -6471 2073 -1073 -1992 228 -2708 2258 -2997 -1571 -1508 -5528 -134 -733 -1338 1681 -4359 -922
15460 -922 3333 -631 -893 3344 1598 -2478 -3388 844 -3403 -2820 502 -1632 -7410 -10592 -9417 -6813
15444 -6813 -4841 -1666 -3606 -4533 -5033 930 -946 -2799 -6457 -1079 5148 3466 -1587 -6310 -8680
15429 -8680 -9042 -12881 -12534 -11787 -16085 -16412 -12276 -2585 -1206 -3142 -357 -742 -1407 -5968 422 2218
15413 2218 -3380 -4166 -7618 -11725 -4041 4458 8383 5970 -2223 -4077 -1044 2936 5450 5333 729
15398 729 5093 8344 1441 1650 -503 -2038 -589 -2706 -4207 -877 -1559 -7542 -14538 -12518 -9866
15383 -9866 -12891 -11567 -18577 -18568 -18619 -16757 -10777 -4678 -6024 -10598 -14380 -18698 -13920 -14220 -11041 -7014
15367 -7014 -5595 -8406 -11282 -9516 -12121 -11733 -5996 1159 5309 5849 3837 2255 -3355 -4667 4068
15352 4068 5519 -2400 -3305 -4463 -2606 706 4602 11507 10983 10390 3065 -5333 -7987 -2314 2679
15337 2679 4251 4458 7166 6469 4044 7086 9984 13165 17765 19842 23318 35878 64322 106869
15323 106869 162539 214172 246150 232408 173391 111247 65985 40108 20735 15730 6245 -948
15311 -948 583 2519 -2473 -1465 -112 -1458 -3284 -6177 -5728 -4312 -7091 -13125 -9239 -6621 -9515
15296 -9515 -12513 -8433 -5111 -3183 -3972 -2756 -5664 -10536 -3831 -3427 -5884 -4564 745 5508 1837
15281 1837 68 932 959 -3722 -14021 -15228 -19043 -17839 -16048 -19681 -18166 -12205 -2502 4993 -2533
15266 -2533 -7170 -2835 3793 6023 7288 3876 -830 -3336 -4015 -1857 -6726 827 3996 -137 -1695
15251 -1695 435 603 6103 3485 -3035 -6127 1175 -4158 -4763 -3925 -591 -4046 -12307 -14801 -11229
15236 -11229 -2137 -3569 -570 -2484 -8798 -9788 -7855 -2222 508 805 -1562 -3897 -1548 127 1024
15221 1024 1055 1483 967 4291 4534 3305 1419 -6842 -12685 -7238 -7790 -6779 -4831 -4345 -3516 -2848 -6445
15204 -6445 -19562 -19228 -6022 -568 -8170 -12816 -11587 -3550 296 6798 5188 5217 8172 5997 67
15189 67 -2466 -5518 -5977 -3836 -10556 -13839 -9551 -4693 -13039 -13670 -15363 -13550 -14932 -8340 -7023 -1830
15173 -1830 3344 6365 2106 -1028 70 -3148 -2727 773 -336 -2449 -4400 -12553 -13515 -9073 17
15158 17 707 -4433 -3476 -3738 -2767 -6526 -7898 -6739 -1577 256 1682 -911 -2804 -7409 -9137 -9020
15142 -9020 -5045 -9049 -8665 -8710 -9820 -15111 -17726 -10485 1237 3952 -4107 -6592 -6331 -8160 841
15127 841 6318 2861 1974 1067 2214 1457 -3876 -2505 -176 -3913 -11341 -6958 -10939 -14282 -9275 -142
15111 -142 5645 159 1323 8799 4661 -4272 -4832 5493 -5657 -19226 -20086 -21039 -17360 -12886 -10521
15096 -10521 -5398 -1265 -3089 -4825 -2832 -5918 -5291 529 3603 6365 7703 4731 -1239 -1003 -3228
15081 -3228 -6996 -6646 -3109 -2163 1646 -1881 -3825 -3100 1419 -37 -6792 -9149 -10719 -7203 -7093 -3468
15065 -3468 -2337 -8144 -8684 -8690 -9370 -8227 -9679 -1339 2226 -1691 -1955 -971 -1583 -12129 -13627 -10334
15049 -10334 -7394 503 -156 -1890 3813 5559 5352 1609 -162 -729 -966 -2858 -1408 -943 -6440 -9425
15033 -9425 -5198 375 647 -4588 213 9323 15048 16259 10738 2240 -2377 2672 -908 -3925 805
15018 805 1795 2162 -4447 -7611 -8845 -10677 -5128 -707 -5320 -8380 -2821 4781 -1655 1575 2469 -2370
15002 -2370 -6384 -2441 -1136 -2530 -890 2193 -4084 -2703 -5161 -6715 -4182 -7767 -825 7058 5876
14987 5876 1521 -7083 -9702 -15849 -12066 -4428 -1835 -3477 -1395 1250 4943 3880 862 351 -10
14972 -10 2057 -955 -1416 2275 861 -541 1420 880 -2237 -4998 -2166 -847 -5374 -9933 -14265 -13233
14956 -13233 -6973 -735 -3137 -4376 -11633 -16341 -15363 -15107 -6793 -5336 -2178 3276 -2827 -3568 2930
14941 2930 7318 3884 2661 1347 3450 -1095 -4945 -7462 -4082 -5979 -5527 2011 2342 845 -1682
14926 -1682 1094 314 -4500 -4409 -4721 -4279 -4161 -5806 -9245 -9083 -2163 6621 -4403 -13509 -15409 -15699
14910 -15699 -8666 -6409 -2175 -3080 -4098 -7470 -7512 -6788 -7213 -8827 -7914 -7204 -7295 -7065 -8118 196 1371
14893 1371 1187 3945 3400 5298 4960 2587 -4273 -1394 -3332 -3484 1629 -911 -4608 -8083 -8855 -7939
14877 -7939 -6429 -9517 -11342 -9962 -9472 -453 4850 8750 5357 2258 -15 1360 -5091 -9957 -11643
14862 -11643 -14750 -6870 -2819 -793 -818 4383 6255 2334 -1112 -199 3760 6926 4660 3948 -1797
14847 -1797 -3349 -3206 -3974 -9425 -11588 -2420 3711 4670 -24 -13022 -10465 2925 7407 5055 790
14832 790 -3818 -4907 -2482 2609 313 902 -193 2273 1085 1029 6978 3743 -6649 -10331 -9133
14817 -9133 -7425 -10327 -6970 -8304 -11083 -10972 -8242 -5408 -11461 -13437 -7568 -5370 -6346 -5988 -8002
14802 -8002 -4779 -2515 9 1899 2184 -2876 2538 1607 662 -1172 -7600 -5863 -7469 -6464 -6223 1031
14786 1031 8392 10037 10347 13810 9329 3528 999 -6928 -6594 -1588 1657 3272 -338 -4139 2780
14771 2780 5958 8304 5081 8441 4718 674 -3425 122 4122 8216 11528 3145 -3413 -291 -2428
14756 -2428 -855 -2119 -6040 -7881 -4456 -5868 -2939 -5235 -2183 -2335 -1775 -3849 1074 2467 4125
14741 4125 6303 3280 -406 -7175 -9065 632 6916 959 538 -1739 -10231 -9183 -8930 -9406 -2998
14726 -2998 2782 1236 -2606 757 512 1590 653 976 876 5576 11549 17844 11135 7381 5685 2513
14710 2513 1877 -5410 -6863 -5819 -7349 -7108 400 3817 7360 8152 -777 -225 2596 2454 -317 -6152
14694 -6152 -3112 1775 -4109 -5358 -5440 -4781 -1272 -4189 -541 -5673 -14195 -10674 110 302 37 2987
14678 2987 5223 4192 -650 -2295 -128 -2074 -3465 -9419 -6721 -5993 -1962 -7122 -11742 -7839 -7561
14663 -7561 -8595 -7500 -8224 -7739 -506 -643 2328 4136 3422 1728 -1565 5279 -1571 1959 2922 4228
14647 4228 -1704 -4552 -6171 -11928 -11563 -16640 -9076 -1054 5718 7587 -783 -8039 -10357 -7651 -1276
14632 -1276 -892 -843 -5509 -9460 -7679 -7633 -1672 2430 1389 -6211 -3239 353 -890 -4608 -1861 2404
14616 2404 5069 7682 7570 5246 4386 9894 9055 -70 -5504 -4701 -807 -2051 2954 14464 10923
14601 10923 3883 1152 8180 9518 3026 -1051 -2043 -1360 2712 3529 2167 -651 2046 7860 1227
14586 1227 8942 5914 5966 6260 -3719 -4829 -8611 -6525 -4909 -6726 -3718 -1950 -6037 -9683 -3342
14571 -3342 3891 9018 12124 2382 -4855 -11911 -12929 -7621 -1941 -1325 -2909 -2825 -2978 -2578 391 -4854
14555 -4854 526 711 -5064 -2416 1051 -4365 -9477 -7822 -3862 1590 -708 -541 -8370 -4525 -3851
14540 -3851 -2134 -6142 -9142 -3929 1894 3644 -2052 -3176 -5207 -2977 -3984 -1773 -5579 -3800 1940
14525 1940 4028 4584 11692 10742 1380 -3632 2563 7036 5598 567 118 -6476 -11167 -9043 -3956
14510 -3956 2686 2261 6518 4405 -521 1589 2812 717 -1709 3294 742 -1265 6500 7542 5407
14495 5407 2317 152 -2162 -672 -664 3191 -1398 -6391 -866 3621 4060 6235 430 1694 9244 8254
14479 8254 1974 4604 5383 1111 3003 -2060 -4464 -4917 -1143 8 4360 8922 8978 8413 7058 5543
14463 5543 2336 5564 6489 12717 14763 10727 11342 5835 4401 -712 -4556 -4162 -3863 -486 -4352 -10445
14447 -10445 -8266 -8572 -14022 -7545 2587 3344 -2877 -3683 167 5856 8834 2753 2413 11038 13186
14432 13186 8833 -3910 -10220 -8014 -4247 -2931 -1784 -1452 -3119 -10997 -8511 -11772 -14535 -15855
14418 -15855 -10097 -11578 -16371 -7676 -292 1498 -4185 -891 -326 -5937 -1046 4699 3067 2208 2389
14403 2389 4315 7094 1367 -2844 -5132 -6476 -10054 -9120 -7721 -9836 -11163 -9275 -6486 -3050 -4401
14388 -4401 -6656 -4431 -3305 -2566 1356 2889 1703 -4982 -7084 -3993 -9960 -8980 -4349 7436 7816
14373 7816 7963 3543 2602 5341 6863 9516 1690 -1367 -4420 -9692 -8221 -9846 -10550 -5580 -3073
14358 -3073 -7759 -9234 -8445 -5181 -8957 -5596 2273 2625 -1327 -369 2852 2422 6324 6192 3564 -3388
14342 -3388 -11347 -6884 -5114 -10395 -14238 -11496 -9600 -8006 -5921 -2483 1361 5136 3563 1971 80
14327 80 -2963 -6084 -5099 -2270 1835 4511 4936 7213 5297 6749 9265 9593 10044 15922 16770 17246 14839
14310 14839 12553 11049 8890 12726 16981 13987 3120 5773 7598 4642 5856 5942 14067 16672 13983
14295 13983 7005 -6009 -4894 1941 3257 4834 4614 6587 6456 4663 1564 4009 4504 -1464 -1858
14280 -1858 2190 4432 2313 5297 -1539 -553 7436 15948 12878 12565 17109 10918 1538 7048 8440
14265 8440 2809 -47 -1666 -2187 715 721 9533 15364 9989 8426 -249 -8103 -5664 1333 6068 8417
14249 8417 5163 1886 4213 12387 13014 4206 -2177 -2278 623 9653 13754 8103 -2572 -8938 -6588
14234 -6588 -9516 -11871 -9837 -7363 -7272 -3475 6098 6633 2732 6517 7546 7617 13891 18545 13458 10267
14218 10267 9290 8720 6565 6586 6819 6304 8683 5795 -1905 1383 4245 -408 1135 1552 5147 7099
14202 7099 4679 4167 1912 2088 299 -4879 325 8215 5314 6894 9520 8624 8397 8382 4855 7296
14186 7296 11148 10680 3826 -1651 -3973 -9059 -13129 800 5318 5299 7426 6156 3544 -2073 -617
14171 -617 1737 867 4317 2047 -2547 -6320 -6892 -14652 -10747 -5135 550 2945 2089 -1507 -2284 10162
14155 10162 11091 10589 10891 12094 9056 7514 4352 5026 366 -6444 -597 1854 3933 5917 4644
14140 4644 6216 6836 3364 1932 4537 5556 2225 10247 6872 1523 1435 8415 9732 5024 5430 12771
14124 12771 15041 13346 11787 16267 23516 20973 17120 19751 16259 12010 13412 13232 11115 12536 6202
14109 6202 -1993 -1907 -812 -10441 -16742 -8591 -3483 -77 -403 758 635 -252 7437 11021 10807 12301
14093 12301 10930 3554 8487 7015 3951 3355 3646 2236 3058 1844 4625 3739 80 -226 -5557 -11044
14077 -11044 -7929 -7332 -12130 -11471 -11331 -11908 -4110 -5 -1097 -90 1789 5331 7042 6858 315 -2633
14061 -2633 -3727 -1451 4613 9987 6670 139 -513 7363 11866 11205 7166 8622 13781 11358 8328
14046 8328 8030 15184 21113 15964 14444 7003 1350 5706 6713 5232 -786 -10613 -8358 -4317 659
14031 659 -822 3325 4145 5055 -718 -6417 -8034 -8449 1406 -1635 -2784 -762 -1005 1873 1696 1487
14015 1487 -199 -665 -1785 -4452 -8683 -7562 -502 7893 8454 5510 5437 4739 1377 -400 2410 1651
13999 1651 8773 4387 -4454 -3719 1720 6155 7012 -746 1670 428 -2435 585 6864 5706 4459
13984 4459 -814 -4877 -7206 -7056 -3270 -3628 -5978 66 -907 541 6932 7780 1340 -8012 -6280 1868
13968 1868 3430 1256 3304 6660 5694 1760 7218 8442 9693 10395 6377 2651 1658 2886 -3208
13953 -3208 -4543 -3663 -1109 -305 4425 6268 1841 -2644 2650 5355 4779 3720 5497 4230 -4749
13938 -4749 -6483 580 7643 7178 2788 591 8378 11543 12324 10025 9497 6560 10600 16339 6234
13923 6234 2689 7465 4966 -895 -1362 1052 7169 10788 8437 5445 3906 918 7804 6350 -316
13908 -316 -1216 -1210 -762 4669 12162 10744 1396 -5216 -6708 -8801 -4996 3822 10045 8646 9310 5461
13892 5461 5257 5288 5635 9113 7352 1263 4127 5988 10206 8343 5734 7022 8426 5534 8859 8457
13876 8457 10171 9556 5520 7086 8495 10828 9703 2693 -3777 -9324 -8550 -8228 -2941 8407 8675
13861 8675 5322 168 5248 6007 1458 -3523 -9246 -3879 7164 5355 5591 7093 6406 3605 2708
13846 2708 3237 3156 -1243 2867 5946 8217 9851 4423 497 569 4213 4027 867 11951 11238 4053
13830 4053 491 -219 -71 5327 4055 6292 10178 10127 4588 -986 -970 4397 6354 7316 2959 883
13814 883 1205 4737 6085 3747 8541 5960 3293 3398 -325 155 1850 5152 6151 12869 15743 18699
13798 18699 15587 12790 15910 17240 16539 13577 7697 9679 7541 5883 3995 2940 -1223 6938 15082
13783 15082 4546 -1296 -44 3830 -117 -1972 7416 10679 9483 9299 12821 13944 10108 8078
13769 8078 4532 259 7229 10879 6116 11319 14747 15258 16230 10882 11245 16094 21481 17665 21443
13754 21443 23852 43347 67971 92884 100618 86871 84329 95573 120756 154888 179321 172607
13742 172607 137177 92004 58241 38531 30097 28581 27214 21785 18339 27101 33293 34969 39921
13729 39921 45322 44583 44400 47149 44481 40092 47787 68325 95142 108133 107486 104560 113175 138657
13715 138657 165711 176368 162054 128942 97040 83871 82781 91620 89290 88482 81037 66368 51716
13702 51716 48620 55650 55199 49128 40222 30750 25273 24931 30370 34510 42255 44674 42365 53655 65981
13687 65981 93477 142608 181299 202551 191866 144047 92430 61476 45585 39146 33449 24958
13675 24958 22532 19135 19130 19703 14708 13028 6610 2374 7441 8387 8674 13919 14924 15022 16287 6921
13659 6921 6384 11937 6843 10807 5751 4446 6021 9172 7266 2040 5172 -5636 -4428 3145 6795
13644 6795 9218 9412 7281 2311 1703 5062 8262 8976 7423 -355 -1450 2232 1685 4152 7853 -1420
13628 -1420 -1128 3126 1128 7969 10656 11402 9279 7883 10692 16085 13034 18688 19239 9861 7307
13613 7307 6078 10278 10855 4420 -5051 -1673 5139 6361 8001 14623 19393 10977 -1113 -4492 -2088
13598 -2088 5439 741 -7264 -4011 5441 13673 11453 19488 24033 26064 29151 32449 36351 30421 27985
13583 27985 23899 24313 23036 20579 18442 7280 6089 8052 13129 21457 22911 16503 13697 15962
13569 15962 20881 24176 21101 23275 32502 35593 42417 36007 35156 40552 43406 43888 32783 23846 21222
13554 21222 16144 15872 21291 19345 20073 22491 18869 16244 18194 25014 35490 42312 45384 49804 50867
13539 50867 48894 55738 63479 73099 83128 80598 88263 102609 112004 124996 151608 196574 272232
13526 272232 383523 539152 706911 776811 672292 475084 298647 189214 133883 93447
13516 93447 62740 53825 47702 43205 39380 44005 46485 48655 49924 55434 54478 61299 64136 56178
13502 56178 53642 57398 60325 55652 50596 35476 21842 17531 19591 26313 22794 20634 20286 16028
13488 16028 11082 5609 8490 15005 15940 17015 20469 23568 17111 12816 12528 9396 8371 10301 7190
13473 7190 3926 6034 4955 3739 5052 5483 5766 8907 7905 5981 12805 20000 17540 19284 15088
13458 15088 9085 11007 10737 9828 8501 9494 13889 13055 14373 18823 12531 13629 14982 22940 21296
13443 21296 19336 16769 18928 17973 23220 25143 14374 3102 7049 14068 16425 14077 9624 12664
13429 12664 16112 16683 11754 16031 18490 22516 24140 21010 23159 20127 10532 8744 10243 15145 12134
13414 12134 10568 14392 19213 20092 16791 17091 10775 11854 14040 5852 1295 8806 10966 6351 4706
13399 4706 4057 704 1856 3500 3889 10528 16889 12793 15546 26819 27531 18999 17732 24879 21122
13384 21122 14924 17003 10412 5193 9658 15193 15242 18474 20432 14684 6917 1071 -87 2849 6441
13369 6441 15253 21970 24474 28249 25639 29014 32406 35758 39116 44728 35318 23334 23728 29975 30531
13354 30531 25379 26492 21920 23649 30855 34818 28070 33945 32073 27552 27140 30937 33441 28535 20363
13339 20363 20587 32149 39773 36921 38428 38007 34062 29277 27198 21920 25590 22206 18023 23900 31762
13324 31762 35745 36100 30583 26719 29232 29356 20866 21467 26939 25134 22497 27917 28545 31832 32309 33239
13308 33239 30943 39519 48552 53705 51835 52053 47708 48305 43142 32883 28798 32654 37381 34295 33630
13293 33630 31330 26094 24974 24312 25198 27482 27034 19577 13894 12954 15352 21200 20501 13565 15474 18261
13277 18261 18920 20394 22760 31502 31252 28479 26525 18987 13461 19333 27535 24929 23852 21305 18056
13262 18056 18368 15063 7665 14259 19676 20776 15735 15542 20312 16307 15415 22976 31527 33717 26675
13247 26675 28855 30070 30354 22978 25272 21316 16957 16720 16519 17348 11533 8539 9569 15603 19261
13232 19261 23185 22557 28519 25198 27709 31301 35003 35173 32228 30817 42031 42526 52484 66967 77816
13217 77816 78615 68001 64545 68334 73057 85435 110408 134307 170595 220198 291443 383505 527238
13204 527238 739116 1061009 1502088 1922689 1968128 1502360 952719 599219 405751 297527
13194 297527 233272 190548 156096 125904 111903 103094 90713 77301 69307 61972 57808 53453
13182 53453 49291 57149 57405 57636 58302 44761 35957 31486 27637 34432 42558 39876 39503 40570 37431
13167 37431 33829 41099 43901 40318 46083 48098 48833 51061 61362 72152 76181 83923 94102 111641
13153 111641 127692 144418 155810 147911 132296 118983 101864 82351 74991 69859 59503 49803
13141 49803 40058 34218 27762 28651 26564 37543 38189 24869 21621 17333 8204 7650 11188 15795 12018
13126 12018 10080 13015 14446 12851 9032 11332 17786 26788 31492 34362 36666 40053 44678 42454
13112 42454 36076 30690 31496 41414 49299 44358 36183 36331 38351 40731 40141 44709 52132 55276 58670
13097 58670 63431 70496 65178 62018 54388 45880 45689 45433 34323 26179 21850 14678 14199 19652 36852
13082 36852 40347 38517 45804 51666 54061 52769 42394 38497 37143 35069 31511 28900 26675 20626
13068 20626 21366 25857 33378 39834 52586 63405 65460 64047 61719 58534 45726 41206 47056 48354
13054 48354 54971 64992 62115 56628 56828 54785 48282 43837 41430 44337 51966 58827 57227 50439
13040 50439 47019 51156 57753 55997 53993 56417 60535 59499 58808 69771 71383 55923 41615 36191
13026 36191 30457 16208 16963 32574 45004 47513 58268 75102 123474 161576 201415 257404
13014 257404 310739 271076 200454 161689 144214 113087 97216 93462 79735 66622 61110 50403
13002 50403 43252 41536 41712 43610 44301 42613 43044 43361 33499 33688 34943 32296 35018 35723 34555 30108
12986 30108 23648 21657 26107 33766 39831 42643 42138 51723 64641 67092 68434 64634 60499 61148 67840
12971 67840 72389 74109 70413 61011 40601 24301 19900 12286 1461 -1115 -4101 -5254 -18607
12958 -18607 -31395 -33756 -27983 -20029 -29357 -30007 -22297 2629 28599 55332 78031 98171 99940
12945 99940 84636 79280 74274 69968 77943 90175 98035 94392 89784 82402 78586 77213 77269 82192
12931 82192 84548 77617 61577 52157 50939 56598 62625 62882 71062 81195 81871 68232 45746 32382
12917 32382 15804 -20635 -65588 -82816 -45590 36958 129884 185740 192036 182340 179246 176516
12905 176516 168161 159112 154859 158749 167228 165361 168286 175920 197044 230134 267407 321921 371967
12892 371967 419578 502518 669254 848999 924967 864650 668875 439955 301580 247613
12882 247613 220653 203553 195687 194779 201004 204165 208051 219744 234188 252434 283696 311273 328984
12869 328984 356642 391238 412282 440046 491681 585181 730971 953665 1276193 1689948 2023388
12858 2023388 2083167 1877964 1473816 1026819 716506 552303 461508 414067 384421 361254
12848 361254 344457 336921 333222 330303 328627 333995 342085 354062 363447 369177 366614 381649 404546
12835 404546 427362 451077 468921 474978 466272 460442 467678 479399 489629 505634 526905 534659
12823 534659 526659 516975 522010 542934 579479 631490 678430 711585 731549 739169 748915 765033
12811 765033 796729 834715 873200 925665 991410 1055012 1107447 1152323 1198163 1234883 1264546
12800 1264546 1302780 1358082 1435928 1530120 1634898 1755818 1874387 1988887 2090218 2175531
12790 2175531 2276342 2419812 2611159 2846891 3152893 3556593 4065414 4713042 5547496
12781 5547496 6587395 7766743 8786351 9166863 9123487 9375402 10172786 11461882 13236815
12772 13236815 15660828 19110383 24080283 31066164 40775686 54344892 73957689 104098885
12764 104098885 151267106 220258250 303208477 361816830 333368609 232532282 141656034
12757 141656034 88215692 59730591 43894714 34103878 26856814 21039552 16673907
12750 16673907 13529356 11197577 9387037 7998267 6961840 6167116 5484350 4882414
12742 4882414 4389070 3969908 3612379 3330449 3114096 2922792 2747159 2567278 2356756
12733 2356756 2143046 1956665 1794172 1654462 1556718 1495868 1444059 1368348 1280943 1202831
12723 1202831 1142221 1081302 1001226 911928 837743 773285 724564 703236 701508 709195 706617 682997
12711 682997 661878 627729 584582 541294 513098 495050 486807 496010 517756 538707 548229 555175
12699 555175 563183 555544 520107 464578 405308 360537 327195 293920 272726 263915 257993 251283
12687 251283 254289 269325 281708 281222 279816 284174 285710 282900 283486 284646 280602 271210 262543 255159
12673 255159 240874 232658 230604 231394 228880 225541 222744 215471 201971 178581 156535 146630 150906
12660 150906 150744 147739 137512 130235 118148 105963 95571 94896 95607 99887 105987 118964 127609 135067
12646 135067 137483 142811 160729 175725 178425 185344 200684 208280 170648 102921 29436 -49727
12634 -49727 -91627 -81351 -35400 9418 29877 32807 35283 48574 61398 70991 67832 55733
12622 55733 53297 53267 48937 44877 39571 27451 22533 14184 270 7311 35496 85934 168365 254902
12608 254902 298970 282213 226481 166089 129885 108297 85755 69627 66754 82001 107207 116347
12596 116347 117525 111900 103797 95624 78682 65569 64771 65516 66032 57227 50673 50163 44401 41841 45069
12581 45069 48132 48881 46407 40251 37563 31840 27334 27199 47445 79560 107853 124843 135558 145163
12567 145163 134493 126134 132639 137748 126285 108018 94763 89793 88114 82844 75573 62619 46330
12554 46330 30740 20931 19266 26654 31737 33646 40754 36955 32280 33494 35788 48299 50477 49146
12540 49146 54179 55645 58679 60238 64095 67604 61027 57953 58150 63858 65291 56522 47190 39505 38214
12525 38214 33765 27119 36509 42203 38026 37918 39587 38108 41188 40085 38141 42326 53391 55482
12511 55482 45485 54526 68697 65209 47752 37242 37931 35944 35945 42378 47360 49446 61341 65966
12497 65966 54506 53852 53476 38963 28192 19326 20931 34236 39688 42968 38865 33809 33731 31520
12483 31520 26501 27658 33167 33211 31815 24119 22048 22018 22002 23827 16589 8825 16327 15188 10757 9555
12467 9555 13693 17251 18187 18536 19243 23430 27224 33835 49747 71589 83505 71483 55366 47128
12453 47128 38320 37972 34178 35119 25286 23456 20320 22634 22725 16941 17409 14028 19269 25825 23083 25699
12437 25699 35678 31012 21637 15943 11020 6679 -1026 -5077 -1676 -3316 431 11061 10305 -2641
12423 -2641 -9762 -7033 -688 3578 12707 19817 18548 15911 16060 18885 23192 17342 16218 16406 16252
12408 16252 20482 22382 26700 27235 20390 23208 27107 30488 35188 37738 31210 16175 14872 21508
12394 21508 17766 16896 18811 20098 10543 6422 223 693 6924 11268 13084 13569 12935 15588 15238 9869
12378 9869 9559 12730 13114 12236 17693 19892 14523 9935 5919 4455 1864 4232 -1957 -5398 -7188
12363 -7188 -3415 -2383 -256 -53 4270 6111 6310 5373 12190 12470 8648 5963 3673 9486 16746 14659
12347 14659 12186 17976 17289 19619 20739 22490 21343 29998 32595 29502 30785 31060 29296 35795 44141
12332 44141 40670 38868 42205 46721 55802 63565 77929 89962 101473 137088 186215 253721 351361
12319 351361 488743 694904 1019658 1461118 1886933 1928202 1461339 918033 560058 365536
12309 365536 263637 198068 152055 117791 97256 83346 69464 58436 50011 50691 40154 31175
12297 31175 20985 28881 28151 25867 26295 26475 25278 21274 24618 26650 25401 20350 21099 16160 16346
12282 16346 20567 18838 13940 12690 5968 1771 -1690 9338 17840 17366 8168 3010 101 365 1661
12267 1661 2893 4747 4593 2139 5965 7865 4432 7605 11477 12074 12948 13174 9370 6197 6875 10013
12251 10013 8676 9675 7734 5424 12451 11067 15182 12497 10148 6864 3383 -3035 -10317 -13264 -5280
12236 -5280 -564 -3822 951 3565 4837 10070 5615 4225 -2265 -5867 -10812 -8361 -1771 6115 8211
12221 8211 2827 10054 13964 5897 463 1180 6141 2423 5514 11383 14800 15443 11598 6549 6219
12206 6219 9534 10078 8651 3256 775 -2660 -7399 -9943 -7231 -2942 -5720 -4861 -12781 -12202 -6699
12191 -6699 -10503 -13407 -9031 -553 -730 -3445 -3440 -3545 -3368 -1915 -173 2563 8647 6057 -1628 -9720
12175 -9720 -2233 606 -2280 -3270 -6783 -2977 -4043 -4301 -1987 -2737 2564 4788 6362 7728 9759
12160 9759 7438 686 -1974 -329 -5839 -7588 805 7463 8359 -1333 -5359 -217 8680 6306 6460
12145 6460 5181 5766 6361 8980 1920 2818 467 4470 6466 9749 6059 2936 -2429 -4042 -9043
12130 -9043 -5911 3355 10228 12763 9914 12973 11275 8847 11776 15201 12038 7133 4951 5189 1435
12115 1435 -289 -303 -7576 -7219 -1461 1823 6462 7369 4439 801 4674 6683 7295 6351 3166 -538
12099 -538 190 -4820 -2087 1245 1360 2989 3846 3815 -2773 -944 987 1008 1096 8584 14794 9454 1767
12082 1767 1721 -3916 -7427 -6120 441 6337 5042 4714 4831 6107 5572 -1224 -7832 -3153 4021 2611
12066 2611 -1687 -5716 -1418 3763 3646 596 -1825 -5123 -1901 898 2488 1227 -4558 -6833 -8610
12051 -8610 -10835 -9911 -7419 -13910 -20144 -17129 -15956 -8472 -4309 2093 3555 5544 10244 4406 -1276
12036 -1276 5011 -732 -1350 2434 3314 9938 10674 10016 7050 7285 11791 12128 9246 10052 4051 -1950
12020 -1950 -5024 -4570 1064 2617 -600 -2286 502 4416 472 -4141 -3961 -3984 -418 2637 -553 -3998
12004 -3998 -5085 -8192 -11526 -5130 889 4472 7048 3974 -1267 -842 -5726 -7717 -4847 -6623 -2057
11989 -2057 6281 7289 4220 573 2030 5544 2846 -4545 -5821 555 3278 175 5184 6570 4633
11974 4633 -1585 921 6254 6478 5461 5179 5725 -101 -1910 -3356 -3842 -3943 -8840 -4012 -2177 -8421
11958 -8421 -8589 5692 15210 20734 17993 12344 4819 12976 20711 19165 10177 5153 4080 884 -1962
11943 -1962 524 2296 1300 -1404 -3710 -5857 -6845 -5406 -5695 -4212 -9390 -14898 -13114 -11573 -13614
11928 -13614 -15290 -12517 -12148 -10905 -7584 -3175 -4349 -11499 -7229 -6791 -4390 2589 1130 3391 5533
11913 5533 956 3718 8350 10500 10090 11099 6054 -2500 -10206 -6796 -2483 -3960 -8545 -7936 264
11898 264 3825 7578 5441 -3095 -2142 -2633 -6076 -10248 -13384 -10890 -8231 -8381 -6705 -4867 -8017 -2371
11882 -2371 -5356 -8481 -4284 -2412 -8001 -3686 4672 11673 11140 6317 4715 3687 12347 15125 11783
11867 11783 8848 8524 1294 -2021 -3030 -701 872 3378 -261 6884 7590 4647 1631 9253 12175
11852 12175 9656 4838 -748 -2769 -5216 -8532 -5316 201 4336 4478 7515 2292 -2483 -3602 3000
11837 3000 5041 2699 -3506 -2023 1921 -2205 -6559 -10358 -11006 -9634 -4626 6894 5007 537 -2434
11822 -2434 -8127 -13115 -14234 -13379 -9428 -5108 -11421 -16139 -7716 -594 4290 8334 11794 15181 9737
11807 9737 4374 -2420 -3870 1693 85 7583 7782 5536 2510 4565 12590 10089 8382 9848 9331
11792 9331 10997 9446 5626 1871 -5244 -3373 -5448 -2314 3749 3754 5880 5512 4244 1957 -4049 -871
11776 -871 6719 6687 11733 17457 12936 6728 10014 11611 9660 8043 2694 -2308 3192 5504 -2855
11761 -2855 -7411 -2267 -2951 -2156 -1992 -1470 1183 3910 4193 4501 3347 -5371 -8956 -2876 -621 2660
11745 2660 224 -4291 -5242 -3091 533 7182 6109 9444 4153 -685 9792 6726 2028 367 -2882
11730 -2882 -5801 -6375 -3311 -3515 -5584 -9458 -6835 -692 3714 4047 2849 2558 7035 13889 16599 19125
11714 19125 9640 -3009 -4849 -2350 -2366 -2668 -5689 -2715 -2711 -5274 -2145 1927 3453 4490 7867 8167
11698 8167 -2226 -5736 279 2301 4301 11747 5330 -4441 -6630 -2807 493 -2838 -3922 -9964
11684 -9964 -10387 -5737 -10165 -11149 -7132 -728 1625 912 -5430 -4723 3023 5527 2587 4902 6835 3480
11668 3480 -4979 1800 10589 11090 6984 5046 7533 14279 25486 23733 18419 11388 5550 12196 6534
11653 6534 8377 13140 8842 -15 -180 5711 424 -3510 -1289 3838 1162 -829 698 -1108 3845
11638 3845 3127 3229 7960 10861 7838 2653 -3327 -1647 -5668 -5687 -6475 -3554 -753 -1225 8361 9029
11622 9029 4934 1688 2525 3704 3664 -169 -6018 -5904 -540 2571 10691 12106 10377 18280 21446 17026
11606 17026 13362 5038 2799 2186 -1351 1078 4872 14380 14736 17581 22104 29389 31892 33092 45940
11591 45940 67801 87646 108048 129705 144715 141994 129536 109556 90178 69020 50904 50990
11579 50990 40852 34929 31518 19485 8717 4987 12967 19580 21944 26337 22818 22370 18377 18675
11565 18675 23280 30909 41978 56237 71672 89489 117756 135921 143901 144700 142546 129247 113196
11552 113196 100408 91050 89765 90848 101838 123607 155298 192870 239061 309593 389192 458328
11540 458328 488112 443923 344685 249957 183254 139889 102332 78656 60463 52361 52198 49965
11528 49965 49740 48781 48418 45851 43420 46973 51848 59362 68291 71048 85224 102042 125374 159680
11514 159680 207059 266084 342380 421840 475099 470329 403637 314209 239040 188984 153128 144639
11502 144639 139801 145099 167360 194445 233920 289101 368560 453577 504669 493989 408946 297653
11490 297653 220123 169496 126214 98247 92974 89159 79076 72965 64633 58828 58281 50484 48773
11477 48773 54064 55468 59242 66899 74549 80289 93557 106992 142170 188002 252568 332770 416341
11464 416341 482128 505255 451986 357840 263079 188166 138483 110041 103853 92942 83573 82696
11452 82696 95274 118133 136929 153971 173513 174247 151528 119751 92714 67353 49263 36015
11440 36015 24422 21280 20053 19972 20205 18230 14841 19766 23196 25656 29056 26715 23050 27275 28172
11425 28172 26963 27536 39223 54995 70534 88714 114807 135054 141977 132970 117312 97871 70636
11412 70636 51528 38616 31264 21317 18448 15276 6337 1287 -4714 -1960 850 3705 2328 1669
11398 1669 -1130 -882 61 -1614 1776 3540 -1978 -6368 848 6832 -1733 -5417 2422 561 -2780
11383 -2780 -8296 -10105 -5037 1356 4533 5176 7776 4013 2495 -2226 -7833 -10400 -2562 731 2479
11368 2479 1451 -2015 -2386 -4949 -6625 -7742 -14853 -15993 -11546 -9805 -12538 -4865 2483 516 -3597
11353 -3597 -6455 -7153 -11824 -9290 -6878 -12752 -9921 -3996 -3710 -6223 -4460 2650 -1073 2172 4131
11338 4131 6052 -220 -127 1326 240 -1780 -5245 -8598 -8527 -7796 -3520 -206 2178 261 3744 6531
11322 6531 8360 11233 8881 6781 1456 -2637 -5355 -16290 -23591 -14332 -12795 -11223 -10462 -10059 -14570
11307 -14570 -16800 -9283 -2026 -5698 -7339 298 4367 -3688 -5023 -2062 828 3282 6019 5597 -1677
11292 -1677 -3667 895 2292 2274 3470 3279 937 2420 3188 -996 -11461 -18308 -14803 -11270 -6643
11277 -6643 -6363 1046 -2611 -9856 -11112 -6708 443 3081 -1542 -3566 -1623 2410 -309 -3747 -306
11262 -306 1218 1482 7341 9440 5641 7728 9126 3434 -4987 -8858 -11002 -10891 -4902 3030 5772
11247 5772 10389 43 -2565 1594 1678 3194 135 1113 1167 -2132 -2047 -4532 -5998 -7772 -2593 2582
11231 2582 5207 7198 9772 6574 4401 3830 6447 583 -13236 -15268 -9107 -4320 -4465 709 3776
11216 3776 1638 -3927 3012 7369 1509 7842 9614 16441 12158 11702 9662 4386 4622 8630 5248
11201 5248 1603 -1052 -2022 -708 -4001 -2813 -1374 -6004 -9258 -3363 -5490 -5305 -7625 -1700 -6243
11186 -6243 -9511 -392 4605 7307 -7277 -18535 -20980 -12480 -10142 -9286 -6430 -1970 4034 3619 -3178
11171 -3178 -61 3869 3350 1073 6036 5557 4533 -1456 -7633 -2512 -575 1990 4405 -826 -1408
11156 -1408 2255 -4574 -8120 -8086 -10433 -11387 -7574 -4695 -3208 -2990 -1251 1490 -87 -7526 -9830 -6114
11140 -6114 2031 688 -3740 340 1209 1600 3295 4070 -317 -4569 -3481 -4570 -2210 -4454 -6899
11125 -6899 -3255 1563 -1897 -2084 -1435 579 931 2312 1505 607 -517 -1586 5172 4071 5156 2215
11109 2215 -2466 -5862 -6741 -1547 4542 5239 2501 -847 -8647 -11052 -13682 -11938 -1780 6717 7824
11094 7824 5204 3281 2916 3936 3440 10024 11550 2472 -1053 2255 8562 10151 7877 -369 -3305
11079 -3305 -97 3358 -293 52 4410 4551 -33 -1783 790 -1665 -436 2983 2949 1927 3991 6212
11063 6212 2861 5705 8054 10755 6589 -1318 -2608 5822 10111 3207 1636 1468 4134 6247 11786
11048 11786 9576 6076 814 4213 1317 3758 8704 7247 7834 8522 10758 9153 9508 6014 1437
11033 1437 3354 6526 7598 3033 5723 6904 3471 5614 9521 13697 9941 4456 3412 4873 10332
11018 10332 8130 523 1404 9147 12816 15217 17151 20057 13604 8388 8000 8116 8378 6115 6380 4597
11002 4597 -618 1641 4191 5510 8197 4308 271 -812 5839 10507 12667 16404 13754 9149 5182
10987 5182 1237 2243 6960 4609 1439 1961 4065 3721 6762 4774 -173 -3194 -2448 -2837 -2592 -8228
10971 -8228 -8069 -5268 -8427 -3730 -818 1583 2971 9352 13863 14446 14263 17125 10094 9851 12082 8826
10955 8826 12026 17131 14914 9261 12691 15416 17412 14953 16557 16910 18909 14459 3815 5730 7644
10940 7644 3938 1124 235 -1898 1144 186 -1682 -1888 556 6077 9099 11049 11008 6861 3138 9798
10924 9798 6884 58 3183 1932 5736 6030 9674 10879 16583 11732 9225 9587 13437 14217 8958
10909 8958 7342 17471 20514 13432 11133 13488 9425 6425 12598 17303 16078 20455 17206 23141
10895 23141 19115 16278 15957 16695 17876 18375 18162 15442 16054 13980 10528 7998 9157 15101 10360 7350
10879 7350 9175 13201 14727 13515 16005 14750 12252 9152 10437 17581 16416 18444 20762 21432 20711
10864 20711 19051 18171 22330 22080 14788 14300 14956 20700 24944 17863 17591 17459 17022 19499 19860 22197
10848 22197 19115 10832 13480 18848 18822 21066 23051 22214 27813 30873 23726 19013 23556 24590 17950
10833 17950 21588 21751 19630 18490 23835 30880 35089 31713 28496 25482 19872 17888 21421 22481 20885
10818 20885 21367 24692 21438 21270 20651 27340 31893 27330 21245 30826 42182 40482 30130 28255 32895
10803 32895 32615 33509 34949 39194 41823 40209 43507 42327 34327 31135 28097 27701 24804 25280 28579
10788 28579 30985 37922 42193 41173 37062 48225 56846 51443 47631 48813 54438 52098 52255 56220
10774 56220 62034 71563 69967 60237 51873 58675 63955 57114 57454 62600 60673 59200 62141 64463 64799
10759 64799 70562 74207 68541 59786 58982 67750 74259 77926 76557 87908 90687 87449 90258 91345
10745 91345 88215 86342 92803 100755 101116 102044 95337 89951 92150 94660 95601 102892 107572 109922 111706
10730 111706 112236 105599 103182 105023 115206 121003 122251 121125 123128 125062 125619 126919 132319 138700
10716 138700 142787 148806 151696 161660 168643 165389 162569 163690 164444 162599 162213 162399 162763 166958 169939
10701 169939 171879 178688 183325 186320 190243 192498 199314 210023 217214 215124 221070 223044 217766 212851
10687 212851 213237 225119 232222 232281 230644 237139 243177 244728 245952 251511 259030 258412 257037 257535 261993
10672 261993 267406 270520 277184 278794 275270 274095 267559 271845 276568 274765 269256 266746 264669 271685
10658 271685 270126 264172 259707 267646 268163 263309 262109 253795 253629 252297 251618 253253 253143 245252 234239
10643 234239 231307 230614 230532 229788 227350 219578 216589 216996 216182 215134 212208 208891 205968 197762 192239 184643
10627 184643 181383 178285 172614 175256 171421 162968 164714 169576 168301 160210 153638 149815 145330 142660
10613 142660 134558 129511 133770 135128 135522 134860 137107 135440 130766 124334 120872 119139 115941 120341 119159
10598 119159 114931 112378 105801 101020 100859 101853 94619 98264 95050 94021 95504 96375 96078 96732 89406
10583 89406 81511 82893 82090 83634 77270 75717 82010 81689 77505 74153 63892 65435 63284 56389 57096
10568 57096 58471 60109 53484 49490 55288 51740 55948 59417 56748 52387 48383 48133 47988 51911 57936
10553 57936 52608 52089 58720 68533 67875 66439 56962 45582 47498 53658 51034 47593 43275 47035 55319
10538 55319 52132 48746 48651 53926 53163 43610 40587 39770 44183 39118 38332 36512 36802 34602 33852 29427
10522 29427 29369 23709 17269 24011 29229 29292 24774 17920 14615 13663 19950 22948 28317 27048 19831 22131
10506 22131 30891 35380 34443 33082 35381 36368 31229 32213 30691 27299 30335 36101 40860 36430 32180
10491 32180 30410 33424 29688 29132 27760 25816 25427 16772 17931 27307 25417 17601 16059 13084 15899
10476 15899 17616 6984 7587 13863 13320 10523 5090 4301 6222 9939 11545 12190 20474 29587 27937
10461 27937 25880 20805 18572 19830 23267 26791 18793 13149 14503 20607 21162 20468 18842 15198 7322
10446 7322 6573 6177 20296 22564 20277 21310 15678 11311 15365 21083 19722 12319 6820 9767 11681
10431 11681 7085 7991 6220 6671 8501 4668 5939 10131 11686 11795 13882 21891 18268 15405 16449
10416 16449 22949 18910 15326 12830 9383 9271 10117 9985 7060 7581 8817 8152 2175 -2136 449 13629
10400 13629 19778 20507 16938 18796 19103 17605 15509 8056 6013 5799 15368 15590 12811 6780 4367
10385 4367 1048 7378 15505 13360 5828 11167 16919 21269 16212 13732 8639 7863 8922 2229 -1908
10370 -1908 1403 6450 2304 -3579 -8958 -3723 756 7164 13257 9540 6803 5054 2144 -3803 -3300
10355 -3300 992 239 91 8418 11208 5856 -3995 -3052 6602 8305 3259 14 6183 5315 4744 8741
10339 8741 5123 8197 11304 4594 2278 2815 2371 7418 14454 20147 15561 13526 12288 7447 3496
10324 3496 3295 2448 3557 3766 -2733 -3054 2142 7309 4137 846 2154 2180 1628 -1694 -11735 -13937
10308 -13937 -8002 -6787 -3107 2448 9299 11173 5334 541 5680 5130 1980 4624 4618 6314 5153
10293 5153 8698 8937 -840 -7441 -10250 -15350 -15078 -6434 3894 2723 -1641 -11332 -13815 -13098 -10611
10278 -10611 -11314 -12304 -5798 -2169 1854 1099 6325 6175 5550 1486 -7880 -7258 -6637 -5167 -8131 -11577
10262 -11577 -15459 -8576 -4236 -1018 5034 4396 7097 7975 6878 1478 -5025 -6160 -7732 -1093 5297
10247 5297 8116 4245 3820 2450 6253 4379 -3483 -8754 -13653 -4306 3241 10399 8457 9252 8846
10232 8846 2356 -4324 -10574 -12078 -5662 1590 4209 -4484 -7521 -7313 -1986 597 1256 2625 4639
10217 4639 -1995 -7591 -10319 -6429 -1380 2978 5392 8744 4390 1582 2452 6082 4808 3934 -4311
10202 -4311 -8465 -9288 -10827 -5840 -3608 -2867 -8004 -7348 -1622 6589 15386 10786 10010 9187 9815 4035
10186 4035 -7777 -6455 -8644 -8702 -3405 -6038 -5541 2412 4030 -1530 -4078 1189 5561 5309 -2860
10171 -2860 -2115 -6536 -9303 -6520 -6364 -10283 -6861 2274 7150 7455 3381 -34 -186 2152 -4934 -9214
10155 -9214 -5442 -2975 -433 -2727 2412 2924 2617 4733 5760 2894 -4772 -5042 -5019 -6974 -12055 -14917
10139 -14917 -12702 -15079 -8802 -5033 719 8290 13031 10119 5889 -1755 -56 -9070 -14841 -9388
10125 -9388 -4912 -5937 -1429 1435 27 2351 3318 6762 9439 415 423 1370 -1308 958 1227 -5990
10109 -5990 -10878 -12989 -14985 -7330 -4070 -1325 -6869 -10860 -4943 -6546 -769 -962 -3682 -6016 -6597
10094 -6597 -6532 -13713 -6987 -1772 1473 -704 -1163 138 -1608 -5209 -10612 -13186 -16220 -10864 -6816
10079 -6816 -1666 1936 2670 5446 -687 -4979 -11215 -9369 -5266 -1302 -1156 -1171 1257 2515 -236 -7941
10063 -7941 -13144 -17771 -13318 -7006 -6063 -6193 -13085 -17814 -15929 -9729 -11941 -8087 -3808 -5166 419
10048 419 6269 9411 6243 -2241 -2050 -1679 -21 5488 9091 16183 14060 7557 260 -781 3231
10033 3231 4549 -1625 -3350 -3185 -2621 660 -2434 -1151 2356 1643 1344 1243 4985 5544 2386 3496
10017 3496 -1523 -7367 -1586 5818 6662 3885 -856 1182 -1172 1092 -885 -2242 1703 12222 15590
10002 15590 8961 -452 -3423 -890 4329 -2219 -2960 -677 3341 6913 6108 2093 2662 6171 7527
9987 7527 7721 12651 10547 7090 8500 12240 7889 8348 8035 927 2433 2648 -137 -11678 -15043 -7445
9971 -7445 -5559 -7525 -7570 -10007 -10185 -9227 -12238 -11958 -7895 -8216 -3946 -1333 -547 3098 5406 5982 3191
9954 3191 -1412 5551 8826 12067 5277 5471 1523 3062 5208 7881 8452 -275 -3374 4302 8754
9939 8754 -480 -7778 -6402 -1652 2203 3605 -3889 -9892 -7117 -1196 5157 5228 2084 1711 5100 3465
9923 3465 2825 -4920 -1397 3081 4726 4924 7644 9463 11405 13997 9857 8782 13610 15980 12258
9908 12258 7511 5768 2420 -3335 -1520 677 2258 -814 -4712 -3006 -1665 -3333 -5826 2636 6712
9893 6712 -2388 -5527 -4266 -5273 -976 7177 7963 1240 -6252 -6654 -5652 -183 6110 12825 19707
9878 19707 23963 19992 12762 6250 4256 9522 1518 -2674 -619 -1353 -2322 -184 -2469 1859 2594
9863 2594 6243 10549 10783 13798 9823 11077 11508 9919 1406 1386 -2668 4058 8674 12021 11821 10488
9847 10488 11934 9655 6993 1891 6369 6772 12350 21861 20558 19183 19568 9390 2523 5071 3018
9832 3018 1877 -2255 -823 -7393 -4623 -8110 -13651 -9949 -12677 -17197 -22368 -18898 -17990 -15629 -17582
9817 -17582 -22017 -16016 -8274 -3841 -4864 -8510 -6370 -450 4930 -527 866 1039 7292 6662 2154
9802 2154 -817 -6059 -4089 1056 -1521 -5748 -5078 -192 2253 -2631 -5121 346 1053 -3576 -4228 -4816
9786 -4816 -9022 -6995 -5107 -5114 -4176 1498 5928 472 -6204 -1009 -1817 -309 -2132 -4867 -3073 -6399
9770 -6399 -5369 104 10004 2462 582 293 3032 4442 -197 3334 10620 12249 2296 -763 -750 1575
9754 1575 10155 3376 -4446 -1267 3877 2244 -1165 -4665 -3944 -6976 -10988 -9950 -10635 -7122 -4890
9739 -4890 -4987 -6402 306 3456 362 -4393 -2940 -7257 -12952 -6903 -3528 -972 851 -370 -2888
9724 -2888 622 843 5901 3426 6000 9032 8654 10092 9774 -4526 -12481 -3981 -8347 -13700 -4933
9709 -4933 -1006 804 -846 -2039 1442 4233 206 -7009 -6973 -5126 -4890 -6445 -3190 -2310 3006 1080
9693 1080 -4790 -6707 -3804 973 -5141 -13775 -10276 -7579 -3166 1911 2736 4810 887 -2275 -5268
9678 -5268 -13132 -8878 -12734 -12856 -3529 -250 -3866 -3598 -5260 169 299 -2755 482 -4183 -4283 -5955
9662 -5955 -8171 -7959 -11829 -7911 -6953 -4226 -1717 -5151 -10566 -6684 -8559 -7948 -9228 -9177 -14137 -12328
9646 -12328 -5169 -4886 -2519 -674 -5896 -2837 -6026 -1262 5350 5265 2991 -640 -612 -2902 -4921 -8992
9630 -8992 -10230 -9195 -11785 -7504 -7202 -4119 7797 14039 6036 1962 1181 -7835 -6496 -5378 -7210
9615 -7210 -6659 -2685 4424 12962 10120 13241 16786 7344 3223 1351 359 2355 367 -316 287 -1718
9599 -1718 -5644 -5402 1254 935 -6038 -6478 -7712 -6198 -2597 -3827 -3040 -8088 -8315 -576 -3878 -10814
9583 -10814 -14940 -7574 -518 -1697 -5643 -901 -730 -869 -3624 -3782 -3628 -2205 -1302 -1119 526 1400
9567 1400 -7333 -9338 -13346 -14700 -9072 -5900 -8868 -8445 -6963 -6153 -933 -1748 1637 594 -140 -3121
9551 -3121 -14702 -11667 -9079 -3092 -1348 -3484 -4842 1711 7593 1481 -3491 260 3629 6647 5778
9536 5778 1269 -210 -325 5252 -1438 -3398 911 1557 -59 -321 963 1458 8232 5576 -2812 -8263
9520 -8263 -6681 30 2594 -2454 2083 5632 10889 10967 9504 5255 -3721 -4488 271 6653 5785 4240
9504 4240 6448 1179 -5166 -6448 -5638 -2335 1030 3551 4423 4883 4835 4190 4859 3206 -2523 -4660 -2275
9487 -2275 -1174 2480 5578 5829 2314 8988 4356 1528 -6298 -7426 -3123 -4292 -5444 -2675 -3252
9472 -3252 -5979 -4469 -238 -1718 -4573 -3512 434 -1081 -2057 -6043 -4689 -3254 -7740 -2173 -1436
9457 -1436 -5420 -3692 -937 -3540 -10694 -18548 -15424 -19242 -14849 -6596 -9149 -9179 -9317 -13160 -8208 74
9441 74 6694 1502 -1566 -4660 -11173 -12873 -4327 -2373 -3588 -5159 -4957 -7820 -10555 -11321 -10339 -986
9425 -986 7972 5531 -490 -4332 -7542 -7924 -3713 -3248 -4982 -2562 -5465 -11575 -6408 -4236 -914 5003
9409 5003 2702 -2292 -3409 -4660 -2585 1639 7896 9479 10417 12736 7629 3626 -148 554 -8 -1385
9393 -1385 -3779 -6811 -5266 -7072 -6030 -1868 -2418 -428 -37 -1655 3959 8797 8443 4734 6479 5241
9377 5241 -1594 -1703 4912 7764 8681 4937 -1340 -3558 -6710 -2440 1593 6083 13761 16680 7549
9362 7549 -2333 -9171 -9573 -5419 -8485 -4824 -2436 -2181 3186 5663 4934 1816 -3023 -6365 -11746 -12564
9346 -12564 -10190 -10396 -14178 -10681 225 2415 1346 -1983 -3864 -3311 -2053 -3815 -9336 -1755 5365
9331 5365 1059 4984 6849 7590 4340 5149 4896 2817 -1534 -276 9253 10682 5239 4179 5023 -5987
9315 -5987 -2830 -4398 -8508 -6579 268 6405 -1257 -10375 -15341 -15200 -11296 -7273 5913 5971 3545
9300 3545 -2757 -3400 339 3719 1614 -6366 -8378 -8365 -9541 -7288 -3441 -39 -1248 -5289 -1025 882
9284 882 3283 -6086 -5574 -1494 1704 2472 10098 11542 8430 8840 18193 19509 6498 -3258 -6022 -5443
9268 -5443 -4539 -5354 -1809 -4370 -6267 -5328 -4065 -4697 -10788 -10331 -8461 -3897 2863 5474 1692 2176
9252 2176 3770 3255 3055 -1647 -1819 1746 -4125 -1301 4359 7557 -122 5305 4828 7707 12783 12518
9236 12518 13312 17756 23209 20695 20436 13778 3313 -1935 9358 12116 13713 12530 5872 6211 -481
9221 -481 1832 873 -4098 -12079 -4223 8290 6746 2704 9331 8022 8261 8200 3797 1481 -81 -1826
9205 -1826 -3636 -9702 -8333 -5076 -5561 -9229 -8714 -4030 3252 4887 4627 3039 7650 8972 8786 1893
9189 1893 -7939 -7228 -3656 4593 4801 5340 3912 631 2968 5825 2193 -2630 -2180 -1970 -2676 2526
9173 2526 -14 -2300 -1569 -6161 -11633 -12105 -11040 -9332 -8974 -5536 -1587 -1401 -15141 -15955 -9986 -5625
9157 -5625 -2544 -10605 -14212 -14379 -12021 -7348 -1011 104 -4515 -6375 -12028 -18599 -11419 -9493 -15334
9142 -15334 -9725 -1402 832 217 -2783 -6869 -6107 4984 3677 3049 2934 6397 399 -2211 -4513
9127 -4513 -2602 1818 11747 3592 -3744 -3447 -10405 -10989 -1802 -1956 -1186 -964 523 1790 154 -6747
9111 -6747 -13472 -17919 -9512 2127 6388 3504 -661 -2039 -2411 -446 2455 -3922 -4845 -1302 1458
9096 1458 -1144 -4542 161 -9289 -8461 -13116 -12374 -4635 -3302 -2227 -1464 1747 3675 6574 11060 12702
9080 12702 12352 11248 13119 6086 860 -2706 757 5207 9423 7756 7495 8459 920 -9758 -10899
9065 -10899 -1691 -3290 -7808 427 6898 3201 1358 -6308 -5294 -2547 -517 217 -2555 -5829 -6310
9050 -6310 -7023 -10935 -5355 6835 11012 5336 2411 4636 4650 12128 17110 16698 14955 10333 2647 4819
9034 4819 2658 2024 -6284 -3927 5104 -312 -2933 -1494 -5806 -2899 -3982 -2303 1618 7851 10976
9019 10976 12772 8700 6190 416 -3167 2741 7774 4522 67 -5571 -5532 -5531 -5780 4798 11643 12570
9003 12570 8560 8800 9449 10400 7195 1467 -6987 -9217 -9664 -4356 1501 -838 -4985 -3093 -5483 -12110
8987 -12110 -10079 -7807 -7768 -7783 -7545 -5585 -3862 -3651 -2004 2055 3763 4888 5885 6535 7118 8328 6991
8970 6991 10837 8422 4405 6873 2284 -1324 5562 13992 9054 4819 2581 13 -436 3439 5036
8955 5036 328 18 7693 11348 11668 8807 8054 13646 5984 1904 3183 7922 11246 14773 13769 8169
8939 8169 2814 -4543 11172 25399 23632 16825 8745 3646 3081 12691 18977 16180 15248 13364 21451
8924 21451 30040 24139 13731 6070 5884 5410 5669 466 402 4188 291 4040 4249 1851 3972 -600
8908 -600 3210 5893 11723 10640 2945 5883 12123 14057 18479 17898 19636 23778 18237 23735 36693
8893 36693 43844 47279 46995 57605 76127 94540 107860 126996 156246 206510 269564 360232 488756
8880 488756 655793 832679 957974 987780 896871 721037 533759 384133 289360 216906
8870 216906 174907 142158 117075 103010 91216 86187 82657 73206 64686 62653 62263 60148 52879
8857 52879 51174 47433 47993 49125 51626 50861 49330 49338 52094 57456 68959 79049 100331 123844 145087
8842 145087 163558 193074 229751 274327 341335 447223 604290 824007 1122268 1483784 1833265
8831 1833265 2011916 1904105 1558028 1143146 803215 567826 411843 309793 246094 206223
8821 206223 171548 146335 123371 106185 95531 88346 88996 78218 70438 62987 59974 53483 47910
8808 47910 47935 50509 53754 50678 51412 51629 51398 53353 55980 57891 65907 72369 77113 88793 105163
8793 105163 126618 159296 198553 257542 348370 466858 612622 771788 886707 900628 809454
8782 809454 649224 476267 334748 240618 169757 133419 111511 82801 67725 60667 55916
8771 55916 49965 48459 48428 37131 26918 22215 20796 18566 23228 19792 16613 14662 20334 19703 6128
8756 6128 5245 14210 13693 13467 13364 6132 1304 1000 4587 2399 6469 8295 9685 11234 9582 11428
8740 11428 19088 23078 21403 14153 4844 5819 11594 15442 15157 12049 10003 2026 3038 5689 7645
8725 7645 8926 3238 6531 11960 16807 15323 6797 5685 900 -143 9252 12693 8122 7157 -408
8710 -408 -3251 -2053 -1143 6284 13814 6378 -5643 -4245 5264 2123 863 1098 7330 7113 1149 -1827
8694 -1827 2157 3475 2882 1930 3278 3936 6265 7700 7733 11607 16030 12954 9679 8271 9127 10105 8492
8677 8492 12383 16940 15975 11078 5957 2625 -4442 426 10982 13450 9357 9467 8698 11544 14497
8662 14497 10858 5571 11864 13915 4008 4310 9876 4195 8194 14925 17770 18370 18613 14769 17311
8647 17311 14938 13975 17041 13606 5272 -3283 721 2049 187 -2687 8133 9984 7211 10311 12499
8632 12499 11175 6431 4634 6340 6605 3464 4340 3950 6924 8618 19435 23471 24630 25789 25622
8617 25622 15512 15244 14502 19671 22088 23552 22390 25806 26267 24468 25722 25719 24084 23021 21291 26133
8601 26133 29625 31656 33338 36399 40740 44402 44921 51378 61288 65592 61655 56510 55797 54885 56214
8586 56214 61836 58527 42742 33102 25101 20083 23503 25064 25319 25060 22778 19638 12908 9551 8526
8571 8526 7758 2383 8986 12877 7217 2193 -3330 -804 12596 18269 12781 6781 11595 18119 10615
8556 10615 9858 11473 14664 23952 20756 19431 16561 14740 11887 6297 2152 -2951 -566 4842 6897
8541 6897 1102 2080 2003 -4459 -7160 -9213 -1608 -4201 -9927 -5376 143 4779 1498 -1059 3662 -1234
8525 -1234 -4952 -5014 1796 7942 5311 1736 5272 7275 5446 -1965 2898 10595 10655 15694 18752 14590
8509 14590 11690 10327 6261 6212 1691 6301 12318 14792 16148 18726 19797 18943 12513 13143 10545 4928
8493 4928 7332 7101 8252 9664 13199 16681 16180 13092 12248 11323 9618 1468 -4022 1879 -881 -2994
8477 -2994 7460 18107 15281 4941 -2188 -3274 5096 4731 9888 13623 12629 9505 11033 5043 -207
8462 -207 2171 7351 7202 7371 542 -4536 -940 405 1961 7312 11624 9504 8799 13853 18710 21012
8446 21012 12484 -2170 -8737 -435 -157 4354 8125 1264 -2525 -2215 5206 6983 2386 2126 4375
8431 4375 13948 19339 17739 11916 8072 3188 3850 9121 15127 23689 25433 20791 16454 11677 6517
8416 6517 5156 9801 14370 12668 12265 7050 6228 5504 2709 10180 9662 7847 8204 4156 127 620
8400 620 -6127 -10876 -9862 -3313 -1816 -3150 -5460 -87 4407 6626 15557 20800 25763 29385 28731
8385 28731 32001 33761 28084 18305 11267 7991 5106 1713 219 6607 16493 17564 18111 18228 17898
8370 17898 12760 11946 8904 2622 2063 -1026 -4644 54 1162 -7759 -8146 -4309 -2694 250 -3636
8355 -3636 -3687 -6383 -1282 4262 3934 6815 8594 9047 8613 7547 6826 -1420 -3816 4598 5723 5628 7707
8338 7707 5781 6441 8139 5389 278 5742 6873 2588 580 -1424 2511 -1719 -1206 -1435 2994 7874
8322 7874 5195 5860 802 -257 5399 533 -11627 -7853 -513 3508 5007 -519 -1163 -5891 -4751
8307 -4751 -2285 1570 870 65 222 -3397 -5554 -2503 -1305 -889 -6592 -5017 -4211 -3210 -7297 -13474
8291 -13474 -8090 -5746 -2176 269 4979 10429 7428 9335 8710 7051 8804 6832 -1191 -6070 -2882
8276 -2882 -1972 -3197 -7273 -6818 -9366 -8996 -4714 1324 710 -4663 2879 12027 12133 13568 11644 10926
8260 10926 7674 8237 7359 10239 7859 7064 8966 3338 -1879 -4340 1420 5607 7689 9798 12461
8245 12461 12559 8139 7141 2203 -169 -282 2792 3799 -5649 -9979 -9831 -8617 -11952 -8416 -8934 -12674
8229 -12674 -11190 -8342 -2269 -3269 -1732 6186 9111 10372 6442 -4028 -5341 5094 4029 4936
8215 4936 -3482 -4069 166 -1495 -6046 -5320 -6309 -4642 -8695 -3311 -7041 -13126 -10819 -6140 -4750 -4365
8199 -4365 -7982 -10664 -11637 -11649 -9178 -10888 -11662 -8478 -4901 -3900 -2628 -4436 -9550 -7758 -8746 -8527
8183 -8527 -2772 3324 2227 -165 -1648 -12320 -13485 -6892 -4446 -4314 -1982 1554 2523 7884 618
8168 618 -1485 -3985 -4818 -160 -2218 -8145 -2828 7819 10704 10831 5072 1490 4577 6155 8610
8153 8610 5296 -4753 -7965 -11960 -15901 -11246 -860 4628 4507 3357 780 765 7373 9029 -379
8138 -379 -427 -6305 -4528 1200 2652 5949 5953 1417 -6199 -8830 2269 5378 4048 3977 6809 7604 11388
8121 11388 11549 8138 8086 6298 -248 -3552 -9161 -6838 801 3585 159 -4768 -7872 -10992 -7170
8106 -7170 -3769 -3328 -1520 150 -2834 -7211 -799 4645 4976 -3026 -9828 -5356 -2802 3913 11108
8091 11108 3892 309 3242 -4342 -5426 -3052 3135 1304 4317 10534 4027 4517 7798 6284 5384
8076 5384 6032 6778 8912 4716 2064 -1362 10919 19336 14096 8183 3673 6415 1653 -2936 1037
8061 1037 8524 5435 3859 -1357 -6328 -3660 -283 9697 8722 10682 14837 14683 11695 12204 8026 5267
8045 5267 6185 10992 14948 15568 15537 12508 4942 4436 8704 5431 6896 15090 13069 17502 18756 13717
8029 13717 8987 10784 2606 -3391 -4528 4197 7313 6975 9803 9641 13373 12782 9631 5872 4280
8014 4280 7334 9593 7060 2156 9820 9545 5931 11068 11560 15664 11566 4396 5960 12346 12688 6842
7998 6842 9025 5402 5635 8271 8642 9946 15245 13160 15807 13587 10105 16328 11446 8805 9269 8954
7982 8954 11083 15676 11291 4907 7261 2534 -1421 -4230 -5439 -4801 -5781 -3295 -7373 -3729 2698
7967 2698 3615 6931 9104 4792 9827 10704 14915 22983 27128 23475 17362 6482 -1907 3739 12206
7952 12206 18540 15610 10588 9551 9543 13969 10316 6588 2258 4703 2472 1321 7688 7544 10427 6006
7936 6006 7713 11545 13241 13407 11438 3430 516 -7108 -7363 -2762 2283 1216 -3933 381 9733
7921 9733 11217 9438 10836 12012 11784 7515 5174 5831 4363 1115 -1217 3047 11114 8895 2510
7906 2510 -3308 -1698 -1913 -1546 -2167 3553 -2251 -7973 3970 5557 -174 -7986 -6079 -6218 -3435 -1902
7890 -1902 -3389 -2853 895 5257 8063 2172 -7937 -8829 -2678 1308 -1399 1026 1873 1973 10771 9543
7874 9543 5880 6192 2872 479 -6273 -5827 3211 4348 1679 -992 -5074 -555 3943 5396 8096
7859 8096 8290 4322 4629 -473 -4923 -7099 -5103 -2100 2111 -5330 703 111 5185 7443 5681 4590
7843 4590 4145 -442 -5185 1169 6026 3896 -2261 -2948 -4108 -10443 -8624 -11173 -11569 -8970 -9752 -2730
7827 -2730 2115 -3550 -1691 1864 3926 -220 -7659 -8107 -10288 -10673 -9337 -5266 -2111 -3765 385
7812 385 8433 16786 16767 9327 5622 -1941 -5710 -8360 -6359 -3021 -818 -3696 -6263 -6604 -3228 571
7796 571 2924 -3071 -4632 -4900 -7711 -12399 -9700 1894 6502 7718 2679 -4205 -9317 -2490 774
7781 774 -1354 -3886 -1105 824 3757 -900 678 5617 8037 7105 2341 -1556 -361 3073 4438
7766 4438 -1328 -3650 -6932 -7926 -3532 -865 5561 6961 4696 3382 -3980 -8958 -5971 -3898 -3447
7751 -3447 -5383 -454 -2089 1115 6795 5682 -1667 -5241 -7326 -2343 -1378 -3080 6062 6819 3421
7736 3421 5278 2042 -2165 -3591 894 585 9890 6132 -877 2017 2688 -874 1458 673 238 -5113
7720 -5113 -2429 808 4430 1592 1967 -231 -4994 -8938 -9572 -8306 -4289 -2408 -6570 -5563 -16867
7705 -16867 -13779 -4515 -1175 -2555 567 -1013 -7158 -12186 -13664 -6815 -7971 -10750 -8486 -1306 130
7690 130 -586 -434 -1737 -1580 2268 5168 -30 -4076 4916 3720 3923 1263 3266 2070 -709 -3101
7674 -3101 -6917 -7392 -2340 7812 2463 3516 -2373 -12773 -16155 -13113 -15559 -13448 -9763 -7342 -8223
7659 -8223 -1646 2030 1289 4690 8111 4093 -6397 -9324 -4196 -3507 -2476 1854 -6038 -5116 3293
7644 3293 11834 11542 10882 8897 2152 870 1805 2774 7928 17065 14452 7310 1122 -1673 2128 6002
7628 6002 12835 9799 -1887 -7847 -2235 -7909 -5524 -3436 -430 2325 999 1074 -2919 -955 -6601
7613 -6601 -16053 -15257 -4743 4159 7616 5594 11299 14591 14266 2691 -2259 -3139 -1644 68 4712
7598 4712 4329 7204 3555 1441 9654 12665 8655 2236 -7170 -10815 -9799 -10877 -12246 -14509 -17254
7583 -17254 -13374 -7127 -7018 -8857 -7399 -5556 -12940 -20120 -16337 -8906 -4350 3318 233 -1144 107
7568 107 -3578 -341 -4613 -3946 -3901 -993 -3831 -3502 -5741 -9782 -9710 -6660 -11277 -18749 -16213 -6591 -3745
7551 -3745 -5220 -1167 6155 10876 13111 11617 9517 3704 1328 -58 -732 -1712 972 2070 8688
7536 8688 11908 9830 9537 7243 -1813 -5551 -4850 -3252 -1676 2647 3165 370 735 -5867 -10041 -5618
7520 -5618 -1722 491 4847 13137 10781 7869 4014 862 -3603 -2202 1993 2049 -4642 -2729 -2049 -5144
7504 -5144 -6632 -3414 1153 -3949 -12446 -8211 -5347 -2810 -6153 -6242 -6534 -9112 -8650 -6392 -6108 -9774
7488 -9774 -10067 -1518 1099 117 3457 -2931 1299 -5999 -4604 -3263 -6320 -290 1178 -3526 -7908
7473 -7908 -4233 -4265 -5990 -7729 -4377 -3216 -1489 209 2462 -3370 -6625 -6437 -841 3254 4887 5524
7457 5524 5414 1367 -3366 3826 7564 3609 -3930 -5734 -5313 -465 -1246 3904 1108 -2470 811 3656
7441 3656 -2029 -1068 -188 1200 -2437 -328 1374 1865 -4140 -10117 -16968 -20688 -18466 -11030 -7458 -2865
7425 -2865 -364 -3352 -275 -919 -6469 -3624 -2391 -1014 6813 13854 14167 8067 -3510 -8054 -6600
7410 -6600 -5531 -3670 -4676 -3304 -12908 -12443 -10009 -9029 -8468 -5569 -6642 -5593 2796 6609 7789 4124
7394 4124 -4632 -1446 74 -5156 -3548 1662 8406 6298 4187 -6196 -10546 -2856 1227 -1719 -4287
7379 -4287 -5305 -3959 -1835 -747 -3112 -7969 -6030 -6510 -10946 -15389 -11424 -10972 -13329 -17389 -20376
7364 -20376 -24491 -12309 -5853 -4162 -5724 -5962 -2533 4339 2467 -6691 -16712 -10211 -3285 -2024
7350 -2024 -556 2200 -2585 -2501 1461 4153 -724 -2092 -4115 -4812 -8308 -7394 -11219 -13350 -11706 -9173
7334 -9173 -1951 1703 4510 7322 9889 8817 1512 2020 7537 141 0 4148 6347 3587 2151
7319 2151 -3033 -8021 -3309 -1320 -2299 -4712 -1092 -1645 1457 2234 1787 5728 2857 -4847 -7277 -6041
7303 -6041 -8001 -6974 -5946 -3673 -3885 -8339 -9381 -7532 -686 10193 17294 11949 4763 4866 15305
7288 15305 17001 11209 7192 5381 3620 -1309 5912 10839 10403 14023 12041 -110 -11255 -6629
7274 -6629 2223 4739 6581 -1360 -5772 -2173 4079 4124 7262 9162 5084 9327 13945 14335 9498 -1994
7258 -1994 -6993 -10505 -8558 -6034 7785 11543 6978 3300 -5077 -12887 -10833 -2981 -1562 -706 -331
7243 -331 1138 5943 5904 8001 6290 -2969 -8912 1509 6259 -517 -10571 -14097 -11854 -6175 -482
7228 -482 -7608 -3953 -2743 -9762 -13527 -9197 -3999 -5216 -5917 -10901 -11482 -1363 1834 1438 -1910 -7714
7212 -7714 -6626 -1508 5749 4395 5268 -2 -9014 -7540 -5582 -9424 -11127 -7383 -4335 -5888 -5652
7197 -5652 -4449 -2626 2792 4341 -37 -5792 -5288 -8034 -5570 850 7531 9772 10731 7824 4538
7182 4538 10088 5819 -64 -9716 -7638 -4786 -894 2796 1562 316 356 4382 1297 -1321 1953
7167 1953 12682 15806 13382 9775 7789 514 -53 561 5983 6635 -745 -7081 -7791 -8051 -553 2948
7151 2948 833 9143 12551 7023 -497 -2521 233 5428 1867 1773 -1305 -4386 -11839 -11992 -8522 -6990
7135 -6990 -11354 -9185 -1548 1235 605 -9985 -14396 -11498 -14847 -15173 -10781 -3740 1112 -6382 -14612
7120 -14612 -14750 -11954 -2677 2548 -2019 -4281 587 -657 -8954 -14032 -12204 -8015 -4910 -689 1279
7105 1279 -5296 -8091 -7309 -1052 4974 6295 7952 9894 8702 11378 11224 6845 6498 3598 5297 801
7089 801 -1751 -987 -2783 -5054 435 -884 1740 9291 8511 -2178 516 779 4596 -962 704 -491
7073 -491 -665 2268 3665 -315 373 6239 642 -5937 -5909 -2920 -7455 -2624 -4636 -2557 7500 8336
7057 8336 -2751 2031 9238 8698 6030 4902 -3013 -10241 -8127 2815 8205 5506 -785 -6941 -9830
7042 -9830 -11542 -10145 -5006 -1609 -430 3189 -6576 -12226 -10148 -4836 2142 1482 10207 21874 17360
7027 17360 5204 -2490 -7703 -2747 -654 -832 614 670 -2787 5410 20893 23937 15949 553 -7338
7012 -7338 -7283 -12116 -14011 -11293 -8252 -12421 -10297 -1090 -1437 -7689 -5484 3384 3677 5933 4311 -7353
6996 -7353 -7496 1148 2225 1912 6415 5033 -1486 7633 10303 11145 9314 5516 2961 -3511 -10237 -12852
6980 -12852 -17678 -15260 -15482 -18705 -10108 -1422 -10954 -16236 -11890 307 5164 2299 -480 -3548 -5937
6965 -5937 -6187 -3906 -4125 -2410 -6839 -11762 -13565 -8579 -4226 -8631 -7092 -8954 -13816 -13794 -17338 -20873
6949 -20873 -13813 -6474 -3738 -5388 -4302 -3547 -1890 -2374 -7838 -9363 -11575 -9498 -4209 4169 7181
6934 7181 3748 1455 -2864 -8171 -8245 -8802 -5667 -6111 -9449 -12047 -10010 -7027 -629 -1170 -3607 694
6918 694 649 -6515 -8610 -10470 -11848 -7797 -9886 -8283 -4177 5224 4192 4173 4465 -1436 -3722 -10949
6902 -10949 -11555 -9293 -5385 -3760 863 -1515 -9348 -11322 -10230 -2753 -2011 -5165 -9871 -10455 -11053 -6214
6886 -6214 -8343 -5696 -7654 -8618 -6732 46 7537 10353 7046 -1031 373 5058 1141 -5650 -8822
6871 -8822 -9037 -4899 -5371 -7798 -6869 -2268 -4250 -3743 -1670 2741 2546 710 -2183 -1528 -4260 1368
6855 1368 4447 -1296 -5321 -6190 -1424 -3059 -6722 0 -3242 471 -1104 -5018 579 3344 -43
6840 -43 -7747 -5996 -5914 186 1982 2021 4296 4198 6034 4132 2288 3158 5505 12879 9003 2233 -562
6823 -562 -4674 -3769 -9790 -5585 3033 11803 12100 1095 -4674 -3098 -4102 -4118 4100 9730 7914 5253
6807 5253 1990 3511 7826 6207 1202 5382 2464 3482 3289 1704 50 4671 -2934 -7479 1474
6792 1474 721 -1482 -1550 -3676 -2685 1651 6108 1899 -5282 -1546 149 3196 3172 1474 -3259 921
6776 921 5877 2723 7117 2223 -1675 -511 -3983 -749 -510 -2923 -8461 -5908 -4620 -4234 -4711 -2736
6760 -2736 1017 1967 -874 2002 9639 12487 15259 10836 5092 -3544 -5935 -10961 -1075 10749 10461
6745 10461 3606 5670 5995 9451 11235 9191 12592 13427 14474 19813 26850 27481 28380 31411 29572 27459
6729 27459 24581 26182 23428 20643 18223 18076 18034 11745 3861 4737 9912 8671 8063 -880 -4956 -1486
6713 -1486 4888 6031 4074 4092 3800 -3461 1017 350 3893 -370 115 3107 3831 3777 5507 2363 -821
6696 -821 2262 4053 2773 -5328 -6475 -3309 -850 -6767 -10586 -6668 528 2754 -1475 -2080 -215
6681 -215 -3467 -2189 285 620 -3668 -2870 -603 -5002 -9434 -9755 -12123 -9799 -3980 -3382 -6732 -7853
6665 -7853 -9388 -9050 -13201 -800 3594 -3876 -11228 -11212 -3927 1798 -3066 -4297 -1269 736 -2402
6650 -2402 -1382 2226 5054 5809 791 -1450 8885 11995 7553 2149 -1338 -1924 -4930 -6736 -7076
6635 -7076 -6369 -7578 -8944 -2868 1309 -177 -274 -4167 -5247 -7938 -4623 -2237 -5472 -6670 -7149 -3745
6619 -3745 -2569 -3359 -3249 -7146 -8643 -2403 1763 10002 11351 9632 4084 -4535 -5890 -541 -1932
6604 -1932 -8510 -11717 -5161 -10228 -9486 -8590 -14034 -16592 -8453 -7983 -3341 -276 150 30 1920 8597
6588 8597 8337 3981 -1041 -4572 -2510 -1035 -4031 -6314 -10516 -4753 9070 13962 7736 4091 2492
6573 2492 2294 -678 -3859 -8674 -12264 -7963 -1749 1734 -869 -3288 -3230 -1797 1873 4489 2271 -2967
6557 -2967 -8722 -10353 -16950 -11708 -5731 2064 1179 -1073 1437 1001 -6769 -7112 385 3449 -762 -7601
6541 -7601 -9538 -13564 -9293 -5307 -1273 7210 7251 1213 -2492 -5256 -4767 1727 2800 1572 1994 5482
6525 5482 6603 3473 -1064 -7517 -7301 -9807 -11955 -10439 -9857 -5587 16 -1754 -6640 -6270 -2336 1639
6509 1639 -788 4696 1751 -3186 -1985 881 -8039 -9299 1724 -1418 381 -446 2806 -1826 -2556
6494 -2556 -927 -4555 -8096 -7378 -9810 -12357 -15222 -11502 118 7422 1784 -5727 -6656 6489 6242
6479 6242 361 1420 2831 4003 3744 5131 5247 3455 -344 -1626 1396 4645 -1772 -4176 2081
6464 2081 4274 -4669 -2965 5360 793 1618 7971 3924 440 -1813 -3370 -4662 -2695 1428 -890
6449 -890 2638 8334 14453 13400 7821 7935 8643 8853 10819 2994 -1606 -8936 -3817 2834 2785 -4550
6433 -4550 -8825 -12880 -11523 -13318 -10433 -6167 -5781 -6562 -8782 -10266 -10033 -3963 -4074 -79 2253 -2421
6417 -2421 -4959 -5370 -571 -1497 -3796 -9961 -5250 205 3399 4544 3396 1580 2588 6505 10420
6402 10420 6032 3509 1286 -3127 736 5286 7720 7508 8545 7712 9223 4002 -4746 -6797 -4545
6387 -4545 3808 4306 -1072 4099 11137 8084 603 -10907 -10815 -1905 5255 795 -2215 -1109 -2795
6372 -2795 -4149 -2510 6987 13151 16065 13082 9211 8049 10591 6613 8339 8547 110 5 -4904
6357 -4904 -4207 -61 -7412 -15261 -16870 -6978 -3519 279 -1783 476 -5460 -10496 -7085 -4517 -2180
6342 -2180 -3021 -3269 2855 1976 -951 -315 -1428 -5650 -3942 -2885 -654 -3272 -402 627 -181 -1723
6326 -1723 -5221 -8997 -3884 -575 -3277 -9836 -11111 -3909 1334 -637 -2386 1979 3879 4018 5236
6311 5236 5020 5391 8905 7512 4210 -1664 -4121 -6635 -9387 -7179 -1636 3805 -1054 -2841 -6246
6296 -6246 809 7839 8572 3201 10156 11555 2647 4450 3501 -2391 -3366 -3559 -3665 -2163 -4042 -4516
6280 -4516 -3307 -5425 -8310 -10721 -14535 -11592 -8419 -3924 -259 6250 1450 -4821 -4638 -8256 -7350
6265 -7350 3323 5727 1585 -4930 -2431 -3118 -2071 -558 -536 -4065 -1721 4097 8590 4542 -615
6250 -615 1577 -1490 2778 -1504 -8960 -8365 -8509 -12809 -7567 -12408 -18001 -14930 -15099 -10002 -7479 1939
6234 1939 -2609 -11731 -13298 -10912 -10936 -5962 -2928 -1498 -2370 -4311 -1764 579 -2478 -6694 -5944 -8338
6218 -8338 -4045 914 3571 -2207 -4710 -472 184 666 -4052 -3814 2295 1411 -4478 -3228 -1749 -3150
6202 -3150 -2548 -4244 -5447 -5610 -7106 -7973 -8332 -14451 -18270 -14242 -8819 -6715 953 1465 2711 2084
6186 2084 965 -2313 -2171 4725 -204 -10081 -15576 -13673 -16510 -13386 -6614 -2141 -742 524 -380
6171 -380 8014 12983 14808 11641 4227 -1948 -3123 -1309 2467 555 2921 5181 6449 1442 -407
6156 -407 -734 -6616 -9688 -9504 -11847 -9891 -3872 -6111 -7007 -7035 -9863 -16541 -13808 -5727 -5013 -8247 -7982
6139 -7982 -3897 -3882 -3965 -2365 -8720 -9843 -7489 -2536 6388 1909 -2691 -12184 -16139 -14261 -8711 -12070
6123 -12070 -12910 -6293 -15330 -8189 4113 1596 -1371 -4532 -6656 -5883 -4188 -7375 -7361 -5803 -4930 -4716
6107 -4716 -8348 -7385 -13826 -10317 -6081 -6667 -6019 1487 595 -1043 -5515 -2654 240 -2409 -8326 -3163
6091 -3163 -37 2404 4730 7018 3774 -3391 -1251 948 3122 6943 7758 7099 5050 521 -6856
6076 -6856 -4661 -240 4161 7314 -1600 -8702 -11999 -14301 -10074 -762 -356 -4253 -9747 -9183 -1913
6061 -1913 -3643 -1565 -2670 -1031 -4978 -6180 -7803 -7420 -2853 5045 4674 -611 -1194 1730 5040 10880
6045 10880 4927 610 1773 7241 3335 -2426 -6674 -3421 -1837 -3478 -3069 2655 -366 -1977 1225
6030 1225 4354 -5567 -15208 -13065 -7862 -919 4327 11682 10099 10325 2529 -4485 -2066 1856 -4576
6015 -4576 -8977 -5791 3465 6461 505 464 -3644 -2411 474 -900 4009 6665 2509 4762 7640
6000 7640 3814 3469 5122 -401 -4037 -1520 -1184 -6355 -6182 1439 13539 6136 -1832 -969 2675 9585
5984 9585 10363 9638 4772 1606 -2432 -1978 663 3123 4128 6720 4886 2414 459 -2303 -7671 -12396
5968 -12396 -7344 -2425 -1316 4853 12343 8184 4265 9009 10519 13386 7183 75 -6778 -1264 4778
5953 4778 1681 -1331 -1787 -3462 -7797 -5990 -3012 -441 2338 501 -3614 -7177 -6815 -6108 -3411 2492
5937 2492 3730 -1320 -6585 -5209 -3057 -2700 -1927 -11048 -16870 -15119 -9111 -6248 811 4506 -173
5922 -173 -1991 -1846 -2294 2809 6184 -1190 -5412 347 -2315 -3920 -2551 -2999 -1971 -3636 -6450 -2620
5906 -2620 -2734 -2850 -4456 -3022 -1142 1683 -2817 -6272 -5359 -6129 -7275 -11634 -4099 163 -1397 1507
5890 1507 -1710 -4748 -8075 -8592 -6830 -9830 -5969 -2907 -773 -255 416 -722 -1631 711 4510 2792
5874 2792 -281 4297 6798 10742 8344 8253 5935 6671 12726 13687 12709 7786 611 2929 5641 -2058
5858 -2058 -4064 734 2841 1145 4748 -900 -7769 -11461 -9847 -5399 -7260 -2188 -2590 -6304 -3173
5843 -3173 -5768 -5274 -6590 -5140 -9340 -9631 -619 6351 8518 6882 3342 -961 -41 8333 9881 14834
5827 14834 7171 -2663 -5943 -1378 6930 9959 5877 -1411 -5109 -6995 -7756 -3701 -4771 -2900 -2984
5812 -2984 -3502 -1389 -1731 -10508 -10152 -10982 -9026 -5349 -1722 -4266 -2655 -2400 1900 2878 875 -3046
5796 -3046 -6979 -2222 -1103 -6913 -2621 -6 4080 2551 7054 12973 14376 17224 17979 20470 17883
5781 17883 7559 2243 5062 7695 -1789 -2687 2090 4285 6332 1936 -6384 -5288 -1940 -3642 -1324
5766 -1324 -1681 4101 8712 2846 103 80 1657 1065 903 1603 -455 2869 4353 4313 4651 685 489
5749 489 6303 7498 2352 -1494 -2787 -3788 -4749 -479 -720 -4810 -2264 -1247 -4781 -5911 -7555 -10631
5733 -10631 -7921 -5227 -834 -1346 -10210 -7791 -12574 -9850 -2257 -1640 -2301 -1399 -2185 -7475 -7944 -10638
5717 -10638 -9878 -6679 -15127 -16342 -12580 -10425 -7026 -7862 -4064 4704 4781 920 -3512 -6296 -3089 -3048
5701 -3048 -3596 449 214 -1712 -5859 -10294 -10634 -7665 -4042 -4766 -3531 -3774 -10918 -8262 -4503 -2644
5685 -2644 2891 5053 3377 746 2378 346 -2874 1351 5342 5338 5687 13521 19466 11395 -2899 -4091
5669 -4091 -1721 -1853 1935 3261 5678 5088 8223 7291 2002 2640 310 4182 4621 4381 6880 803
5653 803 -4819 -5189 6148 7935 8115 7140 984 -4292 309 7468 9939 2317 -5875 -4532 -7232 -3516
5637 -3516 1561 -3992 -7955 -6742 1106 633 -4892 -5197 -817 -4296 -5755 -3788 -5215 -3876 1357
5622 1357 -592 -4206 -1052 -1813 -5354 -1267 3088 3187 -3273 -4587 -5687 -5245 1196 7322 2691 -1348
5606 -1348 3199 -1870 -2361 -731 -6160 -12249 -9981 -4044 -6409 -7045 -7823 -1083 3026 -2347 -6555 -1578
5590 -1578 1980 7241 5225 -772 -6596 -7665 -9008 -4810 -5490 -2394 -2783 -6256 -7018 -2253 5791 1509
5574 1509 165 2196 -763 -480 461 -2379 1414 -2147 -4966 -5596 -8576 -7934 -9274 -4584 2724 -823
5558 -823 -6475 -3588 4932 7506 7278 10343 12967 14448 8284 3775 5327 6618 4989 4389 6149 11201
5542 11201 4212 -4276 -8794 -8727 -3564 922 790 -2479 -6852 -5858 -5995 -5059 -6000 -11610 -3803 6014
5526 6014 179 -5767 -9360 -11188 -5626 -2051 -3701 -2234 5477 6813 2559 -6073 -11162 -2686 544
5511 544 -517 1918 1238 1300 3518 12023 6758 -490 -121 -2537 -3855 -10659 -1297 10727 12648 11148
5495 11148 9080 7818 6178 8057 9143 2502 417 -3464 -8762 -9928 -6019 -9606 -8030 -5461 2667
5480 2667 6680 1648 -3979 -5310 2181 3106 3055 2606 8421 10709 11517 8776 9603 5739 5927 2448 3022
5463 3022 7401 5090 4039 5365 8195 7513 3203 -4775 -6951 -5387 -76 -75 -3936 -79 -137 -1208
5447 -1208 3908 721 969 -2657 3531 7638 9091 8292 7270 5343 5464 -2732 -441 -1260 967 3642
5431 3642 2909 4244 7875 7574 -40 936 3287 -1115 -6284 -2916 1022 1672 -3695 -7441 -661 241
5415 241 -2187 -1958 3539 5543 142 312 -5553 -1673 -2881 -4338 -935 -310 1185 2238 3430 6228
5399 6228 6240 6298 4266 -4617 -7650 -8087 -4550 -2779 -1321 -2555 2062 -425 -677 379 1559 8118
5383 8118 3858 411 -1909 -953 6066 3170 -1508 -2087 2052 -3747 -1058 -2928 -5435 -5790 -1391 -4359
5367 -4359 -1874 1160 6375 1953 -4691 -3612 1369 3016 4105 -752 -6680 -7607 1912 9617 8161
5352 8161 5783 8216 7852 6283 2869 -1922 -8339 -12432 -2158 -110 -4531 -9445 -10254 -2706 -4834
5337 -4834 -6750 -3798 -2726 -3095 2113 4261 -4050 -10296 -11507 -16596 -20155 -15154 -2958 6089 5992
5322 5992 -15 -2256 -4935 -6445 -2757 453 5766 2287 -2512 -10295 -14853 -9675 -9438 -7765 -4331
5307 -4331 -6625 -7477 -7175 -1529 1527 397 -218 4665 8349 13506 10145 10128 9548 6826 3277 6765
5291 6765 8595 2715 2812 1038 4478 7724 9384 12541 13188 1803 -2554 -4611 -3534 -2812 -3832 -2202
5275 -2202 -6913 -6678 -12470 -8201 3538 5453 2725 160 2974 8334 10672 6733 6704 6776 9122 5638
5259 5638 5675 8075 4299 770 -1855 2021 4753 -94 -2785 -4140 -3590 -4741 -4776 -9095 -1907 1425
5243 1425 7006 10455 8999 5241 -1198 671 -54 -4441 -6716 -5333 -489 6337 6642 1562 2278 -5021
5227 -5021 -14489 -17882 -22020 -19560 -14811 -4025 1655 -7040 -6945 -3428 -6718 -2825 2279 5196 4499
5212 4499 8059 1378 -452 -2494 1030 2312 -603 -877 1256 -2235 -6662 -8018 -3430 4544 3239
5197 3239 -1013 373 36 -975 -2025 2920 5293 2410 592 4280 6319 8031 3707 -3694 1686
5182 1686 1424 -4507 -2075 -782 -5884 -9341 -11453 -5797 2246 1609 3150 -1440 -7178 -3822 -6523
5167 -6523 -9534 -9554 -4834 -6881 -10255 -12224 -4051 -2255 -5624 -9814 -7367 -4691 89 450 614 -2007
5151 -2007 -8657 -8341 -5148 -5184 385 2532 6401 5619 -2214 -3878 -1950 1255 -3065 -5668 -9212 -11396
5135 -11396 -10833 -6791 -6257 -7970 -5823 -4546 -6623 -4024 -6653 -15160 -15007 -8283 -6074 -8747 -9841
5120 -9841 -8513 -4514 7858 6306 4612 6348 1410 -5772 -11518 -9818 -6018 -4372 266 -994 123
5105 123 -4395 -5100 -6204 -10833 -10961 -9472 -8368 -12427 -12098 -4092 991 -2247 -8093 -5625 -5038 -9042
5089 -9042 -2696 -1516 -6388 -7229 -4948 -559 -2552 -8379 -6171 -4802 -2308 -978 -2721 -5028 334
5074 334 2985 1636 708 2200 9518 2489 5258 5943 3018 -1851 -3066 1115 3034 -434 3048 9413
5058 9413 12892 6659 5629 12548 10074 6905 14731 11298 12567 12113 9836 11690 12777 11296 5520
5043 5520 -4937 -7072 -5841 -4303 -5935 -4401 2254 515 -4551 -5062 -4018 -6331 -7431 -10965 -13385
5028 -13385 -11629 -12054 -8917 -10633 -13332 -11781 -14512 -10596 3061 2270 -263 4132 2346 5874 6052
5013 6052 1646 7844 10881 8271 4657 -2652 -1393 866 -2328 883 -351 -2068 -5529 -5730 -1062
4998 -1062 575 -234 -2311 -8133 -8421 -4043 -1745 -8556 -9260 -6308 -6379 -5626 -5325 -6375 -4983 -254 3694
4981 3694 1262 -4497 -2828 4370 15080 16680 9728 3797 -2202 -5401 -3664 -3389 -4984 -9737 -10422
4966 -10422 -8989 -9280 -5461 -2681 2481 7940 7913 309 -976 2588 3007 3033 -788 -5686 -10176 -15327
4950 -15327 -16932 -7019 -8490 -2182 851 -1247 4590 4815 347 -225 -1266 -201 -8280 -22379 -21733
4935 -21733 -12418 -2570 3746 -3499 -4669 149 -222 -3240 -4496 -5181 -7685 -5553 2308 2600 -1105
4920 -1105 2771 4535 4876 7676 3278 3255 3638 1925 -990 -2376 -5881 -3606 -3869 -2062 850 1274
4904 1274 10045 12086 8552 5678 4865 7655 12270 10335 4239 7314 1008 -2506 -4491 -5301 -4133
4889 -4133 -1630 -3754 -4861 -9027 -9300 -8003 -7039 -694 -3690 -2506 -4834 -5460 -1961 -1249 3467 2914
4873 2914 5363 10026 7358 5762 3600 8042 5946 6067 10858 9334 7039 -1185 -2597 -3343 -6656
4858 -6656 -329 1089 -5691 -5184 2090 -3825 -2968 -5015 -4862 1590 1215 -5688 -5598 -12135 -19845 -15729
4842 -15729 -7511 -7241 -11522 -6221 -3411 -7079 -8962 -365 1915 1194 1670 1668 -2067 -3843 -2096 6354
4826 6354 8287 424 -3228 -3924 -4524 -8804 -7306 -7999 -5506 -4897 -3171 2245 -96 -3205 -6756 -2360
4810 -2360 6317 4432 -43 -4540 -4088 -4614 -266 15910 17084 9649 1311 -2225 -1790 -1696 4834 4181
4794 4181 6887 12023 9028 6840 1689 8334 12699 12893 11173 975 -2587 5217 4183 4388 4492
4779 4492 4483 1333 -7366 -9331 4296 11318 10660 1814 -1130 -587 -2774 2623 10836 8882 1436 2194
4763 2194 -632 116 4673 3335 1768 6641 4614 -496 -5040 113 6669 6022 4924 3256 1895
4748 1895 3266 808 -482 1633 2135 2742 5294 8383 6702 7584 8541 8174 9519 5605 2634 -227
4732 -227 2901 5104 -822 -10910 -13841 -12607 -11286 -5243 -3544 -3301 -1098 -3339 -3471 692 4614
4717 4614 10273 2039 -3839 -7925 -9958 -6305 -9937 -4005 -1658 -4882 -3615 79 5239 -210 -7415
4702 -7415 -10934 -13734 -6960 -3424 -3604 -5199 -8281 -16603 -14495 -7618 1600 2400 6177 5807 130 -1142
4686 -1142 -3787 -1353 -1247 2008 1217 1110 -2269 -6777 -8032 -7020 -7857 -6210 -3767 -363 10451 14215
4670 14215 15199 8975 -1464 -9745 -8225 -5696 -5124 -1675 4813 2023 -4050 -9665 -12438 -9680 -4321
4655 -4321 1288 9744 8332 8138 4394 1800 -3822 -2832 375 -4140 -2943 -4040 -766 9649 4164
4640 4164 -5372 -2288 2927 6421 3170 2523 3477 4773 6261 8847 3484 -2721 -3981 2437 7071
4625 7071 3475 -5647 -6802 -9213 2877 7671 4539 163 -187 -697 1267 142 -3316 -3533 -1103
4610 -1103 5558 4702 4376 7136 8550 6892 4566 -2202 -127 1793 2055 3483 505 -281 -4092 -5349
4594 -5349 -10379 -9668 1800 2675 -1232 -4174 235 4183 6157 1575 665 3682 8669 6950 1101
4579 1101 -4653 -3997 -3595 -2451 -1844 -60 -3196 -12338 -13988 -7058 -1441 3260 417 -8399 -2191 1889
4563 1889 5110 3927 6813 6957 -935 -5860 -3734 2958 3827 1141 2937 -988 787 3309 6569
4548 6569 7284 5134 5373 1902 1634 -4530 -1304 1037 -4442 -4753 -8054 -8162 -2341 -485 -5530 -935
4532 -935 3655 2249 -261 122 334 848 6198 7125 9148 11503 13719 7059 1233 3290 12748 15364
4516 15364 11874 -1015 -5373 -498 8145 1751 -865 4574 5279 2399 -3537 -4297 -3466 -1495 -3447
4501 -3447 1938 3605 74 -3378 -5330 -861 143 -2038 -4643 2535 7820 -589 2237 -812 -1253
4486 -1253 1291 -2304 -3542 3951 9144 6322 2529 2276 -467 -3825 -4543 -5766 2236 -208 2713
4471 2713 9747 7822 3936 9489 13046 14537 18579 11448 737 4195 6023 5379 2240 -3928 -14542
4456 -14542 -23695 -22413 -16250 -13960 -10686 -7183 -5587 -5677 -6268 -3000 -3947 -227 2575 6814 770 984
4440 984 2395 11777 8777 1366 870 -5939 -2581 1409 -2158 -7419 -3101 1337 4815 217 -4662
4425 -4662 -2057 -1279 -1887 -109 -2184 30 -127 -978 3606 6615 -4294 -8709 -3343 -9015 -12544 -6438
4409 -6438 -4862 -1365 1263 4394 3542 1218 -40 -3422 -3590 759 -4135 -6197 -5374 -931 -1684 -6381
4393 -6381 -9501 -7735 737 628 1443 2457 -455 -4962 -5715 -2307 4126 2543 1989 -2546 -8582 -12716
4377 -12716 -13085 -6027 547 -1134 -5360 -6441 -6106 -5380 2478 -390 1838 -4067 -9289 -9661 -6356 1821
4361 1821 2407 -1527 -2915 -1551 7729 7963 4816 4766 1852 -1086 -1285 6144 5957 1818 5715 6323 1839
4344 1839 4754 5900 -532 -3852 -3418 4919 8091 5851 6685 8146 6445 7126 5658 -1316 1901 3844
4328 3844 -3587 -3898 -4902 -4538 -7610 -6378 -1115 -6469 -10866 -8018 2890 6828 4442 2566 1868
4313 1868 6427 -51 242 -3108 -3949 -6114 -5697 675 0 -2518 1925 3527 2996 351 611 -1479
4297 -1479 3161 6422 1198 -3283 881 6068 3761 2278 124 -2566 -2320 4272 542 -6131 -612
4282 -612 -917 -3252 -8450 -7590 -10013 -18534 -13618 -11031 -5265 1392 6644 6409 384 -3008 -9654 -15150
4266 -15150 -14665 -8186 -3742 -6993 -5609 8 -1105 -6497 -7647 -626 6749 9283 2156 -4713 -7423
4251 -7423 -9902 -5371 1556 -7197 -17214 -11461 -8223 -6883 -7135 -3903 -3693 3784 6747 6741 8109 6896
4235 6896 10418 8304 3879 2291 1819 -2604 2610 -600 -346 -2761 -2923 -5798 -5472 -4791 -6510 -10234
4219 -10234 -3348 3227 2679 6920 10098 6877 3545 7334 5206 6700 4664 5183 6032 2258 3102 6021
4203 6021 11619 13690 12195 7842 751 -792 -3850 2347 4264 -1290 -5413 -8336 -4876 -951 -5827
4188 -5827 -10286 -4845 -1320 2506 1423 -1212 1357 1246 -3444 608 8908 8340 5434 4611 9838 6013
4172 6013 2799 4918 5670 1099 -4793 -7901 -7321 -7274 -9266 -7671 -7316 -6783 -6082 -3640 -3934 571 9096
4155 9096 8102 5866 522 -1625 -3331 -6032 -4311 -2727 -4432 -4211 -6089 -8124 -6542 -2073 -3288
4140 -3288 -2502 40 1151 4879 8565 7011 3574 -3654 -1919 1134 2747 -1954 -5958 -5402 -1023
4125 -1023 -3760 -10146 -13727 -14198 -13089 -9535 -1076 9587 7428 3461 -1709 -3941 4294 -468 -39
4110 -39 -2849 -9070 -6292 -744 7018 8680 9538 13616 13124 8802 1428 1720 1746 -1489 998 4188 1366
4093 1366 -1722 -1272 -438 6805 7484 3458 4035 4792 -4027 -5996 -4116 -1532 -1658 -1333 125 2458 527
4076 527 -858 1922 2676 11538 9596 -73 -792 -1335 2730 7710 4497 4012 7248 9015 3967 897
4060 897 2518 -1135 -4292 -4730 -9602 -7200 -9394 -10914 -11232 -2824 6415 4040 -848 2411 3686 213
4044 213 -4135 -4308 -7334 -9407 -11995 -13535 -10126 586 3731 4535 3204 2817 2656 1625 -406 5460
4028 5460 6899 -4757 -5249 -6114 -4152 -394 -2604 -3777 -5486 -6627 -7548 -7205 -2941 5797 7177 2518
4012 2518 -585 99 -59 1196 -261 -1402 6186 10544 10063 11235 8059 86 2084 -1244 -605 3243
3996 3243 3043 115 -5018 -3520 347 -3216 -3980 -1385 2109 7172 7417 3930 322 -3549 -4892 -1637
3980 -1637 2299 5395 9762 16254 16175 12517 6642 2346 1391 -3603 -1425 -1358 -1025 -5946 -13802 -11673
3964 -11673 -3781 1527 3068 418 2095 3674 -2604 422 718 2509 6874 4576 -1660 -5545 -6088
3949 -6088 -9715 -5833 -7289 -8842 -1359 3560 1705 3897 1373 -3003 -220 5095 -18 -8558 -4165
3934 -4165 -423 -2527 -1944 -78 -6439 -5484 4312 5771 -3099 -854 9286 7573 -3097 -7677 -6725
3919 -6725 -8840 -5102 160 957 -1311 7694 7767 6018 -7172 -7859 -6178 -4491 -2909 130 4627 5035
3903 5035 1249 -1398 -1528 -3172 -5487 -3044 -2253 3383 9412 13278 17506 12186 3389 1694 669
3888 669 2514 4633 -2414 -660 152 2176 5051 5004 4214 2095 3646 5376 3244 2702 -3380 -4503
3872 -4503 4538 4798 2771 783 5261 6820 -227 -1952 -8236 -4993 -1234 -7520 -8152 -6797 1462
3857 1462 1171 -3726 -2353 2639 1771 -4920 -2461 2744 8037 2227 -3001 1767 8993 6306 8447
3842 8447 7272 4540 102 -11 4022 6055 7248 5494 1117 2778 2268 828 3551 7108 12616
3827 12616 11622 8076 4162 1068 -1725 -7358 -6788 -6160 -6069 1922 2746 3928 3014 2422 -994 1034 2113
3810 2113 1785 -1442 5164 4076 -5252 -11941 -11241 -10060 -6247 -9287 -13480 -8369 -4887 -751 -175 -282
3794 -282 2620 8516 8575 5717 -2273 -5778 -6217 -6285 -7666 -15152 -18026 -11659 580 3867 1625 2423
3778 2423 3615 5682 5790 5863 6091 1973 -2260 2202 6222 9640 6729 -4312 -4351 3414 7132 8484
3762 8484 4505 -2088 -4094 -4823 -7878 -11570 -8175 -6895 -7552 -8315 -8823 -13555 -10418 -8906 -5728 -2119
3746 -2119 1185 2830 3584 8545 5915 -615 -3380 -1447 2153 3306 -1499 -3220 -5625 -10137 -10879
3731 -10879 -5630 2628 8365 4828 337 2806 8264 12242 9769 4930 2760 -2962 -4836 -4174 -5314
3716 -5314 -5372 -4642 -3175 819 4822 -1975 -7186 -6050 -3437 -8303 -10506 -7512 -6216 -7425 -1975 -516
3700 -516 -5993 -4335 -553 -3034 -3928 -139 -1670 -6132 -9290 -5828 -5145 -4821 -5039 544 -1511 -4629
3684 -4629 -6707 -10747 -12211 -14728 -8142 3375 7917 5953 2344 -2513 2139 11085 13972 7276 304
3669 304 -5871 -6328 -7249 -3371 -1503 -989 1539 1456 -410 -9624 -8432 -1552 295 187 2017 -1417 -1184
3652 -1184 3463 9057 11449 7349 10092 17349 15147 5418 1509 5837 2299 -974 -4301 -4856 -187
3637 -187 3559 8300 5693 1243 -1686 2277 -607 1835 -2374 -3738 -4559 -4870 4596 11994 8192 -1936
3621 -1936 -7888 -12209 -9987 -7731 -1557 6184 10351 12576 6165 1919 1264 -2121 -1304 -514 5649 1555
3605 1555 5335 6607 5538 7872 3460 3801 3689 2481 -1481 -2783 -2956 -1700 1456 1824 1796 -7504
3589 -7504 -14015 -9935 -4900 -1311 -6062 -6343 5644 9660 6814 7768 6550 3909 -594 -3657 -4532
3574 -4532 -3621 -1526 3766 7282 4554 -1462 58 2495 -484 437 -1406 -1546 -1782 -7151 -10163 -6873
3558 -6873 -1426 66 -416 1291 78 -1612 -4316 -920 3228 1043 -2556 6041 6790 -338 -4083
3543 -4083 -6414 -6350 -5271 -5110 -3191 530 -814 -3622 -3958 -4990 500 5781 2050 -8179 -11150 -12327
3527 -12327 -7499 647 -837 -1354 -2812 -4982 667 10543 10040 13593 8478 2413 2794 5064 -749
3512 -749 -8274 -10792 -227 4566 7379 9662 6405 -1284 3180 3626 1460 6266 12507 8996 4303
3497 4303 1811 -816 3559 2423 -197 6340 3230 -1021 -349 3482 3935 6301 11328 7088 8971
3482 8971 7432 1358 -153 4894 8957 9333 8432 10637 6068 -841 -3457 2853 1606 -926 -3475
3467 -3475 -5313 -1525 -268 4161 2945 -755 -1152 2830 3155 1679 -13505 -16172 -13775 -8772 -3890
3452 -3890 -556 4584 1962 -3652 -10242 -7845 -6398 -4032 3577 2026 7739 8386 3032 15967 15911
3437 15911 3544 -2946 -5807 -5832 -8310 -5975 505 5307 5331 2886 -573 -2746 -3953 -6364 -554
3422 -554 776 2401 -182 -3659 -3757 -2635 -8889 -15258 -10729 -513 -1677 2559 -1790 -7791 -3462
3407 -3462 -4068 -7189 -12200 -9542 -12430 -7174 -925 -4036 -2162 -4581 -11898 -12653 -5731 4612 3796
3392 3796 -6370 -11199 -13248 -13848 -10751 -11436 -8967 -1200 -482 -2328 -2214 2432 970 3282 1872 -6006
3376 -6006 -70 614 1116 4854 7017 13004 16438 9443 7170 3325 6817 9201 7505 726 3016
3361 3016 4520 3221 2716 -4071 -2842 1916 8545 11652 6108 -140 -845 -11070 -11888 -6767 788
3346 788 -1128 -6325 -4207 -4936 -1045 2961 1162 -4862 -2036 2847 5486 4009 -2069 -1145 3574 6914
3330 6914 5142 3663 3543 -3866 -2013 4194 4370 10479 7038 8163 3237 3148 11481 13103 7132 3894
3314 3894 1603 -3178 -264 -2649 619 4489 840 -427 -211 4055 1306 -68 4788 9417 13939
3299 13939 12444 11241 8451 9495 6517 1512 -984 -2527 -563 5022 5510 7232 2997 3388 2765
3284 2765 5618 5211 4022 4278 -260 -3101 -1291 -3804 -5616 374 5772 215 3836 11766 10994 11041
3268 11041 10249 6832 11694 10281 1219 -767 2869 -4432 -8734 -2131 -1782 -4768 -4444 -8654 -9768
3253 -9768 -10466 -14466 -9936 -1797 -1924 -1213 -376 -4402 -615 4643 10549 11657 13282 9625 2636 -568
3237 -568 -1026 -2742 1886 4639 8707 5858 5153 1175 -2594 911 -451 -1030 5159 11753 7945 5922
3221 5922 14157 17295 10402 10388 8630 -496 4005 3460 -5131 -2204 4707 5668 5581 9316 3129 2713 2545
3204 2545 5369 7208 7787 9325 7758 1476 -14 -893 -4287 -7133 -2365 -5749 -14829 -15227 -10766 -1971
3188 -1971 4082 9543 11202 12997 6172 -1739 -1834 -485 -2388 -8546 -9481 -4085 -166 2886 3912 7640
3172 7640 12292 13277 7975 5029 -1198 -5508 5537 9053 1518 -3083 -3677 -1507 -2388 2360 4980
3157 4980 -2579 -4754 -6109 -6979 -8374 -9232 -7332 -3707 1549 -426 -4322 -4381 -5353 -8944 -9372 -4782
3141 -4782 5061 7941 -570 -2299 -848 1105 4650 401 219 -991 2912 12060 12567 7818 7001 6485
3125 6485 9926 16459 19021 14081 6264 5288 11435 9674 5378 325 -5102 -6035 -5648 -7052 -1751 3587
3109 3587 7751 7553 7726 -38 309 2395 4601 5113 6146 1840 2476 1556 2817 -8853 -13422 -8418
3093 -8418 -4884 -1910 392 -1321 2180 1492 2545 -2100 2054 2056 5051 2145 -5557 -4005 -939 -173
3077 -173 -5399 -7396 -9366 -6526 -5203 -3354 -3867 632 5167 1583 -5794 -4525 -2573 -4912 -1559
3062 -1559 -1767 -2933 4995 -1002 -1436 -4463 -1843 1169 682 -1723 -3039 -3311 -697 -2012 -4959 85
3046 85 143 -3606 -5062 2388 3577 -285 -442 7951 12042 -418 -13255 -9070 -5485 -1464 7742 9823
3030 9823 8563 7170 9472 7761 3764 2210 -632 -6066 -16 -5448 -5664 -1871 -2493 -1852 1964 4216
3014 4216 2206 -6784 -2990 2903 3950 3676 2503 -666 -2895 -3534 -7609 -4837 2215 4244 1467
2999 1467 -1466 1181 142 -151 -21 -1966 -8071 -7320 -292 4455 -187 -1423 936 1495 1234 -749
2983 -749 -445 -3683 -242 5772 7516 10073 10268 3172 1969 827 2009 4042 10712 10868 5417 6944
2967 6944 11102 16436 11812 882 2553 2213 -3682 -1098 2958 3765 7036 5726 2091 -2040 420
2952 420 3077 1753 3249 -4950 -6788 -5803 -1854 1971 3431 493 864 -154 -6972 -11872 -13077 -8748
2936 -8748 -3965 -4305 -6505 -9907 -15295 -18531 -4999 -171 2549 3288 5506 284 -1382 3911 6203
2921 6203 4553 9232 16752 15787 11745 6952 9607 6174 -934 -3236 -5932 -7881 -3431 -7511 -7309
2906 -7309 -9458 -6226 235 1583 1071 -599 -5047 -4978 -780 -2140 -4556 -4348 -3902 -3806 -5535 -8604 -9186
2889 -9186 -10073 -2402 -31 528 -183 706 1442 -3631 -4828 -5517 -4215 4035 -1793 -8004 -42 879 3407
2872 3407 4956 9367 5835 271 -5991 -8616 -5994 -3901 -399 -393 1227 3495 6280 6297 6957 4243
2856 4243 6318 9760 11694 6889 5395 12860 9885 6108 3862 4735 4990 2219 541 25 -3046 -4867
2840 -4867 -7946 -7888 -3420 220 -5089 -10546 -12903 -4725 1912 1211 -2925 -3850 -1452 -4760 -7556 -4528
2824 -4528 -1230 713 -5711 -6961 -8113 2091 5686 1325 2939 4883 1716 3158 6378 5876 5511
2809 5511 5728 -1407 -3738 1580 1812 3312 2681 -474 4325 5788 5190 4548 1173 1248 -386 -2915 1541
2792 1541 -1016 1687 2155 895 -6954 -4335 -2412 -1324 1735 3928 3484 7636 9431 10333 5097 -4210
2776 -4210 -12273 -11819 -4512 -1389 2795 250 -1345 -2041 -642 7947 10634 9794 2899 3042 -3416 -469
2760 -469 -1640 -3613 -2280 705 -5991 -9228 -9417 -3378 747 -4780 -5355 -2702 1653 2051 2082 4094
2744 4094 4092 6762 6535 4852 3893 5395 7806 4960 3317 -3344 -4291 -1438 1535 4024 6350 6877 4640
2727 4640 3242 1098 6477 4503 11737 13544 8778 8591 5934 5705 6028 898 4311 339 -8783 -2434
2711 -2434 2117 509 377 125 -266 -822 -1763 3572 5418 -220 -3441 3297 13926 8471 2460 1308
2695 1308 -3018 -8110 -9424 -9141 -12686 -13616 -2891 2167 -4019 -9017 -10370 -6246 -1767 -1642 -3652
2680 -3652 -10445 -14399 -4819 4178 3185 1157 -5902 -11149 -6325 -6559 -7076 -10140 -11617 -12666 -7141 -3334
2664 -3334 -2663 -385 1210 -4880 -3691 2919 6279 10011 13717 11585 8017 4846 2316 3034 2315 1339
2648 1339 2116 2402 522 -3055 -3492 -882 -2705 -4032 -5822 -5646 3683 10282 8677 8703 12206 13926
2632 13926 2021 4828 3550 1100 3148 -496 -4868 916 7934 5908 2972 -4280 -2681 -4014
2618 -4014 -10002 -15237 -10559 -10271 -1492 1914 245 7463 3981 9472 7718 3233 6279 5818 785
2603 785 -4246 -1786 2508 1464 -5748 910 8879 6363 8991 5730 -3279 4206 5144 -3355 -9770
2588 -9770 -10820 -13289 -12182 -12842 -11253 -7791 -6447 -3032 -3010 -12031 -9517 -1128 -1389 -5067 -3930 -905
2572 -905 -2499 -3704 -4241 -8064 -8794 -6247 -5909 -7515 -5522 3778 -239 -8614 -13149 -9145 -4187 -2503
2556 -2503 -3396 -4081 -5035 -7475 -8985 -9373 -13381 -13112 -7328 -1176 1112 -3374 -10699 -9633 -6436 -8156
2540 -8156 -6630 -11165 -14181 -12228 -7617 -3568 -11579 -16517 -9807 -7212 -6024 -6699 -3305 6739 6515
2525 6515 1433 260 1236 571 -4988 403 4567 3084 5252 8522 12620 16223 13698 12920 7490 4473
2509 4473 2140 2075 2942 4052 -4597 -15971 -19446 -4766 3912 4634 -412 9260 6352 602 2276
2494 2276 3117 2627 1795 6349 14936 9867 6527 6838 973 308 4372 6204 4882 1501 1708 1760 2722
2477 2722 -7593 -5322 -2712 -2275 -6187 -4504 1124 2534 -3158 -5364 -5282 -8654 -9662 -6839 -5984 -5365
2461 -5365 -4928 -2703 -7053 -8637 -3938 -602 -751 -3840 -9628 -12025 -5089 -880 -1599 6649 9748 9876
2445 9876 7209 578 -2543 -5972 -3998 -2099 2581 -5201 -15073 -10023 -2667 -4280 -3731 3215 -2986
2430 -2986 -4700 1521 1579 -1511 985 5928 -120 -4258 -2609 107 4542 3262 5353 -2112 -10714
2415 -10714 -13101 -8899 -11769 -8648 837 4769 -134 -4041 -6256 -6740 -6402 -4450 31 5024 3931
2400 3931 -2299 -3989 -838 -3928 -15286 -5865 4863 2992 -4089 -1787 -3237 -5293 -4432 -450 2260
2385 2260 -1455 -8641 -6683 -5803 -3735 2264 3304 -2057 -9977 -7999 -2149 2784 4402 4771 9812
2370 9812 6946 -2841 -6394 -4828 1387 -4223 -3664 2953 5797 9717 3992 -5488 -11311 -7504 -8395
2355 -8395 -6675 -2113 2009 8360 5295 5359 6850 1935 -5729 -1655 7763 10848 9664 1804 -3041
2340 -3041 -624 5122 3888 -704 -1513 4797 15110 14306 15001 10917 10230 14415 9180 2344 8260 12336
2324 12336 8324 5207 1537 -1974 -819 -3018 -11346 -13340 -8125 -6877 2304 6346 4675 1974 1308
2309 1308 5379 7671 6516 4233 3559 3341 -696 -2820 -6150 -8020 554 7404 8349 11515 6239 -2214
2293 -2214 -604 3998 8227 4007 -1419 2201 228 -415 609 1492 -1229 -459 1010 6524 9409 10424
2277 10424 13195 506 -4771 2696 5280 745 1550 578 -3899 -3247 357 -2192 -5302 -1965 -4201
2262 -4201 -3789 -11256 -15747 -14985 -6520 8991 15494 10847 5740 4205 1439 -8642 -14872 -13638 -1411
2247 -1411 -2894 -1751 -3068 -4457 -5649 -7784 -5025 2888 10100 15140 13188 7487 5230 1820 3034
2232 3034 2573 9188 14099 6666 3588 1494 2131 1737 -1270 -1806 -463 3311 6915 2858 -8348 -3851
2216 -3851 2767 8918 3693 -2857 -7253 -7294 -10383 -2355 37 1102 2779 5795 11404 9582 3535
2201 3535 -2467 -1496 732 -721 -7229 -6150 -618 1094 6313 7099 -2749 465 3746 9893 3519
2186 3519 -2041 -1127 223 6202 -1758 -4680 1548 1874 -2324 -2316 -1028 -5420 -6359 -7754 -2833 -2803 -3839
2169 -3839 -352 11116 16818 18882 10230 -1904 -1872 -6120 -10240 -11436 38 4088 3703 2064 -3061
2154 -3061 3725 5581 722 1897 5496 2214 -4643 -3258 -699 3772 10123 13572 12933 12852 10744 9767
2138 9767 12785 8259 3739 6095 11109 14301 6566 4226 5969 2105 -3790 -10054 -6144 610 7486
2123 7486 -1683 -2741 625 2151 -3271 -5972 -4533 -1593 2192 3298 3214 -287 551 4013 17 -845
2107 -845 -949 43 1216 5414 7488 7042 6708 9684 11591 15185 5015 -1860 2683 2757 167 -575 -3477
2090 -3477 -3455 -3720 -5081 -3629 3741 5061 6380 6981 3389 -1212 -10223 -13154 -3924 95 -1833 -2664
2074 -2664 -3930 -1647 -5375 -12573 -13929 -8050 -3413 1644 2824 6362 6299 -245 -3362 -7626 -10808
2059 -10808 -10357 -7520 -2088 3233 -778 -6467 -9885 -6343 -10491 -11431 -7355 -6974 -1766 -2217 -3101 -3272
2043 -3272 -5744 -2913 -4759 -12596 -7896 -2208 -6460 -10228 -4062 -325 5133 7867 4007 1908 -790
2028 -790 1950 -4457 -11593 -10633 -5941 -4852 -5381 -3221 -1636 5176 4099 1167 2252 -1633 -4889 -5132
2012 -5132 -2868 -1684 -1952 3633 12036 14175 7931 -25 -658 3938 2043 -7391 -3726 -4647 -10005 -11356
1996 -11356 -10154 -4468 452 6295 2822 -3335 -4738 -2761 -3532 -560 352 4007 -3626 -8257 -5834
1981 -5834 -7658 -4377 2271 4947 6288 2365 419 -2303 -8593 -9644 -2446 884 2537 683 402
1966 402 1728 -3160 -7301 -2949 -634 4694 5878 8374 6670 1304 530 3007 2918 344 -48 6515
1950 6515 8632 11553 7405 4685 3529 1028 -3227 998 -6221 -9946 -9724 -4114 -2288 -1115 4172
1935 4172 2522 2087 539 -860 2566 1998 -3602 -3758 -409 -1725 -7315 -4240 1256 2129 4029 1711
1919 1711 -4959 -2409 -2610 -2250 -3444 -2223 -2562 -6834 -6911 -6861 -5671 -3064 -86 -638 5660 11492 2160
1902 2160 -1490 -5531 -3485 -5420 -3023 -152 5096 4045 1667 1191 -1144 4716 1287 -2066 -3744
1887 -3744 -6879 -1007 6343 4286 2957 433 2966 3632 710 -4642 -5192 -8710 -16160 -13935 -10754
1872 -10754 -6429 751 6545 6543 1790 -861 -392 2076 3717 2107 -1470 -5229 -6642 -5529 -3403 -4720
1856 -4720 -6588 -2254 2919 2814 4147 4198 6142 446 -6055 -4877 -736 144 2620 2395 2875 2916 -1510
1839 -1510 -8878 -11969 -10574 -2750 -3118 -7784 -2561 -2376 -8712 -5558 -3264 -5483 -7530 -3973 -1056
1824 -1056 8935 9395 5894 11129 14054 10028 7601 7324 7001 11017 11053 10028 6525 8565 8320 941
1808 941 3582 6417 2313 786 3376 4999 -430 182 -759 2297 282 5155 5391 12188 9039 12603
1792 12603 12617 5559 -407 3037 5401 6698 2193 1177 7840 13830 10179 4610 3933 -5572 -4631 3147
1776 3147 4824 1794 -2980 -1652 -3659 -996 -2248 -6880 -7229 -2172 2919 651 -2743 -1403 -2265
1761 -2265 -6642 -11543 -7457 -2259 3252 4521 2511 3512 988 -3816 -9241 -9938 -6209 -3253 -9192
1746 -9192 -11476 -5001 -732 -2864 -3153 -360 -4853 -6396 -6353 -3906 -2494 -746 -2050 -2034 -345 2579
1730 2579 3029 7588 5242 -324 2479 3186 289 4040 2959 110 79 1470 -1611 -5356 -9846 -6901
1714 -6901 -3150 -668 -470 3910 3156 574 3447 4869 778 5593 17234 23114 20933 13024 10634
1699 10634 11232 6549 134 1286 2914 3173 -610 -5308 225 2142 -2026 -4989 -5720 -3537 3798
1684 3798 10655 12026 7119 4904 4335 3845 1867 2181 3830 4892 4383 1642 -11186 -8233 -9062 -11116
1668 -11116 -10134 -10321 -17083 -14629 -8296 -393 1490 -3035 -4716 -3984 -943 677 -1630 1668 -3149
1653 -3149 -5651 -11721 -8556 -3525 -5761 -7629 -3922 1860 5387 1777 1409 4712 6451 4335 3285
1638 3285 1063 -1812 -3404 -2436 -4891 -8346 -4250 -2032 -7656 -6308 -5594 2106 -2645 -9521 -8815 -11546
1622 -11546 -6964 -4298 1172 5077 5205 2625 7871 12355 10723 9270 748 -660 -262 1925 9283
1607 9283 8584 6649 1390 -1208 -1596 2567 2810 1348 1513 -75 -326 -1102 145 1911 6820 10526
1591 10526 3313 5631 4193 282 1499 2812 -276 -924 -615 -4422 2750 6700 6317 12360 10893
1576 10893 6709 -3584 -5924 -2496 2656 4679 2839 8852 6527 3325 5466 -1573 -2455 116 2360
1561 2360 -2622 50 8004 8292 5707 1416 -4822 -6264 3173 5480 6139 6809 558 -606 4832 -2139
1545 -2139 -6099 -7779 -4923 -1269 109 203 7839 11140 11831 10401 5194 -914 -1813 -3614 -11628 -9966
1529 -9966 -8323 -3767 1896 7516 10172 9522 9758 1506 1589 6447 7195 6601 4944 873 -2461 -2273 -5582
1512 -5582 -8389 -8853 -6035 -8814 -6050 -7652 -2399 -2183 1074 2620 2210 6063 7487 6283 1715 347
1496 347 2042 1519 1885 -4010 -1817 -5460 -7206 -4279 -2150 1237 3578 1792 263 -4197 -4984 -923
1480 -923 3813 5814 1877 -1659 451 1924 -2254 -8191 -418 773 3865 -4236 -9177 -8749 -9210 -13461
1464 -13461 -15064 -8042 603 6897 13381 10328 1829 197 -1190 886 690 -815 73 6591 6908
1449 6908 7301 11495 8604 9657 12110 11970 371 -4994 -8847 -10663 -2926 5762 3707 4831 4323
1434 4323 3249 3697 206 -425 -5071 -6147 -4896 -6397 -850 -25 3389 4468 6771 2464 6251 8884
1418 8884 3480 -2063 -3547 -120 4551 5858 8759 5520 1320 5182 5944 -908 -4304 -3803 2460
1403 2460 4510 -289 -2958 -2147 728 7179 7145 1445 2570 4444 4241 682 -7763 -897 669 -8209
1387 -8209 -12110 -7403 -4014 -4138 -6440 -2597 1007 8714 13486 11375 2193 -1653 -1743 456 1602 4708
1371 4708 4007 4813 5633 2714 1618 -1788 -1223 -5920 -8397 -7606 -1995 989 2564 2246 -1456 -1210 -2595
1354 -2595 -13450 -14845 -8974 -7319 -1181 3958 3643 4815 4430 8642 11605 7065 1459 -2658 -8375
1339 -8375 -7317 -5477 3439 8151 4976 4984 -3604 -12069 -15249 -11272 -1644 2361 2175 5339 4028 1554
1323 1554 -3483 -3040 -1414 3163 -5411 -6360 -7158 -5711 -5701 -5589 -2343 -2332 -4547 -6346 -602 3259 10360
1306 10360 13122 7105 -2448 -4090 8093 2735 -2113 942 -784 37 1869 -6653 -11015 -5594 -1921
1291 -1921 3062 3222 1104 6311 12646 3411 -5424 -5478 -2539 625 6242 2689 -1158 -263 -2200 -1858
1275 -1858 1400 5484 7079 2949 516 6849 10789 10735 5222 5694 4709 -614 -4254 1197 7170 9163
1259 9163 11538 5660 -2720 -6954 -8182 -7182 -1749 1457 3833 4942 5152 553 -1768 -2843 2579
1244 2579 8706 5734 8118 7039 3453 903 6043 10972 6801 5184 1007 1506 -3753 -8588 -5003
1229 -5003 68 6031 6101 5085 3773 -546 -4485 -1817 -727 -186 972 -3971 -1781 -2374 -87 -4963
1213 -4963 -5022 -9523 -5621 -6814 -5238 -4866 -4421 -1188 -912 -3136 2154 1743 40 795 1065 -384 2646
1196 2646 9430 7340 3825 2412 -1596 1988 10410 16974 9168 5412 2971 7396 8437 2538 -3221
1181 -3221 -6323 -13448 -12396 -3740 995 3190 7854 8668 2629 -1377 -5659 -11025 -9599 -2144 4206
1166 4206 6191 6762 87 -571 -1983 1260 4171 6297 5568 4287 4671 8632 10315 4279 1739 7582
1150 7582 17611 16781 10072 4253 -1666 48 -938 1688 -1947 -5072 -7217 -5576 -3325 -2876 -9890
1135 -9890 -9693 -7158 1037 9114 4167 326 3063 2911 4390 -2525 -292 -4060 -2630 753 -2508
1120 -2508 -1379 3098 4688 660 3360 5412 -1238 -2797 1907 10107 7921 4548 7465 9992 10121
1105 10121 6994 -356 -2882 224 846 -5628 -11332 -16030 -22575 -12435 2050 4481 8358 7242
1091 7242 6070 4825 -6672 -11085 -5867 689 7228 10771 9520 499 -583 6703 8539 7596 4938
1076 4938 5264 8336 5112 -528 -3393 -4750 2235 1666 -9373 -6687 3927 12550 11437 8436 4817
1061 4817 6736 5482 -1408 -4957 -8923 -7927 -5451 -1973 -4033 -6183 -2254 -4147 -1643 2886 2864 2507
1045 2507 1424 6342 15252 20060 23062 15559 10357 8866 4957 4278 7081 4774 2299 -3090 1726
1030 1726 13445 15245 7545 3304 -1389 -3473 -2712 -7134 -3091 -2004 -1040 1356 6481 7009 3515
1015 3515 7810 7745 -909 -3283 -2120 -239 1126 -1416 2790 1516 -3574 -7164 -6415 -853 -7144 -12223
999 -12223 -3088 5001 3864 5849 8351 2504 4455 7469 8807 10857 5458 -1343 -1457 -5210 -2832
984 -2832 936 3165 2182 1313 -313 5824 -11 -7111 -1919 -270 -5 5883 6251 3694 7296 2350
968 2350 1286 202 -609 1810 6558 5023 2171 1083 4792 6006 5749 4568 388 -203 992 2366
952 2366 2245 4196 7340 3485 2818 1468 -1843 -4634 -2991 -1633 4896 5843 -1150 -3381 -6135 -4688
936 -4688 -3186 -5482 -5242 -6770 -10570 -5942 -2034 -619 -2850 1482 2283 3688 5286 2147 352 -3100
920 -3100 -7757 -7230 -4322 -3520 2635 2450 2065 3976 -3132 -11477 -9641 -11316 -12632 -9720 -10149 -6422
904 -6422 907 4916 -125 204 1250 7230 7123 -385 -6903 -7062 -9286 -3981 1324 2298 4219 5842
888 5842 -300 -2090 3187 -28 -3489 -5168 -7192 -9270 -8039 -5711 -500 67 980 9430 8850 7758
872 7758 6661 6043 5957 5661 6647 7498 7759 2436 -1891 -5551 -7354 -10875 -4008 -581 -5394 -11486 -9325
855 -9325 -3740 3647 4100 3078 -943 77 -555 -1606 -2154 -3757 -5713 -1740 -1267 5518 4657 993
839 993 -415 1382 3880 592 -1588 -1291 -4838 -2169 -3706 48 9329 7696 10018 8852 -882 -3942
823 -3942 -4361 -182 2335 4841 9154 7314 3024 -7025 -6140 -3540 -3905 -4172 -1501 -7776 -8072 -3967
807 -3967 1624 1328 429 -733 1402 1833 -1655 -2359 -8034 -6487 -5907 -1486 1147 4304 5494 11563
791 11563 17409 18510 13329 8801 8162 7926 13034 14863 3858 -7506 -4931 2963 3142 -1355 -48
776 -48 9065 4790 2597 3597 2636 50 1573 -3985 -7666 -9233 -6527 -10221 -5542 -1411 -6793 -6468
760 -6468 -5243 -801 4527 4792 -143 -3701 2343 3602 3204 6494 4904 3607 7136 905 -1143 4870
744 4870 -77 -4468 -6589 -5850 -968 -1693 8703 9215 -483 -5512 -3852 755 2124 3188 -3125 -9869
728 -9869 -7078 -4135 -1660 -104 8569 9864 9934 9739 3523 -1276 -3200 -3370 -649 -1636 1175 4097
712 4097 787 377 -1986 -10303 -268 12595 12167 8785 6694 7424 8804 6371 3949 8551 15034
697 15034 12761 10196 9617 10025 8432 11741 14182 12979 10089 5705 5344 1709 -2409 -3747 -1895 -313
681 -313 367 -6225 -8521 -426 5729 3994 308 -919 777 1564 1735 -2392 -1152 -1009 -6151 -9770
665 -9770 -9503 -7675 -696 -4966 -8362 -2278 3588 5764 4700 1503 -4581 -1157 1630 43 -1236
650 -1236 3281 12127 12567 6452 -1990 -6949 -10024 -8167 1487 7752 10155 11060 5524 -3108 -7335 -8934
634 -8934 -13354 -17368 -12483 -6761 -5932 -2385 -1189 -1351 1874 3930 1269 1431 217 6290 6773 8776
618 8776 10426 190 -4805 -5101 -12142 -9474 -5037 -4713 2917 8265 11233 7723 8742 8684 5784 3783
602 3783 2697 -5582 -7271 -7279 -10865 -5945 7931 17791 19157 20265 14745 9163 10091 8455 3737 184
586 184 2918 3649 1967 2082 757 6037 5019 -1054 3441 7801 4915 5883 6255 10255 10188 4120 -3122
569 -3122 -1272 -395 -1540 -962 -6533 -5850 -4680 -3100 -1005 -937 752 2248 2022 1911 3529 2632 10086
552 10086 5724 -1356 -1336 1522 -2792 -6900 -5488 -6195 -6275 -7442 -9993 -5969 -888 -8199 -5418 -3390
536 -3390 3362 2778 462 -3809 -6279 287 2990 -771 -4553 -2157 -1644 1915 7949 5686 1440 -859
$$ [...]
##END NTUPLES=NMR SPECTRUM
##END=
