##TITLE=Analysis number 328583
Compound Code cc 61826
Book Reference 467/154
Project Code adrs
Chemist Name benw
##JCAMPDX= 6.0         $$ Bruker NMR JCAMP-DX V2.0
##DATA TYPE= NMR SPECTRUM
##DATA CLASS= NTUPLES
##ORIGIN= Bruker BioSpin GmbH
##OWNER= nmr
$$ XWIN-NMR		Version 3.5
$$ Tue Jun 19 11:58:07 2007 GMT Daylight Time (UT+1h)  MAYBRIDGE\nmr@NMR_250MHZ
##.OBSERVE FREQUENCY= 250.131544655141
##.OBSERVE NUCLEUS= ^1H
##.ACQUISITION MODE= SIMULTANEOUS (DQD)
##.ACQUISITION SCHEME= undefined
##.AVERAGES= 16
##.DIGITISER RES= 18
##SPECTROMETER/DATA SYSTEM= dpx250
##.PULSE SEQUENCE= zg30
##.SOLVENT NAME= CDCl3
##.SHIFT REFERENCE= (INTERNAL, CDCl3, 0, 16.518)
##AUDIT TRAIL= $$ (NUMBER, WHEN, WHO, WHERE, WHAT)
$$ ##TITLE= Audit trail, XWIN-NMR		Version 3.5
$$ ##JCAMPDX= 5.01
$$ ##ORIGIN= Bruker BioSpin GmbH
$$ ##OWNER= nmr
$$ C:\u/data/dgb/nmr/ADRS/1130/pdata/1/auditp.txt
$$ ##AUDIT TRAIL=  $$ (NUMBER, WHEN, WHO, WHERE, WHAT)
(   1,<2007-06-19 11:57:40.95 +100>,<MAYBRIDGE\nmr>,<NMR_250MHZ>,
      <created by zg, POWCHK disabled, PULCHK disabled
       configuration hash MD5:
       76 6E 9A 78 1E 09 19 81 EC 84 63 8F B0 6A 59 2D
       data hash MD5: 64K
       DF 39 BA 93 39 48 64 4E A5 49 72 98 70 89 DF CF>)
(   2,<2007-06-19 11:57:54.14 +100>,<MAYBRIDGE\nmr>,<NMR_250MHZ>,
      <Start of raw data processing
       ef LB = 0.3 FT_mod = 6 PKNL = 1 SI = 32K 
       data hash MD5: 32K
       A4 A0 16 A6 67 B9 0A 7B 46 FD 5A EB 89 FC B4 4E>)
(   3,<2007-06-19 11:57:55.82 +100>,<MAYBRIDGE\nmr>,<NMR_250MHZ>,
      <apk 
       data hash MD5: 32K
       C7 CF B6 D8 62 A9 F3 8A D4 B9 E4 8A F0 18 2A B4>)
(   4,<2007-06-19 11:57:56.70 +100>,<MAYBRIDGE\nmr>,<NMR_250MHZ>,
      <abs ABSG = 5 
       data hash MD5: 32K
       E0 62 3C A1 FC 56 B7 A3 39 2C 80 AB 27 6B D2 82>)
$$ ##END=
$$ 
$$ hash MD5
$$ FD 60 08 43 C4 10 00 ED DB 77 05 3F 89 C5 89 25
##$RELAX= 
##$RELAX= 
##$RELAX= 
##$RELAX= 
##$RELAX= 
##$RELAX= 
##$RELAX= 
$$ Bruker specific parameters
$$ --------------------------
##$DU= <C:\u>
##$EXPNO= 1130
##$NAME= <ADRS>
##$PROCNO= 1
##$TYPE= <nmr>
##$USER= <dgb>
##$AMP= (0..31)
100 100 100 100 100 100 100 100 100 100 100 100 100 100 100 100 100 100 
100 100 100 100 100 100 100 100 100 100 100 100 100 100 
##$AQSEQ= 0
##$AQ_mod= 3
##$AUNM= <au_zg>
##$AUTOPOS= <6 >
##$BF1= 250.13
##$BF2= 250.13
##$BF3= 250.13
##$BF4= 250.13
##$BF5= 500.13
##$BF6= 500.13
##$BF7= 500.13
##$BF8= 500.13
##$BYTORDA= 1
##$CFDGTYP= 0
##$CFRGTYP= 5
##$CHEMSTR= <none>
##$CNST= (0..31)
1 1 145 1 1 1 1 1 1 1 1 1 1 1 1 1 1 1 1 1 1 1 1 1 1 1 1 1 1 1 1 1 
##$CPDPRG= <>
##$CPDPRG1= <>
##$CPDPRG2= <>
##$CPDPRG3= <>
##$CPDPRG4= <mlev>
##$CPDPRG5= <mlev>
##$CPDPRG6= <mlev>
##$CPDPRG7= <mlev>
##$CPDPRG8= <mlev>
##$CPDPRGB= <>
##$CPDPRGT= <>
##$D= (0..31)
0 1 0 0 0 0 0 0 0 0.06 0 0 0 0 0 0 0.0002 0 0 0 0 0 0 0 0 0 0 0 0 0 0 
0 
##$DATE= 1182250659
##$DBL= (0..7)
120 120 120 120 120 120 120 120 
##$DBP= (0..7)
150 150 150 150 150 150 150 150 
##$DBP07= 0
##$DBPNAM0= <>
##$DBPNAM1= <>
$$ [...]
##$SUBNAM7= <"">
##$SUBNAM8= <"">
##$SUBNAM9= <"">
##$SW= 20.6930455092707
##$SWIBOX= (0..15)
0 0 3 0 0 0 0 0 0 0 0 0 0 0 0 0 
##$SW_h= 5175.983436853
##$TD= 65536
##$TD0= 1
##$TE= 297.16
##$TE2= 300
##$TE3= 300
##$TEG= 300
##$TL= (0..7)
0 120 120 120 120 120 120 120 
##$TP= (0..7)
150 150 150 150 150 150 150 150 
##$TP07= 0
##$TPNAME0= <>
##$TPNAME1= <>
##$TPNAME2= <>
##$TPNAME3= <>
##$TPNAME4= <>
##$TPNAME5= <>
##$TPNAME6= <>
##$TPNAME7= <>
##$TPOAL= (0..7)
0.5 0.5 0.5 0.5 0.5 0.5 0.5 0.5 
##$TPOFFS= (0..7)
0 0 0 0 0 0 0 0 
##$TUNHIN= 0
##$TUNHOUT= 0
##$TUNXOUT= 0
##$USERA1= <user>
##$USERA2= <user>
##$USERA3= <user>
##$USERA4= <user>
##$USERA5= <user>
##$V9= 5
##$VALIST= <valist>
##$VCLIST= <CCCCCCCCCCCCCCC>
##$VD= 0
##$VDLIST= <DDDDDDDDDDDDDDD>
##$VPLIST= <PPPPPPPPPPPPPPP>
##$VTLIST= <TTTTTTTTTTTTTTT>
##$WBST= 1024
##$WBSW= 4
##$XGAIN= (0..3)
0 0 0 0 
##$XL= 0
##$YL= 0
##$YMAX_a= 239781
##$YMIN_a= -311953
##$ZGOPTNS= <>
##$ZL1= 120
##$ZL2= 120
##$ZL3= 120
##$ZL4= 120
##$ABSF1= 16.51802
##$ABSF2= -4.175152
##$ABSG= 5
##$ABSL= 3
##$ALPHA= 0
##$AQORDER= 0
##$ASSFAC= 0
##$ASSFACI= 0
##$ASSFACX= 0
##$ASSWID= 0
##$AUNMP= <proc_1d>
##$AZFE= 0.1
##$AZFW= 0.1
##$BCFW= 0
##$BC_mod= 0
##$BYTORDP= 0
##$COROFFS= 0
##$CY= 12.5
##$DATMOD= 1
##$DC= 0
##$DFILT= <>
##$DTYPP= 0
##$F1P= 14.0000005364418
##$F2P= -0.99999901652339
##$FCOR= 0.5
##$FTSIZE= 32768
##$FT_mod= 6
##$GAMMA= 0
##$GB= 0
##$INTBC= 1
##$INTSCL= 1
##$ISEN= 128
##$LB= 0.3
##$LEV0= 0
##$LPBIN= 0
##$MAXI= 10000
##$MC2= 0
##$MEAN= 0
##$ME_mod= 0
##$MI= 0
##$NCOEF= 0
##$NC_proc= -4
##$NLEV= 6
##$NOISF1= 0
##$NOISF2= 0
##$NSP= 0
##$NTH_PI= 0
##$NZP= 0
##$OFFSET= 16.51802
##$PC= 1
##$PHC0= -55.28315
##$PHC1= 11.22776
##$PH_mod= 1
##$PKNL= yes
##$PPARMOD= 0
##$PSCAL= 4
##$PSIGN= 0
##$REVERSE= no
##$SF= 250.130000993451
##$SI= 32768
##$SIGF1= 0
##$SIGF2= 0
##$SINO= 400
##$SIOLD= 32768
##$SREGLST= <1H.CDCl3>
##$SSB= 0
##$STSI= 32768
##$STSR= 0
##$SW_p= 5175.98343685301
##$SYMM= 0
##$S_DEV= 0
##$TDeff= 65536
##$TDoff= 0
##$TI= <Analysis number 999999
Compound Code 99
Book Reference 9
Project Code 9>
##$TILT= no
##$TM1= 0
##$TM2= 0
##$TOPLEV= 0
##$USERP1= <user>
##$USERP2= <user>
##$USERP3= <user>
##$USERP4= <user>
##$USERP5= <user>
##$WDW= 1
##$XDIM= 32768
##$YMAX_p= 591189914
##$YMIN_p= -386951
$$ End of Bruker specific parameters
$$ ---------------------------------
##NTUPLES= NMR SPECTRUM
##VAR_NAME=  FREQUENCY,     SPECTRUM/REAL,   SPECTRUM/IMAG
##SYMBOL=    X,             R,               I
##VAR_TYPE=  INDEPENDENT,   DEPENDENT,       DEPENDENT
##VAR_FORM=  AFFN,          ASDF,            ASDF
##VAR_DIM=   32768,         32768,           32768
##UNITS=     HZ,            ARBITRARY UNITS, ARBITRARY UNITS
##FACTOR=    0.157963299565203, 1,           1
##FIRST=     4131.65251656243, 0,            0
##LAST=      -1044.33092029058, 0,           0
##MIN=       -1044.33092029058, -386951,     0
##MAX=       4131.65251656243, 591189914,    0
$$ Real data points
##PAGE= N=1
##DATA TABLE= (X++(R..R)), XYDATA
$$ [...]
14647C2658J5113M0500k322l0350j3500o3671K5687N856J03O272m0992l0080n2959
14634a07685l2369L0248O6284m5567m8374K1077k2443M9920L3961m119L1042P66
14622b7259R208M2455j1433j14598l2742L7143O2022J6495m749N8320L908p5757
14610c6987j8715J5449j6560J4835J9547k2488J3907O1765q493m4760K0528l3154
14598c5126q0208L2843L222k9146l122o395O8175N7612q94l108j0481K9951j961
14585B1362L2147m0429L8465M5059M4710k5433p0649l5212l502K7609K5233p7030
14573a7670k6802J3041M367l7301J3703K7615l7591J9179J3242o6379o8258L495
14561a59359N1962J4447M1882N5217R079j4534J0895k3497j5650L586L5134k416
$$ plain form
14647 32658 47771 88271 85949 55599 42099 -21572 4115 9971 10074 16346 -24646 -54726 -107685
14634 -107685 -140054 -109806 -43522 -89089 -137463 -116386 -138829 -88909 -54948 -59067 -28025 -27259
14622 -27259 -18051 24404 12971 -101627 -134369 -97226 -35204 -18709 -23458 34862 38770 -36987
14610 -36987 -55702 -40253 -56813 -41978 -22431 -44919 -31012 30753 22260 -22500 -1972 -35126
14598 -35126 -115334 -82491 -79269 -108415 -111537 -117932 -49757 7855 6961 3853 -6628 23323 21362
14585 21362 53509 13080 51545 96604 141314 115881 45232 10020 6518 34127 59360 -17670
14573 -17670 -44472 -31431 -27064 -64365 -50662 -23047 -60638 -41459 -28217 -94596 -162854 -159359
14561 -159359 -107397 -92950 -51068 4149 13228 -1306 9589 -13908 -29558 -25972 9162 6746
14549F746N0528N3362J1237L8329r1663r8562K4765j2112k6507K0606K7137J265
14537E131L9030O4745l8209k4845k3132k1390L0328O7687K9301p5998k0427j4734
14525A7487k2173m8910m2932j5347r042P1873O0847J6066L2262p1021j09299k207
14513a22396L092n7935m8579L398N7626K1079O0613J7176J070k0404j9737j7790
14501a22787k9574k540L1278M6342L553M5712k6574p7177P1347J3240n6632O8306
14489c5506Q368L545L2146q860K9980L2371j1512r93j172M3485j5779o8941m4592
14476c7460j4833k6007m2141P320Q1293N0102M4742j4013k2334O1269J158o1687
14464B7409o3330l3265m5897R0669L5362j0977K4147M479o301M4676K2995r6446
$$ plain form
14549 6746 57274 110636 121873 160202 68539 -30023 -5258 -17370 -43877 -23271 3866 5131
14537 5131 44161 108906 70697 45852 22720 1330 31658 99345 128646 52648 32221 17487
14525 17487 -4686 -53596 -96528 -111875 -120917 -49044 11803 27869 60131 -10890 -120189 -122396
14513 -122396 -119304 -177239 -225818 -222420 -164794 -143715 -83102 -65926 -64856 -85260 -104997 -122787
14501 -122787 -152361 -154901 -123623 -77281 -73728 -28016 -54590 -131767 -60420 -47180 -103812 -35506
14489 -35506 -27138 -23593 8553 -307 29673 62044 50532 49539 48367 91852 76073 7132 -37460
14476 -37460 -52293 -78300 -120441 -113121 -31828 18274 63016 49003 26669 87938 89096 27409
14464 27409 -35921 -69186 -115083 -24414 10948 -29 24118 28597 22296 66972 89967 -6479
14452f479j02147L2347Q2007k5359K4334P830l9424l003m0098p465O7025L6331
14440B5899p609j5627p618n2953j3892N741K7008k3937M667L8100J06250o8011
14428A8018j00383N1788K6067q8024m6745P704R7748M2352l2223M6479L8033k8941
14416C1873L8054k6565n7397P33l7464P526M6821n2239J8055J9932k9526M563
14404c5634m3665P15O0026N3080l369m371j557J7335k0593l8069j3908m1582M7318
14391b4274J4712J8945J4236r3233n7653k591N4461Q3430L8949l4011j6888j5046
14379a8963k4276o341R56j6509M2740P451L5359m289J0137o946j1276l6999o510
14366c5466Q409K8954l0166kj9436k3809r148K8252L8092N0478m9761j08065j9888
$$ plain form
14452 -6479 -108626 -76279 5728 -19631 4703 12533 -26891 -29894 -69992 -77457 -10432 25899
14440 25899 18290 2663 -4955 -57908 -71800 -66059 -39051 -62988 -58321 -20221 86029 18018
14428 18018 -82365 -30577 -4510 -92534 -139279 -131575 -33827 8525 -23698 22781 60814 31873
14416 31873 69927 43362 -14035 -13302 -50766 -43240 3581 -48658 -30603 -10671 -40197 -35634
14404 -35634 -79299 -78584 -18558 34522 31153 26782 25225 42560 21967 -16102 -30010 -71592 -24274
14391 -24274 -9562 9383 23619 -69614 -127267 -129858 -75397 8033 46982 12971 -3917 -18963
14379 -18963 -43239 -49580 -48624 -65133 -22393 -14942 20417 16128 26265 19319 8043 -28956 -35466
14366 -35466 -27057 1897 -28269 -28271 -47707 -71516 -80664 -52412 -14320 36158 -13603 -121668 -141556
14353a41556l5165K9507L6421J5503K3448N3772M0112n2865l2779q905l1203R051
14341i4659O4263L5085K2345J3580m4113K5417r51q456n0343l591l2769L6296
14329c7896P2409L6706m3449L9139N5484k2399l1652l7002q2047L5578J4924j7662
14317a7867q042k8125k5261j3647M5676K5086N0257O3998m9669r3004p356M370
14305e3584K296K8390J9479k6987n6949l2903O4988M8139J2487K615l9973k1433
14293e3435q232N4426o014r5715l6908O404L2393j985R696l6520K8423Q8148N0281
14280C0962k9229l4487L1951M8756M8036J04433j3687p4884J008j110o4238N899
14268E3410N6068o233M3749l7372k055o2731k8285r163K518N6080k0775l5275
$$ plain form
14353 -141556 -176721 -147214 -110793 -95290 -71842 -18070 22042 -30823 -63602 -72507 -103710 -94659
14341 -94659 -30396 4689 27034 40614 -3499 21918 20967 12511 -37832 -41423 -74192 -37896
14329 -37896 34513 71219 27770 66909 122393 99994 68342 31340 -50707 -15129 -205 -17867
14317 -17867 -25909 -54034 -79295 -92942 -47266 -22180 28077 92075 42406 -50598 -57954 -53584
14305 -53584 -51288 -22898 -3419 -30406 -87355 -120258 -55270 -7131 5356 7971 -32002 -53435
14293 -53435 -61667 -7241 -13255 -108970 -145878 -139474 -107081 -109066 -99370 -135890 -107467 -19319 30962
14280 30962 1733 -32754 -803 47953 95989 200422 186735 111851 112859 111749 47511 53410
14268 53410 109478 103245 146994 109622 107567 44836 16551 7388 9906 65986 45211 9936
14256I936k97j4195k7360l4792M3365J996j4779p0409l9385j0614J9037K4740
14244a12757L6737P157j9560L1999N6835J9884q0581p2827R793N7047l490o5091
14232a34854k8576J692l3099N9664M5388Q1009P6375M9232q4570p2943L3170N1376
14220D3864j7160p9013l1497J4505L5937N2538l1858J088J978K8158K7312N5995
14208A01847n2007q7940o5259K9207M8745j4779j73K0414L2418J2736k8738o0615
14196f4144n6460J5986L3335J181P943K3613m4952k4633L4805K5689R3937M8319
14184I4619N189l839J4733L2996j19618r0937o0197N46M4878N3638r230L8910
14172A688M2039m760M2770l2837n5176j211l4128K2382P3339j8564o8112n7725
$$ plain form
14256 9936 9639 -4556 -31916 -66708 -23343 -21347 -36126 -106535 -145920 -156534 -137497 -112757
14244 -112757 -76020 -68863 -88423 -56424 411 20295 -60286 -133113 -123320 -66273 -69763 -134854
14232 -134854 -163430 -161738 -194837 -135173 -89785 -8776 67599 116831 32261 -40682 -7512 43864
14220 43864 26704 -52309 -83806 -69301 -33364 19174 -12684 -11596 -9618 18540 45852 101847
14208 101847 49840 -38100 -103359 -74152 -25407 -40186 -40359 -19945 12473 25209 -3529 -64144
14196 -64144 -120604 -104618 -71283 -70102 -62159 -38546 -83498 -108131 -73326 -47637 46300 94619
14184 94619 99808 95969 110702 143698 24080 -66857 -127054 -126508 -81630 -27992 -37222 1688
14172 1688 43727 38967 81737 48900 -6276 -7487 -41615 -19233 54106 35542 -32570 -90295
14160i0295m3195J1388K2734o124N9813K598l0118K7337M478L0105K4519o9403
14148e6163M1166R023O3865j7869r575j6363j907j1422j4885k0455k9067M2610
14136b1042M1978l1445l944j3818m8682J0J9459k812K7872L9730J364L5149K7256
14123G1075K073p558l4993K3364m445n2083m756p886J136q406k1910k1915L6346
14110b9958M8511P7182J1049K7346L1900o2203p9747p295j4170r386l9568R137
14098c7202P7819n1666n4284K3064L6223J9125L8152K8433L889m3962j6224l5983
14086a2616r493J1845M963k3703o9888J6728M6697J0048l4785J9383J2115k164
14074c0870O0332r937m313K8354p6203j00129l8934J6917J01735Q2261k0351j8419
$$ plain form
14160 -90295 -133490 -122102 -99368 -105492 -45679 -43081 -73199 -45862 -41384 -11279 13240 -56163
14148 -56163 -14997 -5974 57891 40022 30447 14084 12177 755 -14130 -34585 -63652 -21042
14136 -21042 20936 -10509 -14453 -28271 -76953 -76943 -57484 -60296 -32424 7306 8670 43819 71075
14123 71075 73148 65590 30597 53961 49516 -2567 -7323 -15209 -14073 -22479 -44389 -66304 -29958
14110 -29958 18553 95735 106784 134130 166030 103827 24080 16785 2615 -6771 -46339 -37202
14098 -37202 40617 -11049 -65333 -42269 -6046 13079 51231 79664 83553 39591 23367 -12616
14086 -12616 -22109 -10264 -5301 -29004 -98892 -82164 -35467 -25419 -60204 -40821 -28706 -30870
14074 -30870 29462 19525 15212 43566 -32637 -132766 -171700 -154783 -53048 29213 8862 -9557
14062i557k9796J9005L5151k4796o7886R407N4033l7377j7472J4934N9395J08807
14050A13848k6381j3173L0473M196k845p2484k9721P11q6048j2146K8056O4295
14038a219O7760n4217j24147O2779j5799o0233J3252Q9769J1020M2048M6372K8400
14026A05785n5763P442L8872k5011K647L0470q57l2917j50434l3608O4146P870
14014d1358M3268O793N6621m2632k8766m1287j3809J0509L5217M4745m017n9212
14002c3928o8560k8887L7373N507M8464L1052n0150l272j8273o471K5256J7587
13990d4302M942N5337j6074o5378L129K72k5916m1285J395Q226P785M9459j0417
13977g2827M5813J4890j1157m0458l4649O9772J9758p110k6884R988L3506k6380
$$ plain form
14062 -9557 -39353 -20348 14803 -9993 -77879 -68472 -14439 -51816 -69288 -54354 5041 113848
14050 113848 87467 74294 104767 108963 106118 33634 3913 4624 -81424 -93570 -65514 -1219
14038 -1219 66541 12324 -111823 -49044 -64843 -125076 -111824 -22055 -11035 31013 77385 105785
14026 105785 50022 57464 96336 71325 73972 104442 103585 70668 -79766 -113374 -49228 -41358
14014 -41358 1910 8703 65324 22692 -6074 -47361 -61170 -50661 -15444 29301 25284 -33928
14002 -33928 -102488 -131375 -94002 -88495 -40031 -8979 -59129 -62401 -80674 -87145 -61889 -44302
13990 -44302 -39360 15977 -97 -65475 -62346 -62074 -87990 -129275 -127880 -119654 -111869 -62410 -72827
13977 -72827 -27014 -12124 -23281 -63739 -98388 -28616 -8858 -15968 -42852 -32864 642 -25738
13965b5738J4241j9682p8103J9761L0699N947L6017N6940N0734j09795k1752M092
13953c6639l4053K2432M5126O882k6537M789n5366L7277L6060o8969J6210L1188
13941b1600N2723J9090J0006j3086l9448q0803n5846L8720P015M0349L2761K677
13929g442K58l6641n6604N8933O6907J4395O418o130K352K5046K1102n3798o1234
13916b6438K8839O0396j0281J9641p432k0220l326j2363m398j8224K3104k6294
13904C004J9605L1554n108o1193J9095O2971R840p4350m6160l2176N366M8255
13892a9297k5598k4993P626O4214M6829k4097M8217j7656k3389j8838L2376p641
13880C7753j5260M0558J5245k7821o1860P66N2438m562P3516j0415q8384q6246
$$ plain form
13965 -25738 -11497 -31179 -109282 -89521 -58822 -52875 -16858 40082 90816 -18979 -40731 -36639
13953 -36639 -70692 -48260 -3134 3748 -22789 -18000 -73366 -36089 -29 -68998 -52788 -21600
13941 -21600 31123 50213 60219 47133 7685 -73118 -128964 -90244 -83229 -42880 -10119 -7442
13929 -7442 -7184 -43825 -100429 -41496 25411 39806 46224 40094 42446 67492 88594 34796 -26438
13916 -26438 2401 62797 52516 72157 64725 44505 41179 28816 24418 6194 29298 3004
13904 3004 22609 54163 49055 -12138 6957 69928 79768 5418 -40742 -72918 -67552 -19297
13892 -19297 -44895 -69888 -62262 1952 48781 24684 72901 55245 31856 13018 45394 37753
13880 37753 22493 63051 78296 50475 -11385 -10619 41819 37257 110773 100358 11974 -74272
13868g4272j8144K1338M1087R5925O0081q8068o8579J262j7452n280L4004L8407
13856B0309n0020j7801q703r828k7750j9291k546M3125l3940K0483J11146N359
13844C0543j06081P414P1188j5856l3172j8322o264O2439K0706r5307p6254J3830
13832a45136J00543K3486m6346K8543P6279o5752m5641o067K1742j1966k8304
13821i8619l31r551k5487K3844K1000P0349L7276q10j8542K5458j5359j3821K4736
13808B0143j0459n1596k844j2371J6052K2015k2488l9278M056K6048M582K062
13796d4078J8758l0582J2963J8366N8428K5751j1564N0408R385m8556m3873n794
13784I612L4283q0327r9287J2825M3211L9487K0340P9083M3146K7431m6946q8475
$$ plain form
13868 -74272 -92416 -71078 -29991 65934 126015 37947 -30632 -29370 -46822 -52102 -18098 20309
13856 20309 -29711 -47512 -56215 -66043 -93793 -113084 -115630 -72505 -106445 -85962 25184 30543
13844 30543 -75538 -68124 3064 -12792 -45964 -64286 -70550 -8111 12595 -82712 -158966 -145136
13832 -145136 -44593 -21107 -67453 -38910 37369 -28383 -74024 -80091 -58349 -70315 -98619
13821 -98619 -98950 -108501 -133988 -110144 -89144 -18795 18481 17671 -871 24587 9228 -4593 20143
13808 20143 9684 -41912 -44756 -57127 -41075 -19060 -41548 -80826 -76770 -50722 -46140 -44078
13796 -44078 -25320 -55902 -42939 -24573 33855 59606 48042 98450 107835 59279 15406 9612
13784 9612 43895 -36432 -135719 -122894 -79683 -40196 -19856 59227 102373 129804 82858 -5617
13772e617n5733Q767J9926P990L7538l1042R8426L9608r8478o9954m2238L6113
13760e4694L4126n1568K5477J104m1345l170O7341p021o044k6175Q789K811k2093
13747g2462q066P7723L8369l5000q0323K8259P695J1693J850j015J2310q0767
13735i9734K1299O5289N4881n538o7633N0210J4113K7522o3133j1257l330L8110
13723B0799J1950P0055j610m4089J5397J7472J7905k2468r8556j12039m9916N0841
13711a24259K2986P0284K2250k1552l8474R986l3549O0873N9368j2031J3468L4838
13699F4188l0269j5067k5194J6040l7003k2543L8691j5703l8901n617L3307L6375
13687a696J5572j6693n1748K1039O489m2905Q787K7161P8978P019k1683p1020
$$ plain form
13772 -5617 -61350 -52583 -32657 -24667 12871 -18171 80255 119863 21385 -48569 -90807 -54694
13760 -54694 -20568 -72136 -46659 -45555 -86900 -90070 -22729 -29750 -35794 -61969 -53180 -50369 -72462
13747 -72462 -80528 -2805 35564 564 -79759 -51500 -43805 -32112 -30262 -31277 -18967 -99734
13735 -99734 -78435 -13146 41735 36197 -31436 18774 32887 60409 -2724 -13981 -17311 20799
13723 20799 32749 102804 101194 57105 72502 89974 107879 85411 -13145 -125184 -175100 -124259
13711 -124259 -101273 -30989 -8739 -30291 -68765 -58779 -92328 -31455 27913 15882 29350 64188
13699 64188 33919 18852 -6342 9698 -27305 -49848 -11157 -26860 -65761 -71378 -38071 -1696
13687 -1696 13876 -2817 -54565 -33526 -27037 -69942 -61155 -33994 44984 52003 30320 -40700
13675d0700q1403n1883J8236J2260P9679O979j7541j8939K6166R387O4180O061
13663A2482l0282q877m7305L8223N9456r271J5791k7955L4996k472o4636m3915
13651g3765J7528K1680M4760J6711m3540l1890j2057K9482j5208o441K4533O1945
13639C3738l927p6519l384m9886J945O3995J1925k9930j3156p898K1928k2247
13627g3416k2110O6619R8165P825m0181O773J1187l7622M9677L5673m611p8552
13615A9427l2187M3877j5521o2177k0730j0901n476k6083m7403M0597O5026L9733
13603a1818j9671q7184o0635J3470N7525L6714J6207j1173q6105P238K0294Q2558
13591d2580N2445k5237M2600K6738n9402k3334N1444L6034J6671R281J2325k209
$$ plain form
13675 -40700 -122103 -173986 -155750 -143490 -63811 -56832 -74373 -93312 -67146 -57759 6421 12482
13663 12482 -17800 -26677 -73982 -35759 23697 14426 30217 2262 37258 34786 -29850 -73765
13651 -73765 -56237 -34557 10203 26914 -16626 -48516 -60573 -31091 -46299 -52740 -28207 33738
13639 33738 29811 -46708 -50092 -99978 -98033 -34038 -22113 -52043 -65199 -73097 -51169 -73416
13627 -73416 -95526 -28907 69258 77083 36902 43675 54862 17240 66917 102590 97979 19427
13615 19427 -12760 31117 15596 -46581 -67311 -78212 -83688 -109771 -157174 -116577 -51551 -11818
13603 -11818 -31489 -118673 -179308 -165838 -108313 -71599 -55392 -66565 -152670 -145432 -125138 -42580
13591 -42580 9865 -15372 27228 53966 -5436 -28770 22674 58708 75379 84660 96985 94776
13579I4776n9779m0575n2592L3462L0875p98K4547p9472M6198K1635P7730k1059
13567G4948J7007l167r6647n3804k1841M6304P254j8649L1603L9757L4359P1610
13555A28734k7191j69413K4816O6564J4943l4045L4753L2860m180l8348M8958
13544G8451N8074L7090k1385k0656o472P68Q045m905J1506p0083o0881k1867j3860
13531b6175M0269o956k7862o9251r728J1318R1499K0673Q487j0266K108M9447
13519G3563L0293p364J8850J3471j5895n5052k3747O0033L4438Q2122J5562J5916
13507B42190k5722L8133J2153R524k594o8819q900l1060o3844K9359K1463o4023
13495H7860j3432J7191P336L0767M0471N8653n405k9662o9835M1730J4316n2129
$$ plain form
13579 94776 34997 -5578 -58170 -24708 6167 5369 29916 -49556 -3358 18277 96007 74948
13567 74948 91955 88788 -7859 -61663 -83504 -37200 -29946 -48595 -16992 22765 57124 128734
13555 128734 101543 -67870 -43054 23510 38453 4408 39161 72021 67841 29493 78451
13544 78451 136525 173615 152230 131574 125102 125870 133915 129010 140516 70433 9552 -12315 -26175
13531 -26175 14094 7138 -20724 -89975 -99703 -88385 3114 23787 32274 22008 24116 73563
13519 73563 103856 96492 115342 128813 112918 57866 34119 94152 128590 210712 226274 242190
13507 242190 216468 254601 266754 276278 273684 204865 195965 164905 101061 130420 151883 87860
13495 87860 74428 91619 98955 129722 170193 228846 223441 193779 123944 165674 179990 127861
13483A27861O888j9710J5020L9239m016n0784m713L5461L3735K3587k5259l3055
13471A44254n313p427k8689l9295J5816q098Q9082k7801l3998L5492L2028N1122
13459B17173M0532l0200m4804J9094N9286m3762o014K9204Q5069J11881N7895
13448D95354m9152j19713r6205j7085O001k3874r4256j02192l2261O3124n033
13437B4708L0363j9777l3143m4912j5673O9366P9920J9214k9591J3003l8173K8199
13425H3504K0066O3687K3314j7386M214j9806O7497O1682M6605m0357p1733k8011
13413A93276k7148k2558m006Q0765P498K240J601m93L0565M3947N3504l1150o1245
13400B66796m3768m2111q641R016K1032M671m8926k8383p8689l4836M995J2949
$$ plain form
13483 127861 134749 115039 130059 169298 165282 114498 109785 145246 178981 202568 177309 144254
13471 144254 138941 131514 102825 63530 79346 71248 160330 132529 98531 134023 166051 217173
13459 217173 257705 227505 182701 201795 261081 217319 211305 240509 325578 437459 495354
13448 495354 446202 326489 230284 213199 219200 195326 101070 -1122 -33383 29741 24708
13437 24708 55071 35294 2151 -42761 -58434 10932 90852 110066 80475 93478 55305 83504
13425 83504 103570 167257 190571 173185 177399 157593 225090 286772 333377 293020 221287 193276
13413 193276 166128 143570 139564 220329 227827 230067 231668 231175 261740 305687 359191 328041 266796
13400 266796 223028 180917 172276 181292 202324 206995 158069 129686 50997 16161 21156 34105
13388C4105J6725l0447N2610L4532m1881M7542P1162j6963n1478K4073l390n5038
13376H1552m2981j6403j366m996k3538K5793R6163L0299L7807L2554m370j3819
13364A96695o4272m5710j3346Q0083K7962K0048j4579o6092m5984R70k9102k595
13352D4078k267o9111N8103K2603l721K538l3305M0389N3948k2055K1300M9985
13340A62485l8973n948l2003p7158J38M0701j9846M865L4441n3984q0346j0587
13328g6215j1129N8559J9288o118k8572L4512N5932Q2196l2506k5721m2410J0810
13316C8626J5668j3932K7501L612n4617n8621M931J4770O5662N9066j1468K6615
13304A17813q311n807M880m3002K8964K3616L0395L0645l8867p9454J6217M1875
$$ plain form
13388 34105 50830 20383 72993 107525 65644 113186 184348 167385 115907 139980 136590 81552
13376 81552 38571 22168 20802 15806 -7732 18061 114224 144523 182330 214884 210514 196695
13364 196695 132423 86713 73367 153450 181412 201460 186881 120789 74805 75775 46673 44078
13352 44078 41811 -27300 30803 53406 49685 52223 18918 59307 113255 91200 112500 162485
13340 162485 123512 117564 85561 8403 8541 49242 29396 34261 68702 14718 -65628 -76215
13328 -76215 -87344 -28785 -9497 -15615 -44187 -9675 46257 128453 95947 70226 27816 38626
13316 38626 54294 40362 67863 71475 16858 -41763 -36832 -22062 43600 102666 91198 117813
13304 117813 109502 103695 108575 65573 94537 118153 148548 179193 140326 60872 77089 118964
13292A18964p065m552O6507o798q8188r5298M0436R2551N4276n9332J1695j2975
13280A10221r4442J6734K2488J75m8079j1591r181p350M0564o416p389k648M6763
13267D9849J3978l0897k2051J6197O2830J3225K3194n7132K7257K8872M4307j220
13255A68409P204j3337n5689K4480K7923p7637l5133n6466J5151L1772J2503k9896
13243A9284j8884L9540L3710m2313k152L2232k8985m975L4090q690L6170N2382
13231A41409m7959j15544m4998L7202P5387K8973k5033R506O5444N5517K105p3258
13219A08751n1171j3039L7565K6343m0695P3884R6845L1604K6721K1267p6613
13208B41462j16418k3954M751Q273L1040l9153N0893n025j712j5791j032L531
$$ plain form
13292 118964 111899 107347 173854 167056 78868 -16430 24006 116557 170833 111501 123196 110221
13280 110221 15779 32513 55001 55176 7097 -4494 -13675 -21025 19539 13123 5734 3086 49849
13267 49849 63827 32930 10879 27076 89906 103131 126325 69193 96450 125322 169629 168409
13255 168409 175613 162276 106587 131067 158990 81353 46220 -10246 4905 36677 49180 19284
13243 19284 400 39940 73650 31337 29185 61417 32432 27457 61547 52857 89027 141409
13231 141409 93450 -22094 -67092 -29890 45497 74470 49437 58943 124387 179904 182009 108751
13219 108751 57580 44541 82106 108449 67754 141638 238483 270087 296808 318075 241462
13208 241462 125044 101090 105841 114114 145154 106001 156894 151869 150157 134366 133334 136865
13196A36865m265m253n7225k0479M8828P5396K8277M5692q4826q8541O4423J04929
13184B44821K4817O1484O171L3185K7619M6705R2062K6801q234P563L8365J5164
13172F16523K4307O8271J45048J80640J58793K34092L73102L04756K62105M36759
13162B804396O43360J011914J689545K259269K160600Q96866j144326k239628
13154H081996k101669j591999j016758p09630m47860k77692k03807j32413r5009
13145A505159j4743j3915r0472J0081P8333J06936K27059k9250j2655J44850J48495
13134B059878J87769K44169M06283N95998R57763J508123K281253L311902M147223
13125A5700361M182035K832198P39947j942381m317939m707961l577190k390625
$$ plain form
13196 136865 132600 128347 71122 50643 99471 174867 203144 248836 164010 75469 139892 244821
13184 244821 269638 331122 337293 370478 398097 444802 536864 563665 555431 562994 601359 616523
13172 616523 640830 709101 854149 1034789 1193582 1427674 1800776 2105532 2367637 2804396
13162 2804396 3447756 4459670 6149215 8408484 10569084 11465950 10321624 8081996
13154 8081996 5980327 4388328 3371570 2661940 2214080 1936388 1732581 1600168 1505159
13145 1505159 1490416 1476501 1386029 1396110 1474443 1581379 1808438 1779188 1766533 1911383 2059878
13134 2059878 2247647 2491816 2898099 3494097 4451860 5959983 8241236 11553138 15700361
13125 15700361 19882396 22714594 23454541 21512160 17194221 12486260 8909070 6518445
13117F518445j570588j003614p10276m63595l07261j88867n7526j9548l9745L0141
13107B187566Q1121J04998J16285J21059J51567J94191J24792J95080L61666M40638
13097D078963N64653Q72483J338806K028373K883160L753178L756423K390489
13089B1666528Q49387J281913L662010O306299P248204M071710k502549p720811
13081C4862691q611351o765123m636518l047996k007966j369354r58235o99229
13073F766919m56556k77414k78032j07889k4230J06660K37062L99616L92605M37033
13063G195774P03951J123469J595769J691311J765894K172311L311521N231979
13055B4791979P819416J0108278J0666980P919169M046671K889939K392320l219017
$$ plain form
13117 6518445 4947857 3944243 3233967 2770372 2463111 2274244 2216718 2197170 2157425 2187566
13107 2187566 2268687 2373685 2489970 2611029 2762596 2956787 3081579 3276659 3638325 4078963
13097 4078963 4643616 5516099 6854905 8883278 11766438 15519616 19276039 21666528
13089 21666528 22515915 23797828 27459838 33766137 41014341 45086051 42583502 34862691
13081 34862691 26251340 19486217 14849699 11801703 9793737 8424383 7466148 6766919
13073 6766919 6310363 6032949 5754917 5647028 5622798 5729458 5966520 6366136 6758741 7195774
13063 7195774 7899725 9023194 10618963 12310274 14076168 16248479 19560000 24791979
13055 24791979 32611395 42719673 53386653 61305822 65352493 68242432 70634752 67415735
13047F7415735j1412702j4156655j1178117p114547m234367k284307q71354L01415
13039A6465101J645568L111701M790386O294748O674853M559645k3546m551917
13031C8966539o778911o471370m871859l312076k023130r96239j43522P74412
13023A5143844J631605K858062M568929O422593P753805O958815K423830l847072
13015D3914411p760773p822934n776258l657528j906522n02394Q24360K355362
13007A9667724M460134P184152R605767R125755L443672m620415q966871p724096
12999C2175822m108329n11718K550695N242000O595954N047122L51265n047652
12991D2295159q138262q069193o227562m311526k987853k063209j554653j149561
$$ plain form
13047 67415735 56003033 41846378 30668261 23553714 19319347 17035040 16163686 16465101
13039 16465101 18110669 21222370 26012756 32307504 38982357 43542002 43518456 38966539
13031 38966539 32187628 25716258 20844399 17532323 15509193 14512954 14369432 15143844
13023 15143844 16775449 19633511 24202440 30625033 38378838 45337653 47761483 43914411
13015 43914411 36153638 28330704 22554446 18896918 16990396 16488002 17312362 19667724
13007 19667724 24127858 31312010 40917777 50043532 53487204 48866789 39899918 32175822
12999 32175822 28067493 27555775 30106470 35348470 41944424 46991546 47342811 42295159
12991 42295159 34156897 26087704 19860142 15548616 12560763 10497554 8942901 7793340
12983G793340q15299n69369l75151j81582k550N1962N6067j00519r0764Q6811
12973E852946K41026N96676Q77058J317684J980238L004253M448023O421099Q410499
12964C3149502R298786P258829J923517m016921p843436q798906p830395n970608
12956A7170368m210870k828117j941780j373544j023795q04862n21155l41844
12948D124401k38864j46985r2556k01391l33438k56183k46619j54738r2984O9365
12938B430008J34800J64734L70719N44591Q60364J277108J964728K800699K831540
12929A3379291J281501j033695k275544j777779m89270P71221J603418J852776
12921A3311919Q95284j066692k391717k541478j993794j370464r43434o23536
$$ plain form
12983 7793340 6978041 6408672 6033521 5851939 5849389 5901351 5957418 5856899 5766135 5852946
12973 5852946 6093972 6690648 7567706 8885390 10865628 13869881 18317904 24739003 33149502
12964 33149502 42448288 49707117 51630634 47613713 39770277 30971371 23140976 17170368
12956 17170368 12959498 10131381 8189601 6816057 5792262 4987400 4466245 4124401
12948 4124401 3885537 3738552 3645996 3444605 3111167 2854984 2608365 2453627 2360643 2430008
12938 2430008 2564808 2729542 3100261 3644852 4505216 5782324 7747052 10547751 13379291
12929 13379291 14660792 13627097 11351553 9573774 9084504 9855725 11459143 13311919
12921 13311919 14207203 13140511 10748794 8207316 6213522 4843058 3899624 3276088
12913C276088l46521j70281l2663j3991j60477k59487k74307j79680q6461m4972
12903A707248p3451J6624L1871n213L4770J68866K84353M57854P30786J102334
12893D456042J518219K033780K343586J908844M69002j322169k415916k369877
12885F621511j754985j140323q31772o89413m40221k68936j76326j58888q6485
12876A074162m4910p8704r8479m3659p1103p0531k6897j09825l7097k4554j0632
12865D57771J06286J0689k6445q789k4122j9475k4332k7833k9029k4953J0612
12854D00380M9042j9363K3138k4217q1638O8498n905k6695k3225J0047l0462P160
12842C46760k720K538J6438K3447l7359n1514n5991r7166n4505K7496j3455j1382
$$ plain form
12913 3276088 2929567 2759286 2726623 2712632 2552155 2292668 2018361 1838681 1752220 1707248
12903 1707248 1633797 1650421 1682292 1677079 1711849 1880715 2165068 2622922 3353708 4456042
12893 4456042 5974261 8008041 10351627 12260471 12729473 11407304 8991388 6621511
12885 6621511 4866526 3726203 2894431 2205018 1764797 1495861 1319535 1160647 1074162
12876 1074162 1029252 950548 852069 808410 737307 666776 639879 530054 492957 468403 457771
12865 457771 564057 574746 548301 539512 515390 495915 471583 443750 414721 389768 400380
12854 400380 449422 430059 453197 428980 347342 415840 409935 383240 360015 370062 339600 346760
12842 346760 344040 346578 363016 386463 349104 297590 241599 144433 89928 117424 103969 92587
12830I2587K9393K8856k5247n1816L8377M3794q428L8037L1151J8445K9998M9956
12818C15103k9912o9185l7238r652k4657R998N432j9785k3561l8588K0040J6439
12806A14434J0988k1756m5885K8440j8586P9033j8697r4242M158R9273R1821O0061
12794B89042o1885m444K3022l0225l9017l6522k0366l2355M0380l3038o7479M9264
12782G6377N6527N1641n5354k9129l7089l5934n9786L6706M0108K7359m76j5372
12770E5578L6050R181j3258k5870k5053j0144N2170l1168O3712k2638j01019K9790
12758A7331n2946k0828P2502M0699o8306l4040J5430K6029Q5312j8061J5805J8722
12746I7649j114o8586l3974k7083j3747j2259k9284L4347j8725L3889J0462P9879
$$ plain form
12830 92587 121980 150836 125589 73773 112150 155944 147516 185553 216704 235149 265147 315103
12818 315103 285191 216006 178768 169116 144459 154457 159889 140104 116543 77955 97995 114434
12806 114434 125422 103666 57781 86221 67635 146668 127971 33729 37887 137160 228981 289042
12794 289042 227157 222713 245735 215510 176493 139971 119605 87250 127630 94592 27113 76377
12782 76377 132904 184545 129191 100062 62973 27039 -32747 3959 44067 71426 70950 55578
12770 55578 91628 100809 87551 61681 36628 26484 78654 47486 111198 88560 -12459 17331
12758 17331 -35615 -56443 16059 56758 -11548 -45588 -30158 -4129 81183 63122 78927 97649
12746 97649 96535 27949 -6025 -33108 -46855 -59114 -88398 -54051 -72776 -38887 -28425 51454
12734E1454L6700K789k2489k5025n0352m8741N0655J07301O7542q7130o3677N5222
12722G4249k175j9708k4381L9309k322n6465k058Q181l1201k2393m515K4983M3951
12709B5455j2572j2028K9752P8961n0954l4586q275O8479L7731j3846K4492n8229
12697G4380o1402K2047N906m2353l5430K8254L2197L3261N2159L9290k9311j13374
12685E624J0204N9074j7008m0689m2004k6935J7130M895J7887L1600J9538L9720
12673G9036N7007m0755j17832N221P0768K0720k9491q114M0395n1417L1866L2664
12661I0068L3931j6919n1949k9886n5117m707N5239m27m9205Q478P785l3077k0101
12648f5887r612j4653J675K0815R1267L6763j5832J6927L0190J3492n4663m6040
$$ plain form
12734 51454 88154 90943 68454 43429 -6923 -55664 -5009 102292 169834 82704 19027 74249
12722 74249 72074 52366 27985 67294 64972 8507 6449 14630 -16571 -38964 -43479 -18496 25455
12709 25455 12883 855 30607 109568 58614 24028 15753 84232 121963 108117 132609 74380
12697 74380 12978 35025 40931 -1422 -36852 -8598 23599 56860 109019 148309 118998 5624
12685 5624 15828 74902 57894 17205 -24799 -51734 -34604 -29709 -11822 19778 39316 79036
12673 79036 136043 95288 -22544 -17323 53445 74165 44674 36560 76955 25538 57404 90068
12661 90068 123999 107080 55131 25245 -29872 -34579 20660 20233 -28972 -20494 -12709 -45786 -65887
12648 -65887 -75499 -90152 -88477 -67662 23605 60368 44536 61463 91653 105145 50482 4442
12636D442m4237p086M3062O9317j3057N3172l4229n9369L445J9835J9321j8386
12624C6230M4020K325J6271Q4784j8026n2320q5967o2647n3538j7353M4708k1543
12612h3056L0286K5840N4815j9642L4887L4099n7890L799O0700m1648r290N2022
12600H4922j3414m0816M619K9469L4929K180K7126L3208J6922J10995Q8212N3173
12588D31525l7661K4606m9244k9922r9956m5391j1445k3871m852j3560L9002K6013
12576B05244j5072l6329j1088M4896J8783n578L9793o4025m5078m6238l4234J3731
12564F4805L9570R639k7282j41K8335M3433o795K7429J19231N2365k7983m4282
12552B78324o5672m1618m8666p8672R9413J00000j0342r4881j1280K4199L5451
$$ plain form
12636 4442 -39795 -46881 -3819 65498 52441 105613 71384 12015 15460 35295 54616 36230
12624 36230 80250 82575 98846 183630 165604 113284 27317 -35330 -88868 -106221 -61513 -83056
12612 -83056 -52770 -26930 27885 8243 43130 77229 19339 23138 83838 42190 32900 84922
12600 84922 71508 30692 35311 64780 99709 101889 129015 162223 179145 290140 378352 431525
12588 431525 393864 418470 369226 339304 239348 193957 182512 158641 153789 140229 179231 205244
12576 205244 190172 153843 142755 187651 206434 200856 240649 176624 131546 85308 51074 64805
12564 64805 104375 114014 86732 86591 114926 158359 151564 178993 298224 350589 322606 278324
12552 278324 212652 171034 122368 43696 143109 243109 232767 137886 126606 150805 186256
12541A86256N9981M8222M940j41836p7379j1435o816Q8819J01690N1411m0524
12530B63329q1845j9651k4263o3802j4358M7845J459n1781p2473J4986M5324J1687
12518E6457J2059l0817l4704k7755M9395L1616k1740k3009J94Q598L2920o183
12506D7031J1001O3232M5239J0970K5324K9764k2943P335m3837l4984m3195p060
12494H7877o8402J486L5545N648j3140j8326p2406J8198P1324n012k9787l4141
12482b1136l4258j6744l242L8707j3009p4763L195J9858K4777J6393M7213J3061
12470E2L8409M2296j4067k3187p697K8840M8224j339n2769M1562J2066n7779q4574
12457b9963r161K8726n099n789m5848P241L7262m1428M1337M6124J6908j068l5875
$$ plain form
12541 186256 246237 294459 299399 157563 80184 68749 61933 150752 252442 303853 263329
12530 263329 181484 161833 137570 73768 59410 107255 108714 56933 -15540 -554 44770 56457
12518 56457 68516 37699 2995 -24760 24635 56251 34511 11502 11696 20294 53214 47031
12506 47031 58032 121264 166503 177473 202797 232561 209618 216953 173116 138132 94937 87877
12494 87877 19475 20961 56506 62154 49014 30688 -41718 -23520 47804 42792 13005 -21136
12482 -21136 -55394 -72138 -75380 -36673 -49682 -124445 -121250 -101392 -76615 -60222 -13009 52
12470 52 38461 80757 66690 43503 35806 64646 112870 111531 58762 100324 112390 54611 -29963
12457 -29963 -39124 -10398 -15497 -21286 -67134 -59893 -22631 -64059 -22722 23402 40310 39242 3367
12444C367m2109l6011P0626m669j203J5664l3129l1179q350J7250P4440k0329
12432D368J3596N120l2522m449l7566l220N0390p698m6638p516Q8567K0651p7433
12419c4350n5582O362J5852P0226p367l9729n3982p668n516K5205r677j9196L9682
12406g5740j5602j2198L8227P1364K9950j136j3225m8531m2510p524l5877j7455
12394a30257O55R5844R9557n5317p0263k6382j8075O803O8937K4680o2806n6526
12382a23150M8726L6747j9921o1234K0719J845O3722R2409k919o6897m1892N8750
12370F905J468P527j1406o922M7232l6651K1539n9174j8750O0238p6715q9853
12358a54562P1091j5162P392Q0643N1852q801j7618m269k8236l7110k0424j8149
$$ plain form
12444 3367 -38742 -74753 -4127 -8796 -9999 5665 -27464 -58643 -66993 -49743 24697 4368
12432 4368 17964 23084 -9438 -13887 -51453 -54673 -4283 -11981 -58619 -66135 22432 43083 -34350
12419 -34350 -89932 -83570 -67718 2508 -4859 -44588 -98570 -106238 -111754 -86549 -96226 -115422 -75740
12406 -75740 -91342 -103540 -65313 6051 36001 34865 21640 -26891 -69401 -76925 -112802 -130257
12394 -130257 -129602 -33758 65799 10482 -59781 -86163 -104238 -97435 -28498 -3818 -66624 -123150
12382 -123150 -74424 -37677 -57598 -118832 -98113 -96268 -32546 59863 56944 -9953 -51845 6905
12370 6905 8373 15900 4494 -2428 44804 8153 29692 -29482 -48232 12006 -64709 -154562
12358 -154562 -83471 -98633 -91241 -10598 41254 32453 14835 10566 -17670 -54780 -75204 -93353
12346i3353m9990m4674m5415j4727N7735L2640N9426L6125m5404o4096R318J04123
12334e8292J03131j01838p6305L290M5916M272M6112J5181K2436J0533j8700k343
12322f607p561n263K583M2768Q4098l4584l1118J2129m047L4751L2037n0678k502
12309F6006M9510n796l9527p5797j9121l6477n5436N816o706k0224M0608N4282
12297d2862J3022j8988p646o6070K854Q1432l918L897m2437k7570k7878M2717
12285i3447K4069k2476j720q4152K3645O6351O8067J7183j225k7095p7984j3378
12273a22162m568K2784J3718j5262N8109M0091o6152j7775K0209k9265Q076M9527
12261d2670K7841m722K4016q8807p8399k9464L0192Q0426R7103J638j7101o1602
$$ plain form
12346 -93353 -143343 -188017 -233432 -248159 -190424 -157784 -98358 -62233 -107637 -171733 -162415 -58292
12334 -58292 44839 -56999 -133304 -130014 -84098 -79826 -33714 -18533 3903 14436 -4264 -6607
12322 -6607 -14168 -19431 -16848 25920 110018 75434 44316 56445 52398 87149 119186 68508 66006
12309 66006 115516 109720 70193 -5604 -24725 -61202 -116638 -110822 -117528 -137752 -97144 -42862
12297 -42862 -29840 -48828 -56474 -122544 -119690 -38258 -42176 -38279 -80716 -108286 -136164 -93447
12285 -93447 -69378 -91854 -93574 -177726 -154081 -87730 -19663 -2480 -3705 -30800 -108784 -122162
12273 -122162 -126730 -103946 -90228 -105490 -47381 -7290 -73442 -91217 -71008 -100273 -92197 -42670
12261 -42670 -14829 -19551 4465 -84342 -162741 -192205 -162013 -81587 15516 17154 53 -61549
12249f1549k6824M4755j1158J3450N6934K8259o3706K1194q230m8251L8829L9219
12237B2922r961k9599L723P266p471K9522j1799P2290L4761q1148k6352N926J2271
12224B2351M8255K068k8656l7840n950J2149q1682l1112L4114J2340m3281K6287
12212g0957l3366M5639O9668l467m2284j3369k2760J2482o721l0110M7401K4158
12200b3686Q65P1223L1883N628k0631o3684o9829k3225N444J3101j3503q934J9660
12187g5688p741k2033P762J8579J5904M9092j4516n9132k7661J1849M5867o3413
12175a21131o0879K5676L9521j9512J1107l629l8524N8764O7982l4969o751R829
12163g2516l8668J0030L5942L7884j9886O8470P0104O518l2324j6424m756n2857
$$ plain form
12249 -61549 -88373 -43618 -54776 -41326 15608 43867 -19839 1355 -6875 -55126 -16297 22922
12237 22922 12961 -16638 -12915 -5649 -13120 16402 4603 76893 111654 30506 4154 10080 22351
12224 22351 70606 72674 44018 6178 228 12377 -69305 -100417 -66303 -53963 -97244 -70957
12212 -70957 -104323 -58684 10984 7517 -34767 -48136 -70896 -58414 -65135 -95245 -47844 -23686
12200 -23686 -22821 48402 80285 85913 65282 1598 -68231 -91456 -86012 -72911 -86414 -95348 -75688
12187 -75688 -83429 -105462 -97700 -79121 -63217 -14125 -28641 -87773 -115434 -103585 -57718 -121131
12175 -121131 -182010 -156334 -116813 -136325 -125218 -128847 -167371 -108607 -40625 -75594 -82345 -72516
12163 -72516 -111184 -101154 -65212 -27328 -47214 21256 91360 97878 65554 49130 44374 -8483
12151h483n2275j489j5230N1540j6788k2845j21494l461R2360M7208K6459k8045
12139e2543p099P9343m0012j6473J4446l6184k5831j1028L3459R4438k6987l9590
12127c4061m7442N1678M3666j8540m630j842J6587q6226R456M3139L4705O8828
12115G5318j3007j7224k2064M4618J7035m2468J9743J33696Q3090O9866k7299
12104C21304n7213k6803j00533l2008j0016n2374l3988Q699M6J6431o0174j05986
12092a32615m2974P081O4778M7404J8419J6148q886L5424P800O059K3826l5007
12080G457n9323k0194K2328J3027O649j9304P600P1382M1526L2231k7484j51607
12068g5712j03272N8223R2884P2219O3388Q554N2516k2155r7810j4720n8294j2150
$$ plain form
12151 -8483 -60758 -62247 -77477 -25937 -42725 -65570 -187064 -190525 -98165 -50957 -24498 -52543
12139 -52543 -59642 19701 -20311 -36784 -22338 -58522 -84353 -95381 -61922 32516 5529 -34061
12127 -34061 -81503 -29825 13841 -4699 -9329 -11171 5416 -80810 -71354 -28215 6490 75318
12115 75318 62311 45087 23023 67641 84676 42208 61951 195647 278737 348603 321304
12104 321304 264091 237288 136755 104747 94731 42357 8369 17068 17114 33545 -26629 -132615
12092 -132615 -175589 -168508 -103730 -56326 -37907 -21759 -30645 4779 12579 18638 42464 7457
12080 7457 -51866 -72060 -49732 -36705 -30056 -49360 -41760 29622 71148 103379 75895 -75712
12068 -75712 -178984 -120761 -27877 44342 107730 116284 168800 146645 48835 34115 -24179 -36329
12056c6329l6978O912J3851K3544K0292O2641j0804j04598m5828M5461M5137q7280
12044a03979l8473P2219O9327q5126k5979O6099N9647O6237Q0672m5264p7052
12033C8328L1757n353P35L395M6078J9278Q0J6899M2990P2128L0604K8294J13792
12020D39005O3221M6229L9312l7210j14209q9632m0109n6693n0137o6236p0826
12009F2715j7951k704k3232k6781j6341J2670q503J7820k4687M09J7050k4897
11997c4432J6704M2787K9870l9643l3933r746N9772N7863p2116k6874m736m7065
11985f1549J4630P445j5184n0861N457P1119m500q5193k556K0668M3498N615M1189
11972a0222l6198K3589j6692M8277j3246R071j9624p8410m9810K0642O6965J0639
$$ plain form
12056 -36329 -73307 -66395 -52544 -29000 -8708 53933 43129 -61469 -107297 -61836 -16699 -103979
12044 -103979 -142452 -70233 -906 -86032 -112011 -45912 13735 79972 160644 115380 38328
12033 38328 70085 64732 65467 68862 114940 134218 134298 151197 194187 266315 296919 325213 439005
12020 439005 502226 548455 587767 550557 436348 346716 306607 249914 199777 133541 62715
12009 62715 44764 42060 18828 -7953 -24294 -11624 -20127 -2307 -26994 -26585 -9535 -34432
11997 -34432 -17728 25059 54929 15286 -18647 -28393 31379 89242 17126 -9748 -14484 -61549
11985 -61549 -46919 -39474 -54658 -105519 -100062 -28943 -33443 -118636 -121192 -100524 -57026 -51411 -10222
11972 -10222 -46420 -22831 -39523 8754 -4492 4579 -15045 -93455 -143265 -122623 -55658 -45019
11960d5019l9042o0211K0326M756P6046L3957K5318O5876J4041m2574N14l5420
11948A8568p5508J5246l484O2682O2942J0268L2343j09536p7564N1817K6635J8559
11936C2968M6175o8144n2999K9924P6742p1176p7138j2282O0224M7819r429j1086
11924h402Q122L8898k0459k2490l1923M6795J7240r74k2132j1901K2346K904j3199
11911D825j3728M0939J09041L2510n098L7838R6035J57008J57349J14691L6807
11900G68217n3434j41808j90870r3686p4346p4811o6678o7613m4502O9337K6559
11889E6365l8238J40n600k6343M0448K2251K3347k2494J4330n479Q635m4928k009
11876B0425K4179q2795n1431M5226K2137L1688o9865L239J8655N3247k1101n2051
$$ plain form
11960 -45019 -84061 -144272 -123946 -119190 -43144 -9187 16131 82007 96048 53474 53988 18568
11948 18568 -56940 -41694 -45178 17504 80446 90714 123057 13521 -64043 -12226 14409 32968
11936 32968 79143 10999 -42000 -12076 64666 -6510 -83648 -95930 -35706 12113 2684 -8402
11924 -8402 -280 38618 18159 -4331 -36254 10541 27781 26807 4675 -7226 15120 18024 4825
11911 4825 -8903 32036 141077 173587 168489 206327 302362 459370 616719 731410 768217
11900 768217 714783 572975 382105 288419 214073 139262 72584 4971 -39531 29806 56365
11889 56365 18127 18267 12667 -13676 26772 49023 72370 49876 64206 58727 67362 22434 20425
11876 20425 44604 -38191 -89622 -44396 -22259 9429 -60436 -57197 -38542 14705 -6396 -58447
11864e8447o3670k1189J4744J1317J2282P7606N0926j5240O8392L0798k7995l5097
11852D4427l814O4286k4051k5813M6135n3365p3129O567k0043j2054K7642P1828
11840D8616J4788O906M4271l8160m8103n2443j7873j1668J8258J5261n884j1008
11828c7039J1113N0620k3910P7192L4874K8124k9802l2077j7147J9779K4038K1147
11816A26912R9028N1564N9518p1163o5704q3996l0976l5578o297m0998n860J1259
11804G709J8950l8935m746K4777n0888k7375J3167k0462O3346J11606K2205m9660
11792F9694j15927l5978J03869P1228m3180j1753l1543K7234N6852N701l4849
11781F1348n280k1123n9599J9712j8045J6365P5909m6683j6626L4898N0081K340
$$ plain form
11864 -58447 -122117 -143306 -128562 -117245 -104963 -27357 23569 8329 76721 107519 79524 44427
11852 44427 40613 104899 80848 55035 101170 47805 -25324 -18757 -38800 -50854 -23212 48616
11840 48616 63404 70310 114581 76421 28318 -24125 -41998 -53666 -35408 -20147 -26031 -37039
11828 -37039 -25926 24694 784 77976 112850 140974 111172 79095 61948 81727 105765 126912
11816 126912 225940 277504 337022 265859 200155 116159 85183 49605 43308 2310 -3550 7709
11804 7709 26659 -12276 -17022 7755 -43133 -70508 -57341 -77803 -14457 97149 119354 69694
11792 69694 -46233 -82211 21658 92886 49706 37953 6410 33644 90496 96197 61348
11781 61348 56068 34945 -24654 -4942 -22987 -6622 69287 22604 5978 40876 90957 93297
11769I3297p7531O674L6769K4859J1217M160j4976K8100O2681l0279o8737k4661
11757E1573j3959j0849k765l6754P2865M4767j4847Q072M4129m2623O5324O6678
11745B31611l3610l3037m5335Q731L8471O2312K1702k7452N2243K5041l8812J0686
11733B72551O8800l042J7827j6522o7412r4559k2499N0015j2857m0333N5494P8589
11721B86052M3392K0984Q4941L9116N5435J69796R2941O8674M8738J43907J42780
11710A196756J95905J20495J45800K37104K51663L39067L04566L41559M39789
11701C572704N34024O96555J123589J703868K551510L832153N369303P083889
11693B6467595Q677218R079161P271900L380657r38125n182476q362991r095388
$$ plain form
11769 93297 15766 22440 59209 84068 95285 99445 84469 112569 175250 144971 76234 51573
11757 51573 37614 26765 24000 -12754 60111 104878 90031 98103 142232 99609 164933 231611
11745 231611 198001 164964 119629 128360 166831 229143 250845 223393 275636 300677 261865 272551
11733 272551 341351 338309 356136 339614 272202 177643 155144 205159 192302 151969 207463 286052
11721 286052 329444 350428 435369 474485 529920 699716 792657 861331 910069 1053976 1196756
11710 1196756 1392661 1513156 1658956 1896060 2147723 2486790 2791356 3132915 3572704
11701 3572704 4106728 4803283 5926872 7630740 10182250 14014403 19383706 26467595
11693 26467595 35144813 44223974 51495874 54876531 53938406 48755930 40392939 31297551
11685C1297551p968419o272697m519503l095222k021381j384546j002005p63830
11677D269948o00882n51401m47505k88129k72961j87277j57247j49458j55252
11668A459836n8789k0149o4662j08878q6219R897l0263q0074P136K4797n1094
11657A001538o3606o2776o8640n0303P5092j2051q7910k677n8795l9179M361P4678
11645G09732L9972O5978J4727k922J68K4147J4446k4719O0256J02055L3002L1964
11633A068806N3292J59502J34032K14714J80991K06963K60673K27995K13649L95841
11623C116458L83254L62824L85600N02889O67015P57133Q48449R08642J085209
11614I017473J343246J732574K534448L810475N706342Q464368J2032438J5902258
$$ plain form
11685 31297551 23329132 17056435 12536932 9441710 7420329 6035783 5033778 4269948
11677 4269948 3669066 3117665 2670160 2382031 2109070 1921793 1764546 1615088 1459836
11668 1459836 1401047 1380898 1316236 1207358 1121139 1131036 1100773 1020699 1027835 1052632 1001538
11657 1001538 937932 875156 806516 756213 831305 819254 731344 728667 669872 630693 635054 709732
11645 709732 749704 815682 830409 827487 827655 851802 866248 841529 901785 1003840 1036842 1068806
11633 1068806 1122098 1281600 1415632 1630346 1811337 2018300 2278973 2506968 2720617 3116458
11623 3116458 3499712 3862536 4248136 4751025 5418040 6175173 7023622 7932264 9017473
11614 9017473 10360719 12093293 14627741 18438216 24144558 32608926 44641364 60543622
11606F0543622J9344662K0941654J8409121J0771823O20118r422298j7451444
11599A03757258k0798424j9464820j5988979j2147039q759041n983158m075382
11592A6540415k942735k203975j645762j273480r92571q31465p01675o56929n41938
11583D749885l88198l30050k33514k38225j81192k58066k62326k11332j96454
11574B450528k12698j34041q8665j12485j52639j69377j34824p8832p2450n1881
11564A242636p0732p2622q0724l8359j2412q656k9557l5589l4146k2486P533l0182
11552H14704n6467m070J7548M3531P5720j0294J1303j4330J4399R8383k9552K2209
11540I83084P2259J6467l7500k3777j0660m4394j27913j79505q9015K1394O5784
$$ plain form
11606 60543622 79888284 100829938 119239059 130010882 130631000 121208702 103757258
11599 103757258 82958834 63494014 47505035 35357996 26598955 20615797 16540415
11592 16540415 13597680 11393705 9747943 8474463 7481892 6650427 5948752 5291823 4749885
11583 4749885 4361687 4031637 3798123 3559898 3378706 3120640 2858314 2646982 2450528
11574 2450528 2237830 2103789 2015124 1902639 1750000 1580623 1445799 1366967 1294517 1242636
11564 1242636 1171904 1099282 1018558 980199 967787 959131 929574 893985 859839 837353 844886 814704
11552 814704 758237 754167 771715 815246 890966 880672 891975 877645 892044 990427 960875 983084
11540 983084 1055343 1071810 1034310 1010533 999873 955479 827566 648061 559046 580440 646224
11529F46224j1641M7177O7937r945K5969L7247J05608J15533N0946J00434M4757
11518A220246k0133k252J20736J07413J67006Q0156J69465K78136K94338L58392
11508B773503M06519L53077L31172J17268K13449M52195O01404Q59793Q99542
11499G007922P70867O67659R30748J557232K264947L253318M733073P182763J1410402
11490C9778931J8266599K8002525L7712608L7825427J6750229j7560611l8863085
11483A21912623l7706306k6857065j7098535j0637493o592748m174830k965821
11476A5879825k322956k074301j812209j386205r83705q67319p84550o66768n95088
11467D386724m10305k72733j29080o9884j73472k20239l25423l86715k92281j58109
$$ plain form
11529 646224 634583 681760 749697 739752 765721 802968 908576 1024109 1075055 1175489 1220246
11518 1220246 1200113 1197861 1318597 1426010 1593016 1673172 1842637 2120773 2415111 2773503
11508 2773503 3180022 3533099 3864271 3981539 4194988 4647183 5248587 6108380 7007922
11499 7007922 7778789 8446448 9377196 10934428 13199375 16452693 21185766 28368529 39778931
11490 39778931 58045530 86048055 123760663 161586090 178336319 160775708 121912623
11483 121912623 84206317 57349252 40250717 29613224 23020476 18845646 15879825
11476 15879825 13556869 11482568 9670359 8284154 7300449 6433130 5648580 4981812 4386724
11467 4386724 3976419 3703686 3574606 3504722 3331250 3111011 2785588 2398873 2106592 1948483
11457A948483j28517j33168r6613q1323q9296p7971l2208m4785n0913m4104k8476
11446A141109j8783q0795p8336j9404M732m1634K5210J9559j1855l1082k1836
11435H86885J3655j8417j0134K5384M5477o3538J8134N9888N436M2177M5458r269
11423A041136N9460K58158K01694O5367P8765J1764N2381J17500K75592L81954
11413B543771L33689K79718K52652K57143M55223P88446J074457J543890K400999
11404I929988L948323O485049J0446232J5500412J8073771J1624888m030340j6578702
11396E5399621j7766661j2749578p829734m682457k893738j878366j191949r28303
11388E478835p37491p02467n44394m01617l41940k98994k94971k31642j67748
$$ plain form
11457 1948483 1819966 1686798 1590185 1508862 1419566 1341595 1309387 1264602 1213689 1169585 1141109
11446 1141109 1122326 1041531 963195 943791 948523 906889 932099 951658 939803 908721 886885
11435 886885 900540 882123 871989 897373 942850 879312 897446 957334 962770 1004947 1050405 1041136
11423 1041136 1100596 1358754 1560448 1625815 1704580 1716344 1768725 1886225 2161817 2543771
11413 2543771 2877460 3157178 3409830 3666973 4122196 4910642 5985099 7528989 9929988
11404 9929988 13878311 20363360 30809592 46310004 64383775 76008663 71978323 55399621
11396 55399621 37632960 24883382 17053648 12371191 9477453 7599087 6407138 5478835
11388 5478835 4741344 4038877 3494483 3092866 2750926 2451932 2156961 1925319 1757571
11379A757571j05871n5509k4526j00381j82509j97953q4525K99o2866n7955j101
11368H84674q3502j13166J4992N8873K8188k7535L702N3097k9535q2499j20855
11357E86434j6883k9620n4470j8549j0811l5447j7345O966N389j3640j99N6563
11345D58388p1751L387r056j1752j2786J7257o810K0543j1057o7923l8212l9346
11333B30882O2981P1425M1156q3997p3852L3380Q4084J06365J7584n921l7875
11322D46212K394M8738J4845q2029j798N8580O8059K7497k5283Q8213J70469K26497
11310A042394J69984K23820L65634N10360O17941P40271P00356N45688L71476
11301E287924K33887M3942k46571l58061m28222o02455o69810n78542n79913l75493
$$ plain form
11379 1757571 1651700 1596191 1571665 1471284 1288775 1090822 1006297 1006596 943730 885775 884674
11368 884674 801172 688006 702998 761871 790059 762524 766226 819323 789788 707289 586434
11357 586434 569551 539931 485461 466912 456101 420654 403309 410275 415664 402024 401825 458388
11345 458388 386637 390024 380968 369216 356430 373687 366877 387420 376363 308440 270228 230882
11333 230882 293863 365288 406444 322447 248595 281975 366059 472424 490008 484087 446212
11322 446212 448606 497344 512189 430160 428362 486942 555001 582498 557215 645428 815897 1042394
11310 1042394 1212378 1436198 1801832 2312192 2930133 3670404 4370760 4916448 5287924
11301 5287924 5521811 5565753 5319182 4961121 4532899 3930444 3260634 2682092 2102179 1726686
11291A726686k19911j29933j67260j08570o4828m2752K547j0195L675N0272J37432
11280A177163J19282R3195K59122K64724M51424Q25113Q82762O98859N37165M64957
11270E773766M23453L12055J43173M1686M0035M2257j00563k58587k33002j32087
11260F052186k37848m03917l96148n33515p26708o70443o46937m96940l41541
11251A598189j87143k06480j93776r2904m009K4066l4740R513j7392k8123M63
11240H67664N5704P2040J79178L06569L40635L94919N42080O02634N67650M53668
11230D382741K36843J57869K0829j73400k77603k82450l97288m64617m95062k81452
11220B426410j50481q8230m2593K8469N0053R3311K30856L91854M17056M80190
$$ plain form
11291 1726686 1506775 1376842 1209582 1101012 1036184 993432 995979 985784 989459 1039731 1177163
11280 1177163 1296445 1389640 1648762 1913486 2364910 3190023 4072785 4771644 5308809 5773766
11270 5773766 6197219 6509274 6652447 6694133 6734168 6776425 6675862 6417275 6184273 6052186
11260 6052186 5814338 5410421 5014273 4480758 3754050 3083607 2436670 1939730 1598189
11251 1598189 1411046 1204566 1010790 917886 913877 937943 903203 912716 895324 867201 867664
11240 867664 923368 995408 1174586 1481155 1821790 2216709 2758789 3361423 3929073 4382741
11230 4382741 4619584 4777453 4798282 4624882 4347279 4064829 3667541 3202924 2707862 2426410
11220 2426410 2275929 2187699 2145106 2173575 2223628 2316939 2547795 2939649 3356705 3836895
11210C836895P21010R48656J330085J839471K612123L414543M168172M226089
11202B3097044L618722K922425K217775J186597k46483j411002k391234l188110
11194B5805734l813964l986833l469545k594832j866993j246544p86142o39246
11186G401635m27352m1413O6713J40868K42978L24183M23384O27342Q36682J185290
11176A0780310J728885K448852L329345M432085N233388N610177N592519N846067
11168D5001628O369856O720244O552470O056736M989422L233007P37443j670906
11160G7989900l418754m983878o407215p374196p744374p797000p250469n974752
11152B7039262m484079l045560k032982j431147j003076o02540l28833j32750
$$ plain form
11210 3836895 4557905 5506561 6836646 8676117 11288240 14702783 18870955 23097044
11202 23097044 26715766 29638191 31855966 33042563 32796080 31385078 28993844 25805734
11194 25805734 21991770 18004937 14535392 11940560 10073567 8827023 8040881 7401635
11186 7401635 6974283 6932870 6999583 7140451 7383429 7707612 8130996 8758338 9595020 10780310
11176 10780310 12509195 14958047 18287392 22719477 27952865 33563042 39155561 45001628
11168 45001628 51371484 58091728 64644198 70700934 75690356 78923363 79660806 77989900
11160 77989900 74571146 69587268 63180053 55805857 48061483 40264483 33014014 27039262
11152 27039262 22555183 19509623 17476641 16045494 15042418 14439878 14111045 13978295
11144A3978295M7981J80147M30283P92577J295303J918760K836130M158025N912305
11135C1549806P640506Q962959R818713J0372505R901963P408889L925133J168515
11127I0748989j537993n165054q341089r712432r938580r898744r236883p740513
11119B9177701n929912m260751l005513k171099j626398j271310j027711p45671
11111I139336m88660l29711m6122J03931L40755N86607R36699J479353K233078
11102A3955266L040244L749057L900884L369663K731989K125988R16118q29246
11094C2959963k290268l099632l555154m081065m163336l514240k609855j796369
11086G850044j344174r97328o89898m85310l99953m01944l60896k90712k31339
$$ plain form
11144 13978295 14026276 14206423 14636706 15429283 16724586 18643346 21479476 25637501 31549806
11135 31549806 39190312 48153271 57971984 68344489 78246452 85655341 89580474 90748989
11127 90748989 89210996 84045942 75704853 65992421 56053841 46155097 36918214 29177701
11119 29177701 23247789 18987038 15981525 13810426 12184028 10912718 9885007 9139336
11111 9139336 8650676 8320965 8274843 8378774 8719529 9306136 10242835 11722188 13955266
11102 13955266 16995510 20744567 24645451 28015114 30747103 32873091 33789209 32959963
11094 32959963 30669695 27570063 24014909 19933844 15770508 12256268 9646413 7850044
11086 7850044 6505870 5508542 4818644 4333334 3933381 3531437 3170541 2879829 2648490
11077B648490j29262n9036m2764k192Q0265P7978O139O1795K24688L97459N54522
11066C818082O88934O46557N42004M07270L66673K42730L9653k98754m63069n75283
11056E414797p05715q04260p42869n67364l12831k43563j49305j30996j43749
11047A614145r3357o7003N139J12423M1291J03832K08142J71205K43296K31338
11037B570451K19188L81740N57406P67303Q06707Q50310R16860R10243P60497
11028H740705L95016P0232j18155l18338p32873j044482r62039p97519q63332
11019D369215q96541o87450m97078l42270k33443j86562j77809j04739k2754k6076
11009A194493l216P9405M9287L7791P1767J11088K13737K36017L24346M11897
$$ plain form
11077 2648490 2519228 2460192 2417428 2415236 2495501 2573479 2579618 2641413 2866101 3263560 3818082
11066 3818082 4507016 5153573 5695577 6102847 6469520 6712250 6751903 6453149 5990080 5414797
11056 5414797 4709082 3904822 3161953 2594589 2281758 2038195 1888890 1757894 1614145
11047 1614145 1520788 1453785 1458924 1571347 1612638 1716470 1924612 2095817 2339113 2570451
11037 2570451 2789639 3171379 3728785 4496088 5302795 6153105 7069965 7980208 8740705
11028 8740705 9135721 9205953 9087798 8769460 8036587 6992105 6030066 5232547 4369215
11019 4369215 3472674 2785224 2288146 1945876 1712433 1525871 1348062 1243323 1220569 1194493
11009 1194493 1191277 1270682 1319969 1357760 1429527 1540615 1754352 1990369 2314715 2726612
10999B726612N15037N64389M32527L02207L12338J39432j55842l19860m40059
10990D076781n81153o72237n95702m49169l30187k79380j82427l9129J1497j1504
10980I47390r016j4711o1747j36474r3335n4504j17182m3374l808K6578j3493
10969D26324o1158n1592j6243J4911N1494q736n0287J3638N130p0358p3446J5303
10957A94980j828j9574N8314n5496O452j1174L227K8008m9895J7782N6991J7430
10945B45217M2797k9009L8844m0763j9968k8686L121K8917j6169j2050l3809j9253
10933A59189L3180j5617m2993j6187k1677J4455L9050L7985q068p9658K790O6504
10921A68953P807n8765k4730J6996M7788r249r1160m0417J00342N9950j9184m9061
$$ plain form
10999 2726612 3241649 3806038 4238565 4540772 4853110 4992542 4836700 4516840 4076781
10990 4076781 3495628 2823391 2227689 1778520 1448333 1168953 986526 947397 958894 947390
10980 947390 938374 923663 861916 725442 632107 577603 460421 417047 413239 439817 426324
10969 426324 365166 313574 297331 312242 363736 355000 304713 318351 323481 253123 179677 194980
10957 194980 193152 173578 231892 176396 182848 171674 174901 202909 153014 170796 227787 245217
10945 245217 288014 259005 297849 257086 237118 208432 211553 240470 224301 212251 178442 159189
10933 159189 192369 176752 133759 117572 95895 110350 149400 187385 179317 99659 102449 168953
10921 168953 176760 117995 93265 110261 158049 148800 57640 17223 117565 177515 158331 109270
10909A09270k3488P8282O5324P6652O7551l3326j26329r7144l0111j11758j4626
10898c9703K417j7446R8263R8006L676m8990K437j4980k1206K7956j0342l1891
10886D8197M663r893M4840J1664M4258P825n7109l5493K112l1945m7004J7343
10874e42l9386l3099J03540M2761l9809o334K7317M645Q7632L0579j540M1665
10862B17429J2458N2862j8235n0974j05140n5488P2399O1440M9203k4813l1736
10851A79405m0513M9168o419l4369o7717m8262j5562O0047P6319l9540k2388k7453
10839F2716J8192N5451k4128r4841L1240M8342j9341J9550J3582q8987n9837J7899
10827b0162o5789j9867J3985P0796L2081K0767M0107o0781j7894M9514k5963l3476
$$ plain form
10909 109270 85782 164064 229388 306040 373591 340265 213936 116792 86681 -25077 -39703
10898 -39703 -37286 -54732 43531 141537 145213 96223 98660 83680 62474 90430 80088 48197
10886 48197 52860 42967 87807 99471 143729 151554 94445 58952 61064 29119 -17885 -542
10874 -542 -39928 -73027 30513 73274 33465 27131 54448 59093 146725 177304 175764 217429
10862 217429 229887 282749 264514 213540 108400 52912 125311 186751 235954 211141 179405
10851 179405 138892 188060 181641 147272 79555 31293 15731 75778 152097 112557 90169 62716
10839 62716 80908 136359 112231 17390 48630 96972 77631 97181 110763 21776 -38061 -20162
10827 -20162 -85951 -105818 -91833 -21037 11044 31811 71918 11137 -6757 42757 16794 -16682
10815a6682L0293M6802L2713l2298N9216J8624l1652m0715K2394L2117n2018j204
10803F7590J464m3326L6543J9456K6582P807M9733j5842p0095p409N551L2542
10791A10596N4272R113l5828M3139K3380P155l7368m0203p552N3206k1923K8522
10779A86509K1861r626Q0367P0443n0044j9091m1227o1088o0354l2036L7220j5857
10767A07077J4032L5704p0094o3104L1039Q1826J6407K3837k8066n7370J3932
10756A05220J5617j8306M0499Q1677N5516j2902N1729O7506l5009J4505j3708
10745C52344K7532M9363O9974j733n7462r2976q7646p531O0523L3761o2769m1409
10733B41971o7861m2793m7717p124L8570m4132k728l441k5687J4608K6451m3738
$$ plain form
10815 -16682 13611 60413 93126 60828 120044 138668 107016 66301 88695 120812 68794 67590
10803 67590 69054 25728 62271 81727 108309 116116 165849 150007 79912 72503 78054 110596
10791 110596 164868 173981 138153 181292 204672 211827 174459 134256 126704 179910 157987 186509
10779 186509 208370 198744 279111 349554 299510 280419 239192 178104 117750 85714 122934 107077
10767 107077 121109 156813 86719 23615 54654 136480 152887 176724 148658 91288 105220
10756 105220 120837 102531 143030 224707 280223 267321 319050 386556 351547 366052 352344
10745 352344 379876 429239 499213 497480 440018 347042 259396 251865 312388 346149 283380 241971
10733 241971 174110 131317 83600 76476 115046 70914 68186 64745 39058 53666 80117 36379
10721C6379n315P3912O4245L5045O1466n890J6062O0076m589O4923K6743J6701
10709D39758j2223n6590m2749K9402q246n1515o2790m2955n8436J0066J0569l4509
10697A19782k0781J5667l3650n5189N1013N1173J6521j6057l9861l159k5083o268
10685E4108M0675N7841l649K7909L3134L1013Q522k1955M230m5029j04380k0320
10673F2099M0412M4432o3618m4435L1866P3140O6140J02209O5829L4554p284L4051
10661D39395L0685o034N4988M5777k771J670l0582j19591q3156J04396m9588o7663
10649C17526P5557K10785K39106J58815l0746j06434j27295j66321o9903L7543
10639E38633J41611J79070J16715j54742k57212j61633m8591n1652j54199n9177
$$ plain form
10721 36379 31064 104976 169221 204266 265732 259842 275904 335980 331391 396314 423057 439758
10709 439758 427535 370945 328196 357598 349352 297837 235047 192092 133656 143722 154291 119782
10697 119782 99001 114668 81018 25829 76842 128015 144536 128479 88618 85459 60376 54108
10685 54108 94783 152624 148975 176884 210018 241031 249553 227598 231828 186799 82419 62099
10673 62099 102511 146943 83325 38890 70756 143896 210036 312245 378074 412628 405344 439395
10661 439395 470080 464046 519034 564811 562040 563710 533128 413537 330381 434777 385189 317526
10649 317526 393083 603868 842974 1001789 971043 864609 737314 570993 501090 538633
10639 538633 680244 859314 976029 821287 564075 402442 353851 302199 148000 88823
10629H8823K5120J4336L9968Q80l5972l3177o5708j2701n361l7109J9951m7648
10617d8598J315J04456L7200l3684o6686p076J5871J13039Q2710q24m3111q9806
10605F4806M5056l1208p9328J9778L6316o5107n3533J2730M4913M8361j3256J353
10593C0881N8494L9729K3608J2447j10343r6647n4342P5267P7056m0170j8905
10582b925L7067K1033l6004J8497J8013m2368r700N7342j1447k6841Q874j9676
10570A1865l2890N2619O0691j9532K3131n1023o9406n2213J5048o436o675j2672
10558h7493k0546M1210L7005P677P6842m4889N173k6466k6908m0097P3078K8701
10546B3287O013m8173J1577m439k4495k7835o2553j3875Q5426P1372q1759N0225
$$ plain form
10629 88823 113943 128279 168247 169127 133155 99978 34270 21569 16208 -20901 -950 -48598
10617 -48598 -47283 57173 94373 60689 -5997 -13073 2798 115837 198547 197723 154612 64806
10605 64806 109862 78654 -674 19104 55420 -9687 -63220 -50490 -5577 42784 29528 30881
10593 30881 89375 129104 152712 165159 54816 -41831 -96173 -20906 56150 15980 -2925
10582 -2925 34142 55175 19171 37668 55681 13313 3613 60955 49508 22667 31541 11865
10570 11865 -21025 31594 92285 72753 95884 44861 -24545 -76758 -61710 -68146 -74821 -87493
10558 -87493 -108039 -66829 -29824 -22147 54695 9806 14979 -11487 -38395 -78492 -5414 23287
10546 23287 29300 -18873 -7296 -11735 -36230 -64065 -126618 -140493 -55067 16305 -65454 -15229
10534a5229Q9881J2549m1077l0263k0850O5781j5545o0806j00685M4308K8751
10523d3185k3549K1972o499L4130k734R365J0705J3418P2065K2618k3482o5900
10511A8924J761N1899O549L9909K5911K0270j5064r1695l2975R0627n6522p4163
10499a4569k1614l3798m9879j268O6953O3132n2882K8034K0456l5987K80J3903
10487a7239L5110j3956L6201K089p4160Q425L2014l7440r4880L4273O7411J03245
10475H1093k8203m4710N3052L5133L0999k8856k5600k6951l0109J9574l0893m018
10463E11K0395j4184n6273O632J0410n2443q602J9276J29935j1415m1941o345
10451d044q885M779J7902O3760M2492k4695Q585r837r936p523L7353l4907r7387
$$ plain form
10534 -15229 74652 87201 46124 15861 -4989 60792 45247 -15559 -116244 -71936 -43185
10523 -43185 -66734 -44762 -51261 -17131 -19865 -10500 205 13623 85688 108306 84824 18924
10511 18924 20685 72584 79133 119042 144953 165223 150159 58464 25489 116116 59594 -14569
10499 -14569 -36183 -69981 -119860 -121128 -54175 8957 -43925 -15891 4565 -31422 -31142 -17239
10487 -17239 17871 3915 40116 42205 -31955 -23530 8484 -28956 -123836 -89563 -22152 81093
10475 81093 52890 8180 61232 96365 127364 98508 72908 45957 15848 35422 4529 511
10463 511 20906 6722 -49551 -42919 -32509 -84952 -93554 -74278 55657 44242 2301 -4044
10451 -4044 -12929 -8150 9752 73512 116004 91309 99894 90057 80121 72598 109951 75044 -22343
10438b2343l6514L192K2665n338L0884L3248J00916K6494j38530o6559M3202j9507
10426b8190J5673J9074J4437m4600q217m7042l6257l020K576N7320L3987j1089
10414c5348M109J0766m079P958n3375k681m688M0186N2364M2342k3056J1853K4396
10401G0747k7541m3887K7742J6743m2266m8637O136K22m483N1827k6782r347m6403
10388g5929R352M5918M5212O2478n8410o9496M7790J8839J2564k6917k8058J021
10376a5636q526M8893k3985L4380m0704n083l491k4732J3432N23l654J5064L0098
10363A6579j1393m377o5567o624M9704k2532M4302Q6149J10599m0104j05581q6411
10351c5256m3225J5633M2158M9393m2946p9808O1728M3074q078L5027J2878L232
$$ plain form
10438 -22343 -58857 -55665 -33000 -38338 -7454 25794 126710 153204 14674 -51885 -8683 -28190
10426 -28190 -12517 6557 20994 -23606 -31823 -78865 -115122 -118142 -115566 -58246 -24259 -35348
10414 -35348 -31239 -20473 -24552 -16594 -69969 -72650 -77338 -37152 15212 57554 34498 46351 70747
10401 70747 43206 -681 27061 43804 1538 -47099 -40963 -40741 -45224 6603 -20179 -29526 -75929
10388 -75929 -66577 -20659 24553 87031 28621 -40875 6915 25754 38318 11401 -16657 -15636
10376 -15636 -24162 24731 746 35126 -5578 -10661 -14152 -38884 -25452 -24929 -28583 -13519 16579
10363 16579 5186 809 -64758 -71382 -21678 -44210 92 86241 196840 156736 51155 -35256
10351 -35256 -78481 -62848 -20690 28703 -14243 -94051 -32323 10751 2673 37700 50578 53810
10339E3810J436l3335m5395M317J3578P5463J8472l8648o3871p7956j47L0771
10327f1505j0038N3653j0641o9788K1614m081j7120J8955O9731L3926M9910K3662
10315I8278l0936o5266L6902O0055q0207O439M6017q947l1001k6249J5988j966
10303A9107K957o3173n0715n0417J15338J16338k8189J4395K3058K5317p545j05664
10291A0807m7068m9775K9093M1916j8988k1867j131L1483k1193P471Q4391K3056
10279F8195m4456R788j2918p0105k2321M150k8580L969l319J1465O475k9558n2131
10266a59346J6436j9970J5626J27054L0128M899o237J7997l693M4446n7935o8666
10254e9261M8280p896n2988L3070K7546m0255n1711P4039L5566O958L541L2760
$$ plain form
10339 53810 55246 21911 -23484 -19167 -5589 69874 88346 49698 -14173 -92129 -92276 -61505
10327 -61505 -71543 -17890 -28531 -98319 -76705 -80786 -97906 -78951 -9220 24706 74616 98278
10315 98278 67342 2076 38978 99033 18826 25265 71282 62335 31334 5085 21073 19107
10303 19107 22064 -41109 -91824 -142241 -26903 89435 61246 75641 98699 124016 116471 10807
10291 10807 -36261 -86036 -56943 -15027 -34015 -55882 -57013 -25530 -46723 -39252 45139 68195
10279 68195 23739 33527 20609 -49496 -71817 -67667 -96247 -92278 -95597 -84132 -77657 -107215 -159346
10266 -159346 -142910 -162880 -147254 -20200 9928 14827 8590 26587 22894 67340 9405 -59261
10254 -59261 -10981 -18877 -71865 -38795 -11249 -51504 -103215 -29176 6390 13348 16889 49649
10242D9649k8376L4219M1854l476k645p741q0263l2914P0917Q8592M1348K648
10230A73812l2321l0629J2318O174L9476n5252o0055p993J1308L2347O562Q844
10218A04591k7759k1948N726J9501l084n7966K700M8062K2865j4028k8651N4919
10206A04928L6411p7785o6326j6205J5129K1756J4529O0839q587J7499M0830j8910
10194A24108j26641l9971j5375L5641k5746n1101o0014l6393J20525N9703o097
10183b1361P226L4549j73l3053k6235K9686M5542n4046j2317L2886o181j9949
10171b3426K0321N7967O4302L717L2647l0577l2803l8086N103j4870J0403l3604
10159B1094n8984k9780J9519j7893J0376L2308L9058n6042j5053k0183O7283Q057
$$ plain form
10242 49649 21273 55492 97346 93870 91225 83484 3221 -29693 41224 129816 171164 173812
10230 173812 141491 110862 123180 129354 168830 113578 53523 45530 56838 89185 95747 104591
10218 104591 76832 54884 60610 80111 77027 19061 21761 69823 92688 78660 50009 104928
10206 104928 141339 63554 -2772 -18977 -3848 17908 32437 93276 84689 102188 143018 124108
10194 124108 -2533 -42504 -57879 -22238 -47984 -99085 -159099 -195492 -74967 -15264 -21361
10183 -21361 -14135 20414 20241 -12812 -39047 -9361 36181 -17865 -30182 2704 -3477 -23426
10171 -23426 -3105 54862 119164 122881 155528 124951 92148 54062 59165 44295 54698 21094
10159 21094 -37890 -67670 -48151 -66044 -55668 -23360 15698 -40344 -55397 -75580 -8297 -240
10147b40j4793M2797N9342L3438M398j4727j8333P7324p141l1112k7432J4027
10135A17548L603l052Q387o436p5226m6526K7552K6154k0573J3487J0226l6276
10123A8868J465m0299j4937K3420J6591j2276j0185K615L6732j9839k819l901
10111d565K5259K8527j6290J5397M482Q920N2280l1706k0838O671m1674n5741
10099b9278J2399p429m20l4279j0160l8819J6851p97K9837J9891l6110K1685O1122
10086D493P884M0294m5197N5111K0049r060M3895L0956o2918k5581m8164k0709
10074h947J4319L5614J6009q727m9317M2543N5453R272l2597k8546k0695k5768
10062a387N3580M2677J13271P6113q2058j14513l8520P314J2491j8280k8271k2258
$$ plain form
10147 -240 -15033 27764 87106 120544 124942 110215 91882 169206 162065 130953 103521 117548
10135 117548 121151 118099 126486 120050 44824 -1702 25850 52004 31431 44918 55144 18868
10123 18868 20333 -19966 -34903 -11483 5108 -7168 -17353 -14738 21994 2155 -664 -4565
10111 -4565 20694 49221 32931 48328 52810 61730 114010 82304 61466 68137 26463 -29278
10099 -29278 -16879 -24308 -24728 -59007 -69167 -107986 -91135 -91932 -62095 -42204 -78314 -56629 4493
10086 4493 12377 52671 7474 62585 82634 73574 117469 148425 85507 59926 11762 -8947
10074 -8947 5372 40986 56995 48268 -1049 41494 96947 106219 73622 45076 24381 -1387
10062 -1387 52193 94870 208141 284254 202196 87683 49163 56477 68968 50688 22417 159
10050A59M1581K7413m5970q394M2582J927k8441L751O5336k112p7359k8227L0912
10037B3158M6718J7650m1990l5206k7830L2381L7859n1153m3150j4926q1585O1912
10025g6162M2712m1052M8757R3939n8496q0655k5069L854N9472P0683j1017m6902
10013a9936m1619L4334J4906o0161O523l893o099N6269J6366M7725J7846l9943
10001B2318m189k856j9433j2705R4365k3783m3589M1345o4360n3271K0849K6712
9989a8597m1928j1390K5534J3991j2788J9855K2269RJ9091J4543p190l4127q6494
9976i7222l510j9617P0763N1948J2086p416m0666l5030l7439J22272M3474m2652
9964A6991m3882N2517M2919K8894j8111J5532n8484n5855j1826M3607N32K2734
$$ plain form
10050 159 41740 69153 23183 14789 57371 59298 30857 34608 99944 97832 20473 -7754 23158
10037 23158 69876 87526 45536 10330 -17500 14881 52740 1587 -41563 -56489 -138074 -76162
10025 -76162 -33450 -74502 -25745 68194 9698 -70957 -96026 -92172 -32700 37983 26966 -19936
10013 -19936 -61555 -27221 -12315 -72476 -65953 -69846 -75945 -19676 -3310 44415 62261 22318
10001 22318 18129 15273 -4160 -16865 77500 53717 10128 51473 -12887 -66158 -45309 -18597
9989 -18597 -60525 -71915 -46381 -32390 -45178 -25323 -3054 -3045 16046 30589 23399 -10728 -97222
9976 -97222 -100732 -120349 -49586 2362 14448 7032 -33634 -68664 -106103 16169 59643 16991
9964 16991 -26891 25626 68545 97439 79328 94860 36376 -19479 -31305 12302 12834 35568
9952C5568o197l2736m1579n0560R178Q6820O8598L5887n0298K7085O1655m9166
9940I4255q475K9743k0779K6318Q7712j1742n0352m0017n3573K1161K0748K596
9928I7595q571m8513l3881j7136K9379L5420p2902l7370J0145j2016J9148l377
9916d2079N3307p33k0546L5557l6396l673M2855L980M227L0970N2179M9136k5825
9903A42959o2436n3972L5341O8858M7407N9972k6212j58155l6160J8952J3647
9892E0201L3719Q124j4428j1173k5195m4485k5459L6157j0819J5746l04j8675
9880f591O7706L1804M3626J1364p93K532j4958m4111j9887O4888L5172k2592n9492
9867H8668o9448M2325m4965k1216R5844J43758J53200L29490M82057P52118J006502
$$ plain form
9952 35568 29371 -3365 -44944 -95504 -86326 494 69092 104979 54681 81766 143421 94255
9940 94255 85780 115523 94744 121062 208774 197032 146680 106663 53090 74251 94999 97595
9928 97595 89024 40511 6630 -10506 18873 54293 -18609 -55979 -45834 -57850 -38702 -42079
9916 -42079 11228 10495 -10051 25506 -10890 -14563 28292 32272 36499 67469 119648 168784 142959
9903 142959 80523 26551 61892 130750 178157 238129 211917 53762 17602 36554 50201
9892 50201 83920 92044 77616 66443 41248 -3237 -28696 7461 -3358 12388 12084 -6591
9880 -6591 61115 92919 136545 147909 147116 149648 134690 90579 70692 135580 170752 148160 88668
9867 88668 19220 61545 16580 -4636 91208 234966 388166 717656 1199713 1951831 2958333
9856B958333Q51935J04031p85672j005684p48644m44231k72749j19105j57964
9847C80250o7215k5420p5256k8295L3361q0849O722j3307k6619j321m4303O1421
9835A19169J6852j1127q231q192k7899r3300O921P0457O9440m8873n7108L0722
9823E8831P3401K3837l246n291m7394L7256K4704J6860l0495n9377M5014m9687
9811H4413n0760O1763L1489m0880j7295M5752m7252q628Q2077j7591L798K1489
9799A48375l2472o042L4378j3404j5854L890K3743K5625l4184l3645p2046P349
9787C5713L4293j0348l4030J848j9314N6891k2973J512J3788L9638j6745J4745
9775I5018k9896r1093j2848M2006R3433o347m4283l7986p303Q5910J4237j7602
$$ plain form
9856 2958333 3810268 3914299 3128627 2122943 1374299 930068 657319 538214 380250
9847 380250 313035 287615 212359 184064 217425 136576 143298 129991 103372 102051 57748 119169
9835 119169 136021 124894 116663 108471 80572 -12728 -5807 64650 134090 85217 28109 58831
9823 58831 132232 156069 152823 147532 100138 137394 162098 178958 148463 89086 134100 84413
9811 84413 33653 95416 126905 86025 68730 114482 67230 58602 140679 123088 126886 148375
9799 148375 115903 109861 144239 130835 114981 118871 142614 168239 134055 100410 28364 35713
9787 35713 70006 59658 25628 27476 8162 65053 42080 43592 57380 97018 80273 95018
9775 95018 65122 -25971 -38819 3187 96620 90273 45990 8004 701 86611 100848 83246
9763H3246j5969J8807j364J0499L2864K3664J5835l7455N334M6527l9120r5719
9751D7149j7991n0023k9457K2619Q8777J4669M9855j3128k3221N7729P711n5960
9739I8729o7861p910j2364q298L6868K5164J3390J610l3811p4116j720M6692L6332
9726E2705P5919j2263l7714n5265n554j0213K5926j1713J7359L4786j5307p672
9714E0994J7948m656j1936m0748N6691P4531n367l3325J7251M0284k1341j2063
9702A28263p319L6863n3711l2460j1956J3797K0574J8166j1148K3559M1971q3109
9690H3490j9363l5519q3073J9518M3748L0294k8967J5456k4110O123K8301Q4455
9678A20353K832m7080N1951K6120j13142L1252N0300J4866O018n0440K4013O6489
$$ plain form
9763 83246 67277 86084 84720 95219 128083 151747 167582 130127 135461 181988 142868 47149
9751 47149 29158 -20865 -50322 -27703 61074 75743 125598 112470 89249 146978 154689 98729
9739 98729 30868 22958 10594 2296 39164 64328 77718 79328 45517 -28599 -30319 16373 52705
9726 52705 128624 116361 78647 23382 17828 7615 33541 21828 39187 73973 58666 50994
9714 50994 68942 64286 52350 11602 68293 142824 137457 104132 121383 161667 140326 128263
9702 128263 120944 157807 104096 71636 59680 73477 94051 112217 101069 124628 166599 83490
9690 83490 64127 28608 -54465 -34947 8801 39095 10128 25584 1474 7597 35898 120353
9678 120353 123185 76105 128056 154176 41034 72286 122586 137452 143470 93030 117043 183532
9666A83532Q3781J0563k4381N5838L6433L7139J9017M1064k7490o8750L8888P3344
9654D58978J24960N4738J52802K91189L73261M32128N32290L45840J57846m651
9644B919381k59651m55219n19471l94088l17111j74899j03152j15538j33969l7371
9634D08912j1333m1453L0593K2183l2989k0172k2229q9583l4503j2011l28l0571
9622A66516j8728R8371J02155J1222n6521n7338J4384k4267K1171o2841K9352
9611B23476k6213j07971n7164o2643M6133P6790L8772K3654N1680L9861l2511
9600B13864k0316l5347k8644p0912j1657k4454J2127j0461j1535K4023M7839O6597
9588A51124j3617k4737K9198M1629k3788q6561q7380M2914PL1730P6951p165L8143
$$ plain form
9666 183532 267313 277876 253495 309333 345766 382905 401922 442986 415496 346746 385634 458978
9654 458978 583938 638676 791478 1082667 1455928 1888056 2420346 2766186 2924032 2919381
9644 2919381 2659730 2204511 1685040 1290952 973841 798942 695790 580252 446283 408912
9634 408912 397579 356126 386719 408902 375913 355741 333512 243929 209426 197415 197087 166516
9622 166516 147788 246159 348314 359536 303015 245677 260061 235794 256965 194124 223476
9611 223476 197263 89292 32128 -30515 15618 92408 131180 154834 206514 246375 213864
9600 213864 193548 158201 129557 58645 46988 22534 34661 24200 12665 36688 84527 151124
9588 151124 137507 112770 141968 183597 159809 73248 -14132 28782 28789 60519 137470 130305 168448
9575A68448M816o2075K780N5520o863O5760K0913L3780n2007m3337k5599L2540
9563A94676J0680l4205o8089K042o817R2534L5535J8250p7317m8310K9293O294
9551A54566n3693M3115P6962k593m2134R907Q837N3366l2690L223L2218j8384
9539B32700L573M6012l2534M0945j0097o0902j5908q6211K2549J9818J7285J0231
9527A87461k8877O3598m5538o2401n709Q897J6198j7265L0502k5228Q0391N1949
9515B53978l5248k5774l905L1060M405p548o6330N4959Q5317P7079j2671J7316
9503C72638K3721p497O3892P6452m20R170M2547N1391k3152o5872o3595j05306
9491C73969l3368J9863o6318J5621N1110k9243r878k9475J968M2082M1480j2130
$$ plain form
9575 168448 173264 111189 113969 169489 162626 228386 249299 283079 231072 187735 162136 194676
9563 194676 205356 171151 103062 105104 98287 190821 226356 244606 167289 118979 148272 154566
9551 154566 100873 143988 220950 218357 176223 186130 194967 248333 215643 218866 251084 232700
9539 232700 236273 282285 249751 290696 280599 219697 203789 117578 140127 159945 177230 187461
9527 187461 158584 222182 176644 114243 108534 117431 133629 116364 146866 121638 202029 253978
9515 253978 218730 192956 189051 220111 224516 216968 150638 205597 290914 367993 355322 372638
9503 372638 396359 388862 452754 529206 528786 537956 580503 631894 608742 542870 479275 373969
9491 373969 340601 360464 294146 309767 360877 331634 321756 292281 294249 336331 377811 365681
9479C65681R060Q316o381m7249m6594R9J6121O0564N2573j30372p1827J4341N6660
9466B80992J23890P3704l233n447n0950J7063J1803l2648n7859j7520J9045k598
9454C56242K3809j6279m5856n1477p842J6267M0071P3533P1103l1278q6782n3089
9442B88422M0174M3027q0564p1997l3439O1200N8417J8064k2731N5218K1289j5974
9430C61106o0633M8011j2178k0280L8447o1422J2764o430o1916l6388l8591J1243
9418A73733J47M7462O4397N5635K6669O1047j4984j6395L0851K0094k1121N968
9406D33503M522k5338M4557k3236R0958P4800P747l1328J2279m8148r994J6306
9394E46628K1214p567m2394m0301o4766Q614P8172K8643n064K7106L8641K9660
$$ plain form
9479 365681 374741 383057 376676 329427 282833 282932 299053 359617 412190 281818 209991 224332 280992
9466 280992 404882 478586 475353 469906 418956 436019 447822 415174 357315 339795 358840 356242
9454 356242 380051 363772 317916 266439 258597 274864 314935 388468 459571 428293 341511 288422
9442 288422 328596 371623 291059 219062 185623 246823 305240 323304 300573 355791 377080 361106
9430 361106 300473 348484 336306 316026 354473 293051 305815 299385 237469 201081 162490 173733
9418 173733 173880 221342 285739 341374 368043 429090 414106 397711 428562 448656 427535 433503
9406 433503 438025 412687 457244 434008 524966 599766 607513 576185 588464 540316 530322 546628
9394 546628 567842 560275 517881 477580 412814 421428 499600 528243 523179 550285 588926 618586
9382F18586J04594P9080J7153q6419l8653J9253R9667K0863n2144L9251M3003
9371H64234p015j37758j91179j09334m6594l7217l2099J9468N8901N6211j3065
9360D24553j8995k0795P0681L551L2772K9769P5556M3566J6551j4805M0428M5212
9348G28044O5973L4064p273p3780l2683m6885J6632P5310R9207j5439p7398J5365
9336G81137K3755N405K720J7155J9436l2879l1362o9804k6945N6917M0754J8864
9324H05153J5179Q7361J20056P6516k8107n570J1304N4863L594k3187K7562M5906
9312A190630K8485J1971j4497K5579m764J869Q3533L6648K8552M1977N588M8330
9300A483901J12980N480k5440M3128L8890N2226P5736P2600m524p196J08408J46222
$$ plain form
9382 618586 723180 802260 819413 732994 694341 713594 813261 834124 781980 821231 864234
9371 864234 857219 719461 528282 418948 372354 335137 303038 322506 381407 437618 424553
9360 424553 405558 384763 455444 458995 491767 521536 597092 640658 657209 642404 682832 728044
9348 728044 794017 828081 820808 747028 714345 667460 684092 759402 858609 843170 765772 781137
9336 781137 804892 810297 813017 830172 849608 816729 785367 715563 688618 745535 786289 805153
9324 805153 820332 907693 1027749 1104265 1076158 1070588 1081892 1136755 1140349 1117162 1144724 1190630
9312 1190630 1219115 1231086 1216589 1242168 1237404 1239273 1322806 1359454 1388006 1429983 1435571 1483901
9300 1483901 1596881 1602361 1576921 1620049 1658939 1711165 1786901 1859501 1854977 1847781 1956189 2102411
9288B102411J51905J49624M2641M8903J35973J35624J11238K42234K88088K70231
9278C678872K77395K52080L33408M09070M04313L59546M40965M88254N16329O45270
9268G805502P86438R44606J135582J324451J571308J974664K281764K538541K893890
9259B3256746L286129L770309M169385M457398N033264O362824Q943830J3304447
9251G2584332K0178495L0698064M6339837O8061914R2956696J08925263R7619781
9244E37364382N3825532n465464o1529041r9274937j05782509q7348618o2258410
9237A69530935m1816549k7792597j8687923j2852408r241122p010373n927636
9230D6202327n300384m920755m540847m112199l537752k935459k440365j962835
$$ plain form
9288 2102411 2254316 2403940 2446581 2495484 2631457 2767081 2878319 3120553 3408641 3678872
9278 3678872 3956267 4208347 4541755 4950825 5355138 5714684 6155649 6643903 7160232 7805502
9268 7805502 8591940 9536546 10672128 11996579 13567887 15542551 17824315 20362856 23256746
9259 23256746 26542875 30313184 34482569 38939967 43973231 50336055 59279885 72584332
9251 72584332 92762827 123460891 169800728 237862642 330819338 439744601 537364382
9244 537364382 591189914 585724450 524195409 424920472 319137963 231789345 169530935
9237 169530935 127714386 99921789 81233866 68381458 59140336 52129963 46202327
9230 46202327 40901943 35981188 31440341 27328142 23790390 20854931 18414566 16451731
9222A6451731j641146j281555j072339q63059o36639p20209o99491n28390m34912
9213H573991n11747l78328k87420k77356k39706j90361l27060k72159j83547k51472
9203E654835k37188j54930j43452j82133j56111j17828q7230j07193j23101j02939
9193D242730j15087o9156r2570p1681p0499o5156m1554p6305j19479j16443l5356
9182C369444p3968j5549J8019R012m1470o9955m7605p9820j00016j10051o2425
9171B795616L0744m6078n0888j04654j6476L0764k6148m9891j0454l9443p205
9160B505887L3747k9495j3460m9426m1897k2885J098K0081L3010j1831r3299J1467
9148B342997K5083j337k1390q6703k3131j7733k9352l0203o0762K4282N9421J79
$$ plain form
9222 16451731 14810585 13529030 12456691 11593632 10956993 10236784 9537293 9008903 8573991
9213 8573991 8062244 7683916 7396496 7119140 6879434 6689073 6362013 6089854 5906307 5654835
9203 5654835 5417647 5262717 5119265 4937132 4781021 4663193 4575963 4468770 4345669 4242730
9193 4242730 4127643 4058487 3965917 3894236 3823737 3758581 3717027 3640722 3521243 3404800 3369444
9182 3369444 3295476 3279927 3297946 3306958 3265488 3195533 3147928 3068108 2968092 2858041 2795616
9171 2795616 2826360 2780282 2729394 2624740 2608264 2639028 2612880 2562989 2552535 2513092 2505887
9160 2505887 2539634 2510139 2496679 2447253 2405356 2382471 2383569 2403650 2436660 2424829 2331530 2342997
9148 2342997 2368080 2366743 2345353 2258650 2235519 2217786 2188434 2158231 2097469 2121751 2181172 2181351
9136B181351n1591k2908K2713M247N0400J7020j6212J5735J0313J5303P7492P1373
9124B375236k7038k4549O4683J09945M6977J4502m0410n7347q5931j37451j64317
9113B074300r4758m5800o1117o0186o8903p606O6858K3294K1985j7108L2221L3450
9101A896630p7189m189l825k716L9805O36l4948j5919L3949k4841o5925l6680
9089A704788Q5400J29290J88846K23920J42936J69971P5149l9032j63729j62906
9079B354633j35850j69924k19894o1919o9391m2942o5613k6382n2506m4087M544
9068A470669L4316J202l9332J103o267j6019o6839p3661Q3543p626n8038l3019
9056A290032J267L2754O6116K9524l1215j3622l9394q2118m7681k5138m696N7147
$$ plain form
9136 2181351 2129760 2106852 2129565 2133812 2184212 2201232 2185020 2200755 2211068 2226371 2303863 2375236
9124 2375236 2348198 2323649 2388332 2498277 2545254 2559756 2519346 2461999 2376068 2238617 2074300
9113 2074300 1979542 1933742 1872625 1812439 1743536 1735930 1802788 1826082 1848067 1830959 1863180 1896630
9101 1896630 1819441 1815252 1811427 1808711 1848516 1849152 1814204 1798285 1832234 1807393 1741468 1704788
9089 1704788 1790188 1919478 2108324 2332244 2475180 2645151 2720300 2681268 2517539 2354633
9079 2354633 2218783 2048859 1828965 1767046 1697655 1654713 1589100 1562718 1510212 1466125 1470669
9068 1470669 1504985 1506187 1466855 1467958 1461691 1445672 1378833 1305172 1388715 1381089 1323051 1290032
9056 1290032 1291299 1324053 1390169 1419693 1388478 1374856 1335462 1253344 1205663 1180525 1175829 1232976
9044A232976M8928K6433M707j8146l7036p6867j8516N9773l2704o9982M618j53
9032A124031L224p2364O598J0949J5195o399p13O8708j1447q7313m1840j0650
9020I97979l627m3607O3534n1735q5362J9366J2260J9582P5663L8317k3528k3290
9008I95552P285l1980j489L8295k4851j5040K935k2332K3239l2080n8532j1670
8996H69332L6214O0005J7353O9195N6410n1496k1167r4950k3974J8043J7480n661
8984I46784l4333m4595l3833j6813r058l1415j5680j8454k8412O066R5434O1376
8972H77067j1925l7846m1774K6740l0440n5213K8111M4785l0517p6750l06P28
8960F92660Q5590J5325n5353r3752k2038J23310N097J484K9683l996J8758P471
$$ plain form
9044 1232976 1281904 1308337 1313044 1294898 1257862 1180995 1162479 1222252 1189548 1119566 1124184 1124031
9032 1124031 1127255 1054891 1061489 1072438 1087633 1081234 1080521 1149229 1137782 1050469 1008629 997979
9020 997979 994352 950745 1014279 962544 877182 896548 908808 928390 1004053 1042370 1018842 995552
9008 995552 1002837 970857 969368 1007663 982812 967772 970707 948375 971614 939534 881002 869332
8996 869332 905546 965551 982904 1052099 1108509 1057013 1035846 940896 916922 934965 952445 946784
8984 946784 912451 867856 834023 817210 808152 776737 761057 742603 714191 720257 815691 877067
8972 877067 865142 827296 785522 812262 781822 726609 754720 799505 768988 692238 691932 692660
8960 692660 778250 793575 738222 644470 622432 745742 750839 752323 782006 778010 796768 804239
8948H04239q0070r051R4m7901l2965m4120J5243J8039o479m4125P774L7109M840
8935F22627J9824l3228k5206n1735k9359M4578M8609k9991M3067l914n155K6663
8923F26780L6419J2729l7841j7431L5452Q568m2703j3031q81o5569R489p439l2758
8910E11784n9869K7194N453l9388l551N4526J00741n6235r5399q973J9501M6842
8898E02626j202M4652N8365N2762n0602n7191p0011n9093K5433q536L8717Q5865
8886E61785j0651k0924p938o5619m6437n5839j0108O9321n671J2627N0790J6957
8874D88293j1604o2349j0828J7336j0922M1987k2533N1119M5593K8387k4659R502
8862E39322r896n903j9365l601k8030l1090K0972L287R334Q084j4536m6301P8359
$$ plain form
8948 804239 724169 715118 715212 667311 634346 590226 605469 623508 617029 572904 580678 617787 622627
8935 622627 642451 609223 584017 532282 502923 547501 596110 566119 609186 605272 600117 626780
8923 626780 663199 675928 638087 620656 656108 664676 621973 608942 608061 542492 551981 544542 511784
8910 511784 451915 479109 484562 445174 441623 496149 596890 540655 445256 436283 455784 502626
8898 502626 501424 546076 604441 657203 606601 549410 479399 420306 445739 437203 475920 561785
8886 561785 551134 530210 522272 456653 410216 354377 344269 413590 407919 420546 471336 488293
8874 488293 476689 414340 403512 420848 409926 451913 429380 480499 526092 554479 529820 539322
8862 539322 529426 523523 504158 500557 472527 441437 462409 465696 475030 483114 468578 422277 500636
8849E00636J02478J4297J2339O9135J42993J22768R7163J77546K04212K94925
8839A738492M30207N20592M13602J52640n4326k45374m47577m81989m51916l73266
8829A201085k29054p2844k7786o2673o8585o7954n2374n9976J604L5322m4423
8818E52342p6189j08713p3612M1279K1610Q4814l2882m0354J844N9193M6728n5724
8806D20336O08j39L2087k5734j3815p816k1782k7074p9200M839J5191J7263q896
8793C05868J735J6590l1872j9555K6616l1957N0892K9500k4151l0419R072N8084
8781C60403L3244J1683l2822Q0941M499k1945p0569k9136k4259n0504K3297j6393
8769B68439J5149M3076J8831k5316k2506P401M6491k6758q5329k570j828J8882
$$ plain form
8849 500636 603114 617411 629750 698885 841878 964646 1061809 1239355 1443567 1738492
8839 1738492 2168699 2689291 3102893 3255533 3201207 2955833 2508256 2026267 1574351 1201085
8829 1201085 972031 899187 871401 808728 740143 672189 619815 559839 561443 596765 552342
8818 552342 476153 367440 293828 335107 356717 441531 408649 368295 370139 429332 476060 420336
8806 420336 420944 420805 452892 427158 413343 405527 383745 356671 277471 282310 297501 314764 305868
8793 305868 307603 324193 292321 272766 299382 267425 318317 347817 323666 293247 302319 360403
8781 360403 393647 405330 372508 453449 457948 436003 365434 336298 312039 261535 284832 268439
8769 268439 283588 326664 345495 320179 297673 305074 351565 324807 239478 236908 235080 253962
8757B53962j0591n3337P8440N0257O167P2254o3759j6171n8428j9232L9040M8303
8745C26905j5172J82n5014l9475m1866N1021L6762Q21n0096J586O2397J1155N714
8732B94920q791l1232k7751M3887J5209l9236o8543n0195Q1549J07182l2361q8857
8720A95781l1808o080K2441N7571K3399k4577J8188J9072k8760l7210q743L3506
8708B32780k048q934J1848R540m3086q1911k1820l009l463J3359N9508O4725q208
8695B19281M4889L9328q143j09209n018L3352P181N9593L257o0811j8465L6165
8683B41400l2864l9355K518K8960K2437j2410M7137J3254L0190k9774m4978M7997
8671B74512L421j2793P689l8600r356N689r267R716K1937m252o6288l9790O2240
$$ plain form
8757 253962 243371 190034 268474 318731 324898 397152 333393 317222 258794 239562 278602 326905
8745 326905 311733 311915 256901 217426 175560 226581 263343 264164 214068 215654 278051 289206 294920
8732 294920 286129 254897 227146 271033 286242 247006 178463 128268 209817 316999 284638 195781
8720 195781 163973 157893 180334 237905 261304 236727 254915 273987 245227 208017 199274 232780
8708 232780 230732 221798 233646 243186 200100 118189 96369 93360 89897 103256 162764 227489 219281
8695 219281 264170 303498 295355 186146 181128 214480 221661 281254 284511 223700 205235 241400
8683 241400 208536 169181 171699 200659 223096 210686 257823 271077 301267 271493 226515 274512
8671 274512 277933 265140 272829 234229 224873 230562 221295 231011 252948 248696 182408 142618 204858
8658B04858M7928R4966J70505K53544K77086J13664j15984k75666k45887j06370
8648D18644p9045m2626p213j3139l4929k6904K6036L7666j7444J4060k1132l0110
8636B23864l2615M6507M8186L0991O695j9400n118k1640l7110m5399j737l1448
8624A61776o7M4802N469k59J2656K1571P2444R2380O4843M6520n066N2778J26426
8611F96273K42481M97724O29995L48657k95028o36127m30600k51752q6552k2177
8601F92894o3505p1522k6967j4411j12288j13227k6646P462N0641J2156J5388
8590C49975j2027J4389J16545n2126j21875M216L3513j5726k9368K3274r062m2777
8578B58951j7211k1552O4628M3575k2603j1386J00081m6749k4091K5196k8319
$$ plain form
8658 204858 252786 347752 518257 771801 1048887 1162551 1046567 770901 525014 418644
8648 418644 339599 296973 289760 276621 241692 214788 240824 278490 261046 275106 253974 223864
8636 223864 191249 237756 285942 316933 323628 304228 299110 277470 240360 194961 193224 161776
8624 161776 161709 206511 211980 211721 224377 245948 318392 410772 475615 522135 517069 569847 696273
8611 696273 938754 1436478 2066473 2415130 2120102 1483975 1053375 801623 715071 692894
8601 692894 629389 557867 530900 516489 404201 290974 264328 271790 322431 334587 349975
8590 349975 337948 352337 468882 416756 294881 299097 332610 316884 287516 310790 301728 258951
8578 258951 241740 220188 284816 328391 305788 294402 394483 347734 323643 348839 320520
8567C20520M4520J12924J30431K47210K09429l8782k41274k71454p2681r1260
8557C49583j14174n3403r792p3817j3692Q64l1480R094K3642R9596j8932m3988
8545A23501l4898o012J8186p759o0018N7670J18838j254L2358O279n0210q6133
8533A10548j1852M7250J8800r918O5805R850l6996j9370n6354q6950M4547J41579
8521B16939j1024n0902m9395o8166N6043L9425L1467N434m1254n2731n2160L9159
8509F2835O5264j773q480M0120l690q8610L7476R4231m0272l3415K4352M2667
8497A90705j9993p1099m1822l6195J8596r818j1695P3330P0426L4034R922j04075
8485A02316J1115J5774j5520J6819j271m2578j0063L1603K4467p6243k6405O988
$$ plain form
8567 320520 365040 477964 608395 855605 1065034 1026252 784978 513524 440843 349583
8557 349583 235409 182006 172214 98397 84705 85569 54089 63183 86825 186421 167489 123501
8545 123501 88603 82591 100777 93018 33000 90670 209508 208254 240612 246891 196681 110548
8533 110548 98696 145946 164746 154828 220633 230483 193487 174117 117763 30813 75360 216939
8521 216939 205915 155013 105618 37452 93495 132920 164387 169821 128567 75836 23676 62835
8509 62835 128099 126326 117846 157966 154276 65666 103142 197373 157101 123686 148038 190705
8497 190705 170712 99613 57791 21596 40192 30374 18679 92009 162435 196469 206391 102316
8485 102316 113431 129205 113685 130504 129233 86655 76592 108195 132662 56419 30014 37002
8473C7002q539O0323j3539n5798M7935j5390M359M6984O140j5462M1416L1417
8461A66848p9954j16727k5999O0400l911K1614L1052M0568K6738l3097n0512q6197
8449d9177J0633N6467m461N7341O2207p8059J9984j1773P1651K873n0495J9735
8437A06926o3181n815J4547k6381n598P4775j0226K9327K5306p1095n1668j8172
8425a255N8127K0103j6854p2349J1190M4675R6236L0753l4157k2843l6870k6761
8413D9995o8995l1021L4532k519L7247M5752k1332l3664L86k7146j1308M8199
8401B0126O919Q693J14652N5207l8531p1396n2367k3017K3165K1475k3458j3398
8389B8070n6038l752O2209N8290k3612m2172N4126L1327M384L2250J0502l6041
$$ plain form
8473 37002 28463 88786 75247 19449 67384 51994 56353 103337 109477 94015 135431 166848
8461 166848 86894 -29833 -55832 4568 657 22271 53323 93891 120629 87532 37020 -49177
8449 -49177 -38544 17923 13462 70803 133010 54951 74935 63162 134813 137686 87191 106926
8437 106926 43745 37930 52477 26096 20498 95273 85047 114374 139680 68585 16917 -1255
8425 -1255 56872 76975 60121 -12228 -1038 43637 139873 170626 136469 113626 76756 49995
8413 49995 -19000 -50021 -15489 -18008 19239 64991 43659 9995 10381 -16765 -28073 20126
8401 20126 27045 35738 150390 205597 167066 95670 43303 20286 43451 64926 41468 28070
8389 28070 -27968 -31720 30489 88779 65167 22995 77121 108448 112832 145082 155584 119543
8377A19543o1535k1392R2734J9765m2433l2625l3632q079P0554L3577m1154j7589
8365G7734L9579L5032j1519l3378L6539K788j9461o513n470N857M6254J7022l3499
8352A50965o6172p6974n2331P231O0862O3427M6954j7575k8372n8751m561L4975
8340E9678K14n193O9954L1239q0558j05161l4563O2161N8684L7923p3007p5169
8328e3798M0684P2282J06617N1181o6875k0478M226J2063n6676J5115l0127J1709
8316H5923q984J3979p334J1027q2011p9075N699m4144j2343Q8840M6809n6190
8304c7804N1211K4040j342l1581L3998n7813M1030M9675P475m4381L6643M1181
8292A12332k7107j1399O405o7526n3017J387K4670N223J1638l9761N2031K1497
$$ plain form
8377 119543 58008 36616 129350 149115 106682 74057 40425 32346 102900 136477 95323 77734
8365 77734 117313 152345 140826 107448 143987 146775 127314 120801 115331 121188 167442 184464 150965
8352 150965 84793 7819 -44512 -37281 23581 87008 133962 116387 88015 29264 24703 59678
8340 59678 59892 54699 124653 155892 75334 -29827 -64390 -2229 56455 94378 21371 -53798
8328 -53798 -13114 59168 165785 216966 150091 129613 133839 145902 89226 104341 74214 85923
8316 85923 76939 90918 83584 94611 12600 -66475 -60776 -104920 -117263 -28423 18386 -37804
8304 -37804 13407 37447 36105 4524 38522 -19291 21739 71414 78889 34508 71151 112332
8292 112332 85225 73826 80231 12705 -40312 -38925 -14255 -9032 2606 -37155 14876 36373
8280C6373R353N5463l294j1849o0912M266l054K3202L3624L7447J5409o8622K5718
8267I3124J6445n8484k5460M6526M55N366j0011k2152J2212L0211M1622m5777
8255H4077o4871m859j2763K4124q019k3624k6045J5707P0775j4899m392J9206
8243E4417M079r78j7849L0027J334j9042m4470m0903r712O2943N912N9419k7816
8230E7361M244K1491n177r2537m1677P3485N4745K5758p7750o3012J4245Q024
8218b0800L9294l67j3717p442O5465p31K6030n95k274J1959Q59q4829k1908o710
8204a5766l6375L0481k3696j4621L0682L3488N4845o0782j5762O4409J32504N908
8192A85315q2554m6810j8100r27k8002q3331L0270O4475K2578K8449K1767l0173
$$ plain form
8280 36373 45726 101189 97895 86046 25134 29400 26346 49548 83172 120619 136028 67406 93124
8267 93124 109569 51085 25625 72151 72606 77972 67961 45809 58021 88232 129854 84077
8255 84077 19206 14347 1584 25708 17689 -5935 -31980 -16273 54502 39603 35211 54417
8243 54417 58496 57518 39669 69696 71030 51988 7518 -33385 -43097 19846 25758 85177 57361
8230 57361 61605 83096 77919 -14618 -56295 17190 71935 97693 19943 -43069 -28824 -20800
8218 -20800 18494 18127 4410 -3032 62433 61702 87732 87137 84863 96822 97681 12852 -9056 -15766
8204 -15766 -52141 -21660 -45356 -59977 -29295 4193 59038 -1744 -17506 46903 179407 185315
8192 185315 102761 55951 37851 36924 8922 -74409 -44139 20336 42914 71363 93130 62957
8180F2957l7939M6016n8709k0987K20O4304J0575l1333R259o794k3717K1772N405
8167D1029p809l8026o0076r9567M6139J42091k264p9949l4580K3866J03563J210
8155C5627J54k624k0738l3949j3534k2799L0197J3731j9201K3234N100k1138N1986
8142B6046J6565k3426J9455m537k3578K606K2724O2471L9356j4079L1976k650
8130A52929o0698L4694R1961p9570k7987j782k2306l4565l000L397m3994o1722
8118e2643J8332k4580N4127Q3552k2000M5900R193o3783j555n09R431m9214n8009
8105e1758m8202N3368R3875L5625j5299l5779n4020j8181N6699Q754m3314M8609
8093C0377k5626p8660l1442J7115K1285L9299P9530j1978M934N754m9378j0621
$$ plain form
8180 62957 25018 71034 12325 -8662 -8442 55862 66437 35104 44363 37569 13852 35624 41029
8167 41029 33220 -4806 -64882 -164449 -118310 23781 21517 -58432 -93012 -69146 34417 35627
8155 35627 35781 33157 12419 -21530 -35064 -57863 -27666 -13935 -33136 -9902 -4802 -25940 26046
8142 26046 42611 19185 38640 34103 10525 13131 35855 98326 137682 123603 155579 152929
8130 152929 92231 126925 218886 139316 111329 109547 87241 52676 49676 53073 9079 -52643
8118 -52643 -34311 -58891 -4764 78788 56788 102688 111881 48098 46543 46034 55465 6251 -51758
8105 -51758 -99960 -46592 47283 82908 67609 31830 -22190 -40371 16328 25082 -18232 30377
8093 30377 4751 -73909 -105351 -88236 -66951 -27652 51878 39900 44834 50588 1210 -9411
8081i411m0357p2215m277M1859J1211L2155M9989M1055L2066K2266N8669N9035
8069B22045n8926l8869K8268k1436q2199l0600K6047L6883K6048L752m0418n6234
8057A4361q2126N4341K6231q983k5333K4251L7913P1003M741o1329Q3453M1413
8045A79936j535o848m4331j4634r2129o8668q649J2412L0057J26937L9569k0496
8033A31621k3868n7670l0185o8655j5399J2697j6971N1535M2090o3591Q137O1870
8021C1611J3768J5074l9046m4171K310K2722L4121L1133R1279L3494l7672N3589
8009B08212m5981n0567L1295L098j6656p540Q2449j166k9591k5474K4965l9452
7997A33592m9917k465j533o9117l3339K722N2863J6520P786M5209j5083k8N53
$$ plain form
8081 -9411 -49768 -121983 -126260 -84401 -73190 -41035 8954 50009 82075 104341 163010 222045
8069 222045 163119 124250 152518 131082 48883 18283 44330 81213 107261 111013 70595 14361
8057 14361 -67765 -13424 12807 3824 -21509 2742 40655 111658 116399 55070 138523 179936
8045 179936 178401 171553 127222 112588 20459 -48209 -56858 -44446 -14389 112548 152117 131621
8033 131621 107753 50083 19898 -48757 -64156 -51459 -68430 -16895 25195 -38396 -30259 31611
8021 31611 45379 60453 21407 -22764 -20454 2268 36389 67522 158801 192295 154623 208212
8009 208212 162231 111664 142959 146057 129401 121861 204310 203144 173553 148079 173044 133592
7997 133592 83675 81210 79677 10560 -22779 -20057 32806 49326 57112 102321 87238 87210 87763
7984H7763k7225K933l450m0779M829k7659j9135K609o774O8281M6763K120L3603
7971A23879J5991J3064j10367p2534P3008K6799J0009J2310N7041M0314K3687
7960B13201L7409k2336M971M5575M530q6126m8317m0362k9288m61K6959J4292
7948A20047n604n3353o9660J1170O7736K5340k9854L666N2559q478j9103N5764
7936A50230M4089n2244p4953o0647O9206P4594l2241n1638J633N1129M242j6333
7924A07067j3622L8124l5530m2565j4984M2161R010m9663l1033m9756n0956L1847
7912e9900O8520L4734K6474j3683L8297N1893q3892q970Q0796l0908l6652K8203
7900I4912L2000j1637o6518k6124O6428k719m4721J728M5869l0621j3237J5345
$$ plain form
7984 87763 60538 63471 60021 19242 24071 -3588 -22723 -20114 -26888 41393 88156 90276 123879
7971 123879 139870 152934 42567 -29967 43041 69840 79849 92159 149200 189514 213201
7960 213201 250610 228274 233245 278820 283350 197224 148907 108545 79257 78796 105755 120047
7948 120047 114443 61090 -8570 2600 70336 95676 65822 69488 122047 113569 94466 150230
7936 150230 194319 142075 67122 6475 75681 150275 118034 66396 68029 119158 123400 107067
7924 107067 93445 131569 96039 53474 38490 80651 89661 39998 8965 -40791 -91747 -59900
7912 -59900 8620 43354 69828 56145 94442 146335 62443 53473 134269 103361 66709 94912
7900 94912 126912 115275 48757 22633 89061 86342 41621 43349 89218 58597 45360 60705
7888F0705J3177L5961o6329p6847L5018j3060L8381K8042K3033M764k0641k0800
7876D1404r618r008l3532k5106n0599m4605P4544R0818j7666j0420j9138N1848
7864C8922m1228k9963K8617J5160M4879N6859K3070j03141k7831k6444K9189M4037
7852E2126k0767P792P5708l7460q3239M187O194J1034J8138l0570J9847m7417
7840b4427j00137L0041J6197n5346m7020J663M2512K5308J032J3165N6775L4198
7828f039J7483O7878p24K4437k5603m6008k0216p9287J5536M7881k6191o909j389
7815c9151K9464l5041m6928R023O2011m7361o1692L1296J17292K9955K9815L1298
7803A09981p872l4127l3570L4267k5627L0856o5396o3993J07165L9884j1590L8018
$$ plain form
7888 60705 73882 109843 43514 -33333 1685 -11375 27006 55048 78081 82845 62204 41404
7876 41404 31786 22778 -10754 -35860 -86459 -131064 -56520 34298 16632 6212 -12926 38922
7864 38922 -2306 -32269 -3652 11508 56387 113246 136316 33175 5344 -21100 8089 52126
7852 52126 31359 39151 114859 77399 -5840 -1653 4541 15575 33713 3143 22990 -24427
7840 -24427 -124564 -94523 -78326 -133672 -180692 -179029 -136517 -111209 -110177 -97012 -40237 -6039
7828 -6039 11444 79322 78598 103035 77432 31424 11208 -68079 -52543 -4662 -30853 -37762 -39151
7815 -39151 -9687 -44728 -91656 -82633 -20622 -67983 -129675 -98379 18913 48868 78683 109981
7803 109981 102109 67982 34412 68679 43052 73908 8512 -55481 51684 91568 79978 117996
7791A17996p707j15595o3064N7696M0306K1876M8720j5339m1824k6144p5637M616
7779e4100O3053r680m009o017o8184j8389r929L2482M9488K7529J5440N1975K2613
7766I2272m7311j0545l6194l1275j647O4335l7351j8388P2967L69j7967J4722
7754D3987j0861m6890k7334l2696K2839L1741j5909M1135J3889J6526q2462j2515
7742e8550L8846J2479m2451J3376k6504L7748p435l3630k4330R920N8375J7793
7730d363k9851n5772l1844J6374j4885O16j0837O2765J5512m1802K3921P8532
7718H366K8924q4373l0693N4709J888l3996r410N1806l2307K5431K7430q868K7381
7705B6288K33l9377o9108q0581K2581J18580Q417r0587J8525J6005L7438P5617
$$ plain form
7791 117996 110289 -5306 -68370 -10674 29632 51508 100228 84889 43065 16921 -58716 -54100
7779 -54100 8953 -727 -4736 -10753 -78937 -97326 -107255 -74773 -25285 2244 17684 69659 92272
7766 92272 44961 34416 -1778 -33053 -34700 29635 -7716 -26104 46863 47232 29265 43987
7754 43987 33126 -13764 -41098 -73794 -50955 -19214 -35123 6012 19901 36427 -46035 -58550
7742 -58550 -19704 -7225 -49676 -36300 -62804 -25056 -32491 -66121 -90451 -80531 -22156 -4363
7730 -4363 -34214 -89986 -121830 -105456 -120341 -119725 -130562 -67797 -52285 -94087 -70166 8366
7718 8366 37290 -47083 -77776 -23067 -21179 -55175 -64585 -12779 -45086 -19655 7775 -1093 26288
7705 26288 26521 -12856 -81964 -162545 -139964 -21384 -12967 -103554 -85029 -69024 -31586 44031
7693D4031n679o6427o06k4372p7575O8504R3271N2250J7747m2655J5941o210k3842
7680D4378l3683r657j4701L5605l0571p5203N9218P911n845K8155K6380J1016
7668D3003r7003p9312j6789N5043L5679K9914j1994M0864L0253O0958m6761n5848
7656a1993k0784j1321j0958L2031J3568L5716M4539m7079o0621k3007J0902l2640
7644h1647m7634J9409O4099Q1294Q765m812k3390k4870J5M9402j2359p0897k3512
7631f6137N1624L110J1122J9052K0497K5924o3326m200K0367j1748J9018J1386
7619C6689l4894J7594K9631j2783k5122M709M3919r189r2656l6842K8811Q7137
7607C7004K0226J8963k0418p1037j9471L8662m000l1428p0890L31L3244J6269
$$ plain form
7693 44031 38352 -28075 -28681 -53053 -130628 -62124 31147 83397 101144 58489 74430 68220 44378
7680 44378 10695 1038 -13663 21942 -8629 -83832 -24614 -16703 -22548 5607 31987 43003
7668 43003 -54000 -133312 -150101 -95058 -59379 -29465 -41459 -595 29658 90616 43855 -11993
7656 -11993 -32777 -44098 -55056 -23025 -9457 26259 70798 23719 -36902 -59909 -49007 -81647
7644 -81647 -129281 -109872 -45773 35521 44286 39474 16084 -8786 -8771 40631 28272 -42625 -66137
7631 -66137 -14513 -11403 -281 18771 39268 65192 1866 -2334 18033 6285 25303 36689
7619 36689 1795 19389 49020 36237 11115 15824 59743 50554 -42102 -78944 -50133 37004
7607 37004 57230 76193 55775 -15262 -34733 3929 -71 -31499 -102389 -102058 -68814 -52545
7595e2545p76j9081J2177k6125J7691L7830M6898P4458J2396l3514q0245L0563
7583A9727J101j6m1312k3435N5428l9453l1947m4912L7553L3641L4802j433l1757
7570c2013k1525k0019o60J388k6017j8528l4891J404N0893J9351k149r998M6632
7557d6132j4835k0419O0052O7915P788k3117m5643m6376n3645K7017N4135k7727
7545f0987L3679k1619K0332N0412L7212k5430p3805j3619P2935P175p9655m7958
7533a01328p542L3846Q9558l3207L466J8964n598j0893l5341J4662M5037j3155
7521a531J8277k947k5147k622L6835K1046j0869L1152Q066j8270K3121o103o9193
7508A815o46J3403M0897J245m8316P276R774J8083J2057o4490j4336N9787J5189
$$ plain form
7595 -52545 -53321 -72402 -60225 -86350 -68659 -30829 16069 90527 102923 69409 -10836 19727
7583 19727 20828 20812 -20500 -43935 11493 -27960 -59907 -104819 -67266 -33625 1177 -256 -32013
7570 -32013 -53538 -73557 -74217 -72829 -98846 -117374 -152265 -150861 -99968 -80617 -82766 -92764 -46132
7557 -46132 -60967 -81386 -21334 46581 54369 31252 -14391 -60767 -114412 -87395 -33260 -60987
7545 -60987 -27308 -48927 -28595 21817 59029 33599 -40206 -53825 19110 26285 -53370 -101328
7533 -101328 -108870 -75024 14534 -18673 -15207 3757 -1841 -12734 -48075 -33413 11624 -1531
7521 -1531 16746 13799 -11348 -13970 22865 43911 33042 64194 72260 53990 77111 71008 1815
7508 1815 1169 14572 55469 56714 8398 15674 25448 43531 55588 -8902 -23238 36549 51738
7495E1738o610J6927q4169p4711R416M4394Q9487N1990l0639k6334L2438k9733
7483D4194r0078J3457J11148R153k9835k4396l4656j66Q060L9809l8020k9892
7471b1222k016j7991p2732k8203K8916N6972L9194P7112N4922p7870p0806Q4533
7459E0809J7499j0264k3865o7203J1150k8924n669J546L53P781Q611k8264p5586
7446a42026J2635J33193j1390L760J46r7982M8938L9013J2156K7918J2035Q216
7434D6612o2767M4670O1317m2235j45702l1384O7498J19344K6854K5915m728q3941
7422B1453m9549Q6707K2121n4461k6532J753n1799o2831P0642N1398l2310J5554
7410g854n228p563J8441N1893K3799m5082m5992J991q628K7422k5084M6122J0550
$$ plain form
7495 51738 45128 62055 -22114 -96825 -87409 -43015 46472 98462 67823 41489 73927 44194
7483 44194 -45884 -32427 78721 87874 58039 33643 -1013 -1179 6881 46690 8670 -21222
7471 -21222 -23238 -41229 -113961 -142164 -113248 -56276 -17082 60030 114952 37082 -33724 50809
7459 50809 68308 58044 34179 -33024 -21874 -50798 -56467 -54921 -54568 -46787 -38176 -66440 -142026
7446 -142026 -129391 3802 -7588 -3828 -3682 -101664 -52726 -13713 -1557 26361 38396 46612
7434 46612 -16155 28515 89832 47597 -98105 -129489 -61991 57353 84207 110122 105394 21453
7422 21453 -28096 58611 80732 26271 -261 1492 -50307 -113138 -42496 8902 -23408 -7854
7410 -7854 -13082 -20645 -2204 49689 73488 28406 -17586 -15595 -24223 3199 -21885 24237 34787
7397C4787K8877Q292K8734q1286l0642J1448R3352J458m5337r4046N1530k3718
7385a6551p480L2461J9432l268J8332K6419M2699l3444o5163m7422k3921M7555
7373a0351n1564r3988M8635J10170O5313J9936m4323k2970j00433J9053O7838
7362G316l090j7214M3488J4824k9092k1554n0747J2105L4167j6782J6493O9151
7350E9065P2327o7709n51M1051N3099n8617n1972k9963p1170k8794j5625J4728
7338h4131J0317O404O5179N7773k2510O991l7183q458L9460j8460j7026k5111
7326b6755n3572O2039j4748n3691J1215K42L0556J160o7274k9233M856R593K7315
7313i8297L9424j5084L7515p2593K3228L2487k4912j3109L2543l1448M0379K139
$$ plain form
7397 34787 63664 71956 100690 19404 -11238 210 93562 95020 49683 -44363 7167 -16551
7385 -16551 -24031 8430 27862 24594 42926 69345 112044 78600 13437 -33985 -57906 -10351
7373 -10351 -61915 -155903 -107268 2902 68215 88151 43828 20858 -79575 -60522 7316
7362 7316 4226 -12988 30500 45324 16232 -5322 -56069 -43964 -9797 -26579 -10086 59065
7350 59065 131392 63683 63132 104183 157282 98665 46693 16730 -54440 -83234 -98859 -84131
7338 -84131 -73814 -67410 -2231 55542 33032 40023 2840 -5618 33842 15382 -1644 -26755
7326 -26755 -80327 -18288 -33036 -86727 -75512 -75270 -44714 -43554 -110828 -140061 -135205 -125612 -98297
7313 -98297 -58873 -73957 -36442 -109035 -85807 -53320 -78232 -91341 -58798 -90246 -49867 -47728
7301d7728K9703K6685j2963J6492K7880k0167K0462K517m2562N146n597K171j9764
7288a7725j0768j0065J1675O135k2021K2289j0176o1719o2104L720J0178L9680
7276a00901N8643J5461k5621M27N5657L1586n4385n0139J13128M8557j4415j5690
7264F2308l8277j8712L0926n5684n9135N7807j7983m2259j4176K4764K3931J9898
7252b6592L0501O4000R026J2564l6226o8745n5603l1501m9953o3895J4182j1297
7240b13539O6430J1076O9061Q4965J4793o0767j0199J769K9712L296L1136R987
7228C7720N5452n614n8670n1908j05322K9921R7952L8704j5054M331p975j0205
7216I332m025k6973K8766j2448j1795o5627j8039p0901j5419R6032L0620O1460
$$ plain form
7301 -47728 -18025 8660 -4303 12189 40069 19902 40364 42881 319 5465 -132 2039 -17725
7288 -17725 -28493 -38558 -26883 -20748 -42769 -20480 -30656 -92375 -154479 -150759 -140581 -100901
7276 -100901 -42258 -26797 -52418 -51991 3666 35252 -19133 -69272 43856 92413 77998 62308
7264 62308 24031 5319 36245 -19439 -78574 -20767 -38750 -81009 -95185 -70421 -46490 -26592
7252 -26592 3909 67909 76935 89499 53273 -15472 -71075 -102576 -152529 -216424 -202242 -213539
7240 -213539 -147109 -136033 -66972 17993 32786 -27981 -38180 -36411 -6699 -3403 27733 37720
7228 37720 93172 87558 28888 -23020 -128342 -98421 -469 38235 23181 27512 19537 9332
7216 9332 5307 -21666 7100 -5348 -17143 -82770 -100809 -171710 -187129 -91097 -60477 983
7204I83L4077N0438K0601p6937n1086l889n172L4106n2352n1202O9014J4177p179
7191b4421j1317N3132L7714n3636p1284J8084M1466K4980J3353j6206k2140l0426
7179d0701L586Q873O3721j0740l3345K423K5399K1694l6652n3398l7893L7155
7167d9878k3831j8005p502K2964J9130l3579M7557O885k8686o638P2508J0102
7155A1027m9489j6716J4280P5708j6617r3857n3672J3568J0625L0845M7249m9008
7143g6057n4689M4706J05087j5245m2998n2362l730M196O3936Q1546l9057m4319
7131b8986K4184j6075M77M48l8343L415J7047K7983j5362j4024J8417j5063L6183
7118C01p6278n4107P5092O8148l3325l7175L4814K3072n4914K2108N4129k0892
$$ plain form
7204 983 35060 85498 106099 29162 -21924 -25813 -30985 3121 -49231 -100433 -31419 -17242 -24421
7191 -24421 -35738 17394 55108 1472 -69812 -51728 -10262 14718 28071 11865 -10275 -40701
7179 -40701 -37115 -28242 35479 24739 -8606 -6183 19216 40910 4258 -49140 -87033 -49878
7167 -49878 -73709 -91714 -99216 -76252 -57122 -90701 -43144 -36259 -64945 -71583 925 11027
7155 11027 -38462 -55178 -40898 34810 18193 -75664 -129336 -115768 -105143 -74298 -27049 -76057
7143 -76057 -130746 -86040 19047 3802 -39196 -91558 -95288 -91092 -27156 54390 15333 -28986
7131 -28986 -4802 -20877 -20400 -19952 -58295 -54880 -37833 -9850 -25212 -39236 -20819 -35882 301
7118 301 -75977 -130084 -54992 13156 -20169 -57344 -22530 542 -54372 -32264 21865 973
7106I73k2457m4519J343R3938J02891k3281m5552o854N1922l7518q8127j8891
7094c6132j8702O0522M9160l9691P426J6537k1722K3770o5947j09296p2722k0374
7082b27171Q8539J23174J1145o0286l3692k9840K9530P1147l529J26j5350k2026
7070f8233l4803q533n812R2158K4757q254l6151j5266n829k3676O0891P6929l9990
7057H188l0322r1774K8510J19266L0153p613k3715j5003l8273k5316k3609o085
7045g5593O3636m0705O56J33293O3745m6161q0666l7455m2908M6790n8796r5555
7033a69719n7357O4928O0697P0619L1689j6447o126k4930K4870k0741r6994m6270
7021a85781k0870J6138Q2914l0063j7219L2735K7265L3668O730M0260J021r1716
$$ plain form
7106 973 -21484 -66003 -64660 29278 132169 108888 63336 56482 108404 70886 -17241 -36132
7094 -36132 -54834 5688 54848 15157 22583 39120 17398 41168 -24779 -134075 -206797 -227171
7082 -227171 -138632 -15458 -4313 -64599 -98291 -128131 -98601 -27454 -30983 -30857 -46207 -68233
7070 -68233 -103036 -111569 -117381 -25223 -466 -8720 -44871 -60137 -65966 -89642 -28751 48178 8188
7057 8188 -22134 -113908 -85398 33868 64021 56408 32693 17690 -20583 -45899 -69508 -75593
7045 -75593 -11957 -52662 -52006 81287 145032 98871 18205 -19250 -62158 -15368 -74164 -169719
7033 -169719 -227076 -162148 -101451 -30832 857 -15590 -21716 -46646 -21776 -42517 -139511 -185781
7021 -185781 -206651 -190513 -107599 -137662 -154881 -122146 -94881 -61213 -54483 -14223 -13202 -104918
7009a04918N4987R1968l3932m222N2840O172j3010l93j9374l4324k3726n8994
6997h6926n4914p0270l4605P3165J24884J7764o9915k8604J2716O7505R2223N6088
6985I9111k9167K5808j4870m9177j3656l0572l8427L9764j5880q9728K991j5126
6973a28929J5236J3151j8367P2544L2720l6104j7823R517J0965K421l9306P0250
6961a3725L0152l1078J0432m8244l5384J7186L5387N4480r6238j3683R715M5903
6949c5097N2962J5667p38j0924r513j6070l1533n6182K771J9090N382N1129O8486
6936E5430j0287m0533j8391P6269O790q833m8536p271K6451N845m592p4604q1047
6923a23309J7329M0393K7496o4935M4609M7191Q204o4442j3560L8510P6745j0656
$$ plain form
7009 -104918 -49931 42037 8105 3883 56723 62895 49885 49492 30118 -4206 -27932 -86926
6997 -86926 -141840 -212110 -246715 -173550 -48666 -30902 -100817 -129421 -116705 -49200 43023 99111
6985 99111 69944 95752 80882 31705 18049 -12523 -50950 -11186 -27066 -116794 -113803 -128929
6973 -128929 -113693 -100542 -118909 -46365 -13645 -49749 -67572 -58055 -47090 -44669 -83975 -13725
6961 -13725 16427 -14651 -4219 -52463 -87847 -70661 -35274 19206 -77032 -90715 -81000 -35097
6949 -35097 17865 33532 32794 21870 12357 -3713 -35246 -91428 -88657 -69567 -64185 -13056 55430
6936 55430 45143 4610 -13781 62488 69278 60445 11909 4638 31089 36934 32342 -42262 -123309
6923 -123309 -105980 -65587 -38091 -103026 -58417 -11226 -3022 -67464 -81024 -42514 34231 23575
6911B3575k2365k4960Q878K0621j9223j7532j9735Q1205K8954m1650n9451m468
6899d6151N3661P783J7133J468k9629n7289M9560N8303o3947l8827O2139N1151
6887F5355K0451J8311J9002J9228k7487q6270l4851J5322O260k2124k3435k7352
6875e7590J4159r198N4258J3817O463n5151j9682M7159m4p2521J0285L2968k8334
6862f3411K3095K2418L1520j2114n8216q589o0249K522Q8287O9502P909m1530
6850A144k3031J0628m4231O513j7496j7922o65j06293K9695R3632K6421k4857
6838f6462R8911J0285k3037J2932k4052n2608j4632Q869N2963M0400O0507k1027
6826H3049l818j1197M610J5322m2370o721N6220J7258j7221M590r8920m3953J6741
$$ plain form
6911 23575 1210 -23750 -14872 5749 -13474 -31006 -50741 30464 59418 17768 -41683 -46151
6899 -46151 7510 15293 32426 33894 4265 -53024 -3464 54839 -9108 -47935 14204 65355
6887 65355 85806 104117 123119 142347 114860 28590 -6261 9061 15321 -6803 -30238 -57590
6875 -57590 -43431 -52629 1629 15446 21909 -33242 -52924 -5765 -5809 -78330 -68045 -35077 -63411
6862 -63411 -40316 -17898 13622 1508 -56708 -65297 -125546 -123024 -34737 34765 42674 1144
6850 1144 -21887 -11259 -55490 -48977 -66473 -84395 -85060 -191353 -161658 -68026 -41605 -66462
6838 -66462 32449 42734 19697 32629 8577 -44031 -58663 -49794 3169 43569 104076 83049
6826 83049 79231 68034 72644 87966 45596 38875 95095 112353 95132 99722 802 -43151 -26410
6813b6410r361L2894P987n3278j7667l6126R1178J8114p634J050k5193m8734P2244
6800i36R2874Q822o1848n1406K1338M4349L277m3201o8404L780j8841o4881k2297
6787a57374J47150N9923J1191r932P882m1732p5514m905j0220O9246O7707N6611
6775A20033j7067o1556j9347J3990K1359M4178p0246q0563M1812K8910j8512k9809
6763b6818k6060r582P1112Q4273k1711o4872k3148m4970J124J2145k5078R772
6751f3813J00787k0822n9773J4355Q6331q022p2205N216k1902n3759M2752J9124
6739c1731p8981j3611P6950M9069L1221M0346k9702O229j3576J0385L044N1082
6727A00725M9576K8245n56m0959m6782o1723l2658j2480n452l7973l5636K8265
$$ plain form
6813 -26410 -35771 -2877 5110 -48168 -65835 -101961 -10783 7331 -303 747 -24446 -73180 -936
6800 -936 91938 100760 38912 -12494 8844 53193 56470 13269 -55135 -51355 -70196 -135077 -157374
6787 -157374 -10224 49699 60890 50958 58840 17108 -58406 -63311 -73531 -4285 63422 120033
6775 120033 102966 41410 22063 36053 57412 101590 31344 -49219 -7407 21503 2991 -26818
6763 -26818 -52878 -62460 8652 92925 71214 6342 -16806 -61776 -60652 -48507 -73585 -63813
6751 -63813 36974 16152 -43621 -29266 57065 49043 -23162 -17946 -39848 -93607 -50855 -31731
6739 -31731 -110712 -124323 -47373 1696 32917 73263 43561 49790 36214 46599 49643 100725
6727 100725 150301 178546 177990 137031 90249 28526 -4132 -16612 -22064 -60037 -95673 -67408
6715f7408K0837M5027l9986l408p210m2609q358N963k2349J4342P47L8122L0332
6702c5958M7128M7756m5456J0261K1501j5695N52J0365L9181k0898o3996l6866
6690d2125j0798J0897j7012P6392K8012K9064M4509j7861j4342l6459m8923P684
6678I038L796o9053q167J3158N1152r582m1063K2186R345J0607J0202l5650l9750
6665g3781j8347k338N1612J860N8787m488j2089m4454k4346m5050J7908L4147
6653f0579J2815J559P4807N1641m1242k7639m2175k8055M2266J1141j7832o0818
6641h4111M2141K5519N9121M7948n6027m7581l7278j3938n9141l065O0024J0260
6629e6128m020l7009J493N3774M0388k3313j6901k1145L7283K4734L7580P2371
$$ plain form
6715 -67408 -46571 -1544 -41530 -44938 -52148 -94757 -103115 -97152 -119501 -105159 -104412 -66290 -35958
6702 -35958 11170 58926 13470 23731 45232 29537 30089 40454 79635 58737 -5259 -42125
6690 -42125 -52923 -42026 -59038 17354 45366 74430 118939 101078 86736 50277 1354 9038
6678 9038 12834 -56219 -64386 -51228 -76 -9658 -50721 -28535 -19190 -8583 1619 -34031 -73781
6665 -73781 -92128 -94466 -42854 -40994 17793 13305 1216 -43238 -67584 -112634 -94726 -60579
6653 -60579 -47764 -46205 28602 80243 39001 11362 -30813 -58868 -16602 -5461 -23293 -84111
6641 -84111 -41970 -16451 42670 90618 34591 -12990 -50268 -64206 -123347 -126412 -66388 -56128
6629 -56128 -60148 -97157 -95664 -41890 -1502 -24815 -41716 -62861 -25578 -844 36736 109107
6617A09107q996l3044N2162K5129O4154J29989L979m6305r1064p5827n0255J8801
6605I7830K9312o5724l0539r0828J5630o3645o4852O5397L4594R672O489n337
6593f2001j9655M6656L9527N7187k3910m5878N2248J9993K2040K2101k9906q5358
6581f956p823n9446J2230R8983N2435l8432j918J7117n7616m3637N321j9913N553
6568d4102R400K9063j8647K788M6630m956K360L8313J096k2847N958l947m5812
6555d703j4949L6033m8065l8213J4939L3676L3388j5370l9001m0535J1308q426
6543g9918l9686P9363K1245n1556o107M2687N3164j4424o5523L593k911M7151
6531a2922j8126k8737L740r4472m4682K9056R462L1331Q9269J9073L804q217j3560
$$ plain form
6617 109107 100111 67067 119229 144358 208512 338501 342480 296175 205111 129284 79029 97830
6605 97830 127142 61418 30879 -59949 -44319 -107964 -172816 -107419 -72825 -63153 -56664 -62001
6593 -62001 -81656 -35000 4527 61714 37804 -8074 44174 64167 86207 108308 78402 -6956
6581 -6956 -14779 -74225 -61995 36988 89423 50991 49073 66190 8574 -35063 -29742 -49655 -44102
6568 -44102 -34702 -5639 -24286 -21498 25132 20176 22536 60849 61945 39098 45056 41109 -4703
6555 -4703 -19652 16381 -31684 -69897 -54958 -21282 12106 -3264 -42265 -82800 -71492 -79918
6543 -79918 -119604 -40241 -18996 -70552 -76659 -33972 19192 4768 -60755 -57162 -60073 -12922
6531 -12922 -31048 -59785 -56045 -150517 -195199 -166143 -156681 -125350 -36081 -17008 -13204 -21421 -34981
6518c4981l7414J9172q792k0147J3530J7127L0351J8475J3066q2357r260M6771
6506c4459Q1297J907L8617o1324r2706j0118K1792L2368J4571J2830j2075L6003
6494B8703n9577o9234Q366N6095j325L2502K2562j0080J2251L2214J1999k3109
6482D1367l6526k1658j6481K8368K99j5580K9919j9651n6058K4118N0816L9598
6470D8531L7754j5204o7516K7020j1205q0974m6630J2018O158N09K7088K2548
6458c9903L621P0847R1987n2704p4291n6551m1510M4153P5l7834j12330J7437
6446a87003R1334J09070J14414p2456j64858L0848N2894n560j2547j6559K2758
6435c7665l6757J4423O6665M323p1176L2853j5025l9289O0946N6354J1313J7396
$$ plain form
6518 -34981 -72395 -53223 -62015 -82162 -68632 -51505 -21154 -2679 10387 -71970 -81230 -34459
6506 -34459 46838 48745 87362 26038 -66668 -76786 -54994 -22626 -8055 4775 -7300 28703
6494 28703 -30874 -100108 -91742 -35647 -36972 -4470 18092 8012 20263 52477 64476 41367
6482 41367 4841 -16817 -33298 -4930 -4631 -20211 9708 -9943 -66001 -41883 8933 48531
6470 48531 86285 71081 3565 30585 19380 -61594 -108224 -96206 -90048 -89539 -62451 -39903
6458 -39903 -36282 34565 126552 73848 -443 -56994 -98504 -54351 -54276 -92110 -204440 -187003
6446 -187003 -95669 13401 127815 55359 -109499 -78651 -25757 -31317 -43864 -60423 -37665
6435 -37665 -74422 -59999 6666 10989 -60187 -27334 -42359 -81648 -20702 35652 46965 64361
6423F4361m193K3990l0594q3928j9072n8239K4408L3616L4641L2214o0195q1326
6411a24317M8653N5325M9357k0733l8497O8103J6396j2608l5348k9912n62O7372
6399D3229k899n5797l7702j5585J2461K1213K1290j5418M5580J0856o4716n6288
6387i3776k335P8558o6222o481K8744J4803K143J7246L4750J0156l6511m3780
6375f2705K5659j8496L606O761m6300L7677O6510m2004q2014M6699M3841N099
6363a5667J2195M3362q707j3139J9027J6151q6912k5568L0616L6345m3128n993
6351d1418K8001J3020j4175k5608k235K7065J6374j25795j6516N3362N7684L6895
6339F654r504l3693r902K7650M607p7778k0911J9747q914O5364j8493N1867m7457
$$ plain form
6423 64361 60168 84158 53564 -30364 -49436 -107675 -83267 -49651 -15010 17204 -42991 -124317
6411 -124317 -75664 -20339 29018 8285 -30212 37891 54287 41679 6331 -23581 -24143 43229
6399 43229 40330 -15467 -53169 -68754 -56293 -35080 -13790 -29208 16372 27228 -37488 -93776
6387 -93776 -96111 -17553 -83775 -90256 -61512 -46709 -44566 -27320 7430 17586 -18925 -62705
6375 -62705 -37046 -55542 -51936 -45175 -91475 -53798 12712 -29292 -111306 -64607 -20766 -15667
6363 -15667 -3472 39890 31183 18044 37071 53222 -33690 -59258 -28642 7703 -35425 -41418
6351 -41418 -13417 -397 -14572 -40180 -42415 -15350 1024 -124771 -141287 -87925 -30241 6654
6339 6654 -2850 -36543 -46445 -18795 -14188 -91966 -112877 -93130 -102044 -36680 -55173 -3306 -50763
6326e0763k9659m7045K0587K8843n025K4969L2104N3013p649m568J4496M0054
6314F9357L6958k0534l9311M1458J3938r721K7241j1112n290n4667l2753p1441
6302e5877L5629K1963l6008o0320Q913j9248O4958J7142m2232O5115K5072m2635
6290a7528k1880n6895N8378j8609k4211R420j2139O9020K036m140L941N7147L4368
6277G8908q8267p6720j05498k5602P2545M8691j632Q621L2024L5664n1059m27
6265g2752J4969q457N1641L268k502q3817m0856K9296Q8219K9465n0425M1147
6253h04r099n8997Q768K9562j8715k7503N9939O4692l8031j6032l034M132l2225
6240c7347m1210p1836J4444L7497J125J7664L65n1119J0740L129J11128J13154
$$ plain form
6326 -50763 -80422 -127467 -106880 -78037 -83062 -58093 -25989 27024 19375 14807 29303 69357
6314 69357 106315 85781 46470 87928 101866 92145 119386 108274 102984 48317 15564 -55877
6302 -55877 -20248 1715 -34293 -94613 -85700 -104948 -39990 -22848 -65080 35 25107 -17528
6290 -17528 -39408 -96303 -37925 -56534 -80745 -71325 -83464 -14444 -12408 -16548 -12607 44540 78908
6277 78908 -9359 -86079 -191577 -217179 -144634 -95943 -97575 -88954 -56930 -21266 -72325 -72752
6265 -72752 -57783 -66240 -14599 -11331 -13833 -97650 -138506 -109210 -20991 8474 -41951 -804
6253 -804 -9903 -68900 -60132 -30570 -49285 -76788 -16849 47843 9812 -6220 -9254 -5122 -37347
6240 -37347 -78557 -150393 -135949 -98452 -97327 -79663 -79298 -130417 -119677 -116548 -5420 107734
6228A07734K9846o3323j09228k7732R058K4597R1463P734k1761J6636j1581m3811
6216I632m145J5021Q85n4029K4517k7530J6424J9582K0019m5374n842J667L2441
6203C268m4076m9869j7550O3844O6825k7314l2035k8424l7234N6682P9584j737
6191C1964K5787O1671n796q6496j451j6963j8821j7091L2552Q570Q920j2132j3243
6178b529l2723M334k1323K9707N6351l485Q60j4280J7905N0660j3714l1653o8295
6165b8185p944Q358k6546k2744M874N898k6187P3496j1244n014L1380L1330r897
6152A7575q4484L8071L0703N6135L5058p953l0694m7210R02K0408O5654j0662
6140H3503M324k5412o4857J9015j460m1057K2972k6857J0957N0628m3679q0392
$$ plain form
6228 107734 137580 74257 -34971 -62703 -53645 -29048 62415 70149 48388 65024 53443 9632
6216 9632 5487 20508 21393 -32636 -8119 -35649 -19225 357 20376 -24998 -30840 -29173 3268
6203 3268 -40808 -90677 -108227 -44383 22442 -4872 -36907 -65331 -102565 -45883 33701 31964
6191 31964 57751 119422 113626 27130 25679 8716 -10105 -27196 5356 13926 22846 10714 -2529
6178 -2529 -35252 -30918 -52241 -22534 33817 30332 31192 16912 34817 85477 71763 40110 -28185
6165 -28185 -36129 -27771 -54317 -77061 -72187 -66289 -92476 -18980 -30224 -35238 -3858 27472 17575
6152 17575 -66909 -28838 1865 58000 93058 85105 54411 7201 8103 28511 94165 83503
6140 83503 87827 62415 -2442 16573 15113 -25944 -2972 -29829 -18872 31756 -11923 -92315
6128i2315j8956l1505J4401J01107N7315k022Q792n664k645k6034m4877p2679
6116a15082m9607k3841M8683N5405L6709M0949j7599K4062J7008m5887j2069P024
6104c4245j6893M1745J2829m135K3289l5487j9487q482M9035j7141r0413K7991
6092g1394J04448O0373l0293j7004k318l3749m5691n9971m4779J6833J2985M0883
6080f9677K5858k3421J0726J1803L6455M2799j1080m484m5910m2869k8149o569
6068a04518N0383k287K1424Q9758k4169q5095r1630K02J5120R0487L0416K1564
6056A1655m0576k3992J6697k3815L1938K6388P933N8140O1299P564m8031q5790
6044e90l5851j7939J8385M345K262k9698j02913m9252L2324N7699M2698L9300
$$ plain form
6128 -92315 -111271 -142776 -128375 -27268 30047 28025 36817 31153 28508 2474 -42403 -115082
6116 -115082 -164689 -188530 -139847 -84442 -47733 -6784 -24383 -321 16687 -29200 -41269 -34245
6104 -34245 -51138 -9393 3436 -699 22590 -12897 -32384 -40866 8169 -8972 -99385 -71394
6092 -71394 33054 93427 63134 46130 43812 10063 -35628 -95599 -140378 -123545 -110560 -69677
6080 -69677 -43819 -67240 -56514 -44711 -8256 34543 23463 18979 -26931 -69800 -97949 -104518
6068 -104518 -54135 -56422 -34998 54760 30591 -54504 -146134 -145932 -130812 -40325 -9909 11655
6056 11655 -28921 -52913 -36216 -60031 -28093 -1705 6228 64368 125667 133231 85200 -590
6044 -590 -36441 -54380 -35995 -31650 -29388 -59086 -161999 -211251 -178927 -121228 -78530 -39230
6032c9230k0731L8386O3409J7008n2728J5595n1123M1791j0399l5966l1447J03517
6020C8082K2368m8981l1229k0829J1453K8026J1256o1720l3711K6310J4488N213
6008c9274k8840N4090L6103K9518m2635n3613K59m0983k0196M8346P8879j2523
5996I131l3819J1596j6689l2812l6055M6401Q111K2968J01k3782l5433M649K0236
5983e5397K0694J623O972M4257J6604R851m704J9566L584j4900j7761K8181L8947
5970I7517n2529K381j25458p7909K4017K5332q567j0644P620P5923j1160k4535
5958g8012m9952R404J4885O0617Q5302j1336j325p6364n6603L05J9225P753L0135
5945d5966j3953k9434L281O6183J1639L9156n320o3034J2738J7466K0931k3521
$$ plain form
6032 -39230 -59961 -21575 41834 58842 6114 21709 -29414 12377 1978 -33988 -65435 38082
6020 38082 60450 11469 -19760 -40589 -29136 -1110 10146 -51574 -85285 -58975 -44487 -39274
6008 -39274 -68114 -14024 22079 51597 8962 -44651 -44392 -85375 -105571 -57225 21654 9131
5996 9131 -24688 -13092 -29781 -62593 -98648 -52247 -44136 -21168 -21067 -44849 -80282 -75633 -55397
5983 -55397 -34703 -33080 -26108 18149 34753 44604 39900 59466 63050 48150 30389 58570 97517
5970 97517 44988 47369 -78089 -155998 -131981 -106649 -115216 -125860 -118240 -42317 -53477 -78012
5958 -78012 -127964 -118560 -103675 -43058 42244 30908 29583 -46781 -103384 -103079 -83854 -76101 -45966
5945 -45966 -59919 -89353 -86072 -19889 -8250 30906 25586 -37448 -24710 -7244 13687 -9834
5933i834R682N1240M3162j269r3723l3081n1907K7501r614l0003R000N9587P832
5920b1427L7293R464l560O076M9634n0345n4931N8207J8270J6966N6136j7913
5908A03870m4696J8608P659n5133p7147j3715J00456n497m5464k9974n386M6087
5896c32J6326J9549J6695k6379l1895j6766m2459j6497q7874k8375O9227L5489
5884i3291K8208M9837n813k8825O832M6167M1081j7393j7201N2898j7863n7457
5872a2820J0919m4412n544J06147M989q9293k0082J9224Q1797J8426k2094j3397
5860C3860M493l0408m2254p856N7028J3695m040k0109q1986l5779k9942J4840
5848a28458N3044P2919R7735j1464O323L0938K5337o559r0049j04958K5990k6431
$$ plain form
5933 -9834 -152 51088 94250 92981 -742 -33823 -85730 -58229 -67843 -97846 -88846 -29259 -21427
5920 -21427 15866 25330 21770 27846 77480 27135 -27796 30411 48681 65647 121783 103870
5908 103870 59174 77782 85441 30308 -46839 -60554 39902 34405 -11059 -41033 -46419 -332
5896 -332 15994 35543 52238 25859 -6036 -22802 -65261 -81758 -169632 -198007 -128780 -93291
5884 -93291 -65083 -15246 -21059 -49884 -43052 3115 44196 26803 9602 62500 44637 -12820
5872 -12820 -1901 -46313 -51857 54290 59279 -30014 -50096 -30872 50925 69351 47257 33860
5860 33860 38353 7945 -34309 -42165 14863 28558 24518 4409 -77577 -113356 -143298 -128458
5848 -128458 -75414 -2495 95240 83776 90099 121037 146374 139815 49766 -55192 -29202 -55633
5836e5633P2940j5410r5432j4628M0166j7228J0654l2408J8982O0285N4441j7230
5824I499m4683k1081L6233K856q2727l138P1674J254K6694l9968k1489O929l8876
5811i6823k0181l1562L2499N4637J748K9310K1228M3803Q4381L405n7029k5507
5799C9909n2596p3444K071k7465j4150N9268N1969N2081K0373n2922l6757L909
5787b7754K1427J90L7698N0946m1436l0831J13495l2539m1871j17616l783M4671
5775b7403J1395J391l4064p1730j5432J6984K5806J6388K7626M4739k0551P5615
5763E0764l7438l3913K573K5296L2947J03j9492o478k8736R3216j3757n7947J476
5750H614p8646J3935K5656M8163K6066J8039O226p3835k2404K8556J5938J6403
$$ plain form
5836 -55633 17307 1897 -93535 -108163 -67997 -85225 -74571 -106979 -87997 -27712 26729 9499
5824 9499 -35184 -56265 -20032 -17176 -99903 -103041 -31367 -30113 -3419 -43387 -64876 -57947 -96823
5811 -96823 -117004 -148566 -116067 -61430 -59682 -30372 -9144 34659 119040 122445 65416 39909
5799 39909 -12687 -86131 -84060 -111525 -125675 -66407 -14438 37643 58016 5094 -31663 -27754
5787 -27754 -6327 -6137 31561 82507 41071 10240 123735 91196 49325 -68291 -72074 -27403
5775 -27403 -16008 -14617 -48681 -120411 -135843 -118859 -93053 -76665 -49039 -4300 -24851 50764
5763 50764 13326 -20587 -18014 7282 40229 40332 20840 14362 -14374 78842 65085 7138 8614
5750 8614 -70032 -56097 -30441 17722 43788 61827 68053 -5782 -28186 370 16308 32711
5738C2711l6870m5729n3247M6446J1275j0025L8362k5565J7292K3815n3426l6586
5726i1547q5329K4069O2101L3582J5064k6001L783P6599k932k9870j5217j9835
5714e5533j319L3640l7466r1596k2291L2719Q2086J0841J5497Q2562L6324m9762
5702C5702k6534m1660k017n3704L2084J04278j6758k5604j1862l3575j1372K7747
5690b3275J136M5213m6850m3988j5940o8712J6570R7777J8810N35o5844k3323
5678a07891n50K1782l7817J00429N2921l0253o367m0916J5497K3194p79K3479
5666A2729K1091K1484L542n1839j4957J6660R816J0145R217n5714K1414K2082
5654B5670n2957j9697k1611K979M190J0524N0461K0624K6760m6851l431J6349
$$ plain form
5738 32711 -4159 -49888 -103135 -56689 -45414 -55439 -17077 -42642 -25350 -1535 -54961 -91547
5726 -91547 -176876 -152807 -90706 -57124 -42060 -68061 -64278 12321 9389 -20481 -35698 -55533
5714 -55533 -56852 -23212 -60678 -152274 -174565 -141846 -59760 -48919 -33422 49140 85464 35702
5702 35702 9168 -32492 -34509 -88213 -56129 48149 31391 5787 -6075 -39650 -51022 -23275
5690 -23275 -22139 23074 -23776 -67764 -83704 -152416 -135846 -38069 -19259 -18724 -84568 -107891
5678 -107891 -108441 -86659 -124476 -24047 28874 -1379 -7746 -48662 -33165 -9971 -10750 12729
5666 12729 33820 55304 58846 7007 -7950 8710 18526 28671 37888 -17826 3588 25670
5654 25670 -27287 -46984 -68595 -65616 -61426 -50902 -441 20183 46943 92 -3339 13010
5642A3010J7556n9692K8103L500j01457K7371M9300j1654j8224K3120M0833N8817
5630G0583n5826m800R30o0697q3399J0755L2780M050J6195J9609R794j7649j7128
5617g4803L9262P7269J1650n6420l0746k4283J6581k2440N322O3052k1890j7422
5605c4868K2080l2363L6944K3290k5790M5820P276K709n9368j1608l0327n0122
5593a06327K0166M9715n375Q1191L847K7226o1524n1464l8430p337n449k5285
5581a19046p882P975L3636N924j6033J4726j721m4235k5497O1739L5952l2092
5569h6554L3043K0310j2440j2253n943L8887K3357N5513M1198k2978l8101J5359
5557D9398k5044l1111l4365L1332M0771k6833k2741o7474L1870P5040l5736m8380
$$ plain form
5642 13010 30566 -29126 -1023 2477 -98980 -71609 -22309 -33963 -52187 -29067 11766 70583
5630 70583 14757 9957 10887 -49810 -133209 -122454 -89674 -85624 -69429 -49820 -40026 -57675 -74803
5617 -74803 -35541 41728 53378 -3042 -33788 -58071 -41490 -63930 -58608 4444 -17446 -34868
5605 -34868 -12788 -45151 -8207 15083 -10707 35113 42389 45098 -14270 -25878 -56205 -106327
5593 -106327 -86161 -36446 -41821 39370 43217 70443 8919 -42545 -80975 -88312 -93761 -119046
5581 -119046 -126928 -118953 -85317 -79393 -95426 -80700 -82421 -126656 -152153 -90414 -54462 -86554
5569 -86554 -53511 -33201 -45641 -57894 -63837 -24950 -1593 53920 95118 72140 34039 49398
5557 49398 24354 -6757 -41122 -9790 30981 4148 -18593 -86067 -54197 20843 -14893 -63273
5545f3273q75j9179O7811j124l6702O6959k5234l000l1841j1696j6964N9176K0273
5532D331k315K2351J1931L024N1832j9724o4714l5007q336k9022J8025l3448o817
5519h7889L6017J6719m818K4562j7026N8216K181q632n0556p3242k9027J4741
5507a18754M9527N3637O772o9152l6151k8443k5790Q4104K0761K9187k2819l7117
5495i4238J5435L0334K0462l9517l5322n3827J6770N4737K5129k5330J1708k8596
5483a02255j276L8010j3135k2714j1871J0262J4312L0080K1430L0334j5418K5095
5471B854l1311O3113N1040m1634q1229O4239m163r391l4176L1811n8355n4221
5459a01423o8656L3744J22772L143j7356M0470K5366P4646j4995J8296J0957j32500
$$ plain form
5545 -63273 -64148 -83327 -15516 -16640 -53342 13617 -11617 -14617 -46458 -58154 -75118 -15942 4331
5532 4331 2016 24367 36298 39322 91154 71430 6716 -28291 -36627 -65649 -47624 -81072 -87889
5519 -87889 -51872 -35153 -39971 -15409 -32435 25781 27962 19330 -31226 -104468 -133495 -118754
5507 -118754 -69227 -15590 -8818 -77970 -114121 -142564 -168354 -84250 -63489 -34302 -57121 -94238
5495 -94238 -78803 -48469 -28007 -67524 -102846 -156673 -139903 -85166 -60037 -85367 -73659 -102255
5483 -102255 -103531 -65521 -78656 -101370 -113241 -102979 -88667 -58587 -37157 -6823 -22241 2854
5471 2854 -28457 34656 85696 44062 -37167 27072 22909 13518 -20658 11153 -47202 -101423
5459 -101423 -170079 -136335 -13563 -10420 -27776 12694 38060 112706 97711 116007 126964 -5536
5447e536j07257L384k6822o451N7178L9790M1058j0993J3785L7039M6057R840
5435I1072o2325n674L8845L7511K1454m7326j6814l4433J9678l3786k4932N8541
5423D1811K7812p6385j5890J7650q425m8992l6188L3850K5007K2150l2417k980
5411e2997M0029j7345J9976L5609M9073n7592l8483K9522L5263m6558l3450M9522
5399A2569M6298J657j8486K4035L3200l1285n9204J6616Q2080j5429k7095k4075
5387D0881j120j9800j8088K7615J3330L0921M9292L280K5209o9994n3389j7227
5375A0910o3252n1663o676k4837o824L4045M1216R1658J5149m9827m9872O8553
5363H580M7804J6061J1291m6507j19171L8775M8933J7668K8982K9292m8454J0717
$$ plain form
5447 -5536 -112793 -109409 -136231 -142682 -85504 -45714 -4656 -15649 -1864 35175 81232 91072
5435 91072 28747 23073 61918 99429 120883 73557 56743 22310 41988 8202 -16730 41811
5423 41811 69623 -6762 -22652 -5002 -13427 -62419 -98607 -64757 -39750 -17600 -50017 -52997
5411 -52997 -12968 -30313 -10337 25272 74345 16753 -21730 7792 43055 -3503 -36953 12569
5399 12569 58867 60524 42038 66073 99273 67988 8784 25400 107480 92051 64956 40881
5387 40881 39761 19961 1873 29488 42818 73739 123031 126311 151520 81526 28137 10910
5375 10910 -52342 -104005 -110681 -135518 -142342 -108297 -67081 24577 39726 -10101 -59973 8580
5363 8580 56384 72445 83736 37229 -81942 -43167 5766 23434 52416 81708 33254 43971
5351D3971K2768q49k2748k4876p656m0646m9489j3778P6058O7875l0001j6187
5339D442l051l7246J2703L4450j7915j0787N5390l3291n4575N3582k1027k5057
5327d2382m4606M7571o166K8730p5429l5664N3778P2871K3151k228j9414K3788
5315B4000l8957j5339M9685p424J4659m4096L1357O5192k0029p741J3268J6028
5303H0603j0732K3430K604m1462o6326k4706R0642L2352L5238p1001m3717J1857
5291A8782m0596n9445M5643M1026R077M9944J7622P417n4443l0440l2337j4443
5279d2193P8310L3532m8489q7492o7698j6265O2757K2644p5220O891J21823L8601
5267B7201l6750j6524M415l3790L5705M0844k4078J5777J0559m4041N2290K7336
$$ plain form
5351 43971 66739 65890 43142 18266 10610 -30036 -79525 -93303 -17245 50630 20629 4442
5339 4442 1391 -35855 -23152 11298 -6617 -17404 37986 4695 -49880 3702 -17325 -42382
5327 -42382 -86988 -39417 -45583 -16853 -92282 -127946 -74168 -1297 21854 19626 212 24000
5315 24000 -14957 -30296 19389 11965 26624 -17472 13885 79077 59048 51307 64575 80603
5303 80603 69871 93301 95905 54443 -11883 -36589 54053 86405 121643 50642 6925 18782
5291 18782 -21814 -81259 -35616 5410 14487 64431 82053 89470 35027 4587 -27750 -42193
5279 -42193 36117 69649 21160 -66332 -134030 -150295 -87538 -64894 -140114 -133223 -11400 27201
5267 27201 -9549 -26073 -21658 -55448 -19743 21101 -2977 12800 23359 -20682 31608 58944
5255E8944K113k9653o1119J8488K5134n4554K3043K9624J4827n124K5198K2142
5243F9063j1875o01Q554m321J6689O410l4993j7485q169J5892q9629l9198L4259
5230e5404J1300L2651k3582m2960l6655L051N0339M5460k4489p774M0732J2460
5218E129J5676m8812m3378J0893L2806O2433p837R007O325j3772L752j0131M6642
5205F8733M4992o6270OM8134p2472r3689j6130J525J8878j3795j3103O9914K326
5192b0951n6806J2834J8847K207M314l3567n2967N6661K6483l8374J859m1426
5180a20886J3264O2644M2010K9933O0269K5432p6106o0378L5308J2694K0910J4264
5168E9358k0730k971l4617j4787K9031M3657K3137q137k9939m5554J4071J1369
$$ plain form
5255 58944 61057 31404 -29715 -11227 13907 -40647 -17604 12020 26847 21723 46921 69063
5243 69063 57188 56587 65141 60820 77509 83919 48926 31441 23272 39164 -50465 -89663 -55404
5230 -55404 -44104 -11453 -35035 -77995 -114650 -111599 -61260 -15800 -40289 -48063 -7331 5129
5218 5129 20805 -28007 -71385 -60492 -27686 34747 26910 35917 42242 28470 32222 22091 68733
5205 68733 113725 47455 47461 95595 23123 -70566 -86696 -85171 -66293 -80088 -93191 -23277 -20951
5192 -20951 -77757 -64923 -46076 -43869 -39555 -73122 -126089 -69428 -42945 -81319 -79460 -120886
5180 -120886 -107622 -44978 -2968 26965 87234 112666 36560 -23818 11490 24184 45094 59358
5168 59358 38628 35657 1040 -13747 15284 58941 82078 73941 44002 -1552 12519 23888
5156B3888j6185l3644K2841K042k7594L123L0064m528j1915l8494k0599j8283
5144h9284M6891K4324K0938K2963r355q4610M8755m4206q646M2372K4375J7257
5132A1774J3441k642J4969J3672r579m9100k6645L5129K2204L010J9968L926K0943
5119G1070J9170J1439o5261o2940m6962R916L6215m4791P605q1628m522K4583
5107a26106l5691J9490R9896Q7783R407p9218K0756j2439o0499K4874J5468m801
5095d1080K7279J1838l4542l6978r68N3457j0084j02040k565L5792N3322K3526
5083b3043J2307P335Q47q5519p2467M3909O4046p1J4398K7136k8344p6627m1794
5070a57887M83M8889N1101l2187l8437M0660L715k5792P5536Q0069P253m6198
$$ plain form
5156 23888 7703 -25941 -3100 -1058 -28652 -25529 4535 7 -11908 -50402 -71001 -89284
5144 -89284 -42393 -18069 2869 25832 16477 -68133 -19378 -63584 -72230 -29858 -5483 11774
5132 11774 25215 22573 37542 51214 41635 -7465 -34110 1019 23223 26233 46201 50127 71070
5119 71070 90240 101679 36418 -26522 -73484 -63568 -27353 -72144 -64539 -146167 -150689 -126106
5107 -126106 -161797 -142307 -42411 45372 54779 -24439 -3683 -16122 -76621 -51747 -36279 -41080
5095 -41080 -13801 -1963 -36505 -73483 -74451 -20994 -31078 -133118 -135683 -99891 -46569 -23043
5083 -23043 -10736 -3401 -2554 -88073 -160540 -116631 -52585 -52656 -38258 -11122 -39466 -116093 -157887
5070 -157887 -157404 -108515 -57414 -89601 -128038 -87378 -83663 -109455 -33919 46150 53403 7205
5058G205K1971o5131l0295M856n8154O342J04416J1137K2664m1284j7177r4131
5046a27581j8186J08942N4543p3596n6292J1747M3411l7669L012M9356J0091j3116
5034d5338O0963K5866n1198j9784j1940j1612j0077K7834J3620Q138Q871J6643
5022A1986J5488q455J2155R086L5743k8049j01423k2034M0221Q1775N2463n5442
5010D3514J0028j9089J1030l8195k8582M0427l1971N4368Q643n2077q301J4676
4998D471M5378N6586K3018J6793J3623l6584m0434l6550p492j8068l8909J9497
4986A329L4969n378k3499K6663l6790m2392m4736N5521R1621n2340n2035j7579
4974f4646j4470J2908K1507J6114m693q6002K8296O4092K1052j0341q111n1141
$$ plain form
5058 7205 29176 -35955 -66250 -61394 -119548 -113206 -8790 2347 25011 -16273 -33450 -127581
5046 -127581 -145767 -36825 17718 -55878 -112170 -100423 -57012 -94681 -91669 -42313 -32222 -45338
5034 -45338 15625 41491 -9707 -29491 -41431 -53043 -63120 -35286 -21666 -13528 -4657 11986
5022 11986 27474 19019 31174 40260 76003 47954 -53469 -75503 -35282 46493 98956 43514
5010 43514 53542 34453 45483 7288 -21294 19133 -12838 41530 50173 -1904 -10205 4471
4998 4471 49849 106435 129453 146246 159869 123285 82851 46301 38809 20741 -18168 1329
4986 1329 36298 30920 7421 34084 -2706 -45098 -89834 -34313 57308 4968 -47067 -64646
4974 -64646 -79116 -66208 -44701 -28587 -33280 -119282 -90986 -26894 -5842 -16183 -24294 -75435
4962g5435j473J5042j9923L6207M6619m7760p1953M5081N8557J9141O8369N0882
4950A23354P196l8226p523j7309k7525l5411k8790r4253J5529R3642Q2506j1789
4938F1401o3p5917j5079N0327L2003j8821j7356M0156j8648o933l9382n8740j9747
4925h6799N2074L4555k6689l3147q0721j0424M4842O2346n2175j5528J02747N7586
4913D8667p5076k7441m0052q389K9591K8944j7309P2787l127m3233M1201N0174
4901E6737k3683m5368m7964r547l9463O8010L7661K0119l4822j9942O2612l0483
4889f133r202L2211o6797n2604N8792K1887l3704k9603L2028J0558O695N6133
4877B0261L4864q08L504m11o2644J0172p8162N902N7702K0612l7553N4758P4551
$$ plain form
4962 -75435 -76908 -61866 -81789 -45582 1037 -46723 -118676 -73595 -15038 4103 72472 123354
4950 123354 130550 92324 84801 67492 39967 4556 -24234 -118487 -102958 -9316 73190 61401
4938 61401 61338 -14579 -29658 20669 52672 33851 16495 56651 38003 31070 -8312 -67052 -86799
4925 -86799 -34725 -170 -26859 -60006 -140727 -151151 -106309 -43963 -96138 -111666 -8919 48667
4913 48667 -26409 -53850 -93902 -102291 -72700 -43756 -61065 11722 8595 -34638 6563 56737
4901 56737 33054 -12314 -60278 -69825 -109288 -41278 -3617 16502 -18320 -38262 24350 -6133
4889 -6133 -15335 16876 -49921 -102525 -43733 -21846 -55550 -85153 -53125 -42567 -35872 20261
4877 20261 55125 54317 57821 57410 -5234 4938 -73224 -67322 -9620 10992 -26561 28197 102748
4864A02748k8195j6935p1607k7207R368M6329K785j3206J2434m939J9233q68l0721
4851g81j8822k4194N4851l799p8192o1435j6517m894m962J35265Q7015m3757p4409
4838e4631l9551J0910K0372O981q248O4919j2931l9821M9049L4621m2877k2287
4826c3494J4686O3752Q47o4372n366l720k4457P3874j9965n9970l0465j3744l7983
4813a40377O5269k1005P219O5698O6190P907L258j2154r826P903m978l0576m9789
4800d5261m0092K1812M1567J8482p6961N6391N6302L1805K062o676K5165k6230
4788E8366l1862L9467R777m0926l3490j9346L3557J8961n3717r5834j1742M863
4776a21926K2271O906K9086P544M702L0567O5032N9780N311o8305K3813R352q9132
$$ plain form
4864 102748 74553 57618 -13989 -41196 -31828 14501 17286 4080 16514 11575 30808 29940 -781
4851 -781 -19603 -43797 11054 7255 -70937 -132372 -148889 -153783 -158745 -23480 63535 19778 -54631
4838 -54631 -94182 -83272 -62900 -55919 -64167 752 -12179 -52000 -2951 31670 -11207 -33494
4826 -33494 -18808 44944 45791 -18581 -23947 -27667 -52124 21750 1785 -58185 -88650 -102394 -140377
4813 -140377 -75108 -96113 -88894 -23196 42994 50901 54159 42005 32179 40082 35104 4528 -45261
4800 -45261 -85353 -63541 -21974 -3492 -80453 -24062 32240 64045 66107 59431 84596 58366
4788 58366 26504 65971 75748 34822 1332 -18014 15543 34504 -19213 -115047 -126789 -121926
4776 -121926 -99655 -92749 -63663 -56119 -51417 -20850 44182 103962 109273 40968 64781 74133 -14999
4763a4999n0649m426K7084Q835k9176o3589J5015L9533K8397L1346L2831j459
4751A8743r4858k8639P9556P0570k705n2503k8712M0228P6457J8848K1477n0626
4739F7836m4752k2228N5041M308O926j218o0821k2500m0410K9597L7832O425m5807
4726b9771n3946k8714j2837k1400M0165K0806Q934P580n2524m6375N6421M5761
4714f5900K5813J0584o4927J6971P8462L7943m9021m0499K2716k3095j272m896
4702e7121k3157M3259Q000P561J1847L75j12314m0079R0196P7534P4532J5369
4690I6002k5254o0630J7283K0389K4110l0096P604L967m7253N247j6250m4697
4678d9578L8455L8049k516q8503l6692P961J2713K0964k8111J3192J0656R721
$$ plain form
4763 -14999 -65648 -70074 -42990 -34155 -63331 -126920 -111905 -72372 -43975 -12629 20202 18743
4751 18743 -76115 -104754 -25198 45372 42667 -9836 -38548 1680 78137 96985 118462 67836
4739 67836 23084 856 55897 60205 67131 65913 5092 -17408 -57818 -28221 9611 16036 -29771
4726 -29771 -83717 -112431 -125268 -146668 -106503 -85697 -76763 -69183 -121707 -168082 -111661 -65900
4714 -65900 -40087 -29503 -94430 -77459 1003 38946 -10075 -50574 -27858 -50953 -52225 -57121
4702 -57121 -80278 -37019 -29019 -21458 -9611 -9236 -121550 -161629 -71433 6101 80633 96002
4690 96002 70748 10118 27401 47790 71900 41804 49408 53375 6122 11369 -4881 -49578
4678 -49578 -11123 26926 24410 -64093 -100785 -92824 -80111 -59147 -87258 -74066 -63410 -53689
4666e3689k3292O135J5748J775M24N0053K9773l0571p5687q525N8872N1859K5009
4653D7884K3390j3735m2445j7701q3884n9222k1243J9263M0981j6077N4288L6557
4641c1944P9590j7826l6991r075L497N173l5962r101Q0062Q129l0670o4887j8243
4628g8248J766k0333J119R795N6777K4799J5010q2847j8694P1272L3171m6549
4616c2962k2278m341M0546O6180k0602K249l3415n408M7280o3408l5461M2248
4604a9372n114R8726j6676k976K6061L587l7996o6322K3988J1753l7890J9962
4592b269R889L6006j2409m0830n7935o9651Q4055O3756j8014k0661J2147m1989
4580e7905p2355K5368R4087n354l9952J4054J17827L684m6800o6670k7197M2478
$$ plain form
4666 -53689 -76981 -70846 -55098 -53323 -52899 -2846 26927 -3644 -79331 -87856 -28984 22875 47884
4653 47884 71274 57539 15094 -2607 -86491 -145713 -166956 -147693 -106712 -122789 -68501 -31944
4641 -31944 47646 29820 -7171 -16246 -12749 -7576 -43538 -52639 27423 35552 4882 -60005 -78248
4628 -78248 -76482 -96815 -95696 -85901 -29124 -4325 10685 -72162 -90856 -19584 13587 -32962
4616 -32962 -55240 -59581 -19035 47145 26543 28792 -4623 -10031 37249 -26159 -61620 -19372
4604 -19372 -24486 74240 57564 54588 80649 84236 46240 -20082 3906 15659 -22231 -2269
4592 -2269 7620 43626 31217 -9613 -67548 -137199 -53144 10612 -7402 -28063 -15916 -57905
4580 -57905 -130260 -104892 -10805 -16159 -56111 -42057 75770 79454 32654 -34016 -61213 -18735
4568a8735J0936M2709m0815n0422J4933J0155l817K4761L7233P371m361j5518
4556A4430J9418J1158o915M5448J234j1026N37n4733j1018J200M2468o0561k7798
4543c6158J16236j428r3039n5487M554K9307M3259O766N5489P9126q1773l5218
4531C1634l5014j5715n1796K872O9556j5196m6620L2866M6266M3980k371m0301
4519B0161j0137K625J8989K4528n0719o3303J1719k1192J0027L6362J6272j1859
4507a6527n1260Q8150N5760n93j3120k8589j3491m6161K7149q888q9812K476N2516
4494d2390k763k187l192n843N00P3026L6181m2559q4251l7416j4546O3057J03587
4481D1204o709K6517K2917l4823p6636J6788o2891n8281L6538K3016n8050L4349
$$ plain form
4568 -18735 -7799 34910 -5905 -56327 -41394 -31239 -35056 -10295 26938 34309 29948 14430
4556 14430 33848 45006 38091 83539 84773 73747 74284 19551 8533 9733 52201 -8360 -36158
4543 -36158 80078 78650 -14389 -69876 -65322 -36015 7244 14010 69499 148625 66852 31634
4531 31634 -3380 -19095 -70891 -68019 1537 -13659 -60279 -27413 18853 62833 60462 20161
4519 20161 10024 12649 31638 56166 5447 -57856 -46137 -67329 -57302 -20940 -4668 -16527
4507 -16527 -67787 20363 76123 75530 62410 33821 20330 -25831 1318 -7570 -97382 -94906 -42390
4494 -42390 -45153 -47340 -50532 -56375 -55875 17151 53332 10773 -73478 -110894 -125440 -62383 41204
4481 41204 34495 61012 83929 49106 -27530 -10742 -73633 -131914 -95376 -72360 -130410 -96061
4469i6061J12916K5675o8044m0362J3039J3682J3621j8163l1927n2704M6410L8759
4457d3159J1127j6176O2200N2826k6029L3070l7428o6140k0965M2590j0754k1902
4445d0740m8063J6226M8178O1805M7167o9123q5201l0748q6477n767P7424J8363
4433i6956O4716L8849M5974O5880J5717m0415L3874m2699o7591j0981l0355J6470
4421g517l344J1023k1456j3161p233o4518O1478N6109m5343L7214K9440k7666
4409E026p1348j3144N6452J7505k083m9921K7959O4669p815J1310p5005R871M8560
4396B2036n1630l3707L3352J3909o309k8339M3055N3166q923J2109p1651l6682
4384e9614l9855n0312L1410J14880J0277j4748L7440l7266k0388K5720R715L259
$$ plain form
4469 -96061 16855 42530 -25514 -65876 -52837 -39155 -25534 -43697 -75624 -128328 -81918 -43159
4457 -43159 -32032 -48208 13992 66818 40789 73859 36431 -29709 -50674 -8084 -18838 -40740
4445 -40740 -88803 -72577 -24399 37406 84573 15450 -69751 -100499 -186976 -192743 -115319 -96956
4433 -96956 -32240 6609 52583 118463 134180 93765 127639 84940 17349 6368 -23987 -7517
4421 -7517 -10861 162 -21294 -34455 -41688 -106206 -44728 11381 -33962 3252 32692 5026
4409 5026 -66322 -79466 -23014 -5509 -7592 -57513 -29554 35115 27300 38610 -36395 -26524 22036
4396 22036 -29594 -63301 -29949 -16040 -22349 -50688 -7633 45533 36610 48719 -22932 -59614
4384 -59614 -99469 -149781 -118371 -3491 6786 -7962 29478 -7788 -28176 -2456 7259 10518
4372A0518j1265p650J5621L99O943r564M473o924j0724P0459l3494k9507O2701
4359F1986j8471j7990m3713M3481o478q4627k1497P1440N4201p8389k2047J7633
4347d4471j8992J8507m4667n4001n7693L8931J09877R4889j7513j04360q394O5262
4335b2625J6200o8310l7901K6457K8071k2589r1670M383K9464J20657K234m5866
4323f1495M7889Q3803L171n4584l8091K3981k7749R2936Q293r4743o5829J8024
4311f4394m7650r8351N7237R9077O1058K3072L680o5785o4615R797K7872o677
4299f5679M1852M5953Q6956j14032r2912R107P0028L3794Q524J4049n0742o5261
4287g8363O989k3025j463J5963k500J5883N564P5302J9521j816J8924n0316l3020
$$ plain form
4372 10518 -747 -8397 7224 7623 14566 5002 9475 2551 -8173 62286 28792 -715 61986
4359 61986 43515 25525 -18188 25293 18815 -65812 -87309 -15869 38332 -40057 -62104 -44471
4347 -44471 -63463 -44956 -89623 -143624 -201317 -162386 -52509 42380 24867 -79493 -87887 -22625
4335 -22625 -6425 -74735 -112636 -86179 -58108 -80697 -172367 -167984 -138520 -17863 -15629 -61495
4323 -61495 -13606 70197 73368 18784 -19307 4674 -23075 69861 78154 -16589 -82418 -64394
4311 -64394 -112044 -210395 -153158 -54081 6977 30049 33729 -32056 -96671 -86874 -59002 -65679
4299 -65679 -23827 22126 109082 -4950 -97862 -88755 -18727 15067 23591 37640 -13102 -78363
4287 -78363 -71374 -94399 -95862 -79899 -82399 -66516 -60952 14350 33871 32055 50979 663 -32357
4274c2357L2140L7916M5137L7278J485m0368j10501j5124N7372J0627K2500Q888
4262E4993k8651p407L2339M1375k9832l3223m1955j7921n26L1830N834l1886q1345
4249a06375j4445O0778K2661J5618m8572L6899Q1227n2616j3640L812l1832O118
4237d0367m788R724L7528N6720m3738m8445N2525L6899k1429k3674l1817l5610
4225e6472K6145l81n7983l324J8476k8514K693k466J0450J1229K1986J4590l4230
4212g7801k8198p66J08005J8023k0035k0009l7197L0828m2138J9176P021m2300
4200h5391o092P2117K6452k6917j0636m5615Q175J5675q947K0456M0622p458J6871
4187I312L3957N4069M1174m1744m8059o0152k7876k8166L1826L324K0354Q8817
$$ plain form
4274 -32357 -217 37699 82836 120114 121599 81231 -29270 -44394 12978 23605 46105 54993
4262 54993 26342 18935 51274 92649 62817 29594 -12361 -30282 -30808 1022 6856 -25030 -106375
4249 -106375 -120820 -60042 -37381 -21763 -70335 -33436 47791 -4825 -18465 -14653 -46485 -40367
4237 -40367 -45155 -35431 2097 58817 15079 -33366 19159 56058 34629 10955 -20862 -56472
4225 -56472 -30327 -30708 -88691 -92015 -73539 -102053 -99360 -101826 -91376 -80147 -58161 -43571 -77801
4212 -77801 -105999 -106765 1240 19263 -772 -20781 -57978 -27150 -69288 -50112 -43091 -85391
4200 -85391 -91483 -19366 7086 -19831 -30467 -76082 -67907 -52232 -61179 -40723 -101 -7559 9312
4187 9312 43269 97338 138512 96768 48709 -11443 -39319 -67485 -35659 -32335 -11981 76836
4175G6836L7143K3802m3448j11192p5399n777N2526Q4691P1373m1317j0573k1292
4163C7373k1515m5425M9923k5064N797K2808l7895m0758o799m475L842J11040
4151D8852L8398J475m7983R38L1509L7549p6681j0945M890m6667k5682K7594J05019
4138H8266M980L8815l744o8573K0575k9533J4389j0018l2619n0165J7580J6457
4126F410k8939L4056M405J8564P1556n6831k9045j150m8060N3083K6052m9512
4114E89j5972j5820J0421q698n3299n0435N6600N0440K4133k4380k521K3709m972
4101a0205J2468J1681L1501M3879m5692k3389n6444q2988l8169M7714O1868K8263
4089a9513P9716R17r827l0614L1965M7950k3787k5643q776l2156j2784r65p0094
$$ plain form
4175 76836 113979 137781 94333 -16859 -92258 -98035 -45509 39182 110555 69238 58665 37373
4163 37373 15858 -29567 20356 -4708 1089 23897 -13998 -54756 -61555 -66030 -62188 48852
4151 48852 87250 88725 40742 41680 73189 110738 34057 23112 28002 -18665 -44347 -16753 88266
4138 88266 93246 132061 128317 59744 80319 50786 65175 55157 22538 -27627 -10047 6410
4126 6410 -22529 11527 15932 34496 106052 49221 20176 19026 -29034 24049 50101 589
4114 589 -15383 -31203 -20782 -29480 -82779 -133214 -76614 -26174 -2041 -26421 -28942 -5233 -10205
4101 -10205 2263 13944 45445 89324 43632 20243 -36201 -119189 -157358 -109644 -47776 -19513
4089 -19513 60203 61120 51293 20679 52644 100594 76807 51164 42388 10232 -2552 -3517 -73611
4076g3611l4110N7497l449K9096o137P1423j7076m4915L5584L8711k1012K1090
4064E3091J9996J6981K7667j0360m5350j4542j6533k7475l8163P490N0423M4191
4052F7416J3765n2231l5907k8611J383K6672L0805m0389j5842k2613m8597M3314
4040f0835M0842q534L0931K5856M1855m272k1664M1471m0547l2006m954k2342
4028a4199M7596M3782J0521k2008q8298m2708K8351M7120P4012l9409k3745n6399
4016c5384K4396q894k8445L5620M7995J7373j7161l4277n1051l635M5241J8088
4004I866Q004m0458k332k9499N3018L6337l2798K1146R021n0003J5713M2189N2555
3991I2759m103K5635k6819p0389k0895p03L0842l743K6542R8065m108m3821m7848
$$ plain form
4076 -73611 -107721 -50224 -53673 -24577 -30714 40709 23633 -21282 14302 53013 32001 53091
4064 53091 73087 90068 117735 107375 62025 47483 30950 3475 -34688 -27198 23225 67416
4052 67416 81181 28950 -6957 -35568 -34185 -7513 23292 -17097 -32939 -55552 -104149 -60835
4040 -60835 -19993 -28527 2404 28260 70115 65843 44179 85650 45103 13097 8143 -14199
4028 -14199 33397 77179 87700 65692 -22606 -65314 -36963 10157 84169 44760 21015 -35384
4016 -35384 -10988 -19882 -48327 -12707 35288 52661 35500 1223 -49828 -53463 -8222 9866
4004 9866 17870 -22588 -24920 -54419 -1401 34936 2138 23284 32305 -17698 -1985 40204 92759
3991 92759 88656 114291 87472 17083 -3812 -4515 26327 22584 49126 147191 143083 99262 51414
3978E1414k725L0239o5039J2594J6837J7965Q351L6037j7705n6264l703l9536
3966a1535m4764L2270j8973p0643M193O031J524L4199M8191r846J795J2562J2926
3953b070j8025J5146j2689K9372M8506n8967p4587L7066K1448O2694k4453j4236
3941I205k6175q16k9230k489k9990J3306J4570l4443P2376P4251N7387m5166r1072
3928a8286q9988N505N3925m6620p081M8307L0219n031M901j9388m1050R375K0123
3915e5089Q8127O2020j0709q7051k2571L4197n9717k735K1749N5434M4499l1599
3903C6555q3725J5012K4357k5284j05449o1567M3533Q2796K2286j0351M29L1309
3891c0099m5488J0535O7520J521n266j8029j9994O829Q8389L783m5984L2332p402
$$ plain form
3978 51414 48689 78928 13889 26483 43320 61285 69636 105673 87968 31704 28001 -11535
3966 -11535 -56299 -24029 -43002 -113645 -109452 -103421 -101897 -67698 -19507 -29353 -27558 -14996 -2070
3953 -2070 -20095 -4949 -17638 11734 60240 1273 -73314 -36248 -14800 47894 23441 9205
3941 9205 -16970 -17786 -47016 -49505 -79495 -66189 -51619 -86062 -13686 60565 117952 72786 -18286
3928 -18286 -108274 -102769 -48844 -95464 -102545 -54238 -24019 -29050 -24149 -43537 -84587 -75212 -55089
3915 -55089 33038 95058 84349 -2702 -25273 8924 -50793 -53528 -31779 23655 68154 36555
3903 36555 -47170 -32158 -7801 -33085 -138534 -200101 -156568 -73772 -51486 -61837 -61408 -30099
3891 -30099 -75587 -65052 2468 3989 -1277 -19306 -39300 -32471 55918 59701 13717 46049 38647
3878C8647q0930j1953K9427P9393O1411k5286o0399k8200p4462J4107l5342k6349
3866a19936M549N3325n678N4043L1374l8126l0383P2574l4864o7674J7165L3011
3854c0620L369M4541k0882j8482L7961N561k5730r719j6773M9809r041l2998p0532
3841i3536N7153M6925O768k9167n2714r276L194j8421J6914O5299j1479P664n6402
3828f7078k197m1051o5204K8910N6659j6895O557R4298N3907l7485k7639R556
3816g662q6137k5699J33551R0737r825r3985o9971P0272O5399J9330k4815J5105
3804G6300p3402j3034k0648r581P575L9281O2771n7164n6754m290L3594J4629
3792g23o0397J289L3013N5859j4367m5457K8262L7076M9051l0607l1461k8091
$$ plain form
3878 38647 -42283 -54236 -24809 54584 115995 90709 30310 2110 -72352 -58245 -93587 -119936
3866 -119936 -115387 -62062 -67740 -13697 17677 -20449 -50832 21742 -13122 -80796 -63631 -30620
3854 -30620 -27251 17290 -3592 -22074 15887 21448 -4282 -14001 -30774 19035 9994 -23004 -93536
3841 -93536 -36383 10542 17310 -11857 -64571 -73847 -70653 -89074 -72160 -6861 -18340 -10676 -67078
3828 -67078 -69275 -110326 -175530 -146620 -89961 -106856 -100299 -6001 47906 10421 -17218 -7662
3816 -7662 -93799 -119498 14053 104790 94965 980 -68991 1281 66680 86010 61195 76300
3804 76300 2898 -10136 -30784 -40365 -32790 6491 69262 12098 -44656 -48946 -15352 -723
3792 -723 -61120 -59831 -26818 29041 14674 -30783 -2521 34555 83606 52999 21538 -6553
3780f553j4978l2019k7872k2170j4934N0960K3773j9368K821l8q738o0227L3133
3767i6210O5494k0802J3124M0059r8574p0300j3948P6284Q9115q430k5699n6951
3755a06838N509M6778N1886R800J767L9829l6117q8362K9178P9792M6171K5303
3743A04696l6006M3321L34m0046j46345n1763N759j4835J15806O3930m3132p0781
3731f9062k7921O0493P9591J3898k3744k3162j0122L184l6432K9942K7652L490
3719B7807j0017q595N0228M1827J7328K693j24752m2803q0601l4869M4886J329
3707a15539O162M7066N2740l7393m5893J0960M5702M6212O4195n661k3515l7230
3695G806J713k3633j05529j365J10111L2415m5500k6410m3719K8180j2757J9898
$$ plain form
3780 -6553 -21531 -53550 -81422 -103592 -118526 -67566 -43793 -63161 -60340 -60378 -69116 -129343 -96210
3767 -96210 -30716 -51518 -38394 1665 -96909 -167209 -181157 -104873 -15758 -24188 -49887 -106838
3755 -106838 -101329 -54551 -2665 7135 8902 48731 12614 -75748 -46570 33222 79393 104696
3743 104696 68690 112011 112345 72299 -74046 -125809 -120050 -134885 -19079 44851 1719 -69062
3731 -69062 -96983 -36490 43101 56999 33255 10093 -29 3155 -33277 -3335 24317 27807
3719 27807 17790 9195 59423 101250 118578 121271 -3481 -46284 -126885 -161754 -116868 -115539
3707 -115539 -109377 -62311 -9571 -46964 -92857 -81897 -36195 10017 74212 68551 45036 7806
3695 7806 9519 -14114 -119643 -121008 -10897 21518 -23982 -50392 -94111 -65931 -78688 -58790
3683e8790J7249l131K3355L9305N0544k3092n8148j041L0365J6922l4362k4445
3671b5269M6501N6295k0598q7251l4637K1154M9856M0753j2268L229O409n225
3659C8949J2747j4090k0152q1888J8651l1779J9612Q80J0064n5824n110L2553
3647g5387L2469N0729K3872K4803K9999M8214r261m8139j8479l0357j095N2973
3635H0341q656q5740k8736l7014J2311Q0668M4906r5741j2793o278n1879K4581
3623h4030K4853l0716j4605L3107K7897M6632l4463l8426L3295J9170P9400J8283
3611H0397r355k7596r803j4637k5408L23K5503j9817J7651o9461j2533M4694o4556
3598h4598J7655K0675m2161L5489L2105l4599o9450m8150n7290M1558M8158L6184
$$ plain form
3683 -58790 -41541 -44672 -21317 17988 68532 45440 -12708 -13749 16616 33538 -824 -25269
3671 -25269 21232 77527 56929 -30322 -64959 -43805 6051 46804 34536 37765 44174 38949
3659 38949 51696 37606 17454 -64434 -45783 -77562 -57950 -57070 -47006 -102830 -107940 -75387
3647 -75387 -42918 7811 31683 56486 86485 134699 125438 77299 58820 28463 27368 80341
3635 80341 71685 -14055 -42791 -79805 -67494 13174 58080 -37661 -50454 -56732 -108611 -84030
3623 -84030 -59177 -89893 -104498 -71391 -43494 3138 -31325 -69751 -36456 -17286 62114 80397
3611 80397 71042 43446 33643 19006 -6402 -6079 19424 -393 17258 -52203 -64736 -20042 -84598
3598 -84598 -66943 -46268 -88429 -52940 -20835 -55434 -124884 -173034 -230324 -188766 -140608 -104424
3586a04424l5176P1688r29K3288N9682O7381K52m6542p704n0763M1182R8638l6682
3573G9891p6725m422L5783J5833J8346m9521j8694J9188l3878R464n388N3M0911
3560C0841k0844n5093p7625N1411N4168K5454j9017p7789j8829J55971L9263p730
3548H0181m0657n6732k3688r682P333O132p0705m2642l7249L010N1857M3024M5017
3535d4801K3252K0052q522K0901J8500l6332k8732L2479L4641k7885j1809R565
3523A309P755J9095l3659o960L8675M5186n1339j31141p142m24J2058N5537J1333
3510c9717k9408J2620L9589R170l0920m1214M0963M2919j2291m2572j3783M3357
3498b1287P5210M0299k066n3760j8422m1737k3633l1041p148L0322K285o446j0438
$$ plain form
3586 -104424 -139600 -67912 -68841 -45553 14129 81510 81762 35220 27516 -23247 17935 116573 79891
3573 79891 3166 -1256 34527 50360 68706 19185 491 19679 -14199 -4735 -10123 -10070 30841
3560 30841 9997 -45096 -122721 -71310 -17142 8312 -10705 -88494 -107323 48648 87911 80181
3548 80181 39524 -17208 -40896 -50578 -43245 -37113 -107818 -150460 -187709 -184699 -132842 -89818 -44801
3535 -44801 -21549 -1497 -10019 10882 29382 -6950 -35682 -3203 31438 3553 -8256 1309
3523 1309 9064 28159 -5500 -12460 26215 71401 20062 -111079 -118221 -118645 -106587 -51050 -39717
3510 -39717 -69125 -56505 -16916 -7746 -38666 -79880 -38917 4002 -8289 -50861 -64644 -21287
3498 -21287 53923 94222 92156 38396 19974 -21763 -45396 -76437 -83585 -53263 -50978 -57424 -67862
3485f7862n242M8497R408p083n9673m3175O8395J0620p929O5725L8257k5397m3104
3472a8563m7436n2441j1041L3151P8054M1159p643J0546m7146k8955K273l5986
3460h4028L6453J1825j0096J6668j9044N3489K025J9915M6960k765j5852r8715
3448d3165o5937M1844M2476K5929q273o6583L6953K5638R924N2879M3530n9433
$$ plain form
3485 -67862 -73104 -24607 -15199 -22282 -81955 -125130 -56735 -46115 -54044 11681 49938 24541 -18563
3472 -18563 -65999 -118440 -129481 -96330 -18276 22883 15240 25786 -21360 -50315 -48042 -84028
3460 -84028 -47575 -35750 -45846 -29178 -48222 5267 7292 27207 74167 71402 55550 -43165
3448 -43165 -109102 -67258 -24782 1147 -7126 -73709 -36756 -11118 -1194 51685 95215 35782
$$ [...]
##END NTUPLES=NMR SPECTRUM
##END=
