##TITLE=Analysis number 329566
Compound Code cc 61901
Project Code adrs
Chemist Name endeavour
##JCAMPDX= 6.0         $$ Bruker NMR JCAMP-DX V2.0
##DATA TYPE= NMR SPECTRUM
##DATA CLASS= NTUPLES
##ORIGIN= Bruker BioSpin GmbH
##OWNER= nmr
$$ XWIN-NMR		Version 3.5
$$ Fri Sep 14 09:04:34 2007 GMT Daylight Time (UT+1h)  MAYBRIDGE\nmr@NMR_250MHZ
##.OBSERVE FREQUENCY= 250.131544655141
##.OBSERVE NUCLEUS= ^1H
##.ACQUISITION MODE= SIMULTANEOUS (DQD)
##.ACQUISITION SCHEME= undefined
##.AVERAGES= 16
##.DIGITISER RES= 18
##SPECTROMETER/DATA SYSTEM= dpx250
##.PULSE SEQUENCE= zg30
##.SOLVENT NAME= DMSO
##.SHIFT REFERENCE= (INTERNAL, DMSO, 0, 16.522)
##AUDIT TRAIL= $$ (NUMBER, WHEN, WHO, WHERE, WHAT)
$$ ##TITLE= Audit trail, XWIN-NMR		Version 3.5
$$ ##JCAMPDX= 5.01
$$ ##ORIGIN= Bruker BioSpin GmbH
$$ ##OWNER= nmr
$$ C:\u/data/dgb/nmr/ADRS/1560/pdata/1/auditp.txt
$$ ##AUDIT TRAIL=  $$ (NUMBER, WHEN, WHO, WHERE, WHAT)
(   1,<2007-09-14 09:04:13.56 +100>,<MAYBRIDGE\nmr>,<NMR_250MHZ>,
      <created by zg, POWCHK disabled, PULCHK disabled
       configuration hash MD5:
       76 6E 9A 78 1E 09 19 81 EC 84 63 8F B0 6A 59 2D
       data hash MD5: 64K
       CF 54 0E 36 E3 B6 71 CF 07 2F AC 96 64 28 C5 BF>)
(   2,<2007-09-14 09:04:25.59 +100>,<MAYBRIDGE\nmr>,<NMR_250MHZ>,
      <Start of raw data processing
       ef LB = 0.3 FT_mod = 6 PKNL = 1 SI = 32K 
       data hash MD5: 32K
       EB 31 59 61 28 B0 2E DC 29 F5 81 29 A8 23 DB 2E>)
(   3,<2007-09-14 09:04:27.31 +100>,<MAYBRIDGE\nmr>,<NMR_250MHZ>,
      <apk 
       data hash MD5: 32K
       D9 21 0A 81 84 2F 74 D8 D1 AA EF 54 16 2C E7 D8>)
(   4,<2007-09-14 09:04:28.02 +100>,<MAYBRIDGE\nmr>,<NMR_250MHZ>,
      <abs ABSG = 5 
       data hash MD5: 32K
       E5 6A AC E0 D9 13 FB 14 69 06 BD 64 83 91 CE 42>)
$$ ##END=
$$ 
$$ hash MD5
$$ 1A D3 72 3A AB F7 A9 12 AD 03 5D FE DE A4 30 BB
##$RELAX= 
##$RELAX= 
##$RELAX= 
##$RELAX= 
##$RELAX= 
##$RELAX= 
##$RELAX= 
$$ Bruker specific parameters
$$ --------------------------
##$DU= <C:\u>
##$EXPNO= 1560
##$NAME= <ADRS>
##$PROCNO= 1
##$TYPE= <nmr>
##$USER= <dgb>
##$AMP= (0..31)
100 100 100 100 100 100 100 100 100 100 100 100 100 100 100 100 100 100 
100 100 100 100 100 100 100 100 100 100 100 100 100 100 
##$AQSEQ= 0
##$AQ_mod= 3
##$AUNM= <au_zg>
##$AUTOPOS= <4 >
##$BF1= 250.13
##$BF2= 250.13
##$BF3= 250.13
##$BF4= 250.13
##$BF5= 500.13
##$BF6= 500.13
##$BF7= 500.13
##$BF8= 500.13
##$BYTORDA= 1
##$CFDGTYP= 0
##$CFRGTYP= 5
##$CHEMSTR= <none>
##$CNST= (0..31)
1 1 145 1 1 1 1 1 1 1 1 1 1 1 1 1 1 1 1 1 1 1 1 1 1 1 1 1 1 1 1 1 
##$CPDPRG= <>
##$CPDPRG1= <>
##$CPDPRG2= <>
##$CPDPRG3= <>
##$CPDPRG4= <mlev>
##$CPDPRG5= <mlev>
##$CPDPRG6= <mlev>
##$CPDPRG7= <mlev>
##$CPDPRG8= <mlev>
##$CPDPRGB= <>
##$CPDPRGT= <>
##$D= (0..31)
0 1 0 0 0 0 0 0 0 0.06 0 0 0 0 0 0 0.0002 0 0 0 0 0 0 0 0 0 0 0 0 0 0 
0 
##$DATE= 1189757052
##$DBL= (0..7)
120 120 120 120 120 120 120 120 
##$DBP= (0..7)
150 150 150 150 150 150 150 150 
##$DBP07= 0
##$DBPNAM0= <>
##$DBPNAM1= <>
##$DBPNAM2= <>
$$ [...]
##$SUBNAM7= <"">
##$SUBNAM8= <"">
##$SUBNAM9= <"">
##$SW= 20.6930455092707
##$SWIBOX= (0..15)
0 0 3 0 0 0 0 0 0 0 0 0 0 0 0 0 
##$SW_h= 5175.983436853
##$TD= 65536
##$TD0= 1
##$TE= 296.16
##$TE2= 300
##$TE3= 300
##$TEG= 300
##$TL= (0..7)
0 120 120 120 120 120 120 120 
##$TP= (0..7)
150 150 150 150 150 150 150 150 
##$TP07= 0
##$TPNAME0= <>
##$TPNAME1= <>
##$TPNAME2= <>
##$TPNAME3= <>
##$TPNAME4= <>
##$TPNAME5= <>
##$TPNAME6= <>
##$TPNAME7= <>
##$TPOAL= (0..7)
0.5 0.5 0.5 0.5 0.5 0.5 0.5 0.5 
##$TPOFFS= (0..7)
0 0 0 0 0 0 0 0 
##$TUNHIN= 0
##$TUNHOUT= 0
##$TUNXOUT= 0
##$USERA1= <user>
##$USERA2= <user>
##$USERA3= <user>
##$USERA4= <user>
##$USERA5= <user>
##$V9= 5
##$VALIST= <valist>
##$VCLIST= <CCCCCCCCCCCCCCC>
##$VD= 0
##$VDLIST= <DDDDDDDDDDDDDDD>
##$VPLIST= <PPPPPPPPPPPPPPP>
##$VTLIST= <TTTTTTTTTTTTTTT>
##$WBST= 1024
##$WBSW= 4
##$XGAIN= (0..3)
0 0 0 0 
##$XL= 0
##$YL= 0
##$YMAX_a= 313943
##$YMIN_a= -401867
##$ZGOPTNS= <>
##$ZL1= 120
##$ZL2= 120
##$ZL3= 120
##$ZL4= 120
##$ABSF1= 16.522
##$ABSF2= -4.171173
##$ABSG= 5
##$ABSL= 3
##$ALPHA= 0
##$AQORDER= 0
##$ASSFAC= 0
##$ASSFACI= 0
##$ASSFACX= 0
##$ASSWID= 0
##$AUNMP= <proc_1d>
##$AZFE= 0.1
##$AZFW= 0.1
##$BCFW= 0
##$BC_mod= 0
##$BYTORDP= 0
##$COROFFS= 0
##$CY= 12.5
##$DATMOD= 1
##$DC= 0
##$DFILT= <>
##$DTYPP= 0
##$F1P= 14.0000005364418
##$F2P= -0.99999901652339
##$FCOR= 0.5
##$FTSIZE= 32768
##$FT_mod= 6
##$GAMMA= 0
##$GB= 0
##$INTBC= 1
##$INTSCL= 1
##$ISEN= 128
##$LB= 0.3
##$LEV0= 0
##$LPBIN= 0
##$MAXI= 10000
##$MC2= 0
##$MEAN= 0
##$ME_mod= 0
##$MI= 0
##$NCOEF= 0
##$NC_proc= -5
##$NLEV= 6
##$NOISF1= 0
##$NOISF2= 0
##$NSP= 0
##$NTH_PI= 0
##$NZP= 0
##$OFFSET= 16.522
##$PC= 1
##$PHC0= -70.39981
##$PHC1= 5.180427
##$PH_mod= 1
##$PKNL= yes
##$PPARMOD= 0
##$PSCAL= 4
##$PSIGN= 0
##$REVERSE= no
##$SF= 250.13
##$SI= 32768
##$SIGF1= 0
##$SIGF2= 0
##$SINO= 400
##$SIOLD= 32768
##$SREGLST= <1H.DMSO>
##$SSB= 0
##$STSI= 32768
##$STSR= 0
##$SW_p= 5175.98343685301
##$SYMM= 0
##$S_DEV= 0
##$TDeff= 65536
##$TDoff= 0
##$TI= <Analysis number 999999
Compound Code 99
Book Reference 9
Project Code 9>
##$TILT= no
##$TM1= 0
##$TM2= 0
##$TOPLEV= 0
##$USERP1= <user>
##$USERP2= <user>
##$USERP3= <user>
##$USERP4= <user>
##$USERP5= <user>
##$WDW= 1
##$XDIM= 32768
##$YMAX_p= 428077197
##$YMIN_p= -213381
$$ End of Bruker specific parameters
$$ ---------------------------------
##NTUPLES= NMR SPECTRUM
##VAR_NAME=  FREQUENCY,     SPECTRUM/REAL,   SPECTRUM/IMAG
##SYMBOL=    X,             R,               I
##VAR_TYPE=  INDEPENDENT,   DEPENDENT,       DEPENDENT
##VAR_FORM=  AFFN,          ASDF,            ASDF
##VAR_DIM=   32768,         32768,           32768
##UNITS=     HZ,            ARBITRARY UNITS, ARBITRARY UNITS
##FACTOR=    0.157963299565203, 1,           1
##FIRST=     4132.6476996994, 0,             0
##LAST=      -1043.33573715361, 0,           0
##MIN=       -1043.33573715361, -213381,     0
##MAX=       4132.6476996994, 428077197,     0
$$ Real data points
##PAGE= N=1
##DATA TABLE= (X++(R..R)), XYDATA
$$ [...]
16365f1579J0669O346K998o31o679l0071n0391J3216N466K6342L347K0401J4565
16352d6001k520l745O6012L6264P1648j034l3307m4363J8824l1039m9299j1767
16340c0327J3472l1846p224K5852K098K9486m6749m5902L628M4734O4988k5686
16328c476j5380k2949K4707M2553L7341k5059m1243m566K2830L6242o380J6304
16316F0924J6258N450j4424l560q853N04L2183M7324J3194k0044l6765l2215k9608
16303C0368N7089l2537q9295M4232M4178L6927l7692k1577j094o548j4304k6608
16291a6861n5404J6318Q7321K2898l5502l1029M8017L1687k5947l451J9237J8551
16279G5835k452j4020p3626l4448N9395K8258l7403j684J0819n66J206J1847k007
$$ y = [-61579, -50910, -44564, -41566, -42197, -48876, -78947, -129338, -116122, -110656, -84314, -80967, -60566, -46001, -48521, -52266, 13746, 50010, 121658, 120624, 87317, 42954, 61778, 30739, -18560, -30327, -16855, -48701, -55925, -30073, -27975, 1511, -45238, -91140, -87512, -42778, 22210, -3476, -18856, -41805, -17098, 25455, 62796, 37737, -3506, -8072, 14758, 51000, 44620, 60924, 77182, 82632, 68208, 64648, 55795, 56299, 88482, 135806, 149000, 128956, 92191, 59976, 30368, 87457, 54920, -34375, 9857, 54035, 90962, 53270, 31693, 30599, 24051, 9747, -16861, -72265, -55947, 31374, 54272, 18770, -12259, 35758, 67445, 41498, 38047, 57284, 75835, 73383, 59363, -14263, -48711, 10684, 38942, 1539, -145, 10674, 10108, 11314, 23161, 21154]
16266B1154r918l6288m0344K3438k4549M6048J04164m8415k504K6350K3246n592
16254G6790l3926l1197K6763J4816N9238k0500o5669m1122o0578L3906P2842j4320
16242A7043Q254J4115J0419q21j7380M904M54m5088j3641J4094L4393M77n478
16229B1745q821J9680M2328l970j0371L2431J8675k5519n2976k952l4702K143
16217b309l0065L3758J296p9616J5829J2905R897K6823k9978m683O8580J8120
16205D0557k2374k3116K6800L0084k1664p2989P136K0891L2148l5040m1399l0173
16193h9139K4454j0614K1742J5569K7599N7039L163q4K9348r07r3n7977k8357
16180h257k5380n9818K8897N5646k9954m4079k4665L4412K760J0642M0107j4072
$$ y = [21154, 11236, -25052, -65396, -41958, -66507, -20459, 83705, 35290, 32786, 59136, 82382, 76790, 42864, 11667, 38430, 53246, 112484, 91984, 26315, -14807, -75385, -41479, 31363, 17043, 25297, 39412, 49831, 49010, 31630, 36534, 36988, -8100, -21741, -7647, 26746, 27223, 21745, 12924, 32604, 74932, 70962, 60591, 93022, 111697, 86178, 33202, 30250, -4452, -2309, -32374, 1384, 2680, -76936, -61107, -48202, -38305, -11482, -41460, -46143, 22437, 40557, 18183, -4933, 21867, 51951, 30287, -42702, -35566, -14675, 17473, -17567, -58966, -89139, -64685, -75299, -53557, -37988, -10389, 46650, 49813, 49729, 79077, 78170, 78077, 20100, -8257, -33637, -93455, -64558, -8912, -38866, -82945, -107610, -73198, -70438, -59796, -19689, -33761]
16168c3761j3385l2872M82r777l853J5586k0193N476M4589K3827L9441M6998l0042
16155C2516R275k3214O351j633j86k2507K358k1673k9137M9623N854L403R167
16142B0197M9888L1222J7883k809m9214n9637q074k6972k8331L216R88J9677L7707
16129E741p868k8870J4250J8867j6439m5768k2699L0718J4742j6719J4899M5458
16117F312N314J584m851J9466N815k0411L5362M3130p2986j6747m2165J2630K5279
16104b268q11m3381K2180j8276k3521L6393J3172O4184K8468k5955K7543k0121
16092E7607l3034k0873M863J5695L3178j4793l1642n8673L2346R637K1224N6697
16080G2232K2521p0706l7449P330L64L3042K0808k0700K4839L7894k7561o9222
$$ y = [-33761, -47146, -80018, -79536, -89313, -93166, -77580, -97773, -92297, -47708, -23881, 15560, 62558, 32516, 41791, 18577, 24928, 23295, 23109, 602, 2960, -18713, -47850, 1773, 7627, 11030, 20197, 70085, 101307, 119190, 116381, 67167, 7530, -544, -27516, -55847, -52631, -51643, -31966, 5741, -2127, -30997, -16747, 2120, -14319, -60087, -82786, -52068, -37326, -54045, -39146, 6312, 11626, 13210, 8359, 27825, 33640, 13229, 48591, 91721, 18735, 1988, -40177, -27547, -2268, -3079, -46460, -24280, -42556, -66077, -29684, -16512, 47672, 76140, 50185, 77728, 57607, 24573, 3700, 8563, 24258, 57436, 42643, 11001, -47672, -15326, -5689, 15535, 72232, 94753, 24047, -13402, -6072, -5708, 27334, 48142, 27442, 52281, 90175, 62614, -6608]
16068f608p6286M0215N956Q029N1263J5021m0267m5660K8996j3399l4052J033
16056f5759J3732J2550j8058J2525L9197K547K8074L4450L2722m4662p9599p307
16044c9588N1975O253J2717k4389l2989N995J0331j0280j4408l4069K5459M5856
16032B863K1427j1779o9521l4379Q9381O0296K471k6243p6841K4098K7988R697
16020A9458M5368o416m8090J0944M762n122K5761k2315m6180j8422n6835m2019
16008a39106M2573K0574J5009P143R782j8459M076J8133J5803l5332k8217L0036
15996e7985K4484K1773q6995P711O6427k4666l2974P630K7238L2792J7595j3462
15984a0432j5595m2335K2548J1666j0249L514J6640k5282l5914k2098M4819j3031
$$ y = [-6608, -82894, -42679, -36723, -28694, 22569, 37590, -2677, -48337, -19341, -32740, -66792, -65759, -52027, -39477, -57535, -45010, -5813, -3266, 24808, 59258, 91980, 47318, -32281, -39588, 12387, 18640, 31357, 6968, -26021, -20026, -9695, -19975, -34383, -68452, -42993, 2863, 24290, 12511, -57010, -91389, -2008, 58288, 60759, 34516, -42325, -18227, 9761, 19458, 64826, 58410, 10320, 21264, 26026, 20904, 46665, 24350, -21830, -40252, -97087, -139106, -96533, -75959, -60950, -53807, -44025, -62484, -58408, -40275, -24472, -59804, -88021, -57985, -33501, -11728, -98723, -91012, -24585, -49251, -82225, -74595, -47357, -14565, 3030, -10432, -26027, -68362, -45814, -34148, -44397, -40883, -24243, -49525, -85439, -107537, -62718, -75749]
15972g5749J0552Q1154M7195K2462m5128k5483R554l8253k4649O6180l313R143
15960C3665m7549k9068o0907l95M0366M5116P8520Q560p4802j7296k742k186o437
15947c5155l1987L3501K9720N142N0349J2538M0492r470m0211m6097o4807l318
15935e9303k981j6066q114L9465O0927N4069o639q377J8309J2715k6058J7755
15923G5702k5893n9054o6762n4905O4430M7972K748o609j7535L3668K3454j3603
15911C613l1333o889L2383O1601N4765J1243j2235n3220n851K3104l6105l2523
15899H553m9675k1898J9091m325K0051k6021P891K9386j0332j5574o751K1769
15887b7835k5154L520j7488l2236R4823O9881O526j5149o1805j0380M2265J3885
$$ y = [-75749, -65197, 15957, 63152, 85614, 40486, 15003, 24557, -13696, -38345, 27835, 24522, 33665, -13884, -42952, -103859, -104254, -63888, -18772, 59748, 68308, -6494, -23790, -26532, -28718, -35155, -67142, -33641, -3921, 1221, 51570, 64108, 104600, 95130, 54919, 8822, -55985, -59303, -62284, -78350, -86464, -46999, 13928, 67997, 61358, 52981, 71290, 84005, 57947, 75702, 49809, -9245, -76007, -130912, -66482, -18510, -15762, -22371, -39906, -6238, 17216, 3613, -27720, -34609, -2226, 59375, 114140, 125383, 113148, 59928, 54077, 77181, 41076, 8553, -41122, -63020, -43929, -48254, -28203, -54224, -46333, -16947, -27279, -42853, -49604, -27835, -52989, -49469, -66957, -99193, -4370, 65511, 72037, 56888, -4917, -15297, 26968, 40853]
15875D0853k9417m7499J5399L3109j8032K138k5162l7723m9263k7384L8310P1707
15863c2964J2558J8769J5652k3894r180j0685k3065L7220M0478j8359l8511J4558
15851a7423m0979K4414M1784L2325j9143o6306M913p065L0950J7457J9618m0103
15839a9558n9013j8210M0599M0351O1012j7366j6861K8305j1357n895j9994K3205
15827B5218K4004J7917p7903n5648r781L1728J244L2270q18n882k2030k7720J9565
15814d7836Q8143L5178o7420r918l1848M3505Q2379k7073m0891l4684k8514L216
15802c5763l1402o632L3627M2685p768k2396K9973j332n8255k9982l4175K1094
15790a00326N9627L033K149L6772L3744p626j8956n8899l778K3544k3004k4372
$$ y = [40853, 11436, -36063, -20664, 12445, -5587, -3449, -28611, -66334, -115597, -142981, -104671, -32964, -20406, -1637, 14015, -9879, -19059, -29744, -52809, -15589, 24889, 6530, -31981, -17423, -58402, -33988, 7796, 40121, 20978, -45328, -40415, -47480, -16530, 927, 20545, -19558, -78571, -96781, -56182, -15831, 45181, 27815, 10954, 39259, 27902, 22007, 2013, 25218, 49222, 67139, -10764, -66412, -76193, -44465, -43221, -10951, -11769, -17651, -39681, -67401, -47836, 40307, 75485, 8065, -1853, -33701, 9804, 92183, 65110, 24219, -10465, -38979, -35763, -67165, -73797, -40170, 2515, -5253, -27649, 2324, 992, -57263, -87245, -121420, -100326, -40699, -37666, -35517, 1255, 34999, 27373, 8417, -50482, -54260, -30716, -53720, -78092]
15778g8092J4198P5481Q827K1123O9417J4488r856k5294m6161k5697O561J0016
15766C5011k5269m7136J3326N4073j8955J4246j0708J0878k5114j1941k609o129
15754b0327j2482j5717K1781p107N223l2997j4137K3497o043J0260Q034K3958
15742a6057J6099J6823j096N6130k9262l8761k2379L1578J2038L5296o4828m2063
15730d6482N941K2203R123N2001O0222l5543L8791j6087o8181o0382M881L8973
15718E460M2144j8963k9568L282M9015J9315j9820j12204M0200J2176J8881O7002
15706G6920O2419j2532o8328l4927m7700J246L3532O2007P7127o7098r5592l660
15694a6586J9522k2091m2690p2086K3145L0379N5266J5416m0440j9218J056K9205
$$ y = [-78092, -63894, 11587, 20414, 41537, 110954, 125442, 115586, 90292, 44131, 18434, 24995, 35011, 9742, -37394, -24068, 30005, 11050, 25296, 14588, 25466, 352, -11589, -14198, -20327, -32809, -48526, -26745, -33852, -28629, -61626, -75763, -52266, -58309, -48049, -40015, -16057, 42, 16865, 15769, 71899, 42637, 3876, -18503, 13075, 25113, 60409, -4419, -46482, -40541, -18338, -9215, 42786, 103008, 67465, 106256, 90169, 21988, -38394, -33513, 5460, 47604, 28641, -927, 2355, 51370, 70685, 50865, -61339, -21139, -8963, 9918, 76920, 139339, 126807, 58479, 23552, -24148, -22902, 10630, 72637, 149764, 82666, -12926, -16586, 2936, -19155, -61845, -133931, -110786, -80407, -25141, -9725, -50165, -69383, -68327, -39122]
15682c9122j2818K5253K9210J7257M4980N79n007J0104l0265l9500n7565J0150
15670d6744j8308l8339L962L4115Q5573M1458j5197J385L7049n3456q6402J3378
15658d1526K1146k4129j6919J5326K7837J6256l778O031k4446k7013j0013j3554
15646g4782K4995K8337l9613k690K9753L4604O290k0252l0256L4460L1222k6667
15634d599m2426M4101M1550k8304j8208M7076K6196m5428m1556j8473O7J6622
15622b3382O7778O356p5321j1788L1897K3778k2340M353L7231k7876k7400J1640
15610e074l563N407J3923K0029k2492k4705K7248Q176M387k7049j4540L4648L9816
15597E6211q766l5188j4643o3741K133M9054K1015l914Q491o4802K1798K9444
$$ y = [-39122, -51940, -26687, 2523, 19780, 64760, 65339, 60332, 70436, 40171, 671, -56894, -46744, -65052, -103391, -99429, -65314, 20259, 61717, 46520, 47905, 84954, 31498, -54904, -41526, -20380, -44509, -61428, -46102, -18265, -2009, -5787, 244, -24202, -51215, -61228, -74782, -49787, -21450, -61063, -63753, -34000, 604, 6894, -13358, -43614, -9154, 22068, -4599, -47025, -2924, 38626, 10322, -7886, 39190, 65386, 19958, -21598, -40071, -40004, -23382, 44396, 50752, -24569, -36357, -4460, 19318, -3022, 1331, 38562, 10686, -16714, -5074, -8637, -3230, 10693, 30722, 8230, -16475, 10773, 18949, 23336, -3713, -18253, 16395, 56211, 47445, 12257, -2386, -66127, -63994, -14940, 6075, 2161, 10652, -54150, -32352, -2908]
15585b908j8469O2236N8397k2374J916m0782n6847l7395O996M7860P826j9589
15573a3133j5482l8427l0956j1737k0557J7018Q0950j2103L244l267L4780O0391
15561E0721J0784q195j4050K2396l924K4160o9370J6824N7188l8716o4665J0125
15549f722K2425l4593n903j7902Q115L7732k3182J2735l0550j0647P0038J8119
15537C9665l1363m8180j3117J5233j3025k5090r49Q467L1633K1882l5573l5753
15525h6170M3329Q0824K3061k4755o323j8731N814j2319r882m7287K1099J6610
15513a4730K2184N845L2956j9183n6096j4345J7552O1802K5975o3289m2807k2737
15501f6873N5617K0457M1107l8318L833J6895J7604m2457m4392Q195k0289m8889
$$ y = [-2908, -21377, 40859, 99256, 76882, 78798, 38016, -18831, -56226, -49230, -1370, 6456, -13133, -28615, -67042, -97998, -109735, -130292, -113274, -32324, -44427, -41183, -44450, -9670, 50721, 61505, 53310, 39260, 61656, 57732, 81892, 12522, 29346, 86534, 47818, -16847, -6722, 15703, -18890, -24793, -42695, -34580, 3152, -20030, -7295, -37845, -48492, 21546, 39665, 8302, -39878, -52995, -37762, -50787, -75877, -76826, -68359, -36726, -14844, -50417, -86170, -42841, 37983, 61044, 36289, 29966, 11235, 17049, 4730, -5152, -52439, -31340, -14730, 7454, 13299, 46255, 27072, -29024, -43369, -25817, 35985, 61960, -1329, -44136, -66873, -11256, 9201, 50308, 11990, 15823, 32718, 50322, 7865, -36527, -28332, -48621, -97510]
15489i7510M8373K5947K1724k2331q0804j9388Q0764O2496k921J323L8152L849
15477E9674r748K2762K9608K2622j4363n4820L5746Q385R436o6324r7001l0571
15465h4594L628O3663J4665k8737R213J265j8099j3062m962O3611N5160l8554
15453B3197j9992M6726J1041n9265M3181J9750K1369m3716m0612K3633l6570q592
15441a9850M1701O327K4559Q090J5194j0992j9809J6466L3260k6415m9286p2646
15429e3401J3298Q966P482K728Q709J4851K7643j4918j8761l7806j3967J7305
15417c7871L8315L0171K2298o700J6627M4027M8660M266k6242m3820p7924k5378
15405a3571n993k5579j0108L7503M5763k9063k7673k6212R1N511j4547m848L5923
$$ y = [-97510, -49137, -23190, -1466, -23797, -104601, -123989, -43225, 19271, 16350, 17673, 55825, 59674, 49926, 72688, 102296, 124918, 110555, 55735, 91481, 99866, 109302, 42978, -54023, -84594, -80966, -17303, -2638, -31375, -22162, -20897, -38996, -52058, -57020, 6591, 61751, 23197, 3205, 49931, 60972, 1707, 44888, 64638, 86007, 42291, 1679, 25312, -11258, -19850, 21851, 28178, 52737, 60827, 76021, 65029, 45220, 61686, 94946, 68531, 19245, -53401, -40103, -31137, -23655, -20927, -12218, 2633, 30276, 15358, -3403, -41209, -55176, -37871, 444, 30615, 52913, 46213, 62840, 106867, 155527, 159793, 133551, 89731, 11807, -13571, -19564, -45143, -55251, -17748, 28015, -1048, -28721, -54933, -54842, -49331, -63878, -68726, -32803]
15392c2803q209L024J8583L5911J3006m2683J172J8040J3358j5459P525l3041
15380b1576j5602j5479J557K6908j747k4058Q1740l1968l7728Q6L6414L4110n6667
15367b4010j7399P371j3324N117K7150j8747l147N50N248L1334k7O1456n091n0284
15353F197o647K5055p974l768M5165n040l2314L115m6320m0926j9893K6116L2301
15340b4933k2516N113M7751J5559l971j4834M0765K3990o603k5425j9297l6054
15328b0455J3497N1976N1119Q550k9042N3272R370j4980o6886p9678j6459M3394
15316C678l140L9911J5362k3607n5314m1372o5386N793P5963N8382K0945k7013
15304D202J770j0609l2968L9797J7503n547k9432l0498o841L0062m2138J6262
$$ y = [-32803, -41012, -37988, -19405, 16506, 29512, -13171, -11999, 6041, 19399, 3940, 11465, -21576, -37178, -52657, -51100, -24192, -25939, -49997, 31743, -225, -37953, -37867, -1453, 32657, -24010, -41409, -34038, -47362, -42245, -15095, -33842, -36989, -36439, -31191, 143, 116, 61572, 56481, 6197, -450, 24605, 16631, 12863, 58028, 52988, 20674, 23789, -22531, -63457, -83350, -57234, -24933, -47449, -42336, 5415, 20974, 17003, 2169, 42934, 66924, 60321, 34896, 15599, -20455, -6958, 45018, 96137, 104687, 75645, 128917, 138287, 123307, 56421, -23257, -39716, 3678, 538, 40449, 55811, 32204, -23110, -64482, -129868, -124075, -48112, 10270, 31215, 4202, 5972, -4637, -37605, 2192, 19695, 14148, -15284, -45782, -52623, -22561, -64699, -48437]
15292d8437L1205L2008J1007J3039j3045p91k8086j6188K6023k1707m7276J8628
15280d3620J7520k4964m6229j2314M7166M4003L7811j5944m0745N865J636j9470
15268d9285j3170J4955L3956N0758K7900j9060j5061l0055l0195J0975L4698l4398
15256a7982J8542r199l4199n4528N0856J6178m9952J9255J4261L8338K6883l2070
15244a3617P35Q439K7581l0796k4405l6618j2906K3701J8402J0148J0699j01086
15232a19723k4938K4037K3809m787K5600K949l3699j0220L6080R0659R978j7116
15220B629k8513J3579m188n337l140N314J6602k2197k5253j664k0187N6634j8297
15207c4018K427J2285J5616k7032l0799l676J2932K7512R640k4840L4104j5357
$$ y = [-48437, -17232, 14776, 25783, 38822, 25777, 24986, -3100, -19288, 6735, -14972, -62248, -43620, -26100, -51064, -97293, -109607, -62441, -18438, 19373, 3429, -37316, -31451, -29815, -49285, -62455, -47500, -13544, 37214, 65114, 46054, 30993, 938, -29257, -18282, 16416, -17982, 560, -8639, -42838, -97366, -46510, -30332, -80284, -61029, -46768, -8430, 18453, -13617, -12882, -4443, 23138, -7658, -32063, -68681, -81587, -57886, -39484, -29336, -18637, -119723, -144661, -120624, -96815, -101602, -76002, -73053, -106752, -116972, -80892, 9767, 19745, 2629, -25884, -12305, -16493, -21830, -24970, -19656, -3054, -25251, -50504, -52168, -72355, -15721, -34018, -31591, -19306, -3690, -30722, -61521, -65197, -52265, -24753, -15113, -39953, -5849, -21206]
15195b1206k8720j4816K9495J6836n2493M7968J6444j2599N3587j7381n2787Q584
15183b7088J0940n229k376k360M9321M8977l5753o5290q734r053k2234k2009J8033
15170g2855P3456M5853j4887k581k0612L5635o210n9733j6208k314K3627P329
15158i500m733J7486l1220m8597j674O327n173l8891J4811Q4663R65m7564j2773
15145g5873J2229P854M10J140q787K2940L6759Q031L196m103l71M6553K7532j0270
15131F7240Q290K2163k3412k863K0900l1871m7412j2949J1333J8296K3369p642
15119D5442L6134L5500j2547k1024p9393k6191K7905N1768j7402k5913L3657L6779
15107H4715k2040o0967m9891r693L3743r813N0882Q19J0446p722K4358l6671m6880
$$ y = [-21206, -49926, -64742, -35247, -18411, -70904, -22936, -6492, -19091, 34496, 17115, -35672, -27088, -16148, -21377, -23753, -26113, 23208, 72185, 36432, -28858, -37592, -46645, -68879, -90888, -72855, 601, 46454, 31567, 28986, 8374, 44009, 37799, -21934, -38142, -40456, -16829, -9500, -14233, 3253, -27967, -76564, -78238, -71911, -77084, -115975, -101164, -16501, -15536, -63100, -75873, -63644, -55790, -55380, -54240, -63027, -40087, -3328, 4703, 7899, 3796, 3425, 49978, 77510, 67240, 75530, 97693, 74281, 71418, 92318, 60447, 13035, 86, 11419, 29715, 53084, 45442, 81576, 117076, 104529, 83505, 4112, -22079, 5826, 57594, 40192, 14279, 47936, 84715, 62675, 1708, -48183, -57876, -24133, -33946, 16936, 17755, 28201, 20479, 44837, 8166, -38714]
15094c8714M7258Q03r7246m6352l5633K9704M3453Q780K3681M2395M6302J8221
15082D2652l0753o0697P523j4372k3963M6887l6874l9968j3933P795L6837o533
15070h5399L1242R293Q258J978K0513K7660M8599k1478l9313l1275J0304J4013
15058e605l1312j9471O433L4401J5220J2827L177r291L0309k5337j4372L1467
15046B8446o507J1237J1090J1062k3402n9659K1797J0682J254N0048l2666j1455
15034A1927l7217J0881M2593J2789m0502l6729l9850R827L7194K9872P035L7856
15022D5676j0666L1731j4262j4792K254j8629M1025L041N079K4988l4387m5836
15010A5222l7739k3742Q755P4000m2507q7267O5248j7679P561N3443Q6725k16
$$ y = [-38714, 8544, 9347, -87899, -134251, -169884, -140180, -96727, -87947, -64266, -21871, 24431, 42652, 11899, -48798, -41275, -55647, -79610, -32723, -69597, -109565, -123498, -115703, -78866, -85399, -54157, -44864, -36606, -34628, -14115, 13545, 62144, 40666, 1353, -29922, -19618, -5605, -36917, -56388, -49955, -15554, -334, 12493, 15670, 6379, 36688, 11351, -3021, 28446, 21939, 33176, 44266, 55328, 31926, -27733, -5936, 4746, 6000, 56048, 23382, 11927, -25290, -14409, 28184, 40973, 471, -36258, -76108, -66281, -29087, 785, 7820, 45676, 35010, 66741, 52479, 37687, 39941, 21312, 62337, 65378, 70457, 95445, 61058, 15222, -22517, -46259, -37504, 36496, -6011, -93278, -28030, -45709, -38148, 15295, 102020, 101804]
14998A01804r2503m1923Q183K4941P34K931L1331j9738l11k8665L3011j3608m5865
14985c9678J696O6901j1381j4648j9094K5918j4251K713J0986J3232J187l1618
14973h037k2236m004k7452J2027L1457m1228j9760Q0982O0886O300r714j0935
14961D8286J1093P275R981j9639n4957J773K0043k2547M690r227o201K3238N9400
14948G3208l5924l7715n7036j6739k0360K280J4533k5377K6756J17273L7594l9369
14936C9124k8303L6m609J1139M1473J6357p894m7411l7394K2975m9239q152K6144
14923b5754M2223O832K4592o2405n6554L0260N6172Q622l1699j5421M2389J3146
14911C2403J6772n0179m2724J8168p2305K3894j4719Q884p642k2951L9443n20
$$ y = [101804, 9301, -32622, -24439, 502, 1236, 4167, 35498, 15760, 15449, -13216, 19795, 6187, -39678, -37982, 28919, 17538, 2890, -16204, 9714, -4537, -1824, 9162, 22394, 23581, -8037, -30273, -34277, -61729, -49702, -18245, -59473, -79233, 1749, 62635, 68935, 59221, 48286, 59379, 66654, 76635, 56996, 2039, 3812, 23855, 1308, 5998, -3229, -9430, 13808, 73208, 37284, -431, -57467, -74206, -94566, -92286, -77753, -103130, -76374, 40899, 78493, 39124, 10821, 10857, 6248, 17387, 58860, 75217, 67323, 19912, -17482, 5493, -43746, -51898, -25754, 16469, 23301, 47893, -14512, -71066, -40806, 15366, 23988, -7711, -23132, 19257, 32403, 49175, -1004, -43728, -25560, -97865, -73971, -88690, -79806, -87448, -110399, -70956, -71476]
14899g1476N859m6088J4731J225r507M4813M3235j2375k3819m918L1099O703Q182
14886a2336j0572k4140M6067M1404N947J173j8887K2579m3627m8005J8862M3653
14874B2118J1514J887l8115j4537J6939k0541k1346m5575L498L323J5383M9288
14862a6164M5447M50J9992M9464l9281k256K1754M1346j7878n033l0404p6570
14850i133m0654j0858K4887k0246l6692J7500N8359L6204j0200J3484k8875J5405
14838I181K9288L5561j5323n561k3791k4799J4505J4960K398M3752q116k9735
14826D2320m700n5916m1284m5242l290O7843K8388M7074K6726o884k4365K5487
14814E6157l778K0730J1428m4472k5579m7672j5828R1279J5757p9790L4612J1426
$$ y = [-71476, -65617, -111705, -96974, -95749, -105256, -60443, -17208, -29583, -53402, -58320, -27221, -20518, -12336, -22908, -47048, -981, 40423, 46370, 47543, 28656, 51235, 7608, -40397, -21535, 22118, 33632, 35519, -2596, -17133, -194, -20735, -42081, -87656, -84158, -80835, -65452, -16164, 29283, 29733, 49725, 99189, 59908, 57652, 79406, 120752, 102874, 97841, 67437, -9133, -49787, -60645, -35758, -56004, -92696, -75196, -16837, 19367, 9167, 22651, -6224, 9181, 38469, 74030, 58707, 53146, 29355, 4556, 19061, 34021, 36419, 80171, 72055, 42320, 37620, -18296, -59580, -104822, -108112, -40269, -11881, 35193, 61919, 55035, 30670, 56157, 52379, 73109, 84537, 40065, 14486, -33186, -49014, 42265, 58022, -21768, 12844, 24270]
14802B4270K5067k7717k1069j6589K4463k4629k8835r856j6921l8098k6187O8392
14790f7709Q0553m3162k1662J7218n9008l2214L3747K2702J4060M9264J4690P265
14778A5744k7636o958R064j4824J5225n911Q958l328k9907J6136K6910Q732J9066
14765C1271P212j1817n1453k4501K6360Q3511K4542k5467l9909K3033n7786n8381
14753g3385J5680J6023L2098k6804J00M4153R663p558L3956k1904n5724L8055
14741D353j239j9263m462n047k8556j5955O4629M4903N788L651K7944K5145o2228
14728C9663n9251j5519l708l755R999J5243M5799l0222j4285N2383N5537n1890
14716C9994M000J4922N5953k041k1485n0843k0490K1158K7959K4839q1197l5605
$$ y = [24270, 49337, 21620, 551, -16038, 8425, -16204, -45039, -54895, -71816, -109914, -136101, -67709, 12844, -30318, -51980, -34762, -93770, -125984, -92237, -69535, -55475, -6211, 8479, 15744, -11892, -18850, -9786, -24610, -9385, -15296, -6338, -9666, -39573, -23437, 3473, 12205, 31271, 38483, 26666, -24787, -49288, -22928, 60583, 85125, 59658, 19749, 42782, -15004, -73385, -57705, -41682, -9584, -36388, -36288, 7865, 17528, 9970, 43926, 22022, -33702, 4353, 3114, -16149, -20611, -25658, -54214, -70169, -5540, 39363, 45151, 48802, 76746, 101891, 39663, -19588, -35107, -38815, -42570, -32571, -17328, 28471, -1751, -16036, 36347, 91884, 39994, 43994, 58916, 114869, 112828, 91343, 40500, 20010, 41168, 69127, 93966, 12769, -22836]
14704b2836J3479q491J710j5327p687J122K3465m5498l5683K4095J3157Q2469
14692B3975M8509m4205M077O5571L5727k4693L518l1840o7088j8682N016J9432
14680A9317o624j9280o992J7414J9501j0840Q016L117m0379M4399O6769M0658
14668A35076k4549l0247k3612m2409m3503J030N175K0759M2408j2471M755q538
14656B3874o953n7301l4793K6942Q879k4759O9637P3874j5917p9896o725N1412
14644B8274j3183l1977k1352j757N9534R986k2815k1294p453r531q477N2593L8108
14631E0656J5223l1713m5902l4251j8185O621k1512N2876L2371l767N0639j2245
14619D0811n5142j0261J1938k8235J4961O8941J8732J5692O905N683p605j4613
$$ y = [-22836, -9357, -17848, -16138, -31465, -39152, -38030, -14565, -60063, -95746, -71651, -58494, 23975, 72484, 28279, 32356, 97927, 133654, 108961, 112479, 80639, 13551, -5131, -115, 19317, 12693, -6587, -13579, 3835, 23336, 12496, 20512, 23629, -16750, 27649, 94418, 135076, 110527, 80280, 56668, 14259, -29244, -28214, -23039, -2280, 40128, 27657, 32412, 23874, 16921, -40380, -75173, -48231, -39352, -64111, 5526, 79400, 63483, -16413, -23138, 28274, 15091, -16886, -38238, -39995, 19539, 29525, 6710, -14584, -22037, -31568, -40045, 12548, 50656, 65879, 34166, -11736, -45987, -64172, -57551, -79063, -26187, 6184, 2417, 53056, 40811, -14331, -24592, -12654, -40889, -25928, 43013, 61745, 77437, 84342, 90025, 82420, 67807]
14607F7807m8823n4381L8057O9684K6891j9273n4303l0546j3627j0334N5100m0780
14595a4528j6144J5175r374N0256K2421j6901J7513K8448N1038l37n1685m6883
14583B8999r147J3707M58J675k3847m5045J2704J2967j7140K9337K4227M9908
14571G8803K7298Q209p658m2252j1475l7757l1720j6546L0664K3062K7359l7805
14559A0182j6313M0925J8818m5645m7320j204P26j2717J246J7498M6678L9629
14547E2503n8763J9485L2929j1598J7127M0411O917N066K3882k2535n8693m2496
14535D235n5847J6986P4409J622l5412j2616k9168K2133L5731o511l9410J228
14523b2620M0192O687j6103O132k8278k3520j3302K3307N4613L838L0487K038
$$ y = [67807, 18984, -35397, 2660, 72344, 99235, 79962, 25659, -4887, -18514, -28848, 26252, -14528, -30672, -15497, -24871, 25385, 47806, 30905, 48418, 76866, 127904, 127567, 75882, 28999, 19852, 33559, 34017, 35692, 11845, -33200, -20496, -7529, -24669, 4668, 28895, 78803, 106101, 114310, 106652, 64400, 52925, 15168, -16552, -33098, -2434, 20628, 47987, 10182, -6131, 34794, 53612, 7967, -39353, -40557, -39831, -52548, -51302, -33804, 12874, 52503, -6260, 13225, 46154, 34556, 51683, 92094, 99011, 104077, 127959, 105424, 46731, 4235, -51612, -34626, 39783, 41405, 5993, -6623, -35791, -13658, 22073, 15562, -23848, -22620, 17572, 24259, 8156, 14288, -13990, -37510, -50812, -27505, 27108, 30946, 61433, 63471]
14511F3471k8783k558L430k7164l0639l252J1824J4800L942l8950k9764J2894
14499e0749J2379p070N477Q652K9333k622K2878M1401m988n4806k9777J554m4331
14486g2669J2023l7836K9211N0225K4870L901j9172l5312k4442l146M8115O5444
14474D1212j6323j34M1674K4507K0665k2045k6418m4566j711J9443L7625L2044
14462A05973J2040l951m7162p3783J3862L9579J838k079Q182m2303k8890K1623
14450D929K4556J7059N1358l783m2208m5792k2824M5614m1706m3780l7100o377
14438a00054L7552L5454Q561n0210j6626O0761O3471L7240O396l0881j3149j0790
14426B7725K6302K395M932k5458n2692l5509k0440L9354K5693j0788k7624L0040
$$ y = [63471, 34688, 32130, 35560, 8396, -22243, -25495, -13671, 1129, 5071, -33879, -63643, -50749, -38370, -45440, -39963, -31311, -1978, -4600, 18278, 59679, 54691, -115, -29892, -28338, -72669, -60646, -98482, -69271, -19046, 5824, 9725, -9447, -44759, -69201, -72347, -24232, 41212, 24889, 24755, 66429, 90936, 111601, 89556, 63138, 18572, 16861, 36304, 73929, 105973, 118013, 114062, 66900, -6883, 6979, 46558, 48396, 46317, 54499, 12196, -16694, 4929, 29485, 46544, 97902, 94119, 51911, 6119, -16705, 28909, -12797, -56577, -93677, -100054, -62502, -27048, -18487, -68697, -85323, -24562, 38909, 76149, 82545, 51664, 38515, 27725, 54027, 56422, 61354, 35896, -16796, -52305, -72745, -33391, -7698, -18486, -46110, -16070]
14414a6070J8802l0765J6070J5702j0789j8457L6089K4457j5072J2677j8093l9097
14402b4546j1049q5997L4960N7012j6684O967K6941O055M9960K3688j204o773
14390E9330N8908k0649l9367j7394l8098q6622l6109L3752K8283O5984M5854K9546
14378H3418m5612n9748q097m8132K4909K0178J9973q103O509N0328K8869m8584
14366A5908l6149j6012N419N355P54N4367M8512P786M309l6713k3248m7859k1739
14353c9310M7263K5466K3896J0406q8865K2012M6554J7964p360J6740j0917k3015
14341D0834M303L2323k985J473M783k3591k9159l2339j5468K5354Q68q012M6374
14328D4758J0633n0597m1972N23L1078n176n680J5890j6080k1697m1103K3878
$$ y = [-16070, 2732, -28033, -11963, 3739, -7050, -25507, 10582, 35039, 19967, 32644, 14551, -24546, -35595, -121592, -86632, -29620, -46304, -39337, -12396, -6341, 43619, 67307, 66103, 59330, 118238, 97589, 58222, 40828, 2730, -83892, -120001, -86249, -57966, 8018, 53872, 83418, 37806, -21942, -30039, -78171, -53262, -33084, -13111, -21214, -14705, 35623, 64492, 15908, -20241, -36253, -30834, -25479, -24725, 29642, 78154, 85940, 90249, 53536, 30288, -17571, -39310, 7953, 33419, 57315, 67721, -21144, 868, 47422, 65386, 58026, 74766, 63849, 40834, 45137, 77460, 74475, 75948, 80731, 57140, 27981, -4358, -19826, 5528, 6396, -1616, 44758, 55391, 4794, -37178, -36655, -5577, -10753, -16433, -543, -16623, -38320, -79423, -55545]
14316e5545L5324j2566l347o961P6731k6090K1346j4678j1175L889J7717k7691
14304c046m0803j8362O1987K941r200M1549o903m1409k4312M7773L6398M3420
14292I0033o940o6341L4492j9302J1189o179k380J1379Q863Q08j3768j7548J812
14279B6118l1859j1027P161n2011k2381J8390R0950J797n1743L7160K9769l6019
14267F305q286P0126K5530m0446p1872J4902O139j591m5822r30M7390j2147j532
14254a2234M7052P824P200m424m9219k2292K0919k0767j251J3537n6858N269L3695
14241c1549M5436K684M3290k603l8731K4736J4242n5351k6396J3303N728J8507
14229A3296K9052K0757k4677J9691J2473j9142l3151k500n0995N1598M5224J0505
$$ y = [-55545, -20221, -32787, -36134, -43095, 33636, 7546, 28892, 14214, 3039, 6928, 24645, -3046, -43849, -62211, -224, 2717, -6483, 35066, 28163, -13246, -37558, 10215, 46613, 90033, 83093, 16752, 51244, 31942, 43131, 36952, 34572, 45951, 54814, 55622, 41854, 24306, 26118, -5741, -16768, -9607, -61618, -83999, -65609, 25341, 27138, -24605, 12555, 42324, 6305, -1981, 68145, 93675, 53229, -18643, -3741, 2398, 807, -45015, -45945, 1445, -10702, -12234, 34818, 42642, 49842, 45418, -3801, -26093, -5174, -25941, -27192, -13655, -70513, -65244, -31549, 13887, 16571, 59861, 57258, 18527, 43263, 57505, 2154, -24242, -10939, -5211, 13296, 42348, 63105, 38428, 58119, 70592, 51450, 18299, 15799, -35196, 16402, 61626, 72131]
14217G2131k7064o520L4055l1508J3779L0794R93Q534k4689l8455k0684K3269
14205C4635L4761k1315j6454n4753l2K6788L1503j8675m8360o955K7275N009o0560
14192f7133J8091J3848k0895J4698M8499r506j2024Q859L2488M9329n9289k0774
14180c809Q083L662j287J2706l4041J0303O41j2381k1088j673L8801M9388J4401
14167F3706j8871p906n1788J1976k809j8751j822k8164J4591O949J9082K4967
14155A1160K4863J5352J8662N203Q956r2393m4217M2200M7167m8167r3320k908
14143a07442M2941N766M9101j9273m0441L3198N7942j5586K5911K8575p01l6603
14131B3388j1509o4084j7707j2243R593N5228L4153l022k1117J6114L1243l6061
$$ y = [72131, 45067, 38547, 72602, 41094, 54873, 85667, 86660, 95194, 70505, 32050, 11366, 34635, 69396, 48081, 31627, -23126, -23158, 3630, 35133, 16458, -31902, -38857, -11582, -6573, -67133, -49042, -35194, -56089, -41391, 7108, -2398, -14422, -5563, 26925, 76254, 16965, -3809, 4274, 7936, 6649, 19355, -14686, -4383, -3742, -16123, -37211, -38884, -83, 49305, 63706, 44835, 36929, -14859, -2883, -5692, -24443, -26265, -54429, -39838, -32889, -13807, 11160, 36023, 51375, 70037, 75240, 84196, -8197, -52414, -10214, 36953, -11214, -104534, -107442, -64501, -58735, -9634, -28907, -69348, -36150, 21792, 6206, 32117, 60692, 59991, 23388, 11879, -52205, -69912, -82155, -72562, -17334, 16819, 13797, -7320, 8794, 40037, 3976]
14119C976p220k8717L5857J6352p075N839N4745J5612o236M1308n1849n0515J3568
14106C5645L430j1941j9112M2021K7622j9976r293m0667j8874R532k755O140p930
14093f158M236K4536j1605j1670j8283k8956M0367Q0531N1934k6570n4831J8475
14081F2006k3977r70m3653P0310Q3492l293m7394q6295p70O849J3981r564M4836
14068F5558j3146o3795p2662l6976k8706J4240M7339P5255P433J2627n4124O048
14056d0909P0489N0765j3820j4406k3320k3025j0845P16J818m2384j0202K7518
14044b7605m1026o745R855K648K8577L866m06l8241J3835L1072n120j8903J6501
14031c1692j7108l716O5313N8733n5603r3800l607J7067L5158M631K7927k8437
$$ y = [3976, -3244, -31961, 3896, 20248, 13173, 19012, 73757, 89369, 83133, 124441, 72592, 22077, 35645, 39075, 27134, 8022, 50043, 77665, 57689, 48396, 7729, -11145, -1613, -4368, 1772, -6158, -1922, 22614, 11009, -661, -18944, -47900, -7533, 72998, 124932, 98362, 43531, 62006, 38029, 37059, -6594, 63716, 147208, 143915, 96521, 10226, 9456, 16305, 30286, 20722, 65558, 52412, -11383, -84045, -121021, -149727, -135487, -88148, -12893, -5460, 7167, -46957, -40909, 29580, 80345, 66525, 52119, 28799, 5774, -5071, -4355, -2537, -44921, -55123, -27605, -68631, -75376, -65521, -62873, -34296, -30430, -30836, -69077, -55242, -24170, -29290, -48193, -31692, -48800, -52516, 12797, 71530, 15927, -77873, -81480, -64413, -29255, -24624, 3303, -25134]
14019b5134q384l2262L4584K2315K201O3283n779k3186l7227L1769L6325K0593
14007G9098j6288l6877K7337n5802j3559L2297N369k0442J8187J0219N2864J4758
13995I7161n0187m3877K4873m1333j1794K194j2680J2353K307N0171J7772j0210
13983C6750J9354N674l7409l4066M4107J5403l2436p215n7738j5080L07L6561
13971b5788K9326Q482L604j9097o5899k4886M6362L0451Q566J7187j1662p120
13959a0474O0393Q646k8698l066K3778L8471r94n5477l9570L48K8896K4807k2793
13946B4267Q552J7270J6986k3222R805l2790j8211j7941L4550k0108j7998p838
13934b6678J6294R494J2471J5032Q0012m4131j8896k3991j7790k1844J0536r44
$$ y = [-25134, -33518, -65780, -31196, -8881, -6680, 56603, 50824, 27638, -9589, 22180, 58505, 79098, 62810, 25933, 53270, -2532, -16091, 16206, 21575, 1133, 19320, 29539, 82403, 97161, 46974, 3097, 27970, -13363, -25157, -22963, -35643, -23290, -20983, 29188, 46960, 36750, 56104, 61778, 24369, -9697, 34410, 49813, 17377, 10162, -47576, -62656, -62349, -25788, 3538, 12020, 15624, -3473, -69372, -94258, -47896, -17445, -8879, 8308, -3354, -10474, 49919, 58565, 29867, 26801, 50579, 89050, 88056, 32579, -6991, -6643, 22253, 47060, 24267, 32819, 50089, 67075, 43853, 53658, 20868, 2657, -15284, 19266, -842, -18840, -26678, -10384, -890, 11581, 26613, 106625, 62494, 43598, 19607, 1817, -20027, -9491, -10435]
13922a0435l0780L5504K0656n426N761L2374m4614m298J5154L9904j386K4628
13910G7042J208q151M5053L4884l1969l3325k1810o4303l6676j3611q531J532
13898e8657J22J6561O3546N1899j7084n3806k9320J407K1417M0491j7244p0985
13886e1653l9335M8906L4253m0733k2681L1414J3946M1645j4418n1781j1304J4979
13874d6762M3413K2449K9821K4436l008p3788j8997k5450l1740R041K851L1090
13862c6644O844K037m5086k0783K5444K0902L6394J3719l9776m3994J2675N8412
13850i856n979l2951l9958p9535k481O6350M5029M0243p582O4067M6480p2006
13838A1821l5288L6742l5487q857J6431M4413M3227O9106k6604l2703p9103q0356
$$ y = [-10435, -41215, -5711, 14945, 9519, 15280, 47654, 3040, -1258, 13896, 53800, 52414, 77042, 78250, 70099, 115152, 150036, 118067, 84742, 62932, -1371, -38047, -51658, -60189, -58657, -58535, -41974, 21572, 73471, 56387, 2581, -26739, -25332, -3915, 36576, 19332, -51653, -90988, -42082, -7829, -48562, -71243, -39829, -25883, 15762, 1344, -50437, -61741, -46762, -3349, 19100, 48921, 73357, 70349, -3439, -22436, -47886, -79626, -70585, -67734, -36644, -29800, -27763, -72849, -93632, -68188, -47286, -10892, 2827, -36949, -80943, -68268, -9856, -15835, -48786, -88744, -168279, -170760, -104410, -59381, -19138, -26720, 37347, 83827, 11821, -23467, 13275, -22212, -31069, -14638, 29775, 73002, 142108, 115504, 82801, 3698, -76658]
13826g6658L3166k1750k7001L4982K279K2810l82p817j6554J9913K3872p226K4489
13813D123O3942K345n7801p0521n1531K1604J0066M0132o827P2203m696N207J1440
13800C9686L9476M1764J1863p199n3895Q36l7008o0354l6512r181L2087r901k7608
13787g5946J56J6319m201L195J3663J6368R721K696m4469k0980K3999O5800l454
13774B867K4450R744J3595m0053J3382l581l8328j169k0363k5657J5872m210M161
13761d9290K5001J5317K1764J102N3925j3118n0237L269K8101Q276L395k8445
13749A9060k5597o0623l0113J7448L3982K2248L5419n673l0377Q890n1324P857
13737e8803P6197O8179K3648n9330j7713J799J3119j3051r125P4461k2523o7916
$$ y = [-76658, -43492, -65242, -92243, -57261, -54982, -32172, -32554, -40371, -56925, -37012, -13140, -20366, 4123, 68065, 70410, 12609, -57912, -109443, -87839, -77773, -37641, -44468, 27735, 23039, 28246, 39686, 79162, 120926, 132789, 125590, 71695, 72531, 35523, -24831, -61343, -70524, -38437, -48338, -75946, -75790, -59471, -63672, -60477, -46814, -30446, -20725, -18029, -62498, -83478, -59479, 6321, 2867, 27317, 37061, 50656, 10603, 23985, 20404, -17924, -19093, -39456, -65113, -49241, -53451, -49290, -24289, -8972, 12792, 13894, 67819, 54701, 4464, 7733, 35834, 44110, 47505, 19060, -6537, -67160, -97273, -79825, -45843, -23595, 11824, 6151, -24226, -15336, -66660, -58803, 17394, 85573, 109221, 49891, 32178, 33977, 47096, 34045, 24920, 99381, 76858, 8942]
13725H942n5870M894r559L4325K6506M4635J4751l7770p201l0868M945k111k8696
13712c3077K6161n0856k3318K346J04948k86l4212j3224l9479L742J6184n609
13700d6680J0492K7445o314J0542O2188l7425p113P810L4614j0384j3460J4064
13688D5779m7634J281J1372J3426m299j919l213k8907j6850J8109j0412k4413
13676d7680K3388L2906K5770O9533N5413p4072l5318n096m6849m4336N7742K5605
13664C7006j0351K305l4293l2670j5512r475o882k7048J5094N6772k1724k1198
13652f7976J4691L1554N3737L1999n2936o6353K506Q312J7114L2427K3138n3934
13640b5721m5859N881K3641O9245l337k0107l2675O4470P2278l3636o0878K0362
$$ y = [8942, -46928, -42034, -51593, -17268, 9238, 53873, 68624, 30854, 23653, -7215, -2270, -4381, -33077, -6916, -57772, -81090, -78744, 26204, 25918, -8294, -21518, -60997, -57255, -41071, -46680, -36188, -8743, -15057, -4515, 57673, 20248, 13135, 20945, 55559, 45175, 31715, 45779, -1855, -574, 10798, 24224, 19925, 18006, 14793, -14114, -30964, -12855, -23267, -47680, -24292, 8614, 34384, 103917, 159330, 85258, 49940, 44844, -2005, -46341, 11401, 37006, 26655, 28960, -5333, -38003, -53515, -62990, -69872, -96920, -81826, -25054, -46778, -67976, -53285, -21731, 32006, 64005, 11069, -55284, -52778, -44466, -27352, 5075, 28213, -25721, -71580, -65699, -42058, 27187, 23850, 3743, -28932, 35538, 107816, 74180, 13302, 33664]
13628C3664N7332o673p5581l2776K784M671N226N245O127j5800L6887J1841J3570
13615D6517K8286Q015l1782j7353k9432m0086K4266j6476j6398k3078J05983M8166
13603H6628K314j8593R692J2655q278p751j4166l0061m8358l7910O117M16K713
13590d4582L3642j7089j2753o7062Q943O2655J2497q830k2966P1K6103L2456L56
13577C441L6955M9319k075J7877l6898n1127k6733L4472L877K850o1717j1542
13565d1301M6948L9684n414k4757m7628m372L2090J07M3045N7171l6067n636m1624
13552A2246l145p243M616j2191M3904M8002k1818o5486l1756k7505k5748p871
13540i3995M5283J924M1969k910M6750j8341j8390L5070L9991J5960m3422k9767
$$ y = [33664, 90996, 84323, 8742, -24034, -21250, -16579, -11353, -6108, 19, -15781, 21106, 32947, 46517, 74803, 82818, 51036, 33683, 4251, -35835, -11569, -28045, -44443, -67521, 38462, 86628, 88942, 70349, 80041, 92696, 84418, 76667, 62501, 32440, -15918, -53828, -47711, -47295, -44582, -10940, -28029, -40782, -107844, -98901, -36246, -23749, -32579, -55545, -55474, -29371, 3085, 3441, 40396, 89715, 87640, 105517, 68619, 17492, -9241, 25231, 29108, 31958, -29759, -41301, 5647, 45331, 39917, 15160, -32468, -36840, -4750, -4643, 38402, 95573, 59506, 53870, 12246, 9101, 1858, 6474, -5717, 38187, 86189, 64371, -1115, -32871, -60376, -86124, -93995, -48712, -46788, -4819, -7729, 39021, 20680, 2290, 37360, 77351, 93311, 49889, 20122]
13528B0122p8317j7528M2921N9673k938q602P6163O9306o9223o7778m0750k8861
13516d5812J5428K6950J2968K9852K5636K8422m314k4942J82q038m8784J7027
13504B4575M9646M3720K0232j8349o7068r1855J2559K544N24m5896j552k4963
13492i5883l812k1026J2200J40M9524O7941J5606l1204J3228M8645n33N83K3878
13479G9287j671N818l6059j7196J7160K0103l9014J8157N6747m07n9358l2854
13467A0713M7157L9072k1272m3037l254M6437m3438m0477L7559J2999l7245J102
13455F316j6519k335K5420l8613N3075O2850k1721K0043q572J4931k5833j10535
13443d1493j1724L6941J3163Q5252K1013J7494L2626m3264l0682K8423L901l8650
$$ y = [20122, -58195, -75723, -32802, 26871, 23933, 15331, 91494, 160800, 91577, 23799, -16951, -45812, -30384, -3434, 9534, 39386, 65022, 93444, 89130, 64188, 64370, 56332, 7548, 24575, 74221, 117941, 138173, 119824, 52756, -39099, -26540, -23996, -23472, -69368, -70920, -95883, -99695, -120721, -108521, -108381, -58857, 9084, 24690, -6514, 6714, 55359, 54826, 55409, 79287, 77616, 83434, 47375, 30179, 47339, 67442, 28428, 46585, 103332, 102925, 43567, 10713, 57870, 96942, 75670, 32633, 29379, 75816, 32378, -8099, 29460, 42459, 5214, 6316, -10203, -12538, 12882, -25731, 27344, 90194, 68473, 88516, 79944, 94875, 69042, -41493, -53217, -16276, -3113, 82139, 103152, 120646, 153272, 110008, 79326, 107749, 111650, 73000]
13431G3000k4506j6361m0803l2292L2046q846n96j5009K6469Q3195K5573l0557
13419G1313l3082L7671n0507l7545k6945l7938N2133O6144j4902J2943j9785l7231
13407a7731n111M9748q876K974J0316k4288n878k2169l910p417J0523o273j6379
13394d4471j9567L0105J0288K3478K2801N6961K577j4425j3239N516m8104J0231
13382B2151l2492m2863l1943R8706n88k0296n4525J4770P1303K1937j2375k5588
13370H197j9305R406l3410k9538J8074K0541k644m6401p658J0458M0597J7683
13358a4000M7176j7293k5333o870O7519j150j4963j3717j836J6362N237k162K9013
13345F7983N505k5026M834k6623l3822K5384o232l5702J5479j609J5526N25N700
$$ y = [73000, 48494, 32133, -8670, -40962, -8916, -17762, -18358, -33367, -6898, 76297, 101870, 71313, 38231, 75902, 25395, -12150, -39095, -77033, -24900, 41244, 26342, 39285, 19500, -17731, -22842, 26906, 18030, 21004, 31320, 7032, 1154, -21015, -24925, -32342, -21819, -28092, -44471, -64038, -33933, -23645, -167, 22634, 79595, 82172, 67747, 54508, 60024, 11920, 22151, -10341, -53204, -85147, 13559, 12971, -7325, -61850, -47080, 24223, 46160, 33785, 8197, -11108, -1702, -35112, -64650, -46576, -26035, -28679, -75080, -82738, -72280, -31683, -14000, 33176, 15883, -9450, -16320, 51199, 50049, 35086, 21369, 19533, 35895, 41132, 38970, 67983, 73488, 48462, 53296, 26673, -7149, 18235, 12003, -23699, -8220, -9829, 5697, 6222, 11922]
13332A1922J9268q8903q054L4857K1352M7308L011n710J6875j2977j3060K0072
13320D5961o9644k1193m0661J6323L3998K6707k4509l5301J7319N1092K3096K9335
13308E2523N236j5932j5757L8774k1091n7367N1838J7435j4801K3588K2351Q362
13296I5159m0220o3003K9478K7700p125K0043n878k5045N446J7807K5502L2537
13284A12401P506n5131n137p238m4287n027L7520j312l2434L953j3562k4232m5088
13271g2068L1350K695O2747M358K3376K0050J3242j9443j8892J2085l402k8857
13259B7241L8105j7083J8180l026m8233L8684N8085m1027o0441M4041J1039l9483
13247B6082k3746K9289m8450L0160N9359k396m1585j7559N59r722K1872l4337
$$ y = [11922, 31190, -57713, -65767, -30910, -9558, 37750, 40761, 35051, 51926, 38949, 25889, 45961, -23683, -44876, -85537, -69214, -35216, -8509, -33018, -68319, -51000, 92, 23188, 52523, 57759, 41827, 26070, 64844, 43753, -13614, 38224, 55659, 40858, 64446, 86797, 95159, 54939, -8064, 21414, 49114, 41989, 62032, 56154, 31109, 36555, 54362, 79864, 112401, 119907, 64776, 59639, 52401, 8114, 3087, 40607, 39295, 6861, 10814, -2748, -26980, -72068, -40718, -38023, 24724, 29082, 52458, 72508, 85750, 66307, 47415, 59500, 56098, 27241, 65346, 48263, 66443, 63417, 15184, 53868, 111953, 70926, 10485, 54526, 65565, 26082, 2336, 31625, -16825, 13335, 72694, 70298, 28713, 11154, 11713, 1991, 23863, -10474]
13235a0474J351q309K1882L4606j5828k1008j8557k062m5693m9380L3939L0993
13223d8540J0085L3205L7663J4226J043n3393l7769J4806L7091N3390j5977l5310
13211A0520r304K0969m0269j268O824m1156l8738N453l851O4364L0779J7061N1243
13198G2627k3236k1542J5038o7960j4927M3814L4824L8913n9299J0894M1743q242
13186F2647r084l3892k5661N3967L5736l4454J862j4871j5564k4733l0871P92
13174c4126M568R080N2140P873l2627l685j6722N6616L9467k4273l2779M1622
13162F7154l1914k5011N0167k0736O133j578k6911j7352L2557K9498P534o3456
13150F085P139M2796P421l0491n757j8682k7040J1604O3923K4278o5634k8403
$$ y = [-10474, -9123, -17432, 4450, 39056, 23228, 2220, -16337, -18399, -64092, -113472, -79533, -48540, -38455, -5250, 32413, 46639, 47682, -5711, -43480, -28674, 8417, 61807, 45830, 10520, 1216, 22185, -18084, -19352, -12528, -53684, -92422, -86969, -90820, -26456, 4323, 21384, 72627, 49391, 27849, 42887, -25073, -40000, 3814, 38638, 77551, 18252, 29146, 70889, 62647, 53563, 19671, -5990, 47977, 83713, 49259, 51121, 36250, 20686, -4047, -34918, -34126, -29558, -20478, 31662, 39535, 6908, 3223, -13499, 43117, 82584, 58311, 25532, 67154, 35240, 10229, 60396, 39660, 45793, 44215, 17304, -48, 32509, 62007, 69541, 6085, 13224, 56020, 63441, 32950, 27193, 8511, -18529, -6925, 56998, 81276, 15642, -12761]
13138a2761M6802J7942L186k3157l8566R053o450k0724l1169N590M9609j7831
13126a8476k7055O893J1750P802P130k0304k261J2381L3046j0389K5L182j2623
13113h899J679J8825J7155j4829p75K9120l5038j375J0526k1472r053J8081P7144
13100H1089j0809k9597j8782k2158K1454Q15K6273L0308P527k9528l0219k2122
13088D251n42K3233M8216r238l1311j2160k4035j490L7624M8112l4811l479J6325
13075F0695K0117l9500j128K454j0666j8512K4004l5279k6645O964K0773K5500
13063B8777K1257J1259j0943N33j6127K7106k3146n0684j7555K3102l6572k1809
13051f4802M7121n535k1543J3575M7375L1632n733j5354j1793p837o24n8150l7301
$$ y = [-12761, 34041, 51983, 55169, 32012, -6554, 2499, -3951, -24675, -55844, -50254, -645, -18476, -45531, -38638, -26888, -19086, -11956, -32260, -34521, -22140, 10906, 517, 542, 3724, -8899, -7220, 11605, 28760, 13931, 13156, 42276, 7238, 5863, 16389, -5083, -14136, 3945, 81089, 70280, 40683, 21901, -257, 21197, 22012, 48285, 78593, 86120, 56592, 26373, 4251, 3709, 26942, 75158, 65920, 34609, 22449, -1586, -3076, 34548, 82660, 47849, 44370, 60695, 80812, 41312, 40184, 42638, 31972, 13460, 37464, 2185, -24460, -17496, 3277, 28777, 50034, 61293, 50350, 50883, 34756, 61862, 38716, -11968, -29523, -6421, -42993, -64802, -17681, -23216, -44759, -31184, 16191, 47823, 42090, 26736, 14943, 7106, 6482, -51668, -88969]
13038h8969M4038J8186L2605N772k3123K2327J6248p0878j3267M5024K3603k09
13026A1357K3528n0060o8304m9903J0865R578M6066K7784p965J3302q3M3160q371
13013I54o5445j2525K4340Q6453M6076J5916O221L171j6644m2958j2543N1683
13001H4699K2169n6941m5217p220M6258m8734p8391j6250N5884M1081L4472k2488
12989I322J3235j6024M1919l0733J5728L5022N1800K0827L7966m6783j6807R962
12977A25434J9950r747o3799k3997j6149P425M9416l6716l8313j7986L6952q391
12965B4079j3111k0498K8272K1484L2019j4040l010Q215l4484J189O842q407P412
12952C5962M0700j3385J9512k97l3944k4278m1472k1989l317K9519L527K4356
$$ y = [-88969, -44931, -26745, 5860, 11632, -11491, 10836, 27084, -43794, -57061, -12037, 11566, 11357, 34885, -15175, -83479, -133382, -122517, -112939, -66873, -39089, -47054, -33752, -33835, 9325, 954, -64491, -77016, -52676, 33777, 79853, 95769, 101990, 105161, 88517, 45559, 33016, 84699, 106868, 49927, 4710, -2510, 43748, -4986, -83377, -99627, -43743, -2662, 31810, 9322, 22557, 6533, 48452, 17719, 33447, 68469, 120269, 141096, 179062, 132279, 115472, 125434, 145384, 135637, 71838, 47841, 31692, 39117, 88533, 51817, 13504, -4482, 32470, 24079, 10968, -9530, 18742, 40226, 72245, 58205, 55195, 63410, 28926, 30115, 36957, 28550, 35962, 76662, 63277, 82789, 82492, 48548, 24270, -17202, -39191, -42508, -12989, -9462, 14894]
12940A4894K5253k822K4496K435n4634O245L2468J7168k5111n8076n9676R755
12928f7605L3404J7571J3450J6290K9654K384l7896k8421r299k4241M4793J4957
12916E041K3352N2666O648p5511j0527N7989m3066l6880o3929L3494P2182M9794
12904G1253k0753J1357L9197j7105J7370r379l7913n9153K4609o472J4764O611
12892C4386J9844O721n5540l3708O8564J9852j1469K869r811n5517l3022M2517
12880d314O9710j6757L1043K3133K2871o5668j5689L5546P117l8742k8642J1194
12868C0802L9391K3052q5958o122M1821K9494J8170r581J3267N5822j9419p66
12856A29973j2086p017K4437j4739l5619K198n4752k5489M987M1523L351m3793
$$ y = [14894, 40147, 37325, 61821, 64256, 9622, 15867, 48335, 65503, 40392, -17684, -77360, -67605, -34201, -16630, -3180, 13110, 42764, 45148, 7252, -21169, -30468, -54709, -9916, 5041, 28393, 81059, 87707, 12196, 1669, 59658, 16592, -20288, -84217, -50723, 21459, 71253, 50500, 61857, 101054, 83949, 101319, 91940, 54027, -5126, 19483, 13011, 27775, 34386, 54230, 60951, 5411, -28297, 40267, 60119, 48650, 51519, 41708, -13809, -46831, -4314, 65396, 48639, 79682, 102815, 125686, 60018, 44329, 79875, 86992, 48250, 19608, 30802, 70193, 93245, 7287, 1165, 42986, 72480, 90650, 81069, 94336, 150158, 130739, 129973, 117887, 110870, 135307, 120568, 84949, 87147, 32395, 6906, 11893, 53416, 56767, 12974]
12844A2974K717l9118L3755J9896n5025j8934O0382M3853l6933K010L5068O122
12832F6767n0493m3629Q184P8221o483L1623m533l9000j8764j3355j4217N6159
12820E0480N5720m6994r876J11k0514o512L5408o720J3505r734m2729K282K8844
12807D3271j2573R749m195n4065k3405J2939M6558K6176k6309l745n1537P43J770
12794c4623J1967O424j3439j6853N7372K815K7741k1600j1183O437K508r0024
12782g2458o6909L1929J9685M4951O7228k4505l0336o632k0354J8757N1489K9650
12770D2495k675m1722M364M1768m221J5709n1109O852J1247L556j530k2724J0762
12757A2772O1033J2878m9032k2334j2209R425R446j2441l0363J2450N3483L4927
$$ y = [12974, 15691, -23427, 10328, 30224, -24801, -43735, 16647, 60500, 23567, 25577, 60645, 66767, 16274, -27355, -19171, 59050, 52567, 84190, 79657, 40657, 21893, 8538, -5679, 50480, 106200, 59206, 49330, 49441, 28927, 22415, 57823, 51103, 64608, 54874, 12145, 14427, 43271, 30698, 40447, 36252, -17813, -41218, -28279, 18279, 44455, 18146, 14401, -37136, -36393, -34623, -22656, -16232, -29671, -46524, 10848, 13663, 41404, 19804, 8621, 15058, 17566, -72458, -139367, -107438, -87753, -42802, 24426, -79, -30415, -37047, -57401, -38644, 12845, 42495, 39820, -1902, 2462, 44230, 40009, 55718, 4609, 11461, 22708, 26264, 24734, 2010, 12772, 73805, 86683, 37651, 15317, 3108, 12533, 21979, 9538, -20825, -8375, 45108, 80035]
12745H0035p1443j7293M4869n2683l9787K3558q272L395P8118K8326l4675k2805
12733A1343K9051J3703P0064j9501n5430n4634J4754k6384l93p215M1436N1283
12721F8077L2933j9710m0137K1351k3059l6880N692L8139M7650l7328k8866k4441
12709C421J3976L214M7780l3822p0730k2137N2931Q985j2843L1166L4032j4156
12697D1817J2464N3041J6079k8191j9107L7775p616L2913J6425l8309r1043l1284
12685e036J7166M7709L2807R022j2252l319M5643p5419m1457j3260l1356k3503
12673e3255M9164O1414n2246j2209O0459q519J2792o169m9600M1231K8356J7703
12661H9121J1263l2116p059l325k7796q388K7429k6633k9185j556M844l774l3345
$$ y = [80035, 8592, -8701, 36168, -16515, -56302, -32744, -41016, -37621, 40497, 68823, 34148, 11343, 40394, 54097, 124161, 104660, 49230, -5404, 9350, -17034, -17427, -24642, 16794, 68077, 101010, 81300, 41163, 62514, 39455, 2575, 8267, 46406, 94056, 56728, 27862, 3421, 17397, 20611, 68391, 34569, -36161, -58298, -5367, 3618, -9225, 21941, 55973, 41817, 54281, 107322, 123401, 95210, 76103, 113878, 106262, 139175, 155600, 117291, 26248, -5036, 12130, 59839, 92646, 101668, 89416, 86097, 131740, 56321, 14864, 1604, -29752, -53255, -4091, 57323, 5077, -7132, 53327, 44808, 57600, 51431, 1831, 43062, 71418, 89121, 100384, 68268, 61209, 57884, 30088, 21700, 49129, 22496, -6689, -8245, -3401, -7175, -40520]
12648d0520j8687K0055K9791K5250N2765J5178k2506j8961n7478L1477O294q368
12636A4290j1703L1486L3827k0145M154k2503j8501p61k0369j9450L4747M7144
12624E2216M9669K8970l4139j0372J8485j2044K1346l7389m1515p273J7757K9005
12612G4716K4111O4122l0921j8166m7635n3450m705k7965L3615p456j6072k2489
12600c2295K1806M4216J5320J3876l1274l904j165n255K0503m9572k4341p326
12588c9411Q274N356j6016J1679P2605R230j8948K066J8673J3056L3617L3645
12576A33826m8977k7835J8055l4226j4830M1863K8765l662K1566K5113j0635k5260
12564A03763j5269R309O536N013l1413l1985L1731n9501j2873m083j3494j3502
$$ y = [-40520, -59207, -39152, -9361, 15889, 68654, 83832, 61326, 42365, -15113, 16364, 22658, 14290, 2587, 34073, 67900, 47755, 51909, 29406, 10905, 10144, -10225, -29675, 5072, 52216, 101885, 130855, 96716, 86344, 104829, 92785, 114131, 76742, 35227, 27954, 45711, 74716, 98827, 162949, 132028, 113862, 66227, 12777, 8072, -19893, 13722, 6266, -9806, -32295, -10489, 33727, 49047, 62923, 31649, 27745, 26580, 21325, 41828, -7744, -32085, -39411, -31137, -25781, -41797, -30118, 42487, 51717, 32769, 34835, 53508, 66564, 100181, 133826, 84849, 57014, 75069, 40843, 26013, 67876, 96641, 92979, 114545, 139658, 129023, 103763, 88494, 97803, 104339, 109352, 77939, 45954, 77685, 18184, 5311, 1228, -12266, -25768]
12552b5768K1476m4266L6267M930j5231K1801K9268L8531j0624j2139k8890J3553
12540B8908j9446M7295r093j320L0993K275k8381M3466M2099k8671l1451n366
12528G1308n0788J9042J17488L5638k5224q215p1267m4260m3955J8254R111m8210
12516b1078k457P0193O9502K4428m1911J9875J0829n3208j0773K0804M1481J2468
12504A40153l6294j4023k6230K9387m339j9487J275j7750J9525L533m908M1844
12492A12686K9438L809l1431m828k2569n7358J533p841J3407M2690J9448n568
12480I3416q415p332L7067j7504j6632L3855j2685l1894M4609L3313j171j2590
12468A34037K0077q948n5185J6994p449p587L6535p22q682K538M895K7002k9642
$$ y = [-25768, -4292, -48558, -12291, -7361, -22592, -791, 28477, 67008, 56384, 44245, 15355, 28908, 9462, 56757, 47664, 46344, 77337, 79612, 51231, 94697, 136796, 108125, 76674, 71308, 20520, 39562, 157050, 192688, 167464, 159249, 87982, 43722, -233, 18021, 27132, -21078, -23535, 46658, 116160, 140588, 98677, 118552, 129381, 76173, 65400, 86204, 127685, 140153, 103859, 89836, 63606, 92993, 88654, 69167, 70442, 52692, 72217, 75750, 70842, 112686, 142124, 145933, 114502, 109674, 87105, 29747, 31280, 23439, 36846, 79536, 98984, 93416, 85001, 77669, 114736, 97232, 80600, 114455, 101770, 69876, 114485, 147798, 146627, 134037, 154114, 145166, 89981, 106975, 99526, 91939, 128474, 127752, 119070, 121608, 126503, 153505, 123863]
12455A23863J7871n4332k3765j6683L5563l631q005N914L2485J7524k6611m0366
12443E9827l4942K5619k0052j3284M3441K2028L3552K0300m883n3677m4227q463
12431B5239K3653J1520k2600K6652J1735p607j1877J3468P40J9891K6456N0726
12419A67996P010n9595J073J1056M5142n207L032J9338j0082N1258K192k2359
12407B10854o162j8705l3523m5161l2302Q1873N9050q8253l9467K6970m5540l118
12395F6516N7023J9581k4482N0959J5740n0388j1870k3141m409K8066l593J710
12383A21712K7672O1234p402p7902K5054N5444l4847J9235O5755J7872O354Q6385
12371C66566R3375n119o5580o4926j09304p2707o711J0305M414p733l992J1738
$$ y = [123863, 141734, 87402, 63637, 46954, 82517, 78886, 70881, 76795, 109280, 126804, 100193, 59827, 24885, 50504, 30452, 17168, 60609, 82637, 116189, 136489, 131606, 77929, 33702, 25239, 48892, 60412, 37812, 64464, 76199, 68592, 56715, 70183, 70923, 90814, 117270, 167996, 175006, 115411, 116484, 127540, 172682, 167475, 170507, 189845, 179763, 231021, 233213, 210854, 204692, 185987, 152464, 107303, 75001, 156874, 215924, 127671, 88204, 115174, 69634, 66516, 123539, 143120, 118638, 169597, 185337, 134949, 123079, 99938, 95529, 123595, 120002, 121712, 149384, 210618, 203216, 125314, 150368, 205812, 170965, 190200, 255955, 273827, 280181, 366566, 459941, 454822, 389242, 324316, 215012, 142305, 135594, 145899, 150313, 142580, 138588, 150326]
12359A50326n9002m1266Q1917N0254n9779o4124M4879N8221K2250L6592M331j2917
12347B11682m106q409l2802M034L2073L1894P3313l7135p8985l3769O2692P7014
12335B97496N9856J33326R2703O0168k4437j02514r3799j22425j4630k2160l0019
12324B33565J8182l1308j3478j0032j8484L514j1287J9065k3353n437j9843K4834
12312A65938K6778l0082n0354j5543O1285N367J9280J7615K6311L1375l5822m7677
12300A74471n1894j847J00604P1885M5082M8440N2637M8429k2530r4803j24822
12289B45652K3168J5591o1699k3484J7208j0601j3026O538k5621j6816J5334J0212
12277A82456M413o780O4325p5373m0128M8247K1740P44k789N2528l1079o7379
$$ y = [150326, 91324, 50058, 131975, 182229, 122450, 58326, 103205, 161426, 183676, 220268, 224599, 211682, 207576, 199167, 166365, 170399, 202472, 234366, 307679, 270544, 191559, 157790, 220482, 297496, 357352, 490678, 583381, 643549, 619112, 516598, 422799, 300374, 285744, 263584, 233565, 251747, 220439, 206961, 196929, 178445, 181959, 170672, 189737, 166384, 160947, 141104, 165938, 192716, 162634, 112280, 96737, 158022, 163389, 182669, 200284, 226595, 257970, 222148, 174471, 122577, 120730, 221334, 293219, 338301, 386741, 439378, 487807, 465277, 370474, 245652, 268820, 284411, 222712, 199228, 216436, 205835, 192809, 199347, 173726, 156910, 172244, 182456, 186869, 180089, 244414, 169041, 128913, 177160, 198900, 199644, 196855, 249383, 218304, 150925]
12265A50925P9225j2547O054P07K6893R8492J4342n9539O165K5111N2677J9077
12253D07582n2002m953j4351j8521l086j5360j8418j9146j9723m814j8169J0658
12241B29697J5635M1441J4466L0803l4379k7168o8799j1595N6084j6223n3004
12230A76958j1770J455j3180J2426p055j6438O154M4364L5016L6818L0874l1171
12218B64451K4717P2602m278p495k5370m4642K1729P883j2776j4853O2041R667
12206C53676P950l3928K1119M4882l7467J0813N4049p01j2911L93m1020n9004
12194C07851k6151K0991K3379l683M1092L0440k739j3744j997p2368m8325j740
12182B53006N8102P2891M9176J9936m8619n2423P147J2955J3555J4940n8756k0387
$$ y = [150925, 230150, 217603, 223657, 224364, 251257, 349749, 364091, 304552, 310717, 335828, 388505, 407582, 355580, 350627, 336276, 317755, 314669, 299309, 280891, 261745, 242022, 237208, 219039, 229697, 245332, 286773, 301239, 332042, 297663, 270495, 201696, 190101, 246185, 229962, 176958, 165188, 166643, 153463, 165889, 158834, 142396, 148550, 192914, 227930, 264748, 295622, 264451, 289168, 361770, 357492, 349997, 324627, 279985, 301714, 309597, 296821, 281968, 344009, 353676, 361626, 327698, 348817, 393699, 356232, 367045, 421094, 420393, 407482, 407875, 366855, 307851, 281700, 302691, 326070, 322387, 363479, 393919, 391180, 377436, 375439, 303071, 254746, 253006, 311108, 383999, 433175, 453111, 404492, 352069, 359216, 372171, 385726, 400666, 341910, 321523]
12170C21523J6816j419K5365J9383k5753L2570J7752Q061K4082L8217k4274K989
12158D55312n9135k3189M943K4192N6631m0204K7095K5623l4219j3098q132R614
12146D25433J9504M3639k6803l0969K7243O3328M6700M123l1513m1593m9553N549
12134D55088M9955Q7896n146k9524l3371o24K6590n4242M538O8073K99l2880k2332
12121E14320J8499K7118N0975j238n2999L7822K4618M9957L8589J2812o4813k0275
12109F35385L5823k8267Q0957L7554k6340p425l0309l5373L1259L1885L1054K2981
12097G79184j5218r530L9437K930m6989p50K6338K6755k7148p970O8066M6236
12085H81341J7291K6068K547j9950Q312M5530J9436K4476L1066L3669J2977r1170
$$ y = [321523, 338339, 336920, 362285, 381668, 355915, 388485, 406237, 414298, 438380, 476597, 452323, 455312, 396177, 372988, 377931, 402123, 458754, 418550, 445645, 471268, 437049, 423951, 415819, 425433, 444937, 488576, 461773, 430804, 458047, 521375, 568075, 572198, 540685, 499092, 449539, 455088, 505043, 592939, 587793, 558269, 524898, 524274, 550864, 496622, 501160, 569233, 569532, 536652, 514320, 532819, 559937, 610912, 609674, 556675, 594497, 619115, 669072, 707661, 720473, 655660, 635385, 671208, 642941, 723898, 761452, 735112, 727687, 697378, 662005, 693264, 725149, 756203, 779184, 763966, 754436, 793873, 796803, 749814, 749064, 775402, 802157, 775009, 767039, 835105, 881341, 898632, 924700, 927247, 907297, 915609, 961139, 980575, 1005051, 1036117, 1069786, 1082763, 991593]
12073I91593o0116O2532L5426M1159N1768k6060J2567K3210M5513Q3679K603m1248
12061A222626j5212n801Q75l2457N1954K2972M3982q072K6721M4730j8742n103
12049A328473K7923N0424N6710J05042j2587m2032K8162k426K4125m338M9342
12038A608818M8075k2910L6905N0696N8116N4546O1844p986M6179K3254K3472
12027A981009P1646L4077N420J4154K3925K5469M9205P2028O4951O2067J2534
12016B416485l852L202J1318Q1459Q2931O5118O4256N5427J32347R8291q055N1757
12004C050684R7902R6873J5263R7750L2815P2987P5424P270N1071P5067P5477
11993C748583P8136J13524J10347R1851Q4204Q8499J13534R0213J87549J43033
$$ y = [991593, 931477, 994009, 1029435, 1070594, 1122362, 1096302, 1108869, 1132079, 1177592, 1261271, 1263874, 1222626, 1207414, 1201613, 1202488, 1170031, 1221985, 1244957, 1288939, 1280867, 1307588, 1352318, 1333576, 1328473, 1356396, 1406820, 1463530, 1568572, 1555985, 1513953, 1542115, 1539689, 1563814, 1559476, 1608818, 1656893, 1633983, 1670888, 1721584, 1779700, 1834246, 1896090, 1888104, 1934283, 1957537, 1981009, 2052655, 2086732, 2092152, 2106306, 2130231, 2155700, 2204905, 2276933, 2341884, 2403951, 2416485, 2412633, 2415835, 2427153, 2508612, 2591543, 2656661, 2720917, 2776344, 2908691, 3006982, 2998927, 3050684, 3148586, 3245459, 3260722, 3358472, 3391287, 3464274, 3539698, 3546968, 3598039, 3673106, 3748583, 3826719, 3940243, 4050590, 4142441, 4226645, 4315144, 4428678, 4518891, 4706440, 4849473]
11983D849473P3070J09813J39846J15679J48376J76379J30961J55615J81110K14644
11973F294966J85869J87046K22651K28020J82709K00789J70968K03857J91649
11964H068524J76339K35998K31906K51236K71951L31087L15031K42681K39877
11955A0364630L30927K85988L12680L30032L08892L15631M23945L49690L20846
11946A3343261L22745L52690M28712M25699L69113L13153K58873K83742L63116
11937A6461104L31894K94775L06297K83760K76291K03248J89386K59718J66383
11928A8772856J18025P7552O0492J06931P1860r800L7001o9134j10298j69538
11918A8885947j20602j86849j93852k22657k56562k36338l21912l68796l64702
$$ y = [4849473, 4922543, 5032356, 5172202, 5287881, 5436257, 5612636, 5743597, 5899212, 6080322, 6294966, 6480835, 6667881, 6890532, 7118552, 7301261, 7502050, 7673018, 7876875, 8068524, 8244863, 8480861, 8712767, 8964003, 9235954, 9567041, 9882072, 10124753, 10364630, 10695557, 10981545, 11294225, 11624257, 11933149, 12248780, 12672725, 13022415, 13343261, 13666006, 14018696, 14447408, 14873107, 15242220, 15555373, 15814246, 16097988, 16461104, 16792998, 17087773, 17394070, 17677830, 17954121, 18157369, 18346755, 18606473, 18772856, 18890881, 18968433, 19028925, 19135856, 19207716, 19197916, 19234917, 19165783, 19055485, 18885947, 18765345, 18578496, 18384644, 18161987, 17905425, 17669087, 17347175, 16978379, 16613677]
11909A6613677k91847l10844l61859l56012l81334l75791l66208l22183l33468
11900A3514131l52507l40447l54134l48250l21740l19823k92970k90241l34063
11891A0559956l04878k38760k96698k98238k37606k62275k32791k29575k67164
11882H191971k59979k57101j76681j86598k15836j94638k30864j61969j42858
11873F365447j49615j34718k20802k27036j39376j10202q6591q4698j31125j46320
11863D934964j26710j49975j11497j64951q4871n5730j30693p1972p8994r9198
11853C860373o8447n0508r8475r8814p8075j05045j21582r4100l2206p7796j5228
11842C020097n8160o4041m6150j344l2513n7707j13593o5854j4802p9153n7978
$$ y = [16613677, 16321830, 16010986, 15649127, 15293115, 14911781, 14535990, 14169782, 13847599, 13514131, 13161624, 12821177, 12467043, 12118793, 11797053, 11477230, 11184260, 10894019, 10559956, 10255078, 10016318, 9719620, 9421382, 9183776, 8921501, 8688710, 8459135, 8191971, 7931992, 7674891, 7498210, 7311612, 7095776, 6901138, 6670274, 6508305, 6365447, 6215832, 6081114, 5860312, 5633276, 5493900, 5383698, 5297107, 5212409, 5081284, 4934964, 4808254, 4658279, 4546782, 4381831, 4296960, 4241230, 4110537, 4038565, 3959571, 3860373, 3791926, 3741418, 3642943, 3544129, 3466054, 3361009, 3239427, 3145327, 3113121, 3035325, 3020097, 2961937, 2897896, 2851746, 2850402, 2817889, 2760182, 2646589, 2580735, 2565933, 2486780, 2428802]
11831B428802m6322O13m4101l0428j1242j5086m7126o8740j6196o4510p6422p5931
11819A933311l1184k2337l5103k2404l814m0107p4497n8849k8624m823P683r057
11807A610195J84j7795o1041N600k983l5539j5491p324n6018k0572M720l6876
11795A367060m7485K1179K235q8939l6588k91n4487l9419M9986R55j0822J6845
11783A180229j3508j1921J0227l7582j2176j999p4919o2052k8036m9348J0981
11772I09896Q967l287m6015k6813R206q066l1695k4704o749o27j3215M3765L7385
11759H48048J0751j1585l5371j1647k2470j5373j8709j5205Q171j1374k1721n2492
11747F51023J9003K0346N452n4146r455l4942j611N2890K9115l3263m460J0959
$$ y = [2428802, 2382480, 2383093, 2338992, 2308564, 2297322, 2282236, 2235110, 2166370, 2150174, 2085664, 2009242, 1933311, 1902127, 1879790, 1844687, 1822283, 1818469, 1778362, 1703865, 1645016, 1616392, 1611569, 1619252, 1610195, 1610379, 1592584, 1531543, 1537143, 1534160, 1498621, 1483130, 1475806, 1419788, 1399216, 1403936, 1367060, 1319575, 1340754, 1342989, 1254050, 1217462, 1217171, 1162684, 1123265, 1173251, 1174206, 1163384, 1180229, 1166721, 1154800, 1165027, 1127445, 1115269, 1113270, 1038351, 976299, 948263, 898915, 909896, 918863, 915576, 869561, 842748, 851954, 843888, 812193, 787489, 780740, 780113, 766898, 810663, 848048, 858799, 847214, 811843, 800196, 777726, 762353, 743644, 728439, 736610, 725236, 703515, 651023, 670026, 690372, 695824, 641678, 632223, 597281, 595670, 648560, 677675, 644412, 639952, 650911]
11735F50911N2906k1577m9184r642J6127q431k566K9097q078l3359o7332j8786
11723E30086K8786K5392r468n7307k6865K5070L4685K9473J0484J844n7m8700
11711E43423k3891K4484r740R192R627j3287Q889J1542p025k0128m4991k0146
11699D67949K0226L3982P725k9889m1905k4183j536j3191k3767j3125k8434L9478
11687C93330J3863j1716J1366j6992l3648l8746J8767N1102K5467m995j141p246
11675C99411M603O4533k3224r1883k1812L2403J6930j8274k4317N5188J4694k680
11663D05572l2823J4510l470k4427l4154J5501q897l1390J9230M7501K929K3594
11651C93676k2641n9750J0838K7877J0505L4748j0226j0158j0915r425N0938k9720
$$ y = [650911, 703817, 682240, 633056, 623414, 639541, 631110, 628544, 657641, 649563, 616204, 548872, 530086, 558872, 584264, 574796, 517489, 490624, 515694, 550379, 579852, 590336, 592180, 592123, 543423, 519532, 544016, 534276, 543468, 553095, 539808, 548697, 560239, 553214, 533086, 488095, 467949, 488175, 522157, 529882, 499993, 458088, 433905, 432369, 419178, 395411, 382286, 353852, 393330, 407193, 395477, 406843, 389851, 356203, 317457, 336224, 387326, 412793, 407798, 406657, 399411, 404014, 468547, 445323, 353440, 331628, 364031, 380961, 362687, 338370, 393558, 408252, 405572, 372749, 387259, 383789, 359362, 325208, 340709, 331812, 300422, 319652, 367153, 370082, 393676, 371035, 311285, 322123, 350000, 360505, 395253, 385027, 374869, 363954, 354529, 405467, 375747]
11639C75747l2986K651l7976o2845K6732J5976k014J0946p599k4333k1309M0205
11627B83195L3456o3281J5537K9376l6898j5306L305p634K7843l2678j2269R1120
11615C15766m14m4369l2054N0169K8840J5440K697l2964j7931k337J823N7880
11603C42546J7552o0662J380K8662k789m0816l5156j4966K8897l2262P6122K856
11591C11364p8597r922P345M8751L5078J2955R124m1319K8073l558j9160l2848
11579B67286m961k5522k9900K8394L6334K349p8602O420j030m696P425K144J0309
11566B15950k2195j1038j5436j1678P826J875L7651J9149m9363M3091k5320l4770
11554A55742K2215K2822P7093N8645K7661o9324l1224k6042n715N9381k6311l0733
$$ y = [375747, 342761, 345412, 307436, 244591, 271323, 287299, 285285, 296231, 288632, 264299, 242990, 283195, 316651, 253370, 268907, 298283, 261385, 246079, 249384, 241750, 269593, 236915, 224646, 315766, 315352, 270983, 238929, 289098, 317938, 333378, 336075, 303111, 285180, 282843, 284666, 342546, 360098, 299436, 300816, 329478, 326689, 285873, 250717, 235751, 264648, 232386, 308508, 311364, 232767, 222845, 230190, 278941, 314019, 326974, 336098, 294779, 322852, 319294, 300134, 267286, 262325, 236803, 206903, 235297, 271631, 273980, 195378, 201798, 200768, 196072, 203497, 205641, 215950, 193755, 182717, 167281, 155603, 163429, 165304, 202955, 222104, 172741, 215832, 190512, 155742, 177957, 200779, 277872, 336517, 364178, 294854, 263630, 237588, 231873, 291254, 264943, 234210]
11542B34210k8491K1626j7769l347j0771j08123n8037L3338N6159J3953P0319
11531B03067O2814j5192P010n53o089N789j3082k5557k9943L3164M6295M052l474
11518B68301m4722m5057j4048M0099j6703l4741k3016J8306J3809K424K2169M7396
11506B34217J2165m8419J1278j0392k7215M2823k1457m2949l3810j9082J7472
11495A14631L351J5051M2634q14q900m3945n7155K2495M6370K7488M3454j1839
11483A92821j2012J4202k0958j8765j2900j3800M2897j3529n8126L0597K6931
11472A57358j1879K059K851J3487q532m8985J6552M1694L9038j3663L589l6506
11460A57063l9298O782J7588m0635J5987r007J041M2037j642K3342r533K0658
$$ y = [234210, 205719, 227345, 209576, 206229, 195458, 87335, 29298, 62636, 118795, 132748, 203067, 265881, 250689, 257699, 257146, 251057, 256846, 243764, 218207, 188264, 221428, 267723, 271775, 268301, 223579, 178522, 164474, 204573, 187870, 153129, 130113, 148419, 162228, 164652, 186821, 234217, 246382, 197963, 209241, 198849, 171634, 214457, 193000, 150051, 116241, 97159, 114631, 117982, 133033, 175667, 174853, 165953, 122008, 64853, 87348, 133718, 161206, 204660, 192821, 180809, 195011, 174053, 155288, 142388, 128588, 171485, 157956, 99830, 130427, 157358, 145479, 147538, 150389, 163876, 155344, 106359, 122911, 164605, 203643, 189980, 193569, 157063, 117765, 124547, 142135, 101500, 117487, 108480, 109521, 151558, 149916, 173258, 163725, 184383]
11448A84383L9085l3483j0074L625r582k7118l3835o6625k7545O6244L6597L2447
11436A54119J716n5680j8151l2568K5306R1699q744l0480l7383k3216J8842M4642
11424A30102p80N982l064j2676K6497N316J3541L0705k1161k8549k1965k0027
11412A03921M9772J5052k1072l2722J9629j5040M0562Q4527k3505j8711J6331
11401B18744l682j0373J2394N7581o3866r0954k9377K2214K7422J6830J1320Q352
11389A76605p7635n5260q191L9759l8065j1871J4775j5362j3263K8515P3288N2069
11377A65364L06l8397k3022L1171L940l4466N2565k4538q151O882l193j9639O032
11364A14854K2082L3413o552J7695j6330k3614j5851j2561p3118l5970O2136M1459
$$ y = [184383, 223468, 189985, 179911, 183536, 173954, 146836, 113001, 46376, 18831, 85075, 121672, 154119, 155835, 100155, 82004, 49436, 74742, 166441, 157697, 127217, 89834, 66618, 85460, 130102, 129322, 135304, 132240, 119564, 146061, 151377, 164918, 195623, 174462, 145913, 123948, 103921, 153693, 168745, 147673, 114951, 134580, 119540, 160102, 244629, 221124, 202413, 218744, 215062, 204689, 217083, 274664, 210798, 119844, 90467, 112681, 140103, 156933, 168253, 176605, 98970, 43710, 35519, 75278, 37213, 25342, 40117, 24755, 11492, 40007, 113295, 165364, 165670, 127273, 104251, 135422, 139362, 104896, 157461, 132923, 124772, 131654, 128461, 108822, 114854, 136936, 170349, 163797, 181492, 165162, 141548, 125697, 113136, 40018, 4048, 66184, 107643]
11352A07643j1395m4081l542J8759L6302R934M0739N551K6240J3798l1540n0627
11340A17781l9901m1564N9297L0404k7351L2735K3219j5744J9848q107Q496k5674
11328A33439j2681p455M382K5985j6317L7444P5191j123P901l7688j5797l828
11316A89453j0620j5119M618l8016l4104L4377j3849j2620K6731K6950K4869j058
11304A81612L568L0364P2627m409k451m3519K025Q726j6558J8064Q1333K4299
11292C55681k0623l2068j0366K1110j5882j1174r3614o7090R096k909L5970L2276
11280B00407K916J1724P059n2523l6677J1057k149j3618m2530k7701K3232Q2035
11268A63232N4194J8415k1058l3925m6893l0285j1530L2177R590l2116K78L4673
$$ y = [107643, 96248, 52167, 48625, 67384, 103686, 113620, 154359, 159910, 186150, 199948, 168408, 117781, 77880, 36316, 95613, 126017, 98666, 131401, 154620, 138876, 158724, 150617, 159113, 133439, 120758, 113303, 117685, 143670, 127353, 164797, 239988, 238865, 246766, 209078, 193281, 189453, 178833, 163714, 168332, 130316, 96212, 130589, 116740, 104120, 130851, 157801, 182670, 181612, 185180, 215544, 288171, 283762, 281311, 237792, 239817, 248543, 231985, 250049, 331382, 355681, 335058, 302990, 292624, 313734, 297852, 286678, 193064, 125974, 135070, 132161, 168131, 200407, 203323, 215047, 222106, 169583, 132906, 143963, 141814, 128196, 85666, 57965, 81197, 163232, 217426, 235841, 214783, 180858, 133965, 103680, 92150, 124327, 133917, 101801, 102079, 136752]
11256A36752K7677L879Q268j2091m9983J7607N8002j3149K760k6183M5272J24813
11244C23624L5179l5825J7236Q278J3777M0297J00642J02731M0518J11474O0073
11233H18004J09010R6940K7805j32420j23337o1822m5615p1580k8183n818j4274
11222E68710O2043k3316Q474k6987N8641P2764P0618J99079K34011J82370R3911
11211A500318L5945j4694n7238j26734r1244q620r6005j30936j21531o9205q5017
11200G35039r2237n1041k393k5937m1260o7670k9857K8789M1678m2958M1980Q9037
11188E83170O9316J18931J17881O6763P0398K8532M4144J83717K50830J60296
11178A693978J93513J96025J57939J53526Q7431j26216k13369k04829j63803j88853
$$ y = [136752, 164429, 168308, 176576, 164485, 114502, 132109, 190111, 176962, 179722, 153539, 198811, 323624, 358803, 322978, 340214, 348492, 362269, 402566, 503208, 605939, 646457, 757931, 818004, 927014, 1023954, 1051759, 919339, 796002, 734180, 688565, 616985, 588802, 582984, 568710, 630753, 607437, 615911, 588924, 647565, 720329, 790947, 990026, 1224037, 1406407, 1500318, 1536263, 1521569, 1464331, 1337597, 1246353, 1237733, 1141728, 1010792, 889261, 820056, 735039, 642802, 591761, 589368, 563431, 522171, 454501, 424644, 453433, 495111, 452153, 494133, 583170, 652486, 771417, 889298, 956061, 1026459, 1054991, 1099135, 1282852, 1533682, 1693978, 1887491, 2083516, 2241455, 2394981, 2482412, 2356196, 2142827, 1937998, 1774195, 1585342]
11168A585342k51141j03410j34325j48233o9173o4467m8819O84j0341N0110O7146
11157H73373P5044J00615N7777J04181J39281J55475N2784O4985O564p673p5172
11146A547234j23330j16000j49730j05441j12224j15728j00660r2941j12130r8838
11136D20212m4609P021J5044k1894r353j9575L0337k3852P065J8416N154l7664
11124C46302j8015M9116j4853J6960o9670q2723k8531N410O3883j740o9229k0108
11112A76802r379M7668N3578J4497k4720k1695o3667K4325L9901o116P284j9264
11100B19214j1500l0892j7111N4040N6812K9457m8968n645k9083N15J8910J2405
11088B48154K9465Q359q777J1337n4692j0554Q6173M4501l9359j9077K8417k8182
$$ y = [1585342, 1334201, 1230791, 1096466, 948233, 879060, 814593, 765774, 766458, 756117, 806227, 873373, 948417, 1049032, 1106809, 1210990, 1350271, 1505746, 1558530, 1623515, 1630079, 1622406, 1547234, 1423904, 1307904, 1158174, 1052733, 940509, 824781, 724121, 631180, 519050, 420212, 375603, 382624, 397668, 375774, 366421, 346846, 377183, 353331, 360396, 378812, 383966, 346302, 328287, 377403, 362550, 379510, 309840, 227117, 198586, 203996, 267879, 266139, 196910, 176802, 167423, 215091, 268669, 283166, 258446, 236751, 173084, 197409, 237310, 231194, 238478, 219214, 207714, 176822, 159711, 213751, 270563, 300020, 251052, 245407, 216324, 216839, 235749, 248154, 277619, 285978, 277201, 288538, 233846, 223292, 309465, 353966, 314607, 295530, 323947, 295765]
11076B95765o0256q649L5722N0418m629m8043j6481k1686K3834j1546K3580m528
11064B53501J8688n407p2963L5446L3754m2634r587J6802M4457l1489M3361O0159
11052C44088L8638K7313Q2514k5015j555q443j7084n008k3288M760K4875P284
11040D49079J00454P7756P0844O0563J8062N5529K5581L5218J3957k7392l9487
11029H40164k0399N303k9516N2406Q7213P2471K2644j1577p1746q5002q1986l0528
11017G49447r1762n024O7458R4227O1969L32j2188n5425n2178m4790j8915m1839
11005F51312l207m936Kj7528q266m2175l4135K627R419m271m043J0632K5546J3510
10991E94487K2023j4710o6717p7996q9293m8008M7930K3712O877J5752M2944m06
$$ y = [295765, 235509, 226860, 262582, 313000, 308371, 260328, 243847, 222161, 245995, 234449, 258029, 253501, 272189, 266782, 193819, 229265, 263019, 220385, 210798, 227600, 272057, 240568, 283929, 344088, 382726, 410039, 492553, 467538, 465983, 457540, 440456, 435448, 412160, 416920, 441795, 449079, 549533, 627289, 698133, 758696, 776758, 832287, 857868, 893086, 907043, 879651, 840164, 819765, 825068, 795552, 847958, 935171, 1007642, 1030286, 1018709, 946963, 861961, 779975, 749447, 657685, 652661, 720119, 814346, 876315, 876647, 864459, 809034, 756856, 712066, 693151, 651312, 648105, 643169, 643171, 625643, 617377, 575202, 541067, 543694, 553113, 548842, 544799, 555431, 580977, 594487, 616510, 601800, 535083, 457087, 367794, 319786, 367716, 391428, 398305, 414057, 457001, 456595]
10979D56595k3638K7918K3038j6932j5057n6865l9983N3187K6133L5961K4242
10968D94599J5786k3441L2619L1424l0456p7204j1716J4211K8126K9692J5251
10957E18891o595r0307o2954l204J0014m1468K1007l731m4420k9087J9805O3110
10945C51061L0648L573N2643M7677L596k9264k3132J4343M1489N6402j4017J1672
10933E46691O630P5395M531p505k3816K3016Q1316R4766M3958K8543K768Q950
10921H85243j644k7781l8045l4948j4084j1686Q568J8179M9207J23450L7417P2969
10909A066845M5389j7357M004P2243J02253N5221R4908J28736J14692Q7617O6722
10898A821273J05262J53266J72291J67260J73703K08791L99172M91091O88222
$$ y = [456595, 432957, 460875, 483913, 466981, 451924, 395059, 355076, 408263, 434396, 470357, 494599, 510385, 486944, 519563, 550987, 520531, 443327, 431611, 445822, 473948, 503640, 518891, 512296, 421989, 359035, 355831, 365845, 324377, 345384, 341653, 297233, 268146, 287951, 351061, 381709, 385282, 437925, 485602, 489198, 459934, 436802, 451145, 492634, 549036, 535019, 546691, 553321, 628716, 633247, 625742, 601926, 624942, 706258, 801024, 844982, 873525, 876293, 885243, 883599, 855818, 817773, 782825, 768741, 757055, 765623, 783802, 833009, 956459, 993876, 1066845, 1112234, 1094877, 1098881, 1171124, 1273377, 1328598, 1423506, 1552242, 1666934, 1754551, 1821273, 1926535, 2079801, 2252092, 2419352, 2593055, 2801846, 3201018, 3692109, 4380331]
10889D380331Q25349J071131J397074J824880K332611K647583K418050J394947
10881A8291956n3269j340742j991122k122766j885546j525957j095286o53213
10873G624055l37323j8344K90264N78311R04847J392084J961998K615925L322448
10864A8334265L668629L097977J491708p02944k538332l587318l614960l004321
10856A3144704k317355j684828j236161r51175q01322n64138m06671m10519k92425
10847D480110j93591j54926n3817j2581Q417J5697M084K4583j0268k902Q6097
10836D190903R9223O8167J16313Q6770J26379J54343K85823K85461K65951L13514
10826E992847L66446L08671L19813K52542J45182J09475J83228K06568L26601
$$ y = [4380331, 5205680, 6276811, 7673885, 9498765, 11831376, 14478959, 16897009, 18291956, 18238687, 16897945, 14906823, 12784057, 10898511, 9372554, 8277268, 7624055, 7286732, 7268388, 7558652, 8136963, 9041810, 10433894, 12395892, 15011817, 18334265, 22002894, 25100871, 26592579, 25889635, 23351303, 19763985, 16149025, 13144704, 10827349, 9142521, 7906360, 6955185, 6153863, 5589725, 5183054, 4772535, 4480110, 4286519, 4131593, 4077776, 4065195, 4073612, 4089309, 4093393, 4117976, 4107708, 4104806, 4190903, 4290126, 4358293, 4474606, 4561376, 4687755, 4842098, 5127921, 5413382, 5679333, 5992847, 6359293, 6667964, 6987777, 7240319, 7385501, 7494976, 7678204, 7884772, 8211373]
10817H211373M35496N93235P30972Q86027J056341J272569J535700J880019K264947
10808A8866679K790381L521961M450193N717121P422583R589635J2486332J6181658
10800H1026543J9880175K2495947K2124342J6815916O697343n062825j4353954
10793A49623487j8867822j8839313j5831807j1801922p674503l924439n88727
10786G2094954K605266N858692R550246J3849406J8725381K3769737K8057926
10779A74511608L0316426K9392277K3860057J3154187q52305j3990563k2707770
10772B33683917k6176815k5873370k3690456k0943232j8135632j5245542j2210600
10765I1408270r342290p015735n268442l997309k728660j580876k90926J262380
$$ y = [8211373, 8646869, 9240104, 9971076, 10857103, 11913444, 13186013, 14721713, 16601732, 18866679, 21657060, 25179021, 29629214, 35346335, 42768918, 52358553, 64844885, 81026543, 100906718, 123402665, 145527007, 162342923, 169040266, 163977441, 149623487, 130755665, 111916352, 96084545, 84282623, 76608120, 72683681, 72094954, 74700220, 80558912, 90109158, 103958564, 122683945, 146453682, 174511608, 204828034, 234220311, 258080368, 271234555, 270382250, 256391687, 233683917, 207507102, 181633732, 157943276, 137000044, 118864412, 103618870, 91408270, 82065980, 75050245, 69781803, 65784494, 63055834, 61474958, 61184032, 62446412]
10757F2446412L092554N186451P553342R978019J2079794J3653972J4622167J5471331
10749A44084042J6698119J8451061K0634320K3198242K6385632L0687738L6209785
10742C16348939M0678041L9175183K6947311M927723j8817430l6439692m5129084
10735C27690991m6289180m2711202l6884134l0209421k3693366j7798884j2771631
10728A17333173q573885m827113j291627K298839O262406J0736019J5804647K1359219
10720A59101678K6860340L1785377L5010761L4515677K8545782J6780077J165043
10713C33764735j4599893k7103192l4463531l6711982l5302887l1723492k6922329
10706A26937429k1984543j7547529j3859566j0911515q604138o848530n376502
$$ y = [62446412, 65538966, 70725417, 78278759, 88256778, 100336572, 113990544, 128612711, 144084042, 160782161, 179233222, 199867542, 223065784, 249451416, 280139154, 316348939, 357026980, 396202163, 423149474, 428077197, 409259767, 372820075, 327690991, 281401811, 238690609, 201806475, 171597054, 147903688, 130104804, 117333173, 108759288, 103932175, 102640548, 104939387, 111201793, 121937812, 137742459, 159101678, 185962018, 217747395, 252758156, 287273833, 315819615, 332599692, 333764735, 319164842, 292061650, 257598119, 220886137, 185583250, 153859758, 126937429, 104952886, 87405357, 73545791, 62634276, 54030138, 47181608, 41805106]
10699D1805106m211954l210668k286512j630946j029855n97308l68461j02990
10691B8366412m5017l24548p06614j016186j293020j548196j691401j850642j843147
10682A8047641j733202j574466j422795j168395r40778p25450m71029k59325r7672
10673I654529m3776P369K57959N95246Q20576J166883J451896J722881J962862
10664A7596425K111061K032785J731117J035163J65858n98764j123387j564338
10656B1385920j922244k106462j992269j887009j687475j566084j309704j072121
10648G842552q27974o56068m89014l01260k03262k26123j76318j01782M0732P1164
10638D972647J10244K36681K83778K56445M13715M52708M72587N94330N02159
$$ y = [41805106, 37593152, 34382484, 32095972, 30465026, 29435171, 28837863, 28469402, 28366412, 28321395, 27996847, 27290233, 26274047, 24981027, 23432831, 21741430, 19890788, 18047641, 16314439, 14739973, 13317178, 12148783, 11208005, 10482555, 10011526, 9752201, 9654529, 9610753, 9618122, 9876081, 10471327, 11291903, 12458786, 13910682, 15633563, 17596425, 19707486, 21740271, 23471388, 24506551, 24672409, 24073645, 22950258, 21385920, 19463676, 17357214, 15364945, 13477936, 11790461, 10224377, 8914673, 7842552, 7014578, 6358510, 5869496, 5568236, 5364974, 5138851, 4962533, 4860751, 4901483, 4972647, 5082891, 5319572, 5603350, 5859795, 6273510, 6726218, 7198805, 7793135, 8295294]
10629H295294M65119M67998N00216N56994P44663J069673J506275K167003K995687
10620A8768922L956805M825709M968284L672553J410613q44351j940369j697129
10612C3121037n31907J105507L131063N536600Q278070J0476277J0490639O702805
10604G8310091L33595m997829p071030o209839l509336k52508L328266P102339
10596F7033749J0812632J3381162J2485854N899915l708689j1001404j3336847
10589H1566372j1614201q107469m257190o23184K641039N511915P226665N997212
10581G8341159J083988n257413r637862j0569414q969575o375419l749920j583654
10573C3281890P7056J277914J781377R88382j141540l500666n045794n215958
$$ y = [8295294, 8760413, 9228411, 9728627, 10285621, 11030284, 12099957, 13606232, 15773235, 18768922, 22725727, 27551436, 32519720, 36192273, 37602886, 36758535, 34818166, 33121037, 32589130, 33694637, 36825700, 42362300, 50640370, 61116647, 71607286, 78310091, 78643686, 73645857, 66574827, 60364988, 56855652, 56603144, 59931410, 67033749, 77846381, 91227543, 103713397, 109613312, 105904623, 94903219, 81566372, 69952171, 61844702, 57587512, 56964328, 59605367, 65117282, 72343947, 78341159, 79425147, 74167734, 64529872, 53960458, 44990883, 38615464, 34865544, 33281890, 33358946, 34636860, 36418237, 37406619, 36265079, 32764413, 27718619, 22502661]
10565B2502661m587634l601947k697599j973503j462250j117792q82112o75529
10557E504295n63946n22336m55219l98079k58011j40606j40658j82595j81311
10548B661534j86793j35284j55339j26405q1260j04522r7385l5068j5546m0407
10538A683525l0698j0384p3654m6444m4187n5860j01392m7457m1437m0288j2089
10527A179635N191j0088n5404m1862Q187P2451K4532l2830l6976n9142o999M1814
10515A088509L1710j7380j627j7914q7380n1725k2729J2211q306j1165o4352k6462
10503H23390O774O367K5969k8999j9648L543K6p418J6038o241o3054k0677l3304
10490G02766N4013Q9388N1252L1541l4770p0679m8418l2952k4506l3949k5697
$$ y = [22502661, 17915027, 14313080, 11615481, 9641978, 8179728, 7061936, 6179824, 5504295, 4940349, 4418013, 3962794, 3564715, 3306704, 3166098, 3025440, 2842845, 2661534, 2474741, 2339457, 2184118, 2057713, 1976453, 1871931, 1774546, 1739478, 1723932, 1683525, 1652827, 1642443, 1568789, 1522345, 1478158, 1422298, 1320906, 1273449, 1232012, 1191724, 1179635, 1184826, 1174738, 1119334, 1077472, 1085659, 1158110, 1182642, 1149812, 1112836, 1053694, 1046695, 1088509, 1120219, 1102839, 1101212, 1083298, 995918, 944193, 921464, 933675, 925369, 914204, 849852, 823390, 830164, 836531, 862500, 833501, 813853, 817396, 817422, 810004, 826042, 819801, 756747, 736070, 702766, 756779, 846167, 897419, 928960, 894190, 823511, 775093, 742141, 717635, 683686, 657989]
10479F57989M416j6963j0832K0404L6958m5020m0092N610N5259L5126P982j6277
10467F94560l0925l9434j2799r730M8769M1699L3222K8408j0614o114j7581j0688
10455G08773M0569M9439J9901j295j335k2558M1981K0128o508K3848k6866j7517
10443H28560j6261P4345R7076Ok3113J7011r109l1921P1364R5111P1299L5108
10431A209476K0717j2122K0835j6780L1751L6893J07865J09486M117k9982j1775
10420A470481K6644J20382R2123P1870O6767Q2483M645K9627J40690J63959K02037
10409B471708K04977K34171K84226L78605M82855O23346Q89790J181203J549863
10400H300744K003094K535113K816355K534858J653834K83249j173678k159820
$$ y = [657989, 662405, 645442, 634610, 655014, 691972, 646952, 606860, 612470, 667729, 702855, 710837, 694560, 663635, 624201, 611402, 601672, 650441, 692140, 725362, 753770, 743156, 737042, 719461, 708773, 749342, 798781, 818682, 817387, 816052, 793494, 835475, 855603, 849095, 872943, 846077, 828560, 812299, 886644, 983720, 983726, 960613, 977624, 968515, 936594, 1007958, 1103069, 1174368, 1209476, 1230193, 1218071, 1238906, 1222126, 1253877, 1290770, 1398635, 1508121, 1512238, 1482256, 1470481, 1497125, 1617507, 1709630, 1781500, 1848267, 1930750, 1935395, 1965022, 2105712, 2269671, 2471708, 2676685, 2910856, 3195082, 3573687, 4056542, 4679888, 5569678, 6750881, 8300744, 10303838, 12838951, 15655306, 18190164, 19843998, 20127247, 18953569, 16793749]
10392A6793749k379381k028389j594112j090879o88031l15445l0131J72618M53297
10383I293296Q42215J230831J880311K793292L885820N203041O309599O488512
10375C7926917M985127J718787k081150n082584o301518n933171m811778l582433
10367A6838197k467300j623212j039476p26167m43253j16620K08521N77919J022983
10358A2231592J705651K619621L516544L900004L393069J762298o05394k676477
10350B5846908l853163l903457l334595k458706j656880j045421o84085m46257
10342H464344j90975l4715J07451K44743L71575O01815Q54799J073543J423334
10333A2915914J905755K741831L844885N140086O284298O623813N364767K462160
$$ y = [16793749, 14414368, 12385979, 10791867, 9700988, 9012957, 8697512, 8667381, 8839999, 9293296, 10135511, 11366342, 13246653, 16039945, 19925765, 25128806, 31438405, 37926917, 42912044, 44630831, 42549681, 37467097, 31165579, 25232408, 20420630, 16838197, 14370897, 12747685, 11708209, 10982042, 10538789, 10422169, 10630690, 11208609, 12231592, 13937243, 16556864, 20073408, 23973412, 27366481, 29128779, 28523385, 25846908, 21993745, 18090288, 14755693, 12296987, 10640107, 9594686, 8910601, 8464344, 8273369, 8238654, 8346105, 8590848, 8962423, 9564238, 10419037, 11492580, 12915914, 14821669, 17563500, 21408385, 26548471, 32832769, 39456582, 44821349, 47283509]
10325D7283509j209236m323985n849198n612576m494979l166101k019650j213341
10317A9394443m67756J57431P25743J398061K229652L380572N142145P486893
10309C9447184J0559799J3835892J5831957J4496451Q591273m51801r128857j4201475
10301G8980423j4918206j2821680r775322o860691m712168l287665k191521j448239
10293B2964931p80057k3183P06988J706142K882235M278748N839310P005480O985743
10284E1566337N052712J309033k972453o288225p789385p485577o203325m794534
10276B2394583l468192k532818j919041j409911j126426r45321p48082o01193
10268I643599m34045k49979n4859K01088N03138R56606J625776K462605L429537
$$ y = [47283509, 46074273, 41750288, 35901090, 30288514, 25793535, 22627434, 20607784, 19394443, 18926687, 19084118, 19809861, 21207922, 23437574, 26818146, 31960291, 39447184, 50006983, 63842875, 79674832, 94171283, 102762556, 102310755, 93181898, 78980423, 64062217, 51240537, 41465215, 34604524, 29892356, 26604691, 24413170, 22964931, 22184874, 22161691, 22868679, 24574821, 27457056, 31735804, 37575114, 44580594, 51566337, 56619049, 57928082, 54955629, 48667404, 40878019, 33392442, 27189117, 22394583, 18926391, 16393573, 14474532, 13064621, 11938195, 10992874, 10244792, 9643599, 9209554, 8959575, 8904716, 9105804, 9608942, 10565548, 12191324, 14653929, 18083466]
10259A8083466M351386M295165K845605K75759k294255l816217l998274l347871
10251A6394764k400825j561258r07291l83064k8860K75982O51623R17433J495424
10242A4453928K314931L410622M918456O746803Q376931Q739398O751703K475444
10234E8188216k751758o819223q446423q053515o507477m815185l367967k263154
10226A5163514j454538q73714m66484q4004K83090P30573J371929K061483K931096
10217A9662945L721068L982709L345119J619655q12010l025348m261391m466888
10209A9765859l941236l121764k383565j797913j286360j024319p60484n82554
10201D867664n30486m63522l51577l44697l11299k49539j93775j45292q3281j45150
$$ y = [18083466, 22434852, 26730017, 29575622, 29851381, 27557126, 23740909, 19742635, 16394764, 13993939, 12432681, 11525390, 11142326, 11113466, 11389448, 12041071, 12958504, 14453928, 16768859, 20179481, 25097937, 31844740, 40221671, 48961069, 55712772, 58188216, 55436458, 48617235, 40170812, 32117297, 25609820, 20794635, 17426668, 15163514, 13708976, 12835262, 12368778, 12284774, 12567864, 13298437, 14670366, 16731849, 19662945, 23384013, 27366722, 30711841, 32331496, 31519486, 28494138, 24232747, 19765859, 15824623, 12702859, 10319294, 8521381, 7235021, 6210702, 5450218, 4867664, 4337178, 3873656, 3522079, 3177382, 2866083, 2616544, 2422769, 2277477, 2194196, 2049046]
10191B049046j11842j21126j04438p5515k9536j1406o7035n4515n0967m6195l1468
10180A345003K1739l3861m4915n3859o9193j2013N5769L6712O064j9453q519K3288
10168A246762N7831J6066k3787q2224n0229k1614O845j1918K5946J23266J6664
10157A303608L0436m0833o5342r133r8321q8229o893J173M2045O274m9720L9987
10145A065052O8326k8348k2488m0319k8153J0234L3549K5575l1251q2319p2137
10134H97721j483m7214l9158k6940l4147k8394m4209M2615M5814k8856l0997k7813
10122F76939N0616N5652R061j1212j5519l4024J6459L7752L2156o9178O14L6429
10110G85745J1019j3316j2776J3269P1410P0952P5445J01431N5003k1593k1357
$$ y = [2049046, 1937204, 1816078, 1711640, 1636125, 1606589, 1595183, 1528148, 1473633, 1422666, 1376471, 1345003, 1366742, 1332881, 1287966, 1234107, 1164914, 1152901, 1208670, 1245382, 1251446, 1231993, 1223474, 1246762, 1304593, 1320659, 1296872, 1214648, 1164419, 1142805, 1149650, 1137732, 1163678, 1286944, 1303608, 1334044, 1293211, 1227869, 1218736, 1120415, 1032186, 1025293, 1026466, 1068511, 1074785, 1025065, 1065052, 1133378, 1105030, 1082542, 1042223, 1014070, 1024304, 1057853, 1083428, 1052177, 969858, 897721, 896238, 849024, 809866, 782926, 748779, 720385, 676176, 718791, 764605, 735749, 704752, 676939, 727555, 783207, 792268, 781056, 765537, 731513, 747972, 785724, 817880, 748702, 749316, 785745, 796764, 783448, 770672, 783941, 855351, 926303, 1001748, 1103179, 1158182, 1136589, 1115232]
10099A115232J4939M4001l1002l8708K014o5058m4416L1199J8118O882m1838M7882
10087A059245R4937M646M4459Q3696M8896O0640Q8303O3798K2573J887L4472o050
10075A601502N325L264m12K5548R5467M6793L9227M0031N6308J26714J31348J17131
10063B288246J23651J49670K34635J67687K55871K98503L08886L51995M37209
10054D616353N65148P12335P32645P53657J008398J257588J638506K172314K719592
10045A6176536L368823M044082M314778L983166K987795J749535O69231o0512
10037C7233434n89690j013319j255228j260944j335649j517387j524024j319629
10029B7417564p80719K8539J118175K351878L712943N122497O496776P739667
$$ y = [1115232, 1130171, 1174172, 1143170, 1104462, 1106476, 1041418, 997002, 1028201, 1046319, 1053201, 1011363, 1059245, 1154182, 1158828, 1203287, 1286983, 1335879, 1396519, 1484822, 1548620, 1571193, 1573080, 1607552, 1601502, 1606827, 1610091, 1609679, 1635227, 1730694, 1777487, 1816714, 1856745, 1913053, 2039767, 2171115, 2288246, 2411897, 2561567, 2796202, 2963889, 3219760, 3518263, 3827149, 4179144, 4616353, 5181501, 5893836, 6626481, 7380138, 8388536, 9646124, 11284630, 13456944, 16176536, 19545359, 23589441, 27904219, 31887385, 34875180, 36624715, 37293946, 37233434, 36643744, 35630425, 34375197, 33114253, 31778604, 30261217, 28737193, 27417564, 26636845, 26665384, 27783559, 30135437, 33848380, 38970877, 45467653, 53207320]
10021E3207320Q393810Q503750Q138807P183479N760160L976747J985316l77412
10013I6771977l107987n651868p375408p974486p547274o498852n492434m605024
10005D8518644l678233k397724p73804R65459K487696L834121N208878O642301
9997F0807338P633981P726330O798745N048558K889521N67111j832370m051431
9989H5587783n876201p042135p375118p020978o466329o123196n808135n096721
9981C4778970m045620k871676j790861q30927J23386R56899J551099J780983J816399
9972C1468652J811877J723282J372636Q75280L30636m56392j090565j283282r62412
9963C3789712k91468M33372J311962K294501L129405L607721L637671L038174
$$ y = [53207320, 61601130, 70104880, 78243687, 85427166, 91187326, 95164073, 97149389, 96771977, 93663990, 88012122, 80636714, 72662228, 65114954, 58616102, 53123668, 48518644, 44840411, 42442687, 41668883, 42634342, 45122038, 48956159, 54165037, 60807338, 68441319, 76167649, 82966394, 88014952, 90904473, 91471584, 89639214, 85587783, 79711582, 72669447, 65294329, 58273351, 51807022, 45683826, 39875691, 34778970, 30733350, 27861674, 26070813, 25239886, 25363272, 26320171, 27871270, 29652253, 31468652, 33280529, 35003811, 36376447, 37251727, 37582363, 37125971, 36035406, 34752124, 33789712, 33498244, 33931616, 35243578, 37538079, 40667484, 44275205, 47912876, 50951050]
9955E0951050J849803N37492n62759j386941j965039k517974k853501k932025
9947D1120106k521087j825147q83234J67510J374565K886512M517424O113316
9939E0949965P463017Q261476Q439027Q222828P804808O966183N562758L748050
9931A07418112J559809r89808l544373n319651n933838n338081m162473l153003
9923H0536694k877252l622640m175387l763185k283598m01731J151528K217435
9915F6781864L099830M194875N285439N899387N593694M527695K587904K03372
9907I8174060j696686k570640k575706k406663k784327m124477o136865p937398
9899F7941298q668382q105632o666714m971062l518420k333237j205852k31902
$$ y = [50951050, 52800853, 53338345, 52775586, 51388645, 49423606, 46905632, 44052131, 41120106, 38599019, 36773872, 35890638, 36058148, 37432713, 40319225, 44836649, 50949965, 58412982, 66674458, 75113485, 83336313, 91141121, 98107304, 103670062, 107418112, 108977921, 107988113, 104443740, 99124089, 93190251, 87852170, 83689697, 80536694, 77659442, 74036802, 69861415, 66098230, 63814632, 63412901, 64564429, 66781864, 69881694, 74076569, 79362008, 85261395, 90855089, 95382784, 97970688, 98174060, 96477374, 93906734, 91331028, 88924365, 86140038, 82015561, 75878696, 67941298, 59272916, 51167284, 44500570, 39529508, 36011088, 33677851, 32471999, 32240097]
9891C2240097O07219J205075J470644J215319O74813K34705l4203p3533k20270
9882C7319866o92296j750629l097857l944370m046569l679405l070912k493557
9874A4544271j894340j506693j289875j120893j007739q44790p42955o26222n68176
9865D942588m89079l89587l53982k56132k11006k07103k14200q7111j17925j29929
9855B486534q0227r4405o2691n9502k0154o2655j01660m5567r6251j07038m9575
9844A706809l1207m3837p5006l5926k449o8761q2377k509N9422m795m7507o4919
9832A306938K5844j6137N113k6903m4051m888m4205l2850K3199m5175n6110N8537
9820A149312P351k7618p9679p1858M819l3917R383n0639l8394N5557O0313P046
$$ y = [32240097, 32847316, 34052391, 35523035, 36738354, 37413167, 37647872, 37613669, 37540136, 37319866, 36627570, 34876941, 31779084, 27834714, 23788145, 20108740, 17037828, 14544271, 12649931, 11143238, 9853363, 8732470, 7724731, 6879941, 6136986, 5510764, 4942588, 4453509, 4063922, 3709940, 3453808, 3242802, 3035699, 2821499, 2734388, 2616463, 2486534, 2406307, 2311902, 2249211, 2189709, 2169555, 2106900, 2005240, 1959673, 1863422, 1756384, 1706809, 1675602, 1631765, 1556759, 1520833, 1518384, 1449623, 1367246, 1364737, 1424159, 1419364, 1371857, 1306938, 1332782, 1316645, 1321758, 1294855, 1250804, 1245916, 1201711, 1168861, 1192060, 1146885, 1090775, 1149312, 1156663, 1129045, 1049366, 977508, 982327, 948410, 957793, 907154, 868760, 924317, 984630, 991676]
9808I91676p8l7535n864n6529o1155r032J3174j8424q2145j3192R200l0585j159
9795F98352m4587l5750j7946L5014O3048j9465r2457k1145L4177J0682J2514K9923
9783F52360j4076k1679l1616l7877l4074k9145j5435N6293k0076J8354K0294k1228
9771E22095o928K4243J0618L7135j8802M845l3363J460j722j446l9054K5672n722
9758E19031m5881J4155l3067j8890l551q932j6832J6031J6964L9043K1967N937
9746E05975k9570k916j658j4983L0072M2440L2586Q38k0836p0566m7089K9179
9734D53472O516l8396k034O418K1295L766m459l5123m704n3300K0051N2758M2049
9721D68309p982j3679M125R1913N6522m3058l8255k1999m060L373M5674K439n2145
$$ y = [991676, 991598, 954063, 948199, 891670, 830515, 821483, 834657, 816233, 734088, 720896, 730096, 699511, 698352, 653765, 618015, 600069, 635083, 698131, 678666, 586209, 565064, 599241, 609923, 622437, 652360, 638284, 616605, 584989, 547112, 513038, 483893, 468458, 524751, 504675, 523029, 543323, 522095, 515167, 539410, 550028, 587163, 568361, 573206, 539843, 541303, 539581, 538135, 499081, 524753, 519031, 473150, 487305, 454238, 435348, 431797, 422865, 406033, 422064, 439028, 478071, 500038, 505975, 476405, 473489, 471831, 456848, 486920, 529360, 561946, 562784, 541948, 471382, 424293, 453472, 459988, 421592, 419558, 425976, 447271, 451037, 446578, 411455, 406751, 353451, 373502, 426260, 468309, 460327, 446648, 450773, 542686, 599208, 556150, 517895, 495896, 491836, 495209, 540883, 543322, 491177]
9708D91177k3270k4837Q357L298R372r057j4710k5479j614K763K338K7010K1192
9695D66540J3898M046j7847K0334m920k1901R546j6165J0069J5532j1799J2522
9683D79855j407m0567K3497n565m418j3941k5899m6463k4503O0799P2276l4291
9671D39373o5828k9764j7747M0517P830L8049L0271K361k4481J8241M6427L8581
9659E23830O684L6774O6778L5396N5062L0374J39674J11741J5979p4843p6507
9648H70942j11261p7323l8664l6554n2063l5846K4122K8583K500K2376P6516K2069
9636F95397K8260K8736m939j1006l4270l5420n1110k6360k0555m25M0411J199
9624F09918L9891O2834J7632j1568l6428K7664q040q647K0544r37J28j6652r752
$$ y = [491177, 467907, 443070, 451427, 454725, 464097, 455040, 440330, 414851, 413237, 416000, 418338, 445348, 466540, 480438, 484484, 466637, 486971, 482051, 460150, 469696, 453531, 463600, 479132, 467333, 479855, 478448, 437881, 461378, 455813, 451395, 437454, 411555, 365092, 340589, 401388, 473664, 439373, 373545, 343781, 326034, 366551, 374381, 412430, 442701, 445062, 420581, 438822, 485249, 523830, 530514, 567288, 634066, 669462, 724524, 754898, 894572, 1006313, 1022292, 947449, 870942, 759681, 682358, 643694, 607140, 555077, 519231, 543353, 571936, 574436, 596812, 673328, 695397, 723657, 752393, 747454, 736448, 702178, 666758, 615648, 589288, 568733, 568308, 608719, 609918, 649809, 712643, 730275, 718707, 682279, 709943, 701903, 693256, 713800, 712863, 712991, 696339, 686587]
9611F86587K6464J0273P2917L9878j4977K7029P0774l3680p581M8290J8739q3410
9599H61303p0402j0082k385l9126K4063M3033k6346j7787l1499q563j1800M7223
9587G57632P1775K7511J6645J1895K8265P6926r651k9981m9946p3248j3588m2213
9575G72022j850j2081k3584J3994k0930r628l6684m8310m2811j9601M6863M555
9563F21955k07k109R3710L7356N6179J5366k4122m9187l4514j01276p1729j0439
9551E30983J5986L4784J9812K2333j0990L967J1993j4702M6883m710J0928K8739
9539F96006J4433n3267k2343J5502m0908p1872j9854O1515M9635L3234L5508O4265
9527G61854Q295m321O258J2558J7503q188K0811N102K6534j559n7006J9624n0883
$$ y = [686587, 713051, 723324, 796241, 836119, 821142, 848171, 918945, 885265, 877684, 925974, 944713, 861303, 790901, 780819, 778434, 739308, 763371, 806404, 780058, 762271, 730772, 722209, 710409, 757632, 829407, 856918, 873563, 885458, 913723, 990649, 980998, 951017, 901071, 827823, 814235, 772022, 770172, 758091, 734507, 748501, 727571, 717943, 681259, 632949, 590138, 570537, 617400, 621955, 621748, 619639, 713349, 750705, 806884, 822250, 798128, 748941, 714427, 613151, 541422, 530983, 546969, 581753, 601565, 623898, 612908, 616875, 628868, 614166, 661049, 656339, 667267, 696006, 710439, 657172, 634829, 650331, 609423, 537551, 517697, 579212, 628847, 662081, 697589, 761854, 770149, 765828, 772086, 784644, 802147, 793959, 814770, 819872, 846406, 844847, 787841, 807465, 756582]
9514G56582n1668J0476j7925l0403j1220n741N484N5595j9665L3197O1340m5734
9502G40318j5184L5107K1910L0681k9966l791M9805j4532J0070P525m6855q7158
9490F97930p3963k4529k4529k3851o3401l2905N0904M1028N550n2035o5936l2977
9478D01286q7N6716O1689Q1273M2426o9920j5372j1070o8044J708r999k9561k0282
9465D20763j9229l1508r632k7119k3160j8169j8246L7262K1814l5102O783J1823
9453C16280k0085M1791J2533J0982m6213l1283J4059M3950o630j9530K4801M0429
9441C81084k2038M112j3708j1609r398M383k2517J0278k3788j0421m1273N3291
9429B98396O3142m8092M6475L0316j4688Q303m4291m0307K580J2035l2946k5521
$$ y = [756582, 704914, 715390, 697465, 667062, 655842, 650101, 655585, 711180, 691515, 724712, 786052, 740318, 725134, 760241, 782151, 812832, 782866, 779075, 828880, 814348, 824418, 831943, 785088, 697930, 623967, 599438, 574909, 551058, 487657, 454752, 505656, 546684, 552234, 500199, 434263, 401286, 401199, 457915, 519604, 600877, 643303, 573383, 558011, 546941, 478897, 480605, 470606, 441045, 420763, 401534, 370026, 360394, 333275, 310115, 291946, 273700, 310962, 332776, 297674, 304457, 316280, 296195, 337986, 350519, 361501, 315288, 284005, 298064, 342014, 335384, 315854, 340655, 381084, 359046, 363158, 349450, 337841, 328443, 332826, 310309, 320587, 296799, 286378, 245105, 298396, 361538, 313446, 359921, 390237, 375549, 383852, 339561, 299254, 301834, 313869, 280923, 255402]
9417B55402N5179J22881N3635q6280m5668J4718N8194L4787k4382m7807k2471
9406C68188k5743k5754J8972N9187M7645O3211J4055j1828J6780o132J3003q226
9394E23358j8626k4211J249j4513L0851M5379J0323m4334K148L4452L2809R3112
9382F71997L4670K857N4250Q9275J68810J71174J57324J93973K07661J81078J94666
9371B127735J88160J94465J62623O4163J539J1571q9515j43121j32009k15480
9361B170131k22242j48128j47244j39471q6264k9246o890n1028k1697m1535k8092
9350A248294l684J3587k0231j541K5113L9384O1674R1442P9121P6749O0418J18560
9338A788886J38839J35198J03064Q3181J24391J58570K13906K64958K85445L63134
$$ y = [255402, 310581, 433462, 487097, 400817, 355149, 369867, 428061, 462848, 438466, 390659, 368188, 342445, 316691, 335663, 394850, 442495, 505706, 519761, 507933, 524713, 518581, 531584, 523358, 504732, 480521, 481770, 467257, 498108, 543487, 553810, 509476, 511624, 546076, 578885, 671997, 706667, 709524, 763774, 853049, 1021859, 1193033, 1350357, 1544330, 1751991, 1933069, 2127735, 2315895, 2510360, 2672983, 2737146, 2738685, 2750256, 2660741, 2517620, 2385611, 2170131, 1947889, 1799761, 1652517, 1513046, 1426782, 1397536, 1390646, 1339618, 1317921, 1276386, 1248294, 1244610, 1258197, 1237966, 1236425, 1261538, 1300922, 1362596, 1454038, 1533159, 1609908, 1670326, 1788886, 1927725, 2062923, 2165987, 2249168, 2373559, 2532129, 2746035, 3010993, 3296438, 3659572]
9328C659572M33728M86529O62863P95240R23121J210277J603463K036194K379549
9319A4190536K797396L348707M278505N134064N745176N930529N060120K804510
9311D9289543m0859k581433m214580m924448n112801m794967m148737l424505
9303B0047213k508440j837825j369760j081230p75524n81676l97545k75885j36888
9294A1082440j3198J82509L63729P47411J177969J677288K332233L000966L588010
9285B4139357L831876L826216L813495L356828K309308J314792P69286N26336
9277D3887494k55498j751411l301118m258543m479321m039577l389206k700001
9269A9712819k011526j475008j078522p03298k69239P2379M66463R81430J523688
$$ y = [3659572, 4093300, 4579829, 5242692, 6037932, 6961053, 8171330, 9774793, 11810987, 14190536, 16987932, 20336639, 24615144, 29749208, 35494384, 41424913, 46485033, 49289543, 49248684, 46667251, 42452671, 37528223, 32415422, 27620455, 23471718, 20047213, 17538773, 15700948, 14331188, 13249958, 12474434, 11892758, 11495213, 11219328, 11082440, 11069242, 11251751, 11615480, 12362891, 13540860, 15218148, 17550381, 20551347, 24139357, 27971233, 31797449, 35610944, 38967772, 41277080, 42591872, 43361158, 43887494, 43631996, 41880585, 38579467, 34320924, 29841603, 25802026, 22412820, 19712819, 17701293, 16226285, 15147763, 14444465, 14175226, 14247605, 14714068, 15695498, 17219186]
9260A7219186K248266L033136L756396M459790M984260N098279M752536L899520
9252D9451369K685215J412095N08520J01690Q0093L48426Q47304J429134J613914
9243E8477760J135990j03777j751073l360028m323411m556354m100270l077539
9235C8341298j704134j26329J266467K325053L316038M285537N056726N180152
9227E7940808M159904K352132N09107m93477j60368Q21316J871182K294357J791947
9218G1086908O30750o84792j886009k711173l009564k798111k289305j706260
9210E6632444j238812q21676p92790j617942l017891m186984m547199m000607
9202C6408543l095975k119053j117931M889J165708K141499K890735L230991L071775
$$ y = [17219186, 19467452, 22500588, 26256984, 30716774, 35701034, 40799313, 45551849, 49451369, 52136584, 53548679, 54057199, 54158889, 54238982, 54587408, 55434712, 56863846, 58477760, 59613750, 59509973, 57758900, 54398872, 50075461, 45519107, 41418837, 38341298, 36637164, 36510835, 37777302, 40102355, 43418393, 47703930, 52760656, 57940808, 62100712, 64452844, 64961951, 64468474, 64308106, 65129422, 67000604, 69294961, 71086908, 71717658, 71032866, 69146857, 66435684, 63426120, 60628009, 58338704, 56632444, 55393632, 54571956, 53779166, 52161224, 49143333, 44956349, 40409150, 36408543, 33312568, 31193515, 30075584, 30080473, 31246181, 33387680, 36278415, 39509406, 42581181]
9193D2581181K547367K067665J673680J136396P91332J131498J826245K078136
9185E5833500J466971K14316j086355k077358k559260k553283k305879k098347
9177D4834305j723791j043485J1766J024006J701653J880099J458584O18946m72588
9168D8289495j437310k056478k022817j289373k81894O95311J619514K544530
9160D6060978L342635L794871L399469K041383J80109j200460j442574o95548
9152E5480863L87141J187254J079770J65033j297856l051270m575711n341693
9144D4033531n187787m255892k867425j286363K19537J588652K597121L035896
9136C7877270K981163K153120J005160l40331j546092k339776k514496k051260
$$ y = [42581181, 45128548, 47196213, 48869893, 50006289, 50797621, 51929119, 53755364, 55833500, 57300471, 57514787, 56428432, 54351074, 51791814, 49238531, 46932652, 44834305, 43110514, 42067029, 42078795, 43102801, 44804454, 46684553, 48143137, 48762083, 48289495, 46852185, 44795707, 42772890, 41483517, 41201623, 41896934, 43516448, 46060978, 49403613, 53198484, 56597953, 58639336, 58819445, 57618985, 56176411, 55480863, 55868004, 57055258, 58135028, 58300061, 57002205, 53950935, 49375224, 44033531, 38845744, 34589852, 31722427, 30436064, 30655601, 32244253, 34841374, 37877270, 40858433, 43011553, 44016713, 43676382, 42130290, 39790514, 37276018, 35224758]
9128C5224758j100968m4908P27503J187455J232380P12042j19600j066958j883207
9119C4868497k381307k437180k162521j843034k011116k186158k177177j806005
9111A7863999j199038o27140K8979P47390J517751K328714L162482L649749L510510
9102C0983396K469481Q20813p26759j942769k618693k778439k697902k518943
9094B0990185k283993k090189j857662j607913j310226j074366q32517o95754
9086I237565n42381l89306l38042k21422k49954k73183k27303q6040K251J06260
9076G018445K41183N00793O97099R87723J432456J966019K679151L452073M016027
9067B2990969M019031L404389K093866L67590j275250k678267l490167l652958
$$ y = [35224758, 34123790, 34078882, 34806385, 35993840, 37226220, 37938262, 37818662, 36751704, 34868497, 32487190, 30050010, 27887489, 26044455, 24033339, 21847181, 19670004, 17863999, 16664961, 16037821, 16066800, 16814190, 18331941, 20660655, 23823137, 27472886, 30983396, 33452877, 34273690, 33546931, 31604162, 28985469, 26207030, 23509128, 20990185, 18706192, 16616003, 14758341, 13150428, 11840202, 10765836, 9933319, 9237565, 8695184, 8305878, 7967836, 7746414, 7496460, 7223277, 6995974, 6909934, 6912185, 7018445, 7259628, 7760421, 8457520, 9445243, 10877699, 12843718, 15522869, 18974942, 22990969, 27010000, 30414389, 32508255, 32875845, 31600595, 28922328, 25432161, 21779203]
9059B1779203l446343l108302k680575k248642j851082j364222j075342q65104
9051E139591o42265n22501l80180k85811k65213k66759k33987j80497j87574j75637
9041A999167r0472r7807j02041o6082j05171r0292n6149l4819m1061m4447l5815
9030A235011R327J8580J1807n8969l4952N4476O7271k472R6317J39480J30274
9019A666150P7353J24677J60513J56238O0917K2491n8414j94206j62969j38246
9009A714504p7363r7552j12905j44746j40945j71364j33669m3150J563l2962k7116
8998G34295J8823O939n220o5597o3722J1061j0282j1725M674K0814m4209n6067
8986E39784j5064m9050m8217J9161L6707l8671n5052K2932M579L5044L5301J109
$$ y = [21779203, 18332860, 15224558, 12543983, 10295341, 8444259, 7080037, 6004695, 5139591, 4497326, 3974825, 3594645, 3308834, 3043621, 2776862, 2542875, 2362378, 2174804, 1999167, 1908695, 1810888, 1708847, 1642765, 1537594, 1447302, 1391153, 1356334, 1315273, 1270826, 1235011, 1244338, 1262918, 1274725, 1215756, 1180804, 1235280, 1302551, 1300079, 1396396, 1535876, 1666150, 1743503, 1868180, 2028693, 2184931, 2245848, 2268339, 2209925, 2015719, 1852750, 1714504, 1637141, 1539589, 1426684, 1281938, 1140993, 969629, 835960, 792810, 794373, 761411, 734295, 753118, 760057, 754837, 689240, 625518, 636579, 626297, 614572, 619246, 640060, 595851, 539784, 524720, 475670, 427453, 446614, 483321, 444650, 389598, 412530, 417109, 452153, 487454, 488563]
8974D88563j3982M087J6558k1898l8544O255j4615j35n5373j2703L1370n53k4694
8961C64336J0703K4480J0011M1291j0371n6153k6280n5220K3535j4641j8822r17
8949B91952O448l4876j7337K1581J548L2361Q99Q151m2507J6767K3212l8529k2805
8936B46865J2572L7733J0847k100l4504k245K0084K0380J7842l5509l0845l0775
8924B30345J6906N8097j5898o818r072k2979N575n131J2768K4009l4453J688N1564
8911C06601L9185O4686N25q2338m114L355k7861r979j2494M1117J10324N3451
8899D82458K3976k7753k7205L7546l4927r485o7624l1854o360j4744M4855j5510
8887C53373l2165l5362k449L8087K05j9075P67k316P357K2250L7084J321m028
$$ y = [488563, 474581, 478668, 495226, 473328, 434784, 441039, 426424, 426289, 370916, 358213, 389583, 389030, 364336, 375039, 399519, 409530, 450821, 440450, 384297, 358017, 302797, 326332, 311691, 292869, 291952, 298400, 263524, 246187, 267768, 269316, 301677, 302576, 310727, 268220, 284987, 308199, 269670, 246865, 259437, 297170, 308017, 305917, 271413, 269168, 289252, 309632, 327474, 291965, 261120, 230345, 247251, 305348, 289450, 282632, 273560, 250581, 256156, 251025, 263793, 287802, 253349, 255037, 306601, 345786, 410472, 410997, 328659, 324545, 327900, 300039, 290060, 277566, 318683, 429007, 482458, 506434, 478681, 451476, 489022, 454095, 444610, 376986, 345132, 338772, 324028, 368883, 353373, 321208, 285846, 283397, 321484, 321689, 302614, 303381, 301065, 308422, 330672, 367756, 369077, 365049]
8874C65049j815N425Q440K61M6905j9761k0005J9298N9633l4163K2520M9950k280
8861D99457k7042j0595m1775K7601j3839l5145l0911j3799l6258P475K90m1282
8849B84177N2561L1056J8419o6961j2968k16M7359J6022M6857N1459j1163J521
8837D58123k5208m4140K4454N3926M7183L6437j8639J8708O0468k7540r1638o3469
8825D28665l4696m9106k5480J6903l9049N8954J09838J9957p74m267P4141J370
8813E56456l4275K7421M8274L2701J3643k5418l4379k5132k9155M0757P1952k1452
8801F21393n3840k4460j8345o154J5893K2773n6305k8332n1208n9765l2882K9282
8789C58050K9158R464k3497m506L4958m4902K006N6767L0932L1236j274q5212
$$ y = [365049, 363234, 368659, 377099, 377360, 424265, 404504, 384499, 403797, 463430, 429267, 451787, 501737, 499457, 472415, 461820, 420045, 447646, 433807, 398662, 367751, 353952, 317694, 325169, 325459, 284177, 336738, 367794, 386213, 319252, 306284, 306068, 353427, 369449, 416306, 467765, 456602, 458123, 432915, 388775, 413229, 467155, 514338, 550775, 532136, 550844, 611312, 583772, 492134, 428665, 393969, 344863, 319383, 336286, 297237, 356191, 466029, 485986, 485212, 480945, 555086, 556456, 522181, 549602, 597876, 630577, 644220, 618802, 584423, 559291, 530136, 570893, 642845, 621393, 567553, 543093, 524748, 518594, 534487, 557260, 500955, 472623, 421415, 361650, 328768, 358050, 387208, 396672, 373175, 368669, 403627, 358725, 360731, 417498, 448430, 479666, 478392, 393180]
8777C93180K6166N1391N039k6786k5745k5789j9382L9138j0439k3576j9908Q478
8765C71767j4164L066j1484j7520N1644j8499M5335N3767J4469k4640k445N0269
8753E01565J1160q0309k3531K3302O4523o2662R857K0462J1894R190j4048K7217
8741D98620k9726m1238l5879M1462j0193O611N271K2483k4505m4104j8649O067
8729C76220n755p3259O097K4523N1682M5138n365k7883L620J308K9747Q205l0958
8716D03320n1193k7679l0948Q366k167J590J3093J7438K2478m17j2581K7758M0955
8703D10013K859m1665m4526j9560k0137k3390K2529m861K8138j7540j7890J2437
8691B86407O2763L672j5546k9439J705R832N4523j4567l2178l1798J8235L9381
$$ y = [393180, 419346, 470737, 475776, 448990, 423245, 397456, 378074, 417212, 406773, 383197, 363289, 371767, 357603, 360669, 349185, 331665, 383309, 364810, 410145, 463912, 478381, 453741, 451296, 501565, 512725, 432416, 408885, 432187, 496710, 434048, 443905, 464367, 476261, 485451, 471403, 498620, 468894, 427656, 391777, 433239, 423046, 429657, 434928, 457411, 432906, 388802, 370153, 376220, 370465, 297206, 303303, 327826, 379508, 424646, 419281, 391398, 395018, 396326, 426073, 434278, 403320, 352127, 324448, 293500, 301866, 299699, 301289, 314382, 331820, 354298, 353881, 341300, 369058, 410013, 412872, 371207, 326681, 307121, 286984, 263594, 286123, 281262, 309400, 291860, 273970, 286407, 349170, 352842, 337296, 307857, 309562, 319394, 373917, 359350, 327172, 295374, 313609, 352990]
8679C52990M444m6150m8598l5670m8056l7714q618Q207K0044J2276L4548M7016
8667B54719K9600q557k6661k2772N6857K7897p1895n6094k9163J8815J7042K1911
8655B11699M6902K5700K2337O0258L1801k4759m8803J1286l76j1711n4185o4408
8643B05741n3302K8245o959m5443J5144j1929m790O583J7888j4930o6341O2309
8631A32216L9358N9857l0477N703l7454j2883j7444l869J0725l0310m6475M939
8619G3886L3182n357M5363Q3709j2220l0770j4887K6670L1967j3237k2511l1053
8607A64742M0900K8690P153q434k7816J0616k751L574p9751n8265J0889K9380
8595A18927J6283J7041K9816L4760j2502L1805L195m8106L5153Q607o0965J1179
$$ y = [352990, 357434, 311284, 262686, 227016, 178960, 141246, 132628, 140835, 160879, 173155, 207703, 254719, 284319, 275762, 249101, 226329, 283186, 311083, 239188, 183094, 153931, 172746, 189788, 211699, 258601, 284301, 306638, 366896, 398697, 373938, 325135, 336421, 336045, 324334, 270149, 205741, 152439, 180684, 173725, 128282, 143426, 131497, 126707, 133290, 151178, 136248, 69907, 132216, 171574, 231431, 200954, 206657, 169203, 156320, 138876, 135007, 145732, 115422, 68947, 73886, 107068, 101711, 147074, 230783, 218563, 187793, 172906, 199576, 231543, 218306, 195795, 164742, 205642, 234332, 241485, 233051, 205235, 215851, 213100, 216674, 136923, 78658, 89547, 118927, 135210, 152251, 182067, 216827, 204325, 236130, 239325, 191219, 226372, 234979, 174014, 185193]
8583A85193N7285K1284o7834k9803r954k154k2195j5194K1957L1051n4240n827
8571A09569J6593J6799l661n246L336M596k4581J2240q616k7557N7241N0270M091
8558B05074k1165j1745k0092p3227o262K6806K7137o1961l487M1266L4769J8661
8546A55774K7710q847N3692l7975k7230K041j7083j4638Q143J0270Q281L1410
8534A91548K1750q8p9508p421M2770J5311K1613J6582j110J106n710P971j8822
8521B05992n6940l3288j0309J0269j7671k2087k63M3721O1749l1192k5558j4069
8509A10354K921j3790k302j6409l035M5572k2984l7045k9370j4597J5133m189
8497C0259k8116K4072N0705o7l6525K2436Q4718K3186k9079j6630M148K2019J2939
$$ y = [185193, 242478, 263762, 195928, 166125, 156171, 154017, 131822, 116628, 138585, 169636, 115396, 109569, 126162, 142961, 139300, 134054, 137390, 141986, 117405, 129645, 121029, 93472, 150713, 200983, 205074, 183909, 172164, 152072, 78845, 72583, 99389, 126526, 64565, 61078, 102344, 137113, 155774, 183484, 174637, 228329, 190354, 163124, 165165, 148082, 133444, 141587, 151857, 160138, 191548, 213298, 213210, 133702, 126281, 169051, 184362, 205975, 222557, 221447, 222553, 216843, 224814, 205992, 149052, 115764, 105455, 115724, 98053, 75966, 75703, 119424, 181173, 149981, 124423, 110354, 113275, 99485, 97183, 80774, 77739, 123311, 100327, 63282, 33912, 19315, 34448, 30259, 2143, 26215, 76920, 76853, 40328, 62764, 147482, 170668, 141589, 124959, 129107, 151126, 164065]
8484A64065K0276P0177n8023j0230J5563l3235j0396Q7301j2329n0887r533p260
8472A65489n4394Q5684L6115l3309l7227k7970L2943J4755P3584N959l7039j204
8460B23386L921K5596K9175j0570l4296o1803M388o959l3390j8856K7990L8246
8448A86828k3105l6136M4910J640p2969K6783L3779k4171p543M0156N381j9319
8436A56234K1212M9608m5179j8097l0605m0372J8091j3210J8114K9227N056p057
8424A43022Q3189L1918k5772J9129m9235k2067k6473K9929N0884J8368J1785n0796
8412B13881M773j6710j0942o741l1139N873j2206j0926j3598O4708L8213o387
8400B18799k80m0502n3511J3639k2281J5892n1821j2551J0343K9681k258M4911
$$ y = [164065, 184341, 254518, 196495, 186265, 201828, 168593, 158197, 245498, 233169, 182282, 172749, 165489, 111095, 196779, 232894, 199585, 162358, 134388, 167331, 182086, 255670, 261629, 224590, 223386, 227307, 252903, 282078, 271508, 237212, 175409, 179797, 172838, 139448, 120592, 148582, 186828, 163723, 127587, 172497, 174137, 101168, 127951, 161730, 137559, 130016, 170172, 175553, 156234, 177446, 227054, 181875, 163778, 133173, 92801, 110892, 97682, 115796, 145023, 150079, 143022, 226211, 258129, 232357, 251486, 202251, 180184, 153711, 183640, 234524, 252892, 264677, 213881, 218654, 201944, 191002, 184261, 153122, 158995, 146789, 135863, 122265, 186973, 225186, 218799, 218519, 178017, 124506, 138145, 115864, 131756, 79935, 67384, 77727, 107408, 105150, 150061]
8388A50061P3244J3642J3392R182k4922l145k843N296l3877k596l3178k3973M3276
8375A83559L2991K6451k7726P660J0578p3767j4814M1867k9423J7435o557j3011
8363A55243L00n722L9316J0642o6255p3739M6169N5482j4959M5728K5579J8040
8351B35824m337K2254Q567p762J1164o815m872M4561m2039o2306L653M798k2778
8338A79912K380M3059j3331J4888K7456n9835l3131L3368O8367m4456m8595M892
8326A74974R46n0243l520L9816O5884J3239K2263m3458m8517n3708M1934P179
8314A66789r487M8384J03664N1137k1107P538k2711j8899J8918N8854J2263J1724
8302D07067K5229K8667l1826K1120O6341N6166K1869P4026J65215K54195L66658
$$ y = [150061, 223305, 236947, 250339, 259521, 234599, 231454, 228611, 233907, 200030, 197434, 164256, 140283, 183559, 216550, 243001, 215275, 222935, 233513, 159746, 144932, 186799, 157376, 174811, 168254, 155243, 155543, 149821, 189137, 199779, 133524, 59785, 105954, 161436, 146477, 192205, 217784, 235824, 231487, 253741, 262308, 254546, 265710, 258895, 254023, 298584, 256545, 194239, 197892, 202690, 179912, 182292, 225351, 212020, 226908, 254364, 194529, 161398, 194766, 263133, 218677, 170082, 174974, 175920, 125677, 122157, 161973, 227857, 241096, 263359, 219901, 171384, 117676, 159610, 166789, 157302, 205686, 309350, 360487, 339380, 346918, 324207, 305308, 324226, 383080, 395343, 407067, 432296, 460963, 429137, 450257, 516598, 572764, 594633, 668659, 833874, 1088069, 1454727]
8291A454727N88940J039247J440826J038534l77632j161632j283429r19747m81682
8282A338152l08919k23223j01837o2878n6976j12990j6481l2052j0009k009N5
8271D10833k9499o587K5535K1117q379k5971J0242K7495N8541M2934L0641k1173
8259E35729l5972M4526J3745J16203K07597L66511M98813Q02095J281634J325663
8249E156544K38249r43261j263404j043781o53776l97620k44660j50374r3474
8240F04443p2724k0907m1792p4536j5958J4378q419K3517j3788j4580j7389P164
8228C69409n8689m9620M1167P4471j8483n7218l9344K2504k7841l008R373k9901
8216B32820l2116M2442J2577K9533O052j9848J0342j9083k6092Q589M2784n33
$$ y = [1454727, 2043667, 3082914, 4523740, 5562274, 5184642, 4023010, 2739581, 1819834, 1338152, 1029233, 806010, 704173, 641295, 584319, 471329, 454848, 422796, 412787, 410778, 410833, 381334, 374747, 400282, 421399, 413020, 387049, 397291, 424786, 483327, 526261, 556902, 535729, 499757, 544283, 558028, 674231, 881828, 1248339, 1747152, 2549247, 3830881, 5156544, 5394793, 4451532, 3188128, 2144347, 1490571, 1092951, 848291, 697917, 604443, 531719, 510812, 469020, 394484, 378526, 392904, 384485, 408002, 394214, 379634, 362245, 369409, 310720, 261100, 302267, 376738, 358255, 301037, 261693, 284197, 256356, 253348, 262721, 232820, 200704, 243146, 255723, 285256, 291308, 271460, 281802, 262719, 236627, 245216, 288000, 287467]
8204B87467o2771j3070m2243j882r41J0645J7202k3986J89J8665L5135L871R032
8191B37313m83L5519k0798r9577J5122L4280L8039O05n4974p5069K6597K5538
8179A62112M0138l2233K9779n5669l787Q260M495m2541Q611l258L091N4099J3627
8166A86724l6151j1922K8897p556N333l440k7319J6571J3839q921J173j9257k353
8153A35618O0430J9864k9399O1674J7557o7809p8806j2153j4170O1969j9087K7351
8141A63039J9210j6946o0422n878J618L2133J5894k0897m1595M5336L2517j7877
8129A46132k4218l3388j0228L0368M1749J3126j0078p3784n5591J3699M9185j0555
8117G6417n027K6459O6570j939o9509l2759k874k2643L3714J2106L2649K965q1961
$$ y = [287467, 224696, 211626, 169383, 167501, 166560, 177205, 194407, 170421, 170610, 189275, 224410, 228281, 237313, 236830, 272349, 251551, 151974, 167096, 201376, 239415, 240020, 185046, 109977, 136574, 162112, 202250, 170017, 199796, 144127, 140340, 148600, 153095, 110554, 119165, 115907, 118998, 173097, 186724, 150573, 138651, 167548, 159992, 165325, 161885, 134566, 151137, 164976, 156055, 157228, 137971, 135618, 196048, 215912, 186513, 248187, 265744, 197935, 119129, 106976, 92806, 154775, 135688, 163039, 182249, 165303, 104881, 99003, 100621, 132754, 148648, 127751, 86156, 131492, 164009, 146132, 121914, 88526, 78298, 108666, 150415, 163541, 153463, 79679, 24088, 37787, 86972, 76417, 71390, 97849, 164419, 162480, 92971, 60212, 57338, 34695, 68409, 80515, 113164, 116129, 34168]
8104C4168l9460K8211K3894L3711N7944K557j3055J9972m7090j9585K6562J3013
8092A20842j9708k4655J3628N3976m4226l2123J1488M0431k0128L5713r720o9264
8080E6254j8225L3613L4707L3396J0444j2402k0501j0177l2495m7306j9868K3708
8068C1148J9888P5379k3180n076K3940N074J3961m7278K423l767m9594j5030L8419
8055F6307L3080L1822J5170k5641O676k2378j3017J2478l4959l2655m9363k770
8043a5250J00074M1885m8330m7169P399K0807P726o944K0814O9991K1349k049
8031A70303o7099n7229r253r392j7532N8175m6857o9689M2746Q1566Q2569K7684
8019A85992J1998l6387l2857l3785M526K8508N0215Q0487J3781l8878m2407n4497
$$ y = [34168, -5292, 22919, 46813, 80524, 138468, 141025, 127970, 147942, 100852, 81267, 107829, 120842, 101134, 76479, 90107, 144083, 99857, 67734, 79222, 119653, 99525, 135238, 125518, 56254, 38029, 71642, 106349, 139745, 150189, 137787, 117286, 107109, 74614, 27308, 7440, 31148, 51036, 126415, 103235, 98159, 122099, 127173, 141134, 93856, 96279, 92512, 42918, 27888, 66307, 99387, 131209, 146379, 120738, 127414, 105036, 92019, 104497, 69538, 36883, -12480, -15250, 84824, 126709, 78379, 31210, 38609, 59416, 67142, 60198, 81012, 151003, 172352, 170303, 103204, 45975, 36722, 27330, 9798, 67973, 21116, -48573, -5827, 75739, 158308, 185992, 197990, 161603, 128746, 94961, 99487, 127995, 178210, 258697, 272478, 233600, 191193, 136696]
8007A36696k4939J8549L1284K2085n0932j4145k6120J3886J7804k856k0749j7452
7995H3111J3241k0304R372j9912J9362k5539k3754J010j8456j0209K7134M7035
7983H2091K494l6932N907M027L3647N1137j2932M190k4970j2348n447K5725k8729
7970H7860k0855L687O1506n678j7534n994K7118L3867n7741l5678J976l8039Q227
7957D2722q778k6418J779O987j7526K8202M3092J7160r540J518K2073J6754j7219
7944A00806O162k5987q730K7881J3545R51L6706M8050k9154j2358k1922k7918
7932A08032l1835k7514Q4294M0560l0374j7795J4381j1314O84j4921m9948m3397
7920B0853L2715k0390m8586L168Q4144M0368j6476N816K3491P785J9190l009k3390
$$ y = [136696, 111757, 130306, 161590, 183675, 132743, 118598, 92478, 106364, 124168, 121312, 100563, 83111, 96352, 76048, 85420, 65508, 84870, 59331, 35577, 36587, 18131, 7922, 35056, 82091, 84585, 47653, 53560, 57587, 91234, 142371, 129439, 133629, 108659, 96311, 90864, 116589, 87860, 67005, 70692, 132198, 126520, 108986, 102992, 130110, 163977, 106236, 70558, 72534, 34495, 42722, 33944, 7526, 9305, 16292, -1234, 26968, 70060, 87220, 77680, 79198, 101271, 118025, 100806, 106968, 80981, 72251, 100132, 113677, 114628, 151334, 199384, 170230, 157872, 135950, 108032, 76197, 48683, 132977, 173537, 143163, 125368, 139749, 128435, 129119, 114198, 64250, 20853, 53568, 33178, -15408, -12240, 71904, 112272, 95796, 101612, 125103, 132888, 152078, 149069, 125679]
7907A25679l185K0161k8969k3528J5888j2991l2626j0599j3044K4337M1702L6123
7895A38948l371m0564N895l0149k0174q177L189K2214p919k128j600n4455O381
7882H090j8310k553R694k650L5683l0764m5621j3136P1318K3925k6754n382N2890
7869E6430j9021o3057N2453N8796l1437L118O1053l9515q3641k7233J0119L4122
7857A2187P786L7397N054j927N7373J481l904L518l1254J1027J0868l3038l4837
7844D1731L1088J0858m6298k2773R2499M7677j0127O353k7512k4610M8059O807
7832A53752q5617K2001j8180j2127p2036j6276Q468J3732j0014M7728O8022M5655
7820A45108K5012m1796n3504K0637J1711k3567n1994J2221J7139k0860J6163M326
$$ y = [125679, 122494, 142655, 113686, 90158, 106046, 93055, 60429, 49830, 36786, 61123, 102825, 138948, 135577, 95013, 100908, 70759, 50585, 42408, 45597, 67811, 59892, 57764, 56164, 1709, 8090, -10220, -12773, -3079, -5729, 29954, -810, -46431, -59567, 11751, 35676, 8922, 3540, 56430, 37409, -25648, 26805, 85601, 54164, 57282, 118335, 78820, -4821, -32054, -21935, 12187, 19973, 57370, 62424, 60497, 117870, 119351, 115447, 118965, 87711, 98738, 109606, 76568, 41731, 72819, 83677, 37379, 14606, 107105, 154782, 144655, 151008, 123496, 98886, 146945, 153752, 68135, 90136, 71956, 59829, -12207, -28483, -20015, -6283, -16297, 31431, 99453, 145108, 170120, 128324, 74820, 95457, 107168, 83601, 31607, 43828, 60967, 40107, 56270, 60596]
7808F0596j1557j795M2174j9696q404L1459O031j9132q5132o3936n295O4993O5425
7795E5731K5531k7883n5426j2938J0182J3878N413M1448L0398l2755k7080P0916
7783I7415K5017j9318r798m062m7761k5935J1782M3427j0891o726j1311l6807
7771E032M1205j9632J1297N8509k3278k0387L5252L2812o5868j7160R726J0137
7759E7645K6658L5725j2909n0372J3811N4387j6405l8835m6735L7055L9227N6282
7747A55534l7273o2542J606Q1947N8622n3004o4817l5266j6484L7793J7462k9938
7735E3640M972j656J5733K0132O7572m0629l7791k134j9581q626o577L445J0408
7722E8908m713O1697J0744n8717n7042J4742K9410R869O523m9435m1117M7196
$$ y = [60596, 49039, 47244, 89418, 69722, 61318, 92777, 98808, 79676, -5456, -69392, -74687, -9694, 55731, 81262, 53379, -2047, -14985, -4803, 9075, 14488, 55936, 86334, 53579, 26499, 97415, 122432, 103114, 93316, 89254, 41493, 15558, 27340, 70767, 59876, 53150, 41839, 5032, 46237, 26605, 37902, 96411, 73133, 52746, 87998, 120810, 54942, 37782, 47508, 57645, 84303, 120028, 107119, 56747, 70558, 124945, 108540, 69705, 22970, 60025, 99252, 155534, 118261, 55719, 57325, 139272, 197894, 144890, 80073, 44807, 28323, 66116, 83578, 53640, 58612, 56956, 72689, 92821, 160393, 119764, 81973, 79839, 60258, 51632, 45055, 48500, 58908, 54195, 115892, 126636, 67919, 10877, 25619, 55029, 64898, 71421, 21986, -19131, 28065]
7710B8065M840P556O0784K3053k3551k1252k8480J4792l1913J7502m4256J1563
7698A8703K6606j3727M4580K0932l3959k7036j2545j9849J2079K5091l5146l5226
7686b9497L5132N6978k6400J3130J0986K0209P752j5701j3840k9466Q730P9646
7674A17659n96r052r402q323k8750j822l9461j4321K714p910J8594k503J8654
7661C5481K2323m7176o1593J0504M8072O2215P454M1397K0717j6722m2515M0412
7649A20569q37m95k6629l3196L415M4842l4755l6936J0945N1373K2499l5879K1131
7636A06047q17j160L5910k7970k5754K3388m7071m1198M5079j2881M182M7689
7624A05444J2821n3422k844J2394l7194j3104j4248K3412N6930j2359l1542k2543
$$ y = [28065, 32905, 40461, 101245, 124298, 100747, 79495, 51015, 65807, 33894, 51396, 7140, 18703, 45309, 31582, 76162, 97094, 63135, 36099, 23554, 3705, 15784, 40875, 5729, -29497, 5635, 62613, 36213, 49343, 60329, 80538, 88290, 72589, 58749, 29283, 38013, 117659, 117063, 108011, 98609, 90286, 61536, 59714, 20253, 5932, 8646, 736, 19330, 16827, 35481, 57804, 10628, -50965, -40461, 7611, 69826, 77280, 118677, 139394, 122672, 80157, 120569, 119732, 119237, 92608, 59412, 62827, 107669, 72914, 35978, 46923, 98296, 120795, 84916, 106047, 105230, 104070, 139980, 112010, 86256, 109644, 62573, 21375, 66454, 53573, 57755, 105444, 118265, 64843, 61999, 74393, 37199, 24095, 9847, 33259, 90189, 77830, 46288, 23745]
7612B3745p568J5269J3762J8030j081M3487k4754m6877l8848j7673K8853k1888
7600a5543R745J7836L1743J8746J0966j2282L7390J8413j8136L8934K0212k6675
7588A31349o2333j2193K0342k1414L5512M979n2069n0090K7962M1361q5696J2780
7576i510M3421L9622J0291J8033m625K0606P5043j8739l4406j7196j8977r94L1319
7563A33888R399k3653k7655p418j8209k8298J6968N5520p1340k4843L387K136
7551A9882K0514M7106J7655l3686m9406k0407M6099l3346n1736L0646M7764J8794
7539E9879k3681l836K4416k074l6527n3419J6321O6414N9571J9249m4588k4276
7527E7449n8971j6676J8117L7996K0251N518j3136O529M1874m6649r0259j96r116
$$ y = [23745, 16177, 31446, 45208, 63238, 62157, 105644, 80890, 34013, -4835, -22508, 6345, -15543, -5798, 12038, 43781, 62527, 73493, 61211, 98601, 117014, 98878, 137812, 158024, 131349, 69016, 56823, 77165, 55751, 91263, 96242, 44173, -5917, 22045, 63406, -22290, -9510, 33911, 73533, 83824, 101857, 97232, 117838, 192881, 174142, 139736, 122540, 103563, 102569, 133888, 143287, 119634, 91979, 84561, 66352, 38054, 55022, 110542, 39202, 14359, 17746, 19882, 40396, 87502, 105157, 71471, 22065, 1658, 47757, 14411, -37325, -6679, 41085, 59879, 36198, 32362, 56778, 54704, 18177, -35242, -18921, 47493, 107064, 126313, 81725, 57449, -1522, -18198, -81, 37915, 58166, 63684, 50548, 57077, 98951, 52302, -37957, -38153, -47269]
7514d7269O3300Q9502P366n2103N818L8367j1064l4467k8350J8750p853J8751
7502F0748P626J4048M6850j4805p1453j4015L3994O0078J3268j571j0875l1024
7490I2869m3704j6361L0372N6105K5083m0001K659K9692J1695L5843p7382p4795
7478C2075J399L1125k8556l9502r875K5860j54j9471L035J1512J9399L6872O2118
7465A25837m7585Q374J2476L9625m8752j01023o6095j3328r5L7578M3563L9883
7453C0458J7187k3990j3845l5668Q161j7526m2692M5032L830J8031l3000J2454
7441c1568R176K6508k4555r295J7071L5576K4683M149Q057k3638l6407J1448J9884
7428C1089P053R873j9609J975K9205k7387K634K5958k3255p064j5292K1525L8594
$$ y = [-47269, 16031, 105533, 112899, 60796, 66614, 104981, 93917, 59450, 31100, 49850, 41997, 60748, 68374, 82422, 129272, 114467, 43014, 28999, 62993, 123071, 136339, 134768, 123893, 92869, 49165, 32804, 63176, 119281, 144364, 104363, 107022, 136714, 148409, 184252, 106870, 32075, 33474, 64599, 36043, -3459, -13334, 12526, 12372, -7099, -4064, 7448, 26847, 63719, 125837, 78252, 86626, 99102, 138727, 89975, -11048, -77143, -90471, -90566, -52988, -9425, 30458, 47645, 23655, 9810, -25858, -17697, -35223, -77915, -32883, -29053, -11022, -44022, -31568, -22392, 4116, -20439, -29734, -12663, 22913, 47596, 51745, 59802, 36164, -243, 11205, 31089, 38142, 48015, 28406, 30381, 59586, 32199, 34833, 60791, 37536, 30472, 15180, 36705, 75299]
7415G5299j2454j8306k412j7467l491o840R578K4915j1713j9423m5941R733r400
7402b7922k0709j625J7442K18K7480M0977J0715J247j1877k053p964r598n5583
7389c9252N385K7884L0219K8426K0249K7551K7507o9977o8818K9650L6507P0048
7377A25379L4349j1231r698k4679l7339l2268j8222K6602J4703L4930l0822J9846
7365I1550J6039l4910j6595M2508j060l4527l0343J1443l6583O318P210j5930
7353E120k3356K816K6111O368J1577O5746J0079j5712n0278p9811p441O8162R0339
7340A09720p518k3450p0507n2073j5379L7353M606l2375K4455K674N981l6172
7328e2685j4158N8669N5296L1467j4530M5576l4668J2489k2239l4978k7074l3679
$$ y = [75299, 62845, 44539, 42127, 24660, 21169, 14329, 23907, 48822, 37109, 17686, -28255, -18522, -27922, -48631, -50256, -32814, -32596, -5116, 35861, 46576, 47823, 35946, 33893, 25929, 16331, -39252, -33867, -5983, 24236, 52662, 72911, 100462, 127969, 57992, -10826, 18824, 55331, 125379, 159728, 148497, 138799, 114120, 76781, 44513, 26291, 52893, 67596, 102526, 71704, 91550, 107589, 72679, 56084, 98592, 97532, 63005, 32662, 44105, 7522, 13840, 21050, 5120, -18236, -15420, 10691, 17059, 28636, 94382, 104461, 88749, 38471, -41340, -48781, 19381, 109720, 102202, 78752, 8245, -43828, -59207, -21854, -17248, -49623, -25168, -22494, -16513, -52685, -66843, -8174, 47122, 78589, 64059, 109635, 74967, 87456, 65217, 30239, 3165, -30514]
7316c0514M7713M8538Q404k7322J12M6364j4012J1074L5109l938q7856n7537k934
7303b6799P6638L168p4836P636L7853k0694n5588J5802p436l69J6875n7662j3452
7290i8864k0437K5398L1754k9763L368J3043K3814L7255L505j04k1823m9583j737
7277h4174N6134K5493k3412J6070J3948O6334J2182m6718k1190M9053o549l7447
7265A9724K5670J4723M0226J1262q6782o9538R473N7831L7596o8760l2874Q697
7253c2752M8116K1649k1630j2978O118l8273L237N883j371K2459L1652M591l2298
7240D403j2393J5634m7449l3523r316K1380L5803K7159j2011M4115N2453J6108
7228A02363m4185r0796j5214M8990O691m3151J5487k3600N858L923J7578M9026
$$ y = [-30514, 17199, 65737, 74141, 46819, 46931, 93295, 79283, 90357, 125466, 121528, 33672, -23865, -26799, 49839, 53007, -21829, -14193, 23660, 2966, -52622, -36820, -44256, -44625, -27750, -85412, -98864, -119301, -93903, -62149, -91912, -88544, -75501, -51687, -14432, -10927, -11031, -32854, -82437, -84174, -28040, -2547, -25959, -9889, 4059, 70393, 82575, 35857, 14667, 63720, 57171, 19724, 45394, 60117, 100343, 111605, 24823, -44715, -35242, 22589, 60185, -8575, -41449, -32752, 15364, 37013, 15383, 2405, 8523, -29750, -26513, -20630, -22001, 458, 32110, 36701, 4403, -7990, 7644, -39805, -73328, -82644, -61264, -25461, 1698, -10313, 33802, 86255, 102363, 58178, -32618, -47832, 1158, 7849, -35302, -19815, -43415, -37557, -33634, -16056, 32970]
7216C2970j9914M928M8555R908n9304j4466K4017L0539k6099r093j2872m0469
7204c1300j8588N8300J22578Q57n2701l5432l0720k7820n576J0872K8829L8494
7192E7793j9693o0360N5393L8526n6233k4893o152K2278J4415M2506M0359m916
7180I9023R72k5083k8021J1355j7663n9832K3950J7935J1681j9116j3641l4385
7168c2825o299K106l1373L8684j1097j1850K1966J7362r905k081L979N074O0777
7155D4518k2879k2809j1341r166m5344K6355M2020j7433L706L1680l529j1903
7143C875J2826M619m463M768L3357M0201o4886j1439k9510o934L5631N7440l6204
7130C9281j7025j4875j2705J7805N4760l5494k8802j9682K5864K3153K4798n600
$$ y = [32970, 13056, 17984, 66539, 76447, 17143, 2677, 26694, 57233, 31134, 22041, 9169, -31300, -49888, 8412, 130990, 131847, 79146, 43714, 12994, -14826, -20402, -9530, 19299, 57793, 38100, -22260, 33133, 71659, 15426, -9467, -15619, 6659, 21074, 63580, 103939, 99023, 99995, 74912, 46891, 58246, 40583, -19249, 4701, 22636, 34317, 15201, 1560, -32825, -39124, -37018, -68391, -29707, -40804, -52654, -30688, -13326, -23231, -25312, -21333, -16259, 44518, 21639, -1170, -12511, -21677, -67021, -40666, 1354, -16079, -12373, 19307, 15778, 3875, 16701, 21320, 16857, 21625, 54982, 95183, 30297, 18858, -10652, -17586, 18045, 75485, 39281, 22256, 7381, -5324, 12481, 67241, 31747, 2945, -16737, 9127, 32280, 57078, 51478]
7118E1478k3059N2206K6289N938n5311J1973K1710k6217j7569P908R30j8073O68
7105C8871m1025J6845Q636k0086j9963j6920O0356r226m1322K893k9758k5398
7093g6097L7011l887L0629r836p392P847O371l685k854l8787M9485L2872j7254
7080D423l4135l330k007M2032J4924L6759J3657j7166n8282K8895K9833n0095
7068E508j2N390j3854j3083n8240L099L6670n287L9956P0107l8067k0835j4078
7055b726l1773j1280M8122K2858l721o534K1913L9959O8317k3274m8079k78j7306
7042E6198j7714l4971n707L4638L0918l4170J3885L3234j6869r054p959j6670
7030B5759l5493M2353M3364o919j9455j3645K5022L3119n7557o9057n5559K1196
$$ y = [51478, 28419, 80625, 106914, 112852, 57541, 69514, 91224, 65007, 47438, 55346, 56276, 38203, 38871, -2154, 14691, 23327, 3241, -16722, -33642, 26714, 17488, -23834, -20941, -50699, -76097, -39086, -42973, -12344, -22180, -29572, -21725, -15354, -19039, -21893, -60680, -11195, 21677, 4423, -29712, -33042, -35049, 6983, 21907, 58666, 72323, 55157, -3125, 25770, 55603, 5508, 5496, 10886, -2968, -16051, -74291, -71192, -34522, -39809, 147, 70254, 32187, 11352, -2726, -34499, -45779, 2343, 25201, 21480, 14946, 36859, 76818, 145135, 121861, 73782, 73504, 56198, 38484, 3513, -2194, 32444, 63362, 29192, 43077, 76311, 59442, 50388, 42429, 25759, -9734, 32619, 75983, 69064, 49609, 35964, 60986, 94105, 36548, -32509, -88068, -66872]
7018f6872J5516L9239O126J1973m98K6676l5388k0294N022j1062k0869J9308P3402
7005D2279M2769l1197J8303J923j787j2350n241K6443j2814n0770l4853k0395
6993c7690l76r626j4899k2269M7830Q8201J8221n0021j3300K102L2033j9385l0631
6980i810k9171m5618l2785k5527M414M6654K7803K1901K6136L1592L410J9272
6968C8271m0544l0586J5553L5388L3176O069J6745L997k4952l1966m498l0972
6956a4319J6993J9742k7210O425K3185J8149n25K987l2821k3730N722M4618J6221
6943E5437K1009O8614J2608m1940n7256Q274M0691j8441j771l3866k3948j8110
6931A1301j7334j748L3554r85p1923Q659J5137K0318k6638l4876O602Q0674O417
$$ y = [-66872, -51356, -12117, -5991, 5982, 5484, 32160, -3228, -23522, -18500, -29562, -50431, -31123, 42279, 85048, 53851, 72154, 74077, 72290, 59940, 54699, 81142, 68328, 17558, -17295, -37690, -38066, -47692, -62591, -84860, -37030, 51171, 69392, 19371, 6071, 8173, 40206, 20821, -9810, -38981, -84599, -117384, -142911, -138497, -91843, -64040, -42139, -16003, 15589, 18999, 38271, -2273, -32859, -17306, 18082, 51258, 57327, 74072, 78069, 53117, 21151, 16653, -14319, 2674, 22416, -4794, 1631, 24816, 42965, 42440, 45427, 12606, -11124, -5402, 39216, 55437, 76446, 145060, 157668, 115728, 58472, 66746, 107437, 88996, 87225, 53359, 29411, 11301, -6033, -7781, 25773, 24788, -47135, -38476, -23339, -3021, -29659, -64535, -57933, 22741, 29158]
6918B9158k1814k0724K0613J3672K4979j3698m584l9025j084k028p756L995J4324
6905c972m4558k5899R447m366K2827P851L0162K084j1098k2209l541l1589n011
6892g9872J00724m760l8669J5057Q942J2064K6132j291o205k635R709L2308J093
6879G2597J3606l7808P202m5746n0065m3562Q905N6975N9940P9223l6777k0670
6867F3820l0690n1553n5008l9205M1581R241M6009L9421J0735K5212k904j2184
6855D4475j5820n4656j2214K4907N902K556j2743K5808P296Q50N796m381k1429
6842c653k4099J4073k2668l4860q84L0273m1026J8427J3447k004O5547J04480
6830A17053k2591p1367j9175m1214j8864J5631J2130l4315M3337O4947j2689m7225
$$ y = [29158, 7344, -13380, 7233, 20905, 45884, 32186, 27602, -11423, -12507, -14535, -22291, -18296, -3972, -48530, -74429, -64982, -69348, -46521, -38670, -8508, -6424, -17522, -39731, -43272, -74861, -79872, 20852, 16092, -22577, -7520, 1422, 13486, 39618, 38327, 32122, 29487, 39196, 71504, 72597, 86203, 48395, 55597, 9851, -40214, -83776, -74871, -17896, 42044, 121267, 84490, 63820, 33130, -18423, -73431, -112636, -71055, -61814, -15805, 23616, 34351, 59563, 56659, 44475, 28655, -26001, -38215, -13308, -7406, -4850, -17593, 8215, 15511, 16361, 22157, 17776, -3653, -27752, -13679, -36347, -71207, -72091, -41818, -82844, -64417, -50970, -52974, 12573, 117053, 94462, 23095, 3920, -37294, -56158, -40527, -28397, -62712, -19375, 45572, 32883, -14342]
6818a4342j581Q369m3120k0277L3796J5154n088K5609m442J7610j0648l2843k1134
6805e2937n092K1375M5590j1701k5366J1011m8125o1270J0349J07987Q4890K4330
6793A01041J5254q5213o8124J3384L6903j1278m0713J552k3867o57M2826O350
6781a2542J2682N5534O991m2927J1673j6321m6702M2869J9711R718J8722m5332
6769A4076k9931J3217J9652J1790k4228J9388k8863n9798P1337r117o7443L5708
6757c4212M8604m7793n8653L9267M7940k6107m1754L4952M2737K9074L4864o2165
6745F754O327N1659j6410L140m184m4628n235r188l4605K1462k7823j9967n0894
6732a23592K453L2030Q809J1488L1624j548L9979K4565J883p105k4246K2136K7136
$$ y = [-14342, -15923, -7554, -50674, -70951, -37155, -22001, -27089, -1480, -5922, 11688, 1040, -31803, -52937, -58029, -36654, 8936, -2765, -28131, -17120, -65245, -126515, -116166, -8179, 76711, 101041, 116295, 31082, -37042, -23658, 13245, 1967, -38746, -37194, -61061, -61718, -18892, -12542, 140, 55674, 62665, 19738, 31411, 15090, -31612, 11257, 30968, 40686, 59408, 14076, -15855, -2638, 17014, 28804, 4576, 23964, -4899, -64697, 6640, -2477, -69920, -34212, 14392, -33401, -92054, -52787, -4847, -30954, -72708, -37756, 4981, 34055, 68919, 6754, 13081, 64740, 48330, 51470, 47286, 2658, -2577, -11765, -46370, -24908, -52731, -72698, -123592, -121139, -89109, -80300, -68812, -37188, -38736, 1243, 25808, 27691, 20586, -3660, 18476, 45612]
6719D5612J1330j69R912M3232m3364j9185p9437m6783L1874J3809J8822M7446
6707C3099K5845k695j4969K8470J9638j6952o4018m3219P4750L9130r7928p0914
6695h9763k1869P2575N2070J3198l613m4255J3764K8707k5336N700O2742M2149
6683A06069J8702l7531J5970m7574o2659m288r491n0124k2212o97N5505M2442
6671D112k5631n4841l31N2924Q9334M4782K5584J5914j4699o9338l0293m4475
6659f958m748J5188M4989N425k1530j0224L413j4377m2483L5212k0968l0128j3450
6646f0639N908J7207K6718O9574k3663o4395j840n7380o325P2755M0948k0958
6634b090l8275J2090l7132o835M8319O2455L7417L2097j3724o5403k1067O3654
$$ y = [45612, 56942, 56773, 66685, 109917, 66553, 47368, -32069, -78852, -46978, -33169, -14347, 33099, 58944, 56249, 41280, 69750, 89388, 72436, 8418, -34801, 39949, 79079, -18849, -89763, -111632, -39057, 13013, 26211, 22598, -21657, -7893, 20814, -4522, 1178, 63920, 106069, 124771, 87240, 103210, 55636, -7023, -11311, -20802, -70926, -93138, -93835, -38330, 4112, -21519, -76360, -76691, -23767, 65567, 110349, 135933, 151847, 137148, 67810, 37517, -6958, -11706, 3482, 48471, 53896, 32366, 22142, 25555, 11178, -31305, 3907, -17061, -47189, -60639, -54731, -37524, -10806, 58768, 35105, -29290, -31130, -88510, -94835, -22080, 18868, -2090, -40365, -28275, -65407, -72242, -23923, 38532, 75949, 108046, 94322, 28919, 7852, 71506]
6622G1506m2793o4792K2193L8487l6310L7014J0477K7064M7709m8959m2267m7959
6610b8630J6357Q8754Q156l5258m4517l1097J8004N20k1719J5708j9627K1462
6598a1887k7727m460M4232O1282J8815l9177P7889m9328k8391n5005n5485l8716
6586a07958J8184P2835Q1342m785j6931k6901K8151J6203R288Q52J6706m1293
6574D5693k9317o8359l5923k5692j0273n131M0764K6654K1563M6951J1083L4137
6562E2150O6575J8051n6722l5690l0443L596L366J4776n2886o0362k6017N8976
6550d4630M3124M1164r765m2274K684K936m3252N388R632n4840j4854o154O5493
6537d5348J4304j3691j7167j689j2566N4132K6289k1844m4280J4938L2786Q4708
$$ y = [71506, 28713, -36079, -13886, 24601, -11709, 25305, 35782, 62846, 110555, 61596, 19329, -28630, -12273, 76481, 84637, 49379, 4862, -26235, -8231, -7711, -29430, -13722, -33349, -11887, -39614, -44074, 158, 61440, 80255, 41078, 118967, 69639, 41248, -13757, -69242, -107958, -89774, -16939, 64403, 59618, 42687, 15786, 43937, 60140, 69428, 70280, 86986, 45693, 16376, -51983, -87906, -113598, -123871, -129002, -88238, -61584, -40021, 6930, 18013, 52150, 118725, 136776, 80054, 44364, 13921, 17517, 20883, 35659, -17227, -77589, -103606, -44630, -1506, 39658, 29893, -12381, -9697, -6761, -50013, -44625, -34993, -89833, -104687, -110841, -45348, -31044, -44735, -61902, -63591, -76157, -22025, 4264, -17580, -61860, -46922, -14136, 70572]
6525G0572J4215o156J2732l8648L6848j8679p085m0413n7119k006k3319j542K1832
6512c8768K4506J0200j2049N5576n256k3416L320J0320Q754l9591J6652J1344
6500B1592j3962J2166n1454K5905K6665K1195l9388r507k6213k1962r651J2410
6488e2204r373M1499l9879j4062l2877Q5358N4694k320j8451q859J1253j7175
6476b396n7149j3335n851n893N2939O1962L2159k013q670L3237J1509l2468J2287
6463G6318j7752n6356k6526M6517j3232n9750l8195P612L649Q692L100k1614M5203
6450d2334j5818k9292l561M3344J3387l3389J21j9184n321K1938J3696O0089N3911
6437E7587j1147k9951j4956L0524k5217k3492k2390Q946m77m3407k140L0944J535
$$ y = [70572, 84787, 78631, 91363, 52715, 89563, 70884, 63799, 23386, -33733, -35739, -59058, -60600, -38768, -14262, -4062, -16111, 39465, 34209, 10793, 14113, 24433, 33187, -6404, 10248, 21592, 7630, 19796, -31658, -5753, 20912, 42107, 2719, -6788, -33001, -54963, -64614, -52204, -61577, -20078, -59957, -74019, -106896, -21538, 33156, 30836, 12385, 3526, 14779, -2396, -59545, -72880, -78731, -84624, -31685, 30277, 62436, 60423, 51753, 84990, 96499, 64031, 76318, 58566, 2210, -24316, 22201, 8969, -50781, -88976, -81364, -77715, -69023, -65923, -87537, -42334, -58152, -87444, -91005, -47661, -34274, -67663, -67542, -86726, -92047, -70109, -56413, 3676, 57587, 46440, 16489, 1533, 32057, 6840, -16652, -39042, -30096, -30573, -73980, -76120, -45176, -43641]
6424d3641J8959P802L4804Q756K4899l8607l4899L6570l3279m2588N1027L6541
6412B6344n4742k8977N4272L9569j7150k2683k1489Q03J442L2201M0118K3423
6400G3131k8761N409K1008k4833o363j0533q8629k2005J8651K3862l9952n314
6388h4329J7740L42J9630L7174l5752k331j4833J8735M0359P4362Q369l9668j3459
6375B6339J2142k5214l047L215j1890o5211j1549P3376L0517J9184k8168k0909
6363a215L040K1265M9329m6568j4007M5146J8831l4697o2741j6460n5794n5463
6351a49334O7479L8948K1626l46k6711M2618J7157o5507L6826N3408m8143j5586
6339b7565j3530L1852J3241j9602L2180j4789J5300J9479j7763k5243k6262m429
$$ y = [-43641, -24682, -16880, 17924, 26680, 51579, 12972, -21927, 14643, -18636, -61224, -10197, 26344, -28398, -57375, -3103, 36466, 19316, -3367, -24856, -24053, -22611, 9590, 49708, 73131, 44370, 49779, 70787, 45954, 39591, 29058, -59571, -81576, -62925, -39063, -79015, -84329, -66589, -66247, -46617, -9443, -45195, -47526, -62359, -43624, -3265, 71097, 79466, 39798, 26339, 38481, 13267, 10220, 13435, 1545, -63666, -75215, -1839, 28678, 47862, 19694, -1215, 1825, 23090, 72419, 25851, 11844, 56990, 75821, 41124, -21617, -38077, -93871, -149334, -81855, -42907, -21281, -21627, -48338, -5720, 11437, -54070, -17244, 36164, -11979, -27565, -41095, -9243, 3998, -15604, 16576, 1787, 17087, 36566, 18803, -6440, -32702, -37131]
6327c7131k0435K9571K6829J1222l77j2306o017l685q449R5542l5384R135K7626
6314G6141j8957k7930K4626m455k9517l2043j2337j3067n999J9077J2503N481
6302f477k4454k0293k5002P33j955k2413r891J4581Q0244M6378n6626n134n3197
6289h3506j2613K9422J0951L3852K5394J8531j758K915K224k2787o7283k9754
6277i4412L7864L4848L4836K0134O6300j8086m8854k3240j5545M898k4270j7162
6265d2689N8754j882j462J3675o7597j0374L0777k7298m0895j5618M8493M1842
6253a4274M726k6666L60L8357n818k9741p682N619K4121P3436q320l6891j1375
6240E852q930K5253n054K6283M3337k8729l4560L1765J0335k9817K2439k6757
$$ y = [-37131, -57566, -27995, -1166, 10056, 9679, -2627, -8644, -12329, -20778, 74764, 39380, 48515, 76141, 57184, 29254, 53880, 49425, 19908, -12135, -24472, -37539, -43538, -24461, -11958, -6477, -30931, -51224, -76226, -75493, -77448, -99861, -109752, -95171, -14927, 31451, -25175, -30309, -83506, -96119, -66697, -55746, -21894, 3500, 22031, 20273, 23188, 25412, 2625, -64658, -94412, -56548, -21700, 13136, 33270, 99570, 81484, 32630, 9390, -6155, -1257, -25527, -42689, 16065, 14183, 12721, 26396, -41201, -51575, -20798, -48096, -88991, -104609, -56116, -14274, -9548, -36214, -35854, 2503, -3315, -33056, -40738, -35119, -10998, 62438, 54118, 17227, 5852, -3078, 22175, 17121, 43404, 86741, 58012, 23452, 55217, 65552, 35735, 58174, 31417]
6228C1417K0298k0186p902k282J4548l2167m115j1984M3870k9591k3860J201J9078
6215a675j7285M128l2728k4671K0383l0511R509K1343L6072N4478m619m2192l5370
6202d3138j5619M3668k0468J5809K0264j1183M726l2910k5996J0428P832M0764
6190e823J9490l5266l8829K7284L2088O1446J2880o2155k5167r692n0309m9448
6178a23501M7341Q5523L1881o303l8971j7104l872n45j2084R641j4016j0475l6011
6165h8496J4133L5083P993l808M652L4342N6508M7460l0751R242m7768K369J7636
6152E8595k340o9560J1044k3555M54O024m1661O611M6532K3213J0443l5394l1380
6139d0974N0741r316j8645J6998k6657J1981L7917Q190k9490J2453j2801j082
$$ y = [31417, 51715, 31529, 23627, 21345, 35893, 3726, -389, -12373, 31497, 1906, -21954, -20753, -1675, -18960, -14832, -47560, -72231, -51848, -82359, -72850, -51507, -15435, 39043, 34424, -7768, -43138, -58757, -15089, -35557, -19748, 516, -10667, -5941, -38851, -64847, -54419, -46587, -5823, 13667, -21599, -60428, -33144, -1056, 60390, 73270, 11115, -14052, -23744, -74053, -123501, -76160, 9363, 41244, 34941, -4030, -21134, -25006, -25551, -37635, -27994, -42010, -52485, -88496, -74363, -39280, -31287, -35095, -30443, 3899, 60407, 107867, 77116, 86358, 38590, 40959, 58595, 56255, -13305, -2261, -25816, -25362, -19338, -60999, -54388, -7856, 15357, 25800, -9594, -40974, 9767, 451, -18194, -1196, -27853, -15872, 22045, 30235, 745, 13198, 397, -685]
6127f85L4310R10k5896o953J6646K196k0240K9176J9525k2531R361K8249K7191
6114I1259j6k2079k9248j0412k0240k1542k4975r113N567p870l8076m671J8202
6101g3214K6267N6502o5612l9683Q2932K1186n4946J3033k7187r0520L9236P3068
6089c8938P0812J9935m0482K518j1870m836J811j7944l8372K8971N2569M1195
6077F5369p3941l5900L0412K4489k8239K278K5813M2508j1448o0234q237M4169
6065A7039k8045n3422J4310J6462j722M366K0328J0444n210M6011n037m3994k8258
6052c6728p110k1064l6951K2826O0600O235j5136m7046L363P439J3976L8540j951
6039a3007q400K7870L7465M7860j4965n5741m6815j7423P1229j8406r844J7838
$$ y = [-685, 33625, 34535, 8639, 1686, 18332, 20528, 288, 29464, 48989, 26458, 35819, 64068, 91259, 91243, 69164, 39916, 29504, 9264, -12278, -37253, -46366, -40799, -48669, -86745, -91416, -73214, -46947, 9555, -56057, -95740, -12808, 8378, -46568, -33535, -60722, -151242, -112006, -38938, 31874, 51809, 11327, 13845, 1975, -2861, -1050, -18994, -57366, -28395, 24174, 65369, -8572, -44472, -14060, 10429, -17810, -15532, 10281, 52789, 41341, -18893, -27130, 17039, -11006, -64428, -50118, -33656, -35378, -31012, -10684, -240, -5450, 40561, 35524, -8470, -36728, -43838, -64902, -101853, -79027, -18427, -12192, -27328, -74374, -71011, -63572, -49596, -11056, -13007, -21407, 6463, 43928, 91788, 76823, 21082, -25733, -43156, 28073, 9667, -177, 17661]
6027A7661l1515K851Q94q256K6247k0455k0554M5407m1879k1031L2986M1714Q634
6014C2704O431J5732j4615k2944J9437k3948o2276m7866O543L4658N5887l5588
6002c5845n016J8672o86L8690K1157l5488j663M1058K9320k8766m9348l7579k379
5989d7873r865L9205Q953o6144P380K0093q64N1197J2356l119L153J379M1096
5976E6947K2279n6514n7072K2431K0601Q809P287k9756J275N0170O361j02781
5964d9963k2746N8406O5714k8087l9104n622K2402p1029l6101N0637M4139j4815
5952b6169K281j9610J1587J6132J0576j9819k8403N9760M6681l118j0331K3858
5940F3425l4060k3203K7933k4772l6702m0514K5792J887m877k7379J2780M7154
$$ y = [17661, -13854, -11003, -10109, -18365, 7882, -12573, -33127, 12280, -29599, -50630, -17644, 24070, 32704, 39135, 54867, 40252, 17308, 36745, 12797, -49479, -97345, -90802, -56144, -257, -35845, -40861, -22189, -22875, 15815, 36972, 1484, -179, 40879, 70199, 41433, -7915, -45494, -47873, -57738, -18533, -9580, -75724, -68344, -48251, -49115, 2082, 14438, 11319, 14472, 15851, 56947, 79226, 22712, -34360, -11929, 8672, 17481, 24768, -4988, -3713, 46457, 52818, -49963, -72709, -14303, 51411, 23324, -15780, -21402, 1000, -70029, -106130, -55493, -11354, -26169, -23888, -43498, -31911, -15779, -5203, -25022, -53425, 6335, 53016, 49898, 39567, 63425, 29365, 6162, 34095, 9323, -27379, -67893, -42101, -40214, -45091, -72470, -59690, -12536]
5928a2536L242o211q384O3476O4212l4056k9289R415J3365p9419j3380L9524j1305
5915a346J787L4567o576k6003O268M7357l0420r6013j9152j546J4457N8123N12
5902a7985n8445O921N7810J3140K0464l3023K2652L6696n0927k8209J676M474
5890b4756N5886J941j03033k2641l780j741K1736M4288J5121L4254m592j6225
5878c542p7059L5790J7651L7452N9917J697k1324k4443n9094q1314K9108L3521
5866e1640L0035M1112J510j4561j6409M7193J2315k7980N718J9237m0517L0945
5854C6958M7534q004p5743l1296L0144K6711l1917m7851K326L2912J798M7054
5842C0626l223k5978m283l055j7816k695M210n3050l2942L1201L6498M8286K8512
$$ y = [-12536, -9294, -15505, -23889, 39587, 103799, 69743, 40454, 49869, 63234, -16185, -29565, 9959, -1346, 441, 35008, 28432, 2429, 8697, 56054, 25634, -70379, -89531, -91077, -76620, -18497, -17985, -76430, -69509, -11699, 1441, 21905, -11118, 11534, 48230, -2697, -30906, -29230, -24756, 31130, 33071, -69962, -92603, -96383, -98124, -76388, -32100, -16979, 17275, 12683, -3542, -80601, -44811, -27160, 10292, 70209, 71906, 50582, 26139, -32955, -114269, -85161, -51640, -21605, 19507, 21017, 6456, -9953, 37240, 49555, 21575, 27293, 46530, 6013, 36958, 84492, 76488, 745, -30551, -407, 26304, -5613, -53464, -51138, -18226, -16428, 30626, 27403, 1425, -2858, -5913, -23729, -26424, -22214, -75264, -108206, -77005, -40507, 7779, 36291]
5829C6291K6683j4645m074n7251m9298k9157M480L1331Q1562K3361p820L9018
5817H0481J5498n3181l2868M0486K2075j3559k7997l2937K9829k3983k2940J0114
5805h982J7624J5166l0798J3579L5225L1039N713j7366m9575K4028K6058p049
5793E4662l9394j2408k004K7359j9753k6725r946o678l6771O0833N4706l0371
5781A3510r4420J3598R0021M1271m0739o3324j7961J1805M6997L110k3452l579
5769b3163J7437j3692k3967J7041L2951J188k4674L64N912J2679k0898l4666J0895
5756d2593N4317p547o8007L5273Q1383r520l6722L926L141k2532M4642J3105K2116
5743G0982L7474l8416m5092l0093m918k5054k1817l0878K557k4505P605L6282
$$ y = [36291, 62974, 48329, 44255, -12996, -62294, -91451, -86971, -55640, 25922, 49283, 41463, 80481, 95979, 42798, 9930, 50416, 72491, 58932, 30935, -2002, 27827, 3844, -19096, -8982, 8642, 23808, -6990, 6589, 41814, 72853, 78566, 61200, 11625, 35653, 61711, 54662, 15268, 2860, 856, 28215, 8462, -18263, -28209, -34887, -71658, -10825, 43881, 13510, -80910, -67312, 22709, 63980, 23241, -40083, -58044, -46239, 758, 3868, -19584, -23163, -5726, -19418, -43385, -26344, 6607, 7795, -16879, -16515, -10603, 2076, -18822, -53488, -42593, 11724, 4177, -63830, -28557, 52826, 43306, 6584, 10510, 13651, -8881, 35761, 48866, 70982, 108456, 70040, 24948, -5145, -10063, -35117, -56934, -87812, -85255, -109760, -102155, -65873]
5731f5873L2871Q955J128l6035k0085j1960N0735R7450N6009m3506n6633p517
5719E539k6007k498k735j0997L5094J3014P707J1298k6497k1948J9110k2258k4815
5706d5993j0398P785k991J9972J6919m917K5977k5511L1522K7625K1390k4751
5694C6629l0420j3018m5965J5905O3189L7738k8787m9222n4363M5757N9066j0951
5682B5558l5824P904L521l1422J6653K0679l3887l8982r5O7557L2682j0708M2118
5669F5754j0133k4302l8805O367m110j7562m2711J0026p629Q391j4413O831J2026
5656e0270M4673M502k0762l9672L4902M0101J8758l2415j0816p5l3L0354j6484
5643B763n558K8456l8717p4689J3919O1088J0884n0550r010j3197m1072J4195
$$ y = [-65873, -33002, -24047, -22919, -58954, -79039, -90999, -40264, 57186, 113195, 69689, 13056, 5539, -20468, -22966, -25701, -36698, -1604, 11410, 19117, 30415, 3918, -18030, 1080, -21178, -45993, -56391, -48606, -51597, -31625, -14706, -19623, 6354, -19157, 12365, 39990, 61380, 36629, 6209, -6809, -52774, -36869, 26320, 64058, 35271, -13951, -68314, -22557, 36509, 25558, -10266, -2362, 1159, -30263, -13610, 7069, -26818, -65800, -65895, 1662, 34344, 23636, 65754, 55621, 31319, -7486, -1119, -5229, -22791, -65502, -55476, -63105, -54714, -69127, -62296, -50270, -5597, -1095, -21857, -61529, -26627, 13474, 32232, -183, -10999, -11074, -11107, 19247, 2763, -2795, 25661, -13056, -87745, -73826, -12738, -1854, -52404, -61414, -74611, -115683, -101488]
5631a01488R4929K2688J7171m20K021k4172o1245j2556m8374M628l139J466N0112
5618e8379o6494K5030P4529M6375M1022l2734k559K099o0993m1199L4712N8648
5606B0057M6904k3109m6722J8664K3588O719q425N172L0919J1560n790P80l2677
5593D7640J60k3665l4526K3360M812Q553l7383o7033p574J8234N2915m835n4591
5580g3933k135j4172J271L5993K3195N9744R488p5182n791l4323l130M1226K3146
5567a4603k2337l686k153k5518K2620K4437j0191N2140K4337J7150L4811K386
5555I9393m5019M3032n541l5101r0376l8268m3432J4231P2599M602Q492j0870
5543b6258j8826M0420R8946N5075k6462k2946R679k0753m086l6865j09831j1317
$$ y = [-101488, -6559, 16129, 33300, 32880, 34901, 10729, -50516, -63072, -111446, -106818, -109957, -108491, -58379, -124873, -99843, -25314, 21061, 62083, 29349, 26790, 28889, -32104, -73303, -38591, 20057, 66961, 43852, -2870, 15794, 39382, 46101, 37676, 42848, 73767, 85327, 79537, 80317, 47640, 47800, 24135, -10391, 12969, 17781, 26334, -11049, -78082, -85656, -67422, -14507, -19342, -73933, -76068, -90240, -88969, -52976, -29781, 29963, 39451, -35731, -41522, -75845, -78975, -37749, -14603, -36940, -40626, -42779, -68297, -45677, -21240, -31431, 20709, 45046, 62196, 97007, 99393, 54374, 97406, 91865, 56764, -33612, -71880, -115312, -101081, -28482, -23880, -15388, -26258, -45084, -4664, 94282, 149357, 122895, 99949, 109628, 88875, 84789, 47924, -61907, -73224]
5531g3224K3986m650J0996J771o0222M7930M7318k5303o7794R933J1082O0268
5519a7909N0920K4348N316m2296n1295m0364K5607K9586k0212J5087Q063N3493
5507D0344J8017n8705j2799J6286Q88j5200J6981L4505j5158p6007o5669K8281
5495h8236R1559O8581L5612l7701o9295p368K7602k9444o8152k5856K6376L0569
5483d5753J2370q628n6943K9571M0570l39m252Q6708k1043m1253m1224J1021K2753
5470a6442N0701J5992r670m2409l4813J91j137k1645L1740L7377j4880l9747j4696
5457e9438L00K8385K6534n1926j9449J167p015M7287R141O0504O2821m541j3468
5444H0302k6723k7222l355J584m4304j1063L1652K6521R795N2064O50J2530m971
$$ y = [-73224, -49238, -53888, -42892, -41121, -101343, -53413, -6095, -31398, -99192, -89259, -78177, -17909, 33011, 57359, 62675, 20379, -30916, -71280, -45673, -16087, -36299, -21212, -13149, 40344, 58361, -344, -13143, 3143, 4031, -11169, 5812, 40317, 25159, -50848, -116517, -88236, 3323, 71904, 107516, 69815, 520, -6848, 20754, -8690, -76842, -102698, -76322, -45753, -33383, -42011, -98954, -69383, -28813, -29152, -33404, 53304, 32261, -8992, -50216, -39195, -16442, 34259, 50251, 40581, -1828, -36641, -36450, -37587, -59232, -27492, 9885, -4995, -44742, -59438, -59138, -30753, -4219, -56145, -75594, -74427, -81442, -34155, -25014, 35490, 98311, 93770, 80302, 53579, 26357, 23002, 24586, -19718, -30781, 871, 27392, 37187, 89251, 89901, 102431, 97460]
5431I7460k1312k9551p693k7451l4242J2801J8911M7982m132n3866n6523l5078
5419i2694J9338N5318j9849K7256K0579j7494k0637J6167K8930k6987K1783j2105
5407c95K6463j7955l2460J2496o693J9787k428N1585L7670L0904l2810k6475J9120
5394G8809J3429p6203q6863L328J5195K043n995K8814j0612N8142L6002n1274
5382D815n8470q845N4297O0513J341n0414p4408M201j1085k4955j1390J2918L4250
5369f7232k0949J0377K5028j581K9951P6434n773l1148k5734k1406K7454M6185
5357D1606L2534k0024l8178J753k3948l8452j6745l3901m6693N6637M6882L0816
5345g713Q906p044J4763J8821l3408n4324m8174L0566K5165j0289j1632K9614
$$ y = [97460, 76148, 46597, 38904, 11453, -22789, -9988, 8923, 56905, 52773, -1093, -57616, -92694, -73356, -18038, -37887, -10631, 9948, -7546, -28183, -12016, 16914, -10073, 11710, -395, 26068, 8113, -24347, -11851, -18544, 1243, -1185, 50400, 88070, 118974, 86164, 59689, 78809, 92238, 16035, -70828, -67500, -52305, -50262, -56257, -27443, -38055, 20087, 56089, 4815, -53655, -62500, -8203, 52310, 53651, 3237, -71171, -66970, -78055, -103010, -114400, -101482, -67232, -88181, -77804, -52776, -54357, -24406, 52028, 46255, 15107, -10627, -32033, -4579, 41606, 74140, 54116, 15938, 17691, -6257, -44709, -61454, -95355, -142048, -85411, -38529, -7713, 1193, -5851, 8912, 27733, -5675, -59999, -108173, -77607, -52442, -62731, -74363, -44749]
5333d4749L2012J7290o080J7442l519m283m354O589l197M1374N5241O2342o6539
5320I9569l0435O559j7032r831k9257J8667K8317k7665M7758j2112k7370L7547
5308H4715n001L980p821K7959n6217r7751n655q408L5684N491J1447o0890k2794
5295i5261O499J4957O7806M9814q432j6226o2608m6630J4608J9124K4121l6625
5283f8853K5272J2901m4386K7721K3528M4753M5183J7553n3613m5364K1450q974
5271b829k5553J5566K0802m3900l2160j4490J3102K9578K5846l6463M6086K644
$$ y = [-44749, -12737, 4553, -1527, 15915, 12396, 8113, 3759, 10348, 7151, 48525, 103766, 166108, 99569, 69134, 75693, 58661, 48830, 19573, 38240, 66557, 38892, 86650, 74538, 47168, 84715, 79714, 83694, 75873, 103832, 47615, -50136, -55791, -64199, -28515, -23024, -11577, -72467, -95261, -88762, -73805, -5999, 43815, 35383, 19157, -43451, -90081, -75473, -56349, -32228, -68853, -43581, -30680, -75066, -47345, -23817, 20936, 66119, 83672, 30059, -15305, 6145, -2829, -28382, -12816, 7986, -35914, -68074, -82564, -69462, -39884, -14038, -50501, -4415, -1771]
$$ [...]
##END NTUPLES=NMR SPECTRUM
##END=
