##TITLE=Analysis number 329449
Compound Code cc 61904
Project Code adrs
Chemist Name endeavour
##JCAMPDX= 6.0         $$ Bruker NMR JCAMP-DX V2.0
##DATA TYPE= NMR SPECTRUM
##DATA CLASS= NTUPLES
##ORIGIN= Bruker BioSpin GmbH
##OWNER= nmr
$$ XWIN-NMR		Version 3.5
$$ Mon Sep  3 14:57:11 2007 GMT Daylight Time (UT+1h)  MAYBRIDGE\nmr@NMR_250MHZ
##.OBSERVE FREQUENCY= 250.131544655141
##.OBSERVE NUCLEUS= ^1H
##.ACQUISITION MODE= SIMULTANEOUS (DQD)
##.ACQUISITION SCHEME= undefined
##.AVERAGES= 16
##.DIGITISER RES= 18
##SPECTROMETER/DATA SYSTEM= dpx250
##.PULSE SEQUENCE= zg30
##.SOLVENT NAME= CDCl3
##.SHIFT REFERENCE= (INTERNAL, CDCl3, 0, 16.522)
##AUDIT TRAIL= $$ (NUMBER, WHEN, WHO, WHERE, WHAT)
$$ ##TITLE= Audit trail, XWIN-NMR		Version 3.5
$$ ##JCAMPDX= 5.01
$$ ##ORIGIN= Bruker BioSpin GmbH
$$ ##OWNER= nmr
$$ C:\u/data/dgb/nmr/ADRS/50/pdata/1/auditp.txt
$$ ##AUDIT TRAIL=  $$ (NUMBER, WHEN, WHO, WHERE, WHAT)
(   1,<2007-09-03 14:55:57.29 +100>,<MAYBRIDGE\nmr>,<NMR_250MHZ>,
      <created by zg, POWCHK disabled, PULCHK disabled
       configuration hash MD5:
       76 6E 9A 78 1E 09 19 81 EC 84 63 8F B0 6A 59 2D
       data hash MD5: 64K
       36 B2 2D 27 74 7D 4D 99 D3 9B 8D A8 97 B4 A5 F7>)
(   2,<2007-09-03 14:56:26.70 +100>,<MAYBRIDGE\nmr>,<NMR_250MHZ>,
      <Start of raw data processing
       ef LB = 0.3 FT_mod = 6 PKNL = 1 SI = 32K 
       data hash MD5: 32K
       5A EC EB F7 87 24 4D 96 FC FB 57 99 FA AC DC 1E>)
(   3,<2007-09-03 14:56:32.14 +100>,<MAYBRIDGE\nmr>,<NMR_250MHZ>,
      <apk 
       data hash MD5: 32K
       29 44 3E 22 7E 84 F3 9E 7D 48 41 81 F8 87 B0 2F>)
(   4,<2007-09-03 14:56:37.46 +100>,<MAYBRIDGE\nmr>,<NMR_250MHZ>,
      <abs ABSG = 5 
       data hash MD5: 32K
       90 50 B0 68 7F 22 88 0E 90 6D 75 6B 80 E9 E2 BB>)
$$ ##END=
$$ 
$$ hash MD5
$$ AF 26 96 F2 3B 20 23 F9 4A C7 EC FF 93 70 4A C6
##$RELAX= 
##$RELAX= 
##$RELAX= 
##$RELAX= 
##$RELAX= 
##$RELAX= 
##$RELAX= 
$$ Bruker specific parameters
$$ --------------------------
##$DU= <C:\u>
##$EXPNO= 50
##$NAME= <ADRS>
##$PROCNO= 1
##$TYPE= <nmr>
##$USER= <dgb>
##$AMP= (0..31)
100 100 100 100 100 100 100 100 100 100 100 100 100 100 100 100 100 100 
100 100 100 100 100 100 100 100 100 100 100 100 100 100 
##$AQSEQ= 0
##$AQ_mod= 3
##$AUNM= <au_zg>
##$AUTOPOS= <31 >
##$BF1= 250.13
##$BF2= 250.13
##$BF3= 250.13
##$BF4= 250.13
##$BF5= 500.13
##$BF6= 500.13
##$BF7= 500.13
##$BF8= 500.13
##$BYTORDA= 1
##$CFDGTYP= 0
##$CFRGTYP= 5
##$CHEMSTR= <none>
##$CNST= (0..31)
1 1 145 1 1 1 1 1 1 1 1 1 1 1 1 1 1 1 1 1 1 1 1 1 1 1 1 1 1 1 1 1 
##$CPDPRG= <>
##$CPDPRG1= <>
##$CPDPRG2= <>
##$CPDPRG3= <>
##$CPDPRG4= <mlev>
##$CPDPRG5= <mlev>
##$CPDPRG6= <mlev>
##$CPDPRG7= <mlev>
##$CPDPRG8= <mlev>
##$CPDPRGB= <>
##$CPDPRGT= <>
##$D= (0..31)
0 1 0 0 0 0 0 0 0 0.06 0 0 0 0 0 0 0.0002 0 0 0 0 0 0 0 0 0 0 0 0 0 0 
0 
##$DATE= 1188827755
##$DBL= (0..7)
120 120 120 120 120 120 120 120 
##$DBP= (0..7)
150 150 150 150 150 150 150 150 
##$DBP07= 0
##$DBPNAM0= <>
##$DBPNAM1= <>
##$DBPNAM2= <>
$$ [...]
##$SUBNAM7= <"">
##$SUBNAM8= <"">
##$SUBNAM9= <"">
##$SW= 20.6930455092707
##$SWIBOX= (0..15)
0 0 3 0 0 0 0 0 0 0 0 0 0 0 0 0 
##$SW_h= 5175.983436853
##$TD= 65536
##$TD0= 1
##$TE= 297.16
##$TE2= 300
##$TE3= 300
##$TEG= 300
##$TL= (0..7)
0 120 120 120 120 120 120 120 
##$TP= (0..7)
150 150 150 150 150 150 150 150 
##$TP07= 0
##$TPNAME0= <>
##$TPNAME1= <>
##$TPNAME2= <>
##$TPNAME3= <>
##$TPNAME4= <>
##$TPNAME5= <>
##$TPNAME6= <>
##$TPNAME7= <>
##$TPOAL= (0..7)
0.5 0.5 0.5 0.5 0.5 0.5 0.5 0.5 
##$TPOFFS= (0..7)
0 0 0 0 0 0 0 0 
##$TUNHIN= 0
##$TUNHOUT= 0
##$TUNXOUT= 0
##$USERA1= <user>
##$USERA2= <user>
##$USERA3= <user>
##$USERA4= <user>
##$USERA5= <user>
##$V9= 5
##$VALIST= <valist>
##$VCLIST= <CCCCCCCCCCCCCCC>
##$VD= 0
##$VDLIST= <DDDDDDDDDDDDDDD>
##$VPLIST= <PPPPPPPPPPPPPPP>
##$VTLIST= <TTTTTTTTTTTTTTT>
##$WBST= 1024
##$WBSW= 4
##$XGAIN= (0..3)
0 0 0 0 
##$XL= 0
##$YL= 0
##$YMAX_a= 488031
##$YMIN_a= -434373
##$ZGOPTNS= <>
##$ZL1= 120
##$ZL2= 120
##$ZL3= 120
##$ZL4= 120
##$ABSF1= 16.522
##$ABSF2= -4.171173
##$ABSG= 5
##$ABSL= 3
##$ALPHA= 0
##$AQORDER= 0
##$ASSFAC= 0
##$ASSFACI= 0
##$ASSFACX= 0
##$ASSWID= 0
##$AUNMP= <proc_1d>
##$AZFE= 0.1
##$AZFW= 0.1
##$BCFW= 0
##$BC_mod= 0
##$BYTORDP= 0
##$COROFFS= 0
##$CY= 12.5
##$DATMOD= 1
##$DC= 0
##$DFILT= <>
##$DTYPP= 0
##$F1P= 14.0000005364418
##$F2P= -0.99999901652339
##$FCOR= 0.5
##$FTSIZE= 32768
##$FT_mod= 6
##$GAMMA= 0
##$GB= 0
##$INTBC= 1
##$INTSCL= 1
##$ISEN= 128
##$LB= 0.3
##$LEV0= 0
##$LPBIN= 0
##$MAXI= 10000
##$MC2= 0
##$MEAN= 0
##$ME_mod= 0
##$MI= 0
##$NCOEF= 0
##$NC_proc= -4
##$NLEV= 6
##$NOISF1= 0
##$NOISF2= 0
##$NSP= 0
##$NTH_PI= 0
##$NZP= 0
##$OFFSET= 16.522
##$PC= 1
##$PHC0= 166.7766
##$PHC1= 2.019197
##$PH_mod= 1
##$PKNL= yes
##$PPARMOD= 0
##$PSCAL= 4
##$PSIGN= 0
##$REVERSE= no
##$SF= 250.13
##$SI= 32768
##$SIGF1= 0
##$SIGF2= 0
##$SINO= 400
##$SIOLD= 32768
##$SREGLST= <1H.CDCl3>
##$SSB= 0
##$STSI= 32768
##$STSR= 0
##$SW_p= 5175.98343685301
##$SYMM= 0
##$S_DEV= 0
##$TDeff= 65536
##$TDoff= 0
##$TI= <Analysis number 999999
Compound Code 99
Book Reference 9
Project Code 9>
##$TILT= no
##$TM1= 0
##$TM2= 0
##$TOPLEV= 0
##$USERP1= <user>
##$USERP2= <user>
##$USERP3= <user>
##$USERP4= <user>
##$USERP5= <user>
##$WDW= 1
##$XDIM= 32768
##$YMAX_p= 302664337
##$YMIN_p= -178553
$$ End of Bruker specific parameters
$$ ---------------------------------
##NTUPLES= NMR SPECTRUM
##VAR_NAME=  FREQUENCY,     SPECTRUM/REAL,   SPECTRUM/IMAG
##SYMBOL=    X,             R,               I
##VAR_TYPE=  INDEPENDENT,   DEPENDENT,       DEPENDENT
##VAR_FORM=  AFFN,          ASDF,            ASDF
##VAR_DIM=   32768,         32768,           32768
##UNITS=     HZ,            ARBITRARY UNITS, ARBITRARY UNITS
##FACTOR=    0.157963299565203, 1,           1
##FIRST=     4132.6476996994, 0,             0
##LAST=      -1043.33573715361, 0,           0
##MIN=       -1043.33573715361, -178553,     0
##MAX=       4132.6476996994, 302664337,     0
$$ Real data points
##PAGE= N=1
##DATA TABLE= (X++(R..R)), XYDATA
$$ [...]
17283a7855N608M5m702P726n786q922K38J6870p383j393J0176M516k588k10k139
$$ -17855 -12247 -12202 -16904 -9178 -14964 -23886 -23648 -6778 -14161 -15554 -5378 -862 -3450 -3660 -5799
17268e799k992q4n577J460O978o446o040j0144o156J4174J2790J2045L672j399
$$ -5799 -8791 -8875 -14452 -12992 -6014 -12460 -18500 -28644 -34800 -20626 -7836 4209 7881 6482
17254F482r770j1416n29Q6J2654j601j0682m559N314P700M003n592o857R401R768
$$ 6482 -3288 -14704 -15233 -15147 -2493 -4094 -14776 -19335 -14021 -6321 -2318 -7910 -14767 -5366 4402
17239D402N65o56j106L351o96k773n35j081n421n34Q237k614p968O858l4l52K068
$$ 4402 4967 4311 3205 6556 5860 3087 2552 1471 -3950 -4484 3753 1139 -6829 29 -5 -357 1711
17222A711m573n715l216O565N994N744K71N003k689n499o191K95M469j869l619
$$ 1711 -2862 -8577 -11793 -5228 766 6510 6781 11784 9095 3596 -2595 -2300 2169 300 -3319
17207c319M764q395p867K405R936M458k385J018J895j0450j721N413p642j100
$$ -3319 1445 -6950 -14817 -12412 -2476 1982 -403 615 2510 -7940 -9661 -4248 -11890 -12990
17193a2990L595Q84j139N09J0909L608q130N809j70n657P12j1595l09r09J039
$$ -12990 -9395 -8511 -9650 -9141 1768 5376 -2754 3055 2885 -2772 -2060 -13655 -13964 -14873 -13834
17178a3834J311p21P269J950m003O932q74M530n08n222k681o016M428O93p640
$$ -13834 -12523 -13244 -5975 -4025 -8028 -1096 -1970 2560 2052 -3170 -5851 -11867 -7439 -6746 -14386
17163a4386M663M517J55q17p420J957R40n316K211k04L535p33R49L032K896n039
$$ -14386 -9723 -5206 -5051 -5868 -13288 -11331 -10391 -15707 -13496 -13700 -10165 -10898 -9949 -6917 -4021 -9060
17147i060q844O66O978m306M10Q657j919j2158m099L555k388J4258J8132j953
$$ -9060 -17904 -17238 -10260 -14566 -14156 -5499 -7418 -19576 -23675 -20120 -22508 -8250 9882 7929
17133G929p377m383j3069l97Q088m530r849K458Q856o995n071M698m010j964R456
$$ 7929 552 -3831 -16900 -17297 -9209 -13739 -23588 -21130 -12274 -19269 -24340 -19642 -23652 -25616 -16160
17118a6160q01N321o489K068J2376O817j2197l187J100n087j3769N571O186p550
$$ -16160 -16961 -11640 -18129 -16061 -3685 3132 -9065 -12252 -11152 -16239 -30008 -24437 -18251 -25801
17104b5801m7M0j203m794P708L057p969N562J0686Q972J0584L600q942n272n228
$$ -25801 -25848 -25808 -27011 -31805 -24097 -21040 -29009 -23447 -12761 -3789 6795 10395 1453 -3819 -9047
17089i047o250M786J510o285J881O343J0523o928n872P047m320r24N434R526o98
$$ -9047 -15297 -10511 -9001 -15286 -13405 -7062 3461 -3467 -9339 -2292 -6612 -7536 -2102 7424 6726
17074F726m102O351o909n411K063m590k515J0970k289l156l147q905j295K522
$$ 6726 2624 8975 2066 -3345 -1282 -5872 -8387 2583 294 -2862 -6009 -14914 -16209 -13687
17060a3687L586m551q514N787J0041J374k723J0171j476l251oP63R28O594R002
$$ -13687 -10101 -14652 -23166 -17379 -7338 -5964 -8687 1484 8 -3243 -3249 -2486 -1558 5036 14038
17045A4038m59j3319j1522J656Q649p657q243k82J510O941p311o596j910Q747
$$ 14038 13579 260 -11262 -9606 -957 -8614 -16857 -17139 -15629 -8688 -15999 -22595 -24505 -15758
17031a5758J2999l541o755R729k556n862q75P946N944M489M084n70M478j1572
$$ -15758 -2759 -6300 -13055 -3326 -5882 -11744 -12619 -4673 1271 5760 9844 9274 13752 2180
17017B180m675R69l617q530j1572J1402J2293P232m578j1446k983O992M944M468
$$ 2180 -2495 -1526 -5143 -13673 -25245 -13843 -1550 5682 1104 -10342 -13325 -6333 -1389 3079
17003C079j435o801j836K923O585Q280K448j899l175J952n958l450p213l48r01
$$ 3079 1644 -5157 -6993 -4070 2515 10795 13243 11344 8169 10121 4163 713 -6500 -6848 -7749
16988g749L008J68l444O033N434n526p73p35M821m121k10p838q929j476O83k539
$$ -7749 -4741 -4573 -8017 -1984 3450 -2076 -2849 -3584 1237 -2884 -3094 -10932 -19861 -21337 -20654 -23193
16972b3193K151J2464M471k463q003K229O939j3051m290P355J1721j004j560k402
$$ -23193 -21042 -8578 -4107 -6570 -14573 -12344 -5405 -18456 -22746 -15391 -3670 -4674 -6234 -8636
16958h636L928m034K323M67q804m205o465o060M418j075M738k744n223M143L401
$$ -8636 -4708 -8742 -6419 -5952 -14756 -18961 -25426 -31486 -27068 -28143 -23405 -26149 -31372 -27229 -23828
16943b3828J256M366K734N17J1621J0639j501K296m053j1122j278J349o111j0900
$$ -23828 -22572 -18206 -15472 -14955 -3334 7305 5804 8100 4047 -7075 -8353 -7004 -13115 -24015
16929b4015k019L495o62n260K462M938P447o219J414k427K895R363Q36p190K919
$$ -24015 -26034 -22539 -23201 -28461 -25999 -21061 -13614 -19833 -18419 -20846 -17951 -8588 -7752 -14942 -12023
16914a2023o52J0018j38k1109r930P333o461O36J1880L238n46J7480R475n322
$$ -12023 -12675 -2657 -2795 -23904 -33834 -26501 -32962 -32326 -20446 -17208 -17754 -274 9201 3879
16900C879M053r906j4025l8j318o905N013O683Q022Q029N698n6j0593j8462o302
$$ 3879 7932 -1974 -15999 -16037 -17355 -24260 -19247 -12564 -4542 3487 9185 9129 -1464 -19926 -26228
16885b6228L489J517M559P476o733K502K65j2672o708O973N273j010N819K274
$$ -26228 -22739 -21222 -16663 -9187 -15920 -13418 -13153 -25825 -32533 -25560 -20287 -21297 -15478 -13204
16871a3204k81p77J563j631M610P579K366q053j579O843M904k728k551r305n913
$$ -13204 -13485 -14262 -12699 -14330 -9720 -2141 225 -7828 -9407 -2564 2340 -388 -2939 -12244 -18157
16856a8157q071k209K703Q35L064J2029l045j278o108p819Q132p910M402R446
$$ -18157 -26228 -28437 -25734 -24899 -21835 -9806 -12851 -14129 -20237 -28056 -19924 -27834 -23432 -13986
16842a3986k126l062j572q178P752J3397o948j108P12n827P096j088J810N278
$$ -13986 -16112 -19174 -20746 -28924 -21172 -7775 -14723 -15831 -15119 -20946 -13850 -14938 -13128 -7850
16828g850r09p221O837R496l171o729m740l518K035l298j2374M197o54o002R071
$$ -7850 -8759 -15980 -9143 353 -2818 -9547 -14287 -17805 -15770 -19068 -31442 -27245 -27899 -33901 -24830
16813b4830J3734N930j047L197k43m267o768M720m554k137J0143N370p284m114
$$ -24830 -11096 -5166 -6213 -3016 -3259 -7526 -14294 -9574 -14128 -16265 -6122 -752 -8036 -12150
16799a2150O66M910M438M090l527J57M12N88R88l121m766l326o379m972L984Q138
$$ -12150 -11484 -6574 -2136 1954 -1573 -1416 -1004 -416 572 -2549 -7315 -10641 -17020 -21992 -18008 -9870
16783i870J454R71n575r071K807j180L698Q375J913k495J428O74q783k972M748
$$ -9870 -8416 -7445 -13020 -22091 -19284 -20464 -16766 -8391 -6478 -8973 -7545 -6871 -15654 -18626 -13878
16768a3878O851m463k226K948J641N63N532n464j3346j3331J602O384J2053R0
$$ -13878 -7027 -11490 -13716 -10768 -9127 -8564 -3032 -8496 -21842 -35173 -33571 -27187 -15134 -15044
16754a5044R202N365m029j0009K975J6408K018j2911l614j213l541J626q691l911
$$ -15044 -5842 -477 -4506 -14515 -11540 4868 6886 -6025 -9639 -10852 -14393 -12767 -21458 -25369
16740b5369l110P876J6483j473o043O975L882j0404k190k335k64j21N489L364
$$ -25369 -28479 -20603 -4120 -5593 -11636 -4661 -779 -11183 -13373 -15708 -15972 -16093 -10604 -7240
16726g240K521j337Q14K899n47q340p150O045K812l058m41q6o775K984K46n521
$$ -7240 -4719 -6056 -5242 -2343 -2890 -11230 -18380 -12335 -9523 -12581 -13022 -13108 -19883 -16899 -16653 -22174
16710b2174j635N213l008L55K446j942l326q86k550M433M686o893j1118K717R322
$$ -22174 -23809 -18596 -21604 -21249 -18803 -20745 -24071 -24957 -27507 -23074 -18388 -25281 -36399 -33682 -24360
16695b4360K386J3463K454j1749P735J692q116q542K069R786L340L350L528R814
$$ -24360 -21974 -8511 -6057 -17806 -10071 -8379 -16495 -25037 -22968 -13182 -9842 -6492 -2964 6850
16681F850j0686j442L775J298m808k257N031L8o89j416o934m392o212K59J4376
$$ 6850 -3836 -5278 -1503 -205 -5013 -7270 -2239 -2201 -2890 -4306 -11240 -15632 -21844 -21585 -7209
16666g209K83M302L967o88j866m427M336K237J985J71M858p41j3993j2373l090
$$ -7209 -6926 -2624 1343 655 -1211 -5638 -1302 935 2920 3091 7949 7208 -6785 -19158 -22248
16651b2248J302N607M337N552L076q51o07j263K507n991J550l528j99N673J1459
$$ -22248 -20946 -15339 -11002 -5450 -2374 -3225 -3832 -5095 -2588 -8579 -7029 -10557 -10756 -5083 6376
16636F376R796j2897j3150o211N111j971j858J468L846L6O075l327L34n758M498
$$ 6376 16172 3275 -9875 -16086 -10975 -12946 -14804 -13336 -9490 -9454 -3379 -6706 -6372 -12130 -7632
16621g632J0465K446r496j9197n515k780Q652P951O948Q351L262r175p484K380
$$ -7632 2833 5279 -4217 -23414 -28929 -31709 -23057 -15106 -8158 193 3455 -5720 -13204 -10824
16607a0824J1972j108K763Q0r79p859o150l698m711O19n13K662j338l507O402
$$ -10824 1148 40 2803 2883 1904 -5955 -12105 -15803 -20514 -19895 -20408 -17746 -19084 -22591 -16189
16592a6189M455J0511J848l082J117j980j5365j6876l001J1869J3463Q021M692
$$ -16189 -11734 -1223 625 -2457 -1340 -3320 -18685 -35561 -38562 -26693 -13230 -5209 -517
16579e17j341o626O49n422K700N897q745p03N80K644J0066J2375j124j1225r354
$$ -517 -1858 -8484 -7835 -13257 -10557 -4660 -13405 -14108 -13528 -10884 -818 11557 10433 -792 -10146
16564a0146L381O241j254l714j1758j396M860K402J215L742o788r460p155j319
$$ -10146 -6765 -524 -1778 -5492 -17250 -18646 -13786 -11384 -10169 -6427 -13215 -22675 -29830 -31149
16550c1149Q940J579j003j414K465o292l015L004K988J524k308R068r15J1806
$$ -31149 -22209 -20630 -21633 -23047 -20582 -26874 -29889 -26885 -23897 -22373 -24681 -15613 -16528 -4722
16536d722M570q64j707k877l330M77n406j464P150m95J241q318O77l355P72J0230
$$ -4722 -152 -1016 -2723 -5600 -8930 -8453 -13859 -15323 -8173 -8668 -7427 -15745 -15068 -18423 -17651 -7421
16520g421J3002R48J915j017k479J169j3025O354K88J347k803M857Q257k084j1933
$$ -7421 5581 6529 8444 7427 4948 6117 -6908 -554 -266 1081 -1722 3135 11392 9308 -2625
16505b625r05J0080Q227q970l144N16p562K840M605J915k701q422p241o861o350
$$ -2625 -3530 6550 14777 5807 2663 3179 -4383 -1543 3062 4977 2276 -6146 -13387 -20248 -26598
16490b6598R795K0203n593p89J791r328M73L285K126Q278l414M357r07l081Q215
$$ -26598 -16803 3400 -2193 -2982 -1191 -10519 -10046 -6761 -4635 3643 229 4586 3679 598 8813
16475H813l059j1540k673r769p878J055J149R542J351Q348P229J0007k381M689
$$ 8813 5754 -5786 -8459 -18228 -26106 -25051 -23902 -14360 -13009 -4661 2568 12575 10194 14883
16461A4883j292n447Q72l335k100l534N216R258m973p171l327O507N829K439Q412
$$ 14883 13591 8144 9016 5681 3581 47 5263 14521 9548 2377 -950 5557 11386 13825 22237
16446B2237N989q57J393j814j952j6110r975J723j827J1045J170j1564k1686j122
$$ 22237 28226 27369 28762 26948 24996 8886 -1089 634 -1193 9852 11022 -542 -22228 -23350
16432b3350P341K484k695R235Q733l255o245L740O717j389j3646K143P432n472
$$ -23350 -16009 -13525 -16220 -6985 1748 -1507 -7752 -4012 2705 1316 -12330 -10187 -2755 -8227
16418h227J119j338m586R669k221p924n186q10O353m571M290K698q937K807K913
$$ -8227 -7108 -8446 -13032 -3363 -5584 -13508 -18694 -19504 -13151 -17722 -13432 -10734 -19671 -16864 -13951
16403a3951M938L972j677n413j147K658P907L843n550m286o243q236j102R617
$$ -13951 -9013 -5041 -6718 -12131 -13278 -10620 -2713 1130 -4420 -8706 -14949 -23185 -24287 -14670
16389a4670N194p884M207q91q51P031j0851R1L119K597J730R777J2743N102q778
$$ -14670 -9476 -17360 -13153 -14044 -14895 -7864 -18715 -18624 -15505 -12908 -11178 -1401 11342 16444 7666
16374G666j3474o758k869K999O185L638J0851N46q968j1824j506P738r885r185
$$ 7666 -5808 -12566 -15435 -12436 -6251 -2613 8238 8784 -184 -12008 -13514 -5776 -15661 -24846
16360b4846Q142L036j973L836k257r22j639P777J0890J566j411M73M553O781K020
$$ -24846 -16704 -13668 -15641 -11805 -14062 -14984 -16623 -8846 2044 3610 2199 2672 7225 14006 16026
16345A6026M872J3981q305k0717o243j783j775k940k720R7P633r259p603l875
$$ 16026 20898 34879 26574 5857 -386 -2169 -3944 -6884 -9604 -9507 -1874 -11133 -18736 -22611
16331b2611N71P707l89j200K95o766n616O13P592J7800J618n718k454m630o864
$$ -22611 -22040 -14333 -14722 -15922 -15627 -22393 -28009 -27396 -19804 -2004 -386 -6104 -8558 -13188 -20052
16316b0052P998N464k152q708L190K581K252M596j925l991N375K635N751K758
$$ -20052 -12054 -6590 -8742 -17450 -14260 -11679 -9427 -4831 -6756 -10747 -5372 -2737 3014 5772
16302E772q065L02m779r30j3058k086Q456R227J723O601O99R307j2362j4148N825
$$ 5772 -2293 -1991 -6770 -7700 -20758 -22844 -14388 -5161 -3438 3163 3862 13169 807 -13341 -7516
16287g516j818M942Q477Q64L759J904q370o876K02p152k99N572L32k168J322r188
$$ -7516 -9334 -4392 4085 4949 8708 10612 2242 -4634 -4432 -11584 -11883 -6311 -5979 -8147 -6825 -16013
16271a6013k139O430Q704M688N232k530j2543J59J4855L721P00J411j1615M76
$$ -16013 -18152 -11722 -3018 1670 6902 4372 -8171 -8012 6843 10564 11264 12675 1060 1536
16257A536k244p193n898K26l627M867O983M691k638O16R246l92o333K593O234
$$ 1536 -708 -7901 -13799 -13573 -17200 -12333 -5350 -659 -3297 -2681 6565 6173 -160 2433 8667
16242H667m698M652m48L437o594j1289q003j3293P304Q088l975o937N846J419
$$ 8667 3969 8621 8173 11610 5016 -6273 -14276 -27569 -20265 -12177 -16152 -23089 -17243 -15824
16228a5824L557N758L602p009N682M51n443K609m959J704j885M610J1454p963
$$ -15824 -12267 -6509 -2907 -9916 -4234 -3783 -9226 -6617 -11576 -9872 -11757 -7147 4307 -3656
16214c656k300o547j05J361n679Q427j421j338K439R329q646j572l380N237j561
$$ -3656 -5956 -12503 -12608 -11247 -16926 -8499 -9920 -11258 -8819 510 -8136 -9708 -13088 -7851 -9412
16199i412M74L554l522J750k676R672l297j1355k2196l634M268J129R312J1776
$$ -9412 -8938 -5384 -8906 -7156 -9832 -160 -3457 -14812 -37008 -40642 -36374 -35245 -25933 -14157
16185a4157R986J183j0403o83J861O832n676j1444q491O502L662n704O913L75
$$ -14157 -4171 -2988 -13391 -14074 -12213 -5381 -11057 -22501 -30992 -24490 -20828 -26532 -19619 -19244
16171a9244J343J4593P126r180j5483j4209O735J0681L934O755Q347j124l863
$$ -19244 -17901 -3308 3818 -5362 -20845 -35054 -28319 -17638 -13704 -6949 1398 274 -3589
16158c589p108L44n062M328l43P987k243p623r33L433P903M569L242j8510k60
$$ -3589 -10697 -10353 -15415 -11087 -11430 -3443 -5686 -13309 -14242 -10809 -2906 1663 4905 -13605 -13865
16143a3865K561K486k8R15j917j965O719n651R73L86j176Q12N684k542j49q288
$$ -13865 -11304 -8818 -8846 -7931 -9848 -11813 -5094 -10745 -9772 -9386 -10562 -9750 -4066 -6608 -6757 -15045
16127a5045n455R716N224J99r881L5Q803l672l295m23K233j916M922l169k114
$$ -15045 -20500 -10784 -5560 -5361 -15242 -15207 -6404 -10076 -13371 -13794 -11561 -13477 -8555 -11724 -13838
16112a3838l052J874k915n512l411M277N491p436L749P18k006R090N804q17j110
$$ -13838 -16890 -15016 -17931 -23443 -26854 -22577 -17086 -24522 -20773 -20055 -22061 -12971 -7167 -7984 -9094
16097i094j188J791k347p816O248J963k299l207M486N696r17j884q98l851j489
$$ -9094 -10282 -8491 -10838 -18654 -12406 -10443 -12742 -15949 -11463 -5767 -6684 -8568 -9466 -13317 -14806
16082a4806m639j099N524Q724L838O257l019m822m994L670j259o731n018J742
$$ -14806 -19445 -20544 -15020 -6296 -2458 3799 780 -4042 -9036 -5366 -6625 -13356 -18374 -16632
16068a6632Q021Q774Q045L89r784r823J090j361j231M409L076l032q507J268P433
$$ -16632 -8611 163 8208 8597 -1187 -11010 -9920 -11281 -12512 -8103 -5027 -8059 -16566 -15298 -7865
16053g865j623n497Q74n21Q708r78o558l088j1083l840K957J330J1532j778j476
$$ -7865 -9488 -14985 -14111 -14632 -5924 -6902 -13460 -16548 -27631 -31471 -28514 -27184 -15652 -17430 -18906
16038a8906K050K315J576O17l633n942J304n35M768Q295j060m056O314J298k052
$$ -18906 -16856 -14541 -12965 -12348 -15981 -21923 -20619 -21154 -16386 -8091 -9151 -13207 -6893 -5595 -7647
16023g647o548o134K573Q66l047l394L949O951M13l396M43K524l204j720n349
$$ -7647 -14195 -20329 -17756 -16890 -19937 -23331 -19382 -12431 -12018 -15414 -14971 -12447 -15651 -17371 -22720
16008b2720J434J2698M708p18m348L607k61M168O511k955M777l897k378p384m489
$$ -22720 -21286 -8588 -3880 -4598 -8946 -5339 -5600 -1432 5079 2124 6901 3004 626 -6758 -11247
15993a1247J658N404N701m786n815l632O540M752M346K775n473k905N661M31j1205
$$ -11247 -9589 -4185 1516 -3270 -9085 -12717 -6177 -1425 2921 5696 223 -2682 2979 3410 -7795
15978g795j7200K288R803M695j0728k360K0733N315N138k307p475j499P028o293
$$ -7795 -24995 -22707 -12904 -8209 -18937 -21297 -564 4751 9889 7582 107 -1392 5636 -657
15964f57j0876l324O746M569J349L227K128O535Q84m559n772J0692M369Q99j270
$$ -657 -11533 -14857 -8111 -3542 -2193 1034 3162 9697 10581 6022 250 10942 15311 16210 14940
15949A4940k300q33l89K955n510l003l032K330R284n974l377r743r720K634j721
$$ 14940 12640 11807 11418 14373 8863 5860 2828 5158 14442 8468 5091 -4652 -14372 -11738 -13459
15934a3459O218M978J401M306P76J999N819M90j606p38O115K251L522r584j3031
$$ -13459 -7241 -2263 -862 3444 4220 6219 12038 12528 10922 10184 16299 18550 22072 12488 -543
15919e43n19K009o764l693J0351J5222O131r589j4625j1416r871q276K654J1684
$$ -543 -1062 947 -5817 -9510 841 16063 22194 12605 -2020 -13436 -23307 -31583 -28929 -17245
15905a7245Q09Q349N695j137j3837p292Q828j523j791j585P360N361R130K569
$$ -17245 -16436 -8087 -2392 -3529 -17366 -24658 -15830 -17353 -19144 -20729 -13369 -8008 1122 3691
15891C691J3025M62J069L301j557j881M40j5371p759N528J240N989K340j0844
$$ 3691 16716 17178 18247 21548 19991 18110 18550 3179 -4580 948 2188 8177 10517 -327
15877c27j0782j1242Q925l24m774j581n847M575J2267M354o886l223k760n175
$$ -327 -11109 -22351 -13426 -13750 -18524 -20105 -25952 -21377 -9110 -4756 -11642 -14865 -17625 -22800
15863b2800M196J0822P098n082o724P248J246J2910L831j0223J889p798k314J1243
$$ -22800 -18604 -7782 -684 -5766 -12490 -5242 -3996 8914 12745 2522 4411 -3387 -5701 5542
15849E542J032j728p10K71J25r40j768N038j5384p171K255o755o516J344p06L427
$$ 5542 6574 4846 4136 4407 4532 3592 1824 6862 -8522 -15693 -13438 -20193 -26709 -25365 -26071 -22644
15833b2644J0013Q260Q16L721r658J981M692N385j025k036m306j472j658j712
$$ -22644 -12631 -4371 -3555 166 -9492 -7511 -2819 2566 1541 -495 -4801 -6273 -7931 -9643
15819i643O789R713o414q190n75O178M698o625l557O628M57j0078j661o483j014
$$ -9643 -2854 6859 445 -7745 -8320 -2142 2556 -4069 -7626 -998 -541 -10619 -12280 -18763 -19777
15804a9777K907l383Q735O359P207j0873o532J881n476p905m065Q387N112j717
$$ -19777 -16870 -20253 -11518 -5159 2048 -8825 -15357 -13476 -18952 -26857 -30922 -22535 -17423 -19140
15790a9140k116J602o615k900J8767K3180J281j4552r246j340N483m892n10m771
$$ -19140 -21256 -19654 -26269 -29169 -10402 12778 14059 -493 -9739 -11079 -5596 -10488 -10998 -15769
15776a5769L05J1897Q430l025n062j817p706l364o17O785K891m948p422n06m656
$$ -15769 -15464 -3567 4863 1838 -3224 -5041 -12747 -16111 -16728 -9943 -7052 -12000 -19422 -19928 -24584
15761b4584n79n950p196R650R124Q16l269n31R935R667o184j0291N99R232K64
$$ -24584 -25163 -31113 -38309 -28659 -19535 -18719 -21988 -22519 -12584 -2917 -9101 -19392 -18793 -9561 -9297
15746i297O365n990o505J1670R27j1356O58M642l272k306o110Q850L597p367m977
$$ -9297 -2932 -8922 -15427 -3757 -2830 -14186 -13528 -8886 -12158 -14464 -20574 -11724 -8127 -15494 -20471
15731b0471k830j669q700j758J3844N481o200j747N989R2N870R801L609M220m3
$$ -20471 -23301 -24970 -33670 -35428 -21584 -16103 -22303 -24050 -18061 -17969 -12099 -2298 1311 5531 5488
15716E488n102r977j618p9p506j099J07r08k092J210j822k245P931J675k776j317
$$ 5488 386 -9591 -11209 -11288 -18794 -19893 -19786 -20694 -22786 -21576 -23398 -25643 -17712 -16037 -18813 -20130
15700b0130L646J2419P830j1787n696J562p368K605K305k834Q906O313o394l272
$$ -20130 -16484 -4065 3765 -8022 -13718 -12156 -19524 -16919 -14614 -17448 -8542 -2229 -8623 -11895
15686a1895l007L199k449o744p162n489M442J2864J670m198P652k306K832k409
$$ -11895 -14902 -11703 -14152 -20896 -28058 -33547 -29105 -16241 -14571 -18769 -11117 -13423 -10591 -13000
15672a3000L476O119o222j1512r83R577J613QJ1569J1163q272L79N261l959p923
$$ -13000 -9524 -3405 -9627 -21139 -22122 -12545 -10932 -10924 645 11808 3536 3915 9176 5217 -2706
15657b706p874k007p109r94J1997k592p872nM271R587O585n46k343k423k541n854
$$ -2706 -10580 -12587 -19696 -20690 -8693 -11285 -19157 -19162 -14891 -5304 1281 735 -1608 -4031 -6572 -12426
15641a2426j503j381N181Q324O288o473K928j072j1372m229k27K851j32M727L969
$$ -12426 -13929 -15310 -10129 -1805 4483 -1990 938 -134 -11506 -15735 -15962 -13111 -13243 -8516 -4547
15626d547n433j986J174L440j4656o356Q399R518P060P980Q172L593o799q451
$$ -4547 -9980 -11966 -10792 -7352 -22008 -28364 -19965 -10447 -3387 4593 12765 16358 9559 1108
15612A108J696n349J247P115j0903p757Q07Q057j664r789k722p10K600k850L265
$$ 1108 2804 -2545 -1298 5817 -5086 -12843 -12036 -3979 -5643 -15432 -18154 -18864 -16264 -19114 -15849
15597a5849j1290J217N064O928J136k772j372l179L000L113j507j052K532O75
$$ -15849 -27139 -25922 -20858 -13930 -12794 -15566 -16938 -20117 -17117 -14004 -15511 -16563 -14031 -13356
15583a3356o590k134j150m467j771O792K1666L491P198J520k159n051j12o675
$$ -13356 -19946 -22080 -23230 -27697 -29468 -22676 -1010 2481 9679 11199 9040 3989 3877 -2798
15569b798q293o98K743p936q361K260K379M521j874q607m22o22l413J039M47K481
$$ -2798 -11091 -11789 -9046 -16982 -25343 -23083 -20704 -16183 -18057 -26664 -27086 -27708 -31121 -30082 -29635 -27154
15553b7154P190O359n52r138l651L826P330N704J118j011j061J3828N848n874
$$ -27154 -19964 -13605 -14157 -23295 -26946 -23120 -15790 -10086 -8968 -9979 -11040 2788 8636 2762
15539B762j801j4554j1072N50K111K937L558n509M864K067K063N479k346O202
$$ 2762 961 -13593 -24665 -24115 -22004 -19067 -15509 -21018 -16154 -14087 -12024 -6545 -8891 -2689
15525b689j491l917j2349j6295M131Q573M079R954k551K960q01J932O960q453
$$ -2689 -4180 -8097 -20446 -36741 -32610 -24037 -19958 -10004 -12555 -9595 -10396 -8464 -1504 -9957
15511i957k65p97K128k819n97L018o378K373l66m295N321N282q708M052P352m285
$$ -9957 -10222 -11019 -8891 -11710 -12307 -9289 -15667 -13294 -13660 -17955 -12634 -7352 -16060 -12008 -4656 -8941
15495h941k746n249j5760j525O605M535Q458J488j294L403P779n976o12Q72L108
$$ -8941 -11687 -16936 -32696 -34221 -27616 -23081 -14623 -13135 -14429 -11026 -3247 -9223 -9835 -8963 -5855
15480e855J1815N526O158p275p850J0542Q311j607m800l449L010J885p647l749
$$ -5855 5960 11486 17644 10369 2519 13061 21372 19765 14965 11516 14526 16411 8764 5015
15466E015J439l176k864p38o400l705Q593Q354k594p931J734M819M240j0557k639
$$ 5015 6454 3278 414 -324 -6724 -10429 -1836 6518 3924 -4007 -2273 2546 6786 -3771 -6410
15451f410N284K127K887j2372J621j406Q41O033O760K970q928J859N848m925r315
$$ -6410 -1126 1001 3888 -8484 -6863 -8269 -7428 -1395 5365 8335 -593 1266 7114 2189 -7126
15436g126L243O797M448k834K723q254q389J066N421O774q458p249m646l292K99
$$ -7126 -3883 2914 7362 4528 7251 -1003 -9392 -8326 -2905 3869 -4589 -11838 -16484 -19776 -19477
15421a9477O412j502k598P002J2137j608q247J241K469m968q307L083L091L823
$$ -19477 -13065 -14567 -17165 -10163 1974 366 -7881 -6640 -4171 -9139 -17446 -14363 -11272 -7449
15407g449p62m05k595o074m089N921j826L07K182L844N05l471R52J0860P626m370
$$ -7449 -8211 -8616 -11211 -17285 -21374 -15453 -17279 -16972 -14790 -10946 -10441 -13912 -12960 -2100 5526 1156
15391A156n775p985o126p63m943O489P802m87P902p512p668P425p70n619n64J147
$$ 1156 -4619 -12604 -18730 -19493 -24436 -17947 -10145 -10632 -2730 -10242 -17910 -10485 -11255 -16874 -17438 -16291
15375a6291N646J625L453n583n429J675n222j935M111J2145O888k138j0547p407
$$ -16291 -10645 -9020 -5567 -11150 -16579 -14904 -20126 -22061 -17950 -5805 1083 -1055 -11602 -19009
15361a9009k473L735M851P651R687q17p051j0874J029J867j0065j260J4594M774
$$ -19009 -21482 -17747 -12896 -5245 4442 3625 -3426 -14300 -13271 -11404 -21469 -22729 -8135 -3361
15347c361n409j079J0269K587L35k271n126o922p475K435J628M217R095n094j4266
$$ -3361 -8770 -9849 420 3007 3342 1071 -4055 -10977 -18452 -16017 -14389 -10172 -1077 -6171 -20437
15332b0437k892n635P02L551J0616J6084J45m081N832J03q24O479J1199N797q409
$$ -20437 -23329 -28964 -28262 -24711 -14095 1989 2134 -1947 3885 3988 3164 9643 20842 26639 18230
15317A8230o346J0761o608j4446l668J5931J0354q973J619n438j0586o706N217
$$ 18230 11884 22645 16037 1591 -2077 13854 24208 15235 16854 11416 830 -5876 -659
15304f59n034k491M386l938L359Q405P129M627j227o808L17J210p967o528p772
$$ -659 -5693 -8184 -3798 -7736 -4377 4028 11157 15784 14557 7749 8066 9276 1309 -5219 -12991
15289a2991P7P525J0733n426k216P957O85j4871j0282J1798j386N491J0308K517
$$ -12991 -12914 -5389 5344 -82 -2298 5659 6344 -8527 -18809 -7011 -8397 -2906 7402 9919
15275I919r175O438R85j2955j4959L10J217O933P590j890r96J991N923K616M472
$$ 9919 744 7182 8167 -4788 -19747 -19437 -18220 -11287 -3697 -5587 -6583 -4592 1331 3947 8419
15260H419j0455q759n962p50K266L318M620l132P880l709K233P820k48n997O464
$$ 8419 -2036 -10795 -16757 -17507 -15241 -11923 -7303 -10435 -2555 -6264 -4031 3789 3541 -2456 4008
15245D008N309j3211J598O565r196j3814m803M255l649N42k43K558L406J1793
$$ 4008 9317 -3894 -2296 4269 -4927 -18741 -23544 -19289 -22938 -22396 -22639 -20081 -16675 -4882
15231d882L603M295j804J117N042j748p931o503l970L475k672p201m911j179p516
$$ -4882 -1279 3016 1212 2329 7371 5623 -2308 -8811 -12781 -9306 -11978 -19179 -24090 -25269 -32785
15216c2785R750Q198n986L08J44N628j30l517k793O442N836o662k529p982j846
$$ -32785 -23035 -14837 -20823 -20515 -20371 -14743 -14873 -18390 -21183 -14741 -8905 -15567 -18096 -26078 -27924
15201b7924L367m288L843R037K370L412m576j470J351N059l117P544J411q43j264
$$ -27924 -24557 -28845 -25002 -15965 -13595 -10183 -14759 -16229 -14878 -9819 -12936 -5392 -3981 -4824 -6088
15186f088J452q703n101L836J39K217K921K088k774q594q059P275R136L115J385
$$ -6088 -4636 -13339 -18440 -14604 -14465 -12248 -9327 -7239 -10013 -18607 -26666 -19391 -10255 -7140 -5755
15171e755j015M443j538j3464k720R390P340m118P695j31J28l592r236k158N595
$$ -5755 -6770 -2327 -3865 -17329 -20049 -10659 -3319 -7437 258 127 255 -3337 -12573 -14731 -9136
15156i136Q093M136M726R684K287j1642j0899O097N069P761q172o527l882j137
$$ -9136 -1043 3093 7819 17503 19790 8148 -2751 3346 8415 16176 8004 1477 -2405 -3542
15142c542k454J899k58j836l240N023k203J832k080n120k304L163M14M566L868
$$ -3542 -5996 -4097 -4355 -6191 -9431 -4408 -6611 -4779 -6859 -11979 -14283 -11120 -10706 -6140 -2272
15127b272P11j789P064Q394j233k040q2o505j2471k695P675n048j2201n070K679
$$ -2272 -1561 -3350 3714 12108 10875 8835 8753 2248 -10223 -12918 -5243 -10291 -22492 -27562 -24883
15112b4883J3321Q918L18K501l122R00q936M585K486k650M746L12k048P60r079
$$ -24883 -11562 -2644 -2326 175 -2947 -2047 -10983 -6398 -3912 -6562 -1816 -1504 -3552 -2792 -11871
15097a1871o347j175m782q173j325M938J0472N337N713Q08Q138N498l77k29p837
$$ -11871 -18218 -19393 -24175 -32348 -33673 -28735 -18263 -12926 -7213 -6405 1733 7231 6854 6625 -1212
15082a212q373n388l200Q813Q905l749n285J593P734K900p624L905Q665p684r08
$$ -1212 -9585 -14973 -18173 -9360 -455 -4204 -9489 -7896 -162 2738 -4886 -981 7684 0 -908
15067i08Q21j0172r366l923j685j873J937k214m20O911P591J2949J314j2513o204
$$ -908 -87 -10259 -19625 -23548 -25233 -27106 -25169 -27383 -27803 -20892 -13301 -352 962 -11551 -17755
15052a7755k394M936M682n413K606N80J025L767M511L850r935N66K64O958P015
$$ -17755 -20149 -15213 -10531 -15944 -13338 -12758 -11733 -7966 -3455 395 -9540 -8974 -8710 -1752 5263
15037E263k12o222p838k881L353l72N058j213j556J60P79L012J208l256Q05j800
$$ 5263 5051 -1171 -9009 -11890 -8537 -8909 -3851 -5064 -6620 -6460 -5681 -2669 -1461 -4717 -3912 -5712
15021e712n182j960L206N736m608q809N863J857J825k394n190Q7L347P321L595
$$ -5712 -10894 -12854 -9648 -3912 -8520 -17329 -11466 -9609 -7784 -10178 -15368 -15281 -11934 -4613 -1018
15006a018K53p407o215K096N763J315j1095p797K023L390R994J227j464J785J663
$$ -1018 -765 -8172 -14387 -12291 -6528 -5213 -16308 -24105 -22082 -18692 -8698 -7471 -8935 -7150 -5487
14991e487k857m882j877n53m071k187O609j477n573P152M128O241j901J200L392
$$ -5487 -8344 -13226 -15103 -15656 -19727 -21914 -15305 -16782 -22355 -15203 -11075 -4834 -6735 -5535 -2143
14976b143M107j876K751p067J955J692Q101J016j5316o107m974J828N091O461
$$ -2143 1964 88 2839 -4228 -2273 -581 7520 8536 -6780 -12887 -17861 -16033 -10942 -4481
14962d481n335j633l273J8L499N244LJ969k440l747j1366k340J0057P199K672
$$ -4481 -9816 -11449 -14722 -14704 -11205 -5961 -5958 -3989 -6429 -10176 -21542 -23882 -13825 -6626 -3954
14947c954K484k881l498M292j1420o810k704n779N629k977n015R783J2548J3121
$$ -3954 -1470 -4351 -7849 -3557 -14977 -21787 -24491 -30270 -24641 -27618 -32633 -22850 -10302 2819
14933B819q37p761m485k395M136k912K689N989J157l227N34K024m038q295j446
$$ 2819 1982 -5779 -10264 -12659 -8523 -11435 -8746 -2757 -1600 -4827 -4293 -2269 -6307 -14602 -16048
14918a6048J656m196N997j360K731J0454Q501o894q701O304L805n930n947JN2
$$ -16048 -14392 -18588 -12591 -13951 -11220 -766 7735 841 -7860 -1556 2249 -3681 -9628 -9627 -9575
14903i575J353J29O247R884J958Q57j0557r810m450K329J1291L135p437R30k579
$$ -9575 -8222 -8093 -1846 8038 9996 10853 296 -9514 -13964 -11635 -344 2791 -4646 -3716 -6295
14888f295q75j919O139m678j4968J5573J0643j6661n675M941j162j341Q356L636
$$ -6295 -7170 -9089 -2950 -7628 -22596 -7023 3620 -13041 -18716 -13775 -14937 -16278 -7922 -4286
14874d286L017L99m086q178P75L655R99j861Q50j873l473m201M165N46n215o760
$$ -4286 -1269 -870 -4956 -13134 -12359 -8704 -7705 -9566 -8716 -10589 -14062 -18263 -14098 -13552 -18767 -25527
14858b5527J2348K614o51j440O355J0345j16o342q760r485J635j720m039m747
$$ -25527 -13179 -10565 -11216 -12656 -6301 4044 3928 -2414 -11174 -20659 -19024 -20744 -24783 -29530
14844b9530O094O219Q736n846k455K938N967l736j7543l844O76N004P324Q276
$$ -29530 -23436 -17217 -8481 -14327 -16782 -13844 -7877 -11613 -29156 -33000 -32324 -27320 -19996 -11720
14830a1720k106O577P176k451k449L66l21M511M994L519j298n425r323j947o074
$$ -11720 -13826 -7249 -73 -2524 -4973 -4607 -4928 -417 4577 8096 6798 1373 -7950 -9897 -15971
14815a5971q320J0713J0077j505k162j888L465k843p962P7L690P288N261L239
$$ -15971 -24291 -13578 -3501 -5006 -7168 -9056 -5591 -8434 -16396 -16319 -12629 -5341 -80 3159
14801C159R61q358r171L171O601O311n087p153k419n025k077P603J450N927j277
$$ 3159 4120 -4238 -13409 -10238 -3637 2674 -2413 -9566 -11985 -17010 -19087 -11484 -10034 -4107 -5384
14786e384p046M587O824j0454j2417P992P515J1330m328j3117m16N921J2K380
$$ -5384 -12430 -7843 -1019 -11473 -23890 -15898 -8383 2947 -1381 -14498 -14914 -8993 -8981 -6601
14772f601P629p52r446J265k146O838P819j454M62j032n979N327J365j2391p064
$$ -6601 1028 276 -9170 -7905 -10051 -3213 4606 3152 3614 2582 -3397 1930 3295 -9096 -16160
14757a6160P280Q709L021l587m314p765K095J2937J392k030r636k925o871n21
$$ -16160 -8880 -171 2850 -737 -5051 -12816 -10721 2216 3608 1578 -8058 -10983 -17854 -18375
14743a8375r65M514J4235M494Q329m848o861j959O803l928o322q135N440j1006
$$ -18375 -19340 -14826 -591 3903 12232 7384 523 -1436 5367 1439 -4883 -13018 -7578 -18584
14729a8584r981O625L659P523N893j515q07P468l43j739j500O554n99L41n002
$$ -18584 -28565 -21940 -18281 -10758 -4865 -6380 -7187 281 -62 -1801 -3301 3253 2654 2995 -2007
14714b007p944k590R52J278m283J4548L268j184K903N28j7012l168o13j006k05
$$ -2007 -9951 -12541 -11589 -10311 -14594 -46 3222 2038 4941 5469 -11543 -14711 -15324 -16330 -16535
14699a6535m798K204K146l416P62J118k473K143JQ025O421K634j739n112m223
$$ -16535 -21333 -19129 -16983 -20399 -19637 -18519 -20992 -18849 -18848 -10823 -4402 -1768 -3507 -8619 -12842
14684a2842K068l045j623L725Q412R5P302n30K52n168o553M755N283L976L302
$$ -12842 -10774 -13819 -15442 -11717 -3305 -3210 4092 3562 3814 -1354 -7907 -3152 2131 6107 9409
14669I409R826K558j3645j3686N076k533p944K716M150M508O104m210n891J277
$$ 9409 19235 21793 8148 -5538 -462 -2995 -10939 -8223 -4073 435 6539 2329 -3562 -2285
14655b285j209L641L420K657O761m921r016l812n238o255M553J1070j095r668
$$ -2285 -3494 147 3567 6224 12985 8064 -952 -4764 -10002 -16257 -11704 -634 -1729 -11397
14641a1397K668J823K343Q967p326R115K498l332j0406L064O282Q938r255l189
$$ -11397 -8729 -6906 -4563 4404 -2922 6193 8691 5359 -5047 -1983 4299 13237 3982 793
14627G93L257p121l237N790Q510J195p65k273m024L141L188K000k814R931o344
$$ 793 4050 -3071 -6308 -518 7992 9187 8422 6149 2125 5266 8454 10454 7640 17571 11227
14612A1227j79J2269q800j3110n15l800K365J878P01j057n58l821l722q362N392
$$ 11227 11048 23317 14517 1407 892 -2908 -543 1335 2036 979 421 -3400 -7122 -15484 -10092
14597a0092R427j1345M515R135n773j2399n376N014J2557L07n961K469p625k396
$$ -10092 -665 -12010 -7495 1640 -4133 -16532 -21908 -16894 -4337 -4030 -9991 -7522 -15147 -17543
14583a7543N133k906J4127o121j3870J6235J2299j4058m129o73M130Q1l708J4436
$$ -17543 -12410 -15316 -1189 -7310 -21180 -4945 7354 -6704 -10833 -11506 -7376 -7295 -11003 3433
14569C433P010l445p462K30J703K032L020q94L791m290p167r60K65k906q134j927
$$ 3433 10443 6998 -464 -234 1469 3501 6521 5627 9418 5128 -2039 -2999 -2734 -5640 -13774 -15701
14553a5701P082L469j637J1786j147j1619j967R224J0120J0402k58p809N336k024
$$ -15701 -8619 -5150 -6787 4999 3852 -7767 -9734 -510 9610 20012 19754 11945 17281 15257
14539A5257q232n502J4971P296K867j0185r835p847L854o311m759j08R526M475
$$ 15257 7025 1523 16494 23790 26657 16472 6637 -1210 2644 -3667 -8426 -8534 992 5467
14525E467J193k028L389L588J62q785Q95k392l080k420M57J285M179L844R772
$$ 5467 6660 4632 8021 11609 11771 2986 3881 1489 -1591 -4011 -3554 -2269 1910 5754 15526
14510A5526Q345o622J465O135J46j227L820j1130m622j2268l657n51m168o752
$$ 15526 23871 17249 18714 24849 24995 23768 27588 16458 11836 -432 -4089 -4640 -8808 -15560
14496a5560J699K755Q877N535N412p165n456M947J275k146L859P048l132p63k45
$$ -15560 -13861 -11106 -2229 3306 8718 1553 -3903 1044 2319 173 4032 11080 7948 7185 6940
14481F940r472l225M236k153N993R756K659K241m361m058k075j0866r189O014
$$ 6940 -2532 -5757 -1521 -3674 2319 12075 14734 16975 12614 8556 6481 -4385 -13574 -7560
14467g560k603j895M561L479J558o736r093M291P800N732l50o735o159K257Q46
$$ -7560 -10163 -12058 -7497 -4018 -2460 -9196 -18289 -13998 -6198 -466 -816 -7551 -13710 -11453 -10607
14452a0607R736K963n446O631r479o760o68J4159K1933j880k0487J756j1133K183
$$ -10607 -871 2092 -3354 3277 -6202 -12962 -13630 529 22462 20582 95 1851 -9282 -7099
14438g099j393k641Q557P539J1108L927l517l912R832K3758J8484J0946J2768
$$ -7099 -8492 -11133 -2576 4963 16071 19998 16481 12569 22401 46159 64643 75589 88357
14425H8357K6745L1451K0439J165j3271j6733j8851l0138p414N6l076r188j2527
$$ 88357 115102 146553 166992 168157 154886 138153 119302 89164 81750 81806 78730 69542 57015
14412E7015r101k480M032J1235M462m277L516k656K690Nj398N98L468J8082Q697
$$ 57015 47914 45434 49466 60701 65163 60886 64402 61746 64436 64441 63043 63641 67109 85191 93888
14397I3888J0260J8088J2473J3487P706N666r411j6537k2894k5448j0768j1355
$$ 93888 104148 122236 134709 148196 155902 161568 152157 135620 112726 87278 76510 65155
14385F5155r695j1979l103r376o870q875j158q145j2161J3092O252k233N052l058
$$ 65155 55460 43481 40378 31002 24132 15257 14099 5954 -6207 6885 13137 10904 15956 12898
14371A2898p78K987j3076l430K693p97k466L375M684k833L472n35j0378N039M300
$$ 12898 12120 15107 2031 -1399 1294 497 -1969 1406 6090 3257 6729 6194 -4184 855 5155
14356E155o860p59L470j3355M445J607j347m899P672J063O245N536k114q472n70
$$ 5155 -1705 -2464 1006 -12349 -7904 -6297 -7644 -12543 -4871 -3808 2437 7973 5859 -2613 -3183
14341c183M073j142O601M744J134L080l178r574p875O411N062J626R73m388J142
$$ -3183 890 -252 6349 11093 12227 15307 12129 2555 -5320 1091 6153 7779 8752 4364 5506
14326E506L174Q77k962M629Q164M848n172j066n741K090N944k482M69m950N9m106
$$ 5506 8680 9557 6595 11224 19388 24236 19064 17998 12257 14347 20291 17809 18278 13328 13387 9281
14310I281j0338r225Q312J0526O682L396j4611p799n553J925L686P449p832q499
$$ 9281 -1057 -10282 -1970 8556 15238 18634 4023 -3776 -9329 -7404 -3718 3731 -4101 -12600
14296a2600o328M184P487q410R62M646O82K838N040l459L81j0264N484j417J1442
$$ -12600 -18928 -14744 -7257 -15667 -14705 -10059 -9377 -6539 -1499 -4958 -4577 -14841 -9357 -10774 668
14281F68J3787J442q996k948o220J609m918q488l049O8O400R281P849k925l757
$$ 668 14455 15897 6901 3953 -2267 -658 -5576 -14064 -17113 -17045 -10645 -1364 6485 3560 -197
14266a97m663K009K826K725m169o835m700N597P453K661p657m340k623k595J1669
$$ -197 -4860 -2851 -25 2700 -1469 -8304 -13004 -7407 46 2707 -4950 -9290 -11913 -14508 -2839
14251b839M520k03o9L49k867L204n82k240R48J0090N494o347j1871l141J032j396
$$ -2839 1681 1478 1409 1758 -1109 2095 1513 -727 221 10311 15805 9458 -2413 -5554 -4522 -5918
14235e918o674M334R727m628l863P94O746n38r938n951k475R709N372j505k708
$$ -5918 -12592 -8258 1469 -3159 -7022 -6228 518 -20 -9958 -15909 -18384 -8675 -3303 -4808 -7516
14220g516K917J921l768q65k238k234J359K284k77O367L388J07l377K075K094
$$ -7516 -4599 -2678 -6446 -7311 -9549 -11783 -10424 -8140 -8417 -2050 1338 1445 -1932 143 2237
14205B237q389l397M118j326J464K037k336l347r300j203J904J0946N713n532
$$ 2237 -6152 -9549 -5431 -6757 -5293 -3256 -5592 -8939 -18239 -19442 -17538 -6592 -879 -6411
14191f411L313l655J037M999m445r018j101M781J1496k272O537R180o791j3425
$$ -6411 -3098 -6753 -5716 -717 -5162 -14180 -15281 -10500 996 -1276 5261 14441 7650 -5775
14177e775l317L230L396r956o38J532J261N406m11l45J489J750J1850k955p746
$$ -5775 -9092 -5862 -2466 -12422 -13060 -11528 -10267 -4861 -5272 -5617 -4128 -2378 9472 6517 -1229
14162a229j576K262M023Q141L504L513K764P477J6792Q641R900M537l753K459
$$ -1229 -2805 -543 3480 11621 15125 18638 21402 28879 45671 54312 64212 68749 64996 67455
14148F7455k1309k5967j1179n271M80L382N521o032J706J580N504q875J516j7
$$ 67455 46146 20179 9000 3729 4209 7591 13112 7080 8786 10366 15870 6995 8511 8494
14134H494r243N060j0753Q351N216m641o876O0J2200R541K249r627l405M611j5894
$$ 8494 -749 4311 -6442 1909 7125 2484 -4392 -4332 7868 17409 19658 10031 6626 11237 -4657
14119d657q616J2702Q899J996P780J3705J3523K821J0414R519J790p413j0396
$$ -4657 -13273 -571 8328 10324 18104 31809 45332 48153 58567 68086 69876 62463 52067
14106E2067j6914j0985l453j3166q546P03j024j947J857P618R010J885k008m436
$$ 52067 35153 24168 20715 7549 -997 -294 -1318 -3265 -1408 6210 15220 17105 15097 10661
14092A0661J066p0Q104j881n778j1741j1287K61J3753P662m783n174M506j7N48
$$ 10661 11727 11657 19761 17880 12102 361 -10926 -10665 3088 10750 5967 793 5299 5282 5830
14077E830p952p584M131P879O722O496K72r637r709K568J2529N536j0225j885
$$ 5830 -2122 -9706 -5575 2304 9026 15522 15794 6157 -3552 -984 11545 17081 6856 4971
14063D971k571o088p382n185J1538P854k472j0904m42J496Q89k450J0134P396
$$ 4971 2400 -3688 -11070 -16255 -4717 3137 665 -10239 -10681 -9185 -8296 -10746 -612 6784
14049F784R265J1092P972k077j1419r679J654L892r036J0105j605l924O238n602
$$ 6784 16049 27141 35113 33036 21617 11938 13592 17484 8448 18553 16948 13024 19262 13660
14035A3660O102K276L737L899J0426j308p280j0907j8325j1480P772M040m319
$$ 13660 19762 22038 25775 29674 40100 38792 31512 20605 2280 -9200 -1428 2612 -1707
14022a707j26l99K081J463l307O528J0888k02j718m147m730j865J808R61j372
$$ -1707 -1833 -2232 -151 1312 -1995 4533 15421 15219 13501 9354 4624 2759 4567 5528 4156
14007D156m041j405L141k3L733J72k914o501j377L256l549l872J0559k684J696
$$ 4156 115 -1290 1851 1828 5561 5733 2819 -3682 -5059 -1803 -5352 -9224 1335 -1349 347
13992C47R173K901Q814m633j022O832j960o768P479L541J258J889M267N94O491
$$ 347 9520 12421 21235 16602 15580 22412 20452 13684 21163 24704 25962 27851 32118 32712 39203
13977C9203j958n892j4054L900Q388P298n774m283j317j2089l03P540J127n69
$$ 39203 37245 31353 17299 21199 29587 36885 31111 26828 25511 13422 13119 20659 21786 21217
13963B1217n993k084Q367J2324J0464R141K596j0887n23r239j2250j0161n211
$$ 21217 15224 13140 21507 33831 44295 53436 56032 45145 44622 35383 23133 12972 7761
13950G761j854o025P812Q453q5J282q312P027J3184p596j7294K678r15o477r38
$$ 7761 5907 -118 7694 16147 16062 17344 9032 16059 29243 21647 4353 7031 6116 -361 -1299
13935a299M237M914m020j4198p58P565K049L234O320j801Q033o890r617M09N115
$$ -1299 2938 7852 3832 -10366 -11124 -3559 -1510 1724 8044 6243 14276 7386 -2231 -1822 3293
13920C293O978L454J062M517M162J529J0174k733M384L589j632n702j921l550
$$ 3293 10271 13725 14787 19304 23466 24995 35169 32436 36820 40409 38777 33075 31154 27604
13906B7604j0141r529K859Q329j0457p585J674K914j003J0955J099o03L605M09
$$ 27604 17463 7934 10793 19122 8665 1080 2754 5668 4665 15620 16719 16116 19721 20130
13892B0130m178J281l558K811L335Q350j91o641n354M677l136k143j0522J105
$$ 20130 15952 17233 13675 16486 19821 28171 27980 21339 15985 20662 17526 15383 4861 5966
13878E966O645m454n512j1407P950O133J579q938O203l525Q10K519l020j713M129
$$ 5966 12611 8157 2645 -8762 -812 5321 6900 -2038 4165 640 1450 3969 949 -764 3365
13863C365O178N830j492J665j084l014N894q06o559n131k210J1047K706M255K015
$$ 3365 9543 15373 13881 15546 14462 11448 17342 16536 9977 4846 2636 13683 16389 20644 22659
13848B2659k449n031o379L101Q850J182N203l08J710r624n78R162Q752l465j3275
$$ 22659 20210 15179 8800 11901 20751 21933 27136 26828 28538 18914 18336 27498 36250 32785 19510
13833A9510J243r64l319n640j535j3396L776L451q34q47o862J2074J8258l71p160
$$ 19510 20753 19789 16470 10830 9295 -4101 -325 3126 2292 1445 -5417 6657 24915 24544 17384
13818A7384k872k802K831k977m266L542q569n490M359K117L214l027J226O794
$$ 17384 14512 11710 14541 11564 7298 10840 2271 -3219 1140 3257 6471 3444 4670 11464
13804A1464o600N739or795m502P523k189m426m285k65R651L456P759N507o44K626
$$ 11464 4864 10603 10597 802 -3700 3823 1634 -2792 -7077 -7342 2309 5765 13524 19031 18387 21013
13788B1013k578j0805M772l017n311J770J805R3M311j564m788M802j82j267n45
$$ 21013 18435 7630 12402 9385 4074 5844 7649 7742 12053 10489 5701 10503 10321 9054 8509
13773H509j09r451j224J3896Q712j027l942q3o237q166k140O05n064L98P866J978
$$ 8509 8400 -1051 -2275 11621 20333 19306 15364 15281 9044 878 -1262 -657 -5721 -5323 2543 4521
13757D521j1579l114j304R277O545l752k312M587J0667N241Q08j1m432l623K890
$$ 4521 -7058 -10172 -11476 -2199 4346 594 -1718 2869 13536 18777 19585 19574 15142 11519 14409
13742A4409L664K770J832j203j279l160k440Q351K985k075K754J1399n95r189
$$ 14409 18073 20843 22675 21472 20193 17033 14593 22944 25929 23854 26608 38007 37412 28223
13728B8223K412q77M258Q122j0422q558R801L191l503j403L300n73l976L210P72
$$ 28223 30635 29758 34016 42138 31716 23158 32959 36150 32647 31244 34544 33971 29995 33205 33977
13713C3977j7287j0534j784P025j456Q043l957l335q620j1543k183P544Q197n883
$$ 33977 16690 6156 4372 11397 9941 17984 14027 10692 2072 -9471 -11654 -4110 4087 -1796
13699a796k444p93R191L268k795N937k083k163P647J590r707K014l070M817l175
$$ -1796 -4240 -5033 4158 7426 4631 10568 8485 6322 13969 15559 5852 7866 4796 9613 6438
13684F438r994p99o23j1434m688O579J4475J0866r460j2952M216K559N404N24
$$ 6438 -3556 -4355 -4978 -16412 -21100 -14521 -46 10820 1360 -11592 -7376 -4817 587 1111
13670A111j0793K98P073l903o17J0679P15k323N918l91n233Q614K284j530o774
$$ 1111 -9682 -9384 -2311 -6214 -6831 3848 4563 2240 8158 7767 2534 11148 13432 11902 5128
13655E128L314J975O290K592p222K68N12n708m362N795J1995O1o023J745O42l00
$$ 5128 8442 10417 16707 19299 12077 12345 12857 7149 2787 8582 20577 20638 14615 16360 17002 16702
13639A6702K453L471m459O257o963m716R018l080m298O652P820J392M550k145
$$ 16702 19155 22626 18167 24424 17461 12745 21763 18683 14385 21037 28857 30249 34799 32654
13625C2654J825J694r02J569m628o949m670p037l284m102L047Q203K381j238o791
$$ 32654 34479 36173 35271 36840 32212 25263 20593 13556 10272 6170 9217 17420 19801 18563 11772
13610A1772k131p979p5J2212M920p900m464O784p720J388K996j55k830l825K136
$$ 11772 9641 1662 1587 13799 18719 10819 6355 13139 5419 6807 9803 9648 6818 2993 5129
13595E129L374L470j3315o020R810M465p734M452O822l04p136o384l818m064O465
$$ 5129 8503 11973 -1342 -7362 2448 6913 -821 3631 10453 10149 3013 -3371 -7189 -11253 -4788
13580d788j649M664k719l751K705L36k247L162K582R281M983r717q368j161k324
$$ -4788 -6437 -1773 -4492 -8243 -5538 -5202 -7449 -4287 -1705 7576 12559 2842 -5526 -6687 -9011
13565i011K604R455L254k898l123k96L95Q029L885n542P116L51J985j0269k836
$$ -9011 -6407 3048 6302 3404 281 -15 380 8409 12294 6752 13868 14219 16204 5935 3099
13550C099M547P235O70M656o077p773O756O182n32j1650j4452n413Q102K990K798
$$ 3099 7646 14881 15551 20207 14130 6357 13113 19295 18763 7113 -7339 -12752 -4650 -1660 1138
13535A138n517M129Q278o414j091q41m075l462Q070K234o62L147l285L375M691
$$ 1138 -4379 -250 8028 1614 523 -318 -4393 -7855 215 2449 1787 4934 1649 5024 9715
13520I715l598Q34O482K049J511p195l140P227j44J574r407k944l37L435P223
$$ 9715 6117 6951 13433 15482 16993 9798 6658 13885 13741 15315 5908 2964 2627 6062 13285
13505A3285j567j447j330j6419m113K749N564M317O410n68L851K067M96p041J65
$$ 13285 11718 10271 8941 -7478 -11591 -8842 -3278 1039 7449 6881 10732 12799 13295 6254 6419
13490F419l648q54M585o052K220J083m694l224k244M389J664n84L308O161M818
$$ 6419 2771 1917 6502 450 2670 3753 -941 -4165 -6409 -2020 -356 -940 2368 8529 13347
13475A3347J6142K664m629r209j892l343j214j730O325J0550n58k817q567J106
$$ 13347 29489 32153 27524 18315 16423 13080 11866 10136 16461 27011 26453 23636 15069 16175
13461A6175J0012K702K347j1393j0914o244O738J1919R62n742p833n608o10J95
$$ 16175 26187 28889 31236 19843 8929 2685 9423 21342 22304 16562 8729 3121 2511 2706
13447B706L84Q31R04l353O374R550k064m330o222N950J3962M081k851n289l650
$$ 2706 3090 3921 4825 1472 7846 17396 15332 11002 4780 10730 24692 28773 25922 20633 16983
13432A6983P366j868j0031R666K969O81K149q102m695R00Q401L505n988j7436
$$ 16983 24349 22481 12450 22116 25085 25766 27915 19813 15118 16018 24419 27924 21936 4500
13418D500k627M017j276P62o225N133J455N622q08k04L090Rj473o019l760J1369
$$ 4500 1873 5890 4614 5376 -849 4284 5739 11361 10553 10349 13439 13448 11975 5956 2196 13565
13402A3565J7715j2606o921O621j049K474m966o420j0109j3339L595K961L864
$$ 13565 31280 18674 11753 18374 17325 19799 14833 8413 -1696 -15035 -11440 -8479 -4615
13389d615J713K631l657q588N05M245J2110P466l151o8j709k378J8617J717p289
$$ -4615 -2902 -271 -3928 -12516 -12011 -7766 4344 11810 8659 8591 6882 4504 23121 24838 17549
13374A7549j0801m438M201L404M809M95N034L52j065L808k032m7N991M197r210
$$ 17549 6748 2310 6511 9915 14724 15219 20253 20605 19540 23348 21316 21269 27260 31457 22247
13359B2247n974O063O888J2727R101n410j4811j215N501M449o627o905L574N590
$$ 22247 16273 22336 29224 41951 51052 45642 30831 29616 35117 39566 32939 26034 29608 35198
13345C5198j1291J30J718K663L938o736j722J442Q687j091p595M662Q537J469
$$ 35198 23907 24037 25755 28418 32356 25620 23898 25340 34027 32936 25341 30003 38540 40009
13331D0009n068k0584p725m40M154O487J166l942J720m513k772m171m676K088
$$ 40009 34941 14357 6632 6192 10346 16833 17999 14057 15777 11264 8492 4321 -355 1733
13317A733j975j70J79Q290N407m254L536N033K595O769k130k349j598N656l423
$$ 1733 -242 -412 -233 8057 13464 9210 12746 17779 20374 27143 25013 22664 21066 26722 23299
13302B3299J56k180l758p785J328p172k517N013J1133k538J676J3277R45r709
$$ 23299 23455 21275 17517 9732 11060 3888 1371 6384 17517 14979 16655 29932 30877 21168
13288B1168N718k614K362M041K950j0176r543K877m170m400l870O375M249N61
$$ 21168 26886 24272 26634 30675 33625 23449 13906 16783 12613 8213 4343 10718 14967 15528
13274A5528j314M030J565m800n793j395R69O622N753O207O059q158j448m968M028
$$ 15528 14214 18244 19809 15009 9216 7821 8790 15412 21165 27372 33431 25273 23825 18857 22885
13259B2885j0168J341L716N57l16N24m630K971Q00j539J771J1695j041j038M44
$$ 22885 12717 14058 17774 18331 18015 18539 13909 16880 17680 16141 17912 29607 28566 27528 27972
13244B7972L278N433l451j4658M04k313k49o035j2403q931K699R958K637l81K633
$$ 27972 31250 36683 33232 18574 18978 16665 16416 10381 -2022 -10953 -8254 1704 4341 3960 6593
13229F593Q912k971m759l124n328J4969O185j0245o683K130O709M325o16J386
$$ 6593 15505 12534 7775 4651 -677 14292 20477 10232 3549 5679 12388 16713 16097 17483
13215A7483N94k868n531j382k963L610O807N788Q09j0500j1364O231J2371K542
$$ 17483 18077 15209 9678 8296 5333 8943 15750 21538 22347 11847 483 6714 19085 21627
13201B1627Q26q372o79q483p710J0112K982j0475o869K051O761M730M04M159j3
$$ 21627 22453 14081 13402 4919 -2791 7321 10303 -172 -7041 -4990 1771 6501 6905 11064 11051
13186A1051J511K460n066J116Q919j779k582k315K168n147k710m109J87N150k672
$$ 11051 12562 15022 9956 11072 19991 18212 15630 13315 15483 10336 7626 3517 3704 8854 6182
13171F182K99M655o31P69J824m222j92R71K653l21K486l973r101q191O370O23
$$ 6182 6481 11136 10505 11274 13098 8876 8684 9655 12308 11987 14473 10500 1399 -6792 -422 201
13155B01m066L439N362q968m584M56O256P54p12N302J02o79N340O721m09o0m390
$$ 201 -3865 -426 4936 -4032 -8616 -8160 -1904 -1150 -1862 3440 3542 2863 8203 14924 14515 14455 10065
13138A0065j1450N313M25p81M59N027n318L965L460m400N105J0842L359p332j5872
$$ 10065 -1385 3928 4353 3572 4031 9058 3740 7705 11165 6765 11870 22712 26071 18739 2867
13123B867j967N556J2865J3483m599k638n51m470o663m751K220P977J844j2491
$$ 2867 900 6456 19321 32804 28205 25567 25016 20546 13883 9132 11352 19329 21173 8682
13109H682p412Q42j296L92N420Q863o671j331J2756O88l104N148j2955m504L132
$$ 8682 1270 2112 816 1208 6628 15491 8820 7489 20245 20933 17829 22977 10022 5518 8650
13094H650j292m376J3893Q505m836n910L383K330N887O537m212j2131O308Q279
$$ 8650 7358 2982 16875 25380 20544 14634 18017 20347 26234 32771 28559 16428 22736 31015
13080C1015j671n270j574j1260j77L626J708j228Q070J5913k001j5456J775O684
$$ 31015 29344 24074 22500 11240 11063 14689 16397 15169 23239 39152 37151 21695 23470 30154
13066C0154K053q458m935P866k520p916k780N181P838r380m542P028Q882K30k53
$$ 30154 32207 23749 18814 26680 24160 16244 13464 18645 26483 17103 12561 19589 28471 28701 28448
13051B8448Q536M310n038n909K614K921p848q112M95r179k71K652N642J1543J4454
$$ 28448 36984 41294 36256 30347 32961 35882 28034 19922 20417 11238 10967 13619 19261 30804 45258
13036D5258J868j591O520M304P496N583L979J622J5052J1746j6631j3931o312
$$ 45258 47126 45535 52055 56359 63855 69438 73417 75039 90091 101837 85206 71275 64963
13023F4963p048p114j1853j1342J294K599N95n100o937j419K98L674R277L164
$$ 64963 57915 50801 38948 27606 28900 31499 32094 26994 20057 18638 18936 22610 31887 35051
13009C5051Q711J3617J882P271l948j239J882N42m386K566L555m996k032M83L191
$$ 35051 43762 57379 59261 66532 62584 61345 63227 63769 59383 61949 65504 60508 58476 58959 62150
12994F2150J549R830j685j683k232j0365p201P870m253m421m372j310m886J9P971
$$ 62150 63699 73529 71844 70161 67929 57564 50363 58233 53980 49559 45187 43877 38991 39010 46981
12979D6981M305J2783N230J8330J8462N795M371J2946p750j4439k3087j9038k280
$$ 46981 51286 64069 69299 87629 106091 111886 116257 129203 121453 107014 83927 64889 62609
12966F2609l249K015n269j2780r983K284l505k050L277J0219K825R111R709J2524
$$ 62609 59360 61375 56106 43326 33343 35627 32122 30072 33349 43568 46393 55504 65213 77737
12952G7737m674l193k285M890j3233j3312j258o791j673M71N25N766q87R436J7129
$$ 77737 73063 69870 67585 72475 59242 45930 44672 37881 36208 36679 37204 42970 42083 51519 68648
12937F8648O129n078j0617j200r04j0151j1012k584p93N560k946K149l460Q94
$$ 68648 74777 69699 59082 57882 56978 46827 35815 33231 32438 37998 35052 37201 33741 34635
12923C4635n94M952J7047P370L132O872K449O95r716j3631P62Q98j1720o582n777
$$ 34635 34041 38993 56040 63410 66542 73414 75863 76558 66842 53211 53973 54871 43151 36569 30792
12908C0792N723K914m190n113M404L334q277R549J2134L0O354K397M218M008j3355
$$ 30792 36515 39429 35239 30126 34530 37864 29587 39136 51270 51300 57654 60051 64269 68277 54922
12893E4922j7937q37o182o252r671n583L817L66k773q071N680K839o412n965R024
$$ 54922 36985 36148 29966 23714 14043 8460 12277 12643 9870 1799 7479 10318 3906 -2059 6965
12878F965K394n569P128k726J551N487J988p329k657J3808J343o707M162O551
$$ 6965 9359 3790 10918 8192 9743 15230 17218 9889 7232 21040 22383 15676 19838 26389
12864B6389j599q454k185r5M409J292j0634K741J3561O32j8301j964L887m02p617
$$ 26389 24790 16336 14151 14056 18465 19757 9123 11864 25425 26057 7756 5792 9679 9277 1660
12849A660K733O837L586N993K015p536L348o848J1461R310p363k323q120M539
$$ 1660 4393 11230 14816 20809 22824 15288 18636 11788 23249 32559 25196 22873 14753 19292
12835A9292N849q548o423N814J686n360P602M939K699M092m63j0944R78K103M619
$$ 19292 25141 16593 10170 15984 17670 12310 19912 24851 27550 31642 31179 20235 21213 23316 27935
12820B7935q94r731n134J0141J0730o420K624J2485l267j1886p538J763K260Q625
$$ 27935 27041 17310 12176 22317 33047 26627 29251 41736 38469 26583 19045 20808 23068 31693
12806C1693J0647k567p652k575n759l375j842R112M639o095M104J369q049K193
$$ 31693 42340 39773 32121 29546 23787 20412 18570 27682 32321 26226 30330 31699 23650 25843
12792B5843Q426N418Q26j874o679q950k555L380P25O330Q934n545J025n378N70
$$ 25843 34269 39687 40513 38639 31960 23010 20455 23835 24560 30890 39824 34279 35304 29926 30496
12777C0496N508n00R88k657j352r94l270j070m11n254P399N024o974j2057j2524
$$ 30496 36004 35504 36492 33835 32483 31489 28219 27149 26738 21484 28883 33907 26933 14876 2352
12762B352q32J0354J3758J0064q947o095l281R521Q164k105O554n60j5587n887
$$ 2352 1520 11874 25632 35696 26749 20654 17373 26894 35058 32953 39507 38947 23360 17473
12748A7473m847L752N183J5166J0772j262j0657K858n146j1767r948m644O89O712
$$ 17473 12626 16378 21561 36727 47499 46237 35580 38438 33292 21525 11577 6933 7622 14334
12734A4334R741P266l037j1528P037K525l297l796k001N807J718o504r047R187
$$ 14334 24075 31341 28304 16776 23813 26338 23041 19245 17244 23051 24769 18265 9218 18405
12720A8405P699M540M271O725l161p389k157r05j4977l987P592K778O660L526
$$ 18405 26104 30644 34915 41640 38479 31090 28933 28028 13051 9064 16656 19434 26094 29620
12706B9620K345K318j438J064k300o600l977J778j1758k486J1765J1172l942R91
$$ 29620 31965 34283 32845 33909 31609 25009 21032 22810 11052 8566 20331 31503 27561 28552
12692B8552J960N855m906l961l007l647o520r604O049J6889J5935K260q496r641
$$ 28552 30512 36367 31461 27500 24493 20846 14326 4722 10771 27660 43595 45855 37359 27718
12678B7718K124Q825r3r518k429J859o937j784L485j034R527J1255J421j0012
$$ 27718 29842 38667 38574 29056 26627 28486 21549 19765 23250 22216 31743 42998 44419 34407
12664C4407l671q966j777L586j240k339Q232N38n867M622K792J758J295o922j988
$$ 34407 30736 21770 19993 23579 22339 20000 28232 28770 22903 27525 30317 32075 33370 26448 24460
12649B4460j872m086m492K735P481O004J219r072k878N907M974K0195O761j275
$$ 24460 22588 18502 14010 16745 24226 30230 31449 22377 19499 25406 30380 50575 57336 56061
12635E6061L552L815j2057P201p853r324r573j1934R63k38j5032n194N902Q776
$$ 56061 59613 63428 51371 58572 50719 41395 31822 19888 20851 20613 5581 387 6289 15065
12621A5065J3429l381r94L150o90m341n332K552M924O923P139M476j570n171J529
$$ 15065 28494 25113 24119 27269 26579 22238 16906 19458 24382 31305 38444 42920 41350 36179 37708
12606C7708O230j3398r161l927N32N499N717l833K77J019r317l010L517R508P578
$$ 37708 43938 30540 21379 17452 17984 23483 29200 25367 25644 26663 17346 14336 17853 27361 34939
12591C4939p087m076J0083K121r940J312J1979O338p491m419L374j133l753k545
$$ 34939 27852 23776 33859 35980 26040 27352 39331 45669 38178 33759 37133 36000 32247 29702
12577B9702L928M748j1234r699J684J1417K119K406R595n153j3874p576m861J2643
$$ 29702 33630 38378 27144 17445 19129 30546 32665 35071 44666 39513 25639 18063 13202 25845
12563B5845M702l581m043p601R222M467p826n87J0060M800m788P664J010j699
$$ 25845 30547 26966 22923 15322 24544 29011 21185 20598 30658 35458 30670 38334 39344 37645
12549C7645J830j0900o402J58Q51R62P818o50n829L266J0761j405o266r90N091
$$ 37645 39475 28575 22173 22331 23182 24144 31962 31312 25483 28749 39510 38105 31839 30849 35940
12534C5940M572L33k215r59j831Q279J0241O72K779m843r169j593j815j1535k405
$$ 35940 40512 40845 38630 37671 35840 44119 54360 55032 57811 52968 43799 42206 40391 28856 26451
12519B6451p084L089n91m072P683L304M948J657q619L645J031o130j720j347M743
$$ 26451 19367 22456 21865 17793 25476 28780 33728 35385 26766 30411 31442 25312 23592 22245 26988
12504B6988n34J54R56N093k680J800n0o580j358J8223J0496O45l296k261l366
$$ 26988 26454 26608 27564 32657 29977 31777 31727 25147 23789 42012 52508 53153 49857 47596 44230
12489D4230q985M065J5925J4189R584j321r466j3389r003j405l990j1738n130
$$ 44230 35245 39310 55235 69424 79008 77687 68221 54832 45829 44424 40434 28696 23566
12476B3566o60m267j006L668Q413R02j532J0351o12k899J364j5968n755J2836
$$ 23566 22906 18639 17633 21301 29714 30616 29084 39435 38823 35924 37288 21320 15565 28401
12462B8401L671l736K707M635N294n43j868M586J824P84R03L358j941L156O009
$$ 28401 32072 28336 31043 35678 40972 40429 38561 43147 44971 45755 46658 50016 48075 51231 57240
12447E7240J75K890R07L195P549K427k77n467r830j930j1787j3701o068J943k132
$$ 57240 57415 60305 61212 64407 71956 74383 74106 68639 58809 56879 45092 31391 25323 27266 25134
12432B5134o107K87R974P301O303n166l946J281p258q06P733k17L49Q104m045
$$ 25134 19027 19314 29288 36589 42892 37726 33780 35061 27803 26997 34730 34513 34862 42966 38921
12417C8921o105j36N99M156n819M277j541j726J0004R347k965K557J0580N468
$$ 38921 32816 32680 33279 37435 31616 35893 34352 32626 42630 51977 49012 51569 62149 67617
12403F7617P886O063j0482j8539j3324l441j566N735j696J825P633O33M583r38
$$ 67617 75503 81566 71084 52545 39221 35780 34214 39949 38253 40078 47711 48344 52927 51989
12389E1989l596J2923M877J520k441j6758r757n344j483J998N035K585L873J27
$$ 51989 48393 61316 66193 67713 65272 48514 38757 33413 31930 33928 38963 41548 45421 45548
12375D5548M318o331p911M797j0672j044K03Q980J7694J5594N870o991l151K507
$$ 45548 49866 43535 35624 40421 29749 28705 28908 37888 55582 71176 77046 70055 66904 69411
12361F9411k743l921l379m746o203N740J1919l096l693L226K479J078p01m428
$$ 69411 66668 62747 59368 54622 48419 54159 66078 62982 59289 62515 64994 66072 65371 60943
12347F0943L450J812n941q077j0522K259P822J2945m418j318r03O02J0546J3573
$$ 60943 64393 66205 60264 52187 41665 43924 51746 64691 60273 58955 58052 58654 69200 82773
12333H2773j691p23M150M156J238o246n187l090l325p316n898n93R918j446n737
$$ 82773 81082 80359 84509 88665 89903 83657 78470 75380 72055 64739 58841 58248 68166 66720 60983
12318F0983P4p13q415p782J101O554n630N372J2423N764n419O475R039R239J236
$$ 60983 61057 60344 51929 44147 45248 51802 46172 51544 63967 69731 64312 70787 79826 89065 90301
12303I0301l481k862m352o230m258R653Q256n739k213m232r227N201P892n886
$$ 90301 86820 83958 79606 73376 69118 78771 87027 81288 79075 74843 65616 70817 78709 72823
12289G2823k724j2017r258l70L939j227L587J4468J0309k696r63n495O006k066
$$ 72823 70099 58082 48824 48454 52393 51166 54753 69221 79530 76834 75871 70376 76382 74316
12275G4316M285m009M332N477j621J659N188J405P21K320p415j0363q842l414
$$ 74316 78601 74592 78924 84401 82780 84439 89627 91032 91753 94073 86658 76295 67453 64039
12261F4039m572o129M75K935J2529K334n326q850o438l471J3400L148j166J338
$$ 64039 59467 53338 53813 56748 69277 71611 66285 57435 50997 47526 60926 64074 62908 64246
12247F4246l544L273J4964Q836K547o373q131m777j2841j810m068r827K640L732
$$ 64246 60702 63975 78939 87775 90322 83949 75818 71041 58200 56390 52322 42495 45135 48867
12233D8867J2101N391M978n331o922p122m647J76L474j822N781L479J86q127j2476
$$ 48867 60968 66359 71337 66006 59084 51962 47315 47491 50965 49143 54924 58403 58589 50462 37986
12218C7986n047K638K078m686j601Q061J137O964R150L365J0604K473R423j155
$$ 37986 32939 35577 37655 32969 31368 39429 40566 47530 56680 60045 70649 73122 82545 81390
12204H1390j93M415Q34j0547k592j733k621r742N39J2920J251r053l638K266J809
$$ 81390 81197 85612 86446 75899 73307 71574 68953 59211 59750 72670 73921 64868 61230 63496 65305
12189F5305n638Q222r23j3568j001J5812K177q843l353r094O529Q45j508l513
$$ 65305 59667 67889 66966 53398 52397 68209 70386 61543 58190 49096 55625 56470 54962 51449
12175E1449j2368n235l610k735J5965R432P128N003m940r558q25j571N468P554
$$ 51449 39081 33846 30236 27501 43466 52898 60026 65029 60089 50531 49706 48135 53603 61157
12161F1157L034N63M437q335p471n914n477j0391N499J4564J0987R571l536j1642
$$ 61157 64191 64754 69191 60856 53385 47471 41994 31603 37102 51666 62653 72224 68688 57046
12147E7046r920n035L146J4292J4153L217M229k979o258k281R56k425M20n630
$$ 57046 47126 42091 45237 59529 73682 76899 81128 78149 71891 69610 70566 68141 68561 62931
12133F2931R060K782O640m400j1286M483J5n052q537j527r995P986N700K820L602
$$ 62931 71991 74773 81413 77013 65727 70210 70225 65173 56636 55109 45114 53100 58800 61620 65222
12118F5222R136o742o827n360O603J2218p353j82j763j629m978j102j1491J663
$$ 65222 74358 67616 60789 55429 62032 74250 66897 66715 64952 63323 58345 57243 45752 47415
12104D7415N731K929q813J33J8088J2985n813j3815j2266J177m505Q482L823O156
$$ 47415 53146 56075 47262 47395 65483 78468 72655 58840 46574 47751 43246 51728 55551 61707
12090F1707N956O251q128k674R956Q02j5447l181k611Q035o2Q76n323o956k371
$$ 61707 67663 73914 65786 63112 73068 73870 58423 55242 52631 60666 60604 61480 56157 49201 46830
12075D6830N441J0591O814L170l029n037M357j462J0551L708j1045j444J274N06
$$ 46830 52271 62862 69676 72846 69817 64780 69137 67675 78226 81934 70889 69445 70719 71225
12061G1225Q205J111l705Q735J5940J7665p761J27M134J8287J9798J7396K7721
$$ 71225 79430 80541 76836 85571 101511 119176 111415 111542 115676 133963 153761 171157 198878
12048A98878M7626O6864R6895J13827J01502M3279m4942j04000j03105q8841o7127
$$ 198878 246504 313368 410263 524090 625592 668871 623929 519929 416824 327983 260856
12037B60856m1693k7124j9013q524r166j5709q290O239m528j1027o6J1128J6786
$$ 260856 219163 192039 173026 164502 155336 139627 131337 137576 133048 122021 121955 133083 149869
12024A49869N678N469Q834J682m404L494Q819K463J6880J6957R117O017J4849
$$ 149869 155547 161016 169850 171532 167128 170622 179441 181904 198784 215741 224858 230875 245724
12011B45724L9501N6202P5298Q4979P0420N7253J5339l0012p4484q2884q9559
$$ 245724 285225 341427 416725 501704 572124 629377 644716 614704 540220 457336 367777
12000C67777p6251n5510m4240l2580j3557m889r23j0681r984r434r143k256o957
$$ 367777 291526 236016 191776 159196 145639 140750 139827 129146 119162 109728 100585 98329 91372
11987I1372L152L393q303r895m253L51m131p426N62R061n849k459L370L053K159
$$ 91372 94524 97917 89614 79719 75466 75817 71686 64260 64822 73883 68034 65575 68945 71998 74157
11972G4157j973j343j86O555N692l532N204K833r364o149M032K392m436r145J113
$$ 74157 72184 70841 70655 77210 82902 79370 84574 87407 78043 71894 75926 78318 73882 64737 65850
11957F5850Q633r66k870L398J0833J5460L006J1932Q019q498J85j4412j1980l062
$$ 65850 74483 73517 70647 74045 84878 100338 103344 115276 123295 114797 114982 100570 88590 85528
11943H5528l968q200l201j60M925Q747M614q09o17q553k815J515J665n341j1278
$$ 85528 81560 73360 70159 69999 74924 83671 88285 87476 86859 78306 75491 77006 78671 73330 62052
11928F2052N284l409o615Q157J0638O450o064Q651O889m940j1217J3030J0740
$$ 62052 67336 63927 57312 65469 76107 82557 76493 85144 92033 87093 75876 88906 99646
11915I9646l097r432p216J3584R758J521j071K636L263o112n339M193l370p7J517
$$ 99646 96549 87117 79901 93485 103243 104764 103693 106329 109592 103480 98141 102334 98964 98887 100404
11900A00404J4818J1079J5245J1794K5462J5934r403j6666j5830o239R95r32j9718
$$ 100404 115222 126301 141546 153340 178802 194736 185333 168667 152837 146598 147593 146661 126943
11887A26943r536q74k592l471l740o759n016L096M503j613n203o686N234o382
$$ 126943 117407 116533 113941 110470 106730 99971 94955 98051 102554 100941 95738 89052 94286 87904
11873H7904j495J4912J2034L268j438L373o929j4042p375L98l47k354J1367N599
$$ 87904 86409 101321 113355 116623 115185 118558 111629 97587 90212 90610 90263 87909 99276 104875
11859A04875o985J582l950j527p278L260q558j746M099L349O970M179K390o060
$$ 104875 97890 99472 95522 93995 86717 89977 81419 79673 83772 87121 94091 98270 100660 94600
11845I4600p223r017k134M813k016L895K342P676k753l496J017m882K656m081
$$ 94600 87377 78360 76226 81039 79023 82918 85260 92936 90183 86687 87704 82822 85478 81397
11831H1397J0865L842l058j645j469N812O580j3343p341j862O144J0871L304j3386
$$ 81397 92262 96104 93046 91401 89932 95744 102324 88981 81640 79778 85922 96793 100097 86711
11817H6711n320k576J733O726L972l402q747J0992N214o811k261O575m723p181
$$ 86711 81391 78815 80548 87274 91246 87844 79097 90089 95303 88492 86231 92806 88083 80902
11803H0902N74L989k897m96K101O521l034k588j432L150k50m418j111K084K50
$$ 80902 81476 85465 82568 82072 84173 90694 87660 85072 83640 86790 86540 82122 81011 83095 83345
11788H3345L347N839N17q240n853j901L782L724j1795j13O578J6618k949L241
$$ 83345 86692 92531 93048 84808 78955 77054 80836 84560 72765 72652 79230 95848 92899 96140
11774I6140K831m746j98j183l464L555K539q19r94P987o914R80j033L087N063
$$ 96140 98971 94225 94027 92844 89380 92935 95474 94655 93661 101648 94734 95714 94681 97768 102831
11759A02831j616r390N357K58p780K172R605j2505k939L846J2143l915p806j893
$$ 102831 101215 91825 97182 97440 89660 91832 101437 88932 85993 89839 101982 98067 90261 88368
11745H8368l112O584J0256l634m535M87N058o63o501M632J3952J694K114j1785
$$ 88368 85256 91840 102096 98462 93927 94414 99472 98809 92308 96940 110892 112586 114700 102915
11731A02915o628j553M168j1408j5980R823N473L594l062m693J0857q27M313r276
$$ 102915 96287 94734 98902 87494 71514 81337 86810 90404 87342 82649 93506 92679 96992 87716
11717H7716L925N774O858J014l02J783m657M51n182K205k468Q613M196j0351p07
$$ 87716 91641 97415 104273 105287 104985 106768 102111 102562 97380 99585 97117 105730 109926 99575 98868
11702I8868K799P678J547j6092j1189M149J1963N86L916K238l429L235k064j5362
$$ 98868 101667 109345 110892 94800 83611 87760 99723 100309 104225 106463 103034 106269 104205 88843
11688H8843j3062J433O29J1119J5249N890o689m146L765J2625O100j765L88L620
$$ 88843 75781 77214 77843 88962 104211 110101 103412 99266 103031 115656 121756 119991 120379 123999
11674A23999P639J680L11j034N87m902R515m866l626j903r471J910L734k646N704
$$ 123999 131638 133318 133629 132595 133182 128280 137795 132929 129303 127400 117929 119839 123573 120927 126631
11659A26631O285q149n304L24L327J025q758o501p535k208P25k592M200P39o180
$$ 126631 132916 124767 119463 119787 123114 124139 115381 108880 101345 99137 99862 97270 101470 102209 96029
11644I6029j350O351J1725L391k081K692m9q286l259n971N132R988M334P618M635
$$ 96029 94679 101030 112755 116146 114065 116757 116708 108422 105163 99192 104324 114312 118646 126264 130899
11629A30899N565J4051J1379N381p297O420l872p759n866j943p126k597K61j795
$$ 130899 136464 150515 161894 167275 159978 166398 162526 154767 148901 146958 139832 137235 137496 135701
11615A35701r628q816l97P997o670j1501q68K965j041K727L568p916k693k673
$$ 135701 126073 117257 116860 124857 118187 106686 105818 108783 107742 110469 114037 106121 103428 100755
11601A00755K764n049Q635R165M717j864j721K813Q420l217o331J979p918J6381
$$ 100755 103519 98470 107105 116270 120987 119123 117402 120215 128635 125418 119087 121066 113148 129529
11587A29529K4523J0952K076j3253j3358q034j879M515P054R40q17o251j7993
$$ 129529 154052 165004 167080 153827 140469 132435 130556 135071 142125 143065 142248 135997 118004
11574A18004q477M553L984k9R000J1400k809k503R970J0465J2272o378j2903j751
$$ 118004 109527 114080 118064 118035 127035 138435 135626 133123 143093 153558 165830 159452 146549 144798
11560A44798R305j0216q497L082L455k03M114k439j1450o419J504p534l479O546
$$ 144798 154103 143887 135390 138472 141927 141724 145838 143399 131949 125530 127034 119500 116021 122567
11546A22567k400J716j1711J158k314R531R325Q954O925Q363J376l57K74L347
$$ 122567 120167 121883 110172 111330 109016 118547 127872 136826 143751 152114 153490 153133 153407 156754
11532A56754k606j0174n121M766N83J4677R193l418n638j1944o289K414P891O598
$$ 156754 154148 143974 138853 143619 144202 158879 168072 164654 159016 147072 140783 143197 151088 157686
11518A57686M838j747j4969j6538q415J1125P716J079Q048L091l567K621P266
$$ 157686 162524 160777 145808 129270 120855 131980 139696 140775 148823 151914 148347 150968 158234
11505A58234P358L537K474k649q754r374j807L276O159n920j1389q944l773n005
$$ 158234 165592 169129 171603 168954 160200 150826 149019 152295 158454 152534 141145 132201 128428 123423
11491A23423L455M795Q755L037j163J295O474K287R96K668J674K619J689P840
$$ 123423 126878 131673 140428 143465 142302 143597 150071 152358 153354 156022 157696 160315 162004 169844
11477A69844n623q392j1070q342L656M52K960R553K31j0820o234m540j140R901
$$ 169844 164221 155829 144759 136417 140073 140525 143485 153038 153269 142449 136215 131675 130535 140436
11463A40436J9126J5214M431l301j495J2653L540J0480J4069L049r740n644O01
$$ 140436 159562 174776 179207 175906 174411 187064 190604 201084 215153 218202 208462 202818 203419
11450B03419M082P250k221l969P954K312J2558O148j6181j5998J132Q955P016
$$ 203419 207501 214751 212530 208561 216515 218827 231385 237533 221352 205354 206486 215441 222457
11437B22457P038J2524j094j6382p466N609J702J3205J2497L812K858j5166j7628
$$ 222457 229495 242019 240925 224543 217077 222686 224388 237593 250090 253902 256760 241594 223966
11424B23966j025j674k43M217l492p265o488Q340J3654J2705M826L135k912m348
$$ 223966 222941 221267 221024 225241 221749 214484 207996 216336 229990 242695 247521 250656 247744 243396
11410B43396K604L092l678k855j2706j9207O344J8307l09j670j1373l617K638
$$ 243396 246000 249092 245414 242559 229853 210646 216990 235297 234988 233318 221945 218328 220966
11397B20966K511q302o496N550j0793o937K311N479k494l459N010R78j752q656
$$ 220966 223477 215175 208679 214229 203436 196499 198810 204289 201795 198336 203346 204324 202572 193916
11383A93916k376O529L364J026o49Q406q53j278R49o777l169J1917J4577J4882
$$ 193916 191540 198069 201433 202459 201810 210216 209363 208085 209034 202257 199088 211005 225582 240464
11369B40464O064j45L668J1108J282J651n343l677R090Q655J5448R334N162q26
$$ 240464 246528 246383 250051 261159 262441 264092 258749 255072 264162 272817 288265 297599 302761 301935
11355C01935l308N218k775r847j1405q785j0266L032Q144J2363J9430J4202J2597
$$ 301935 298627 303845 301070 291223 279818 271033 260767 263799 271943 284306 303736 317938 330535
11342C30535R312l298J099N754r273k315n04L72k323l193m643k455n913m451L362
$$ 330535 339847 336549 337648 343402 334129 331814 331310 331682 329359 326166 321523 319068 313155 308704 312066
11327C12066O879m085Q951J4001L860r466j0898q369J8847L983k099m531O847
$$ 312066 318945 314860 323811 337812 341672 332206 321308 312939 331786 335769 333670 329139 335986
11314C35986Q093j308J112l278m584j1785r877j495m37j3387j6511j3737k406
$$ 335986 344079 342771 343883 340605 336021 324236 314359 312864 312427 299040 282529 268792 266386
11301B66386Q619Q448L742P110M787j110q813p187m211k473P763P599q523M763
$$ 266386 275005 283453 287195 294305 299092 297982 289169 281982 277771 275298 283061 290660 282137 286900
11287B86900J6356L415j035R935J3352K429O6R813K0897K0529R618J0916J6631
$$ 286900 303256 306671 305636 315571 328923 331352 331418 341231 362128 382657 392275 403191 419822
11274D19822J3199J8588K4739K7328M2318N7652P2194J11011J55346J82269J96805
$$ 419822 433021 451609 476348 503676 545994 603646 675840 786851 942197 1124466 1321271
11263A321271J93008J45760O0135n1847j39037j99092k15703j81772j35791j04360
$$ 1321271 1514279 1660039 1720174 1668327 1529290 1330198 1114495 932723 796932 692572
11253F92572o5161m1492k5567q289r232N260J7160J4588K3123N8220P7168J02452
$$ 692572 627411 585919 560352 552063 542831 548091 565251 579839 602962 661182 738350 840802
11241H40802J31730J59778J91609J81723J48755J07916M0357m2106j06380j39162
$$ 840802 972532 1132310 1323919 1505642 1654397 1762313 1802670 1760564 1654184 1515022
11231A515022j53188j26248r5090q1409o1565l3331k2791k6440l9071n3398n1099
$$ 1515022 1361834 1235586 1140496 1059087 997522 964191 941400 914960 875889 822491 771392
11220G71392m4152l7679k8487l2160j8342R900J3944O008K0408L5324Q1002J11553
$$ 771392 727240 689561 661074 628914 610572 620472 634416 640424 660832 696156 777158 888711
11208H88711J42061J50965Q9018k022p6270r8333p0556l0608q315J60M394K2276
$$ 888711 1030772 1181737 1270755 1268733 1192463 1094130 1023574 992966 984651 984811 989205 1011481
11196A011481K6840R750j2264k2318j8870k1982l48K6437N2107O5086M8482Q761
$$ 1011481 1038321 1048071 1035807 1013489 994619 972637 972289 998726 1050833 1115919 1164401 1173162
11184A173162o6559j10841j25807j17130q9089o1043n1231m1677l1404l0954k9728
$$ 1173162 1106603 995762 869955 752825 663736 602693 551462 509785 478381 447427 417699
11173D17699k4748q790r393j3749r146k938k388j306q859m420o402K828N032j522
$$ 417699 392951 384161 374768 361019 351873 348935 346547 345241 336382 331962 325560 328388 333420 331898
11159C31898o45O864k026L290M727J2389P150L329P08j994j926L589M225P299
$$ 331898 331253 338117 336091 339381 344108 356497 363647 366976 367684 365690 363764 367353 371578 378877
11145C78877L309NK286m405j0296j803Q905N206K611k488k589J8285O212r564
$$ 378877 382186 382191 384477 380072 369776 367973 376878 382084 384695 382207 379618 397903 404115 394551
11131C94551l280l460Q701o04m199m644K659J0869k991N395J9556L1958J5352
$$ 394551 391271 387811 396512 395908 391709 387065 389724 400593 397602 402997 422553 454511 469863
11118D69863j559k7343r755J1903J0576k96n276l610n932K103L289R16l572r83
$$ 469863 468304 440961 431206 443109 453685 453389 448113 444503 438571 440674 443963 444879 441307 440324
11104D40324Q88M218R218L723K483N191j371M548J0525K2289J8100M520R835j093
$$ 440324 441212 445430 454648 458371 460854 466045 464674 469222 479747 502036 520136 524656 534491 533398
11090E33398q500O845L154L581Q986M445r427j1419M824R194J2786J5787J4442
$$ 533398 524898 531743 534897 538478 547464 551909 542482 531063 535887 545081 557867 573654 588096
11077E88096J7333K1463J7680J1866O969J9997J3494J7144R751N498K983J451
$$ 588096 605429 626892 644572 656438 663407 683404 696898 714042 723793 729291 732274 733725
11065G33725Q391l444j4317j5874j0010r142J712k300j043M418K3870K6636J2727
$$ 733725 742116 738672 724355 708481 698471 689329 691041 688741 687698 692116 715986 742622 755349
11052G55349K3615K3765J3781K0123K1713L188l567K578m483p065o759p890j4585
$$ 755349 778964 802729 816510 836633 858346 861534 857967 860545 856062 848997 842238 834348 819763
11039H19763p591m240k578j475K238J1917N812M881J2O603L512P549J5495J8378
$$ 819763 812172 807932 805354 803879 806117 818034 823846 828727 828739 835342 838854 846403 861898 880276
11025H80276J5292J8129J8788K7822J6498L4554M3405N3015M6513M7713M4716
$$ 880276 895568 913697 932485 960307 976805 1011359 1054764 1107779 1154292 1202005 1246721
11014A246721K9530K8876o460k7482l2480j8937j9306k6236k2733j6952k4509
$$ 1246721 1276251 1305127 1298667 1271185 1238705 1219768 1200462 1174226 1151493 1134541 1110032
11003A110032k4357k1609j9433R970J0454J1805J8320K0997J2236N853K604N707
$$ 1110032 1085675 1064066 1044633 1054603 1065057 1076862 1095182 1116179 1128415 1134268 1136872 1142579
10991A142579J2638J8975K4011J1006j249n411M310J616j8182k4460j1125j1212
$$ 1142579 1155217 1174192 1198203 1209209 1207960 1202549 1206859 1208475 1190293 1165833 1154708 1143496
10979A143496k3888p888m069l767o14r89r133n032N845Q010R042j982J379R730
$$ 1143496 1119608 1111720 1107651 1103884 1103270 1102281 1093148 1088116 1093961 1101971 1111013 1109031 1110410 1120140
10965A120140J6913L6540L0650J8838K3676L4514R203L674p513k0446l5555l4662
$$ 1120140 1137053 1173593 1204243 1223081 1246757 1281271 1290474 1294148 1286635 1266189 1230634 1195972
10953A195972l6343m7875n0562n6624o1482m7261l4180n11J5485K4933K9024L4051
$$ 1195972 1159629 1111754 1061192 1004568 943086 895825 861645 861134 876619 901552 930576 964627
10941I64627M5032M5073L8087N2570N4740N1943N1741M6398L6761K0081J0589
$$ 964627 1009659 1054732 1092819 1145389 1200129 1252072 1303813 1350211 1386972 1407053 1417642
10930A417642K5690J7708L045k702n228r484r783j5912j8399J0921N5443R6925
$$ 1417642 1443332 1461040 1464085 1461383 1456155 1446671 1436888 1420976 1402577 1413498 1468941 1565866
10918A565866J14531J00434Q6612N2177M3904J5622k9192o6550p8500p3091n2820
$$ 1565866 1680397 1780831 1867443 1919620 1963524 1979146 1949954 1883404 1804904 1731813 1678993
10907A678993l0674L184J7402L3227M2554N5766O9934Q0122R8678J00517J19286
$$ 1678993 1648319 1651503 1668905 1702132 1744686 1800452 1870386 1950508 2049186 2149703 2268989
10896B268989J14002R3210Q3181R9593J35849J69621J58213J37082J30794J80350
$$ 2268989 2382991 2476201 2559382 2658975 2794824 2964445 3122658 3259740 3390534 3570884
10886C570884K90364M51489O15805P68588R55700J116743J119015Q88145M96887
$$ 3570884 3861248 4312737 4928542 5697130 6652830 7769573 8888588 9776733 10273620
10877A0273620R8967k09515l87125m57451n05192n85096o18383n55626m34743
$$ 10273620 10372587 10163072 9775947 9318496 8813304 8228208 7609825 7054199 6619456
10868F619456k84354j24315m2017l7404o5640l9144N3830J52812K06169K21521
$$ 6619456 6335102 6210787 6168770 6131366 6065726 6026582 6080412 6233224 6439393 6660914
10858F660914K32578K69430L55732N05867P20550R19674J049070J067532J010225
$$ 6660914 6893492 7162922 7518654 8024521 8745071 9664745 10713815 11781347 12791572
10849A2791572Q68300P67164P60566P80431P82950P70778Q45236J090414J463343
$$ 12791572 13659872 14427036 15187602 15968033 16750983 17521761 18366997 19457411 20920754
10840B0920754J924672K528738L298741M209861N368443P091394R747160J3847172
$$ 20920754 22845426 25374164 28672905 32882766 38251209 45342603 55089763 68936935
10832F8936935K0191619K8715512L7131881M1001469L5868705K1044364J785075
$$ 68936935 89128554 117844066 154975947 195977416 231846121 252890485 254675560
10825B54675560j4966537k5905778l1499159l2469228k9383327k3938947j8159106
$$ 254675560 239709023 213803245 182304086 149834858 120451531 96512584 78353478
10818G8353478j3017813q658890n157296k541262p04832O32295K019652L954117
$$ 78353478 65335665 56676775 51519479 48978217 48273385 48905680 50925332 54879449
10810E4879449O644842J0151261J4518195J9622082K4911670K9245133L2197527
$$ 54879449 61524291 71675552 86193747 105815829 130727499 159972632 192170159
10803A92170159L4827843L6148517K9560898R956920j6756957l6812903m1483795
$$ 192170159 226998002 263146519 292707417 302664337 285907380 249094477 207610682
10796B07610682l3504254k1248335j0526346l435670o20663p81166k535680n218790
$$ 207610682 174106428 152858093 142331747 138896077 138275414 137494248 134958568 129739778
10788A29739778p978375r420247r204763q464886q511918r168051r024224p317010
$$ 129739778 121761403 112341156 103136393 94671507 86159589 76991538 67967314 60650304
10780F0650304m614105j831969P50149L289460O016409R474066J4051265J8129080
$$ 60650304 56036199 54204230 54954379 58243839 64260248 73734314 87785579 105914659
10772A05914659J8964046J5517826R075394K249999j796936j821690P15224M026378
$$ 105914659 124878705 140396531 149471925 151721924 149924988 148103298 148818522 152844900
10764A52844900O754590O935848M415530O94684l572534q246981j2055047j3102069
$$ 152844900 159599490 166535338 170950868 171645552 168073018 159826037 147770990 134668921
10756A34668921j0822729n883846O93408P350254J0633062P529304n48474r671794
$$ 134668921 123846192 117962346 118655754 126006008 136639070 144168374 143619900 133948106
10748A33948106j6718053k0149823j9562542j5922038j1297961p557168n274716
$$ 133948106 117230053 97080230 77517688 61595650 50297689 42740521 37465805
10741C7465805m013665l297820k909060k708416k569149k401543k173752j890208
$$ 37465805 33452140 30154320 27245260 24536844 21967695 19566152 17392400 15502192
10733A5502192j605811j371472j214012j074050r11264p55522o41866n46224m56396
$$ 15502192 13896381 12524909 11310897 10236847 9325583 8570061 7928195 7381971 6925575
10724F925575m03977l46956k92760k40906j87565j54194j19778j07702j14770
$$ 6925575 6521598 6174642 5881882 5640976 5453411 5299217 5179439 5071737 4956967
10715D956967j31373j29884j26440r6680o8500m1440l7626l4662o2167p0190n0959
$$ 4956967 4825594 4695710 4569270 4472590 4404090 4362650 4325024 4290362 4228195 4158005 4107046
10704D107046m9413m4771m7427m3198k0579j0365M396K6837P7157J25874J79646
$$ 4107046 4057633 4012862 3965435 3922237 3901658 3891293 3895689 3922526 3999683 4125557 4305203
10693D305203K41465L24151M78841P19092J076718J532778K033523K500146K660341
$$ 4305203 4546668 4870819 5349660 6068752 7145470 8678248 10711771 13211917 15872258
10684A5872258J940532K75018j407983k330965k442818k068820j520890j100788
$$ 15872258 17812790 18087808 16679825 14348860 11906042 9837222 8316332 7215544
10676G215544q20285n97929m11721k36497n9054J45598M28844P60365J116017
$$ 7215544 6395259 5797330 5385609 5149112 5090058 5235656 5664500 6424865 7540882
10667G540882J368398J330601R87754L72961m84366j261955j623782j549751j271691
$$ 7540882 8909280 10239881 11227635 11600596 11116230 9854275 8230493 6680742 5409051
10658E409051r53618o63657m49209l29779k51422j98126j62151j29760r8638r5300
$$ 5409051 4455433 3791776 3342567 3012788 2761366 2563240 2401089 2271329 2172691 2077391
10648B077391j05630j05903r4895q4046o9410n8715n3561m7905l8579l6285m5860
$$ 2077391 1971761 1865858 1770963 1686917 1617507 1558792 1505231 1457326 1418747 1382462 1336602
10637A336602m6529l8756k7815j4551p452n086J300m462q241o356j2922k0928
$$ 1336602 1290073 1251317 1223502 1208951 1201499 1196413 1197713 1193251 1185010 1178654 1165732 1144804
10625A144804m1098n9256m0517j9942r537j4119j1320M319J455k536J2400K1709
$$ 1144804 1103706 1044450 1003933 983991 974454 960335 949015 953334 954789 952253 964653 986362
10613I86362L9244N3814N7196M9701J6260q793k0528k3828q110p573l3628n3578
$$ 986362 1025606 1079420 1136616 1186317 1202577 1193784 1173256 1149428 1141318 1133745 1100117 1046539
10601A046539o8746o4191n8911l3443k6676k0954n944J3753L2499M2931M5776
$$ 1046539 977793 913602 854691 821248 794572 773618 767674 781427 813926 856857 902633
10590I02633M3800N1024M6565K1249J108n861j5500j2131j0772l2346l1942m5666
$$ 902633 946433 997457 1044022 1065271 1066379 1060518 1045018 1032887 1022115 989769 957827 912161
10578I12161l9601k8744q758k5897j955J454n323j2618j3027j2064j2325K64K149
$$ 912161 872560 843816 835058 809161 807206 808660 803337 790719 777692 765628 753303 753567 755716
10565G55716O26j04J0263L415J300K3684o28r135j5007k9154j6038J0875L211
$$ 755716 756342 756238 766501 769916 771216 794900 794272 785137 770130 740976 724938 735813 739024
10552G39024j5560l112j1893k6865k1381k5705j6667J7128K7265L1496L2476J0560
$$ 739024 723464 720352 708459 681594 660213 634508 617841 634969 662234 693730 726206 736766
10540G36766k31j2168o415k299j1341j0912k5075o768r720q901M792Q091k503
$$ 736766 736535 724367 717952 715653 704312 693400 668325 661557 651837 642936 647728 655819 653316
10527F53316j7169j2543p487J964P428J3042J8395J3919J2781M342j6207j1002
$$ 653316 636147 623604 616117 618081 625509 638551 656946 670865 683646 687988 671781 660779
10515F60779j5514r341m228j2412j6468j5350M151K3388K2397K4995K6499J8939
$$ 660779 645265 635924 631696 619284 602816 587466 591617 615005 637402 662397 688896 707835
10503G07835J3890J5357J3913J5159J698j7533k6829k6448j4637R36q687k4338
$$ 707835 721725 737082 750995 766154 767852 750319 723490 697042 682405 683341 674654 650316
10491F50316k5540k7248k1805j1134k454m084o901p001j587R749K8273J5730J9699
$$ 650316 624776 597528 575723 564589 562135 558051 551150 544149 542562 552311 580584 596314 616013
10478F16013L1053K3688K0104J2194R945J0397n716l6830l5345l1161k9105k6929
$$ 616013 647066 670754 690858 703052 712997 723394 717678 680848 645503 614342 585237 558308
10466E58308j9093j9573k2801j4643m020n481n412l481l883j532J2042J7748N588
$$ 558308 539215 519642 496841 482198 478178 472697 467285 463804 459921 458389 470431 488179 493767
10453D93767k168l233J1598J5981n41K487J3596J0265j0582k6347j7448K594j0562
$$ 493767 491599 488366 499964 515945 515404 517891 531487 541752 531170 504823 487375 489969 479407
10440D79407m804q267r045k331o918k568N284j16J254m330j0321n40P321J2072
$$ 479407 474603 466336 457291 454960 448042 445474 450758 450642 451896 447566 437245 436705 444026 456098
10426D56098J0589K805N475Q110J0144Q181L363M305l664r75p710o827M182J4594
$$ 456098 466687 469492 474967 483077 493221 501402 504765 509070 505406 504431 496721 489894 494076 508670
10412E08670M864O767Q304R091O822j979J622O977J5726J4322J1701K578J0150
$$ 508670 513534 520301 528605 537696 544518 542539 544161 551138 566864 581186 592887 595465 605615
10399F05615J7128J9236J1048N232L1983N1997P1461R9755J06769R2979R4259
$$ 605615 622743 641979 653027 658259 690242 742239 813700 913455 1020224 1113203 1207462
10388A207462J14061J20808J05134N8924k550o0706r8780j19474j16129r5387
$$ 1207462 1321523 1442331 1547465 1606389 1603839 1543133 1444353 1324879 1208750 1113363
10378A113363p0705o3383l3260k7304k0539q973q868O150K1248M2306M6793P9490
$$ 1113363 1042658 979275 946015 918711 898172 889199 880331 886481 907729 950035 996828 1076318
10366A076318J12001J63285K19205K63217K50457J95394J19627L6821l6885j04341
$$ 1076318 1188319 1351604 1570809 1834026 2084483 2279877 2399504 2436325 2399440 2295099
10356B295099j54561j48369j32688j07656q7499p1925o8778n9212l6923m8346
$$ 2295099 2140538 1992169 1859481 1751825 1664326 1592401 1523623 1464411 1427488 1379142
10346A379142o8934o8270p3354n5826k6663j8302q414l113Q640J8027L3826M5802
$$ 1379142 1310208 1241938 1168584 1112758 1086095 1067793 1059379 1056266 1064906 1082933 1116759 1162561
10334A162561N5186Q5341J22353J69146K07244J94082J29187O7054K0415J7539
$$ 1162561 1217747 1303088 1425441 1594587 1801831 1995913 2125100 2192154 2212569 2230108
10324B230108N8425Q8095R3000Q9104R3536J24441J98634K96859M67186P47462
$$ 2230108 2288533 2376628 2469628 2558732 2652268 2776709 2975343 3272202 3739388 4486850
10314D486850J186587J672533J865731J427724N19569k10429k36678J44694K32774
$$ 4486850 5673437 7345970 9211701 10639425 11158994 10948565 10711887 10856581 11089355
10305A1089355l25117j139682j539368j411206r82134n62372k56980k2506J94689
$$ 11089355 10764238 9624556 8085188 6673982 5691848 5129476 4872496 4849990 5044679
10296E044679M54530P77995J221500J856999K772493L710786L866989K877445
$$ 5044679 5499209 6277204 7498704 9355703 12128196 15838982 19705971 22583416
10288B2583416J288017J5108j93462K50769J40161j008239k532493l569110l618756
$$ 22583416 23871433 23886541 23693079 23943848 24084009 23075770 20543277 16974167 13355411
10279A3355411k862520j964631j302056q01199m16016q4478K32991N67203J011668
$$ 13355411 10492891 8528260 7226204 6425005 6008989 5924511 6157502 6724705 7736373
10270G736373J700417K551783L000926K386535P96233n38959n48525L42910O83233
$$ 7736373 9436790 11988573 14989499 17376034 18172267 17633308 17084783 17427693 18110926
10261A8110926l31934k016677k980765k769161j969798j235965p49022m30313
$$ 18110926 17778992 15762315 12781550 10012389 8042591 6806626 6057604 5627291
10253E627291j65480O1676K84569N36911Q56402J306716J981919K755303K945042
$$ 5627291 5461811 5523487 5808056 6344967 7201369 8508085 10490004 13245307 16190349
10244A6190349J919077L25330m95394q8934N47922J68689j129122k145658k243531
$$ 16190349 18109426 18434756 17939362 17850428 18398350 18567039 17437917 15292259 13048728
10235A3048728j721148j083386n35279p5499L59061Q03721J303982J928405K890997
$$ 13048728 11327580 10244194 9708915 9633416 9992477 10796198 12100180 14028585 16919582
10226A6919582M579861P292512J0033318R724348M989125o17422k171420N57782
$$ 16919582 21499443 28791955 38825273 48549621 53538746 52921324 50749904 51307686
10218E1307686K875942N71232m873056q509320q062539n298449k553768o87837
$$ 51307686 54183628 54754860 49881804 41372484 33309945 28011496 25457728 24769891
10210B4769891N29789J481856K408276L403312M545813N495356O005062O373138
$$ 24769891 25299680 26781536 29189812 32593124 37138937 42634293 48639355 55012493
10202E5012493O351113N250187L702514L253385L924541L635418P33758m200702
$$ 55012493 61363606 66613793 70316307 73569692 77494233 81129651 81863409 77662707
10194G7662707q813432j0924219r851976o589600k757335L72967J890078J598852
$$ 77662707 68849275 57925056 48073080 41483480 38726145 39099112 40989190 42588042
10186D2588042M77643K63340J255659J860597J063824k6805j25696O43894J392084
$$ 42588042 43065685 43329025 44584684 46445281 47509105 47482300 47356604 48000498 49392582
10177D9392582J536197J005383L95710Q3511j48144k1356J173354L121295M559448
$$ 49392582 50928779 51934162 52329872 52413383 52265239 52243883 53417237 56538532 61097980
10168F1097980M330948K681836J488318J331225J599219K249492K760122J709766
$$ 61097980 65428928 68110764 69599082 70930307 72529526 74779018 77539140 79248906
10160G9248906q60586k890095k723692l57364K824315M986168M558913J970403
$$ 79248906 78388320 75498225 72774533 72417169 75241484 80227652 84786565 86756968
10152H6756968q66410k471344l105669l999555n251976n592541m907870m670475
$$ 86756968 85890558 83419214 80313545 76313990 71062014 65469473 60561603 55891128
10144E5891128n042695m872025m123584l533347l192372k830797k348527j716777
$$ 55891128 50848433 45976408 41852824 38319477 35127105 32296308 29947781 28231004
10136B8231004j079408p50774p94697j012923j225665j197279p24609P8504R33561
$$ 28231004 27151596 26400822 25606125 24593202 23367537 22170258 21445649 21524153 22457714
10127B2457714J586525J934215K121309K314812K484696K448276K823124L205925
$$ 22457714 24044239 25978454 28099763 30414575 32899271 35347547 38170671 41376596
10119D1376596K004771m27925j811855j349841n19635k77811q40366k370868m044648
$$ 41376596 43381367 42953442 41141587 39791746 39272111 38994300 38153934 35783066 31738418
10110C1738418m494107l496125j987135p03265K63490J024878J846306L033521
$$ 31738418 27244311 23748186 21761051 21057786 21321276 22346154 24192460 27225981
10102B7225981M452993N873352P059494P372584O926725O534209O457097N858953
$$ 27225981 31678974 37552326 44611820 51984404 58911129 65445338 71902435 77761388
10094G7761388M788903L924913K554155m78625l877936n750880o821209q216913
$$ 77761388 82550291 86475204 89029359 88550734 84672798 78921918 72100709 63883796
10086F3883796r051072q325199o772355n142128l348792j279514O15244J674477
$$ 63883796 54832724 46507525 39735170 34593042 31244250 29964736 30579980 32254457
10078C2254457J850567K142671L302920N278371P195616P909848O797946M664826
$$ 32254457 34105024 36247695 39550615 44828986 52024602 59934450 66732396 71397222
10070G1397222K814031J245632q25505k746639l517485l473340m113120n986398
$$ 71397222 74211253 75456885 74631380 71884741 68367256 64893916 60780796 54794398
10062E4794398p891101q467709p534567n817103m083177k682493j529278n17967
$$ 54794398 46903297 38435588 30901021 25083918 21000741 18318248 16788970 16271003
10054A6271003L49953R77357J243537J051237P23146O39661N47542K92903L86968
$$ 16271003 16620956 17598313 18841850 19893087 20616233 21255894 21803436 22096339 22483307
10045B2483307J004763J392032Q91869m40073k137238l432366l674851l099507
$$ 22483307 23488070 24880102 25771971 25331898 23194660 19762294 16087443 12987936
10037A2987936k407102j912435j459273j032478p54198o46978n97906n09903l95816
$$ 12987936 10580834 8668399 7209126 6176648 5422450 4775472 4177566 3667663 3271847
10028C271847l15977k65866k13829j82554j59586j43197j36637j19614j08376
$$ 3271847 2955870 2690004 2476175 2293621 2134035 1990838 1854201 1734587 1626211
10019A626211q0347o8824n9995m5963l2979k4384P3P932K3705M2517O4331R6001
$$ 1626211 1545864 1477040 1417045 1371082 1338103 1313719 1313792 1321724 1345429 1387946 1452277 1548278
10007A548278J31478J20506M0840r1877j66766j71849j46143j05701p8201p2356
$$ 1548278 1679756 1800262 1841102 1749225 1582459 1410610 1264467 1158766 1080565 1008209
9997A008209o3387m7671m4027l3449j5299r881j634p758N67M383M479j3579l521
$$ 1008209 944822 897151 853124 819675 804376 794495 792861 785103 785670 790053 794532 780953 777432
9984G77432M422Q839K197o70j04j4487p232N000N955K684n757j5350j4078k5282
$$ 777432 781854 790693 792890 792220 792116 777629 770397 775397 781352 784036 778279 762929 748851 723569
9970G23569k2832j5515j5308q442j0672o796j0337r515o670o067o76J858j5280
$$ 723569 700737 685222 669914 661472 650800 644004 633667 624152 617482 611415 610739 612597 597317
9957E97317j5279K922K598l119P624M815j4630q329M956J084J665J924k562j3423
$$ 597317 582038 584960 587558 584439 592063 596878 582248 573919 578875 579959 581624 583548 580986 567563
9943E67563j5023L360k360j2303j1796j1009k919J714j4983j7887j7606k8092
$$ 567563 552540 555900 553540 541237 529441 518432 515513 517227 502244 484357 466751 438659
9931D38659j6784r822j12M475P754Q393N467r40j0337r500o773j916J2791K0821
$$ 438659 421875 412053 411941 416416 424170 432563 438030 437090 426753 417253 410480 408564 421355 442176
9917D42176J3472J1341J6009J2532Q582O458j088Q270J8678J7288M474k623j4123
$$ 442176 455648 466989 482998 495530 504112 510570 509482 517752 536430 553718 558192 555569 541446
9904E41446j7427j6754k3327j5747k528J500j3099j0708J3776K8806L5631L1877
$$ 541446 524019 507265 483938 468191 465663 467163 454064 443356 457132 485938 521569 553446
9892E53446L3051K1933O733q90m145q221k1811l1358k0881k0032j9546j0204k734
$$ 553446 586497 608430 615163 614273 610128 601907 580096 548738 527857 507825 488279 478075 475341
9879D75341O902o740j3271m049L388m743J5881K1305K0128J3911Q119J5224J2218
$$ 475341 482243 475503 462232 458183 461571 456828 472709 494014 514142 528053 536172 551396 563614
9866E63614Q252O292J012j1847k0263j4555o665j124O802L372M446k234p38K3783
$$ 563614 571866 578158 579170 567323 547060 532505 525840 524716 531518 534890 539336 537102 536364 560147
9852E60147K4927K2707L3237M5050N9392N3207L1761q382l7971n3665m5455l4448
$$ 560147 585074 607781 641018 686068 745460 798667 830428 822046 784075 730410 684955 650507
9840F50507k4146j9854k2890k6837k4016k4621k5657m362Q521r316l171R606J7308
$$ 650507 626361 606507 583617 556780 532764 508143 482486 478124 486645 477329 474158 483764 501072
9827E01072L4633M2417N3251N0624K1562k549r365L486J5784R881k8949m3397
$$ 501072 535705 578122 631373 681997 703559 701010 691645 695131 710915 720796 691847 648450
9815F48450l0852k7696j5059J1456J7695J2080J4970K7223K7925L3086L5661K1373
$$ 648450 617598 589902 574843 586299 603994 616074 631044 658267 686192 719278 754939 776312
9803G76312J1680P410P128J0614J8587J3250J4386j0145j3731k0917l1195j4179
$$ 776312 787992 795402 802530 813144 831731 844981 859367 849222 835491 814574 783379 769200
9791G69200k1400j7653j1553j5295j5348o903O122J5737K2966M1316M6901M7477
$$ 769200 747800 730147 718594 703299 687951 681048 687170 702907 725873 767189 814090 861567
9779H61567L7663Q009Q53l607K227J1034J0658r303k5876j7013R619Q411J3180
$$ 861567 899230 907239 908092 904485 906712 917746 928404 919101 893225 876212 885831 894242 907422
9766I07422O873O242P014r871m78J7553J1730K0095K5325J6307l29k3767l4828
$$ 907422 914295 920537 927551 917680 917202 934755 946485 966580 991905 1008212 1007883 984116 949288
9753I49288k1504r792k0300k0282k3246k8937p777J7761P018r798r306n319Q285
$$ 949288 927784 917992 897692 877410 854164 825227 817450 835211 842229 832431 823125 817806 826091
9740H26091J5006K0167J8161O823p905j4097j3164j1781j0939k398K67j5772l6052
$$ 826091 841097 861264 879425 886248 878343 864246 851082 839301 828362 825964 826231 810459 774407
9727G74407l3728j2687o556j2992k4127k9542l4231l0053j7819m842K3R807K5023
$$ 774407 740679 727992 721436 708444 684317 654775 620544 590491 572672 567830 567853 577660 602683
9714F02683J4136K0344J4063O431k821n140Q518J1968M385r106L592n475j5517
$$ 602683 616819 637163 651226 657657 654836 649696 658214 670182 674567 665461 669053 663578 648061
9701F48061j6906j7558p475R354K1592J2966J3633L2533L7418L9817L9098K9137
$$ 648061 631155 613597 606122 615476 637068 650034 663667 696200 733618 773435 812533 841670
9689H41670M798k866R360J1638l062k811K934J079l473m979j0159l2125n9820
$$ 841670 846468 843602 852962 864600 861538 858727 861661 862740 859267 854288 844129 812004 752184
9676G52184n0322l7959k1888j2322M443L428p165m137n387M469K0067L1951N9342
$$ 752184 701862 663903 642015 629693 634136 637564 630399 626262 620875 625344 645411 677362 736704
9663G36704M6936K6208J9880J1276K532k545r23r836l5359m5452n1920m5789n3156
$$ 736704 783640 809848 829728 841004 843536 840991 840068 830232 794873 749421 697501 651712 598556
9650E98556n0204k8833j4296l31K559P605J4603J7157K7623J7072m776k665M47
$$ 598556 548352 519519 505223 504892 507451 515056 529659 546816 574439 591511 586735 584070 584517
9637E84517j437j859P514k08j563k867j2336j7334l9103m8021k1111j2020q246
$$ 584517 583080 581221 588735 588527 586964 584097 571761 554427 515324 467303 446192 434172 425926
9624D25926k671k045p16n438j1890l124R240O777M780L783O239J653J0801J2347
$$ 425926 423255 421210 420494 415056 403166 400042 409282 416059 420839 424622 430861 432514 443315 455662
9610D55662J3616J7230K3215K0788Q486J102l330j9629j2190n875j2045L57Q567
$$ 455662 469278 486508 509723 530511 538997 540099 536769 517140 504950 499075 487030 487387 495954
9597D95954q423j9851q248o053p19r140k710K053Q670J268r67p252m266j851K860
$$ 495954 487531 467680 459432 453379 452660 443520 440810 442863 451533 452801 451834 444582 440316 438465 441325
9582D41325Q502r16j228L089M263J7207J8370P045P322J017m040L111Q0M186q448
$$ 441325 449827 448911 447683 450772 455035 472242 490612 497657 504979 505996 501956 505067 505147 509333 500885
9567E00885j9836j3110p738k727k213q251l992Q42J651L710P040J0612J3891M727
$$ 500885 481049 467939 460201 457474 455261 447010 443018 443860 445511 449221 456261 466873 480764 485491
9553D85491J4411J5529R999J2185R27J3974J7630O762p181k819o856j0981j4096
$$ 485491 499902 515431 525430 537615 538542 552516 570146 576908 569727 566908 560052 549071 534975
9540E34975n823j0755K829J1414J5756J4808K1221J5473J2638J509O304M824r24
$$ 534975 529152 518397 521226 532640 548396 563204 584425 599898 612536 614045 620349 625173 624249
9527F24249R572J5891K373o226o746j402L247J0312R124M337J5222J2783K1069
$$ 624249 633821 649712 652085 645859 639113 637711 640958 651270 660394 664731 679953 692736 713805
9514G13805J7703N932P368J9548J3582k99J2288K9484M2691N8211P6651R1714
$$ 713805 731508 737440 744808 764356 777938 777639 789927 819411 862102 920313 996964 1088678
9502A088678R1668P3163P0868R5108J36228J71962J91041J42176P5703L9617L4821
$$ 1088678 1180346 1253509 1324377 1419485 1555713 1727675 1918716 2060892 2136595 2176212 2211033
9491B211033J3655j1076k9945l4377n210L2881N2799L8135l085n8461q1888o0624
$$ 2211033 2224688 2213612 2183667 2149290 2144080 2176961 2229760 2267895 2264810 2206349 2124461 2063837
9479B063837l7482j3051L026J4260M0426M1942N1197P4930J06507J36585J47946
$$ 2063837 2026355 2013304 2016330 2030590 2071016 2112958 2164155 2239085 2345592 2482177 2630123
9468B630123J47730J69112J89155K03269K03097K09300K27145K73187L42652M43241
$$ 2630123 2777853 2946965 3136120 3339389 3542486 3751786 3978931 4252118 4594770 5038011
9458E038011O50927R04337J153077J226705J043345O38282K77361K65659P10640
$$ 5038011 5688938 6593275 7746352 8973057 10016402 10654684 10932045 11197704 11908344
9449A1908344J512449K349093K762465K362471J102238l66906j134285p50427
$$ 11908344 13420793 15769886 18532351 20894822 21997060 21630154 20495869 19745442
9441A9745442L93075J454682J685406P97536p47431k090601k710006k753218k533631
$$ 19745442 20138517 21593199 23278605 24076141 23328710 21238109 18528103 15774885 13241254
9432A3241254k171063j678381j149983p02775l54404j17227l1027j6570R812R1351
$$ 13241254 11070191 9391810 8241827 7539052 7184648 7067421 7036394 7019824 7029636 7120987
9422G120987K12358L59137N05539O70175P78024Q14068P89737Q34724J040118
$$ 7120987 7333345 7692482 8198021 8868196 9646220 10460288 11250025 12084749 13124867
9413A3124867J425063J852811K033224J813491J314608Q27987O02062Q22686J374866
$$ 13124867 14549930 16402741 18435965 20249456 21564064 22392051 22994113 23816799 25191665
9404B5191665J709526J530644J025152O51544P44451J057306J137708Q54935M69042
$$ 25191665 26901191 28431835 29456987 30108531 30852982 31910288 33047996 33902931 34371973
9395C4371973J77093j64140o35428j065503j250474j206765j127578j165639j206121
$$ 34371973 34549066 34384926 33749498 32683995 31433521 30226756 29099178 27933539 26727418
9386B6727418j172843j152083j069996p92866j94109M66930R99745J389810J772864
$$ 26727418 25554575 24402492 23332496 22539630 22345521 22812451 23812196 25202006 26974870
9377B6974870K233770K792546L264961L145727J982096j37023k317934l511514
$$ 26974870 29208640 32001186 35266147 38411874 40393970 40256947 37939013 34427499
9369C4427499l460063k678483j700340p03590J71521Q42293J297795J534868J622762
$$ 34427499 30967436 28288953 26588613 25885023 26056544 26898837 28196632 29731500 31354262
9360C1354262J720775J890048K030805K044881J990003J885831J755406J431682
$$ 31354262 33075037 34965085 36995890 39040771 41030774 42916605 44672011 46103693
9352D6103693P17288n65721k193944l513820l835851l104147j993653j276121
$$ 46103693 46820981 46255260 44061316 40547496 36711645 33607498 31613845 30337724
9344C0337724j113119r01659l13285L52523P63422R15634R38845J014907J355039
$$ 30337724 29224605 28322946 28009661 28362184 29125606 30041240 30980085 31994992 33350031
9335C3350031J954047K579097K673084J807563M26063m35630m00533j06253P7182
$$ 33350031 35304078 37883175 40556259 42363822 42789885 42354255 41953722 41847469 41924651
9326D1924651L56964Q61453J469475J862366J836769J364454L74815j178286k921316
$$ 41924651 42281615 43143068 44612543 46474909 48311678 49676132 50050947 48872661 45951345
9317D5951345m061924m232540l863594l387776k819543k043392j180504k82932
$$ 45951345 41889421 37656881 33793287 30405511 27585968 25542576 24362072 24079140
9309B4079140N03992R09180R45854Q57363O20301K76099m6118k17630j93589k3780
$$ 24079140 24583132 25492312 26438166 27295529 27915830 28191929 28145811 27928181 27734592 27710812
9299B7710812K10557N25742P71968R44996J054748R01971N53176K77498K50469
$$ 27710812 27921369 28447111 29219079 30164075 31218823 32120794 32673970 32951468 33201937
9290C3201937K91345M96080J062217J943130K649590K561975J354709p60743k917139
$$ 33201937 33493282 33989362 35051579 36994709 39644299 42206274 43560983 42800240 39883101
9281C9883101m143128m027844l012555j871482j087876p85673q49159r56277p32679
$$ 39883101 35739973 31712129 28699574 26828092 25740216 24954543 24105384 23149107 22416428
9272B2416428k10819L26316O93189R22626J202106J677628K193303K187901J312449
$$ 22416428 22205609 22531925 23225114 24147740 25349846 27027474 29220777 31408678 32721127
9263C2721127k45019j739557k573045k525655j837325r24780j69736K33343L37546
$$ 32721127 32476108 30736551 28163506 25637851 23800526 22875746 22706010 22939353 23276899
9254B3276899K42560k7754l90423p36007r75675j164840j378696j516908j369241
$$ 23276899 23519459 23491705 23101282 22365275 21389600 20224760 18846064 17329156 15959915
9245A5959915r76421n11780j27508K40059O96033J121425J270507J129920Q11911
$$ 15959915 14983494 14471714 14344206 14584265 15280298 16401723 17672230 18802150 19614061
9236A9614061L42262k36019p08768j014913j241757j236689r84418p58001p45925
$$ 19614061 19956323 19720304 19011536 17996623 16754866 15518177 14533759 13775758 13029833
9227A3029833q37742r39250r78307r08256p31394n15720l75769l20732k55384
$$ 13029833 12192091 11252841 10274534 9366278 8634884 8119164 7743395 7422663 7167279
9218G167279j79715j86298k23511j79771k9133J79462L22187L38066K54162J55382
$$ 7167279 6987564 6801266 6577755 6397984 6368851 6548313 6870500 7208566 7462728 7618110
9208G618110J39973K37738L98459N87297P90417J099207J516632J955551K156799
$$ 7618110 7758083 7995821 8394280 8981577 9771994 10871201 12387833 14343384 16500183
9199A6500183J876612J094941j9306j088413j820718k127247k100048j836867
$$ 16500183 18376795 19471736 19452430 18364017 16543299 14416052 12316004 10479137
9191A0479137j494163j261463j177345j121521r78529p51778n15562l50253k49694
$$ 10479137 8984974 7723511 6546166 5424645 4446116 3694338 3178776 2828523 2578829
9182B578829j89063j49897r4769n9877q5064j16120j27823j10266n3284j4622
$$ 2578829 2389766 2239869 2145100 2085223 2000159 1884039 1756216 1645950 1592666 1578044
9172A578044l5300p0291p7170p1677p9601o8284p0655p1543p3362n5841m1122
$$ 1578044 1542744 1472453 1395283 1323606 1244005 1175721 1105066 1033523 960161 904320 863198
9161H63198l2949l5901l8363l4357j9648j2244m883J0733L0956M6984O9708P1645
$$ 863198 830249 794348 755985 721628 701980 689736 684853 695586 726542 773526 843234 914879
9149I14879P1679O9694M3505J1242j9080n7872n9913n9720n5979m4658n5316o0753
$$ 914879 986558 1056252 1099757 1110999 1091919 1034047 974134 914414 858435 813777 758461 697708
9137F97708n6398m8549l7456m2333l6508k1459j0452j6486k3313j8688j4656l0103
$$ 697708 641310 592761 555305 512972 476464 455005 444553 428067 404754 386066 371410 341307
9125C41307j9865j2313o333Q81j7179j1427o535j0478o251p458o798o971L357
$$ 341307 321442 309129 302796 303677 286498 275071 268536 258058 251807 244349 237551 230580 233937
9112B33937M006j120j8593j6832M86m540o374j556R483J642j4031k726o600j0159
$$ 233937 237943 236823 218230 201398 201884 197344 190970 189414 198897 200539 186508 183782 177182 167023
9098A67023p59N888m864r185L611q37k309K463O26J3964J0423Q901J437M231J2007
$$ 167023 166264 172152 167288 158103 161714 160877 158568 161031 161657 175621 186044 194945 196382 200613 212620
9083B12620Q681O034L698j1007k787j0551R281P107N483J973k151n532m736p703
$$ 212620 221301 227335 231033 220026 217239 206688 215969 223076 228559 230532 228381 222849 218113 210410
9069B10410o56Q940R50p490O650J0516l159j801l820o035P679K365O071K783n812
$$ 210410 209754 218694 219644 212154 218804 229320 226161 224360 220540 214505 222184 224549 230620 233403 227591
9054B27591j91L648J0786J1495L637O473N243M387l116K413l65j064K760q365
$$ 227591 227400 231048 241834 253329 256966 263439 268682 273069 269953 272366 272001 270937 273697 265332
9040B65332o049K890J5420J3960R795J5711J6601K6590L6030K7882K9102K6247
$$ 265332 259283 262173 277593 291553 301348 317059 333660 360250 396280 424162 453264 479511
9028D79511o76j8427l1179l5501l3523k0390j8218k2642j4945j6196j6598j288
$$ 479511 478835 460408 429229 393728 360205 339815 321597 298955 284010 267814 251216 249928
9016B49928N064k14K211J4604N55K198j6203j1524L001o239j523n980P489J0872
$$ 249928 254992 254778 256989 271593 272148 274346 258143 246619 249620 243381 241858 235878 243367 254239
9002B54239O072L471K370k69L133L695O873P936J8339J4066J5058K6265L1165
$$ 254239 260311 263782 266152 265883 269016 272711 279584 287520 305859 319925 334983 361248 392413
8989C92413J8314J0217p759k0241j7817j2173j6622j373o197M126K109J4317K0470
$$ 392413 410727 420944 413185 392944 375127 362954 346332 344959 338762 342888 344997 359314 379784
8976C79784Q683L369p629j6074k4963j3918p484n558n299o910O185J9489J8793
$$ 379784 388467 391836 384207 368133 343170 329252 321768 316210 310911 304001 310186 329675 348468
8963C48468J6049J4867K0733q010k1414j1052k1946k1979r118j0095q81L684q659
$$ 348468 364517 379384 400117 392107 370693 359641 337695 315716 306598 296503 295622 299306 290647
8950B90647m62j287J0657K0696J8549J9558L2690M9125L2911J5431J2178J4410
$$ 290647 290185 288898 299555 320251 338800 358358 391048 440173 473084 488515 500693 515103
8938E15103J7156m720l3413n3438n1930l7814k8133j9653j1346Q818R528j132
$$ 515103 532259 527539 494126 440688 388758 350944 322811 303158 291812 300630 310158 309026
8926C09026Q805K1058J4748K1217J5217m392o631q153j5069j4011q125n085L279
$$ 309026 317831 338889 353637 374854 390071 385679 379048 370895 355826 341815 333690 328605 331884
8913C31884N382J2064Q252N675J0863K2715Q388J907K426j6531j0373l785j6765
$$ 331884 337266 349330 357582 363257 374120 396835 405223 407130 409556 393025 382652 378867 362102
8900C62102l2045k4911j8115q620j335K723R664K004j08J6709J4483K1606R044
$$ 362102 330057 305146 287031 278411 277076 279799 289463 291467 291359 308068 322551 344157 353201
8887C53201l159l248L430j4333r846M551K221k59R464K5323K3283J5223O623j38
$$ 353201 350042 346794 350224 335891 326045 330596 332817 332558 342022 367345 390628 405851 412474 412336
8873D12336L818J308j1809j5723k7662k3067k0368k2372j3274j1764p062j96j6484
$$ 412336 416154 417462 405653 389930 362268 339201 318833 296461 283187 271423 264361 264165 247681
8860B47681j2113j7145O558J7936K0143J9018J5865K9803J9978J6224L128o754
$$ 247681 235568 218423 224981 242917 263060 282078 297943 327746 347724 363948 367076 360322
8848C60322k3400l3294k0197j3198r729j2383p882m516O789J1850l836j0861j1867
$$ 360322 336922 303628 283431 270233 260504 248121 240239 235723 242512 254362 250526 239665 227798
8835B27798k0782k1773k6072j0631m929P732J0016R943J9691J3741J5420J2247
$$ 227798 207016 185243 159171 148540 143611 151343 161359 171302 190993 204734 220154 232401
8823B32401J0852J678k671m967j2726j4362k3791k2209k1278j1984o871p762k690
$$ 232401 243253 244931 242260 237293 224567 210205 186414 164205 142927 130943 124072 116310 113620
8810A13620P233K205j148N9J51J3692J8790K8448M4925P7415R1795N4015j6599
$$ 113620 120853 123058 121910 121969 122120 135812 154602 183050 227975 305390 397185 451200 434601
8797D34601p4631r0560n9576l1606k0369j3213L253R311Q070J1792K6568K8492
$$ 434601 359970 269410 209834 178228 157859 144646 147899 157210 165280 177072 203640 232132
8785B32132K2493M522j2436j9875j5987j1272j2234J568P948n883j6611j2008
$$ 232132 254625 259147 246711 226836 210849 199577 187343 188911 196859 190976 174365 162357
8773A62357n918p969N596K0026K539k330j2645j5891j7554k668K351J684J1903
$$ 162357 156439 148470 154066 174092 176631 174301 161656 145765 128211 125543 127894 129578 141481
8760A41481J8805L4894M7585N0785K1210j5824l9208m0466m5495j8826j5176r267
$$ 141481 160286 195180 242765 293550 314760 298936 259728 219262 173767 154941 139765 130498
8748A30498j9860k14O171K949j229J708K261l728M295J233J0372J3280m209j9735
$$ 130498 110638 110424 116595 119544 118315 120023 122284 118556 122851 124084 134456 147736 143527 123792
8734A23792k7422k0246j3740K405K033n988q092o018O626J486k162N373O318M343
$$ 123792 96370 76124 62384 64789 66822 60834 52742 46724 53350 54836 52674 58047 64365 68708
8720F8708R349Q987J4640L1903M8760M3604K5066j1580n0245l8752l4912k3252
$$ 68708 78057 87044 101684 133587 182347 225951 251017 239437 189192 150440 115528 92276
8708I2276j0958m912r57P618P729J5249j056P09R889J0929J6910N942l929J0141
$$ 92276 81318 76406 75449 83067 90796 106045 104989 105698 115587 126516 143426 149368 145439 155580
8694A55580J3111J496K133r503k6507j8318j7979j665m022j8610r790J280p796
$$ 155580 168691 170187 172320 162817 136310 117992 100013 98348 94326 75716 65926 67206 59410
8681E9410m556K181J0587R515Q434K127m397Q991J6318J835p04O674j4617j0801
$$ 59410 54854 57035 67622 77137 85571 87698 83301 92292 108610 110445 109741 116415 101798 90997
8667I0997j1082n469l317J070n462j3515j8677j2371P493J1674J946O952j9o289
$$ 90997 79915 74446 71129 72199 66737 53222 34545 22174 29667 41341 43287 50239 50220 43931
8653D3931o904j221l640J0364L159j162J216j304k40n945l960k082K943J711n111
$$ 43931 37027 35806 32166 42530 45689 44527 45743 44439 44199 38254 34294 32212 35155 36866 31755
8638C1755M218J98M63K394M712q069J963N813K382J1173L202O210J245l542N66
$$ 31755 35973 36171 36634 39028 43740 35671 37634 43447 45829 57002 60204 66414 67659 64117 64683
8623F4683p03K63J1283Q128l470j5605j284R31j03k253J00J3016R804J031R691
$$ 64683 63980 64243 75526 83654 80184 64579 63295 64226 64123 61870 61970 74986 84790 85821 95512
8608I5512J0264J1438J5191J0134n318m989k224P559J2278J116p452q594j9611
$$ 95512 105776 117214 132405 142539 137221 132232 130008 137567 149845 150961 143509 134915 115304
8595A15304j6963k320M894J933K732O932M297j2932j3919j1894j411R670j533
$$ 115304 98341 96021 100915 102848 105580 112512 116809 103877 89958 78064 76653 86323 84790
8582H4790n81L608N710J0202J6477R779k614r461o798K616R695N61q136n657n592
$$ 84790 84209 87817 93527 103729 120206 129985 127371 117910 111112 113728 123423 123984 115848 110191 104599
8567A04599m078l09L843K505N203P114J0240M00L13M704k276J1220J3691P14l178
$$ 104599 100521 100212 104055 106560 111763 118877 129117 129517 129830 134534 132258 143478 157169 157883 154705
8552A54705O505J8804J1450J2984K4278K2030K6743L5406M0235L5141K3290J9349
$$ 154705 161210 180014 191464 204448 228726 250756 277499 312905 353140 388281 411571 430920
8540D30920J8512K4328M4779N7739K8904K3244K8443N2106P6780M4573K6455M3356
$$ 430920 449432 473760 518539 576278 605182 628426 656869 708975 785755 830328 856783 900139
8528I00139P1787J25951J82419K58010L38339K28048m7650k35186k04193j56245
$$ 900139 971926 1097877 1280296 1538306 1876645 2104693 2057043 1821857 1617664 1461419
8518A461419k23851k71124k24058j47421r7584p8271n5343l8478j9621k8140l1541
$$ 1461419 1237568 966444 742386 594965 497381 419110 363767 325289 305668 277528 245987
8507B45987j6555j9012n103N681N817j854O528P609j4620k9987k2065j9717j2603
$$ 245987 229432 210420 205317 210998 216815 214961 221489 229098 214478 184491 162426 142709 130106
8494A30106l738o56J1136m417j3562o950j2661K97l761k628j0214j975k459q223
$$ 130106 126368 125712 136848 132431 118869 111919 99258 99555 95794 93166 82952 80977 78518 70295
8480G0295J704R85m901j27N858Q060Q476J568k509R792J391P481M473L038P245
$$ 70295 71999 72984 68083 67956 73814 81874 90350 91918 89409 99201 100592 108073 112546 115584 122829
8465A22829p727J254K82j4359n441q550K354J4438q411o433J0043K1113K9025
$$ 122829 115102 116356 116638 102279 96838 88288 90642 105080 96669 90236 100279 121392 150417
8452A50417K3636N289k1265k9738l7280j2356J793o284j0117j2706q101p362j0754
$$ 150417 174053 179342 158077 128339 91059 78703 80496 74212 64095 51389 43288 35926 25172
8439B5172n733Q228J8959L41p657j978N748k024Q619L705j848P443q630k520m52
$$ 25172 19439 27667 46626 46967 39310 37332 43080 41056 49675 53380 51532 58975 50345 47825 47373
8424D7373J7242K2206j938N322p005j8691k3081o002l568p839K447J4182L87K126
$$ 47373 64615 86821 84883 90205 83200 64509 41428 35426 31858 24019 26466 40648 41035 43161
8410D3161l40J9506J4127k649k128N658L308J728n743n053m693p323m42j1902
$$ 43161 42821 62327 76454 73805 71677 77335 80643 82371 76628 71575 66882 59559 59117 47215
8396D7215n187m375L974q471m070L658n395p5J501q010R20m331l313m48J1203
$$ 47215 42028 37653 41627 33156 29086 32744 27349 27274 28775 20765 21685 17354 14041 13593 24796
8381B4796L478R23p777L420O598L599R133P654q705j1751p7p530k323J3487O646
$$ 24796 28274 29197 21420 24840 31438 35037 44170 51824 43119 31368 31291 23761 21438 34925 41571
8366D1571q576j0595p04L690J443P334J1661K733j5377j7730j393p252j076k255
$$ 41571 32995 22400 21696 25386 26829 34163 45824 48557 33180 15450 14057 6805 5729 3474
8352C474P836M413M943p352j955R626Q417q174m799M432j800p579m777l621L630
$$ 3474 11310 15723 20666 13314 11359 20985 29402 21228 16429 20861 19061 11482 6705 3084 6714
8337F714P924j054Q313R227O035k839l702p046p548j2136j409M574o146Q030Q863
$$ 6714 14638 13584 21897 31124 37159 34320 30618 23572 16024 3888 2479 7053 907 8937 17800
8322A7800L445q499q75p320N243J1405j0322l687O319N134N582N134P35j9498
$$ 17800 21245 12746 11871 4551 9794 21199 10877 7190 13509 18643 24225 29359 30094 10596
8308A0596n761O068M157K405K325j672l495J860j0400L932J0972j0888q658L077
$$ 10596 4835 10903 15060 17465 19790 18118 14623 16483 6083 10015 20987 10099 1441 4518
8294D518N038o082j53k224J298L28J0200L598J41j0087r558j63K454o520P216
$$ 4518 9556 3474 3321 1097 2395 2723 12923 16521 16662 6575 -2983 -3146 -692 -7212 4
8279DK579R43L246K192n873q763j734o092L120J5411J0087m825l023K82n016o502
$$ 4 2583 3526 6772 8964 3091 -5672 -7406 -13498 -10378 5033 15120 10295 7272 7554 2538 -3964
8263c964j977k30j975O927N516j1458O722N885k836m1J0757n924q518l377L816
$$ -3964 -5941 -6171 -8146 -1219 4297 -7161 -439 5446 2610 2569 13326 7402 -1116 -4493 -677
8248f77l517k040L395R82k166k672P345j422m128m007k565P043J4173o92j4883
$$ -677 -4194 -6234 -2839 -1857 -4023 -6695 650 -772 -4900 -8907 -11472 -4429 9744 9052 -5831
8233e831m631L20L182j324M1J661k012n42p117l530P735J5938J206M022n503n770
$$ -5831 -10462 -10142 -6960 -8284 -8243 -6582 -8594 -9136 -16253 -19783 -12048 3890 5096 9118 3615 -2155
8217b155n101l5m531j901k690l405Q649N619m835J826M505k43P90l824J661O11
$$ -2155 -7256 -7291 -11822 -13723 -16413 -19818 -11169 -5550 -10385 -8559 -4054 -4297 -3507 -7331 -5670 -5059
8201e059j378M66M606l257K157j078n414K893L90j2190J778K354M70J80L693N601
$$ -5059 -6437 -5971 -1365 -4622 -2465 -3543 -8957 -6064 -5674 -17864 -16086 -13732 -13262 -13082 -9389 -3788
8185c788M326J690l454L575L553l607q36n258l166L200l995M138M843l469K883
$$ -3788 538 2228 -1226 2349 5902 2295 1459 -3799 -6965 -3765 -7760 -3622 1221 -2248 635
8170F35M18R011O301K386j033m855p874o583j502m996Q98K879m537J195K310L550
$$ 635 1053 10064 16365 18751 17718 12863 4989 -1594 -3096 -8092 -7194 -4315 -8852 -7657 -5347 -1797
8154a797p38r346k023P073Q661o333r409k521m184q018P465P831J1622N264l014
$$ -1797 -2535 -11881 -13904 -6831 1830 -4503 -13912 -16433 -20617 -28635 -21170 -13339 -1717 3547 533
8139E33J281p176k794l109k792N773J3854l080l191O187n435j3894l871N040L270
$$ 533 1814 -5362 -8156 -11265 -14057 -8284 5570 2490 -701 5486 51 -13843 -17714 -12674 -9404
8124i404P4M931K235j0418j4540N706N672O483L576q267p823K358Q413J3221L602
$$ -9404 -9330 -4399 -2164 -12582 -27122 -21416 -15744 -9261 -5685 -13952 -21775 -19417 -11004 2217 5819
8109E819q990p585r587j3761P51J1593L413P982J4888J354j5438j558P275q25
$$ 5819 -3171 -10756 -20343 -34104 -33353 -21760 -18347 -10365 4523 5877 -9561 -11119 -3844 -4669
8095d669o986J4147N695M535q271k001M600p386r46K964J3302K342p913l085J4414
$$ -4669 -11655 2492 8187 12722 4451 2450 7050 -336 -1282 1682 14984 17326 9413 6328 20742
8080B0742M132n626j0059m394l301j611n309j06l791l350N760R619J7179P868
$$ 20742 24874 19248 9189 4795 1494 -117 -5426 -5532 -9323 -12673 -6913 2706 19885 27753
8066B7753l778j1602k033P610N730q047o730L693n095l491P836R60K0683J2483
$$ 27753 23975 12373 10340 17950 23680 15633 8903 12596 7501 4010 11846 12806 33489 45972
8052D5972J912j067j1065q287j3888o995J519L61Q394O663J3499q6m586m160J480
$$ 45972 47884 46817 35752 27465 13577 6582 8101 8462 16856 23519 37018 36932 32346 28186 29666
8037B9666R593J0640K4786L3600J7080m933j3750j1033k3022p964J989l8O408
$$ 29666 39259 49899 74685 108285 125365 120432 106682 95649 72627 64663 66652 66614 73022
8024G3022q41j088O762N253N423P500j363l964J4998K7338K4763J3832m954j8074
$$ 73022 72181 71093 77855 83108 88531 96031 94668 90704 105702 133040 157803 171635 166681 148607
8010A48607k7447l0753k0288j6536q513l193k08l094Q557J4824J4587k563j581
$$ 148607 121160 90407 70119 53583 45070 41877 41669 38575 47132 61956 76543 73980 72399
7997G2399k342j175n082o138J3810K6292L3080K5187K1001K669j4825k4861j6000
$$ 72399 70057 68882 63800 57662 71472 97764 130844 156031 177032 179701 164876 140015 124015
7984A24015j3187j3107q406N667R161Q487N066p079M440J3009P637K1407K8760
$$ 124015 110828 97721 89315 94982 104143 112630 117696 110617 115057 128066 135703 157110 185870
7971A85870K2501R350k7557k6212k1405j5416j2259L676l634o12j318J1495J6338
$$ 185870 208371 217721 190164 163952 142547 127131 114872 118548 114914 114302 112984 124479 140817
7958A40817L995O322k167p764N586M687j2257j2705j4433r097M696J9903M571
$$ 140817 144812 151134 148967 141203 146789 151476 139219 126514 112081 102984 107680 127583 132154
7945A32154N69L488J0685K1934j166J952J5462J0376n93q923J0721R538R543J0114
$$ 132154 132723 136211 146896 168830 167664 169616 185078 195454 194861 185938 196659 206197 215740 225854
7931B25854J2226J1104K0829J8864J0629L865p920j1635j8173j3757j6550m077
$$ 225854 238080 249184 270013 288877 299506 303371 295451 283816 265643 251886 235336 231259
7919B31259J527j349r666j3322j3789k2400j364J9514J5694m50j122K0123J5710
$$ 231259 232786 231437 221771 208449 194660 172260 170896 190410 206104 205654 204532 224655 240365
7906B40365J4253J3606P158J2642J2343P717m157r296J4179J0802j1148k731J984
$$ 240365 254618 268224 275382 288024 300367 308084 303927 294631 308810 319612 308464 305733 307717
7893C07717k1534j6997j9188j4552p085M13M343L460N842J4903j44n32Q294j07
$$ 307717 286183 269186 249998 235446 228361 228774 233117 236577 242419 257322 257178 256646 264940 264833
7879B64833j0143q599j2736o820j1921j1075j8731k1384j6446l800o100j3972
$$ 264833 254690 246091 233355 226535 214614 203539 184808 163424 146978 143178 137078 123106
7867A23106j1511n48M108O39K530J3720M361j1395P087J551R90J49K235k109k14
$$ 123106 111595 111047 115155 115794 118324 132044 136405 125010 132097 133648 134638 134787 137022 134913 134699
7852A34699m39n770n386L427L600P634N267r678j2288p44j0385p755K393N434
$$ 134699 134260 128490 123104 126531 130131 137765 143032 133354 121066 120322 109937 102182 104575 110009
7838A10009O822R085Q410j640j1756n570j4846j0603q673K152p15l216o020N758
$$ 110009 116831 125916 134326 132686 120930 115360 100514 89911 81238 83390 82675 79459 73439 79197
7824G9197k307o544R69m393o194l318N93P267O552P585K386P735J4045R357n840
$$ 79197 76890 70346 71315 66922 60728 57410 58003 65270 71822 79407 81793 89528 103573 112930 107090
7809A07090j9789k8714j6102K689m178M372J2456R799n294M253j0570r298L12
$$ 107090 87301 58587 42485 45174 40996 45368 57824 67623 62329 66582 56012 46714 47026
7796D7026M754j390l906r066j2141L256K739N347n02N15O6J836l539k732N205
$$ 47026 51780 50390 46484 37418 25277 28533 31272 36619 36117 36632 36698 38534 34995 32263 37468
7781C7468P049M193p629n057L396r419o622l108J0198j903k736O831M627p279
$$ 37468 44517 48710 41081 36024 39420 30001 23379 20271 30469 28566 25830 32661 37288 30009
7767C0009o60Q700n099j1474j949R497L018o73m43Mj32l928j732L288p777Q71
$$ 30009 29349 38049 32950 21476 19527 29024 32042 31369 30926 30930 30798 26870 25138 28426 20649 21520
7751B1520R87m738n750q414n414j569q12l444m463L739L125l964j924j145R403
$$ 21520 22507 17769 12019 3605 -1809 -3378 -4190 -7634 -12097 -8358 -5233 -9197 -11121 -12266 -2863
7736b863R483L22J4057N412J775o969L799p347j334P727J493j2788j1145K752
$$ -2863 6620 6942 20999 26411 28186 21217 25016 17669 16335 24062 25555 12767 1622 4374
7722D374p965j1464P757J3962o426Q38J583m764l017K331M776N65j1072R85J159
$$ 4374 -3591 -15055 -7298 6664 238 1076 2659 -2105 -5122 -2791 1985 2550 -8522 -7537 -6378
7707f378o35O298k48m512l094N66L227J889Q53o49K355p190J449J2711N223o239
$$ -6378 -7013 -715 -963 -5475 -8569 -8003 -4776 -2887 -2034 -2683 -328 -7518 -6069 6642 11865 5626
7691E626r835L354k31j086M293K286n648o191n366O238R219l781q583l029N700
$$ 5626 -4209 -855 -1086 -2172 2121 4407 -1241 -7432 -12798 -6560 2659 -1122 -9705 -12734 -7034
7676g034m638j0776k98K084Q749k806k301P98k216L302N364p5q000J036O550j784
$$ -7034 -11672 -22448 -22746 -20662 -11913 -14719 -17020 -16222 -18438 -15136 -9772 -9847 -17847 -16811 -10261 -12045
7660a2045p882p327N012N102L341n00P41q188o889J15P13R158J3588j41o757j3191
$$ -12045 -19927 -27254 -22242 -17140 -13799 -14299 -13558 -21746 -28635 -28520 -27807 -18649 -5061 -5202 -11959 -25150
7644b5150j159J0464L598l001n965m038j1148L792J4548M322q327j0853k244J577
$$ -25150 -26309 -15845 -12247 -15248 -21213 -25251 -36399 -32607 -18059 -13737 -22064 -32917 -35161 -33584
7630c3584N893l249k575N508J2632K795L895K924q467k229O79P031K46o690n338
$$ -33584 -27691 -30940 -33515 -28007 -15375 -12580 -8685 -5761 -14228 -16457 -15778 -8747 -8501 -15191 -20529
7615b0529o700P428l594L540N70r156Q947R545r106N017R956K767j7045l867Q412
$$ -20529 -27229 -19801 -23395 -19855 -19285 -28441 -19494 -9949 -19055 -14038 -4082 -1315 -18360 -22227 -13815
7600a3815k348j756K348L755M44r15m613j368p23l825o56k377p841o0j227J6605
$$ -13815 -16163 -17919 -15571 -11816 -11372 -12287 -16900 -18268 -18991 -22816 -23472 -25849 -33690 -33750 -34977 -18372
7584a8372K014n492m652n604J816K509k357N154O580L391L135n686j0802N117
$$ -18372 -16358 -21850 -26502 -32106 -30290 -27781 -30138 -24984 -18404 -15013 -11878 -17564 -28366 -23249
7570b3249L221R33J001k443R207P949O456n717j646p182M184p820r524j749l98
$$ -23249 -20028 -19095 -18094 -20537 -11330 -3381 3075 -2642 -4288 -11470 -7286 -15106 -24630 -26379 -26777
7555b6777o1N422J1525q959l666L172K448nl381J959J0113O701l627p109n078
$$ -26777 -26838 -21416 -9891 -18850 -22516 -19344 -16896 -16901 -20282 -18323 -8210 -1509 -5136 -12245 -17323
7540a7323m195k412K511P173K199p134k096j408K71l055K253m082K809N83k294
$$ -17323 -21518 -23930 -21419 -14246 -12047 -19181 -21277 -22685 -22414 -25469 -23216 -27298 -24489 -23906 -26200
7525b6200K769L800P69n327j120n372p228J1059R210K671J444n139R90p171n699
$$ -26200 -23431 -19631 -18862 -24189 -25309 -30681 -37909 -26850 -17640 -14969 -13525 -18664 -17674 -24845 -30544
7510c0544q6J0335L988K860O405k113q858L012M625K543j0369J357M654o176M687
$$ -30544 -30630 -20295 -16307 -13447 -7042 -9155 -18013 -15001 -10376 -7833 -18202 -16845 -12191 -18367 -13680
7495a3680J683o81K704J482m518p578O659O125j5778J037Q036M25n695L607O288
$$ -13680 -11997 -12678 -9974 -8492 -13010 -20588 -13929 -7804 -23582 -22545 -14509 -14084 -19779 -16172 -9884
7480i884K308r671L406K920k14N921l952n120l5P72Q515K711j6308j6056J324
$$ -9884 -7576 -17247 -13841 -10921 -11135 -5214 -9166 -14286 -14321 -13549 -5034 -2323 -18631 -34687 -33363
7465c3363P358O146l825j1474J1007Q719M720L076j1134J592k431J6L392N440
$$ -33363 -26005 -19859 -23684 -35158 -24151 -15432 -10712 -7636 -18770 -17178 -19609 -19593 -16201 -10761
7451a0761J002n32k752L894M743L06N689J0039q185m150o582r839P307O311m293
$$ -10761 -9759 -10291 -13043 -9149 -4406 -4100 1589 11628 3443 -707 -7289 -17128 -9821 -3510 -7803
7436g803m419J932P039r63J924r340j0554N946R518j0568o116N608O873o082n052
$$ -7803 -12222 -10290 -3251 -4214 -2290 -11630 -22184 -16238 -6720 -17288 -23404 -17796 -10923 -17005 -22057
7421b2057m696J256R725N987o534J32L26l274M99L022o196K750J077J128m859
$$ -22057 -26753 -25497 -15772 -9785 -16319 -16187 -15861 -19135 -18636 -15614 -21810 -19060 -17983 -16855 -21714
7406b1714N156J546M521j507R258L161J225K794o888k0148l398O872J0085J718
$$ -21714 -16558 -15012 -10491 -11998 -2740 421 1646 4440 -2448 -22596 -25994 -19122 -9037 -7319
7392g319R594k07j3576q35M777L716Q019O96Q24k55o415p973j828j410p174k20
$$ -7319 2275 2068 -11508 -12343 -7566 -3850 4169 4865 5689 5434 -981 -8954 -10782 -12192 -19366 -19586
7376a9586P330R27O3N639K982M327k913j0031m623K355m782q164k866R385O986
$$ -19586 -12256 -11329 -11266 -5627 -2645 1682 -1231 -11262 -15885 -13530 -18312 -26476 -29342 -19957 -12971
7361a2971P316N603L10j0095q862j077L633k278n949P416M12l784R682q08N8k666
$$ -12971 -5655 -52 258 -9837 -18699 -19776 -16143 -18421 -24370 -16954 -16542 -20326 -10644 -11452 -11394 -14060
7345a4060N894L915q76N095l008R70m424q143j0382J555Q01J367q147p907K298
$$ -14060 -8166 -4251 -5127 -32 -3040 -2070 -6494 -14637 -25019 -23464 -22663 -21296 -29443 -37350 -35052
7330c5052N644J2180j398L443J1292O166j0276Q93K866l350n978P55q19M294J383
$$ -35052 -29408 -17228 -18626 -15183 -3891 2275 -8001 -7108 -4242 -7592 -13570 -12815 -13634 -9340 -7957
7315g957N143n086N267L623n49n801J812L35r17j0345j420K011n774l198Q474
$$ -7957 -2814 -7900 -2633 990 441 -5360 -3548 -3213 -4130 -14475 -15895 -13884 -19658 -22856 -14382
7300a4382m054j1874k785Q482p930k295q78R970O364P66k899j0978M383k897m896
$$ -14382 -18436 -30310 -33095 -24613 -32543 -34838 -35716 -25746 -19382 -18616 -21515 -32493 -28110 -31007 -35903
7285c5903m03r85Q341L802P053N016n162r743k189J1524r900l791n467J6234J0190
$$ -35903 -36306 -37291 -28950 -25148 -18095 -13079 -18241 -27984 -30173 -18649 -28549 -32340 -37807 -21573 -11383
7270a1383o279q999j983J802N245Q869O227Q017l884k193p645o117N962o458p712
$$ -11383 -17662 -26661 -28644 -26842 -21597 -12728 -6501 1516 -2368 -4561 -12206 -18323 -12361 -18819 -26531
7255b6531k599j04j3879Q224J8724M062M478j1437m395P223N824L438L55j2048
$$ -26531 -29130 -29234 -43113 -34889 -16165 -12103 -7625 -19062 -23457 -16234 -10410 -6972 -6617 -18665
7241a8665j0797j838R198J0549J108p843N44l897O701O0q165j1867q094M195P553
$$ -18665 -29462 -31300 -22102 -11553 -10445 -18288 -17744 -21641 -14940 -14880 -23045 -34912 -43006 -38811 -31258
7226c1258R075J1110j3j4880p116Q501J468J5M792O472J2966l337k607k731m379
$$ -31258 -22183 -11073 -11086 -25966 -33082 -24581 -23113 -23098 -18306 -11834 1132 -2205 -4812 -7543 -11922
7211a1922J05j1819p000m617M070J5858O069p225l83J513J920k851j2033l193
$$ -11922 -11817 -23636 -30636 -35253 -31183 -15325 -9256 -16481 -16864 -15351 -13431 -16282 -28315 -31508
7197c1508Q717j3049m718Q77L467L085N002J0770K529Q06J0507L920j4062r186
$$ -31508 -22791 -35840 -40558 -39681 -36214 -33129 -28127 -17357 -14828 -14022 -3515 405 -13657 -22843
7183b2843J347N088P032k207j858P214n388K542J131q070j1686p955k371K270
$$ -22843 -21496 -16408 -9376 -11583 -13441 -6227 -11615 -9073 -7942 -16012 -27698 -35653 -38024 -35754
7169c5754J037N766J082K935M872q123p520Q498L864M511N489K964N263q113j320
$$ -35754 -34717 -28951 -27869 -24934 -20062 -28185 -35705 -27207 -23343 -18832 -13343 -10379 -5116 -13229 -14549
7154a4549J1727M780n201j4990m507k520k557j214P027l678M251N129J778J528
$$ -14549 -2822 1958 -3243 -18233 -22740 -25260 -27817 -29031 -22004 -25682 -21431 -16302 -14524 -12996
7140a2996l568k569r79M122J601k40N18j1939j5328M249Q360R095P571k596q975
$$ -12996 -16564 -19133 -20112 -15990 -14389 -14629 -14111 -26050 -41378 -37129 -28769 -19674 -12103 -14699 -23674
7125b3674o859p00J8339q3l322P838P080j649n204j160o761l16N56N048j00n78
$$ -23674 -30533 -31233 -12894 -12977 -16299 -8461 -1381 -3030 -8234 -9394 -16155 -16471 -15915 -10867 -10967 -11545
7109a1545M619K165K896m142q061r766q439m659j86l501M516J3410L507q28N38
$$ -11545 -6926 -4761 -1865 -6007 -14068 -23834 -32273 -36932 -37118 -40619 -36103 -22693 -19186 -20014 -19476
7094a9476K557l856J218j545R015J616o355j1804k724M849J2834j748n933O718
$$ -19476 -16919 -20775 -19557 -21102 -12087 -10471 -16826 -28630 -31354 -26505 -13671 -15419 -21352 -14634
7080a4634N073l55j042Q983J872o400q321r307P009J0179o939k940n654k194O164
$$ -14634 -9561 -9916 -10958 -1975 -103 -6503 -14824 -24131 -17122 -6943 -13882 -16822 -22476 -24670 -18506
7065a8506J4434L193k364O25k183k946r280n486Q230N320m737p976O01q62r47
$$ -18506 -4072 -879 -3243 -2618 -4801 -7747 -17027 -22513 -14283 -8963 -13700 -21676 -21075 -21937 -22884
7050b2884J828J3023Q82o166o623m254O743N80k690p364L807J2752j641k004M1
$$ -22884 -21056 -8033 -7151 -13317 -19940 -24194 -17451 -16871 -19561 -26925 -23118 -10366 -12007 -14011 -13970
7035a3970N379l468K229n675l752l677L713l28j908q020N909J1440m458m742j949
$$ -13970 -8591 -12059 -9830 -15505 -19257 -22934 -19221 -19549 -21457 -29477 -23568 -12128 -16586 -21328 -23277
7020b3277r447m325N739j741M287O468j701n729Q897N256j1889L40L921o92q765
$$ -23277 -32724 -37049 -31310 -33051 -28764 -22296 -23997 -29726 -20829 -15573 -27462 -27122 -23201 -23893 -32658
7005c2658K830J2510J350L249J127q132j388Q582N097n24o687k524p462N847o666
$$ -32658 -29828 -17318 -15968 -12719 -11592 -19724 -21112 -12530 -7433 -7957 -14644 -17168 -24630 -18783 -25449
6990b5449l428M838L772M190L925P319n822o239m15q373l893L037P581K565k874
$$ -25449 -28877 -24039 -20267 -16077 -12152 -4833 -10655 -16894 -17309 -25682 -29575 -26538 -18957 -16392 -19266
6975a9266K34o52N317M758p859j444Q426P886m124k719j3504j1157j367P436k511
$$ -19266 -19032 -19684 -14367 -9609 -17468 -18912 -10486 -2600 -6724 -9443 -22947 -34104 -35471 -28035 -30546
6960c0546L484R761P638L321k696q954q055q688j106R388R411N50k437L090J575
$$ -30546 -27062 -17301 -9663 -6342 -9038 -17992 -26047 -34735 -35841 -26453 -17042 -16492 -18929 -15839 -14264
6945a4264N38n171m723N825N301k935o664N381O720J803j3864k566P532L243l423
$$ -14264 -13726 -18897 -23620 -17795 -12494 -15429 -22093 -16712 -9992 -8189 -22053 -24619 -17087 -13844 -17267
6930a7267j438o083M836j0328l356O311L430o00M820M927L963m47kO071k938j0244
$$ -17267 -18705 -24788 -19952 -30280 -33636 -27325 -23895 -24495 -19675 -14748 -10785 -11232 -11234 -5163 -8101 -18345
6914a8345r634K826R519O656R44l779J779K168j0050q034j0766Q06J8195J1911
$$ -18345 -27979 -25153 -15634 -8978 -8034 -11813 -10034 -7866 -17916 -25950 -36716 -35910 -17715 -5804
6900e804r608l15P489m593M024k0o089m862J791M60J839n516j0972L155P979M977
$$ -5804 -15412 -15727 -8238 -12831 -8807 -8827 -14916 -19778 -17987 -17527 -15688 -21204 -32176 -29021 -21042 -16065
6884a6065J576J947j1493N579R972O218L993n601n045k90j162m805o385J1917
$$ -16065 -14489 -12542 -24035 -18456 -8484 -2266 1727 -3874 -8919 -9209 -10371 -15176 -21561 -9644
6870i644m675p734M216L344j015R085k272j1514j432Q549J4938R077n242j5591
$$ -9644 -14319 -22053 -17837 -14493 -15508 -6423 -8695 -20209 -21641 -13092 1846 10923 5681 -9910
6856i910p272K29P255n892k007J2296P230o384j1096o088L896L62p111O896n428
$$ -9910 -17182 -16953 -9698 -15590 -17597 -5301 1929 -4455 -15551 -21639 -17743 -17381 -24492 -17596 -23024
6841b3024M196q105m249l274k382P534M879Q371K326N634P271k086N08M18K872
$$ -23024 -18828 -26933 -31182 -34456 -36838 -29304 -24425 -16054 -13728 -8094 -823 -2909 -2401 -1983 889
6826H89q528r286k180L75l23L774j094P07O261L875L20K510J349l831o346k317
$$ 889 -7639 -16925 -19105 -18730 -19053 -15279 -16373 -15666 -9405 -5530 -5210 -2700 -1351 -5182 -11528 -13845
6810a3845J093l768k460m54k685Q23K242M241Q541J0976o249j956K908o512r837
$$ -13845 -12752 -16520 -18980 -19434 -22119 -21296 -19054 -14813 -6272 4704 -1545 -3501 -593 -7105 -16942
6795a6942J361J4262j531m106l418J846P468o555K858K731l269m837m020n630
$$ -16942 -15581 -1319 -2850 -6956 -10374 -8528 -1060 -7615 -4757 -2026 -5295 -10132 -14152 -19782
6781a9782p430O525L871q6m038m048N206N360r708k9r30l188J412K943M97J610
$$ -19782 -27212 -20687 -16816 -16902 -20940 -24988 -19782 -14422 -24130 -24159 -25089 -28277 -26865 -23922 -23425 -21815
6765b1815q844k796k736O692M453k369n322L822L03O806L059J723R46K048J1506
$$ -21815 -30659 -33455 -36191 -29499 -25046 -27415 -32737 -28915 -28612 -21806 -18747 -17024 -16078 -14030 -2524
6750b524l391j3500o871J658J5329J674k991m299N33j369m60M303R02p818k640
$$ -2524 -5915 -19415 -26286 -24628 -9299 -7625 -10616 -14915 -14382 -15751 -16211 -11908 -11006 -18824 -21464
6735b1464j973R26J1759M66K283M237n147q223m728m048J904J1099K008q909r681
$$ -21464 -23437 -22511 -10752 -10286 -8003 -3766 -8913 -17136 -21864 -25912 -24008 -12909 -10901 -19810 -29491
6720b9491L315L132M492K839J6201K688n745o358j0537m295q21P788R799P044
$$ -29491 -26176 -23044 -18552 -15713 488 3176 -2569 -8927 -19464 -23759 -24580 -16792 -6993 51
6706E1n761p365l420q386J69K597M58j1783J2689K928J305o649m248j053k222
$$ 51 -5710 -13075 -16495 -24881 -24712 -22115 -21657 -33440 -20751 -17823 -16518 -23167 -27415 -28468 -30690
6691c0690k858P164R878j056n625l361K862M602L265m581K643L896L004j405R79
$$ -30690 -33548 -26384 -16506 -17562 -23187 -26548 -23686 -19084 -15819 -20400 -17757 -13861 -10857 -12262 -11283
6676a1283J5056J524j5598m481K178K241m984K720P327j176n937J677j614j0705
$$ -11283 3773 5297 -10301 -14782 -12604 -10363 -15347 -12627 -5300 -6476 -12413 -10736 -12350 -23055
6662b3055j176k567N616R725p593j975R779j188j7J0885r111l054N782J3027M031
$$ -23055 -24231 -26798 -21182 -11457 -19050 -21025 -11246 -12434 -12451 -1566 -10677 -13731 -7949 5078 9109
6647I109k891l385P002m546q68p85p153r675n41P549K851L657L883M245N794m516
$$ 9109 6218 2833 9835 5289 4421 3636 -3517 -13192 -13733 -6184 -3333 324 4207 8452 14246 9730
6631I730q787j1055j914q642l915N347J304R3M05J1686O240N29n474j6964j1345
$$ 9730 943 -10112 -12026 -20668 -24583 -19236 -17932 -17839 -17434 -5748 492 1021 -4453 -21417 -32762
6616c2762P337Q829m713p09O53J0906J0036M067p38p81o132j547j34m271l059
$$ -32762 -25425 -16596 -21309 -22018 -21365 -10459 -423 3644 2906 2125 -4007 -5554 -5688 -9959 -13018
6601a3018J675l10n025R067L933P8M121p464k1163k546M924R095K027l338n705
$$ -13018 -11343 -11653 -16678 -7611 -3678 -3600 521 -6943 -28106 -30652 -25728 -16633 -14606 -17944 -23649
6586b3649K047M749O952O473O471o111j0598L113L301j131Q559L565o899j197
$$ -23649 -21602 -16853 -9901 -3428 3043 -3068 -13666 -10553 -7252 -8383 176 3741 -3158 -4355
6572d355m417p059L765j035j2810P574M799m22K603j021j712n49Q500J3136R29
$$ -4355 -8772 -15831 -12066 -13101 -25911 -18337 -13538 -13960 -11357 -12378 -14090 -14639 -6139 6997 7926
6557G926m249r214j576J0686J150n602j964r420n01R324J753M820J007p954K867
$$ 7926 3677 -5537 -7113 3573 4723 -879 -2843 -12263 -12764 -3440 -1687 3133 4140 -3814 -947
6542i47n34j1582l734R310K893k194J286q034K970L329k575J8L729l959m94m265
$$ -947 -1481 -13063 -16797 -7487 -4594 -6788 -5502 -13536 -10566 -7237 -9812 -9794 -6065 -10024 -10518 -14783
6526a4783J869M530q61O308L709q446J406m87j4424l027R173O957L82j0780K939
$$ -14783 -12914 -8384 -9245 -2937 772 -7674 -6268 -6755 -21179 -24206 -15033 -8076 -7694 -18474 -15535
6511a5535K425n447Q289J1143n537R833K905n129l043n003n085j416L150L90k914
$$ -15535 -13110 -18557 -10268 875 -4662 5171 8076 2947 -96 -5099 -10184 -11600 -8450 -8060 -10974
6496a0974j399L625P037J059J997o335k49j50P882p229j089M743n163p997p709
$$ -10974 -12373 -8748 -1711 -652 1345 -4990 -5239 -5389 2493 -4736 -5825 -1082 -6245 -14242 -21951
6481b1951K710N453O414K718K340p742j363O695M088N032k202N163k0670j0876
$$ -21951 -19241 -13788 -7374 -4656 -2316 -10058 -11421 -4726 -638 4394 2192 7355 -13315 -24191
6467b4191Q582J691O023r78J376N153p596q677n414M586j632O860N61j840N996
$$ -24191 -15609 -13918 -7895 -8873 -7497 -2344 -9940 -18617 -24031 -19445 -21077 -14217 -13656 -15496 -9500
6452i500J080o60L359l90P321K113Q639n906j0020o619j456N619k192j773q290
$$ -9500 -8420 -9080 -5721 -6111 1210 3323 11962 6056 -3964 -10583 -12039 -6420 -8612 -10385 -18675
6437a8675j123P284j652m348n961J0213Q785o859j2002j809M25L203M036M509
$$ -18675 -19798 -12514 -14166 -18514 -24475 -14262 -5477 -12336 -24338 -26147 -25722 -22519 -18483 -13974
6423a3974O676J37N775j263r665m720R0J969o09l2P106P844O460J51J65M73n93
$$ -13974 -7298 -7161 -1386 -2649 -12314 -17034 -16944 -14975 -15584 -15616 -8510 -666 5794 5945 6110 6583 5990
6406E990J29n026j105M151M150m579q973m953n696n102R805J105l394q646M706
$$ 5990 6119 1093 -12 4139 8289 3710 -5263 -10216 -15912 -21014 -11209 -10104 -13498 -22144 -17438
6391a7438N214K530j4723K449M407n22N099M410P58L5J3251j2084j7297N179K676
$$ -17438 -12224 -9694 -24417 -21968 -17561 -18083 -12984 -8574 -7816 -7781 5470 -6614 -23911 -18732 -16056
6376a6056Q919l742j493k984k424q472J462J2882n055Q686M359j335K746j0583
$$ -16056 -7137 -10879 -12372 -15356 -17780 -26252 -24790 -11908 -16963 -8277 -3918 -5253 -2507 -13090
6362a3090l711L645P212j315q211n208M39N291J353l45m685o63O342J3730k459
$$ -13090 -16801 -13156 -5944 -7259 -15470 -20678 -20239 -14948 -13595 -13940 -18625 -19288 -12946 784 -1675
6347a675l630j2247m191N626K578Q154l165m07O761j381j3357j0146M428J2865
$$ -1675 -5305 -17552 -21743 -16117 -13539 -5385 -8550 -8957 -2196 -3577 -16934 -27080 -22652 -9787
6333i787O225j1901j3143p079J033R239O961Q695J5613q557J006P14Q220N928
$$ -9787 -3562 -15463 -28606 -35685 -34652 -25413 -18452 -9757 5856 -2701 -1695 -981 7239 13167
6319A3167o459j7639j4223J4367O866J969m079l533n806K311J1024J2836O77o731
$$ 13167 6708 -10931 -25154 -10787 -3921 -1952 -6031 -9564 -15370 -13059 -2035 10801 11478 4747
6305D747j3475q699j048K030J293R972J2537q792j3184J011p886n897N862m76
$$ 4747 -8728 -17427 -18475 -16445 -15152 -5180 7357 -1435 -14619 -13608 -21494 -27391 -21529 -22005
6291b2005O031Q274J100q987J693m59l450K997Q095O989j761l892q351k479L122
$$ -22005 -15974 -7700 -6600 -15587 -13894 -14353 -17803 -14806 -6711 278 -1483 -5375 -13726 -16205 -13083
6276a3083l44n209N510p44k114j741o234k946O803J3048N5o05j416l954j89K601
$$ -13083 -13427 -18636 -13126 -13870 -15984 -17725 -23959 -26905 -20102 -7054 -6999 -7604 -9020 -12974 -13163 -10562
6260a0562q475l539P685J0854k319k924r48n53J43l872p184q890O090Q894o153
$$ -10562 -19037 -22576 -14891 -4037 -6356 -9280 -10228 -10781 -10638 -14510 -21694 -30584 -24494 -15600 -21753
6245b1753k652J4522J3190O323J985j2239j416N026j417p082l583Q302j235L796
$$ -21753 -24405 -9883 3307 9630 11615 -624 -2040 2986 1569 -5513 -9096 -794 -2029 1767
6231A767J806M169l469m565J023O670k963p112J86o529l090P13M706k884K010
$$ 1767 3573 7742 4273 -292 731 7401 4438 -2674 -2488 -9017 -12107 -11394 -6688 -9572 -7562
6216g562P282M774q377j367j0548O093R305o50n204M257k42l794N328k715j1245
$$ -7562 -280 4494 -3883 -5250 -15798 -9705 -400 -1050 -6254 -1997 -2239 -6033 -705 -3420 -14665
6201a4665o638N745O934N415N557K238L179p843j4601j38p24m282J0947N178j437
$$ -14665 -21303 -15558 -8624 -3209 2348 4586 7765 -78 -14679 -14817 -15541 -19823 -8876 -3698 -5135
6186e135q153Q210O311k375K863M977o715q007O003K364o983r931m852N415k493
$$ -5135 -13288 -5078 1233 -1142 1721 6698 -17 -8024 -2021 343 -6640 -16571 -21423 -16008 -18501
6171a8501k622k685N197Q329N943L898J709L303L597M999o416j2972o877J929
$$ -18501 -21123 -23808 -18611 -10282 -4339 -441 1268 4571 8168 13167 6751 -6221 -13098 -11169
6157a1169o81r521J232J978n465J117J880M962J1976N523M580p0j3796n250k689
$$ -11169 -11850 -21371 -20139 -18161 -23626 -22509 -20629 -15667 -3691 1832 6412 6342 -7454 -12704 -15393
6142a5393M682O130R077M978n829j8596l470J1226J291K18M809K585p211J392
$$ -15393 -10711 -4581 4496 9474 3645 -14951 -18421 -7195 -5904 -5686 -877 1708 -5503 -4111
6128d111L634R52R111N670j2801j139M528R775j438j1369r765M644k069k208O195
$$ -4111 -477 475 9586 15256 2455 1316 5844 15619 14181 2812 -6953 -2309 -4378 -6586 -391
6113c91m898o996P949J0375j368r597k243m013J998n904L498J1241l738m621o301
$$ -391 -5289 -12285 -4336 6039 4671 -4926 -7169 -11182 -9184 -15088 -11590 -349 -4087 -8708 -15009
6098a5009O05P597L578o934K181P15n688l62J1229k425j3867R67L264J89O559
$$ -15009 -14404 -6807 -3229 -10163 -7982 -7267 -12955 -13317 -2088 -4513 -18380 -17413 -14149 -13960 -7401
6083g401m327j1209p93J3079m93m921R406P090Q908k758j0878L842r415Q67Q329
$$ -7401 -11728 -22937 -23730 -10651 -11144 -16065 -6659 431 9339 6581 -4297 -455 -9870 -9003 -674
6068f74N499l043m749j593J07K878O387o430n994l006M658l616J0380P158N79
$$ -674 4825 1782 -2967 -4560 -4453 -1575 4812 -1618 -7612 -10618 -5960 -9576 804 7962 8541
6053H541K682j169k450n328j490K662n892R802L964n4n455k918p169m158Q733
$$ 8541 11223 10054 7604 2276 786 3448 -2444 7358 11322 11268 5813 2895 -4274 -8432 301
6038C01J0760j86q671P352M183q119p285k156r840M389O039l559o561n820l201
$$ 301 11061 10875 2204 9556 13739 5620 -1665 -3821 -13661 -9272 -3233 -6792 -13353 -19173 -22374
6023b2374J4411J2513L874p049n108l32O533O54j0231n359M294J797o396p862
$$ -22374 -7963 4550 8424 1375 -3733 -4065 2468 3122 -7109 -12468 -8174 -6377 -12773 -20635
6009b0635k915l113M8L037k207O247M865k683p905l592q40J3072P62m023J0083
$$ -20635 -23550 -26663 -26615 -23578 -25785 -19538 -14673 -17356 -25261 -28853 -29693 -16621 -15859 -19882 -9799
5994i799J109p348Q595M718l440n116j031L744k088p696J270p43n197j290k600
$$ -9799 -8690 -16038 -7443 -2725 -6165 -11281 -12312 -8568 -10656 -18352 -17082 -17825 -23022 -24312 -26912
5979b6912n436O126k195J911J1357P739o162M113o105R274N417J7680j843o725
$$ -26912 -32348 -26222 -28417 -26506 -15149 -7410 -13572 -9459 -15564 -6290 -873 16807 14964 8239
5965H239j3005j747N926j054j922M602o901p806k694o35k928L599N92K314M678
$$ 8239 -4766 -6513 -587 -1641 -3563 1039 -5862 -13668 -16362 -16997 -19925 -16326 -15734 -13420 -8742
5950h742k601K222l406k435j078Q19J993M760q747j896j835q772j1043R386Q303
$$ -8742 -11343 -9121 -12527 -14962 -16040 -15221 -13228 -8468 -17215 -19111 -20946 -29718 -40761 -31375 -23072
5935b3072O755J928N020k627n768m07q38L093O049N012m70o605J824P19P455l697
$$ -23072 -16317 -14389 -9369 -11996 -17764 -18171 -19009 -15916 -9867 -4855 -5325 -11930 -10106 -9387 -1932 -5629
5919e629m961O59j0524p484K358O320N191J167k282q54O101J3585O660p24r870
$$ -5629 -10590 -9931 -20455 -27939 -25581 -19261 -14070 -12903 -15185 -16039 -9938 3647 10307 9583 -287
5904b87n605l086L43N59o07J697L26m4L541Q896M712J2002n793q439n768n027
$$ -287 -5892 -8978 -8635 -8076 -8683 -6986 -6660 -6704 -3163 5733 10445 22447 16654 8215 2447 -2580
5888b580l949K17N75R91J09O1k058J437n034Q429N779l983j340M335N163n922
$$ -2580 -6529 -6312 -5737 -4746 -4637 -4576 -6634 -5197 -10231 -1802 3977 -6 -1346 2989 8152 2230
5872B230K80k463o24l939j1748l160O264J2847m246m717P674Q803O693r072l194
$$ 2230 2510 47 -577 -4516 -16264 -19424 -13160 -313 -4559 -9276 -1602 7201 13894 4822 1628
5857A628p497R81q973M967J2705K176p276j265O780M411m07J467J91o678j2470
$$ 1628 -5869 -4888 -13861 -8894 3811 5987 -1289 -2554 4226 8637 8230 9697 9888 3210 -9260
5842i260N855J2124r807j5112L700Q172O360j972l700m290N94j102p279j308N002
$$ -9260 -3405 8719 -1088 -16200 -12500 -4328 2032 60 -3640 -7930 -7336 -8438 -15717 -17025 -12023
5827a2023Q162N881j1131k299M387o261O875N231j15n423K247r523m475J2055
$$ -12023 -3861 2020 -9111 -11410 -7023 -13284 -6409 -1178 -1293 -6716 -4469 -13992 -18467 -6412
5813f412L430O809n96l335j477l697j0201p412P114R272k825J1157k486m321N57
$$ -6412 -2982 3827 3231 -104 -1581 -5278 -15479 -22891 -15777 -6505 -9330 1827 -659 -4980 -4423
5798d423K829N776j385N842J579o781p400q066m501q28L677P570n867m264L915
$$ -4423 -1594 4182 2797 8639 10218 3437 -3963 -12029 -16530 -17358 -13681 -6111 -11978 -16242 -12327
5783a2327M840M972J921N477m11j649N246M099n936j0702m911L951L994j286l389
$$ -12327 -7487 -2515 -594 4883 4472 2823 8069 12168 6232 -4470 -9381 -5430 -1436 -2722 -6111
5768f111k992Q890L12p243L285L982M070J687l484n350k541J1972r92n827Q600
$$ -6111 -9103 -213 99 -7144 -3859 123 4193 5880 2396 -2954 -5495 6477 5485 -342 8258
5753H258m438n118q119J857l065o202m640J3033l68K063J705l697m287K47O614
$$ 8258 3820 -1298 -9417 -7560 -10625 -16827 -21467 -8434 -8802 -6739 -5034 -8731 -13018 -12771 -6157
5738f157Q189j577m491J793k683j639k457J0733l211n554K391L164p029P149M098
$$ -6157 2032 455 -4036 -2243 -4926 -6565 -9022 1711 -1500 -7054 -4663 -1499 -8528 -1379 2719
5723B719j422j4524j0244M892N373p691n835O455J4466J4425L847r43J900j521
$$ 2719 1297 -13227 -23471 -18579 -13206 -20897 -26732 -20277 -5811 8614 12461 11518 13418 11897
5709A1897r355K049M738j707k222l90l009n205o577n427Q711N087p38r431P022
$$ 11897 2542 4591 9329 7622 5400 5010 2001 -3204 -9781 -15208 -6497 -1410 -2148 -11579 -4557
5694d557Q558L538j0803N007J069J216o229j0457J706N809j213L507Q52j534O70
$$ -4557 4001 7539 -3264 1743 2812 4028 -2201 -12658 -10952 -5143 -6356 -2849 -1997 -3531 -2861
5679b861K474m958NJ2933q28q70L075n531m955L708P136k216N065P984j1110q136
$$ -2861 -387 -5345 -5340 7593 6765 5895 8970 3439 -1516 2192 9328 7112 12177 20161 9051 915
5663I15P210K545J040l171r452r47K492M103m70K289n363r308M331o618P62K866
$$ 915 8125 10670 11710 8539 -913 -1860 632 4735 4265 6554 1191 -8117 -3786 -10404 -9642 -6776
5647f776Q0k000o360k138M023J1181Q078O134j091n740j1608o194P182N598j751
$$ -6776 -6696 -8696 -15056 -17194 -13171 -1990 6088 12222 11131 5391 -6217 -12411 -5229 369 -1382
5632a382L00P419L18j1927J2442N861m774n900q32K74m458n329n483L907R272
$$ -1382 -1082 6337 6655 -5272 7170 13031 8257 2357 1525 1799 -2659 -7988 -13471 -9564 -292
5617b92q253J438Q633n746J578K383q720k239L365O252j267n486m868J703o258
$$ -292 -8545 -7107 1526 -4220 -2642 -259 -8979 -11218 -7853 -1601 -2868 -8354 -13222 -11519 -17777
5602a7777P85J300M801J6465M183m195l398l207l391N841P55p130l539Q97Q442
$$ -17777 -16992 -15692 -10891 5574 9757 5562 2164 -1043 -4434 1407 2162 -4968 -8507 -7610 832
5587H32J694m172m182j0591M182L335N539n620J628M30l015j515O802j433j029
$$ 832 2526 -1646 -5828 -16419 -12237 -8902 -3363 -8983 -7355 -6925 -9940 -11455 -4653 -6086 -7115
5572g115j2976R452P633n866N805J326J549o70o981J736K79N406J694k960m11
$$ -7115 -20091 -10639 -3006 -8872 -3067 -1741 -192 -862 -7843 -6107 -5828 -422 1272 -1688 -2099
5557b099k999n921K602R523L103p685K430L244m571L14M7o67p749O937J975O793
$$ -2099 -5098 -11019 -8417 1106 4209 -3476 -1046 2198 -2373 -2059 -2012 -2679 -10428 -3491 -1516 5277
5541E277Q098P395j411p61L208m360p523n151l006k738k790j798n685R745j774
$$ 5277 13375 20770 19359 18598 21806 17446 9923 4772 1766 -972 -3762 -5560 -11245 -1500 -3274
5526c274m698o94o680p036L224J4878o3J500q5j02l533k111N204K582O852R928
$$ -3274 -7972 -8666 -15346 -22382 -19158 -4280 -4343 -2843 -2928 -3030 -6563 -8674 -3470 -888 5964 15892
5510A5892q389j1744o242P157J440l349M677J2459K070q169p027k182K648L593
$$ 15892 7503 -4241 -10483 -3326 -1886 -5235 -558 11901 13971 5802 -1225 -3407 -759 2834
5496B834j035j626k923J051J0174j81m191L342L122j2149J584J0934L33o461j0772
$$ 2834 1799 173 -2750 -1699 8475 8294 4103 7445 10567 -1582 2 10936 11269 4808 -5964
5481e964K427P400N633p002R45j336p69J688l446L902P284j2088L040K934j1762
$$ -5964 -3537 3863 9496 2494 3439 2103 1334 3022 -424 3478 10762 -1326 1714 4648 -7114
5466g114L618N067J235K97k484k439p851J0358O174q452r072K424P142N534m923
$$ -7114 -3496 1571 2806 3103 619 -1820 -9671 687 6861 -1591 -10663 -8239 -1097 4437 -486
5451d86q783J871Q842L150m482n173J529n009j034L359l201l518P777J0600K977
$$ -486 -9269 -7398 1444 4594 112 -5061 -3532 -8541 -9575 -6216 -9417 -12935 -5158 5442 8419
5436H419l199j3819j547P334K026k755j595L422k535O197O435o212k717p286j1180
$$ 8419 5220 -8599 -10146 -2812 -786 -3541 -5136 -1714 -4249 1948 8383 2171 -546 -7832 -19012
5421a9012o117P978J8679Q006m2n559J641J061J340o813o159K668J0080L908m679
$$ -19012 -25129 -17151 1528 9534 9492 3933 5574 6635 7975 1162 -4997 -2329 7751 11659 6980
5406F980k860j189j124k596r84k457m387N020N45r26M387n036o297j882L978N674
$$ 6980 4120 2931 1807 -789 -1773 -4230 -8617 -3597 -3052 -3978 409 -4627 -10924 -12806 -8828 -3154
5390c154O745K588p889p412R396K673q970o385k69J4650R874j06P947n16j2562
$$ -3154 3591 6179 -1710 -9122 274 2947 -6023 -12408 -12677 1973 11847 11741 19688 19172 6610
5375F610l887l711k628N848k358j397O927O575p378J135O673L061p452q569m658
$$ 6610 2723 -988 -3616 2232 -126 -1523 5404 11979 4601 5736 12409 15470 8018 -551 -5209
5360e209K621m682N764J1825M798j659n471N96k615l082p310J1533P442n688m127
$$ -5209 -2588 -7270 -1506 10319 15117 13458 7987 8583 5968 2886 -4424 7109 14551 8863 4736
5345D736o655J725p8k705L859r34j63l059n301L384J7867J728j0352j7254p150
$$ 4736 -1919 -194 -272 -2977 882 -52 -215 -3274 -8575 -5191 12676 14404 4052 -13202 -20352
5330b0352m864l856J484L009M570L111M430O467L945J466K243J478R34r580n898
$$ -20352 -25216 -29072 -27588 -24579 -20009 -16898 -12468 -6001 -2056 -590 1653 3131 4065 -5515 -11413
5315a1413P805J238j404J1590k242o577P073r199q052k129Q314m015L65N240n734
$$ -11413 -3608 -2370 -3774 7816 5574 -1003 6070 -3129 -11181 -13310 -4996 -9011 -8646 -3406 -9140
5300i140k090J651l934L767O475L640M669j5907l078N435n49P270M231M2M68r615
$$ -9140 -11230 -9579 -13513 -9746 -3271 369 5038 -10869 -13947 -8512 -9061 -1791 2440 2482 2950 -6665
5284f665l218J1322J2845n143q233q319n669K780L559K159k024K667o74O237J774
$$ -6665 -9883 1439 14284 9141 908 -7411 -13080 -10300 -6741 -4582 -6606 -3939 -4613 1624 3398
5269C398o819n731O35J697K807k755j0545m187O992N212o487k171M818Q784J589
$$ 3398 -3421 -9152 -8517 -6820 -4013 -6768 -17313 -21500 -14508 -9296 -15783 -17954 -13136 -4352 -2763
5254b763m914M743j899P6L988K51o188l149j614Q544J562l664P2N466n406j425
$$ -2763 -7677 -2934 -4833 -4757 -769 -518 -6706 -9855 -11469 -2925 -1363 -5027 -4955 511 -4895 -6320
5238f320O19r162K48m472K760J4347Q474n028Q390N233j37l572p931j261j963
$$ -6320 -5701 -14863 -14615 -19087 -16327 -1980 6494 1466 9856 15089 14952 11380 3449 2188 225
5223B25p015j277K442M890qJ408m241P43J624o142n580j536P173L650n501j666
$$ 225 -6790 -8067 -5625 -735 -743 665 -3576 -2833 -1209 -7351 -12931 -14467 -7294 -3644 -9145 -10811
5207a0811O081J037k815k311N638L744J920m465p849P44l153J23L534L813p371
$$ -10811 -4730 -3693 -6508 -8819 -3181 563 2483 -1982 -9831 -9087 -12240 -12117 -8583 -4770 -12141
5192a2141n513M088j363k875J0058R025M79l561j0024j287J745J087Q655k979
$$ -12141 -17654 -13566 -14929 -17804 -7746 1279 1758 -1803 -11827 -13114 -11369 -10282 -1627 -4606
5178d606o926O071Q362k281k248j2300j0029N110J1535R612l35R06o006O13p98
$$ -4606 -11532 -5461 2901 620 -1628 -13928 -23957 -18847 -7312 2300 1965 2871 -3135 -2522 -3320
5163c320n044l593j787K933N630N494M953l468n582L855P536O78r302o900m379
$$ -3320 -8364 -11957 -13744 -10811 -5181 313 5266 1798 -3784 71 7607 8285 -1017 -7917 -12296
5148a2296M633M544J532m074O7r73M053R545m826r672K833k080l925L763N304
$$ -12296 -7663 -3119 -1587 -5661 -5594 -6567 -2514 7031 2205 -7467 -4634 -6714 -10639 -6876 -1572
5133a572L116n524n834j159R729Q489J577n655J0603M811k564n729r31J89K459
$$ -1572 1544 -3980 -9814 -10973 -1244 7245 8822 3167 13770 18581 16017 10288 9357 9546 12005
5118A2005O69N319P705j0152o240r423L348q10n653j542J138o504p278N345J1504
$$ 12005 12674 17993 25698 15546 9306 -117 3231 2421 -3232 -4774 -3636 -10140 -17418 -12073 -569
5103e69m259p13n327k992J203J4335J455j156r186n679r723J1526R879k289j030
$$ -569 -4828 -5541 -10868 -13860 -12657 1678 3133 1977 -7209 -12888 -22611 -11085 -1206 -3495 -4525
5088d525K679o447p041N068N358J2424O209r148q090J059R82m511J480P571j544
$$ -4525 -1846 -8293 -15334 -10266 -4908 7516 13725 4577 -3513 -2454 -1472 -5983 -4503 3068 1524
5073A524o090q180l354l979L229O939O749N160k036L215J3935o923r735q455O121
$$ 1524 -4566 -12746 -16100 -20079 -16850 -9911 -3162 1998 -38 3177 17112 10189 454 -8001 -1880
5058a880M816r134r591R234M367R437N822l994J025j1278q320N823M000o27K408
$$ -1880 2936 -6198 -15789 -6555 -2188 7249 13071 9077 10102 -1176 -9496 -3673 327 -300 2108
5043B108l820o556J144j627j763K195Q338m446l409n959K589K436O146P893j345
$$ 2108 -1712 -8268 -7124 -8751 -10514 -8319 19 -4427 -7836 -13795 -11206 -8770 -2624 5269 3924
5028C924j827J393k154J318n12Q570M202q414j0818k002K847L236o737j146K928
$$ 3924 2097 3490 1336 2654 2142 10712 14914 6500 -4318 -6320 -3473 -237 -6974 -8120 -5192
5013e192o633K889l596K112N701m898j818n241l09O17M789O818l29j883O707l054
$$ -5192 -11825 -8936 -12532 -10420 -4719 -9617 -11435 -16676 -16985 -16368 -11579 -4761 -5090 -6973 -266 -3320
4997c320j0259Q98R071O5o438k128J4409N043l820q18M909L818j0652K865n156
$$ -3320 -13579 -12681 -3610 -3545 -9983 -12111 2298 7341 3521 2703 7612 11430 778 3643 -1513
4982a513k311j0252P74N480N696O017O543J605O763K628n71l32O099o978l324
$$ -1513 -3824 -14076 -13302 -7822 -2126 3891 10434 12039 18802 21430 20859 20527 26626 19648 16324
4967A6324m678K025j380m18L035n898j738R549n782j3410j365O266N928k718q319
$$ 16324 11646 13671 12291 11873 14908 9010 7272 16821 11039 -2371 -3736 2530 8458 5740 -2579
4952b579o898k926K722m84Q094J407N681l198j0506L079Q451O91k168m326l337
$$ -2579 -9477 -12403 -9681 -10165 -2071 -664 5017 1819 -8687 -5608 2843 3534 1366 -2960 -6297
4937f297P299Q048j65l459l895q23K115M983l391L159k185n58m110K133K004N12
$$ -6297 1002 9050 8885 5426 1531 708 2823 7806 4415 7574 5389 4831 721 2854 4858 5370
4921E370l759R599k54P72m452n36L5J975n324n367R433O164j1665k215O283P016
$$ 5370 1611 11210 10956 11728 7276 6740 6775 8750 3426 -1941 7492 13656 1991 -224 6059 13075
4905A3075l138j760M675r391O594O608J209o806n028J464K44k020M23q661o467
$$ 13075 9937 8177 12852 3461 10055 16663 17872 11066 6038 7502 7746 5726 6149 -2512 -8979
4890h979P05P709J1352n826j2782L863N922Q702o884j536k883Q76q664k022J7891
$$ -8979 -8274 -565 10787 4961 -7821 -3958 1964 10666 3782 2246 -637 239 -8425 -10447 7444
$$ [...]
##END NTUPLES=NMR SPECTRUM
##END=
