##TITLE=Analysis number 329564
Compound Code cc 61963
Project Code adrs
Chemist Name endeavour
##JCAMPDX= 6.0         $$ Bruker NMR JCAMP-DX V2.0
##DATA TYPE= NMR SPECTRUM
##DATA CLASS= NTUPLES
##ORIGIN= Bruker BioSpin GmbH
##OWNER= nmr
$$ XWIN-NMR		Version 3.5
$$ Fri Sep 14 08:39:52 2007 GMT Daylight Time (UT+1h)  MAYBRIDGE\nmr@NMR_250MHZ
##.OBSERVE FREQUENCY= 250.131544655141
##.OBSERVE NUCLEUS= ^1H
##.ACQUISITION MODE= SIMULTANEOUS (DQD)
##.ACQUISITION SCHEME= undefined
##.AVERAGES= 16
##.DIGITISER RES= 18
##SPECTROMETER/DATA SYSTEM= dpx250
##.PULSE SEQUENCE= zg30
##.SOLVENT NAME= DMSO
##.SHIFT REFERENCE= (INTERNAL, DMSO, 0, 16.522)
##AUDIT TRAIL= $$ (NUMBER, WHEN, WHO, WHERE, WHAT)
$$ ##TITLE= Audit trail, XWIN-NMR		Version 3.5
$$ ##JCAMPDX= 5.01
$$ ##ORIGIN= Bruker BioSpin GmbH
$$ ##OWNER= nmr
$$ C:\u/data/dgb/nmr/ADRS/1530/pdata/1/auditp.txt
$$ ##AUDIT TRAIL=  $$ (NUMBER, WHEN, WHO, WHERE, WHAT)
(   1,<2007-09-14 08:39:12.09 +100>,<MAYBRIDGE\nmr>,<NMR_250MHZ>,
      <created by zg, POWCHK disabled, PULCHK disabled
       configuration hash MD5:
       76 6E 9A 78 1E 09 19 81 EC 84 63 8F B0 6A 59 2D
       data hash MD5: 64K
       B9 6C 2F 9E 56 5F 04 EC 58 7C 21 E7 F1 18 A4 DA>)
(   2,<2007-09-14 08:39:28.27 +100>,<MAYBRIDGE\nmr>,<NMR_250MHZ>,
      <Start of raw data processing
       ef LB = 0.3 FT_mod = 6 PKNL = 1 SI = 32K 
       data hash MD5: 32K
       E1 D3 BE 66 44 7B 52 74 F7 74 6C 3B DC E0 A8 BB>)
(   3,<2007-09-14 08:39:33.29 +100>,<MAYBRIDGE\nmr>,<NMR_250MHZ>,
      <apk 
       data hash MD5: 32K
       8E F9 59 68 92 EC 93 23 A6 2E 92 9F DE 16 84 3C>)
(   4,<2007-09-14 08:39:35.18 +100>,<MAYBRIDGE\nmr>,<NMR_250MHZ>,
      <abs ABSG = 5 
       data hash MD5: 32K
       8D 16 73 A4 BD C6 AA 9C FC E1 D4 38 FD B3 41 B3>)
$$ ##END=
$$ 
$$ hash MD5
$$ E1 AA 02 98 91 20 1A 7C 8B C9 D1 95 88 D1 E2 15
##$RELAX= 
##$RELAX= 
##$RELAX= 
##$RELAX= 
##$RELAX= 
##$RELAX= 
##$RELAX= 
$$ Bruker specific parameters
$$ --------------------------
##$DU= <C:\u>
##$EXPNO= 1530
##$NAME= <ADRS>
##$PROCNO= 1
##$TYPE= <nmr>
##$USER= <dgb>
##$AMP= (0..31)
100 100 100 100 100 100 100 100 100 100 100 100 100 100 100 100 100 100 
100 100 100 100 100 100 100 100 100 100 100 100 100 100 
##$AQSEQ= 0
##$AQ_mod= 3
##$AUNM= <au_zg>
##$AUTOPOS= <1 >
##$BF1= 250.13
##$BF2= 250.13
##$BF3= 250.13
##$BF4= 250.13
##$BF5= 500.13
##$BF6= 500.13
##$BF7= 500.13
##$BF8= 500.13
##$BYTORDA= 1
##$CFDGTYP= 0
##$CFRGTYP= 5
##$CHEMSTR= <none>
##$CNST= (0..31)
1 1 145 1 1 1 1 1 1 1 1 1 1 1 1 1 1 1 1 1 1 1 1 1 1 1 1 1 1 1 1 1 
##$CPDPRG= <>
##$CPDPRG1= <>
##$CPDPRG2= <>
##$CPDPRG3= <>
##$CPDPRG4= <mlev>
##$CPDPRG5= <mlev>
##$CPDPRG6= <mlev>
##$CPDPRG7= <mlev>
##$CPDPRG8= <mlev>
##$CPDPRGB= <>
##$CPDPRGT= <>
##$D= (0..31)
0 1 0 0 0 0 0 0 0 0.06 0 0 0 0 0 0 0.0002 0 0 0 0 0 0 0 0 0 0 0 0 0 0 
0 
##$DATE= 1189755549
##$DBL= (0..7)
120 120 120 120 120 120 120 120 
##$DBP= (0..7)
150 150 150 150 150 150 150 150 
##$DBP07= 0
##$DBPNAM0= <>
##$DBPNAM1= <>
##$DBPNAM2= <>
$$ [...]
##$SUBNAM7= <"">
##$SUBNAM8= <"">
##$SUBNAM9= <"">
##$SW= 20.6930455092707
##$SWIBOX= (0..15)
0 0 3 0 0 0 0 0 0 0 0 0 0 0 0 0 
##$SW_h= 5175.983436853
##$TD= 65536
##$TD0= 1
##$TE= 296.16
##$TE2= 300
##$TE3= 300
##$TEG= 300
##$TL= (0..7)
0 120 120 120 120 120 120 120 
##$TP= (0..7)
150 150 150 150 150 150 150 150 
##$TP07= 0
##$TPNAME0= <>
##$TPNAME1= <>
##$TPNAME2= <>
##$TPNAME3= <>
##$TPNAME4= <>
##$TPNAME5= <>
##$TPNAME6= <>
##$TPNAME7= <>
##$TPOAL= (0..7)
0.5 0.5 0.5 0.5 0.5 0.5 0.5 0.5 
##$TPOFFS= (0..7)
0 0 0 0 0 0 0 0 
##$TUNHIN= 0
##$TUNHOUT= 0
##$TUNXOUT= 0
##$USERA1= <user>
##$USERA2= <user>
##$USERA3= <user>
##$USERA4= <user>
##$USERA5= <user>
##$V9= 5
##$VALIST= <valist>
##$VCLIST= <CCCCCCCCCCCCCCC>
##$VD= 0
##$VDLIST= <DDDDDDDDDDDDDDD>
##$VPLIST= <PPPPPPPPPPPPPPP>
##$VTLIST= <TTTTTTTTTTTTTTT>
##$WBST= 1024
##$WBSW= 4
##$XGAIN= (0..3)
0 0 0 0 
##$XL= 0
##$YL= 0
##$YMAX_a= 403305
##$YMIN_a= -453847
##$ZGOPTNS= <>
##$ZL1= 120
##$ZL2= 120
##$ZL3= 120
##$ZL4= 120
##$ABSF1= 16.522
##$ABSF2= -4.171173
##$ABSG= 5
##$ABSL= 3
##$ALPHA= 0
##$AQORDER= 0
##$ASSFAC= 0
##$ASSFACI= 0
##$ASSFACX= 0
##$ASSWID= 0
##$AUNMP= <proc_1d>
##$AZFE= 0.1
##$AZFW= 0.1
##$BCFW= 0
##$BC_mod= 0
##$BYTORDP= 0
##$COROFFS= 0
##$CY= 12.5
##$DATMOD= 1
##$DC= 0
##$DFILT= <>
##$DTYPP= 0
##$F1P= 14.0000005364418
##$F2P= -0.99999901652339
##$FCOR= 0.5
##$FTSIZE= 32768
##$FT_mod= 6
##$GAMMA= 0
##$GB= 0
##$INTBC= 1
##$INTSCL= 1
##$ISEN= 128
##$LB= 0.3
##$LEV0= 0
##$LPBIN= 0
##$MAXI= 10000
##$MC2= 0
##$MEAN= 0
##$ME_mod= 0
##$MI= 0
##$NCOEF= 0
##$NC_proc= -5
##$NLEV= 6
##$NOISF1= 0
##$NOISF2= 0
##$NSP= 0
##$NTH_PI= 0
##$NZP= 0
##$OFFSET= 16.522
##$PC= 1
##$PHC0= -71.24684
##$PHC1= 5.199204
##$PH_mod= 1
##$PKNL= yes
##$PPARMOD= 0
##$PSCAL= 4
##$PSIGN= 0
##$REVERSE= no
##$SF= 250.13
##$SI= 32768
##$SIGF1= 0
##$SIGF2= 0
##$SINO= 400
##$SIOLD= 32768
##$SREGLST= <1H.DMSO>
##$SSB= 0
##$STSI= 32768
##$STSR= 0
##$SW_p= 5175.98343685301
##$SYMM= 0
##$S_DEV= 0
##$TDeff= 65536
##$TDoff= 0
##$TI= <Analysis number 999999
Compound Code 99
Book Reference 9
Project Code 9>
##$TILT= no
##$TM1= 0
##$TM2= 0
##$TOPLEV= 0
##$USERP1= <user>
##$USERP2= <user>
##$USERP3= <user>
##$USERP4= <user>
##$USERP5= <user>
##$WDW= 1
##$XDIM= 32768
##$YMAX_p= 305274337
##$YMIN_p= -235003
$$ End of Bruker specific parameters
$$ ---------------------------------
##NTUPLES= NMR SPECTRUM
##VAR_NAME=  FREQUENCY,     SPECTRUM/REAL,   SPECTRUM/IMAG
##SYMBOL=    X,             R,               I
##VAR_TYPE=  INDEPENDENT,   DEPENDENT,       DEPENDENT
##VAR_FORM=  AFFN,          ASDF,            ASDF
##VAR_DIM=   32768,         32768,           32768
##UNITS=     HZ,            ARBITRARY UNITS, ARBITRARY UNITS
##FACTOR=    0.157963299565203, 1,           1
##FIRST=     4132.6476996994, 0,             0
##LAST=      -1043.33573715361, 0,           0
##MIN=       -1043.33573715361, -235003,     0
##MAX=       4132.6476996994, 305274337,     0
$$ Real data points
##PAGE= N=1
##DATA TABLE= (X++(R..R)), XYDATA
$$ [...]
20580 104210 66609 -28645 -70455 -2123 -16342 62332 86099 73468 72557 50116 25752 -2860
20568 -2860 32353 35948 1659 -38377 -58653 -50701 -72490 -8496 3500 -8701 -18183 11915
20556 11915 48599 36416 14634 50297 87469 109582 125167 123024 91668 62896 139339 153712
20544 153712 108181 91822 161350 168641 98676 50583 103639 72826 19279 13279 47066 77313
20532 77313 95189 113543 111091 94975 91101 119147 109222 131158 89594 64524 56272 52973 62332
20519 62332 30711 3223 20651 41448 15993 -22551 -12584 6004 20403 35446 50814 19865
20507 19865 45013 43918 14604 56991 35205 8787 40812 74638 99885 139624 127930 90462
20495 90462 98534 95117 82971 52490 74769 117002 113379 30774 28114 75518 65068 26601
20483 26601 54081 62596 77041 64754 53145 38817 41331 9805 -20243 12425 46943 61644
20471 61644 28052 25794 1325 33295 22111 20830 56890 119001 88812 100949 60979 20398
20459 20398 73850 105656 97516 87878 67921 70377 78593 126334 111203 91022 95039 106963 57021
20446 57021 25853 108111 151348 128090 104684 63797 58951 46916 57868 79975 59618 72359
20434 72359 88816 80423 78693 64545 53539 48567 66286 56544 35371 69218 128047 107066
20422 107066 67484 64040 90177 123026 112757 73468 67203 71071 59733 58521 61523 115801
20410 115801 107548 68457 71255 63844 46386 12289 8453 15481 54219 61897 70915 52513 32563
20397 32563 67478 33669 45015 29335 24688 23975 54028 58711 89944 143357 128454 105741
20385 105741 14903 -37209 -5398 30141 46677 57489 62675 111166 113170 89718 131895 140780
20373 140780 198810 220575 157054 110988 151331 140499 125408 107299 81763 91704 104059 40233
20361 40233 24360 44100 28104 11584 19788 46088 67200 90900 86911 16306 6362 50882
20349 50882 71729 63455 84852 118712 85664 66822 74670 74631 56784 25526 25679 75163 109439
20336 109439 83802 81875 117433 150228 117666 74034 56081 53082 86038 143807 150011 128940
20324 128940 107708 120584 120528 76607 46912 51337 78466 98926 175660 196521 172109 155721
20312 155721 120916 130944 95504 39312 40870 66656 90119 125458 95206 83476 135605 163038
20300 163038 191037 169376 118788 112098 112671 92037 121795 199081 203021 172842 141372 150300
20288 150300 144198 160859 162968 157046 144876 103249 77272 90129 98356 84476 103561 130895
20276 130895 123053 178390 232027 143647 122507 161517 143921 125811 113810 140760 90266 129546
20264 129546 182862 157857 132541 121362 120597 145779 165505 157826 217866 259956 232398 131533
20252 131533 72091 81787 76571 83336 67676 86041 93812 87473 79404 134106 169170 182596 137627
20239 137627 76821 104232 46107 93565 157096 171582 203466 203852 177798 184771 173494 145879
20227 145879 109072 129208 144466 137823 177627 246455 206368 122659 102135 76777 78289 146071
20215 146071 133808 118995 146733 168566 118283 39798 58743 64327 56201 71622 123625 181675
20203 181675 210616 167648 120136 107611 88912 69434 94633 94592 149397 150974 166133 157241
20191 157241 134495 84902 105628 105340 158779 234733 282521 265437 211868 159355 198110 198198
20179 198198 203850 183464 191297 237154 239881 247330 213555 187893 167514 132049 125578 128906 121734
20166 121734 139233 158804 177273 191595 184511 156431 180007 191735 194227 178361 165618 168280
20154 168280 160099 180112 190748 141784 173187 223164 267534 276516 260501 236104 268323 278110
20142 278110 246992 252711 285950 185271 138735 173778 170536 244178 221679 227645 209574 209704
20130 209704 196262 190363 149741 200326 217692 214773 206937 274913 276284 247079 223436 221000
20118 221000 177433 189375 226333 281765 163697 126654 145902 137979 162924 215084 240673
20107 240673 217449 239232 270926 254392 214523 268685 255795 275239 291235 226091 167816
20096 167816 199475 233229 245610 285512 326941 317090 279534 244973 231002 262678 311649 342848
20084 342848 316876 269449 294507 305179 303317 272684 284670 327371 318849 332207 312165 310259
20072 310259 261674 259397 262893 256964 286416 347733 381527 341127 285327 287761 313919 370674
20060 370674 338076 312871 322500 308625 318087 370294 344376 318940 343456 340460 283757 258950
20048 258950 329526 348447 340754 376403 338510 307523 307532 323069 328417 302910 289291 320544 345022
20035 345022 427859 447061 398731 377049 322748 292620 321321 377514 397857 357873 342402
20024 342402 294974 275881 317210 365116 316921 319134 343122 327999 345117 368836 375678 357231
20012 357231 356892 389559 421342 398939 341067 327049 383270 391096 378044 431542 489790 462547
20000 462547 410410 378417 404793 428288 421467 423687 425309 402223 422784 471482 418950 404108
19988 404108 458053 540980 566195 518878 454428 429482 400277 396882 427725 495159 424719 417256
19976 417256 459983 517069 535370 473217 436258 464431 488368 478482 521038 507191 487437 481175
19964 481175 507162 491276 483204 486336 504445 540845 548801 577629 592217 516184 513582 531388
19952 531388 506279 511545 519602 525479 511069 511218 541246 497183 463719 464975 479158 531120 572238
19939 572238 604271 603942 628163 593842 574993 583848 600562 627773 631546 664683 710936 647238
19927 647238 600263 604540 618973 617197 613239 655219 728802 708910 663720 619258 645620 680505
19915 680505 708695 727944 687854 707924 697228 693265 705616 708818 675008 625647 634565 647386
19903 647386 670136 713806 713786 712496 728045 722866 680945 703895 766411 800310 783039 730953
19891 730953 705314 751167 817688 824002 805916 746995 772689 857052 913229 833087 757494 753527
19879 753527 808616 904356 903168 900765 966759 1027854 960268 877552 829674 843512 932626 963852
19867 963852 945552 924617 933709 942082 978167 1015889 1042989 1042539 1064124 1096320 1134078 1100381
19855 1100381 1027223 985374 1028510 1074263 1137286 1162676 1194499 1170958 1128880 1148310 1238879
19844 1238879 1256698 1196059 1209626 1232157 1218041 1236326 1224797 1267442 1309303 1293824 1330828
19833 1330828 1324029 1272402 1290703 1311158 1315524 1275042 1312786 1361966 1365989 1415759 1433412 1456423
19821 1456423 1471124 1468593 1422657 1391780 1382550 1403466 1400074 1410038 1457867 1463936 1524459 1576503
19809 1576503 1588279 1550009 1553295 1538497 1565380 1607321 1570357 1570220 1561743 1566145 1561794 1627828
19797 1627828 1662045 1680448 1641038 1657672 1724876 1734111 1713195 1741453 1776873 1784383 1818965 1861804
19785 1861804 1894249 1899435 1921747 1939279 1937366 1931513 1920220 1911409 1927926 1959835 2001795 2073518
19773 2073518 2102249 2135686 2159540 2149077 2137987 2146507 2208567 2273699 2305982 2316424 2348614
19762 2348614 2418201 2440763 2433156 2435457 2461055 2517235 2508969 2492340 2546868 2621438 2698584 2799290
19750 2799290 2788850 2768552 2762477 2782019 2786056 2826785 2930669 2987842 3003578 3024987 3077925
19739 3077925 3128146 3169224 3206482 3222370 3287249 3342303 3398215 3456253 3534762 3590211 3671322
19728 3671322 3699129 3680050 3734109 3806752 3923061 4023447 4131216 4224894 4266544 4399212
19718 4399212 4481823 4559741 4599243 4632519 4709270 4799863 4917968 5007982 5147973 5275253 5336508
19707 5336508 5426766 5507155 5634823 5762727 5816672 5900492 6064722 6218438 6299580 6355778
19697 6355778 6455631 6522226 6557329 6621046 6755657 6827644 6888431 7036672 7159064 7281412
19687 7281412 7401419 7555378 7671409 7738225 7817190 7908428 8026452 8223674 8432330 8570570
19677 8570570 8659656 8769409 8980039 9146911 9301511 9472215 9681710 9909769 10076789 10191272
19667 10191272 10422922 10671748 10878606 11101198 11393286 11682197 11955924 12218614 12458939
19658 12458939 12719673 13012494 13315725 13676326 14021062 14317077 14642255 15025625 15440124
19649 15440124 15807166 16235943 16686941 17151378 17590787 18094389 18595167 19117219 19691253
19640 19691253 20252435 20881829 21541256 22201183 22939858 23622715 24402863 25142794 25919747
19631 25919747 26797582 27684931 28662317 29684141 30685140 31788965 32893520 34065691
19623 34065691 35398547 36767009 38195491 39731606 41311435 42974045 44708044 46554391
19615 46554391 48493216 50493147 52623382 54924020 57433462 60012556 62680246 65557566
19607 65557566 68654501 71935763 75343434 78909004 82708768 86695850 90953189 95457587
19599 95457587 100162836 105096301 110255198 115678994 121325071 127108684 133040746 139056832
19591 139056832 145173640 151353723 157545818 163680554 169636597 175227987 180406399 185159147
19583 185159147 189429077 193077925 195987124 197989251 199159864 199470313 198894338 197486442
19575 197486442 195188599 192138576 188446868 184172542 179345824 174167825 168682164 162936492
19567 162936492 157000713 151028191 145099676 139157520 133262222 127589602 122051600 116680381
19559 116680381 111461477 106438312 101689107 97163315 92825015 88679910 84771053 81092476
19551 81092476 77598299 74244314 71020528 68010957 65242968 62567191 59971473 57549603
19543 57549603 55272361 53055481 50995206 49008431 47105602 45324663 43701468 42156979
19535 42156979 40679146 39219857 37823698 36527597 35335475 34150090 32996240 31953237
19527 31953237 30919308 29942473 29017059 28051428 27124557 26322534 25528252 24738061 24021148
19518 24021148 23334669 22733133 22181653 21586644 20992959 20373430 19801669 19247306 18766366
19509 18766366 18357543 17883254 17421521 17014360 16606737 16155550 15741771 15330328 14929814
19500 14929814 14558648 14231029 13893216 13533869 13189942 12919989 12686581 12412116 12138659
19491 12138659 11873161 11565690 11326460 11092894 10820646 10621944 10421037 10185320 9974041
19482 9974041 9757215 9532213 9379990 9189854 9033135 8827158 8602536 8474600 8337229
19473 8337229 8129476 7954873 7832056 7666636 7503501 7339177 7157220 7044742 6941575
19464 6941575 6767920 6632582 6472569 6318445 6207796 6170761 6051550 5938929 5824823 5661269
19454 5661269 5567318 5514250 5476635 5363838 5242308 5191754 5170336 5112909 4993554 4861687
19444 4861687 4802136 4735037 4688748 4691036 4686814 4594629 4546388 4490136 4449436 4423164 4383042 4302031
19432 4302031 4218790 4182620 4179154 4103743 4041270 4001852 3952094 3897844 3841956 3831682 3805257
19421 3805257 3767141 3670946 3616418 3579860 3557092 3556073 3528196 3523923 3537221 3492896 3459454 3379010
19409 3379010 3255281 3192205 3155955 3072679 3001134 2959014 2998289 2994978 2934184 2906555 2859080
19398 2859080 2823430 2770667 2722565 2698148 2740310 2770103 2717477 2701646 2669833 2618454 2552772
19387 2552772 2525705 2542249 2542264 2557689 2564461 2514790 2508009 2539303 2516851 2513459 2511913 2464901 2442012
19374 2442012 2434767 2405946 2383373 2309996 2262272 2230876 2238942 2158518 2122713 2101351 2121636 2124197
19362 2124197 2073631 2039682 2039020 2067159 2069248 2054938 2022887 2038081 2038682 2003364 2005506 1955237
19350 1955237 1907918 1863264 1886467 1887205 1919490 1945344 1875028 1858554 1839268 1807993 1766032 1734178
19338 1734178 1767769 1752572 1742135 1691730 1588960 1603714 1648012 1625576 1642569 1632584 1603243
19327 1603243 1618171 1636916 1632627 1591701 1571446 1498652 1425098 1381029 1387581 1440781 1427168 1413797
19315 1413797 1411012 1410300 1376721 1331691 1294770 1337923 1362349 1345414 1319593 1303397 1297585 1294936
19303 1294936 1290097 1318815 1310677 1275434 1307055 1300341 1297586 1255777 1256949 1257809 1229223 1220132 1224119
19290 1224119 1240730 1229819 1164799 1156776 1154301 1124208 1143947 1161808 1099357 1081460 1124760 1143553
19278 1143553 1117542 1117689 1123249 1126838 1090676 1048450 1016211 1000573 1057798 1136663 1154065 1095696
19266 1095696 1130179 1085962 1054709 1023917 987258 967479 983624 976690 1037328 1014627 975812
19255 975812 948478 901081 904063 891784 876152 898607 922968 912607 884199 873093 864171 891944
19243 891944 879479 895566 880638 868401 887034 913484 904782 921735 930401 877608 822884 761383
19231 761383 793672 824939 838708 833835 760561 742942 781859 791770 804958 816748 800607 839314
19219 839314 835275 751410 685606 666342 677168 699155 733275 704523 634855 653998 653478 681664
19207 681664 703123 710859 695839 695457 719308 750312 696349 732699 734604 643508 623323 644438
19195 644438 664970 686878 683662 679502 692384 706532 715480 715724 659050 633896 616883 644972
19183 644972 571013 497697 510593 572330 548975 529326 576914 571960 563706 606490 649217 690666
19171 690666 715159 615645 580909 515914 533140 551254 577771 606518 615897 590534 596611 596284
19159 596284 558529 516815 479806 484813 494210 496350 493636 499677 548792 589923 587677 571732 491736
19146 491736 463588 462740 463462 502439 518372 514456 501240 496636 547122 533888 550409 584873 570827
19133 570827 529203 559039 561645 521733 462038 465580 476493 465511 427777 435244 436235 460626
19121 460626 462328 441668 501677 511264 476208 455544 463265 443523 413746 425766 438693 445746
19109 445746 437595 421019 413127 457596 485817 470956 481855 471735 462346 468051 436422 390427
19097 390427 372542 387210 409338 396626 404480 355178 336447 370642 437810 469585 449595 391549
19085 391549 338069 293136 283823 323614 367315 354413 341819 378779 382101 354090 296010 245359
19073 245359 253968 322125 331866 300491 351564 338809 314780 302078 341213 305760 288036 307620
19061 307620 328364 364322 398384 436788 436464 375994 367653 366384 328521 266566 231736 244016
19049 244016 303125 332173 338315 310177 331533 370829 367837 368910 352034 350021 432956 455068
19037 455068 481641 451137 411539 344185 305917 283025 308851 284141 235883 249373 274339
19026 274339 268268 254378 297929 306316 290063 273603 287524 286390 308756 298927 282003 331776
19014 331776 328260 302763 282448 233885 228898 248877 282244 260860 227591 187878 221641 234393
19002 234393 232450 195377 236624 276977 315607 324063 331092 358001 346539 340339 346068 370608
18990 370608 383175 353714 291514 205647 208397 225994 275033 258009 186492 199214 232919 286883
18978 286883 253806 236866 236481 261764 275422 298322 287798 252483 259054 281393 281732 243311
18966 243311 215848 188992 219599 216515 216861 200513 228473 287972 257795 220068 211375 239101
18954 239101 266864 316908 352206 350986 325549 311734 315901 307364 334452 324033 286033 231982
18942 231982 223815 237942 221598 191330 198734 195396 167758 158004 137620 111574 169273 222059
18930 222059 174931 130945 134634 178281 186287 216904 197092 149229 180693 171950 142067 201657
18918 201657 239576 185818 216885 242073 251360 229543 192714 136482 124772 142627 164098 176050
18906 176050 151137 214657 252723 226356 172331 202739 193755 159882 172726 216046 195625 130699
18894 130699 94857 126904 158372 141441 108748 136555 135376 136451 181960 209954 208080 192476
18882 192476 189187 190322 173991 141932 222374 235857 170471 154298 220512 260917 284211 279533
18870 279533 241506 183590 238738 272216 240680 264024 257219 249112 215871 204732 189745 234582
18858 234582 219157 185706 178302 224738 282470 266349 277798 229887 172761 149111 112295 95122
18846 95122 143835 144821 153189 130208 146368 172461 180576 181726 188783 138524 70529 106209 152677
18833 152677 140825 163093 183102 138733 127216 142403 115229 115609 136873 130009 162608 189112
18821 189112 206717 200793 133823 155013 173334 159785 134769 146135 152134 127768 86065 91923
18809 91923 156174 171064 194214 228939 175165 183542 200721 161206 140334 178511 179226 145426
18797 145426 147760 222623 214728 150516 93599 150638 186093 201245 167249 164586 185989 200884
18785 200884 213248 197875 180400 192911 180113 166276 161977 192606 222977 207410 122292 102262
18773 102262 149887 200144 168831 117441 96530 120279 109550 169311 209864 222916 203625
18762 203625 190163 187134 160091 171589 168139 138351 118302 116524 86585 71587 73757 128811
18750 128811 170782 105436 117247 169367 134076 108797 162825 218652 206963 161443 128376
18739 128376 133541 133602 109322 83345 112706 128878 146396 176442 199756 145865 132080 160383
18727 160383 178930 220328 222905 159446 143632 116400 78263 27241 95152 157702 167483 226454
18715 226454 248290 196279 148718 142464 151589 164630 174394 148819 163342 143164 127500 111477
18703 111477 84607 90999 103379 45412 81095 112300 120091 129867 129594 141811 112659 79752
18691 79752 88232 125476 126582 132780 133532 92252 82478 104159 140594 111320 120398 117554 81798
18678 81798 103871 104016 147802 110929 80765 74316 73510 104490 103846 66158 31730 72358 99728
18665 99728 87100 85812 107493 105841 113914 169250 188187 189061 187802 190326 154830 134214 88120
18652 88120 61631 38322 -5101 37733 96024 115526 140118 162386 110288 105373 141642 180108
18640 180108 220893 115229 61008 73208 80886 9609 27907 91122 84606 154298 150616 103959
18628 103959 75358 63522 74270 37532 39825 87548 106749 89204 119494 165742 116370 108300
18616 108300 129892 150089 103311 77282 47104 48211 33254 53125 61526 98117 55520 -18120
18604 -18120 -58159 35445 117483 162382 91606 51729 78416 55570 10741 -20320 1032 9756
18592 9756 19285 12655 54645 40501 68019 52616 82781 118742 137452 94742 47436 51397
18580 51397 92390 139926 135382 67566 64800 113414 129950 163842 159033 152716 132029 98263
18568 98263 113232 141728 127703 102875 105729 102839 45238 -10858 -9127 28833 58882 76906
18556 76906 95598 110217 109550 121643 167066 157803 134643 127264 95419 112891 32966 -27370
18544 -27370 1044 9113 16296 21392 30183 57518 28210 17139 17296 15065 17987 -3312 26075
18531 26075 41767 21092 -36096 -49851 -89412 -17001 26492 41419 37055 97144 150377 143535
18519 143535 100561 80020 59297 100326 145199 149556 166432 100555 68369 90865 102288 72589
18507 72589 16569 19461 61180 18778 24099 81010 102439 34793 6871 -3288 75561 126774
18495 126774 81561 22168 36280 117476 170778 139304 120309 50912 -26080 12703 42111
18484 42111 34347 58850 64894 50286 33181 9206 -2552 54736 83489 98575 92332 76864
18472 76864 61184 99287 86468 64864 56923 37048 70185 72249 35648 64963 72535 60774
18460 60774 46450 56630 65666 51172 117213 100491 92768 83460 90242 97836 84124 81558 29087
18447 29087 -14447 -30993 20198 50854 40916 -19844 -41076 -1392 65891 94230 63012 352
18435 352 33705 74184 109561 125693 102424 77250 73990 49709 60782 30484 48184 34277
18423 34277 -12297 40724 93626 112983 90895 33873 -47824 -65181 -48219 -74108 -63529 -5323
18411 -5323 78294 87957 65217 67421 27200 -11218 10564 -12731 -48756 -9610 34429 99849
18399 99849 118558 98470 86868 145791 181316 87070 27587 31305 42696 100495 118447 98210
18387 98210 86527 101125 111672 100920 97204 92775 114868 178200 137228 137910 126359 93644
18375 93644 20820 33388 59912 118078 112450 76988 42284 15832 -2091 75390 42622 4634
18363 4634 52718 89777 72161 107924 148950 112912 64770 45959 74174 32787 -13514 32831
18351 32831 92598 70243 64869 117315 145817 95677 92714 123824 103736 25847 22842 28027
18339 28027 60755 81320 45998 -5081 28358 64790 110759 133666 89413 51725 40196 -14832
18327 -14832 -23753 23367 -660 24916 40719 67046 92660 98042 111036 123926 140154 163798
18315 163798 107922 111982 119784 119503 118699 110103 119238 126099 108104 90278 59553 36378 117536
18302 117536 115639 77032 65066 32256 50449 61259 92630 121638 122583 118087 106153 113667
18290 113667 105684 135391 135962 87030 77773 57934 74074 12697 19516 37827 40409 41599 33196
18277 33196 76973 91638 33272 12617 11200 5247 33238 6559 34816 -3319 20252 86232
18265 86232 143003 141573 118142 130633 114972 105365 40211 -9870 59863 90706 101005 59401
18253 59401 -3573 6075 18155 -19701 -81943 -10047 39693 49903 55817 21681 -9641 -84674
18241 -84674 -100496 -66505 -74456 -71770 -39266 -58615 -59060 -23998 55969 47382 27697 -12355 -8413
18228 -8413 5179 -2618 272 -28452 4761 67212 91708 101686 78175 49343 -11634 -45098
18216 -45098 14281 -10298 -7494 24494 8143 13109 95284 139730 157989 160971 183296 163365
18204 163365 127210 78873 72681 61565 15322 -50345 4889 11614 43423 38985 40399 53703
18192 53703 22245 12459 24189 62166 108701 88448 65123 104299 167749 110116 66165 104406
18180 104406 85489 35148 7815 -4298 -34516 -36165 6063 34283 32126 17276 32761 23563
18168 23563 60430 54555 32196 43113 52941 52034 37052 47860 53332 94363 46744 5017 23432
18155 23432 39677 26118 24002 50225 30851 -4144 -39743 -43538 -37755 -7049 -31757 -35783
18143 -35783 -13626 -19647 -69487 -75291 21371 103413 57042 -3193 -70559 -32304 -8200 16323
18131 16323 44919 70823 54243 35116 91509 99676 54138 37393 -10021 -52322 -54863 -57227
18119 -57227 -71010 -14877 -24991 -50365 -2394 40798 54502 14287 -13197 -38901 -70457 -59284
18107 -59284 15766 26209 8926 33557 63732 40252 14872 27995 57017 94116 93461 62055
18095 62055 75575 103974 62554 22930 -12120 -44970 -67465 -51547 -42949 -21076 -6075 -735
18083 -735 2334 24405 -602 -12810 29880 27393 59240 122131 123846 96674 50756 60992 66813
18070 66813 36547 14069 30508 72118 74331 92931 122175 98030 108727 155184 135596 80516
18058 80516 88845 54440 49813 66939 59400 54513 -7928 -93352 -71971 -36462 -2398 40818
18046 40818 27209 12177 -41928 -3760 69546 171207 163530 94320 28631 30735 19851 -20922
18034 -20922 -40607 12679 -19798 -79451 -83214 -51630 19942 84914 53527 -25536 -24269 -44822
18022 -44822 -30272 48369 65827 84684 4734 4325 -30708 -28869 -17457 26096 32651 81261
18010 81261 111312 139972 179356 154273 141662 117363 141301 92211 36511 22977 72602 66135
17998 66135 9370 -44389 -92296 -64690 13876 -31342 -32936 -17483 -17611 23918 58780 67232
17986 67232 38543 63503 67163 12294 -38392 6614 58019 77121 74333 47622 -2841 6580
17974 6580 11865 -32972 -62129 -65893 -44456 17565 65515 99292 56295 -21034 -50787 -21130
17962 -21130 -11767 -14443 13825 51239 59127 73997 94234 104896 85269 127413 197618 219632
17950 219632 178653 100896 76470 82911 83025 113324 93730 84306 98864 111274 138371 159185
17938 159185 141760 109387 73937 13817 -54735 -31052 20838 -34902 -64761 -85672 -51312
17927 -51312 -70330 -71181 -32247 -49471 -56220 -26523 -16664 -12591 -1741 5925 28006 38095 61418
17914 61418 98992 39772 -1358 62161 86971 62250 5344 15199 -20213 -11496 -17656 -32578
17902 -32578 -19949 -3773 -21989 -4958 27526 39692 -2627 -22014 -10920 -10720 7776 15528
17890 15528 23603 53100 53531 -8072 -7742 62789 105339 41270 -21037 -59585 -42337 -31805 17967
17877 17967 31831 22498 59653 29387 -4787 -17495 7499 55889 28113 -41479 16163 55804
17865 55804 58913 -26354 -34623 -28561 -30613 -35515 -33653 -25349 5545 -21219 -53982 -32731 -4050
17852 -4050 48474 75394 74315 11593 14916 2756 34904 27094 -10327 -25389 -3141 -20743
17840 -20743 -56885 -22644 11601 -18303 -22387 37821 -125 -49136 -18057 -3337 -5768 -14396
17828 -14396 12723 -33574 -67314 -65552 -79675 -87819 -46270 -16974 16476 -2922 -27063 -27123 14787
17815 14787 28012 6129 14238 -4178 -33416 1943 55678 23183 -24584 -12719 -9588 -43306
17803 -43306 -124931 -130361 -87827 -47359 -14416 8055 51334 58604 46794 55774 27090 19829
17791 19829 36316 78357 80570 65143 37718 30195 716 53221 93822 29148 30229 46939
17779 46939 36599 22998 24972 50796 88150 66000 -12162 -9526 6300 24419 -1943 -12675
17767 -12675 -8394 18846 35690 37989 29304 57544 94385 18734 -50623 -61657 -57444 -15957
17755 -15957 15032 15834 -9570 15183 52476 45288 -1417 35059 38745 6701 19030 26483 4137
17742 4137 39472 76076 81882 114170 90284 53253 72741 67086 31040 45677 45648 10426 -26597
17729 -26597 -84616 -25444 1941 -2844 17168 60401 4860 -20904 -39087 -13377 -15007 -60453
17717 -60453 -39873 -761 27258 52023 -3014 -80891 -87361 -89508 -52387 -55339 -47604 -59197
17705 -59197 -49289 -29564 -83678 -88954 -47062 -45815 14227 46635 -1038 -40499 -66132 -65643 -11476
17692 -11476 6974 -5865 -39321 -58365 9763 46326 47425 -11418 -15415 9099 73772 58045
17680 58045 53383 51315 30722 19756 8664 -2751 -5716 25955 31373 36001 61709 81527 71204
17667 71204 27583 -4958 -21352 24292 106061 144966 101183 20554 38438 105786 86322 42299
17655 42299 -43743 -60735 -38059 -24915 -9538 -12761 -28632 -18124 4249 28083 13680 38080
17643 38080 45308 7977 -9440 7961 29647 76205 110232 77066 48937 44621 46477 63183
17631 63183 110377 115995 122010 82761 57589 63797 29310 -17112 -38363 -97585 -103942 -44475
17619 -44475 -47753 -33404 -90340 -134345 -165631 -104900 -31973 2371 -22067 18124 -21107 -31032
17607 -31032 -23494 -24276 -10313 -21284 -27934 41295 55328 13618 4206 -8353 25625 10154 18419
17594 18419 15782 -4859 9084 3274 -19166 -8292 15546 -10756 -38743 -17731 -31509 -44781
17582 -44781 -7917 -52453 -84423 -76801 -73136 -42583 24659 49522 31739 5500 -9713 18523
17570 18523 60273 32389 -20432 -7317 -11571 -2307 -7969 2691 52127 11648 -25265 16745
17558 16745 33961 -8934 -37161 -36469 -6496 724 8239 22228 15993 -25576 -15957 -91837 -81560
17545 -81560 -18186 22693 -10771 2813 19928 57850 72582 50171 56516 97246 20971 -32875
17533 -32875 8777 6930 -41512 -22302 8020 43087 32668 45411 57966 30854 25521 48238
17521 48238 51594 36109 64765 70343 63953 49010 61158 21018 -16297 -49806 -72647 -90517
17509 -90517 -22970 31552 -11292 -43931 -79872 -46158 43490 71857 69655 20052 -23098 -37102
17497 -37102 38978 48112 3464 -10086 -32624 -30897 -59668 -27949 8339 64724 98399 48694
17485 48694 -25646 -28500 -44480 -61903 -104935 -131646 -115337 -103208 -117977 -142762 -152886 -116701
17473 -116701 -75803 -70012 -41812 27301 69804 38816 22872 75383 86827 40508 -9424 44762
17461 44762 62375 50764 67666 53007 -9948 -63996 -35192 -13414 -4377 1459 5904 50525
17449 50525 64287 82432 65317 29908 20421 -3067 22604 78894 35863 6400 54881 52375
17437 52375 -29557 -41606 -62044 -77834 -62160 -10837 -9500 -34746 -43443 -6026 17386 56110
17425 56110 21483 -57526 -82688 -1356 34789 6720 -8675 -46759 -15867 39806 64924 71370
17413 71370 24568 -16126 33826 89037 100037 72494 76275 90724 67558 66866 55102 55266 22830
17400 22830 -35348 -29196 -33815 -17433 -41940 -36446 -11046 -13091 -49347 -64580 -66317 -88766 -50239
17387 -50239 -40302 -60569 -56457 -43741 538 -10295 -11211 -4418 -16619 -9636 3364 1964 -33332
17374 -33332 -15485 29497 -9504 -55072 -33408 -6502 1778 -43884 -16257 -20077 -52157 20511
17362 20511 53664 -8418 -31983 -40056 -40854 -20410 -39651 -64035 -13671 34181 14091 171
17350 171 41524 29637 41560 64620 60501 21549 54603 73427 44863 -14771 -19649 -25564 -11672
17337 -11672 -46437 -100897 -102544 -52238 21170 28246 14099 27268 51608 25340 62740 106927
17325 106927 63617 14767 -4809 -305 -29615 -81971 -89899 -29919 -2062 -28817 -30606 -7572
17313 -7572 -9051 18170 35231 22719 48654 62835 -11526 -26849 33235 8220 2107 -3005
17301 -3005 -34296 -21351 37438 79872 79835 79017 24003 6369 -41631 -25949 -23586 -33647 20074
17288 20074 -3310 -28816 -49364 5890 15549 -18267 -36368 -7461 -24651 -48150 -29674 -19959
17276 -19959 -10195 -10774 4476 10198 8676 -14601 -73246 -66776 -957 -7622 -54959 -60372 -38743
17263 -38743 -16665 -21456 -71521 -25100 16925 30660 67836 74166 -17686 25324 52969 42635
17251 42635 1411 5484 -577 -5876 -10835 -17972 -35392 -15022 27004 43389 27696 23614 11347
17238 11347 -12279 -80686 -84837 -51400 24634 49626 66928 58940 76796 76371 5774 -18550
17226 -18550 5751 -23712 -32402 -2950 11522 -11190 15511 -30191 -64873 -28173 -53550 -95136
17214 -95136 -50332 -5977 11618 28824 16162 -25621 -15563 36782 66637 19906 25859 29463
17202 29463 16884 24690 19834 30741 83428 55667 6301 40329 57665 59048 39226 -33930
17190 -33930 -78935 -87435 -97440 -100777 -72900 -60700 -42200 -21436 45721 16246 -56594 -66066
17178 -66066 -43371 -75992 -61455 3619 44734 5452 -1547 36006 16938 5496 31013 -1753
17166 -1753 -42586 -22389 15118 31645 40911 25045 6947 10743 -3421 2400 37079 -1797
17154 -1797 -5711 2319 16682 22160 -23825 -40657 -49830 -78523 -47311 20574 67129 55979 -17224
17141 -17224 -44163 -43856 -42804 -43328 -40628 954 1027 39762 29844 7233 -51519 -37203 15209 43921
17127 43921 53921 53009 88570 102862 71930 26497 -19803 -78477 -101037 -157728 -170928 -160207
17115 -160207 -180507 -134056 -114968 -77819 -104556 -126697 -129630 -114429 -86427 -75227 -69605 -40392
17103 -40392 -76690 -93775 -83940 -90001 -48406 -5567 25825 54490 58773 53329 2899 -43590
17091 -43590 -63575 -76546 -51529 3796 93852 96467 66421 10769 -45058 2588 -7353 -8849
17079 -8849 1303 -4881 15139 -35837 -31998 24487 26767 33307 19026 -28231 -24242 -37855 -84736
17066 -84736 -80373 -64885 -82067 -55815 -28587 6888 14417 17104 12003 23779 49127 63339
17054 63339 27317 -10178 -46776 -85437 -71634 -65066 -106367 -115129 -104645 -79320 -24402 -2885
17042 -2885 15244 16139 12289 48739 54363 23246 -8976 -74751 -79962 -64353 -62467 -54856 -12361
17029 -12361 -32755 -31952 -45788 7333 8844 -48387 -26091 1294 32661 62116 59904 54254 100
17016 100 -15622 14039 20086 26526 44230 50842 29705 21879 90766 36011 -24762 -34647 -46534
17003 -46534 -2823 -23758 -104181 -132299 -104313 -29141 12455 15594 -33353 -10811 14418 -9384
16991 -9384 -26080 -28303 -27713 -56071 -26520 9329 37873 34071 60808 21140 -58756 -51688 -30497
16978 -30497 -50808 -113454 -137747 -101544 -75938 -77756 -40379 -21791 -18270 -43317 -71823 -69773
16966 -69773 -90981 -78397 3625 -10857 -54557 -44282 2108 -3767 -14624 -15331 -21384 -23221 49498
16953 49498 56948 49654 58717 51020 9249 -20666 13795 15597 19105 13682 4326 43002 91053
16940 91053 69891 29329 1804 9500 -7972 -34655 -35398 -27263 -26603 -51832 -38449 -983 31150
16927 31150 15471 23929 -13007 -49184 -60279 -20409 -24927 -56146 -14901 15212 2894 2386
16915 2386 -20047 -31783 -8516 24518 -47343 -92614 -89451 -61398 -94332 -66313 -103178 -143042
16903 -143042 -85523 -70137 -63973 -81117 -74998 -50224 13069 15074 -39189 -27131 41774 42715
16891 42715 20798 8792 -36532 -39242 -32565 -17726 -64311 -51249 32182 106931 98553 50975
16879 50975 -1377 -65085 -123215 -83259 -22269 -38668 -33203 9371 27812 37717 42669 -19394
16867 -19394 -5872 2741 -52378 -85078 -59281 -60944 -59689 -22646 5555 12818 19098 1836 -11959
16854 -11959 8803 34363 19241 -36784 -35261 -5625 17744 79815 91277 56394 33662 34947
16842 34947 -3056 -11150 -15570 -23278 -81506 -106909 -34488 18416 37249 -28503 -65446 -121005
16830 -121005 -125582 -94421 -77474 -62586 -67546 -69675 -87724 -15982 57056 32808 -24873 -9806
16818 -9806 -1677 2732 25065 59750 76053 40209 6020 36335 91657 79409 38320 -16809
16806 -16809 -36553 -3940 65262 69970 -15623 -98723 -139356 -128503 -84938 -105031 -90658 -28588
16794 -28588 -2129 21373 30381 16916 -32709 -28960 -4818 -25771 -27182 -4337 -19919 23055
16782 23055 16236 1547 27778 24489 40708 24712 51050 36114 21096 -7471 11056 35108
16770 35108 9183 11777 63067 24467 -25893 5249 41129 74186 91626 89011 100145 76670
16758 76670 51137 78456 65981 5113 2998 -41942 -19981 48783 76168 62474 61919 14730
16746 14730 -28334 13657 28705 14844 35462 -36634 -30789 -58014 -36031 19936 14767 4076
16734 4076 54115 77723 83572 96104 82313 85609 84462 22444 -34195 15088 79226 95227
16722 95227 51405 2138 -46022 -65074 -46433 -56918 -84615 -66761 -32027 -44367 -49100 -70700
16710 -70700 -69912 -95475 -126152 -127568 -87254 -30793 -47580 -35484 2375 14772 9485 11144 50190
16697 50190 27851 59946 51302 45033 85386 106638 108887 117088 131667 90462 64542 35256
16685 35256 26484 9555 -2729 25821 59944 24876 20982 66800 57337 32527 50110 19271
16673 19271 -4857 10710 -42613 -51509 23806 52335 49901 40910 -5702 12363 60571 72864
16661 72864 56779 85882 52542 33957 42303 91341 76789 34901 40996 72444 69938 68028
16649 68028 52554 59547 51028 59510 63100 57606 44957 22835 -7582 -31920 -17342 -55408 -63362
16636 -63362 -37180 -18369 -8627 -37347 -88298 -89737 -101390 -99218 -48091 -8203 35161 20354
16624 20354 14090 40070 15309 -11343 -10602 24202 18537 15346 -24169 -14341 6987 19417 50483
16611 50483 40192 -49936 -56850 -48504 -21477 18384 9610 -34479 -22209 27939 42534 -21370
16599 -21370 -63635 -102517 -99862 -124282 -94047 -46262 -59721 -50118 -3144 25465 45216 1692
16587 1692 -30734 -69093 -107657 -71536 -34874 -6393 5791 -7321 8545 53709 14693 -8369
16575 -8369 -7423 -20866 -20947 -57090 -80250 -82998 -90396 -23303 565 -3870 -21149 160 -27650
16562 -27650 -61633 -61216 -63561 7713 46991 -56612 -126443 -103180 -82495 -75670 -45349 -1238
16550 -1238 30511 -38515 -110359 -113287 -50459 -110129 -130283 -89405 -70075 -107871 -158557 -140431
16538 -140431 -102281 -80171 -57974 -36619 -17202 11615 18368 -14579 49936 93370 33176 -28556
16526 -28556 -31559 -10514 -40159 -69209 -55496 -20220 -13415 -46456 -37097 -66334 -65384 -26152 8907
16513 8907 -7508 24617 1979 -22922 2161 46083 5101 -43007 24643 41697 63710 -3588
16501 -3588 -24393 -63480 -23134 -26935 -63406 -17073 11594 -5049 -24305 -20110 27063 39579
16489 39579 -25738 -44805 -33801 -5313 28789 -5543 -25170 -59794 -5915 22310 26816 -18714
16477 -18714 -28724 -18374 -48923 -12652 -44299 -53610 11477 38461 51556 36771 -12827 -36154
16465 -36154 -3996 -17858 27791 66756 34205 -31906 -64701 -78774 -77042 17305 30807 -29359
16453 -29359 -24546 -7200 -9196 12046 -29008 -42967 2764 42253 47773 16461 15894 6085 -17231
16440 -17231 -28564 -21767 -12602 -30841 -3578 -37832 -17887 753 -33798 30983 55418 -3518
16428 -3518 -22963 12824 69168 10132 -43437 -76813 -74082 -50192 -25937 -8290 -3993 -7165
16416 -7165 -48946 -6657 64954 86893 47691 13944 18905 3184 -15361 -11098 -8010 -4533 -12363
16403 -12363 -9892 -2511 -17663 3792 54460 22848 -15051 -26631 -34305 5484 11111 -13567
16391 -13567 -48462 -109189 -124081 -135967 -101317 -113222 -116754 -88515 -70326 -58827 -47203 -54570
16379 -54570 -69544 -22404 43364 49101 -30299 -84878 -97243 -29832 -22184 -3083 -13787 -16079
16367 -16079 -28097 -38045 7327 -33628 -22327 47055 83426 22949 184 -36371 -35157 -30963
16355 -30963 -28745 -71949 -124267 -123220 -101621 -75085 -130320 -91373 -18112 9749 -51655 -121542
16343 -121542 -100431 -59611 -44335 -95552 -138372 -93659 -21362 4869 32062 56254 33993
16332 33993 18207 -3370 23940 39684 26309 30142 70052 95858 97409 20668 -4633 -22942
16320 -22942 -24689 -59047 -78958 -47050 -20253 -15910 -42998 -65910 -58321 -83545 -111924 -55694
16308 -55694 -11209 74360 41734 -18947 -18479 -11016 6839 -6774 -1361 -39223 -37286 4795 38683
16295 38683 21332 -32204 -3430 -9352 -47175 -43778 -63066 -112438 -161176 -177566 -110635 -91865
16283 -91865 -85097 -20604 -21056 29395 34341 21556 -18994 -32540 33901 35872 15763 -72781 -145659
16270 -145659 -70504 10569 -4531 -27410 27005 77523 63454 79521 26227 -12744 -12224 -49866
16258 -49866 -6561 56745 24972 -4050 -84469 -102798 -51216 3965 -12735 5327 15887 -40549
16246 -40549 -53988 -33915 -180 14922 -6759 -62859 -81064 -55985 -35326 -44781 -1819 49580
16234 49580 87548 67825 58940 -12769 -45111 -70482 -68075 -41944 -16392 -36245 6812 23009
16222 23009 62169 40114 46769 20560 -24318 -35326 -50157 -92135 -100746 -47102 -11665 -22403
16210 -22403 10070 37923 76877 16597 -53170 -86839 -71892 -20586 33498 35851 -18735 -69454
16198 -69454 -14371 46465 36051 30601 -9466 27610 -25122 -49487 -35617 -72950 -53484 -62146
16186 -62146 -55459 -33891 -75650 -98179 -85326 -89651 -54385 -37036 -42866 -35158 -63109 -50403
16174 -50403 -70922 -56991 -94739 -134515 -94113 -90370 -62056 -19734 45611 24606 -9301 -16545
16162 -16545 -58689 -45489 -40051 -52624 -38353 -108389 -152737 -135423 -82562 -46622 -25278 -7235
16150 -7235 64965 76340 29380 9207 -21208 -10550 -69459 -109564 -141252 -105986 -17550 -9277
16138 -9277 -29426 -38218 -15035 -69035 -83884 -63889 -97399 -112787 -96478 -107309 -27780 7796
16126 7796 -9150 -2160 38577 36429 -28174 -41506 -83009 -102996 -100983 -110568 -137248 -109314 -54603
16113 -54603 -34315 -10861 -39742 -53610 2089 9897 -89718 -73759 -2552 -33452 -90672 -103460
16101 -103460 -112471 -45193 -9826 -41559 -95934 -79328 3807 27841 58050 18606 22521 39764
16089 39764 64281 18673 -21513 -32856 -57760 -17832 -18841 -20021 26399 3253 -19509 -42889
16077 -42889 8908 32334 28322 6844 12604 22333 -9080 6980 31250 15190 5869 -3270 -27125
16064 -27125 -52299 -30816 -22942 -43079 -55488 -30505 8368 48667 42876 43682 38261 -15481 -102474
16051 -102474 -99666 -47443 -29410 39465 74860 72540 40327 65202 53896 75855 77154 46351
16039 46351 -13740 -48316 -45409 -3194 -31938 -20242 30318 9762 -2047 -21639 -45510 -45840
16027 -45840 -43939 -27926 -40879 -71490 -84905 -32378 -27231 -19752 -42315 -38544 16995 -9004
16015 -9004 -42866 -11958 24760 26310 1434 7598 -16650 -16263 -8709 -32855 -38382 -34833 -27703
16002 -27703 9774 56190 48977 38628 21980 6262 -828 -53035 -44758 -37387 -35718 -30974 -43
15989 -43 9931 33607 33689 -37554 -86689 -75362 -72203 -88627 -95830 -109626 -61926 -60109 -88070 -90586
15975 -90586 -45137 -25304 -43169 -58694 -13207 -51110 -50002 -31622 -12975 10479 38468 88450
15963 88450 92965 75157 29800 3391 14797 -47012 -81778 -138150 -135897 -65350 -67682 -108805
15951 -108805 -132525 -166002 -144701 -115110 -50930 17132 -25148 -44813 -57844 -70607 -92672
15940 -92672 -90222 -60674 -8816 7489 21186 34219 20534 -50050 -21394 -2394 -27563 -14904
15928 -14904 12910 -26410 -55881 -38384 6005 4042 3333 -36795 -60598 -71399 -75346 -45829
15916 -45829 -23655 -57932 -29468 17855 -1297 -11472 -41326 -56554 -30012 -26784 -24346 -66794
15904 -66794 -92752 -70432 -105004 -105625 -59874 -56891 -66953 -86767 -69191 -51145 -35179 -42186
15892 -42186 -33333 -60951 -68587 -55004 -68251 -58309 -10012 6914 -14205 -51084 -63521 -19419
15880 -19419 -35450 -68543 -24434 33632 -19064 -51117 -11755 -9989 -60853 -43010 10888 -42801
15868 -42801 -71296 -56187 -34621 -35593 -85526 -21180 21467 33171 12442 -24795 -79861 -22636
15856 -22636 17000 -6831 15646 26335 24913 11852 -15370 19208 51097 42610 27884 18896
15844 18896 -21972 -4718 38444 13025 -12900 -29642 -40026 -44750 -23686 -49968 -96918 -92122
15832 -92122 -8361 46005 56563 15734 21684 71423 63451 54623 19903 18077 31103 14514
15820 14514 35370 -4918 -30272 -67661 -74624 -55732 -52657 -40589 -9400 -55022 -131159 -128929
15808 -128929 -107854 -122860 -112497 -66143 -35575 -43784 -37751 -60011 -86433 -35737 49644 78920
15796 78920 16744 -42806 -54733 -25962 25953 26667 -32688 -79049 -20767 -48620 -35313 11068
15784 11068 23276 -17930 -16411 -20519 -50672 -93035 -105504 -99064 -93034 -105323 -122497 -124146 -64537
15771 -64537 -50222 -50038 -21125 -37629 -26748 -10120 29208 19051 -26440 -524 19520 16822
15759 16822 -12069 -34464 -54487 10041 15421 -1874 -21572 4190 56704 32060 -14097 -29832
15747 -29832 -20337 -39465 -109981 -131061 -121601 -110922 -37473 -21116 -37121 -57715 -69874 -66327
15735 -66327 -16494 -19095 -8088 21112 16644 -38064 -25439 -10533 -8137 -60886 -42806 -2222
15723 -2222 25074 -12867 -87245 -128490 -139290 -79706 -19671 -6126 6782 26380 35202 -16652
15711 -16652 -1912 23983 -8412 -48954 -103954 -114883 -117269 -98296 -36620 -47256 -19814 -20245
15699 -20245 18690 55612 29185 -1953 -43547 -45442 -48513 -3219 22208 -40860 -72194 -88258
15687 -88258 -69591 -9092 7548 -4902 1433 35186 27826 69884 115783 153211 98776 32431
15675 32431 -5879 8736 -24303 42660 13323 -63628 -81120 -56861 -40699 -18977 3356 34036
15663 34036 37267 44878 19048 22229 -3185 818 2852 29979 37865 29401 -20145 -15440 -31866
15650 -31866 -76228 -38505 -43690 -9981 6777 -13174 -7038 -9126 -10990 21638 12949 20083 33216
15637 33216 50049 11474 -53701 -29791 15469 3244 -11870 49455 58971 22171 -8371 22265
15625 22265 46127 15993 -19828 -17962 -26419 40908 -9789 -34001 -52250 -67992 -50452 -33271
15613 -33271 -56845 -82279 -47559 9787 4920 -43105 -40986 -15191 942 59200 92548 80120
15601 80120 11119 3520 3350 51864 61980 68414 31310 -27764 -7636 4769 -28100 -22782 -53654
15588 -53654 -45849 -54842 -47904 -29739 -40066 -30369 -64364 -110101 -70681 -92442 -114400 -94128
15576 -94128 -50411 7694 16636 -17465 -43535 -57120 -110996 -110166 -118044 -114599 -73789 -62759 -123011
15563 -123011 -203297 -235003 -174759 -150549 -112059 -71376 -13376 24952 24532 1463 -44552 -35347
15551 -35347 10783 -2586 -5947 -13595 -9126 19783 37183 -33350 -41655 -39268 -18287 6974 21993
15538 21993 28853 -2416 11785 7068 41396 43088 25529 45107 63869 39953 41312 59341
15526 59341 43202 36881 36062 14176 -33466 -75931 -104368 -72245 -27597 -2753 5178 -54122
15514 -54122 -78985 -8052 24170 -1650 -7807 15807 4291 -10629 -42650 -70530 -50614 -22914
15502 -22914 -34738 -36967 5715 -21798 -22864 29916 44381 1019 -35192 -68803 -75913 -33456
15490 -33456 12491 7333 -23763 -16411 -40395 -63064 -30713 -52985 -79736 -22728 7220 8345
15478 8345 -1301 -20360 -28701 -39544 -27228 -55377 -57402 -26041 24978 -4606 -1817 31297 22409
15465 22409 -7084 -20510 29158 61606 15677 -25003 -11640 4119 -13164 25274 40453 12304
15453 12304 -15124 4048 32153 28673 -17201 -38609 -22663 13934 19768 8584 -13228 -52915
15441 -52915 -30518 3237 34290 51282 65203 14494 -27387 -3966 -13404 -34187 -23204 2858
15429 2858 -10272 -14996 -12448 13292 46875 97746 65258 31045 24860 6635 -5119 -55471
15417 -55471 -83636 -58384 -53068 -6598 30334 3987 -31319 -51632 -344 57218 34878 208
15405 208 35960 34677 23610 10570 6566 -16130 -58568 -50008 -26396 -16445 -58836 -92603 -99427
15392 -99427 -95517 -100613 -73066 -78396 -68352 -64605 -78545 -40860 -50476 -73120 -44700 -5593 -33010
15379 -33010 -21557 -23289 -4051 9862 26939 56419 20824 -43730 -53704 -55441 -11308 -35487
15367 -35487 -37500 -46342 -25669 -8549 -48717 -58479 5790 26213 21932 -65078 -69111 -65762 -84786
15354 -84786 -99032 -81881 -8918 -16404 -4004 -16883 -68812 -70428 -41753 -21610 -10693 -17143
15342 -17143 -13782 18508 99859 119005 66172 72469 53337 45404 36323 6228 10300 -4155 -44024
15329 -44024 -48442 18886 49949 24935 -37513 -77907 -56849 -31313 -32196 -7265 48243 79939
15317 79939 53557 -4738 -4561 21467 14571 -17312 -43967 -64695 -69414 -91550 -38789 -30175 -21950
15304 -21950 -5374 -9436 -64906 -91282 -30755 818 -34107 -66964 -51546 -35810 -3485 6143
15292 6143 44031 75110 36576 -44387 -52867 -42211 -10226 600 -5916 1575 4315 24091 21954
15279 21954 20575 37696 -1304 30470 24455 -13815 -43085 4821 11117 12907 45931 45340 41312
15266 41312 45367 -887 -34285 -1919 64146 129076 96062 56634 63106 63367 33556 37182 889
15253 889 -62682 -54404 -61711 -60148 -75144 -94775 -72208 -69852 -59766 -15397 -18702 -13301 -33597
15240 -33597 -33227 -76892 -132394 -152126 -119492 -36120 -18864 -39208 -53340 -46451 14911 25711
15228 25711 28093 20971 -12171 27348 23688 7189 73398 87955 74024 3362 -44023 -21279
15216 -21279 16826 22580 43548 30012 8360 21535 18493 22230 9015 -10408 16666 29120
15204 29120 61447 -42057 -130814 -147136 -129666 -154954 -184763 -152089 -75250 -12276 1377
15193 1377 -34823 -68216 -61489 -26934 -35485 -25114 -31906 -27265 -4616 -6350 -35290 -49025 -38190
15180 -38190 -27857 -28793 -42546 -38995 -21134 505 -37611 -14804 44503 41135 -22995 -44450
15168 -44450 -19540 74503 72208 36552 -5486 -9640 -17746 -73098 -86511 -63159 -47502 -40321
15156 -40321 -15155 3957 -42975 -71991 -115173 -82063 -4710 8559 11725 49692 34632 41931
15144 41931 66598 7066 -23822 21117 -9762 -44933 -15552 -34348 -20283 -1963 63953 133333
15132 133333 103657 47572 64379 115306 76848 16187 53924 66823 58297 48493 17040 7611
15120 7611 -28155 -75198 -109674 -81577 -12202 -59623 -129391 -134136 -109060 -34483 -27294 -5103
15108 -5103 -22534 -17372 -56457 -114944 -104585 -65983 -24752 6902 2023 -1778 -25558 -69340
15096 -69340 -43657 -19475 -13962 16896 30775 14084 -34916 -71167 -71415 -64874 -31341 -30247 -3284
15083 -3284 47980 60804 93378 67732 75601 70123 16651 -23053 23123 57151 29158 -16148
15071 -16148 17055 3858 -44195 -42551 -25107 -51583 -68730 -30019 5414 16871 -8084 461
15059 461 -14583 22119 27925 11408 -57340 -84859 -46475 -12853 -9810 -41216 -35243 -13957 -33617
15046 -33617 -42688 -33232 14805 37866 18674 -17780 -51845 -62306 -86286 -71370 -15527 -24347
15034 -24347 -17669 -8661 -7008 8649 12373 2931 -12456 -57938 -102771 -54175 -62152 -46855 -13248
15021 -13248 -52269 -12316 -979 -49101 -37128 11130 -3661 -23563 -65632 -34855 -6684 -17229
15009 -17229 -70680 -26586 -32660 -36785 -55459 -113347 -106246 -88491 -102562 -61549 10591 12096
14997 12096 9312 20283 75627 49785 -25060 -34973 7622 22084 -10117 -41959 -88558 -84632
14985 -84632 -21153 13229 25447 46493 8818 5014 -16577 -26233 -38756 -1790 -12296 -94183
14973 -94183 -166378 -123018 -96699 -71977 -48364 -71479 -65798 -34780 -18776 -60234 -101008 -77886
14961 -77886 -28614 -36964 -46682 -11776 -3988 -18900 -55036 -35689 27406 66308 66719 29847 20254
14948 20254 37696 -24713 -50961 -23833 -74076 -35907 17611 14981 -16796 909 36078 50286
14936 50286 23933 -2271 37224 12482 -38592 -62660 -97327 -112464 -86940 20542 77174
14925 77174 108239 50782 15513 42882 50834 40721 -3830 -53877 -78158 -104534 -118065 -97195
14913 -97195 -65950 -35396 -31230 -16041 28641 39220 -26914 -79446 -15165 -83 -51643 -33688
14901 -33688 -48042 -61967 -29261 -63278 -86128 -63508 -31219 -12658 -33974 -39433 -5714 -14335
14889 -14335 -57679 -16942 15487 -47487 -63712 -42517 -22675 -25950 27815 51975 111216 97817
14877 97817 37481 -37312 -92584 -79554 -49521 -37183 -1716 -4396 -3852 -16963 -58618 -8534
14865 -8534 8402 -35289 -80155 -43134 -58507 -16315 26075 33043 49163 79971 95412 109181
14853 109181 73553 2764 -15431 -12330 955 3499 -39929 -7350 -32186 -48225 -51147 -39757
14841 -39757 -30287 -24655 681 5396 -39351 -61411 -32321 9954 35222 36860 34382 25502 -43444
14828 -43444 -37290 -1792 22613 45147 36499 29756 21065 44494 354 -27795 -21887 -18331 -229
14815 -229 -1873 -15313 -65772 -32651 -40934 -54510 -64255 -72094 -24686 -16977 -54707 -61847 -74069
14802 -74069 -87652 -45509 -5038 -19239 -4310 -17733 -17795 -435 6676 23127 21660 18452 5597
14789 5597 31931 21031 3640 -8917 -20068 -8033 -11759 -66071 -51027 -8228 -15557 -10747
14777 -10747 -5464 -22875 -12945 11247 15266 13843 -6039 -26618 -25339 -72425 -6798 15511 -27866
14764 -27866 -60923 -99428 -78461 -59752 -54214 3516 -28620 -70747 -56363 -10738 34906 23196
14752 23196 -6322 15735 -23354 -17601 893 -38882 -15282 30941 12775 34074 -13286 -24384
14740 -24384 -21468 21980 63104 118375 129415 124935 67577 57711 13582 10766 -6037 -42996
14728 -42996 -47673 -30281 5239 23855 -23114 -33377 26147 71917 128145 110837 56841 7808
14716 7808 -7230 15887 -22711 -1851 13296 -5612 -63367 -94839 -45583 -29624 -43025 -47340
14704 -47340 -68197 -33015 -83473 -65450 -25651 -19931 -19528 -8148 -50779 -72377 -100235 -108061
14692 -108061 -62856 -21772 -39137 24212 101468 117951 85875 95262 45090 32646 50182 24375
14680 24375 -48511 -20056 -41466 -29780 -24744 -57885 -46261 -10824 14657 28554 11260 -25114
14668 -25114 -65066 -56734 -73310 -77928 -40195 -48873 -110878 -108703 -71403 -48375 -50812 -48551 15559
14655 15559 36240 18326 1415 -14156 9632 1734 14341 11870 54608 56995 -6070 -32688
14643 -32688 -53600 -25668 -9318 -10032 11216 23440 -33763 -74225 -76241 -82616 -116139 -102719
14631 -102719 -85229 -102238 -117723 -103457 -117301 -108803 -88907 -41752 8504 63614 57547 -1546
14619 -1546 -59499 -84331 -46868 -43749 -20076 -54799 -82671 -109011 -116449 -113559 -48661 -11187
14607 -11187 -44121 -51963 -45141 -3984 31388 41409 -4938 4660 25519 53601 49631 1366
14595 1366 -39686 -46027 -47298 -49595 -37992 6901 -1477 -36778 -70599 -93208 -120779 -113928 -51600
14582 -51600 -25730 11780 21509 13989 79953 63614 39186 15657 14149 18070 4725 -30949
14570 -30949 -20572 11343 20755 -925 14608 -29643 -88451 -92161 -62651 10351 47570 16721
14558 16721 -21018 -56922 -107157 -96306 -18922 53267 13687 17942 18374 22409 48200 48186 42053
14545 42053 59544 40116 46580 67900 65373 -17428 -43034 5501 9293 15663 23454 19343 37623
14532 37623 76825 42413 -42639 -16982 -17944 38581 48112 59605 96310 103735 68642 42235
14520 42235 21147 -2763 -15634 -19821 -922 34562 46587 46686 19401 15157 25840 16042 18350
14507 18350 -28372 -29048 -39748 -18990 -16031 -26508 -69742 -71228 -32487 -39908 -26906 8657 -42060
14494 -42060 -51377 -46212 -49546 -26140 -4110 -52989 -10750 24455 27019 14274 -1769 34291
14482 34291 94841 45304 15722 -10350 -31160 -38999 -93849 -89533 -57471 -17030 22752 51302
14470 51302 7644 -32985 -6590 31234 45851 13340 -13019 50526 57121 -1200 -31483 -19339
14458 -19339 -50662 4349 87291 84461 52594 5428 -13286 9131 58760 12464 -21972 -8534
14446 -8534 -16758 -60381 -74370 -56953 -47822 -18988 -10658 40002 8965 -85226 -130576 -35069
14434 -35069 -12853 -45084 -45696 -64670 -50898 -52576 -35383 -27032 -14773 -16805 -11881 19676 44485
14421 44485 47504 37730 -7887 -24379 -40100 -61038 -19378 -12342 -57883 -65794 -68925 -36811 -4466
14408 -4466 -31098 -46174 -8016 -53732 -103768 -67525 13371 11433 33357 -19194 -76128 -106175
14396 -106175 -39974 -34711 21733 4872 -61274 -86625 -87290 -23678 13753 -26325 -48097 -38621
14384 -38621 -28447 -15848 -26010 -31741 -13300 -13337 -28943 -57692 -73388 -43688 -101083 -81787
14372 -81787 -28485 -27417 -7950 -41170 -27769 -21687 -74036 -113499 -131241 -93104 -36432 44091
14360 44091 67446 60460 45534 40886 -11678 -20331 33140 33182 20593 31812 22847 -2659 30747
14347 30747 6311 25608 8503 -24088 -79139 -62827 -68005 -68535 -54484 -69977 -69030 -44154 -18278
14334 -18278 -73 -10754 -64404 -112101 -112563 -56045 -47274 -77255 -32415 69130 17865 6416
14322 6416 416 -32942 -77345 -90922 -58676 -79259 -42774 18698 36160 -33840 -28803 -14907
14310 -14907 -5074 19188 24293 47785 28455 -41823 -59784 -83759 -65021 -32124 -38054 -4010
14298 -4010 16155 25792 20894 -4417 -29704 -15113 -39622 -1668 44549 23519 -27937 -15140
14286 -15140 13223 9912 -21675 -20118 -17064 -5481 20448 18271 55876 80334 36824 11458
14274 11458 -39672 -26404 43107 -13035 -29308 19598 23406 13316 5424 -8087 22045 -29979
14262 -29979 -92553 -75249 -72275 -92255 -89559 -91044 -76094 -96678 -70139 -47094 -57894 -77737
14250 -77737 -26433 2433 11585 3926 16132 44296 52245 6010 -37744 -80583 -61392 -71163
14238 -71163 -39934 -41966 -58665 -14719 7190 154 -30725 -24226 -20929 23865 -24582 -23335 10545
14225 10545 19227 -20502 -70424 -66488 -36163 -76268 -87732 -27761 8568 5548 17951 46661
14213 46661 45063 -3862 10692 7862 31305 46630 62491 20571 -34375 -26252 -28449 -27076 -28365
14200 -28365 -49473 -25658 12708 23836 -6808 -18169 -19547 -1111 148 26053 39299 -47232
14188 -47232 -72388 -44482 -25189 13425 34243 35707 60793 85939 77395 52034 75510 545
14176 545 -94479 -85024 -63192 -56323 -10365 13007 8301 7485 -12367 26927 28841 -10368 -44305
14163 -44305 -63767 -20525 48690 61391 77555 62553 58252 51584 14629 44245 64404 39250
14151 39250 6918 -17345 -7957 -15542 -4268 32829 62237 67690 34944 30304 -12605 -38768
14139 -38768 -82808 -169808 -118534 -34677 695 65270 78882 -26129 -50903 -53726 -90554 -117022
14127 -117022 -65366 13124 66352 34158 32507 59765 61979 -18323 -52641 -24658 -35624 -64833
14115 -64833 -70159 -20270 -65563 -128190 -119603 -69818 6493 3569 -68766 -127783 -133618 -66062
14103 -66062 35245 37545 -9882 -32672 -48209 -88416 -107203 -76438 -50496 -28135 6585 13674
14091 13674 14764 57208 86364 65289 76531 102896 101496 53493 24644 -22901 -37241 -30538
14079 -30538 14375 -8741 -26002 8739 -23919 -5749 -26536 -56832 -39040 -61749 -44823 24252
14067 24252 18874 -27959 -103602 -63453 -33937 -33949 -42201 -51260 -76784 -77576 -27918 -40122 -76738
14054 -76738 -20761 -42718 -18718 -28775 -99045 -99221 -65766 10956 2775 -39406 -78765 -108579
14042 -108579 -106199 -121100 -77264 -104420 -120700 -91251 -177575 -161491 -116276 -108811 -104823 -84263
14030 -84263 -82789 -113548 -93105 -63626 -67687 -41896 -68276 -71406 -58380 -71847 -100537 -51647
14018 -51647 15980 35328 38425 93530 91383 72922 92275 83208 109529 101611 111529 50514 -23278
14005 -23278 -26721 5061 2091 14513 47208 81717 58925 44159 34695 2170 -73782 -43154
13993 -43154 7865 13910 -11091 -16320 -19425 -11235 -19055 -40418 -32830 45882 27752 -47314 -88994
13980 -88994 -105152 -70810 -50852 -62279 -76581 -70544 -60142 -28306 5564 24132 13785 20890
13968 20890 -5961 -49625 -67040 -63636 -48583 -43789 -13845 39863 34428 6858 -26466 -61408
13956 -61408 -68701 -69508 -66775 -62109 -73358 10271 1848 -10115 -22941 -31960 -271 7804 -17977
13943 -17977 -13170 52800 14937 -31709 -72711 -79723 -62270 -47589 27833 41957 -3037 -26372
13931 -26372 6428 15728 22925 30528 26123 -9679 16017 28409 12962 -7138 -114157 -107286
13919 -107286 -37833 -21466 6319 -32001 -27979 -15705 7278 579 -33760 -23110 2291 -19598
13907 -19598 15184 13469 42072 24377 -4567 13922 64841 92820 92051 48445 48718 28503 33070
13894 33070 53990 43934 36179 57654 33608 56787 62105 49141 1789 -27467 -53718 -46661
13882 -46661 77898 53204 -26471 -85073 -65837 -28765 -50306 -18044 3490 -15882 -63511
13871 -63511 -84538 -40416 4618 95078 90075 9425 -2904 57453 100083 94190 65536 62312
13859 62312 41209 -24853 -14611 -2534 10973 -31347 -48608 37718 43294 -6711 -33370 -60553
13847 -60553 -60999 -71039 -60782 -29623 -37857 -17611 -17846 -29698 -25657 -63919 -90870 -77318 3576
13834 3576 26748 42305 73335 98966 142872 113680 77451 67027 19509 17299 -16657 -3831
13822 -3831 -16647 -50928 -50000 -53671 -41915 -42480 -43140 -38668 18843 44848 -19670 -12097 -5900 -53280
13808 -53280 -68374 -74467 -38913 -8621 -22146 -61033 -71351 5423 14507 -5388 29634 -7064
13796 -7064 -36443 -77807 -108161 -61621 -55117 -40211 -1177 -21316 -14670 14248 18851 -15956
13784 -15956 15380 25571 6142 1569 -15350 -15147 49318 29944 -15698 -45184 -32691 -29650
13772 -29650 8262 44774 13832 618 7818 11515 8270 -29090 -16099 -29310 -33131 -7707
13760 -7707 70136 65565 62677 21663 -15781 -56822 -68577 -45379 32479 58993 66792 22855
13748 22855 2601 -35211 -45675 -1205 15231 -16130 -43784 -72262 -127473 -102794 -69262 -35926
13736 -35926 18082 25897 -28153 -40165 1453 -24665 23900 27025 16632 726 -49684 -112902
13724 -112902 -89996 -52045 -47567 -58518 -22924 -42261 -55156 -63687 -18551 16442 -21214 5992
13712 5992 5975 -17913 -23297 28206 77471 60904 22114 -12512 -14182 -80699 -96891 -67987 -55313
13699 -55313 -44926 -48724 -84299 -62715 23907 38648 -25990 -93676 -116679 -105163 -61803 -30439
13687 -30439 -30033 -34267 -1930 -1955 -18774 -37017 -72616 -65095 -20407 -7363 -37957 -42014 -68283
13674 -68283 -87414 -44444 -15070 -3409 -14717 10020 -8340 4431 32757 -1689 -5486 1257
13662 1257 54376 77656 30842 14953 56570 79705 66208 65592 72874 106056 97408 -22998
13650 -22998 -41671 74222 52120 -29141 -21005 41949 37771 49379 64354 64713 19923 -19784
13638 -19784 31893 92733 86162 66876 37882 4044 5778 -10309 -19233 10336 33322 23501
13626 23501 19700 18896 34445 23414 -7279 26109 62441 92597 135725 115780 129287 108961
13614 108961 95564 135871 136861 127795 133238 111070 23149 -5115 68490 57304 56298 86398
13602 86398 150585 155261 143464 124345 124465 138540 114679 101956 101728 54383 33665 17454 -3718
13589 -3718 6746 56341 95321 61033 45229 47944 81831 120232 88310 29389 46496 64048
13577 64048 11630 16798 32919 89465 90830 103666 130231 92420 62325 43696 8242 19555
13565 19555 56837 41690 27557 82470 95056 117964 97237 76552 35680 54763 86041 49947
13553 49947 48589 -5025 -28512 3755 74323 102492 77687 64183 31233 38066 37574 1009
13541 1009 -1366 2148 19966 43820 63708 26315 -18013 -36210 -756 -33370 -33450 21185 50308
13528 50308 29639 2981 31650 24566 13102 43815 32349 28243 21816 36885 29189 69408
13516 69408 81816 31698 22431 49951 3219 -47358 -91720 -78629 -33092 10888 70668 56009
13504 56009 -3454 -23070 -48939 7591 -17331 -36280 -7228 377 35785 83704 67424 9400
13492 9400 -35589 -30427 -16054 6933 39830 61536 41190 20444 20020 29050 -1560 -45756 -100348
13479 -100348 -134086 -100359 -11582 21270 7424 2028 24548 23035 -10060 -20742 -28023 2835
13467 2835 13432 -53053 -45914 -35054 -41001 -50127 -43080 -20916 -16081 -53727 -49388 4163 42181
13454 42181 19742 -884 15843 -9052 1962 10263 19270 42116 14700 -42188 -36603 -10106
13442 -10106 13442 23460 43864 38930 -32898 -40645 -12263 -17179 -22238 -22882 -54880 -99545 -125452
13429 -125452 -67159 -40842 -58440 -58194 -401 36388 113761 68449 1099 -37919 -35502 13331
13417 13331 51097 32638 18521 4061 -37487 -39739 -22243 30687 31318 -7340 21697 59770
13405 59770 94071 78896 62049 11993 -43943 -28375 -4945 -49699 -33533 -55261 -71631 -23918
13393 -23918 45629 62887 86001 91995 61963 -3762 -28523 3476 46945 124750 169999 151611
13381 151611 77790 16928 40015 20530 4423 -2731 6665 33318 31017 15624 -23133 16586
13369 16586 44883 57459 48488 82797 33829 -51887 -47803 21161 34206 22422 25942 34035
13357 34035 4089 -13159 -33774 -15901 35608 43458 15184 -28328 -37806 -3568 23775 3928
13345 3928 -14113 13123 15414 47072 65946 34865 29989 22242 25642 6788 25521 36186 24
13332 24 28489 36117 30205 -27671 -59531 -43465 -58690 -15092 -16608 -22586 -967 71004 48770
13319 48770 51711 8790 -4067 -54580 -85430 -52274 3367 23808 17008 829 -7418 -5363
13307 -5363 -5594 -2854 1880 5465 -10516 4722 19235 15468 -28348 -42564 -20428 11348 51229
13294 51229 75137 65149 75687 94781 94210 99328 59101 30618 24877 6947 79587 88152 28101
13281 28101 20704 -10594 -63720 -86076 -71818 -77855 -25829 -55590 -68002 -102076 -102039 -50810 -47619
13268 -47619 -50026 -12786 13219 -9545 -16720 -24960 -37648 -15443 15212 17361 -12726 -1644
13256 -1644 -39814 -65859 -47963 -18141 983 -5586 -39012 -38511 -14863 -38638 -60201 -34572
13244 -34572 10063 -7040 -45799 -28895 -41751 9070 48469 44103 60764 53270 42515 -3614
13232 -3614 43577 106340 39067 29233 48740 9745 22242 27818 -11903 -38280 -34915 2633
13220 2633 16061 54515 50526 34846 47726 50813 11889 -18613 -47599 -67527 -31066 -47515
13208 -47515 -36914 5018 -32859 -27157 -20818 24489 39821 -27280 -64758 -42717 -28415 -58344
13196 -58344 -72647 -50505 -20066 -24683 387 4773 23946 46703 37629 41378 38484 13659 -14699
13183 -14699 -18827 -3686 -52876 -38897 -43261 -51257 -20527 -19104 -47734 -26722 4703 39739
13171 39739 61050 66006 111462 101033 24322 -37433 -31084 -28339 -50844 -89786 -76319 -11636
13159 -11636 -10340 -21976 14013 2245 -4750 -25673 -95159 -122868 -136210 -110349 -69330 -42968
13147 -42968 10159 53572 67721 38629 21871 -3536 -3785 -20731 -68554 -50688 8658 8877
13135 8877 7460 35570 18810 -13395 -20468 -3489 7729 35434 49077 17196 40793 66530
13123 66530 11421 -119 28529 5369 -16595 -20024 -33925 -20643 -8715 -27237 -85250 -107305
13111 -107305 -81221 2860 12418 15656 5786 -20686 -26319 -696 7785 -10432 -7444 8480 -20084
13098 -20084 -92207 -145820 -71398 19000 29338 50747 38781 -12312 -8545 35389 55305 55118
13086 55118 31925 -22490 -9428 35560 50292 35791 28695 -6141 35891 41049 55455 25287
13074 25287 17476 10846 -8170 7998 -6416 -12356 -45689 -65508 -48147 -60200 -37239 -549
13062 -549 24550 43166 12778 -40157 -38995 -59836 -57679 -75450 -54213 -10376 12004 -573
13050 -573 -26165 -46425 -39574 23166 54490 41506 46094 18058 8872 14332 31244 33983 8706
13037 8706 -15710 -30607 -22519 -5717 8339 -2349 -3674 57056 41332 33178 28750 -28714 -93160
13024 -93160 -109810 -119488 -86529 -39204 41293 57460 83265 128043 175700 143759 129340 142598
13012 142598 75046 41625 28379 24553 -24256 12044 47584 15190 -59218 -93677 -56377 -64990
13000 -64990 -63355 -6547 -31262 -29646 -1306 5462 29937 47058 95323 127537 132905 127368 69171
12987 69171 42758 68294 52322 6819 -9364 -11091 13449 63361 61615 -31786 -56422 -43923
12975 -43923 -35682 -22676 -6644 -37522 7053 37803 19096 8194 -17156 -75807 -90052 -62377
12963 -62377 -51142 -5764 -23121 -57866 -68372 -106908 -74490 -92785 -98542 -13845 65073 90788
12951 90788 29491 23389 -8859 -43417 -100430 -89299 -12396 -63664 -83007 -41433 13341 -38487
12939 -38487 -63709 -14243 -25210 -8037 19732 75768 50305 -5166 29597 42949 21064 -7411
12927 -7411 61273 14578 -2299 -20157 -13690 -17171 11481 -3243 -32539 -30437 3102 -37 857
12914 857 -16878 -1228 -7763 -36446 -41019 34038 76102 82747 72207 60768 -6500 -21807 23744
12901 23744 70966 72392 63889 29494 -33799 -46392 23471 59866 73962 100327 129130 101228
12889 101228 57158 5448 -37924 9663 1137 25995 54925 38670 -3222 39553 47910 -11004
12877 -11004 -19986 -443 29594 22685 19110 39737 11894 -18657 -44487 -47727 -10588 20197
12865 20197 7647 -23738 -32555 -31252 -30323 4289 39146 85823 55825 -52469 -57776 -44498
12853 -44498 -45584 -19268 10065 60062 34956 36232 34214 32906 18629 23612 40255 15182 -37422
12840 -37422 -23293 2616 2181 32634 26547 11897 33589 26132 10245 -2289 11152 26051
12828 26051 1165 -43624 17654 35637 25308 11496 -25338 656 32433 31128 37338 48261
12816 48261 55420 24850 -9461 -14402 -12268 51124 55276 87022 111011 62191 19811 52983
12804 52983 84953 50701 2037 -36340 -21313 -29551 -25525 4425 33458 25000 10107 -44019
12792 -44019 -52525 -37996 -47974 2569 23709 8230 -22100 -12271 16593 15238 6239 -17328 -58023
12779 -58023 -29348 -12047 10953 62162 13694 -13954 -21644 -11616 13922 3545 23334 86472
12767 86472 76334 41765 42974 23555 -6778 -45604 -55320 -27907 45924 104866 121055 66799
12755 66799 43702 29588 33709 18498 -65470 -65642 14226 41190 -14823 -23106 -19036 496 2818
12742 2818 31818 40628 25919 49563 83462 41168 40415 61752 34935 48226 74679 53272
12730 53272 864 3336 1912 29719 13933 -21118 -95353 -107145 -97093 -100189 -85952 -44905
12718 -44905 -19767 -1330 -19579 -43798 -48214 -37062 -20892 -37895 -84394 -76636 -73073 -46541
12706 -46541 -43149 -60228 -74298 -29422 -2405 2352 -20385 -42002 -52882 -45284 -21195 42735
12694 42735 46209 4312 -68570 -109980 -52981 -117019 -115721 -39606 -31753 14435 78860 55924
12682 55924 31164 15260 -920 -51176 -81664 -61996 -31530 -37672 -43773 -52175 -25313 -7590
12670 -7590 -30853 -44265 -37805 10343 62992 59080 44318 83501 116328 71930 15906 16220 15907
12657 15907 29647 38219 58848 74991 73145 44498 26712 29517 -10385 -24126 -27946 -11249
12645 -11249 36423 78815 74324 81047 69314 58718 26621 19579 47510 59433 70338 82430
12633 82430 82714 57419 42126 51979 22202 -14218 -4844 21385 61291 21680 23571 109264 120752
12620 120752 101028 93742 29735 39792 33827 77406 43007 -59765 -53228 -21713 23469 86652
12608 86652 24698 839 16169 1362 43804 50319 71554 83926 19911 -9760 22668 44826
12596 44826 43107 27407 37884 -6233 -49106 -36701 -1123 28671 12570 -31419 -1238 41596
12584 41596 -17038 16820 19592 3550 -6108 38604 14768 -20285 -65211 -43371 -27101 22209
12572 22209 42969 14291 -11453 -1902 13064 30608 75867 81566 -6681 -34396 -14331 -36193
12560 -36193 11050 44167 32030 36459 34004 -49620 -24485 -43538 -48524 33915 37125 1242
12548 1242 -2570 2804 -31416 -28193 -7524 -10586 -19846 615 6808 -5020 -103380 -92501 -27247
12535 -27247 2863 9510 14969 -7064 1768 369 -9063 -24581 -45702 -24263 88417 131407
12523 131407 171026 156078 138486 134009 128177 114674 115587 122681 120889 62796 25915 30109 31524
12510 31524 63703 108382 120457 91920 67826 61590 46210 49677 103425 86694 41118 65735
12498 65735 116117 122757 49758 35410 41118 36119 23663 42149 38695 13423 24963 58483
12486 58483 104102 124470 64396 -14305 -75286 -40992 -35676 -69405 -100299 -45135 40566 81100
12474 81100 64147 74763 25742 37995 59907 77312 35146 54149 73903 42090 72464 106464
12462 106464 79818 48227 18461 -30396 21209 24082 -79804 -79918 -11004 33735 46223 28696
12450 28696 39830 55121 -102 -10102 361 22551 66538 123993 138386 108540 49770 41359
12438 41359 52773 55651 25089 21318 22833 65727 99149 80840 74859 34142 -23973 5440
12426 5440 61447 96814 153680 147901 106452 99598 172137 230485 165558 115662 114731 107660 117628
12413 117628 102733 62119 24800 64002 68869 6014 -96436 -71607 5477 48163 91172
12402 91172 117458 83382 84417 99017 139399 122743 141759 130025 105388 114143 111780 129940
12390 129940 81222 31885 8141 50276 48510 75009 112904 167145 139743 78834 34441 42282
12378 42282 112541 117430 142807 180492 232845 240250 206639 152939 101461 101880 84923 63922
12366 63922 66969 65764 69589 72959 92166 61060 28235 69952 51071 84200 107861 127671
12354 127671 180133 186331 162543 160777 147972 148110 91154 32922 49543 67828 77358 47009
12342 47009 24691 89115 181937 201734 148361 125245 113982 148785 160862 128392 116426 155685
12330 155685 153587 136766 126051 146642 159950 171122 157188 175589 168463 122450 71131 88245
12318 88245 117869 88098 42973 33715 24029 74441 76537 71336 104169 124306 145510 114062
12306 114062 130612 145635 147235 154106 138553 115617 129347 90116 71668 56557 63904 78639
12294 78639 87824 103298 113653 133424 134026 93197 79433 111469 140697 155391 163150 177463
12282 177463 161627 139293 174767 147350 175403 194404 172189 163324 146150 120481 116204 147179
12270 147179 184117 165050 112096 123821 160998 149265 132030 129190 138594 110229 82626 45605
12258 45605 21039 61670 128495 108342 114695 147360 153214 181054 180865 157900 190406 245819
12246 245819 228804 234937 209747 140220 140717 198711 248113 254940 254680 241274 241218 282735 216196
12233 216196 155924 157113 164804 176715 207628 224484 199773 170858 212859 197758 215239 247921
12221 247921 236734 224541 198632 178352 228137 230690 220384 229185 296536 317931 298604 301374
12209 301374 302315 231765 226324 237032 198921 153996 170136 235885 354631 399439 377094 323972
12197 323972 290931 289270 317258 233155 211188 208649 225073 208296 201963 200888 239828 220435
12185 220435 227928 252369 330849 287669 252326 268356 262494 266323 300099 274855 314571 316825
12173 316825 306256 277546 304091 366350 374116 349647 353725 319583 281131 231576 245783 250636
12161 250636 230656 297939 340556 341624 340520 301317 347203 422454 467792 468071 399779 405295
12149 405295 391526 408261 452841 448431 430036 410737 425242 473727 485183 516727 534287 560639
12137 560639 537499 528115 531489 514158 590391 604533 609139 625172 636319 581233 583943 597257
12125 597257 588766 616907 630163 637467 637864 638014 601090 624704 661538 614384 647744 699075 695196
12112 695196 596529 603227 680693 756779 751280 747086 759707 820494 828384 830886 846772 884443
12100 884443 868166 894108 930790 940896 960113 1002406 997299 988237 970142 1052996 1110104 1147434
12088 1147434 1180945 1249854 1308628 1330339 1383205 1413714 1363967 1375864 1361675 1367694 1336616
12077 1336616 1349079 1317808 1317156 1332610 1370720 1397008 1352977 1390609 1421408 1455646 1444771 1397466
12065 1397466 1394789 1430325 1482536 1523324 1538625 1504852 1493668 1540527 1586128 1630832 1646254
12054 1646254 1686157 1751912 1834841 1864447 1837972 1848805 1894681 1937643 1975654 2045155 2124922
12043 2124922 2190688 2261106 2364047 2423891 2409322 2456137 2541566 2572409 2562138 2509049 2533549
12032 2533549 2548192 2604104 2719903 2821646 2850411 2866797 2859861 2930316 3020658 3059835 3170157
12021 3170157 3268249 3340118 3408289 3480162 3542093 3637043 3714811 3809507 3976211 4119128 4236775
12010 4236775 4366105 4505115 4663086 4833437 5023473 5195447 5348701 5514373 5680555
12001 5680555 5848989 6055389 6310791 6565165 6848727 7171023 7430289 7721659 8010554
11992 8010554 8308647 8620128 8931294 9335259 9762890 10210830 10664642 11137242 11656931
11983 11656931 12159310 12683563 13290415 13933185 14633175 15348560 16147457 16989521 17881830
11974 17881830 18817598 19828242 20859295 21871305 22969391 24101072 25290376 26465968
11966 26465968 27736618 29064893 30356584 31601883 32769067 33892728 34955539 35945203
11958 35945203 36798008 37531521 38093056 38443014 38588050 38549625 38390242 38024701 37498259
11949 37498259 36756214 35891550 34925768 33899147 32723004 31497489 30235991 29008609
11941 29008609 27823757 26665270 25513589 24347151 23204255 22099977 21048596 20011453
11933 20011453 19031472 18103005 17269003 16463820 15704196 14929273 14240838 13638987 13082843
11924 13082843 12462524 11898905 11395957 10927146 10494769 10046528 9592713 9151651 8805406
11915 8805406 8445509 8122141 7825030 7574484 7314378 7037308 6755458 6494175 6204793
11906 6204793 5970940 5763093 5568788 5372060 5221129 5133658 4996432 4792347 4596345 4480450
11896 4480450 4418588 4297201 4134609 3954730 3851298 3730781 3581020 3513888 3516721 3416017
11886 3416017 3249027 3128999 3066452 2990877 2861065 2790964 2731996 2679490 2649634 2600007 2565688
11875 2565688 2505459 2397102 2320698 2276452 2227605 2187705 2131035 2109689 2050005 1961897 1913998
11864 1913998 1848348 1752110 1757357 1792652 1789341 1717800 1692197 1669970 1612127 1516850 1427776 1382807
11852 1382807 1391009 1430267 1415603 1355390 1355746 1338819 1270561 1212316 1201186 1137761 1058575 1058322
11840 1058322 1071802 1060432 1054356 1011609 1031540 989896 979113 1005604 1000697 947858 933913 941438
11828 941438 927840 895979 847289 859021 859645 849107 843165 822734 770872 768265 723880 676999
11816 676999 657889 689768 732576 713306 682518 649317 669671 714348 707068 695365 688323 719212
11804 719212 695341 630556 583199 540191 560770 605599 559749 558936 624405 684075 668727 642763
11792 642763 644161 657317 631388 625083 621507 627997 609118 593345 611729 587189 543046 521569
11780 521569 535581 532197 509898 467517 492183 515576 492619 510224 514922 439656 403744 446951
11768 446951 407182 352108 356089 378010 343100 376088 415242 434173 435325 431879 397612 383125
11756 383125 349514 356405 385043 411980 416833 378227 383779 402561 410664 429540 392096 436163
11744 436163 454703 378930 349213 329378 351587 351969 336394 339096 360515 323323 286237 336055
11732 336055 414476 411643 352409 353756 376404 330658 304486 306630 309202 312962 306957 316311 305669
11719 305669 324607 347698 393734 418560 424735 373398 294379 257514 223995 206265 213518 248154
11707 248154 224444 174122 188737 220693 290701 325210 314623 250077 212985 226974 230061 249025
11695 249025 277477 280209 262276 239334 211896 251300 256531 205740 222524 279005 279453 244941
11683 244941 183709 196466 215572 187154 212280 270063 219964 198388 187129 153421 178234
11672 178234 246646 262074 247948 226355 239127 268594 280300 254414 239590 233544 263401 316251
11660 316251 285971 246511 210107 242512 238011 198019 198295 184014 164327 151495 187445 206835
11648 206835 197373 190355 162428 142922 136714 131989 158004 162183 171354 206312 211867 170492 197879
11635 197879 148151 145628 187597 254716 202981 165872 169226 173401 164364 127337 215799 239561
11623 239561 227591 209151 226095 248136 214265 198705 216575 237216 227323 204464 221298 204091
11611 204091 165450 181812 173704 155270 141301 150047 119402 89266 126440 137197 128166 118183
11599 118183 144856 167004 116922 119393 117613 95569 80148 95526 99386 103327 144228 146612
11587 146612 118833 133047 116622 116606 105618 89764 74792 116684 119290 115113 127771 141711
11575 141711 135999 145213 142749 116778 74263 100053 148497 166054 148746 80805 26342 77557
11563 77557 129684 154245 172171 178859 160513 178345 182038 153264 145836 92956 59732 79425
11551 79425 138676 136168 144408 94466 44281 46553 59781 88066 126585 138532 114203 94819
11539 94819 98107 96223 119763 111229 84161 77766 75986 48278 62548 43271 66784 26847 -18439
11526 -18439 5185 61939 101250 88796 101904 128200 155690 153258 156645 146001 132577 140063
11514 140063 121745 125248 91365 68619 82862 125631 193753 198828 168669 101201 38376 97756
11502 97756 210027 258137 223440 165357 117214 40368 8362 59102 58679 54559 52319 49160
11490 49160 62184 3473 -90091 -21641 25006 28202 -18420 -45137 -32493 -10186 36498 54050
11478 54050 79078 141172 148113 78088 72061 116940 102327 129527 205766 187071 179365 178712 170005
11465 170005 138254 81007 55570 36690 62417 87936 84802 74471 99396 104197 96263 15903
11453 15903 -32379 27128 45863 20658 -18130 -17868 -25142 23264 98453 144776 127710 103668
11441 103668 73409 74758 104240 121097 147726 141851 97444 98711 71098 39708 79261 121872
11429 121872 154391 157611 165965 113637 72572 40857 59161 112451 112913 137739 167981 132909
11417 132909 91115 36793 17126 29766 83326 103937 55510 23848 33684 26938 72276 108541
11405 108541 124460 123486 128293 156964 181528 157418 72897 91888 112904 125481 137236 115628
11393 115628 101193 86721 107294 90312 132879 145849 161487 120330 106284 131308 136421 127853
11381 127853 134703 90501 58686 38199 28863 61988 54984 87156 119009 86630 117475 82163
11369 82163 83836 88153 99067 96245 86391 84565 43844 38372 60327 63495 123465 92937 84696
11356 84696 102521 126560 120581 135195 111506 90747 77868 12496 -20031 -13294 8290 19333
11344 19333 7339 63052 92521 62851 92024 128915 115531 72699 94653 77596 54496 48810
11332 48810 73201 126566 76943 84996 85088 82168 96019 104137 95904 41921 35989 79600 103788
11319 103788 134218 131986 157402 153437 174377 166783 161922 143368 118611 97533 133803 123108
11307 123108 155698 148420 138568 166833 200938 182239 146268 123537 122129 147471 156045 154042
11295 154042 211840 286921 316148 268575 236525 265483 341229 410288 433793 480261 555306
11284 555306 652560 783224 964031 1126158 1273535 1344649 1372925 1353801 1262380 1118697
11274 1118697 982743 874020 798159 738091 617829 495358 522211 463155 326689 326968 357719
11263 357719 367708 374188 336282 329919 378633 402025 385322 388067 358400 326853 275397 284668
11251 284668 335861 350059 402347 433217 510172 541500 565169 578728 629979 676228 818825
11240 818825 989481 1163100 1305580 1422323 1542977 1555927 1453709 1280937 1186522 1115943
11230 1115943 1038496 918785 793263 680769 600235 546361 492569 479857 446979 393349 381623
11219 381623 395942 419942 415881 376466 334321 344038 371525 374456 407452 419591 384648 297650
11207 297650 252724 285383 298781 291708 284500 308031 292758 347999 409795 420064 456632 492474
11195 492474 508708 574946 637041 728997 830443 907851 970856 1054817 1140765 1239560 1359532
11184 1359532 1396639 1351372 1357789 1355201 1214726 1118244 1030703 958875 901643 853987 829379
11173 829379 865303 822786 836289 932969 998075 1089380 1143862 1258609 1323872 1431848 1538044
11162 1538044 1615125 1708323 1654049 1509377 1425809 1343775 1244124 1192491 1101504 1018219 963514
11151 963514 927096 886424 888443 927454 936520 870149 799460 793481 799414 737670 678252 707176
11139 707176 687956 652171 603676 501811 520804 648452 677690 713862 740288 804347 896832
11128 896832 1006459 1092822 1217286 1342580 1470674 1449973 1453779 1391642 1351388 1304454 1185019
11117 1185019 1108123 997830 913108 844385 835852 839183 828633 833884 893446 949868 990095 1004574
11105 1004574 1042510 1144494 1135793 1005117 921605 823698 737986 697542 572572 500410 493270
11094 493270 538564 580560 620584 590059 591508 562651 557670 502985 420833 380717 346301 373329
11082 373329 401770 439067 443768 367300 300371 290168 281965 324047 340686 300603 275629 281121
11070 281121 312688 317711 358460 363492 326153 279339 230800 246288 311299 359363 343737 386871
11058 386871 422930 396451 282444 322401 377917 400783 412578 451526 503168 561945 627867
11047 627867 691483 661123 576683 563733 536571 594690 590308 597643 668759 724571 778716 860741
11035 860741 856339 788389 770507 762617 716767 731426 772238 797789 830193 918143 1011199 1041035
11023 1041035 1049479 983268 924734 885837 861504 785283 748532 743263 730485 724187 734375 809192
11011 809192 829895 737211 642042 649332 637593 619005 610674 569223 572515 600198 614927 661681
10999 661681 663437 644238 632844 567687 489561 441017 379424 383669 423238 438621 498045 541505
10987 541505 561176 535094 588341 623572 645927 618363 612458 594893 585893 586656 602883 634854
10975 634854 629869 576338 557123 577897 604409 658662 658933 674722 719715 759166 835127 955547
10963 955547 1089312 1172522 1267164 1326794 1283658 1213710 1174182 1122902 1079085 1071981 1041438
10952 1041438 1046770 1058960 1095055 1136363 1130991 1104255 1082623 1104885 1169475 1207110 1220356 1250266
10940 1250266 1233876 1168881 1149242 1085397 1024785 1015339 980346 1038141 1103272 1127462 1098778
10929 1098778 1111495 1177647 1258877 1343201 1429241 1468227 1551492 1685643 1860689 2006633 2088937
10918 2088937 2122361 2174350 2186002 2139160 2093874 2033411 1984524 1922356 1905132 1870270 1811192
10907 1811192 1863844 1947793 1999600 2049279 2080357 2106674 2154369 2208388 2240790 2259170 2244547
10896 2244547 2312623 2406279 2469601 2462945 2461290 2487587 2556883 2668012 2782954 2906378 3032221
10885 3032221 3157939 3289642 3385305 3488269 3678863 3950900 4216464 4410727 4576960 4817973
10875 4817973 5007312 5203550 5367165 5527824 5687448 5880129 6084079 6347103 6675932
10866 6675932 7039471 7495144 7928429 8404706 8973495 9672211 10415974 11225309 12141709
10857 12141709 13241021 14552461 16000434 17707501 19671715 21883376 24418430 27526562
10849 27526562 31297074 35832000 41464990 48311450 56900093 67922171 82306132 101236618
10841 101236618 125897162 156681866 192464350 229478273 261204487 280412862 282382542
10834 282382542 267045459 238853190 204533448 170256747 140117681 115602061 96522977
10827 96522977 81964384 70934070 62534301 56019235 50823105 46657707 43231403 40474740
10819 40474740 38193048 36407969 35062807 34164836 33780954 33847972 34250715 35054194 36279670
10810 36279670 37989073 40327531 43327532 46873207 51187303 56387025 62594233 70103138
10802 70103138 79279669 90722339 105230363 123836578 147753423 177553914 212344194
10795 212344194 248804200 280885399 301453259 305274337 291217898 262922450 226907084
10788 226907084 189944785 156728550 129321555 108024631 92050503 80259050 71527437
10781 71527437 65039608 60140392 56289081 53173033 50609036 48440328 46646382 45045097
10773 45045097 43591339 42297643 41085125 40026148 39276782 38908764 39050585 39781144 41151166
10764 41151166 43290182 46346131 50402584 55765762 62835064 72051938 83980882 99197770
10756 99197770 118122142 140599185 165700022 191517606 215368081 234375527 245939936
10749 245939936 248708014 242849303 229916363 212339211 192726542 173361622 155940001
10742 155940001 141538570 130717950 123713285 120516833 121178751 125737720 134195934 146622659
10734 146622659 163019351 183049702 206058361 231088987 256304322 278839791 294946696
10727 294946696 300899655 295030842 278688438 255741327 231125228 209062770 191817963
10720 191817963 179581073 171441854 166049478 161992250 158285374 154200490 149490450 143973091
10712 143973091 137621837 130579001 122978231 115073715 107096248 99355233 92229397 86169384
10704 86169384 81615713 78769610 77777768 78629537 81383546 86097481 92945887 102067831
10696 102067831 113507485 127362295 143598024 161958010 181834831 201912056 220067229
10689 220067229 233302719 239042851 235795625 224082909 206001204 184818256 163554535
10682 163554535 144347959 128407711 116184161 107703071 102953391 101690156 103847281
10675 103847281 109277584 117469004 127326863 137339504 145310860 149146015 147407517 139913852
10667 139913852 127736614 112768281 97182324 82555538 69725304 58978744 50313586
10660 50313586 43429710 37935335 33391287 29604381 26545971 24032696 21851668 20032253
10652 20032253 18557656 17308041 16188803 15220793 14333278 13601931 13004512 12461492 11983523
10643 11983523 11544954 11080926 10679701 10339384 9993340 9719775 9554121 9482856 9382652
10634 9382652 9368356 9291397 9211287 9236171 9271869 9378185 9648120 10051978 10688782 11585860
10624 11585860 12894299 14733431 17299764 20779754 25184764 30017800 34368080 37342763
10616 37342763 38556121 38304024 37352668 36754984 37389622 39773130 44364608 51591966 61437913
10607 61437913 72682016 82710747 88906870 90452793 88097193 83558723 78794272 75302687
10599 75302687 74146121 76177498 81967303 91317701 102038643 109997180 111719882 106829072
10591 106829072 97322724 86453709 77580095 72224594 70417186 71957736 76326874 82424096
10583 82424096 88066292 90486567 87763231 80234601 69801315 59025359 50051957 43607164
10575 43607164 39653711 37806753 37601319 38392665 39090123 38669864 36561293 32765626 27936970
10566 27936970 23002405 18705144 15335144 12753409 10867146 9372223 8279057 7455518
10558 7455518 6802298 6281067 5908820 5621280 5272371 4968638 4702136 4404848 4140295
10549 4140295 3911684 3643382 3423293 3295007 3103505 2907081 2751148 2600867 2503994 2438201
10539 2438201 2407692 2391837 2366855 2378788 2305075 2279262 2249481 2150881 2053009 2024608 1986043
10528 1986043 1946463 1920036 1908746 1904629 1819680 1743423 1711896 1720166 1719756 1766755 1704041 1603460
10516 1603460 1567860 1599677 1567412 1563903 1543263 1474685 1449386 1426081 1375728 1327433 1355708
10505 1355708 1333043 1286738 1296345 1285835 1222428 1163454 1184521 1157719 1124399 1078614 1127401
10494 1127401 1135339 1125467 1094460 1070839 1054325 1026493 959447 946832 910465 895580 897086 889921
10482 889921 812774 758649 690370 704164 726567 676576 645362 666505 723485 739024 726444
10471 726444 655930 593633 548088 527727 552850 510773 492241 530392 556167 560626 561151 570986
10459 570986 558995 533751 491514 505039 556253 562786 582522 658259 680585 609783 628671 641356
10447 641356 635085 620134 560360 514125 556112 644824 684732 682243 636583 626396 652200 715220
10435 715220 675666 722818 776986 785253 797000 797477 790177 693299 639508 641864 647873 667257 681302
10422 681302 747576 757004 710413 697124 666234 649802 650617 639172 598066 599044 569166 561399 521766
10409 521766 491402 510124 541229 586287 586861 586241 635811 663590 676897 630982 637499 711982
10397 711982 771008 752225 747434 778072 878934 1004392 1131019 1266891 1386377 1487747
10387 1487747 1624568 1705049 1721584 1616693 1561117 1458327 1318086 1238643 1123786 1026179
10377 1026179 942982 866252 816203 800070 739834 709219 702189 676360 667178 687181 707555 731416
10365 731416 699294 691525 705972 672255 610803 645238 638691 619018 698253 733126 761987 773946
10353 773946 779233 769420 788315 830463 943203 1063278 1212003 1319928 1480233 1680747 1849172
10342 1849172 1918806 1843936 1749312 1667039 1479587 1307245 1159667 1053513 923032 820490
10332 820490 790159 729924 680736 711810 713646 656358 650702 662145 665226 660673 657851 716932
10320 716932 805132 894241 923178 928565 1028243 1138554 1217116 1314446 1405292 1491369 1519244
10309 1519244 1534335 1536778 1494815 1488140 1512852 1493388 1410072 1329523 1303813 1265193 1274271 1233987
10297 1233987 1263080 1409654 1456087 1526347 1576041 1677700 1783980 1899603 2035877 2173004
10287 2173004 2220917 2179238 2165826 2086299 2011121 1921924 1857318 1803356 1744223 1736278 1670862
10276 1670862 1585676 1517016 1550833 1501266 1429016 1382487 1324888 1276520 1237298 1190125 1126384
10265 1126384 1064729 1027085 1007651 1008200 1022500 1033656 1041094 1023129 1013376 1045681 1057300 1104655
10253 1104655 1211857 1385347 1493246 1574221 1601407 1599295 1603671 1630038 1603638 1514021 1401865
10242 1401865 1344040 1256116 1144895 1078360 1061078 989020 965127 1006999 1058388 1098791 1143427
10231 1143427 1176518 1220974 1207936 1236376 1242161 1170470 1024548 940798 929280 897730 852443
10220 852443 777634 719584 706183 719198 694859 689837 764665 788712 784190 733249 710102 733166
10208 733166 798675 813389 830386 838488 810393 780357 720493 633929 623623 661375 673913 706759
10196 706759 695606 699271 734725 790930 748495 731509 725940 778147 767705 746205 741102 712976
10184 712976 707028 690873 741902 770900 768003 757627 719079 643506 629026 635248 665320 730254
10172 730254 777774 841202 869781 854636 834293 866938 845426 850220 822849 789130 774876 824900
10160 824900 934684 954794 996739 998033 963408 907128 822030 758949 719711 690794 694499 751694
10148 751694 766527 805940 792042 802426 793311 749917 689513 630982 575073 572532 597976 543440
10136 543440 528690 478003 435002 476107 514699 488143 441007 373896 351057 368503 414396
10125 414396 407632 332291 300217 215007 208301 228092 222051 212396 233909 278693 301547 365845
10113 365845 387336 357100 296586 251681 206895 170852 172067 178822 174002 191867 261526 273983
10101 273983 260672 215001 233302 188890 227273 239692 278741 273396 240963 257108 245420 233845
10089 233845 179283 183138 200894 215455 290364 265194 313682 349509 279621 282493 274424 295964
10077 295964 301711 253586 236948 211662 242878 243533 202023 229670 305694 321620 284790 253190
10065 253190 298801 356336 381814 319371 289457 293168 321689 298972 284399 302416 348801 293665
10053 293665 282530 298929 294100 270246 289158 264757 284556 300332 295816 314322 388640 410600
10041 410600 366765 338323 356698 377351 326106 287886 340686 387372 430485 423519 418052 356967
10029 356967 372518 401490 368259 372853 405669 462949 533411 524101 526987 556603 530616 550946
10017 550946 569635 557292 512339 526538 501019 504304 517090 504381 529291 500141 480847 497565
10005 497565 545691 578906 627886 658111 677060 680140 723677 741515 710575 632251 628139 628676
9993 628676 693770 767801 775662 786800 755888 707708 670168 668227 706009 730595 741871 788007
9981 788007 842612 868297 841379 871619 907334 864849 828704 832835 856784 854478 826494 843162
9969 843162 869182 898614 926874 884957 862771 880198 860800 884235 939643 979024 1025068 1077343
9957 1077343 1066056 1065514 1072361 1103262 1181994 1251965 1274104 1370021 1481085 1503535 1565220 1588648
9945 1588648 1647089 1673091 1769114 1864198 2029665 2185711 2266565 2431103 2590033 2846599
9935 2846599 3079235 3277103 3458063 3724976 4099272 4503252 4953794 5458231 6078590 6800836
9925 6800836 7639564 8675540 9915563 11431860 13254762 15397267 17888609 20471008
9917 20471008 22931930 25051193 26695747 27898433 28817372 29500402 30112376 30702470 31229097
9908 31229097 31622744 31881475 32095687 32457549 33233472 34705005 37003215 40217517 44308194
9899 44308194 49090291 54033729 58664144 62704276 66049406 68784153 70991116 72741087
9891 72741087 73848328 74116284 73360013 71703662 69372460 66726971 64082523 61743307
9883 61743307 59954350 58836857 58443044 58766478 59796322 61438651 63459890 65610768
9875 65610768 67797174 70033779 72085732 73700453 74653036 74764069 73977009 72337071 69845908
9866 69845908 66661366 62944694 58762710 54419887 50059443 45968793 42426421 39557928
9858 39557928 37387204 35952798 35163892 34861575 34806665 34826775 34814360 34683593 34448016 34219365
9848 34219365 33912984 33398206 32672949 31655736 30324065 28843502 27520245 26548437 26047091
9839 26047091 26032200 26512025 27459164 28744565 30299925 31919301 33652628 35263971 36636190
9830 36636190 37680399 38393701 38751512 38798714 38557643 38210918 37885170 37649140 37712667 38296221
9820 38296221 39638005 41860294 44995274 49046155 53913810 59232867 64780817 70359909
9812 70359909 75699333 80558761 84792807 88119444 90280728 91052093 90335337 88087003
9804 88087003 84581922 80171143 75347952 70699337 66791710 63999620 62536302 62391715
9796 62391715 63441385 65619178 68838397 72727886 76885502 80878333 84362786 87130431
9788 87130431 88970728 89576070 88777415 86644689 83241887 78747005 73480277 67723114
9780 67723114 61790325 56009694 50715653 46217514 42646096 39995184 38107479 36942014
9772 36942014 36242436 35901564 35664925 35427974 35188781 34937478 34675696 34230517 33482117
9763 33482117 32229942 30367609 28015327 25379078 22581494 19922910 17550631 15470502
9755 15470502 13696112 12116000 10843955 9825333 8896486 8067650 7288352 6667220 6119801
9746 6119801 5612228 5151435 4786612 4468539 4187440 3892182 3630131 3453788 3276919 3139096
9736 3139096 2986039 2924003 2836363 2675955 2579985 2522026 2425695 2312289 2233120 2223751 2212743
9725 2212743 2138712 2023651 1979641 1961421 1935880 1880197 1812933 1789972 1718628 1654035 1564111
9714 1564111 1498944 1493046 1436279 1418129 1413187 1381147 1366897 1338611 1323346 1321596 1293688 1187387
9702 1187387 1162016 1221602 1180033 1167767 1143808 1084107 1066678 1074020 987356 992353 923150 892785
9690 892785 852737 819058 771498 735101 698188 640215 646727 655994 659877 657780 672802 697831
9678 697831 707529 704158 737395 760326 741015 704716 736481 739174 718133 656936 532444 517815
9666 517815 470575 472360 479979 444928 437240 423825 467778 515997 580515 615552 602374 577524
9654 577524 580634 571831 597252 638173 711616 793658 873463 875007 850593 808940 724314 657379
9642 657379 561082 546553 555760 549609 469641 432277 434972 448165 479698 474887 525161 636120
9630 636120 658203 599525 570381 564781 553337 522285 515094 457828 455934 437106 452233 412659
9618 412659 382314 405028 470818 476668 493781 510443 525561 515312 520667 486636 566573 578352
9606 578352 494617 497216 496924 488459 514683 553547 549674 566558 499152 456834 473542 459372 407882
9593 407882 400773 385133 339089 294771 307619 338028 382373 399687 381113 393263 384612 413371
9581 413371 401743 383485 402460 414199 448278 453943 452218 404797 347926 374331 397554 368463
9569 368463 443955 500235 492647 437996 395230 359352 398814 460879 406787 370461 364732 383815
9557 383815 403352 352168 336182 381115 380704 413983 411611 437794 449553 437680 418650 387243
9545 387243 374125 363382 358790 343218 327873 321820 308179 348488 408099 417869 385673 344406
9533 344406 315110 277936 287711 333515 332489 328484 290564 239087 251051 309166 337259 334422
9521 334422 284856 291952 355825 388190 353169 378079 397866 400185 379703 393473 375305 381626
9509 381626 391060 401889 447922 447032 452118 424699 391666 393934 357179 409042 473206 519680 520401
9496 520401 499801 510555 490483 528355 562036 563128 540309 536968 577804 652547 657095 680053
9484 680053 683691 669192 642809 619745 597869 542744 557344 593690 522830 518572 564239 534917
9472 534917 489962 543868 611059 606582 652576 649289 641382 684408 705288 690236 611574 578678
9460 578678 584226 584008 599640 563052 537871 583454 609092 550620 531308 554722 534469 509822
9448 509822 483295 463557 494742 500146 503478 484215 458724 447776 426680 419779 433445 472616
9436 472616 498889 541777 553950 536849 543804 548124 593190 635479 654303 646197 664249 709569
9424 709569 685894 627938 647313 679854 728074 742547 723489 719441 737468 786371 838538 899360
9412 899360 966301 1022619 1114935 1189890 1311211 1407647 1483836 1575450 1667047 1789520 1904154
9401 1904154 2098848 2320412 2543911 2865680 3268328 3681441 4057146 4340164 4554506 4707749
9391 4707749 4679698 4577491 4404810 4164035 4001561 3857137 3743922 3720498 3786081 3936342
9381 3936342 4109119 4415861 4813630 5265368 5757638 6284368 6821104 7275411 7575962 7659312
9371 7659312 7619778 7395455 6939473 6473780 5970187 5523525 5207463 4993373 4869890 4880217
9361 4880217 4952258 5075913 5395436 5817371 6289506 6896884 7758254 8629503 9440660 10218233
9351 10218233 10817079 11120903 11086765 10760739 10231396 9554803 8879265 8302927 7861732 7551982
9341 7551982 7384291 7406643 7571529 7910997 8486923 9251469 10204144 11393314 12771426
9332 12771426 14251733 15561886 16592887 17251596 17445524 17313609 16963625 16621992 16404986
9323 16404986 16285435 16255116 16133968 15909833 15618636 15222067 14806166 14465142 14306992 14509773
9313 14509773 14973830 15601457 16348860 17153664 17884491 18549442 19142351 19772853 20500218
9304 20500218 21252309 21981686 22538939 22806656 22562225 21809671 20718091 19483215 18228478
9295 18228478 17150388 16330189 15863844 15655519 15730829 16122887 16748749 17537494 18528613
9286 18528613 19608110 20819765 22086315 23421779 24853422 26203691 27338821 28112837
9278 28112837 28270244 27921610 26905101 25483227 23904675 22365228 21050667 20055787 19421949
9269 19421949 19162150 19310202 19713410 20413218 21454925 22953487 24998315 27538324 30424459
9260 30424459 33291663 35666856 37081830 37267826 36291632 34366759 31985032 29541432
9252 29541432 27403416 25699690 24365268 23352150 22496374 21810932 21398965 21263706 21448049
9243 21448049 22015091 22890582 24019380 25238159 26458750 27502873 28213412 28505088 28418945
9234 28418945 28061946 27524147 26921082 26208592 25395135 24492128 23482077 22352432 21172536
9225 21172536 20041512 19135439 18565308 18261609 18298746 18727966 19506422 20497496 21671132
9216 21671132 22822621 23733732 24399660 24832280 24991820 24984073 24972475 25001466 25100488 25015169
9206 25015169 24636829 23832436 22674662 21351523 20038222 18878404 17986286 17492249 17304323
9197 17304323 17358582 17525002 17774589 18130645 18647358 19322057 20352858 21702634 23113013
9188 23113013 24430976 25390603 25691888 25082781 23718536 21794321 19668096 17607526 15719506
9179 15719506 14135052 12949815 12069036 11425437 11054972 10979481 11089493 11468617 12104502
9170 12104502 12953427 13959668 14961752 15744494 16216286 16386409 16176687 15579081 14638355
9161 14638355 13467018 12239406 11062960 9997059 9083021 8299246 7728952 7347536 7119425
9152 7119425 7045252 7143000 7428596 7787808 8281051 8930579 9661283 10430700 11027038 11315921
9142 11315921 11213610 10754572 10060241 9143042 8171271 7268309 6499912 5871328 5407527
9133 5407527 5074393 4845895 4746200 4760840 4866530 5064219 5324339 5617966 5898990 6124141
9123 6124141 6158984 5956460 5607883 5110906 4630864 4127064 3673498 3235284 2894813 2587588
9113 2587588 2349529 2155006 1952779 1826741 1671390 1569270 1536407 1464805 1341643 1262020
9103 1262020 1173456 1136812 1107838 1101515 1059297 969789 969695 946041 870700 822848 839773 844829
9091 844829 766595 742088 769723 855430 839635 818836 855216 901437 875546 818275 771847 717087
9079 717087 666025 627644 637714 678588 679970 719751 710096 666575 588914 614962 626907 620971
9067 620971 640687 624081 545965 452364 410817 373858 390140 417210 415816 446068 446633 443051
9055 443051 440671 520717 535856 541158 530669 496796 521714 528917 523504 542584 566873 538129
9043 538129 501189 519976 567017 551608 479895 366685 365308 401444 440943 409452 422265 499333
9031 499333 521393 572615 575700 520636 548363 538299 516579 504872 479925 505729 542026 520706
9019 520706 450999 394210 443252 472385 450542 491097 450162 420287 414038 396946 396362 410987
9007 410987 433757 457244 469620 492849 465197 415109 443732 454591 403242 405597 411548 437739
8995 437739 464458 469178 448957 432353 472665 459909 454514 534730 545982 539831 497217 498891
8983 498891 486032 391726 321846 328640 418429 483499 432328 446013 476212 412342 399008 462917
8971 462917 435456 406559 359235 350872 392592 385963 360206 358981 381624 459983 501588 468014
8959 468014 440939 402692 380929 372549 362158 321930 289326 295308 283558 344079 376547 370824
8947 370824 346036 335318 312215 289179 247654 235924 251168 251311 230048 234125 263646 323599
8935 323599 325692 345180 365056 406536 406931 379320 364502 322875 305998 355038 353554 324075
8923 324075 331066 346710 350540 406660 439283 404742 373795 397801 449699 434025 389580 391522
8911 391522 378064 408901 392653 395755 409058 360470 360561 403636 415318 373807 367717 361060 375879
8898 375879 482137 522243 533135 521522 479878 463937 490045 452407 431303 446930 417243
8887 417243 365082 356573 369669 384915 439621 472315 501307 521596 536587 528222 491010 474708
8875 474708 462719 467563 452081 425493 457913 488040 476376 488131 548985 548820 550394 561053
8863 561053 566890 568364 604987 661528 652666 671952 680150 685428 732917 757258 753374 744067 812390
8850 812390 859021 853064 741280 690324 680622 702410 709109 678509 700753 782513 833834 881855
8838 881855 875872 895671 917045 953586 994727 1092258 1228743 1265825 1332325 1436714 1529201
8827 1529201 1622055 1776276 2032547 2304676 2584761 2841666 3066164 3294830 3421280 3502473
8817 3502473 3588337 3580635 3498377 3367640 3211357 3043991 2803478 2636368 2491959 2346038
8807 2346038 2234109 2183785 2130002 2117247 2136422 2152556 2174006 2260985 2347859 2428064 2461032
8796 2461032 2566830 2670648 2798440 2957855 3146656 3335221 3557115 3800727 4098374 4475388
8786 4475388 4919998 5469859 6194696 7085439 8239371 9675162 11463181 13697999 16376637
8777 16376637 19490754 22969718 26580513 30066687 33312957 35924355 37508393 37873978
8769 37873978 36969832 34923942 31989031 28610987 25091892 21815919 18926375 16541119
8761 16541119 14692051 13191762 12028712 11203033 10597885 10178360 9862789 9693004 9610157
8752 9610157 9665538 9814520 10041016 10414830 10869806 11412148 12039860 12776409 13633804 14588220
8742 14588220 15811510 17318138 19087388 21019777 23220784 25760950 28507741 31327103
8734 31327103 33888537 36015167 37379692 37855712 37442163 36221267 34415461 32384171
8726 32384171 30414621 28714720 27559810 27034337 27143779 27762611 28870919 30367340 32103554
8717 32103554 33932949 35727359 37426902 38830476 39892604 40426206 40394186 39812133 38895284
8708 38895284 37880874 36963784 36354763 36196888 36452786 37173744 38309709 39589046 40855095
8699 40855095 41909159 42530010 42777058 42732810 42622973 42630975 43127470 44196474 45660202
8690 45660202 47334686 48841875 49688776 49758819 49016213 47529713 45668941 43810070 42282702
8681 42282702 41384110 41281689 41986805 43507031 45596516 47866732 49688025 50702100 50598634
8672 50598634 49429841 47553768 45434955 43446267 41748716 40574744 39931856 39744457
8664 39744457 40026366 40782230 41899716 43229990 44621443 45926969 47010183 47730320 48152316
8655 48152316 48415554 48741390 49187139 49710481 50245745 50639212 50704989 50415093 49729590 48648510
8645 48648510 47410266 46174381 44945765 43862029 43008078 42218640 41418352 40529133 39606581
8636 39606581 38817201 38272040 38162251 38479935 39150782 40028711 40979691 41815919 42451285
8627 42451285 42834674 43025801 43092265 43041338 42930960 42790560 42715281 42811966 43032330 43251805
8617 43251805 43315950 43127031 42579795 41704292 40498821 39130364 37742082 36584329 35840320
8608 35840320 35661532 36102867 37034815 38339126 39688104 40847366 41540397 41619442 41194217
8599 41194217 40477593 39611969 38998426 38816105 39074956 39769199 40705615 41665326 42404580
8590 42404580 42539717 41988551 40780936 39289670 37799723 36426576 35332520 34454721 33742274
8581 33742274 33239344 32766609 32221764 31521196 30531927 29089800 27210799 24992441 22700222
8572 22700222 20505952 18572593 17009139 15845292 15057945 14651227 14592128 14843240 15404880
8563 15404880 16257720 17475416 18929145 20535332 22139312 23580332 24714709 25367949
8555 25367949 25467004 25187422 24594790 23702651 22556815 21138853 19494962 17691090 15854143
8546 15854143 14225916 12841814 11636303 10626475 9870084 9301146 8823717 8423070 8169769
8537 8169769 7963650 7756474 7645155 7526679 7500267 7683165 7933388 8267592 8824315 9606352
8527 9606352 10645782 12048762 13627711 15424064 17341535 19337116 21194621 22682749
8519 22682749 23595996 23720829 23061919 21705612 19783095 17526013 15293683 13226777 11360548
8510 11360548 9786220 8404864 7264760 6311254 5540916 4934297 4394862 3921948 3549620
8501 3549620 3280996 3088381 2825361 2641161 2456520 2329453 2245600 2136891 2013057 1914431
8491 1914431 1861968 1759386 1576795 1479097 1418104 1421893 1422528 1413301 1392165 1404631 1437389 1385444
8479 1385444 1388914 1460351 1466343 1490404 1541534 1563473 1621764 1692166 1758656 1742341 1727338 1738598
8467 1738598 1721197 1691842 1646849 1620752 1603498 1478666 1368466 1307575 1203567 1132058 1072115
8456 1072115 1035730 957289 874196 896636 929210 874031 800673 745044 706488 692238 675024
8445 675024 609656 553020 598618 617999 648204 671126 583628 515621 547042 596797 554450 515305
8433 515305 519014 464635 458901 458149 490824 513644 514197 554171 518887 521900 494037 415778 358967
8420 358967 382654 396859 417577 493604 501270 515610 541981 510893 431921 415208 385590 377537
8408 377537 351860 334559 354571 387702 396855 402461 395665 363683 399969 448024 376189 368085
8396 368085 386459 385443 372160 376885 390370 376701 379128 386034 402604 466543 455093 378258
8384 378258 364766 400192 441234 393966 278908 268712 320970 401286 443225 423051 399683
8373 399683 445073 462313 455542 485842 501524 475784 470648 488076 471640 503396 511700 540385
8361 540385 510115 455170 422497 452375 518177 531782 479832 423234 366810 369904 399815 408407
8349 408407 433580 464153 404102 431559 440481 457120 473237 530634 564278 559157 576916 580931
8337 580931 622109 714654 939674 1261284 1682588 1966888 1900448 1707009 1327504 980653
8327 980653 785302 721739 709650 716137 671400 655721 666269 672352 674215 607720 585857 582702
8315 582702 540206 480095 479004 506758 581990 627211 603934 619225 650112 601479 546173 562440
8303 562440 540505 535951 574363 590942 600986 644447 654881 670692 669005 728193 840839 1025790
8291 1025790 1352170 1906541 2727969 3472951 3452026 3107954 2434957 1739663 1312647 1083138
8281 1083138 980358 922465 893851 825481 713317 656262 665029 711283 691449 688735 740829
8270 740829 699032 622009 656777 663231 644306 641027 607476 611154 642746 621539 566723 556290
8258 556290 600048 612092 623355 675386 755390 741703 696626 696068 719493 771011 822383 915424
8246 915424 1120023 1521279 1936491 2013019 1853572 1549014 1168400 941149 853151 743715
8236 743715 683842 628933 559149 502854 520493 550889 561877 574241 601274 567685 552135 540694
8224 540694 528431 489858 509646 430458 447678 524215 555757 518372 479928 483437 523783 493572
8212 493572 488289 495392 437830 402987 354043 377519 406766 428438 455126 437873 463113 440730
8200 440730 470209 552851 586589 593207 573368 555146 496883 455802 421277 376819 409869 464541
8188 464541 467011 463945 496198 553456 579005 533973 483018 451117 489894 482711 474045 422763
8176 422763 411462 387204 371011 344621 275249 231053 243130 278056 302071 302548 286231 259747
8164 259747 304301 296497 237960 256685 296612 315511 311572 265120 242736 256899 314385 329852
8152 329852 340768 311498 322135 340113 326481 301628 244138 238150 226512 219340 270526 303066
8140 303066 298901 287955 277442 257638 213179 193530 193638 197847 199660 167818 150136 158965 192047
8127 192047 204986 247756 204588 166160 178694 236982 248281 246586 261862 227869 168022 161203
8115 161203 221097 283761 306037 256867 255415 286993 334059 330905 273612 252718 218811 200901
8103 200901 183936 177566 208630 229029 190748 177182 187028 209475 192358 204559 207091 155429
8091 155429 145081 174123 199475 219076 199571 110216 121144 154640 135794 156207 184648 141257
8079 141257 135768 136123 101898 115509 179472 208604 185321 214031 213813 200241 156201 129825 146449
8066 146449 135094 135732 126527 149536 190054 181314 196248 219751 221348 194761 200143 218708 176992
8053 176992 149446 154755 149199 177931 132123 72611 50283 -4897 25363 63705 88501 109920
8041 109920 70246 81750 74349 78404 90785 67949 62714 54379 79714 91304 65607 78391
8029 78391 99303 106692 124823 130539 112821 77881 70324 93420 130359 127941 111142 155853 193798
8016 193798 213114 176988 141952 106459 93300 124350 148653 214437 229670 133678 65700 63078
8004 63078 77341 140289 143192 153534 151753 90912 101913 145044 150651 147907 183637 150133 86903
7991 86903 30168 35295 51651 58742 127537 135184 104813 132954 109469 101496 113001 101117 125798
7978 125798 157856 150627 153500 188286 152608 132281 121247 94538 76138 106129 124733 102901
7966 102901 92779 124933 118694 117569 203051 249370 242827 241517 269566 198827 141894 47065
7954 47065 6536 67592 99078 93793 81806 102840 128466 155429 121289 33320 49573 123770
7942 123770 151219 162127 153324 114697 115118 114162 97036 36007 -1711 -17955 11705 69671 94314
7929 94314 127668 119241 103775 89685 89802 95142 108108 142759 144753 189841 171517 109287 36040
7916 36040 32272 50355 111502 168472 220706 247128 200521 120822 107630 109970 78050 37426
7904 37426 49992 64713 36202 -5062 30390 65482 45864 49744 67263 35657 25789 123936
7892 123936 181660 172955 167763 161046 154872 94503 69112 63213 83433 152588 176608 222611 200551
7879 200551 121530 88801 88343 104924 108695 111029 81236 59294 73395 117028 163882 190530
7867 190530 145767 115240 110094 120257 105635 59768 8014 -7493 29099 87961 89274 79145
7855 79145 97716 129307 157610 169921 141259 156984 132064 81690 112262 169798 138394 76118
7843 76118 94857 71465 79977 55875 42958 46747 30150 37819 17640 28595 91319 61952
7831 61952 59375 102762 163683 172382 156448 129978 105846 114288 134935 143298 143428 185746 193024
7818 193024 121553 106009 181419 212224 145127 102476 54869 88933 135319 154241 113240 54085
7806 54085 8195 65351 99621 152875 181092 165530 119638 104627 142180 133306 124469 130837
7794 130837 154257 150556 149177 141993 89766 55045 52408 65872 6148 15447 5505 78622 105691
7781 105691 76464 92338 77668 40460 25805 79286 97617 125070 145462 96600 65285 56573
7769 56573 45172 39885 64606 100699 62458 49838 -24127 -29279 10774 5481 -20693 15255
7757 15255 85593 98915 94791 85402 65874 78977 84703 64798 46230 33202 16331 44944
7745 44944 108946 118079 48563 -20438 17680 63346 69332 108637 116737 147039 124995 154860
7733 154860 178104 173628 101664 146669 256686 295529 224548 157141 140736 122766 140591 135547
7721 135547 89551 75753 79814 101613 140397 122423 107396 120218 43313 68341 122090 132738
7709 132738 61381 25519 81741 141219 187074 158299 130232 135542 91660 37999 -7682 29550
7697 29550 74810 64258 63865 13476 -3366 -18673 -50403 -19894 -17146 18846 29202 37475 32264
7684 32264 14004 59025 41091 19271 34676 71406 136977 135856 70259 19954 49654 56822
7672 56822 70028 63566 -2705 21694 15822 28474 76353 86068 33695 51537 95054 88206 52277
7659 52277 50195 96467 151567 177189 171512 158962 136958 101708 56391 59143 65586 51192 48325
7646 48325 50494 38540 -1694 19060 -31792 -77826 -67339 -42525 -7750 -7974 -1692 13785 15291
7633 15291 23462 60246 19616 -31636 -4291 90157 101255 101610 117621 138496 69051 32907
7621 32907 53917 78768 68330 43444 18821 -10188 -16848 -31784 -33936 -18762 -62076 -19145
7609 -19145 47076 78212 55703 16365 7045 141 45184 86257 103854 98859 95716 119424 127310
7596 127310 167502 156400 123123 75011 79348 120135 132551 118172 34095 18221 49795 83948
7584 83948 98486 41079 -2796 -8975 127899 190030 159791 130069 101688 70753 47767 72457
7572 72457 64720 11553 19014 26891 67739 105815 90169 87306 72564 47033 67711 75703 96642
7559 96642 113588 72668 48633 44977 46343 25498 25854 13945 -8264 4342 67649 144300 157335
7546 157335 150112 134931 118183 97563 105353 120336 50286 8712 7366 32439 24785 11174
7534 11174 70805 91421 30028 51059 75581 62865 53090 61497 37413 29865 27830 -5742 -5844
7521 -5844 31373 48840 11074 44082 63409 -966 9145 51381 34700 12741 8923 -35854
7509 -35854 -30555 -4276 45674 54243 49483 46076 15621 50040 65521 46071 71049 49195 -10657
7496 -10657 -8971 20300 1848 -58282 -76898 -57123 -3132 24746 -12302 27523 41497 3920
7484 3920 -33575 -24373 26468 -17100 -30240 -25002 5040 92713 86725 27890 12799 37950 42064
7471 42064 49310 48185 81104 27554 -20697 -22857 -5491 29598 74826 93171 48883 -28520
7459 -28520 -61053 -53489 -62815 -40668 14290 68308 53640 34092 7024 -4160 62922 83872
7447 83872 47833 19615 7430 64587 88934 80411 91531 139169 142851 130106 124393 72318
7435 72318 26209 1903 -1191 20007 -13111 -3519 36510 79333 84157 17653 13759 55531 43369
7422 43369 14076 -25882 -36950 -48775 -77136 -69962 -51632 -20327 10366 -15213 7863 51836
7410 51836 46998 42724 33901 26929 -10950 -59550 -57069 -32622 -38875 -29381 4816 -885 -107111
7397 -107111 -110708 -16153 25985 71752 87499 38501 41094 -2921 8771 13105 41122 10188
7385 10188 -20854 22178 104304 69845 37096 5030 31796 67833 96111 90267 64164 60744
7373 60744 45108 66451 113307 102648 94823 90924 43809 -18362 -34709 -49737 20310 92602
7361 92602 74100 8813 -15766 -11874 48635 31485 16782 -493 -30477 1963 63870 56952
7349 56952 25200 24259 66488 44748 12272 68657 61025 -13405 -8312 52846 36420 -37489 -19389
7336 -19389 -23669 -49688 -30062 16997 26066 48703 79328 93209 78216 54216 47526 43186 22834
7323 22834 38666 43173 81462 78738 42517 48100 25452 28351 50511 6509 -8816 36141 50757
7310 50757 76692 76057 88315 105934 99337 131114 90574 52627 38095 16102 8186 2420 14287
7297 14287 28450 49833 43417 585 17766 38822 68666 62151 51078 69115 42690 -3687
7285 -3687 -105 -6428 43160 86662 39623 32423 32420 23822 29377 33096 40304 59187 107489 113235
7271 113235 85353 52050 12073 394 -11123 97636 135310 104171 104321 62535 51234 41560
7259 41560 -20599 -70573 -61602 -5959 18115 37364 25852 39707 47980 27264 -16336 -22323
7247 -22323 -46641 5270 38264 47207 2177 11756 -16919 -2131 37615 50744 55662 24157
7235 24157 52179 95416 95352 44638 48998 22729 -26040 -32953 -33070 -12212 -5685 -4508 -20322 -5995
7221 -5995 38010 67748 10588 -15384 -46920 2841 49143 71579 34145 29680 43987 47499
7209 47499 17954 32659 83045 120937 154620 162288 150900 178988 152359 86162 -9188 -12909
7197 -12909 -10572 -22673 -16721 6184 13248 6332 267 -36444 -39154 -10584 -53415 -57586 6853
7184 6853 -11999 -54024 -68946 -33046 6242 -1038 -36005 -8406 17328 -5662 -18562 -15268
7172 -15268 -3482 2420 -15597 -27742 -36418 -11731 -23002 -8576 24327 50003 71693 74401
7160 74401 3430 -54093 -28908 5217 -14880 7725 20225 50465 62610 39769 78694 81367
7148 81367 32182 16938 48168 93006 69776 20506 2535 30653 52561 77137 50052 46207
7136 46207 76581 56549 78487 76764 33509 262 -6819 -15452 -6735 -1235 17520 22270 61503
7123 61503 127752 113171 46606 27582 60101 38156 46296 67467 37010 22791 -28777 -18030
7111 -18030 -25838 6451 8631 9985 7000 -29982 -42759 -4919 42115 25355 24857 -20341 -21545
7098 -21545 -19910 -46416 -31137 -47565 -50969 -56324 -26029 24823 68219 61965 50833 30119 40953
7085 40953 21373 64084 85630 70050 71253 63350 85241 74226 31864 -11399 28917 82486
7073 82486 58144 58705 960 -42171 -23988 6650 31755 34352 70851 106305 62879 6178
7061 6178 -25558 32734 73290 50637 69459 114701 136014 110888 75603 67310 58244 69896
7049 69896 22934 18130 24895 33412 53481 117032 114447 88771 89620 73715 68920 93623 92031
7036 92031 72125 79638 47611 76434 71380 60160 61686 87974 94155 94790 28127 18854 -17588
7023 -17588 -17224 5011 -13974 10598 64715 107240 66185 52563 12981 20690 38697 20036
7011 20036 -7264 -34724 -39770 12220 59916 115074 52996 42561 22209 -5002 -15677 -11546
6999 -11546 -52192 -27432 21976 110620 134614 69555 55892 31683 8588 9801 -24718 -24136
6987 -24136 49250 104452 113451 54515 53601 45049 -2926 25969 34759 -8903 -21511 17074 59299
6974 59299 43109 6998 13864 12048 35929 16933 -5921 9277 14345 38517 66270 31848
6962 31848 16529 19160 5749 -9434 11374 21108 8686 -1415 -3514 36321 57876 18625
6950 18625 16828 33024 79807 66400 -3661 -43550 -84463 -63326 -29648 -121 25525 24232
6938 24232 -12731 -35124 10430 -2109 -60844 -72369 -58137 -2846 14928 11502 -1050 1839
6926 1839 -10498 -20702 29932 38068 -24336 -47589 -63763 -22397 -30681 -73431 -89459 -51692
6914 -51692 -66375 -93454 -103624 -84531 28431 102758 88706 103351 91590 61970 66133 76254
6902 76254 14866 -1337 -35903 -33419 -41935 -12748 -14148 -46009 -48510 -25273 2019 -1462 55629
6889 55629 62163 519 -3225 -24030 3395 58021 65216 35350 -237 31935 59042 22196
6877 22196 -48346 -43425 -35270 -17609 -12025 -40032 -19830 -33901 -36451 2994 14089 -9191 -47175
6864 -47175 -50018 -91317 -116028 -63628 -66209 -68141 -56779 -62638 -1593 12692 47181 46884 30729
6851 30729 26715 -2523 50895 29511 -28718 -22695 19804 8297 -19647 52723 66758 71275
6839 71275 76882 84396 78514 20940 17516 27879 -2312 -56916 -114849 -111655 -85852 -63943 -38047
6826 -38047 -8382 -18168 1313 13094 26617 -3014 -87189 -111781 -90298 -50273 -20581 -19168
6814 -19168 -26043 -23185 -17115 -3330 23690 24042 63235 27711 -62964 -68664 -19877 -20604 -35231
6801 -35231 -44092 -49596 -49048 -8732 -10039 11013 4984 -1486 -35316 -7711 10236 60865 42864
6788 42864 11540 16139 15384 -17606 -66156 -49363 -22734 -60384 -50146 -37870 -32694 47013 77650
6775 77650 48184 47086 84051 67825 80173 86515 58529 10952 3230 -9382 9161 30477
6763 30477 -259 -17394 -6984 4034 31074 79730 116465 85116 -40858 -42260 78582 137394
6751 137394 124346 81316 56068 -24469 -15452 -45969 -12722 63409 89366 71414 37576 27836
6739 27836 40010 30188 27570 16696 1931 -5023 -10418 -34536 -15315 35898 -2607 36916 26867
6726 26867 42280 65180 78425 46170 74810 132047 141001 120297 123825 78329 68614 84375
6714 84375 76788 -3614 -23645 -9185 -16032 -25069 -50979 -1130 27084 83950 105765 90394
6702 90394 62919 36428 -10841 -46992 -11687 27547 33546 -718 -66315 -84940 -72971 -36706
6690 -36706 -22666 3408 45645 30712 19089 57848 84373 77805 81170 68450 92638 62658
6678 62658 22113 -10813 19119 49574 82076 74608 26694 -19081 -28161 -61096 -75821 -47910
6666 -47910 24767 40669 -515 19295 7779 14884 50094 79250 40978 74637 84709 46865
6654 46865 43937 55494 31819 16929 -9053 -16543 -26629 13685 58420 51304 42236 38013 9445
6641 9445 -36874 -45706 -47233 -12316 1130 17917 31888 23916 52851 79494 68868 27848 43605
6628 43605 31897 45731 20383 -23811 -70228 -66451 -21494 38309 88969 133414 159320 114746
6616 114746 61707 50171 46833 42928 10024 -21966 18353 47297 2966 -4722 7593 -19806
6604 -19806 -51133 -21875 -36130 -27293 5144 59817 28419 25382 36258 -14741 -54022 -32105
6592 -32105 -10873 19935 6486 22043 3292 15274 -11119 -35829 18708 49907 -9325 -12353
6580 -12353 7093 -20422 -86315 -96055 -34743 -35371 -7145 26722 35490 -27649 -12375 -25542 8593
6567 8593 46704 69119 38110 22697 14497 32319 20468 -7969 -55108 -43865 -18953 -23778
6555 -23778 6505 -14349 3949 41689 32002 -2827 2568 8070 18738 -6299 -20086 29992
6543 29992 49522 37828 34291 -2762 3543 22544 85164 109034 90712 68004 48942 28675
6531 28675 11252 29773 49924 420 -36202 3109 63371 18268 -10778 -33631 -22495 21818
6519 21818 -962 -80403 -39838 -17076 4286 -63447 -84358 -37055 -13292 -25610 -31763 -4094
6507 -4094 -15165 -8820 -13099 8704 -17878 -24711 -24553 -51487 -47155 -49650 -1699 42481 21969
6494 21969 -6050 -7973 -35855 -58999 -125774 -140783 -109798 -100070 -95815 -68088 -66477 -62379 -80396
6481 -80396 -53958 -75013 -97352 -79204 -47781 12124 37060 -9206 -33435 1396 43257 22041
6469 22041 8326 -9524 -1440 -8292 -41122 -49659 5921 7450 5627 17513 58523 75591 30902
6456 30902 48921 79999 71616 57165 160 32736 85782 74894 67942 34458 23763 -20536
6444 -20536 11478 34307 33804 -11295 -61902 -42079 -4030 -11256 -66200 -32710 18326 29590
6432 29590 77237 106148 76065 50953 6945 -32838 -23467 -36017 -10218 -4213 3567 23673
6420 23673 12718 -18992 -45672 -56162 -54128 -61120 -19742 -26065 -20126 -19449 14085 28957 -7575
6407 -7575 -26435 -59682 -45483 9950 56088 74983 66895 54101 52264 114486 72674 48622
6395 48622 19379 -15014 36548 96337 133238 84314 67223 53480 43473 6535 19957 -17654
6383 -17654 -82901 -88312 7303 99396 97936 54163 41771 -2798 -77348 -128053 -132329 -141814 -68708
6370 -68708 79578 132845 100428 70621 77915 57964 -1725 3227 49033 57206 7714 -433
6358 -433 18857 -5678 -27939 21580 49757 45753 52337 55965 17101 14553 16272 -49 -23832
6345 -23832 -51131 -61386 -85039 -107050 -82278 -48159 -14911 -4550 5148 46744 -4307 -47924
6333 -47924 3094 -9157 5134 -39278 -47444 -31286 -18094 49774 78963 19632 -48032 -22603
6321 -22603 -20403 -1775 8928 -1748 -46013 -68785 -49429 -23613 -1460 -6708 -17517 -17971 -29697
6308 -29697 -59370 -51021 35438 60621 22554 38751 62356 59208 65356 115628 109586 61650 2554
6295 2554 15860 38015 21965 -28978 -45220 -6672 -4133 -11116 -11429 -43676 -56183 -45363 2569
6282 2569 8630 -1055 -34045 -32071 15374 58214 82296 95197 -4428 -79637 -88623 -62643 -51414
6269 -51414 -69760 -78874 -47483 -27218 8892 83787 109364 87743 84600 92446 56368 88449
6257 88449 87196 53741 14380 3 19865 60508 109072 104591 50268 14316 8438 4002 8986
6244 8986 17499 52797 12993 -9017 -2941 -43172 -54224 -65766 -67457 -13215 38970 48628 59410
6231 59410 96405 77024 29349 49696 91357 57888 -2909 -22260 -41865 -62413 -52414 -34261
6219 -34261 -66294 -42092 -22795 -38439 -36905 -27203 21002 65496 21712 16497 19790 30113 25171
6206 25171 24299 62660 68126 58037 30333 -9469 -31252 -11822 20711 -37472 -45653 28987 60073
6193 60073 44171 -5037 3403 64352 46964 14964 -1414 58470 100190 88623 113463 101585
6181 101585 59739 9047 -39952 -52108 -7392 -40039 -70037 -108761 -80893 -80830 -91113 -100160
6169 -100160 -97122 -58029 -48196 -23476 8392 -20323 -16468 38396 38071 -22804 -44662 -57053 -50744
6156 -50744 -8759 -4098 -16345 -20326 -41293 -63848 -36584 -24583 -37757 -55517 -44366 -42203
6144 -42203 -15575 -16386 -13130 25373 50746 50192 34341 -729 -25017 -31795 -71640 -42819 3515
6131 3515 33586 8235 -15662 -34494 -56171 -88614 -89056 -98200 -7136 56437 76158 42708 -8173
6118 -8173 -73968 -57104 -30314 -92910 -93771 -58712 -62388 -93614 -87939 -49561 21911 40940 37651
6105 37651 49278 55840 66673 87911 64393 23628 17923 56375 62154 18521 4856 34816
6093 34816 32915 15912 -14876 10468 47493 -14384 -45994 2466 68739 52786 77265 37733
6081 37733 -9836 -46718 -43951 -26319 -58150 -70545 -36910 -74077 -96584 -73258 -67726 -32166
6069 -32166 -32503 -32257 18338 47993 56668 53823 94820 55312 13696 -9332 -77240 -78692 -118505
6056 -118505 -135733 -96533 -67721 -30644 -23238 -26072 -30625 -9611 7526 -3285 15308 16343
6044 16343 27752 73634 56784 4397 -44285 -62117 -50245 -39255 -38941 -66072 -30722 -10919
6032 -10919 -10112 -2580 13590 26911 -31612 -57346 -5197 -47586 -68220 4942 19334 -27042
6020 -27042 -43836 -24139 -40240 -93335 -64664 -10765 1439 21063 18236 9994 -40086 -100779
6008 -100779 -68191 -1838 -5139 43609 32556 9668 -2730 30724 34382 19266 -25269 -41436
5996 -41436 13645 15105 -40922 -20699 -18279 -34443 -15101 22773 -15065 -49104 -48028 -27683
5984 -27683 -47048 -106196 -90812 -76571 -80895 -50555 1450 12295 16006 -652 -42719 -47560
5972 -47560 -36286 -43404 8929 21685 18496 15396 34047 44110 34366 13887 -1013 32141 60872
5959 60872 46863 -21933 -52388 -94732 -60766 17768 -4146 17015 69403 25817 -20424 -24135
5947 -24135 15988 47053 14424 -7316 -10272 -52935 -84952 -134013 -128168 -83742 -40837 -28680
5935 -28680 -10377 15376 -742 37549 64451 56963 74822 113520 52505 34871 31549 46125
5923 46125 23459 43227 26350 14287 4020 39373 65621 105687 73923 60993 64184 91583
5911 91583 59548 33013 24168 6074 25130 1351 806 43254 42097 -7257 -7254 -33120 -4803
5898 -4803 -31799 -15972 -9424 -31881 -30870 14511 26700 -267 -4606 -11891 6211 11710 -27982
5885 -27982 -13656 27300 44674 -5893 1917 23493 8065 -36199 -72234 -35235 -20370 -13693
5873 -13693 14011 62283 47651 11067 -8489 -9657 4469 -40282 -73424 -44842 -11661 -15064
5861 -15064 -89053 -104848 -58814 8726 46035 32038 41883 3274 -13616 -46393 -78353 -28600
5849 -28600 40332 27217 557 -3063 -5253 153 -51395 -59192 -23477 -12252 -91791 -159348 -140421
5836 -140421 -77031 40520 42776 -25612 -24053 3046 48725 68640 82472 52911 6264 -12750
5824 -12750 -15867 5924 22772 2017 -16343 7850 15557 8015 -21888 -57440 -38808 -34371 -58465
5811 -58465 -12912 1852 -15531 6741 -29357 -24209 -49012 -32456 -10780 -23264 -51066 -12614
5799 -12614 -21418 -18355 1313 23431 -7357 -39316 -21224 -22283 1968 24924 34913 6773 4492
5786 4492 -2244 12360 4170 -36765 -69474 -81966 -66941 -32678 -55628 -40171 -16080 1485
5774 1485 -22435 -74615 -49345 -22261 -60758 -53169 1411 13194 60284 16810 -18690 -28831
5762 -28831 -76418 -84668 -1695 32108 3926 -58408 -35741 -40649 -80212 -60413 -28501 10460
5750 10460 22052 36294 34558 21828 2522 -44047 -18603 351 6122 22015 20244 3441
5738 3441 2186 30418 24559 8417 41704 47262 63268 109648 67977 42131 52795 38940 -19429
5725 -19429 -46808 -70790 -52383 -34299 -72894 -86651 -45741 -26730 48129 96256 65132 79055
5713 79055 33761 24660 34870 44929 41807 34663 31251 44157 15367 13094 45526 86543 117376
5700 117376 99035 46547 48417 43637 32795 21736 -50583 -68751 -89169 -46429 16939 11497
5688 11497 39260 68749 12366 16553 62989 71727 -28439 -76329 -86799 -93036 -38585 3800
5676 3800 12303 -33101 -83388 -60620 -5849 17130 -6956 -18069 -51454 -13454 6729 11155
5664 11155 -4074 -36677 -45343 -91539 -56504 -13646 -20846 -22006 -28768 -30014 -8551 -11487 20047
5651 20047 15741 36636 42613 51459 23398 32855 12777 -2530 6122 -11909 15925 50333 36534
5638 36534 -45596 -31668 -9565 11931 52361 59973 78267 35253 69461 28593 86298 101321
5626 101321 78348 32807 48533 52558 -7178 5330 14338 44139 71379 93242 109875 70708
5614 70708 29206 61917 93884 95419 82742 2526 3297 17240 -280 14841 51026 86292
5602 86292 87863 122668 124564 35315 -10216 -21346 -10390 -8253 -38796 2240 61660 89982
5590 89982 90218 47411 -61585 -64520 -28084 -18203 1993 29605 -7043 -14504 -5484 53760 89368
5577 89368 63705 58534 -12882 -28719 -15094 -4603 -20946 28850 42348 37277 9713 5356
5565 5356 -11740 -34176 -6837 -29325 -75663 -57256 -26630 -63868 -77768 -48933 -32466 13712
5553 13712 70266 32318 31502 64290 39747 8974 26664 9460 15759 -5151 -66447 -83251
5541 -83251 -62367 -45177 6033 19089 26654 3237 -30091 -12815 -3413 6033 -19348 -41037
5529 -41037 -34714 -36208 -17635 -39210 -3517 -2214 14886 24842 -60549 -158321 -142435 -168913 -178724
5516 -178724 -199694 -204443 -144292 -108077 -111902 -74425 -63009 -110806 -93408 -93629 -123542 -189058
5504 -189058 -203115 -210902 -176535 -89689 -66251 -26122 -69680 -105209 -123164 -104165 -82794 -100559
5492 -100559 -95439 -72632 -61199 -20786 -12907 -50277 -61346 -16716 -30832 45650 114546 51180
5480 51180 -11956 -53959 -42892 -50400 -126520 -113254 -71890 -5073 18579 -17479 4449 35147
5468 35147 17842 47106 -16193 -37845 -32658 22434 83090 57780 -4385 -17605 686 47815
5456 47815 9015 35567 46656 -6214 -39603 -80046 -76721 -92390 -75841 -38414 -9784 -137
5444 -137 -44557 -50707 -76350 -89652 -48780 15356 36936 48052 32379 -6763 39457 102606
5432 102606 95501 63599 46307 40001 63397 69800 27947 -3313 -3437 44121 44119 -13211 -38850
5419 -38850 -25350 10115 12392 -7025 -32392 -23745 -27317 -47536 -80800 -62248 -24547 -11626
5407 -11626 -20274 -30440 -18522 22953 54614 1356 -21048 -7397 -15905 13821 64456 61063
5395 61063 12188 -55657 -20062 18114 58285 88885 72350 48144 63997 44452 43893 69943
5383 69943 86821 123323 59959 -12832 -32146 -38271 -39159 -7784 25209 16567 4826 -24391 -12196
5370 -12196 -10748 -44709 -34785 -40858 -87672 -82881 -76922 -43302 -5479 -17685 -18557 -35800 -36300 -40432
5356 -40432 -16826 49381 28214 15374 -11770 -21065 -13550 -33679 16205 55778 25806 34354
5344 34354 37349 -3451 -22458 -16231 17474 23228 -10940 22841 19263 23307 21155 53381 96005
5331 96005 61077 51635 56536 -5323 -44421 629 51689 74451 101990 118511 77886 62381
5319 62381 48071 46702 20269 -5516 12332 -3397 54460 65465 21949 522 -53515 -9462
5307 -9462 28464 40848 20817 -44382 -15194 13889 -36540 -1481 11004 40348 35947 17978
5295 17978 -16777 -38505 -59183 -76190 -43530 4940 18660 8342 -4651 -18284 43833 23369
5283 23369 18842 -26893 -86065 -118388 -104228 -110644 -13340 20315 22213 56052 47712 20311 22516
5270 22516 13789 10760 70360 107606 62058 28671 44011 45985 50146 57119 76943 96200 53748
5257 53748 -4721 -23735 -35675 -60434 -77075 -60644 -126527 -111781 -50357 -1190 783 -2541
5245 -2541 4650 11871 -39393 -21862 2158 -24561 -24714 -22879 18698 20593 -42877 -39108 -60710
5232 -60710 -61807 -47668 1412 57075 93244 60539 -40755 -87354 -91416 -87463 -100801 -88724
5220 -88724 -53702 -33321 19041 16835 14673 30032 4466 -28523 -54215 -84129 -91627 -21277
5208 -21277 59003 60322 42049 29864 28911 55506 50491 92885 91804 55924 52247 57157 59268
5195 59268 48543 60697 37462 34399 -12495 -43303 -108985 -134014 -101875 -25606 -13052 -33320
5183 -33320 2865 51841 34669 18666 -45109 -22977 37477 78327 50347 51590 55915 41499
5171 41499 31329 40405 34342 22779 5419 -16276 -37702 -44463 -13030 48219 33458 -46666
5159 -46666 -48188 -45463 -41293 -63991 -67653 284 23568 29559 41431 15660 40764 99744 99564
5146 99564 25048 18917 42849 73896 67740 70269 71994 67239 28656 -23504 4637 -10555 -24096
5133 -24096 -57531 -91152 -96828 -47685 897 39039 87037 36226 9827 31131 86437 7718
5121 7718 -67057 -115876 -78027 -30405 -42303 -41796 -70611 -80062 -36234 -51366 -76256 20077 -4642
5108 -4642 -16393 -37724 -69204 -53870 -30472 -63736 -27398 37979 72484 -15148 -39449 -10695
5096 -10695 6126 -49593 -88314 -41787 2645 45975 -18819 -57818 -20511 26118 33864 483
5084 483 -44107 -13755 -15876 -31270 -27429 1053 24752 119354 110911 65425 8649 -65874 -52860
5071 -52860 2111 20529 31533 23341 -7292 -35053 -44729 14994 52156 56961 15081 15675 39457
5058 39457 84739 94413 60771 34998 30760 28335 18355 -19558 -28211 -42127 -50332 -57089 -67778
5045 -67778 -3879 -26903 -18577 11299 -17356 -57704 -41195 -15232 1029 -4216 -51304 -69542
5033 -69542 -38767 -12421 -15951 -59822 -48080 -21303 13036 21376 16388 35604 52015 46923 -17568
5020 -17568 -70760 -49088 -21443 -57730 -88456 -67396 -269 -30539 -96620 -74975 -17270 34050
5008 34050 68450 68584 79294 38171 10974 10734 -54355 -69680 -30594 -53713 -73129 -79114 -65032
4995 -65032 11481 12996 58652 24757 7243 -16868 7815 34189 41107 -25308 -47893 -21135
4983 -21135 -34451 -61322 -102076 -104579 -82630 -101575 -57052 6724 45244 10433 -3750 13331
4971 13331 -20409 -22053 7351 -46100 -59775 -56401 -33113 -16549 6075 71613 55733 40886
4959 40886 -16165 -25946 -21056 15503 -1415 2194 -25687 -90067 -59960 12702 22832 -27223
4947 -27223 -72659 -94356 -76333 -45122 -12950 10335 -9177 -31999 -30769 -7796 24889 68328
4935 68328 36923 26501 -44992 -39395 -3788 -19147 -66342 17219 109809 138220 107842 36222
4923 36222 -10432 -35666 -62107 -57403 -34958 -15462 -29281 -95311 -86307 -76286 -80630 -56679
4911 -56679 -22687 -38549 -32943 -1745 -78839 -51112 41488 68620 72639 47977 -1287 22257
4899 22257 7821 2868 -31342 -21185 864 26550 32101 -21578 -48342 -70195 -60515 -43245
4887 -43245 -99838 -60637 -72014 -22506 7988 73663 102745 65687 9908 -44303 -16140 -10482
4875 -10482 -666 52717 -5873 -80547 -88046 -93481 -36401 37419 58818 40256 12338 -44348
4863 -44348 -31904 24384 -18151 -75608 -31850 -24998 -8128 7918 -4987 1490 -8291 5861
4851 5861 9197 -3765 -17400 5829 12647 -2040 23145 -13509 -86650 -70218 -31823 8556
4839 8556 30428 22895 -13181 689 -18096 3839 -41253 -71240 -71797 -68953 -31266 -33396 -28609
4826 -28609 -45568 19124 59097 76318 141187 115883 16403 -59324 -58612 -12277 26306 13745
4814 13745 15491 1741 25005 36020 36629 39329 18641 25678 74514 67245 65220 89422 58533
4801 58533 45646 56284 56674 3366 -53946 -97977 -77225 -68584 -50113 -51165 18317 28166 24458
4788 24458 38791 45916 66255 59225 4355 -30670 19105 40558 21434 5432 -19882 -64946
4776 -64946 -37351 -21613 -43445 -26685 1204 13976 -8125 -18266 -8837 -28530 -1398 -13205
4764 -13205 -16834 -25380 -17826 46700 1330 -57341 -44738 -17331 -12040 -6482 15688 26776 6729
4751 6729 -83787 -118383 -75962 -48660 -66565 -78261 -77541 -64315 -50835 -61328 -55294 -40428 -59266
4738 -59266 -48412 -51472 -69087 -59117 -42897 -18992 -73553 -73107 -51566 -49322 -76591 -61409 -48527
4725 -48527 -8835 -9701 -31494 -114135 -112596 -50104 -63524 -24233 5717 24160 31094 9253 -6073
4712 -6073 9571 99906 156372 123998 40236 34343 45045 -14991 -12870 -30101 -65656 -40706
4700 -40706 -37513 -43868 -65451 -63590 -96631 -100506 -102322 -64870 23049 60299 2979 -75268 -90361
4687 -90361 -39325 -32441 2198 8873 30286 -30176 -98763 -38478 4495 -2337 16860 50379
4675 50379 25485 61968 70089 42059 49194 -6323 -65824 12137 51197 2039 -2902 8959
4663 8959 61675 55181 -5563 -68743 -45039 -10139 20174 -4787 14872 64651 87593 68164
4651 68164 14229 -6848 27679 -27242 -29973 35612 36160 50065 86211 45315 -8486 12555
4639 12555 -34264 -22656 59496 94340 47519 -11282 6745 21603 6994 -35358 -96884 -77385
4627 -77385 -32773 -24717 -50251 -76796 -92831 -80787 -52886 -48799 -78835 -96803 -55875 -87324
4615 -87324 -130712 -64550 4272 18477 16116 21613 13734 -6054 -39356 -57107 -54772 -50837 -34189
4602 -34189 -15240 -39889 11794 3744 -310 29815 56662 108724 136057 103482 134018 158883
4590 158883 155725 147205 131957 72817 32103 54297 34386 -29869 -49567 15599 15364 14020 -14807
4577 -14807 -28639 -47279 -138803 -122291 -115855 -62018 -11656 -29025 -24925 -32573 6481 8076 7900
4564 7900 -17678 -65319 -74439 -95931 -69641 16305 40161 -14148 -8402 37938 40496 18574 -7736
4551 -7736 -40455 -54772 28470 11298 -35858 -40006 -63578 -103639 -127111 -117079 -113029 -64672
4539 -64672 20834 18715 39157 45759 5561 -24700 -67427 -48345 -15030 17867 30785 18178
4527 18178 -9889 5168 49270 15134 -95795 -89033 -49915 -11230 16282 -23147 -48535 -79900
4515 -79900 -37994 -12956 45824 -5520 -82257 -74687 -56794 -63733 -10854 15173 -4699 -50991
4503 -50991 -52728 -75322 -78299 26443 54037 77754 93061 107769 55587 -11562 -13016 -20091
4491 -20091 -22049 -40105 -38331 -63517 -65836 -46847 -39533 -12066 13953 10617 27665 18661 5312
4478 5312 -40251 -48164 255 38195 37203 44486 85765 139279 124286 46796 20097 48668 55180
4465 55180 9167 33767 57172 51189 44761 39925 70661 56368 -42181 -36041 -19648 10138 4987
4452 4987 829 -22092 -12351 -14536 -6056 -4261 19650 17770 -16799 -44349 -78884 -82255 -45307
4439 -45307 -70785 -119427 -123469 -88857 -54740 -88604 -85007 -46128 -23712 -37921 -28948 -51586
4427 -51586 -77785 -97977 -77576 -49697 -29729 -23739 -43375 6055 52658 25232 -8669 -10927
4415 -10927 16282 -5886 -80501 -89816 -69607 -8092 50307 87804 80594 14792 498 14972
4403 14972 19410 54476 64430 75969 22025 539 20509 4993 -34196 -37625 11531 40708
4391 40708 16346 27982 49630 26662 15668 -643 -25047 -40890 9060 79299 72713 -635
4379 -635 -13690 -34557 -15742 -8795 -32652 -31418 -19961 -39982 -34988 5981 31849 2602 -22757
4366 -22757 -9630 -4939 -37963 -51711 -30459 -3991 5043 -35159 -31716 -10867 35718 892
4354 892 24640 33290 30321 -982 -44610 -65298 -33732 31665 36898 29107 7611 -20325 4806
4341 4806 23558 25331 -5442 28637 37447 25318 -14740 -28798 29799 66734 32553 -26526
4329 -26526 1630 65757 38162 27532 -19651 -16411 -13292 -27764 15621 61465 93515 107631
4317 107631 45320 -19073 -36356 -72671 -68851 -22472 -22534 -55127 -59486 2473 -37240 -56985 -51855
4304 -51855 -5915 -17901 -51938 -85108 -54749 -9810 -62487 -80631 -49792 -42240 -60052 -34716
4292 -34716 -21312 -49011 -60354 -53919 -35122 10068 22776 -19556 -25572 -19438 13820 45672
4280 45672 46039 16679 -18012 -71383 -75800 -17180 13549 27445 -21123 -78841 -68556 -46625
4268 -46625 -21313 69592 65555 62784 36974 -18487 -5724 3410 -20710 24899 71396 50735
4256 50735 61576 -3010 -15061 26201 22300 21582 -37178 -102378 -95176 -91197 -57197 -9898 -3037
4243 -3037 -44442 -62917 -60389 -72692 -26072 15144 50633 57678 34545 36435 53873 11264 -438
4230 -438 -23051 -54966 -80827 -125433 -113261 -61102 -64269 -74771 -67251 -64861 -70470 -85267 -13191
4217 -13191 56230 55284 48406 19690 27428 -32684 -60728 -51765 -32758 -7235 -9059 15105 -40389
4204 -40389 -41020 23990 44659 -10429 -62053 -90836 -27983 33918 -5773 4903 46750 20303
4192 20303 6203 -49023 -50978 -25695 9129 -2273 -29585 -27687 -48149 -54005 -12610 7029
4180 7029 -9184 5058 -9243 -61427 -50634 -14456 18331 26672 14963 37639 48876 19131
4168 19131 2106 32561 45886 -29006 -5340 -22792 -29378 -14070 -6728 -1843 -11214 -23991 -20975
4155 -20975 -18916 -5018 13792 16832 13557 59574 67547 36183 15434 12596 72055 63648 41227
4142 41227 -37526 -75653 -56567 -82662 -46874 -8812 91161 135335 35398 26696 52412 38659
4130 38659 8404 -9737 -36413 -56521 -79074 -72427 -32332 28515 52318 81254 121033 85580
4118 85580 -25061 -35659 6894 -64189 -82601 -61411 -57108 -87384 -123377 -79505 -14424 42838
4106 42838 21059 3838 28158 24601 23885 24234 -89 -4598 29956 23333 5385 73045 86038
4093 86038 94372 39748 -20706 17633 42217 55849 37763 -1892 46207 126460 102635 34013
4081 34013 -13263 -3422 16693 -23602 -45926 -68427 -64716 716 9274 31105 41958 2414
4069 2414 -4679 -7314 28887 55746 35642 33669 -32971 -7529 18890 36989 116736 105136 85025
4056 85025 85055 9667 -56280 -11103 -2239 20216 40817 -4597 -28052 -51576 -21842 17856 68626
4043 68626 63967 17664 -45047 -78557 -18578 -7276 15064 -48210 -41820 7920 24057 10664
4031 10664 -19334 -94915 -111339 -23903 -66666 -94027 128 62377 15453 -27374 -4059 38282
4019 38282 40299 40605 73092 62078 322 -64024 -54472 -43858 -88550 -96105 -32413 -33992 -5623
4006 -5623 16782 -51584 -88862 -87235 -93039 -115237 -129864 -166488 -164089 -145323 -172050 -153660 -122063
3993 -122063 -96377 -47453 -2453 -40790 -97466 -125063 -87359 -36430 1153 -9610 -62545 -49615
3981 -49615 -45481 -13784 -31943 -61487 -60207 -30530 26233 337 -8801 -11535 -9415 -21271 -39743
3968 -39743 -1230 59186 56134 25599 -1913 13454 17170 -5180 -55015 -33130 -38567 -30230 -37230
3955 -37230 -42924 -48321 -52462 -30244 13912 42003 51973 -11252 -34121 -36422 -13340 178 -22139
3942 -22139 -26787 -4976 41474 35861 68239 23275 -13348 -30626 -19512 -61329 -80218 -51354
3930 -51354 -5137 40306 -10855 -31836 -38584 -31420 -52376 -57944 -63806 -48053 -28636 -5333 32074
3917 32074 41120 -9261 -60777 -87613 -86275 -71783 -36770 -30133 -30564 -44383 -68431 -90614 -95230
3904 -95230 -75036 -27974 -37524 -56375 -99072 -47718 -25426 -69591 -94331 -79817 -48300 3810
3892 3810 6536 7333 72379 130833 82858 20997 22869 15098 -10336 -62851 -62934 -23567 -60422 -56717
3878 -56717 -6799 -20475 -34812 -31477 -66241 -38877 -21513 -18631 15625 -4801 -106006 -155093
3866 -155093 -67587 22363 15751 20740 -16054 -26094 -67270 -61669 -26664 12734 29782 44509
3854 44509 32064 -24954 -51215 -29928 -9186 -7914 -6024 -26708 -54015 23746 83898 35844
3842 35844 -38279 -24415 -5763 -74387 -118934 -137460 -81606 -24700 -26488 33614 1937 -57164
3830 -57164 -68157 -55278 -26689 -35915 17819 570 -2104 -13749 -47306 -13822 9681 40132
3818 40132 36299 44029 73897 97629 71348 7184 -40820 -71255 -91607 -31028 23451 -15817
3806 -15817 -44770 26853 90507 78611 18872 -23711 -32173 -22908 -30626 -21893 -39891 -31358 -38739
3793 -38739 -58055 -36486 -50755 -59827 -52239 -39213 -43218 -1896 -31895 -39795 -44102 -84193 -64932
3780 -64932 12931 52401 36535 15844 27598 48727 83841 46487 -3228 3537 4913 3274
3768 3274 -21662 -32335 -42742 -73159 -69930 -39158 -1781 31028 41064 -1519 -45964 -26456
3756 -26456 5434 50063 -12763 -92128 -149469 -116939 -87740 -68252 -31650 28667 26440 11928
3744 11928 29459 29983 17945 15376 6991 -28221 -49831 -74861 -152783 -138435 -65308 831 36057
3731 36057 -773 -19702 -14088 -24599 -57195 -36433 5330 18262 38582 73622 56963 2765
3719 2765 -27129 -22436 -57823 -49480 -87483 -124274 -58155 -2191 15983 48870 19155 -26475
3707 -26475 -12059 -29958 -5263 -1441 -22011 -49222 -46447 -77516 -35049 -15868 56764 73628
3695 73628 39761 -9567 -69133 -84324 -75077 -78805 -67382 -23835 12689 11396 -4216 -8631 -41533
3682 -41533 -44621 -28047 -32965 -71391 -56120 -46461 -40533 -102413 -67727 -8302 -2391 -32107 28548
3669 28548 61382 47237 -6216 -31789 -75720 -69158 -87060 -5797 86448 58968 -10867 -74305
3657 -74305 -12771 40342 76841 38941 16407 72078 93208 81804 57695 67955 43821 36673
3645 36673 -10677 -58991 -80155 -108250 -72746 -58100 -26033 2616 -16091 -2151 1309 3726
3633 3726 38102 107834 124024 56080 -7885 25599 15433 44715 -252 -18207 -22315 -24765
3621 -24765 29386 78544 82055 68541 68077 68819 79712 64093 77117 41088 36645 43143 45101
3608 45101 75835 118096 91384 110489 37474 15657 79394 98006 101514 64607 17012 -5277
3596 -5277 -45412 -12366 -14790 -36705 -42398 -54076 -30664 -57928 -84718 -76109 -76369 -22537 -41245
3583 -41245 -34005 -35561 -90213 -63857 -24945 4347 -15110 -342 5869 -50694 -38596 -1292
3571 -1292 -12758 -10498 -11342 -32975 -36739 805 49153 15282 -42660 -13053 38348 41126 32507
3558 32507 24422 -1459 -52181 -92453 -140066 -163975 -107290 -57935 -33778 1007 32356 43317
3546 43317 43704 22327 31858 31015 5188 13721 15695 31550 45731 72444 98095 89031 70189
3533 70189 49838 40888 23764 26877 25629 -5576 -32479 -8250 45505 36114 -35653 -51737 -55769
3520 -55769 -126433 -88140 11515 45683 43083 -6991 -26733 -44653 -56137 18802 27722 18539
3508 18539 15030 8042 -25372 -34904 -79816 -56795 -87476 -116410 -54911 6111 -4174 -8611 16023
3495 16023 34007 -20813 -87816 -115116 -125474 -79342 -6098 41131 46091 43212 -29752 -32278
3483 -32278 30746 52668 48475 23096 39666 17643 18578 13848 -6823 -238 32280 31910 -5535
3470 -5535 -75565 -48158 -22370 8512 9173 -38673 -28035 48392 65000 16298 -21007 48564
3458 48564 88222 86941 42994 -23780 -83289 -68574 -44148 9339 86737 121272 118613 65337
3446 65337 11418 -6410 -47349 -52309 -78963 -78292 -94430 -42983 -32699 -23879 -48401 -39746 99
3433 99 20795 -16316 -25763 -8290 32125 72250 26997 -10221 32777 25262 -2118 20267 37536
3420 37536 34683 -23268 -66179 -83690 -37609 -33463 -60015 -27401 -18486 -24110 -18885 -61936 -83624
3407 -83624 -28072 -43831 -33036 44986 13134 16560 -7680 -44186 -45415 -6407 32063 -262
3395 -262 -40940 -39805 -22056 -13849 5738 42542 31378 25212 -1485 -12276 -16501 4728 -1215
3382 -1215 -39750 -73383 -70837 -53363 -21464 -1247 -31358 -6317 -1741 12952 27711 35767 55370
3369 55370 61785 66274 37195 1333 -51203 -58917 -35262 6323 30714 -2866 -32833 -20211
3357 -20211 -12176 -14357 -31257 -63452 -63471 -24089 -33916 -69704 -18578 4308 11429 11012 5868 33278
3343 33278 97966 144109 85321 59783 70153 28665 -11601 26890 5873 10245 8130 -21271
3331 -21271 -61821 -52027 -27474 3384 50119 44586 93448 99371 109301 78018 91252 81229 99649
3318 99649 84987 55639 14746 -3793 -35862 -32797 -26480 -68416 -99625 -57236 -25392 -69213
3306 -69213 -73003 -76179 -76552 -18442 31097 28177 61042 97162 93535 39710 -3226 4593 -48212
3293 -48212 -8894 -19174 -19149 18619 62657 87061 51453 8040 33765 43972 -39776 -52168
3281 -52168 -55525 -52004 -32650 -21002 -61003 -71128 -56292 -42116 1353 34570 67712 83089
3269 83089 55042 22204 -21921 -41753 4011 2995 10533 15302 -32038 -79143 -39230 -19560
3257 -19560 -2046 -23311 29567 70576 82088 -9273 -76050 -60862 -4519 72144 98751 42899
3245 42899 -47987 -109616 -76068 -51113 -33131 -36784 -15498 23527 25841 -15461 -6922 54001
3233 54001 56383 17239 -33456 48962 58122 68992 86431 55170 -6766 -37385 20049 28756
3221 28756 -2330 7308 -28512 -16970 473 65 18593 -20203 -43739 -68001 -61871 -93714 -61036
3208 -61036 -29105 -33685 -62979 -56181 -19395 6235 47467 34718 -18001 14164 70378 96321
3196 96321 111166 90953 21603 -21994 -73730 -106389 -107517 -34889 1531 7284 -20031 -29385
3184 -29385 -49991 -51466 2003 2425 47567 32652 69784 22666 -22579 -1566 -34536 -39000 -64848
3171 -64848 -32394 19878 45625 1179 -39183 -65443 -46370 -19575 14522 30304 8940 9806
3159 9806 -57370 -7239 -6935 -38329 -90179 -102222 -81732 -77462 -78897 -74006 -41736 -24309 -66606
3146 -66606 -74017 -54462 17518 -12039 -4878 4412 -20581 -30981 -77683 -97345 -70271 -19410
3134 -19410 2785 18770 28520 8629 -39318 -37292 -61529 -82035 -97834 -91557 -39920 -17678
3122 -17678 -2303 -40650 -43622 -55880 -21986 2368 -25749 -71318 -84600 -48014 5812 31849
3110 31849 3048 -32059 -52357 5190 20429 41621 86185 74480 63066 17487 -1435 -5802
3098 -5802 -11463 -1278 5022 56325 50578 64850 87945 60005 21354 21844 13494 -5636 -15687
3085 -15687 -93882 -122130 -120228 -135726 -82888 -532 26040 52350 38712 30522 100605 53351
3073 53351 44277 10492 -45209 -83760 -77445 -3344 11012 18960 -24779 -58354 -48613 -43279 -65658
3060 -65658 -59921 -2306 33761 80503 65364 -3769 -41925 -51102 -41320 -15505 40321 29895
3048 29895 9768 19864 49409 85434 57678 -17149 -63136 -80410 -12024 26064 33694 23619
3036 23619 -22552 -57797 -67040 -65144 -81108 -78058 -1224 -27259 2410 47391 24639 -4318
3024 -4318 -17950 23615 21773 71268 16124 -633 40073 72865 45680 22112 30382 -25550
3012 -25550 -5144 33057 59558 95799 115140 94208 70519 11406 26230 70081 54794 25522
3000 25522 59236 12403 -33618 24965 28501 -2301 -13407 43598 32467 -16128 -33888 -32862
2988 -32862 19167 89741 75473 58437 54613 79584 68889 30583 36206 35879 50756 54856 42472
2975 42472 20912 -2523 2958 -1085 -9703 -57628 -92459 -102388 -82995 -68570 -59119 -67217 8048
2962 8048 67874 40406 -37564 -44519 -32339 -8761 17957 22038 2786 9422 -3137 -37954 -62540
2949 -62540 -46066 -30058 -26507 -49019 -52889 -45900 -19453 -33024 -89907 -128570 -110517 -4582
2937 -4582 50618 -12004 -37233 -25596 -29533 -5607 9834 -15580 -57354 -47968 24496 70365
2925 70365 12406 -57470 -109141 -106943 -100555 -37581 31900 59813 15428 12563 47676 82689
2913 82689 84379 83801 77480 57871 -978 -30180 28594 20168 -33439 -43229 -13026 -13251 -41960
2900 -41960 -41740 54985 29120 -17447 -14183 10589 10168 7883 48373 20035 29232 52184 61237
2887 61237 45439 -55987 -78313 -61835 -9657 75540 55797 39102 24778 36015 90227 44615
2875 44615 15486 60608 81427 66052 123507 130926 90961 58383 2570 27107 61258 102584
2863 102584 139404 132472 112353 94549 81293 61463 66831 104306 90687 42674 29871 34591
2851 34591 35094 -4949 -47074 -65008 -7463 48295 118339 145709 84178 45093 45568 40893 -9891
2838 -9891 -28333 -66461 -30024 38669 41330 64326 28849 14248 45667 24504 -2116 -73335
2826 -73335 -45034 5114 -11563 -72264 -58833 30228 24952 -28801 2556 14837 20006 -18216
2814 -18216 -56498 -57420 -60312 -58809 -30390 -3372 -9022 -16193 -13475 22450 37580 7682 -2741
2801 -2741 -314 -36219 -34669 -36105 -47078 -52635 -43392 -66024 -52999 9596 17629 -11510 -34791
2788 -34791 -40818 -56936 -108026 -64575 -85289 -131388 -32596 24868 19898 32681 36582 -9946
2776 -9946 -27440 -44863 -44501 12104 64299 38769 11766 -8092 9569 36717 39630 36735 45308
2763 45308 -214 -18763 -48740 -42409 -21499 -12329 16775 37157 6499 -65999 -101391 -64684
2751 -64684 15223 71150 29098 10679 5793 -18426 -15737 -54797 -74707 -68505 -20310 -5262
2739 -5262 11507 -17355 -45574 -14351 34774 7832 23744 74080 29645 -27535 -85055 -62214
2727 -62214 -21752 -12111 -2350 -34705 -83669 -78156 -19700 -31553 25288 27496 34480 -3446 -26504
2714 -26504 -16419 -62620 -16922 -23059 16119 20248 -6705 -25939 6155 -14136 -14213 -33455 -71845
2701 -71845 -42639 6117 6388 -7643 11421 6144 51128 56762 -1858 -5270 -27162 -69222 -109929
2688 -109929 -95709 -24186 -15266 -63518 -38297 23390 49745 11303 -1293 57089 63632 -29192
2676 -29192 -112701 -55154 46248 69999 84792 121312 94498 54059 58857 80918 111382 77062
2664 77062 88047 122853 64136 -35023 -30816 -22764 -27190 -65572 -34819 -24205 32679 85708
2652 85708 76256 38171 20215 21735 -22752 -41831 -10854 14991 33270 49566 5308 -33593
2640 -33593 -70234 575 -20009 -70612 -43171 -27924 -85948 -94875 -12268 40503 1141 -6153
2628 -6153 17053 20431 66652 76095 47954 29743 25404 -3166 5545 15608 21232 48196 67849
2615 67849 74144 67108 97810 91486 74867 26825 -22168 -31139 -7148 14392 47128 51529 33572
2602 33572 -14882 -18253 -18438 33544 72084 45908 23147 -28110 -38190 -37965 -35217 -36954 -20930
2589 -20930 26222 54308 52605 26273 22859 -5863 -56196 -53250 -36658 41052 37122 57168 37471
2576 37471 73363 42072 13300 14773 7399 -46281 -26683 -17594 -10556 -30154 -40637 21813 52716
2563 52716 66593 71032 55013 72864 62269 55485 -46999 -89643 -61045 -34234 -13539 -43728
2551 -43728 -52936 -2334 48890 74169 34995 -12469 -10702 -100 33523 66763 31833 18545
2539 18545 13107 -16386 23695 46088 89033 78263 102286 53348 2705 23083 769 -14522
2527 -14522 -23059 -4476 -5492 24116 64657 60836 58295 -8653 3211 49137 80559 75120 48377
2514 48377 -31722 -66896 -35320 -69462 -67003 -98893 -80755 -88681 -90706 -45097 -25069 6759
2502 6759 -51812 -52736 -53639 -88861 -71023 -22907 -10138 -28343 -50084 -40492 39556 14517 -40374
2489 -40374 4013 -4355 -6097 2511 63921 72030 90008 106433 127379 135829 80511 78434 97241
2476 97241 78839 65859 76869 58253 14300 35816 64394 -777 -106034 -89488 -37474 9328
2464 9328 -21927 -17489 1455 -40423 -58575 -50705 20629 31293 13852 12631 55881 27055 51753
2451 51753 68916 50261 21864 25069 36397 78261 83611 51188 27013 -2229 3922 59507
2439 59507 119046 76734 62589 58863 19124 29415 -10224 -58495 -22667 -9592 -6476 8746
2427 8746 29078 28962 -8072 -83175 -71106 -8673 22896 41257 25553 -28733 -32211 -36992 -203
2414 -203 8375 19356 -14202 -15881 7436 12424 -17260 17366 30886 26223 21634 6902 -5499
2401 -5499 -36267 -29107 1458 45928 70020 72593 46740 25531 14107 -28466 -81795 -89890 -82276
2388 -82276 -104587 -57646 6363 7199 -4598 -1691 -51352 -6938 13490 -19775 11788 17781 3649
2375 3649 -38177 -883 9356 17254 3111 3372 3103 -39991 6898 42902 31386 -2339 43311
2362 43311 -9144 -28184 15340 1047 24102 22790 29191 78968 61077 34367 70479 69445
2350 69445 6993 -31906 -66404 -43669 -12465 -15780 -62206 -83532 -54337 -11389 -14283 -44659
2338 -44659 -59387 -13550 -14407 -12998 -28271 -15024 -3476 -36415 -82273 10363 71824 29083
2326 29083 -17195 -36858 -67998 -52016 -49192 7850 27224 7325 -33550 20543 81708 79106
2314 79106 91427 76543 40256 61105 54142 153960 180686 133113 108633 71792 36419 -3585
2302 -3585 -7318 -33533 -92329 -73588 -54093 1689 4915 -24703 -43823 -25848 -28666 -33351 -6859
2289 -6859 1428 -39115 -49302 5055 80119 54394 39063 70833 104766 123616 83975 10711
2277 10711 -19438 -9497 10303 33958 52638 63493 24965 -30905 -3583 -3298 32141 -2265
2265 -2265 -38965 -36136 -3167 -2399 -29405 -36026 -19563 -5938 50097 30916 34565 71587 44290
2252 44290 57683 74399 38681 440 -26167 -42060 -21558 41591 26147 -36322 -40565 28838
2240 28838 25147 6466 31000 50219 29815 39391 -501 -27534 -12236 -44508 -40632 -59194
2228 -59194 -63828 -4224 -18637 -29696 -70716 -51943 -10797 46525 45896 41137 11287 -64580 -64057
2215 -64057 -49405 -7791 16260 -5880 2177 14004 -29961 -72630 170 41513 1486 3275
2203 3275 19846 16154 13969 -22243 -67639 -68855 -2853 42005 81783 91202 100075 375 -51314
2190 -51314 -70610 -53090 -97927 -53644 -17602 2270 52777 75878 34732 32497 51201 19656
2178 19656 -15188 -45649 -62428 -41946 -63358 -47990 -28028 -41691 -17851 -94761 -113675 -61637
2166 -61637 -28247 25410 -209 -54854 -51505 264 31434 37136 18085 -67055 -68539 -47133
2154 -47133 -2836 1040 -5469 -4858 27956 19958 -70602 -112225 -96014 -45741 -64044 -72093 -56258
2141 -56258 -36887 -1516 79347 57177 -24028 -43683 -51684 -58541 -39995 9466 18385 14948 50267
2128 50267 56503 65160 44334 47633 21178 45066 103143 125604 85291 31692 -37299 -32412 -3413
2115 -3413 -5740 65 -4189 -10999 -23767 -14939 -36151 -16931 -9035 -41381 -41339 -42208 -21020 -10319
2101 -10319 -7088 -29672 -23145 29375 24761 31299 1185 -80386 -101573 -78691 -89331 -127252 -150729
2088 -150729 -100996 -90307 -48114 -90716 -69344 -27767 -19520 -21486 -62937 -62514 -15623 49091
2076 49091 30334 22192 -17076 -65830 -48682 -55982 -29808 21146 -14593 28981 13702 -463
2064 -463 5204 35170 12939 -44180 -71398 -68927 -47363 -47846 7798 46291 34726 -54615 -37829
2051 -37829 -30729 1369 11788 9774 13488 -16394 17481 58411 34102 8357 -33285 4482
2039 4482 44821 25764 -960 -24847 -24256 -56194 -90063 -76714 -85603 -76948 -55989 -54541 -39659
2026 -39659 -28438 -29212 -57438 -52604 -50632 -39451 -56294 -96128 -120102 -103256 -126526 -124032 -64643
2013 -64643 -30692 24456 3453 -47958 -27767 28071 70180 63596 19205 -2817 -13230 4802
2001 4802 -28503 -123528 -132747 -59536 -71517 -101910 -104723 -105794 -83322 -63798 -69324 -33882 -19295
1988 -19295 -48555 -77001 -82959 -72293 -50229 -64546 -12157 32582 30131 25377 -17029 248
1976 248 -15524 -86507 -75212 -42847 -15845 12006 -18066 -56564 -28499 -13465 6517 -54761
1964 -54761 -41271 -1406 -9988 26883 46493 48536 27131 1516 -8028 -41002 -39996 -40555 -29106
1951 -29106 -35269 -63832 -58661 -34877 -4863 -10504 -46792 -46344 16939 35842 60003 41788 -3780
1938 -3780 -16563 -42783 -41682 -25170 -68339 -9990 89797 72560 10586 -42817 -30367 -59673
1926 -59673 -28335 8482 28849 2371 9156 32169 -5132 -29181 -76076 -29693 36797 57924
1914 57924 55684 49458 27487 9739 7908 -7907 -15292 -4017 -32303 1554 37246 40075 63287
1901 63287 108860 63101 9012 15216 19050 -26672 -64865 -27493 -57547 -66963 -76663 -62136 -25320
1888 -25320 -19520 15661 8810 20230 95570 86806 67446 57473 34213 34667 19700 32278 82295
1875 82295 101964 118107 101845 81843 64398 74989 34644 36817 28800 12736 34794 19539
1863 19539 -14110 -22294 -36973 -68096 -43335 -18378 17186 52074 42499 14281 -9822 -4997
1851 -4997 41228 63062 62663 17983 -47580 -36322 -7663 22864 36094 87220 25692 -182
1839 -182 -737 31734 41471 58854 57787 73660 106909 56644 82851 113271 75949 25439 -7310
1826 -7310 -16500 8779 38743 44925 17563 -41492 -13272 -8246 -46007 2956 32477 87539 77346
1813 77346 32649 8577 -68247 -143911 -97751 -28683 -28940 -26395 -38071 -15493 -35043 -46309
1801 -46309 -23791 2411 36796 10935 -11124 -64977 -83160 -49244 -38509 -49395 -76236 -51692
1789 -51692 -3310 1893 -61575 -75893 -80790 -85699 -85194 -52889 -49852 -19744 41332 31532 38325
1776 38325 34988 39896 27437 -19510 -21759 -27148 -26920 -7838 25273 5780 -32218 -55085 -34015
1763 -34015 -33780 -33020 -15455 -35846 -9277 -36976 19549 -14635 -12061 24148 -5801 -14393 -15997
1750 -15997 23847 28848 -22313 -61575 -47296 -17345 13360 19546 -17673 -20266 35425 42977 30258
1737 30258 -11585 -54605 -30020 2317 49519 58577 30582 12295 23424 27081 32698 -8694
1725 -8694 -11089 116 -6014 1963 986 12874 -13075 309 30167 14517 33577 68322 84971
1712 84971 32006 -15490 -35451 -23070 -48915 -10527 2839 7459 44198 91795 62854 83072
1700 83072 99795 77533 57752 30635 24822 -7650 -4419 3399 6832 13521 -86 -9546 13139
1687 13139 10484 15049 70491 95553 39691 23571 1248 20863 29710 83226 99685 119921
1675 119921 107702 89804 58694 36377 63144 27897 -2211 14353 -29972 -47256 -59206 -56499
1663 -56499 -33849 -28690 -49828 -37671 -30960 10303 42513 -9821 -48823 -46418 -116257 -131161
1651 -131161 -116224 -103869 -124085 -118359 -100974 -36291 -22424 -34827 -63151 -23446 -33126 -27182
1639 -27182 -30100 -49282 -57688 -24262 -2451 5561 -61902 -59321 -17332 8052 38773 31856 44798
1626 44798 15856 9176 -15814 -61819 -50165 -49010 -29725 17911 -12038 -28502 -21024 -6997
1614 -6997 -7063 31174 11165 2814 -11507 -28303 -34764 -51353 -32583 28020 59112 82657 64688
1601 64688 41959 66290 43936 6739 -16639 6801 -2714 -47593 -32605 -17869 -63784 -60175
1589 -60175 -485 23837 30175 28255 38196 5485 -53400 -56320 -866 -28935 -61954 -87264 -36657
1576 -36657 -13130 -6696 -60 11056 24975 18400 6006 -10426 -37767 -28572 -31078 -69045 -89116
1563 -89116 -88485 -17023 2433 -16465 -17182 -40816 -29798 2704 9101 -35446 -83645 -42872 -2511
1550 -2511 22847 48274 47341 -128 -23259 -18834 -18013 27045 42652 83477 65275 35156 49871
1537 49871 -1507 -30627 -15721 -1509 44043 12692 -27301 8716 -5748 -59748 -77276 4554
1525 4554 23368 31488 63459 69548 6724 -22194 48958 115460 80631 78379 61732 60160 78056
1512 78056 126190 129915 88810 30201 -12149 -63035 -87571 -18907 -1009 -8903 -25240 3139
1500 3139 37028 21223 27154 41585 14138 -551 37183 84965 63039 -6063 -1946 42413
1488 42413 28415 68402 69366 -8745 -21649 -2698 23360 -10987 -22887 17174 10149 4537 -41456
1475 -41456 -65745 -34590 3036 64141 102026 90384 78936 9510 -34057 -46844 -8744 -26327
1463 -26327 2213 26867 28744 35204 -11805 -80319 -82354 -81891 -109725 -67856 -31659 -8650 38642
1450 38642 40438 75698 33145 -15179 -35670 21598 11847 -9406 4441 26060 63036 104313
1438 104313 81857 50415 89297 73449 81351 61598 10090 17448 68265 37255 -31253 -43623
1426 -43623 -25471 -42753 24823 17437 6683 -166 14438 -1382 -17189 -8097 58541 76874
1414 76874 67159 66881 76949 86572 95683 109114 71314 10561 24462 28457 28385 21990 -23671 -41955
1400 -41955 -69507 -94717 -10106 23441 39730 50367 109954 101386 53077 10595 2666 35750
1388 35750 40747 10366 79750 76899 42370 -38277 -54532 -53685 -124866 -130297 -100754 -117843 -63529
1375 -63529 -6400 24616 29396 12851 19921 24823 15694 -9285 -65184 -60890 -6077 -13879 -54757
1362 -54757 -59310 -16219 -57262 -64580 -89777 -101845 -98318 -99141 -38628 -36568 -61582 -78230 -48061
1349 -48061 -86523 -81633 -74029 -71913 -54846 -57934 -56730 -54535 -11259 18693 38801 27158 -5346
1336 -5346 -1698 -13944 13983 59425 29837 -10086 -39459 35609 82934 69290 40747 36666
1324 36666 32657 29038 -36319 -68934 -33292 17225 38836 39741 -4996 -9853 39815 76086 119118
1311 119118 121219 97259 83967 29099 -4627 12744 52542 -11431 -28360 -20559 -52494 -59711
1299 -59711 -44811 -5551 18568 -34116 -46746 31750 -13835 -41149 -63933 -39641 -11254 32538
1287 32538 5705 6630 57806 37198 19716 67481 87595 46373 15956 -3466 -10158 -22519
1275 -22519 -35769 -38867 1461 2670 60007 45477 9016 -15281 37010 70533 71269 85488 45226
1262 45226 8667 54584 62572 52181 47718 61427 78631 45006 19262 20587 2350 14122
1250 14122 19558 908 32246 46247 -322 6546 20092 29222 25680 31705 43493 6172 -19613
1237 -19613 -3157 18983 43863 5334 -30058 -14886 14786 -15790 -53856 -7331 -33605 -41975
1225 -41975 -65126 -113445 -142097 -99432 -62767 -31039 -25295 -37637 -17268 35861 60492 61959
1213 61959 18454 22552 -12384 -30117 -32222 -56591 -70270 -42489 -46528 -102967 -112897 -99959 -46352
1200 -46352 -25113 20518 37240 24136 -36365 -69701 -71859 -80683 -76278 -54077 16539 -4346
1188 -4346 44086 64937 47097 39740 62211 130935 93879 11986 -37052 -27056 -26748 3562 51216
1175 51216 43662 -5691 -44767 -20206 3979 66517 96824 62702 2903 -29707 -17707 -336
1163 -336 15132 21832 21817 16686 24852 3226 4992 -1169 -15916 21501 -18059 -56379 -46979 -2956
1149 -2956 38593 7938 -11599 -16724 2818 -6073 -9783 16339 32066 66909 -1899 -69002 -62697
1136 -62697 -61800 -62784 -18891 6365 13348 84108 45226 61131 42870 -35788 -77864 -77939 -49622
1123 -49622 766 15600 -1868 -734 39617 62253 61087 29622 -11949 -3532 36065 41587 49625
1110 49625 23896 -14134 6711 22203 9381 16235 -39897 -100393 -57398 -3012 9739 -26294
1098 -26294 -34986 -43165 -21307 -167 31658 -21554 -20633 35559 74476 69417 65497 45518 -4601
1085 -4601 9108 18282 -11754 -11636 -13898 4814 -16866 -48430 -30720 7581 21083 22089 -6728
1072 -6728 28206 85401 64770 -7180 -26648 -5342 30460 21762 27347 9049 3527 4213 1333
1059 1333 40964 38083 3325 -15047 33671 64909 42158 5423 -14711 39245 47315 13710
1047 13710 36062 77879 83716 75576 30759 17479 12909 46019 38452 19349 24751 -198 -17354
1034 -17354 -27621 20506 57300 13947 -27949 -28091 -20439 -39831 -53890 -7872 -9691 -31343 -48859
1021 -48859 -30759 18628 46468 43821 8612 -2606 -12961 23902 60347 36753 45165 60192
1009 60192 36289 -8416 -50117 -15361 11721 23049 54856 35092 60143 89856 91084 71556
997 71556 55952 17728 -18758 46139 107350 74800 19533 18194 61077 68926 74392 56786 26379
984 26379 -23232 30953 67202 48476 63953 95358 83936 67259 80515 83574 80430 78888 73672
971 73672 48362 26191 40125 21816 13466 5468 65531 108170 86646 50326 43834 8566 28196
958 28196 35438 21309 8395 -13014 -27848 5191 25386 -76618 -64700 -72726 -80490 -71393 -71042
945 -71042 -34732 -7887 19656 47560 44489 15702 9402 -5067 -29530 -41590 -40572 -70028 -29923
932 -29923 5737 -38755 -43425 11872 61172 71142 70730 42357 530 -17242 -5147 29611 55007
919 55007 5466 -2121 39823 34940 58721 57275 72788 61395 -17106 -31576 -14959 -36668 25919
906 25919 -339 -6545 16367 36026 -33478 -14273 51456 55324 45024 35887 10577 42931 49410
893 49410 6753 -27460 -91537 -76234 -2033 21553 -1701 -34272 -59818 -57742 -25002 -12621
881 -12621 1037 -3071 -51150 -73386 -68810 -32479 -49227 -50080 -6244 14160 35256 14878 36738
868 36738 57078 88079 95821 112258 67648 21454 -38398 -48320 -21155 11587 26223 8146
$$ [...]
##END NTUPLES=NMR SPECTRUM
##END=
