##TITLE=Analysis number 328740
Compound Code cc 62109
Book Reference 540/2/2
Project Code adrs
Chemist Name mikem
##JCAMPDX= 6.0         $$ Bruker NMR JCAMP-DX V2.0
##DATA TYPE= NMR SPECTRUM
##DATA CLASS= NTUPLES
##ORIGIN= Bruker BioSpin GmbH
##OWNER= nmr
$$ XWIN-NMR		Version 3.5
$$ Fri Jun 29 09:12:39 2007 GMT Daylight Time (UT+1h)  MAYBRIDGE\nmr@NMR_250MHZ
##.OBSERVE FREQUENCY= 250.131544655141
##.OBSERVE NUCLEUS= ^1H
##.ACQUISITION MODE= SIMULTANEOUS (DQD)
##.ACQUISITION SCHEME= undefined
##.AVERAGES= 16
##.DIGITISER RES= 18
##SPECTROMETER/DATA SYSTEM= dpx250
##.PULSE SEQUENCE= zg30
##.SOLVENT NAME= CDCl3
##.SHIFT REFERENCE= (INTERNAL, CDCl3, 0, 16.4482)
##AUDIT TRAIL= $$ (NUMBER, WHEN, WHO, WHERE, WHAT)
$$ ##TITLE= Audit trail, XWIN-NMR		Version 3.5
$$ ##JCAMPDX= 5.01
$$ ##ORIGIN= Bruker BioSpin GmbH
$$ ##OWNER= nmr
$$ C:\u/data/dgb/nmr/ADRS/2210/pdata/1/auditp.txt
$$ ##AUDIT TRAIL=  $$ (NUMBER, WHEN, WHO, WHERE, WHAT)
(   1,<2007-06-29 09:12:11.79 +100>,<MAYBRIDGE\nmr>,<NMR_250MHZ>,
      <created by zg, POWCHK disabled, PULCHK disabled
       configuration hash MD5:
       76 6E 9A 78 1E 09 19 81 EC 84 63 8F B0 6A 59 2D
       data hash MD5: 64K
       F9 2C 83 19 D0 4E 01 4D BA 74 65 84 9D E7 C2 A9>)
(   2,<2007-06-29 09:12:27.17 +100>,<MAYBRIDGE\nmr>,<NMR_250MHZ>,
      <Start of raw data processing
       ef LB = 0.3 FT_mod = 6 PKNL = 1 SI = 32K 
       data hash MD5: 32K
       62 B7 46 20 09 48 FD C3 C7 F8 65 BA 48 88 31 67>)
(   3,<2007-06-29 09:12:29.46 +100>,<MAYBRIDGE\nmr>,<NMR_250MHZ>,
      <apk 
       data hash MD5: 32K
       A4 EA 78 3C 13 85 D4 19 86 CD 79 36 F6 EC 63 56>)
(   4,<2007-06-29 09:12:30.62 +100>,<MAYBRIDGE\nmr>,<NMR_250MHZ>,
      <abs ABSG = 5 
       data hash MD5: 32K
       93 39 F8 26 C0 DB 05 6F AE 9E 33 AC E9 F4 80 46>)
$$ ##END=
$$ 
$$ hash MD5
$$ B3 8C 6B 0D 88 5C 48 29 1A C9 21 E2 7A C9 62 1C
##$RELAX= 
##$RELAX= 
##$RELAX= 
##$RELAX= 
##$RELAX= 
##$RELAX= 
##$RELAX= 
$$ Bruker specific parameters
$$ --------------------------
##$DU= <C:\u>
##$EXPNO= 2210
##$NAME= <ADRS>
##$PROCNO= 1
##$TYPE= <nmr>
##$USER= <dgb>
##$AMP= (0..31)
100 100 100 100 100 100 100 100 100 100 100 100 100 100 100 100 100 100 
100 100 100 100 100 100 100 100 100 100 100 100 100 100 
##$AQSEQ= 0
##$AQ_mod= 3
##$AUNM= <au_zg>
##$AUTOPOS= <2 >
##$BF1= 250.13
##$BF2= 250.13
##$BF3= 250.13
##$BF4= 250.13
##$BF5= 500.13
##$BF6= 500.13
##$BF7= 500.13
##$BF8= 500.13
##$BYTORDA= 1
##$CFDGTYP= 0
##$CFRGTYP= 5
##$CHEMSTR= <none>
##$CNST= (0..31)
1 1 145 1 1 1 1 1 1 1 1 1 1 1 1 1 1 1 1 1 1 1 1 1 1 1 1 1 1 1 1 1 
##$CPDPRG= <>
##$CPDPRG1= <>
##$CPDPRG2= <>
##$CPDPRG3= <>
##$CPDPRG4= <mlev>
##$CPDPRG5= <mlev>
##$CPDPRG6= <mlev>
##$CPDPRG7= <mlev>
##$CPDPRG8= <mlev>
##$CPDPRGB= <>
##$CPDPRGT= <>
##$D= (0..31)
0 1 0 0 0 0 0 0 0 0.06 0 0 0 0 0 0 0.0002 0 0 0 0 0 0 0 0 0 0 0 0 0 0 
0 
##$DATE= 1183104731
##$DBL= (0..7)
120 120 120 120 120 120 120 120 
##$DBP= (0..7)
150 150 150 150 150 150 150 150 
##$DBP07= 0
##$DBPNAM0= <>
##$DBPNAM1= <>
$$ [...]
##$SUBNAM7= <"">
##$SUBNAM8= <"">
##$SUBNAM9= <"">
##$SW= 20.6930455092707
##$SWIBOX= (0..15)
0 0 3 0 0 0 0 0 0 0 0 0 0 0 0 0 
##$SW_h= 5175.983436853
##$TD= 65536
##$TD0= 1
##$TE= 296.16
##$TE2= 300
##$TE3= 300
##$TEG= 300
##$TL= (0..7)
0 120 120 120 120 120 120 120 
##$TP= (0..7)
150 150 150 150 150 150 150 150 
##$TP07= 0
##$TPNAME0= <>
##$TPNAME1= <>
##$TPNAME2= <>
##$TPNAME3= <>
##$TPNAME4= <>
##$TPNAME5= <>
##$TPNAME6= <>
##$TPNAME7= <>
##$TPOAL= (0..7)
0.5 0.5 0.5 0.5 0.5 0.5 0.5 0.5 
##$TPOFFS= (0..7)
0 0 0 0 0 0 0 0 
##$TUNHIN= 0
##$TUNHOUT= 0
##$TUNXOUT= 0
##$USERA1= <user>
##$USERA2= <user>
##$USERA3= <user>
##$USERA4= <user>
##$USERA5= <user>
##$V9= 5
##$VALIST= <valist>
##$VCLIST= <CCCCCCCCCCCCCCC>
##$VD= 0
##$VDLIST= <DDDDDDDDDDDDDDD>
##$VPLIST= <PPPPPPPPPPPPPPP>
##$VTLIST= <TTTTTTTTTTTTTTT>
##$WBST= 1024
##$WBSW= 4
##$XGAIN= (0..3)
0 0 0 0 
##$XL= 0
##$YL= 0
##$YMAX_a= 381894
##$YMIN_a= -241679
##$ZGOPTNS= <>
##$ZL1= 120
##$ZL2= 120
##$ZL3= 120
##$ZL4= 120
##$ABSF1= 16.44819
##$ABSF2= -4.244982
##$ABSG= 5
##$ABSL= 3
##$ALPHA= 0
##$AQORDER= 0
##$ASSFAC= 0
##$ASSFACI= 0
##$ASSFACX= 0
##$ASSWID= 0
##$AUNMP= <proc_1d>
##$AZFE= 0.1
##$AZFW= 0.1
##$BCFW= 0
##$BC_mod= 0
##$BYTORDP= 0
##$COROFFS= 0
##$CY= 12.5
##$DATMOD= 1
##$DC= 0
##$DFILT= <>
##$DTYPP= 0
##$F1P= 14.0000005364418
##$F2P= -0.99999901652339
##$FCOR= 0.5
##$FTSIZE= 32768
##$FT_mod= 6
##$GAMMA= 0
##$GB= 0
##$INTBC= 1
##$INTSCL= 1
##$ISEN= 128
##$LB= 0.3
##$LEV0= 0
##$LPBIN= 0
##$MAXI= 10000
##$MC2= 0
##$MEAN= 0
##$ME_mod= 0
##$MI= 0
##$NCOEF= 0
##$NC_proc= -3
##$NLEV= 6
##$NOISF1= 0
##$NOISF2= 0
##$NSP= 0
##$NTH_PI= 0
##$NZP= 0
##$OFFSET= 16.44819
##$PC= 1
##$PHC0= -55.72001
##$PHC1= 10.19667
##$PH_mod= 1
##$PKNL= yes
##$PPARMOD= 0
##$PSCAL= 4
##$PSIGN= 0
##$REVERSE= no
##$SF= 250.130018459587
##$SI= 32768
##$SIGF1= 0
##$SIGF2= 0
##$SINO= 400
##$SIOLD= 32768
##$SREGLST= <1H.CDCl3>
##$SSB= 0
##$STSI= 32768
##$STSR= 0
##$SW_p= 5175.98343685301
##$SYMM= 0
##$S_DEV= 0
##$TDeff= 65536
##$TDoff= 0
##$TI= <Analysis number 999999
Compound Code 99
Book Reference 9
Project Code 9>
##$TILT= no
##$TM1= 0
##$TM2= 0
##$TOPLEV= 0
##$USERP1= <user>
##$USERP2= <user>
##$USERP3= <user>
##$USERP4= <user>
##$USERP5= <user>
##$WDW= 1
##$XDIM= 32768
##$YMAX_p= 290314963
##$YMIN_p= -74843
$$ End of Bruker specific parameters
$$ ---------------------------------
##NTUPLES= NMR SPECTRUM
##VAR_NAME=  FREQUENCY,     SPECTRUM/REAL,   SPECTRUM/IMAG
##SYMBOL=    X,             R,               I
##VAR_TYPE=  INDEPENDENT,   DEPENDENT,       DEPENDENT
##VAR_FORM=  AFFN,          ASDF,            ASDF
##VAR_DIM=   32768,         32768,           32768
##UNITS=     HZ,            ARBITRARY UNITS, ARBITRARY UNITS
##FACTOR=    0.157963299565203, 1,           1
##FIRST=     4114.18624068812, 0,            0
##LAST=      -1061.79719616489, 0,           0
##MIN=       -1061.79719616489, -74843,      0
##MAX=       4114.18624068812, 290314963,    0
$$ Real data points
##PAGE= N=1
##DATA TABLE= (X++(R..R)), XYDATA
$$ [...]
18427A831916k35364j17193n9606j7895M9268N4577m5216n9429M386L5715O8536
18416A509695J44772K31366K90399L50636L23714J74289K28883N80376J084189
18407D918319J805707K746822L507960L506504K957450J787103p09686k483628
18399A8036551k599406k355309j212496O44690K136194K604481K265060J112155
18391B0631920j473784l191768l224635l154351k504976j556407q69477m14430
18383D242092j88864k18091l38719l78699l46718k69442j67206r5500k1706M2966
18373B260113R7385J10595P3704Q9003Q8168O8982R5652J42433K61885M48244
18363C736164O96643J091860J708773K665512L975273N241487N790085N251316
$$ plain form
18427 1831916 1596552 1479359 1419753 1401858 1451126 1505703 1460487 1401058 1405444 1441159 1509695
18416 1509695 1654467 1885833 2176232 2526868 2850582 3024871 3253754 3834130 4918319
18407 4918319 6724026 9470848 12978808 16485312 19442762 21229865 20520179 18036551
18399 18036551 15437145 13081836 11869340 12514030 14650224 17254705 19519765 20631920
18391 20631920 19158136 15966368 12741733 9587382 7082406 5525999 4656522 4242092
18383 4242092 4053228 3835137 3496418 3117719 2771001 2501559 2334353 2238853 2217147 2260113
18373 2260113 2357498 2468093 2541797 2630800 2718968 2787950 2883602 3026035 3287920 3736164
18363 3736164 4432807 5524667 7233440 9898952 13874225 19115712 24905797 30157113
18355C0157113L757712Q62485k658402m167716l754643k427528M1412K591179
18347B4401612L729609L444874K083730j292122m692942n490682n474625m866927
18339A1842527l436918k200567j376362q72559n62190l52674j95228j05497o2035
18330B678497j25362j56547j65447j45215r4500l4277k7316n453O565J3799p044
18319A937700K8316O8258J35046K60071M07788O64618J110593J763141K510174
18310H885705K883574K628182J998473M64394j500585k065677j931966j277214
18302A0084886O3807J297923J766504J612394R24518q83935k386965k616830k674475
18293G187827k262030j451627q62808n47455l35073k08785j46862o7362r246J8800
$$ plain form
18355 30157113 33914825 34777310 32118908 27951192 24196549 21769021 21810433 24401612
18347 24401612 28131221 31576095 33659825 32367703 27674761 22184079 16709454 11842527
18339 11842527 8405609 6205042 4828680 3956121 3393931 3041257 2846029 2740532 2678497
18330 2678497 2553135 2396588 2231141 2085926 1991426 1957149 1929833 1924380 1930945 1944744 1937700
18319 1937700 1966016 2034274 2169320 2429391 2837179 3501797 4612390 6375531 8885705
18310 8885705 11769279 14397461 16395934 16860328 15359743 13294066 11362100 10084886
18302 10084886 10148693 11446616 13213120 14825514 15750032 14866097 12479132 9862302 7187827
18293 7187827 4925797 3474170 2611362 2063907 1728834 1520049 1373187 1305825 1296579 1315379
18283A315379K3886p493o8434p5594p4840o6100m9515m7887l2160k3261p982l1551
18271H54448p4770o7823l2627l5960o4524n0203m4919k1679k0396k7188K5951
18260D40310M2314K4802K4409P4613J11985J25350J22593Q2786P9935L7175p8927
18249A087345j51845j31406p7499p2353q2425o7564l7249J1163K3330N640J2712
18238E19849O54J8293L0465R170O188j020m8924l4260j5282M302Q369K1085K3830
18225E42719J0098j8752j3846m711J1242N3729L5554n273k2386J625J8494J7727
18213F26220J182Q422l774j455k5559j8247r568K741j5365m013n095L810q40K5679
18199E84138L7182Q200K184m700j5411m895k736N202j4074J7653J8952o340k0193
$$ plain form
18283 1315379 1339265 1331772 1263338 1187744 1112904 1046804 997289 949402 917242 893981 885999 854448
18271 854448 779678 711855 679228 643268 578744 528541 483622 461943 441547 414359 440310
18260 440310 482624 507426 531835 606448 718433 843783 966376 1049162 1129097 1166272 1087345
18249 1087345 935500 804094 726595 654242 571817 504253 467004 478167 501497 507137 519849
18238 519849 520503 538796 569261 578431 584619 583599 534675 500415 485133 489435 497804 518889 542719
18225 542719 552817 534065 520219 515508 526750 580479 616033 610760 588374 589999 608493 626220
18213 626220 627402 635824 632050 630595 605036 586789 577221 579962 564597 560584 555489 559299 558459 584138
18199 584138 621320 629520 631704 627004 611593 606698 603962 609164 595090 612743 631695 625355 605162
18186F05162k8729j3534J6684L2031j335j5499Q878j9337j7604j2993m791j285
18174E47648j3091k9957j6769p371j4700K190n249J1595L457k147J8536O532J737
18161E02411R740j2562j5117J0255L9906J2818p992N306J2631P141K3118L7486
18149F25141M6156N2269O4755R1375Q5682Q0238Q9411O3080N2680P9130Q7167
18138A417084R2144R4653J04472J18112J01972J31521J51462J57582J60460K12898
18128B742360K73224L85114N68322Q53281J335348K131157L379038M989222O328263
18119B2985329O509511N135527K901877J243322q8950j636018k363273l68232
18111C4319093L774667Q875266J4012559J6311970N326950j5345334j8801340
$$ plain form
18186 605162 576433 562899 579583 611614 610279 594780 603658 584321 566717 553724 548933 547648
18174 547648 534557 504600 487831 480460 465760 467950 462701 474296 477753 475606 494142 500674 502411
18161 502411 512151 499589 484472 494727 534633 547451 539459 544765 557396 564537 587655 625141
18149 625141 671297 723566 788321 879696 965378 1045616 1135027 1198107 1250787 1329917 1417084
18138 1417084 1509228 1603881 1708353 1826465 1928437 2059958 2211420 2369002 2529462 2742360
18128 2742360 3015584 3400698 3969020 4822301 6157649 8288806 11667844 16657066 22985329
18119 22985329 29494840 34630367 37532244 38775566 38686616 37050598 34687325 34319093
18111 34319093 38093760 46969026 60981585 77293555 82620505 67275171 48473831
18104D8473831j3072117j0002127p738581n474376l459200k118961j282611q08324
18096D517534n53825m04210l32375k58016k01967j57852j21270j03939p4236k6923
18086B282921O155J1852J185K580L6024P9574J12634J97241L43722N92057R93408
18075D659353J643248K611956L789482M729434M750772L548981J711834J10024
18067B7555084j494635k880345k869466j225190R44288K279823K065489P74313
18059B5149361m61359j560503l013617m307312m404694l561342k388386j463770
18051C988378r04106n95063l69217k25568j74999j29838j20691j31198j26680
18042A211018j04794j00932r7087p6204n6909m1183l3200m9091m3148k0444k4068
$$ plain form
18104 48473831 35401714 25399587 17661006 12186630 8727430 6608469 5325858 4517534
18096 4517534 3963709 3559499 3227124 2969108 2767141 2609289 2488019 2384080 2309844 2282921
18086 2282921 2289076 2300928 2302113 2304693 2340717 2420291 2532925 2730166 3073888 3665945 4659353
18075 4659353 6302601 8914557 12704039 17433473 22184245 25733226 27445060 27555084
18067 27555084 26060449 23180104 20310638 19085448 20029736 22309559 24375048 25149361
18059 25149361 24688002 23127499 20113882 15806570 11401876 7840534 5452148 3988378
18051 3988378 3084272 2489209 2119992 1894424 1719425 1589587 1468896 1337698 1211018
18042 1211018 1106224 1005292 908205 832001 775092 733909 700709 651618 608470 588026 563958
18031E63958n4471p1307n7424l8586k5316k2443k1469j4865R442n998j8462r687
18019B33372J0031j0694j0254n154r91L2753K946J4876K3970J0995K0156j33j8865
18006C03008J9870L944j2064j1606j1722o356J4510J3532p15M93n931j9199m5642
17993B42122k9984n752j1789k0730k436l431j0004j0643r885p178R690N023p683
17980A37320N45L89k3883j1032O92O638j0603J4644O775P422J5260J0580K0946
17967A75693P243L05J062l707k209k853J3101j0284m403l565N025p540m488j5094
17953A48286j0307k1636l898J8643L350o196k0243j8774k2462r278J2811J5222
17941H5518o614J3030J4695N25k7053r110O94l062M318J834J2246j6362j0015
$$ plain form
18031 563958 509487 438180 380756 342170 316854 294411 272942 258077 267519 261521 243059 233372
18019 233372 243403 232709 222455 217301 216310 249063 252009 266885 290855 301850 322006 321873 303008
18006 303008 322878 326822 314758 303152 291430 285074 299584 313116 312401 312894 306963 287764 242122
17993 242122 212138 206386 194597 173867 171431 168000 157996 147353 137468 130290 139980 145003 137320
17980 137320 137865 138254 114371 103339 104031 110669 100066 114710 121485 128907 144167 154747 175693
17967 175693 182936 183241 184303 180596 178387 175534 188635 178351 173948 170383 175408 167868 163380 148286
17953 148286 137979 116343 112445 131088 134438 128242 107999 89225 66763 57485 70296 85518
17941 85518 78904 91934 106629 107154 80101 70991 71685 68623 72941 74775 87021 70659 60644
17928F0644p694P990J0917L78J9689K5414L0664J1290q305j0257q387p297M974
17915A30020j1448J5241n311j89r628j2318o773J6649j1583j1714m042k717j7367
17902F8820l2236J1079M309J933J1709o98j4810j4112j65j316j0075M408J5389
17889D4235K546K8326K4153M3176J2267k9144j6587j4468j1757N411J6843R020
17877A14021J2607J3980J92Q005j4966k0847j4418r814k2004q497M238n870m050
17864E2577P28J4082j0842k8581L616K4273n548J837N468K964j7384m057m350
17851C4783k2030K937J2107j7806j1391J8927K4133J7665K0529J9874K5612K3585
17839A48925O780N208K041m516j9689j6996J6706L3610o075j0265l997R067K569
$$ plain form
17928 60644 52950 60940 71857 72235 91924 117338 148002 159292 150987 140730 132343 125046 130020
17915 130020 118572 133813 128502 128313 118685 106367 99594 116243 104660 92946 88904 86187 68820
17902 68820 36584 47663 51972 53905 65614 64916 50106 35994 35829 34513 24438 28846 44235
17889 44235 46781 75107 99260 142436 154703 125559 108972 94504 82747 88158 105001 114021
17877 114021 126628 140608 140800 148805 133839 112992 98574 88760 66756 58259 62497 56627 52577
17864 52577 53305 67387 56545 27964 31580 55853 50305 52142 57610 60574 43190 39133 34783
17851 34783 12753 15690 27797 9991 -1400 17527 41660 59325 79854 99728 125340 148925
17839 148925 155705 160913 162954 158438 138749 121753 138459 172069 165994 155729 151732 160799 163368
17826A63368m958l0202k1980l2865l1684j9433j1947m121P763K1411J9824n437
17814D9739j5889p469L906l706L656M559m463k1506j4436j0679k088k966J3323
17801h019k981Q958J1511N592p651J867K0927K1736j213J6698J2192J67j4157
17788F5627l0547m717R150l11J9558Q665J2381K199M200j1482r376j4843p788
17775D2716j2842N15J4241m703j4727j2998k880J9731J7114P288l0291k4268l802
17762d906j99L634l445j1821L746M326J6513j080j4193r048J3297N615p967k76
17748e804N823J1431j2945r729p357J1245M908Q72q435L27M007J744n363J4906
17734E630L449j4695k1895M94K8232J3073J0753K986p316N775p78R326q73L303
$$ plain form
17826 163368 158410 128208 106228 73363 41679 22246 10299 6178 13941 35352 55176 49739
17814 49739 33850 26381 30287 26581 30237 34796 30333 8827 -5609 -16288 -18376 -21342 -8019
17801 -8019 -11000 -2042 9469 15061 7410 9277 30204 51940 50727 67425 79617 79784 65627
17788 65627 35080 30363 39513 39202 58760 67425 79806 82005 86205 74723 65347 50504 42716
17775 42716 29874 30389 44630 39927 25200 12202 9322 29053 46167 53455 23164 -1104 -4906
17762 -4906 -5105 -1471 -4916 -16737 -12991 -8665 7848 6768 -7425 -16473 -3176 2439 -5528 -5804
17748 -5804 19 11450 -1495 -11224 -18581 -7336 -2428 -1556 -9991 -9664 -5657 -3913 -9276 5630
17734 5630 9079 -5616 -27511 -27017 1215 14288 25041 28027 20711 26486 25708 35034 34161 37464
17720C7464j6923k203p487N785K182Q875j4921j2158P292j665j3922K583j3392
17707a8490q726J1647O253k729J0149J1456k726R6n585p275l017l998P705J2064
17693F824r151o350J707K6404j0656k5350p247J4377J5961Q33j7476M601J5038
17680I515j5907p904O612n133n348J6137p243q564J633j2617J255L656m815J449
17666b7274J720Q094O265o160L201J5187j4607N962M929j0170q016Q041M530J210
17652g088r145J888p089j361q510p291L109R783K4688J9572k1855j5919j1499
17639c0717j7948L545R909K1713K0253j390J8140J1763k637l6279p916o612L354
17626a4822k666P043L940l125K696J0376j363j3522K0422J0608o547J4237J3359
$$ plain form
17720 37464 20541 18338 10851 16636 18818 27693 12772 614 7906 6241 -7681 -5098 -18490
17707 -18490 -27216 -15569 -9316 -12045 -1896 9560 6834 6930 1345 -5930 -8947 -12945 -5240 6824
17693 6824 -2327 -8677 -6970 19434 8778 -16572 -23819 -9442 6519 7352 -10124 -5523 9515
17680 9515 -6392 -14296 -7684 -12817 -18165 -2028 -9271 -17835 -16202 -28819 -27564 -23908 -28723 -27274
17666 -27274 -25554 -17460 -11195 -17355 -14154 1033 -13574 -7612 -2683 -12853 -20869 -12828 -8298 -7088
17652 -7088 -16233 -14345 -21434 -22795 -31305 -38596 -35487 -25704 -1016 18556 -3299 -19218 -30717
17639 -30717 -48665 -45120 -35211 -13498 6755 5365 23505 35268 32631 -3648 -11564 -18176 -14822
17626 -14822 -17488 -10445 -6505 -9630 -6934 3442 2079 -11443 8979 19587 13040 27277 40636
17613D0636J4931J5407L0722J2795L1640J8891J473j1949k0728j3443l373J6526
17601A33528R111J340J3010P682j7386k2003l1473j8862k9136j5231j2951P06
17589A8335J507P22m618k0706q404r397P670P567R898oK887K539O263k131j868
17574A0258K520J1718n189O028j944J565M164J2462K2791N159J4261L5813L3872
17561A53478L417o182Q760N37j8326k7219p698J7510J9332n179l500k0025j7983
17548I6922j5183r755j3439j8840k8034q252J550j727o358p939R099J2322K6474
17535C6840Q542m706l899j4795r869N878M573j220O34M577j6074J625J2315R263
17521C3684k863o72J9948J5970M3484M8714N2925L4234L8950Q5895O1801L0515
$$ plain form
17613 40636 55567 70974 101696 114491 146131 165022 166495 154546 133818 120375 117002 133528
17601 133528 142639 143979 156989 164671 147285 125282 93809 74947 45811 30580 17629 18335
17589 18335 19842 20564 15946 -4760 -13164 -22561 -14891 -7324 2574 2568 5455 7994 14257 12126 10258
17574 10258 12778 24496 19307 25335 23391 24956 29120 41582 64373 69532 83793 119606 153478
17561 153478 156895 150713 159473 160010 141684 114465 106767 124277 143609 138430 134930 114905 96922
17548 96922 81739 71984 58545 39705 11671 3419 4969 3242 -3116 -11055 -1956 10366 36840
17535 36840 45382 40676 36777 21982 12113 17991 22564 21344 21978 26555 10481 12106 24421 33684
17521 33684 30821 30149 50097 66067 109551 158265 211190 245424 284374 370269 432070 462585
17509D62585J614R15k6907n6342n3061o7603n4460m0626n5971k9177j6656j5626
17497D8685l1454j756m838J2401o324k7172k360J5830m198J7904p474j0547J300
17484cJ0135k858j3347k3951J369J3393R47K471J6526Q693J1374n896k2735N696
17470A814m553j0559Q927J1634j565j8575j7259J1554N104j880p257J3281L781
17457e553k1233J1830L861J6898M64J9100p848j2344K402j0245J8465J8969J3600
17444D8366J3997K7917P0944O9414j1551q0622p1439m9435p347K892J625Q632
17432B3393j615k884j2696o333M247N442J9001Q486j8546r851r616Q02L694k2513
17418a8989j1422L163J8788M830l571L792j2553K3510K1061j26l0208N320j528
$$ plain form
17509 462585 464199 465114 438207 381865 328804 261201 206741 166115 110144 80967 64311 48685
17497 48685 17231 15475 10637 23038 16714 -10458 -12818 3012 -1186 16718 9244 -1303 -3
17484 -3 10132 7274 -6073 -30024 -28655 -15262 -14315 -11844 4682 13375 24749 18853 -3882 1814
17470 1814 -2739 -13298 -4371 7263 5698 -12877 -30136 -18582 -13478 -15358 -22615 -9334 -5553
17457 -5553 -26786 -14956 -11095 5803 6267 25367 17519 5175 7577 -2668 15797 34766 48366
17444 48366 62363 90280 161224 230638 219087 138465 67026 17591 10244 13136 14761 23393
17432 23393 21778 18894 6198 -135 4112 9554 28555 37041 18495 8644 -972 -170 3524 -18989
17418 -18989 -30411 -27248 -8460 -3630 -7201 -3409 -15962 7548 28609 28483 -1725 3595 2067
17405B067o911N592R46j6141l152N287m92M815R527J4745O718j1480O183J2897
17391C0601j1598k5086J1028K0256j750j231o092k5610P452J1034j5334J5274
17379H944M549j9668N441N793j1925R619m1o606L004J2862Q095j0674o819N409
17365G983p268k6191j9664K275K4091J6749J5051M024M750P560j3369j8952k5126
17352b8087M377J1982k3370J1096j422N218k530l125M173p285o052O176J5132
17339a3717J945L563J0367n685J075J7743m922r497j0943l639R437J732j6132
17326a8673M84J4223K540j0679m776l688K729P024O493P405N849j8317K240P338
17312A92J787r061n02J2641J6970j193k3544R546k2334j8530k3868j30R74M927
$$ plain form
17405 2067 -4844 748 1694 -14447 -17599 -12312 -12804 -7989 1538 16283 23001 11521 17704 30601
17391 30601 19003 -6083 4945 25201 23451 22220 16128 -9482 -2030 9004 -6330 8944
17379 8944 13493 -6175 -734 5059 -6866 2753 2712 -3894 -890 11972 20067 9393 2574 7983
17365 7983 715 -25476 -45140 -42865 -18774 -2025 13026 17050 21800 29360 15991 -2961 -28087
17352 -28087 -23710 -11728 -35098 -24002 -25424 -20206 -22736 -25861 -21688 -28973 -35025 -28849 -13717
17339 -13717 -11772 -8209 2158 -3527 -2452 15291 10369 872 -10071 -13710 -4273 -2541 -18673
17326 -18673 -18189 -3966 -1426 -12105 -16881 -20569 -17840 -10816 -4323 3082 8931 -9386 -7146 192
17312 192 1979 -7082 -7584 5057 22027 20834 -2710 6836 -15498 -34028 -57896 -58026 -57052 -52125
17298e2125O916K2714j6733J2046J6580q326l288N017o842J2652O221L653N581
17285D066p537o105j616Q782o554j4563J1322J4343p2J1495P964R663l1187j9987
17271a9986j4088R573J6071J3645R040N335N646j6108L482r244j8742l343J726
17258a6993k896N87J0016r007J2777P434O408j2260j6554n976J7878N816J3967
17245A1197Q048R259L627L087J8914J5989J7243J569k429J2500N362m422j1339
17232H8605k1768k4165R29m744M197J2834j0674j2522J2388M128j388k3660j3351
17219A0809K486Q567k4410p461J2352O167K669J7672Q119j950J35J4635M480J5309
17205F9579M0047M6495N8500R0376J31921J54925J67105J82121K24243J27496
$$ plain form
17298 -52125 -45209 -22495 -39228 -27182 -10602 -18928 -22216 -17199 -24041 -11389 -5168 -1515 4066
17285 4066 -3471 -9576 -11192 -2410 -8964 -23527 -12205 2138 2066 13561 21525 31188 1 -19986
17271 -19986 -34074 -24501 -8430 5215 14255 19590 25236 9128 12610 3366 -15376 -18719 -16993
17258 -16993 -19889 -19302 -9286 -18293 -5516 1918 8326 -3934 -20488 -26464 -8586 -2770 11197
17245 11197 19245 28504 32131 35218 54132 70121 87364 88933 86504 99004 104366 99944 88605
17232 88605 66837 42672 43601 38857 43054 55888 45214 32692 45080 49208 47820 24160 10809
17219 10809 13295 21862 -2548 -10009 2343 8510 11179 28851 36970 35020 35155 49790 54270 69579
17205 69579 109626 156121 214621 304997 436918 591843 758948 941069 1165312 1292808
17195A292808p798N66O791r7775k00869k01082j72062j58434j36817j03844n5837
17184A65647l9753k1063k9666k6249P700K0198q944j6704j0075J8596M625r673
17172E4639j004O223l397n455p400j95j014m63M10j4020j1291P750j64j7970m459
17157B190R27l902J7305j9038j1475L735L794L941k4776j4949J0288K4830J2746
17144E616J2816k603k0337k699j4863q418L787k689j734J665L12J3797J2178Q371
17130E199k2234J4233Q23l383k94L523Q283k64l117J2481m58J0289K630M390K012
17115C4113k1377j5141J6416K0198J8992n48p545m349j344j3210l3734J3655J9382
17102B5508j7026Q651J0974O949o11j410k1085j9152K1578L0348K647l920J3698
$$ plain form
17195 1292808 1285010 1285576 1292367 1194592 993723 792641 620579 462145 325328 221484 165647
17184 165647 125894 104831 75165 48916 56616 76814 67870 51166 41091 59687 64312 54639
17172 54639 53635 59858 56461 51006 43606 43411 42397 41934 42344 28324 17033 24783 24619 6649 2190
17157 2190 3117 -785 16520 -2518 -13993 -10258 -6464 -2523 -27299 -42248 -31960 -7130 5616
17144 5616 18432 15829 -4508 -7207 -22070 -30488 -26701 -29390 -31124 -29459 -29147 -15350 -3172 5199
17130 5199 -17035 -2802 -1979 -5362 -5656 -2133 6150 5886 2769 15250 14792 25081 27711 32101 34113
17115 34113 12736 -2405 14011 34209 53201 52653 45108 40759 39415 26205 -7529 6126 25508
17102 25508 8482 17133 28107 35056 34445 33035 11950 -7202 14376 44724 47371 43451 57149
17089E7149j939r918q175m706Q551j6113j8357J5492J483R702k850Q285j4961
17076B3643r7J8987J0876K594K0021J2044P207J6519K1314J8493j6484J2647J6933
17063A64697m609m089q309j7100j8776j2581j0859r342n333m930p641P67M738
17050F6633J2878K695j0417o975J3620O817O592q827j9058o14J4208r885P594
17037G5261J2632R972n47L33R765J4948l476j9677J659o197L230q066P51J8503
17023A09091K7605J3010o030j1288j898o986j7407R210j293j983l173M401p031
17010A06228J4175k1932J6148L9150K412j4796O740j333J4609J4433L308L985
16998A83127J3785N927R545J4751K1333L0664K8404R074J0399J0996J4168R661
$$ plain form
17089 57149 55210 45292 37117 32411 40962 24849 6492 21984 23467 33169 30319 38604 23643
17076 23643 23546 42533 53409 56003 76024 88068 95275 111794 133108 151601 135117 147764 164697
17063 164697 160088 155999 147690 130590 111814 99233 88374 79032 73699 68769 61128 61895 66633
17050 66633 79511 82206 71789 64814 78434 85251 91843 83016 63958 63344 77552 67667 75261
17037 75261 87893 97865 97318 97651 107416 122364 118888 99211 100870 94673 97903 89837 90588 109091
17023 109091 136696 149706 143676 132388 130490 123504 106097 115307 114014 112031 108858 113259 106228
17010 106228 120403 98471 114619 153769 156181 141385 148125 146792 161401 175834 179142 183127
16998 183127 196912 202839 212384 227135 248468 279132 307536 316610 327009 338005 352173 361834
16986C61834q801j106k354R964J5370K5705K9322J4556J6747K7653K4599L2870
16974E46359M6342M3983N3955Q9854J03178J20627J40498J40682J77513J84732
16964A647723J46700J37789J52639J51547J44391J70957K25145K56856L37611
16955C371358M46659N53858P67205J143967J743468K671401M173257O413736Q866250
16946C0151159J0249698J0393706J1733099J4086994J1533508L211496j229364
16939I0130296j79215l529119j1675215j4791095j2288789j0518038r917180q217418
16931A9014227n690953l582519k225516j430204r64952p15193n73447m48142l51164
16922C032137l39413k99207k43902k00926j70994j32529q0172q4009r4689p0223
$$ plain form
16986 361834 353033 351927 349573 359537 374907 400612 429934 444490 461237 488890 513489 546359
16974 546359 592701 636684 690639 780493 883671 1004298 1144796 1285478 1462991 1647723
16964 1647723 1794423 1932212 2084851 2236398 2380789 2551746 2776891 3033747 3371358
16955 3371358 3818017 4371875 5139080 6283047 8026515 10697916 14871173 21284909 30151159
16946 30151159 40400857 50794563 62527662 76614656 88148164 91359660 90130296
16939 90130296 89951081 86421962 74746747 59955652 47666863 37148825 27231645 19014227
16931 19014227 13323274 9740755 7515239 6085035 5120083 4404890 3831443 3383301 3032137
16922 3032137 2692724 2393517 2149615 1948689 1777695 1645166 1564994 1480985 1386296 1316073
16912A316073n7638q7635j28724j06395q4123j07506j03511o5545m6370l4008
16902D94618l5326k8907l2956k8911k6247j8437j1870k9932l0057j6893M118j993
16890B37207k1726k0939m503O161k841j3158n958N018j9028j7138J706j7180Q54
16877A28475j3320k4454j0184J5677J3756k140k8k8221j1757J6284m699p91J573
16864H0171l326r019O483k0278j4572r054q766n136J2940j325q785j0664R839
16851A8508J6183J7591N561j4602k65M946K1986J3119j3372j1665O673J5317k4915
16838E5065k2254j5397j0853m216J0234M251R051J842j8773q44J2858K5910n054
16825D1820j2414j6132k2664l917m827L367K179j2107J3748J7205P270j565J1732
$$ plain form
16912 1316073 1258435 1170800 1042076 935681 851558 744052 640541 574996 528626 494618
16902 494618 459292 430385 397429 368518 342271 323834 311964 282032 251975 235082 239200 237207
16890 237207 215481 194542 190039 196200 193359 180201 174243 179261 160233 143095 144801 127621 128475
16877 128475 115155 90701 80517 96194 109950 107810 107782 79561 67804 84088 79389 78598 80171
16864 80171 76845 67826 74309 54031 39459 30405 21639 16503 29443 28118 19333 8669 18508
16851 18508 34691 52282 57843 43241 42976 47922 69908 83027 69655 57990 64663 79980 55065
16838 55065 32811 17414 6561 2345 12579 16830 25881 27723 8950 8106 20964 46874 41820
16825 41820 29406 13274 -9390 -13307 -18134 -14767 -12588 -24695 -10947 6258 13528 11963 23695
16812B3695J0336k407R912J1757J0973J0929k689k2385j0319L291R783p938J180
16799D6118L08J5832R048o88j6646j9358j1455k170o166k5689p428L989o638K1530
16785E87J755M220j26k718O576j4026l401q58Q906Q580n946k3279j5252r414P473
16770c6923J2654L802K604K633o102N411K1424R498N121p451l125n262J918L117
16756I319K988L729J2322J8214K1014M580M075m352L459J615P085j0695L66m60
16742G3259j0960J4261K262k9159j4698N728R92M370j2205p832R551J4559J1087
16729F1215J8480p04j6203k0071l375K794Q64l727k4900o257j221O117j17r217
16715C678k417j3419q722k115j3809K634J019J2076J3127q519J0294J2471K385
$$ plain form
16812 23695 34031 31624 41536 53293 64266 75195 72506 50121 39802 43093 52876 44938 46118
16799 46118 46426 62258 71306 70618 53972 34614 23159 20989 14823 -10866 -18294 -14305 -20943 587
16785 587 2342 6562 6436 3718 10294 -3732 -7133 -7991 915 9495 3549 -19730 -34982 -44396 -36923
16770 -36923 -24269 -20467 -17863 -15230 -21332 -15921 5503 15001 20122 12671 9546 4284 6202 9319
16756 9319 12307 16036 28358 46572 67586 72166 76241 71889 75348 76963 84048 73353 73719 73259
16742 73259 62299 76560 78822 49663 34965 40693 41685 46055 33850 26018 35569 50128 61215
16729 61215 79695 78991 62788 42717 39342 42136 43000 39273 14373 8116 6895 13012 12895 3678
16715 3678 1261 -12158 -20880 -22995 -36804 -34170 -33151 -21075 -7948 -16467 -6173 6298 8683
16702H683M25j9510p552j2022j358J0434R502N600L903R50o28R507K594K691J037
16687A4256o651J2407l384l61r03J683j704J328n389j511j0881J496J4095L165
16673A7646j5935O92J7034P2j9765J8618K4487J2945K67K4884J3376o075Q802
16660I7048L914j4287m198j2297j1979p58J4275j0173m148k1289k502j005L115
16647C5716j8605k493l027q536M278p440j1189r173p597n640L569K1633p395j9464
16633c5363K896J8068l270k050J8272K4236O514j4551l2433r316O83J0147k161
16620a8328O890R547J6167j0814K511k269J2798K97j3831L5408M922l2600j5478
16607d780k02k730M534J0981J5107P601j6080l1938j7637j603K1417J3336k81
$$ plain form
16702 8683 9108 -10402 -17954 -29976 -31334 -20900 -11398 -5798 -1895 -945 -1573 7934 10528 13219 14256
16687 14256 7605 20012 16628 16267 15364 17047 15343 16671 11282 9771 -1110 386 14481 17646
16673 17646 1711 2403 19437 19509 -256 18362 42849 55794 56061 80945 94321 88246 97048
16660 97048 100962 86675 82477 70180 58201 57443 71718 61545 57397 36108 33606 32601 35716
16647 35716 17111 14618 11591 3055 7333 -107 -11296 -20469 -28066 -33706 -30137 -8504 -15899 -35363
16633 -35363 -32467 -14399 -17669 -19719 -1447 22789 29303 14752 -17681 -26997 -26314 -16167 -18328
16620 -18328 -11438 -1891 14276 3462 5973 3704 16502 16799 2968 38376 43298 10698 -4780
16607 -4780 -4982 -7712 -3178 7803 22910 30511 14431 -17507 -35144 -36747 -15330 -1994 -2275
16594b275j2511o043r53l58N876R277J1269p789q293N364J782j5933Q850J4165
16580B428j2415j8965k152K4144K2702L668k193J1458J0755J3843j344k075P94
16567E0648j2310j1882j0315j5746j6707J5896J1382j2325l6797j0998L391L848
16555d1915K2465J5038J2621j284k1788j5822P491K610q749K3099J6373L860k226
16542A1773j3055o094J0976j186N681o514j229M0n363K2863n890j5283j0012p307
16528b0600k841j1680n804J2604J7741m614k223J1648K097P72Q264J4855L143
16515B3362j4838k3322n844Q574J6760p180j7825m815l029j3473J1346K2908q768
16502a6144J4456J7036j5565j8799J4694P811j0929j2796l540o235K036k635m47
$$ plain form
16594 -2275 -14786 -20829 -21782 -22140 -16264 -6987 4282 -3507 -11800 -6436 -4654 -20587 -11737 2428
16580 2428 -9987 -28952 -31104 -6960 15742 19410 17217 28675 39430 53273 51929 49854 50648
16567 50648 38338 26456 16141 395 -16312 -416 10966 -1359 -38156 -49154 -45763 -41915
16555 -41915 -19450 -4412 8209 6925 -14863 -30685 -23194 -20584 -29333 -6234 10139 13999 11773
16542 11773 -1282 -7376 3600 2414 8095 1581 352 392 -4971 17892 12002 -3281 -13293 -20600
16528 -20600 -23441 -35121 -40925 -28321 -10580 -15194 -17417 -5769 -3672 -2900 5364 20219 23362
16515 23362 8524 -14798 -20642 -12068 4692 -2488 -20313 -25128 -28157 -41630 -30284 -7376 -16144
16502 -16144 -1688 15348 -217 -19016 -4322 3489 -7440 -20236 -23776 -30011 -27975 -30610 -31057
16489c1057M30K222J941j153r873L686J0454J9273l556k0198o27J326N19n98J3798
16474a3413P708L632R083j0467j5001j2396o873J3744O920k696P455J281l007
16461a4030n127K467J340M337P376J644j0969k3296J6005j296K721q605j1372
16448c8805J417K685J1157L268J988j8364J820Q309J7929l3076j0453K5523O312
16435b0290k695m248O295J2734J257n02N401J1896J0156L352J2675J8602K2010
16422G6643k684J431O596Q36R314n819k4182j1791j1160l188j2495J5462p019
16409C1944j6210j6296k3482N982J8607o578p527J5976n38J0068l733j2683m330
16396h800P999J035L605L72J4883J5327j4806j8289K619O67J1826l812m93o956
$$ plain form
16489 -31057 -30627 -28405 -26464 -27617 -37490 -33804 -23350 -4077 -7633 -27831 -28458 -27132 -26613 -27211 -13413
16474 -13413 -5705 -2073 7010 -3457 -18458 -30854 -37727 -23983 -17063 -19759 -12304 -11023 -14030
16461 -14030 -19157 -16690 -15350 -11013 -3637 -1993 -12962 -36258 -20253 -21549 -18828 -27433 -38805
16448 -38805 -37388 -34703 -23546 -20278 -18290 -36654 -34834 -26525 -8596 -41672 -52125 -26602 -20290
16435 -20290 -22985 -27233 -20938 -8204 -6947 -7449 -2048 9848 20004 23356 36031 54633 76643
16422 76643 73959 75390 81986 82822 92136 86317 62135 50344 39184 35996 23501 38963 31944
16409 31944 15734 -562 -24044 -18062 545 -6033 -13560 2416 1878 11946 8213 -4470 -8800
16396 -8800 -801 234 3839 4211 19094 34421 19615 1326 3945 4612 16438 12626 12133 5177
16382E177J1662N347L055o752p695N794K0139J7688L4851J8927M2320N9580N8544
16369B68637O0875M0907M1633K5825R466o7k9086n2825q1437o3329n2218n2568
16357A15813m3782l9379l0570j4799J4093l588Q08J485R442m499m718O042J4558
16344B0906J5130j0291k2023j1858M965L591o939o896J5462R003J593r985p999
16331e341J2483J318j1865o650j7198J5586K450j2862J5715k963l913J2957j9067
16318a9350j0439k18J3262J0241l609k4867K020J7454r222R10j5473j9835M273
16305e4853J3071J370J4192o419j3982k0552M933K7230J2315J508j1572m201K0647
16292a6313K7294j0646j5492r321M100q125k7597k071J3561L327n356P058N950
$$ plain form
16382 5177 16839 22186 25241 18489 10794 16588 36727 54415 89266 108193 150513 210093 268637
16369 268637 329512 370419 412052 437877 447343 447276 418190 365365 283928 220599 168381 115813
16357 115813 72031 32652 2082 -12717 1376 -2212 -1404 81 9523 5024 306 6348 20906
16344 20906 36036 25745 3722 -8136 -3171 420 -6519 -13415 2047 11050 12643 2658 -5341
16331 -5341 7142 8460 -3405 -10055 -27253 -11667 -9217 -22079 -6364 -9327 -13240 -283 -19350
16318 -19350 -29789 -30007 -16745 -6504 -10113 -34980 -32960 -15506 -24728 -23818 -39291 -59126 -54853
16305 -54853 -41782 -40412 -26220 -32639 -46621 -67173 -62240 -35010 -22695 -21187 -32759 -36960 -16313
16292 -16313 10981 335 -15157 -24478 -20378 -28503 -56100 -58171 -44610 -41283 -46639 -39581 -33631
16279c3631L280J4286m653j4460j3115m584O616p279P702J7786O692K3757J1361
16266A3758j978r541k517r317k6449M151J5992n121N441n437J0991J0878R835
16253A0686j6983j1740k5381m194J2856K1983J5671J7113l5990p444J1861j2682
16241b4244M691Q674l233j5769M360K4910J0743j1578j6952J0784j6215r475J2512
16228b0792K5298o819n679M314q888j335p592j909j1174J6948N419J0174M553
16215B518q955r213m893O59J0639K463Q477k873M380J772r413n332j2418n9K634
16200a9614q659l719j009J0675n271M803J8609p095j7954O969N050k055j2598
16187c1868j74J390M025j1423j2077K4808O37k0646j8166O527J7410O845K0379
$$ plain form
16279 -33631 -30351 -16065 -20718 -35178 -48293 -52877 -46261 -53540 -45838 -28052 -21360 2397 13758
16266 13758 11780 2239 -278 -9595 -36044 -31893 -15901 -21022 -15581 -21018 -10027 851 10686
16253 10686 -6297 -18037 -43418 -47612 -34756 -12773 2898 20011 -15979 -23423 -11562 -24244
16241 -24244 -19553 -10879 -14112 -29881 -25521 -611 10132 -1446 -18398 -7614 -23829 -33304 -20792
16228 -20792 4506 -2313 -7992 -3678 -12566 -13901 -21493 -23402 -34576 -17628 -12209 -2035 2518
16215 2518 -6437 -15650 -20543 -19884 -9245 -6782 1695 -1178 3202 4974 -4439 -9771 -22189 -22248 -19614
16200 -19614 -28273 -31992 -33001 -22326 -27597 -22794 -4185 -11280 -29234 -22265 -17215 -19270 -31868
16187 -31868 -32042 -30652 -26627 -38050 -50127 -25319 -24682 -45328 -63494 -56967 -39557 -32712 -12333
16174a2333K9300k453n0j3701q875n291J0607q12j0346J1836J2870k934j4844
16161g026K307p001J1784r39k0149K6027J208j964J991o234j6475K080J0327J185
16147b879l276j4322K38n780p025l628L484J6981K1225J8717l817j9596M955j0933
16133e656r64j2427n77M89j829M85j2796O416N295p201J3603J5832N073m354j6749
16118a5360n099k196m924p118J9846M522R985J7663j4055r395L727k5009K249
16105b5164R644j7229j0447O041k0669P312J6780K4804j1030O252j4352o949K2087
16092a2920j07r430N581J8721r222Q309k073O895J908m440J223L390l002j979
16078B854r590r534j2402l180J2471J834m237N70K375Q703O75m124j51j817l017
$$ plain form
16174 -12333 16967 14514 14464 763 -8112 -13403 -2796 -3608 -13954 -2118 10752 7818 -7026
16161 -7026 -4719 -11720 64 -875 -21024 5003 6211 4247 6238 4 -16471 -14391 -4064 -2879
16147 -2879 -6155 -20477 -20239 -26019 -33044 -36672 -33188 -16207 5018 23735 19918 322 5277 -5656
16133 -5656 -6620 -19047 -19624 -19135 -20964 -20479 -33275 -26859 -21564 -28765 -15162 670 5743 1389 -15360
16118 -15360 -20459 -22655 -27579 -34697 -14851 -10329 -344 17319 3264 -6131 -2404 -27413 -25164
16105 -25164 -15520 -32749 -43196 -37155 -57824 -50512 -33732 -8928 -19958 -13706 -28058 -35007 -12920
16092 -12920 -13027 -22457 -16876 1845 -7377 932 -1141 5754 7662 3222 4445 7835 4833 2854
16078 2854 -6736 -16270 -28672 -31852 -19381 -17547 -21784 -21214 -18839 -10136 -9461 -13585 -13736 -15553 -18570
16063a8570M233Q380J8394n02L283K351j1039j1280n576P518K432L213j69k149
16049E19j5853J4219N795m934j044k779r027k6003j1795L2220K4530o228N774
16036E394K130K2836M752k109J657J567k2329j2622j6439k068q409R027J2399
16023d214l183j5961O318j592m567m654K2706K790j2853M871K2651K894j0802
16010D404j6180Q521N154R724q904M642N571j1026p175L992p017m936L320N980
15996c930m830q411l995J7860J1624n081j011k1285k4002J4897J4987p776m229
15983b5182k753Q806k673j530J6494j284k7292j9441n831N548O314j8406p228
15970g4458J5811K7323L8536m34q614q059R892R653o549k2960m609K710J5454
$$ plain form
16063 -18570 -14337 -5957 12437 11935 15218 17569 6530 -4750 -10326 -2808 -376 2837 2668 519
16049 519 -15334 -1115 4680 -254 -1298 -4077 -13104 -39107 -50902 -18682 5848 -380 5394
16036 5394 7524 30360 35112 33003 34660 36227 13898 1276 -15163 -17231 -25640 -16613 -4214
16023 -4214 -7397 -23358 -17040 -18632 -23199 -27853 -5147 -2357 -15210 -10339 12312 15206 4404
16010 4404 -11776 -3255 1899 11623 2719 7361 12932 1906 -5269 -1277 -8294 -13230 -9910 -3930
15996 -3930 -8760 -17171 -21166 -3306 8318 3237 2226 -19059 -43061 -28164 -13177 -20953 -25182
15983 -25182 -27935 -19129 -21802 -23332 -6838 -8122 -35414 -54855 -60686 -55138 -48824 -67230 -74458
15970 -74458 -58647 -31324 7212 6778 -1836 -9895 -3 9650 3101 -19859 -24468 -21758 -6304
15957f304q144q055M08j8998j2542J7375L3037Q758j5377n824R269j3953j6447
15944c6797K9120J850J1412N329n539j7692L979K1607J8276j0627k5951m278J553
15931g758J2548J6652j1828j1664n285K207m572o442k872j724o379p866J822J0409
15917b2752R294j0214J0889K5498Q098l1294k0826R888P275j4339r558Q738N387
15904b3916J5567Q949o444O867K62m360q0L97n278n804M134j1718l135M124K519
15889a7916J0484n598l143L44o096p31M229N501r851p613n541K2335J1056j6745
15875a9285R686m608R927Q744l657m273n850n602j0322K621J6631J0116j4586
15862a0458k4433O760P759K473q662r504r671k04N98n402J5215P546J4729R187
$$ plain form
15957 -6304 -14448 -22503 -22095 -41093 -53635 -36260 -3223 5535 -9842 -15666 -6397 -20350 -36797
15944 -36797 -7677 -5827 5585 10914 5375 -12317 -8338 13269 31545 20918 -5033 -9311 -7758
15931 -7758 4790 21442 9614 -2050 -7335 -5128 -9700 -16142 -19014 -20738 -27117 -34983 -33161 -22752
15917 -22752 -13458 -23672 -12783 12715 20813 -10481 -31307 -21419 -14144 -28483 -38041 -29303 -23916
15904 -23916 -8349 600 -5844 1023 1285 -3075 -3155 -2758 -8036 -13840 -9706 -21424 -24559 -20435 -17916
15889 -17916 -7432 -13030 -16173 -15829 -21925 -22656 -18427 -12926 -22777 -30390 -35931 -13596 -2540 -19285
15875 -19285 -9599 -14207 -4280 4464 807 -3466 -9316 -14918 -25240 -22619 -5988 4128 -10458
15862 -10458 -34891 -28131 -20372 -17899 -26561 -36065 -45736 -45940 -45342 -50744 -35529 -27983 -13254 -4067
15848d067J8307j093j4932q424Q565j6901L803N121j444l3930K211O850J0071
15835b5863M521O49L294R575P034o476R07m999p641m390j198P289J9398j531j8252
15820a7683Q47j2530o910k1150Q20J9559K0311J4193j0678n589q467o769q85J649
15806c3282J0072o87l957k035J767j1593J260K8484K2042n032k710K683j7384
15793a0372j0267j895J695p70O807J2330J391j7706K999K3583j8545k7592J2221
15780b6121J1031m302r438J079l319M956R518J342o452O163J5856q215j1031J0329
15766h604q998r924q603j170K9564M8148J672k2527j8791l313J306j6406O440
15753a1206p67p987J040o975r123o364J622J2764K0034P269j319J7503q894l673
$$ plain form
15848 -4067 14240 13147 -1785 -10209 -1644 -18545 -14742 -9621 -11065 -44995 -42784 -35934 -25863
15835 -25863 -21342 -20693 -17399 -7824 -790 -7266 -6359 -11358 -18999 -23389 -24587 -17298 2100 569 -17683
15820 -17683 -16836 -29366 -36276 -57426 -56606 -37047 -16736 -2543 -13221 -18810 -27277 -34046 -34931 -33282
15806 -33282 -23210 -23897 -27854 -29889 -28122 -39715 -38455 -9971 12071 7039 4329 7012 -10372
15793 -10372 -20639 -22534 -20839 -21609 -14802 -2472 -1081 -18787 -15788 7795 -10750 -38342 -26121
15780 -26121 -15090 -19392 -28830 -27751 -31070 -26114 -16596 -15254 -21706 -15543 313 -7902 -18933 -8604
15766 -8604 -17602 -27526 -36129 -37299 -7735 40413 42085 19558 767 -2546 -1240 -17646 -11206
15753 -11206 -11973 -19960 -18920 -25895 -35018 -41382 -39760 -26996 -6962 307 -1012 16491 7597 3924
15739C924Q194Q18j0707j9249j007R85n534m37K698M810J6064J9597Q914k2510
15725F560j481l236j8050M374L275k701j0053k0631l256J2809J5141m908p308
15712b9465K14k079J538J0285J3004n062m81j1888M325P059L764J1448r904R967
15698B725M690j0579j716q723P87M971k866L850j5534j2382R919J1520q760k070
15684b4168J4366r485J6110J1101J244l66P827L2342K0594o853j4044L054k7615
15671B4107k9517j9252J820M418L89j7302r216n032j4272K3515J4588Q209J4329
15658c216J580l04K392m60m231P257p713j0134P002J5542j4239j4915j2270J9020
15644a4689k76n649L594J2804O787J4622q679j5000p434m430O914R378j7565j4358
$$ plain form
15739 3924 12118 12936 2229 -17020 -18027 -17042 -22576 -23013 -20315 -15505 559 20156 29070 6560
15725 6560 5079 1843 -16207 -11833 -8558 -11259 -21312 -41943 -45199 -32390 -17249 -22157 -29465
15712 -29465 -29251 -31330 -29792 -19507 -6503 -11565 -12046 -23934 -19609 -12550 -8786 2662 -7242 2725
15698 2725 7415 -3164 -4880 -13603 -12816 -7845 -10711 -6861 -22395 -34777 -24858 -13338 -22098 -24168
15684 -24168 -9802 -19287 -3177 7924 9168 8802 16629 48971 69565 62712 48668 51722 24107
15671 24107 -5410 -24662 -22842 -18424 -18035 -35337 -44553 -49585 -63857 -40342 -25754 -17545 -3216
15658 -3216 -1636 -1940 452 -8 -4239 3018 -4695 -14829 -7827 7715 -6524 -21439 -33709 -14689
15644 -14689 -14965 -20614 -17020 -4216 2571 17193 8514 -6486 -13920 -18350 -11436 -2058 -19623 -33981
15630c3981j991r41M310L534J960q302Q100L914n322n245N706Q5p07J8j1946J9691
15614b1117K5624r337r503P141L455q021J5830N586n949J3304J67j1421o097j3945
15600a4283j1121L512o098p007P333m563j508J3521j249M363R786m208n591l906
15586b1019J8968K0817o078o611r44M550j6549q607J3134O671n955j2052M912
15573h763l152l394j0667k535L7529K4326O499j5013j8649p849m511r682J987
15560a3874k641o222J3231J5081L424j364j594J7727J6754j2011r401m758p608
15547F744k1821k3959j302Q082J797O769p015j0206L1439J2457r164j9655o177
15534c2011p35J259K2288o933Q848Q306k3381j1457O411O623J5852N489o904j13
$$ plain form
15630 -33981 -35972 -36913 -32603 -29069 -27109 -35411 -27311 -23397 -28719 -33964 -28258 -28173 -28880 -28862 -40808 -21117
15614 -21117 4507 -4830 -14333 -7192 -3737 -11758 4072 9658 3709 17013 17180 5759 -338 -14283
15600 -14283 -25404 -21892 -27990 -34997 -27664 -32227 -33735 -20214 -21463 -17100 -7314 -11522 -17113 -21019
15586 -21019 -2051 18766 12688 6077 5133 9683 -6866 -15473 -2339 4332 -1623 -13675 -8763
15573 -8763 -11915 -15309 -25976 -28511 9018 33344 39843 24830 6181 -1668 -6179 -15861 -13874
15560 -13874 -16515 -22737 -9506 5575 8999 7635 6041 23768 40522 28511 19110 14352 6744
15547 6744 -15077 -39036 -40338 -32256 -30459 -23690 -30705 -40911 -9472 2985 -6179 -25834 -32011
15534 -32011 -32746 -31487 -9199 -16132 -7284 1022 -22359 -33816 -27405 -20782 -4930 559 -6345 -6458
15520f458l151p716j970p64J3712K1730P40j1649J4780N272j2331r22r686J3347
15506A4934J5668m166J9286J6344j2235k8072l4943k4528j2799J5354J4760R948
15494a0449k172j6082n478q475o44J8995L468J695J700k213j809j5262j6427J4043
15480c9110J1815l135J0138O895N352J258j0548K295K58m677k054J0159J2672
15467A318l884j123m845l511n049O260n529j5437j0179J5769K2331J1453R874
15454A7448k875L976j8077j6224j396o27l890j0391J5037n115l569K112J3714
15441i877K838J197K970r709n697j4806J2171R509Q809l351J833J3877j98j3159
15427c593j2730o253j297J489J2839J1907K902m337r874m716k5652L499K1559
$$ plain form
15520 -6458 -9609 -17325 -19295 -20059 -6347 15383 16123 4474 19254 24526 12195 11273 1587 14934
15506 14934 30602 26436 45722 62066 49831 21759 -13184 -37712 -50511 -35157 -20397 -10449
15494 -10449 -12621 -28703 -34181 -42656 -43300 -24305 -20837 -19142 -17442 -19655 -21464 -36726 -53153 -39110
15480 -39110 -27295 -30430 -20292 -13397 -8045 -6787 -17335 -15040 -14782 -19459 -21513 -11354 1318
15467 1318 -2566 -3689 -8534 -12045 -17094 -10834 -16363 -31800 -41979 -26210 -3879 7574 17448
15454 17448 14573 18549 472 -15752 -17148 -17775 -21665 -32056 -17019 -22134 -25703 -23591 -9877
15441 -9877 -7039 -5842 -2872 -12581 -18278 -33084 -20913 -11404 -2595 -5946 -4113 9764 9566 -3593
15427 -3593 -16323 -22576 -23873 -22384 -9545 2362 5264 927 -8947 -13663 -39315 -35816 -14257
15414a4257R591k6972j7261k90q603J7559K0598M295Q865m160L661L78k0378J12
15400b6862M533J9945L265RN893j4123j4224J1288N982j975K024o22j1113N941
15386a0039K6649K8391q305k3191j238o217M084m001j0852M41J4995Q622q210
15373A1129j0936J686j4943j4883M096M76K482O989K3502N591N6M841j6546j3127
15359i587m101n090J1655o13J1723j0131k3747j7576K99J1796J7640J6167J6748
15346A5183q37k0489r119l096Q606J6690j8693k3294j8993J1357J5414j32m005
15333c1408M804k301J6549k0631l342J7471J540K0668J7806j7032q706J290k599
15320e891N213j0404j4733J424m903K4570K3499p759J0420L807j3674q39L883
$$ plain form
15414 -14257 -4666 -31638 -48899 -49189 -57792 -40233 -19635 -15340 -6475 -10635 -6974 -6596 -26974 -26862
15400 -26862 -22329 -2384 881 890 6783 -7340 -21564 -10276 -4294 -6269 -4245 -4867 -15980 -10039
15386 -10039 16610 45001 36696 13505 12267 6050 10134 6133 -4719 -4278 10717 19339 11129
15373 11129 193 1879 -13064 -27947 -23851 -23375 -20893 -13904 9598 15189 15245 20086 3540 -9587
15359 -9587 -13688 -18778 -7123 -7736 3987 -6144 -29891 -47467 -47168 -35372 -17732 -1565 15183
15346 15183 14346 -6143 -15262 -18358 -9752 6938 -11755 -35049 -54042 -42685 -27271 -27403 -31408
15333 -31408 -26604 -28905 -12356 -32987 -36329 -18858 -17318 3350 21156 4124 -4582 -3292 -5891
15320 -5891 -678 -11082 -25815 -24391 -29294 -4724 18775 11016 21436 25243 11569 10730 14613
15307A4613j5456L692k821j0987j9458R161P414Q46k0161M179K5724K6486L936
15294B7168k9890O812L3558m214k6267j1373Q15M531K708k7358K493K070o511
15281b5458K457J0389Q179J4341L0405q356j2001j8293j1793K020J3189k742k432
15268i5r002j4359j4732N772O538n5N931M306J0509j590R375K0105P584j3361
15254A6926l292K984j153j4622k3258j4102j1475J0835K1014p731R374J6294n704
15241c910p60Q504O783m338j2816J477j669P669o854J8620K663N7J6007J3101
15227D4534o161o251j3431N584M291O125j2490o608o974p526q594L803j0896j0566
15213b5160L997K564Q227J3446P467j035j0311j1067j836N736k377J2848m248
$$ plain form
15307 14613 -843 2849 28 -10959 -30417 -21256 -13842 -12996 -33157 -28978 -3254 23232 27168
15294 27168 -2722 4090 37648 33434 7167 -4206 -3391 1140 3848 -23510 -21017 -18947 -25458
15281 -25458 -23001 -12612 -4433 9908 40313 31957 19956 1663 -10130 -8110 5079 2337 -95
15268 -95 -9097 -23456 -38188 -32416 -25878 -25933 -20002 -15696 -5187 -6777 2598 22703 30287 16926
15254 16926 13634 16618 15465 843 -22415 -36517 -47992 -37157 -16143 -23874 -14500 1794 -3910
15241 -3910 -4670 3834 10617 6279 -6537 -5060 -6729 940 -5914 12706 15369 15426 31433 44534
15227 44534 38373 32122 18691 24275 28566 34691 22201 15593 8619 1093 -7501 -3698 -14594 -25160
15213 -25160 -21163 -18599 -10372 3074 10541 9506 -805 -11872 -13708 -7972 -10349 2499 -1749
15200a749l333R236r95j6210j2934p340J3211N416K2227J47j2901O340L496Q944
15186A3555N194m179j6540k274l235p803j3221R401J0003J509o885J469m56J3980
15172E18K5677k5668j3187j048l082P555j6078j989L439J8829J1010R912R461
15159B5349Q583j7450n494m019m892j4493j757R773m757K482o139k997J990M309
15145i512J0483n632p350j0124l942L295J9683P002j916Q635j0279j6698j023
15132a7378j2993J741Q362N872j296j0199j426K9569J1782j0774Q356J5909j1229
15119A6296j8910k2546q301Q769L176j0422J0978J5831r181r03m784j3105K973
15106c0129L702J4604j84o967J2691J1457p123K767m700P120J5003k523j1265
$$ plain form
15200 -1749 -5082 4154 3159 -13051 -25985 -33325 -20114 -14698 7529 7676 -5225 1115 4611 13555
15186 13555 18749 14570 -1970 -4244 -7479 -15282 -28503 -19102 -9099 -7590 -14475 -13006 -13462 518
15172 518 26195 527 -12660 -13708 -16790 -9235 -25313 -27302 -23863 -5034 5976 15888 25349
15159 25349 33932 16482 10988 6969 2077 -12416 -14173 -4400 -9157 -6675 -12814 -15811 -13821 -9512
15145 -9512 971 -4661 -12011 -22135 -26077 -22782 -3099 3903 1987 10622 343 -16355 -17378
15132 -17378 -30371 -28630 -20268 -14396 -15692 -25891 -27317 2252 14034 3260 11616 27525 16296
15119 16296 -2614 -25160 -33461 -24692 -21516 -31938 -20960 -5129 -14310 -15213 -19997 -33102 -30129
15106 -30129 -26427 -11823 -12007 -18974 -6283 5174 -1949 818 -3882 3238 18241 15718 4453
15093D453k3895K0600L352o385J5043J1530j5484k5333R368l454%K5761l807o636
15079E113M820l278o712l256m536k255q836N756J1856J4535r716j9655J7566o168
15065d766m76j1693j0297J0358p813j2073J887L385J0761J183L398R039j4797
15052b1904o878Q497Q438J4895j5645K148p850j7273N568J8465m30r227j2508
15039c3704K3747J6240J1486l394j8291j6142J5539J0873R702p015j4894q982
15027a4835O550k008p131j0732J559M503J4871R800J7923J5241o1O173j1799K849
15013C2903L28M943q995q530J4721J861J3074J0304L518j162L2675M9320N7764
15000B02724Q8350J31833K57463N00459R47102J455475J057543q10991j728127
$$ plain form
15093 4453 -19442 1158 4510 -1875 13168 24698 9214 -16119 -6751 -10205 -10205 15556 11749 5113
15079 5113 9933 6655 -57 -3313 -7849 -10104 -18940 -13184 -1328 13207 3491 -16164 1402 -4766
15065 -4766 -5242 -16935 -27232 -16874 -24687 -36760 -34873 -31488 -20727 -19544 -16146 -7107 -21904
15052 -21904 -28782 -20285 -11847 3048 -12597 -10449 -18299 -35572 -30004 -11539 -11969 -21196 -33704
15039 -33704 -9957 6283 17769 14375 -3916 -20058 -4519 6354 16056 9041 -5853 -14835
15027 -14835 -8285 -10293 -17424 -28156 -26597 -22094 -7223 2577 20500 35741 35680 41853 30054 32903
15013 32903 33231 38174 29179 20649 35370 37231 50305 60609 64127 62965 95640 144960 202724
15000 202724 291074 422907 680370 1180829 2127931 3583406 4640949 3829958 2101831
14991B101831r98893m56932k40347j50879o8154k5549k4954k9680l0649j7698
14981E8096r628Q783O567j8514k2075l0946O23R337o790n981j1893l127J112M549
14967a9887M704J486K452R486p551K726J204O04j3484J163j8541J1386L6208J1097
14953B3053j4952J0105j634j2627K073J2855O192j8603j2393O379l110j0140j4293
14940b7095j6675J5484J0607K373J34R729q354j4171K651J9061K171J464K658
14927C7Q901P318j5635k0993P494O26l672n205J3470j2685j5756J5643K1679K02
14913A424l0282r564K988P121l984L304Q098O735O395q538r11K570M025J0736
14899A17P559n564k404L129M777L403j4568M670L123k190J958j1613l515M885
$$ plain form
14991 2101831 1102938 646006 405659 254780 186626 161077 136123 106443 75794 58096
14981 58096 48468 57251 63818 45304 23229 -7717 -7094 2243 -4547 -10528 -22421 -25548 -24436 -19887
14967 -19887 -15183 -13697 -11245 -1759 -9310 -6584 -5380 -4776 -18260 -17097 -35638 -24252 11956 23053
14953 23053 8101 18206 16572 3945 6018 18873 25065 6462 -5931 448 -2662 -12802 -27095
14940 -27095 -43770 -28286 -17679 -15306 -15172 -5443 -13797 -27968 -25317 -6256 -4085 -2621 37
14927 37 8938 16256 621 -20372 -12878 -12252 -15924 -21129 -7659 -20344 -36100 -20457 1222 1424
14913 1424 -28858 -38422 -35434 -28313 -32297 -28993 -20895 -14160 -7765 -16303 -17214 -14644 -10619 117
14899 117 7676 2112 -292 2837 7614 11017 -3551 1119 4242 2052 4010 -7603 -11118 -6233
14885f233J726m655j001J6258O32J361RL717j6851J0204j504n854p588p43r636
14870b0158m645j8380N253j4316l12J8573J7769K4530M954r941o942m131Q396
14857F50k834k0289l654J3621K8738j026j7888j814m414N082J2616j7841j53O457
14843b749P222J2059K148L717r185j2262j4351J2052N815n338l798O235j6699
14830a5134j4944l547j088M822K937n2k042O545p812O346k972j0120j2844J8311
14816c1594K450j0581L440J0049N69K468k257L85M512R592K7428m667K50R614
14802B1658L03k3398p956J2971J0928n335k5943q417L877R236m777l233J5221
14789d865Q545R963j005k358J969m968J3405K623j5899j3680M178j537L055j1750
$$ plain form
14885 -6233 -4507 -9162 -10163 6095 6727 8088 8097 11814 -5037 5167 3663 -2191 -9779 -10522 -20158
14870 -20158 -24803 -43183 -37930 -52246 -52558 -33985 -16216 8314 13268 3327 -3615 -7746 650
14857 650 -2184 -22473 -26127 -12506 16232 15206 -2682 -4496 -8910 -3828 8788 -9053 -9206 -2749
14843 -2749 4473 16532 18680 22397 13212 950 -13401 -1349 4466 -872 -4670 1565 -15134
14830 -15134 -30078 -33625 -34713 -29891 -26954 -27006 -29048 -22503 -30315 -23969 -26941 -37061 -49905 -31594
14816 -31594 -29144 -39725 -36285 -26236 -25667 -23199 -25456 -25071 -20559 -10967 16461 11794 12044 21658
14802 21658 21961 -1437 -9393 3578 14506 9171 -16772 -25189 -21312 -12076 -16853 -20086 -4865
14789 -4865 3680 13643 12638 10280 12249 7281 20686 23309 7410 -6270 -2092 -3629 -574 -12324
14775a2324p018l486J3383K5479o858j9499O144K0847J8484O792j4412N521j2175
14762B0878j3795J6535K8916K63j2456j9637j5485L998j625o763r691j5841K0031
14749d672J7088J253q445M408q74J709Q290p551L995R558j958q313M588j0473
14735H603m949k25M341q27M76m695r14Q269o176j6251O87L819j545m494m477J0142
14719h216J982j7085R154J2003m785o69K451N404J8280K558j2271K426l796l2566
14705b5130k0083R776J0042J9358J722O770n863j8513m272P401K0856K27l554
14692a263k676K571K328j502j3917k0929J4030O114P5Q166J7277K1338p410j743
14678B2459O082j0916l678k588j4504j4749j6047J0119J4906Q643P878j937n357
$$ plain form
14775 -12324 -19342 -22828 -9445 16034 9176 -10323 -4179 16668 35152 41944 27532 33053 20878
14762 20878 7083 23618 52534 52797 40341 20704 5219 9217 7592 829 -8862 -24703 -4672
14749 -4672 12416 13669 5224 9632 8758 10467 18757 11206 15201 24759 22801 14488 19076 8603
14735 8603 3654 3429 7770 6943 7419 2724 1810 10079 3903 -12348 -11661 -7842 -9387 -13881 -18358 -8216
14719 -8216 -6234 -23319 -14165 -2162 -6947 -7616 -5165 239 18519 21077 8806 11232 7436 -25130
14705 -25130 -45213 -35437 -25395 -6037 -4315 2455 -3408 -21921 -26193 -18792 2064 2291 -1263
14692 -1263 -3939 -1368 960 -542 -14459 -35388 -21358 -15244 -15169 -7003 10274 31612 24202 22459
14678 22459 28541 17625 13947 11359 -3145 -17894 -33941 -23822 -8916 -273 7605 5668 311
14665C11R7m474l640j3620K281Q075m0M949O500K0680R633n967K47j5391k3231
14650a3590m50J9335r862K217K871J4124J9739R540r914j3276O661K139m794o916
14636A7824j7652j1404L642M784K1424j0547j7048J4876r715r395J3857j182J6271
14623A5735j0391J77o893K774Q07M665J7139O504o944j5864k471K574J2848k108
14609A8552j3794j1802R780P112l63j3011r643J0769K0137N552j0087P238J152
14596B1592j7125j671K2275K2503j801k594m773k627k673R15R692j2262n18n220
14582B5713j0005k2379j4513J0176O511P205j112q167J2573N008j1911k446J0947
14569G600P737K478J1481J847k0638j6044n17J9812K1474O910L85j6738n676P187
$$ plain form
14665 311 408 -4066 -7706 -21326 -19045 -10970 -11010 -6061 439 21119 30752 24785 25032 9641 -13590
14650 -13590 -14040 5295 -4567 -2350 521 14645 34384 43924 34010 20734 27395 29534 24740 17824
14636 17824 172 -11232 -7590 -2806 18618 8071 -8977 5899 -3816 -13211 646 -536 15735
14623 15735 5344 5521 -1372 1402 2209 6874 24013 30517 23573 7709 5238 7812 20660 18552
14609 18552 4758 -7044 2736 9848 9485 -3526 -13169 -2400 17737 23289 13202 20440 21592
14596 21592 4467 2796 25071 47574 45773 43179 38406 35779 33106 34021 43713 31451 30933 25713
14582 25713 15708 -6671 -21184 -11008 -4497 2708 1596 -6571 6002 11010 -901 -3347 7600
14569 7600 15337 17815 29296 31143 10505 -5539 -6056 13756 35230 42140 42525 25787 20111 27298
14555B7298j1764l0806k4119K7688L6654J5766j3093n562j3169n02j2144j7824
14543b1577o818K63J7706J84j7615J1893J0304N14k936Q515N733M320J783K507
14529A4776L964n288j667O353k752k141M617l582Q629Q474P908k6333k1355j0054
14515a8451N645K0362K1337j2466n414o060q550q837k699J3662n55Q07O36p229
14501g812m94K0618p836j8767J2395Q472k2324j9436K4823J0979J9776J5555J74
14488C6123n443J1384j6524k8494o718q431j3959O353J2216N079L042K0035r509
14475E154j0979Q932J1877j2887k414l620j8331P385P967n132n455M215J9285
14462E997j2559o290K400L578Q046J943L065J3735J2216l842q27r406k959r101
$$ plain form
14555 27298 15534 -15272 -39391 -11703 24951 40717 27624 22062 8893 8391 -3753 -21577
14543 -21577 -28395 -28132 -10426 -10242 -27857 -15964 -5660 -5146 -8082 433 6166 10486 12269 14776
14529 14776 18740 13452 11785 18138 15386 13245 17862 14280 22909 31383 39291 12958 -8397 -18451
14515 -18451 -12806 7556 28893 16427 11013 4953 -3597 -12434 -15133 -1471 -2026 -1219 -583 -7812
14501 -7812 -8306 12312 4476 -14291 -1896 6576 -15748 -35184 -10361 618 20394 35949 36123
14488 36123 30680 42064 25540 -2954 -9672 -18103 -32062 -25709 -13493 -8414 -5372 14663 5154
14475 5154 -5825 3107 14984 2097 -317 -3937 -22268 -14883 -6916 -12048 -17503 -13288 5997
14462 5997 -6562 -12852 -10452 -6874 1172 3115 6180 19915 32131 28289 27462 18056 15097 5996
14448E996j2315P390J5325p880k8957R389N51j2023o08J4236j0925N07J3592J9131
14434A3409M421j1355q444J9661K4049l139j2176J0543j0631j2626j0949J0824
14422A3587j0495M151K172Q22j9505l489L977J3305J3681K968J418R704o872k1008
14408D416k1548l517J6071J3001M030q264k0111l025P616O37J141R779L854K513
14394F593o952l143p138K382K985K1030Q02J63j0998R928k217j6223j0075N407
14380g456J0438m575j4420J155N265o634n850p48J032J9277K003k070m224j3935
14366b0742J575j047k033K6090J4515j6585M257J9288L2872k2768o710p220k0531
14353I61K894o291p682P316M024J0373R700j1782p836J1434L227l357J2165j7486
$$ plain form
14448 5996 -6319 1071 16396 8516 -20441 -11052 -10501 -22524 -23132 -8896 -19821 -19314 -5722 13409
14434 13409 17830 6475 -1969 17692 41741 38602 26426 36969 26338 13712 2763 13587
14422 13587 3092 7243 9415 10237 -9268 -12757 -8780 4525 18206 21174 22592 32296 25424 4416
14408 4416 -17132 -20649 -4578 8423 12453 4189 -15922 -18947 -11331 -10694 -9553 226 4080 6593
14394 6593 -359 -3502 -10640 -8258 -5273 15757 16559 16722 5724 15652 13435 -2788 -12863 -7456
14380 -7456 2982 -1593 -16013 -14858 -9593 -16227 -22077 -22825 -21793 -2516 -513 -2583 -6807 -20742
14366 -20742 -19167 -20214 -22247 3843 18358 1773 6030 25318 58190 35422 28712 21492 961
14353 961 3855 -2436 -10118 -2802 1222 11595 21295 9513 1677 13111 16338 12981 25146 7660
14339G660j7650M229J5689L279j0168j135j634J211K3438j2621j6508M006J5333
14326A5129p231j2192J7216K65L281M467P28j2142K663r871K607L056J920j1585
14312a689p368L01m149O628N492R109j1317l900O712m962k583k084R001Q508N993
14297A3692N531J1638J2205J0466p344j1392M135P47k2415j4656l301J964R142
14284A0412J0336J839K6627p771j5731j6092j7383J1724J0201L668o65Q37k8255
14271a0253j4768K1276M909n615P281j873j383M452k638Q619J5742Q422K794l348
14257C3617k0242o720R806k0885J1555L411M243K4205j0801j5496O535m060L664
14244A8832k0769j6492o564J6740K0569J1503J6253j574L716j017j0578k3114
$$ plain form
14339 7660 -9990 -5761 9928 13207 3039 1904 270 1481 24919 12298 -4210 -204 15129
14326 15129 7898 -4294 12922 13187 16468 20935 21663 9521 12184 2313 4920 7976 9896 -1689
14312 -1689 -9057 -8756 -12905 -6277 -785 8324 -2993 -6893 -181 -5143 -7726 -9810 -809 7699 13692
14297 13692 19223 30861 43066 53532 46188 34796 38931 39678 17263 2607 -694 1270 10412
14284 10412 20748 22587 49214 41443 25712 9620 -7763 3961 14162 17830 17165 18002 -10253
14271 -10253 -25021 -3745 1164 -4451 2830 957 -426 4026 1388 10007 25749 34171 36965 33617
14257 33617 13375 6655 16461 -4424 7131 10542 14785 38990 28189 12693 19228 15168 18832
14244 18832 -1937 -18429 -24993 -8253 12316 23819 40072 38498 42214 41197 30619 7505
14232G505r511J1641J0110M574q551J8547N334K003j910L090K541K005J3331P015
14218F7724P69K0198J553O566J9472l611q121J1180K5880J9096J8015K7653L2268
14205B38642M2913N7956P4216O8757J10066J05914J09465P9048J9593k6658n3767
14194H26145q3042r5472j11230j26477p8373n6599n7003l6807k1948k197m653
14183A52344k2248k6187J640J749r5k564p493L156O309p524R15N083L150K02j1722
14168I6715j6158q602P717K345j9808q654j2205n64m865j3141j733J1900J1740
14155D4687n817k9174p021J0298j5723k455Q328R497p32r803j805P160J9974N334
14141C2748J527k1894j0142p675J3798J4433Q252m345r935M606N676J227j6916
$$ plain form
14232 7505 -2006 9635 19745 24319 15768 34315 39649 41652 39742 42832 45373 47378 60709 67724
14218 67724 68493 88691 90244 96810 116282 112671 104550 115730 141610 160706 178721 206374 238642
14205 238642 281555 339511 413727 482484 592550 698464 807929 886977 906570 879912 826145
14194 826145 743103 647631 536401 409924 331551 274952 217949 181142 159194 156997 152344
14183 152344 130096 103909 105549 107298 107203 104639 97146 100302 106611 99087 100002 105085 108235 108437 96715
14168 96715 80557 71955 79672 82017 62209 53555 41350 40786 35921 22780 21047 32947 44687
14155 44687 38870 9696 2675 12973 -2750 -5205 3123 12620 11888 2085 280 7440 27414 32748
14141 32748 34275 12381 2239 -5436 8362 22795 31047 26702 16767 21373 27049 28276 11360
14128A1360j4420J5945L8228J3413k9179k4253R491R905R048N131J0241L878J5628
14115G4416Q036p201j935k1592l5317j1154J2494J8957O228M031p917k6876q71
14102A1299J1473J5662k27q53P392J9178J8554q357J4795J275j5574R770J1530
14089I5917J7520J7467p395J49M013Q815L106j9832n678n681j5031k3882j0628
14076E8860j0652J3998j0902M194q814j9089r000J2002Q037J29J9926L787j7255
14063D5221q218J1329J5690R847l683n585J4181J4727j2317j6q621j7063L689
14050E9181K1500P476m992M996R271J9082J7294K9534L1803M8376L4188L9814
14038C17523N6101P0463N6970J2848j5007k1795l6741m3906o5505n7486n8525
$$ plain form
14128 11360 -3060 12885 51113 64526 35347 11094 20585 30490 39538 44669 54910 58788 74416
14115 74416 82452 75251 73316 51724 16407 5253 17747 36704 42932 46963 39046 12170 11299
14102 11299 22772 38434 38207 37354 44746 63924 82478 74121 88916 90191 74617 84387 95917
14089 95917 113437 130904 123509 123658 127671 136486 139592 119760 114082 108401 93370 69488 58860
14076 58860 48208 62206 51304 55498 46684 27595 18595 30597 38634 38763 58689 62476 45221
14063 45221 37003 48332 64022 73869 70186 64601 78782 93509 81192 81176 72555 55492 59181
14050 59181 80681 88157 83165 88161 97432 116514 133808 163342 195145 243521 277709 317523
14038 317523 373624 444087 501057 513905 498898 477103 440362 396456 330951 273465 214940
14027B14940l7887k1217k7160m340K378j2506k2787j1349j8120n529o552l457
14015D6414l463K5543J8335O271J410j5292j193L5080K5303J3396J1212L657j431
14002A65242J4843K4752q859j7717j3499j8449l24r847j7488k5695j9399P38M327
13989G8625J0862K8270L028k6616k368M081j0423j2218j9208n098N606j2139j0615
13976C1787J0693J6979Ql0715j7900J388K3454J2164R476k2126j0123k012o685
13963A6388J5941o814J54o049k2480K689o019P390J4989N496P13J7207K80j837
13949C8048L123j5453k847k3988M103L1086K2567l184J6792K8597K8540L0035
13937A57419L8256K0321J21L651k0371M020J9128J4292j2414k4288q796j1497
$$ plain form
14027 214940 177053 155836 128676 124336 126714 114208 91421 80072 61952 56423 49871 46414
14015 46414 42951 68494 86829 93100 94510 79218 78025 113105 138408 151804 163016 166673 165242
14002 165242 180085 204837 195978 178261 164762 146313 145989 136142 118654 92959 73560 74298 78625
13989 78625 89487 117757 120785 94169 91801 95882 85459 73241 54033 48935 54541 42402 31787
13976 31787 42480 59459 59467 28752 10852 12240 35694 47858 57334 35208 25085 23073 16388
13963 16388 32329 25515 25669 19620 -2860 -171 -6190 1200 16189 21685 22398 39605 39885 38048
13949 38048 41171 25718 22871 -1117 2986 34072 56639 53455 70247 98844 127384 157419
13937 157419 195675 215996 216117 219768 199397 203417 222545 236837 224423 200135 191339 179842
13925A79842n386m772j6726j1652n663J7301M1836p859j3716K786j9200j5434
13913A41357k3040j5736p347P338J5473j5522j9792m267P760o92Q584P578j0413
13900I1281p410J9839J9593M15r53N612M081k623l1245j5756J5619M449J5438
13887A18340J6464L1108J1889L783K57O501N188J0408M2948K9808O152M7833L3751
13874C64430M86J1456J3051p049q885k6041l6605k4997j3328k2461l5222k3114
13862A91721P077Q745l448j2076J0689J9529N061j5187j5006Q025J5555J2769
13850B33454k691N368K7680O718M592k01m480R608K4118q100J0488K2749o023
13837C23280n86J0725L935N033J4930J0153K266J1538r649L696r10r467J3331
$$ plain form
13925 179842 174456 169684 152958 141306 135643 152944 194780 186921 173205 175991 156791 141357
13913 141357 118317 102581 95234 102572 118045 102523 82731 78464 86224 85532 94116 101694 91281
13900 91281 83871 103710 123303 123718 122765 128377 132458 129835 98590 82834 98453 102902 118340
13887 118340 134804 165912 177801 181584 181841 188342 193530 203938 246886 276694 282846 330679 364430
13874 364430 364916 376372 389423 382374 373489 347448 310843 285846 272518 250057 214835 191721
13862 191721 198798 207543 204095 192019 202708 222237 227298 212111 197105 205130 220685 233454
13850 233454 230763 236131 263811 270529 275121 274920 270440 280048 304166 296066 306554 329303 323280
13837 323280 322694 333419 337354 342387 357317 367470 369736 381274 371625 375321 374411 364944 378275
13824C78275L5146J5607j3323o020L3653L0830J5044J5561J0082J1908J6737K1204
13812E64704K2732N146J4086K6344R096K1879L2008K3864R556L9352L8166L5185
13800H42118K8932M4560L1011J7125K5451L3981O0614N2874N5032N2266M4287
13789A288251N1818P5298Q0741R1389J03343J02823J26968J42081J37204J67379
13779B367295J88106K28518K24559K36861K78203L14509L49750L96784M63475
13770E048060N39849O28886P52699Q66739J031607J240124J436260J679610J938920
13761A5162754K320532K862460L626098M774899O478228Q833579J1898130J5395128
13753G1351808J8546119K0335129J9937954J6985825J1664184M642689l112697
$$ plain form
13824 378275 413421 429028 415705 409685 443338 474168 489212 504773 514855 526763 543500 564704
13812 564704 587436 592582 606668 633012 642108 663987 695995 719859 729415 768767 806933 842118
13800 842118 871050 915610 946621 963746 989197 1023178 1083792 1136666 1191698 1243964 1288251
13789 1288251 1340069 1415367 1496108 1587497 1690840 1793663 1920631 2062712 2199916 2367295
13779 2367295 2555401 2783919 3008478 3245339 3523542 3838051 4187801 4584585 5048060
13770 5048060 5587909 6216795 6969494 7836233 8867840 10107964 11544224 13223834 15162754
13761 15162754 17483286 20345746 23971844 28746743 35224971 44058550 55956680 71351808
13753 71351808 89897927 110233056 130171010 147156835 158821019 163463708 160351011
13746A60351011j0380527j6149135j9601191k0420203j8932272j5963721j2460151
13739D6443811r226755o717009m952193l753817k946454k422730k051976j788713
13731A2584164j585345j389597j190766j018595q41692o85803n58921n06499m31358
13722D375588l58626l15824k83331k21121j93614j75172j56478j59248j54636
13713B357538j33459j28190j12027j21422j10565q2024o3564p5950o4333m8472
13703A417532p4901n1610m3984p0888o8281m7020k9510l0612m8939l7060l3425
13692H81302m2784m5081j7875l2275m8158j9245k2249j9011k1276l4381k7020
13681E51947j5537M788P889j1851o759j6591j7850k138j3686j6539n0206k8671
$$ plain form
13746 160351011 149970484 133821349 114220158 93799955 74867683 58903962 46443811
13739 46443811 37217056 30500047 25547854 21794037 18847583 16424853 14372877 12584164
13731 12584164 10998819 9609222 8418456 7399861 6558169 5872366 5313445 4806946 4375588
13722 4375588 4016962 3701138 3417807 3196686 3003072 2827900 2671422 2512174 2357538
13713 2357538 2224079 2095889 1983862 1862440 1751875 1669851 1606287 1530337 1466004 1417532
13703 1417532 1342631 1291021 1247037 1176149 1107868 1060848 1031338 1000726 951787 914727 881302
13692 881302 838518 793437 775562 743287 695129 675884 653635 634624 613348 578967 551947
13681 551947 536410 541198 549087 537236 530477 513886 496036 493898 480212 463673 413467 384796
13669C84796K36q372j1173j0653k388Q099m504j9998q62m542l1462j7888j4202
13656B67087N30L67Q631n68J9059R13l766J537q579r536j0024j1172j7024o655
13642B30800o789k0379Q75j4453k2600K990J3039O986m118j1748J1667J0146j8861
13629A77555l2548k6353J2175j1518q343J0354J1643K747J5190O345Q01j0972
13617A47076l859J5750J7675k176J355j1671k727j4365j108j0424O408M415p789
13604A38560j1333j590J2417j6917m739q934J541Q163J1620j9180l0817L313K530
13591H4634j5758P753J0174o227o911Q974M475j7037l841j5732r07n05J8060J4745
13577H1897j8523j3785j2182Q381j2739j763K7317K4684l275l043R47l465k626
$$ plain form
13669 384796 385032 376660 365487 354834 352446 360545 356041 336043 335181 330639 299177 281289 267087
13656 267087 267617 267984 276615 276047 295106 296019 292253 293790 285211 275675 265651 254479 237455 230800
13642 230800 224011 203632 204507 190054 167454 170444 183483 190469 186351 174603 186270 196416 177555
13629 177555 145007 118654 130829 119311 110968 121322 132965 135712 150902 157247 158048 147076
13617 147076 143217 158967 176642 174466 175821 164150 161423 147058 145950 135526 141934 146349 138560
13604 138560 127227 125637 138054 121137 116398 107464 109005 117168 128788 109608 78791 82104 84634
13591 84634 68876 76629 86803 80576 73665 82639 87114 70077 66236 50504 49597 49092 67152 81897
13577 81897 63374 49589 37407 45788 33049 31286 58603 83287 80012 76969 77916 74451 71825
13564G1825j182j540J8098J5732J9093Q467O752J6330Q020j0603Q489K7828l686
13551A83623p44j2131l0018L854N912k9692j1223l539K288j1223J1378J5248J0590
13538A34323P42l3415j1309J0210N103J0663O998J6478J2703J0598P043K9017
13526A99154M8613N8061L2617N553p259l3750o0673n4436n0748l7569k0388J3737
13514I2912N313N653M708p050P163J5765L8835L3162L6367M5622K8605m974j7132
13501B84949m5210l7935j4619k3518l8530j7359j6324N928J623j6249j0677J499
13489G3578J1551O641j254p518j605j2326j1341J847q307k6768J2027R988J0321
13476E6834m182l162o586L205j5558J389j0749k023K5453Q657j837J7005P786
$$ plain form
13564 71825 70643 69103 87201 102933 122026 130493 137245 153575 161595 150992 159481 187309 183623
13551 183623 182879 170748 140730 144584 150496 120804 109581 106042 108330 97107 108485 123733 134323
13538 134323 135065 101650 90341 100551 105654 116317 123315 139793 152496 163094 170137 199154
13526 199154 247767 305828 338445 343998 336739 302989 242316 187880 137132 99563 79175 92912
13514 92912 98225 103878 108586 101536 108699 124464 163299 196461 232828 278450 307055 302081 284949
13501 284949 239739 201804 187185 163667 125137 107778 91454 97382 99005 82756 72079 73578
13489 73578 85129 91770 90516 82998 81393 69067 57726 59573 51266 24498 36525 46513 56834
13476 56834 52652 49490 42904 46109 30551 31940 21191 19168 44621 53278 51441 68446 76232
13463G6232L745j0955j0855j2049j3954l251O749Q337j3682n050j377P260j499
13450B9651R580j5409j796n517J89o505Q807J894l568J0244k793r685K42J0368
13436B5702J1790l676o014n563O846J8616O404k4341k4351L332L181l705Q907
13423A7128K4454r58k8780j3890m917P259J8427N95K4641J0760k038K958j0983
13410D4656k0349m481j3710j5990q574M360J4534J5793J0914l0525J8133J3803
13398B8564O681j6507j4913j6682N756K6917k167k9615L879R383j063R870J9402
13385B9505j1921j7827R921J9286R171j2080q239j088l221K3992o555k195M647
13372C3396R39l540L796l898n069M01j146j6135k2362j186L864J0289M991p553
$$ plain form
13463 76232 79977 69022 58167 46118 32164 28913 35662 43999 30317 25267 23890 31150 29651
13450 29651 39231 23822 22026 16509 16698 10193 19000 20894 17326 27570 24777 15092 15334 25702
13436 25702 37492 33816 27802 22239 29085 47701 54105 29764 5413 8745 11926 8221 17128
13423 17128 41582 40624 11844 -2046 -6963 296 18723 19318 43959 54719 52681 55639 44656
13410 44656 24307 19826 6116 -9874 -18448 -14088 446 16239 27153 -3372 14761 28564
13398 28564 35245 18738 3825 -12857 -7101 19816 17649 -11966 -8087 1296 233 10103 29505
13385 29505 17584 -243 9678 28964 38135 26055 17816 16728 13507 37499 30944 28749 33396
13372 33396 34335 30795 34591 30693 25624 26025 24879 8744 -13618 -14804 -10940 -651 4340 -3213
13358c213Q253J2644q038R186J87k7584j2140J1485L665Q001K152j8893m39L579
13344a1155J035r954n504l81J9957K0856n134J3631l353q486j5169q090J057R372
13330a318J4920L8495L2768N937m398P220j3779q745j0480K4r278j2420p531j7555
13316A3860L106L2206J6083j4196q042j1869Q339K8068M716Q046K6912Q615k337
13303A13507K0271L3272N2340O5069O9398R1486O8790R1786J10322Q2855M6551
13292H45647J7979l8867p2616j03881r8242q4737r1154r6709o9078l8892m2584
13281A26866k4536j5809j5729j4606K713M349J5609j405j8567j6862k2200j3494
13269F329j0567O991J3775J2581k3588n046K359o17m665P114J2578j3586L090
$$ plain form
13358 -3213 5040 17684 9646 18832 19019 -8565 -20705 -9220 -5555 2446 4598 -14295 -14734 -11155
13344 -11155 -10120 -20074 -25578 -25959 -6002 14854 9720 23351 19998 11512 -3657 -11747 -10690 -1318
13330 -1318 13602 52097 84865 90802 86404 93624 79845 71100 60620 60644 51366 38946 31415 13860
13316 13860 16966 49172 65255 51059 43017 31148 39487 67555 72271 80317 107229 115844 113507
13303 113507 133778 167050 219390 284459 353857 445343 514133 605919 716241 799096 845647
13292 845647 863626 824759 752143 648262 550020 465283 374129 277420 208342 169450 126866
13281 126866 102330 86521 70792 56186 58899 63248 78857 77452 58885 42023 19823 6329
13269 6329 -4238 2753 16528 29109 5521 475 2834 2217 -2448 4666 17244 3658 6748
13256F748Q17N257J2569j4646j6951L422J5164O261L210j2233k0004r18n873J6496
13242f81q785j2346k349n666L1465L3651p302j3875j6519O821k127j7408r060
13229b4181j017L611n987K717J6955N154J5961k395J115P664R559o078K2763K1053
13215F6894j3656j7725j7195l171m281L375p46R793R871J4613n84k5889n017q70
13201A5412j768J6912K2064L073k2874j4734j6458K227J1067J2326L922q151j0398
13188A2620j1133K914J5013J1658J7672L079k1798q250M578j1765j3940N854Q599
13175A5101J0364j3551Q168o313j5399n350l390N171N390K2551K562j1824L99
13162A3879j708M169P16P858M600Q235j2807k557k4658j5454J8213L4654J4353
$$ plain form
13256 6748 7565 12822 25391 10745 -6206 -2784 12380 18641 21851 9618 -10386 -11304 -17177 -681
13242 -681 -9466 -21812 -24161 -29827 1638 35289 27987 14112 -2407 4414 2287 -15121 -24181
13229 -24181 -25198 -21587 -27574 -24857 -7902 -2748 13213 10818 11933 19597 29156 23078 45841 66894
13215 66894 53238 35513 18318 15147 10866 14241 13495 23288 33159 47772 47188 21299 16282 15412
13201 15412 13644 30556 52620 55693 32819 18085 1627 3854 14921 27247 31169 23018 12620
13188 12620 1487 4401 19414 31072 48744 51823 30025 21775 26353 14588 648 6502 15101
13175 15101 25465 11914 20082 13769 -1630 -6980 -10370 -5199 191 22742 25304 13480 13879
13162 13879 12171 16340 17056 24914 29514 37749 24942 22385 -2273 -17727 486 35140 49493
13149D9493m32l930j5217O599p45K4325K3957m083j2694n176l216k0812k2093
13136A5976k1178k4028j1141R693N541M534N467J5490Q939J315N388r561M623
13123A1058l111j5824L458K7170m754m532k844J1735R454k9263Q176K4840j228
13110C4335j6597j2863j2335l303j7580k003L3411J9211O187l544j446j0210J5674
13097B8937J478J0490L40r814j0707K202J4223j3243j4671l739P601O046l093
13084A6050J0518K2890l79o892o180K727j0477O876j0337n932o857j622J5580
13071B5965j5396j1431k0143K696K6385k890o719J2129J2667j7442j0728k4510
13059b9417k2983J0304J6534K2374K8506n337K012J1538J4597R615o417P77n327
$$ plain form
13149 49493 49061 45131 29914 36513 35768 60093 84050 79967 67273 62097 58881 38069 15976
13136 15976 -5202 -29230 -40371 -30678 -25137 -20603 -15136 354 9293 10608 15996 6435 11058
13123 11058 7947 -7877 -4419 22751 17997 13465 10621 22356 31810 2547 10723 35563 34335
13110 34335 17738 4875 -7460 -10763 -28343 -30346 3065 22276 28463 24919 23473 13263 28937
13097 28937 30415 40905 41245 31431 20724 22926 37149 23906 9235 5496 13097 19143 16050
13084 16050 26568 49458 49079 42187 36007 38734 28257 35133 24796 18864 12007 10385 25965
13071 25965 10569 -862 -21005 -18309 8076 5186 -1533 10596 23263 5821 -4907 -29417
13059 -29417 -52400 -42096 -25562 -3188 25318 19981 21993 33531 48128 57743 51326 52103 46776
13046D6776k387J0534n796M761L525K1247N399j7619J1799L2225N015j2443j7023
13033H6013m6475o971J3674J096k4882k1422Q667N797P167j5646q914k414P218
13020B908J6971R14j4j5392r026p513q830J7163k004m776l899k415l388J1861
13006g440J7183R849P831J2227j4641j8316k307m959q32K09n652J4325J5631K162
12992B5270R573J2095k1382K377m615J2224j008j7861o575M899Q630m384k149
12979A7094J1301K9784j9214k3618J1370K141N647m24k5331j9350J6822O398K0159
12966C2779m17k4417k0042K2404K3131q481N080o591m772p447M305K9823Q240
12953E3595j2800N091K078R061J0660P560m763j700j2600r255L308J698J3241
$$ plain form
13046 46776 44389 54923 49127 53888 57413 78660 84059 66440 78239 110464 115479 103036 86013
13033 86013 39538 32567 46241 47337 22455 1033 9700 15497 22664 7018 -1896 -4310 2908
13020 2908 19879 20793 20779 5387 -3639 -11152 -19982 -2819 -4823 -9599 -13498 -15913 -19301 -7440
13006 -7440 9743 19592 27423 39650 25009 6693 4386 -573 -1405 -1196 -6848 7477 23108 25270
12992 25270 34843 46938 25556 27933 23318 35542 34534 16673 10098 14997 23627 19243 17094
12979 17094 28395 58179 38965 15347 26717 28858 34505 34081 8750 -10600 6222 12620 32779
12966 32779 32362 7945 -12097 10307 33438 24957 30037 23446 18674 11227 15532 45355 53595
12953 53595 40795 45886 47964 57025 67685 75245 70482 68782 56182 46927 50235 51933 65174
12940F5174j920N933j787N057L3613M2557N0174P6161J01469J18103J66066J95420
12928H56020K12703K34391J63832K7140j7922m356q9027k18230k36392k03457
12918G24702j98732j54706j05536o3294m9637j4287k6414k3660m320L074p702
12907G9488j8224k2395o01K1779K804q687l863j2422O173J9110P929j9082k9196
12894B2813j0925J5553J5860K1474J5810j1452P055J6253J7787K2115O4991Q9405
12882B86739J01122J31018J23865J10793P7471M8460J5171m8841r6583j01985
12872F47230j18213j15955r2386p5348p6895l9112r710n0907j4409j1119k680
12861D0496J5870J0990j3585k8163J2768J57P031Q376J7629k0751j3523l327j0665
$$ plain form
12940 65174 63254 69187 67400 72457 106070 148627 198801 274962 376431 494534 660600 856020
12928 856020 1068723 1303114 1466946 1494086 1476164 1471808 1382781 1164551 928159 724702
12918 724702 525970 371264 265728 202434 152797 138510 112096 88436 84116 87190 79488
12907 79488 61264 38869 38268 60047 62851 54164 50301 37879 44052 63162 71091 52009 22813
12894 22813 11888 27441 43301 64775 80585 69133 76188 92441 110228 132343 197334 286739
12882 286739 387861 518879 642744 753537 831008 879468 894639 845798 749215 647230
12872 647230 529017 413062 320676 245328 168433 129321 119611 68704 54295 43176 40496
12861 40496 56366 67356 53771 25608 38376 38533 45564 53940 71569 50818 37295 33968 23303
12848B3303m253J811Q820q489j1457R011q000R382q447j3037J344k3248P299O722
12834i239K15M063N742J070K600J5034k048j5443l653j056J7722K148N236j9671
12820B720K2171K189J3557K4491K851J327K3742L5821J7852J9999M4867K8563
12808B40150J7256L2153K2109J3295j8013k9135j8737q443j5588j8797k1386k0876
12796A73988q740j1529j0129n029l6086m7771p081J8795L617K769j3656j4748
12784D4400o519J7012K6245K790J6597J6652r633n979j6208Q194K3609J5013J4034
12771A46207L4585N4491O8756R8268J49915K53422L39633M64074N84675O29243
12761B823269O90142N17760J35806m6071j16668m97302p22909n88158n02151m57224
$$ plain form
12848 23303 19050 20861 29681 21192 9735 18746 10746 20128 11681 -1356 -12 -23260 -15961 -9239
12834 -9239 -9024 -4961 781 1851 4451 19485 17437 1994 -1659 -2715 15007 17155 22391 2720
12820 2720 24891 27080 40637 65128 67979 69306 93048 128869 146721 166720 211587 240150
12808 240150 257406 289559 311668 324963 306950 277815 259078 250635 235047 216250 194864 173988
12796 173988 165248 153719 143590 138561 102475 54704 47623 66418 70035 72804 59148 44400
12784 44400 37881 54893 81138 83928 100525 117177 107544 101565 85357 93551 117160 132173 146207
12771 146207 180792 235283 304039 402307 552222 805644 1145277 1609351 2194026 2823269
12761 2823269 3513411 4031171 4166977 4120906 4004238 3506936 2784027 2195869 1693718 1236494
12751A236494l32054k31135j06868m4234l851J7340J9002k356j1978j372k934
12740E36054k4619m3270j3288j9856l1364m1144k1331L552m5983o9866l7596k3166
12728A68123j6623j2646k5091j2993j9369j3374J9651J6755j7138j0630R980M882
12716I1527r264J836j2063l0758n149L831J187n644R012k9398j1760N843k074
12703G126N077K1706J3765K871O437n227j8701j9726p31k305j1148k1214k966
12690b5036O750K2701R001J097K544Q845q967k1249j9194j4719M942J4597M15
12677a8273j6826j1176J1696N62q422m894q95J8507Q119L02j4922J6553K4812
12664E143K3832j172K861J7798J1137J6287J9728R387N454K345M904n366O354
$$ plain form
12751 1236494 904440 673305 566437 522203 518352 535692 554694 552338 540360 538988 536054
12740 536054 511435 468165 454877 435021 403657 362513 341182 344734 298751 228885 191289 168123
12728 168123 151500 138854 113763 100770 81401 68027 87678 104433 87295 76665 86645 91527
12716 91527 82263 84099 72036 41278 36129 39960 41147 35503 44515 15117 3357 9200 7126
12703 7126 12203 33909 47674 50545 56982 51755 33054 13328 12597 10292 -856 -22070 -25036
12690 -25036 -18286 4415 13416 14513 17057 25902 16935 -4314 -23508 -38227 -33285 -18688 -18273
12677 -18273 -35099 -46275 -34579 -34017 -42439 -47333 -48228 -29721 -21602 -21300 -36222 -19669 5143
12664 5143 28975 27803 30664 48462 59599 75886 95614 105001 110455 112800 117704 112338 118692
12651A18692l20j2133p653M191J0705j4884k2315j6622J9615J2548N193J4597
12639A11614l20k764j7378q484o748o055J082J0926n890l801j3199J468K007q630
12625E3828q621n535K628R151j4080R013Q372O555j6057K0541M8820L8505L1304
12612A84424L4527O1253R8097P3834J7983j058K9453M313l9959l6782l4609m7665
12600C43811n1213l5361l3079m1741j2852n149q429J1756j1834j6941P390j3807
12588A32551j4723q083J5850Q759j1490j1119J6073K2199k991l552J0879J3901
12576A68254j558J6491J5912K0892J6573o955N169R776J4453J2300j3765j5539
12564B42003K3546K6393J2767p754l135J296l98j2601j665p272P896L5524K6882
$$ plain form
12651 118692 118372 106239 98586 102777 113482 98598 76283 59661 79276 91824 97017 111614
12639 111614 111294 108530 91152 82668 75920 69865 70947 81873 75983 72182 58983 60451 62458 53828
12625 53828 45207 39672 42300 51451 37371 46384 54756 61311 45254 65795 114615 153120 184424
12612 184424 218951 280204 378301 452135 470118 469060 498513 502826 462867 426085 391476 343811
12600 343811 292598 257237 224158 182417 169565 164416 155987 167743 155909 138968 146358 132551
12588 132551 117828 109745 125595 134354 122864 111745 127818 150017 147026 143474 154353 168254
12576 168254 166696 183187 199099 219991 236564 229609 234778 244554 259007 271307 257542 242003
12564 242003 265549 291942 304709 296955 293820 295116 294718 282117 280452 273180 281076 316600 343482
12551C43482J8909K6247K6253J3156L83J1900M785J1163m625r99J6234J0114Q029
12538D85031O173M0152L1451K4019N3293L6920M0037L7208K1399J3580N963K5975
12526H21201K0606K4158K0243L4149M7956P1048N9275M6373O7094Q6481J08754
12515A407338R8719J33807J62172J53724J73507K17430K33251K34861K48274K73553
12505C336636L08591L95477M05759M48122N27314O20683P59917R27461J205559
12496H935519J600068K122004K873725L944342N626330Q382342J2700994J9253920
12488F5439244K7628225L4512407L7108661M0352980M4929587L3570795O773064
12481B90314963l126218j983742k2077654m5855618m3589426l4056795l3116469
$$ plain form
12551 343482 362391 388638 414891 428047 428430 440330 445115 456278 451653 450654 466888 477002 485031
12538 485031 491204 531356 562807 586826 640119 677039 717076 754284 775683 789263 795226 821201
12526 821201 841807 865965 886208 920357 968313 1039361 1098636 1145009 1212103 1298584 1407338
12515 1407338 1506057 1639864 1802036 1955760 2129267 2346697 2579948 2814809 3063083 3336636
12505 3336636 3645227 4040704 4446463 4894585 5421899 6042582 6802499 7729960 8935519
12496 8935519 10535587 12657591 15531316 19475658 25101988 33484330 46185324 65439244
12488 65439244 93067469 127579876 164688537 205041517 249971104 283541899 290314963
12481 290314963 287188745 285205003 263127349 217271731 173682305 139625510 106509041
12474A06509041l0819866k2466832j4349682r309102o309839m388180l258871
12467A5606669k573494k021113j577960j280503j042769q50860p07855n77210
12459D974905m86201m04068l47100k92807k38553j95774j56804j56653j34790
12450B562155j06542r2196q9193j04379j04275j10196j05063j03095r5590p9051
12440A572575r2174p6842m6026l7173n0046n3307l7630n3906o6602o8596k6945
12429I63328k4682m7784k0014j3540l8403l2284j7826k8734l4264k7253k3001
12418F55543k1236l1054p002J3288j3354j0439n888p081J0205N994J7665J5803
12406F22444j4915k9550j3996O30r458j7456j1324j2710l9854j8656l773r156
$$ plain form
12474 106509041 75689175 53222343 38872661 29563559 23253720 18865540 15606669
12467 15606669 13033175 11012062 9434102 8153599 7110830 6259970 5552115 4974905
12459 4974905 4488704 4084636 3737536 3444729 3206176 3010402 2853598 2696945 2562155
12450 2562155 2455613 2363417 2274224 2169845 2065570 1955374 1850311 1747216 1651626 1572575
12440 1572575 1480401 1403559 1357533 1320360 1270314 1217007 1179377 1125471 1058869 990273 963328
12429 963328 938646 890862 870848 857308 818905 786621 768795 740061 705797 678544 655543
12418 655543 634307 603253 596251 609539 596185 585746 579858 572777 582982 588976 606641 622444
12406 622444 607529 577979 563983 564613 555155 537699 526375 513665 473811 455155 451382 442226
12394D42226j1540j6541j6492j3205o273p075j1506M750J395o190J8360O313q148
12381C76074j7579j8229l508q750j6213k8714J5532m123K94K887p487J315k678
12368B88821j9969j9432j0986j0575k170k2585l2179k1792n544J0320J9752K1088
12356A94749K7192K1274K7570K2121J181J5052q678j6889r334k8739o171K290
12344B41618R848J5778J9255K001j9198o799j1482k5177l0521p035J0278n581
12332A92985j1745q85K508j4733j5917j7153Q711K7466q918O641j4986j2704J0510
12319A51780M615Q072k7073j9241R15j1181o338J1301o419q435J22R32O092K6546
12305A31688K4653J0187r782j4104k93N489K0582J795R976p72K2590K4818O723
$$ plain form
12394 442226 430686 414145 397653 384448 378175 371100 359594 364344 365739 359549 377909 384222 376074
12381 376074 358495 340266 336758 328008 311795 283081 298613 294490 294784 297671 290184 291499 288821
12368 288821 268852 249420 238434 227859 225689 203104 170925 149133 143589 153909 173661 194749
12356 194749 221941 243215 270785 292906 294087 309139 300461 283572 274238 245499 239328 241618
12344 241618 251466 267244 286499 288500 269302 262503 251021 225844 195323 188288 198566 192985
12332 192985 181240 180355 182863 168130 152213 135060 143771 171237 162319 168960 153974 141270 151780
12319 151780 156395 164467 137394 118153 119068 107887 101549 112850 106431 97996 98118 99050 105142 131688
12305 131688 156341 166528 156746 142642 142349 147838 168420 170215 180191 179419 202009 226827 233550
12292B33550J4657J7630K7173J1188P561k472j5187o708J0252p256J847l917j5411
12279B72907k4901o431N485O886O195L0951M9753M4860K5680L0040M8347J8975
12267E08747q073j7400r945m1232m2439m6219k7837j7728j7200m3192l8714k652
12255A96116j8104k1003m834k9700k5907j9775K091P246k4568l108O526K1167
12243H6147q074k3561q82l812j225K3859K1524J1248P644K4271n403J486R686
12230A42908Q880J7984K2276K1429j2974k4864j6928j706j9090k1461j6624j4440
12218H5390n509L315J1754j172k3418K594J4387l210o866j8527K68R611l105k4791
12204D0721q318J2154k46L925k1059l920K0100r597J0276J3800R683k5475M504
$$ plain form
12292 233550 248207 265837 293010 304198 311759 309287 294100 287392 297644 290388 292235 288318 272907
12279 272907 248006 241575 247060 253946 260141 291092 340845 385705 411385 441425 489772 508747
12267 508747 500674 483274 473329 432097 389658 343439 315602 297874 280674 237482 198768 196116
12255 196116 178012 157009 152175 122475 96568 76793 78884 86130 61562 58454 64980 86147
12243 86147 78073 54512 53630 49818 48593 72452 93976 105224 112868 137139 131736 133222 142908
12230 142908 151788 169772 192048 213477 200503 175639 158711 157005 137915 116454 99830 85390
12218 85390 79881 83196 94950 93778 70360 72954 87341 84131 77265 58738 59006 68617 65512 40721
12204 40721 32403 44557 44311 48236 27177 23257 43357 33760 44036 57836 67519 42044 46548
12191D6548J4074R730q569j3864n431j018j0333m394j1286M168l319n732p561
12178C013k906K6382K6778M074O079l995j6117j252J2562P669O649J1132Q354
12165H8422r732k8810r782N800k0184p329k829J3785K6143j525O680N693J5441
12152H1773l606j6080j9640q62J2116L502O8j9597j8079q606R040L5945R610L094
12138F8678k4843l112J1728J2909j9328j2139L8l658L574N204p163R809J155o9
12124D2783j58n089r855q80J0480Q110r037r668n363l238P235O500j7643n288
12110H889q111q426k378K0217Q673J2776O8r327N441J1490J1646R682J2697l607
12096F9730l0425r842k650j163M053Q292j2978R067J786k1101j4238m019J6412
$$ plain form
12191 46548 60622 70352 61783 47919 42488 41470 31137 26743 15457 19625 16306 10574 3013
12178 3013 107 26489 53267 57341 63420 59425 43308 42056 54618 62287 68936 80068 88422
12165 88422 78690 49880 40098 45898 25714 18385 15556 29341 55484 53959 60639 66332 81773
12152 81773 78167 62087 42447 41585 53701 57203 57271 37674 19595 10989 20029 55974 65584 68678
12138 68678 43835 40723 52451 65360 46032 33893 33931 30273 33847 39051 31888 41697 42852 42783
12124 42783 42625 37536 27681 26801 37281 45391 36354 26686 21323 18085 25320 31820 14177 8889
12110 8889 778 -7648 -10026 10191 18864 31640 31708 22381 27822 39312 50958 60640 73337 69730
12096 69730 39305 29463 26813 25650 29703 37995 25017 34084 35870 14769 531 -3488 12924
12083A2924o399j6143J3488J4037J8305l116m243J4142n087J7824l641q96j2164
12070C9031R380K1922j763r929k0710j1555m068J9376R36n517j6633J164J3494
12057C5128Q858L3020J2427j3210r064P00L100q617o151K3953Q946l1689O805
12044F4206K3536L2163L9134N2268M7505O9744J41675J94027J96980J99710K03470
12033A264418J23859L9158q037k5463j41994k22671k08302j64927j54778j34765
12023C66498j06174p1682l2311p594l1030j7597j6557k6582j3231j1947q156k5514
12011a877k4039j0431J1659K5134K8977K4181m024j5038l687j0739r856j3196
11999b936j4167j0007N102K9156J6764j0796j822j1828j3454R863L098J5975j0008
$$ plain form
12083 12924 6525 -9618 3870 17907 36212 33096 28853 42995 37908 55732 52091 51195 39031
12070 39031 48411 70333 68570 58641 37931 26376 22308 41684 42620 37103 20470 21634 35128
12057 35128 43986 77006 89433 76223 67159 67859 70959 62342 56191 80144 89090 57401 64206
12044 64206 87742 119905 159039 211307 258812 328556 470231 664258 861238 1060948 1264418
12033 1264418 1388277 1427435 1419398 1393935 1251941 1029270 820968 656041 501263 366498
12023 366498 260324 188642 156331 148737 117707 100110 83553 56971 43740 31793 23637 -1877
12011 -1877 -25916 -36347 -24688 446 29423 53604 49580 34542 30855 20116 10260 -2936
11999 -2936 -17103 -27110 -22008 7148 23912 13116 11294 -534 -13988 -4125 -1027 14948 4940
11986D940j5391j3981J1343O065P11N246N599m363R092j8207J27P257J5851N457
11972A9746L302n15j7602k2709k3441J9896M245J8869P626M137j1494n83K1192
11959B2669J516n341n621j861j6768q182J4504L16Q577J0742k333m676J1342J3361
11945C8245J3069L35j2409J459L239n243k8178j7316j3618J0362J961q380L69
11932a6105O175J6560R197L081k9076L341J4327j2325o751L250j0289J459J5191
11919a965J6477j0100j1834k0656N897p989J6547J0225j0792j0766J2205L936
11907h815Q953l338j0023L033L641j2564J6088q120J6287Q610L769j3596j1806
11894g881P623P234o590J0475n807J8101k005k1242j2150r18o704k0173R870J2580
$$ plain form
11986 4940 -10451 -24432 -13089 -7024 -6313 -1067 4532 169 9261 -8946 -8819 -1562 14289 19746
11972 19746 23048 22533 4931 -17778 -41219 -21323 -17078 1791 9417 13554 2060 1477 22669
11959 22669 24185 18844 13223 11362 -5406 -13588 916 1232 9809 20551 18218 13542 24884 38245
11945 38245 51314 51649 39240 40699 43938 38695 10517 -6799 -20417 -10055 -8094 -16474 -16105
11932 -16105 -9930 6630 15827 18908 -10168 -6827 7500 -4825 -11576 -8326 -18615 -17156 -1965
11919 -1965 14512 4412 -7422 -28078 -22181 -30170 -13623 -3398 -14190 -24956 -12751 -8815
11907 -8815 138 -3200 -13223 -10190 -6549 -19113 -3025 -11145 5142 13752 17521 3925 -7881
11894 -7881 -258 6976 386 10861 5054 23155 21150 -92 -12242 -13160 -19864 -40037 -30167 -17587
11880a7587J754j016j3904J3856K2216P856r737j6508j9748J1436K3126M932J785
11867H461q773L182N136N514k7516n649j6043j1473J312K7601K8294K600l416
11854I230j6604m562R371p216K385J4689K3068j0138J9842J1215O332J7447J0595
11841H5654r10L0469L1962J1381Q785K5585K3398R702j2888K144k5058k3188k1922
11828A45114k764j4663k8436k7481j5821K352Q957j1062n362o191j3031k8151
11816C461j7335L365Q092p088n049K8007K0103l759j1545j7310l044j1299n475
11803a8876K0663J5187o516J5506J424K014l513j4685q954j7602J2705L5247J85
11790C2785j2503j2299m931J246J1085P264J1143l4585n171k462Q474K5826j9401
$$ plain form
11880 -17587 -15833 -16849 -30753 -16897 5319 13175 3438 -13070 -32818 -21382 1744 6676 8461
11867 8461 -312 2870 8006 13520 -13996 -19645 -35688 -47161 -45849 -18248 10046 12646 9230
11854 9230 -7374 -11936 -2565 -9781 -7396 7293 30361 20223 40065 51280 57612 75059 85654
11841 85654 84744 115213 147175 158556 167341 192926 216324 226026 213138 215282 190224 167036 145114
11828 145114 142350 127687 99251 71770 55949 58301 67258 56196 50834 44643 31612 3461
11816 3461 -13874 -10509 -2417 -9505 -14554 13453 33556 29797 18252 942 -2102 -13401 -18876
11803 -18876 1787 16974 10458 25964 27388 29402 25889 11204 2250 -15352 -2647 32600 32785
11790 32785 20282 7983 3052 4298 15383 22647 33790 -795 -5966 -8428 46 25872 6471
11777F471m471M20j3655j2187P023r635J0649J5157J4583o479n351j172q05j2141
11763a1593o354r766k788K422M972J6506j0342M29J8728L64J344K532n055n644
11749d245k0347K535J5451j927J6104k769j2971j0211j456J9987P066j2651j1138
11736a6572L504K4287m066K141J27j18k730K12J6507q509j2717j9587j064P597
11722a0988n22k4573o180J0816O462m45P426J3560K925J2129J1805o768j310q264
11708F073m511K0719K633j3593R9Q856O537N179j8275k1176J533N161K0603J9642
11694C9480k0674o803n62m275Q276j2172p333K95k379m828n433n812m073o44J5358
11679a1579r88j0426M023M085J3506n3L272N69J0123l885j6104j0682j5317N296
$$ plain form
11777 6471 2000 2420 -11235 -23422 -16399 -26034 -15385 -228 14355 7876 2525 1353 548 -11593
11763 -11593 -17947 -27713 -30501 -28079 -23107 -6601 -16943 -16514 2214 2578 3922 6454 1399 -4245
11749 -4245 -24592 -22057 -6606 -8533 7571 4802 -8169 -18380 -19836 151 7217 -5434 -16572
11736 -16572 -13068 11219 7153 9294 9421 9303 6573 6785 23292 14783 2066 -17521 -18585 -10988
11722 -10988 -11510 -36083 -42263 -31447 -24985 -25430 -18004 -4444 -1519 10610 22415 15647 14337 6073
11708 6073 1562 22281 24914 11321 11420 20276 26813 31992 13717 -7459 -5926 -765 19838 39480
11694 39480 18806 12003 11441 7166 15442 3270 -4063 -3768 -6147 -10975 -16408 -22220 -26293 -26937 -11579
11679 -11579 -12567 -22993 -18970 -14885 -1379 -1432 1840 2409 12532 8647 -7457 -18139 -33456 -28160
11665b8160J3339r892l131M872j538K917q976j5275o538J7797K2551P593k586
11652g027l546N474l650Q91q082m800P057M179j1013P855K7379p36Q396o11N743
11637B7509m34Q166k250j2921j593j5490J034k83R251O650j5968L646J1358k3942
11623e267r003j5235r935J8776K4656J0611j0164j1294j0965R542K98p616J2421
11610c175J5257j5648O392J1676J190k668n203P417Q456L537J943j6278j1785
11597A111L310n422O126O835r511o814R280J0938q627r287j369J8078j0151k7589
11583b3092k155J8081O85P167j373J344m119n881j3776j0949M472n443q06J719
11569c4126R251J5240j79j9639p152R545R124P019M282L468r820n396j718j478
$$ plain form
11665 -28160 -14821 -24713 -27844 -22972 -24510 -21593 -30569 -45844 -52382 -34585 -12034 -4441 -7027
11652 -7027 -10573 -5099 -8749 -7858 -15940 -20740 -13683 -9504 -20517 -12662 14717 13981 22377 21766 27509
11637 27509 27075 35241 32991 20070 18477 2987 4021 3738 12989 19639 3671 7317 18675 -5267
11623 -5267 -14270 -29505 -39440 -20664 3992 14603 4439 -6855 -17820 -8278 -7980 -15596 -3175
11610 -3175 12082 -3566 2826 14502 15692 13024 7821 15238 23694 27231 29174 12896 1111
11597 1111 4421 -1001 5125 11960 2449 -4365 4915 15853 7226 -2061 -3430 14648 4497 -23092
11583 -23092 -25247 -7166 -6481 686 -687 657 -3462 -9343 -23119 -34068 -29596 -35039 -35845 -34126
11569 -34126 -24875 -9635 -9814 -29453 -36605 -27060 -17936 -10917 -6635 -3167 -12987 -18383 -20101 -21579
11555b1579J6253J9374J7772j6100j4676R020M182K984q620M6o410j643J0191
11542A0794R89p571O493J7689M968k0463o169L513J1196l0619k3224J6644J1028
11529d732M808J6458n673k1609k372j0169j1442J2305J3773Q98J7043p389M856
11516F755j6808j0043N176M051R263Q388L919j2920o602J7193k463p238L91l813
11502d751j3793j6675O020J6563J105n97m165P559K944j2272M938L625R104O997
11488F602J741k064J9387k2838q239J3055P394j3178l443R166J3664o879k1088
11475f720N606M361J0074R697J4556j8934l758j800m327l331k4396k12k6450J5196
11461c0438J7718M692R55P163L639L103j1669J909Q444r598k234R421N588J0294
$$ plain form
11555 -21579 -5326 14048 31820 15720 1044 10064 14246 17230 8610 8656 2246 603 10794
11542 10794 11783 4212 10705 28394 33362 12899 6730 10243 21439 -9180 -32404 -15760 -4732
11529 -4732 76 16534 10861 -10748 -13120 -23289 -34731 -22426 -8653 -7755 9288 1899 6755
11516 6755 -10053 -20096 -14920 -10869 -1606 6782 10701 -2219 -8821 8372 5909 -1329 -938 -4751
11502 -4751 -18544 -35219 -29199 -12636 -11531 -12128 -16293 -8734 -5790 -18062 -13124 -9499 -395 6602
11488 6602 8343 6279 25666 2828 -5411 7644 15038 1860 -1583 7583 21247 14368 -6720
11475 -6720 -1114 3247 13321 23018 37574 18640 14882 13082 8755 5424 -18972 -19184 -45634 -30438
11461 -30438 -12720 -8028 -7073 90 3729 6832 -4837 -2928 5516 -4082 -6316 3105 8693 18987
11447A8987K12k7141l4426j630J2219J4780P158Q20J3379o891R562J6280K321
11434B5630o274l891p840j880p625j1975q213J1079J5011q189j362r47P181J6549
11420A7254j3696k1530O70J5146j12p149R489J2201o258j1144l115l389k2696
11407c4329Q65Q301o948K5252J6131m94j7304l591O090L823K111j6339L540J3195
11393C03M721M285Q635m358K475J7953L26J0579p949j8049j574L079k583o527
11379A1316O8o675K160j5757j6259r15M513j110N154Q160J0458K5672L1896P439
11365F6120k9961m750N818l555k3593o867K6610O08q405Q214p160o394j1746o525
11351a586j700J1465N942j0465j3936J1038J2631R691j6212r957r71j5332P68
$$ plain form
11447 18987 19199 -7942 -42368 -43998 -31779 -16999 -9841 -9021 4358 -2533 7029 23309 25630
11434 25630 19356 15465 7625 5745 -1880 -13855 -22068 -10989 4022 -4167 -5529 -6476 705 17254
11420 17254 3558 -17972 -17302 -2156 -2268 -9417 72 12273 6015 -5129 -8244 -11633 -34329
11407 -34329 -33464 -25163 -32111 -6859 9272 8778 -8526 -12117 -6027 -2204 -93 -16432 -12892 303
11393 303 5024 9309 17944 13586 16061 34014 34340 44919 36970 18921 17347 20426 17843 11316
11379 11316 11384 4709 6869 -8888 -25147 -26062 -21549 -22659 -17505 -9345 1113 26785 58681 66120
11365 66120 36159 31409 37227 33672 10079 3212 29822 30430 22025 30239 23079 16685 4939 -1586
11351 -1586 -3286 8179 14121 3656 -10280 758 13389 23080 6868 -3089 -4060 -19392 -18624
11338a8624J8782N403R96j1314P422J7591N892K1288j9537k8900k5865k460J8049
11325a1277N682P343P833k3714m319J0941N713Q903j729R607p61n938P257K705
11311A8246r068j5000q325K241J323J6948m171l091R392J3576J075k0647n174
11298b675L982L153p981N411M257o181j2986J3427J4018J421q206k456Q096J2153
11284B5433q45J429j1552l211j1613j5711j3479N861K2881K500j032J5434J507
11271A7602j0214O43M091j675O73j5709j0894N524o679J3022J5769J0763J4687
11258C7603j0454p078r644j3312m72J0223P10j361J754Q567R62J922j0126M307
11244A3601l608j3699o592J0517j192o190L368J7242q311K392j1252r268R258
$$ plain form
11338 -18624 158 5561 6557 -4757 2665 20256 26148 47436 27899 -1001 -26866 -29326 -11277
11325 -11277 -5595 1748 9581 -14133 -18452 -7511 -1798 7105 5376 14983 14222 8284 15541 18246
11311 18246 9178 -5822 -14147 -11906 -10583 6365 2194 -897 8495 22071 23146 2499 -2675
11298 -2675 1307 4460 -3521 1890 6147 -34 -13020 407 14425 15846 7640 5184 13280 25433
11284 25433 24588 26017 14465 11254 -359 -16070 -29549 -23688 -807 1693 661 16095 17602
11271 17602 7388 8031 12122 10447 11120 -4589 -15483 -9959 -16638 -3616 12153 22916 37603
11258 37603 27149 20071 10427 -2885 -3357 6866 7576 6215 7969 16536 17498 19420 9294 13601
11244 13601 9993 -3706 -10298 219 -973 -7163 -3795 13447 5136 7528 -3724 -12992 -3734
11231c734m628P35K2668Q608j939k646l465r816J659j3440J0556L1157N131O404
11217D7250K081J018M73o310j917m910q659J8139k758m5473k2138Q664K1255K2964
11203B9679J348P060r249k7537j5134J737J1161J992n427k931m378N399J4937
11190H657j6592j1510J6762j251q917J2630K9191k877k5321j8622k852J7755J1385
11177H438J5641k712j567N105k1567N359J2137j5292n319M63J7433J9966j0274
11164B7811m335N6l292j282R917O108m404n151j4519j7367O25J7554J3808P192
11150C2721m137j3218M608o887J3709O855l883l150Q48o388j0039j5088o578p712
11136a8339j1568K2732J2558j8199j3330J0209J2783P348Q305l863k3874r19k666
$$ plain form
11231 -3734 -8362 -7627 15041 23649 21710 19064 15599 5783 7442 -5998 4558 35715 40846 47250
11217 47250 49331 50349 50822 44512 42595 37685 29026 47165 44407 -1066 -23204 -14540 6715 29679
11203 29679 31027 38087 28838 1301 -13833 -12096 -935 1057 -4370 -7301 -11679 -6280 8657
11190 8657 -7935 -19445 -2683 -3934 -12851 -221 28970 26093 772 -17850 -20702 -2947 8438
11177 8438 24079 21367 19800 24905 3338 8697 20834 5542 223 686 18119 38085 27811
11164 27811 23476 23532 20240 18958 28875 34983 30579 25428 10909 -6458 -5833 11721 25529 32721
11150 32721 28584 15366 19974 13087 26796 33651 29768 26618 27466 21078 11039 -4049 -10627 -18339
11136 -18339 -29907 -7175 5383 -12816 -26146 -15937 -3154 4194 12499 8636 -15238 -16157 -18823
11123a8823r756m570J3389n669p969J415J3256P438J37k089N427M797M565o369
11109d821m629N992l104o998N557k822j9669p671K3788O678N141k024m129K084
11095f627n524J5597Q386l1109k6977N166K5915J7912k4175L905m1j0973J0268
11082a8277M999m113R075M368L941m221J3803J3599P949k721q021j5950j0263
11069e832P688q07l802K601Q031p427j3042j94L724n645q17Q754K584M205n902
11054e881j2192J3880O889R61j576j5322J1380P140k0896k896n031J0927P526
11041e091O989K574O092J3226R543K369P407j8783o937j2227O401M627j0158m990
11027A042L638P914M409J8214o747l168Q736n043m403J0288L237J073q363Q558
$$ plain form
11123 -18823 -28579 -33149 -19760 -25429 -33398 -31983 -18727 -11289 -11152 -13241 -7814 -3017 1548 -4821
11109 -4821 -9450 -3458 -6562 -13560 -8003 -10825 -30494 -38165 -14377 -7699 -2558 -4582 -8711 -6627
11095 -6627 -12151 3446 11832 -19277 -46254 -41088 -15173 2739 -21436 -17531 -17572 -28545 -18277
11082 -18277 -13278 -17391 -8316 -3948 -7 -4228 9575 23174 31123 28402 20381 4431 -5832
11069 -5832 1856 1049 -2753 -152 7879 452 -12590 -12784 -9060 -14705 -15522 -6768 -4184 21 -5881
11054 -5881 -18073 -4193 2696 3657 2081 -13241 -1861 5279 -15617 -18513 -23544 -12617 -5091
11041 -5091 1898 4472 10564 23790 33333 35702 43109 24326 17389 5162 11563 16190 6032 1042
11027 1042 4680 12594 17003 35217 28470 25302 34038 28995 24592 34880 38117 39190 30827 39385
11013C9385J1215L200m949k3762j3129n780l355Q053J8299Q524q217k2451j0422
11000c389j4213P9k859l573J1675K0352K1133k719j799j1620j3237k935R655R051
10986A5601n590m498l450P758Q601j2883K1343o287K968O180R177J347j2201L566
10972C1632l085r109r877L999P543J1399o058k1840M405J7737L469l4163j6556
10959b0504J9019p89j3888J6503O445L809J6696J9272p518k2032j7027J7178p004
10946A0160k278Q894J3465J0302j7685j845j442j922q115q592m547r729n359J2516
10932f177J1645J4121J1949R952k8157p005l596j2829m766J5225K1273J1297j3333
10919A9599o488R161j7663l0026L820O982j74k919O070K5921J4417P686j1388
$$ plain form
11013 39385 50600 53800 48851 25089 11960 6180 2825 10878 29177 37701 29484 7033 -3389
11000 -3389 -17602 -17523 -20382 -23955 -12280 8072 29205 26486 24687 13067 -170 -3105 6550 15601
10986 15601 10011 5513 2063 9821 18422 5539 26882 20595 23563 29743 38920 40267 28066 31632
10972 31632 28547 19438 9561 13560 21103 32502 26444 4604 9009 26746 30215 -3948 -20504
10959 -20504 -1485 -2274 -16162 341 6786 10595 27291 46563 39045 17013 -14 17164 10160
10946 10160 7882 16776 30241 40543 22858 21013 19571 17649 9534 942 -3605 -13334 -18693 -6177
10932 -6177 5468 19589 31538 41490 13333 6328 2732 -10097 -14863 362 21635 32932 19599
10919 19599 13111 22272 4609 -25417 -21597 -14615 -14789 -17708 -11638 14283 28700 36386 24998
10906B4998q886q871M104J030j744j367J055L402o353o269o96J2699Q864Q068
10892C0034k796k762J0183J7867r578j5543J8821j305J3846J1218n493j0924k9251
10879B4317j0715j089R722J3124j7962l962Q783K533p182r194j6299P923n775
10866e776l668m672M822N800J6977j626j9131P568J2885J8031p074N71o470j6771
10852A466M543o423K1648J9677P008j8742j777O071J6582j620J0674R097J9412
10839H7616j2118j5749m654j3975l6910J2686Q940j0809M125J1421J2298K152
10827D5023m457P689q700o964m644l30p912l083p711m249m345o106K520J812o579
10812h036K665L719P772J2194P509L783M348k1790j6061j7552Q128j0937j072
$$ plain form
10906 24998 16112 7241 11345 12375 10631 9264 10319 13721 7368 1099 403 13102 21966 30034
10892 30034 27238 24476 34659 52526 42948 27405 46226 44921 58767 69985 64492 53568 24317
10879 24317 13602 12513 22235 35359 17397 13435 22218 24751 17569 8375 -7924 -1 -5776
10866 -5776 -9444 -14116 -9294 -3494 13483 11857 -7274 294 13179 31210 24136 24707 18237 1466
10852 1466 6009 -414 21234 40911 47919 29177 27400 33471 50053 48433 59107 68204 87616
10839 87616 75498 59749 55095 41120 4210 16896 25836 15027 19152 30573 42871 45023
10827 45023 40566 48255 39555 32591 27947 27617 19705 16622 8911 4662 317 -5789 -3269 -1457 -8036
10812 -8036 -5371 -1652 6120 18314 25823 29606 33954 12164 -3897 -21449 -13321 -24258 -25330
10799b5330J1718J4228p005n804J2986L985K569K2953J0920L659R969k112o243
10786D6493J7526K194j9893q357q389j2194q319J4826J5370l372j047m443j2564
10773A7831j5773o747L113K2135K623J223J799J748J0392K163P622j7857M90K2082
10759E2844k0210k0344j4621j9202P440J1449M380kN209L078K050o825P889M791
10745A7926j8480Q727l643k6841l128p8K069K3568J3941n552r203n973N39L635
10731b493m313q701J7621J3761K0643J4702j7536l1827q885J9407J5449j6832
10719A0996p950m883M589J1749L080r971J319K3604m875j6534N057K0957j693
10706C5445j7391j5567k594j2944j6308J6165L0674N792j573j3866k0768N444
$$ plain form
10799 -25330 -13612 616 -6389 -12193 793 4778 7347 30300 41220 44879 54848 52736 46493
10786 46493 64019 66213 46320 37963 29574 17380 9061 23887 39257 35885 34838 30395 17831
10773 17831 2058 -4689 -1576 20559 23182 24405 26204 27952 38344 40507 48129 30272 30762 52844
10759 52844 32634 12290 -2331 -21533 -14093 -2644 1736 1734 6943 10021 12071 5246 13135 17926
10745 17926 -554 8173 4530 -22311 -25439 -25517 -23448 120 14061 8509 -694 -6667 -6128 -2493
10731 -2493 -6806 -15507 2114 15875 36518 51220 33684 1857 -7028 12379 27828 10996
10719 10996 3046 -1837 2752 14501 17581 7610 8929 32533 27658 11124 16181 37138 35445
10706 35445 18054 2487 -107 -13051 -29359 -13194 17480 23272 21699 7833 -12935 -7491
10694g491M158j9622J4046P263j13K839N212n821j0128j7416J0395P793Q581l296
10680c600k71M870L603k3762o938p357J7699J9340N389m797j3012J450J9470Q951
10666B1035L849J2294l513N501j8733p08L984k253J403q75j537Q982n427m884
10652A9118k587j1735k661R29R818K958r717O21N516o525J125l774k180N985o923
10637c2k089J25p197l551J8333m885O372r409j4803n318J2441n518j1810J5026
10623a2315n395o654p75P973j3062K1873K3423j9230j1538o166N683J814J4297
10610g2k392j771j0501j1304J1676N498O249j3501J5143N904k6160m371J9959
10597e643N373k536k6995k236J3390o200O138J6650k235n848J2r705j6463k372
$$ plain form
10694 -7491 -3333 -22955 -8909 -1646 -1759 1080 6292 471 -9657 -27073 -16678 -8885 -304 -3600
10680 -3600 -3871 999 4602 -19160 -26098 -33455 -15756 3584 8973 4176 -8836 -7386 12084 21035
10666 21035 24884 37178 33665 39166 20433 19725 23709 21456 22859 21984 20447 29429 24002 19118
10652 19118 16531 4796 2135 3064 12882 15840 6123 6744 12260 5735 6860 3086 906 6891 -32
10637 -32 -2121 -1996 -9193 -12744 5589 704 7076 -2333 -17136 -22454 -10013 -15531 -27341 -12315
10623 -12315 -17710 -24364 -25139 -17166 -30228 -8355 15068 -4162 -15700 -21866 -16183 -14369 -72
10610 -72 -2464 -4235 -14736 -26040 -14364 -8866 -2617 -16118 -975 4929 -21231 -25602 -5643
10597 -5643 -270 -2806 -29801 -32037 -18647 -24847 -18709 -2059 -4294 -10142 -10130 -19835 -36298 -38670
10583c8670J6522j2807j483Q950k490o65o415m501J4122J9621Q526p768K9703
10570B2645K1901o471o565j3244j6393J0892M417P395J1683m531j0822j4091j7200
10557a0384O635R078k835j4744O483K1434P247l324q473p355l218n438j58j3133
10543a8185M440j1494R528J4861N163k0386k249l369J5414R67p351J2427J8386
10530A8152L46k4985k8555K0500J8561R899n260j3460M898N604J4052Q646j0035
10517A8363q65K5497J924k5782N126L889l399k1045q755J26l57J0445K9J2395
10503A7591N60j4740Q005J0288l887m897M515J2391p93k4803M968M174O001q953
10489A0420m600Q901K799R998j1123k0369P42L566N581n781j2357k6668m388n007
$$ plain form
10583 -38670 -22148 -34955 -36438 -27488 -29978 -30643 -37058 -41559 -27437 -7816 710 -7058 22645
10570 22645 44546 38075 31510 18266 1873 12765 17182 24577 36260 31729 20907 6816 -10384
10557 -10384 -3749 5329 2494 -12250 -5767 15667 22914 19590 11117 3762 544 -4894 -5052 -18185
10543 -18185 -13745 -25239 -15711 -850 4313 -16073 -18322 -21691 -6277 -5310 -12661 -234 18152
10530 18152 18498 -6487 -35042 -14542 4019 13918 8658 -4802 96 5700 19752 28398 18363
10517 18363 17498 42995 44919 19137 24263 28152 24753 3708 -5047 -4921 -5278 5167 5196 17591
10503 17591 18151 3411 11416 21704 17817 12920 17435 29826 29033 4230 9198 13372 19373 10420
10489 10420 5820 14721 17520 27518 16395 -3974 -3232 334 5915 134 -12223 -38891 -43279 -48286
10475d8286L6701K7687J9664k6181k0152J717j3669J1604Q692j5033k1273J9377
10463a9152J1734J0209J6765k1074q758l093J2154j792j366J3395L93j2537j4963
10450a8085J8547p547k5108M2Q330J3299J8385l390K662j3743j0964M745o39q105
10436b1571N35r178J4869J8051J510j705O09p06K808p732J0837J2388n119j4017
10422A579l117J4970j085R07K878j4998l0199j4337J916N117K2756R188J130J0215
10408F920K6159o821j5273j553J8956r58J293m181k0131n347j055J0047m585j0083
10394f612k7444n518K3551P425M14J216J2461m926l109J182J1462O045J0823k1597
10380E373j2561J7931K7712R575n755j7732j7329L016O305j917r074q747J5270
$$ plain form
10475 -48286 -11585 16102 35766 9585 -10567 -8850 -22519 -10915 -2223 -17256 -38529 -19152
10463 -19152 -7418 2791 19556 -1518 -10276 -13369 -1215 -3007 -4373 9022 9415 -3122 -18085
10450 -18085 462 -7085 -32193 -32151 -23821 -10522 7863 4473 7135 -6608 -17572 -12827 -13466 -21571
10436 -21571 -21036 -30214 -15345 2706 4216 2511 3120 2414 5222 -2510 8327 20715 15596 1579
10422 1579 -1538 13432 12347 13254 16132 1134 -29065 -43402 -41486 -36369 -13613 -4425 -3295 6920
10408 6920 33079 26258 10985 9432 28388 27430 28723 24542 4411 -936 -1991 8056 3471 -6612
10394 -6612 -34056 -39574 -16023 -8598 -8184 -6968 5493 567 -2542 -1360 10102 16147 26970 5373
10380 5373 -7188 10743 38455 48030 42275 24543 7214 10230 16535 14618 5544 -3203 12067
10367A2067L180k3293m923r535K254J2761J6665r36o165J1131J6395J947j3090
10354A8458j7686K421O283L207J556k473K612m164r892O903J0764R229k101L124
10340B8241R250J8006N571Q770Q870n414P33j313J906J2479R219L22k4216M357
10326G6781j784p189j2476j3550p111k6630j647K986j777L644j8007q12J5999
10313H427J2557j4276j0163J325j0402J0486J0927n28R549o716j687P867J139
10300A8505R402j0312m136L289J1520J4896P869l315j5547j8190p039n902j559
10287e19N176j9961p118r20J0349N177J3345K4809J5279O50j5065j3984o37j534
10273A5047j4041q208R365O697j6012N356p23o750J2969J0155k1926n226j0187
$$ plain form
10367 12067 15247 -8046 -12969 -22504 -20250 -7489 9176 8240 2075 13206 29601 31548 18458
10354 18458 772 3193 9476 12683 14239 11766 14378 10214 322 7225 17989 27218 25117 28241
10340 28241 37491 55497 61068 69838 78708 73294 74027 72714 74620 87099 96318 96640 72424 76781
10326 76781 74997 67808 55332 41782 34671 8041 6394 9380 7603 11247 -6760 -7572 8427
10313 8427 20984 6708 -3455 -2130 -12532 -2046 8881 8353 17902 11186 9499 17366 18505
10300 18505 27907 17595 13459 16748 28268 43164 51033 47718 32171 13981 6942 1040 -519
10287 -519 4657 -15304 -22422 -23342 -12993 -7816 5529 30338 45617 46267 31202 17218 16581 15047
10273 15047 1006 -7202 2163 8860 -7152 -1796 -2519 -9269 3700 13855 -8071 -13297 -23484
10260b3484J0795K2582P525j2359p179J3248M370j4536l075o022k948k709K923
10247a0869j64O491K1110J1424q880m326m113R964p84l424M791N139r57O757r847
10232B2312n610k939O760J3761j0985J3367J3690j008p418K846p160o283L672
10219C5005J0717m057k7345Q119j556j4752J6791R664m160k1766m425O216J2125
10206B0576K154K015Q041j48J619l610k0370k3956J641K9435J1281k6280l273
10193h75K398P866j1287J042J459K4115J4362m299k932j3777J0473l862r129k4002
10179h448j6590P920J9770o24j369J2726K4489j553j2427J188k1608j5540R054
10166c012J2621K1241O787N552j309N613j542l1225j1717J574k510L656O281J4263
$$ plain form
10260 -23484 -12689 9893 17418 5059 -2120 11128 15498 962 -2113 -8135 -11083 -13792 -10869
10247 -10869 -11033 -4542 16568 27992 19112 14786 10673 20637 19853 16429 21220 26359 25402 32159 22312
10232 22312 16702 13763 20523 34284 23299 36666 50356 49348 41930 44776 37616 31333 35005
10219 35005 45722 41665 14320 22439 20883 6131 22922 32586 28426 6660 2235 8451 20576
10206 20576 22730 24745 32786 32638 34257 30647 10277 -13679 -12038 17397 28678 2398 -875
10193 -875 1523 9389 -1898 -856 603 24718 39080 34781 31849 18072 28545 24683 15554 -8448
10179 -8448 -25038 -17118 2652 2028 659 13385 37874 36321 23894 25082 3474 -12066 -3012
10166 -3012 9609 30850 37637 43189 41880 47493 45951 14726 3009 4583 2073 5729 12010 26273
10152B6273J808j8522Q061N234J1190J2203J456j4818n841Q611m201O372L379
10139D1205j388L687k3034K845K9034l574k2207r970k154M846J0197N89m49j6900
10125A2727L860J4151L845r437p00J2094K281k621J519R435O790p414M470j7340
10111C3660j4452R566M483r702Q21L258k0652o03J3832L202j6788j437J7530J5346
10097C8064J410P0j810n471j8082R153L946P283J709N466N129n167j1070j2545
10083A8085O924K974p503j0910P286J4170P350m233o816j6850M697K1902J6973
10070E4049n470N923Q693J2624l3290j5232K3397p135k849k594M879j6175L875
10057C0695K9329K1436J9045L710L173p785j9929J8264P192j7338j1078j3707
$$ plain form
10152 26273 28081 9559 17620 22854 34044 46247 47703 32885 27044 35655 31454 37826 41205
10139 41205 39817 43504 20470 23315 52349 48775 26568 16598 14444 19290 29487 30076 29627 12727
10125 12727 16587 30738 34583 25146 24446 36540 38821 36200 37719 47154 53944 46530 51000 33660
10111 33660 19208 28774 33257 23555 24376 27634 6982 6379 20211 23413 6625 5188 22718 38064
10097 38064 39474 39544 37734 32263 14181 23334 27280 34563 36272 41738 46867 41700 30630 18085
10083 18085 25009 27983 20480 9570 16856 31026 38376 34143 27327 10477 15174 37076 54049
10070 54049 48579 54502 63195 75819 42529 27297 50694 43559 40710 38116 42995 26820 30695
10057 30695 60024 81460 100505 104215 107388 99603 79674 97938 105130 87792 76714 63007
10045F3007p220q69K430J0645N103J3655M0013L8943L774o2712m2412j3082K09
10032E1484p250L583O000r034j6161L114N730P061R59J9129j1876o339J0474j2379
10018D4495j2124k64K1481K188l799j0371m930N566O696J741j6733o244J3577
10005D1279J4378j5236K885j625j0951M390Q756J8499J829Q316kk1693n52Q037
9991E8310J0324P265k512j8668N269q072j2975j0815Q019J1751Q166J0486o112
9978F0436M851O081p512N443R385j1100j4425m984R864J3042O297j4140O438K417
9964G2093Q124J4382M024p701j0032k0016P166L2952J6982j9370j3301k3493p707
9951E4103J6532N747n508L4J2307J5125m398q365J010L681J378J8730O281j8651
$$ plain form
10045 63007 55787 54918 57348 67993 73096 86751 126764 165707 169481 106769 64357 51275 51484
10032 51484 44234 47817 53817 44783 28622 31736 37466 44527 45486 64615 52739 46400 56874 44495
10018 44495 32371 32107 53588 55776 51977 41606 36676 42242 48938 50679 33946 27702 41279
10005 41279 55657 40421 43306 41681 30730 35120 43876 62375 64204 72520 72518 50825 50273 58310
9991 58310 68634 75899 73387 54719 59988 51916 38941 28126 36145 47896 56062 66548 60436
9978 60436 65287 71368 63856 69299 78684 67584 53159 48175 58039 71081 77378 63238 69676 72093
9964 72093 80217 94599 98623 90922 80890 60874 68040 100992 117974 98604 85303 61810 54103
9951 54103 70635 76382 70874 70908 83215 98340 93942 85577 86587 90268 91646 110376 116657 98006
9937I8006k1818j1135J4685J3681J391k0716q629L296J7183O873L82J370L228
9924I7797R305N173N583J4299K789M722j6663j0872J9570J877K1923r001L117
9911A49619j7607K684R281j557j0994j1829j3085r828J1533K2132J1993r775N729
9898A38296J8372K2717J019O369N434j6789q658N442N404J5399j7385j9349L500
9885A59771K0195J9333L396l993n859m471j2512p089k746n534J9914P753K680
9872A90838k158p424o912K665P891J6498K063j3342J5401M721K047Q685K6428
9859B47401K6537J1033o188l420M522J3109J9272M091j3076j167j3404J5359J4656
9846C18725N039N12k0642k5812Q997J2492j1667K7781L9661L1089M7109K7626
$$ plain form
9937 98006 76188 65053 79738 93419 94810 74094 65465 68761 85944 92817 93199 94569 97797
9924 97797 107102 112275 117858 132157 134946 139668 123005 112133 131703 133580 155503 146502 149619
9911 149619 132012 134696 143977 142420 131426 119597 106512 96684 108217 130349 142342 132567 138296
9898 138296 156668 179385 180404 186773 192207 175418 166760 172202 177606 193005 175620 156271 159771
9885 159771 179966 199299 202695 198702 192843 188372 175860 168771 166025 160491 180405 188158 190838
9872 190838 188680 181256 174344 177009 184900 201398 203461 190119 205520 210241 212288 220973 247401
9859 247401 273938 284971 278783 275363 279885 292994 312266 316357 303281 302114 288710 304069 318725
9846 318725 323764 324276 303634 277822 286819 299311 287644 315425 355086 386175 433284 460910
9834D60910J0122l2481n6466l2624o622K9473j1529j6831N986J8546K1456J0237
9822D00177K8132R007J9476j1633l3860j8518Q505K383n918J0172O460L2883N0616
9809D97882K7946j196k5699p562K890J2700M610J3295K934L3644K9477r485J6427
9796E97863R21J2632L7571K6494Q465k975J3519J9264K1729K033r240J4401R679
9783G52356L2158M3136K7651J6725Q358J6202L2075J4591K1700K8777K5092J4961
9771A033782K8032K6868J9407o438J4536M2352M7995M3420J0559J8157J9642L4332
9759A332644M8521J4443K7040L0324L3170M4999L8932N9054N1366O1044N5821
9748A797358N0620M5423L5816L3683O8824P5349O4809N5389O8500O1505Q1743
$$ plain form
9834 460910 471032 438551 382085 349461 342839 372312 360783 343952 349938 368484 389940 400177
9822 400177 428309 437316 456792 445159 411299 392781 401286 403669 397751 407923 414383 447266 497882
9809 497882 525828 524632 498933 491371 494261 506961 511571 524866 527800 561444 590921 581436 597863
9796 597863 598784 611416 648987 675481 683946 680971 694490 713754 735483 737516 728276 742677 752356
9783 752356 784514 827650 855301 872026 880384 896586 928661 943252 964952 993729 1018821 1033782
9771 1033782 1061814 1088682 1108089 1101651 1116187 1158539 1206534 1249954 1260513 1278670 1298312 1332644
9759 1332644 1381165 1395608 1422648 1452972 1486142 1531141 1570073 1629127 1680493 1741537 1797358
9748 1797358 1847978 1893401 1929217 1962900 2031724 2107073 2171882 2227271 2295771 2357276 2439019
9737B439019Q3953R0322J06287Q1457P4766R7055J07475J07936J03531J04739
9727C396540J12015J31935J53878J38772J28903J54653J43650J58677J64023J59887
9717D842933J79255J86039K16593K19504K27967K47632K45414K56640K63592K69543
9707G155112K97859K97806K98546L09242L42519L50403L41274L48434L61686L61142
9697A0464023L80390L90061L70844L65903L68067L67726L55960L37272L18481
9688A3718727L09662K96444K67363K36310K08763J72981J37033P7369L7562J9783
9678A5481997k5244o5413r6771j44388j81990k14652k47596k70930k85389k93838
9668A3655786l19250l32892l11005l36281l48762l30959l41284l64812l57583
$$ plain form
9737 2439019 2522972 2613294 2719581 2801038 2875804 2972859 3080334 3188270 3291801 3396540
9727 3396540 3508555 3640490 3794368 3933140 4062043 4216696 4360346 4519023 4683046 4842933
9717 4842933 5022188 5208227 5424820 5644324 5872291 6119923 6365337 6621977 6885569 7155112
9707 7155112 7452971 7750777 8049323 8358565 8701084 9051487 9392761 9741195 10102881 10464023
9697 10464023 10844413 11234474 11605318 11971221 12339288 12707014 13062974 13400246 13718727
9688 13718727 14028389 14324833 14592196 14828506 15037269 15210250 15347283 15424652 15462214 15481997
9678 15481997 15456753 15391340 15294569 15150181 14968191 14753539 14505943 14235013 13949624 13655786
9668 13655786 13336536 13003644 12692639 12356358 12007596 11676637 11335353 10970541 10612958
9659A0612958l41992l24924l14044k97148l03010k92638k79897k75532k53932
9650G929841k52720k66416k52480k41812k40253k19390j87042j82955j79042j70306
9640E737425j74613j60581j74507j93721j56832j15830j29706j30365j20858j19821
9630D260591j28182j23403r7308q3497r6259j00711q4147r2632q8996r5130q9614
9619C180712p1875o2619o3791p3531n9283o5664n3637n7625o9100p4071m9266
9608B480250l2673m3675o4556o5246m9072m6927l5356k6508l7325l8679k4973
9597B015260l0113l1062n1485m3229k9759l4242k1003l5273k4919j2346j5962
9586A685867m0169l3331k1444j6774l4878l0744j9318j1225j3248l6053l6014
$$ plain form
9659 10612958 10270966 9946042 9631998 9334850 9031840 8739202 8459305 8183773 7929841
9650 7929841 7677121 7410705 7158225 6916413 6676160 6456770 6269728 6086773 5907731 5737425
9640 5737425 5562812 5402231 5227724 5034003 4877171 4761341 4631635 4501270 4380412 4260591
9630 4260591 4132409 4009006 3911698 3828201 3731942 3631231 3547084 3454452 3365456 3270326 3180712
9619 3180712 3108837 3046218 2982427 2908896 2849613 2783949 2730312 2672687 2603587 2529516 2480250
9608 2480250 2447577 2403902 2339346 2274100 2225028 2178101 2142745 2116237 2078912 2040233 2015260
9597 2015260 1985147 1954085 1902600 1859371 1829612 1795370 1774367 1739094 1714175 1701829 1685867
9586 1685867 1645698 1612367 1590923 1574149 1539271 1508527 1489209 1477984 1464736 1428683 1392669
9575A392669n128J982m1280l8092j4676n574l6758k7849k6151p331k1615j0996
9563A159201J3708M302r997k7076m435k6981j7477k1223j2250j080K2308j3218
9551A065782j7045k1511m4841p077m466j120q818k6288j7119j471o910k3990o644
9538H78482j0516q569q61J0866L274J448p203j8595j9564O80k8297l6082n512
9525G59551M419O242J7067N73j7996m878m393j7535m377j5829j4572p783m813
9512F95676K761j3115k4657L945p1l302K1134J0915k9403j0142o671j6951J717
9499F31836O253j527m239J2075K795p111m365J13j9856j4047J379K0378O509j1899
9485F18294j3270o431n831j6396M59r965q579J8305K985j322n027j2085m125o169
$$ plain form
9575 1392669 1387541 1389523 1348243 1310151 1295475 1289901 1253143 1225294 1199143 1191812 1170197 1159201
9563 1159201 1172909 1177211 1167214 1140138 1135703 1108722 1091245 1070022 1057772 1056692 1079000 1065782
9551 1065782 1048737 1027226 982385 975308 970842 969722 960904 934616 917497 916026 909116 885126 878482
9538 878482 867966 859397 858536 869402 872676 874124 866921 848326 828762 829442 801145 765063 759551
9525 759551 763970 770212 787279 787852 769856 764978 760585 743050 738673 722844 708272 700489 695676
9512 695676 698437 685322 660665 664610 664539 661237 682371 693286 663883 653741 647070 630119 631836
9499 631836 638089 636562 632323 644398 647193 640082 635717 635830 615974 601927 603306 623684 630193 618294
9485 618294 605024 598593 592762 576366 576825 566860 558281 576586 579571 578249 573222 561137 557012 550843
9471E50843K356m167N34j3003j5105k668J9643r145j9427o252O877L786j025j1753
9457E01494J4970K448q385L989n141m958l076j571J0951J0400J3991j1695q247
9444E15170k2210M105m561q00j2528J0243M134j5302j488o458p011j625j2893
9431D48776n86J0298j1741J005P576m0j6779j9438k1336L102j006L380L0720P733
9417D41664n456p754j2302j5414L891o890R394J9654k582m813n96P844P677m27
9403D33890j2865q066M168j1617k192J1650K173j9698P677J997j2273k440j015
9390C91389r635K0919J0913j2763N76O009J7469o435j5720j218k260J4730J4358
9377D28332Q433k4218j1620j7727j7990J0323K381L788k3603l820J2454k588J1608
$$ plain form
9471 550843 553199 549032 549566 536563 521458 518790 538433 529288 509861 503609 510486 514272 513247 501494
9457 501494 516464 518912 510527 514516 509375 504417 501341 499770 510721 521121 535112 523417 515170
9444 515170 492960 497065 492504 491704 479176 489419 493553 478251 476763 470305 463294 461669 448776
9431 448776 448190 458488 446747 447752 455328 455288 438509 419071 397735 400837 399831 403211 433931 441664
9417 441664 436208 428454 416152 400738 404629 397739 407133 426787 424205 419392 418796 426640 434317 433890
9403 433890 421025 412959 417127 405510 403318 414968 417141 397443 405120 407117 394844 392404 391389
9390 391389 381754 402673 413586 400823 401399 407408 424877 418442 402722 401504 399244 413974 428332
9377 428332 436765 412547 400927 383200 365210 375533 377914 381702 358099 354279 366733 364145 375753
9364C75753J3692m035n482j3922O030J1474O186j133j769j595j5646j0757J1528
9351C70324J1476L821M522k73m317K994J623n442k5077j0156N662J1201n287Q931
9337C70002K0238o766q107l910p826Q575J1323J79j8272j120n266j3823m872j1314
9323C29041O461N652p82l984r509n303J2486j6436k1228J0821K0109P947p297
9310C27978K851k044j532J2748r943L69M185J1150M88J285l647l687J0052n528
9296C44725j5299K830J0867n299p25M693j2309k251j373M019j7366L279Q691r387
9282C15095O078M261j0609r215L603k249q521J0954O435q331K923J0430j2825
9269C08029m260j2948J0003o023q354M213j815o845k5731N742M795K2491J0325
$$ plain form
9364 375753 389445 385410 379928 366006 372036 383510 389696 388563 386794 385199 369553 358796 370324
9351 370324 381800 385621 390143 389870 385553 388547 390170 384728 359651 349495 355157 366358 361071 370002
9337 370002 390240 383474 375367 371457 363631 372206 383529 383708 365436 364316 359050 345227 340355 329041
9323 329041 335502 341154 340372 336388 326879 321576 334062 317626 296398 307219 327328 335275 327978
9310 327978 330829 328785 327253 340001 330058 330427 334612 345762 346250 347535 343888 340201 350253 344725
9296 344725 329426 332256 343123 337824 337099 341792 329483 327232 325859 329878 312512 315791 324482 315095
9282 315095 321173 325434 314825 305610 309213 306964 298443 309397 315832 307501 310424 320854 308029
9269 308029 303769 290821 300824 294801 286447 290660 288845 282000 256269 262011 266806 289297 299622
9256B99622k8683l62P917k8362j5862J3429m426n749m150J1924J0794N056k5801
9243B35347q366K3048R648J1332J4649k976k15j4199J6486Q263j1394Q024M284
9230B93931r198r198O252M667k3917p749K804n356J0595J6396N525K397J586j7158
9216B71577j7804j330n294J3064j489j6377j8641k7453q581K6477P794J2294j429
9203B32808o122l245j8469M640K1085O928j625j6592K690M088k861j7001q450
9190A97874n37P887K2865L050O183J2551o051q478k5524K666J4260J4418K920
9177B44084q980o379j2568P339j322K825M696m594j2364k625P657J0874K525j9589
9163B11579k804M126O85o249R513m816L242J2406p895j1835J1849J1770J3771
$$ plain form
9256 299622 270939 270577 278494 250132 234270 247699 243273 237524 233374 245298 256092 261148 235347
9243 235347 226981 250029 259677 271009 285658 282682 282467 268268 284754 293017 281623 289647 293931
9230 293931 284733 275535 281787 286454 262537 254788 257592 252236 262831 279227 284752 287149 288735 271577
9216 271577 253773 252443 247149 260213 258724 242347 223706 196253 187672 214149 221943 234237 232808
9203 232808 226686 223441 204972 209612 230697 237625 236000 219408 222098 226186 223325 206324 197874
9190 197874 197337 205224 228089 231139 237322 249873 243822 235344 209820 212486 226746 241164 244084
9177 244084 235104 228725 216157 223496 222174 224999 229695 225101 212737 210112 217769 228643 231168 211579
9163 211579 208775 212901 213586 207337 216850 212034 215276 227682 219787 207952 219801 231571 245342
9150B45342j8150j5030j1742J2030O424j7075q919M552j260k550P315Q52J712
9137B03501M079k860Q142J3621N6j7360j6938J7894n918p504J00K1171K0492O368
9123B44844R217M789j2167k5839l627J8398p173j7650q366J393K2530L3546O762
9110B66657j1104j7263k2726j8316n261O547O586J3988l309j3327k0122k2314
9098A60036j6689q797n74J7897r807j4492P716K0542k189k754J4275Q736j372
9085A72528j2446M54J4517K5304j231j4147j0023J2643R181K8192L1871K5915
9073B82758r780j6840n64r698j0939j22J4688Q430j0343q357k921J0444j0793
9060B35963j803j540o710j4697j5111j4637j7989M731M293j7953P210q311L707
$$ plain form
9150 245342 227192 212162 200420 212450 218874 201799 192880 197432 196172 193622 200937 201789 203501
9137 203501 207580 204720 212862 226483 226539 209179 192241 210135 204217 196713 196813 217984 238476 244844
9123 244844 254061 258850 246683 220844 217217 235615 228442 210792 202426 203819 226349 259895 266657
9110 266657 255553 238290 215564 197248 191987 198534 205120 219108 215799 202472 182350 160036
9098 160036 143347 134550 133976 151873 142066 127574 135290 155832 153643 150889 165164 173900 172528
9085 172528 160082 160536 175053 200357 199126 184979 174956 187599 196780 224972 256843 282758
9073 282758 272978 256138 255574 245876 234937 234815 249503 257933 247590 239233 236312 246756 235963
9060 235963 234160 232620 225910 211213 196102 181465 163476 168207 172500 154547 161757 153446 157153
9047A57153J1452m66M429n776j0205k044L2449Q738Q865J0619J1992J5992J8221
9034B61419J1848J6429N0205O9394N9251K1597j5220l7263k8192J439j585j1097
9022C98225o954k5102j6519k569l1150P6J1164J7099P301n907O536K700k1150
9009C33750j1606j5303j9340j9689j5216J0228K9402L934k5696o987K865m601
8997B61741k605l462l028K7463L0376o411M282M5932J8281J977j012K7349M092
8984D04975J6552M4457L7553K5696J5993J9149M6025L7307K6314K929k1489J939
8972F57400L775j889j6131m7611m7112l8510m2837k1363k3020l4576O789q257
8960C86658j3887k695j2816L394j3284j3560o246K817K914O164J860j2689k6847
$$ plain form
9047 157153 168605 168139 172568 166792 156587 154543 186992 195730 204595 215214 227206 243198 261419
9034 261419 273267 289696 339901 409295 468546 490143 474923 437660 409468 410907 409322 398225
9022 398225 391271 366169 349650 347081 315931 316007 327171 344270 351571 345664 352200 354900 333750
9009 333750 322144 306841 287501 267812 252596 262824 292226 296160 270464 263477 266342 261741
8997 261741 259136 255674 252646 280109 310485 304074 308356 354288 372569 374546 373534 400883 404975
8984 404975 421527 465984 503537 529233 545226 564375 610400 647707 674021 676950 655461 657400
8972 657400 661175 659286 643155 595544 548432 509922 467085 445722 422702 388126 394915 386658
8960 386658 372771 370076 357260 360654 347370 333810 327564 330381 333295 339459 341319 328630 301783
8947C01783j4810J1853K5773P602P542L4484K7427j2425j3153l50P648p380k328
8934C73666J9161J0068K8161N4044N4470O5675O9787M2627m349l4672p2388o4546
8922E41704l9461k4932m4017j4630o75J179k2095m6624k0879J0060L8886K7255
8910D05771J265j565N232o6n114l1683m4430l7089k7802j7024j6828j5091k0891
8897A94685j0663p182Q07L611J8138m666K932l163k017J0694m960r612J8242P051
8883B13897M629J6091K6278M6008J8630j4398j9359j4251J429K5214J2811J3115
8871C30094n000l1766l6259m2053l3496k4571Q614J4460m994K05N422J133j1486
8858A70303l0345r878l208M730n80J4814K2732l20m906j5726R137L3483k981k6518
$$ plain form
8947 301783 286973 298826 324599 332201 339743 374227 401654 389229 376076 375726 383374 375994 373666
8934 373666 392827 402895 431056 485100 539570 605245 675032 717659 713310 678638 606250 541704
8922 541704 502243 477311 433294 418664 417989 419168 397073 350449 329570 339630 378516 405771
8910 405771 407036 405471 410703 410637 405523 373840 329410 292321 264519 247495 230667 215576 194685
8897 194685 184022 176840 177647 181258 199396 194730 197662 194499 192482 203176 198216 188604 206846 213897
8883 213897 218526 234617 260895 306903 325533 311135 291776 277525 278954 304168 316979 330094
8871 330094 325094 293328 257069 215016 181520 156949 165563 180023 175029 175234 180656 181789 170303
8858 170303 139958 130080 126872 131602 131022 145836 168568 168248 163342 147616 156753 190236 187255 160737
8844A60737n925L430n115k2047k0229K0690K176K4088P417n125J3363m186j4176
8831A55098k2232p657P140j0011j7523m733K0357J7589l406K8221o130j6791p428
8818A32494j475R229O913R914K696P761R390j550J4564K2552K936J4422O321L0571
8804B66738K0651r714l8621j8046j2842Q669J5272K9415J5401J2213J8257J5317
8792C22710J4379m462k3377k3291k1342l0217q832k8537o911R518o083M032J2643
8779B10230o780o294j3325M777J2292o764N577K086O906p009J6895K1846L0429
8766B70866K9285L7163M2747J9964J7116J8578N858j4237J2848N477L021J1993
8754D60679K4551L9237K2148M1124N8787M9639K8722k993P725M443k2977p2863
$$ plain form
8844 160737 154812 158242 153127 131080 110851 131541 133717 157805 165222 160097 173460 169274 155098
8831 155098 132866 125209 132349 122338 104815 100082 120439 138028 134622 162843 156713 139922 132494
8818 132494 131019 140248 147161 157075 159771 167532 176922 175372 189936 212488 215424 229846 236167 266738
8804 266738 287389 277675 239054 221008 208166 216835 232107 261522 276923 289136 307393 322710
8792 322710 337089 332627 309250 285959 264617 234400 225568 197031 190120 199638 193555 197587 210230
8779 210230 203450 197156 183831 188608 200900 194136 199713 201799 208705 201696 218591 240437 270866
8766 270866 300151 337314 380061 400025 417141 435719 441577 427340 440188 445665 448686 460679
8754 460679 485230 524467 546615 587739 646526 696165 724887 721894 729619 734062 711085 638222
8742F38222r6953p9850o7827k5691k1125j4819j9869J5273k170j3450j5231m68
8730B96042K808Q126k297j587l25k686J2767L6673K3527J4644J8163K2948K4430
8717D53233J9659L4218N0565K8299K3117J4864J5923L4573O2287O1000M2009O5952
8705I05699N5370L4357K0833k4568k6002l8490l4961j3975j3402q858l2536q1758
8693G41709p8076n6497o1201o3473l5838l9740k1095j8168j840j3286l366p607
8681C41522K13J1164J1312J9383M497P698K6573K3802K2379K0666J1053K1538
8669E21800K930N490K8325L9630L3492N0892M7437L1269K1828K9341M2590K7365
8657H82389l227l8028o784K7438K7867p15J1188o04m7236j03227j14604q7728
$$ plain form
8742 638222 541269 461419 393592 367901 346776 331957 312088 327361 325191 311741 296510 296042
8730 296042 298850 306976 304679 303092 302767 300081 312848 349521 373048 387692 405855 428803 453233
8717 453233 472892 507110 557675 585974 609091 623955 639878 674451 736738 797738 839747 905699
8705 905699 961069 995426 1016259 991691 965689 927199 892238 878263 864861 856003 823467 741709
8693 741709 663633 607136 545935 482462 446624 406884 385789 367621 365781 352495 349129 341522
8681 341522 341735 352899 364211 383594 388091 395789 422362 446164 468543 489209 500262 521800
8669 521800 524730 530220 558545 598175 631667 682559 729996 761265 783093 812434 855024 882389
8657 882389 879162 841134 834350 861788 889655 888940 900128 899524 852288 749061 634457 546729
8645E46729n6200n8252m6446j4884N417J4743j835j8505k5163j5621j7348r31
8633C11704K256k0549J246r869l758L188k442J6702J2221K3508J7418J001J5219
8620C67845J9756L0479n863p374Q900L4558P2444M7411K2617J8905J2744J2643
8608F35065N582K538j8022p951l9967m5859m5325k5883k673J5030q242O546J4541
8595D85380J7104o882k6844m1972l2439l7114l5755k5457n882j1413k4266k4537
8583B29923j4123M878O124K181J1254r93q171j5472k2737j0149k3963k2320K697
8570A39129K2527K0618K5403M1788M650J2063J1235l0147m7016l8310j6092j9645
8558A26203j2080j3185L151k559M668J0096L877K02J3531M113j3172n590n082
$$ plain form
8645 546729 490529 432277 385831 370947 376364 391107 389272 370767 345604 329983 312635 311704
8633 311704 313960 293411 294657 284788 281030 284218 281776 298478 310699 334207 351625 352626 367845
8620 367845 387601 418080 412217 404843 413743 448301 520745 568156 590773 609678 622422 635065
8608 635065 640647 643185 625163 617212 577245 531386 486061 460178 457505 472535 464293 470839 485380
8595 485380 502484 495602 468758 426786 394347 357233 321478 296021 290139 278726 254460 229923
8583 229923 215800 220678 226802 228983 240237 239244 231073 215601 192864 182715 158752 136432 139129
8570 139129 161656 182274 207677 249465 254115 266178 277413 247266 200250 161940 145848 126203
8558 126203 114123 100938 104089 101530 106198 116294 120171 120373 133904 138017 124845 119255 114173
8545A14173k2448j1656J061L088j5184O885K1611j2474j1166J697M998k765N627
8532H3447j0170N54P948j0862K913O355J4492J2525j6084N250M781J706M819L122
8518A10796o026O63l521l1562m269K1826O784k3560r420J4902Q200j5101M358
8505G4070J0875R95m07J9051j4537j2115J8024K2233J1339j3142M935o154j275
8492A13892j8383k6513M126j3068j2870k246M447K4058J2345N130Q82K588o85
8479I3703k0957J92j3640r812l369J2734N469N601K548R659j198j2201l775n926
8465E9028r125r220O320Q896k138r27Q604P39Q77J8618o059J082N480J6467J963
8450A00605J7752Q924r484j1866J117p001j1118q783L803J82R31r322m630m039
$$ plain form
8545 114173 91725 80069 81130 84218 69034 75919 97530 85056 73890 75587 80585 77820 83447
8532 83447 73277 73831 81779 70917 73830 80185 94677 107202 91118 96368 101149 102855 107674 110796
8518 110796 104770 105433 101912 70350 66081 87907 94691 71131 61711 76613 84813 69712 74070
8505 74070 84945 85940 85533 104584 90047 77932 95956 118189 129528 116386 121321 115167 113892
8492 113892 95509 68996 73122 60054 47184 44938 49385 73443 85788 90918 91800 94388 93703
8479 93703 72746 72938 59298 49486 46117 58851 64320 69921 72469 82128 80930 68729 64954 59028
8465 59028 49903 40683 47003 55899 53761 52834 61438 62177 63054 81672 75613 76695 82175 98642 100605
8450 100605 118357 127281 117797 105931 107048 100047 88929 80146 83949 84131 85062 75740 71110 67071
8436F7071L439J2571j75j0975j4635j5481q249L618L317O116j3570l894p131J8114
8422D0136J6373j2802j5489k0866J2744J9842Q719N268J1885K0942j937j3096
8410G1719j6254k9525Q275K9512J7485l301J128o297L725J2219O16k2178R154
8397G6278O626q937o641p637M8j1126Q645K700M404Q854j6145k1368L132K2148
8383F0981J521k3063p812k1486k5894M2054J9714n243L680N757n628p604l532
8370C3445j727P069q011p184P278R562O043j4612k4287Q56J6600J7475j679j3641
8356B7187k889O716L0867n171j5209P506Q728L966M236l333k7165P585J2613j0646
8342D4991P05P053m48j5969k091j1190L776o092M430M108J457n288J0871K3510
$$ plain form
8436 67071 70510 83081 82906 71931 57296 41815 33566 37184 40501 46617 33047 29153 22022 40136
8422 40136 56509 43707 28218 7352 20096 39938 48657 53925 65810 86752 84815 71719
8410 71719 55465 25940 34215 63727 81212 77911 79039 72742 76467 88686 89302 67124 76278
8397 76278 82904 73967 67326 59689 59737 48611 57256 59956 64360 73214 57069 35701 38833 60981
8383 60981 62502 39439 31627 10141 -15753 26301 46015 40772 44452 50209 44581 36977 33445
8370 33445 31718 38787 30776 23592 30870 40432 46475 31863 7576 8432 25032 42507 40828 27187
8356 27187 24298 31014 61881 56710 41501 49007 57735 61701 65937 62604 35439 43024 55637 44991
8342 44991 45696 52749 52301 36332 34241 23051 26827 20735 25165 29273 30730 25442 36313 59823
8328E9823P712j6132k0701j1160P922m039R295k632J3045J7820J292L164J2595
8315G8004r012j0909O263J7880l88M487o913k267n033K871k000m290j3301r677
8301D5715r904M995n903R904k250j643J474n849m57j3000J5281m704J0581l398
8287D0842j2181p464J634j3329R665L2799J1401L172o49Q642Q652K824K06j80
8273H6034j0493Q843J2097j2989O521J7095J4070J236j5900j3409J1720j1136
8261I3689j5992l084K505j1197N670p455j0640J229R821o689J5433R429P711L518
8247I3948o21O814n806j4195k9515q637J88R97Q444j6889j703j109K4018J4952
8233G0886P010J1204L038j1400k6376j6227K6904J9120P467K364P298K1287K4558
$$ plain form
8328 59823 67535 51403 30702 19542 27464 23425 32720 30088 43133 60953 62245 65409 78004
8315 78004 68992 58083 64346 82226 81838 86325 79412 77145 72112 74983 72983 68693 55392 45715
8301 45715 35811 40806 34903 44807 42557 40914 42388 36539 36082 23082 38363 33659 44240 40842
8287 40842 28661 21197 22831 9502 19167 51966 63367 66539 65890 74532 83184 86008 86214 86034
8273 86034 75541 84384 96481 83492 90013 107108 121178 122414 106514 93105 104825 93689
8261 93689 77697 74613 77118 65921 71591 64136 53496 54725 64546 57857 73290 82719 90430 93948
8247 93948 93327 100141 94335 80140 50625 41988 42176 43173 51617 34728 33025 31916 55934 70886
8233 70886 77896 89100 92138 80738 54362 38135 65039 84159 91626 93990 101288 122575 147133
8220A47133M4353J4391j4354j1722M751j6197j4586j5366O043J1850r871p249
8208A39176q560l1674k1909J4128k803q259J4140O626K5105J6660o660m720J2697
8195A43947l088j896J9937K3828J5444J5865K0151J2856J2939M5269Q4956J24964
8183E15172J52315J58791J68721Q7606l3845j32285j80131j70757j12087q9672
8173C63828o1008k0651l975k5575j0587M82M738p58R98K711p482m167K162j6702
8159B24014p597O751q083P146J0082J8906M7709K1438J9071L0609L9455K6096
8147D35597L1180J5563k8369L375K0161M1123R109j2117j9010q168l445J5154
8135E00153M718P899K4047N2287O6014R5896Q1050M2430l4698o8879p1287o9281
$$ plain form
8220 147133 191486 205877 191523 179801 184552 168355 153769 138403 144446 156296 146425 139176
8208 139176 130616 98942 77033 91161 88358 80099 94239 100865 125970 142630 135970 131250 143947
8195 143947 140859 138963 158900 182728 198172 214037 234188 247044 259983 305252 390208 515172
8183 515172 667487 826278 994999 1082605 1048760 916475 736344 565587 453500 363828
8173 363828 302820 282169 278194 252619 242032 242514 247252 246494 247492 250203 242721 238554 240716 224014
8159 224014 216417 223168 215085 222231 232313 251219 298928 320366 339437 370046 409501 435597
8147 435597 466777 482340 453971 457346 477507 518630 527739 515622 496612 488444 484999 500153
8135 500153 504871 512770 536817 589104 655118 751014 832064 874494 839796 770917 699630 630349
8123F30349n0495j6719O374J3126J2880k8074k5769k6247k6563l9260o0544m1352
8111C47706j3136j0709k1770n360j5701k5996j3261J3351J0432M8316O5738P3087
8099D52697P4209R3608Q9639L1396k3250q5899r2549p8942o2879m1186o245N893
8087C56492K578J0316J5305L7873P7615J10969J54186J48732J06967N4259j7480
8076A057812n8860n0238k2644K6860R7601J67004K38978K65639K73878K46913
8066B242943J78813J9913j56648k79121l18463l37761k74002j95068j21155q2720
8056F76731m3732M7165J01180Q6296P9395O2451J6373p0586j23990j05058r9714
8045F26511p2157n3777m0397j7994o673K1208J5435j3856k4002P124J4725P796
$$ plain form
8123 630349 579854 563135 569509 582635 595515 567441 541672 515425 488862 449602 389058 347706
8111 347706 334570 323861 302091 296731 281030 255034 241773 255124 265556 313872 379610 452697
8099 452697 526906 620514 710153 741549 718299 632400 539851 460909 398030 356844 350599 356492
8087 356492 359070 369386 384691 422564 500179 611148 765334 914066 1021033 1075292 1057812
8076 1057812 998952 948714 926070 952930 1050531 1217535 1456513 1722152 1996030 2242943
8066 2242943 2421756 2441669 2285021 2005900 1687437 1349676 1075674 880606 759451 676731
8056 676731 632999 680164 781344 867640 947035 1009486 1025859 955273 831283 726225 626511
8045 626511 554354 500577 460180 442186 435513 456721 472156 458300 434298 441422 456147 463943
8033D63943L6711N8950J07827R5003R5303J31517J84606K50261L59945N12955
8023B297021O38239O78385O08860L54880r0852m93224p14793p64270o49443m48465
8013A416338l01896j81648j34226p9087l5550o818L424R250O888n1259l2993m3685
8001E68738k5678l6255m3168m1580j9055k2907j276k121J2214L7642O506j388
7989D31672J4295K8355N1950L0160J2697L2170L9835P2110J20383J28958J43838
7978A106423J52427J93854J47279R3867L0004j13428j86965j71957j45929j79371
7968I26204k08633j60012j14751o6599l9970l5088l0468j5394j2168q297q912
7957B25912k0166l817m915m756Q404K6073J725q087j0858l684l600J4472n017
$$ plain form
8033 463943 500654 559604 667431 762434 857737 989254 1173860 1424121 1784066 2297021
8023 2297021 2935260 3613645 4222505 4577385 4486533 3993309 3278516 2514246 1864803 1416338
8013 1416338 1114442 932794 798568 719481 683931 677113 680537 689787 696675 645416 612423 568738
8001 568738 543060 506805 463637 422057 403002 380095 378819 376698 388912 426554 433060 431672
7989 431672 445967 474322 526272 556432 569129 601299 641134 713244 833627 962585 1106423
7978 1106423 1258850 1452704 1599983 1693850 1723854 1610426 1423461 1251504 1105575 926204
7968 926204 717571 557559 442808 376209 336239 301151 270683 255289 243121 234824 225912
7957 225912 205746 201929 197014 192258 200662 226735 228460 220373 209515 205831 202231 216703 211686
7944B11686o49j569r236j3127Q720J2538k8696n311j289j5553j6354j6822l955
7931A20383K285R494J0950J2j2326m198J9169R071p287j0968j5155j445m437o885
7917A08663l430N541O618m89N099q914j5550p110J6284J1670m234j6700j6041
7904H1407j6144J2469J1367O250J6241k6057Q033N793q966m0940j3674n775J4854
7891D4858O345n084J836R794L670L398J2705J6342m131J556O304j2444j7685o935
7877F0529Q818Q320m434o540j5840k2245j2950J1262O102N283L62j1604Q183J3720
7863D8966l51R676j526M135J6500K0918k1546j9554k4693l574m092m985n703Q41
7849A5012M362J6553P369L950n78k832j3021j2158j7211j1457N088J5496J8942
$$ plain form
7944 211686 211037 209468 200232 187105 195825 208363 179667 174356 173067 157514 141160 124338 120383
7931 120383 122668 132162 143112 143124 130798 126600 145769 154840 147553 136585 121430 119985 115548 108663
7917 108663 105233 110774 117392 116903 122002 113088 97538 90428 106712 118382 114148 97448 81407
7904 81407 65263 77732 89099 95349 111590 85533 93566 99359 90393 49453 35779 30004 44858
7891 44858 51203 46119 47955 57749 61419 64817 77522 93864 89733 91289 97593 85149 67464 60529
7877 60529 69347 77667 73233 66693 50853 28608 15658 26920 33022 38305 38667 27063 35246 48966
7863 48966 48615 58291 56765 60900 77400 98318 76772 57218 32525 28951 24859 19874 14171 15012
7849 15012 19374 35927 43296 47246 46668 43836 30815 18657 1446 -10011 -4923 10573 29515
7836B9515N491l960q644j554J4010m366j3730P291K2754m681j5141j072K499K693
7822C1105k724l345K8685j6758l2672k806j2427J1148L8043K930J2225k069n183
7809D6152j2798j3563q788M415o615j5954M029O853K626J0229R383j699o508j5429
7795B333J012J7992o044j0797R770J4193J9617j0131j7465M878L735n545R699
7782C3247j4850l81J0194L849j6289j5546J4506J7325J1075j7131J0618K7640
7770F4257M054k9543j1561j7863r719O406K5374q916r183l771Q1J1917j7313K116
7756F336j059l787l652j1230j908P954O272K0121J9932J9259r540m174l907j2558
7742B8059n860K0175J367o526j3291j413K309r322j6532O41N749J5253J0496R52
$$ plain form
7836 29515 35006 31046 22402 20848 34858 30492 16762 24053 46807 42126 26985 25913 28412 31105
7822 31105 28381 25036 53721 36963 4291 1485 -10942 206 38249 41179 53404 51335 46152
7809 46152 33354 19791 11003 15418 8803 -7151 -3122 3731 6357 16586 25969 24270 17762 2333
7795 2333 3345 21337 15293 4496 14266 28459 48076 37945 20480 25358 29093 23548 33247
7782 33247 18397 18016 28210 32059 15770 224 14730 32055 43130 25999 36617 64257
7770 64257 68311 38768 27207 9344 -375 6031 31405 22489 13306 9535 9616 21533 4220 6336
7756 6336 5277 1490 -2162 -13392 -15300 -7346 -1074 19047 38979 58238 48698 44524 40617 28059
7742 28059 22199 42374 43741 37215 23924 22511 24820 15498 -1034 -393 5356 20609 31105 32057
7728C2057k8208k728R899K404J4236k393j2099j1665m38P979J967R773K5813L052
7714D9649j375j123q193j5950j703k732m238o096o655n030n106Q944K2852k142
7700B1102k5855j9408J8607J2617J0975l307j0930j8298R360j364n802k935J5753
7687E15O236J373r202M729l530j3463M859K9773m057n564N141J792k6210p267
7673a4875J7618Q722K108J6326J1267J0897j5175J417L988j9115j9913j8690J725
7660a3700K73L832J0586J0693L325Q432k4792J804J7855j439j6728R806P462K374
7646A9783j80K009j4418J0229J8924K96k2508l2248j4888J5918K9789P731l1659
7633a1222q244J026P653O845J3956j7162j5894j2455J6518K7434j7475K492J4287
$$ plain form
7728 32057 3849 1121 11020 13424 27660 25267 13168 1503 1065 9044 11011 20784 46597 49649
7714 49649 48274 47151 38958 23008 21305 18573 14335 8239 1584 -3446 -8552 392 23244 21102
7700 21102 -4753 -24161 -5554 7063 18038 14731 3801 -14497 -5137 -6501 -12303 -15238 515
7687 515 6751 8124 -1078 3651 121 -13342 -8483 21290 17233 11669 16810 18602 -7608 -14875
7673 -14875 2743 11465 13573 29899 41166 52063 36888 38305 42293 23178 3265 -15425 -13700
7660 -13700 -13427 -9595 991 11684 15009 23441 -1351 453 18308 16869 141 9947 17409 19783
7646 19783 19603 21612 7194 17423 36347 36643 14135 -18113 -33001 -17083 12706 20437 -11222
7633 -11222 -19466 -18440 -10787 -3942 10014 -7148 -23042 -35497 -18979 8455 -9020 -6528 7759
7620G759P853j291j814p910p728K116N805o004k687n306J0856J2034J0341P730
7606C1754o245p410q465j4901Q333j4219k1596l793K2361J3100J8401r440j8950
7593a1070j7733J8460P246K963j010j8636l096J1812J3174m861R357n22N947J529
7579A3560O458L521j0458K966n610r5j62J5449j6899r131n509J4836J5749lj2850
7564A1822j2353n235L429j2346o977J9047R544n197J212j4646L99O363L624n307
7550f621p220K0579J6745O137N698R104k0812m768j4401j3147L853R620n701k3284
7536b4218j7352O943M399L659J3459j3116l415R333J4589K1664P199j4564k0765
7523a2185m754P093P263J2172M364j5590j2576K3389j6008l133N663P50n379K4156
$$ plain form
7620 7759 15612 14321 12507 4597 -3131 -1015 4790 -1214 -3901 -9207 1649 13683 24024 31754
7606 31754 25509 18099 9634 -5267 3066 -11153 -32749 -36542 -14181 -1081 17320 7880 -11070
7593 -11070 -28803 -10343 -3097 -134 -1144 -19780 -22876 -11064 2110 -2751 6606 6084 12031 13560
7579 13560 20018 23539 13081 16047 10437 10342 10180 25629 8730 -401 -5910 8926 24675 24672 11822
7564 11822 -531 -5766 -2337 -14683 -21660 -2613 6931 1734 2946 -11700 -11301 -4938 -1314 -6621
7550 -6621 -13841 6738 23483 29620 35318 44422 23610 18842 4441 -8706 -4853 4767 -934 -24218
7536 -24218 -41570 -34627 -30228 -26569 -13110 -26226 -29641 -20308 -5719 15945 23144 8580 -12185
7523 -12185 -16939 -9846 -2583 9589 13953 -1637 -14213 9176 -6832 -9965 -4302 -3552 -8931 15225
7509A5225P686r266L275J5397j5233r520j0786K842O575P150r042N283j855j7234
7495i503j9078k555J0221J4386P854j1366M065j332J718J938l238q971J8339o546
7481d068j2595m384n005L827k916m708J3932q397q479r144K2437J4017K2271J7070
7467C3858r450n615j7780p290o798p237M474K4486Q50j6164j3297L150J1210j845
7453g448l196N64Q001J1663j632l960o651J7971J8183L308p321j0346L955j9464
7439C627j1195j1903O558K2072K8789J2913k9319o442Q955l884K98r58j1471k1065
7425a3025r285k150Q310j0273Q314M796j0714m687K724j7002J2604m884J2786
7412b2486K7397J0045q249l0060p65R506J1341J641j5232M586J7045P468k681
$$ plain form
7509 15225 22911 13645 16920 32317 17084 7564 -3222 -380 6195 13345 4303 9586 7731 -9503
7495 -9503 -28581 -31136 -20915 -6529 1325 -10041 -5976 -7308 -5590 -3652 -6890 -15861 2478 -4068
7481 -4068 -16663 -21047 -26052 -22225 -25141 -29849 -15917 -24314 -32793 -41937 -19500 -5483 16788 33858
7467 33858 24408 18793 1013 -6277 -13075 -20312 -15838 8648 9498 -6666 -19963 -16813 -5603 -7448
7453 -7448 -10644 -10080 -2079 9584 7952 3992 -2659 15312 33495 36803 29482 19136 23091 3627
7439 3627 -7568 -19471 -12913 9159 37948 50861 21542 15100 24055 20171 20469 19511 8040 -13025
7425 -13025 -22310 -24460 -16150 -26423 -18109 -13313 -24027 -28714 -25990 -42992 -30388 -35272 -22486
7412 -22486 4911 14956 6707 -23353 -24118 -14612 -3271 -1630 -16862 -12276 4769 12237 9556
7399I556N321j2506j274l674k3376M46K0729l531j1680J0657M532o133j235k904
7385a5072K203j0997J1084J0228J5626J1581p95k4575m660l10j626R114J1600
7372A3401r443l724r464p920o821Q369Q781N663J8705K798j2108o567j0178M835
7358c673J2233P845K452R784p142p172K839j8273p440l960J105K175K035j5222
7344b2414m469o599Q996J3395j2374M80N755m754N594J701o519J6479j967k0753
7330b7449J8033o296n288J4967n96j4177O888K0013J2012O06m473k8477j9656
7317c3893J0579p205N135R641o415r810K0334R500r73R796O169J491m740q454
7303A155k9291j6216K3992J7510l579J924L252R421L945k8282M14J2481Q088K2858
$$ plain form
7399 9556 14877 2371 1097 -2577 -25953 -25507 -4778 -8309 -19989 -9332 -4800 -10933 -12168 -15072
7385 -15072 -12869 -23866 -12782 -2554 13072 24653 23858 -717 -5377 -5687 -7313 1801 13401
7372 13401 3958 234 -9230 -17150 -23971 -15602 -6821 -1158 17547 20345 8237 1670 -8508 -3673
7358 -3673 8560 16405 18857 28641 21499 14327 17166 -1107 -8547 -12507 -11402 -9227 -7192 -22414
7344 -22414 -26883 -33482 -24486 -11091 -23465 -22985 -17230 -21984 -16390 -14689 -21208 -4729 -6696 -27449
7330 -27449 -9416 -15712 -21000 -6033 -6629 -20806 -13918 6095 18107 18713 14240 -14237 -33893
7317 -33893 -23314 -30519 -25384 -15743 -22158 -31968 -11634 -2134 -3107 6689 12858 14349 9609 1155
7303 1155 -28136 -44352 -20360 -2850 -6429 -4505 -1253 8168 12113 -16169 -15755 -3274 4814 27672
7289B7672j3634j5184j0441J2113P186J3342j2231j2517Q236N966R853k330m313
7276A3718j4745j0474q956j7778j4729J4461K2557K3778J580j3900P557L088k828
7263C329j382J586j752M783m749j049K089k100O867J3232P693j1717k0782p661
7249a1613P575j4389m454j5920j5219K2489K0157J843j3787r95K1557R115P02
7236G061R754p392j4605j3172k04K332m291J3824P455l676j074j881j4141p990
7222b8000K5888K5375p001r202k3683L541J41r665r717k156N231J4912J5218J2526
7208A3408K4081P653j5851j7913n953O676r64o344M501n106j520r797j4298L418
7194a8009r05R749J7152J3312k8026j0738P895P942l760o656p69n463m470p549
$$ plain form
7289 27672 14038 -1146 -11587 526 7712 21054 8823 -3694 4542 10508 20361 18031 13718
7276 13718 -1027 -11501 -20457 -38235 -52964 -38503 -15946 7832 9412 -4488 3069 6157 3329
7263 3329 1947 3533 1781 6564 1815 766 2855 755 7622 20854 28547 16830 -3952 -11613
7249 -11613 -4038 -18427 -22881 -38801 -54020 -31531 -11374 -9531 -23318 -24313 -2756 6359 7061
7236 7061 16815 9423 -5182 -18354 -18558 -16226 -20517 -6693 762 -2914 -3988 -5869 -20010 -28000
7222 -28000 -2112 23263 16262 7060 -16623 -13082 -12941 -22606 -32323 -34479 -29248 -14336 882 13408
7208 13408 37489 45142 29291 11378 5425 12101 11137 4793 9294 4188 2668 -7129 -21427 -18009
7194 -18009 -18914 -9165 7987 21299 -6727 -17465 -9570 -1628 -5388 -12044 -12813 -18276 -22746 -30295
7180c0295o082J2809m335N00j1996K924K2217M673R789O566J3062j2518q661j815
7166c162M012P352J30j1818l075J994N3N88j675k925P945j316j4695j5907J3033
7151a9466j38n697J0730K069J081j024J5376M662j260n918R713N276P808J096
7137B4308k9767j7694L653Q114K635J0679j747L331J4339Q014j0051J1566j3505
7124A3875k0545L066K918p599N179K8230J0685j0427j5937l173K197o361j634
7111D74P522J0132j0163j7814J584K1205N546N546q893j8392n403J9197n437j5590
7097a0486L049k876Q674q059j6213Q846Q526j9668J5693J6068m206J5182j1998
7084B532j459J3418m295l8002P803R785L525l666l415r710q154M19lr92R946Q601
$$ plain form
7180 -30295 -36377 -23568 -27903 -27403 -39399 -36475 -14258 -9585 204 6770 19832 7314 -1347 -3162
7166 -3162 850 8202 8332 -3486 -6561 -4567 -4514 -3926 -5601 -8526 -581 -1897 -16592 -32499 -19466
7151 -19466 -19604 -25301 -14571 -12502 -11421 -12445 2931 7593 6333 415 10128 15404 23212 24308
7137 24308 -5459 -23153 -19500 -11386 -8751 1928 181 3512 17851 25865 15814 27380 13875
7124 13875 -6670 -3604 -686 -8285 -3106 25124 35809 25382 9445 6272 8469 2108 474
7111 474 7996 18128 7965 -9849 -8265 12940 18486 24032 15139 -3253 -8656 10541 5104 -10486
7097 -10486 -7437 -10313 -1639 -9698 -25911 -17065 -8539 -28207 -12514 3554 -652 14530 2532
7084 2532 1073 14491 10196 -27806 -20003 -10218 -6693 -10359 -13774 -23484 -31638 -31219 -31222 -32214 -22268 -13667
7068a3667Q503k3521l687K0329J3822J7237J870J0777j0987N158m134j3219J2097
7055B0578K31j4431m14q49O416m015j0915J1140J1199p955j274J3007n64P219
7041B9373p456j2567n538p593r297j0749N068O418O54L242j1173j5461k0178R997
7027d5260K507J2820K8689K0785J1246p332k294j1247k1636k1103R25L993J1283
7014a6624q66j1520n270J4126J674J872R566R307o914j0704P71R945j1092j1556
7000b7285N389J6273J549k844N422j2643m775R892o486n492J3135O06Q887J1218
6986A2846j2845R53j438k0868j2171J3597K117l673J1445m734j9622J2142K4933
6973B682Q34k7535k3256O609K3043R183j978j2859r6k835P188L537j891J4887
$$ plain form
7068 -13667 -5164 -28685 -32372 -12043 1779 19016 20886 31663 20676 25834 21700 8481 20578
7055 20578 20809 6378 5964 5115 11531 7516 -3399 7741 18940 10985 9711 22718 22154 29373
7041 29373 21917 9350 3812 -3781 -13078 -23827 -18759 -12341 -11687 -8445 -19618 -35079 -55257 -45260
7027 -45260 -42753 -29933 -1244 19541 30787 23455 21161 9914 -11722 -32825 -31900 -27907 -16624
7014 -16624 -17490 -29010 -34280 -20154 -18480 -16608 -7042 2265 -4649 -15353 -14582 -4637 -15729 -27285
7000 -27285 -21896 -5623 -4074 -6918 -1496 -14139 -18914 -9022 -15508 -21000 -7865 -7259 1628 12846
6986 12846 1 954 -484 -21352 -33523 -19926 -17809 -21482 -10037 -14771 -34393 -22251 2682
6973 2682 3516 -24019 -47275 -40666 -17623 -8440 -10418 -23277 -23373 -26208 -19020 -15483 -17374 -2487
6959b487R586j2829j9987k8411K317m13K377j4640O556K3460K3921J7992k0493
6946a3051m248r152O344K7950K0290m916k5528M028J9066O580m089J4638p553
6933C0359j4640J0020j1247j6221j855N974j6491J4933R058n315l4p290J068p135
6919h816r712J4761j377L521P870J0445Q568k028l4901j8573Q445J2598J1048
6906A849J99o759Q246N556P754j313J119K757L94J400n395j4000M905J354J0110
6891A8176L031l7904r128N599J561O545J4311Q455O833k542l951j5025K8427J8323
6877D2711o700n227m231j2873q9j899m111o962r776J085r63k476P053J222J4006
6862A0770J0158j4079j4880K552m742J479M687n20J6614m99k3348m166J5240n147
$$ plain form
6959 -2487 7099 -5730 -25717 -54128 -51811 -52224 -49847 -64487 -57931 -34471 -10550 7442 -13051
6946 -13051 -17299 -26451 -20107 7843 28133 23217 -2311 1717 20783 27363 23274 37912 30359
6933 30359 15719 25739 14492 -1729 -3584 2390 -14101 832 9890 4575 4541 -2749 -1681 -8816
6919 -8816 -18528 -3767 -5144 -1623 6247 16692 25260 23232 -11669 -30242 -21797 -9199 1849
6906 1849 2048 -4711 3535 9091 16845 15532 16651 19408 19802 21202 15807 1807 6712 8066 18176
6891 18176 21207 -16697 -25825 -20226 -18665 -12120 2191 10646 17479 14937 10986 -4039 24388 42711
6877 42711 36011 30784 26553 13680 13591 11692 7581 619 -9157 -8072 -9035 -11511 -4458 -3236 10770
6862 10770 20928 6849 -8031 -5479 -10221 -8742 -4055 -4575 12039 11540 -11808 -15974 -734 -5881
6848e881L652M815J495k361n975j0877n086O075L514R165K723l464n64k717L413
6833b073J1298j302k0668j854j6122J6829k535n003P305n995J1520P222o194N399
6819b173L958r26J0339L45r610L702M585K14L324q258j7825J3671M559j7560l245
6804a4900J3680J4391j3698L694j1406k3094R058K2439K88O911P975k938j1709
6791F91k0683j4207L725J8401J5830q10r524K3983K7812K4134O875p790j1648
6778E6789l8776k185L015j0946k750m599k879K443P796P968l313p477J859J6873
6764B3818J6247j2324l140j0014j6011J0747L136q135m763j2758j4011L592J5584
6751h032K0631K1143J8423L3098J0312L336j6697M38Q129k4159p442K505J0919
$$ plain form
6848 -5881 -2229 2586 4081 1720 -4255 -15132 -20218 -14143 -10629 -1464 1259 -2205 -2769 -5486 -2073
6833 -2073 9225 7923 -12745 -14599 -30721 -13892 -16427 -21430 -14125 -20120 -8600 -1378 -7572 -2173
6819 -2173 1785 859 11198 11543 1933 5635 10220 10434 13758 5500 -12325 1346 5905 -11655 -14900
6804 -14900 -1220 13171 -527 3167 -8239 -31333 -22275 164 452 7363 15338 12400 691
6791 691 -19992 -34199 -30474 -12073 3757 2947 -6577 17406 45218 69352 76227 68437 56789
6778 56789 18013 15828 18843 7897 5147 548 -2331 112 7908 15876 12563 5086 6945 23818
6764 23818 40065 27741 24601 14587 -1424 9323 12459 4324 -439 -13197 -27208 -23616 -8032
6751 -8032 12599 33742 52165 85263 95575 98911 82214 82652 90781 66622 59180 61685 72604
6738G2604O548J4068M466j2846K308J0101R033K9935K6693N0539Q2902J09464
6726D05815J58915K90939L83065M07160K35391k32508n33014m26922k58235j50489
6716B80117q9803m8090k7219j5590j4848m120j0131l2953j3309N007p291L994
6704B5764l2p711k261J0352J3684K700P44q951m924n090j6899p194o17K5454K730
6689B7749j1460j4144L328J2781P856R176J6759r327q08p866j0132j576j4335
6676H001l362M252J4543P976k2302L783P688N555J575r645q107q940j139J3968
6662A3846k524n962o886j567j9362p424O468J1715L291J0687j5524J10P604R814
6648D286n260L55J1502j697N008k471p696M709j761m7n394j0076j7034j0481K0290
$$ plain form
6738 72604 79152 93220 97686 84840 87148 97249 106282 136217 162910 213449 296351 405815
6726 405815 564730 855669 1238734 1645894 1881285 1648777 1115763 688841 430606 280117
6716 280117 190314 142224 115005 99415 84567 80447 70316 37363 24054 29061 21770 25764
6704 25764 25732 18021 15760 26112 39796 42496 43240 34289 29365 24275 7376 182 -435 25019 27749
6689 27749 16289 2145 5473 18254 26110 35286 52045 42718 41910 34044 23912 22336 8001
6676 8001 4639 8891 23434 31410 9108 12891 20579 26134 27709 18064 9957 1017 -122 13846
6662 13846 11322 5360 -1526 -3093 -22455 -29879 -23411 -11696 -8405 2282 -13242 -13132 -5528 4286
6648 4286 -974 -619 10883 9186 14194 11723 4027 8736 6975 6928 1534 -8542 -25576 -36057 -15767
6633a5767J3025l970J3997J039k0975P994J0677j3687j2085K332p466q304J4116
6620a9074J3827P74O129l540j1282j5840J0888O335Q213l237K790J506o202J6074
6606G361R285k2393o415J84j7358j1813N082J488K3413L3777K674p879k3678r250
6592a5522J5617J4346J6222J179o141l243K880N320k0105n722K280j7635J257
6579i267j4465J0459m167J3961K1347j036N529j4080j0933J5949o804p036m283
6566d826M380j1673k5352j1783M1068K1637p706p263r089j1100J728J4040m144
6553a0083ON074r832Q321J6650j0485j0047o725N63J2149o86j3086m400j4125
6539c6706J1676L193n009J2265P850M763k165r733J181J4498K0794j6547k557
$$ plain form
6633 -15767 -2742 -6712 7285 8324 -12651 -4657 6020 -7667 -19752 -17420 -24886 -33190 -19074
6620 -19074 -5247 -4473 1656 -1884 -13166 -29006 -18118 -11783 -3570 -6807 -4017 -2511 -8713 7361
6606 7361 16646 -5747 -12162 -11978 -29336 -41149 -36067 -34579 -11166 22611 25285 17406 -6272 -15522
6592 -15522 95 14441 30663 31842 25701 22458 25338 30658 10553 4831 7111 -10524 -9267
6579 -9267 -23732 -13273 -17440 -3479 17868 16832 22361 8281 -2652 13297 6493 -543 -4826
6566 -4826 -446 -12119 -37471 -49254 -8186 13451 5745 -1518 -10607 -21707 -19979 -5939 -10083
6553 -10083 -10077 -5003 -14835 -6514 10136 -349 -10396 -17121 -16558 -4409 -5095 -18181 -22581 -36706
6539 -36706 -25030 -21837 -26846 -14581 -6731 -1968 -4133 -13866 -12685 1813 22607 6060 3503
6526C503O015J7798j6716j8013R429L0269K259j2568P73j6041q806j339j0075
6513a3512q233P026j1741M984Q269Q919K753N727J3904J1132j4246P294N734j9259
6499H751j4733P249L542p999J736r990k980J0540J4773l249j9155J8439K735j5241
6485e582r279J4087J3795R707P739j1702j4102j4881j654M088N072N747m43j7314
6471a4722j65o972J3832j052j9353j3487P357J2724J7477j83J2879Q660j5447
6458A548m322N343l529j0279r9l589K99J1605N606n083L292q124k637q632M956
6443a3645J1751M250K4322O609l0764j2216m072J8914o5P341M555m46Q813j5013
6429A0334j6178O694L173q921m392r875j1553K5942J5226p260j8096Q557J3900
$$ plain form
6526 3503 9518 27316 10600 -7413 2016 32285 34544 21976 22749 6708 -2098 -3437 -13512
6513 -13512 -21745 -14719 -26460 -21476 -13207 -4288 -1535 4192 18096 29228 14982 22276 28010 8751
6499 8751 -5982 1267 4809 -3190 -1454 -11444 -14424 -3884 10889 7640 -11515 6924 9659 -5582
6485 -5582 -14861 -774 13021 22728 30467 18765 4663 -10218 -11872 -7784 -2712 3035 2592 -14722
6471 -14722 -14887 -21859 -8027 -9079 -28432 -41919 -34562 -21838 -4361 -4544 8335 16995 1548
6458 1548 -2774 2569 -960 -11239 -11338 -14927 -14628 -3023 2583 -2500 792 -7332 -9969 -18601 -13645
6443 -13645 -1894 2356 26678 33287 2523 -9693 -13765 5149 5084 12425 16980 16534 25347 10334
6429 10334 -5844 850 4023 -4898 -9290 -19165 -30718 -4776 10450 3190 -14906 -6349 7551
6416G551r06K739m346q908J4586M687m406j8391M366J5715r426j1741N49O398
6402a533P107k551m925m876R650L967j0806j251J401Q446l755K347J3533l02J0310
6387B6762j551j1115q002k7159N099J7319q903r203Q928Q91k704K3561j239n460
6373G224p698j546j9147j0952m838K0590M292L600J7207nQ385J7527j530j0011
6359B3098j8785p202J6147M928O07p770q328j6294M224K0228l553J164J1132p250
6345A2346j6749j2173J8445J3626j7855o446j0768M696k27l677L081r425K242
6332b2884K989j679J0022l654P422J0569j3649j2552m878Q998J8224q115m984
$$ plain form
6416 7551 6645 9384 5038 -3870 10716 15403 10997 -7394 -3028 12687 3261 -8480 -7931 -1533
6402 -1533 5574 3023 -1902 -6778 2872 6839 -3967 -5218 -3817 4629 874 3221 16754 16452 26762
6387 26762 25211 14096 6094 -21065 -15966 1353 -7550 -16753 -7825 -6934 -9638 13923 12684 7224
6373 7224 -474 -2020 -21167 -32119 -36957 -16367 -12075 -8475 8732 8727 17112 34639 33109 23098
6359 23098 4313 -2889 13258 18186 18793 11023 2695 -13599 -9375 10853 7300 8464 19596 12346
6345 12346 -4403 -16576 1869 15495 -2360 -8806 -19574 -14878 -15105 -18782 -15701 -25126 -22884
6332 -22884 -19895 -21574 -11552 -15206 -7784 2785 -10864 -23416 -28294 -19296 -1072 -9187 -14171
$$ [...]
##END NTUPLES=NMR SPECTRUM
##END=
