##TITLE=Analysis number 328882
Compound Code cc 62113
Book Reference 540/10
Project Code adrs
Chemist Name mikem
##JCAMPDX= 6.0         $$ Bruker NMR JCAMP-DX V2.0
##DATA TYPE= NMR SPECTRUM
##DATA CLASS= NTUPLES
##ORIGIN= Bruker BioSpin GmbH
##OWNER= nmr
$$ XWIN-NMR		Version 3.5
$$ Thu Jul 12 13:13:16 2007 GMT Daylight Time (UT+1h)  MAYBRIDGE\nmr@NMR_250MHZ
##.OBSERVE FREQUENCY= 250.131544655141
##.OBSERVE NUCLEUS= ^1H
##.ACQUISITION MODE= SIMULTANEOUS (DQD)
##.ACQUISITION SCHEME= undefined
##.AVERAGES= 16
##.DIGITISER RES= 18
##SPECTROMETER/DATA SYSTEM= dpx250
##.PULSE SEQUENCE= zg30
##.SOLVENT NAME= CDCl3
##.SHIFT REFERENCE= (INTERNAL, CDCl3, 0, 16.522)
##AUDIT TRAIL= $$ (NUMBER, WHEN, WHO, WHERE, WHAT)
$$ ##TITLE= Audit trail, XWIN-NMR		Version 3.5
$$ ##JCAMPDX= 5.01
$$ ##ORIGIN= Bruker BioSpin GmbH
$$ ##OWNER= nmr
$$ C:\u/data/dgb/nmr/ADRS/860/pdata/1/auditp.txt
$$ ##AUDIT TRAIL=  $$ (NUMBER, WHEN, WHO, WHERE, WHAT)
(   1,<2007-07-12 13:12:52.37 +100>,<MAYBRIDGE\nmr>,<NMR_250MHZ>,
      <created by zg, POWCHK disabled, PULCHK disabled
       configuration hash MD5:
       76 6E 9A 78 1E 09 19 81 EC 84 63 8F B0 6A 59 2D
       data hash MD5: 64K
       51 F4 10 3A 36 2C 6A BF 99 40 AA BD 06 D0 56 DA>)
(   2,<2007-07-12 13:13:05.53 +100>,<MAYBRIDGE\nmr>,<NMR_250MHZ>,
      <Start of raw data processing
       ef LB = 0.3 FT_mod = 6 PKNL = 1 SI = 32K 
       data hash MD5: 32K
       BC 8F EC 99 70 A9 85 8C BF 2B D4 EA 0B 2B 6A D4>)
(   3,<2007-07-12 13:13:07.17 +100>,<MAYBRIDGE\nmr>,<NMR_250MHZ>,
      <apk 
       data hash MD5: 32K
       32 BF 43 55 7B B3 64 83 0D 1A FB 1F 7C B4 CE 0E>)
(   4,<2007-07-12 13:13:07.87 +100>,<MAYBRIDGE\nmr>,<NMR_250MHZ>,
      <abs ABSG = 5 
       data hash MD5: 32K
       5B 07 EC 4A F6 F5 F6 8A B4 45 61 3D DD 66 65 45>)
$$ ##END=
$$ 
$$ hash MD5
$$ 0E 21 91 77 68 4F 16 27 ED DA E5 35 79 FD AF 37
##$RELAX= 
##$RELAX= 
##$RELAX= 
##$RELAX= 
##$RELAX= 
##$RELAX= 
##$RELAX= 
$$ Bruker specific parameters
$$ --------------------------
##$DU= <C:\u>
##$EXPNO= 860
##$NAME= <ADRS>
##$PROCNO= 1
##$TYPE= <nmr>
##$USER= <dgb>
##$AMP= (0..31)
100 100 100 100 100 100 100 100 100 100 100 100 100 100 100 100 100 100 
100 100 100 100 100 100 100 100 100 100 100 100 100 100 
##$AQSEQ= 0
##$AQ_mod= 3
##$AUNM= <au_zg>
##$AUTOPOS= <18 >
##$BF1= 250.13
##$BF2= 250.13
##$BF3= 250.13
##$BF4= 250.13
##$BF5= 500.13
##$BF6= 500.13
##$BF7= 500.13
##$BF8= 500.13
##$BYTORDA= 1
##$CFDGTYP= 0
##$CFRGTYP= 5
##$CHEMSTR= <none>
##$CNST= (0..31)
1 1 145 1 1 1 1 1 1 1 1 1 1 1 1 1 1 1 1 1 1 1 1 1 1 1 1 1 1 1 1 1 
##$CPDPRG= <>
##$CPDPRG1= <>
##$CPDPRG2= <>
##$CPDPRG3= <>
##$CPDPRG4= <mlev>
##$CPDPRG5= <mlev>
##$CPDPRG6= <mlev>
##$CPDPRG7= <mlev>
##$CPDPRG8= <mlev>
##$CPDPRGB= <>
##$CPDPRGT= <>
##$D= (0..31)
0 1 0 0 0 0 0 0 0 0.06 0 0 0 0 0 0 0.0002 0 0 0 0 0 0 0 0 0 0 0 0 0 0 
0 
##$DATE= 1184242371
##$DBL= (0..7)
120 120 120 120 120 120 120 120 
##$DBP= (0..7)
150 150 150 150 150 150 150 150 
##$DBP07= 0
##$DBPNAM0= <>
##$DBPNAM1= <>
$$ [...]
##$SUBNAM7= <"">
##$SUBNAM8= <"">
##$SUBNAM9= <"">
##$SW= 20.6930455092707
##$SWIBOX= (0..15)
0 0 3 0 0 0 0 0 0 0 0 0 0 0 0 0 
##$SW_h= 5175.983436853
##$TD= 65536
##$TD0= 1
##$TE= 297.16
##$TE2= 300
##$TE3= 300
##$TEG= 300
##$TL= (0..7)
0 120 120 120 120 120 120 120 
##$TP= (0..7)
150 150 150 150 150 150 150 150 
##$TP07= 0
##$TPNAME0= <>
##$TPNAME1= <>
##$TPNAME2= <>
##$TPNAME3= <>
##$TPNAME4= <>
##$TPNAME5= <>
##$TPNAME6= <>
##$TPNAME7= <>
##$TPOAL= (0..7)
0.5 0.5 0.5 0.5 0.5 0.5 0.5 0.5 
##$TPOFFS= (0..7)
0 0 0 0 0 0 0 0 
##$TUNHIN= 0
##$TUNHOUT= 0
##$TUNXOUT= 0
##$USERA1= <user>
##$USERA2= <user>
##$USERA3= <user>
##$USERA4= <user>
##$USERA5= <user>
##$V9= 5
##$VALIST= <valist>
##$VCLIST= <CCCCCCCCCCCCCCC>
##$VD= 0
##$VDLIST= <DDDDDDDDDDDDDDD>
##$VPLIST= <PPPPPPPPPPPPPPP>
##$VTLIST= <TTTTTTTTTTTTTTT>
##$WBST= 1024
##$WBSW= 4
##$XGAIN= (0..3)
0 0 0 0 
##$XL= 0
##$YL= 0
##$YMAX_a= 347151
##$YMIN_a= -265369
##$ZGOPTNS= <>
##$ZL1= 120
##$ZL2= 120
##$ZL3= 120
##$ZL4= 120
##$ABSF1= 16.522
##$ABSF2= -4.171173
##$ABSG= 5
##$ABSL= 3
##$ALPHA= 0
##$AQORDER= 0
##$ASSFAC= 0
##$ASSFACI= 0
##$ASSFACX= 0
##$ASSWID= 0
##$AUNMP= <proc_1d>
##$AZFE= 0.1
##$AZFW= 0.1
##$BCFW= 0
##$BC_mod= 0
##$BYTORDP= 0
##$COROFFS= 0
##$CY= 12.5
##$DATMOD= 1
##$DC= 0
##$DFILT= <>
##$DTYPP= 0
##$F1P= 14.0000005364418
##$F2P= -0.99999901652339
##$FCOR= 0.5
##$FTSIZE= 32768
##$FT_mod= 6
##$GAMMA= 0
##$GB= 0
##$INTBC= 1
##$INTSCL= 1
##$ISEN= 128
##$LB= 0.3
##$LEV0= 0
##$LPBIN= 0
##$MAXI= 10000
##$MC2= 0
##$MEAN= 0
##$ME_mod= 0
##$MI= 0
##$NCOEF= 0
##$NC_proc= -3
##$NLEV= 6
##$NOISF1= 0
##$NOISF2= 0
##$NSP= 0
##$NTH_PI= 0
##$NZP= 0
##$OFFSET= 16.522
##$PC= 1
##$PHC0= -53.45341
##$PHC1= 7.596821
##$PH_mod= 1
##$PKNL= yes
##$PPARMOD= 0
##$PSCAL= 4
##$PSIGN= 0
##$REVERSE= no
##$SF= 250.13
##$SI= 32768
##$SIGF1= 0
##$SIGF2= 0
##$SINO= 400
##$SIOLD= 32768
##$SREGLST= <1H.CDCl3>
##$SSB= 0
##$STSI= 32768
##$STSR= 0
##$SW_p= 5175.98343685301
##$SYMM= 0
##$S_DEV= 0
##$TDeff= 65536
##$TDoff= 0
##$TI= <Analysis number 999999
Compound Code 99
Book Reference 9
Project Code 9>
##$TILT= no
##$TM1= 0
##$TM2= 0
##$TOPLEV= 0
##$USERP1= <user>
##$USERP2= <user>
##$USERP3= <user>
##$USERP4= <user>
##$USERP5= <user>
##$WDW= 1
##$XDIM= 32768
##$YMAX_p= 268210842
##$YMIN_p= -70808
$$ End of Bruker specific parameters
$$ ---------------------------------
##NTUPLES= NMR SPECTRUM
##VAR_NAME=  FREQUENCY,     SPECTRUM/REAL,   SPECTRUM/IMAG
##SYMBOL=    X,             R,               I
##VAR_TYPE=  INDEPENDENT,   DEPENDENT,       DEPENDENT
##VAR_FORM=  AFFN,          ASDF,            ASDF
##VAR_DIM=   32768,         32768,           32768
##UNITS=     HZ,            ARBITRARY UNITS, ARBITRARY UNITS
##FACTOR=    0.157963299565203, 1,           1
##FIRST=     4132.6476996994, 0,             0
##LAST=      -1043.33573715361, 0,           0
##MIN=       -1043.33573715361, -70808,      0
##MAX=       4132.6476996994, 268210842,     0
$$ Real data points
##PAGE= N=1
##DATA TABLE= (X++(R..R)), XYDATA
$$ [...]
18472B3404034m570431m314322l652597k827233j979813j323871q71296n81787
18464C282684m11215l05051k18546j70670j26382j20353j31230j20264n8179r144
18454A611650j2215p041k1583N071L9009K6286M914M7007J06576J48631K34985
18443B183290L32779N66993R23731J506943K267279K800780K517919J107304j026666
18434A3180352j998399k119764j278224q2294J139436K077043K230432J405847
18426A4554429p37849k288272k816348k493775j772015j190847p81842n02402
18418A971079l41824k27680j54023j00680n8986o4891p2934p1797o6414l4554
18408G77296p191k1671Q868K3013K8441k2346n8843m9034j2K5835J5289k1105
$$ plain form
18472 23404034 18833603 14519281 10866684 8039451 6059638 4735767 3864471 3282684
18464 3282684 2871469 2566418 2347872 2177202 2050820 1930467 1799237 1678973 1620794 1611650
18454 1611650 1599435 1592394 1570811 1575882 1614891 1641177 1646091 1693098 1799674 1948305 2183290
18443 2183290 2516069 3083062 4006793 5513736 7781015 10581795 13099714 14207018 13180352
18434 13180352 11181953 9062189 7783965 7701671 8841107 10918150 13148582 14554429
18426 14554429 13816580 11528308 8711960 6218185 4446170 3255323 2473481 1971079
18418 1971079 1629255 1401575 1247552 1146872 1087886 1022995 950061 878264 811850 777296
18408 777296 770105 748434 757302 780315 808756 786410 727567 678533 678521 704356 719645 698540
18396F98540n3907p9277m9946k6162j8665J78K888N779k1472l3789k4599Q353
18384D07921K3907L247k4020k5696O46r171j1961k6116j7179m225Q075P254J9491
18371C52173q953J032j1165K506l456J2028K4898L2644J3541j7056p982j4223
18359C75987L4347M1601O124J6139L4064j0943k6682p415Q390j412j107J1895
18347D80988r67L730Q809J4600K9580M7605J6218K8359J3539Q619p392j4756L9234
18334F68166L4280P2954M4649K5486N9481M5206O6135J01162J14618J56974K65755
18323A654866M01610N62673Q23973J309931J993783K620760K505561K286826J684867
18314A5844850m67784j528254j729198j864437j181203K2479J152799J514141
$$ plain form
18396 698540 644633 565356 515410 489248 470583 470761 473649 479428 457956 424167 399568 407921
18384 407921 431828 435075 411055 385359 386005 376834 364873 338757 321578 317353 325428 332682 352173
18371 352173 343220 344252 333087 335593 332137 344165 369063 401707 415248 398192 390210 375987
18359 375987 410334 451935 458059 474198 508262 497319 470637 463222 471612 470200 469093 480988
18347 480988 480021 483751 492560 507160 536740 584345 600563 628922 642461 651080 643688 628932 668166
18334 668166 702446 775400 820049 845535 905016 950222 1016357 1117519 1232137 1389111 1654866
18323 1654866 2056476 2619149 3443122 4753053 6746836 9367596 11873157 14159983 15844850
18314 15844850 15377066 13848812 12119614 10255177 9073974 9096453 10249252 11763393
18306A1763393J388494J522420O7770j718784j848865k129109k279623j800408
18298D965288j202414p61565m70475k90278j64978r9876q3920p2650o6191l1714
18288A721227k757J5152K8272M9127O1689J07979J35883J33716J53572K29883
18278B633743L38634M68176P26855J132887J760703K672542L593931M373889M870567
18269B2571927L556456K229839R04965k124484k957522k552929j894607k56638
18261A9477007J482888K782903K373061J204995N47535k442963m068510l842330
18253A7514586m039142l615552k587798j715533j115692p32846m97321l28871
18245B881831k17239j38497j19955o3489l9930j10773j31124p7499J917L9761
$$ plain form
18306 11763393 13151887 14674307 14742077 13023293 11174428 9045319 6765696 4965288
18298 4965288 3762874 3001309 2530834 2240556 2075578 1975702 1891782 1819132 1752941 1721227
18288 1721227 1718470 1733622 1761894 1811021 1872710 1980689 2116572 2250288 2403860 2633743
18278 2633743 2972377 3440553 4167408 5300295 7060998 9733540 13327471 17701360 22571927
18269 22571927 26128383 28358222 29263187 27138703 24181181 21628252 19733645 19477007
18261 19477007 20959895 23742798 26115859 27320854 27868389 25425426 21356916 17514586
18253 17514586 13475444 9859892 7272094 5556561 4440869 3708023 3210702 2881831
18245 2881831 2664592 2526095 2406140 2342651 2302721 2191948 2060824 1983325 1985242 2025003
18235B025003Q4965J11602P5360Q7892J66075K62731L93770O54608J047193J621425
18225F530624K385090K797911K574844K267306O03501j182178j706089j898644
18217A2372365j239221m9852J052512J723799J760115J664190L55476j629776
18209A6009608k081229k474930k521832j911919j388355j097042p87823m48901
18201C297577k54232j51993m2253N1444K4059M2956j2128p2072j28151j79981
18191B575226k10398k52079k24191j66123j18932o6692q2785n5431l7315m2498
18181A318782p9989p8441o1488k6225k026K2482J0395n151o3380p3173j3043M1930
18169I90673M3989o039N066K4266l2531j9983q1492j23860o6549p564K7510L4890
$$ plain form
18235 2025003 2109968 2221570 2296930 2384822 2550897 2813628 3207398 3862006 4909199 6530624
18225 6530624 8915714 11713625 14288469 16555775 17159276 15977098 14271009 12372365
18217 12372365 11133144 11083292 12135804 13859603 15619718 17283908 17639384 16009608
18209 16009608 13928379 11453449 8931617 7019698 5631343 4534301 3746478 3297577
18201 3297577 3043345 2891352 2849099 2900543 2924602 2967558 2955430 2883358 2755207 2575226
18191 2575226 2364828 2112749 1888558 1722435 1603503 1536811 1454026 1398595 1361280 1318782
18181 1318782 1238793 1160352 1098864 1072639 1070613 1093095 1103490 1098339 1034959 961786 948743 990673
18169 990673 1034662 1028623 1033689 1057955 1025424 1005441 923949 800089 733540 725976 753486 788376
18157G88376K5172M4678j1643p4124m6738o8342n2453j3430Q946k7451k4234k9860
18145E18897j6678L640M402J1192K3762J822L462k1803j5384K8822K2077J1793
18133E76004J578J5430M141K9891M5011M9275M7034N8693K7765J8508L1350K1220
18121I25900M9503J02337J42616J59076K23372L14033M46128O25468R77080J670472
18111E635985K950299N395887R978385J4332960K24213j3035800r672166n767529
18103A0042234l266710j889576j206852q02123m97788l46040k70822j79163j03892
18094A479268p7083m4028k1115k1806j0113K8706M6160M2988M9244O5591P7866
18083A615678R7730R7455J11827J29512J62375J88646K58211L64641N28180P53712
$$ plain form
18157 788376 813548 858226 846583 772459 725721 657379 604926 591496 600442 572991 548757 518897
18145 518897 502219 505859 510261 521453 545215 547037 550499 528696 513312 542134 564211 576004
18133 576004 577582 593012 597153 627044 672055 721330 768364 827057 854822 873330 904680 925900
18121 925900 975403 1077740 1220356 1379432 1602804 1916837 2362965 2988433 3965513 5635985
18111 5635985 8586284 13982171 23960556 38293516 38517729 25481929 15809763 10042234
18103 10042234 6775524 4885948 3679096 2876973 2379185 2033145 1762323 1583160 1479268
18094 1479268 1402185 1358157 1337042 1315236 1305123 1333829 1379989 1422977 1472221 1537812 1615678
18083 1615678 1713408 1810863 1922690 2052202 2214577 2403223 2661434 3026075 3554255 4307967
18073D307967J131192J789138K842774M310450N606366N721055M219825K223276
18065C2152043J419204P33119q94660k452312j760526K50252J796021J559387
18057C2802528J28915m16889r82378k462752m836793n697763n127765l743157
18049I663946k481770j617129j064825p10183m95275l41175k60528k23685j38344
18040B331032j03784q4372r7189n8395Q068J2936k0052J713K5895M8956P0085
18029B134893J15317J71619K98359M92326P67339J231197J972764L007015L920085
18020A4110914M035264K954460J609221P58964j45563j626710k255733j399903
18012A8040914L13324J524333J467984M70196k06798r04350k139512l504695l807188
$$ plain form
18073 4307967 5439159 7228297 10071071 14381521 19987887 25708942 29928767 32152043
18065 32152043 33571247 34304366 33409706 30957394 29196868 29447120 31243141 32802528
18057 32802528 32931443 32514554 31532176 29069424 24232631 18534868 13407103 9663946
18049 9663946 7182176 5565047 4500222 3790039 3294764 2953589 2693061 2469376 2331032
18040 2331032 2227248 2142876 2045687 1987292 1995360 2008296 1988244 1989957 2015852 2064808 2134893
18029 2134893 2250210 2421829 2720188 3212514 3979853 5211050 7183814 10190829 14110914
18020 14110914 18146178 21100638 22709859 23468823 23323260 21696550 19440817 18040914
18012 18040914 18354238 19878571 21346555 21816751 21609953 20705603 18566091 15061396 11254208
18003A1254208l230152k268515j484465r76523o28172m35472l01299k28164k18565
17994A482881j77626j18582r1251j00315o7416p6413o0744n3242m7899n3481m1074
17983E94838m4903n1621n8452m9212j8877O240J948O034J6290j3807K165r90k4046
17970C65607k5308j8406k5285J114Q344p634J4214j9679q060Q921j5455j4722
17958B63651q470k7515l6040k5420j9844k0851Q314J9256k417J1117J1147o638
17946A66290l0645q953p60r998j4896j2474J2079J1493K220j9834p862m915j2879
17933F8866R713Q074L781n510L292K813K107J0136J5973Q476k1526r756j2480
17920H3959k520p98l426j5192L738K0585R487o816L08k0489l934n037k1304k4249
$$ plain form
18003 11254208 8024056 5755541 4271076 3294553 2666381 2230909 1929610 1701446 1482881
17994 1482881 1305255 1186673 1095422 995107 927691 851278 790534 737292 689393 635912 594838
17983 594838 549935 498314 439862 390650 371773 378013 379961 385995 402285 388478 390643 389653 365607
17970 365607 340299 321893 296608 297722 306066 298432 312646 292967 284907 293828 278373 263651
17958 263651 255181 227666 191626 166206 146362 125511 133825 153081 150664 161781 172928 166290
17946 166290 135645 126692 125932 115934 101038 88564 100643 112136 114356 94522 86660 81745 68866
17933 68866 78579 86653 90434 84924 88216 91029 93136 103272 119245 127721 106195 96439 83959
17920 83959 81439 80641 77215 62023 65761 86346 95833 89017 89325 68836 64902 59865 38561 14312
17906A4312j8643j759R217J398R405P981p354j3767j307K8881P893m946J8615
17893D9926J3799k970q615l014j2007k2554K379K2946J6800M314l1479m0488k4763
17880c5726L021J9131M089M28K2813J805J3589j247j0129k4213n066j637j546
17867a4688O134k05Q589k821J8655l639j9103n25J7555m792o026k620m875J837
17853f524n631o811L264K3218P557K085J0363o742m542m888P035m273j6631m319
17839f839r993K1502J4084k4099j1248J4384M143j1919j1260J1019k9010n118
17827d4354J5742O443J6176K0389J5628k2270k2849K342K372j097Q809J6652K78
17814A4261k475j8954q030L362N150o400j7586J6315K8264l795j7343Q63K5195
$$ plain form
17906 14312 -4331 -6090 3127 4525 13930 21911 14557 790 -517 28364 36257 31311 49926
17893 49926 63725 60755 52140 49126 37119 14565 16944 39890 56690 61004 29525 -10963 -35726
17880 -35726 -32705 -13574 -9485 -9057 13756 15561 29150 27903 17774 -6439 -11505 -13142 -14688
17867 -14688 -8554 -8759 -170 -2991 15664 12025 -7078 -7603 9952 5160 -866 -3486 -8361 -6524
17853 -6524 -12155 -18966 -15702 7516 15073 17158 27521 20779 16237 11349 18384 14111 -2520 -6839
17839 -6839 -16832 4670 18754 -5345 -16593 -2209 1934 -9985 -21245 -10226 -39236 -44354
17827 -44354 -28612 -22169 -5993 14396 30024 7754 -15095 -12753 -10381 -11478 -2669 13983 14261
17814 14261 11786 -7168 -15198 -11836 -6686 -13086 -30672 -14357 13907 10112 -7231 -6368 18827
17801A8827J0009K2171K0080J5943l507M405j3709j6577j653O027r552o453J6964
17788F2975J0612Q255J7845k2222k0203j9099k8294j3554N523j9715j5921L065
17776c0733l80J7823Q353N599L389J4026n8r879m304P018j0395K007j5240O665
17762f109L186P271J2329M571K13K9735L7610J5319l833J8654J4109r573k7394
17749I6088L877Q102j0414j0852O271p517J1153K0686M925N54j629j3867r777
17736I7600l234j6591j0324j2528j8904J556Q570j3222k0628j585o55m406j0012
17723d363J429n036m156J0914J8022M541j7061Q800j3942J0338Q290O091P09M686
17709B9262K4859M856k076n794j4571j0620r276J5200L974k1686r67J8239J9258
$$ plain form
17801 18827 28836 51007 71087 87030 83523 87928 74219 57642 55989 62016 52464 46011 62975
17788 62975 73587 81842 99687 77465 57262 38163 9869 -3685 1838 -17877 -33798 -30733
17776 -30733 -31113 -13290 -4937 662 4051 18077 18019 8140 3836 10854 459 2466 -12774 -6109
17762 -6109 -2923 4348 16677 21248 21461 51196 88806 104125 100292 118946 133055 123482 96088
17749 96088 99965 108067 97653 86801 93072 85555 96708 117394 122319 122873 121244 107377 97600
17736 97600 94366 77775 67451 54923 36019 37575 46145 32923 12295 10710 10055 5649 -4363
17723 -4363 -2934 -7970 -12126 -1212 16810 21351 4290 13090 -852 9486 17776 23867 24576 29262
17709 29262 54121 58977 56901 51107 36536 25916 16640 31840 35814 14128 13161 31400 50658
17696E0658K5439J2868j1075p658Q295K79j2727j8335j6987l56J3783J9006n468
17683E7722j3022j1901j3810k1063K839K2173J5378K129p165o137k2450k148J5555
17670A8100K2091J1830N458J8924K9671N3674P4561R4448Q4379Q3743J20252J52315
17658G69446J32994K965m8692J4425M9621k7227j33997j47244j06270q5184q2862
17647C37975p3409n3971n6133n0121j8572j1842l977j742q950k0917j1834P004
17635C3511J0561K546j9580j1710J5048N531q784k3804q468r846o042K0691j616
17622a962O795R331j0442j4132J2197J3171p017j4893j3087M548J5639R60N246
17609F354J7096j1507j0706M447P652r767l1664j5287J2285J2745l101n985j092
$$ plain form
17696 50658 76097 88965 77890 70232 78527 78806 66079 47744 30757 30401 44184 63190 57722
17683 57722 44700 32799 18989 -2074 765 22938 38316 40445 33280 27143 4693 2545 18100
17670 18100 40191 52021 57479 76403 106074 159748 234309 328757 413136 496879 617131 769446
17658 769446 902440 905405 856713 871138 920759 893532 759535 612291 506021 420837 337975
17647 337975 264566 210595 154462 104341 85769 73927 69950 68208 59258 38341 26507 33511
17635 33511 44072 46618 27038 15328 30376 35907 27123 3319 -5149 -14995 -21037 -346 -1962
17622 -1962 4833 14164 3722 -10410 1787 14958 7941 -6952 -20039 -15491 148 1108 6354
17609 6354 23450 11943 1237 5684 13336 3569 -28095 -43382 -31097 -18352 -21453 -27438 -28530
17596b8530j284l944o349j885q793K1970K8811r328k1910j7002J3765j0054j449
17583d5982K742K6211J7260q659q776J2837Q285p588m161R580R825k5493j4990
17570b8909N423o289j4815M474J6457L1578q62K7892J2413m168K5674J7940L1219
17557A18027J5075R818j7559j7287Q061J562K4468M746j0154N365k5803j9505
17545I6814p995k0018l4814k0842J3255J6915k4912o8o271k3690l469J0111j4514
17532a9498p419K918J0890J3656J8267k0422K98K4884J4734r112q135j024K135
17519B2172J650O169j365r398J9292J9617K3144K8615Q502o715J2631J357j4707
17506A10964l583J4819J0354K45j4659j1587q895l536K958r062k0109P040J7367
$$ plain form
17596 -28530 -29814 -33758 -40107 -41992 -50785 -28815 -4 -9332 -31242 -48244 -34479 -44533 -45982
17583 -45982 -43240 -17029 231 -8428 -17204 -4367 3918 -3670 -7831 1749 11574 -13919 -28909
17570 -28909 -23486 -29775 -44590 -40116 -23659 7919 7057 34949 47362 43194 68868 86808 118027
17557 118027 133102 142920 125361 108074 116135 117697 142165 146911 136757 142122 116319 96814
17545 96814 88819 68801 33987 13145 26400 43315 18403 18335 12064 -11626 -15095 -4984 -19498
17532 -19498 -26917 -23999 -13109 547 18814 -1608 -1310 23574 38308 29196 21061 20037 22172
17519 22172 23822 29991 28626 19228 38520 58137 81281 109896 118398 111683 124314 125671 110964
17506 110964 107381 122200 132554 132799 118140 106553 97658 94122 97080 88018 67909 74949 92316
17493I2316K7996K9135N7083O2663P5045O1624L7642k137j1959j7454l1664n9530
17481C20760n5295m8368n3062n2642l1759k9607k1243j8063k146M685K527p870
17469G917n913m22j0375M622K5461J6831j2899k6344r8j2345Q014m613j4591r542
17455c4297K0174K0955M715p805j3912j5586K4980J3604j821O578J5072J6500
17443D9157L0661P6714L2283n9506n4911m2029k9115n86J3519J3814K910j4278
17431A8633j8007o334K3174j282k094j2399J4256n745j6903Q049P631n158o549
17418b728p666O695J0324j469r90J1265N76k1731L596J6334J1348j351N498K275
17404C1976k7604J081L748j2230p309Q791q418j7637L701J1486P84J896K4263
$$ plain form
17493 92316 120312 149447 206530 269193 344238 405862 443504 441367 429408 411954 380290 320760
17481 320760 265465 217097 164035 111393 79634 50027 28784 10721 8575 13260 15787 7917
17469 7917 2004 1582 -8793 -4171 21290 38121 25222 -1122 -1220 -13565 -5551 -10164 -24755 -34297
17455 -34297 -14123 6832 11547 3742 -10170 -25756 -776 12828 11007 17585 32657 49157
17443 49157 79818 156532 188815 129309 74398 32369 3254 2668 16187 30001 32911 18633
17431 18633 626 -5708 17466 16184 14090 1691 15947 10202 -6701 1348 8979 3821 -2728
17418 -2728 -10394 -3699 6625 5156 4166 15431 16007 -5724 -2128 14206 25554 24203 29701 31976
17404 31976 4372 5453 9201 -3029 -10338 -1547 -9965 -27602 -23901 -12415 -11631 -9735 14528
17391A4528J3975j148l503k2196m295j546M637J0118l133o035l29N991L896m062
17377F898L506q433q054l898J753J1775Q311k247j165j1003l159l174N442n614
17363i062j5386l295K1530K4520k682J80J2366K932N995J169R946o620j2259p312
17349B2022Q195M354j027j1086n630p71N574k8072j0398K055j2437P229l972o892
17335c0856L3560L724L000o575m574R256J1849J3411k0057j8124O556O523l251
17322D442k7648j527J7343k196n873J053o715j2664L156j2429O935J0426K7377
17309A680K864M170l050l559J1030p384L237Q591P485k522N187j0661r570o551
17295I47J1142K1824o656k3128k2388l287J3975L517m209r623n537Q207L2567
$$ plain form
17391 14528 28503 27355 23852 1656 -2639 -4185 452 10570 7437 1402 1073 7064 10960 6898
17377 6898 10404 1971 -6083 -9981 -8228 3547 11858 9611 8446 -2557 -5716 -8890 -3448 -9062
17363 -9062 -24448 -27743 -6213 18307 15625 15805 28171 31103 37098 38267 48213 41593 29334 22022
17349 22022 30217 34571 33544 22458 16828 16057 21631 -6441 -16839 -14784 -27221 -19992 -23964 -30856
17335 -30856 2704 6428 9428 2853 -1721 7535 19384 32795 12738 -5386 1170 7693 4442
17322 4442 -23206 -24733 -7390 -9586 -15459 -14406 -21121 -33785 -30629 -43058 -36123 -25697 1680
17309 1680 4544 8714 5664 2105 13135 5751 8988 17579 25064 22542 27729 17068 7498 947
17295 947 12089 33913 27257 4129 -18259 -21546 -7571 -4054 -8263 -17886 -23423 -15216 17351
17282A7351J9210j6788k2323j1775J3035J4170j0574P760j222j1359Q07K0131
17270A8423k3862l6856J65L5210N912P581J391j0198k1523n262R423J174N039
17257a3383q878m61L620P206k619O884J5976J3372n798j3703J5484J669j3676
17244E693j0142r426j163J196O889J0282k4071n913N665J3999Qo980j757k401
17230a8121Q64N458J125j5409J4888J2804k413j1443r225j1731J1662K4730O778
17217I967R249k993j8319k356O768J9161p000k243r319q721M243k085L760j1472
17203a1360k271K0730j5245L814R784L4549L8563M1157K3637K5698O5666O7518
17191C02240J0834r318m672j1057m8281m1139k8879l9475l5692j7865k462L942
$$ plain form
17282 17351 36561 19773 -2550 -14325 -1290 12880 2306 10066 8844 -2515 -1708 18423
17270 18423 -5439 -42295 -42130 -6920 -1008 6573 7964 -2234 -23757 -29019 -19596 -18422 -13383
17257 -13383 -22261 -22722 -19102 -11896 -14515 -7631 8345 21717 15919 2216 17700 19369 5693
17244 5693 -4449 -13875 -15038 -13842 -6953 3329 -20742 -26655 -20990 -6991 -6983 -13963 -15720 -18121
17230 -18121 -17257 -11799 -10674 -26083 -11195 1609 -804 -12247 -21472 -33203 -21541 3189 9967
17217 9967 19216 16223 -2096 -4452 2316 21477 14477 12234 2915 -5806 -1563 -3648 112 -11360
17203 -11360 -13631 7099 -8146 -4332 5452 40001 78564 119721 143358 169056 234722 302240
17191 302240 313074 303756 299084 288027 239746 198607 169728 130253 94561 76696 74234 78176
17179G8176K0083k4125r348p968J0618M180K046P661l465l095P64j0717j9260
17166D5550l539J0828j7785k0638p551P454J8580L325l1131n231J6331L1831j0695
17153C7329j7069q214j4199K139j2664j4366J3803J9j5607O648K164J1361K738
17140e918j7327q284l017L183L4519K0068j994k740l73L350j7454j0739O677j1333
17126a1382L844M854q528q435r445Q819J408K0743K3820N773q197j6564j2676
17113e966j0085P109K8031L692R488O785p486k7039n698N261p998K0738K77N290
17099B2399M301p528K507M221j0495m99j3463J4632K0879p505o850k079n571J7180
17085C2129j7495K950J3536l656J708l802j385j3960L884M631P552L088K105j4669
$$ plain form
17179 78176 98259 74134 64786 56818 67436 71616 73662 81323 77858 74763 75527 64810 45550
17166 45550 42011 52839 35054 14416 6865 14319 32899 36224 5093 -138 16193 48024 37329
17153 37329 20260 12046 -2153 -14 -12678 -27044 -13241 -13222 -28829 -22181 -20017 -8656 -5918
17140 -5918 -23245 -31529 -34546 -31363 3156 23224 21230 18490 18117 21467 4013 -6726 -49 -11382
17126 -11382 -7538 -2684 -11212 -19647 -29092 -20273 -18865 1878 25698 31471 23274 6710 -5966
17113 -5966 -16051 -8942 19089 22781 32269 39054 31568 4529 -1169 4092 -3906 16832 17109 22399
17099 22399 26700 19172 21679 25900 15405 14906 1443 16075 36954 29449 22599 20520 14949 32129
17085 32129 14634 17584 31120 27464 29172 25370 23985 10025 13909 18540 26092 29180 31285 16616
17071A6616J9700K1016l097j0970J0445J5119J524m675N528P399J673k1718j2107
17058D6453j309j582J0704L657J0983J6530Q03J7629Q452j728n387k933j6138
17045H6134m613K1787r814l4740j6392J0631o607o555K405L239o556P395R331
17032E5645k597j4052l573J713J1612N237P106r054j3654L81L673R344K203l320
17018E0664K827J6123L833j3025M444N339K1838q484k4150l253K5638J2555P357
17005A01706l776J880O408M305N426J8630m357P859l904J6947J7737j1342q258
16992A49261m001J1683M822O178L9096K5093L946n256L682N398j4919k007K4929
16979B47905N059j9362L492J2362k052o16J5180j541J357J0879J3205k06N081
$$ plain form
17071 16616 36316 57332 54235 43265 53710 68829 70353 65678 71206 78605 80278 58560 46453
17058 46453 45144 43562 54266 57923 68906 85436 86239 103868 112320 110592 105205 102272 86134
17045 86134 81521 103308 93494 58754 42362 52993 46386 39831 42236 45475 38919 46314 55645
17032 55645 53048 38996 35423 37136 48748 53985 61091 52037 38383 38764 42437 51781 53984 50664
17018 50664 53491 69614 73447 60422 64866 70205 92043 83559 59409 56156 81794 94349 101706
17005 101706 97930 99810 106218 110523 115949 134579 130222 138081 134177 151124 168861 157519 149261
16992 149261 145260 156943 161765 167943 207039 232132 236078 230822 234504 239902 224983 222976 247905
16979 247905 252964 233602 237094 249456 247404 246788 261968 260427 261784 272663 285868 285662 290743
16966B90743J8585J8101K1144P957O70K810L2747J1985L7173L9109J5868K2495
16954E19387M4229N5398O0357O1496L6779O0947J03211J16912J07601J52239J67825
16943A486381J43170J19941J51930J91803J35275J29995J85319K14726K63046
16934C021586L53439M78128N94389Q20050J175826J759791K621386M005664O114616
16925B0944875Q296630R005142Q924486J1086784J3229919Q525065J023633K59823
16917H1296357R34584n150357j1682186j1733494r999596r600864q893511p011158
16909A8159775m902104l265342k163255j466048j045983p80026n91419m61300
16901C484298l88697l45967k68072k19960k07007j83872j28126q2040j13585j13731
$$ plain form
16966 290743 309328 327429 348573 356530 357200 360010 392757 404742 441915 481024 496892 519387
16954 519387 563616 619014 679371 740867 777646 838593 941804 1058716 1166317 1318556 1486381
16943 1486381 1629551 1749492 1901422 2093225 2228500 2358495 2543814 2758540 3021586
16934 3021586 3375025 3853153 4447542 5267592 6443418 8203209 10824595 14830259 20944875
16925 20944875 29241505 38246647 47171133 58257917 71487836 80012901 81036534 81296357
16917 81296357 82230941 77080584 65398398 53664904 43665308 34064444 25170933 18159775
16909 18159775 13257671 9992329 7829074 6363026 5317043 4537017 3945598 3484298
16901 3484298 3095601 2749634 2481562 2261602 2054595 1870723 1742597 1660557 1546972 1433241
16891A433241p8365o3043q1253q1132q3732q0336o5181n1238n0765o2889n6494
16880F78813o2245o5110n9140l1918l4369n5204m7614l4272j3161k2865p350q454
16868B37111l8226j1831k062K448p387j6666k0870j2861n630k2184m609L644p019
16855I3858J5151l859m335k0559j8545q372N82P167j0844K964o164q049p030K279
16841C4244n650P831J951M982k305N194n734J0888J8182p260j8555m779K0872
16828E9861q244j2884J7547J8960N823l744o829p865q816q176j2555L890j405
16815C5563j0672k2176j2004m376Q703j0614k834K4059J4861K872r823L052J195
16802A7806J0703K299j1674K2129J1482R75L695J4076K3228K8584k2028k7912
$$ plain form
16891 1433241 1354876 1291833 1210580 1129448 1045716 965380 900199 848961 798196 735307 678813
16880 678813 616568 551458 492318 460400 426031 370827 323213 288941 275780 252915 245565 237111
16868 237111 198885 187054 184992 187440 180053 163387 142517 129656 124026 101842 97233 100877 93858
16855 93858 109009 105150 100815 80256 61711 53339 53921 61088 50244 53208 47044 38995 31965 34244
16841 34244 28594 36425 38376 43358 41053 46247 40513 51401 69583 62323 43768 38989 59861
16828 59861 51617 38733 56280 75240 81063 77319 70490 62625 53809 45633 33078 36968 35563
16815 35563 24891 2715 -9289 -13665 -4962 -15576 -18410 5649 20510 23382 13559 16611 17806
16802 17806 28509 30808 19134 41263 52745 53720 57415 71491 94719 123303 101275 73363
16790G3363k1381j6816n043Q686J1960l193P22q533j0424m157j2431p258j2653
16777g158J7311M202m104m373J266P060J746o392j3139J834M904J3842j629Q815
16763B4185m277j0495j3938n667P962J2456j9658j8936k967M632J6798L313P790
16750A198K4822N214r646k1178j7734M55l348M467P761R466k969j3081l591o666
16736b4830O1J6496J1259J8918P381J148k663j1403j5411j7387j1358J2103J8435
16723B749o39L773k5021O734j571p906L728J8959J7281Q859n213N441K1450J4929
16709F3553P444O446P858j6687j1062K900j622k6559j2388K627K7073j8425k2910
16696H248k1708j6075J3635J2958p53O835j6724p0K0104K4512M980j0846K451
$$ plain form
16790 73363 51982 35166 30123 38809 50769 47576 48298 39765 29341 25184 12753 5495 -7158
16777 -7158 10153 14355 10251 5878 7144 14204 15950 9558 -3581 -1747 3157 16999 15370 24185
16763 24185 19908 9413 -4525 -10192 -2230 10226 -9432 -28368 -31335 -26703 -9905 -6592 1198
16750 1198 26020 31234 21588 410 -17324 -16869 -20217 -15750 -7989 1477 -1492 -14573 -18164 -24830
16736 -24830 -24769 -8273 2986 21904 29285 30433 27770 16367 956 -16431 -27789 -15686 2749
16723 2749 2110 5883 -19138 -12404 -13975 -21881 -18153 806 18087 26946 21733 27174 48624 63553
16709 63553 70997 77443 85301 68614 57552 60452 58830 32271 19883 22510 49583 31158 8248
16696 8248 -13460 -29535 -15900 -2942 -3695 3140 -13584 -13654 6450 30962 35942 25096 27547
16683B7547M720K978j7811K54J0669q55r953r729j1958k3271L450K8601P215j3038
16669a181j2335j1666p834J7738K348O895n069N079j117M614j2182j3906m21K1326
16655g711K4263k0999j0730J93k895K1100J0920m885k211r2j3696k6873q4K3743
16641i957L3449n279k9209j751L867k736j3548M485o797J5201R973N291M730J2764
16627B0483j4590l0886r59J114j496j0191K3896M5589K3483q395p84M856M624
16614E6744j1389j6901p506q583M917k0714j9136J9878J2366K0981J0107l6946
16602C818O289J2902l005j4647j3220k9185k185K648l137J5942P096J3358m615
16589g941j3652K387K563p909j0109K372J1231l862O697L698P190N741P621l493
$$ plain form
16683 27547 32267 35245 17434 17688 28357 27502 17549 7820 -4138 -27409 -23959 4642 11857 -1181
16669 -1181 -13516 -25182 -33016 -15278 -12930 -6035 -11104 -6025 -7142 -2528 -14710 -28616 -29037 -7711
16655 -7711 16552 -4447 -15177 -14984 -17879 3221 14141 9256 7045 6953 -6743 -33616 -33700 -9957
16641 -9957 23492 18213 -10996 -12747 -8880 -11616 -25164 -20679 -27476 -12275 -2302 2989 7719 20483
16627 20483 5893 -24993 -25952 -24838 -26334 -36525 -12629 32960 56443 48048 47264 52120 56744
16614 56744 45355 28454 20948 12365 17282 -3432 -22568 -2690 9676 30657 40764 3818
16602 3818 10107 23009 20004 5357 -7863 -37048 -39233 -36585 -39722 -23780 -16684 -3326 -7941
16589 -7941 -21593 -19206 -16643 -24552 -34661 -32289 -21058 -24920 -18223 -14525 -7335 -1594 6027 2534
16575B534j0640q86r345q530q29j79m892p389l837J0326O024R030J9562J6283
16561A7232N269j8939l083j2854J1609l416n576R438N91m899J1397J7312l139
16548B0942r112o708j4439j9706m432P72J4753j642j2655L036j4698j2989j1238
16535f8116J3766J8088J8377j219L982j2830k020K630k0676j399K7428Q358l95
16522a4026J9345J461O900p464j5892J1611j3776M208r09k076J3740q929j4653
16509b0460K729J847j2204J525n908j882l820P224K4651J5248k324l082p232l678
16495g366L001p505j924O010m221m699J9529J0368l4851n865P738J4982K873J1022
16481I092j0962L095o400r328J5008Q289j4623k170O03m849j6511n24J2373J2739
$$ plain form
16575 2534 -8106 -8992 -18337 -26867 -27696 -27875 -32767 -40156 -43993 -33667 -27643 -18613 949 17232
16561 17232 22501 3562 479 -12375 -766 -4182 -9758 -320 271 -4628 6769 24081 20942
16548 20942 11830 5122 -9317 -29023 -33455 -32683 -17930 -19572 -32227 -29191 -43889 -56878 -68116
16535 -68116 -54350 -36262 -17885 -19104 -15122 -27952 -29972 -27342 -48018 -49417 -21989 -13631 -14026
16522 -14026 5319 6780 13680 6216 -9676 1935 -11841 -7633 -8542 -10618 3122 -5807 -20460
16509 -20460 -17731 -15884 -28088 -26563 -32471 -34353 -38173 -30949 -6298 8950 6626 3544 -3688 -7366
16495 -7366 -4365 -11870 -13794 -7784 -12005 -16704 2825 13193 -21658 -27523 -19785 -4803 -1930 9092
16481 9092 -1870 1225 -5175 -14503 505 8794 -5829 -7999 -7396 -12245 -28756 -29280 -16907 -4168
16467d168j2480J0866M511k457J467J233m271k177o337n117O064p259j2138j1983
16453d4246J2430K4150N671j7425j8434m981M867p77M804K4764J5192J7631j6333
16440G313m638o982k7731Q89J0039O241j950j3545p985M038q252k7164K03L1282
16426c8242J2789J929j489j30j4085k3467J9869J6157J6131q669m259M328J2326
16413f812j79q163O532k5R224K151K225L184j9790j7675K0356K1069K979r667
16399E409j9460l730m646J1976P658lk200l480r652j639K5841K673k1294p734
16385b0281p778L060O770p377o024J9568J1337O359j000m520J5708l302j746Q976
16371A9750k5644j7399L263J6085m810k177j7193j2267j616J5763J4928j577J1906
$$ plain form
16467 -4168 -16648 -5782 -1271 -3728 -2261 -1028 -5299 -7476 -13813 -18930 -12866 -20125 -32263 -44246
16453 -44246 -31816 -7666 -1995 -19420 -37854 -42835 -37968 -38745 -33941 -9177 6015 23646 7313
16440 7313 2675 -4307 -32038 -31149 -21110 -14869 -16819 -30364 -38349 -34311 -42563 -69727 -69524 -38242
16426 -38242 -25453 -23524 -25013 -25143 -39228 -62695 -42826 -26669 -10538 -19207 -23466 -19138 -6812
16413 -6812 -6991 -15154 -8622 -8647 577 2728 4953 8137 -11653 -29328 -8972 12097 15076 5409
16399 5409 -14051 -17781 -22427 -10451 -2793 -2796 -4996 -8476 -18128 -19767 6074 8747 -12547 -20281
16385 -20281 -28059 -24999 -18229 -25606 -31630 -12062 -725 5634 4634 114 15822 12520 10774 19750
16371 19750 -5894 -23293 -20030 -3945 -8755 -10932 -28125 -40392 -42008 -26245 -11317 -12894 -988
16358i88Q794J666J3831J6557R389K9526L3581M3427M2673M1282P3461M7230K5002
16345C85431L3362J0061J8014k6193q5138q7244n0037l6499l1774l0466k4019
16334G5498k3350j4199k0902j219q838j6494k832O451l71m237j7931j6891R108
16321c6207K6142L7585n897l2569j4957j4920K558J962L753L6781O892n437j8953
16308a3267q223j436J2317r698j0324P746k90P957Q969j2009n442K9388q352j2553
16294a5217o216j2825l444J949P74J8875m435j886J3527J479M927r961o162K7630
16280I015P461O116K3876l535j1997j4912j2522j6596K157j780L545J616M56j1649
16266a8749k853K066k290J0603J9322O113n776p204P26j9036j6156k224L170Q542
$$ plain form
16358 -988 7806 9472 23303 39860 49249 78775 112356 155783 198456 239738 313199 360429 385431
16345 385431 418793 428854 446868 420675 335537 248293 198256 161757 129983 99517 75498
16334 75498 52148 37949 17047 15828 6990 -9504 -12336 -5885 -6256 -10493 -28424 -45315 -36207
16321 -36207 -10065 27520 21623 -10946 -25903 -40823 -38265 -36303 -32550 4231 11123 5686 -13267
16308 -13267 -21490 -22926 -10609 -20307 -30631 -22885 -23175 -15218 -6249 -18258 -23700 5688 -2664 -15217
16294 -15217 -21433 -34258 -37702 -35753 -34979 -16104 -20539 -22425 -8898 -7419 -2492 -12453 -18615 9015
16280 9015 16476 22592 46468 42933 30936 16024 3502 -13094 -10937 -12717 -9172 -7556 -7100 -18749
16266 -18749 -21602 -19536 -21826 -11223 8099 14212 8436 1232 1958 -17078 -33234 -35458 -32288 -23746
16252b3746o696J8653J1597k7355j2689l744P565J3447K4364J1192j4316q519
16240a0247p554m01L401L850M808J4664R890Q95m200q532j9918J126J4576j1197
16226h839p920q265j3774K3758q08l195J595M138R871J2479p29q686p239j528
16212i142r665j812K0620j0816j2836O387J5390j027j6084j6899J854J4707J7199
16199b124j361K446Q65P028Q709p927j9033k1915M469k777M412K538J7591K012
16185e067j3933j2354O259L626n968k584J2453K813q76J2796j2686n142O668P522
16171f473n788M952O591m199l940K970j5214L631j5116P085m102K522N203J7805
16157d073j868o231l161j3152l315k155K655l334l95J5319l832N997m41J3490
$$ plain form
16252 -23746 -30442 -11789 -192 -27547 -40236 -43980 -36415 -22968 1396 12588 -1728 -10247
16240 -10247 -17801 -18202 -14801 -10951 -6143 8521 18411 19306 15106 6574 -13344 -12218 2358 -8839
16226 -8839 -16759 -25024 -38798 -15040 -15848 -19043 -17448 -13310 -3439 9040 8311 -375 -7614 -9142
16212 -9142 -18807 -20619 1 -10815 -23651 -17264 -1874 -2901 -18985 -35884 -34030 -19323 -2124
16199 -2124 -3485 -1039 -174 6854 15563 7636 -11397 -33312 -28843 -31620 -27208 -24670 -7079 -5067
16185 -5067 -19000 -31354 -25095 -21469 -27437 -30021 -17568 -14755 -15631 -2835 -15521 -20663 -13995 -6473
16171 -6473 -12261 -7309 -718 -4917 -8857 -5887 -21101 -17470 -32586 -25501 -29603 -27081 -21878 -4073
16157 -4073 -5941 -12172 -15333 -28485 -31800 -33955 -31300 -34634 -35029 -19710 -23542 -17545 -17986 -4496
16143d496Q187K1472r742r849K111j598j2619r362j0726J4024J9067j2829O395
16130C5j441j2639l100J4591j5877p788K2994J3850p441l997J9043j0266l287
16117D677L118j1654l1870j8138M715K9048J3447l50K839q171N25N439j0987L30
16103a7032L614j1030R765R925j255j9151k8882M80K4228J9730p213J3810K144
16090h67o551k08J4683O03p016Q852M152J4066J0884j0476j227l22J680L003m035
16075B7221j0889k4195j3071l3998k037O445J5506K8339N548M208R587o097k530
16062D037M703J8142K3313j8569j1514m962j0742j0710r033p07k4017l819J6996
16049b6882J3007K9956M333o223k98j133J8089J2623k2239n887k314Q157M751
$$ plain form
16143 -4496 3691 25163 15421 5572 7683 6085 -6534 -15896 -26622 -12598 6469 -6360 35
16130 35 -1406 -14045 -17145 -2554 -18431 -26219 -3225 10625 3184 -813 18230 7964 4677
16117 4677 7795 -3859 -35729 -53867 -49152 -20104 -6657 -7007 -4168 -12339 -11814 -6375 -17362 -17032
16103 -17032 -13418 -24448 -14683 -4758 -6013 -25164 -54046 -53566 -29338 -9608 -16821 -3011 -867
16090 -867 -7418 -7626 7057 7660 644 9496 13648 27714 38598 28122 26895 26573 28253 31256 27221
16075 27221 16332 -7863 -20934 -54932 -56969 -50524 -35018 -6679 -1131 3077 12664 6567 4037
16062 4037 8740 26882 50195 31626 20112 15150 4408 -6302 -15335 -16042 -40059 -43878 -26882
16049 -26882 -13875 16081 20414 14191 13893 12760 30849 43472 21233 15346 13032 21189 25940
16036B5940l681j3686o181p181K162Q579M958n648j0007j5702k152K332J0695
16023i572k012p862R451J209O138l166p935J3833J259k2107o888J3364q185p42
16009b3215R917J8718N957N687p062r972j2269o294J0180j5536r063R352j3431
15996c7031p22P973r979M6J1818K0287K2596J324k556j0007q606o560m488n988
15982b1893l763n793J2829L418L105P377q271K020O430K824Q11R138L177N021
15968A6430r383n730L199O254J0418M576j3783R146j732J0880k277j5157l919
15955H922N674L852j6031k954K514j2201K3195N246J630j0725k98K2820O217j5985
15941B1876m871q349k2552O794j7454J4233K0054k3690l025O889j3006J3472J5973
$$ plain form
16036 25940 22259 8573 2392 -4789 -2627 5952 10910 5262 -4745 -20447 -22599 -20267 -9572
16023 -9572 -11584 -19446 -9995 -8786 -2648 -5814 -13749 84 1343 -20764 -27652 -14288 -22473 -23215
16009 -23215 -13298 5420 11377 17064 10002 30 -12239 -18533 -8353 -23889 -32952 -23600 -37031
15996 -37031 -37753 -29780 -39759 -39713 -27895 -7608 14988 16312 13756 3749 -4857 -11417 -15905 -21893
15982 -21893 -25656 -31449 -18620 -15202 -12097 -4720 -12991 -10971 -4541 -1717 -906 8232 11409 16430
15968 16430 7047 1317 4516 10770 21188 25764 11981 21127 19395 30275 27998 12841 8922
15955 8922 14596 18448 2417 -537 1977 -10224 12971 18217 19847 9122 8824 31644 37861 21876
15941 21876 17005 8656 -13896 -7102 -24556 -10323 9731 -13959 -16984 -10095 -23101 -9629 6344
15928F344O557K985l636R274n166k2680j2513P717J5653R520J5493q38j2545j017
15914A5148l373k4400Q639J1110j0149q534j5818P327K5942R303o428j3947J3921
15901H741J2718k5238o195l91Q942R407o485l768N374j0454n986K4095O270k4876
15887g846k46K4237K4251P067q2J6363k301j0144j2259p988k0979j4779N778K5228
15873B6300J1733j1306j0922l750j5553k0990j525J4915J0580R511M241k019j2481
15860a266M798Q511K2045J4465k4172l303j3179k459k816j2868K928O226j0633
15847a1723l716K0185K9364k644J697l0600j4721P329R12P207J7563P925o541
15834B2237L357j728j97N819J1458l450j7585p224O227k2771j0089K178J1447
$$ plain form
15928 6344 12901 15886 12250 21524 16358 -6322 -18835 -11118 4535 14055 29548 28710 16165 15148
15914 15148 11775 -12625 -3986 7124 -3025 -11559 -27377 -20050 5892 15195 8767 -5180 8741
15901 8741 21459 -3779 -9974 -10365 -1423 7984 1499 -2269 3105 -7349 -13335 10760 17030 -7846
15887 -7846 -8092 16145 40396 47463 47381 63744 61443 51299 39040 31052 10073 -4706 1072 26300
15873 26300 38033 26727 15805 12055 -3498 -24488 -26013 -11098 -518 8993 13234 11215 -1266
15860 -1266 3532 12043 34088 48553 24381 21078 7899 5440 2624 -10244 -7316 -1090 -11723
15847 -11723 -15439 4746 34110 31466 33163 2563 -12158 -4829 -3917 3290 20853 28778 22237
15834 22237 25594 23866 23669 29488 40946 37496 19911 12687 18914 -3857 -13946 -11768 -321
15821c21P703j8141O290K0310J252r45J1558k1232m104j0435j8249M025M265l217
15807b1241k967K531J3691J5231k829Q168lj9547k464P847M118J1078j5784n779
15793g950N861J1695o0j2647J2331m720m740j6794N925J7543o76k5181m434M830
15779a9017L718j829P978q377l997q382l780N854K8881Q06k1411k0780p532q976
15765e6844N623L8696N857p20k578j197J3766P979j3872k7383r061K4529K5290
15752A0085N273o325o775o726J0846k559l906O790j2455j1148l172j9778P435
15739c2415J3833J0658j127m716L703K3153P379J9483k0537j9936r278J658K3730
15726A5588O146J710j0788j2682p119j7854R582j304k0843R086Q48J6120O342
$$ plain form
15821 -321 7382 -10759 -4469 15841 17093 16148 27706 6474 2370 -8065 -26314 -22289 -18024 -21241
15807 -21241 -24208 -21677 -7986 7245 4416 12584 12581 -6966 -9430 -1583 2535 13613 -2171 -7950
15793 -7950 -2089 9606 9546 -3101 9230 4510 -230 -17024 -11099 6444 5768 -19413 -23847 -19017
15779 -19017 -15299 -17128 -9150 -17527 -21524 -29906 -33686 -27832 1049 1855 -19556 -40336 -47868 -56844
15765 -56844 -51221 -12525 -6668 -7388 -9966 -11163 2603 10582 -3290 -30673 -39734 -15205 10085
15752 10085 15358 9033 2258 -4468 6378 3819 -87 6703 -5752 -16900 -20072 -39850 -32415
15739 -32415 -18582 -7924 -9051 -13767 -10064 13089 20468 39951 19414 -522 -9800 -8142 15588
15726 15588 21734 23444 12656 -26 -7145 -24999 -15417 -16721 -37564 -28478 -27630 -11510 -5168
15713e168j8182M144J6700R271O343k6060l571N604j560R716k1632k0205J6204
15700b8396M977o000O41K1191K8505j8825q694m565l918J5216L104M650n33Q242
15686A5595j0236k8719L818J4373q893j5281n433M082J0006L0342J5231m558r817
15673A0510O347j7254j9606r217O12R812L298J012J9906R320j9478m170J1499
15660B591R658k681j9348q672N980j4080N438K9034K2104o850j9871k4059j0821
15647c1577j3330R551J9694O485K3462q070j7675K971N760J1092r748j730Q888
15634E773J339m707m989N674l857k5821N407J662N910k922J8611O724j2123Q349
15620E030n599j2885M922M581J1142J705n204L523N210j825K350l053p481O232
$$ plain form
15713 -5168 -23350 -19206 -2506 6765 13108 -12952 -16523 -10919 -12479 -2763 -24395 -44600 -28396
15700 -28396 -23419 -29419 -28778 -7587 20918 2093 -6601 -11166 -15084 132 3236 7886 7353 15595
15686 15595 5359 -23360 -19542 -5169 -14062 -29343 -34776 -30694 -20688 9654 24885 20327 10510
15673 10510 16857 -397 -20003 -29220 -28608 -18796 -15498 -14486 5420 14740 -4738 -8908 2591
15660 2591 12249 9568 -9780 -18452 -12472 -26552 -21114 7920 30024 23174 3303 -20756 -31577
15647 -31577 -44907 -35356 -15662 -9177 14285 6215 -11460 -8489 -2729 8363 -1385 -3115 5773
15634 5773 7112 2405 -2584 3090 -767 -26588 -21181 -19519 -13609 -16531 2080 8804 -3319 5030
15620 5030 -569 -13454 -8532 -3951 7191 8896 3692 7215 12425 10600 12950 9897 2416 8648
15606H648p448j4363j0265K4399L1799K5893L0698K1172R424R679p356j8749k5473
15593G8058j1463O832M143j0203k9770j2139l508J3033k4198j4926o457R096M174
15580B672k192p029j4027j5826k749O660K2689J1357J0121Q73m663j0601k4689
15567b7404j9901J8726J5335O571L569p058M07p975m9J4579K156J3509p428K838
15553G875K3676p114j8567j5997l02p333Q31O758k7206j290J8318l707L650J983
15539a8425k769r211N67J2903o419J113j0305j1670M239K595k345Q092r17O872
15525b5680K2754J641m740J4119O761r525J951M032J550k877j4536n712k025J6898
15511D611j6864l7769p277K1990M940P014K4807K1759Q47p218j3371L511R074
$$ plain form
15606 8648 1200 -13163 -23428 971 32770 58663 89361 110533 119957 129636 122280 103531 78058
15593 78058 66595 73427 77570 67367 37597 25458 21950 34983 10785 -4141 -10598 -1502 2672
15580 2672 480 -6549 -20576 -36402 -39151 -32491 -9802 1555 11676 12549 7886 -2715 -27404
15567 -27404 -47305 -28579 -13244 -6673 -3104 -10162 -9755 -17730 -17779 -3200 -1044 12465 5037 7875
15553 7875 31551 24437 5870 -10127 -10429 -17762 -16931 -10173 -37379 -38669 -20351 -24058 -20408 -18425
15539 -18425 -21194 -30405 -29838 -16935 -23354 -22241 -32546 -44216 -39977 -37382 -39727 -31635 -32552 -25680
15525 -25680 -2926 -1285 -6025 8094 14855 5330 7281 11313 12863 9986 -4550 -10262 -12287 4611
15511 4611 -12253 -50022 -57299 -35309 -30369 -23355 1452 23211 24058 16840 3469 6980 16054
15498A6054o181k5793p250J7036K205M480L4707K0643j1846k0986k2861j1621
15486a1413j438j655j1540j234j4467o661K357O840P263J6814R728o197o534q418
15472b6555J4497n096j8142j1831J7555J9073O818r114o461Q701J5644O052o45
15459A0496N007k2345k3069j3461M90J3045J0445n783P578P480Q314m18j5891
15446a8112J0531R609r167k493M107j5335J626j077o533O739n055k658j208o818
15432c5844l244j0486Q622K5205Q902J674l907n140j373o935J09O071N263n126
15418a6209q258R903J4752l673k0731N139j1428P72K2470R969p65J2461J3703
15405B8105j2031P311Q668q561j6127l621J754o658j1902J0425k220M882q301
$$ plain form
15498 16054 9873 -15920 -23170 -6134 -3929 551 35258 55901 44055 23069 208 -11413
15486 -11413 -12851 -14506 -26046 -27280 -41747 -48408 -46051 -39211 -31948 -15134 -5406 -11603 -18137 -26555
15472 -26555 -12058 -17154 -35296 -47127 -29572 -10499 -3681 -12795 -19256 -10555 5089 11141 10496
15459 10496 15503 -6842 -29911 -43372 -42882 -29837 -19392 -25175 -17597 -10117 -1803 -2221 -18112
15446 -18112 -7581 2028 -7139 -9632 -5525 -20860 -19234 -20311 -26844 -20105 -25160 -27818 -29026 -35844
15432 -35844 -39088 -49574 -40952 -15747 -6845 -5171 -9078 -14218 -15591 -22526 -22417 -16346 -11083 -16209
15418 -16209 -24467 -14564 188 -3485 -24216 -19077 -30505 -29733 -7263 2706 1941 14402 28105
15405 28105 16074 23385 32053 23492 7365 3744 5498 -1160 -13062 -2637 -4857 25 -8276
15392h276p988k132Q059k625k312k99J42J9352K79k9815j055j407J3111R511O682
15377A227K450j6383k418Q532J4067M122p579K224J5115m583L894j3571l5622
15364b8525k799J6323L869J258J7307M96l236j0721j9424k2156K9805J2665p36
15351e874q12o740Q920K027j0513r063p192n891j91Q728O529N278N051p472j0789
15336b8004L701k1505r530L563J4457J9142q080N971N112q404p460P024j828J1460
15322a4381J9445P203k3908j0042m173J9161J501q842k0540J2940M0804J6492
15310C5660m275j0967j1793k643j5730K730L817P581J6371o863j8596j2556K0874
15297C610J3646P161l0260k3621K0691J4017j2649J3532J9830J984J0217J6188
$$ plain form
15392 -8276 -16264 -18396 -10337 -12962 -15274 -15573 -15431 3921 4200 -25615 -26670 -28077 -14966 -5455 1227
15377 1227 3677 -12706 -15124 -6592 7475 11597 4018 6242 21357 16774 20668 7097 -28525
15364 -28525 -31324 -15001 -11132 -9874 7433 7929 4693 -6028 -25452 -47608 -17803 -5138 -5874
15351 -5874 -6686 -13426 -4506 -2479 -12992 -22055 -29247 -35138 -35329 -26601 -20072 -14794 -9743 -17215 -28004
15336 -28004 -24303 -45808 -55338 -51775 -37318 -18176 -26256 -20285 -15173 -23577 -31037 -24013 -25841 -14381
15322 -14381 5064 12267 -11641 -21683 -25856 -6695 -5194 -14036 -34576 -21636 19168 35660
15310 35660 31385 20418 8625 5982 -9748 -7018 -3201 4380 20751 13888 -4708 -17264 3610
15297 3610 17256 24417 -5843 -29464 -8773 5244 -7405 6127 25957 27941 38158 54346
15285E4346k3931l7836j8451J5254J2840J2665n89N577K588q354r359L046K2000
15272B9796P007k2591j6576k845k652j3280l654O478K0546j750j2216j3935J3751
15259a1921J7639M501m920l327j0243j9423L472O606L32q066M442j2317J0317
15246b2908J0992J1570o45J907j4560J5p317p135m39M233J0092l924J3143N115
15232A39J1936k888L493l1857r656o731J820R726k841j3150J0176J3281P552p321
15218a6321N575j179M503l397r08K226j4350l059J8470K2917L779n32j8748j0260
15204a1284r689q623K3899N758Q735p888j6823J244R283L484P246J7800q240o059
15190H843J0405J1538m771j2483J1675L771L4Q119n172k27j2382j5274N633p455
$$ plain form
15285 54346 30415 -7421 -25872 -10618 2222 14887 14298 19875 22463 14109 4750 7796 29796
15272 29796 36803 14212 -2364 -5209 -7861 -21141 -24795 -18317 2229 479 -11737 -25672 -11921
15259 -11921 5718 10219 5299 1972 -8271 -27694 -24222 -17616 -17284 -25350 -20908 -33225 -22908
15246 -22908 -11916 -346 -991 916 -13644 -13629 -20946 -28081 -28520 -24287 -14195 -18119 -4976 139
15232 139 12075 9187 12680 -19177 -28833 -35564 -33744 -24018 -26859 -40009 -29833 -16552 -9000 -16321
15218 -16321 -10746 -11925 -7422 -10819 -11727 -9501 -23851 -26910 -8440 14477 18256 17724 -1024 -11284
15204 -11284 -20973 -29596 -5697 61 8796 908 -15915 -14671 -5388 -1904 5342 23142 14902 8843
15190 8843 19248 30786 26015 13532 25207 28978 29012 37131 31959 31732 19350 4076 9709 2254
15176B254p350l706J151k869K0284l798K300K4715j1902j1540j1149J0519J6813
15163B5722p049j9727m741M388N652P910L492l514k945j912j1420q002J7347J2563
15149A7764j5891m042K4232j258q524r178j727p775k57o199N59K0150j451n654
15135G49J704j5123M966J3032K016L01o657L224k2870k2965L314K405J8602J3255
15121d047J9311j897k0467o13K085j0020j0046p454N179J6883N688p126K1801
15108I277O362n444j5975n847r13R546J125k1839r093J5411k286r439M717Q968
15094a5430K807J2450j377j4651P594J6939L101n151k5206J316o069J0749R997
15081b931j648k732N312Q873L517J678m425K952Q356R153j4803K283P593Q307
$$ plain form
15176 2254 -5096 -8802 -7651 -10520 9764 5966 8266 32981 21079 9539 -1610 8909 25722
15163 25722 18673 -1054 -5795 -1407 4245 12155 15647 12133 9188 7276 -4144 -12146 5201 17764
15149 17764 1873 -2169 22063 20805 12281 3103 1376 -6399 -6656 -12855 -12296 7854 6403 749
15135 749 2453 -12670 -7704 5328 7344 7645 988 4212 -18658 -41623 -38309 -35904 -17302 -4047
15121 -4047 15264 13367 -7100 -7713 -5628 -15648 -25694 -33148 -27969 -11086 -5398 -12524 9277
15108 9277 15639 10195 -5780 -11627 -12540 -2994 -1869 -23708 -32801 -17390 -19676 -29115 -24398 -15430
15094 -15430 -12623 -173 -1550 -16201 -8607 8332 11433 6282 -18924 -17608 -23677 -12928 -2931
15081 -2931 -4579 -7311 -1999 6874 10391 12069 7644 10596 18952 28105 13302 15585 23178 31485
15067C1485k021n837j166R083j9968k51j0066j4706j2713N885P550k0674J3834
15054a9565K0394Q828k1556p881J1926J9295j9991k2219n077J6519J6621R779
15042G073m462j7117J1039L014j834J8330m862j5501j0484j352L171q159Q232
15029a2912L61R755k343J762Q341m273J4722Q404j0172j5403o081L268j280k6546
15015c2397r116j1490J639M192J6525K6236J7199j018j2345J077j7539O681O533
15002c823j1198n856j3919J3044J2232O83l967J2277O133J312j7733L924j6981
14989b3872n226n297J1976P471j7501P504K3291M023j1372M404J4380R242J193
14976B0216N24o134r601o716q515l137j2922l944L776P081J9815p701k1030J33
$$ plain form
15067 31485 29464 23627 22461 31544 11576 11325 1259 -13447 -26160 -20275 -12725 -33399 -19565
15054 -19565 829 9657 -11899 -19780 -7854 11441 -8550 -30769 -35846 -19327 -2706 7073
15042 7073 2611 -14506 -3467 -453 -2287 16043 11181 -4320 -14804 -16156 -12985 -21144 -12912
15029 -12912 -12551 -2796 -5139 -3377 4964 691 15413 23817 13645 -1758 -7839 -4571 -5851 -32397
15015 -32397 -41513 -53003 -51364 -47172 -30647 -4411 12788 11770 -575 502 -17037 -10356 -3823
15002 -3823 -15021 -20877 -34796 -21752 -9520 -8837 -12804 -527 5606 6918 -10815 -6891 -23872
14989 -23872 -29098 -34395 -22419 -14948 -32449 -24945 -1654 2369 -9003 -4599 9781 19023 20216
14976 20216 20740 14606 5005 -1711 -10226 -13363 -26285 -30229 -26453 -19372 443 -7258 -28288 -28155
14962b8155J1399J3755J5286p440q18l339j53k0963j5434Q566M827M17P717J6985
14948B650j2409J5747p856k5306N483l503j4625J0290J0060J0852J7210J8983
14936B7576L720q756l20k9753k6009j8914L084Q536J1028J9581R57p295j6360
14923c2925k432Q332J102j5035M353J6050Q705m077J6228J9315j5778l2751J6525
14910a2388R649k437j6595K946J7042J1433L614K201j2056j8005L297l150o984
14897b1433K021M398K345L097j356p96q335J1587j5069m644J5905K4871Q086J467
14883B2144p304j3782j1938k3190K5321J2561Q527N354P799J7645j9752k8131
14871d746p199J2085l749p295J7153o056p318N256J0116n168q488j3843Q446l579
$$ plain form
14962 -28155 -16756 -3001 12285 4845 4027 688 535 -20428 -35862 -27296 -22469 -22052 -14335 2650
14948 2650 -9759 5988 -1868 -27174 -21691 -25194 -39819 -29529 -19469 -8617 8593 27576
14936 27576 31296 22540 22220 -7533 -33542 -52456 -49372 -40836 -29808 -10227 -9270 -16565 -32925
14923 -32925 -35357 -27025 -25923 -40958 -36605 -20555 -11850 -15927 301 19616 3838 -28913 -12388
14910 -12388 -2739 -5176 -21771 -18825 -1783 9650 13264 15465 3409 -14596 -11299 -14449 -21433
14897 -21433 -19412 -15014 -12669 -9572 -10928 -11724 -20059 -8472 -23541 -28185 -12280 12591 20677 22144
14883 22144 14840 1058 -10880 -34070 -8749 3812 12339 17693 25492 43137 23385 -4746
14871 -4746 -11945 140 -3609 -10904 6249 193 -7125 -1869 8247 3079 -5409 -19252 -10806 -14385
14857a4385j7407J3119K6636J4989j9549m56L567m889m34J016m71J3023k315j0254
14843B190J91j0566n390Q951l004q366J9804l419j8065m001M814j0051k0140J2652
14829c4400L0901M985J372o516O649M526J4795m617j7359m293k498j3300q123
14816b7878J4325P136J1997R417k2663l640J8124Q303o940r437M254j8709m339
14803b0050J4718J3476r78j4713n672j181N87M427n783K077K89j8605M6p056Q703
14788b9715J0929J9991J1077j980P86j5298q978l043J925J0537K914j7677J5838
14775b694Q756K286l887J1152j6330l8738j1907J5189K3501J0809L679q432J102
14762e514r744j2222j340p174r82l598L536J8273P224J0861N934M608k6220j1328
$$ plain form
14857 -14385 -31792 -18673 7963 22952 3403 2947 6514 1625 1191 2207 1736 14759 12444 2190
14843 2190 2381 -8185 -13575 -4624 -7628 -15994 3810 391 -17674 -21675 -16861 -26912 -47052 -34400
14829 -34400 -3499 1486 2858 -3658 2991 7517 22312 17695 336 -3957 -6455 -19755 -27878
14816 -27878 -13553 -6417 5580 14997 -7666 -11306 6818 15121 8181 -1256 2998 -15711 -20050
14803 -20050 -5332 8144 7166 -7547 -13219 -14400 -13813 -9386 -15169 -13092 -12803 -31408 -31362 -38418 -29715
14788 -29715 -18786 1205 12282 10302 11088 -4210 -13188 -16231 -14306 -3769 -855 -18532 -2694
14775 -2694 6062 8348 4461 15613 -717 -39455 -51362 -36173 -12672 -1863 1816 -6616 -5514
14762 -5514 -15258 -27480 -28820 -35994 -36976 -40574 -37038 -18765 -11541 -680 5254 9862 -16358 -27686
14748b7686m821R396J3169p540j8238J2370N804p317K810Q324m847k128j558Q253
14734a4009J445p035o102O006R085J2438p328L007q102o150n953P008J0621o071
14720a1140l141N445J0432R389n878j447j4340j6924Q881J8582J1945J3853r349
14707A6308m536R028j0823K02m350j7796k2278j1250k805L543K9977j229n998
14694b2007Q129M769L855P892J725R138N385o77N876j0405j02R405M509j716p674
14679A8102j7165q837n042O502J0396j1119J5954K8931J8000k7887j1330N201
14667B1706r628j5396j592J0880j283j5491m879J1537J1025r664j4060j0292J34
14654b7003J2518J4320J0562l090J0274P8n360n877j48j0230p767q168Q23J2258
$$ plain form
14748 -27686 -32507 -23111 -9942 -17482 -35720 -23350 -17546 -24863 -22053 -13729 -18576 -20704 -22262 -14009
14734 -14009 -12564 -19599 -25701 -19695 -10610 1828 -5500 -2493 -10595 -16745 -22698 -15690 -5069 -11140
14720 -11140 -14281 -8836 1596 10985 5107 3660 -10680 -27604 -18723 -141 11804 25657 16308
14707 16308 11772 20800 9977 10179 5829 -11967 -34245 -45495 -48300 -44757 -14780 -16009 -22007
14694 -22007 -13878 -9109 -5254 2638 4363 13501 18886 18209 24085 13680 13578 22983 27492 25776 18102
14679 18102 937 -7900 -12942 -6440 3956 -7163 8791 37722 55722 27835 16505 21706
14667 21706 12078 -3318 -4910 5970 4687 -10804 -15683 -4146 6879 -2785 -16845 -27137 -27003
14654 -27003 -14485 -165 10397 7307 17581 17659 12299 6422 6274 -3956 -11723 -19891 -19068 -6810
14640f810k913P878O634n436K912j5466j6198R845N011m359m161P507o587J3763
14626h380J3221N594R749J090k094k3955l087O851l377l639L161J4830J175k3255
14612a2116O188J412j7343J4375J4722N580j4265j2737L378K247J274J3584k638
14599C661J0895K5252k84j2580j7132j0235R664Q327p53R891P321Q357K3131J1459
14585G6974r583q779j1915N59l528K3875J0562l552K1864J607k8814J0370Q250
14572H7890J0714p8j9860m814K177J7534L717J1811q494j7804J7716P690J1395
14559A19594K847j3487j1202j7313r210N202j0575M236O905P22l954j5915k278
14546E5572J6251p389j2803j5668J0064P606l196r296p625k972N527j8022k8626
$$ plain form
14640 -6810 -9723 -1845 4789 -647 2265 -13201 -29399 -19554 -14543 -18902 -23063 -15556 -22143 -8380
14626 -8380 4841 10435 20184 21274 19180 -4775 -7862 -1011 -4388 -8027 -4866 9964 11139 -12116
14612 -12116 -5928 -4516 -21859 -7484 7238 12818 -1447 -14184 -10806 -8559 -7285 6299 3661
14599 3661 14556 39808 39524 26944 9812 -423 9241 17568 16815 26706 34027 42384 65515 76974
14585 76974 67391 58612 46697 47256 43728 67603 78165 74613 96477 98084 69270 79640 87890
14572 87890 98604 98526 78666 73852 76029 93563 97280 109091 100597 82793 100509 108199 119594
14559 119594 122441 108954 97752 80439 71229 76431 65856 70092 76997 77719 73765 57850 55572
14546 55572 71823 64434 51631 35963 46027 53633 50437 41141 33516 30544 36071 18049 -10577
14533a0577L263M140j604o364L457L045J5469J0840j0127j4006j9392Q435P743
14520e678k217j551P842J0170j741j728J4383K500k3565L83J3973o766o321j9866
14506b0182j0570j0792J6310P481j7733P896R591J711J7938J135o557N179j5356
14493a3949p233J9254N648O373j0578j0642l335K0047P176o153k01J996j649j9732
14479a2978O42M2057j0379m619k0953m33M232N399O635l499k790N982k383l116
14465C797j0149m631J783K8997J4230L132p067j3437p540o848j1607n567J1779
14452c128J6816R918l303k918r968o975m412j1237l814J0508L653p426R122K4626
14438B1462J4071o739r431j7420m951J5166L625k1017J861J2474K2030J9947q913
$$ plain form
14533 -10577 -7314 -3174 -4778 -11142 -7685 -4640 10829 21669 11542 -2464 -21856 -13421 -5678
14520 -5678 -7895 -9446 -1604 8566 6825 5097 19480 21980 -1585 -1202 12771 6005 -316 -20182
14506 -20182 -30752 -41544 -25234 -17753 -35486 -27590 -17999 -16288 1650 2785 -3772 1407 -13949
14493 -13949 -21182 -1928 3720 10093 -485 -11127 -14462 5585 12761 6608 6407 8403 6754 -12978
14479 -12978 -12336 29721 19342 14723 -6230 -6663 -2431 2968 9603 6104 3314 9296 6913 3797
14465 3797 -6352 -10983 -9200 19797 34027 37159 30092 16655 9115 2267 -9340 -14907 -3128
14452 -3128 13688 23606 20303 17385 7417 442 -3970 -15207 -19021 -8513 -4860 -12286 -3164 21462
14438 21462 35533 28794 19363 1943 -3008 12158 15783 -5234 -3373 9101 31131 51078 42165
14425D2165j9059r816P09O64J0740j844L264J0381l749j2051j792O871k475r850
14411A4158K658j474j5599J104J4592P133j6169m285Q49M461N442r077j2544j4944
14397b3695o141o71J0322k865m658Q655j8255P208K896n181M987J6329K0750L138
14383A2819l3152j1393K89L971J4328j586l129M997m697J108J78Q954J7074j4093
14369d332R03N934P593L561P190L720m988P088j8553k2593R809K5044n039q822
14355F515L028O998O838J782j927L244j6403q189k726l674l367J6905J4270k41
14341B3053j2557O92m919Q616J6610j5444n877M858n743k0214K1055L2232O448
14328D8810m929j7388j5208q689J376L192j7049j8627J3920K6029k461j2372O17
$$ plain form
14425 42165 23106 13290 13999 14663 25403 23559 26823 37204 33455 21404 19612 26483 24008 14158
14411 14158 16816 15342 -257 847 15439 22572 6403 2118 2967 7428 12870 3793 -8751 -23695
14397 -23695 -29836 -30507 -20185 -23050 -27708 -19053 -37308 -30100 -27204 -32385 -27398 -11069 9681 12819
14383 12819 -20333 -31726 -31437 -27466 -13138 -14724 -17853 -12856 -17553 -16445 -16267 -7313 9761 -4332
14369 -4332 -3429 2505 10098 13659 20849 24569 19581 26669 8116 -14477 -4668 20376 15337 6515
14355 6515 9543 16541 23379 25161 23234 26478 10075 1886 -840 -4514 -7881 9024 23294 23053
14341 23053 10496 11188 6269 14885 31495 16051 10174 15032 9289 -10925 10130 42362 48810
14328 48810 43881 26493 11285 2596 3972 7164 -9885 -28512 -14592 11437 8976 -3396 -2779
14315b779j0421K836K945J080q057r206j334J9015j3011J506k855M216Q100O190
14301a775Q445J0979k2911k3070N367J2568J0716K477j042J786k1760k2684J0834
14288c0070K4120N658q230j4369j4941K5298K5012N357j0389j2832n978j224k124
14275a4712J9745J690l255j8925n121J3813K2137j2459j7847Q810n358j4653P666
14262a8469J9162L908j2003J4135J5737o70q759K6500J95j5099j3473j0818p160
14249f814j558m169J7355O009j0071j8246n95J2796P241M965q58Q534j0961j6626
14235a2998m955Q313j0495L875L111L50J2712j233J1786L617k580p275R042K247
14221A5517j0024J25R79Q284k851J6889N866L9902K9426J0908K1479J9110K3443
$$ plain form
14315 -2779 -13200 -10364 -7419 -6339 -14396 -23602 -24936 -5921 -18932 -17426 -20281 -16065 -7965 -1775
14301 -1775 6670 17649 -5262 -28332 -22965 -10397 319 2796 1754 3540 -18220 -40904 -30070
14288 -30070 -5950 -292 -8522 -22891 -37832 -12534 12478 17835 7446 -5386 -11364 -12588 -14712
14275 -14712 5033 6723 3468 -15457 -20578 -6765 15372 2913 -14934 -6124 -11482 -26135 -18469
14262 -18469 693 4601 -7402 6733 22470 21800 13041 39541 39736 24637 11164 346 -6814
14249 -6814 -8372 -12541 4814 10823 752 -17494 -18089 -5293 1948 6913 6055 14589 3628 -12998
14235 -12998 -17953 -9640 -20135 -16260 -13149 -12799 -87 -1320 10466 14083 11503 4228 13270 15517
14221 15517 5493 5618 6597 14881 12030 28919 34785 74687 104113 115021 136500 155610 179053
14208A79053l776n050j9713m7155j1925j1237j6492j4291k4440O000j752K875
14196C2097M314j3849k3827j2827k2870N809K2317n22l1168k912K935L4621J5872
14183I990K731N734j6553j3866K902K2518Q714O548m983K763J1337J4670j9284
14170C3221l5760r551J3962q359j4264J2031J5820q803P414P028q025o368p795
14157i449k311j5447q827J0784q049K5179J1143j0981j6737j2323L764j14R393
14144b3975J8654L956n336O122R433j6843j1365J1330j997Q880L516J0075N36
14131A2986q638L01J54r513L88J556j5699K4152J4216r202j013K788R599r197
14117A2878m89n100o99R220m133r585j7084n04K034r268J1004J0390j521N790
$$ plain form
14208 179053 175277 170227 150514 103359 91434 80197 63705 49414 24974 30974 29222 32097
14196 32097 36411 22562 -1265 -14092 -36962 -31153 -8836 -9358 -40526 -43438 -40503 -5882 9990
14183 9990 12721 18455 1902 -11964 -9062 13456 22170 28718 23735 26498 37835 52505 33221
14170 33221 -2539 -12090 1872 -6487 -20751 -8720 7100 -1703 5711 12739 4714 -1654 -9449
14157 -9449 -11760 -27207 -36034 -25250 -33299 -8120 3023 -7958 -24695 -37018 -33254 -33368 -23975
14144 -23975 -5321 -1365 -6701 -579 8854 -7989 -19354 -8024 -10021 -1141 2375 12450 12986
14131 12986 4348 4649 4803 -4710 -4322 -2766 -18465 5687 19903 10701 9688 12476 22075 12878
14117 12878 12389 7289 6590 15810 11677 2092 -14992 -15496 -13462 -22730 -11726 -1336 -2857 2933
14103B933N437J29k3809r389J0944Q813K392L194R12O280j1273J0251j0366j5000
14089a8552R31R141K1932P388p30j6889j8896q643k82J1730K1151l096l14k5255
14075b0384l24K8250j0269L924M142N871r688O537M580L908r838N485j8095m127
14061a0028o365J2349k330R141L62O474k9183J6561P164K348m034M383K430j3138
14047c866Q577J8850m780j0043j2470J915k829q756L891j1974j2833L2022J2837
14034A0541J6303L150q240q911R627P294p330J144N124j941j4609j1628n287r863
14020a4626J0206L3777J725R728J7809J349j9714j0363m801k2149j0740P165O128
14007E494P774j0874j3679J7022K6764N027j7894j0548j7594l6626p585n42J280
$$ plain form
14103 2933 8370 8499 -15310 -24699 -13755 -4942 -2550 644 1556 7836 -3437 6814 -3552 -18552
14089 -18552 -17621 -8480 13452 20840 20110 3221 -15675 -24318 -24600 -12870 8281 5185 4871 -20384
14075 -20384 -20708 7542 -2727 1197 5339 11210 1522 8059 12639 16547 6709 12194 -5901 -10028
14061 -10028 -16393 -4044 -6374 2767 3129 9603 -19580 -3019 4145 6493 2459 6842 9272 -3866
14047 -3866 4711 23561 18781 8738 -3732 -1817 -4646 -13402 -9511 -21485 -34318 -2296 10541
14034 10541 26844 29994 21754 12843 22470 29764 22434 23578 28702 26761 12152 524 -4763 -14626
14020 -14626 -4420 29357 31082 40810 58619 59968 40254 29891 25090 2941 -7799 -634 5494
14007 5494 13268 2394 -11285 5737 32501 37528 19634 9086 -8508 -45134 -52719 -53261 -51981
13994e1981J8575J6907R818J4570K995n438j5780k1593j1721J3528K9857R158
13982H895J5359J1103k240O058q962o525P559j4353N966Q976R5N001k3999q847
13968D086l186o550j249j2J2368m91O928J0780p299j4332j7354j1791j2741K3268
13954a7575J7971n187j0172k633k935k528J7443J2635q183q069J2692J0580k078
13941A1961M573k746q576j4560j8699o625L828J8592J1291P919N94L805J785r928
13927C214J1703j6018o594n564K203l319j2583J7900K9461J5462o204p09j7456
13914A1496j8457j1926M460R965j2278k1493R466J5002j8268m040L0061K1716
13902A5704r156J6884j416k442j3955k6529K935M124j602M442J5741M38Q0O195
$$ plain form
13994 -51981 -33406 -16499 -6681 7889 10884 5446 -10334 -31927 -43648 -30120 -263 8895
13982 8895 24254 35357 33117 39175 30213 23688 31247 16894 22860 31836 31931 36932 12933 4086
13968 4086 900 -5650 -6899 -6911 5457 4966 11894 22674 15375 1043 -16311 -28102 -40843 -17575
13954 -17575 396 -4791 -14963 -17596 -20531 -23059 -5616 7019 -1164 -9233 3459 14039 11961
13941 11961 16534 13788 5212 -9348 -28047 -34672 -30844 -12252 -961 6958 7552 11357 13142 3214
13927 3214 14917 -1101 -7695 -13259 -11056 -14375 -26958 -9058 20403 35865 29661 28952 11496
13914 11496 -6961 -18887 -14427 -4462 -16740 -38233 -28767 -13765 -32033 -36073 -6012 15704
13902 15704 6548 23432 22016 19574 5619 -20910 -17975 -13851 -15453 -11011 4730 5168 5248 11443
13888A1443P37r384j2137M327O047M335J1010K79j7154q441m669r65R922p900
13874a2550j1585L466k789P640J0134l020j9396o097J0003N365r283K3287J6673
13861A1848m128P52M136O522r80k0795o723R909P84M234l147J2037j0724j5484
13847a1759k680j2207O323j17O479K1950n029J0223r04j308j0790J124O923J5112
13833B3340J21M452k60j7888n483Q64J3223j239r922L600J7801J4218j9405k0513
13819B909q703p061J1983J3235Q058j187j8157r148j2907n524J0617M682P441
13806c762J427J555O45o997K222K4912J3917j0752p035j5720j644J244j2664j4119
13792b6771J0061J0416M786n918Q229J1588q638N494j0105L910r20k2857O881
$$ plain form
13888 11443 12180 2796 -9341 -5014 1033 5368 16378 16657 -497 -8938 -13607 -14572 -4650 -12550
13874 -12550 -24135 -20669 -23458 -15818 -5684 -8704 -28100 -34197 -24194 -18829 -28112 -4825 11848
13861 11848 7720 8472 12608 19130 18150 -2645 -9368 541 1325 5559 2412 14449 3725 -11759
13847 -11759 -14439 -26646 -20323 -20440 -13961 7989 2960 13183 12279 10971 181 1305 8228 23340
13833 23340 23461 27913 27653 9765 4282 5146 18369 17130 7208 10808 28609 42827 23422 2909
13819 2909 -5794 -12855 -872 12363 20421 19234 1077 -8071 -20978 -26502 -15885 -11203 -3762
13806 -3762 -2335 -780 -135 -7132 -4910 20002 33919 23167 16132 412 -1232 12 -12652 -26771
13792 -26771 -16710 -6294 -1508 -7426 803 12391 3753 9247 -858 3052 2132 -20725 -13844
13779a3844O143Q900O866J4744N554j1351Q573R056p510l40M314N453K04j2984
13765B3778j1425M344J0388K494r900j8319o662K2153r313j2511L011j436N249
13752A851J874j0653q516n900J1578J8451j0316o840J1880J2467M297j2353O689
13739A4509J0528o826j1834k564Q336j1372J5551M705p939k987j0394Q484k144
13726F053q624j0386K028L646P092O151J2043M230k903Q103J2637j0173L43j8922
13712A1318k671K5004K2404K1607J3810r183k568Q988O961k815j5699j6854j3647
13699D6655Q64j039k6023J6043K668m997r446l620j3282j3048j548l998J2882
13686B111J3814k128q146m347J2640J9371p264l172N831Q463k1566m390Q279k0705
$$ plain form
13779 -13844 -7701 1199 8065 22809 28363 17012 25585 34641 27131 26791 31105 36558 36762 23778
13765 23778 12353 16697 27085 29579 19679 1360 -5302 16851 7538 -4973 -1962 -3398 1851
13752 1851 3725 -6928 -15444 -21344 -9766 8685 -1631 -8471 3409 15876 20173 7820 14509
13739 14509 25037 18211 6377 3813 12149 777 16328 21033 13094 10107 -287 8197 6053
13726 6053 -2571 -12957 -10929 -7283 -191 5960 18003 22233 19330 27433 40070 29897 30240 11318
13712 11318 8647 33651 56055 77662 91472 82289 79721 88709 95670 92855 77156 60302 46655
13699 46655 47519 46480 20457 36500 39168 34171 24725 21105 7823 -5225 -6773 -10771 2111
13686 2111 15925 13797 5651 1304 13944 33315 26051 22879 28710 37173 15607 11217 19496 -1209
13672a209p844J1123l186O765N698o223p168K2811k051k981R545J6125j9402j1651
13658A0352L07j0423K040L097J0315r087J059K2889J0935k4302k0034Q882M995
13645A1025j0024Q36J73l045J4379p333M750k527j2788j1250L516K653q260l348
13631b1243J0764K350k5009J7999J6093R994K3173L447j0257j4392j9615j136
13619g832J6786J9299p454j5341r281k258O770L461k217o479q406O544J2827K41
13605F660l259o12M235r185l744J7269P973n943q138Q674J0046j2921k540Q4m349
13590D250N573j0640L027J2757J003j3202j0265r297o184N654J2005n35K460R519
13576F125n156P462Q307K912O184l795o377P364N962p022k1677j3990K2305K0926
$$ plain form
13672 -1209 -9053 2070 -1116 5649 11347 5124 -2044 20767 18716 15735 25280 41405 22003 10352
13658 10352 10659 236 2276 5373 15688 6601 7660 30549 41484 17182 -2852 6030 11025
13645 11025 1001 1837 2010 -1035 13344 6011 10761 8234 -4554 -15804 -12288 -9635 -17895 -21243
13631 -21243 -10479 -8129 -33138 -15139 954 10948 34121 37568 27311 12919 -6696 -7832
13619 -7832 8954 28253 20799 5458 -3823 -6081 689 4150 1933 -4546 -12952 -6408 6419 6660
13605 6660 3401 2789 7024 -2161 -5905 11364 19337 13394 5256 13930 23976 11055 8515 8599 4250
13590 4250 9823 -817 2210 14967 15970 2768 -7497 -16794 -22978 -17324 -5319 -5854 -3394 6125
13576 6125 969 8431 16738 19650 25834 22039 15662 23026 28988 21966 289 -13701 8604 29530
13562B9530J191K325k646j5110l7192r859Q932Q814r906q809J8276J1153k474
13549e775Q709k010Q701j9397p127J1615R746k1325J0719L1102M860N848j557
13536C4109k0569k1349O925J5194N02K745R053m875r714M86n507K686R387L96
13522A9469j041l376K815J210N058P108L122P346l3786l5406N182J2389K5651
13509A5741J6408r174M520O204j200O33p378m404j1923m368j5989J6272L4245
13496C9587k520j2748k6738j9905M939J3914K1989P519j1311l6670j5598l239
13484d0781N409P790R293O255L271j1923Q442J0159K804P934p677q809q538N385
13470a0986j5847j2130P534K0033J4326L2206N587q550N249j2478k0697j216J794
$$ plain form
13562 29530 30721 33046 30400 15290 -21902 -31761 -22829 -14015 -23921 -32730 -14454 -3301 -5775
13549 -5775 2934 924 9625 -9772 -16899 -5284 4462 -16863 -6144 24958 29818 35666 34109
13536 34109 13540 -7809 -884 14310 14812 17557 26610 21735 12021 12507 7000 9686 19073 19469
13522 19469 18428 15052 17867 19077 24135 31243 34365 41711 7925 -27481 -22299 -9910 15741
13509 15741 32149 22975 27495 33699 32499 33132 25754 21350 9427 5059 -10930 5342 39587
13496 39587 37067 24319 -2419 -22324 -17385 -3471 18518 26037 14726 -21944 -37542 -40781
13484 -40781 -35372 -27582 -18289 -12034 -8763 -20686 -12244 -2085 719 8653 976 -7833 -16371 -10986
13470 -10986 -26833 -38963 -31429 -11396 2930 35136 40723 32173 37422 24944 4247 3031 4825
13457D825K976M106m20l627k5031M746N634K43n872p51L355J247l872K620J4398
13442D577M04n408l455k957O712k271O50j4986o807R755R29j0055J9035J0120
13428F243n989P525J0376M417J0464N061k0653N761N274j3799k0742r102j0218
13415b5382R502J3480N523O183o41r399j4182j2962j2260O010K1491j345J2352
13402a630P521k622L651R539N331j2735P113j970j2353j1070K0237J0695j159
13389B0548J5417k1823l1340O652L0131k738q001j4615j5492K2206J2839J3400
13377B7184k1781k587K6332J730L699K970j0781o734R231j753m481J664p136M30
13363A7987m760L524L946l708k416j3312K184j422J4073O691k5126p306K2619
$$ plain form
13457 4825 7801 11907 11487 7860 -17171 -12425 -6791 -6548 -12420 -13171 -9816 -8569 -12441 -9821 4577
13442 4577 4981 -427 -3882 -6839 -127 -2398 -1748 -16734 -23541 -13786 -12857 -22912 -3877 6243
13428 6243 254 7779 18155 22572 33036 38097 17444 23205 28479 14680 -6062 -15164 -25382
13415 -25382 -15880 -2400 3123 9306 8665 -734 -14916 -27878 -40138 -34128 -12637 -13982 -1630
13402 -1630 5891 3269 6920 16459 21790 9055 16168 14198 1845 -9225 11012 21707 20548
13389 20548 35965 14142 -17198 -10546 19585 16847 8846 -5769 -21261 945 13784 27184
13377 27184 5403 2816 29148 30878 34577 37547 26766 20032 29263 27510 23029 24693 17557 17987
13363 17987 13227 16751 20697 16989 14573 1261 3445 2023 16096 22787 -2339 -9645 12974
13350A2974J0711M835j3456j5242o489j4931M142J6640K13l196J9991k229j3410
13337E53p689J2722Q305N421k999R074j1094k5825j4388J9374p06j1883Q844J0420
13323A29J7250J412j3056n397J037j7289R806K3157O202L523O901q332L652Q697
13309C7692J4104L86l9222k8698J3067R920J635J362L253O231N848r597R48J1554
13295B8483J179M777j860m603m338r80N39J1858J240L066J1141r349r021j3147
13281A8985L655N667p329q14p819J5188k599r893k597j0076n945j8397m710K681
13267b4003K5558R293o693J9127J0363j6970p680j3377n148O588o2Q909n573P318
13253G650J4933j2171m405r217k717k257P110q83L118J3280L689P708o629j8546
$$ plain form
13350 12974 23685 28520 15064 -178 -6667 -21598 -17456 -816 -603 -3799 16192 13963 553
13337 553 -7136 5586 13891 19312 16313 25387 14293 -11532 -25920 -6546 -7252 -19135 -10291 129
13323 129 17379 18791 5735 338 1375 -15914 -6108 17049 23251 26774 33675 25343 28995 37692
13309 37692 51796 52182 12960 -15738 -2671 7249 8884 10246 13499 19730 25578 15981 16929 28483
13295 28483 29662 34439 32579 27976 23638 22658 23197 35055 36295 39361 50502 41153 32132 18985
13281 18985 22640 28307 20978 20164 12345 27533 24934 15041 12444 2368 -3577 -21974 -26684 -24003
13267 -24003 1555 10848 4155 23282 33645 16675 8995 -4382 -9530 -2942 -3004 5905 332 7650
13253 7650 22583 10412 6007 -3210 -5927 -8184 -1074 -1957 1161 14441 18130 25838 19209 663
13239F63j6139J2574K2701l200k0732L15K1284L0313Q60j6487j6669j3619j4405
13226a2541Q694J8270L075J390J0608Q85j1813p506K0842J336o42J058n102l0848
13212b294m647P849K846J5635M776j0754K291p189q2k354q169K569p319p097K1180
13197G241j6696k0585K5777K8356P951J4571r527j1537j7631O038K4363J1535
13185D9856k1926j9683R826K2162k025r629P305k029R43N247j6492n671J0869
13172B8753N014L800k578q859K907j904j3652L532j823j0904N811K4655L550k0913
13158A7389Q856J1095l627l822L517R516J5809O879J6801k358j4232j6656k7250
13145B1917M446J668j2624q790R104M782j0673j0119R972N622J6472O30M904J9498
$$ plain form
13239 663 -15476 -2902 19799 16599 -4133 -3818 17466 47779 48639 32152 15483 1864 -12541
13226 -12541 -3847 14423 17498 18888 29496 30381 18568 11062 31904 33240 32598 33656 28554 -2294
13212 -2294 -6941 908 3754 19389 24165 13411 15702 8513 8431 6077 -2092 477 -6842 -13939 7241
13197 7241 -9455 -30040 -4263 24093 32044 46615 37088 25551 7920 13958 38321 49856
13185 49856 27930 8247 18073 40235 38210 28581 35886 33857 34800 40047 23555 17884 28753
13172 28753 33767 37567 34989 26130 29037 27133 13481 17013 15190 4286 10097 34752 38302 17389
13158 17389 26245 37340 33713 29891 33408 42924 58733 65612 82413 80055 65823 49167 21917
13145 21917 26363 28031 15407 6617 15721 20503 9830 -289 9683 15305 31777 32407 37311 56809
13131E6809N325j4968j6880m163Q946J8848p429j5274J2360M815j5113j0035j5248
13118G993r2Q984j950Q930k665k443p882p496J5995J2197l999k556R143J1416
13104D5575J4991Q316q243m926P125j6275n650j1887M651J8730J6206j9174k1135
13091B8304o399K30O306M752O314L1418o256P828O067n931M503j3622k1165j300
13077D1049o025o596k176k987q5K560J1895P492J216j4956k69j992k234n167k5592
13062c867j2300J7189L3673L1528J6914q614k5637j3560J6765K041j6322l951
13050C3859J2548N10j0843m802j1528J0431J3565m042k1932k875K7356j5360j1079
13037A5808J0190k81K0179J0171k2162o993j1174K0159r505o910O103J4343J4240
$$ plain form
13131 56809 62134 47166 30286 26123 35069 53917 46488 31214 43574 48389 33276 23241 7993
13118 7993 7901 16885 14935 23865 21200 18757 10875 3379 19374 31571 27572 25016 34159 45575
13104 45575 60566 68882 60639 55713 62838 46563 40913 29026 33677 52407 68613 49439 28304
13091 28304 21905 22135 28441 33193 39507 70925 64669 72497 78564 72633 77136 63514 42349 41049
13077 41049 35024 28428 26252 23265 23180 25740 37635 45127 46343 31387 31118 29126 26892 21725 -3867
13062 -3867 -16167 1022 34695 66223 83137 74523 48886 35326 52091 54132 37810 33859
13050 33859 46407 46917 36074 31272 19744 30175 43740 39698 17766 14891 42247 26887 15808
13037 15808 25998 25717 45896 56067 33905 26912 15738 35897 26392 19482 25585 39928 54168
13024E4168K0481k853n810J0520j876j1446J117J6616N118o209j6374q631J107
13011E5928o402j9401J1117K3751j899k636m245j3951n641J2716N662p507Q502
12998E5994k386j7982j001Q432m537N210L5566Q898j1891j0180k0473q837J1092
12985D7905J2713p349j9772j248J3304j777N923J2260J249qp005j1841j6845J3910
12971D1419J1368j3319j3085J6318j8302p503J120j0791J3818m378P95K1077K650
12958D1187n78r84j100r329M112j464N025r313o52J4381J4325O025Q002J4521
12944H4158p090L42J7975J6293k510j4183n195J3797n387o608k128J8156j5731
12931I1889j4409J8727K2739k084K083P934M2103N4388M6757Q9246J65291J64188
$$ plain form
13024 54168 74649 71796 65986 76506 74630 63184 64301 80917 86035 79826 63452 54821 55928
13011 55928 49526 30125 41242 64993 63094 60458 56213 42262 36621 49337 54999 47492 55994
12998 55994 53608 35626 34625 43057 38520 43730 79296 88194 76303 66123 45650 36813 47905
12985 47905 60618 53269 33497 32249 45553 43776 49699 61959 63208 63200 56195 44354 27509 41419
12971 41419 52787 39468 26383 42701 24399 16896 18016 7225 21043 16665 17460 38537 41187
12958 41187 40609 39625 38525 29196 33308 31844 36869 27556 26904 41285 55610 61635 69637 84158
12944 84158 77068 77410 95385 111678 109168 94985 89790 103587 98200 91592 89464 107620 91889
12931 91889 77480 96207 118946 116862 118945 126879 168982 223370 270127 359373 524664 688852
12919F88852J57743K04672K08721Q8895J5388J1570o1779j77478j86055j63122
12909G87407j61569j41055j13966q5198m2027l5702k7821k149k7365k6116j690
12898A22749J5907K203o630J2140l345K483K4363J9394j324K9514M3299L7439
12886B98192N0180O1556Q0443O7355Q2638R2039Q1262P8165O8049L4327l2267
12875I61939o6697q9748j11904j16849j11359j01850n8237m7919l8552l4044j6162
12864A68618k3048k844j1614k5994R310J0857M137j6338k2336p746k564J3590
12852I4028K741l447J56j497o269j4996j4973K2838K5411K0803j5045r890j1493
12839H8367J1466J1215P855o979k3943q298o216j1161K0321J8842J7343J4624
$$ plain form
12919 688852 846595 1051267 1259988 1348883 1364271 1375841 1314062 1136584 950529 787407
12909 787407 625838 484783 370817 285619 243592 207890 180069 177920 150555 124439 122749
12898 122749 138656 140859 134229 146369 143024 145507 169870 189264 187940 217454 260753 298192
12886 298192 348372 409928 490371 557726 640364 732403 813665 891830 959879 994206 961939
12875 961939 895242 805494 693590 576741 465382 363532 305295 257376 218824 184780 168618
12864 168618 145570 142726 131112 105118 114428 125285 129422 113084 90748 83002 80438 94028
12852 94028 96769 93322 93478 91981 85712 70716 55743 78581 103992 124795 109750 99860 88367
12839 88367 99833 111048 118903 111924 87981 79683 73467 62306 82627 101469 118812 133436
12827A33436j1693j3418r082j4498P697J4080P99K2023J3744Q020J5930P269j0724
12814A63583J6057J0817k2206l3555Q564R150j6670j7414K245q027j2710J386
12802A01220j6065l9000P848K2300J8672K939P774p083N739k074n134J6440R625
12789A23201m837k0558R794K1954J7182J2889L0808l394m327J2092r962j8981
12777A65861k1485j4469P447K511J6770J0809L0614N5195L5374M7275Q2302J32367
12765E50571J82611J62132J81832J51799M1659L6280J9567j22426j77089j53302
12755H73634j41097j36182j10574o9249m7343l7240l7662j0958n61k07J9114M4690
12743C46365L8314R0483J50695J35366J10628Q3071M6982j3802q6971j07734r8305
$$ plain form
12827 133436 121743 108325 99243 84745 92442 106522 107321 129344 143088 151108 167038 174307 163583
12814 163583 179640 190457 168251 134696 143260 152410 135740 118326 120571 112544 99834 101220
12802 101220 85155 46155 54003 76303 94975 97914 105688 98605 104344 102270 97136 113576 123201
12789 123201 118364 97806 107600 129554 146736 159625 190433 187039 182712 194804 184842 165861
12777 165861 144376 129907 137354 139865 156635 167444 198058 253253 288627 335902 418204 550571
12765 550571 733182 895314 1077146 1228945 1270604 1306884 1326451 1204025 1026936 873634
12755 873634 732537 596355 485781 416532 369189 331949 294287 283329 282768 282561 301675 346365
12743 346365 384679 475162 625857 761223 871851 954922 1001904 988102 901131 793397 695092
12732F95092n7705m8808n7591k3488k8692l9560r515k8065j9306k9411k1446k4647
12720C06858k3922k7665l0361j2516j701n940j9357l217J0979L0838j3075l329
12708B07592K4310J2972m252k9614j6818j9012j5501L803J4929R570n017k783
12696A80179n834j889q208m445R677P114p663k1514q643l413q531M383j223k0602
12682A09388j5932J1292N932K874l91L133o952j3513l604J9482J9912K613j5330
12669A18904Q094o400j5520k853l70J799J2351k822J8251j5255M935N691o529
12656A20276q29j4639k1944n081K7186N301r849K2600J5905Q483O500m610j269
12643A48030J8587K0663L372l217l204J6545K0037l335j3897J5818J3200q379
$$ plain form
12732 695092 637387 588579 530988 507500 478808 439248 429733 401668 382362 352951 331505 306858
12720 306858 282936 255271 224910 212394 210693 204753 185396 182179 193158 223996 210921 207592
12708 207592 231902 244874 240622 211008 194190 175178 159677 163480 178409 187979 182962 180179
12696 180179 174345 172456 164248 159803 169480 176594 168931 147417 138774 135361 126830 131213 129990 109388
12682 109388 93456 104748 110680 113554 113163 116296 109344 95831 92227 111709 131621 134234 118904
12669 118904 126998 120598 105078 102225 101855 103654 116005 113183 131434 116179 121114 126805 120276
12656 120276 119447 104808 82864 77783 104969 110270 100421 123021 138926 147409 153909 149299 148030
12643 148030 166617 187280 190652 187435 184231 200776 220813 217478 203581 219399 232599 224220
12631B24220m883O866k2746r523R339J1871K3936L639K5542J6707k97J7512K486
12618C04669O122L554J3038J9275K56J5261M6844O2752K8481M2834M8511L6064
12606F27661L0989J2627J9423j3058n435j971k6482o0777l8062m3559n2515k7827
12594D21014J8552J8548j3917N010L0235L1041K2969M9341M5603K0690M711k961
12582F50836J555j7332p262j6763r317j4814k4203j0410L537n340j9053l9364
12570D92070j7624K5800J3865n903j185r686m106K0847K9267K9435L3170K0282
12558F26232K6308N680J3071k772N069J4375K8364L2573L7166K6146L7785J7911
12546H67908M906N120P977L0412L2720K5220L5673L0324L8911M7897N3754M9326
$$ plain form
12631 224220 219337 226203 203457 193934 203273 215144 239080 242719 268261 284968 284671 302183 304669
12618 304669 310791 314345 327383 346658 346914 362175 409019 471771 500252 543086 591597 627661
12606 627661 658650 671277 690700 677642 672207 670236 643754 582977 544915 501356 448841 421014
12594 421014 439566 458114 444197 449207 479442 510483 533452 582793 628396 649086 653797 650836
12582 650836 652391 635059 627797 611034 601717 586903 562700 552290 555827 550487 531434 492070
12570 492070 474446 500246 514111 508208 507023 497337 493231 514078 543345 572780 605950 626232
12558 626232 652540 658220 671291 668519 673588 687963 716327 748900 786066 812212 849997 867908
12546 867908 872814 877934 885911 916323 949043 974263 1009936 1040260 1079171 1127068 1180822 1230148
12534A230148L2774O3066R5598M9755l2550m0307k6499o409J3586J1620K8120
12523A418902M2428N0434K4677M9020Q1408M4447O4146O6498K6249K7494Q6604
12512A982307R8370R9799Q1451Q3385J02314J23828J45740J46013J59406J61634
12502C184247J70873J99616K68433K93066L29852L56502L94570M45271M87346
12493F129776N65461O69238P53917R17556J098453J355148J718958K225281K906147
12484A8339935L881741N426947P872887J1620718J7500016K5286015L0937168
12477A20865427L1740129L6184688M3127969K8311731K770036K449554K761308
12470B68210842k3227330m0021598l3333756k8652192k9858317k5796816j7781658
$$ plain form
12534 1230148 1262922 1325988 1421586 1471341 1438791 1398484 1371985 1365576 1379162 1390782 1418902
12523 1418902 1461330 1511764 1536441 1585461 1666869 1711316 1775462 1841960 1868209 1895703 1982307
12512 1982307 2080677 2180476 2261927 2345312 2447626 2571454 2717194 2863207 3022613 3184247
12502 3184247 3355120 3554736 3823169 4116235 4446087 4802589 5197159 5642430 6129776
12493 6129776 6695237 7364475 8118392 9035948 10134401 11489549 13208507 15433788 18339935
12484 18339935 22221676 27648623 35521510 47142228 64642244 89928259 120865427
12477 120865427 152605556 188790244 231918213 260229944 262999980 265449534 268210842
12470 268210842 244983512 204961914 171628158 142975966 113117649 87320833 69539175
12463F9539175j0627156n155486n72831L982476Q888030J3887265J7898683K0279754
12455A18119910K0285289J7348120J1612309L671210n011219j3037817j9206047
12448A33781755k2555500k2523392j9914188j5814789j1631159q256057n820079
12441B7266591m183564l122397k382359j941545j699050j558233j429471j287814
12433I662158j167938j000517q13629o82066n63380m72472l99728l43860l04058
12424C914510k49702k09277j78349j20111j34491j51305j55375j61638j26484
12415B427778j31671j32208j18760j00463r6843q8943o8310q8879j00741o0233
12405A440727n6579n2986l9913n1362m6952l2449n2174l7814l5116m7286l9575
$$ plain form
12463 69539175 58912019 53756533 53183702 57166178 66054208 79941473 97840156 118119910
12455 118119910 138405199 155753319 167365628 171036838 166025619 152987802 133781755
12448 133781755 111226255 88702863 68788675 52973886 41342727 33086670 27266591
12441 27266591 23083027 19960630 17578271 15636726 13937676 12379443 10949972 9662158
12433 9662158 8494220 7493703 6680074 5998008 5434628 4962156 4562428 4218568 3914510
12424 3914510 3664808 3455531 3277182 3157071 3022580 2871275 2715900 2554262 2427778
12415 2427778 2296107 2163899 2045139 1944676 1847833 1758890 1690580 1601701 1500960 1440727
12405 1440727 1384148 1331162 1291249 1239887 1192935 1160486 1108312 1070498 1035382 988096 948521
12394I48521m0433m6932l2496k7948k4321k3836k4J2412K5481J0980m571K125
12382G98958R472L026k4007m1465l6986m8275m7004k4297j5060l878r302j1945
12370E49237q918j9588j0541M902j8275j4008r10J7913L9989j7017k8631L532
12358D97685m189j2498O058j5342j3559J8466K8254K3203L8973K0168l0851k9646
12346E26722k892q796m5208m2068j8376j5940r666l2802k3457j6126j1124p985
12334B92282Q12p963M492p74J7585K1500K056j2318L046k1176j4560l431j4686
12321B66865k0156k3546k0225j5555k0729k989p899J2983J777k4116n929J0743
12309A51224J1154k7659o664k16m473J845O941j911K504m121J1134o836j1406
$$ plain form
12394 948521 908088 861156 828660 800712 776391 752555 752531 764943 790424 801404 796833 798958
12382 798958 808430 811456 787449 745984 708998 660723 613719 589422 574362 570484 561182 549237
12370 549237 540319 520731 510190 515092 496817 482809 481899 499812 539801 522784 494153 497685
12358 497685 493496 480998 487056 471714 458155 476621 504875 528078 567051 587219 556368 526722
12346 526722 523830 515034 469826 427758 409382 393442 383776 350974 327517 311391 300267 292282
12334 292282 293094 285131 289623 288849 306434 327934 329990 317672 320718 299542 284982 281551 266865
12321 266865 246709 223163 202938 187383 166654 163665 155766 168749 170526 146410 140481 151224
12309 151224 162378 134719 128055 127839 123366 125211 132152 130241 132745 128624 139758 132922 121516
12296A21516O835K0101J270j3429J7553J6737J5819j6131J779L442o248L179J853
12283A74276P870K7067N573j4550O110M590O516K455j6801o200J649j0017j3906
12270A74632k5627P787j6765L58r629q158J639J6967Q999Q194k0343q720Q466
12257A37800l967j0072K563P013J409j5048l225j0179j557J4660P381o333O547
12244A26992J8370K1530j2327k0358o582q637M996j6531j5162j526p08O243N977
12231A02277L1887K2813P591p636O886K9867j5002o319J7476R198j7812j2071
12219A69155L727j6562l5763n937K504q906l684R09r932J8763J1572j4442r602
12206A01802O451J963j7671l371j1495j1678J4451j231j5735q052r185J3946R244
$$ plain form
12296 121516 128351 148452 149722 136293 153846 170583 186402 170271 172050 175492 169244 172423 174276
12283 174276 182146 209213 214786 200236 206346 210936 217452 219907 203106 196906 198555 188538 174632
12270 174632 149005 156792 140027 140385 130756 122598 124237 141204 150203 158397 138054 129334 137800
12257 137800 133833 123761 126324 133337 134746 119698 116473 106294 104737 119397 126778 120445 126992
12244 126992 145362 166892 154565 134207 127625 118988 123984 107453 92291 90765 90057 96300 102277
12231 102277 134164 156977 164568 156932 163818 193685 178683 172364 189840 199038 181226 169155
12219 169155 172882 156320 120557 114620 117124 108218 104534 105443 95511 114274 125846 111404 101802
12206 101802 108253 110216 92545 89174 77679 66001 80452 79221 63486 55434 46249 60195 69439
12193F9439L926j6635q000L593j1587P627n08O4J6699K3027j3192k6690j8302
12180B9461L807J9966K7731J222J5131Q251m575p206m130J145j103N209O659j7810
12166H3758o380j3884j827J012j7902p533N658L929O51K7760L2376j817j3775
12153I2026j4721m612m321j3498P628J968m475l582j4948j1350q340L14L658l399
12139B2348O431j881M6M638K5380J3932j873k938o433j9114j4474K3809m04o439
12125D3028Q80P077j3553j7640l739J4478j1834j0823k014P043P375J874N966
12112B8118o496n707l524j0104J2109J6607J815J43q611J2877K864J1730P86m770
12098D7837j1058j4284J548l542j4439Q80N300J9188j1463j11N445k3238M835
$$ plain form
12193 69439 73365 56730 48730 52323 40736 48363 47855 47919 64618 87645 74453 47763 29461
12180 29461 33268 53234 80965 82187 97318 105569 100994 93788 89658 90803 89700 94909 101568 83758
12166 83758 77378 63494 61667 62679 44777 37244 42902 46831 47482 75242 107618 105801 92026
12153 92026 77305 72693 68372 54874 62502 64470 59995 56413 41465 30115 21775 22089 25747 22348
12139 22348 28779 26898 26944 31582 56962 70894 69021 66083 59650 40536 26062 49871 49467 43028
12125 43028 43908 50985 37432 19792 16053 30531 18697 7874 5860 12903 20278 22152 28118
12112 28118 21622 15915 12391 2287 14396 31003 32818 32961 24350 37227 40091 51821 52607 47837
12098 47837 36779 22495 24043 20501 6062 6942 12242 31430 19967 19856 25301 2063 6898
12085F898P112n362N835p389L437K276J450o960M645K462P670n391r64K0046j3403
12070B2362l061k102P555p03P856Q87n539j5265K5067K7180L336m528q056p532
12056D7457j7723J1461J1180n495j2360p222r128q724K0947J1576n599J0133R365
12043E5868K169P515j5968R563N507Q838K2610K7396N0002L6788L3715P2860R0418
12030D07281J61671J91495K12975K61041L20294K91219J63611J02429Q7010m4793
12020B154233k10671k63907k50377k72835k62316k08877j51737j14921p7610o4492
12010B76490l8552k8319k0620l1971j7927q742m678j6990k0599l0131k0203J4273
11998E2031P538P517M305r174j5844j9603k3985q17n652j2860k761J0141M509
$$ plain form
12085 6898 14010 8648 14483 7094 10531 12807 14257 7297 11942 14404 22074 16683 15719 35765 22362
12070 22362 19301 17199 24754 24051 31907 32794 27255 11990 37057 64237 67573 63045 54989 47457
12056 47457 29734 41195 52375 46880 34520 27298 18170 9446 30393 41969 36370 46503 55868
12043 55868 58037 65552 49584 59147 64654 73492 96102 123498 173500 210288 244003 316863 407281
12030 407281 568952 760447 973422 1234463 1554757 1845976 2009587 2112016 2199026 2154233
12020 2154233 1943562 1679655 1429278 1156443 894127 685250 533513 418592 340982 276490
12010 276490 237938 209619 188999 157028 139101 130359 125681 108691 88092 57961 37758 52031
11998 52031 59569 67086 71391 62217 46373 26770 2785 1968 -3684 -16544 -19305 -9164 -4655
11985d655L29k034Q451n135Q803j0858p016J7831m908K2340j871j6308Q075J348
11971A4392Q216M853M416n480p102p945l972R848k547n012P823R685K99n498K295
11956B4271m138p260l745Q588p518j0087L964K88R274N227j0572M156N120K6295
11942D3863m827j3332j9319j3846J8476j457J5024J0210p234N424n282j8675n174
11929C851P310J0783J350k5041k93j719j2842l105J7815K4642j999q673l071j3228
11915d220m816J989J4230L3J164m398l717m368J547Q160m128J0348M014Q442J492
11900B5772j6916L161q411j1492J4354L971R679p993j7867p728J0069j5068N496
11887a2973K3819r419l03K3199R025j3547j5331L264j0571n478k883q213o875
$$ plain form
11985 -4655 -4326 -6360 2091 -3044 5759 -5099 -12115 5716 808 23148 21277 4969 13044 14392
11971 14392 22608 27461 31877 26397 19295 11350 7378 17226 14679 9667 17490 27175 27474 21976 24271
11956 24271 20133 12873 9128 17716 10198 111 4075 4363 13637 18864 8292 12448 17568 43863
11942 43863 39036 25704 6385 -7461 11015 9558 24582 34792 27558 32982 27700 9025 3851
11929 3851 11161 21944 23294 -1747 -2040 -3759 -16601 -19706 -1891 22751 20752 12079 9008 -4220
11915 -4220 -9036 -7047 7183 7216 8380 3982 265 -4103 -2556 5604 1476 11824 15838 24280 25772
11900 25772 8856 12017 3606 -7886 6468 10439 20118 12125 -5742 -13470 -3401 -18469 -12973
11887 -12973 10846 1427 1124 24323 33348 19801 4470 7734 -2837 -8315 -11198 -19411 -26286
11874b6286Q919J2791m101j6037L331K7443l316j1506l84m884M205o146o076J7704
11860d343j2997M028m106p902M893K2152J779j6242p977o347l556O199L381l340
11846b4378R853J4444q259j9855M273M422K1965K2754M138j5112k5873p367K432
11833a6563K033o668J5195J9304m336R156k148k5988j0896k0714J3427R159m9
11820a9088M325J9307K704j1633r575j1125q105K5149J1141j403p231p900q686
11807b2120j4903K550L968R563J2813m355j0822o232L159Q432j3685k0659O544
11794d5747J2340k796p786J2751K0409J5128p338P464l139r851K0384N800r275
11781H344L199j3400j3489Q481M870j5380n504o1K8696l754r016m825K6718J1540
$$ plain form
11874 -26286 -17367 -4576 -8677 -24714 -21383 6060 2744 -8762 -9146 -14030 -9825 -15971 -22047 -4343
11860 -4343 -17340 -13312 -17418 -25320 -20427 1725 3504 -12738 -20715 -27062 -30618 -24419 -21038 -24378
11846 -24378 -14525 -81 -8340 -28195 -23922 -19500 2465 25219 29357 14245 -11628 -18995 -16563
11833 -16563 -14530 -21198 -6003 13301 8965 18121 15973 -10015 -20911 -41625 -28198 -19039 -19088
11820 -19088 -14763 4544 7248 -4385 -13960 -25085 -33190 -8041 3100 1697 -5534 -13434 -22120
11807 -22120 -37023 -34473 -30505 -20942 -8129 -12484 -23306 -29538 -26379 -17947 -31632 -52291 -45747
11794 -45747 -33407 -36203 -43989 -31238 -10829 4299 -3039 4425 1286 -8565 11819 17619 8344
11781 8344 11543 -1857 -15346 -6865 -1995 -17375 -22879 -22940 5756 2002 -7014 -11839 14879 26419
11767B6419k0314N51J5147j3878Q198k283O628o382k5832R052K3031o034J2867
11754B7170O524n514L155K7089O472k4636J9670R613j2514P773m880j8591j1886
11741B9445K4789J4498J0831k3457j0153q136J7267k6054N0J2193O690m093j4111
11728B9759J0015j0621n298J8147j1414q217L757q449q232K720L971l706L02J5730
11714B8464j5290k3544J8353R142J3440n981J4285J9418k0459l7016l671R188
11702F329j0707N430J1844j379j5537M751J5825o599k2539p817K3642J2048O088
11689B1379o320j0941J5202J4363J4620n593j0268q519J112J0848k7778p305p744
11676f944N12J3244j524J001L703J8923m66l395j7577j2788q632J3057K6596P580
$$ plain form
11767 26419 6105 6656 21803 7925 16123 13840 20468 14086 -11746 -2694 20337 14303 27170
11754 27170 33694 28180 31335 58424 64896 40260 59930 69543 57029 64802 59922 41331 29445
11741 29445 54234 68732 79563 56106 45953 37817 55084 29030 29080 41273 47963 43870 29759
11728 29759 39774 29153 23855 42002 30588 22371 26128 17679 9447 12167 16138 12432 12734 28464
11714 28464 13174 -10370 7983 17125 30565 24584 38869 58287 37828 812 -2859 6329
11702 6329 -4378 1052 12896 11517 -4020 731 16556 9957 -12582 -20399 3243 15291 21379
11689 21379 15059 4118 19320 33683 48303 42710 32442 23923 25035 35883 8105 800 -6944
11676 -6944 -6432 6812 5288 6289 9992 28915 28449 25054 7477 -5311 -13943 -886 25710 33290
11662C3290n347j2202j1968j3054K412J1328J3290j631r251q542o723J1310J5037
11649A7949R140j8967j6562J8360P417j866p942l0578k6802O334J1355p619j0348
11636e0129O364J6883N52J7943K5914K836o273r440j2413J2672P871j6592k1937
11623b5749j6341k307K1067P117j7616q855j234K542Q443O724J214L4840O329
11610A6174k7105j9956m460n576j2799K661J3770K0289J2704O087n81k6583j9773
11597d5148K3117O804J513O159n031J237L975n804q870J568P4J0508K8487l639
11583A4950k0506l814L751j8134q378Q345Q024J1780k2108N777J3387M119L723
11570I16j4174o797J1441N494O686J693k422N660j5246j5931j0837r98O591Q545
$$ plain form
11662 33290 27943 15741 3773 -9281 -6869 4459 17749 16118 6867 -1675 -8398 2912 17949
11649 17949 27089 8122 -8440 9920 17337 15471 7529 -23049 -49851 -43517 -32162 -39781 -50129
11636 -50129 -43765 -26882 -26330 -8387 17527 20363 14090 4650 -7763 4909 12780 -3812 -25749
11623 -25749 -42090 -44397 -23330 -16213 -33829 -42684 -43918 -41376 -32933 -26209 -24995 9845 16174
11610 16174 -10931 -30887 -35347 -40923 -53722 -51061 -37291 -17002 -4298 1789 1208 -25375 -45148
11597 -45148 -22031 -15227 -13714 -7555 -12586 -11349 -7374 -13178 -22048 -20480 -20406 -9898 18589 14950
11583 14950 -5556 -9370 -5619 -23753 -32131 -23786 -15762 -3982 -26090 -20313 -6926 -2807 916
11570 916 -13258 -20055 -8614 -3120 3566 5259 2837 8497 -6749 -22680 -33517 -34515 -27924 -19379
11556a9379p114R377K0903j262j4606N301J7844j7751k3139j5462p105K2508J2962
11543a6923R210j99k580n911j7583Q720J6868R147j301j2781M967r642k5358L126
11529d0240K0471J114R525O507p092l421J727n321K036O658j522l30J7476J3308
11515B0896Q304J2880j506L200q488J0093N492j8650k1711q730J792N744k640
11502F676j1624m951P040P743j1374k0180O805K5112R696L857m744L95K151O45
11488A7247k328N630l339k1255j2146L144Q558M517O154J5712m109n388m182K0396
11474B8611O50k276j4769j2594j181j3697n394Q821J2989n01J8820j6616K048
11461D911J8003j5613k4905j7813n931J9131K7983J1071j0423P143J3436j8274
$$ plain form
11556 -19379 -26493 -17116 3787 2525 -12081 -6780 11064 -6687 -29826 -45288 -52393 -29885 -16923
11543 -16923 -7713 -7912 -10492 -16403 -33986 -25266 -8398 749 -552 -13333 -8366 -18008 -43366 -40240
11529 -40240 -19769 -18655 -9130 -2623 -9715 -13136 -11409 -16730 -14694 -8036 -9558 -9888 7588 20896
11515 20896 29200 42080 40574 43774 35286 45379 50871 32221 10510 1780 3572 9316 6676
11502 6676 -4948 -9899 -2859 4884 -6490 -26670 -19865 5247 14943 18800 14056 14451 16602 17247
11488 17247 14919 20549 17210 -4045 -16191 -13047 -4489 28 6182 21894 17785 12397 8215 28611
11474 28611 29261 26985 12216 -378 -1559 -15256 -20650 -11829 1160 659 19479 2863 4911
11461 4911 22914 7301 -17604 -35417 -41348 -22217 5766 16837 6414 13557 26993 8719
11449H719l36l125m348J229j0095p41r676q595J0274R854o545q437J3163J1895
11435C236j9649j054K0267J0891Q953j055j0572q760j3516J4039M08O6J3444J5742
11421C2440j042j0705r147k3487j1818j3734K2411K8088K073j1547L766k1587
11409a4289j6629N956K1960K0465l179k4753Q844n563q620J2542M273N262p329
11396a060L489J0289q161j1668q534j1799j500L235K0776L339j1414q715k903
11383b4626J0148L371J2769K2965J1545m628m603k8464j8441j614n302N044J5816
11370f020J3636j9843j0833O192n32j0236j6488J9455L082p383o61n973m710N259
11356c5055J9667j3264Q809J1321M473p421N720j824j8766M235m102J9433K3907
$$ plain form
11449 8719 8383 5258 910 2139 -7956 -8697 -18373 -26968 -16694 -6840 -13385 -21822 -8659 3236
11435 3236 -16413 -17467 2800 13691 22644 21589 11017 2257 -11259 2780 3188 3254 16698 32440
11421 32440 31398 20693 11546 -11941 -23759 -37493 -15082 13006 15079 3532 7298 -14289
11409 -14289 -30918 -24962 -3002 17463 14284 -10469 -1625 -7188 -15808 -3266 1007 6269 -1060
11396 -1060 2429 12718 4557 -7111 -15645 -27444 -28944 -25709 -4933 -1594 -13008 -21723 -24626
11383 -24626 -14478 -11107 1662 24627 36172 31544 26941 -1523 -19964 -21578 -26880 -21836 -6020
11370 -6020 7616 -12227 -23060 -16868 -17400 -27636 -44124 -24669 -21587 -28970 -29631 -35604 -40314 -35055
11356 -35055 -15388 -28652 -19843 -8522 -4049 -11470 -5750 -7574 -26340 -22105 -26207 -6774 17133
11343A7133j8413k3490P761R528m881K0036K0564j0903p476j0078m532K32R731
11330E212P461J1905J0608j9188j6363k932k024r273r149o851L910J3852j0331
11317b3163n960Q331m752j2411j2391J8453k195r284j9117L4J0280J7470M493
11304c0212M805L65m32J3540N910l91K275N383L599J2429J7548j3334l2012j3605
11290b4132j68l606J4870J1254J918Q164p32K14j4288j2116j4573j1812m976J3706
11276c6277K4715M928J7768J0156m860J3524j1860o747j6028Q538J4852l160p819
11263G730m234O112l302m533J2977N078j3299j9890k394J095m801j891J169J1423
11249h760R59M15o289J705O348J6369j329j8659j2882J2754J2912P164j6001n76
$$ plain form
11343 17133 -1280 -24770 -17009 -7481 -12362 7674 28238 17335 9859 -219 -4751 -4519 5212
11330 5212 12673 24578 35186 15998 -365 -3297 -5321 -14594 -23743 -30594 -26684 -12832 -23163
11317 -23163 -29123 -20792 -25544 -37955 -50346 -31893 -34088 -43372 -62489 -62455 -52175 -34705 -30212
11304 -30212 -25407 -25042 -25474 -11934 -6024 -6415 -4140 1243 4842 17271 34819 21485 -10527 -24132
11290 -24132 -24300 -27906 -13036 -1782 136 8300 7568 7782 -6506 -18622 -33195 -45007 -49983 -36277
11276 -36277 -11562 -6634 11134 21290 16430 29954 18094 11347 -4681 3857 18709 15549 7730
11263 7730 3496 9608 6306 1773 14750 19828 6529 -13361 -15755 -14660 -19461 -21352 -20183 -8760
11249 -8760 -7801 -7386 -13675 -11970 -5622 10747 9418 -9241 -22123 -9369 3543 10707 -5294 -5870
11235e870P156M176J9849j7777l488n10j169k46J5253j5613j6357K855j668O624
11221f785N312P885P898L829j0571o703n243P122k122k0245Q964L677Q629K747
11207D394k670Q950q889k5293j3984j5513Q334J3691K2564M023o531k087K2104
11194I093J415k3720k4047N801n379Q948J385N007O009j182J2399O465K076j0648
11180f378j6645r907P421Q361p913j8990P676J7948m0k3002k674K9449R392j0528
11166a5830J5795P196O76q736P552n860l817M254q137J4203k277j8855n257r203
11152b8296L707K4040J351k2023j7254K730J074n85J0586J3900J2708J3100p164
11139G874j7688j2491n59L655k796O996Q832j7291l369M574j4035j5856M878K9578
$$ plain form
11235 -5870 1286 5462 25311 7534 4046 3536 2367 2121 17374 1761 -14596 -11741 -13409 -6785
11221 -6785 -1473 6412 14310 18139 7568 865 -4378 2744 622 -19623 -10659 -6982 1647 4394
11207 4394 1724 10674 1785 -23508 -37492 -53005 -44671 -30980 -8416 -4393 -10924 -13011 9093
11194 9093 10508 -13212 -37259 -31458 -36837 -27889 -26504 -21497 -15488 -16670 -4271 2194 4270 -6378
11180 -6378 -23023 -32930 -25509 -17148 -25061 -44051 -36375 -18427 -18467 -41469 -44143 -14694 -5302 -15830
11166 -15830 -35 7161 7837 -899 6653 793 -3024 1230 -6907 7296 5019 -13836 -19093 -28296
11152 -28296 -24589 -549 802 -21221 -38475 -35745 -34671 -35256 -24670 -10770 1938 15038 7874
11139 7874 -9814 -22305 -22864 -19209 -22005 -15009 -6177 -23468 -26837 -22263 -36298 -52154 -47276 -17698
11125a7698K2147J9823J44j6707m171j1667l114Q250j9313q238K1842K798L809
11112b095Q588N90J0233o636j3664j1125J145m614N304K808q67J2329r690K919
11098d775N580k329J052j7481J4890K2946k851L54o815j8823j1703j1021O422
11085b4554P272Q629j2388k2369K9218J7232q834K57n635J821J9604j5367p589
11072a2703N325K0556Q380n485J982j0115J448R690j8020K47k040M818J032o178
11058a063j1657L838K4539J985p781R64m541J3444J0214L149j0459j5249j964
11045E419J933L872J2211J0777J1147j8360r577m296k1811J375J9366j1527q352
11032g823j7787q694j1476R305K042J086L1340R660P051r979p944K684j4705J2202
$$ plain form
11125 -17698 4449 24272 24416 7709 3538 -8129 -11243 -2993 -22306 -30544 -8702 -5904 -2095
11112 -2095 6493 7083 17316 10680 -2984 -14109 -12964 -17578 -12274 -9466 -10333 1996 -7694 -4775
11098 -4775 805 -1524 -472 -17953 -3063 19883 17032 17386 10571 -8252 -19955 -30976 -24554
11085 -24554 -17282 -8653 -21041 -43410 -14192 3040 -5794 -5537 -11172 -9351 10253 -5114 -12703
11072 -12703 -7378 13178 21558 16073 18055 7940 9388 19078 1058 1305 -735 4083 5115 -1063
11058 -1063 -12720 -8882 15657 17642 9861 10825 6284 19728 29942 33091 22632 7383 5419
11045 5419 7352 11224 23435 34212 45359 26999 17422 13126 -8685 -7310 12056 529 -7823
11032 -7823 -25610 -34304 -45780 -36475 -34433 -33347 -2007 7653 14704 4725 -3219 -535 -15240 -3038
11018c038L285j1057O542J6730J7368P016J1120j9919k855k0791j7604j0806N294
11005a8715J4718q583m671J8809J2018N768p750j7388j2782m702m822k830J8693
10992a2237K675o280M587K6293N544k0324n891K814K614J8175o697j5190l7546
10979d1463j0637K4146J1174l366l530J568J768J4346J9899K508j6630L169L517
10966F469j4217l082J0898J3879k200j6230j13J4838J6236P545j0174l0666k1464
10953b8281j4201k524K1385J5601M54k920J0016q746J7502J0386R51j804r452
10940H367N065n127O569k0156j724j9293P060N95j7599k029J2805K4036P831J2113
10926A8513N020O589P231J2047r598q654L376r055p103J091j2867m912M970l500
$$ plain form
11018 -3038 247 -10810 -4268 12462 29830 36846 47966 28047 25192 4401 -13203 -24009 -18715
11005 -18715 -3997 -12580 -17251 1558 13576 19344 11594 -5794 -18576 -23278 -28100 -30930 -12237
10992 -12237 -9562 -15842 -11255 15038 20582 258 -5633 -2819 -205 17970 11273 -3917 -41463
10979 -41463 -52100 -27954 -16780 -20146 -23676 -22108 -20340 -5994 13905 16413 -217 2952 6469
10966 6469 -7748 -10830 68 13947 11747 -4483 -4596 10242 26478 34023 23849 -6817 -28281
10953 -28281 -42482 -45006 -23621 -8020 -7566 -10486 -470 -9216 8286 18672 19623 17819 8367
10940 8367 13432 8305 14874 -5282 -7006 -26299 -19239 -18644 -36243 -38272 -25467 -1431 6400 18513
10926 18513 23533 30122 37353 49400 39802 31148 34524 25469 18366 19457 6590 1678 6648 3148
10912C148n244o657m391r905K158K380J4633K4570n639k6475k0101L312P707N512
10898a4992J5461J7769O994k0008J0529J7386j3203j2052j3356j6560J0745K4227
10886A2940N257L358r990o908O145q081j3425O833j977j6962j9423J2511L5834
10873F112o011j7070r069O707J1592m827k1331j1371o803M141K3465K234M089
10860a8142K7814M308r118J5242R477j1147j6206o692K6K0956r455Q530O954l303
10846A9244J1312P906j3921R58j2793j556k692j2846J9203j0242l537J289j3250
10833a0925n575q64N521Q229N117j0751J8057J0551J361j5141p82k075J331J7986
10819B2040j2589J666k19J5728K4333N128k775m276o321j1475j3790M303j889
$$ plain form
10912 3148 -2096 -8753 -13144 -23049 -20891 -18511 -3878 20692 15053 -11422 -31523 -28211 -20504 -14992
10898 -14992 469 18238 25232 5224 15753 33139 19936 7884 -5472 -22032 -11287 12940
10886 12940 18197 21555 11565 4657 10802 2721 -10704 -3871 -5848 -22810 -42233 -29722 6112
10873 6112 101 -16969 -26038 -19331 -7739 -12566 -33897 -45268 -52071 -47930 -24465 -22231 -18142
10860 -18142 9672 13980 4862 20104 29581 18434 2228 -4464 -4438 16518 7063 15593 22547 19244
10846 19244 30556 38462 24541 25499 12706 11150 8458 -4388 14815 4573 1036 2325 -10925
10833 -10925 -16500 -17364 -11843 -3614 1503 -9248 8809 19360 20721 5580 4798 2723 4054 22040
10819 22040 9451 11117 10898 26626 50959 56087 53312 49036 42715 31240 17450 21753 19864
10806A9864Q009R043j3736J7429J1498m75J2802J3543M046J5926j1571l3271j8193
10793C4914o346m172j728J0182j149l140q978r994R611O594j3680N827M854J1785
10779C4580L145k8173J89K4450Q066M039J100J3085J0124Q256n34J427J2119q718
10765H3155l9157j4218n228J1809J4696Q714L435j5359J563K7809J1663J3339
10753A02221K0500K7028o88j5427k2854j5717j5270j6412k802p001j9011k1947
10741A2620N261N979n501j2265N974L880Q640J845p561j2187j7606J7305K3347
10728B9731J39J0486L425L01Q014J3293K0275J330j1482q336k5134o898j1599
10715B3545R014J1048O511n396J0265J6416O717k076j9311q437K847L964r846
$$ plain form
10806 19864 27873 36916 23180 40609 52107 51632 64434 77977 82023 97949 86378 53107 34914
10793 34914 28568 24396 22668 32850 31701 28561 19583 9589 19200 25794 12114 17941 22795 34580
10779 34580 37725 9552 9741 34191 42257 46296 47396 60481 70605 78861 78327 79754 91873 83155
10765 83155 43998 29780 24552 36361 51057 59771 63206 47847 49410 77219 88882 102221
10753 102221 122721 149749 149061 133634 110780 95063 79793 63381 60579 53578 34567 12620
10741 12620 17881 23860 18359 6094 12068 15948 24588 26433 18872 6685 -10921 6384 29731
10728 29731 29870 40356 43781 44082 52096 65389 85664 86994 75512 67176 42042 35144 23545
10715 23545 32559 43607 50118 44722 54987 71403 78120 76044 56733 48296 51143 55107 45261
10702D5261k2134k1566j6298L482m979J8288Q048o228j6003L898M5954L267j3080
10689B7910q995j4934q711r119j9349j2366M030J9370J1486l453J1457J0169q589
10676a094j082J5057r338r111l714K6277P22j4785R458J9018L781j4928j271j2224
10662F766j0753J8679Q539j3529J0244K3794K267j6272j7376j1621K4503P259
10650C2500K514l178l9401j6780K737K3297m714m301K773J2749O630P966P16j4268
10636I240j7407n568O46N3N987O794k931K1231J704j9446k4145O835J7568k960
10622b399j0859j0932P214R675N692n5J262j2331j2301q79j0307L903J3719m442
10608b3040J261j3255P26J1523L604K2688Q821j7468Q99l016K2524J2036J6835
$$ plain form
10702 45261 23127 1561 -14737 -11255 -16234 2054 10102 3874 -12129 -8231 37723 40990 27910
10689 27910 18915 3981 -4730 -13849 -33198 -45564 -41534 -22164 -10678 -14131 -2674 7495 -1094
10676 -1094 -2176 12881 3543 -5568 -9282 16995 17717 2932 12390 31408 35189 20261 18990 6766
10662 6766 -3987 14692 23231 9702 19946 43740 46007 29735 12359 738 25241 32500
10650 32500 35014 31836 -7565 -24345 -21608 1689 -3025 -7326 -4553 8196 14826 22792 23508 9240
10636 9240 -8167 -13735 -13089 -13036 -7049 -255 -3186 18045 19749 303 -23842 -17007 561 -2399
10622 -2399 -13258 -24190 -16976 -7301 -1609 -1664 -402 -12733 -25034 -25913 -36220 -32317 -18598 -23040
10608 -23040 -21779 -35034 -34308 -22785 -19181 3507 12328 -5140 -4241 -7257 15267 27303 44138
10595D4138J0888M696k316k1265j3824j8661k2188p519J9809Q101J259K767j8110
10582a2225j3983K662Q887J7646J8920j196j1288j7018J820J0004L322k1853M314
10569i988k135j416N738J0675R018p451R408K952O96j0198j6069j1795m642K638
10555b2569k459J6165P102J4075J818j4365k1125Q442N007M453K2259q01k7047
10542i045j1327J1583O545P145J8782m026k4634O912Q553K106j3231j1004J9295
10529G654j0989L231r322j470J5511K1269K55q455j712j3358R661o718j7832j1673
10515b3948j4189L272P428K5557J5534O30l6817k8120O252K0586K626o63m076
10502b5928J6651K386j2338J3432J2788Q89Q181n58j286J3990m139Q01M906N781
$$ plain form
10595 44138 55026 59722 57406 36141 22317 3656 -18532 -26051 -6242 1859 3118 5885 -12225
10582 -12225 -26208 -23546 -14659 2987 21907 20711 9423 -7595 -5775 4229 7551 -14302 -9988
10569 -9988 -12123 -13539 -7801 2874 11892 4441 13849 16801 17497 7299 -8770 -20565 -25207 -22569
10555 -22569 -25028 -8863 -1761 12314 14132 -233 -21358 -12916 -7909 -3456 18803 18002 -9045
10542 -9045 -20372 -8789 -2244 4901 23683 19657 -4977 1935 10488 12594 -637 -11641 7654
10529 7654 -3335 -104 -9426 -10896 4615 25884 26139 17684 15972 2614 12275 5557 -12275 -23948
10515 -23948 -38137 -34865 -27437 -1880 13654 14284 -22533 -50653 -44401 -23815 -21189 -21852 -25928
10502 -25928 -9277 -6891 -19229 -5797 6991 7880 16061 15503 14217 28207 24068 24869 29775 35556
10488C5556J1386J3682k6876j5755k81j6781O008J0511j27J421K5274J8740k6721
10475C6037l1721j2152N548O184K0693M755j8986l611J7136Q927k4167o423N025
10462G245R940J868m18j825j9770j7128J7668J2566r054R778M291j1329m171J888
10448A549r17l435p100O660P10J6437Q429j8981k502q822R454J4419N310J1282
10434C2493j7190l598q594j7838L404J0758k077J6928j186j0639j3725N945K187
10421c132r329P220m417p502P954J7527J2363j717K3841j6419j7480O625K255
10408A7789l815j4512j0271n455J4725J6495l261Q926k425K371n627n51j170j7046
10394c827N297N507l228J918J108K923o694q366K711J9103J0922j2752K348J3859
$$ plain form
10488 35556 46942 60624 33748 17993 17712 931 6939 17450 17323 18744 44018 62758 36037
10475 36037 4316 -7836 -2288 3896 24589 29344 10358 6747 23883 32810 8643 2220 7245
10462 7245 17185 19053 18635 16810 -2960 -20088 -2420 10146 1092 10870 15161 3832 -339 1549
10448 1549 632 -2803 -9903 -3243 -2533 13904 22333 3352 850 -7972 1482 15901 21211 32493
10434 32493 15303 11705 3111 -14727 -11323 -565 -2642 14286 13100 2461 -11264 -5319 -3132
10421 -3132 -12461 -5241 -9658 -17160 -9206 8321 20684 18967 42808 26389 8909 15534 17789
10408 17789 13974 -538 -10809 -16264 -1539 14956 11695 20621 18196 20567 14940 14389 13219 -3827
10394 -3827 1470 6977 3749 5667 6775 9698 3004 -5362 -2651 16452 27374 14622 16970 30829
10380C0829j0182p83J4061k3716k1585K087K221m455M092l709Q502J7346J8303
10367C3011K424q393j2925j5708P367J7580j4927N285O517L194k336j739k498
10354A6852o292p403r296l489m193j1037l486J8170K2854n158l603j5923M813
10341g191K6444L2421J1573j3198n537p319m316J376Q407J8346J0276K0033L8261
10328A29576K7962M8572M9273k777n7562p6385m7289k8237k341P06O119L255j7981
10315C2891m233j4970j1212P027m598j2054Q508L768r67N617O921n078k650k255
10301F715l364N280j3116j52L635Q267M322J876r802K884J1002q570m91K1710
10287C0196J7096M965K640M449J0752r421P414k870j5114J4433j4136L209q426
$$ plain form
10380 30829 20647 19864 33925 10209 -11376 -9289 -7068 -11523 -7431 -11140 -2638 14708 33011
10367 33011 35435 27042 14117 -1591 5776 23356 8429 13714 20231 23425 21089 19350 16852
10354 16852 10560 3157 -6139 -9628 -13821 -24858 -28344 -10174 12680 7522 3919 -12004 -7191
10341 -7191 19253 51674 63247 50049 44512 37193 32877 34253 42660 61006 71282 91315 129576
10328 129576 157538 206110 255383 252606 195044 118659 71370 43133 40792 41498 47617 50872 32891
10315 32891 28658 13688 2476 9503 4905 -7149 1359 5127 4160 9777 16698 11620 8970 6715
10301 6715 3351 8631 -4485 -4637 -1002 7265 11587 13463 3661 6545 17547 8977 8486 30196
10287 30196 47292 52257 54897 59346 70098 60677 68091 65221 50107 64540 50404 53613 45187
10274D5187j2241j5427j936j1054Q025R695J6135J8155K124J1527J797r795k0352
10261D1840n947m149k0959l7777J190J4652Q898R827L410K290j4041n60K059Q219
10247H952j5997m480J5560J0283J7642Q981o044L951J8257j8727k692J442J0354
10234D7482m787j0639R39K19P414r989k1432J1056j439P1J054o052J1655K9906
10220E5458J0980j1137l31J4653j3999K0317J2785J3285J8351J3491j0340J5466
10208A38979M0177O3614R1016J92514K62930K82666J30403J02213K16587K53403
10198A774502q619k31690k01274r5775j54855k77905k37900j45127r8841n7912
10188B64604n1750m8365q113j7087k7349m370r676j5829m699N267o669j8802j9142
$$ plain form
10274 45187 32946 17519 15583 4529 12554 22249 38384 56539 58663 70190 71987 62192 41840
10261 41840 35893 31744 10785 -26992 -25802 -11150 -2252 7575 10985 13275 -766 -1326 733 8952
10247 8952 -7045 -11525 4035 14318 31960 40941 34897 38848 57105 38378 35686 37128 47482
10234 47482 42695 32056 32995 33214 40628 30639 9207 20263 18824 18895 19949 13897 25552 55458
10220 55458 66438 55301 54970 69623 55624 75941 88726 102011 120362 133853 123513 138979
10208 138979 179156 242770 333786 526300 789230 1071896 1202299 1304512 1521099 1774502
10198 1774502 1765883 1534193 1332919 1237144 1082289 804384 566484 421357 322516 264604
10188 264604 212854 164489 156376 139289 111940 107570 97894 82065 77366 82633 75964 57162 38020
10175C8020q117J7977m160j1166J2654L285r096p370k455J2666O742j2327j7393
10162A9260j827m438m704l012j4216J2976K0136R057L04Q94p560J3725j960j1638
10148B6997L672l895m765J1653J0679l96k7022j6503J1575Q069J944n100p625
10135I283j4915r31N695N293K982j3628k111J5026J4397r228q702M524R659m360
10121A2984Q337O681m004l216j1270p742J0157N310m010r185j0708M885K0520
10108A8739J4956J8512r366k4397j5700J1958J3565j0056j3067k0144J4930Q911
10096H841r465J1459m779o717N511P42K3036L1618j881k9191k3149K831k2340
10083a3484P540J0593j992o99r258o951J540J9470R632j4010L657j455P750j168
$$ plain form
10175 38020 29903 47880 43720 32554 45208 48493 39397 32027 29572 42238 48980 36653 19260
10162 19260 17433 12995 8291 5279 -8937 4039 24175 33232 33536 34430 26870 40595 38635 26997
10148 26997 30669 26774 22009 33662 44341 43945 16923 420 11995 20064 22008 16908 9283
10135 9283 -5632 -6563 -868 4425 7407 -6221 -8332 6694 21091 11863 3161 7685 17344 12984
10121 12984 21321 28002 23998 20782 9512 1770 11927 17237 13227 4042 -6666 -1781 18739
10108 18739 33695 52207 42841 18444 2744 14702 28267 18211 5144 -15000 -70 8841
10096 8841 -624 10835 6056 -661 4850 5592 28628 60246 58365 29174 6025 8856 -13484
10083 -13484 -5944 4649 2657 1958 -7300 -14251 -12711 6759 16391 2381 6038 4583 12333 11165
10069A1165J1321m916j5531j4742J6964J3250M179n874l056k340P136M805q973
10056A3388j6474N541O163j6128o792J2504K4772K8138o677J0057m935K396j7035
10043C4918j1926o694j4407Q697L016k0104q890J1678N525L561j033m282J3742
10030A3801p226j2825p535M12J2915M786k928l192Q321j2025K2223J4253P991
10017C8971J647J3119k849o615k12j0474j7871p721P898K6313K443N696K193l1417
10003B1121j3239N266n890n025j2597L796m51K9132J9356j0312k9004Q143J8957
9990B9253j6940M210J9769Q498k2262j8601l696l342M306Q786J6948n203Q283
9977C0009K902R056j2728j3374n290J8503J3639l091j1043j2332J0553J1097k866
$$ plain form
10069 11165 22486 17570 2039 -12703 4261 17511 21690 15816 12760 10420 17556 22361 13388
10056 13388 -3086 2455 8618 -7510 -14302 -1798 22974 51112 44435 54492 49557 51953 34918
10043 34918 22992 16298 1891 10588 13604 -6500 -15390 -3712 1813 5374 4341 59 13801
10030 13801 6575 -6250 -13785 -13373 -458 4328 1400 -1792 6529 -5496 16727 30980 38971
10017 38971 40618 53737 50888 44273 44061 33587 15716 7995 15893 42206 44649 50345 52538 21121
10003 21121 7882 13148 7258 2233 -10364 -6568 -7019 22113 41469 31157 2153 10296 29253
9990 29253 12313 16523 36292 44790 22528 3927 231 -3111 1195 9981 26929 21726 30009
9977 30009 32911 41967 29239 15865 10575 29078 42717 39626 28583 16251 26804 37901 35035
9964C5035M244j1633M028J5442l1412r452O593J7362n754l046j5974l182j7960
9951a5709n332M788J4317O247M387j4883K38m290L602J1776j0772J2815K6773
9938C3957p273p478o038J3081k8783k5739O772O751L47P021o488L340J2013J0982
9924A2465J9490R85j0694n215o221M711J5327J771J5839J6058p104k1298R408
9911D5522O536j968m394j1471k710l719J0255R169K838l7535j8784K6132J1925
9898C1796L037l430m713p561l5155J3289L6310O466q86L911j3462l838k93O401
9884C1872K64m088K4501O502j6785o568p133o584j3064J2595K926Q894Q965j2846
9870B9451j8010K582j80K881o580N471J1066K402J9804P788J4540j3063j3092
$$ plain form
9964 35035 39279 27646 31674 47116 15704 6252 12845 30207 24453 21407 5433 2251 -15709
9951 -15709 -21041 -16253 -1936 4311 8698 -6185 -5947 -10237 -6635 5141 -5631 7184 33957
9938 33957 26684 19206 13168 26249 -2534 -28273 -21501 -14750 -14403 -7382 -13870 -10530 1483 12465
9924 12465 31955 32940 22246 17031 10810 15521 30848 32619 48458 64516 57412 36114 45522
9911 45522 52058 50090 45696 34225 31515 27796 38051 47220 50058 12523 -6261 19871 31796
9898 31796 34833 31403 26690 19129 -16026 -2737 33573 40039 39153 43064 29602 25764 25471 31872
9884 31872 32136 28048 52549 59051 42266 35698 28565 21981 8917 21512 24438 33332 42297 29451
9870 29451 11441 14023 13843 16724 10144 15615 26681 29083 48887 56675 71215 58152 45060
9857D5060O398L097j0577j8390l124Q849p250L640J4928J1435N330o131q565J4537
9843E9237J9327P093K4903O3222Q6758N7877j7618q1245q8532m1870j0567M0k5521
9830E3104k494L995Q146q027j4072j1787J2875N111J8987o491k4373j0841J5150
9817C9283L176N850m814l093J7820J5386j1199j6319J3360O690j0560J2830O150
9804G4560M49R03j1862N359K1121L5198M4454K3538k086j497r339j9486l8248
9791A23064j7568j3197J597l4606j6858K862P105O083J5585L700j5130j2648k261
9778D7728R122l243j9586K594K143k7913k579J5451n805O049J0771L75j3643p704
9764A3760K0965J8687J208J1925O065k4021j9989K0P436l413L474J1595J446q322
$$ plain form
9857 45060 51458 54555 43978 25588 22464 31313 24063 27703 42631 54066 59396 53265 44700 59237
9843 59237 78564 85657 110560 173782 260540 318417 300799 219554 131022 89152 78585 78625 53104
9830 53104 50610 54605 62751 54724 40652 28865 41740 46851 65838 59347 34974 24133 39283
9817 39283 42459 48309 43495 40402 58222 73608 62409 46090 59450 66140 55580 68410 74560
9804 74560 75009 75912 64050 69409 90530 125728 170182 193720 191634 190137 180798 161312 123064
9791 123064 105496 92299 93896 59290 42432 45294 52399 58482 74067 77767 62637 49989 47728
9778 47728 56850 53607 34021 36615 38758 10845 8266 23717 17912 23961 34732 35107 21464 13760
9764 13760 34725 53412 54620 66545 72610 48589 28600 28620 36056 32643 36117 47712 49158 40836
9750D0836J4887J5053j3933r836j0140K075j7903K222J3711n166j2090k0735Q83
9737a36J3945J4962O635J9688K3999m718m520m718k592j916k0287j6561j898j3155
9723H728K6072L1850j9194k7951J2573K960j4292q534K3404J1374J201L534l941
9710D7784k0842n538K2065J3253L064m155J631J7446J6930j3999j6478J778M784
9697F7723j2913j4972L385L607k600Q334L229k0983j6219N399K1705N744q791
9684D2648J0108J2066P805o934q514J975J0089m859q917K1164l359q299j9581
9671D5392j1101J1418J5332K82O752M22M080L877J0922j1205J340m051n160j4629
9657E3671R773k485R82P554p608q716m083q96j775K80N768l609k416P495J4788
$$ plain form
9750 40836 55723 70776 56843 47007 36867 38942 21039 23261 36972 31806 19716 -1019 -136
9737 -136 13809 28771 35406 55094 79093 74375 69855 65137 62545 60629 40342 23781 21883 8728
9723 8728 34800 66650 47456 19505 32078 35038 20746 12212 35616 46990 48191 51725 47784
9710 47784 26942 21404 43469 56722 59786 55631 57262 74708 91638 77639 61161 62939 67723
9697 67723 54810 39838 43223 46830 44230 52564 55793 34810 18591 23990 45695 51439 42648
9684 42648 52756 64822 72627 65693 57179 59154 69243 64384 55467 76631 73272 64973 45392
9671 45392 34291 45709 61041 61323 68075 68497 72577 76454 87376 76171 77511 73460 68300 53671
9657 53671 63444 60959 61941 69495 61887 53171 49088 48192 46417 46697 52465 48856 46440 53935 68723
9642F8723M538O975l029p988m950L453P919j8056l577n136k4804J3122J7105M089
9628E8384N385J2649R269K289k649N74j0563j4683J1Q984j6313N563r622j9539
9614B9739J4116j523l780l512K0999J1971j2528k2562o396Q26J892j658m415J2128
9600C5297J2579J8926N698j3324j4384N608P748L593L282O800Q388J3060k020
9587I1251j747R015O67J0560r966j1816K1040J7265K3087L3472K6332k1883k0732
9574A66545j3877m247J2879p363j9243m936q746j7454p034p074K5520K5416J9649
9561A60035l97J508J8118O345q060k168P307N824j1248m708M451j0279j5511Q576
9547A59793J0414j5980k5351q210P395P908J2492J7407J9779O5079Q4516J06338
$$ plain form
9642 68723 73261 80236 77207 69219 64269 67722 75641 57585 54008 48872 24068 37190 54295 58384
9628 58384 63769 76418 85687 87976 85327 85901 75338 60655 60666 69650 53337 58900 49278 29739
9614 29739 43855 42332 38552 35040 56039 68010 55482 32920 26524 27350 29242 27584 23169 35297
9600 35297 47876 66802 72500 59176 44792 50400 58148 61741 65023 71823 80211 93271 91251
9587 91251 89504 98519 99186 109746 99780 87964 109004 126269 149356 182828 209160 187277 166545
9574 166545 152668 148421 161300 153937 134694 129758 121012 103558 96524 89450 114970 140386 160035
9561 160035 159638 161146 179264 185609 177549 175381 182688 188512 177264 172556 177007 166728 151217 159793
9547 159793 170207 154227 128876 120666 128061 135969 148461 165868 185647 250726 335242 441580
9535D41580M3753o7238p2129p6310m6403k8871k2620o891j1972j8793r183K7213
9523A52136K2728p689J222K745J2487m89R950M841P059M099J982K2832j4428k1794
9509A97681k0275j8210k3227j5954j4746r266o355p501J9481J2173K8247K1233
9497A63281J1048j311K1487K5020J4828k0459l5776k5559j897n318j1414R298
9485A43228Q766R368J5275k5089k6314q6o480m803o313L116j0093o175j3574o681
9471G4145o708P363J6031n677j4802J4956N744J259k868M166l655j5865Q659j149
9457H1599J0742K2747R101j1161L264J2892O506p274o820l1033j6572J7119J0724
9444A01834O046O913j0692k3884j1113J0939K4341P363o820k0843p873j7568j6908
$$ plain form
9535 441580 485333 418095 345966 269656 223253 194382 171762 164871 152899 134106 124923 152136
9523 152136 174864 167175 168397 171142 183629 183140 193090 197931 204990 209089 211071 233903 219475 197681
9509 197681 177406 159196 135969 120015 105269 96003 89648 82147 101628 113801 142048 163281
9497 163281 174329 173018 194505 219525 234353 213894 178118 152559 150662 145344 133930 143228
9485 143228 151994 161362 176637 151548 125234 125148 118668 113865 107552 110668 100575 94400 80826 74145
9471 74145 67437 74800 90831 85154 70352 85308 91052 92311 89443 93609 89954 74089 82748 81599
9457 81599 92341 115088 124189 113028 116292 129184 135690 128416 121596 90563 73991 91110 101834
9444 101834 107880 114793 104101 80217 69104 80043 104384 111747 104927 84084 76211 58643 41735
9431D1735m639K5574J6062N313M325k362K708L389l164J1569l577J3743J1067
9418A21743j483j0520k4243p204J7494P526o689J5293k974m989j6559L87J3090
9405A00872L341K266J3683l894k3678J868J1745j2588Q087J6443J4920P54J2494
9392A46313k525j4334o955j6838J3163O060q18l167j3438M51R24m580o314R332
9378A07274O794K931J2203j645O038j6969k1250L062J7312q340j6328n488N505
9365I1099N487Q799N378J1614K872k265Q127K1384K0153J0400J2941N353J0425
9352B11767J7238R71K492j447r69k7887o006Q87K1233J795l6983l0142j6766j5511
9338A20672O920J8827K467O269n385k466J0185j4209q233j6552l905J4555l021
$$ plain form
9431 41735 37096 62670 78732 84045 88370 86008 88716 92105 88941 100510 96933 110676 121743
9418 121743 120260 109740 85497 78293 95787 103313 96624 111917 108943 103954 87395 87782 100872
9405 100872 104213 106479 120162 116268 92590 94458 106203 93615 101702 118145 133065 133819 146313
9392 146313 143788 129454 122499 105661 118824 124884 124066 120899 107461 107912 108836 104256 97942 107274
9378 107274 114068 116999 129202 127557 133595 116626 95376 98438 115750 107410 91082 85594 91099
9365 91099 96586 105385 110763 122377 125249 122984 131111 152495 172648 183048 195989 201342 211767
9352 211767 229005 229976 232468 231021 230052 202165 196159 197046 218279 220074 183091 152949 136183 120672
9338 120672 127592 146419 148886 155155 149770 147304 157489 143280 135047 118495 114590 129145 126124
9325A26124j988N334M412J7110P583p151k626l76k890q218Q946K5050M362M866
9311A80538J5539O851L7040J2276p940l836J672n148q828J349P742L679j7797
9298B23137k3165j6839P777R723J1502J588j0704l882j0362J7205k7286k4576
9286A54118j6353j466l108j6962J7728J9914P693j3478J291L1832K705R817r709
9273A84022q928R487J5695o289r952K2334J9936J6494J6364n930P007J2486M519
9260B77245N89K2834N354p226J8257L637l0590l4606l5318o530j5063q386Q147
9247A98344k998k6969j4619m636j649J7534L485o296N591K7384l877N245J1525
9234B08064K980n313K760j3505m377J660L312p757k41p199r436l932J8279K3429
$$ plain form
9325 126124 124136 129470 133882 150992 158575 151424 148798 148422 145532 137314 146260 171310 175672 180538
9311 180538 196077 202928 239968 252244 244304 240468 242140 236992 228164 229513 237255 240934 223137
9298 223137 199972 183133 190910 200633 212135 213723 203019 199137 188775 205980 178694 154118
9286 154118 137765 136299 133191 116229 133957 153871 161564 148086 149377 181209 183914 193731 184022
9273 184022 175094 184581 200276 193987 184035 206369 226305 242799 259163 253233 260240 272726 277245
9260 277245 277834 300668 306022 298796 317053 320690 290100 255494 220176 213646 198583 190197 198344
9247 198344 195346 168377 153758 149122 147473 165007 168492 162196 167787 195171 191294 196539 208064
9234 208064 211044 205731 208491 194986 190609 192269 195581 187824 187583 180384 170948 167016 185295 208724
9220B08724j812n982K5201J3384N361l3939j8958q367J3543Q370o922r407J2433
9207B01629j4742Q273N942n123j5668k224L504R134J8777j4290l096O967j5695
9194A83388J7090k2946l415o370J4456J5813j3392j6436Q898R347j47M713o140
9181A84859k271J0644k629P003m935q489r54k060J09J0288j1216O562q35l020
9167A83056J4912R945J6597N653k4678j2685K8218O360K0157M794j2327k34m528
9154B35240p054l984J1832M932k87O729K302k2131O071n607J332R3o404J992Q079
9139B33135J9588o076q997m346q920p563P088K168j5972J8573K0412R521J8362
9126B76973J1733P644J84j1997K083N948o539M697J6446P740m913J0682j1617
$$ plain form
9220 208724 206912 200930 226131 239515 244876 210937 191979 183612 197155 205525 198603 189196 201629
9207 201629 186887 195160 201102 195979 180311 178087 181591 190725 209502 195212 192116 199083 183388
9194 183388 200478 177532 174117 167747 182203 198016 184624 168188 177086 186433 186286 190999 184859
9181 184859 182588 193232 190603 197606 192671 184182 183228 181168 181277 191565 180349 186911 186076 183056
9167 183056 197968 207913 224510 230163 205485 192800 221018 227378 247535 252329 240002 239768 235240
9154 235240 228186 224202 236034 240966 240679 247408 249710 227579 233650 228043 229375 229468 223064 225056 233135
9139 233135 252723 246647 237650 233304 224384 216821 223909 226077 210105 228678 249090 258611 276973
9126 276973 288706 296350 296534 284537 286620 292568 286029 290726 307172 314912 309999 320681 309064
9113C09064r337r913J0801j9588q856l78K6804K2888K692k8398l114j4328j0054
9100B68283J0343J0699P975O320J3850j0244P060r126j7552R58J7557k740k0301
9087B83082k006o304j1067J5745K1285J415q459K289L726J927K4046O177L858
9074C35714K914J2176J6566J2910L832k236J0528K336J1114j3933q620k5175j0439
9061C47687J7212K4196P366l200j2553K80m153q421M646j9524r784r372o886K1731
9047C49225R092k0593n446K11J2430k6306p694L791J0522K5933O561k292J4299
9034C69733K2730L665L446K3154J4569K7882K3710M4810P4164N5030P002l0063
9022F39832j1137N286N284j9066j5520J2835j3666l7447k1678j2782j3625J1485
$$ plain form
9113 309064 299727 289814 300615 281027 272171 271793 298597 321485 324177 295779 292665 278337 268283
9100 268283 278626 289325 297300 303620 317470 307226 314286 305160 287608 288566 306123 303383 283082
9087 283082 281076 274772 263705 279450 300735 302150 293691 295980 299706 301633 325679 331856 335714
9074 335714 338628 350804 367370 380280 384112 381876 392404 394740 405854 391921 383301 358126 347687
9061 347687 364899 389095 396461 393261 380708 380988 376835 368414 373060 353536 343752 334380 327494 349225
9047 349225 358317 337724 332278 332489 344919 318613 310919 314710 325232 351165 357726 355434 369733
9034 369733 392463 396128 399574 422728 437297 465179 488889 533699 607863 662893 669895 639832
9022 639832 628695 633981 639265 620199 604679 617514 603848 566401 544723 531941 518316 529801
9010E29801J2078J3155P163k772K2011j772j0554j9374j2417O413n695J4826J5362
8997E68225n279j4611j5854k4055k2154L696J4289J177J0727L3280K6227n65J223
8984E76326p408K6697J8099M864P521L2296M7137N4519M6625L1809L6443L8509
8972I13437J6808J242k1216o684Q442O992J2141k0642m5130m9758k0706k7020
8960G67906l0953m731j6091k1623j4339j5486J6695J1905j4432p230o142k751
8948F62728O236J3484j0436j3782Q403M404J1844M807K064L425K7869L1116K971
8935G55133j3735j543Q604R20o200K0560R858J4704L1407N8975O5899P7330O6509
8922A088421P333k8156n8013l7657j4493j9992m3200n9721l5018k0088o240O985
$$ plain form
9010 529801 541879 555034 562197 559425 581436 579664 569110 549736 537319 543732 538037 552863 568225
8997 568225 562946 548335 532481 508426 486272 489968 504257 505434 516161 549441 575668 575103 576326
8984 576326 568918 595615 613714 618578 626099 658395 705532 760051 806676 838485 874928 913437
8972 913437 930245 931487 910271 903587 912029 919021 931162 910520 865390 815632 794926 767906
8960 767906 736953 732222 716131 694508 680169 664683 681378 693283 678851 671621 665479 662728
8948 662728 668964 682448 672012 658230 666633 671037 682881 687688 689752 693177 721046 752162 755133
8935 755133 741398 739855 748459 749379 743179 763739 773597 788301 819708 878683 944582 1021912 1088421
8922 1088421 1095754 1067598 1009585 971928 957435 937443 894243 834522 799504 779416 773176 780161
8910G80161M796J5091K3271J2804K4469L1979J6788J7074J3089j8575m1332k9643
8898H49972k5167l716j867j3273m53R236L3606J9546J7275K7619M1893M4988M2710
8885A042369L6408N4927M6957Q4364J23631J27937J08457R9310J76063K73813
8875B174236L77150N28823Q12082J343806K247469L552186M391793J902247k805131
8866A4524661m021137l110696k073236j306706q37789n57168l85862k59661j63542
8857A808864r3641o3083o4018p3884r3340r1715q7008n4169l9292l2425l8268
8846A078021l6948j9786O439l001j7017k0789j8773j1346k6593K4467J2709J0242
8834I77625J5176J453p745l843o597j0654K0084J7390n735o823o945J2260n294
$$ plain form
8910 780161 784957 800048 823319 836123 860592 892571 909359 926433 939522 920947 879615 849972
8898 849972 824805 821089 819222 805949 805496 814732 848338 867884 885159 912778 954671 999659 1042369
8885 1042369 1078777 1133704 1180661 1265025 1388656 1516593 1625050 1724360 1900423 2174236
8875 2174236 2551386 3080209 3892291 5236097 7483566 11035752 15427545 17329792 14524661
8866 14524661 10503524 7392828 5319592 4012886 3175097 2617929 2232067 1972406 1808864
8857 1808864 1715223 1652140 1588122 1514238 1420898 1329183 1242175 1188006 1148714 1116289 1078021
8846 1078021 1041073 1021287 1027726 1024725 1007708 986919 968146 956800 930207 954674 967383 977625
8834 977625 992801 994254 986509 982666 976069 965415 985499 1002889 997154 990331 983386 995646 990352
8821I90352M241K0863J3696q791j1588K2704J0691m215j349K0236J5792l125J236
8808A070743O971J4504k60J2552M473K0173K1808J6946J8165P516K381j0004K3068
8795A209036K4663P735K1874K7628K9337J4086J8529L5787M0724J0543K729j2298
8783A430373k8171k8625M452J8763J5772J4841J2203M255M78J2656R543J3225
8771A479765j036K2295J7871K1425M2953J3703K2893L7846K6865J4847J7471K3779
8759A740677L9190L1577K677n130K3959K5818L7944K5710J6044L9939M1687N4325
8747B074417P1037P9907R6719Q0333M9562K8378K2232J0566j3809p1315n1281
8736B376746l3750j9029M490K1106j5345J0175K6713J4461J5718J6684J5125K2607
$$ plain form
8821 990352 994593 1015456 1029152 1020361 1008773 1031477 1042168 1037953 1036604 1056840 1072632 1069507 1070743
8808 1070743 1077714 1092218 1091958 1104510 1108983 1129156 1150964 1167910 1186075 1193591 1195972 1185968 1209036
8795 1209036 1233699 1241434 1263308 1290936 1320273 1334359 1352888 1388675 1429399 1439942 1442671 1430373
8783 1430373 1402202 1373577 1378029 1396792 1412564 1427405 1439608 1443863 1444341 1456997 1466540 1479765
8771 1479765 1478729 1501024 1518895 1540320 1583273 1596976 1619869 1657715 1684580 1699427 1716898 1740677
8759 1740677 1779867 1811444 1814121 1808991 1832950 1858768 1896712 1922422 1938466 1978405 2020092 2074417
8747 2074417 2145454 2225361 2322080 2402413 2451975 2480353 2502585 2513151 2499342 2428027 2376746
8736 2376746 2342996 2323967 2328457 2349563 2334218 2344393 2371106 2385567 2401285 2417969 2433094 2455701
8724B455701J8461J9437M1384K6700M5266M9498M5459N8245L9100L0660M8867
8713B878778N1235O4977O1571N8003N4857O5263O5215R3462P4073R0808Q1657
8702C639899Q4364J19609J14519Q4733P0796N3413K0817p6K6530L9061J9536O981
8690D280182J114n670k437l847J8066K5224M0306K1841M6906N6271M1917L4643
8678D554516M5355P7711Q7060Q9283J04336R3581Q7952R9054Q9649Q6620R1433
8667E506550J23041J28018J25541J03363J14792J21687J21644J60188J76017J60830
8657F841671J53028J18356J31306J36037J18214J19864J58971J59235J59935J39870
8647H236487J43276J23010J18875R6572O5450O8693J06786J32579Q8254J03068
$$ plain form
8724 2455701 2474162 2493599 2534983 2561683 2606949 2656447 2701906 2760151 2799251 2829911 2878778
8713 2878778 2930013 2994990 3056561 3114564 3169421 3234684 3299899 3393361 3467434 3558242 3639899
8702 3639899 3724263 3843872 3958391 4043124 4113920 4167333 4188150 4188074 4214604 4253665 4273201 4280182
8690 4280182 4281296 4275626 4273189 4269342 4287408 4312632 4352938 4374779 4421685 4477956 4519873 4554516
8678 4554516 4599871 4677582 4764642 4853925 4958261 5051842 5139794 5238848 5328497 5415117 5506550
8667 5506550 5629591 5757609 5883150 5986513 6101305 6222992 6344636 6504824 6680841 6841671
8657 6841671 6994699 7113055 7244361 7380398 7498612 7618476 7777447 7936682 8096617 8236487
8647 8236487 8379763 8502773 8621648 8718220 8783670 8852363 8959149 9091728 9179982 9283050
8637I283050J31933J13659J31492J61809J46654J57636J57961J64736J58853J58152
8627A0765935J72536J81143J81255J77761K07189J90718J82744J64851J85930
8618A2410062J85183J66779J50399J83809J71671J72640J89320J67155J52808
8609A3949826J52793J63062J60561J39043J20634J05536J03624P7732M7383J4740
8599A5034934o245j1332L3111M7257M0750k8697o4046o7370o9300n2631o5656
8588A4790775m9909n6795p3813q8075j13366j00430j15087j18652j44294j21608
8578A3808746j38858j32636j31370j63262j85668j89762j49736j63177j50376
8569A2403901j57532j85060j85027j84235j82942j78278j57851j48770j57727
$$ plain form
8637 9283050 9414983 9528642 9660134 9821943 9968597 10126233 10284194 10448930 10607783 10765935
8627 10765935 10938471 11119614 11300869 11478630 11685819 11876537 12059281 12224132 12410062
8618 12410062 12595245 12762024 12912423 13096232 13267903 13440543 13629863 13797018 13949826
8609 13949826 14102619 14265681 14426242 14565285 14685919 14791455 14895079 14972811 15020194 15034934
8599 15034934 15028689 15017357 15050468 15097725 15138475 15109778 15045732 14978362 14909062 14856431 14790775
8588 14790775 14740866 14684071 14610258 14522183 14408817 14308387 14193300 14074648 13930354 13808746
8578 13808746 13669888 13537252 13405882 13242620 13056952 12867190 12717454 12554277 12403901
8569 12403901 12246369 12061309 11876282 11692047 11509105 11330827 11172976 11024206 10866479
8560A0866479j75549j78365j93818j86245j90502j89898j85933j87338j91854
8551I186977j64431j51163j66329k06612j74234j74533j64136j30490j30691j43142
8541G581216j34246j44801j61799j19594j21667j40156j42580j31291j10532j18697
8531F255853j14693j08348j38176j24229r9299q7327p8265r5412q7546j08857
8521E213701r4182j01044q5716j00967q6861r6334p7613p2761q2485p7163q4802
8510D253773q1841o1883p8794p9653o4684p7987m8694l3923n5922p6108p2778
8499C521506n3360m8817l9125n0557n7830m9142m3393n8492o3518m1181o0048
8488B956043p2284l8927k8178m9197m7068l4421l4700m3530l6960l1937n0346
$$ plain form
8560 10866479 10690930 10512565 10318747 10132502 9942000 9752102 9566169 9378831 9186977
8551 9186977 9022546 8871383 8705054 8498442 8324208 8149675 7985539 7855049 7724358 7581216
8541 7581216 7446970 7302169 7140370 7020776 6899109 6758953 6616373 6485082 6374550 6255853
8531 6255853 6141160 6032812 5894636 5770407 5671108 5583781 5505516 5410104 5322558 5213701
8521 5213701 5119519 5018475 4932759 4831792 4744931 4648597 4570984 4498223 4415738 4338575 4253773
8510 4253773 4171932 4110049 4031255 3951602 3886918 3808931 3760237 3726314 3670392 3594284 3521506
8499 3521506 3468146 3419329 3380204 3329647 3271817 3222675 3179282 3120790 3057272 3016091 2956043
8488 2956043 2883759 2844832 2816654 2767457 2720389 2685968 2651268 2607738 2570778 2538841 2488495
8477B488495m6583k0718k0337l3835k681j0961l5965k9664m5221l9133k9370j3759
8465B160268k7670j6152k7119m5204l6740l1506m4301l4277j7676j4516l1221
8454A833886m3454o246j3078l5526l4739k2023j4109j6129j2744j3115j5780l3070
8442A573873k8942j1067l7775k5684n204j4753j6144k0428l5487l7150n492q997
8430A326750k191j0810l083q628k0742j7388k937l2025m2948J5730K732j9187
8418A185273K19j1281j402l714k1847k1504j6062k5117n117J2236q47k0795l0580
8405A039462l1639p139J8096k0155o421k172J7459J5028k634l7504l3302j9879
8393I29200j2686r950j3613j4961o200m094j1305j4464j0206R029R279j358m075
$$ plain form
8477 2488495 2441912 2421194 2400857 2367022 2364341 2353380 2317415 2287751 2242530 2203397 2174027 2160268
8465 2160268 2132598 2116446 2089327 2044123 2007383 1975877 1931576 1897299 1879623 1865107 1833886
8454 1833886 1790432 1784186 1771108 1735582 1700843 1678820 1664711 1648582 1635838 1622723 1606943 1573873
8442 1573873 1544931 1533864 1496089 1470405 1465201 1450448 1434304 1413876 1378389 1341239 1335747 1326750
8430 1326750 1324559 1313749 1310666 1302038 1281296 1263908 1260971 1228946 1185998 1201728 1204460 1185273
8418 1185273 1185492 1174211 1172809 1169095 1147248 1125744 1109682 1084565 1079448 1091684 1090837 1070042 1039462
8405 1039462 1007823 1000684 1018780 998625 992204 990032 1007491 1022519 1019885 982381 949079 929200
8393 929200 916514 906564 892951 877990 871790 867696 856391 841927 831721 840750 850029 848671 844596
8380H44596l2284j8021l807p186j0790j1134o141q019l620j0973Q578M297J3532
8367G59028l2257L275P339j0364j0129j1138r088J5137k3837k3855q06k891j3547
8354F46867j4485m514M823J2610n346n548n45k1605j36J459j3056N427M202p236
8340F02917L277l7556l5444m510Q422o508Q620M812l797j128p125k3373j310J6020
8326E23317J2447n225l722j5370p47j3405j0883j4650L343M012J1960J4487j2680
8313D92884j0544J2345M265j4549k722K080l220P847k005n23J0218j176l255j8302
8299D73343k6477r223j8152q397L701r882o649J1595n893j1807m955j822j6k258
8285C83108M290M196n526j6623J78k141M585P443K3122J9160p513k2290j5268
$$ plain form
8380 844596 812312 794291 790484 783298 772508 761374 755233 747214 743594 732621 741199 745496 759028
8367 759028 726771 730046 737385 727021 716892 705754 696666 711803 687966 664111 663305 660414 646867
8354 646867 632382 627868 632691 645301 639955 634407 633862 612257 612121 613580 600524 605951 610153 602917
8340 602917 606194 568638 533194 528684 537106 530598 539218 544030 540233 539105 531980 508607 507297 523317
8326 523317 535764 530539 526817 511447 510700 497295 486412 471762 475105 479117 491077 505564 492884
8313 492884 482340 494685 498950 484401 481679 483759 480539 488386 486381 485858 496076 494900 491645 473343
8299 473343 446866 437643 419491 411094 414795 404913 398264 409859 403966 392159 387204 385382 385366 383108
8285 383108 387398 391594 386068 369445 369623 367482 372067 379510 402632 421792 414279 391989 376721
8272C76721J017M918n961p314N119j7007p236P499J4963o673K151J0405Q950o424
8258C81128o210l843M079J1645l1445k0205L121J0982M930j2916R960K719j7191
8245C36754l854J3538O604O544k5659q744p243k3875O171O229j1428j5997j0031
8232B69009P425q191P126J0079Q749P207Q639j2710j6089N150p851O488J2583
8219B97614m487J285K0900K3020J0160K1440N383l4994p897K302j497k0427j7074
8206B95728k2904k988J1066P525n315R764j048m201n985j9601o943J0137L911
8193B69146k791J3521J3107J3402J0667N530J7304O801J1205J9887K6438N5380
8181D59597N7613N3688J16175J66223J60941J21116L7806n0043j42991j57126
$$ plain form
8272 376721 377738 382656 376695 369381 374500 357493 350257 357756 372719 366046 368197 378602 387552 381128
8258 381128 374918 371075 375154 386799 355354 335149 338270 349252 354182 341266 351226 353945 336754
8245 336754 332900 346438 353042 359586 333927 325183 317940 294065 300236 306465 295037 279040 269009
8232 269009 276434 268243 275369 285448 294197 301404 310043 297333 281244 286394 278543 285031 297614
8219 297614 293127 294412 315312 338332 348492 369932 375315 340321 332424 334726 333229 312802 295728
8206 295728 272824 269836 280902 288427 283112 292876 291828 287627 281642 262041 255098 265235 269146
8193 269146 266355 279876 292983 306385 317052 322582 339886 346687 357892 377779 404217 459597
8181 459597 517210 570898 687073 853296 1014237 1135353 1173159 1123116 980125 822999
8171H22999j60866j24706p5527l0918l0815n90q474l1370n826m207k1041j6436
8159C12223J4104P597k4420r058K1487J4577j9949j640q322J0062M4360N2695
8147D13716M8633M3859J4631K0696L1613k1686k7325k840Q752N71K1562J2699
8135E64881J0413M049j2302K2586K0255k215Q963M8261P7293Q9684P4056M7453
8123I53377j1299n6821r0430n8372m2604l6329j2607j0194J4135L3223Q54m6208
8111F36725l7916n7676m4653l8414k2515o033j8025k9035K652J0471K1021l0486
8099C86116k5379j8216k0476j3254P037o468p675l0789j5365N951J9918J1735
8087B93135K9161J8394R544n943K6966M3358K2092K0985N7655Q7973J31945J32075
$$ plain form
8171 822999 662133 537427 461900 430982 400167 399577 391103 359733 353907 349700 328659 312223
8159 312223 326327 333924 309504 300446 321933 336510 316561 314921 306599 316661 361021 413716
8147 413716 462349 506208 520839 541535 573148 551462 524137 521297 530049 530620 552182 564881
8135 564881 575294 579343 567041 589627 609882 607667 616630 664891 742184 831868 905924 953377
8123 953377 942078 885257 794827 736455 693851 657522 644915 634721 648856 682079 682933 636725
8111 636725 598809 541133 496480 458066 435551 429518 411493 382458 385110 395581 416602 386116
8099 386116 360737 342521 322045 308791 315828 309360 301685 270896 255531 261482 281400 293135
8087 293135 322296 340690 350234 344291 371257 414615 436707 457692 515347 603320 735265 867340
8075H67340J10370Q6226L3790n6799r1510p7913l6800J0337J24030J84366K23549
8064A376986K82072K69409K56106J33963n2385j90283k50080l22286l08097k34418
8054I60987j78550j30188r3197o4022n0963k6750k7867k4222k3174j5967O17j2646
8042C14058J4831P707J3415O784q70K687R554L885J2193k2145P24J3730j72M36
8028C76817K7847L2810j40L4636P8720J12634J61909K57909L68975N44509O68870
8017B665496O90075N67675J95526k35828n03562o75561o28000n27689l52414k23611
8007I72107j62509j25861r9650o9554l0231m9759k5742k2246j1333k4805k6038
7996C24379k4575l609j9581J0857K4779q17j8951j6485k5681j8403J9092O644
$$ plain form
8075 867340 977710 1063936 1097726 1040927 949417 871504 834704 845041 969071 1153437 1376986
8064 1376986 1659058 1928467 2184573 2318536 2266151 2075868 1825788 1503502 1195405 960987
8054 960987 782437 652249 559052 495030 444067 417317 389450 365228 342054 326087 326704 314058
8042 314058 328889 336596 350011 356795 355925 358612 368166 372051 384244 362099 362823 376553 376381 376817
8028 376817 404664 437474 437334 471970 550690 663324 825233 1083142 1452117 1996626 2665496
8017 2665496 3355571 3923246 4118772 3882944 3379382 2703821 2075821 1548132 1195718 972107
8007 972107 809598 683737 584087 514533 484302 434543 408801 386555 375222 350417 324379
7996 324379 299804 296195 276614 287471 312250 311433 292482 275997 250316 231913 251005 257649
7984B57649J4966L4531J6380K2733J4373M9308P8238P4395Q3474J32720J61894
7973I40661J81543J55504J40868J11679l9708j35278j24056j20920j89213j93332
7963G27748j65478j28098o3416o2472k8336j6904j7906k9375k6489j689p41N734
7951A92578P095N371k4135j9450j2486L958j4189j5550P894P541J1282K3664R24
7938A74497L639m755L207j6741m890j6607j8992j3342J1264O238j6096k932J6069
7925A20559j2868j5543L472L302j591j2942n576L809p230R567J8367j3308j3181
7912G6837Q53m06J2229J3696o250k5976j2237J5371J3519J7620n173j5431%M284
7898H8936m048j2420m35j7225r594N592N135O843J4868O357j0205q613k508J1946
$$ plain form
7984 257649 272615 307146 323526 346259 360632 409940 488178 562573 646047 778767 940661
7973 940661 1122204 1277708 1418576 1530255 1490547 1355269 1231213 1110293 921080 727748
7963 727748 562270 434172 370756 308284 279948 263044 245138 215763 189274 187585 186844 192578
7951 192578 199673 205044 180909 161459 148973 152931 138742 123192 131086 138627 149909 173573 174497
7938 174497 178136 173381 176588 159847 154957 138350 119358 106016 117280 123518 107422 104490 120559
7925 120559 107691 92148 95620 98922 97331 84389 78813 82622 75392 84959 103326 90018 76837
7912 76837 77690 77284 89513 103209 96959 70983 58746 74117 87636 105256 100083 84652 84652 88936
7898 88936 84888 72468 72033 54808 45214 50806 55941 62784 77652 84009 73804 65191 62683 74629
7884G4629j0341P333R176l491J496l482J1246q820n775Q226L611j4917j9005P216
7870E7102K364K600n641j4526P281K7560j0j1854m759R276J0625j2543k1766P695
7856E3404L671O869J632k3364N99J3687n965k54J919J8383J4620n485j6303K49
7842F3662o035k2052o899R419J0600J5532k74r488L280M241K902Q266m94k7424
7828D5236p61J2814L225k1663j0913j0731q006L598K7120M302l556o780j397o365
7814B6123O274J206q426n190r460J2470j359j649L784j136l05J3949M954p454
7800C3781J0044n408J2284K979n273R523j152N633J0181j2q991k5278l063M644
7786C9892P473L351O643K266P416j5479k2895j3097K1871M053L882J8838O002
$$ plain form
7884 74629 64288 71621 80797 77306 78802 75320 86566 77746 71971 80197 83808 68891 49886 57102
7870 57102 59466 62066 56425 41899 49180 76740 76730 64876 60117 69393 80018 67475 45709 53404
7856 53404 57075 63944 65576 42212 42811 56498 50533 50279 52198 70581 85201 79716 63413 63662
7842 63662 57627 35575 28676 38095 48695 64227 63953 54465 57745 61986 64888 73154 72660 45236
7828 45236 44475 57289 60514 38851 27938 17207 9201 12799 39919 44221 40665 33885 32488 26123
7814 26123 32397 33603 25177 19987 10527 22997 21638 19989 23773 22637 22332 36281 41235 33781
7800 33781 43825 38417 50701 53680 48407 57930 56778 62411 72592 72580 63589 38311 35248 39892
7786 39892 47365 50716 57359 59625 67041 51562 28667 15570 37441 41494 45376 64214 70216
7773G0216J1311k123r704k9260k9361J6712K1554Q514o288j9575n947l651P063
7760B9461Q721j2350l06L925p76K905P782N122J641m341M226J6210L509j2595
7746E3134J949q762J194q248N947j003j1301R68P676m127K398l349o927J6386
7732D5935J3402j4329j690j4824j6510j3011k245P334N303Q099p784L658J6388
7719B9726J557K287q33K153n302k725q567q257M18J3761J3729j987K087j8350
7705A9697j0025J6674R698k602N672q17j3300j1203J7442J1791L56l359M142P733
7691E1899j0989j7606j5631K283n074P145N912N978r284K6854J8327j1143K178
7678E0849K91k0255k8215j1874O588M239N086M019P073R694m129j5912K629l208
$$ plain form
7773 70216 81527 79404 69700 40440 11079 27791 49345 57859 51571 31996 26049 22398 29461
7760 29461 38182 25832 25526 29451 28675 31580 39362 44484 46125 41784 46010 62220 65729 53134
7746 53134 55083 46321 47515 39267 45214 44211 32910 33878 41554 37427 39825 36476 29549 45935
7732 45935 59337 45008 43318 28494 11984 -1027 -3272 4062 9365 17464 9680 13338 29726
7719 29726 31283 33570 32737 34890 29588 26863 18296 10039 10457 24218 37947 35960 38047 19697
7705 19697 9672 26346 36044 33442 39114 38297 24997 13794 31236 43027 43383 40024 44166 51899
7691 51899 40910 23304 7673 9956 4882 12027 17939 23917 14633 41487 59814 48671 50849
7678 50849 51140 30885 2670 -9204 -2616 1623 6709 10728 17801 27495 23366 7454 10083 6875
7664F875j4339O706J097K0325J3150N213Q593m989k0783j1664K6942K3272j6767
7651D3631j7480p462j560K676K554J442L257k897R077M19P926m587j0148o000
7637B0848N179L424k434r246o404L095j62o439J0215l322J851p05j493k317J2621
7622B4711Q692K1206K1718L97o750l1283l9802O406O582Q624j0654j1738J0663
7609H772J1115l473j3596J9085M484J5443K860k2402L47J0115j5662r349P524
7596A5263P245J4092j2926k1315k0743J1068J8231K3320Q376j745j2238n215j7448
7583E965J361K3577m411P503Q53N766L460k6605k1028M365J0178R025l985k794
7569A3230N863J1433J1134p132p271k2097p281n497p057J2276L911j0511n046
$$ plain form
7664 6875 -7464 -758 339 20664 33814 39027 47620 42631 21848 10184 37126 60398 43631
7651 43631 26151 18689 17129 19805 22359 23801 27058 24161 33238 33657 41583 36996 26848 20848
7637 20848 26027 29451 27017 17771 11367 14462 14300 7861 18076 14754 16605 15900 14407 12090 24711
7622 24711 33403 54609 76327 76724 69974 38691 -1111 5295 11877 20501 9847 -1891 8772
7609 8772 19887 16414 2818 21903 26387 41830 44690 22288 22635 32750 17088 7739 15263
7596 15263 22508 36600 23674 2359 -18384 -7316 10915 34235 42611 40866 28628 23413 5965
7583 5965 7326 30903 26492 33995 34848 40614 44074 17469 -3559 806 10984 20009 16024 13230
7569 13230 19093 30526 41660 34528 27257 5160 -2121 -7618 -14675 -2399 1512 -8999 -14045
7556a4045Q394j134O534K3159q489j0999o920L017J4424J5012K4143O446r087
7543E0455j7867J389J4264O891K296j0235r553l917l467j2693j8231r630j934
7530a2232m461P673N372J2408P155J7878r843j5891p245K0269J58q287J1734j880
7516B2808p981k1014K4492Q637k30p93j1984R214J327M100m287K929m203j1093
7502A1922N399J9013m744j4561k105O389J1762m309j2333l017Q311j2621j3660
7489d554p771j1960J5428L392L808J0148N523j942J0394j6845k3842K308m767
7476b0680L429J7437R894q339j6045M380J0841L662L667L91p337R9J9845J5923
7462C7167k568j0119j0776L900R11r909R826K7370J238k9171j1228P960q559M191
$$ plain form
7556 -14045 -5651 -6785 -251 22908 14419 3420 -3500 -483 13941 28953 53096 59542 50455
7543 50455 32588 33977 48241 55132 57428 47193 37640 33723 30256 17563 -668 -10298 -12232
7530 -12232 -16693 -9020 -3648 8760 15915 33793 23950 8059 814 21083 21241 12954 24688 22808
7516 22808 14827 -6187 18305 26942 26712 25919 13935 23149 24476 28576 24289 27218 23015 11922
7502 11922 17321 36334 31590 17029 14924 21313 33075 28766 16433 13416 21727 9106 -4554
7489 -4554 -12325 -24285 -8857 -5465 -1657 8491 14014 12072 22466 5621 -18221 -15913 -20680
7476 -20680 -17251 186 10080 1741 -14304 -9924 917 4579 8246 8637 1300 1399 21244 37167
7462 37167 34599 24480 13704 17604 18515 8606 18432 45802 47040 17869 6641 14601 6042 10233
7448A0233J3385m413j2236J4065p636m937j3773n658k970J9634J3569o236l929
7435I098k0583J770M345J929J0120J0481n631r097j1541O887n79o459O692R894
7421G326J1576Q325L965j9409j1428J4014J1150K2376o107k0546K029O423l427
7408B6267j832L976j746j8449k4319q770K7943K6236j8924k073p677m064J1097
7395G665O585k6070P659L764j3328k953P521L921N613J0651l007l216J3796J2023
7381C0624M466l706q869j8616J416k173j0956L898Q131J3990J3166J0846n243
7368C6974j0741k726o065l627j1748J4252J734K230K6438J5276o030j8109k6535
7355A1323K14R581M543m606q300j3506j6113P848l218Q5J1115K466j0049m369
$$ plain form
7448 10233 23618 19205 6969 21034 13398 8461 -5312 -10970 -13940 5694 19263 13027 9098
7435 9098 -11485 -9715 -5370 -3441 6679 17160 11529 2432 -9109 -2222 -2801 -9260 -2568 7326
7421 7326 18902 27227 31192 11783 355 14369 25519 47895 41788 21242 23271 29694 26267
7408 26267 24435 28411 26665 8216 -16103 -24873 3070 29306 10382 8309 632 -3432 7665
7395 7665 14250 -11820 -4161 -397 -13725 -16678 -9157 -5236 377 11028 8021 4805 18601 30624
7381 30624 35090 31384 22515 3899 5315 3142 -7814 -3916 4215 18205 31371 42217 36974
7368 36974 26233 23507 17442 13815 2067 16319 18053 20283 46721 61997 55967 37858 11323
7355 11323 11537 21118 25661 21055 12755 -751 -16864 -9016 -12234 -12149 -1034 1432 -8617 -12986
7341a2986j151Q286Q140J9683L4716N04j9840j6358j1567k149L379l73k0986k3774
7327c4476M2471M1079n175k0281M309O649r870k2484k6176K261K7683K6429J2266
7314D4685j2435n393k729j460j2799l164L9452l19j1674j2713o804J316J0717
7301B6680j953n757m95j6486j302m415k42O867j0982J33J3898p295j737J8502
7287A5416J1542q216j3188n048K2271R671n303j0249l867J6166o657j0791r363
7274B384J943n882o001p431J1003O188J170j3142j550r43k116J8054K0975p062
7260A7590j5285q758N63R348R41K925j5365o445l096J7558j17m56o027M092J0029
7245G497j4850j8746J0269j725O960J609R582l269o76j0217N234K1521L2682j3804
$$ plain form
7341 -12986 -14137 -5851 2289 21972 56688 57192 37352 20994 9427 7278 10657 10284 -10702 -34476
7327 -34476 7995 49074 43899 23618 27927 34576 24706 2222 -23954 -21693 5990 32419 44685
7314 44685 32250 26857 24128 22668 9869 6705 46157 45838 34164 21451 14647 15963 26680
7301 26680 24727 18970 18475 1989 687 -3728 -3970 2897 -8085 -7952 5946 -1349 -3086 15416
7287 15416 26958 18742 5554 506 22777 32448 27145 16896 13029 29195 22538 11747 2384
7274 2384 4327 -1555 -7556 -14987 -3984 2204 3374 -9768 -11318 -12261 -14377 3677 24652 17590
7260 17590 2305 -6453 -5890 3458 4399 7324 -8041 -14486 -17582 -24 -141 -597 -6624 -2532 7497
7245 7497 -7353 -26099 -15830 -17555 -10595 -8986 596 -2673 -3349 -13566 -8332 13189 45871 32067
7231C2067m993O556r661L500R801j230m155m140K016M42J0204M01m279j5626l0699
7216i796q558M454K391o03j5768L172R053K094M697Q226o945N911M745P718J5737
7201B6528j6224j1071k778M597q85j3083n486k797j993R427K0021P336K129j9754
7187d033j4727q413k575n677J1464J5105k619k4110M281J0431L736L748j6827
7174c0216m019K5952K4286K726j4920l137J2579l748j0617o263k5033j5224n520
7161e3154L0009Q375q412Q690O722k83N917q839r106K879J9676N392l578K6K4725
7146B9039j4529j5209Q708J7900J90k2011k200J0407J3857K1810k4184j729J4470
7133C6519k0909L716P368m617k0629R057Q986q110J2879J289j5307j1644m258
$$ plain form
7231 32067 27074 33630 23969 27469 37270 36040 31885 27745 29761 30203 40407 40808 36529 20903 -9796
7216 -9796 -18354 -13900 -11509 -12112 -27880 -24708 -15655 -13561 -8864 -638 -7583 -1672 3073 10791 26528
7201 26528 10304 -767 -3545 1052 167 -12916 -18402 -21199 -23192 -13765 6256 13592 15721 -4033
7187 -4033 -18760 -27173 -29748 -35425 -23961 -8856 -11475 -35585 -31304 -20873 -17137 -13389 -30216
7174 -30216 -34235 -8283 16003 18729 3809 672 13251 9503 -1114 -7377 -32410 -47634 -53154
7161 -53154 -23145 -14770 -23182 -14492 -7770 -8053 -2136 -10975 -20081 -17202 2474 7866 4288 4314 29039
7146 29039 14510 -699 8009 25909 26099 4088 1888 12295 26152 47962 23778 22049 36519
7133 36519 15610 19326 26694 22077 1448 10505 19491 11381 24260 25549 10242 -1402 -5660
7120e660k907J2618j0612j9388k644j0128j728J6546J2278J2796M413o041Q603
7107H146J489P937J4606j1568o104m165R08K962j9751o692j2075J780N370N075
7093a2082J3608j761P03J0152N228m55J5268J90q099j8920j4080M672J939r961
7079a3598R648m736j5361J554m942O121q50q782N496m923J6383J6379l913j5420
7065a6944R850J2555l788P89N287j9488k9812J0127J6580o822O256J4853p212
7052g769M868J3990j453j1431Q61k9412m337O631K0783O419J1204J659j757k195
7038H061o860l600o808J1555K1059J1881m5258p000L17L720K108n068r896k4341
7024e0130J7849L177J54M250j723J3448r359R489j71j2850q674J8199K0494P818
$$ plain form
7120 -5660 -8567 4051 -6561 -25949 -28593 -38721 -40449 -23903 -11625 1171 5584 -457 8146
7107 8146 9635 17572 32178 20610 14506 10341 11249 14211 -5540 -12232 -24307 -22527 -17157 -12082
7093 -12082 1526 -235 468 10620 15848 15393 30661 30851 22752 3832 -10248 -5576 -3637 -13598
7079 -13598 -3950 -8686 -24047 -22493 -27435 -21314 -22164 -30946 -25450 -30373 -13990 2389 -1524 -16944
7065 -16944 -7094 5461 1673 2462 7749 -11739 -41551 -31424 -14844 -21666 -15410 -557 -7769
7052 -7769 -2901 11089 9636 -1795 -934 -30346 -34683 -28052 -7269 -850 10354 12013 10256 8061
7038 8061 1201 -2399 -9207 2348 23407 35288 -9970 -16970 -16653 -12933 -10825 -15893 -25789 -50130
7024 -50130 -32281 -29104 -28950 -24700 -26423 -12975 -22334 -12845 -13016 -25866 -34540 -16341 4153 11971
7010A1971m736J2029M818K206p041k4361j9738k95L273R527q00L045J3454J1224
6996A4576J337r854j3086J3787J0420j1878k1137n69P085p712J806R665N734R764
6982I938L279j5033K647K4o988j382J2492j0797j9215j1288L538K7919L227N785
6968D146J2501L125j1269n257m152j0589m040J649N913l21o367p941k981J2234
6954a3349J2924n396k770l661J1395l90k182n165j554J794J5348J702j0947l270
6940e521p850j0013R05J5326l995j3219M935J2148L6926J1701q6N993j0510k2611
6926A4129j3941k2936q477L015K6502R883j1071o604J5985L699j622P744j7380
6913a074j9500P827N655J2554m006k580j247j8647l467J5862j0141N026Q331l355
$$ plain form
7010 11971 7235 19264 24082 26288 19247 -5114 -24852 -25147 -21874 -12347 -13147 -10102 3352 14576
6996 14576 15913 6059 -7027 6760 17180 5302 -15835 -16404 -9319 -17031 -15225 -5560 174 9938
6982 9938 13217 -1816 831 855 -6133 -7515 4977 -5820 -25035 -36323 -32785 -4866 -1639 4146
6968 4146 16647 19772 8503 3246 -906 -11495 -15535 -13886 -7973 -8294 -14661 -22602 -25583 -13349
6954 -13349 -425 -5821 -8591 -12252 -857 -1247 -3429 -8594 -10148 -8354 6994 8696 -2251 -5521
6940 -5521 -13371 -23384 -22479 -7153 -11148 -24367 -19432 -7284 29642 41343 41257 47250 36740 14129
6926 14129 188 -22748 -31225 -28210 -1708 8175 -2896 -9500 6485 10184 8562 16306 -1074
6913 -1074 -20574 -12747 -7092 5462 1456 -1124 -2371 -21018 -24485 -8623 -18764 -13738 -5407 -8762
6899h762n231K0255M494J6300L33r350o500p651m111J0308m225R741j1761k5236
6885b1396r177J0550J1688J2382R357L817l792j0124K1341M583r228L341q063
6872A5279j8559L641p722l37J284K508q594k3832J1164J3181O991J9460J3754
6859B8218k559j2365m782j1826r219M743l697j090n834j5788M570K0839m337j793
6845a4920j9362R763J4578J8183P760q784K920r949q682n475j052P949J8114j132
6831I911O613M764j1603J3053Q173J718J5425K210j0135j8398k5615J778Q192
6818F086O552r98q795J1873j0141l471Q721R882k18m135K2654P119n862j1895
6804B7372j4137J4117J5818j4844j7530J4502K5000k0202k5676j182J264R313
$$ plain form
6899 -8762 -13993 6262 10756 27056 27389 18039 11539 3888 -223 10085 5860 15601 3840 -21396
6885 -21396 -30573 -20023 -8335 4047 13404 17221 13429 3305 24646 29229 20001 23342 15279
6872 15279 -3280 361 -7361 -7698 -6414 -3906 -12500 -36332 -25168 -11987 -4996 14464 28218
6859 28218 25659 13294 8512 -3314 -12533 -7790 -11487 -12577 -18411 -34199 -29629 -8790 -13127 -14920
6845 -14920 -34282 -24519 -9941 8242 16002 7218 10138 189 -8493 -13968 -15020 -7071 11043 9911
6831 9911 16524 21288 9685 22738 30911 32629 48054 50264 40129 21731 -3884 -2106 6086
6818 6086 12638 11640 2845 14718 4577 1106 9827 19709 19491 15356 38010 45129 39267 27372
6804 27372 13235 27352 43170 28326 10796 25298 50298 30096 4420 3238 4502 13815
6792A3815k548J1585J0156k4870l0697K589J4505l399j745P367n757p163L630
6779a2532K784j168j0485J847L1525J0679p649j4718k204K019n370J8693L0446
6766D3867o859j0687j2562p961j1994J0788R670k231j7368r092q98N963r578Q540
6752a0402P592j2834j4069K896J4662J5280r102P417J2559n883P21r874Q55l621
6738c803j5328L24N610K3562j2072j3471J6057K4180J8428o948j7868r242q069
6725A360J4707r464n240K509r854l569l863m809Q25R204J8417P113n668K770O099
6710B0537j5402k7692r432K5413J4337P155J8364j2974r903p337l670j377q495
6697a0476J849j0853o195K0136J9311J0740o571k4314j5034K6162J3266o617j2602
$$ plain form
6792 13815 11267 22852 33008 8138 -22559 -19970 -5465 -8864 -10609 -3242 -8999 -16162 -12532
6779 -12532 -9748 -10916 -21401 -19554 11971 22650 15001 283 -1921 98 -5272 13421 43867
6766 43867 37008 26321 13759 5798 -6196 4592 14262 12031 -5337 -14429 -15327 -9364 -18942 -10402
6752 -10402 -2810 -15644 -29713 -26817 -12155 3125 -5977 1440 13999 8116 8837 -1037 -182 -3803
6738 -3803 -19131 -18807 -13197 10365 -1707 -15178 879 25059 43487 36539 18671 9429 1360
6725 1360 16067 6603 1363 3872 -5982 -9551 -13414 -18223 -17398 -8194 10223 17336 11668 14438 20537
6710 20537 5135 -22557 -31989 -6576 7761 14916 33280 20306 10403 3066 -604 -1981 -10476
6697 -10476 -8627 -19480 -25675 -5539 13772 24512 17941 -6373 -21407 4755 18021 11404 -1198
6684a198k057J657j677n25j5747j8245m543J9787J3390K1017L371k1841j8273
6671b4884r321P380J5951P596P59r516K72J3238J2145k27L262k787p630m224J808
6656C822N191N07K885j778m147j3436j6345l916L703L291J4567k066J0718j2816
6642i820J6935J8168j0864p265k812k4465k3242J1475J6052J5549K5097K299j4186
6629A2921j3822J1121Q449j2412j9884R666l741J598l10J1301k0592p7P491p85
6615i076j065J0216J0614l852J1046j4725j500J3856o974l1933j2024K3314O590
6602e513l599q344M877k1103J3863M035R173L326M0P418K161j5539r46J0302J5482
6587A5633J5563k8511j5115P070J1149Q989l49j298L284l0680l589J3896J3906
$$ plain form
6684 -1198 -3255 -1598 -3275 -3800 -19547 -37792 -42335 -22548 -9158 11859 15230 -6611 -24884
6671 -24884 -34205 -26825 -10874 -3278 -2519 -12035 -11763 1475 13620 13393 16655 13868 6238 2014 3822
6656 3822 9013 9520 12405 10627 6480 -6956 -23301 -27217 -23514 -20223 -5656 -7722 2996 -9820
6642 -9820 7115 25283 14419 7154 4342 -20123 -43365 -31890 -15838 -289 24808 27107 12921
6629 12921 -901 10220 18669 6257 -13627 -3961 -7702 -6104 -6414 4887 -15705 -15782 -8291 -9076
6615 -9076 -10141 75 10689 6837 17883 3158 1658 15514 8540 -23393 -35417 -12103 -5513
6602 -5513 -9112 -17456 -12579 -33682 -19819 -15784 -6611 -3285 -3245 4173 6334 -9205 -10151 151 15633
6587 15633 31196 2685 -12430 -5360 5789 14778 14429 13131 16415 -14265 -17854 -3958 9948
6574I948m603k9753l920L805J1338j1205O322J6367K393m834l934j7266K313K0341
6560b688J8044r589O017O358p901j202J3087n020n888m983k1413j4305J117J1730
6546a6636p65N037K456P233r687o361J5918m59k0970j4645J1637K495O469J9798
6532A520J3957j0455j661O60q900k1493Q2K3191L87M343J579k285J0732R125J4263
6517C5045L792m907M745o279l602j8394q720m548J5941l619J186Q533K997m63
6503B1707j5574j1541o783j396J4135J2178O911n315j5579p06J0763M882k334
6490A1348q568j873J869O818L686L856o593k0016j2299N13J1572J4142k3627j834
6476b1006O966j76M62j802R836L4025R96p222J1247j1561r036k845N034K0793
$$ plain form
6574 9948 5345 -24408 -28328 -24523 -13185 -24390 -18068 -1701 692 -4142 -8076 -25342 -23029 -2688
6560 -2688 15356 5767 11784 18142 10241 9039 22126 17106 11218 6235 -15178 -29483 -28366 -16636
6546 -16636 -17401 -12364 -9908 -2675 -12362 -18723 -2805 -3264 -24234 -38879 -27242 -24747 -18278 1520
6532 1520 15477 5022 3361 4021 -4879 -26372 -26290 -3099 -2712 1631 3210 925 11657 20782 35045
6517 35045 38837 33930 38675 32396 28794 10400 1680 -2868 13073 9454 10640 19173 22170 21707
6503 21707 6133 -5408 -12191 -13587 548 12726 19637 14322 -1257 -1963 8800 13682 11348
6490 11348 2780 907 2776 9594 13280 17136 10543 -9473 -21772 -21259 -9687 4455 -19172 -21006
6476 -21006 -14040 -14216 -13754 -15556 -5720 28305 29301 22079 33326 21765 12729 9884 14918 35711
6462C5711o635q107q680r462R095r89o345o249M890J6275K013j9393J1551M829
6448A8504k49j2384O70N642j3454R488J5853J180n830j7698m155q585j5692j6974
6434d3684Q910M745n73Q274J7912K866K228P811m289J3859J2714j1257J967Q823
6420C0306o235o062N651J2053k3034j9770j3125j0097O154K869L182K1488m656
6407a276K133L073J472j3992O787M424n521k5293j3018J0007K5310j572J3723
6394F257M870l706N209l519O626O194j4473j7378j1357L416Q367K394K0117K1881
6380C4898l326k6397j4332j4070Q55j7219J1718K0271J1895k224o498k499n693
$$ plain form
6462 35711 29076 20969 12289 2827 11922 10933 4588 -1661 3229 19504 21517 2124 13675 18504
6448 18504 18255 5871 6541 12183 -1271 8217 24070 25250 19420 1722 -2433 -11018 -26710 -43684
6434 -43684 -34774 -30029 -30602 -22328 -4416 -1550 678 8489 4200 18059 30773 19516 21483 30306
6420 30306 24071 18009 23660 35713 12679 -7091 -20216 -30313 -24159 -21290 -18108 3380 -1276
6407 -1276 857 3930 5402 -8590 -1803 2621 -2900 -28193 -41211 -31204 -5894 -7466 6257
6394 6257 11127 7421 12630 9111 15737 21931 7458 -9920 -21277 -17861 -9494 -7100 13017 34898
6380 34898 31572 5175 -9157 -23227 -22372 -39591 -27873 -7602 4293 2069 -4429 -6928 -12621
$$ [...]
##END NTUPLES=NMR SPECTRUM
##END=
