##TITLE=Analysis number 328666
Compound Code cc 62146
Book Reference 540/6
Project Code adrs
Chemist Name mikem
##JCAMPDX= 6.0         $$ Bruker NMR JCAMP-DX V2.0
##DATA TYPE= NMR SPECTRUM
##DATA CLASS= NTUPLES
##ORIGIN= Bruker BioSpin GmbH
##OWNER= nmr
$$ XWIN-NMR		Version 3.5
$$ Tue Jun 26 08:55:41 2007 GMT Daylight Time (UT+1h)  MAYBRIDGE\nmr@NMR_250MHZ
##.OBSERVE FREQUENCY= 250.131544655141
##.OBSERVE NUCLEUS= ^1H
##.ACQUISITION MODE= SIMULTANEOUS (DQD)
##.ACQUISITION SCHEME= undefined
##.AVERAGES= 16
##.DIGITISER RES= 18
##SPECTROMETER/DATA SYSTEM= dpx250
##.PULSE SEQUENCE= zg30
##.SOLVENT NAME= CDCl3
##.SHIFT REFERENCE= (INTERNAL, CDCl3, 0, 16.522)
##AUDIT TRAIL= $$ (NUMBER, WHEN, WHO, WHERE, WHAT)
$$ ##TITLE= Audit trail, XWIN-NMR		Version 3.5
$$ ##JCAMPDX= 5.01
$$ ##ORIGIN= Bruker BioSpin GmbH
$$ ##OWNER= nmr
$$ C:\u/data/dgb/nmr/ADRS/1830/pdata/1/auditp.txt
$$ ##AUDIT TRAIL=  $$ (NUMBER, WHEN, WHO, WHERE, WHAT)
(   1,<2007-06-26 08:55:05.00 +100>,<MAYBRIDGE\nmr>,<NMR_250MHZ>,
      <created by zg, POWCHK disabled, PULCHK disabled
       configuration hash MD5:
       76 6E 9A 78 1E 09 19 81 EC 84 63 8F B0 6A 59 2D
       data hash MD5: 64K
       91 AA A3 60 3A C2 96 02 93 30 C4 2F A7 72 CD FD>)
(   2,<2007-06-26 08:55:26.06 +100>,<MAYBRIDGE\nmr>,<NMR_250MHZ>,
      <Start of raw data processing
       ef LB = 0.3 FT_mod = 6 PKNL = 1 SI = 32K 
       data hash MD5: 32K
       F4 AF 9E A5 04 A9 EB 54 8D 1B 75 DB 40 4A 76 DA>)
(   3,<2007-06-26 08:55:30.40 +100>,<MAYBRIDGE\nmr>,<NMR_250MHZ>,
      <apk 
       data hash MD5: 32K
       7A 31 27 27 42 50 3C F3 B5 6F A7 92 A3 49 AA 48>)
(   4,<2007-06-26 08:55:31.79 +100>,<MAYBRIDGE\nmr>,<NMR_250MHZ>,
      <abs ABSG = 5 
       data hash MD5: 32K
       B5 61 05 78 D3 2F EB 53 3A 1A 01 34 8E 90 3A 5A>)
$$ ##END=
$$ 
$$ hash MD5
$$ 30 D7 17 11 6F E1 8D 4F 1F A1 58 92 97 3D B4 A5
##$RELAX= 
##$RELAX= 
##$RELAX= 
##$RELAX= 
##$RELAX= 
##$RELAX= 
##$RELAX= 
$$ Bruker specific parameters
$$ --------------------------
##$DU= <C:\u>
##$EXPNO= 1830
##$NAME= <ADRS>
##$PROCNO= 1
##$TYPE= <nmr>
##$USER= <dgb>
##$AMP= (0..31)
100 100 100 100 100 100 100 100 100 100 100 100 100 100 100 100 100 100 
100 100 100 100 100 100 100 100 100 100 100 100 100 100 
##$AQSEQ= 0
##$AQ_mod= 3
##$AUNM= <au_zg>
##$AUTOPOS= <2 >
##$BF1= 250.13
##$BF2= 250.13
##$BF3= 250.13
##$BF4= 250.13
##$BF5= 500.13
##$BF6= 500.13
##$BF7= 500.13
##$BF8= 500.13
##$BYTORDA= 1
##$CFDGTYP= 0
##$CFRGTYP= 5
##$CHEMSTR= <none>
##$CNST= (0..31)
1 1 145 1 1 1 1 1 1 1 1 1 1 1 1 1 1 1 1 1 1 1 1 1 1 1 1 1 1 1 1 1 
##$CPDPRG= <>
##$CPDPRG1= <>
##$CPDPRG2= <>
##$CPDPRG3= <>
##$CPDPRG4= <mlev>
##$CPDPRG5= <mlev>
##$CPDPRG6= <mlev>
##$CPDPRG7= <mlev>
##$CPDPRG8= <mlev>
##$CPDPRGB= <>
##$CPDPRGT= <>
##$D= (0..31)
0 1 0 0 0 0 0 0 0 0.06 0 0 0 0 0 0 0.0002 0 0 0 0 0 0 0 0 0 0 0 0 0 0 
0 
##$DATE= 1182844504
##$DBL= (0..7)
120 120 120 120 120 120 120 120 
##$DBP= (0..7)
150 150 150 150 150 150 150 150 
##$DBP07= 0
##$DBPNAM0= <>
##$DBPNAM1= <>
$$ [...]
##$SUBNAM7= <"">
##$SUBNAM8= <"">
##$SUBNAM9= <"">
##$SW= 20.6930455092707
##$SWIBOX= (0..15)
0 0 3 0 0 0 0 0 0 0 0 0 0 0 0 0 
##$SW_h= 5175.983436853
##$TD= 65536
##$TD0= 1
##$TE= 295.16
##$TE2= 300
##$TE3= 300
##$TEG= 300
##$TL= (0..7)
0 120 120 120 120 120 120 120 
##$TP= (0..7)
150 150 150 150 150 150 150 150 
##$TP07= 0
##$TPNAME0= <>
##$TPNAME1= <>
##$TPNAME2= <>
##$TPNAME3= <>
##$TPNAME4= <>
##$TPNAME5= <>
##$TPNAME6= <>
##$TPNAME7= <>
##$TPOAL= (0..7)
0.5 0.5 0.5 0.5 0.5 0.5 0.5 0.5 
##$TPOFFS= (0..7)
0 0 0 0 0 0 0 0 
##$TUNHIN= 0
##$TUNHOUT= 0
##$TUNXOUT= 0
##$USERA1= <user>
##$USERA2= <user>
##$USERA3= <user>
##$USERA4= <user>
##$USERA5= <user>
##$V9= 5
##$VALIST= <valist>
##$VCLIST= <CCCCCCCCCCCCCCC>
##$VD= 0
##$VDLIST= <DDDDDDDDDDDDDDD>
##$VPLIST= <PPPPPPPPPPPPPPP>
##$VTLIST= <TTTTTTTTTTTTTTT>
##$WBST= 1024
##$WBSW= 4
##$XGAIN= (0..3)
0 0 0 0 
##$XL= 0
##$YL= 0
##$YMAX_a= 432684
##$YMIN_a= -347160
##$ZGOPTNS= <>
##$ZL1= 120
##$ZL2= 120
##$ZL3= 120
##$ZL4= 120
##$ABSF1= 16.522
##$ABSF2= -4.171173
##$ABSG= 5
##$ABSL= 3
##$ALPHA= 0
##$AQORDER= 0
##$ASSFAC= 0
##$ASSFACI= 0
##$ASSFACX= 0
##$ASSWID= 0
##$AUNMP= <proc_1d>
##$AZFE= 0.1
##$AZFW= 0.1
##$BCFW= 0
##$BC_mod= 0
##$BYTORDP= 0
##$COROFFS= 0
##$CY= 12.5
##$DATMOD= 1
##$DC= 0
##$DFILT= <>
##$DTYPP= 0
##$F1P= 14.0000005364418
##$F2P= -0.99999901652339
##$FCOR= 0.5
##$FTSIZE= 32768
##$FT_mod= 6
##$GAMMA= 0
##$GB= 0
##$INTBC= 1
##$INTSCL= 1
##$ISEN= 128
##$LB= 0.3
##$LEV0= 0
##$LPBIN= 0
##$MAXI= 10000
##$MC2= 0
##$MEAN= 0
##$ME_mod= 0
##$MI= 0
##$NCOEF= 0
##$NC_proc= -3
##$NLEV= 6
##$NOISF1= 0
##$NOISF2= 0
##$NSP= 0
##$NTH_PI= 0
##$NZP= 0
##$OFFSET= 16.522
##$PC= 1
##$PHC0= -50.63948
##$PHC1= 6.676888
##$PH_mod= 1
##$PKNL= yes
##$PPARMOD= 0
##$PSCAL= 4
##$PSIGN= 0
##$REVERSE= no
##$SF= 250.13
##$SI= 32768
##$SIGF1= 0
##$SIGF2= 0
##$SINO= 400
##$SIOLD= 32768
##$SREGLST= <1H.CDCl3>
##$SSB= 0
##$STSI= 32768
##$STSR= 0
##$SW_p= 5175.98343685301
##$SYMM= 0
##$S_DEV= 0
##$TDeff= 65536
##$TDoff= 0
##$TI= <Analysis number 999999
Compound Code 99
Book Reference 9
Project Code 9>
##$TILT= no
##$TM1= 0
##$TM2= 0
##$TOPLEV= 0
##$USERP1= <user>
##$USERP2= <user>
##$USERP3= <user>
##$USERP4= <user>
##$USERP5= <user>
##$WDW= 1
##$XDIM= 32768
##$YMAX_p= 448687922
##$YMIN_p= -91681
$$ End of Bruker specific parameters
$$ ---------------------------------
##NTUPLES= NMR SPECTRUM
##VAR_NAME=  FREQUENCY,     SPECTRUM/REAL,   SPECTRUM/IMAG
##SYMBOL=    X,             R,               I
##VAR_TYPE=  INDEPENDENT,   DEPENDENT,       DEPENDENT
##VAR_FORM=  AFFN,          ASDF,            ASDF
##VAR_DIM=   32768,         32768,           32768
##UNITS=     HZ,            ARBITRARY UNITS, ARBITRARY UNITS
##FACTOR=    0.157963299565203, 1,           1
##FIRST=     4132.6476996994, 0,             0
##LAST=      -1043.33573715361, 0,           0
##MIN=       -1043.33573715361, -91681,      0
##MAX=       4132.6476996994, 448687922,     0
$$ Real data points
##PAGE= N=1
##DATA TABLE= (X++(R..R)), XYDATA
$$ [...]
20580 39006 33624 -4955 -21908 4616 6753 13900 -16179 -21357 -9896 208 -18647 -6968
20568 -6968 8096 4046 -7808 -19292 -26941 -21827 5070 7654 -1623 -18501 -15151 -5989 9050
20555 9050 9314 400 -11122 -27628 -44040 -38501 -36906 -10222 -5967 315 -29084 -47592 -56500
20542 -56500 -57657 -48541 -54700 -21769 -3820 -16122 -9279 -23663 -17777 -17038 -36886 -23639 -19606
20529 -19606 -12819 2852 31423 28961 14287 -11523 -16861 9587 664 -2187 -1247 -6266 -10365
20516 -10365 -3502 5684 5707 -8405 932 -12416 -29640 -23852 -6972 -12639 -23032 -38400 -25526
20503 -25526 -12649 -11427 -15357 -16019 -6615 -14245 1103 22626 26080 -9653 -3638 -8743 -9904 -8530
20489 -8530 -8545 -8041 2204 7819 -5356 -26690 -38571 -17454 7166 -1593 -11387 -9955 14846 34667
20475 34667 12524 -25814 -33150 -10198 12155 22426 8241 -1763 -3017 -24271 -35622 -10926
20463 -10926 28405 16064 -5306 700 3569 1441 855 -6442 -5481 26611 45599 21546 13173
20450 13173 8389 -11996 -10849 -3036 12372 36935 40376 34060 27021 17616 5150 2792 -6634
20437 -6634 -15928 -1854 13943 14903 7862 8327 14144 -4810 -15578 -17142 3086 33321 42679 31846
20423 31846 12333 -2060 -4051 -26152 -21271 -17151 -10370 530 19646 12820 -5644 -8459 -22842
20410 -22842 -13730 -13487 -31402 -20502 -20063 -27640 -22029 -22877 -19006 -31215 -31812 -34177 -44750 -44932 -39010
20395 -39010 -35996 -31137 -3241 7238 -13129 -11377 -14320 20476 41112 31580 20908 16277 11475
20382 11475 532 -1009 6704 18960 19391 3530 -2424 8150 4855 -4155 -28599 -19772 -2090
20369 -2090 12069 15508 18560 -5914 -18305 -16179 -5573 -16487 -32628 -5757 19438 18507 -5939
20356 -5939 -21514 -19430 -20271 -9756 -4799 -10344 -24095 -10638 8313 27780 3224 -34061 -31393
20343 -31393 -25431 -4638 7365 10324 -6120 -14150 -18820 -12783 -24284 -34222 -42585 -21289 -26957
20330 -26957 -17274 -23581 -14523 23675 31492 19209 -13332 -19517 -30586 -10843 -9711 -2517 12469
20317 12469 25215 35919 46563 43076 30474 5138 -14417 -31773 -21717 -6039 -15858 -1438
20305 -1438 22445 16720 -2463 -10232 -23732 -32628 -19340 -13571 -1558 -9063 4202 30254 32913
20292 32913 9739 23755 38296 41472 23654 8271 -8515 -21134 -29196 -23699 -16571 -43226
20280 -43226 -57209 -15688 17826 -6780 -16387 -15113 -20400 -25202 4783 29990 24634 30745 53733
20267 53733 38166 10843 -9024 -28183 -27916 -19124 -8062 -9128 -79 -30448 -41121 -36865 -22932
20254 -22932 -5442 -6229 -13735 -7396 18550 15172 2351 -17158 340 -4758 -14457 -12707 -5216
20241 -5216 -24398 -7496 -3278 2853 -24003 -25301 -22203 2661 12177 16559 13428 7672 -14116
20228 -14116 -38978 -52589 -43588 -43799 -27886 -20686 -11731 -20043 -15952 -4980 15584 14169 12669
20215 12669 -10260 -26524 -51820 -32022 -11378 2251 6488 13471 22175 20158 165 861 26856
20202 26856 26130 23264 36871 39494 37752 32262 22251 21246 23726 17331 21098 25115 18661 17048
20188 17048 11791 18578 13668 2133 -12130 -12123 15215 12883 707 -2249 -6907 1169 27524 40876
20174 40876 29602 18677 17920 -24386 -25159 6503 22330 33804 33551 15049 25775 27139 13547
20161 13547 2815 -2187 8759 15875 34845 28182 2335 -16790 -17625 -5210 4383 13594 13005
20148 13005 1611 7945 5805 -17384 -25608 -21819 -4689 4725 -9215 -16852 -26735 -41207 -50041
20135 -50041 -39373 -25811 -36939 -24874 2457 13625 17207 8380 374 -3577 6327 8730 9321
20122 9321 798 -11470 6743 27894 17061 -28180 -43956 -31941 -16782 -12408 -21821 5422
20110 5422 24798 30883 12477 -454 10121 -10986 -35539 -36893 -18472 6033 5320 1760 2450
20097 2450 -1289 -10178 -15472 -12854 -18388 -20498 -976 13510 4342 -15174 -18077 4294 27184
20084 27184 5639 6682 7745 -596 -12888 -12199 979 23383 9283 5743 -10564 -11459 -19314
20071 -19314 3590 11396 -16676 -21747 -11709 -14420 -3859 -22253 -44438 -35355 -15027 -12837 6343
20058 6343 15946 22913 -8913 -22410 -10935 5802 725 4532 21310 11206 -7114 11245 14890
20045 14890 13920 23952 25764 8698 30117 42734 27873 2416 -28486 -25549 -11764 22226
20033 22226 17632 -1671 -29797 -9015 17603 2901 -12403 -37415 -50547 -39579 -31411 14789
20021 14789 41525 30475 7764 1665 8134 10430 -2822 -18905 -23568 5883 9597 3650 -2036
20008 -2036 -8289 7990 5811 -1506 2800 12530 -559 13484 11317 16437 25059 17936 14845 -2040
19994 -2040 -32426 -24471 15576 29160 14483 4987 -9957 -21832 -31128 -40908 -29562 -22603 -30872
19981 -30872 -20149 -41276 -59228 -48864 -13078 -3196 -34721 -49653 -21804 18502 44410 46701
19969 46701 25622 25332 17480 -2358 5934 27065 30497 35226 48490 57259 44587 21091 613
19956 613 4437 -13156 -9787 11287 12452 -320 -860 10513 5717 9806 6685 9868 21343 29582
19942 29582 35018 21100 16592 15585 5108 -2880 -9592 2189 -24461 -38513 -23630 -9193 -24514
19929 -24514 -6965 6597 -11381 -38784 -48104 -31336 -26537 -58741 -49401 -27561 -24767 -41918
19917 -41918 -55395 -43215 -24564 -2776 -4886 -15088 -9489 -21795 -31623 -45053 -43803 -32155
19905 -32155 -2763 -14561 -21077 -24745 -39337 -35837 -33869 -31582 -22976 -22584 17345 17399 -4447 -5673
19891 -5673 20126 21795 5683 3450 -1542 -8615 -23569 -7566 -5706 -23054 -43131 -48236 -45058
19878 -45058 -24489 -10499 -19994 -20590 -12390 -22140 -17928 4392 18930 7984 23173 25374 32078
19865 32078 20193 19521 21061 -6087 -17845 -12829 -17728 -15018 -2319 5372 9470 663 -13178
19852 -13178 -5278 5552 3033 -14342 -17522 12147 11169 13841 21745 6578 -10790 -10445 16368
19839 16368 14488 34111 32399 13377 4594 -1500 -5951 -6138 -8517 15279 6200 4558 -9601 786
19825 786 18091 33878 30840 70 -25820 -18663 -11023 -18111 -49773 -56463 -41480 -22773 -5102
19812 -5102 -12943 -23602 -36783 -37724 -37325 -30575 -21492 2995 17759 19751 36563 48816 52108 44262
19798 44262 5592 1193 -25354 -4892 2437 -1823 3814 3284 -5268 7021 11721 5975 9189 18623
19784 18623 22820 39270 49078 24922 10330 3560 3670 -4434 8306 20300 9742 7704 10330
19771 10330 3627 8828 4740 -11317 -17292 -12021 -12712 -27602 -19601 -25004 -22423 18605 36176 12663
19757 12663 8049 -19999 -13248 21895 36756 11343 -17579 -2062 41491 42852 -5926 -23593
19745 -23593 -7343 -3610 2019 9097 7474 27838 15935 -5420 12101 17316 -11340 -22990 -25867
19732 -25867 -8151 8416 857 67 -7665 -5902 -13371 -21556 -13746 -23211 -21332 -31237 -28311 -12637
19718 -12637 -6927 -10652 -10190 -1488 8878 21711 15747 23943 22837 11950 -6712 -138 11026
19705 11026 13871 28321 21074 -7845 -4151 11156 6167 741 12409 21284 855 5866 5981
19692 5981 -2941 -11875 -14677 -15670 -16392 -12320 -25460 -16397 -29864 -18491 -14707 -4211 13354 46524
19678 46524 89622 76307 47423 20587 -18975 -39600 -41237 -48442 -32344 -15854 -31931 -23658
19666 -23658 -4887 -16130 -13595 -400 -807 -991 -6328 -24311 -27897 -1010 9723 1951 -11262
19653 -11262 3939 1581 28414 17940 2773 -14948 5749 20299 13168 9032 -8221 -29492
19641 -29492 -24816 -22597 -16076 -8735 5381 5061 -19733 -10988 -15028 2581 13130 3107 -5669
19628 -5669 2575 18694 -176 -12106 -39207 -24665 18351 18085 -2507 -5107 -3229 -901 -23478
19615 -23478 -46489 -60097 -56328 -26103 8187 17468 7815 15707 -289 -15690 -15067 -4477 -10641
19602 -10641 -3808 4089 8077 9861 10604 14743 -5903 -19274 182 -3853 -6534 18621 20321 15390
19588 15390 16417 -3944 464 -3760 -19359 -13348 9583 17402 6619 -12545 -6557 -29266 -11386
19575 -11386 8673 -9322 -19849 8521 23515 7576 347 -17154 -47822 -43467 -38931 -20501
19563 -20501 -6540 -1561 -11236 -5197 3573 -2963 9293 31941 27818 7484 -26406 -51079 -10220
19550 -10220 9459 17177 22984 20462 7720 -6092 17023 18898 32889 37714 12928 797 6394
19537 6394 14140 32464 27852 22973 20301 17023 -6324 -19908 -13912 -8279 -6463 -14244 -26806 -32805
19523 -32805 -27226 -37947 -24419 -16589 -10171 -21107 -40575 -37603 -30088 -28585 -9885 -9980 -1551 16546
19509 16546 19480 33877 52613 49720 38260 24206 7768 8318 -4624 15334 29752 25654 21777
19496 21777 32240 27453 13202 1920 17121 -1189 926 11698 11506 5411 1749 -13402 -17859
19483 -17859 -25172 -36750 -33981 -35718 -46254 -44769 -49474 -45396 -13183 11051 7097 31482 36967
19470 36967 33186 41974 40681 1521 -21099 -27617 -27224 -12086 34262 65131 41244 15208 -5600
19457 -5600 -23172 -44764 -53151 -44793 -32047 -25323 -11912 -2219 830 14346 -7440 11535 9961
19444 9961 -5474 -19854 -22339 -36783 -43630 -38226 -15752 5732 23143 4578 -15196 -33055
19432 -33055 -5323 4442 -20840 -33018 -23565 -4800 10249 -7249 -15779 -43401 -31015 -7328
19420 -7328 8655 20151 30981 12588 316 -956 171 11451 4922 10969 17901 23500 23000
19407 23000 8287 52 -2730 7780 -11928 -22272 -6805 2360 -2653 -347 -784 1275 16450
19394 16450 19270 8373 8346 -1511 -22683 -41809 -35356 -11607 -19718 -40123 -27931 -6056 -23265
19381 -23265 -2254 15322 16923 -8651 561 2288 17141 30527 30869 11256 7896 8872 27783
19368 27783 25712 -4657 -5977 9865 15111 28446 42651 45700 46522 14962 6337 1860 2966
19355 2966 -15211 -9812 3294 -7329 16914 18179 10658 8861 275 9181 4419 3381 -8241
19342 -8241 14192 1541 17664 6004 -10006 -9067 -15457 -1054 14577 40717 36965 1201 -16362
19329 -16362 9266 7897 9439 -257 -4358 -1828 1482 7579 -8216 -12741 -18737 -5055 -7088 -37300
19315 -37300 -32580 -19270 3260 22456 14568 3833 -3777 -11210 8852 20321 -5941 -19709
19303 -19709 -7412 8234 21371 3416 -14411 341 -2747 -3495 3561 -3579 -21024 -18852 -5551
19290 -5551 2396 -3895 4312 10077 6627 -15367 -22790 -21674 -6597 6716 97 4195 23707 21099
19276 21099 27613 28897 28584 42683 27916 6337 2932 21285 24592 37521 31799 6937 817
19263 817 -3417 -8282 -383 -18959 -11665 7771 10935 2039 6446 20005 14209 -1332 1645 13998
19249 13998 10213 -5076 7726 23186 29774 46475 57246 51679 27628 28717 12078 -16353
19237 -16353 -12864 -5737 -8642 16815 21378 -3991 5432 6484 6916 31983 34820 21223 12225 3759
19223 3759 4164 8459 44193 58570 57276 34861 32918 22868 23112 13840 -14790 -27270 -7451
19210 -7451 993 10209 14800 36717 35627 15719 -4221 16662 33998 28525 22124 20864 33601
19197 33601 44202 13952 -15807 -1159 25011 35895 31538 29807 24653 19998 28078 33127 10133
19184 10133 6324 15013 34205 35128 8449 22908 27246 29647 30038 29294 21303 7696 6824 22406
19170 22406 21805 12603 6052 -3427 7673 5512 14071 13800 22705 38083 34880 11697 25728 31564
19156 31564 46576 51546 27437 50310 51835 31381 17435 27106 29293 26557 21181 -10803 -32654
19143 -32654 -5647 33759 44495 43725 27612 4881 -17335 -34591 -19799 -2510 16152 25192
19131 25192 22140 8159 8726 1396 10846 6731 3990 11496 38156 42145 18555 18335 26078 24625
19117 24625 34061 19064 3972 -7253 -45 -2303 62 12178 13610 -1787 -23121 -4373 33149
19104 33149 41872 62982 60450 48397 38628 11665 15082 10975 11853 7489 15757 46141 96172
19091 96172 123224 129964 132100 146256 146970 149472 176005 184784 153882 126886 110887 116438 119665
19078 119665 126420 130214 141937 127192 85653 55643 50152 50845 47786 32398 34511 36817 34014
19065 34014 31677 34106 20497 2474 9049 19255 25976 25730 26849 16028 -14666 -17383 -5449
19052 -5449 -11207 8765 28093 32426 27505 27206 33315 45497 76897 93829 104813 134248 127924
19039 127924 135498 175363 171784 185600 207012 226145 242323 236364 228710 205260 182328 155920
19027 155920 151330 139888 120843 98288 87382 73708 43780 35644 17597 12103 31973 59901
19015 59901 57065 43758 29067 22289 48653 52123 50803 52357 78104 126479 124872 71232 48806
19002 48806 57625 71965 65880 74538 78279 75914 92453 101773 100580 119920 117691 102186 73863
18989 73863 73326 87553 78331 44157 44298 30901 37878 20157 6632 24555 31679 27529 21847
18976 21847 47116 31808 22830 38356 43670 34746 33543 38889 52869 49331 70174 69464 96239
18963 96239 111210 121878 129430 161830 195618 200080 200602 198769 210311 189138 166889 164463 167588
18950 167588 202625 202966 195682 192882 181834 176943 143457 101545 74188 97164 85603 68166
18938 68166 73610 94965 96375 67306 57458 66675 63430 72223 81321 79684 71176 74119 97981 89406
18924 89406 59179 42181 38559 26961 44751 37073 23523 19849 14659 3568 6478 12526 22517
18911 22517 54966 74517 111306 129837 126462 98397 103284 100355 125716 135247 140560 155215 142625
18898 142625 117282 100904 93036 88211 54986 19802 28584 9901 13018 12959 4431 23947 56261
18885 56261 73080 79915 54412 49340 51920 34315 20218 30123 48140 76009 66539 52370 50928
18872 50928 36331 40317 51442 58424 34550 22452 18983 11515 22352 47663 20192 12517 45623
18859 45623 46510 31850 11237 14614 34250 49828 54732 62366 52800 41449 38251 59908 75789
18846 75789 70954 36082 1041 24466 25311 15449 15087 26130 42420 55463 65581 69861 49019
18833 49019 45935 66557 64329 73001 75956 74360 101456 117199 150285 149805 126187 103778 91103
18820 91103 103961 114819 141511 157159 187717 197433 187997 153243 109259 90274 73761 79838
18808 79838 116357 122398 119394 119372 102689 96142 89976 98545 84405 77612 75249 83818 91323 96181
18794 96181 87650 65232 51154 42783 79689 86550 77205 95683 109017 94499 118305 149314
18782 149314 158413 191630 212579 232224 238326 232713 232675 245503 256509 254440 250875 279665 304290
18769 304290 348740 403416 491285 559877 507350 415814 312082 230090 179636 144408 111217
18758 111217 90553 63873 74218 101592 115385 128329 114058 98214 110521 108675 106355 75386
18746 75386 85146 83849 38445 34400 35547 61938 89435 99690 110391 137993 164078 167486 156661
18733 156661 164767 166740 164511 150056 132826 131556 149823 161607 164741 179492 209730 211972 211355
18720 211355 187356 163375 145328 131879 116738 96226 82729 96382 134362 144536 151263 156204
18708 156204 138829 132917 133036 144459 165894 178030 178674 163518 162134 176236 178076 155932 155175
18695 155175 160943 162503 168513 151931 123713 118226 124599 152963 143805 131528 136844 144969 165289
18682 165289 158009 119294 102681 98176 84343 90533 100294 125094 138682 128859 140772 145680 145633
18669 145633 164835 167573 178680 185831 187664 197693 211811 203696 178605 198959 207571 207826 219182
18656 219182 197671 174060 157782 166475 183403 196635 184863 189712 178941 175590 157956 139389
18644 139389 163319 196162 197004 204112 211575 203029 221756 208957 215333 221593 236974 250804 226993
18631 226993 198738 188316 215406 223521 229077 252612 267280 288171 319559 332847 345910 375800
18619 375800 430425 465420 509537 528058 545601 586826 620470 663919 692352 731335 772545
18608 772545 828454 910286 1017574 1146903 1292987 1478985 1770888 2218946 2953695 4017771
18598 4017771 5393390 6921293 8717946 10869539 12734013 13641485 14306074 14939668 15039581
18589 15039581 14684640 14562833 14680451 15072649 16091791 17350481 17701508 17504788 17345493
18580 17345493 16530442 14581819 12368017 10225617 8256468 6510989 5107014 4061207
18572 4061207 3373384 2970559 2719402 2552321 2440282 2376838 2335646 2275551 2212054 2198826
18562 2198826 2224002 2282572 2370399 2482727 2645665 2853885 3150091 3571365 4155004 5017636
18552 5017636 6387947 8527717 11544105 15042348 18865800 23646722 28927745 32480832
18544 32480832 34178778 35780964 37118856 36714108 35456748 34786835 34432352 34945858 36856634
18535 36856634 38402878 37925269 37270881 36625607 34153772 29623447 24878890 20385410
18527 20385410 16233542 12600173 9706353 7562205 6120260 5157138 4486155 4004150
18519 4004150 3649353 3407197 3222874 3034714 2840162 2697228 2552976 2419018 2350917 2339311
18509 2339311 2359910 2377487 2382239 2389694 2408711 2489506 2700534 3072267 3674906 4701236 6472469
18498 6472469 9382747 13551209 18182649 21658933 22118611 19874914 16399083 13393810
18490 13393810 11986744 12598499 15260398 19109300 22530752 23355323 20979012 16762077
18482 16762077 12218496 8608244 6149637 4633404 3733664 3158343 2788953 2577951 2445827
18473 2445827 2357165 2285931 2210880 2117073 1995036 1893232 1846992 1891276 1987166 2131893 2304626
18462 2304626 2452326 2547362 2648942 2822423 3158521 3693676 4507264 5790495 7881180
18453 7881180 11260654 16322088 22733744 29141935 33274161 33459317 30938577 26916612
18445 26916612 23277728 21398581 22075488 25300515 29871536 33724382 34466146 32110485
18437 32110485 27548219 21929762 16579131 12117523 8801039 6545297 5060967 4124552
18429 4124552 3509491 3099600 2817768 2622364 2441766 2260826 2089044 1937868 1829534
18420 1829534 1780685 1796529 1831359 1841951 1835685 1826549 1787379 1760201 1778629 1869608 2001490
18409 2001490 2200864 2468700 2909415 3633263 4839443 6847415 9803210 13143605 15848491
18400 15848491 16449834 14959055 12400805 9943607 8547900 8510960 9950587 12511130
18392 12511130 15222510 16856554 16171481 13744809 10477931 7453721 5208343 3714500
18384 3714500 2779561 2207535 1845515 1596163 1427811 1308942 1213120 1107518 1004796 915704
18374 915704 866047 853546 853616 850627 905451 947156 915917 832069 741856 670279 653454 656459
18362 656459 680661 735525 722667 666628 588007 541586 524933 511332 526028 514587 484586
18351 484586 477693 479634 467404 479768 483344 478484 482378 477300 518327 554176 579478 591443 620410
18338 620410 654473 653945 641356 621990 607505 624324 688667 770964 842689 880936 933339 1021829
18326 1021829 1127125 1246456 1407591 1636226 2021745 2579965 3502818 4978051 7203747
18317 7203747 10146797 13286984 16196795 18035001 17722995 16166777 13884977 11632726
18309 11632726 10257720 10102233 11211455 13091618 15158213 16947709 17068313 15551826
18301 15551826 13283510 10433121 7813914 5726879 4276610 3398139 2869096 2555185
18293 2555185 2325977 2159305 2042716 1942627 1866232 1771309 1710959 1717113 1736774 1775274 1840243
18282 1840243 1943426 2040745 2153153 2291439 2500260 2816085 3293101 4039285 5142609
18273 5142609 6869600 9557468 13386627 18349115 23933672 28618748 31832027 32703063
18265 32703063 30522410 27222764 23676944 21185842 20692203 22275242 25385747 28649759
18257 28649759 30984706 31493947 28853476 24712953 19836302 14976502 11048396 8122444
18249 8122444 6148773 4893216 4090561 3554384 3170083 2872972 2586910 2319158 2110542
18240 2110542 1939544 1837756 1787788 1775356 1792592 1811949 1803434 1806508 1829029 1863042 1962223
18229 1962223 2162993 2500780 3088502 4097778 5711820 8085858 11007175 14003098 16585773
18220 16585773 17462479 16528538 14634249 12317425 10589517 9961090 10636750 12279652 14220382
18211 14220382 16034470 16552504 15256030 13072726 10248521 7571958 5457243 3981950
18203 3981950 3057544 2453764 2024947 1724929 1517255 1374016 1258138 1158839 1075084 1004095
18193 1004095 944668 901112 910185 930183 1023308 1122985 1169901 1162950 1063610 909806 760744
18182 760744 627666 531760 451015 395690 360396 341276 352197 325326 300080 306453 293791
18171 293791 304178 319441 330522 328475 317508 315110 323344 325749 314075 308488 306276 321744 344396
18158 344396 359187 367584 360897 323124 299248 300689 325775 340574 300003 262830 268621 290203
18146 290203 309249 351674 375766 386085 400565 380594 384375 383306 370074 381148 405250 420089
18134 420089 446105 443110 445621 460140 475126 508680 518728 537473 582576 642891 693877 758802
18122 758802 862439 994541 1134439 1315248 1573547 1880987 2303085 2896617 3816886 5289382
18112 5289382 8048067 13687117 24407002 42005703 57928350 51253214 37916748 23596850
18104 23596850 13429180 8351624 5723526 4290014 3405674 2821812 2430929 2185457
18096 2185457 2048522 1934065 1836967 1752425 1705849 1705932 1716265 1743816 1793088 1847463 1920871
18085 1920871 2033284 2177506 2369813 2589881 2878132 3290643 3901825 4874104 6458019
18076 6458019 9036745 13050078 18614442 24985658 30686969 34404721 36660285 37719503
18068 37719503 37158023 34678360 32009925 30817416 31868137 34073843 35559889 36018106
18060 36018106 35676147 34205279 30631050 25169949 19168293 13865104 9964721 7390822
18052 7390822 5820348 4838666 4187384 3739358 3359434 3051392 2837557 2679687 2542855
18043 2542855 2402310 2270585 2167274 2104971 2075037 2058046 2063290 2091370 2160723 2254651 2386871
18032 2386871 2619010 3011446 3689393 4790241 6627755 9490247 13424130 17894761 21827792
18023 21827792 24414248 25794182 25841437 24235024 21691832 19567516 18966488 20071248
18015 20071248 22002495 23388906 23889847 23515776 21944081 18807904 14863289 10924198
18007 10924198 7768908 5571916 4178971 3315256 2754639 2374138 2082865 1827899 1618439
17998 1618439 1443093 1305725 1194297 1085661 975504 898617 848629 767573 695355 636607
17988 636607 583460 541968 494925 480473 475952 456773 428589 403970 349983 321463 287160 286010
17976 286010 293021 321564 365321 388243 391195 360297 304747 258433 243064 204775 201489 207813
17964 207813 201577 179620 201838 237565 257837 244043 210643 184447 148927 121726 123359 120385
17952 120385 122370 132547 121555 129345 133767 149354 157507 142260 139302 145515 152598 151079 176498
17939 176498 201708 206216 226660 256710 272740 277037 255830 221377 206098 189973 187131 186262
17927 186262 177153 177508 166471 172905 178950 154893 116743 95137 69547 53646 60003 52340 66700
17914 66700 81305 69476 61049 50766 53999 49871 39148 38059 32425 27438 38966 47239 51805
17901 51805 51337 56058 22131 22177 57662 71544 62539 42882 55876 71833 59366 62648 113091
17888 113091 128945 110535 112424 74857 58540 46001 44830 54195 72552 86449 82911 72216
17876 72216 50188 19639 -7386 -15541 -21154 14191 6470 8833 12865 1008 17065 295 -23465
17863 -23465 -10824 -5487 3711 -8158 -12792 15904 24065 14466 7271 15532 10066 -9676 -14103
17850 -14103 12282 42491 28119 -2353 -8095 4553 -530 -10643 -18841 -24687 -15285 -660 21563
17837 21563 44693 31949 10722 -2988 8959 -3235 -7127 -16477 -14149 -24179 -14335 6747
17825 6747 20788 14421 10993 11685 7591 19171 19713 -2776 -21946 -26587 -34607 -11528 22291 13237
17811 13237 24359 14997 8036 22801 31884 44835 55030 51887 26443 14351 17560 54879 53386
17798 53386 42454 54586 56641 53938 61054 49769 74140 80430 85686 95300 89556 90700 108403
17785 108403 114316 116565 73836 45452 23199 21299 34495 37117 25679 6351 -11593 -18739
17773 -18739 -15191 -20821 -14713 -8714 -30309 -30865 -30457 -24589 -3574 -1657 2624 11613 16495 5312
17759 5312 -4589 23711 10596 32529 78199 82918 85929 105651 128205 133590 126127 120402 91176
17746 91176 45566 28574 58709 81495 90570 95213 81089 81957 81770 84687 97071 86437 34330
17733 34330 15519 17863 7341 17854 20898 11142 16329 20629 21028 14621 27136 398 1050 25594
17719 25594 47088 37038 21307 32482 28974 30844 16983 8282 -14656 -50471 -12674 40048
17707 40048 66043 81713 79457 64844 52403 28962 16265 11781 46 -11355 4735 30422
17695 30422 48933 40850 28487 36214 47297 22454 12929 4803 12398 20519 14508 16142 -641
17682 -641 3792 -7251 -4622 -17141 -16139 2782 8796 3623 6716 -7782 -4864 -16912 -7168 -4695
17668 -4695 -20637 -26032 -16510 -21816 -14483 -463 24553 19895 -10107 -45184 -47891 -41548 -15054
17655 -15054 -16028 -31865 -22133 2941 11833 225 -6468 -17406 -17765 -19692 -30978 -31456 -20527 -1661
17641 -1661 -4214 -14527 -13672 -6123 1863 10834 28942 6129 2807 424 -14592 -9362 6363 -4895
17627 -4895 -21946 -10885 -16835 -39094 -70133 -74812 -67394 -40650 -39520 -24939 -6680 26705 22349
17614 22349 2252 -17496 -25425 -13657 -6637 15729 16911 8706 -9495 -31892 -25500 -25339 -37666
17601 -37666 -58596 -51276 -15592 -21665 -35126 -34234 2857 7749 4429 1893 5956 14343 22128 12490
17587 12490 -15527 -18315 -10812 -30702 -51811 -37509 -10655 5426 35053 31908 17971 8307
17575 8307 -2401 -5157 -8308 -11760 -22553 -15388 -24120 854 48261 68502 85812 111102 135454
17562 135454 138985 151135 152898 140105 148187 150807 160247 159391 159268 150644 171928 162020 96155 47719
17548 47719 36503 37041 30435 14774 16663 11963 -24346 -20146 -2422 21420 13695 3750 13295
17535 13295 14476 11113 27915 23306 20090 8071 -22353 -13873 -12584 3151 20967 24770 34778
17522 34778 46908 35471 37439 64576 103179 145369 172842 180236 169937 138235 130591 107356
17510 107356 95016 110395 131406 170008 192541 199821 190384 189721 188138 205478 247486 296801
17498 296801 366297 422102 428747 438389 470574 478633 444446 380426 322542 280065 214594 163777
17486 163777 115668 81964 57249 63644 81918 71985 57623 52288 21696 1916 6507 7022 30097
17473 30097 32075 22576 8713 13024 64 -5548 9134 -4865 -22576 -46867 -54716 -27299 -3556
17460 -3556 4059 -12405 -14208 -21678 -5432 447 -4220 229 -6747 -13013 -4692 -5473 27707 47256
17446 47256 28200 34975 95302 182470 307562 314512 234226 155356 94227 34383 19566 25729
17434 25729 16770 1698 -24812 -20109 -10904 11154 25794 36854 28728 16556 24869 35037 10539
17421 10539 -17689 -13106 7229 8579 -3558 -9051 -19479 -25544 -6341 -5096 42 -30070 -43744
17408 -43744 -909 31155 18978 9828 28737 47898 28843 17447 8966 -18147 -19647 -20569 -35412
17395 -35412 -59618 -36210 -20732 2114 14551 19887 -9848 -5406 -4224 -10705 -4979 -15632 -26447
17382 -26447 -16263 -27598 -798 5678 1746 3965 14874 22749 -1673 -22057 -20969 -39830 -58740
17369 -58740 -58689 -67430 -48383 -30006 -29075 -18913 -8707 -6931 -1792 -7424 -27151 -12690 -30846
17356 -30846 -27437 5835 4789 2327 -13066 -19855 -14076 -27 -1324 13590 16658 31162 26503
17343 26503 15757 -1929 -7395 -10921 -25595 -16809 -45739 -44003 -39725 -12810 -13678 -2706 -3269
17330 -3269 -18901 -35168 -39469 -53420 -68398 -64757 -63782 -63719 -44940 -23529 -20039 -34953 -27785 -29623
17316 -29623 -46572 -57915 -42325 5594 17786 16871 27964 26128 -15942 -25092 -5932 -11080 -44145
17303 -44145 -53794 -64083 -50525 -16762 240 -25915 -29655 -31541 -9062 -6080 -22893 -28973 -43122
17290 -43122 -22104 -18335 -16170 998 4272 -20901 -25081 4421 -555 -14130 1313 20897 5269
17277 5269 -16510 -24547 -31245 -24372 -22237 -25788 -16370 -14957 -3033 12292 -5563 -22640 457
17264 457 -10082 15 -2210 -1250 -42 -16242 5252 11516 15670 -4690 -23690 -31966 -21084
17251 -21084 -31093 -38658 -21769 -22433 -12787 -1813 4898 -16083 -25012 -21248 -8402 15301 23839
17238 23839 1678 -21343 -19605 -17870 -10468 -8414 10478 29566 11188 -8289 -9227 -5256 10942
17225 10942 7904 -3762 18227 40724 31732 27539 23389 44904 62261 46448 30309 13518
17213 13518 2927 17248 38484 43628 24267 39368 57517 72259 82973 90660 111101 129724
17201 129724 172764 267049 389623 507411 660248 847802 1060914 1218006 1276870 1297288
17191 1297288 1264868 1189876 1051655 870168 691886 515554 381378 280166 228465 181800
17181 181800 132361 101568 132170 129392 106859 89335 88012 66115 66951 82128 60395 38413
17169 38413 50207 27396 9096 21125 20921 18871 22319 26664 8971 13731 22673 22197 24743 24683
17155 24683 46517 15998 6577 24727 24661 7205 -4621 -34169 -55320 -31019 -34806 -39069 -38157
17142 -38157 -35911 -17688 -30021 -22535 -15824 -32272 -33326 -21353 -19764 14761 7681 -17926 -20546
17129 -20546 12379 23058 1410 -14486 -38023 -29045 -12825 -9512 -7126 3987 15557 -902
17117 -902 -7050 -4391 18383 15317 32242 63898 46300 25711 22364 20003 26323 9350 -9046
17104 -9046 -32020 -18616 1547 11638 7501 -6180 818 15043 28563 30962 28229 25378 46525
17091 46525 52634 32593 40067 59304 64979 57264 47536 37691 59692 58144 48997 53408 43255
17078 43255 38908 47186 53251 38908 35006 33846 27629 16184 9370 3496 4597 10968 29111 57669
17064 57669 57617 34639 24443 33647 51383 67871 85014 96730 127987 152707 144087 136586 115345
17051 115345 111464 114596 115489 120254 114620 89332 60210 46710 48158 49345 34460 35936 62243
17038 62243 52308 40756 31800 35760 46657 49427 49347 47394 32136 27634 48712 45872 35195 45630
17024 45630 51822 33752 47039 86210 106118 110853 118563 105542 89768 93283 93074 103571 116358
17011 116358 123089 101627 97808 98635 100872 104173 95568 85809 71983 44947 51339 101613 108710
16998 108710 121112 136848 138157 148696 167127 179765 214745 214082 225876 223851 223510 204843 193332
16985 193332 213495 204549 191729 223497 231389 246039 253629 271581 272904 254596 251792 264447
16973 264447 287632 312658 348450 352741 355403 344042 349388 383541 425485 458959 474801 477219
16961 477219 475055 507174 559798 604634 668939 760329 851245 941458 1082497 1253614 1401704
16950 1401704 1501291 1622693 1762026 1916342 2048846 2198144 2386712 2627568 2984215 3465384
16940 3465384 4033844 4778693 5865344 7475921 9999971 14036880 20237111 28688796
16932 28688796 38323359 48589289 60967482 75038158 85410319 89391196 91108417
16925 91108417 91601103 86892877 76298757 63910287 51691029 40275153 30166767
16918 30166767 21900942 15740729 11542460 8834885 7102301 5958349 5124949 4502678
16910 4502678 4007613 3622456 3307731 3029041 2836546 2692694 2583108 2507961 2445468 2387101
16900 2387101 2299344 2196804 2072030 1923511 1707592 1467822 1265589 1056689 866814 690892
16890 690892 557276 496966 472297 427177 357782 341340 336326 340533 318130 290514 263061 244971
16878 244971 201120 203685 205352 201695 217241 212559 182626 162511 161908 157095 161676 168748 169282 130768
16864 130768 138258 144313 123290 115435 112239 118105 130078 125162 125775 129239 129566 99295 74326 94906
16850 94906 87017 91722 83976 98516 90357 66104 66748 53181 57568 57874 52184 37249 27650 36057
16836 36057 42163 53588 42226 35896 25278 26708 38626 40678 50885 65718 83731 84881 68799
16823 68799 32421 5944 5188 17139 21711 9437 36607 38953 37255 31492 29190 56515 56644
16810 56644 48914 41588 43547 51052 44096 44977 57312 81674 89493 78933 86740 80012 57923 57819
16796 57819 73350 82364 70803 56868 43597 50507 36644 23347 23293 19773 29072 27849 31874
16783 31874 6377 26045 29689 13629 -13024 -27682 -14998 -2626 -5706 -3355 1370 -774 1968
16770 1968 -3483 -1734 8868 11864 10815 3914 1113 -13469 -16368 -8944 -3442 3875 24666 27870
16756 27870 -5053 -39922 -23065 -304 -14384 -17093 -17738 -17795 -12764 -9929 -7560 3748 -25528
16743 -25528 -36576 -18706 -23886 -15825 1729 -17592 -18065 -12850 2269 12242 20820 17326 -4683
16730 -4683 -4910 19073 15878 19511 12676 1589 1165 -12776 -21400 -12676 -5140 1864 -11735 -26876
16716 -26876 -16481 -13723 -4103 -838 -27585 -44144 -18442 1894 9999 -774 1781 3532 289
16703 289 21429 7131 10869 44676 33318 37006 38836 32819 17638 5812 5527 1827 11029 -10926
16689 -10926 -28477 -23498 -24606 -39165 -38146 -48363 -31082 -19182 -42474 -49942 -45451 -17802 -4389
16676 -4389 7674 24702 21998 1287 -14398 -21524 7083 42133 42623 32640 16176 30584 33579
16663 33579 12092 -13607 -18147 -26279 -18148 -3999 -843 -10297 -5369 -19639 -18762 -7513 7963
16650 7963 19468 19888 4157 -9130 -19140 -17438 -22738 -21625 -19684 -584 210 -16600 -21107 -29421
16636 -29421 -26656 -24290 -41033 -49313 -11417 -22868 -26467 -29967 -35193 -1734 29561 32812 34704
16623 34704 43502 35463 7057 13939 15213 8491 -25988 -13673 18034 12232 -8146 -15629 -34644
16610 -34644 -41299 -44545 -43408 -22281 -18577 -10105 11512 8337 -4054 -20527 -11632 5227 692
16597 692 -14979 -23567 -17716 16235 12006 -1978 -13646 -9425 -9516 -1144 11550 7202 2210 3301
16583 3301 -7435 -8229 -8410 -6638 -9485 -6663 23386 29342 6303 -39 -8519 -13553 -1040 16888
16569 16888 35349 37810 9547 -23287 -68409 -73801 -66991 -67282 -71134 -82264 -74605 -46723 -34230
16556 -34230 -51389 -39207 -13589 -21694 -24570 -10137 -7107 -1938 -960 -10924 -15019 -2309 20918
16543 20918 31770 12294 -8528 -44511 -28838 -31239 -32314 -17747 1982 4204 -12002 -29061
16531 -29061 -42047 -34245 -5892 -20473 -13661 14748 35519 20769 5734 -9846 7656 8787
16519 8787 16799 12183 12649 -799 -7268 -8782 -17255 -26886 -36599 -23519 -20573 -10294 -18204 -19133
16505 -19133 -17118 5084 30861 34543 21930 -5317 -28730 -36259 -39286 -33799 -15581 -26935 -46280
16492 -46280 -31984 9718 13955 -6711 -13014 -30245 -18489 1105 9695 6650 8296 7721 24803
16479 24803 36866 19226 -15190 -14342 -19173 -37986 -24017 14449 12999 -3130 13958 29847
16467 29847 30482 19740 34112 3642 -4953 -11279 4629 14513 3354 12105 10067 13757 5458
16454 5458 -1480 -34359 -54709 -51171 -45759 -25425 -22307 -21961 -12160 -6196 -20594 -36546 -43513 -24469
16440 -24469 -26323 -36861 -37986 -36165 -5696 -9941 -35088 -39184 -44788 -27524 -3777 13287 20231
16427 20231 -4010 -29180 -31159 -30672 -47074 -58143 -23553 12300 20532 -500 6967 12700 10339
16414 10339 -2773 6316 12138 -20011 -38991 -24745 -19972 -20498 -25387 -5296 9223 12069 -4231
16401 -4231 -12717 -20950 -19728 -19520 -16919 -5281 -9850 -9390 -17069 -14890 6895 15213 36383 25564
16387 25564 7344 4553 13226 18893 5437 -10232 -13225 -3408 -7035 -17284 -22235 -24848 -20867
16374 -20867 -26207 -28810 -28007 -26950 -21524 -10188 14768 29861 15590 -1989 -5422 -10590 11466
16361 11466 58572 93025 133174 193726 226399 289334 372399 420840 458398 474442 483089 448088
16349 448088 367019 301500 239511 179603 148696 117870 128378 103662 65622 36206 11618
16338 11618 -13109 -14955 2776 -13169 -18561 -20589 -24123 -16477 1609 7951 16577 -11445 -42929
16325 -42929 -42500 -32918 -35672 -32836 -16235 -21356 -16906 713 371 6384 19714 32620 35134 27835
16311 27835 19352 16324 14249 -2687 -26712 -22049 -22211 -11026 -7139 14551 40244 34213 41029
16298 41029 33422 23525 25446 16562 -2614 16810 20345 19878 12626 13804 12011 8168 -20909 -33191
16284 -33191 -40553 -42438 -56784 -70422 -45303 -29908 -14664 -14409 -12663 -35441 -33296 -19514 -26431
16271 -26431 -11735 -17816 -8421 -15987 -31057 -36933 -29267 -22313 -43896 -55438 -36322 -16388 -32706
16258 -32706 -16886 -14448 -33685 -26487 -9647 -16826 -6361 -13699 11101 31191 10750 -17620
16246 -17620 -23066 -17248 7494 24320 5198 16177 23838 37662 25443 7043 -10197 -24360
16234 -24360 -15985 -12732 -11216 -22927 -32137 -24911 -13886 -19092 -30358 -12076 4926 -4884 -4406
16221 -4406 -27551 -13868 11172 8033 -2464 -26233 -50936 -57009 -47440 -49808 -46249 -16050 19824
16208 19824 -4338 -44772 -45086 -36248 -38311 -44922 -40570 -30304 -9109 -17523 -29361 -23230 -25339
16195 -25339 -14614 -21859 -37623 -36674 -26395 4040 28089 13608 11162 -3259 -17432 -11225 15385
16182 15385 22096 15373 4090 2337 672 -14631 -21047 -14669 -18640 -11914 -20249 -8428 6194
16169 6194 15271 6089 2891 2542 -11331 -25486 -44916 -38567 -29630 -35544 -10996 -22073 -50874
16156 -50874 -65418 -52141 -32417 -23040 -9233 8556 969 -859 -17085 -37908 -21071 -16770
16144 -16770 -29598 538 8622 11300 22238 13025 30931 19294 -5506 3663 -22707 -34490
16132 -34490 -22966 -18919 -15767 -5472 -6633 -10715 -20319 19494 57397 41706 41926 19772 -26648
16119 -26648 -45620 -45058 -40506 -25204 -22665 -4239 -14662 -31327 -11713 -3218 -1147 18178 -1845
16106 -1845 -26378 -26162 -15466 -3337 9525 26899 13487 7797 -6422 -7310 -792 41777 40442
16093 40442 4262 -30914 -35408 -12784 -10204 5100 -31409 -38302 -20594 -21541 -12639 -5197 458
16080 458 -6306 -25578 -41358 -53804 -52259 -21924 -10674 -30665 -38842 -52866 -81773 -75846 -48546
16067 -48546 -32962 -3895 -8967 -28264 -43649 -42118 -12479 25763 19915 -6235 -15467 -32605
16055 -32605 -40261 -29177 -7312 -10167 -4288 -3939 -20749 -3516 -1273 -38408 -37986 -38839 -30159 -7949
16041 -7949 -10519 -30435 -23896 -4158 1857 -3053 1117 -30724 -25563 -42024 -25771 -14204 -38304
16028 -38304 -31329 -23272 -17611 -33434 -65865 -63436 -38313 -32321 -5162 8818 -13565 -17184 -26155
16015 -26155 -16401 -26804 -13977 9838 6760 6031 -9677 -49437 -37701 -18285 -17022 -2924 10937
16002 10937 21539 10822 3745 4019 -3597 -8637 -14651 -26871 -25980 -11920 5663 16801 13622
15989 13622 -4790 1318 642 -2406 -333 13605 -14537 -29156 -32481 -37165 -20111 -18926 -25871
15976 -25871 -23381 -4203 -15109 -6362 14126 17943 6747 -19073 -17894 -3367 8508 707 -5880
15963 -5880 -356 -1878 -33563 -23705 -13317 -9766 -2221 -5147 -11489 -15289 -4447 9772 10069 24506
15949 24506 21896 11584 2346 1130 -1830 -22864 -42198 -32610 -18762 -18709 -16341 357 12020
15936 12020 12463 -9260 -44109 -49883 -48366 -47735 -38447 -35460 -35600 -38476 -34840 -16099 -11240 -5589
15922 -5589 -9525 -12739 -10720 -22886 -35943 -36172 -17702 -29163 -36981 -33595 -31422 -18144 -22709 -5649
15908 -5649 -6473 4661 21229 18666 -2547 -19919 -22906 -16928 -36953 -34190 2864 14572 -2947
15895 -2947 -17232 -39449 -42423 -42559 -59095 -48455 -41337 -40108 -11538 -282 -8571 1569 -16725
15882 -16725 -31394 -17741 7206 13039 3431 -30211 -41304 -38906 -14883 -2112 -18771 -9336
15870 -9336 681 -14994 -15221 -5450 -13720 -26734 -26655 -9051 3793 12297 -9312 -42871 -58638
15857 -58638 -61610 -39402 -38782 -26281 -13203 -1079 18888 18184 19820 22315 626 -28668 -64570
15844 -64570 -65560 -44384 -59783 -50576 -32439 -24324 -41103 -44491 -2130 -7098 -12727 7471 9281
15831 9281 644 -4230 -919 -17280 -23251 -9536 -9663 -8436 5240 14278 13641 -12353 -13683 -1394
15817 -1394 -22041 -24151 -20741 -6162 -2224 -24493 -22693 -17013 -13576 -28003 -53362 -54366 -26072
15804 -26072 -3866 9818 16464 13126 10949 27843 23516 8251 -874 1686 -21094 -48563 -41981
15791 -41981 -15931 -13176 -13473 -7002 -3705 1075 8871 6371 1079 -25533 -45213 -26901 -28090 -32339
15777 -32339 -44477 -22635 7145 12855 11589 26788 8464 4229 -2698 17303 5297 11785 9038
15764 9038 -9179 -5332 -31553 -20125 10411 11662 -16478 -22084 -10224 14539 -5478 -26837
15752 -26837 -25549 -18700 -20303 -59579 -91681 -60924 -35379 -12092 9993 3209 -16328 -20486 -18295
15739 -18295 -34465 -50992 -67069 -48365 -35113 -1898 14068 8515 623 -6189 -2951 -16872
15727 -16872 -37653 -23611 -29561 -29492 -33137 -27800 -27556 -46801 -40310 -34963 -41922 -31267 -32937 -18998
15713 -18998 -31674 -37182 -47186 -45592 -28401 -23041 -27136 -41073 -41572 -10037 8006 10116 -19294
15700 -19294 -29508 -17588 -22698 -20133 -15612 -30844 -34417 -13996 -12546 11326 -874 -2729 11614
15687 11614 28186 18475 4907 -28830 -39143 -26876 -19948 -19761 -10949 -12620 -27537 -40917 -26990
15674 -26990 -22665 -8732 -19257 -37709 -36228 -25391 -25880 -6485 -7674 -11689 -15148 7780 -2687
15661 -2687 -29659 -43996 -28283 9949 44468 56793 60966 72533 67901 51482 52464 56180 42811
15648 42811 18683 22652 20249 -1603 1747 4798 -13178 -12046 -14091 -8499 2797 399 -6722
15635 -6722 -35252 -39551 -34502 -24244 -24886 -24255 -11056 -15477 549 7539 376 -718 7601 7960
15621 7960 21906 -44 -33004 -34178 -20630 -28195 -39580 -42168 -28324 -17158 -6267 -408 12145
15608 12145 12111 -15152 -21835 -882 -9301 -7736 -381 -201 -10865 -16365 -22811 -23111 -33822 -26671
15594 -26671 -23569 -34207 -30388 -15507 -27664 -29178 -40398 -48099 -51109 -32924 -24305 -7692 2402
15581 2402 7721 26850 27683 27392 16442 32533 43051 41560 8822 972 -3085 -12529 -8644 14863
15567 14863 16810 29618 8972 -32872 -19459 -6422 -29840 -40571 -54180 -40890 -16911 -14863
15555 -14863 15190 32216 10939 425 6553 -4693 -48005 -78742 -73359 -51810 -49792 -66319
15543 -66319 -67731 -43186 -35202 -49162 -42295 -15588 -8814 -3630 1973 -16488 -5630 -1235 -22618
15530 -22618 -38542 -40606 -32275 -28230 -31924 -12381 -4206 4581 2855 -5251 -3673 -3003 3414 21712
15516 21712 20678 -5655 -9646 -3214 -2256 2564 3968 10829 -3272 -17356 -15838 -9816 3113 17987
15502 17987 2519 -4344 8329 7498 -14188 -33546 -45665 -61137 -54464 -47365 -22995 -3860 -41363
15489 -41363 -42028 -28372 -29701 -27216 -48203 -75496 -58591 -44920 -34868 -11401 -2987 -17269 -15651
15476 -15651 -27270 -26844 -5632 -10703 -14299 -12106 -23856 -12389 -3209 -18825 -32683 -19889 -5995
15463 -5995 -4264 13814 -18144 -42861 -28254 -2962 39940 51157 29952 35095 42894 46886 36032
15450 36032 7980 -1841 -9834 11789 30277 43602 20017 -715 -27948 -20056 -3805 4177
15438 4177 -11742 -14931 -6362 1032 -226 18168 23445 1058 -14904 -10661 -15052 23920 55931
15425 55931 28319 -2965 10942 29848 32781 9678 16438 19373 11178 13665 3812 7679 29281
15412 29281 47518 31208 47188 29420 45106 50465 36101 31361 42524 29642 12962 -12944
15400 -12944 -29535 -17298 -2086 19449 43848 41344 31114 19531 2471 5451 -2802 -17087
15388 -17087 -19962 -2966 6414 24979 38120 36398 32546 21290 18975 31362 36349 35266 41519
15375 41519 37303 14495 541 -11918 -19517 -14557 -4256 -10180 -36303 -11410 2488 6574 22666
15362 22666 31797 32851 17527 16341 22040 26760 13356 18528 -10117 -19497 -3091 10629 24839
15349 24839 22033 8921 5001 11588 36444 42511 3970 -13286 1599 4057 15708 23871 13542
15336 13542 -8232 -13480 -22455 -8072 7423 15192 16482 39740 45336 39461 50651 83727 73818
15323 73818 25759 2571 -4272 -5801 -51 1070 -6795 -16099 -9461 3734 -10669 -16663 -18132
15310 -18132 -2650 2315 23163 60251 71003 57758 54970 38793 34526 35823 41656 39190 46817
15297 46817 47101 43825 24986 5964 4386 2891 -11217 -13120 26801 46005 33522 3383 -7596
15284 -7596 14289 46357 39356 7330 14107 9528 -7142 -20134 -27221 9604 41997 54999 35503
15271 35503 22091 24007 9230 7676 20524 51108 81887 89759 69880 68189 57763 61512 58111
15258 58111 53899 44825 25802 33048 32554 28772 33926 5552 11428 32428 39325 25047 20794 16146
15244 16146 7582 33108 46326 60764 61228 60947 76238 69932 71642 66596 56478 53890 65949
15231 65949 53138 36228 35172 14161 5209 -12145 -27742 -17539 13804 34104 43989 49106
15219 49106 53512 50131 37551 16382 -556 -22680 4107 26847 8284 22303 33329 42276
15207 42276 42626 60041 34355 30224 37581 33273 42504 30214 10394 5712 43673 69879 27590
15194 27590 -8168 -9822 -6810 7672 23401 26137 40569 22480 -16681 -26434 -29817 -10923 1007
15181 1007 16223 51095 64979 48164 42369 32977 -2610 5563 17344 4995 -2115 -169 -6405
15168 -6405 -6890 -7801 -7696 17740 34875 31806 48975 39553 47538 48175 21310 -14099 -36309 -12025
15154 -12025 -5319 -28869 -34391 -13287 76 9854 35644 24954 15238 174 2010 7051 32930
15141 32930 36051 24954 33207 39601 29807 17158 -10668 6965 21457 8251 14230 47116 37871
15128 37871 26348 22774 23491 36440 65091 62216 59085 62409 53978 38656 4765 6353 11848
15115 11848 19560 31326 20227 15887 11968 24819 4974 -18297 -4852 8755 35594 16444
15103 16444 2389 27678 57951 51831 28802 27261 27553 15745 32578 32552 36028 47876 59679
15090 59679 59219 42933 45311 32233 20718 30309 14036 21697 34127 23727 5269 10283 26573
15077 26573 23279 39487 16389 428 -4574 830 10714 36083 24217 20648 23954 10817 23285
15064 23285 -5964 -30442 -9243 7326 23422 12280 8235 18693 12357 -11193 -29093 -8022
15052 -8022 1103 8750 7980 14528 44624 37313 38443 19488 18718 13992 19883 59382 82341 59557
15038 59557 80391 61291 40808 35038 17393 27649 44526 46586 37829 42273 32049 25647 16493
15025 16493 10312 8002 17882 26903 28112 15826 21317 24522 23401 18632 4453 6398 7949 15732
15011 15732 21393 16536 1957 -12479 -15114 -25571 -7290 9608 13465 14841 -2963 -21232 2369
14998 2369 15735 14026 403 -8901 -25167 -13532 25350 32179 21639 7804 -1030 -2946 29199
14985 29199 23818 4531 -519 3843 27572 23665 21469 31934 40520 39609 35265 30776 37568 33960
14971 33960 28331 33251 28767 47746 54970 37297 11200 1475 8967 21575 17055 9354 25064
14958 25064 18104 -5457 -10073 -4626 -4172 -4786 -3417 -434 -27602 -35531 -33222 -22125 -8042 -1959
14944 -1959 -33356 -8467 16088 830 11700 44227 59286 46477 3199 -11431 426 -535
14932 -535 6057 10789 20812 37688 49396 32630 29301 42263 41375 41634 25547 36749 30960 15094
14918 15094 19459 26263 42555 65120 67111 41239 21686 23612 44871 59034 47332 19582
14906 19582 5532 4452 17098 23227 40566 53296 40420 30570 2835 -11798 2663 29093
14894 29093 32120 35069 18174 4789 -2024 6552 18554 38165 62425 46564 15907 20137 33835
14881 33835 28897 26585 32318 35509 26655 4169 14475 27571 28086 41074 59538 47131 10803
14868 10803 -24943 -19365 -5227 11949 20770 12621 6493 14863 23699 29338 38305 31520 19968
14855 19968 7447 1195 -27964 -13416 8620 28711 38852 36667 36848 29400 19426 31153 30412
14842 30412 7551 8732 20178 10088 -20657 -19500 1058 27945 24174 8786 -1393 5073
14830 5073 -840 5449 35639 29420 26305 13693 -11910 -15568 10722 11916 15486 12797 33720
14817 33720 53359 43857 59905 42699 22034 7587 5555 12332 39274 39774 14534 -67 3328
14804 3328 8318 15496 31607 46662 32879 17321 947 -17003 -1898 -6645 3976 15334
14792 15334 21620 29018 44661 50944 48308 28880 10767 20921 38989 27929 6999 -20652
14780 -20652 -23851 -6005 9230 3652 -11498 -2544 -629 -26811 -35488 -35524 -552 603 -15570
14767 -15570 -18199 86 -7897 4700 -2226 -2960 -3374 -3648 30936 48296 39999 43741 46684 43939
14753 43939 23547 17789 22368 16526 6729 20318 62453 78036 59442 24134 -5199 -13502 -1929
14740 -1929 -14127 -29502 -15558 -582 794 9691 9038 30890 36910 23066 27733 33070 15251
14727 15251 19033 14256 -16090 -19393 -24113 -17676 -17135 -9113 1271 -15631 -10111 -2919 22771 26310
14713 26310 -5486 -24648 -25445 -20747 -42157 -66980 -50594 -23647 -9022 7153 8246 -4322
14701 -4322 -1839 17478 17246 12265 33348 50194 18775 -18141 -4664 22057 37622 17840 17392
14688 17392 5076 -9406 2196 13428 18902 4948 -7951 -6866 -16069 -15589 -7951 130 20608
14675 20608 21812 -2427 13981 -2799 -11987 3980 7281 15504 43070 33311 9197 4724 4036
14662 4036 5562 -7165 14887 -3127 -5180 10165 4056 -4213 -24073 -4158 19303 23400 16143
14649 16143 10378 33790 66013 79527 67019 57682 48804 32084 -3990 -23519 -30644 -18054
14637 -18054 -2371 -6835 -3923 9335 2607 5472 21119 42901 27777 14029 21782 33004 19554
14624 19554 8731 -7155 -11780 -7309 655 4975 5623 18487 19651 -6360 -30266 -8793 20258
14611 20258 9784 -2476 -3169 13795 -429 -8071 1085 4469 -740 -3364 22102 8909 -11733
14598 -11733 -10996 4674 -6334 -9241 -4255 6579 10396 -4691 -16278 -3419 -7236 -13076 -17388
14585 -17388 -189 11906 29580 7386 -3010 10217 2799 -5837 -9310 -16829 -37494 -44499 -31393
14572 -31393 -9076 612 -20927 -38512 -32155 -30540 -14748 -7063 -11350 -27615 -28930 -28536 -24085
14559 -24085 -26964 -22583 10879 22616 26302 33897 34027 15843 7915 12864 9001 28882 27857 7167
14545 7167 -17567 5255 -6516 -29896 -24085 -20911 -11157 -12054 -28175 -29738 -6898 13525 -5987
14532 -5987 -12969 -7024 -12426 -11942 -20189 -13816 -1984 4155 15366 18609 9150 -23360 -33559 695
14518 695 11758 2548 14651 2518 -12504 -6451 -23666 -46133 -31212 -21865 -18857 19613 53678
14505 53678 14756 -18699 -12089 42 -13703 -26719 -7657 20314 8844 -18662 -23579 -14228
14493 -14228 -4133 5929 -9144 -16433 -13185 679 26420 33325 33211 20896 14716 8283 19536
14480 19536 20717 -1157 -25041 -43029 -35217 -2795 20525 1361 10072 -8321 -9797 -13771 -9915
14467 -9915 12546 29131 14934 18525 26706 11187 24576 19987 -7571 -21421 -7937 -12601 -20328
14454 -20328 -14323 -26341 -22026 -24894 -19034 -16880 -4109 23701 17832 -5190 -10760 8158 1499
14441 1499 -3828 242 7817 9381 34172 35252 15204 2524 243 -7405 551 9806 -1751 1650
14427 1650 2452 -3020 -13404 -18343 -13582 -15181 -24875 -11710 -12100 -19430 -21234 -13060 -7039 -9980 -21026
14412 -21026 -17343 -14085 -4934 -21481 -18565 -12296 -13279 -2849 -11781 871 5815 -6781 -25801
14399 -25801 -45099 -38091 -16168 9618 21508 -2602 -9623 38 -24728 -48575 -25283 -599
14387 -599 4114 -13423 -20405 -3575 -7977 -19023 -36682 -36883 -29349 -23489 -6705 7621 15865 26660
14373 26660 56797 44197 41919 49098 56496 40520 24274 5448 -10017 -13493 -20553 -22835 -17085
14360 -17085 -10324 -9747 -12124 -14271 -16984 -20720 -26728 -9754 -14564 -19844 -6279 13434 9627 8885
14346 8885 18720 20193 12317 9036 16076 11449 10434 2602 -3422 25992 36995 5912 -10877 -12297
14332 -12297 -12651 -18451 -41566 -50875 -35123 -18007 -1341 -8301 -19146 -12058 -22500 -14829 -6431
14319 -6431 2536 3633 -5824 -4902 -13563 -9786 -14168 -23170 -48104 -47809 -29987 -9502 25857 24604
14305 24604 17235 32953 28082 -16181 -20122 1923 17189 21485 10077 1200 24580 9751 -17514
14292 -17514 -32438 -24368 -33717 -42914 -49638 -41850 -22822 -3155 20056 24974 -5838 -7281 14961
14279 14961 -1266 502 12001 -1893 -6969 -23490 -26234 -48331 -47841 -41208 -19051 -24972 -36486
14266 -36486 -24514 -46620 -60398 -36776 -20400 -37213 -53955 -26188 -361 5949 -7979 -9447
14254 -9447 -29182 -19489 -9979 -1776 -23450 -48683 -31869 -37684 -30062 6773 6627 -548 23547
14241 23547 12733 -6114 22270 1005 -27180 -30388 -19387 10730 5682 22332 9595 5181
14229 5181 1975 -4252 -24969 -38688 -38271 -29712 -23247 -19985 -20963 -21283 -19215 -13422 -21732 -36017 -27237
14214 -27237 -4613 -13399 -33387 -30889 -36598 -15816 -1972 1640 -6828 -2950 7759 -11771 -30786
14201 -30786 -21151 -27808 -30284 -20346 -14418 -34436 -62435 -76900 -46424 -36424 -73806 -66254 -38553
14188 -38553 -154 2095 -2755 -6562 -9033 -10894 -3227 14970 8196 613 785 -9078 -11081 3181
14174 3181 3314 -14609 -19389 -16789 9542 3423 -35002 -35514 -19361 22721 16394 -22562 -30917 -25318
14160 -25318 -51511 -47585 -31782 -14381 -16816 -26688 -32526 -40987 -42115 -17812 -2448 -23648 -33540
14147 -33540 -8285 3976 15241 18619 8833 4582 -5277 -31750 -16056 -1670 2771 7277 -6918
14134 -6918 -2659 -14819 -10202 -10898 -21927 -23021 5739 6415 564 -16367 -35585 -43226 -31993 -17970
14120 -17970 -11972 -16240 -13026 -12812 -6320 -22838 -23894 -15925 3631 8430 15754 3337 -8228 -9904
14106 -9904 -18636 -8193 17266 13524 4982 -1211 -744 -5084 -7600 -25030 -28764 -13898 -1029 19241
14092 19241 19333 8590 -6515 -12601 2147 -12387 -24843 -17154 -26191 -13590 -8537 -4925 11685
14079 11685 12917 27809 27214 33623 41687 21872 -8730 -15688 -13637 7089 -12770 -16876 16619
14066 16619 29305 32435 43301 27525 2102 -3779 -2960 -30754 -25780 -7307 -961 2347 -6022
14053 -6022 10007 -5941 -36946 -34167 -18982 -21812 -23986 -21246 -22136 -6899 3557 38774 49449
14040 49449 49918 50800 32364 18471 12680 -12843 -15645 -21417 -11904 -4033 -17015 -26967 1681 36267
14026 36267 44326 27353 13486 -23569 -36669 -38759 -33816 -23615 -1507 9567 -115 -28042
14014 -28042 -47351 -20896 4208 18734 16789 27951 9392 10009 1314 -6015 -11983 -15636 -18496
14001 -18496 -1816 -12985 -11863 -16928 10980 22857 31206 29621 14211 -4512 -5082 -14088 -4774
13988 -4774 -13397 -26914 -20153 -9692 -1318 5336 19320 12725 -11886 -33879 -51246 -19358 -6493
13975 -6493 13433 4092 -13864 -4253 26490 15851 5058 12133 20294 23933 38008 44982 25600
13962 25600 8642 -121 1370 6439 19433 2049 15018 22111 26268 -224 -6533 -16557 -33987
13949 -33987 -51695 -32482 -7284 -3732 9197 29689 43558 36467 15760 340 -15635 -26389
13937 -26389 -40478 -40955 -21439 11516 7320 9442 31363 32209 13511 4818 13723 3980 -8181
13924 -8181 -14280 12076 24214 7616 7699 -12294 -38271 -28203 -12676 2897 -15058 -36549 -18059
13911 -18059 -3356 -25356 -50564 -35314 -17234 -2049 -6881 -18936 -46595 -38617 -17972 7728
13899 7728 19399 4387 -19416 -15034 -5770 -7952 18384 15952 2036 -7751 1921 -9338 -30406
13886 -30406 -47197 -42259 -40209 -32725 -27401 -27095 32 9262 -12974 -40123 -43597 -44489 -50980 -24159
13872 -24159 6692 58 6375 20231 13016 8002 -5864 646 28756 29901 -3116 -26626 -22757
13859 -22757 -7119 -6533 -7136 4834 3602 -2680 -25293 -42587 -46231 -48640 -55928 -56459 -60249 -46443
13845 -46443 -28609 -24546 -10003 -15596 -24638 -486 4558 2355 5519 30756 49815 29400 3529
13832 3529 -451 -21919 -9307 -14279 -15932 -4422 5687 13004 -3742 1622 17303 8014 -6127
13819 -6127 -16742 -22476 -9851 18265 37436 30406 29147 -2592 -24960 -21324 -3459 6613 225
13806 225 -9885 -1845 9058 14814 4457 4017 -5710 -4665 -7383 -19535 28302 53849 38100
13793 38100 16201 5758 874 -8200 -9249 1185 21062 29774 10551 2800 -4217 -23165 -41841
13780 -41841 -29297 1029 14167 21400 9734 -6212 -2124 -6188 -20527 -19897 -1324 1166 -15691
13767 -15691 -21110 -18016 -10272 -15852 -10800 -21502 -21811 4302 13800 19622 17362 18277 12797 -4101
13753 -4101 -13024 -18945 -5132 22378 29944 28031 30934 10830 13552 6558 5756 4545 -2601 -22669
13739 -22669 -21710 -11689 22549 13828 -13770 -22690 -29889 -16853 -632 1202 8908 16963 34303
13726 34303 29476 26048 25484 42523 69100 80233 73377 70873 65676 45889 36658 30383 18918
13713 18918 40006 46184 16522 -9519 -12212 -12662 -22902 -5729 27730 49444 70009 58542
13701 58542 38870 13603 14913 -8567 11735 29283 19842 9941 -15291 -18885 -15518 -68 1623
13688 1623 11863 31156 32362 21965 24987 18395 43728 35262 15967 -6933 -32824 -19140 -13736
13675 -13736 -17463 -14809 -19606 -24610 -5285 7678 8637 5879 -9375 -27607 -16150 -5615 -16056
13662 -16056 -5288 -1253 -5999 -7518 -125 12472 16795 -671 1725 11824 29 826 -4424
13649 -4424 -1517 21468 36180 43265 49273 25994 10380 -2936 -8768 4371 -4340 -10941 -9306
13636 -9306 -16586 -33415 -27048 -15910 -19510 -14043 -13444 -1512 18824 11359 16694 41297 26270
13623 26270 -8840 -30672 -32423 -25091 -24935 -4763 2798 6533 10371 5565 -15826 -5689 14514
13610 14514 9593 -25093 -29006 -27290 -21728 -35984 -41178 -35937 -6312 -713 -16768 -38300 -26567
13597 -26567 -36910 -25648 -7864 -17296 -3471 -9695 -1244 1912 12222 14589 21752 12311 -2473
13584 -2473 -1756 -13578 -10461 -6001 -23412 -30479 -1108 19544 45655 33990 2094 -62 -342
13571 -342 -4070 -8903 -8644 4165 5361 -4514 2506 22621 34775 21102 19914 16079 8782 12491
13557 12491 5922 -271 10564 25183 55534 60883 51273 48686 20976 -3278 -4187 -6028 -12810
13544 -12810 -30600 -51095 -31514 -2262 -10046 -2293 -17661 -17930 -4904 4936 8248 7971 -12944
13531 -12944 -2622 12372 -620 -29360 -16664 -14791 -21127 -13775 -30674 62 22497 -10114
13519 -10114 -3285 18 14649 8751 26746 40139 19013 -1934 -524 5490 19412 8627 430
13506 430 13 -3113 4796 33250 29666 14463 7033 -291 -25949 -18343 -9743 -21253 -15200 -12781
13492 -12781 -20747 -16171 -11815 14444 5746 -4880 13774 19562 13739 11753 9128 325 -7489 -2292
13478 -2292 9259 17010 14650 15377 31298 51125 38020 221 -6406 24133 21945 19675 14615
13465 14615 -4866 12545 15634 36852 40401 24517 18535 24930 -5569 -31881 3257 24485
13453 24485 25942 18560 -3222 7419 -4541 -13614 -38440 -76487 -56695 -42995 -36613 -32808 -34356
13440 -34356 -41322 -24994 2506 495 14668 -11809 -15052 -21557 12645 14877 5699 12999 2242
13427 2242 -4109 -8204 3110 -82 1167 11971 9678 27029 33230 32514 40727 33574 47616 45650
13413 45650 21343 10213 -6973 -6823 28773 57720 57330 40900 36491 31937 50814 41973 33749
13400 33749 12119 2530 -6097 2577 -6411 -13538 -15987 -28112 -11942 -256 4016 13816 24109
13387 24109 15740 20786 34328 -8762 -24075 -14372 -12359 -9474 8829 19378 5240 -5955 10706
13374 10706 41561 8975 -863 7619 11313 -7412 -14969 -5431 -16751 -2440 12872 12236 7229
13361 7229 12732 -2903 -8763 -29973 -43942 -19315 -6298 3302 -3209 -9387 -8813 -15163 -28362
13348 -28362 -31721 -52658 -34789 -33219 -5908 10383 19397 14913 12508 15559 -3395 -6683 11228
13335 11228 -3361 -25463 -32475 -35416 -8241 17388 18417 11755 16994 10415 10753 6039 20220
13322 20220 2766 -8386 -14302 -24 8501 9871 10208 13008 19703 3538 8782 -6194 -1816
13309 -1816 -23144 -25990 -27288 -34416 -7199 1570 3070 10334 4220 -31311 -31991 -3668 8503 24708
13295 24708 28251 18687 550 -10029 -17510 -7279 10354 1303 -8288 9828 -11330 -21079 -25638
13282 -25638 -20028 -6906 6274 -10981 -17441 2675 387 3429 -14121 -18081 -498 14650 7869
13269 7869 -12196 -274 12724 7044 -11047 -26661 -45679 -48642 11151 35191 26761 -9359
13257 -9359 -8002 -6661 -342 -989 -579 17768 23045 -9438 -5843 22317 18950 9505 -8978 -22527
13243 -22527 -27076 -28289 -28984 -46044 -31009 -21248 -9958 1660 -5632 6860 18089 15191 13200
13230 13200 10857 -2712 -6205 9562 18348 19742 2817 -7153 -4289 3400 5626 10606 31765
13217 31765 28093 27659 18842 8753 21250 28002 29949 35601 44409 49204 37217 13144 -7556
13204 -7556 -7518 7092 18636 26896 -419 -4978 9556 13477 9143 7549 14626 28629 45453 42046
13190 42046 45346 32462 35461 35503 12184 10274 2715 -25168 -29770 -20833 -380 7091 -959 13518
13176 13518 8236 7995 12823 1146 -10165 -21581 -16990 5899 -5908 -12488 -3143 12537 19984
13163 19984 20494 10258 2314 -10728 -6115 -3299 -13348 -21951 -22373 -8969 -6319 -26074 -12625
13150 -12625 10858 32475 46714 44303 3656 -43437 -57720 -58520 -27661 -16171 5023 -315
13138 -315 8060 16443 -5328 -33484 -15049 14121 20225 -18285 -24376 -22255 571 15949 13034
13125 13034 29044 24928 8749 -14941 -18720 -19159 -9332 -852 13604 13721 -7248 -12304 -9743 386
13111 386 -11556 -20932 -25190 -10571 -5858 -9191 -10966 -3414 -2885 4723 975 3435 16271 18983
13097 18983 1741 -4665 -5953 -8634 7369 30194 28260 13076 -13031 -12562 -16337 -12493 -30206
13084 -30206 -33878 -18955 -3907 15438 28014 22921 -7024 -14566 -27796 -37965 -16253 -13757
13072 -13757 -4371 23449 43220 26658 12627 -537 6405 -5085 17491 47595 13265 -4884
13060 -4884 -7650 -4984 -11924 -18456 -7559 -15594 8585 15341 29337 58758 86884 60644 41283
13047 41283 28382 22156 2894 -14727 -6686 17187 33066 57719 58083 46365 27900 24228 39472
13034 39472 56536 58695 33534 62599 76048 104442 112751 72959 74198 90650 99615 94082 70967
13021 70967 72527 90854 89049 79052 50017 45931 52735 64337 38292 17532 -409 17963 52195
13008 52195 41341 16348 -6997 -1335 6290 36365 42836 13510 7154 5150 -12561 -22969 4629
12995 4629 39042 52125 57921 53253 55350 29728 11831 21277 31858 46561 48964 32973 14236
12982 14236 29716 37259 15202 5645 20507 33591 22918 17233 12215 15501 2105 -16163 21397
12969 21397 40008 39426 72677 62666 27374 38016 42982 50355 49697 37934 43333 35150 17022
12956 17022 726 -312 -8362 291 12650 2848 9332 12820 15475 26049 48794 50077 34627
12943 34627 18096 31698 57811 65203 77100 49724 26509 50196 75605 81517 90883 97933
12931 97933 95230 76466 73186 99151 106648 85752 83774 120006 144827 175074 266656 390737
12919 390737 537315 732480 929107 1126162 1321012 1414670 1442170 1449652 1385596 1233102
12909 1233102 1084984 902673 712099 516188 382185 279460 221722 197936 147932 131240
12899 131240 132664 114584 109908 71148 58735 67576 76212 107127 106760 118015 161586 149216 134861
12886 134861 147649 129972 137045 118726 89430 46504 41204 24949 3790 13744 36587 60952
12874 60952 73660 49279 63146 70190 78014 58027 37093 43582 38560 17130 14954 4989 10545
12861 10545 5112 34086 29923 3864 13541 29543 22150 36378 42311 25140 -2297 8178 26746
12848 26746 11536 4841 18410 17934 26117 25096 21281 2381 546 12349 21521 22238 31085 54076
12834 54076 48290 7288 -9166 -10277 -12261 23107 46470 71707 81805 101775 129364 182174
12822 182174 219330 271783 273501 292680 330263 309668 262369 222907 197579 196132 172209 144024
12810 144024 162769 169149 134498 99412 97698 103023 112158 88658 61275 69422 80776 71847 36369
12797 36369 21261 25979 32664 64208 93136 104466 95337 80937 95600 104117 100624 90573 89765
12784 89765 76346 84267 101712 103867 108517 150755 162555 183803 235429 303226 372946 495010
12772 495010 711235 1012954 1474180 2017197 2605566 3284045 3870881 4149844 4293252 4249957
12762 4249957 3810014 3228200 2651973 2062873 1536179 1123237 818193 616706 483076
12753 483076 402323 357862 311576 271825 239870 220425 184749 160788 157107 146287 143755 140460
12741 140460 147915 147423 128749 106164 96679 113101 136966 150764 171309 185976 176959 174679 177183
12728 177183 218031 266472 302213 294354 278070 289767 287046 254385 230163 185861 149983 164451
12716 164451 159236 143988 141833 143462 125393 100801 97246 69802 65750 69109 77050 83992 66559
12703 66559 83696 91239 88443 74940 66978 63832 80149 95170 83493 52859 33938 19149
12691 19149 19622 30926 49350 51196 78873 110761 101087 77299 51423 56008 51793 49174 37735
12678 37735 46497 47449 35790 8900 -8173 -24358 -20430 15857 52646 87462 85382 105296 114089
12665 114089 133287 168963 173646 170205 191680 205871 225132 251976 292622 344575 422638 524370
12653 524370 630090 740871 850369 965929 1047384 1070182 1077268 1044614 931369 794507
12643 794507 667012 525009 394582 304864 251472 230022 216769 189895 184518 184004 173238
12632 173238 178360 161521 166855 163498 134408 135498 178060 193617 165389 155068 151529 130783
12620 130783 123717 119978 132913 144869 134418 121043 117953 115108 115852 103492 89456 109459 125878
12607 125878 143022 161448 187483 239411 267464 302009 345351 394563 412517 390856 410648
12596 410648 410659 384141 346864 325227 313894 313081 287970 256424 229133 213353 204721 177984 142726
12583 142726 142059 125407 153625 167162 189728 200493 210130 216011 217024 218795 220482 257362 270534
12570 270534 272205 266604 301256 336513 351716 364985 383264 391215 387826 387700 411285 424787 442168
12557 442168 460416 447170 429605 464444 492817 527404 579456 668052 772554 870530 906137
12546 906137 909885 859933 823781 782175 708339 655058 625523 590685 551763 514252 515376 493805
12534 493805 489088 524841 557023 576249 581388 569536 584262 599019 633261 661818 706930 756229
12522 756229 773579 792605 821075 864523 905108 941215 984856 1034881 1078449 1128932 1185868
12511 1185868 1261843 1323397 1382278 1445831 1517863 1586578 1667008 1763057 1861704 1946115 2022167
12500 2022167 2125028 2259403 2413012 2595840 2795843 2994951 3265437 3582382 3924604
12491 3924604 4341102 4861299 5520130 6352554 7373411 8701513 10392320 12599532 15522407
12482 15522407 19500154 25231515 33815243 46991685 66892796 94551079 127670041
12475 127670041 164178429 206734426 250350098 276221567 285055158 290495104 284670962
12468 284670962 256238826 217930454 179877506 143113802 108985547 80243060 58072858
12461 58072858 42637304 32447160 25647180 20875281 17378711 14711511 12608213 10935923
12453 10935923 9559972 8414291 7445460 6606269 5879071 5244729 4686692 4213087 3799132
12444 3799132 3447503 3128932 2844624 2611768 2409093 2237069 2079745 1966376 1822933
12435 1822933 1693455 1610557 1520252 1449899 1393091 1309652 1264635 1233831 1197803 1142856 1114858
12424 1114858 1114502 1148100 1214186 1333922 1508309 1739630 2030200 2354551 2724360 3036688
12414 3036688 3149289 3155044 3139629 2974251 2654288 2299955 1974794 1669226 1366874 1121926
12404 1121926 926986 798511 730506 675774 645262 600661 560822 533697 489402 484076 446557
12393 446557 425161 418316 400366 369162 366519 376465 346651 339412 301738 266860 255538 273134
12381 273134 290971 280858 278255 251528 260011 283708 269188 270392 258805 253126 274898 292789
12369 292789 273987 263787 281369 294284 281079 254020 280652 303973 298835 326763 364761 401981
12357 401981 436151 477553 467500 461172 464067 453475 435229 417406 425960 456364 479278 486208
12345 486208 463747 443040 434520 417283 394208 372485 347691 348824 333860 317450 314931 322588
12333 322588 294066 285986 302490 307358 308546 314128 288566 279272 291016 290524 305115 321261 319053
12320 319053 314818 304856 297212 304155 286732 314482 329926 309813 299820 299341 308215 304907 316781
12307 316781 337589 376066 386950 387305 382184 387226 388128 371432 375078 399465 417763 421153 406616
12294 406616 406007 420150 446266 485573 513666 502885 504478 511187 507313 502657 490224 505647 524904
12281 524904 539017 580430 644797 707929 724167 736537 781443 831337 857380 889290 932642
12270 932642 998928 1053824 1094087 1142298 1181335 1204559 1287249 1378754 1423092 1489458 1574900
12259 1574900 1655152 1748868 1852965 1985453 2142280 2306564 2482947 2698509 2970377 3299331
12249 3299331 3727068 4275680 5005062 5917599 7015373 8248361 9598159 11039789 12579618
12240 12579618 14290422 16370455 19148866 23243950 29550602 39313818 53901677 73911742
12232 73911742 98596312 126040005 152973857 175496214 189996967 193965905 186677876
12225 186677876 169272637 144659479 116909916 90064914 67176468 49703070 37409009
12218 37409009 29226936 23887760 20369855 17925641 16058300 14464198 12975538 11507876
12210 11507876 10070438 8715939 7467915 6408998 5518213 4800744 4215488 3722543 3326505
12201 3326505 2994849 2723116 2443721 2221001 2054251 1893928 1761534 1628093 1522634
12192 1522634 1428518 1328682 1253155 1165235 1095264 1041556 998497 963139 922061 875978 814373
12181 814373 758843 730458 709783 675196 632671 617059 598837 572744 556154 554242 543825 524742
12169 524742 495496 474424 472967 478242 460962 466803 457068 422784 409558 401180 388885 382268 397722
12156 397722 379274 339999 314947 312188 301821 293681 299071 304078 282388 255124 235352 220696
12144 220696 194446 173252 172330 161065 144336 156017 167485 167461 154942 163925 157337 176546 191449
12131 191449 185264 143118 123190 167832 197604 223369 220432 188685 132144 141171 149650 164678
12119 164678 175623 170651 160806 182118 186317 165963 146953 161092 155756 190042 185585 170666
12107 170666 159877 185432 183874 180812 206294 207281 186751 171915 157273 159707 145229 135225
12095 135225 141721 165967 177510 163098 149638 151991 146267 120362 116357 124530 111797 117609 116134
12082 116134 112305 121330 124259 121880 113932 112336 94591 79067 74777 50899 27494 26001 44304
12069 44304 54115 68552 47947 14231 19251 37883 52043 39596 50684 64484 58748 54869
12057 54869 69620 88182 81276 82545 84295 82590 57595 49843 57435 48787 41656 27419 37308
12044 37308 73731 89685 81956 89465 93218 83713 78970 103369 100158 102872 138440 206491 248334
12031 248334 272162 319543 415994 536939 685946 844227 1037553 1231586 1405215 1491265
12021 1491265 1512770 1495184 1360529 1177748 999303 813007 662060 525893 397811 316614
12011 316614 245417 214341 213355 196403 163324 130810 102834 93343 122315 110768 97256 68644
11999 68644 41839 46949 55586 42629 36071 21092 4623 1363 -221 14762 38528 44869 38899
11986 38899 32171 50342 67361 88605 72765 67799 55451 54493 57782 59325 59705 52433 35446
11973 35446 34010 20679 36779 43637 26964 24508 36575 75841 96652 95623 117388 117539 88028
11960 88028 101629 116020 93211 55850 28403 25655 2275 36361 59143 70127 57256 49913
11948 49913 71671 96279 139762 192630 220148 267020 363911 431765 433047 381008 337539 296880
11936 296880 234287 177050 137092 93676 86938 63428 62166 66320 68880 89080 88254 78289 67332
11923 67332 52900 41775 22785 23789 18666 -2078 -25359 -35870 -18267 4210 -18776 -8530
11911 -8530 13435 14866 27644 40176 27990 45823 57854 44314 27388 12365 -8104 2763
11899 2763 14710 -6933 7361 2688 -17269 -3547 24350 42375 38172 29580 6832 -14417
11887 -14417 -16171 2870 10060 9843 14866 10043 1579 13989 25236 28461 26819 31836 15447 13161
11873 13161 20105 9604 20405 47480 38532 17890 9230 -1162 7487 21250 25430 12340 2738
11860 2738 1027 8954 15954 28763 29293 35792 53745 10855 -5486 -494 260 -14737 -8038 -13981
11846 -13981 -7257 -8986 -17479 -25191 -31666 -21904 -22867 -8420 16639 8710 -6242 7641 24216
11833 24216 26946 35969 19232 6950 16428 6327 -4532 -3534 18192 25095 28424 43504 25702
11820 25702 22179 25669 50553 60608 54568 62230 79292 103481 138718 122825 126222 180225 239427
11807 239427 315658 444773 562752 699512 836781 960567 1029439 1038127 978112 856825
11797 856825 718822 580426 456024 349700 268153 185637 167026 160427 152563 165113 193485
11786 193485 182735 145393 108433 100077 90028 84404 60183 37440 36790 45854 36917 35146 52007
11773 52007 34953 29712 17605 -16902 -3792 -12207 -14795 -8482 -9476 3631 24055 3201 -15488
11760 -15488 -20444 -18937 -4419 -2290 16400 12863 772 -4639 6497 13271 8545 539 16610
11747 16610 17861 9182 18559 33563 32350 13655 -439 12249 16619 13800 8858 23879 47261
11734 47261 20583 8624 1150 -1671 7271 1999 -16258 -8727 3823 -3547 -11896 -11226 -13897 -25419
11720 -25419 -36378 -26197 -5791 17651 25014 8169 9340 -5301 -14642 -20058 -23099 -25372 -22753
11707 -22753 -6015 10136 -5600 -10244 7725 12583 3524 2135 -10478 -12898 8556 -3816 -20359
11694 -20359 -28361 -11095 -3661 12328 27331 23466 47916 46920 46453 35920 26944 11723 4004
11681 4004 3953 16539 12150 21436 52584 45749 47627 65383 72996 110875 111064 138733 155758 187473
11667 187473 214379 288812 396014 545634 723231 899402 1098152 1308333 1447597 1514027
11657 1514027 1503308 1388791 1236077 1073626 892317 709149 544853 419453 330439 259142
11647 259142 212725 174062 138267 119916 130495 121882 121602 120192 98369 74023 77877 45462
11635 45462 13336 -138 961 -11616 -33036 -14236 16132 -12977 -35709 -23323 -6907 -14516
11623 -14516 -25868 -3671 17815 14324 8224 -4132 -32391 -21493 -2096 -12476 -24340 -3986
11611 -3986 -32547 -39182 -4784 22406 27119 16757 30470 35424 35247 15649 -11687 -29213 -22268
11598 -22268 -23431 -27064 -28799 -11264 -25908 -37302 -5972 -11782 -7374 -1424 12142 21802 6740
11585 6740 11707 11540 -10727 -9230 -16577 -37987 -48069 -60115 -55297 -33193 -22783 7743 12263
11572 12263 30674 47323 50051 39806 36771 25293 14095 23973 36978 29653 12035 16260 11671
11559 11671 22298 9502 -7097 -19239 -27915 -9649 -6903 -25689 -13572 28116 50539 35584
11547 35584 4437 -17743 -29233 -23410 8628 -755 -1069 -11311 -23357 -23408 2238 21268 16325
11534 16325 -14191 -7243 7989 26595 18761 1168 -12201 -21306 -37749 -34225 -35136 -17413 -2701
11521 -2701 -5512 -13908 -3323 5513 -15791 -8973 -8784 -550 -2049 -16951 -20292 -23640 -33147 -31384
11507 -31384 -61122 -74253 -67024 -47156 -27367 -11279 3810 -6546 -11956 964 -14625 -29134
11495 -29134 -22796 -2394 5109 -9606 -30659 -27640 -10437 -3050 -4883 -10896 -18966 -4212 26188
11482 26188 34182 11817 14327 24851 11729 13163 11591 -1794 -19439 -20996 -23464 -4277 11465
11469 11465 13016 11078 7691 -3846 -5247 -5918 -7618 -24247 -34967 -27368 14202 42058 41371 32527
11455 32527 22729 -5720 -29961 -1145 -6846 -30366 -3946 4938 7533 -9560 -37335 -41707 -24461
11442 -24461 -1856 11175 -21362 -37330 -40167 -30496 -5038 -10102 -11112 13964 26187 -888
11430 -888 -29125 -13773 -20512 -3792 9895 6889 -7841 -72 7245 6586 11342 7388 -31729 -37647
11416 -37647 -26335 -29354 -33499 -209 2838 -28935 -36839 -14943 1023 8482 12309 38848 41869
11403 41869 7998 2510 -12983 -23544 -10562 9563 17416 21064 16763 17911 20975 6660 5543
11390 5543 26127 15997 3322 17475 5406 -6187 -30754 -46447 -30203 -21416 -25469 -8983
11378 -8983 12743 10286 1082 -1924 358 -12400 -22411 -18503 15395 29884 31298 12559 -13437
11365 -13437 -16127 -33837 -50347 -21720 -11161 -21094 -5278 16855 21358 10061 3914 15442
11353 15442 13130 -14369 -6719 43596 43775 17402 1840 2067 20120 24222 44129 27536 14820
11340 14820 11914 887 -4510 29634 35842 30477 38343 37356 31597 37724 51508 42347 96 -18803
11326 -18803 -25345 -33450 -14793 3213 -6026 -5989 -18124 -21486 3541 -524 -2564 -31734 -41375 -18763
11312 -18763 -14117 -27483 -33793 -30136 -18696 -572 21836 37066 13572 -11019 -7807 5451
11300 5451 10037 -10882 -15709 -11123 -5467 -22953 -24519 -1045 15449 44399 69183 53943 53096
11287 53096 48728 62658 46718 41675 47559 16699 -16788 -30555 -23875 717 -409 -14352 -10421
11274 -10421 -3514 -13071 -15599 4222 -5291 -12056 613 13602 22489 29243 22423 11822 15377
11261 15377 9519 -10395 -18101 -13669 -11207 -2917 -2441 425 23606 23217 3712 6882 18794 8722
11247 8722 -16224 -51376 -28644 24886 38766 39521 36000 29478 9111 13807 9138 -2734 -8948
11234 -8948 -15580 -11610 -8113 -11494 7551 13736 10790 -4228 -31449 -47147 -33983 -12150 -3734
11221 -3734 -12195 -407 -3459 502 6966 30665 39476 29664 9389 -18120 -33051 -38551 -25161
11208 -25161 -18489 -26910 -15899 -24008 -50613 -39122 -26568 -28318 -27197 -12540 5784 14827 8138
11195 8138 -19038 6513 41272 28574 9511 -17425 -21305 -22942 -34013 -38177 -43250 -45238 -42785
11182 -42785 -12250 20690 5744 -19285 -29903 -18116 -6040 -19779 -22184 -27630 -27029 15118
11170 15118 30048 27917 40144 35938 8942 -8075 -11507 -902 -12162 -28106 -35225 -11190
11158 -11190 12490 5079 2059 -27126 -37511 -14036 -1520 2941 23078 26170 26865 37811 29339
11145 29339 6793 -7654 -3341 1362 -11319 -4055 13736 12662 -9558 -17304 -32520 -55454 -40358
11132 -40358 -23010 -29183 -30383 -22882 -24748 -16980 -3754 -2589 4952 -4927 -12395 -16912 -17873 -19361
11118 -19361 -28218 -30234 -1648 30070 33557 39259 24330 29981 19834 3648 314 -32237 -44595
11105 -44595 -33444 -32693 -23922 -30882 -12991 15101 30257 38509 40609 16830 -8453 -15029 -13875
11092 -13875 -10686 23940 26064 4699 18743 17234 35670 11748 502 -26421 -41175 -54117
11080 -54117 -37072 4313 30473 34609 17302 -14381 -7429 5476 8816 17072 11672 9710 11352
11067 11352 20205 37245 62731 69960 78239 83084 113795 153964 161568 132682 112947 106030 72005
11054 72005 51212 18467 6002 -14180 -22826 -4486 4491 -1489 -2474 -2834 -1022 -8458 9946
11041 9946 28718 21778 24610 24155 32160 43541 66951 65837 78669 113292 153517 153033 155126 149037
11027 149037 166439 146855 139131 119199 87548 69626 57955 60872 54147 50890 38241 4610
11015 4610 15204 27814 40374 21134 1827 -2442 15099 17791 36639 36429 17496 -953 -2005
11002 -2005 -10646 7090 17296 8035 14800 -6995 -11999 -20937 -12584 7656 24730 15153 -17293
10989 -17293 -22860 -7475 11798 24154 14081 10758 31909 50427 28282 6821 20104 13417
10977 13417 -3904 4277 3376 -4357 9041 12626 15805 21928 44108 39373 24030 21492 16748 34582
10963 34582 35164 15885 3971 -10309 -2793 -19735 -11077 -10817 -6103 12920 34075 25785 12370
10950 12370 30339 17552 1904 3671 18245 -9532 -23461 -12681 8579 22729 15610 10960
10938 10960 10614 9582 3464 16703 14446 8229 26612 34154 46476 36631 28249 31923 17089 37761
10924 37761 40083 25048 7367 6154 2800 6088 3555 24179 36720 18429 20056 28064 26445
10911 26445 22591 18106 11628 2382 -2928 27 8217 27545 25181 20184 2382 -8979 8266
10898 8266 23597 53400 45359 25012 -7740 -13479 -18109 7144 4653 -11874 -7684 -1099 -9203
10885 -9203 -15300 -10914 -1148 3575 14084 23270 17392 -7591 -2549 3617 -1785 5521 42645 55698
10871 55698 45474 37205 43066 27194 18254 17212 25320 34080 29066 33029 31442 37819 17405 15839
10857 15839 27770 42898 4177 -10920 -9470 12863 -2075 -20629 -4349 21928 21703 29361
10845 29361 45586 56757 31336 18601 16342 2498 1964 743 10708 8108 11717 39208 65906
10832 65906 40726 22914 24090 38226 44900 52049 41877 28436 24571 30528 30753 28937 40237
10819 40237 38338 26431 37300 40925 41026 14346 8017 5686 9000 23869 36759 27440 21178
10806 21178 15234 18334 17127 38461 35956 42653 54441 29387 38044 41888 46446 26779 187
10793 187 1072 -14058 -8218 -13985 -3791 22450 21131 21752 13706 16133 24111 37557 39930 38042
10779 38042 48183 59998 60021 43635 30350 23841 39554 47207 57782 82246 102296 101371 104339
10766 104339 105627 106727 116950 121569 124956 133805 102569 83616 105801 148465 198916 248069
10754 248069 311376 421672 596417 863525 1334119 1931204 2435162 2553910 2210269 1657829
10744 1657829 1147902 773776 543984 408507 312681 241363 186194 167994 148443 154594 122950
10733 122950 97054 83574 73549 40233 46710 61878 62157 86717 87968 76848 59761 32571
10721 32571 34209 18963 -17594 -8609 6988 22241 12451 12111 25747 31925 24237 27983 28987
10708 28987 61431 59734 65018 59238 40070 22570 18263 6484 4774 -5567 11350 27863 36673
10695 36673 18291 14804 7596 690 -23949 -15548 -7296 5055 27236 20408 8316 2203 5716
10682 5716 8626 3860 -2512 -415 3488 9874 45090 68668 57079 46917 36742 36632 29674 13644
10668 13644 27622 40716 24132 7612 -9854 -11583 -20273 -13874 -19700 -29930 -14922 -171
10656 -171 -10423 697 24758 7147 -3264 22318 37033 48464 60207 58388 64484 65140 58734
10643 58734 52335 23719 28598 42954 24744 27896 6580 -13127 -16506 -10305 -4721 -12937 -4292
10630 -4292 5532 13904 16562 35746 36110 40890 44181 45645 45304 38665 48531 45634 11396 -292
10616 -292 7943 -8318 9925 23986 27741 48016 38470 34625 39318 40627 41394 43540 50656 62426
10602 62426 65426 74758 82381 112560 95690 67472 64255 57126 53915 46257 35783 31021 39779
10589 39779 43047 37974 46744 75321 126798 210664 296277 353210 317728 265460 213398 174259
10577 174259 162785 146790 126367 110007 117100 121283 126325 144037 154943 172138 190379 232785
10565 232785 305376 389618 444243 443721 376552 312735 239557 171569 138109 128374 112699 86240
10553 86240 76918 61256 57903 55261 49145 41341 46562 66709 81430 86016 61788 49248 34645
10540 34645 32366 38232 59141 56946 39191 -3090 -10626 -13259 -27576 -49880 -66344 -61115 -52460
10527 -52460 -22410 15763 54223 76933 99042 98467 104784 135558 125909 90218 78261 87798 67008
10514 67008 81642 123068 100904 105091 130694 145358 171358 200735 260648 327155 458960 702928
10502 702928 939102 990331 863949 711069 574467 533874 572290 606224 597176 549241 482467
10491 482467 416968 379712 384184 356715 304551 284762 243483 210145 187348 167294 168334 172194
10479 172194 174779 192795 180014 163555 139572 128441 135930 135136 145810 152067 146281 132382 146515
10466 146515 165510 172913 171999 175356 191736 220680 270888 344098 456972 553537 641276 609362
10454 609362 515620 442544 352963 309055 291826 260058 242191 218386 193870 182853 185222 185780
10442 185780 184230 197084 186243 194012 215339 237977 251660 267753 270759 245519 214630 221430
10430 221430 233178 246878 270158 275930 279073 284659 284991 302781 329356 340181 344606 354673 377714
10417 377714 397119 418229 428676 423065 427389 431751 405497 375139 361032 339697 327009 339037
10405 339037 371586 392471 410481 415343 437656 444621 466930 486882 502553 526136 530255 547819
10393 547819 582464 602686 612385 643453 651414 643544 647969 645235 641812 649494 686292 725183 792605
10380 792605 896771 954814 975131 997312 1012685 1018701 1054756 1133166 1183307 1200481 1241636
10369 1241636 1305876 1372010 1480849 1610975 1729809 1822693 1904223 1981721 2108105 2229230
10359 2229230 2367377 2514436 2696219 2923010 3159207 3433475 3760060 4127473 4580133
10350 4580133 5121988 5810347 6759606 7850607 8772471 9422884 10091055 11049777 12394241
10341 12394241 14269403 16833793 20281815 24870702 31181269 40259918 53892856 75323847
10333 75323847 110862757 170130613 260797892 371692651 448687922 435663875 357331912
10326 357331912 259895094 175364904 117959809 82436158 60397462 46120666 36449249
10319 36449249 29674535 24801180 21217292 18460193 16273558 14567466 13310390 12473628
10311 12473628 11810707 10928260 9722584 8375629 7156441 6146757 5374972 4773466 4292907
10302 4292907 3902726 3594288 3323618 3083572 2833581 2611214 2439937 2282622 2150021
10293 2150021 2000735 1871906 1789964 1696282 1631061 1581413 1505869 1438687 1376640 1284607 1214853
10282 1214853 1169701 1075132 983932 939096 959914 1016517 1056938 1053873 1022739 986138 929859
10271 929859 859893 761119 688571 661727 668997 674860 644362 631151 584901 547355 533638 544374
10259 544374 546291 496290 469408 461083 468647 473131 450734 427479 397823 373382 346777 329609
10247 329609 317267 265814 239490 231022 243467 245065 246919 228587 221807 228329 238036 251326 274678
10234 274678 285627 258896 253462 255943 249355 231330 233262 255919 273192 262237 214981 186734
10222 186734 212861 227947 223918 250228 267093 280936 288389 261169 237668 229100 231180 218566
10210 218566 195263 190889 204094 260266 318455 352802 401107 436447 416200 387204 333811 280189
10198 280189 221185 200668 225697 237922 248190 253282 230943 206908 188285 184652 181030 199146
10186 199146 174350 144641 126116 123546 155849 155634 133127 103848 108019 111341 115031 127257 125745
10173 125745 108268 65808 49068 72214 82354 82180 98482 111177 106599 87822 90748 114856
10161 114856 115602 120564 120834 121279 107734 102435 82504 80656 98854 115212 100435 106814 99738 97296
10147 97296 111149 117195 101697 101671 112408 118955 108846 80298 59462 51594 62150 56816 64216
10134 64216 86326 115460 131855 127580 128534 132160 135347 128395 116608 136417 139887 117482 110666
10121 110666 131417 152464 128779 109838 93059 96723 96728 111414 85961 59742 60418 47052 22431
10108 22431 6406 -1332 30547 78367 89356 70982 63966 66927 57727 77172 89230 76525
10096 76525 87192 111489 96887 75993 63163 61264 50472 69408 73027 99053 121015 115057
10084 115057 112723 93734 87967 95142 91468 93806 110742 136234 143033 104549 60128 46421 59104
10071 59104 77150 90313 94495 112061 124268 115275 93676 89259 83789 66587 62648 58160 70908
10058 70908 73144 70101 59396 64046 70379 84118 93125 91697 77628 57362 57734 55076 74329
10045 74329 62172 30445 18450 -9586 -19483 12662 24168 4952 -2730 8343 14624 18853
10033 18853 22420 33323 47812 36704 33516 28819 34176 15340 -869 -8018 -12846 -6074 19428
10020 19428 12288 2796 -5708 11151 1420 8305 23477 27595 35269 65469 75969 57466 39595
10007 39595 30442 42872 46468 70096 43101 884 -12740 -3049 18030 39961 51007 41235
9995 41235 27533 17598 31906 19096 11374 13144 12691 20672 39597 54295 77082 81248 52031
9982 52031 33161 26217 23724 15459 33967 53739 78012 68584 55166 43735 37326 33435 63440
9969 63440 62233 45840 48760 58411 50776 48565 69204 120598 116786 138848 171437 169388 158558
9956 158558 184411 227452 264863 293638 306096 298631 323376 366593 434050 542678 671756
9945 671756 852901 1128533 1583984 2306452 3371980 4778989 6138407 6812116 6461017
9936 6461017 5351420 4047142 2872246 2013082 1453913 1110581 870089 687402 575890
9927 575890 483823 434038 374783 344960 351156 344672 317625 304565 283100 267943 234411 201414
9915 201414 211256 229287 239773 290290 327791 414031 524893 662692 933613 1373015 1919089
9904 1919089 2313340 2311742 1963713 1496631 1073506 761146 569904 444731 346801 281855
9894 281855 225648 168839 155551 129002 108147 110067 110442 94313 81055 65976 69888 65780 74368
9881 74368 51302 25470 26406 9538 -1875 11580 20103 40100 66310 58775 53903 73683 59796
9868 59796 44817 37103 37701 33576 40122 56344 60381 43724 33148 18985 12024 26693 23341
9855 23341 5742 23263 47752 39811 63474 83772 61098 59165 23703 64 8224 30539
9843 30539 52656 47158 43525 62274 67757 65712 77964 77497 71920 50949 41676 34103 36419 17229
9829 17229 23152 53822 82708 71467 43521 36713 65575 95532 101210 101417 101749 100016 94392 100633
9815 100633 101257 124828 176041 222856 280552 371184 531222 830122 1294362 2014682 2763456
9804 2763456 3260888 3555870 3529358 3337690 2777800 2039317 1430177 961143 657504 486776
9794 486776 385525 313579 268270 232977 183874 147405 121497 121481 107756 103103 100688 80110
9782 80110 48068 22872 16922 40613 54141 51660 60252 53419 34842 26677 17559 13801 15564
9769 15564 18332 46033 29280 10324 18006 26813 35890 39171 15623 16578 34745 28536 31864 34889
9755 34889 43980 63452 55268 35914 41550 41254 19491 16930 27594 29165 35263 38156 26694 29785
9741 29785 55690 89486 105640 130447 178410 241314 242811 214395 195006 170841 112843 55031
9729 55031 35164 47474 48842 32026 30128 35221 32353 24380 38194 42298 41439 39510 32377 65
9715 65 -26241 -20459 -9514 -12499 -114 25485 13085 -2839 -24076 -26621 3161 1529 -11914
9702 -11914 -24849 -55539 -52632 -40483 -36930 -25317 -34270 708 7849 -1711 9691 21605 27100
9689 27100 12648 26148 21347 -8165 -15920 -465 35349 53460 34788 40731 31044 27935 17310
9676 17310 21868 22399 30036 35049 31639 24229 1283 -29385 -39128 -16645 17451 23300 14973 17576
9662 17576 15902 8640 9115 36952 53080 53281 53581 47294 23810 2124 -18080 -10937 1988 8156
9648 8156 12621 -3448 11665 33814 43281 42193 25598 -499 -3470 6948 6304 -9809 -2754
9635 -2754 430 -13197 13166 20604 10765 -6165 -36378 -22689 -10817 -7578 -6764 -4734 -6961 2115
9621 2115 1005 -19966 -28232 -12758 -4370 -19794 -13677 -6739 6358 12107 -404 -152 1138 -25079
9607 -25079 8848 36079 42600 39058 15210 -1505 5477 29320 40982 46327 40560 9257 -4794
9594 -4794 -7393 -694 -6666 -5396 -1380 4155 23582 29510 10335 20966 32826 47106 24278
9581 24278 20324 23805 9684 9163 2085 -7054 -6613 4379 1064 7408 14862 21567 5055 12623
9567 12623 29694 47796 54341 49438 47878 17506 3276 -14601 -19934 -7423 11531 18494 31673
9554 31673 40490 46441 47513 38627 32925 38963 44507 29700 30951 11295 18478 34830 11486 -1749
9540 -1749 14 836 23538 36439 50366 26868 50091 53846 44056 30979 21606 32362 23601
9527 23601 -7207 -11096 13056 26452 50902 47527 43912 32593 7316 1011 -1738 28375 57264
9514 57264 65873 52148 54235 56965 60863 62529 38709 41496 35802 27362 16840 907 4575 8694
9500 8694 7140 9560 40189 41281 9531 3126 18937 11422 3240 32346 63820 63002 43187 34857
9486 34857 26136 36851 37152 41160 35654 24242 -2015 14543 12771 11488 10931 35114 9278 5036
9472 5036 18113 18233 5405 21062 39433 64145 28238 3365 -3048 -4513 -4528 5891 12260 20399
9458 20399 9893 24749 27861 19343 12807 -8367 7091 9017 1625 -4254 -14156 -2098 520
9445 520 7920 11269 6035 597 21665 67719 78028 34649 31043 62785 74522 42076 13844
9432 13844 1115 19434 13157 6740 21960 28979 39347 34289 12993 2253 -17535 -9814 8004
9419 8004 339 8958 6522 -4841 10801 26968 22087 42289 35596 25544 13589 11755 1210
9406 1210 3295 -5089 14230 27201 15430 1991 14106 25666 32887 25443 30399 50240 56079
9393 56079 39548 40793 33946 31088 23760 3743 -14177 -32525 -25964 -12240 -13228 -19720 4062
9380 4062 21151 6862 16311 22560 4153 -6567 -4894 11581 14323 12169 19842 35534 37212
9367 37212 17186 17868 2028 10765 24992 9802 20969 23318 13201 1737 2282 24063 29747
9354 29747 20889 9668 -5972 17716 31931 10951 -15110 -18395 -22927 -20808 -16178 8215 29896
9341 29896 34485 24937 13444 11394 10582 -17242 -24789 -26720 -18250 -4516 -8579 -16933 -10856 -27571
9327 -27571 -39822 -21265 -2382 100 -14355 22856 52198 29379 24071 33489 38157 26268 12856
9314 12856 34520 38153 31339 11724 31682 55877 59735 62868 60199 59571 34898 12272 893
9301 893 25909 37577 50429 55713 34213 20721 5254 13131 46217 58124 36438 44886 63827
9288 63827 53078 26635 19176 2296 6006 19846 23812 21334 36389 17321 9807 27801 33108
9275 33108 31590 32928 50217 18425 23364 49796 55818 74387 89620 110441 100857 87431 95132
9262 95132 86237 78415 93021 85501 69111 61174 55833 49369 60242 70499 71114 70932 45595 43809
9248 43809 38431 55122 91315 108655 93369 50676 41651 42866 35057 23215 22869 35648 43578
9235 43578 63162 64174 49783 50040 53670 41643 39070 44959 39916 38424 39112 58357 48701 52160
9221 52160 66021 94316 98445 107169 130136 150883 167391 163225 153058 141513 139575 139405 123970
9208 123970 131357 119975 106973 114360 84180 53712 46131 67573 87491 90257 82339 66728 78511
9195 78511 81636 89518 110868 118100 85715 82295 90374 82250 88394 104825 92601 72291 81915
9182 81915 87420 106144 112092 89041 89563 102129 99797 112724 140067 144262 150330 158181 184956
9169 184956 175662 159806 148959 162887 177461 158786 156811 140725 135519 147739 152894 167632
9157 167632 169985 145871 115636 113273 118499 111804 101425 100214 113999 139325 136597 100874 76374
9144 76374 101696 116445 105795 92903 95357 77195 44176 16139 25169 61070 60256 56213 44126
9131 44126 47889 56893 25891 -6752 24401 47854 63153 83515 104058 122504 125008 132210 130014
9118 130014 111019 106206 147771 143245 165633 172479 153628 134865 114472 141659 156819 161498
9106 161498 140272 118890 116702 115900 119488 102008 87024 78363 83455 102089 128888 144478 149793
9093 149793 145502 118341 109291 102649 93138 96287 88255 65826 76514 75564 95877 107118 82951
9080 82951 64808 75302 100493 125640 151058 169593 160716 146497 158384 185548 219251 248061
9068 248061 252895 240850 202179 196959 201189 204434 206047 226839 226620 206868 198081 195841 171895
9055 171895 146530 129495 108524 89396 95329 104066 85215 63519 65775 89654 115997 133114
9043 133114 152524 160877 149861 135538 122269 100414 77346 55679 47222 83306 132375 183626
9031 183626 227431 242477 247004 280688 324106 394661 454025 464971 444082 433145 429572 408658
9019 408658 428899 458855 442710 385567 354040 333627 320353 275379 252559 275018 307820 319660
9007 319660 338874 325431 323191 325737 295060 249966 240824 255900 248839 242306 255862 269206 239551
8994 239551 233531 235740 226366 236651 255300 271099 285611 286813 292051 302902 335300 355429 345754
8981 345754 354359 355519 390491 468293 526188 568405 601835 632210 655566 695226 698585 675027
8969 675027 672435 671477 676366 680293 654297 643330 585141 534242 535857 513406 473246 440590 380592
8956 380592 357562 361904 370488 365666 322568 342847 377701 378186 360006 338724 332229 321256 289636
8943 289636 282069 281606 314921 318231 321242 333637 367277 380011 366298 393460 410983 392340 378250
8930 378250 389990 412509 454902 522317 597797 683498 759205 800792 825431 808429 722617 672132
8918 672132 612929 564971 538646 489472 443294 420474 371194 333160 331742 331536 348245 400236
8906 400236 430806 428110 445219 453320 459868 421741 414557 375133 308266 279633 272005 268736 238055
8893 238055 217292 230813 238069 210277 180639 180606 165800 142982 134113 154070 193511 236138 244492
8880 244492 255666 296684 307130 321707 348133 390199 432754 423824 413283 421040 395500 382124
8868 382124 365905 354881 362388 343417 317643 316637 302049 260515 238326 233409 210106 223004
8856 223004 233448 231898 204980 203584 195514 170121 150254 165395 176819 190117 203711 191697
8844 191697 164375 167575 190340 201247 183216 174514 181825 177926 160895 155260 156362 180104 195522
8831 195522 206804 215418 230046 253538 241327 229585 239087 221947 208330 204954 212972 220049 219224
8818 219224 202891 204949 198620 203801 199110 199162 191335 207767 225158 215803 217158 214367 194974 192587
8804 192587 187313 203318 241143 250108 261016 259621 263218 275247 274656 294835 318610 351120 380800
8791 380800 373282 384661 406010 427996 419930 403623 398090 393852 374290 347946 334222 371344
8779 371344 377123 364174 354186 376061 385798 362346 349298 326196 320947 328475 312575 318327 315852
8766 315852 276315 276975 300434 314669 330193 349545 383567 401557 388653 382513 379486 404910
8754 404910 425157 403121 427567 456766 464430 491089 548251 610695 683915 777351 841099 878905
8742 878905 874857 895510 892372 845375 758939 650733 588962 549754 523749 509327 490072 477983
8730 477983 485043 499915 485404 466043 451157 448814 429327 426664 427471 418314 401472 410134 429352
8717 429352 422700 440911 479668 508096 553917 566676 585875 605815 647499 690924 712133 772832
8705 772832 842978 897418 946777 1007707 1075379 1165877 1204902 1183840 1166369 1147742 1127316 1115748
8693 1115748 1105608 1063589 963274 886920 825816 775094 749799 693363 610605 545698 543785
8682 543785 542736 542355 523194 511622 480711 476747 476191 466755 453978 452871 493321 517806 524972
8669 524972 526678 553463 591790 621403 648036 665236 703888 737225 790639 832765 891460 977515
8657 977515 1075346 1130433 1169114 1201875 1222557 1235316 1234227 1241459 1262152 1290913 1292969 1270010
8645 1270010 1207206 1094598 956580 842184 767147 712625 648134 588959 550462 530697 522312
8634 522312 498200 500574 512353 495566 473996 450601 452314 465249 477618 476095 490844 521786
8622 521786 531565 546247 552548 556669 565767 569818 591214 610914 649250 660791 688204 736785 788735
8609 788735 860996 935323 963813 981140 1006873 1009242 1040166 1034211 1009706 936494 857463 783965
8597 783965 726740 678106 636700 605310 603994 622518 619973 614673 608248 605307 590881 561394 566161
8584 566161 570946 577163 590411 609777 638460 645887 619331 608269 595404 607729 612909 612861 616926
8571 616926 635512 648057 641869 654197 671707 685085 688723 686603 713155 770488 831866 844275
8559 844275 849506 842727 823257 770418 750418 747916 725832 722807 746940 756269 719153 728532 725672
8546 725672 729867 751798 762545 747611 743198 778498 812750 845585 832070 803788 807635 845060
8534 845060 853320 848444 870501 875807 856166 862925 846430 863459 878109 903027 923388 925104 931701
8521 931701 945792 951510 972195 995749 1006494 1003407 1019670 1038511 1065742 1096421 1103592 1107822
8509 1107822 1115036 1141413 1158370 1202298 1251299 1258481 1257507 1297536 1298514 1271229 1276072 1302239 1334041
8496 1334041 1336508 1349360 1372127 1383706 1420641 1468388 1463806 1470144 1514667 1544925 1561704 1564908
8484 1564908 1590247 1620249 1636166 1657378 1692792 1728891 1752563 1787211 1817243 1851129 1890109
8473 1890109 1919373 1958311 1988712 2018303 2043397 2068008 2094819 2148157 2183819 2213642 2237673
8462 2237673 2281148 2321629 2384796 2443483 2475457 2524428 2570146 2622009 2684795 2721450 2766280
8451 2766280 2837913 2902685 2944842 2986452 3028272 3112018 3187284 3237434 3295866 3349554 3401775
8440 3401775 3482407 3567721 3644372 3728893 3805954 3875521 3961707 4078674 4176331 4277265 4381558
8429 4381558 4471722 4520329 4565564 4650376 4732783 4826332 4931837 5049415 5178450 5291767 5404652
8418 5404652 5514586 5629148 5744652 5876529 6001876 6116022 6229772 6349966 6469799 6580270
8408 6580270 6700506 6826621 6977767 7109640 7224502 7338606 7453040 7567306 7692573 7841533
8398 7841533 7976594 8093639 8230262 8344761 8461565 8547871 8633422 8713984 8810827 8888029
8388 8888029 8956867 9038492 9101552 9169004 9218237 9266333 9310642 9352076 9366663 9392390 9412727
8377 9412727 9413720 9414360 9402669 9378894 9344192 9287191 9224666 9164426 9115434 9061228 9003349 8915204
8365 8915204 8842691 8766370 8658687 8557715 8439480 8349376 8236392 8098915 7970022 7847463
8355 7847463 7719783 7604669 7492072 7374382 7231857 7088212 6962431 6844162 6722400 6598336
8345 6598336 6463237 6324473 6207158 6104785 5994502 5883413 5765557 5667363 5539293 5433396
8335 5433396 5323171 5185523 5049550 4948962 4840348 4727700 4645397 4540726 4451867 4377317
8325 4377317 4280976 4170723 4087110 4010697 3932468 3851398 3784600 3748122 3672602 3596573 3515756
8314 3515756 3461901 3397357 3341001 3289174 3233230 3180076 3130576 3064623 2996140 2934617 2858541
8303 2858541 2788026 2716730 2673277 2622921 2572490 2535797 2494037 2434299 2382983 2330935 2300787
8292 2300787 2264040 2220326 2194397 2166980 2132894 2074135 2011910 1962895 1943502 1942357 1922443 1910823
8280 1910823 1876889 1841648 1794321 1771147 1755866 1739987 1707695 1657843 1623246 1603625 1570526
8269 1570526 1546466 1555764 1547691 1525624 1520692 1497041 1486533 1464409 1454794 1456319 1436132 1405098
8257 1405098 1374065 1355291 1334337 1322403 1311521 1294036 1280246 1283595 1260162 1224523 1197762 1164766
8245 1164766 1132039 1140178 1126349 1104302 1086336 1080620 1073438 1055111 1018768 1025694 1025325 1004346 971130
8232 971130 923490 899663 906524 927445 908794 889447 868523 835958 826322 830052 845459 852010
8220 852010 876734 884676 874431 871542 884801 858343 851718 874511 865369 825767 800601 780840
8208 780840 760265 754583 748378 735970 722402 705902 691473 685383 673852 676600 666546 659479 643490
8195 643490 610551 643180 647306 645321 668990 710288 725696 729873 734566 707198 732151 768818
8183 768818 765188 770052 819289 915883 1038160 1206408 1429064 1593332 1677119 1651171 1497867
8172 1497867 1306526 1115326 972665 842163 737700 697621 692865 668485 611202 591592 610447
8161 610447 612727 590704 561086 555882 575506 570425 550261 564861 615021 647302 636832 658442
8149 658442 705106 717468 718880 735892 721531 725451 749150 747735 735292 729728 738370 727820 754908
8136 754908 803388 809795 822610 818611 830108 848155 870417 901058 929870 1003983 1101222 1178849
8124 1178849 1234871 1250491 1205082 1168839 1130975 1064683 1014236 969140 968011 992014 1034637 1056502
8112 1056502 1060076 1045652 1018146 990736 970396 977694 967764 918922 853642 800939 745990 668344
8100 668344 592867 525053 489119 456485 453111 443411 431932 437944 442674 446940 450538 441710 462754
8087 462754 480300 470160 473939 495679 513223 559119 596201 645987 707141 817468 945163
8076 945163 1085089 1246981 1383646 1428478 1407493 1327748 1260411 1282288 1383102 1613202 1948789
8065 1948789 2321874 2708842 3050752 3267058 3286281 3059801 2710885 2266042 1824125 1459217
8055 1459217 1151493 920542 798393 699594 619396 564346 539901 545133 539552 547887 536704
8044 536704 512195 503711 511392 506422 501149 506572 478622 466755 474406 503795 500835 497005 491286
8031 491286 497509 486838 486242 539746 567518 596914 664285 785074 959315 1243919 1690751
8020 1690751 2347377 3186756 4100840 4873729 5196780 5002830 4436262 3642280 2815205 2125515
8010 2125515 1607770 1277135 1071004 902453 783037 686812 599694 542332 502110 495835 492783
7999 492783 476356 460264 450659 447149 435055 421131 391551 381446 362926 363329 374239 375771 374222
7986 374222 366867 363685 371307 380988 394425 420845 488015 548294 622106 742300 892898 1103544
7974 1103544 1339948 1530940 1698938 1824153 1819521 1713488 1529358 1353818 1181086 985199
7964 985199 780352 620386 478065 389263 367101 360668 338956 330312 327222 304600 275982 266474
7952 266474 266120 243049 196403 174296 161883 174519 162059 193746 226942 227282 206436 183637
7940 183637 169109 179282 174052 160180 167852 170876 167328 149648 127831 148234 155225 161850 146020
7927 146020 124289 132205 153776 124891 107450 108961 117372 114000 112843 116402 119611 103842 97891
7914 97891 93678 78563 55168 55616 77953 80665 81905 90339 105717 109094 113960 103773 90411
7901 90411 96032 107286 128097 117572 103201 112149 120112 132090 136050 129322 116535 85836 82129
7888 82129 89947 121977 118181 116815 114865 131170 125383 110545 125712 130267 113920 100327 94026
7875 94026 99201 111423 86472 72410 72046 80687 86377 71067 66725 82264 94373 103661 97106
7862 97106 94460 119867 120153 96081 99589 103886 89221 72661 84129 87766 78172 63804 53045
7849 53045 52888 45190 63980 75940 75240 76101 69896 78930 71169 63161 64743 70782 59100 56750 46748
7834 46748 56726 57266 56183 56300 71242 91549 90664 112759 118862 94966 71046 67439 73620 63593
7820 63593 69346 78831 87274 85741 80008 67648 98801 121264 85554 56437 45208 45449 52791
7807 52791 39237 43490 31740 25056 48248 66581 66420 40835 53637 80994 72005 56798 19460
7794 19460 11653 23020 26048 23039 19419 23995 27822 25482 36229 35226 29298 37946 56606 75614
7780 75614 84504 72459 74148 57521 28094 18726 30440 48597 60213 53219 78025 53974 41440
7767 41440 55108 67646 54152 42036 34077 22957 22332 41853 40941 16625 7125 28276 19018
7754 19018 6571 7886 19019 11862 34831 50120 42842 12875 9719 28038 27390 16350 21975
7741 21975 22827 21857 18134 33858 57948 71311 55225 41914 27909 55089 49884 20737 9967
7728 9967 -8424 -13684 -8264 8450 28053 30770 4837 -6996 22601 36079 49748 43210 32740
7715 32740 11478 25778 38041 37718 21644 21069 29272 21755 10340 28143 41586 51322 63572
7702 63572 72985 40730 1484 1067 -2907 -10300 160 -5970 8256 21237 19736 39973 34173
7689 34173 27692 31902 32108 16972 -4288 -5131 12554 18375 29026 22421 39164 45509 38538 35554
7675 35554 28120 18043 16456 15071 30322 43970 54486 52829 48347 53983 63894 87888 78084
7662 78084 67129 59550 83409 81918 67968 45892 42667 49186 53557 40044 48569 43836 52609
7649 52609 55830 43617 30778 19778 2140 8025 834 12989 25387 30208 21603 27821 23440
7636 23440 16923 16444 11704 -7383 -12032 -23741 -24621 -3106 2067 35459 54927 25013 -2188
7623 -2188 11697 2393 30843 33660 15520 5927 -5732 -17773 -35851 -43423 -35638 -20692 -7824
7610 -7824 2901 -15516 -8965 24495 47037 48161 39360 26711 29234 33536 28366 2307 16680
7597 16680 36142 38406 57516 71832 71984 62850 51109 32602 33839 37635 33434 12833 13151 20184
7583 20184 20731 3357 5152 30853 39785 24054 30773 38164 35480 38759 42627 44924 25365 15974
7569 15974 40971 39794 9239 20356 30389 21590 17007 21946 7516 10505 31772 35225 25199
7556 25199 28472 28647 13159 3919 -4011 -19172 -12763 -14708 -18477 -4756 -4625 17595 39641 43219
7542 43219 38369 19286 6667 1208 370 2986 16324 16736 14610 9473 17896 54908 33289 -2390
7528 -2390 -4226 -1660 -28592 -23003 -29018 -20439 -20015 -22368 5844 11306 10752 -2470 -1819 14223 4202
7513 4202 -6168 -12665 -33231 -40495 -52752 -45053 -34116 -22488 -9723 15872 13685 -5301 27916
7500 27916 42350 36454 17933 8232 14755 9457 8565 -6965 -16048 -26439 -35568 -27238 -24183 -4581
7486 -4581 19706 28949 20553 9813 -3902 15220 27419 -2471 14235 39276 29375 -1187 -2549
7473 -2549 6856 12859 34104 6817 3503 12637 27053 37685 44823 47528 52030 33268 11283
7460 11283 34521 41046 37872 36883 28121 -2677 -2656 4121 754 -26069 -14777 -18532 3636 5283
7446 5283 10433 -3881 -3366 -7791 -3514 -1491 -13615 -17721 2747 3094 3603 13325 20805 14463 9519
7431 9519 24719 22035 14629 25188 34111 17055 11815 14725 2847 -1668 -11836 -24321 -24464 -1583
7417 -1583 -6500 -25333 -8113 -13087 -1698 -1935 1028 15010 21902 15424 18373 23941 66 17291
7403 17291 27997 20616 29453 -15754 -15320 4137 -519 33487 26960 9799 18633 26014 29781 38324
7389 38324 34192 25592 24167 24939 16421 22288 13110 18625 9910 33793 56843 54099 47016 35084
7375 35084 26565 34670 25788 1204 -33231 -40135 -37309 -5720 29251 20583 8968 9313 1223 13187
7361 13187 9112 15591 278 -364 -16191 -33768 -20947 11049 5380 -2760 18903 27421 19167
7348 19167 27159 16405 22244 41671 37467 16860 7158 35180 47551 35248 21337 13574 -321
7335 -321 -7669 -6492 7726 13373 8593 295 9201 22922 37050 52455 16786 -21951 -23845 20089
7321 20089 27058 21582 4975 -21637 -38704 -20246 232 11541 24113 29622 28867 23061 18521
7308 18521 9559 18130 20296 43812 35379 39591 62087 38093 4126 2074 -518 -4098 5125 -8322
7294 -8322 -28104 -36201 -47323 -15447 23776 51299 45567 29193 9135 9070 31722 37645 26503
7281 26503 39000 47376 16693 4273 13838 14742 -8292 -30297 -32772 14104 16564 10451 -4425
7268 -4425 8984 3806 10998 19480 32450 33433 15680 -2765 19519 21332 18049 22822 13960 -7459
7254 -7459 -15057 -21323 -4415 29084 30515 15461 -11629 -26520 -33450 -3971 17592 27710 18720
7241 18720 5866 13888 11444 -6336 4672 11119 10244 5669 -6110 -17186 -9618 -4904 -2899 -215
7227 -215 -3919 9155 -4615 3014 2163 -28951 -68230 -44721 -12324 -9119 -12807 347 18881
7214 18881 21230 22444 17900 235 13041 18259 33554 42189 29196 1918 10969 12176 13121 11606
7200 11606 4456 -922 -12630 -13780 -8504 5395 6914 -4029 -1685 8622 4461 4904 13108 29377
7186 29377 11113 -892 -1111 -17737 -25142 -19959 -24692 -19705 -12567 -15351 -8580 -12539 8185 20039
7172 20039 14436 -8562 19976 3354 -18663 -35881 -32912 -43226 -26576 -19272 7127 16848 10303
7159 10303 11090 4818 13203 31953 18955 -9208 -23631 -37566 -34241 -35627 -33039 -15283 -23226
7146 -23226 -38823 -24398 -7705 6380 2692 -2514 -13474 -3598 17412 20103 7472 -2938 -23958
7133 -23958 -17603 102 6202 800 9013 19151 5963 7020 27444 21931 -12836 -9991 -13892
7120 -13892 -13119 -232 17998 20980 32384 -4883 -38301 -24373 -72 3018 6373 5780 10967
7107 10967 20169 22518 -5039 -14619 -23333 -15104 3682 12975 13143 -10701 -16201 -2134 14349 2068
7093 2068 -8629 7766 10351 8813 -5123 -45781 -59936 -13267 13558 25871 15870 -6711
7081 -6711 -980 -15868 1211 9035 -3478 -16947 -40364 -44800 -44728 -27620 -15614 -34834 -23589
7068 -23589 -16192 -14354 -11005 3389 -13155 -23495 -12046 15037 3111 -23051 -20084 -31439 -41308
7055 -41308 -17308 -1819 12987 23028 -2066 -14969 -7224 11014 13132 3275 1432 6678 -1249
7042 -1249 -7933 -15449 -17976 -6639 -5267 -11204 18381 55776 55278 47299 41385 39958 31132 41240
7028 41240 28109 3387 -12492 -2652 -6750 -6297 -14128 -2278 18938 -11669 -7106 -8352 -13357
7015 -13357 -2515 13184 20361 1219 4211 -751 30243 28998 27277 14886 -801 3391 35180
7002 35180 35074 -13292 -20624 -24566 -40562 -31063 -23794 -11248 24632 24229 -7915 -25110 -24725 -36014
6988 -36014 -22549 11185 35733 26584 25359 23624 6091 2586 17303 24975 20213 6178 -3947
6975 -3947 7694 18698 -3072 -545 1746 4083 14915 22387 30216 38736 49998 33930 29780
6962 29780 12806 -11993 -13305 6985 -1376 -2109 10070 10852 3125 5471 3916 24793 19610 -1539
6948 -1539 14756 28623 6745 4549 -3896 -16882 -11573 -12593 -12809 -16217 -21710 -25838 -9967 1399
6934 1399 -4980 -8583 -1196 5003 6393 5191 7264 15802 10337 21954 -3760 -19091 -19764 -21432
6920 -21432 -1403 -1913 -27536 -35468 -18873 5504 39218 26950 27569 -1773 -10905 -3095 -11949
6907 -11949 -11818 4986 -2597 -25729 -33211 -13221 -33092 -14326 -11095 -10223 1178 15129 5542
6894 5542 11928 5396 11598 1075 4154 6058 -9065 -29126 -21392 -12228 -8075 -23399 -27015 -41130
6880 -41130 -29503 -37898 -41955 -29196 -10388 -23432 -38546 -15479 941 6229 774 -3448 -16531
6867 -16531 -22846 -12595 -18654 -23790 -27654 -22103 12575 10291 3192 7145 -6422 4726 1793 -8192
6853 -8192 -17273 2356 9965 7259 -13414 -33099 5543 16472 8784 6440 -2294 3091 -4395 2106
6839 2106 4039 -8057 -13728 -9996 11555 16893 -9748 -15741 -4417 -27125 -34730 -3115 29192
6826 29192 35793 36818 43852 15878 11956 23119 37383 39080 44537 36816 45038 21402 25202 32431
6812 32431 32260 6833 -4238 -8346 -15337 -9569 -10400 4851 -8351 15585 23304 25130 10311 2640
6798 2640 6701 9523 -4633 -16255 -7199 13270 20584 16662 9392 6804 6758 2086 14109 6704
6784 6704 4204 -11738 -51887 -52440 -35489 -47775 -25262 -9789 -12797 -19360 -20169 11031 7367 26567
6770 26567 3371 -9976 9276 5824 9323 1670 2322 -5923 -43781 -48045 -30070 -10128 -11914
6757 -11914 5933 -23699 -35940 -17854 -16380 4224 -939 -32233 -34004 -20917 -21822 -23986 -29238
6744 -29238 -16825 -2708 13972 5223 -3014 11338 6595 -4672 -884 10305 19567 10521 2948
6731 2948 8289 30786 24166 30567 32677 32755 31678 20742 10098 12845 26701 -944 -32117 -8708
6717 -8708 -12534 -28701 -9167 -5030 -8949 -15358 -5176 14127 -1300 -9877 -18392 -7536 -9381
6704 -9381 -9861 -10964 -2657 3686 1656 17348 2946 -37361 -38056 -20950 -8600 -15544 -20223 -7698
6690 -7698 -9600 -13241 -23913 -8800 -9350 -18168 -24380 -12995 -3401 -5909 13985 23697 -858 -25991
6676 -25991 -17406 -46430 -23216 6989 -9377 -34490 -20555 11723 3941 7644 -11490 -18458 -20165
6663 -20165 -13606 -5805 -2982 1045 -2192 -8964 -5352 4707 13953 8673 653 12572 22800 22200
6649 22200 10220 -11346 -17247 -17322 -21353 -15545 4164 6524 -16598 -28369 -19725 -25251 -25721 -4260
6635 -4260 6048 -11430 -37299 -31423 -28371 -1524 -2786 -21501 -35867 -52247 -44848 -46353 -46118
6622 -46118 -10225 29084 10655 5209 22412 19612 4977 -3080 5921 -194 -12729 -27305 -28008
6609 -28008 -35537 -23043 14072 23515 41340 39951 27360 34965 25561 7213 -10364 -21873 -18080
6596 -18080 -7880 -4323 -7257 11036 12533 7118 14940 12979 -42284 -67816 -85005 -80263 -49002
6583 -49002 -19607 -7305 5795 24136 4716 -13161 -26582 -20184 -41363 -43019 -41077 -6361
6571 -6361 16518 9672 8280 17570 31996 16828 -19694 -17731 -9624 -8415 5512 29055 16745
6558 16745 14573 12554 4743 5378 114 -3229 -10461 -3434 8125 22442 4813 -12325 -18110 -6386
6544 -6386 1067 -3819 27592 27727 21052 25053 19154 17597 17317 -13047 -18772 -13295 3378 -7071
6530 -7071 -24610 -30937 -15659 -16826 -16452 -17574 -35197 -31179 -6648 -23201 -25864 -18973 -18915 -28201
6516 -28201 -36026 -44034 -26972 16357 23654 23962 11863 -7786 4269 8534 -24518 -44801 -42473
6503 -42473 -25338 -25780 -18112 10762 17896 17311 28678 18865 7279 17284 15783 16035 25137 7356
6489 7356 1696 -8812 -21093 -23124 -35872 -45115 -30565 -21178 -22357 -21188 -28216 -15510 15672
6476 15672 13712 -14526 -37502 -36077 -40229 -49738 -38138 -23281 -25818 -16449 -16848 -16552 -19661 -15395
6462 -15395 5948 17425 8860 -12610 -33367 -45799 -24878 -11379 2567 17933 14293 -8023
6450 -8023 1014 -3062 4638 21281 12652 3354 -11255 22932 45585 45288 11357 -6262 -11892 4986
6436 4986 -401 -21793 -24311 -23368 -29963 -8041 -27381 -42925 -55876 -69212 -46753 -25558 -33763
6423 -33763 -42123 -24599 -5876 -15554 -38546 -54467 -57398 -66509 -62835 -59758 -36745 -28419 -5134
6410 -5134 25769 27727 29196 31335 21361 38730 40057 19839 -11918 2893 20882 29279 33388
6397 33388 56700 37371 27398 22296 2374 664 4779 28304 27531 -2221 -25755 459 22656
6384 22656 13314 1012 -3947 6341 37753 25721 -451 -11861 -7210 17689 773 -24380
6372 -24380 -37665 -52049 -57636 -37492 -17867 -22403 -20957 -21053 2165 27829 1994 -20544 -18374
6359 -18374 -1592 18637 6255 -33376 -41200 -18663 12898 3746 -14335 -17548 -4930 -2229 10194
6346 10194 23587 25046 -7428 -16942 -17301 -12762 -16277 -28206 -29485 -8832 -1995 -8544 -7972 -13518
6332 -13518 -56880 -51940 -22597 4364 37811 55057 38742 28471 34173 18390 3859 21465
6320 21465 24470 9688 2504 17762 16498 5125 16689 13544 -2734 46 -20112 -11067 -2751
6307 -2751 -19636 -23468 -8675 3636 -8364 -11617 -4717 5976 23038 24275 -1390 -18186 -12232
6294 -12232 -7450 -25847 -28118 -43262 -42790 -18080 -34275 -55775 -41261 -34299 -27775 -26077 -36034
6281 -36034 -20188 -885 15378 44284 58091 50467 32783 29251 27305 21874 21259 8513 -2295
6268 -2295 -6262 -25652 -33570 -20811 -27308 -13758 4190 8424 9545 -15500 -17404 -21794 -12524 -13762
6254 -13762 -13876 -13412 5418 9138 20062 25903 22979 -6368 -1483 4116 -8783 6622 16728 19373
6240 19373 32970 30597 21221 12434 1778 -3591 22386 23589 7663 1916 -17219 6894 -4811
6227 -4811 -43612 -76385 -67946 -47010 -23010 -2574 6486 13642 19197 21531 16036 20716 19627 -10380
6213 -10380 -29592 -16990 -18318 -30886 -30784 -31514 -1470 30206 26292 981 5712 4266 29358
6200 29358 48163 26661 4205 12015 4571 8553 7660 18682 1781 -2843 6363 15492 6059 -3848
6186 -3848 -9077 8595 7298 -15118 -17042 -14431 -31879 -35285 -16796 6937 286 -221 -21284 -29983
6172 -29983 -16331 -16592 6334 -423 -8726 -17798 8010 27404 17967 15829 21517 15358 8157 18618
6158 18618 17421 -19268 -25917 -17874 -3662 -6876 -13220 3293 -3825 -26723 -29764 -31686 -45982
6145 -45982 -53835 -64398 -73975 -76249 -67771 -29881 -17681 7915 -3040 1411 -2380 -15095 -25917
6132 -25917 -48250 -40683 -21874 -21444 -26513 -31230 -27604 -36803 -19204 -10978 10081 17337 9512 5508
6118 5508 3533 -8294 -22106 -35189 -25498 -1748 8890 13751 17855 18027 32473 11579 10714 2603
6104 2603 -31606 -25613 84 13346 22382 16625 532 568 -5022 6261 19076 14749 1583 -2391
6090 -2391 18030 24789 8544 -4728 -23653 -24995 -4716 8977 30613 22555 13879 2779 -17621
6077 -17621 -36410 -34946 -17939 -12698 2027 -19659 -6312 -4333 -10971 306 -6326 -21799 -19949
6064 -19949 18674 27709 26628 24844 38775 39679 31604 36256 30312 44839 45210 9658 5207 13145
6050 13145 14268 -9447 -13964 -13300 -19787 -28007 -43045 -47680 -42080 -13227 -3744 -14779 -10104 -2225
6036 -2225 -1952 -6944 -26007 -4069 24603 -10639 -39143 -41736 -50759 -41749 -41213 -27244 -19677 -18060
6022 -18060 -14695 6333 39164 31723 16817 -839 -24364 -16934 -17627 -36105 -49624 -14152 8583
6009 8583 7350 1818 -31170 -28947 -10324 2605 23331 21097 29463 34667 12358 2385 29388
5996 29388 24568 24625 6206 8230 5007 9752 -5063 -6537 -23673 -37251 -13347 16413 38092
5983 38092 32772 14030 13547 6645 -21865 -20978 4944 23823 11449 -25438 -37653 -39831 -13596
5970 -13596 -1656 2050 17864 15788 24310 15353 -2812 -21131 -25661 -4071 -4610 4796 -11372
5957 -11372 -12470 -11376 -20637 -51230 -38761 -2067 10198 -1829 -9672 -7988 3958 567 1634
5944 1634 -11994 5570 34735 33715 36570 43111 58229 9087 -35417 -48501 -42507 -16888 -13074
5931 -13074 14468 44780 37725 -12096 -21289 9673 20268 164 21858 12171 -2141 9063
5919 9063 1843 -12522 -13720 -18401 -12502 -20225 -8396 -8211 6795 29479 13346 -6669 4295
5906 4295 14736 748 -13382 1558 14870 11175 -10464 -20970 -22329 -28776 -33722 -38303 -27502
5893 -27502 -20066 -33296 -8752 2611 9017 20009 5232 -6317 -7052 -16350 -4201 12319 28235
5880 28235 40489 17363 -31082 -23768 -12380 -19595 3770 31237 26905 12494 -1905 3279 7396
5867 7396 5981 -22367 -62606 -76967 -58355 -29431 -13351 -20084 -29993 -41659 -49075 -40927 -39443
5854 -39443 -42864 -43041 -28989 -26282 -22744 1387 19699 23159 37617 30132 35762 18763 -8274
5841 -8274 -16955 -15302 -27085 -30951 -26963 -19678 1460 -15181 -19887 -18052 -8604 8797 -4970 -22655
5827 -22655 -39915 -51553 -38396 -19585 -14175 -1587 -6173 -3932 -100 -28133 -20272 2491 13827
5814 13827 12362 18336 32905 34385 9846 2608 5025 37073 20578 1429 5026 36508 48833
5801 48833 54761 43302 40568 66985 73316 55538 26398 19515 4076 -9701 -37717 -38653 -12578
5788 -12578 12786 10775 7622 7559 -14517 -33316 -20154 -12113 -16389 -11608 -15598 -21781 12853 21574
5774 21574 8112 2283 18081 20494 -5899 -19662 -30851 -15770 -5542 15236 10216 3500 -5231
5761 -5231 -19365 -338 -6762 -2114 -20425 -37196 -32095 -20096 -224 -13528 -5719 -8253 2238
5748 2238 7951 9575 12733 4771 -9508 -11980 -30351 -14348 -961 -5265 13592 48520 59406
5735 59406 53648 51550 35539 7381 -12651 -397 13297 32354 13156 14253 7210 -15229 -21793
5722 -21793 -14959 -22896 -35375 -18911 -3191 31918 55441 9265 -20286 -5114 -5788 3955 -3839
5709 -3839 -40535 -47404 -49652 -17805 -16091 -35164 -35832 -45492 -27703 -13950 501 13230 7259
5696 7259 33097 20668 -8595 -5887 -10346 -8324 -21931 -21131 -17983 -34992 -42338 -29615 -25285 -31650
5682 -31650 -38108 -33918 -40552 -36273 -27401 -14529 -23325 -27102 -13603 -3528 17393 24525 -16060
5669 -16060 -41637 -48042 -41973 -42501 -42862 -32791 -37717 -32652 -14044 -11327 -12210 -6011 -15879 -11159 8212
5654 8212 20243 20706 -2781 -15510 -29194 -31253 -29674 -22822 -30414 -27277 -10911 -16921 -17908 6670
5640 6670 9447 1962 -15602 -35954 -51611 -29969 -584 -9026 1588 -7807 -15876 -19195 -17182
5627 -17182 -12997 1841 32098 26315 2442 -22622 -40641 -17113 5796 15817 2853 2412 -4724
5614 -4724 -13126 -18701 -29600 -47697 -66794 -46388 -20425 -10356 -6798 -10478 -32826 -38020 -61100
5601 -61100 -80208 -64402 -25182 -11043 -21206 -17042 2835 6372 7286 21888 28270 22132 12954
5588 12954 4159 -1819 -4961 -10811 1141 -1489 -14908 -24235 -24394 -12263 -1179 -4662 -12446 -13817
5574 -13817 -10213 -23238 -27210 1735 -5035 -17255 -26373 -29709 -13818 -23211 -24092 -4270 11743
5561 11743 22392 -2051 -3485 13473 1727 -9386 12499 6234 13073 9711 14777 18303 -18148
5548 -18148 -25472 -17745 971 16411 33329 -4745 -50424 -51239 -33804 -21472 -48745 -47901 -49514
5535 -49514 -49216 -31028 -20415 -9101 2656 -6112 -4955 2398 -6811 -18636 -10974 -24044 -5404
5522 -5404 20810 9168 -1283 5185 5920 -3484 -6460 12454 10273 -15852 -11394 -4052 -4410 -12220
5508 -12220 798 -23477 -50970 -22036 10862 21935 44453 61165 27324 -8046 -2806 10970
5496 10970 10058 10455 21946 37147 45535 26205 -5483 -15281 -22852 -25354 -36361 -36694 -12388 2272
5482 2272 17683 -907 -27489 -29240 -14320 -57 -2388 -13903 -26807 -10732 1495 39293
5470 39293 41458 8254 -242 5684 10935 17154 22515 1362 3130 -9434 -6689 -18758 -34558
5457 -34558 -44968 -38064 -16387 -21227 -23365 -607 -1610 -11502 -14229 -2132 -11319 -22914 -20013
5444 -20013 -846 -22859 -81 15054 16705 -11493 -15389 -8193 -22810 -33956 -41794 -36281 -42676
5431 -42676 -31427 -15025 6602 3541 3890 -11228 -9395 -7260 -9366 14837 8105 -15741 -22813
5418 -22813 15683 17665 16573 -14754 -33623 -53894 -34845 -21103 -2637 -9449 -9622 4270 11687
5405 11687 2606 -16658 -12295 -13870 -46694 -62839 -28947 19280 25039 25893 21961 18975 29323
5392 29323 17748 -357 -11306 -32711 -17221 -26288 -10172 -11395 -7763 -14505 5578 32202 29820
5379 29820 12843 -7981 -6420 20891 15022 -1920 -5906 -7029 -6320 -996 -8150 -2257 -8695 -19335
5365 -19335 -49702 -34657 -23843 -45329 -16463 -5372 2335 1211 -4378 -341 7503 -7880 -3384
5352 -3384 -11292 -10835 -28307 -32025 -6964 22434 28644 21306 -8280 -32565 -25057 -8578 -14766 -12563
5338 -12563 -9080 -3290 -20023 -23326 -10192 4771 15872 -1496 -22058 -30998 -27996 3569 14305
5325 14305 -7197 -45879 -25270 -23574 -26209 3400 6164 4024 2240 -3666 -3151 4720 -5810 1640
5311 1640 16890 17628 25888 24072 9938 12135 10376 -12140 -19701 -34645 -46214 -48693 -55342 -46475
5297 -46475 -23835 83 4306 7126 20177 22178 13137 7990 11357 1075 -9780 -29378 -42505
5284 -42505 -44878 -39118 -1061 9493 28914 30150 11711 3394 -7246 -15735 10401 3776 -19150
5271 -19150 -14107 -9339 -2735 33281 280 -32140 -32629 -48288 -39948 -18217 -15524 -18409 -6315
5258 -6315 -13749 -19540 -25401 4318 11641 4762 -5237 -3998 -10372 -9314 -9258 -21096 -10789 -17331 -28464
5243 -28464 -29186 -8302 -1558 -9025 -7931 15699 30853 4097 -5344 -19586 -18792 -12015 -11359 5608
5229 5608 20159 20551 5057 -10657 4713 3716 541 -3801 -8945 -19787 -13180 -10309 10025 15278
5215 15278 36223 36414 7038 -9206 -28827 -27585 -15424 -25954 -25607 -20483 -14602 -1884 17448
5202 17448 8652 -10207 -13027 -21857 -7426 -9424 -10503 -7015 -13421 -10387 -9257 -11369 -5117 11909
5188 11909 21743 3378 -7297 -17677 -46532 -45639 -24686 -8571 -3896 3262 -3000 -20521 -34232
5175 -34232 -52942 -39080 -14264 10279 36687 21444 8125 2762 7255 2925 14864 -4474
5163 -4474 -21724 -30498 -11780 15673 41739 34350 30721 -2130 -35005 -22659 -31793 -52956 -26725
5150 -26725 -17982 -4925 -21569 -31326 -20946 -1652 -8170 -10711 -17505 -17580 -32312 -30358 -25806 -24835
5136 -24835 -23520 -15052 -12327 -20513 -13196 13940 17008 -10744 -18977 67 26595 48086 45261
5123 45261 22292 15059 7274 -4406 2910 11286 22889 35677 21479 19236 10886 -3829 -438
5110 -438 4655 -5752 -39103 -33864 -5677 -7358 -26483 -30340 -28642 -32958 -24128 -18521 -5982 16756
5096 16756 23998 6345 -12707 -16787 -3688 -11054 -11028 -20551 -4248 17815 22445 -2429 -34487
5083 -34487 -49146 -59753 -35324 -18290 -7008 -20986 -18807 -2344 20231 5378 -10067 -24626
5071 -24626 -17980 -30757 -51187 -69159 -76437 -44951 -37791 -38000 -24403 -14576 -26793 -36090 -18089
5058 -18089 -3188 1709 7774 2591 -9251 -6450 7843 18608 -15957 -6548 -2032 10405 6406
5045 6406 10433 11563 10390 14785 20752 9276 7111 -12559 -13352 -7708 -10475 -22686 -9662 16182
5031 16182 33089 37679 36497 24813 7743 228 4429 12725 7302 -3490 -30831 -45496 -28664
5018 -28664 15964 20985 11248 13462 13693 22206 24115 14914 -497 -15691 -15450 -15807 -28154 -28963 -51667
5003 -51667 -53716 -28249 -11750 -22527 -33580 -19569 10951 21067 23956 2803 38014 30715
4991 30715 6186 -5522 -10458 -26685 -34040 -23116 -16105 -12712 -8918 -2959 21824 32309 25446
4978 25446 19569 5336 7235 21265 2470 -5228 5253 -1269 1803 2202 -7015 -41070 -42643 -34842
4964 -34842 -5592 -1022 12447 21981 16303 -8025 -24641 -40271 -22111 -2871 -9487 -30587 -30344
4951 -30344 -22987 -25549 -10729 -19648 -15935 -14072 -5024 8760 9371 -6102 -390 424 -16962 -32742
4937 -32742 -36751 -45052 -41181 -27910 -29966 -24415 -43366 -55014 -39950 -23306 -13463 -15302 -19963
4924 -19963 -32696 -31275 -43136 -33568 11793 19719 -12089 -42352 -28204 -35743 -30594 -4181 28606
4911 28606 17094 -3693 -26905 -25956 -23373 -40644 -65973 -68779 -56565 -45464 -46673 -21176 -8001
4898 -8001 -16140 -2667 -5660 4121 -1451 -21234 -16881 -29195 -25395 -24168 -12480 -26247 -16965 -18446
4884 -18446 -16353 -34079 -44324 -36538 -9635 10989 9285 -1036 -8723 15506 10883 8937 12082
4871 12082 -11493 -6364 -5664 -2673 -1215 5136 2738 -8142 4375 38437 49607 26901 3386
4858 3386 -31489 -19371 -3296 -11958 -41246 -58071 -52120 -47472 -25754 -8591 -19467 -14022 44
4845 44 -16739 -25011 4341 22406 10117 20831 -7379 -33345 -43539 -34851 -26807 -35208 -34697 -23250
4831 -23250 -9183 14046 2732 -27131 -9459 -7350 -23129 -37179 -49458 -63201 -50638 -34898
4819 -34898 -27864 -30046 -20847 -29711 -15895 -16021 -34841 -50675 -36839 -26859 -16719 -453 9703
4806 9703 -4939 -5037 9950 36716 18063 -10306 -20588 -19480 -24278 53 21309 34577 41836
4793 41836 6977 908 -2298 -3395 -7968 -4646 -18597 -1152 2892 10387 12596 8036 7900 2224
4779 2224 6416 28962 52197 42802 28592 19224 -6250 -7090 -13100 -32366 -13083 -19351 -21026 -4828
4765 -4828 -5213 -42181 -64329 -48295 -28808 -25757 -21421 4991 -5749 -24099 -4121 8056 6891
4752 6891 9878 -10966 -25970 -45223 -26861 -14744 -9464 11730 39153 33111 6509 24370 25017
4739 25017 13143 10220 8087 -2766 14477 12781 -4420 5098 8957 -8311 -9477 6951 777
4726 777 -14486 -19513 -37606 -54685 -69894 -60515 -35454 -34186 -28152 1109 16724 17734 -8182
4713 -8182 -15292 -16875 1472 31819 22398 -1917 -23553 -31968 -27555 -30777 -24243 -26841 -16136 11620
4699 11620 21659 12463 17550 34899 65202 64424 58708 43478 5058 -12498 -25243 -9734 -6440
4686 -6440 15216 35086 31472 20284 6287 -12681 -22177 -21963 -32964 -27214 -30506 -40798 -38689
4673 -38689 -20387 -7341 7479 994 -36247 -18184 -2477 -13630 -14863 -26621 -15269 -26703
4661 -26703 -33796 -48975 -34115 -22424 -28627 -38566 -14997 6412 -1919 7636 2288 -5542 -13255
4648 -13255 -15352 -31804 -42326 -40316 -42994 -57308 -63707 -64830 -33868 -22259 -3156 2668 -11212
4635 -11212 -19975 -16646 -30769 -41024 -53981 -22457 -16629 -29620 -22001 -27132 -9699 881 -30244
4622 -30244 -26611 -1618 14218 -4315 -5719 -21098 -21478 -6517 5160 28418 21025 18662 13804
4609 13804 17470 3255 -17263 -14319 16904 5399 -2915 -13923 -8524 -19159 -35317 -24158 -5697
4596 -5697 19272 12180 -8583 -21832 -4683 -14031 -20303 -23603 -30970 -47379 -37539 -39289 -44070 -61453
4582 -61453 -59345 -34482 -1302 14110 12094 -24442 -38559 -38493 -23354 -27357 -10985 15569 41036
4569 41036 34066 22232 26196 26881 35741 37042 14761 11887 7454 4286 30210 33874 22017 13527
4555 13527 15218 18412 18449 18553 28906 26830 0 6841 39441 35322 315 4360 8272 17633
4541 17633 6500 -5973 5522 14058 1909 -747 -2554 -7385 -9827 -3310 -26732 -31343 5769
4528 5769 5623 -8073 -12880 6836 33303 42109 29397 14963 15270 16807 -6916 -5456 1220 10557
4514 10557 15977 8715 -21883 -32220 -36075 -39806 -50002 -28268 -9688 -13978 -29909 -31527 7049
4501 7049 13667 12889 -22936 -45977 -31045 -34737 -23723 -3096 -4553 -1570 2249 -253 -14830 -26464
4487 -26464 -47530 -59745 -50812 -17653 -15589 -10926 -498 -21533 -29945 -27495 -20562 -1435 15908
4474 15908 31226 40265 26771 13809 22382 24257 6087 1932 -10859 -5182 -1017 617 10297
4461 10297 5067 -527 17116 12389 -28403 -34243 -48604 -56354 -38853 -38727 -23479 -3301 -11413
4448 -11413 -8466 -1504 -13492 -28445 -16898 -18723 -26227 -17977 -6701 10042 1567 -37579 -38364
4435 -38364 -16155 3652 11516 -25761 -36255 -25531 -18331 -9586 -33722 -38927 -942 21199 424
4422 424 11586 30415 35721 15240 15864 32525 35256 3808 -6452 9889 36213 29440 13008
4409 13008 1603 8404 18901 19710 21128 24171 11378 24907 31535 -5308 -10348 -23371 -33671
4396 -33671 -31055 -3753 1288 12665 20555 -2641 -8669 33583 44889 37196 30135 30333 3236
4383 3236 -7194 -16678 -10441 -20489 -19899 -22682 -16537 -35185 -40257 -29372 -34929 -31540 -2764 -18202
4369 -18202 -41807 -63617 -53862 -12984 -17235 -3748 -4503 4927 -20165 -24435 -16180 -16534 -10983 -9887
4355 -9887 -6667 -13391 -5580 9243 15748 8739 2841 2448 -14012 -34685 -36910 -36336 -15227 -14522 -19017
4340 -19017 -18937 12574 20070 10686 8775 -8349 -24247 2179 -12511 -17853 -22708 -29214 -16121 -9596
4326 -9596 -15896 -27787 -24785 -8604 -13786 -14662 2362 -9976 -2169 -12664 -43513 -35899 10831
4313 10831 4338 -27878 -37702 -58590 -67729 -54794 -27551 -27216 -53934 -54131 -27589 -11195 7564
4300 7564 12344 16466 5610 4312 4425 5557 -1204 -16903 -12031 -620 -20517 -30239 -16926 -20554
4286 -20554 -38522 -24907 -12230 -11834 -3364 20796 21531 -4910 -26832 -33847 -7871 1641 -46252
4273 -46252 -64447 -49662 -43405 -46481 -45573 -33532 -18996 -23293 -1583 5941 8361 -18385 -7819
4260 -7819 -746 -2102 12102 7578 -11218 -24186 -31706 -1408 -4049 -8515 -11702 -157 -5000 -10984
4246 -10984 7640 30640 30448 24089 7398 58 -18902 -23026 -14532 -19079 -49437 -39580 -27143
4233 -27143 -13387 560 -5208 -1154 -4567 10683 7822 1492 1140 637 11571 16494 -3544 -29705
4219 -29705 -32757 -20942 -11461 1021 7737 -13682 -36636 -9251 -16147 -8119 -119 -8252 -6258
4206 -6258 8794 31114 44826 31183 5314 -12486 6290 19587 9402 554 22717 18272
4194 18272 16775 28770 28503 10673 10873 16995 16720 26434 31438 18179 2154 -10265 -17109 -21252
4180 -21252 -10759 -18331 -23290 -19293 -14657 -23182 -29990 -24897 5783 19470 10510 2869 2420 -705
4166 -705 9359 27767 44754 43212 31446 1821 1126 6132 -15362 -34005 -29249 -44859 -21519
4153 -21519 -3583 -21451 -43379 -32237 -36417 -14247 7572 9327 -10493 -8227 -20352 -21428 -15865
4140 -15865 -24197 -31693 -48782 -56971 -47330 -53843 -28537 -21996 -22009 -734 8257 3557 6875 16690
4126 16690 -594 1263 12843 -13591 -27431 -8673 -2004 -11936 -4163 242 18156 39977 35095
4113 35095 6720 -10451 -34675 -41979 -56518 -56198 -46362 -39615 -36127 -18911 2054 -16833 -23357
4100 -23357 -4210 11051 11656 4853 -14270 -26127 -13994 9415 33379 47719 16968 -17959
4088 -17959 -15598 -4638 15103 -8802 -27660 -18670 -35143 -25322 -27598 -24601 -2433 4140 1766
4075 1766 -183 17623 37210 25925 10341 16342 29408 19985 11038 1759 -20058 -28700 -10994
4062 -10994 -15631 1033 -9247 10428 48142 61134 39465 11418 -16216 -11707 -10067 -7171 -1171
4049 -1171 -3261 -15517 -26701 -28236 -50149 -33561 -15475 -17509 -8968 8615 24476 14643 2645
4036 2645 4915 8168 3034 -10693 -5365 -10240 1312 -4325 10286 -980 -17933 -19345 -14848 -3595
4022 -3595 5907 909 -5734 4257 -13776 -18120 -7771 750 -8386 -34555 -43626 -42264 -33410 -41105
4008 -41105 -54863 -30124 -23447 -35174 -19230 -5725 7614 -7965 9413 9923 2999 -26681 -19947
3995 -19947 -5403 12946 27331 15969 1065 -29302 -32585 -23272 -24429 -13563 12683 32847
3983 32847 9520 1974 -7190 -14413 8470 21977 12411 -5224 -7912 -7287 -7671 264 -4808 -989
3969 -989 3242 -20177 -26145 -4331 13747 3660 -2197 -17115 -15431 -8568 -11911 -13258 4966 -11259
3955 -11259 700 30302 35957 41280 30865 13971 35929 37805 30431 14598 10062 17587 1686
3942 1686 -11633 -1722 25278 12479 -2545 -19407 -18595 14637 8280 -12338 -27199 -14515 3294
3929 3294 -10524 3310 -3693 -19388 -22861 -26962 -23338 -7613 -19262 -23231 -6454 3008 4924
3916 4924 5957 810 -17145 -23312 -11847 -23791 -40274 -22177 -13547 -4537 -19366 -44442 -30680
3903 -30680 -1001 -4848 -8973 11041 -24189 -28094 -24775 -14427 6789 305 -4688 -14038 -27537
3890 -27537 -11848 -8329 -17057 -26486 -29918 -28188 -44903 -48112 -37013 -8139 18720 8427 -3335
3877 -3335 -15777 -6609 -11043 -3806 4508 16595 7180 3129 4332 11429 2722 1156 26606 44412
3863 44412 21470 9175 -7275 -9539 2305 1502 4892 44100 44080 8791 -30365 -41991 -34980
3850 -34980 -6103 -2662 4977 23944 -9399 -23955 -19813 -27603 -30432 -15658 -32874 -34671 -18969
3837 -18969 -24637 -35934 -29056 -8147 17396 6521 -4949 -593 -11328 9969 586 1725 -3619
3824 -3619 834 4580 6303 14560 24791 5964 -7129 -19035 6733 20933 23574 15298 17114
3811 17114 5573 -9751 3414 15643 20240 13898 12277 -6411 -12012 -19981 -4914 8291 5349
3798 5349 22072 26754 10701 -3673 -5690 -14057 -568 2734 -6800 -10891 6983 14270 36053
3785 36053 14226 -7996 15690 5160 3479 1770 -18089 -41247 -54149 -53637 -81430 -79176 -59300
3772 -59300 -33446 -27320 -34031 -15585 -18412 -21520 -18607 -32235 -16096 11392 5673 -828 -20586
3759 -20586 -7838 -4076 -17389 -14334 -16989 -8121 -10026 -5529 -27208 -22496 -6570 -3757 25454
3746 25454 21547 -1022 12640 22478 6860 -33802 -41853 -40397 -25220 -26306 -10646 -14586 -32816
3733 -32816 -26181 -32638 -55704 -49618 -1008 2011 -17836 -48205 -63523 -56141 -34240 -4402 4138
3720 4138 21569 32390 38416 25298 10924 -20179 -10413 -16399 -13082 4026 -17047 -44971 -37607
3707 -37607 -25298 -21448 -12570 3565 -3864 20803 -6099 -39859 -29009 -30202 -41344 -47120 -54127
3694 -54127 -63686 -52338 -36996 -26702 -7627 17158 14896 592 8526 -16693 -13039 1573 20191
3681 20191 23672 15683 35926 41481 27374 29962 33197 47710 22776 12951 -7315 2934 10573
3668 10573 10758 14128 24595 15856 -16010 -24381 -1619 23621 30540 16611 23479 7185 -5928
3655 -5928 -20090 -18408 -3780 -7331 -12982 1173 -4847 -7017 -7501 14087 54803 61654 44462 37514
3641 37514 36937 54258 25065 13659 8782 278 -16386 447 12202 -4499 -26869 -46062 -53560
3628 -53560 -63104 -56062 -15797 8289 26278 22347 17620 27857 41337 39219 24512 13255 14689
3615 14689 16940 23836 -1098 -5779 -2031 -18199 -37455 6404 32033 17407 504 -23352 -37707
3602 -37707 -51438 -37905 -2585 -12655 -10901 9942 18750 11881 -275 -10954 239 2405 19844
3589 19844 36345 42115 40595 35316 28042 8342 -5836 20315 23474 15848 8277 11379 8059 -829
3575 -829 -11133 -32363 -39620 -30285 -20540 -37695 -25922 -5010 -12690 166 6760 14376 7964 5970
3561 5970 6072 22394 38341 39457 28275 1299 -14947 -15746 -5506 22983 19213 13732 10496 -26980
3547 -26980 -27163 -21069 -19797 -26794 -23754 -47446 -64793 -45958 -41221 -36567 -10813 3710 -15948
3534 -15948 -14698 9814 10140 12032 9076 3041 -10365 -6069 -24155 -35450 -16100 -16655 -12694 -20361
3520 -20361 2117 10135 -19494 -40344 -17333 24362 39414 24911 5539 -1857 -5386 -8278 -5609
3507 -5609 13832 375 -11989 -17028 -11094 -12623 -6522 4782 1580 19604 29273 3197 2394 -6779
3493 -6779 -25584 -13966 -19982 -39526 -39286 -35064 -27578 3005 4533 -22189 -32320 -43266 -32611
3480 -32611 -11878 17088 11758 -10990 -3960 8396 1665 2755 10307 9625 14447 -3953 -8691 -21976
3466 -21976 -24237 -15651 6338 16750 21837 4772 6454 -5888 -31775 -23870 -32219 -24587 -19853
3453 -19853 -36827 -45915 -38631 -13040 6733 28791 22843 11204 2887 -378 8599 -26433 -22273
3440 -22273 9746 29258 13637 224 12015 565 -6123 -4141 29633 29922 14462 -1666 -7265
3427 -7265 -11201 -884 14755 14197 2283 2187 20443 15631 12073 -20070 -22237 -23800 -7815 118
3413 118 14896 21579 23804 13783 2316 10575 16897 29066 48867 46890 41912 37397 25857 7975
3399 7975 13110 25447 12349 15628 12477 7472 -18483 -22063 -29152 -4680 730 -10258 -15501 -13007
3385 -13007 -15310 -10349 -5576 24837 23806 13024 -821 16138 20152 7537 -9064 -14104 -10523
3372 -10523 -11905 -9817 10489 24432 30257 24572 36546 38902 2230 -33950 -51370 -28720 2708
3359 2708 10761 5827 3705 4539 14352 19671 5732 2609 5059 4048 -10903 -28526 -64218 -67783
3345 -67783 -39823 -11940 -13093 -953 2241 3654 10959 5235 19668 6062 -9782 12679 22698
3332 22698 25875 -1212 -20143 -15360 -5375 2753 5579 7945 8933 25216 21923 12426 -16987 -40180
3318 -40180 -30219 -1499 -13293 -16667 -15296 10042 43619 10937 -6836 10319 -8601 -12957 -1041
3305 -1041 -5674 -6197 41433 46618 23150 -709 -7682 -22358 -26240 -22421 -34020 -25301 -19528 -17750
3291 -17750 -20496 -27477 -27151 -26008 1794 25717 27338 17429 3146 -11503 2323 40486 42083
3278 42083 15285 29119 38298 45051 52180 63699 51821 30862 25819 4437 1850 4193 20577
3265 20577 36669 34628 -3472 -26858 -49309 -33357 2727 6636 4578 11743 1816 2113 20222
3252 20222 28987 38254 42125 36273 51391 44556 31145 -8087 2283 20880 -2039 -18758 3810
3239 3810 6426 5377 12772 14450 -5266 -7922 -4279 -3996 2521 -3615 -17427 -36777 -17266 13604
3225 13604 27657 30353 8841 -16615 -31685 -49503 -42176 -39874 -46086 -25667 -24376 -21486 -13396
3212 -13396 -33754 -53145 -38479 -3688 19004 18798 17289 24787 33015 12539 -3477 -17205 -1402
3199 -1402 37081 41807 9311 7143 22797 21517 9102 3632 22812 49343 32790 10410 -17283
3186 -17283 -13936 -12071 -3684 4066 -5548 -6079 -12604 1097 13146 20026 8647 9865 -15763 -13541
3172 -13541 -6913 -20963 -20681 -1447 7690 -975 -8614 -10821 -9479 -17203 813 -18676 -9542 -23707
3158 -23707 -28939 -29498 -33475 -37133 -14614 3266 70 9481 1562 -5913 -6929 22451 18984 24518
3144 24518 26058 17420 6704 -9307 -11788 6958 13609 13608 26729 17788 14502 25925 23569 707
3130 707 -17046 -22458 -17930 -2897 10951 7989 5038 -4223 -4693 13748 6877 -271 -20504 -19536
3116 -19536 -9698 8310 -113 -3209 -13471 -3829 2515 16596 10390 2328 12969 4689 7683 5624
3102 5624 -8221 -28772 -30782 42 5860 22265 14132 -19808 -20710 1902 11262 -6239 -10515
3089 -10515 -1247 -8878 -30971 -29561 -31917 -25202 -23529 -15955 7644 40390 43234 13678 -1828
3076 -1828 -2759 -3053 2516 22969 3002 -11 -2262 15495 34887 12129 6152 11122 27885 9905
3062 9905 19198 20002 17040 7008 5108 -728 12800 1230 9200 17216 13149 -2994 3953 16397
3048 16397 7334 -3817 -9856 -5344 3119 4871 -2841 8649 -8749 19947 21666 -4919 -6338
3035 -6338 -3631 1864 -4431 -2026 522 -12878 -17357 3997 10615 21283 32862 33806 22203 33891
3021 33891 25024 326 -11891 -21592 -29562 -25775 -29566 -12513 7094 1625 -4274 641 15316
3008 15316 34276 45044 26864 29750 29457 9824 -5520 -29038 -30822 -2665 13617 8916 482
2995 482 9472 8209 -6839 -26062 -26688 -16285 -12868 -17852 -31434 -10428 6005 -11029 -225
2982 -225 8247 -10644 -15021 -16077 -25696 -36263 -41696 -34121 -44803 -36006 -29642 -26564 -17526 -5366
2968 -5366 -22848 -20406 -16005 25557 45433 24333 5818 -4966 -1517 16115 37329 34198 40804
2955 40804 34703 11232 25311 7483 7242 3038 4492 10565 -840 -1044 7271 15033 6987 -4032
2941 -4032 -1811 -9541 -5544 11542 6570 9956 15175 -3246 -13197 -9793 -4460 2603 10520 1752
2927 1752 15735 27483 6996 -13727 -4640 132 10950 12652 17463 23871 13555 -22774 -34686
2914 -34686 -34863 -15037 -18386 -20299 -1553 -2492 -1891 -116 17287 18868 -156 -4412 -15903 -36379
2900 -36379 -38803 -25483 -34087 -40749 -35436 -15979 852 8042 8881 8698 28426 37981 21125 4531
2886 4531 7184 -24538 -22497 -5394 21474 5755 -11423 -222 -20015 -27640 -10242 3396 -323
2873 -323 -11656 -2414 2986 -13316 -16372 -12877 -18682 -17384 11166 35107 3141 -26119 -26047 -28271
2859 -28271 -22904 -24035 -1194 -571 -2678 -11575 -22192 -13203 -9062 -7484 -7422 -24973 -16927 322
2845 322 8366 9791 27489 15767 893 -21809 -16637 -13419 -14620 -29788 -30675 -48290 -35142 -30280
2831 -30280 -38373 -13787 15071 37160 13977 7107 24109 40520 50518 37855 15539 9301 -13634
2818 -13634 -23380 -26681 -24688 -38837 -26823 -12774 7596 13487 25971 11198 3426 -669 -94
2805 -94 24266 8889 1515 17744 23920 1015 -2082 6352 -3605 -11446 4010 28461 25408 28324
2791 28324 9954 5804 6445 -13476 -7694 -364 -15425 -31076 -17961 -3364 -11851 -9785 -11955
2778 -11955 20928 17402 8993 -12187 -37612 -5442 1068 -302 609 26553 49324 56326 68500
2765 68500 65374 50525 45625 27266 9965 -6117 -2626 16089 34541 55864 22599 -25116
2753 -25116 -28204 7332 -6333 -8038 4514 -1678 -16592 -9430 -7557 22276 -2117 -21705 -20041
2740 -20041 -27952 -28522 -14306 5674 10436 -7205 -15630 634 23994 35548 38432 58216 44883
2727 44883 10517 13824 -10474 -14030 8438 8356 23182 8064 8758 2239 -7917 -9504 -22442 2864
2713 2864 37814 22441 29184 13569 -4468 -20384 -23855 1270 9231 21640 47926 7212 -26359
2700 -26359 -23944 -12794 6849 11761 -29512 -43233 -28088 -14024 -25267 -23829 -40444 -22138
2688 -22138 15496 23190 8564 -21773 -39865 -28928 -3276 -6380 -20002 -20590 -16779 -8816 7881
2675 7881 23316 14835 -12378 -4216 11557 14430 3614 9563 4302 2955 14251 27800 18498
2662 18498 13849 21978 16340 12885 8372 -1729 10211 8658 -961 19744 29329 15005 9931 -3302
2648 -3302 -2843 23300 20552 25066 41156 24495 11440 29921 26744 17578 40979 34424 31540 16206
2634 16206 -2094 4090 3476 -23084 -18360 -22030 -10486 -6875 -31030 -28563 -5270 7509 7951 -10650
2620 -10650 2480 24801 34641 44712 56825 29032 3775 12716 12963 6904 -37997 -30304 -14114
2607 -14114 -8392 -10618 -8370 -19121 -17031 7044 30150 34967 36062 45233 38543 20013 -18504
2594 -18504 -36159 -21879 -1869 -8006 -18146 -27432 -23231 -33544 -32759 -3786 -2650 -17802 -32771
2581 -32771 -23554 -2991 24294 13297 18848 13443 684 7329 22502 11234 -7724 499 -23971
2568 -23971 -6640 1068 -4922 -8316 -8123 -16469 -11498 4435 18186 13744 28905 21887 15114 26627
2554 26627 5989 -17130 -25842 -7390 -5771 -14330 -35794 -56217 -39766 457 17393 14730 16219
2541 16219 24075 55013 69404 45707 33364 35132 30335 13540 18922 6028 749 5446 26606
2528 26606 31180 35271 25657 20036 28951 48850 39062 22214 10825 -422 -19825 -8488 7792
2515 7792 13514 7191 -9673 -10249 -13210 -5601 9965 14631 4715 -11537 -6267 4887 8306 -11256
2501 -11256 553 3318 12924 7271 -16449 -1792 5963 11337 32578 22266 25952 38549 -1711
2488 -1711 -38533 -52546 -66837 -74398 -59259 -35068 -45932 -36319 -26011 -25118 -33767 -20209 -22996
2475 -22996 -34474 -40389 -36771 -26518 -48841 -34536 -17571 -11876 8997 23590 11835 1619
2463 1619 4350 37939 44208 26416 23149 29757 27597 28865 25054 14193 -1462 -11243 -12397 3405
2449 3405 10768 22783 25987 50047 54683 46511 40721 18205 8029 2543 -5137 2969 13608 778
2435 778 -972 7266 21979 25267 19048 38440 31486 8794 5575 -6308 -24267 -14368 -16419 -41784
2421 -41784 -42519 -2028 11831 12177 9612 -15618 -26943 -27763 -28464 -38020 -51884 -62541 -50286 -17827
2407 -17827 9599 8888 -16396 -30571 -2847 20284 49561 44359 25455 9507 -2222 -7337 693
2394 693 20588 26329 16846 31768 24358 11603 5643 22623 22048 14347 28491 21615 25953 23455
2380 23455 11259 27583 14435 11923 32824 30567 12293 2213 17668 21445 24620 43278 35560
2367 35560 18829 -1224 -6392 6100 23120 33735 37322 7136 -8791 12681 12912 13435 6129
2354 6129 1233 36067 30779 24173 23402 12928 -84 -3240 -27274 -32524 10234 29274 43678
2341 43678 36269 23908 5968 1037 11954 14971 1117 -12098 1972 11183 13086 -774 -6457
2328 -6457 9386 -8023 -11651 -8595 1555 4908 2464 3790 13659 29157 18868 -10875 -14425
2315 -14425 -16266 -5730 6286 -10712 -18035 -3786 -17318 -20573 -5053 -3675 -8775 -31459 -28548
2302 -28548 -19432 5587 24182 11737 10769 6281 -1012 1749 6796 3172 -6548 -17631 -29606 -26964
2288 -26964 -13278 -19047 -17124 10362 20998 19104 21630 9373 -6945 17610 38651 21575 -1858
2275 -1858 12593 14514 13026 -121 -4616 -23821 -8700 16889 24510 15451 -758 21690 5255
2262 5255 -2382 -7475 1191 27174 24125 3287 -3113 3892 14526 25022 32875 22316 -10881
2249 -10881 -987 3751 -6112 -3429 762 12126 7209 17897 32459 37504 24100 1399 4459
2236 4459 5533 10644 -7013 -6142 6312 -4174 -18362 -25055 4685 9605 6787 25190 31473 23661
2222 23661 23831 31483 21742 17970 9131 -17644 -6170 423 -3640 10089 -3504 -10025 5937 967
2208 967 -12595 -13933 -8877 -3130 1161 3248 -18252 -21795 -15219 -10740 -24075 -12060 -17726 -12383
2194 -12383 -33782 -47750 -36727 -23871 -15255 -23567 -3766 3762 -6614 -6955 -14770 12501 29757
2181 29757 45778 31888 23124 -5581 -21912 15999 32391 36214 27774 40150 23782 12370
2169 12370 -12324 -5475 -7128 8196 17953 33541 18916 25651 13277 -31522 -37124 -40040 -22406
2156 -22406 8541 29275 25112 -8846 -41344 -35161 -10573 1503 28349 54012 49032 29900
2144 29900 5051 14645 25564 30732 24302 3764 10675 3665 -7240 17759 6602 -3234 -594
2131 -594 -556 -9319 -21606 -20475 -17513 -8931 -2641 24254 18358 -5398 2325 20875 35286 11418
2117 11418 -4848 -3676 24288 13249 5701 7237 12970 11382 2591 -14511 -26061 -34027 -20131
2104 -20131 -25919 -30198 -7346 -5693 -28251 -26576 -28843 -33091 -41886 -49566 -33275 -4074 -2050 -11193
2090 -11193 -35965 -64633 -41539 -12858 -12908 -10028 -15131 -1548 -3787 -5502 25626 23034 9530
2077 9530 2000 7495 8519 -10861 -14520 -6376 -17634 -4981 8518 27117 34708 25345 31149 18579
2063 18579 15873 20536 13129 -18026 -7904 -1219 -20683 -13049 2182 -4784 -5243 -3586 -13453 -16462
2049 -16462 4644 12227 9411 15385 9943 1625 -8320 -8317 5575 12540 4156 -4560 -10755 -11676 -32342
2034 -32342 -25891 -14379 -11423 -4340 -1377 1078 -935 -2861 -2233 24515 25757 -5175 -19340 -13553
2020 -13553 -13470 -13740 -3033 -2497 -9730 -176 19296 2064 -212 -10085 2461 29012 20463 -5155
2006 -5155 -17508 -7839 8784 -568 -16164 -22531 -15382 17883 20542 -737 -18696 10752 42189
1993 42189 39888 23657 10484 19183 13721 -5307 19044 33224 5491 -24054 -29787 9077 37590
1980 37590 40768 4592 -4872 408 7654 2239 1961 -13447 -13465 -8156 4609 12137 35623 24350
1966 24350 13344 10966 10499 11463 -1717 -8619 -15030 4918 31891 43939 32856 17355 11843
1953 11843 22130 255 -34797 -38251 -2800 12379 17039 -20117 -32344 -20983 -860 14847
1941 14847 40266 24169 4154 6478 3674 17055 15996 -14679 -11652 -4374 -7918 -11317 -1378
1928 -1378 -16928 -28069 -38504 -30071 -9529 -13208 -11433 -11495 -1728 -6168 -24019 -32909 -34958 -22910
1914 -22910 -27908 -45946 -25243 6221 19097 15199 -9504 -14106 2633 6975 -8693 -6285 -2807
1901 -2807 -7185 -3043 425 6149 965 1179 -1041 -10624 -25792 -19118 -5478 -14651 -16348 -21268 -34662
1886 -34662 -34298 -8324 -1782 17089 41344 28121 -2375 -12812 5870 32923 34122 13400 -12360
1873 -12360 16458 9665 -29288 -33573 -30329 -43072 -23228 -10810 -24880 -9494 -13025 -17941 -5520
1860 -5520 15763 30528 14832 11795 20181 34890 21794 21960 8947 -6033 -19449 -9426 873
1847 873 -8047 2771 5409 -8081 -1198 -1758 9959 14786 2602 633 5874 1243 -26931 767
1833 767 1801 -12789 -24934 -21137 -19707 -4139 -9922 -9546 -31247 -18775 8284 21909 21268 36074
1819 36074 13702 885 -8783 -15239 1587 6420 12817 27780 31987 3345 -24566 -30105 -4131
1806 -4131 36588 53574 56898 29659 -7597 -36098 -27709 17163 23625 24358 33816 42463 48838 27069
1792 27069 29797 8862 -9335 -7759 13213 10247 18120 23809 23865 13965 -17408 -31955 -22855 -3956
1778 -3956 2354 7727 9847 15253 924 12740 34735 39390 16287 -6625 -33634 -60707 -70419
1765 -70419 -40597 -55962 -37943 -24920 -20277 -24870 -3736 26555 20310 4666 -33391 -36939 -32462
1752 -32462 -25619 -16096 -8226 -19634 -16651 3083 11923 15740 16145 12194 18044 20151 30349 36277
1738 36277 58573 77468 79882 71620 55960 51995 24255 -6901 -33868 -14941 -1567 -26703
1726 -26703 -50197 -43833 -47992 -28652 3209 -18853 -32493 -14375 -12595 -20052 -19811 -27180 -15517
1713 -15517 -14296 524 8326 196 -10878 -7397 -3612 1868 -11726 -27465 -33534 -11885 -7853
1700 -7853 -9963 -4159 -4187 -12527 -6247 4496 4128 -555 15189 21923 -2324 17007 24036 21454 20619
1685 20619 14927 -27102 -31816 -24665 -15585 14481 23878 2968 6493 1063 -2196 -10885 -24486 -52316
1671 -52316 -41128 12873 27771 8427 -9170 -19634 4252 8550 -13670 -12711 5951 12020 22029
1658 22029 16501 4660 -6672 -1733 20250 17702 -5358 -1809 5926 3778 -10581 17457 33180
1645 33180 20165 -2815 18506 32212 43625 35903 23336 30317 29778 32227 23705 5091 -9898
1632 -9898 -12573 -4321 -14095 -23001 -17962 9578 36392 21413 -12025 -21783 -18044 -5876 -15399 -11205
1618 -11205 -14030 -32851 -21629 -12671 -3123 16926 23474 22126 2658 5650 -4461 2226 19614
1605 19614 28780 24052 24893 18264 29954 17950 11009 39477 40380 24687 24298 30900 41834 34416
1591 34416 22584 26731 14547 13243 33651 33497 56894 61906 35061 26067 6179 -12399 -29297
1578 -29297 -34151 -15097 3238 8564 -2287 -16488 -37733 -28366 5832 39999 47417 40197 15035
1565 15035 20477 16344 9672 14136 12444 25926 20178 1991 26980 27014 27085 25146 24977 21498 12020
1550 12020 3971 -2367 814 -7194 7392 16957 11844 18438 -12836 -45325 -47531 -30613 -4393
1537 -4393 -12085 -19742 -17372 -8631 18142 10016 1113 16783 23852 44845 50674 32629 5876 4011
1523 4011 10027 17296 4975 -12961 -20737 -2201 17974 15578 18572 26175 19544 18575 32166 29104
1509 29104 15440 936 4589 -9666 -30858 -24430 -21012 7867 21852 50141 65069 35440
1497 35440 8798 -11379 -5026 3005 -8831 -22567 -5563 13414 1479 -7733 -10885 3621 22799
1484 22799 44107 26340 29633 20255 27118 17402 7147 -16509 -27043 -16730 -11731 -13433 -10644
1471 -10644 -14442 -22838 -35910 -29327 -11474 -11466 -4538 16556 11298 1765 -11810 -12214 30179 36210
1457 36210 28312 38055 58019 53579 13521 1059 3765 -3267 -8773 1934 14747 28844 23822
1444 23822 37154 33561 19609 18877 27341 10161 -14970 -24868 -20748 6317 31741 20234 -15223
1431 -15223 -40871 -23620 3519 -2342 -10244 4763 2180 -26374 -18514 8826 15419 14229 10097
1418 10097 14733 24448 32546 23864 12696 34022 45462 46497 59803 65350 56419 23704 -16060
1405 -16060 -17095 9187 2384 -3508 -17397 -10596 21968 21100 21536 14720 -12375 459 9135 -10752
1391 -10752 -11604 -28082 -41958 -38622 -51180 -47675 -37104 -11534 -9024 -17979 -5717 2982 -10967
1378 -10967 -13254 -3625 -511 10095 27190 37529 18052 22185 36399 39341 37460 18045 6246
1365 6246 6293 -19026 263 14742 -10991 -17966 -16894 -18927 -26620 -43094 -38015 -5534 7933 -6051
1351 -6051 -10063 -13734 -15977 -12599 1837 19489 30319 9549 -17297 1042 -11742 8620 3719
1338 3719 -10470 -12474 -20350 -12049 22643 28281 4134 24839 23843 32642 18274 18108 -673 7299
1324 7299 5985 16931 15741 3480 -27322 -42394 -28291 -18051 -25570 -13021 -7287 -1182 -1785
1311 -1785 13035 31571 23567 -4723 -2102 9717 11565 -18421 -23023 5708 13221 7816 -10821
1298 -10821 -23471 -8476 -16920 -42290 -34156 -15334 -15213 -17492 -11568 -415 -15589 -19193 -22598
1285 -22598 -27838 -14087 22629 39830 46195 56945 60670 34325 6372 -20330 -27135 -17586 14051
1272 14051 13050 19434 14947 3795 15186 25509 37617 28382 36393 32969 10966 18986 34960
1259 34960 27665 39645 51025 6508 -672 -6706 -41828 -35666 -20271 -28087 -14129 10730 18399
1246 18399 19709 -654 -5646 2968 5580 2090 14869 19016 15851 11167 5234 28395 21126 -6720
1232 -6720 -1776 1339 -27949 -40115 -25364 -26877 -22893 -303 -3108 -16880 -19687 -15585 -12519 -2650
1218 -2650 14673 6182 17306 17627 12281 25220 11691 -20318 -33290 -23688 -5620 10225 -1422
1205 -1422 661 -9044 -31606 -49671 -25715 5379 5521 18120 19927 31071 31465 5358 18053
1192 18053 36333 43909 19155 3267 9360 36787 42559 9671 2290 -6507 -12119 1142 12220
1179 12220 6919 -18193 -3670 31373 35057 21497 16400 22124 8108 12811 -3339 -23910 -17489
1166 -17489 9631 23111 -8307 -36022 -19581 -15413 3640 18887 17932 25626 27723 36693 41552
1153 41552 28819 28737 20599 7413 15674 20514 17379 -115 8463 16020 32167 35698 32765 20396
1139 20396 4569 7493 16397 30721 35600 18268 10293 -12194 -29771 -16742 -9706 -10306 -16645
1126 -16645 922 5018 -6645 14043 19133 27565 37204 18112 1001 14636 30416 45547 25242
1113 25242 10666 17323 14887 -10097 -5760 1046 -1118 10467 3017 593 21466 21558 24884 12584
1099 12584 4454 -4210 -11004 13333 18392 5073 2592 5522 12743 11372 -587 -6489 -8528 -21202
1085 -21202 -37638 -23816 -12841 -19885 -6991 -5414 9659 15059 19335 21987 6223 -15417 -23971
1072 -23971 -29616 -28164 -28996 -18169 -20258 -22056 -23302 -25439 -6699 -46 -3332 15374 10008 3065
1058 3065 12323 -10797 6867 11245 20126 4853 -8570 6739 6258 9680 17955 23889 30923 25003
1044 25003 22052 18703 8361 31752 38987 31151 30759 35724 22174 20764 33064 35977 35550 38459
1030 38459 43004 21895 4328 5019 -1543 -18571 -6721 3779 11442 5009 8463 5805 -5761
1017 -5761 -12826 -24424 -13121 -14005 -11538 15719 38563 22795 11992 -2366 -13868 -41773 -63622
1004 -63622 -34111 -5928 9118 12166 16003 15162 2221 -6072 3508 7787 18701 9413 -4946
991 -4946 6846 -1594 -2425 -5721 -8017 19084 25121 37978 12894 -30137 -23576 -1792 -3945 1561
977 1561 13735 -8867 -25524 -13987 -15533 -39933 -46481 -57189 -47886 -20156 -2922 -10409 -2241
964 -2241 22105 30938 10872 16292 31715 28427 16256 29945 41965 35913 16060 -11167 -14284
951 -14284 -5187 -17877 -14921 -884 9615 6482 -2038 -8678 -13896 -12901 -6622 -16641 -14370 -17781
937 -17781 -23896 859 14328 22564 16983 10955 5322 6546 3106 -532 -9259 10903 4538 -10993
923 -10993 -104 1365 6323 -2509 -30169 -26402 -696 4776 27186 24725 11315 -7049 -12312
910 -12312 -13978 -21539 -28809 -12518 -2960 27354 29038 24828 18399 27784 33704 28076 41897 31698
896 31698 12815 18390 32705 24604 4967 306 11697 15958 10833 9231 9062 12685 -25774 -21870
882 -21870 -8522 -10043 3700 -11363 -21129 -18895 6166 -1848 -19504 -20401 350 715 -8079 13993
868 13993 27874 27218 33185 17490 465 -725 10050 45987 76735 52865 46283 37161 45060
855 45060 28794 14811 10098 9877 7030 -12295 -5306 10823 11694 506 934 -13024 -4300 10308
841 10308 11055 -980 -4277 5933 38758 28489 24515 23364 15412 14030 26742 23598 -4001 10699
827 10699 9368 -24559 -32347 -40673 -46931 -24164 -9674 -16297 -14356 -15596 -21312 -11262 -17336 -1947
813 -1947 10722 -9725 -13202 8100 -3688 6557 21572 14779 26338 20663 10554 9717 -25005
800 -25005 -23068 -24636 -15118 -35635 -37815 -19513 5991 19984 3011 -16235 -11888 -202 -5263
787 -5263 -25626 -12814 14924 2524 -14041 -55807 -60174 -54989 -35446 -31837 -32853 -31182 -15430
774 -15430 12616 21807 3543 18507 6997 -340 -42649 -41906 -27312 -12472 -7098 6499 13384
761 13384 10199 -5186 6121 -3801 134 15055 -1978 -17586 -15899 -26558 -26848 -17747 -28387
748 -28387 -32679 3616 11404 516 -2806 -2036 -10127 -3263 -4 -13809 -28144 -26545 -20906 -24062
734 -24062 -1635 10593 24808 2904 -11946 6038 18587 18285 -5665 -37626 -26228 -28495 -24728
721 -24728 -20698 359 16889 21217 -6985 -11954 4154 -17745 -23442 -1947 6748 6757 -5169 -3331
707 -3331 7810 4174 -11543 -3779 6431 -12569 -25998 -28324 -9970 -3905 -10470 -16575 -13349 -5380
693 -5380 6058 -4930 13731 24393 30569 1998 -13610 -18889 -15724 -25496 -26513 -18127 -33786
680 -33786 -32675 -4047 6842 24428 22717 -14713 -38151 -25881 -17639 17566 -12103 -4313 -857
667 -857 -80 8098 -8157 -27572 -28939 -13162 -16400 187 8858 -13517 -6800 22791 21352 18456
653 18456 6747 12962 -14655 -10344 23856 22002 -9875 -37921 -18386 -6974 -4172 -2230 -25182
640 -25182 -47467 -27468 -14485 -6629 -16107 -26074 -17105 -4649 1578 -11341 -25056 6700 33976
627 33976 38240 24376 1088 -24195 -32637 -23779 -33774 -1487 7660 3344 11848 -1395 -30365
614 -30365 -27654 -16197 -2002 -6086 6595 -9571 -27342 -33570 -17792 -3736 -11549 7538 7234
601 7234 -4408 -9188 -5506 -10205 -16015 -7853 -4286 -10575 -6853 7294 3358 -22567 -41161 -15016
587 -15016 -5511 -3517 -31041 -49932 -48572 -36655 -16965 -26352 -31050 -51441 -49435 -53322 -54156 -42611
573 -42611 -33549 -12264 -6985 -284 -5687 6293 17594 3477 8243 37057 53240 45995 24354
560 24354 8481 4758 -3755 -27287 -45637 -28185 -36985 -23312 1931 10095 8291 -7307 3294
547 3294 2928 -9091 -7894 -11296 -17975 -1953 -5605 7169 4490 -7297 -22182 -37449 -39145 -28108
533 -28108 -32013 -10487 13197 14113 9041 -6490 -13544 -5936 -42388 -45158 -20872 -12553 -20936 -27687
519 -27687 -7130 12908 1242 1930 5579 6136 -3293 -10440 -7098 -1063 19026 26039 32003 37697
505 37697 14935 -3190 -13319 -20660 -17475 1340 7455 4367 -15617 -25473 -7453 10736 11094
492 11094 -1491 -23203 -5082 -196 -25990 -57105 -40041 -37900 -39042 -49768 -39710 -28101 -38937
479 -38937 -10519 12437 14275 20963 9182 15154 29282 27044 22140 28929 41599 34647 31022 15008
465 15008 6080 20925 15692 7533 9009 -5662 -38674 -29166 -27749 -22817 1351 13442 7133 2749
451 2749 -11326 -10182 -12021 -33959 -22942 -13660 -37801 -30346 -21911 -38778 -44734 -37654 -47750 -44602
437 -44602 -34327 -31238 -27201 -6813 -9045 371 3146 -7372 7231 18916 7143 -1367 7344
424 7344 6310 -10224 -18328 -21209 -36142 -34938 -22370 -14605 -10263 -3648 -14245 4472 28207 37375
410 37375 23182 -6709 -13387 3735 -4538 -12252 -15538 -15598 -3033 -12793 -20735 -11403 11044 -8185
396 -8185 -5619 15492 8532 2401 -11609 -18208 -10882 -6225 -14733 -9811 12005 22831 8445 -4126
382 -4126 -9879 -5284 -7047 -3327 9261 -11 -21844 -21572 -23016 -20560 -21992 -33268 -37393 -25737
368 -25737 -19164 -27622 -12478 -7433 4143 1182 26041 27172 20248 42804 34518 15882 18527 19925
354 19925 24377 11206 1677 -3310 -13287 -21028 90 -360 -14170 -7557 -15598 -24036 -12406 -22923
340 -22923 -18441 5779 2127 1856 -5766 -11301 -15724 -23614 -33007 -8717 12396 2680 -12547 -21811
326 -21811 -33448 -23800 -18307 -12390 -13612 -33107 -29883 -22910 -37598 -54417 -52558 -42554 -11000
313 -11000 10450 8726 15610 32529 22281 19314 10883 2246 -4740 -3885 -17000 -26697 -24297 -27674
299 -27674 -20036 -32850 -29093 -30650 -33200 -15332 -4777 -6246 3015 9692 21404 21580 13643 7765
285 7765 -4775 -31301 -34673 -35933 -43442 -22361 -3144 -5926 -19725 -14108 11530 7455 14467 3447
271 3447 -9818 -21754 -12521 -24778 -17766 -17788 -19529 -13479 -28517 -39827 -24520 -5677 2130 3485
257 3485 -6351 -9608 -9980 -10570 -36903 -23295 1346 9574 8272 20124 10771 -22610 -23487 -1476
243 -1476 1804 -16273 -33344 -14773 -4020 -27447 -26911 -9209 -1898 -4719 -19271 -23502 -19725 -16452
229 -16452 -5844 -6686 715 10104 5744 5206 2289 2634 -21227 -29886 -30687 -11932 2873 13628 -4621
214 -4621 -18590 3705 20309 17208 -13813 -27255 -26225 -10537 -7629 -7215 3525 -6976 -9147
201 -9147 -9172 -30748 -43728 -39146 -26065 -23020 -20056 -5092 -2164 9219 -6440 -12678 -13805 -7011
187 -7011 -3838 -9147 -5316 -23895 -27629 -30306 -27071 -13972 -2079 -6363 -2219 -5869 -21049 -27168
173 -27168 -24336 -17098 -11625 7633 -896 -848 -15952 -19026 -6281 12655 20764 9735 -11355 -11704
159 -11704 -14369 -29291 -38238 -28851 -11388 673 13464 13032 5874 -5396 -6304 6065 14357 8116
145 8116 12877 21372 4864 -21552 -14107 13287 26118 12714 -4936 5425 10877 -20658 -22482
132 -22482 -7898 -1661 -9965 -18734 -5207 5193 1869 -2993 9342 16457 10726 7227 20926 17766
118 17766 -1619 982 -12352 -33845 -17483 -16762 -18834 -29592 -18781 -14156 -14901 -9149 -5462 -16522
104 -16522 -36136 -26549 -9521 -19488 -24898 -23806 -30605 -32394 -35566 -27369 -19541 -24440 -21827 -18906
90 -18906 -28113 -32841 -23156 -9876 -10255 -9933 -8467 -3881 1582 -1156 -7029 6279 18742 27338 37261
75 37261 36243 28989 -301 -26278 -31042 -31468 -28697 -23583 -14795 -6366 -2447 -5145 -5388 8292 27252
60 27252 25041 10466 13098 25153 15531 3185 13153 19677 -4392 -22297 -27025 -10909 -18648 -33216
46 -33216 -25161 -26770 -27258 -18939 -9721 -15966 -14236 -11616 -724 16630 519 -2806 -8036 -25319
32 -25319 -5440 -7105 -2385 677 -3987 -22245 -19679 -8731 -9840 -22728 -22088 -24807 -23429 -25025
18 -25025 -23277 -17952 -18170 -17369 -18399 -21052 -27738 -14306 -10242 -3884 5533 2712 -3879 -4089 -9546 -4198
2 -4198 1018 6152
0 6152
$$ Imaginary data points
##PAGE= N=2
##DATA TABLE= (X++(I..I)), XYDATA
32767 72903 76783 81549 84103 101069 112014 102561 95620 87754 87702 71425 60693 75851 112089
32754 112089 120725 124633 121946 108925 109397 104239 94847 93854 101310 98138 88140 85899 84539 90172
32740 90172 101924 102222 116683 122888 123961 105297 86399 106472 124638 122593 122520 129952 133182 132961
32726 132961 133972 130325 120834 112601 123680 128836 121219 118413 103117 92393 97136 96079 100202
32713 100202 113712 123481 140198 157035 164888 162968 163346 152038 145373 154171 137904 140907 146571
32700 146571 153892 160567 155687 155901 162713 172794 195897 198201 187926 158553 146504 137918 128200
32687 128200 135547 144841 155655 157516 160759 162743 155669 139818 126216 138314 137973 158994 163163
32674 163163 147974 147182 147777 148372 152499 160569 158027 158701 150002 147415 176309 193490 186371 177998
32660 177998 195629 213730 197889 176091 179871 191922 173190 157558 144203 148075 156922 157846
32648 157846 159584 155258 158548 166604 176137 179038 176104 166673 158364 160013 163209 173193 201491 206902
32634 206902 199889 194392 195642 212174 220362 221085 207771 189128 189433 187403 187152 178323 181681 186906
32620 186906 182624 192615 203190 209955 215345 205623 210453 223346 212833 216658 218573 206351 212021
32607 212021 206164 195500 189853 212478 222578 223425 236283 252012 251502 233249 238563 238975 207977
32594 207977 210729 232788 247958 243386 213815 220034 224539 219200 222482 227966 226823 224527 240620
32581 240620 223673 230204 251506 263271 251556 254162 258977 246486 233232 219290 217028 219920
32569 219920 229852 242332 256209 259938 268902 261263 252103 245501 254019 247570 245871 248995 253600 256006
32555 256006 253443 258043 251792 236033 247489 275948 287025 266473 267145 266463 254176 245084 252225
32542 252225 253142 254275 262853 265499 257782 267322 263342 248221 247897 275134 304477 274170 271077 258386
32528 258386 263489 272070 279781 279373 282315 286650 294228 284694 270765 250557 251191 264109 270751 271146
32514 271146 290303 290412 281532 257625 248492 233720 244388 285290 294971 294310 290781 281016 282551
32501 282551 295052 286371 305443 312016 325114 320053 324452 307862 288287 298195 312793 323325
32489 323325 315266 311616 296678 287006 302183 302597 282907 266470 277418 287881 265476 271316 277351
32476 277351 272430 253407 257035 282218 293747 289290 301016 303351 308304 293070 288191 301007 302189
32463 302189 308335 317142 301407 305820 324649 324072 316656 308863 280610 270426 284151 286952 296260
32450 296260 291374 286314 300936 308470 301826 294620 296030 305114 299312 305909 315777 341081 334778 324559
32436 324559 320138 312936 299772 295105 284041 304498 306079 284541 300323 296560 307257 327665
32424 327665 334232 311022 317240 317747 315971 307666 289179 303928 311148 326939 334183 321264 301306
32411 301306 295149 304721 307032 320264 315618 331215 356715 360218 359791 355718 342364 299630 309132
32398 309132 333426 344219 346410 329204 317280 328517 330438 336779 327698 329318 327175 325337 337925
32385 337925 329327 342980 352832 347030 357525 338662 347076 359275 318573 310186 332619 330191 328037
32372 328037 331776 338255 370623 376534 376709 376102 384284 384275 385828 364457 359769 359190 329827 298213 299018
32357 299018 329931 332789 322716 308662 297907 313358 344129 354366 372339 369906 359090 354718
32345 354718 352544 356426 356734 345866 337004 336784 338236 325885 334280 334345 340675 326381 352427 369719
32331 369719 386307 378298 357757 358072 365455 350024 379137 381624 354039 335638 322564 317460 316417
$$ [...]
##END NTUPLES=NMR SPECTRUM
##END=
