##TITLE=Analysis number 328887
Compound Code cc 62201
Book Reference 518/145
Project Code adrs
Chemist Name colinb
##JCAMPDX= 6.0         $$ Bruker NMR JCAMP-DX V2.0
##DATA TYPE= NMR SPECTRUM
##DATA CLASS= NTUPLES
##ORIGIN= Bruker BioSpin GmbH
##OWNER= nmr
$$ XWIN-NMR		Version 3.5
$$ Fri Jul 13 08:36:40 2007 GMT Daylight Time (UT+1h)  MAYBRIDGE\nmr@NMR_250MHZ
##.OBSERVE FREQUENCY= 250.131544655141
##.OBSERVE NUCLEUS= ^1H
##.ACQUISITION MODE= SIMULTANEOUS (DQD)
##.ACQUISITION SCHEME= undefined
##.AVERAGES= 16
##.DIGITISER RES= 18
##SPECTROMETER/DATA SYSTEM= dpx250
##.PULSE SEQUENCE= zg30
##.SOLVENT NAME= DMSO
##.SHIFT REFERENCE= (INTERNAL, DMSO, 0, 16.522)
##AUDIT TRAIL= $$ (NUMBER, WHEN, WHO, WHERE, WHAT)
$$ ##TITLE= Audit trail, XWIN-NMR		Version 3.5
$$ ##JCAMPDX= 5.01
$$ ##ORIGIN= Bruker BioSpin GmbH
$$ ##OWNER= nmr
$$ C:\u/data/dgb/nmr/ADRS/900/pdata/1/auditp.txt
$$ ##AUDIT TRAIL=  $$ (NUMBER, WHEN, WHO, WHERE, WHAT)
(   1,<2007-07-13 08:36:21.72 +100>,<MAYBRIDGE\nmr>,<NMR_250MHZ>,
      <created by zg, POWCHK disabled, PULCHK disabled
       configuration hash MD5:
       76 6E 9A 78 1E 09 19 81 EC 84 63 8F B0 6A 59 2D
       data hash MD5: 64K
       77 02 D3 AC ED AE 68 06 7F 8E 26 30 06 F1 E5 94>)
(   2,<2007-07-13 08:36:33.28 +100>,<MAYBRIDGE\nmr>,<NMR_250MHZ>,
      <Start of raw data processing
       ef LB = 0.3 FT_mod = 6 PKNL = 1 SI = 32K 
       data hash MD5: 32K
       7B 20 9E A6 A9 77 04 1A 6F E9 6A 98 FD F7 2E 7D>)
(   3,<2007-07-13 08:36:34.89 +100>,<MAYBRIDGE\nmr>,<NMR_250MHZ>,
      <apk 
       data hash MD5: 32K
       61 C8 6F F6 9F 92 91 CD 4F EA A0 4D 93 E6 20 4D>)
(   4,<2007-07-13 08:36:35.70 +100>,<MAYBRIDGE\nmr>,<NMR_250MHZ>,
      <abs ABSG = 5 
       data hash MD5: 32K
       61 04 71 2B 97 23 A6 09 71 09 C3 28 A0 00 CE AC>)
$$ ##END=
$$ 
$$ hash MD5
$$ 65 5C 3D CA 47 6E 5F 95 89 22 B7 9F D5 A4 C4 B1
##$RELAX= 
##$RELAX= 
##$RELAX= 
##$RELAX= 
##$RELAX= 
##$RELAX= 
##$RELAX= 
$$ Bruker specific parameters
$$ --------------------------
##$DU= <C:\u>
##$EXPNO= 900
##$NAME= <ADRS>
##$PROCNO= 1
##$TYPE= <nmr>
##$USER= <dgb>
##$AMP= (0..31)
100 100 100 100 100 100 100 100 100 100 100 100 100 100 100 100 100 100 
100 100 100 100 100 100 100 100 100 100 100 100 100 100 
##$AQSEQ= 0
##$AQ_mod= 3
##$AUNM= <au_zg>
##$AUTOPOS= <3 >
##$BF1= 250.13
##$BF2= 250.13
##$BF3= 250.13
##$BF4= 250.13
##$BF5= 500.13
##$BF6= 500.13
##$BF7= 500.13
##$BF8= 500.13
##$BYTORDA= 1
##$CFDGTYP= 0
##$CFRGTYP= 5
##$CHEMSTR= <none>
##$CNST= (0..31)
1 1 145 1 1 1 1 1 1 1 1 1 1 1 1 1 1 1 1 1 1 1 1 1 1 1 1 1 1 1 1 1 
##$CPDPRG= <>
##$CPDPRG1= <>
##$CPDPRG2= <>
##$CPDPRG3= <>
##$CPDPRG4= <mlev>
##$CPDPRG5= <mlev>
##$CPDPRG6= <mlev>
##$CPDPRG7= <mlev>
##$CPDPRG8= <mlev>
##$CPDPRGB= <>
##$CPDPRGT= <>
##$D= (0..31)
0 1 0 0 0 0 0 0 0 0.06 0 0 0 0 0 0 0.0002 0 0 0 0 0 0 0 0 0 0 0 0 0 0 
0 
##$DATE= 1184312180
##$DBL= (0..7)
120 120 120 120 120 120 120 120 
##$DBP= (0..7)
150 150 150 150 150 150 150 150 
##$DBP07= 0
##$DBPNAM0= <>
##$DBPNAM1= <>
$$ [...]
##$SUBNAM7= <"">
##$SUBNAM8= <"">
##$SUBNAM9= <"">
##$SW= 20.6930455092707
##$SWIBOX= (0..15)
0 0 3 0 0 0 0 0 0 0 0 0 0 0 0 0 
##$SW_h= 5175.983436853
##$TD= 65536
##$TD0= 1
##$TE= 296.16
##$TE2= 300
##$TE3= 300
##$TEG= 300
##$TL= (0..7)
0 120 120 120 120 120 120 120 
##$TP= (0..7)
150 150 150 150 150 150 150 150 
##$TP07= 0
##$TPNAME0= <>
##$TPNAME1= <>
##$TPNAME2= <>
##$TPNAME3= <>
##$TPNAME4= <>
##$TPNAME5= <>
##$TPNAME6= <>
##$TPNAME7= <>
##$TPOAL= (0..7)
0.5 0.5 0.5 0.5 0.5 0.5 0.5 0.5 
##$TPOFFS= (0..7)
0 0 0 0 0 0 0 0 
##$TUNHIN= 0
##$TUNHOUT= 0
##$TUNXOUT= 0
##$USERA1= <user>
##$USERA2= <user>
##$USERA3= <user>
##$USERA4= <user>
##$USERA5= <user>
##$V9= 5
##$VALIST= <valist>
##$VCLIST= <CCCCCCCCCCCCCCC>
##$VD= 0
##$VDLIST= <DDDDDDDDDDDDDDD>
##$VPLIST= <PPPPPPPPPPPPPPP>
##$VTLIST= <TTTTTTTTTTTTTTT>
##$WBST= 1024
##$WBSW= 4
##$XGAIN= (0..3)
0 0 0 0 
##$XL= 0
##$YL= 0
##$YMAX_a= 213937
##$YMIN_a= -246481
##$ZGOPTNS= <>
##$ZL1= 120
##$ZL2= 120
##$ZL3= 120
##$ZL4= 120
##$ABSF1= 16.522
##$ABSF2= -4.171173
##$ABSG= 5
##$ABSL= 3
##$ALPHA= 0
##$AQORDER= 0
##$ASSFAC= 0
##$ASSFACI= 0
##$ASSFACX= 0
##$ASSWID= 0
##$AUNMP= <proc_1d>
##$AZFE= 0.1
##$AZFW= 0.1
##$BCFW= 0
##$BC_mod= 0
##$BYTORDP= 0
##$COROFFS= 0
##$CY= 12.5
##$DATMOD= 1
##$DC= 0
##$DFILT= <>
##$DTYPP= 0
##$F1P= 14.0000005364418
##$F2P= -0.99999901652339
##$FCOR= 0.5
##$FTSIZE= 32768
##$FT_mod= 6
##$GAMMA= 0
##$GB= 0
##$INTBC= 1
##$INTSCL= 1
##$ISEN= 128
##$LB= 0.3
##$LEV0= 0
##$LPBIN= 0
##$MAXI= 10000
##$MC2= 0
##$MEAN= 0
##$ME_mod= 0
##$MI= 0
##$NCOEF= 0
##$NC_proc= -6
##$NLEV= 6
##$NOISF1= 0
##$NOISF2= 0
##$NSP= 0
##$NTH_PI= 0
##$NZP= 0
##$OFFSET= 16.522
##$PC= 1
##$PHC0= -64.58083
##$PHC1= 13.88399
##$PH_mod= 1
##$PKNL= yes
##$PPARMOD= 0
##$PSCAL= 4
##$PSIGN= 0
##$REVERSE= no
##$SF= 250.13
##$SI= 32768
##$SIGF1= 0
##$SIGF2= 0
##$SINO= 400
##$SIOLD= 32768
##$SREGLST= <1H.DMSO>
##$SSB= 0
##$STSI= 32768
##$STSR= 0
##$SW_p= 5175.98343685301
##$SYMM= 0
##$S_DEV= 0
##$TDeff= 65536
##$TDoff= 0
##$TI= <Analysis number 999999
Compound Code 99
Book Reference 9
Project Code 9>
##$TILT= no
##$TM1= 0
##$TM2= 0
##$TOPLEV= 0
##$USERP1= <user>
##$USERP2= <user>
##$USERP3= <user>
##$USERP4= <user>
##$USERP5= <user>
##$WDW= 1
##$XDIM= 32768
##$YMAX_p= 454750757
##$YMIN_p= -1000944
$$ End of Bruker specific parameters
$$ ---------------------------------
##NTUPLES= NMR SPECTRUM
##VAR_NAME=  FREQUENCY,     SPECTRUM/REAL,   SPECTRUM/IMAG
##SYMBOL=    X,             R,               I
##VAR_TYPE=  INDEPENDENT,   DEPENDENT,       DEPENDENT
##VAR_FORM=  AFFN,          ASDF,            ASDF
##VAR_DIM=   32768,         32768,           32768
##UNITS=     HZ,            ARBITRARY UNITS, ARBITRARY UNITS
##FACTOR=    0.157963299565203, 1,           1
##FIRST=     4132.6476996994, 0,             0
##LAST=      -1043.33573715361, 0,           0
##MIN=       -1043.33573715361, -1000944,    0
##MAX=       4132.6476996994, 454750757,     0
$$ Real data points
##PAGE= N=1
##DATA TABLE= (X++(R..R)), XYDATA
$$ [...]
22793C24886k60674J53185k15264j13098K10819M7344N4574r4165m0070L58058
22783D25595m4291m0310Q5202k4510n0781k6072k8506n4128Q6148k6321j21067
22772A80959J07408j84732l13420L3363J01247M1228o3470M1052N4978Q0431k95284
22761b16240n4036l1565Q396P3769O4796M11474j4286m2693j99034R375m7649
22750c7693j36305R0639J07199J31210m357l27838k54892J37293j42567L8536
22740c98775L25553k04534l98601R6359K64929J26159O2130k64087j81192Q3247
22730d88812K49533L5737J73028J28338K09732N9959k3766j07013k32842j37745
22720a33851o6156n4902j38733k86136j06964L68562M51330K02815O5116J57143
$$ plain form
22793 324886 64212 217397 2133 -110965 99854 147198 201772 107607 67537 425595
22783 425595 381304 340994 426196 401686 350905 324833 296327 242199 328347 302026 180959
22772 180959 288367 103635 -209785 -176422 -75175 -33947 -97417 -56365 -1387 79044 -216240
22761 -216240 -270276 -301841 -293445 -219676 -154880 256594 242308 199615 581 9956 -37693
22750 -37693 -173998 -83359 23840 155050 150693 -177145 -432037 -294744 -437311 -398775
22740 -398775 -73222 -277756 -676357 -579998 -315069 -188910 -126780 -390867 -572059 -488812
22730 -488812 -239279 -203542 -30514 97824 307556 367515 343749 236736 3894 -133851
22720 -133851 -200007 -254909 -393642 -679778 -786742 -418180 33150 235965 301081 458224
22710D58224J42283j63914j06986R7861n2132m11028m7609J09626J5483J09061
22700A50869P0792m0814j40521p7006M069L8299J91017P468j25795o17828o2669
22689f02119J1884L37524J01814J23233J15832j48474j26918l0837K28086K6444
22679C6469n6932r5817J23595O1801j8128j1436j02923k63562n6089K74767L2964
22668g5291j34520n856j4248j60879j53139M2594L24102K90117K65248O7627q016
22657D37739k7076l95023j17291j12054M06126P2333n194J76194j97381j57469
22647H0904R470o546l1865k48070P006K26710P3012k20691J25906N0611J41536
22636B07983L11532k38110j58044l2074K47736J8080j49899j2167k47950R4046
$$ plain form
22710 458224 600507 436593 329607 427468 375336 -35692 -83301 26325 41808 150869
22700 150869 221661 180847 40326 -36680 -32611 5688 196705 204173 78378 -539450 -602119
22689 -602119 -590235 -252711 -150897 -27664 88168 -60306 -187224 -218061 10025 36469
22679 36469 -20463 -116280 7315 69116 50988 39552 -63371 -326933 -383022 -108255 -75291
22668 -75291 -209811 -215667 -229915 -390794 -543933 -501339 -177237 112880 378128 445755 437739
22657 437739 410663 15640 -101651 -213705 192421 264754 259560 435754 238373 80904
22647 80904 90374 83828 51963 -196107 -189101 37609 110621 -110070 15836 66447 207983
22636 207983 519515 281405 123361 91287 339023 357103 207204 195037 -52913 41133
22626D1133Q1825j21502j63016J61021p4544j16109K55110m0013j22865J03486
22616D526k22294R679M2848j71846o7703m2947J85724M50286q5874m24581J74510
22605a47672L47238P6790j70519O6501K31508R7743M614l5441o3924k86085k74159
22594a53406k6350N2389R0607o6401k43823j24029J19055R6018K40332J11547
22584I5939p1927N4418j39425j6506N2399J92344K20018Q7230j45089k60325k60857
22573a91781O2886P9642O5833M2072k56062q7960j72764j47707J66127k32372
22563f72086j23326M04787L59520K87750L8517m9223j83114j22872Q4646p8415
22553e3816k08582j40823m5325K94633K67409J7228J07478j1041J5762k58117
$$ plain form
22626 41133 122958 1456 -161560 -539 -75083 -191192 63918 23905 -98960 4526
22616 4526 -217768 -208089 -165241 -337087 -404790 -447737 -262013 188273 102399 -322182 -147672
22605 -147672 199566 276356 105837 172338 403846 501589 506203 470762 406838 120753 -153406
22594 -153406 -179756 -127367 -36760 -103161 -346984 -471013 -351958 -255940 -15608 95939
22584 95939 24012 78430 -60995 -77501 -25102 167242 387260 474490 329401 69076 -191781
22573 -191781 -128895 -49253 16580 58652 -197410 -285370 -458134 -605841 -439714 -672086
22563 -672086 -795412 -390625 -31105 256645 295162 245939 62825 -60047 24599 -53816
22553 -53816 -262398 -403221 -448546 -153913 113496 130724 238202 227161 242923 -15194
22543a5194j70487r4656j09121J89494J63469J05450l4121O5720O8387p3911k06956
22532a11926o0663O0687K1299M9406K28971N1596k56420j52596J78427n4757n5478
22521a01454K94984L63627p0828j63690l36175l97735L6597K58089j7140j56808
22511b90533j2426M5976j95147j91858K37638J26475R1350j9764k0891j2925Q2975
22500a59130J31645k79303o0764M2102N0296p2305M9724K39680Q6788r2174o0202
22489a23643N7995n2611J22341j76058j96289l6690J33229K62780J85240k75623
22479i9329p3376Q8477r9026Q342j82537R7965N13406J00304k62472R1982J6616
22468B00352r8142K4527J17423l1484l27935J46984m0339k07780p5696Q9220p4768
$$ plain form
22543 -15194 -185681 -280337 -389458 -199964 -36495 68955 34834 100554 168941 95030 -111926
22532 -111926 -172589 -111902 -90603 -41197 187774 239370 -17050 -169646 8781 -45976 -101454
22521 -101454 193530 557157 486329 322639 -13536 -411271 -374674 -116585 -133725 -290533
22511 -290533 -302959 -256983 -452130 -643988 -406350 -279875 -188525 -208289 -229180 -242105 -159130
22500 -159130 -27485 -306788 -367552 -325450 -275154 -347459 -297735 -58055 28733 -63441 -123643
22489 -123643 -65648 -118259 4082 -171976 -368265 -404955 -271726 -8946 176294 -99329
22479 -99329 -172705 -84228 -183254 -174912 -357449 -259484 253922 354226 91754 183736 200352
22468 200352 102210 126737 244160 212676 -115259 31725 -8614 -216394 -292090 -202870 -277638
22457b77638O0857J53044Q2625J31563j52339L6784J74652J77657j19842L4346
22447C01709p8786j21739N017L3960J06726P445m05024k15761M6140O0330J52311
22436a07672O7252r0784j92416J01424K60186K11186m3881l8798k30338l93146
22426d56987J92296M8893R7424j76943j01757N5014j6898J00597K46268L4538
22416B2445j80684q0763n1434l443J14189l3536K0137p4861j61126r2049J08531
22405d12594J45559L7105k20125j52564M34262M28772r5335l52613o6984M38469
22395A83952p4914q292L4570j57131K0977R5142L41699k3054l81051l36299j71565
22384d75966J85197M36464N2391j28451K05763O0707j04617q9018j68943Q166
$$ plain form
22457 -277638 -216781 -63737 18888 150451 -1888 34896 209548 387205 267363 301709
22447 301709 222923 101184 106201 140161 246887 254332 -150692 -366453 -320313 -259983 -107672
22436 -107672 -40420 -131204 -323620 -222196 37990 249176 205295 166497 -63841 -456987
22426 -456987 -264691 -215798 -118374 -295317 -397074 -342060 -358958 -258361 -12093 22445
22416 22445 -158239 -239002 -290436 -293879 -179690 -213226 -193089 -267950 -429076 -521125 -412594
22405 -412594 -267035 -229930 -450055 -602619 -168357 260415 165080 -187533 -254517 183952
22395 183952 109038 100746 135316 -21815 -838 94304 436003 412949 31898 -304401 -475966
22384 -475966 -290769 145695 198086 69635 275398 336105 231488 142470 -26473 -18307
22374a8307l3950R4823O592k66769j09439J23411L27374N8355j35810k24497J01373
22363g6844J80629k15510m2786L78224J58163M6125K8570k20666j20855j72263
22353e7213m4450J5060J14238K43927j36203n8086j50805J75342j98210j48104
22343b44504L08820j245k61778j08517N8575n3683k10141J37800K17590J49080
22333h003m7443j44061L8406Q4181N2675J717P578j6704p6128R4056L19081j27411
22321A77944k69520l02457M1691k5084J29560J48665j8439J93146J51971J2520
22311B39997l00976n7525K32175q9545J17107J50141K499m32106k26654n121K3717
22300c46291N42944L0961k02026J98354q4456k29709q0568l5064J15642K63537
$$ plain form
22374 -18307 -52257 42566 49158 -217611 -327050 -203639 123735 182090 46280 -178217 -76844
22363 -76844 103785 -111725 -154511 223713 381876 428001 456571 235905 115050 -57213
22353 -57213 -101663 -86603 27635 271562 135359 77273 -73532 101810 -96400 -244504
22343 -244504 64316 63071 -198707 -307224 -248649 -302332 -512473 -374673 -157083 -8003
22333 -8003 -55446 -199507 -161101 -76920 -24245 -22528 -14950 -31654 -107782 -13726 305355 177944
22321 177944 -91576 -394033 -352342 -377426 -247866 -99201 -117640 75506 227477 239997
22311 239997 -60979 -118504 113671 24126 141233 291374 293873 -138233 -364887 -370008 -346291
22300 -346291 196653 227614 25588 223942 139486 -90223 -170791 -205855 -90213 173324
22290A73324n5745j63300Q9714j7528P1490O3692j21696q5635p7367P4163k8327
22279g7215q8331m4171n3637J39094n0033n7504K48789R9618J14238R6350j76312
22268A50886m8717K52111J53007l03329O2439J64931j517o0561m86376q4822K06358
22257D410J91773l9606L028Q9320k6806j7671K433j37707j41517m9383J70641
22246D8915J38299o9718P9571N2423k1417j3004K20599j82478j21527K4327J2073
22235A68063k49333l78240n150L38406J32190j35618j17383K98964J39540r095
22225A82344K5199k08680j01294M42836M7724j30331p4389p3459K01448L8249
22215C49647j25990R6476j20620j01154J08319k08998K6143K11771k5612K12082
$$ plain form
22290 173324 117579 -45721 43993 26465 97955 161647 39951 -45684 -123051 -48888 -77215
22279 -77215 -165546 -209717 -263354 -124260 -174293 -231797 16992 116610 230848 327198 150886
22268 150886 102169 354280 507287 203958 266397 431328 429811 369250 -117126 -201948 4410
22257 4410 196183 156577 159605 248925 222119 204448 206881 69174 -72343 -121726 48915
22246 48915 187214 117496 197067 249490 228073 215069 435668 253190 131663 155990 168063
22235 168063 -81270 -459510 -464660 -126254 5936 -129682 -247065 51899 191439 182344
22225 182344 207543 -1137 -102431 340405 388129 257798 183409 109950 311398 349647
22215 349647 223657 320133 199513 98359 206678 -2320 23823 235594 209982 422064
22205D22064M179l01181j18618K12820o443N5558j66856N9202J1155J72654R3547
22194D38081k06479j92594n039J55426r7775L8025J50158m00840L3033O8522j32051
22183a51533l02563j03529R9973N8071K69108L98223P0832M1484k12796J30195
22173B97465P3237j64940p6983K2908k05765j66576J7659K62815M06471J20897
22163E87188l06272l35518j25580j4319J84725R9847l91260J9105M11253M19056
22153E48225k6345j87074l69406q5519j39343m8577J66388Q8408r8852m8115q2803
22142b83013m5759M9341J25844L43030P3486j63981J31065j0699K33674K85119
22132G38107l5227o7193k5023l53007m77069k08780K71038J21122n9851K9802
$$ plain form
22205 422064 426243 125062 6444 219264 212821 268379 101523 160725 171880 344534 438081
22194 438081 231602 39008 33969 189395 91620 129645 279803 -121037 -88004 -19482 -151533
22183 -151533 -454096 -557625 -457652 -399581 -130473 267750 338582 380066 167270 297465
22173 297465 370702 205762 128779 151687 -54078 -220654 -202995 59820 466291 587188
22163 587188 280916 -54602 -180182 -194501 -9776 90071 -301189 -282084 129169 548225
22153 548225 521880 334806 -34600 -120119 -259462 -308039 -141651 -53243 -152095 -200210 -283013
22142 -283013 -328772 -279431 -153587 189443 262929 98948 230013 219314 452988 738107
22132 738107 702880 635687 610664 257657 -219412 -428192 -157154 -36032 -95883 -66081
22122f6081j04746o5044K41390j43716j64969j86342Q8104Q3239j69524r0796
22112e78485j16580J27318J40719L24333M35925J8593j20242k44378j9765J51647
22102A19085n7592o1161j96081j76111K6266K72269N4016J20611K05129J25024
22092D31455k5689m5393N9186o9535j98312o9817l1524L9380n2878k7867K2088
22081C1094o5690N8299P2305j78973K76940L35238j04798M4723l52241l16932
22071b00035o6525p6141O4639j45144o5264L84023J27331O2762K05253M9374k04234
22060A36039O8531M1240j20835q7085k66423K85770m1163R8072j81473j15862
22050a83189K19568k63614k35152K11025L88331K6115m9798j07531j03788K84927
$$ plain form
22122 -66081 -170827 -235871 5519 -138197 -303166 -489508 -401404 -318165 -487689 -578485
22112 -578485 -695065 -567747 -427028 -102695 333230 351823 231581 -12797 -32562 119085
22102 119085 61493 332 -195749 -371860 -345594 -73325 -19309 101302 306431 431455
22092 431455 405766 360373 419559 350024 151712 81895 50371 89751 36873 9006 31094
22081 31094 -34596 23703 96008 -82965 193975 529213 424415 469138 116897 -200035
22071 -200035 -266560 -342701 -278062 -423206 -488470 -104447 22884 85646 290899 340273 136039
22060 136039 204570 245810 124975 37890 -228533 57237 16074 114146 -67327 -183189
22050 -183189 36379 -227235 -462387 -251362 136969 163084 113286 5755 -98033 186894
22040A86894n2575k30678m6416Q787J19497j31896M1122Q6782j3779r2016J37629
22029A3351O0190J19236J45618J24713J0689k38056l17239j58399J05767J05089
22019b9041l15992N001L24264J38307l5986l6832J10136J182K9156l9799J13395
22008B63791q8918j3166J4188k8865J56393l09251j78377l5003J35579K38882
21998A55253K00079n4938k0947l3932J00319l8156j69535l5864p3568O5002j73402
21987g9689J35621J16121n0399J73220M4271Q6223l0499j74255N8344o0194j97331
21976B1433J3676n8097p2226L8077J14753j714k18024L69112Q1923n2757j72021
21965F4135k80391j18330K72308K02282l0088j07917j45452K8289O4729j35592
$$ plain form
22040 186894 134319 -96359 -142775 -133988 -14491 -146387 -105265 -18483 -32262 -124278 13351
22029 13351 73541 192777 338395 463108 473797 235741 -81498 -239897 -134130 -29041
22019 -29041 -345033 -340032 -15768 122539 86553 49721 159857 161039 190195 150396 263791
22008 263791 174873 161707 175895 147030 303423 -5828 -184205 -219208 -83629 155253
21998 155253 355332 300394 279447 245515 345834 307678 138143 102279 28711 93713 -79689
21987 -79689 55932 172053 121654 294874 339145 425368 394869 220614 278958 218764 21433
21976 21433 35109 -22988 -95214 -57137 57616 55902 -162122 206990 288913 236156 64135
21965 64135 -216256 -334586 -62278 140004 109916 1999 -143453 -115164 -50435 -186027
21955a86027k17928l2749N2772J94174N3363j01990o1495j083l6739K4733N2964
21944b60005K89640K8718k71105k17926K33191K66086O7866m5902J90906l5716
21934B45753l32172J57206K17069k49338n3759L1139j20237j23138N3540j39221
21924c13158j26830J09082K65402J74721N9499K18769L7015o1425j15860n09758
21914b62543l12095l9127K05751M07868J66317l63387j50000J16583J67334p9382
21904a42681K9907J68605L41600j1678k59536K1402Q4761k84488J11015K16427
21894B75334k85597l37206l9309R3219L51041K02556Q7614j95782l64590l1624
21884b44344l7065R0142J16746P2359K45764j82768m8745l3396n2132j32012O8559
$$ plain form
21955 -186027 -403955 -436704 -383932 -189758 -136395 -238385 -299880 -300963 -337702 -312969 -260005
21944 -260005 29635 58353 -212752 -430678 -197487 68599 136465 90563 281469 245753
21934 245753 -86419 70787 287856 38518 -15241 15898 -104339 -227477 -173937 -313158
21924 -313158 -439988 -330906 -65504 109217 168716 387485 424500 363075 247215 -262543
21914 -262543 -574638 -613765 -408014 -146 166171 -197216 -347216 -230633 -63299 -142681
21904 -142681 -112774 55831 397431 385753 126217 147619 232380 -52108 58907 275334
21894 275334 -10263 -347469 -386778 -293559 57482 260038 347652 151870 -212720 -244344
21884 -244344 -281409 -191267 -74521 -2162 243602 60834 12089 -21307 -73439 -205451 -136892
21873a36892K18909k6168L3374p3024J26400P7131L0564j94699p1037Q5491O8790
21862A38839L2804l3612Q2683j51940l38565j54539J13702J0681j06970Q22J28219
21851b77876K21268L7439j10134r5260K19839K687m6162j66841o1425l6362K04042
21840a08785R1844n9813q1714J0450J10167J90593L41945M9636k66115k73690
21830D518p6801m31951l3654K98713K49518P5714j28139j19432K87418M0872N2235
21819B19011K50276Q2568j33910j65747l0387l41078k80012j22486J10470j03247
21809e14542M5858O1983j7631M08078L00249k65723k5980p783J46636l6458n8820
21798C5867n6759q2869J7678o6141n2792P4352L39330L8742j12181q4663l2449
$$ plain form
21873 -136892 82017 55849 89223 16199 142599 219730 250294 55595 -15442 70049 138839
21862 138839 171643 138031 220714 68774 -269791 -424330 -310628 -299947 -406917 -406095 -277876
21851 -277876 -56608 -19169 -129303 -224563 -4724 -2037 -48199 -215040 -276465 -312827 -108785
21840 -108785 -16941 -76754 -158468 -148018 -37851 152742 494687 544323 278208 4518
21830 4518 -72283 -504234 -537888 -239175 10343 86057 -42082 -161514 125904 166776 219011
21819 219011 469287 551855 417945 252198 221811 -119267 -399279 -521765 -411295 -514542
21809 -514542 -468684 -406701 -424332 -16254 283995 18272 -7708 -15491 131145 94687 35867
21798 35867 -20892 -103761 -86083 -152224 -205016 -130664 208666 247408 135227 50564 18115
21787A8115j37818J72950o4862j59126j67636k66821k3734O0500Q134L4854J75845
21776c49599K53909J18627K65673l20532j18900J14683P5691k4501n6825n2321
21766i4095M3006J28223j61166L4091J73365j67340J7275o1368J48362n4271j45307
21755a39225m9162O7656j20992J21114J45556o0611q1292L35755K25160o6148
21745C77811k67456P1J27371R0424j24758k07703p1505J36914K18858L9832k37173
21734H2686j31740J34249k50124k3466j32111l1918J1327J43072j51911K08945
21724a40991M27527j25106O5135J35391L3878J07305j30376n19117k50871J14664
21714b82561l7285j49173J18182K88876p2329N4077j1647J05678J11791J20021
$$ plain form
21787 18115 -119703 53247 -11615 -170741 -338377 -605198 -628932 -568432 -560298 -525444 -349599
21776 -349599 -95690 22937 288610 -31922 -150822 -36139 39552 15051 -41774 -94095
21766 -94095 -51089 77134 -84032 -49941 123424 -43916 -26641 -88009 60353 6082 -139225
21755 -139225 -188387 -120731 -241723 -120609 24947 -35664 -116956 218799 443959 377811
21745 377811 110355 110426 237797 328221 203463 -4240 -75745 61169 280027 319859 82686
21734 82686 -49054 85195 -164929 -188395 -320506 -352424 -341097 -198025 -349936 -140991
21724 -140991 286536 161430 226565 361956 395834 503139 372763 -146354 -397225 -282561
21714 -282561 -319846 -469019 -350837 -61961 -134290 -80213 -91860 13818 125609 245630
21704B45630j49358P6572k7165p0835P7460P5913J34366q228k38097l49510J16851
21693a16401J70570J49627l8043k15029k35145K14199K05483l9589j37419k53176
21683b94923n8011j21691k2431J72761K45870L10379Q9029J93446j92146k41571
21673H0712k4398j2221k3747j52310j405K46720J63476l50657o0904M4578j84033
21662b74189J66643L97827j86353k3809J47314p2753j76097j74068j9370J54426
21652f0429K37367O1485o5322k55420j97253N6699K13980q8064j65339j94828
21642d57124J33229L12109k28501o1119O4784J62249M5379J6678N715j5177k65459
21631b87237j49044J87928K58936K7176N9809j85320l2360j03037m2030J35838
$$ plain form
21704 245630 96272 172844 145679 74844 152304 228217 362583 354355 116258 -233252 -116401
21693 -116401 54169 203796 165753 -49276 -284421 -70222 135261 95672 -41747 -294923
21683 -294923 -352934 -474625 -497056 -324295 -78425 231954 320983 514429 322283 80712
21673 80712 56314 44093 20346 -131964 -133369 113351 276827 -73830 -134734 -90156 -274189
21662 -274189 -107546 290281 103928 80119 227433 154680 -21417 -195485 -214855 -60429
21652 -60429 176938 238423 173101 -82319 -279572 -222873 -8893 -96957 -262296 -457124
21642 -457124 -323895 -11786 -240287 -301406 -236622 -74373 -28994 -12316 -6601 -21778 -287237
21631 -287237 -436281 -248353 10583 37759 97568 -87752 -120112 -223149 -265179 -129341
21621a29341J69167K5298J49747O0679k21004O0386q2269Q8548j92315q9511J35869
21610b4746j0499K7638J47452K7699J02767k136m28931o2695K20363M1897k41484
21599b02675K5272p5461k60435J70129K84132J56668L4277q4137j86735J67357
21589B8392O8423j96777j37832k15830J8966J03905K63280j85918k62449L62229
21579a53611J57021j57493K05348r8388j41197Q0518K66361j7119n4654P5932
21569A62718o1815K19101n4925j99370k33290j73869N4161J05283N1339Q8541
21559d2126j06148j8217j2427j19552l827J38830J81279j310j20046p7116k29093
21548d09753N7830K59308o3605o4864J9330K31617j8932m0897o1770n2560K00167
$$ plain form
21621 -129341 39826 65124 214871 275550 54546 114932 32663 121211 -71104 -160615 -24746
21610 -24746 -35245 -7607 139845 167544 270311 268175 -160756 -223451 -3088 38809 -202675
21599 -202675 -177403 -252864 -513299 -343170 -59038 97630 131907 47770 -138965 28392
21589 28392 96815 -99962 -237794 -453624 -434658 -330753 -67473 -253391 -515840 -153611
21579 -153611 3410 -154083 51265 -47123 -188320 -107802 158559 141440 86786 162718
21569 162718 100903 320004 265079 65709 -167581 -341450 -287289 -182006 -130667 -42126
21559 -42126 -148274 -166491 -178918 -298470 -302297 -163467 17812 16502 -103544 -180660 -409753
21548 -409753 -351923 -92615 -156220 -221084 -201754 29863 10931 -29966 -91736 -144296 55871
21537E5871P7111p0709J41713o8324k08991N1744K44977j05194j43669k3673j74832
21526b23976J70288O9176J5282K9807J63271q345q9162r0774J5623j28809k40836
21515c18455P2129L00223q7131m08551p5481K83230K26647K13564l9724R1590
21505B58041J28113k20312j043J23224o0891L1102j5636k5891j80360j54019J32474
21494A4802J32548m47218l61472J3355J70665J53559J94657K66880q1027q8475
21484c1726K13951R7540j91760p38r770l47639l01414n6768K33970M2548P3224
21473b78582k7511j60860q2243K12953L86291j71359k9090J24129Q3834k5701
21463C1861k21051J15692J33086Q7497L77l25980J2472J46902J50299k5694k7873
$$ plain form
21537 55871 132982 62273 203986 135662 -73329 -21585 223392 118198 -25471 -49144 -223976
21526 -223976 -53688 15488 30770 60577 223848 215503 126341 35567 51190 -77619 -318455
21515 -318455 -246326 53897 -33234 -441785 -517266 -234036 -7389 206175 166451 258041
21505 258041 386154 165842 164799 288023 227132 258234 242598 216707 36347 -117672 14802
21494 14802 147350 -299868 -661340 -647985 -477320 -323761 -129104 137776 56749 -31726
21484 -31726 182225 279765 88005 87267 77497 -270142 -571556 -628324 -394354 -351806 -278582
21473 -278582 -306093 -466953 -549196 -336243 50048 -121311 -150401 -26272 57562 31861
21463 31861 -189190 -73498 59588 147085 147462 -178518 -166046 -19144 131155 105461 77588
21452G7588q1447K62211J23684N924r4630k75239l01429j0279P6744M3961J86876
21441A3964K55467l1946k73388j37605r5612k12187L1074L72581M25061m2918
21431C04491n1500J01587K27666j72049k21052j17528j73912m6115k34146m8959
21421d31517P0610J23794J04479n7927K49341J47979m5908J52011j85074k05246
21411g7458J67981k43k4960O5719j2213l791o4299l8528J905K67009N4127k12519
21399A22730j37086O6333R7286L5959l04060j88292j7351R1112j9063m7535J86676
21388a13291J79497o9088K4281J9845p5005R3097j34257J78044K0850j21832o9955
21377f7814r5985P8665j08065k5854J39470p4286r9514J87016J5558O6618K16487
$$ plain form
21452 77588 -3859 258352 382036 387960 293330 18091 -283338 -293617 -216873 -172912 13964
21441 13964 269431 237485 -35903 -173508 -269120 -481307 -450233 -77652 347409 304491
21431 304491 252991 354578 582244 410195 189143 71615 -102297 -148412 -382558 -431517
21421 -431517 -360907 -237113 -132634 -190561 58780 206759 160851 312862 127788 -77458
21411 -77458 90523 90280 65320 131039 118826 115035 50736 12208 14113 281122 335249 122730
21399 122730 -14356 51977 149263 185222 -118838 -307130 -324481 -233369 -252432 -299967 -113291
21388 -113291 66206 -2882 21399 41244 -33761 59336 -74921 103123 123973 2141 -67814
21377 -67814 -163799 -85134 -193199 -219053 -79583 -153869 -253383 -66367 -50809 15809 232296
21366B32296R5842l39570l11658M57143J91797n9902q6257L4421j06952m17079
21356c09919o3269l7012J35577L38372L09616J25221r5301j66581J34423j02509
21346B68618J1744k5789o1970Q9601J28039J76498j32704m21012j02602J35484
21336F5907K8023j79498J14144J08338q8983j83512k49147K21093J324k48100
21326d10411k04432J48998O7642M6534J11535K02831N5116J14111K56826L5024
21316D23774n3122j89844n8535j57405J87909n1755k49304n4253R0165J51532
21306C9162J62117M2464L3679P9564j60148l15603k20256l3733M03707L46389
21296C77342l1203l00376k7166k2791j8275k91768J00965L00539J56900J58039
$$ plain form
21366 232296 328138 -11432 -323090 134053 325850 265948 179691 214112 107160 -309919
21356 -309919 -373188 -410200 -274623 63749 373365 498586 403285 236704 371127 268618
21346 268618 280362 254573 192603 282204 410243 586741 454037 33025 -69577 65907
21336 65907 93930 -85568 28576 136914 47931 -135581 -384728 -163635 -162311 -410411
21326 -410411 -614843 -465845 -398203 -351669 -240134 -37303 17813 131924 388750 423774
21316 423774 370652 180808 122273 -35132 152777 101022 -148282 -202535 -112370 39162
21306 39162 201279 243743 277422 356986 196838 -118765 -339021 -372754 30953 377342
21296 377342 346139 45763 18597 -4194 -22469 -314237 -213272 87267 244167 402206
21286D02206j63142l10742k62240j0133L78154L52681l15004p1177j04049j9345
21276a22791o8829j69639k08130n0655J01146L37508J78352k52863q3327J85824
21266a53404j23121J23226L97005m3458k71787j5889J60293J72617j24642l40713
21256b19873N7054J0221l41731L03133j10394m1463k4926p6963j31239J4629J9797
21245e41755L4598k2235L76994L1141J09808q2307J00400Q7306j6865l1128P9787
21234A25744j51641m5836L08163K6340O8531k98880j59220j43440M7800k05821
21224d28260P9458Q8028J2261K0991j29653P6380l56736L53999M28729j84236
21214c9039m2224R5923R1970R2449k42611q8233M1788J94081J86707J57881j47668
$$ plain form
21286 402206 239064 -71678 -333918 -344051 34103 386784 71780 603 -103446 -122791
21276 -122791 -191620 -361259 -569389 -620044 -518898 -181390 -3038 -255901 -339228 -153404
21266 -153404 -276525 -153299 243706 200248 -71539 -87428 72865 245482 120840 -219873
21256 -219873 -162819 -152598 -494329 -191196 -301590 -343053 -367979 -444942 -576181 -561552 -541755
21245 -541755 -507157 -529392 -152398 -121257 -11449 -93756 6644 93950 77085 45957 125744
21234 125744 -25897 -71733 236430 262770 331301 32421 -126799 -270239 -222439 -428260
21224 -428260 -348802 -260774 -248513 -227522 -357175 -280795 -637531 -283532 145197 -39039
21214 -39039 -81263 14660 106630 199079 -43532 -131765 -89977 104104 290811 448692 301024
21203C01024r8790l7604j7462O7801J35788K70986Q1583n12919k71436r0490o3130
21192b34649J11784K34421N658N2668p9340j57492j00897J89937j3776L02896
21182C11210J48909n2887K04526L0414j13978m72167l67155K61949K61555K1757
21172B34133Q5687j25488j34187k17721m00835m7870N74232L23009l7422o4663
21162A88875J04776J10185k04307j41538K07575J1938K6008k16631k35171L5777
21152a12513J53294M9246O1027j36376k35167K15551J10056j2273L9570J40445
21142B72860m32177l14516J69803K04783J13311j2793j61228l07994J03458J67619
21132a96874M89883j90934M972Q2355J17369P8990j73326L3888O454k20147k07767
$$ plain form
21203 301024 202234 164630 147168 214969 350757 621743 703326 190407 -81029 -171519 -234649
21192 -234649 -122865 111556 117214 169882 90542 -66950 -167847 22090 8314 311210
21182 311210 460119 407232 611758 642172 528194 56027 -311128 -49179 212376 234133
21172 234133 319820 194332 60145 -157576 -558411 -606281 -32049 290960 253538 188875
21162 188875 293651 403836 199529 57991 265566 277504 303512 86881 -148290 -112513
21152 -112513 40781 90027 151054 14678 -220489 -4938 105118 92845 132415 272860
21142 272860 -159317 -473833 -304030 -99247 14064 1271 -159957 -467951 -364493 -196874
21132 -196874 293009 102075 107047 189402 306771 385761 212435 246323 252777 32630 -175137
21121a75137k25367J56842N5961J60016j51948j30680m7995J08530J31774J68511
21111E0507J21255J07930N0663k14327j15581K7890Q9347l1266J13493p606j31429
21100F0876k04328O4552j44963m6520K03670N0474L5779j94952R9380J97626r2746
21089B8848N5594m4708P1017J51006J78698Q7689k00722m9425K22738j86105m11749
21078i7119j36326m02430N8561J84111l5193m8999J10322J15634P4338P1905P618
21067i7578j67450M237M68526Q9047l16772j77819K56557Q2797N6212L7743l50789
21056a15289M9412Q3387K5009L9876l487J11705J59427l054o031r7141m12391
21045a68577k23204L2303J06907O1788J34674N4402J9298J84043k40373k76960
$$ plain form
21121 -175137 -400504 -243662 -187701 -27685 -179633 -310313 -358308 -249778 -118004 50507
21111 50507 171762 279692 330355 116028 447 28337 117684 86418 199911 192305 60876
21100 60876 -143452 -78900 -223863 -270383 -66713 -16239 19540 -175412 -76032 121594 28848
21089 28848 84442 39734 110751 261757 440455 528144 327422 277997 500735 314630 -97119
21078 -97119 -233445 -635875 -577314 -393203 -428396 -477395 -367073 -251439 -177101 -105196 -97578
21067 -97578 -265028 -260791 207735 296782 -19990 -197809 58748 141545 197757 235500 -115289
21056 -115289 -65877 17510 42519 82395 78908 190613 350040 346986 340955 243814 -168577
21045 -168577 -391781 -359478 -252571 -190783 -56109 -1707 17591 201634 -38739 -315699
21035c15699R7987K32456l0587O4009L1583l33586j90844Q8067J29748j18692
21025c45558L9202K50299K06412k3016k75045r7343L21j6450L04062J32262m4776
21014A30370j9401l2585K61835j90581j46063r9127m7514j45224Q3944k843J49935
21003e7254K86635q5165l39653o6050L60915J85842j17401o4239r3885k97099
20993b87354j12392J00285J78242J03314M3658l279k74300j55411P2415P3335
20983b61487K1758J87616K86056K13154j08709P60K8720q6398j18081n2420n135
20972A05834O2350P5574k61723l75997n373J58536J34841J0683j80711J63969
20962a12017J52795k67219P5592O6151j35547K9172O5755K59400k5074k03125
$$ plain form
21035 -315699 -217712 14744 -15843 48166 79749 -253837 -444681 -356614 -226866 -345558
21025 -345558 -306356 -56057 150355 127339 -147706 -245049 -244728 -261178 42884 175146 130370
21014 130370 110969 78384 340219 149638 3575 -95552 -143066 -288290 -204346 -207189 -57254
21003 -57254 229381 144216 -195437 -261487 99428 285270 167869 103630 9745 -287354
20993 -287354 -399746 -299461 -121219 -17905 25753 22474 -251826 -407237 -334822 -261487
20983 -261487 -239729 -52113 233943 447097 338388 339148 367868 281470 163389 110969 105834
20972 105834 168184 243758 -17965 -393962 -399335 -240799 -105958 -95275 -275986 -112017
20962 -112017 40778 -226441 -150849 -84698 -220245 -191073 -125318 134082 109008 -94117
20952i4117K379j52302N0480K20442R0612j98172Q5846M23352j26742j87553j41533
20941b7308M7458J92540L09041l1522j5531J2877j01730P6202j93281k98524m8538
20930g8316L2406j02056r6092P1259K35680P740J14300M4745k12274r0882r5571
20919a69061L2386P3744N3589k1832J21305J08807q0815j20401Q6679n091q651
20908G0659Q7475J1095K2654j21816o5688l6418M495j34619j05910J84148n5849
20897a39774r9308L5358J70092J35027J60600m8261J67155J16356j73907L8687
20887C62025R4445k3109l16050k33812j03070P4896J94615K28918J2089m1478
20877B49469j75775L929Q8254k49002k00923R4377J84422J03449p1036o2551P8600
$$ plain form
20952 -94117 -91738 -244040 -193560 26882 117494 -80678 5168 428520 301778 114225 -27308
20941 -27308 20150 212690 521731 490209 474678 487555 385825 462027 268746 -29778 -78316
20930 -78316 -45910 -147966 -244058 -172799 62881 70621 184921 229666 17392 -73490 -169061
20919 -169061 -136675 -62931 -9342 -31174 90131 198938 118123 -2278 84401 79310 70659
20908 70659 158134 169229 191883 70067 4379 -32039 -27544 -162163 -268073 -83925 -139774
20897 -139774 -239082 -203724 -33632 101395 261995 213734 380889 497245 323338 362025
20887 362025 456470 433361 117311 -116501 -219571 -144675 49940 278858 290947 249469
20877 249469 73694 77623 165877 -83125 -284048 -189671 -5249 98200 27164 -35387 43213
20866D3213Q0651j29028j07146k7248J52841O9681j8346L9786n5230K2773j60727
20855h8780o5736P0342O5985J94807O128N6605O5488l31326J09035J23560J73597
20844C79705j93529k21738j01707j95671J85624r8413n5472R1089Q7532k04296
20834c26876j81855L54246J07435n3500k13112J93928K64148j28497k80134L6368
20824b27849q5028J86157J5286j74464k68478K88570N10612J36083l38951k98481
20814b56543k8548m2407J01785J77430J02088L14223j46217j86782k10882q5273
20804b61126J16674K55840O8822k4029J10514k13947N4334J42164K97728j41973
20794D05001k34586q6308J12411m02788j38713Q0252j62081N8910J14980j38502
$$ plain form
20866 43213 123864 -5164 -112310 -139558 13283 82964 64618 104404 49174 71947 -88780
20855 -88780 -154516 -84174 -18189 176618 182746 239351 304839 -26487 82548 206108 379705
20844 379705 186176 -35562 -137269 -332940 -147316 -245729 -301201 -210112 -122580 -326876
20834 -326876 -508731 -154485 -47050 -100550 -313662 -119734 144414 15917 -264217 -227849
20824 -227849 -312877 -126720 -111434 -285898 -554376 -265806 244806 380889 41938 -256543
20814 -256543 -285091 -327498 -225713 -48283 53805 368028 221811 35029 -175853 -261126
20804 -261126 -144452 111388 180210 156181 266695 52748 107082 249246 546974 405001
20794 405001 170415 84107 196518 -206270 -344983 -264731 -426812 -367902 -252922 -391424
20784c91424M4237K16430k6926O4116m4991k58645J73207Q5546l371M9220k66412
20773c59013k13102M4128J49083J17178K62625j49198n8555l4541J002k00218
20763d40611q4034L40958J31177J11320J73298j45364K280J31576j64810j0747
20753D5043L9962P2922q3726M8463J70870k04455j28945L27584K49757p2708j80427
20742B84340p9475j67781j33250j25699K54259L65957j52704l03550j65379k69548
20732d92830J17528L3748K2642O628P5238K01610K6743J578n6876l33289r0696
20721d87976Q4197J55600J8231L5893j39945L1669J92741N4218L04075J11018
20711C59721j95537l29033L0354J32198k339N8931K12016l6614l5313k30245l13090
$$ plain form
20784 -391424 -347187 -130757 -157683 -93567 -138558 -397203 -223996 -138450 -141821 -92601 -359013
20773 -359013 -572115 -527987 -378904 -261726 899 -148299 -206854 -241395 -240393 -440611
20763 -440611 -524645 -183687 -52510 58810 232108 86744 89024 220600 55790 45043
20753 45043 85005 157927 74201 122664 293534 89079 -39866 287718 537475 464767 284340
20742 284340 204865 37084 -96166 -221865 32394 398351 245647 -57903 -223282 -492830
20732 -492830 -375302 -341554 -318912 -312284 -237046 -35436 -8693 -7115 -63991 -397280 -487976
20721 -487976 -403779 -248179 -229948 -194055 -334000 -302331 -109590 -55372 248703 359721
20711 359721 164184 -164849 -134495 -2297 -4636 54295 266311 229697 194384 -35861 -348951
20700c48951J31578J9519r6840L6422N09644O7266o0115j16758K5909j98536r8896
20689a29758N0593p649P550J39152K69585J96739j25551k83683j73382k9265J46977
20678F1308J9086j10210N9244N1111J53645N9195j19971j59553O5821K36525J82916
20667D99117j70120k63655j38748l1072o9152K81508K04941P4891K93489L3534
20657G14733j15992m35683k90147j16981R614O0482K04636O9809r2335o3024K27477
20646A72589q1932N9080J76858K3777k20392N1407j56836K3620p6375j67011l3225
20635b28440r1851j48269K48292O8863l28341p1644K8751q9544k7071K72269K06469
20624a60516p0389R4239R5558K043j25873K6426R199J25642J59329K5860m3549
$$ plain form
20700 -348951 -217373 -197854 -294694 -258272 251372 318638 258523 141765 167674 -30862 -129758
20689 -129758 -79165 -86814 -79264 59888 329473 526212 400661 116978 -56404 -85669 61308
20678 61308 80394 -29816 29428 80539 234184 293379 173408 13855 79676 316201 499117
20667 499117 328997 65342 -73406 -104478 -173630 107878 312819 387710 681199 714733
20657 714733 598741 163058 -127089 -244070 -234456 -173974 30662 100471 8136 -54888 172589
20646 172589 90657 149737 326595 350372 129980 181387 24551 48171 -28204 -195215 -228440
20635 -228440 -320291 -468560 -220268 -151405 -479746 -551390 -522639 -612183 -639254 -366985 -160516
20624 -160516 -230905 -136666 -41108 -39065 -164938 -138512 -129313 -3671 155658 181518 137969
20613A37969j05863r117k05164O2134K3149n54372k03040J90514K92076J11792
20603b59922K79458L6240k30073J70079L72079P8313j52194j51886l6071J35244
20593B41267J53772K48970k44288k55779j6883O6100k67557P7154J13101J08727
20583B24584k4398M1261K1384p0149j73537K42141J39890o9371l6054m95590j65004
20572c64843L93894K81354o7000k45778j18345j12160j43450N6761K04053K7922
20562h7592n3037k1930j99225j63527K55339L29789J17754n4262K0154K2742k5363
20551A40842q8008M0954j27740L65496J38381k27715r2992Q7145J60690Q6218
20541D83271j18918k36910J75010q7983K73429l8258j74848l26248j40486k9367
$$ plain form
20613 137969 32106 22989 -182175 -120041 -96892 -651264 -854304 -663790 -371714 -259922
20603 -259922 19536 55776 -174297 -4218 367861 446174 293980 142094 106023 241267
20593 241267 395039 644009 399721 143942 127059 193159 -74398 2756 115857 224584
20583 224584 200186 241447 262831 192682 19145 261286 401176 331805 295751 -199839 -364843
20572 -364843 29051 310405 243405 -2373 -120718 -232878 -376328 -319567 -115514 -87592
20562 -87592 -140629 -162559 -361784 -525311 -269972 59817 177571 123309 143463 166205 140842
20551 140842 52834 93788 -33952 331544 469925 242210 149218 236363 397053 483271
20541 483271 364353 127443 302453 214470 487899 449641 274793 -51455 -191941 -221308
20531b21308J50751Q2479Q6513j91325k99132l4837K4248P4166L13613k6577k95975
20520c37384j08025K59639K19954K18083l608j15964k17241j9800k29404o4711
20510c98461K48665J21463j9232K39940k56779j92151k3445M66881L6643m3889
20500A79635q9329k01313N3337l48282j56220L00827J87771j14957k6061K35818
20490B1226K9853K23172J31363Q5350L6001j41587l49587k03511J06866J39748
20480G8894N0388j11377J0748N3713J65929j73255k05047j51218j72735j50387
20470f04347K39292J71623L06981J09955p9459k82710R6311J07466p2158j21912
20460a28958Q7234J0841l19198l21035J68453J45987N8307r1549N19441L14382
$$ plain form
20531 -221308 -70557 11922 98435 -92890 -392022 -426859 -402611 -328445 -14832 -41409 -337384
20520 -337384 -445409 -185770 34184 252267 248659 132695 -84546 -104346 -333750 -398461
20510 -398461 -149796 -28333 -47565 192375 -64404 -256555 -280000 186881 223524 179635
20500 179635 90306 -111007 -57670 -405952 -562172 -261345 -73574 -188531 -214592 21226
20490 21226 51079 274251 405614 490964 526965 385378 35791 -167720 -60854 78894
20480 78894 129282 17905 28653 82366 248295 75040 -130007 -281225 -453960 -604347
20470 -604347 -365055 -193432 113549 223504 144045 -138665 -42354 65112 -7046 -128958
20460 -128958 -41724 -30883 -350081 -671116 -502663 -356676 -298369 -389918 129523 443905
20450D43905j21575m3201Q1284l02678k39224j74123J04671o5477p9964j07981
20440e04363k68197J65316Q5561J167j06008J38195K37745J10171j72343J16452
20430a96304K91490M40517l4553l74340j41643J86567j3898m9000j42343K63708
20420B30201J41011j57043k41306J56933J01447p3072P3786J7181m6511k13851
20410a1224p9495J11476J37172j10765p7722j17640M0987o8782j38217J31431
20400a82779J34316q635k1580N0108R3447N9091K674j32869k59473k53387L34506
20389a84581J02652Q0964J08507J03295J69472K04804p7191j88409k59065l193
20379E7255k3688R0478l23859k56832L404K25286J08864r2405N3390O2619K31494
$$ plain form
20450 443905 322330 279129 360413 57735 -181489 -355612 -250941 -316418 -396382 -504363
20440 -504363 -772560 -607244 -521683 -520516 -626524 -488329 -250584 -140413 -312756 -196304
20430 -196304 95186 535703 501150 126810 -14833 171734 157836 108836 -33507 230201
20420 230201 371212 214169 -27137 129796 231243 158171 231957 249138 202627 -11224
20410 -11224 -90719 20757 157929 47164 -30558 -148198 -107211 -175993 -314210 -182779
20400 -182779 -48463 -57098 -78678 -28570 64877 123968 126642 -6227 -265700 -519087 -184581
20389 -184581 -81929 -965 107542 210837 380309 585113 507922 319513 60448 57255
20379 57255 33567 124045 -199814 -456646 -453242 -227956 -119092 -211497 -158107 -95488 136006
20368A36006Q7513p2950K9929m80018j00203j6374p9271k6724j09314K81430K76064
20357g3912Q4158m2400L168J59831N3254p394j77058j70753j6480q2702J54029
20346a16259K43729j43876j37652M1205k7975Q3893J1296Q098k2776N9392J01442
20335A00517Q3854j57747O7265J60057p6275l18589J6641K90771J22677k30474
20325E8697j81023q1430Q0436M04448L22163j10595K5805m2064J998q2357j36875
20314B59203O0239Q3828K35780R8901J16771k79820l90957r3337N4420M3302j27326
20303F1004l6445k70644J779J69589J29018k40563j59044L52233O6598p951j84491
20292a18917J21482j18346L8131L18898j07515l64090j89602K6814P5017j55787
$$ plain form
20368 136006 223519 150569 180498 -299520 -399723 -416097 -495368 -522092 -631406 -349976 -73912
20357 -73912 10246 -32154 -28986 130845 184099 176705 -353 -171106 -187586 -270288 -116259
20346 -116259 127470 -16406 -154058 -112853 -140828 -56935 -45639 -37541 -60317 -925 100517
20335 100517 184371 26624 93889 253946 177671 -140918 -124277 166494 289171 58697
20325 58697 -122326 -203756 -123320 281128 603291 492696 518501 476437 478435 396078 259203
20314 259203 319442 403270 639050 737951 854722 574902 183945 90608 145028 188330 61004
20303 61004 24559 -246085 -244306 -74717 54301 -186262 -345306 6927 73525 65574 -118917
20292 -118917 2565 -115781 -77650 241248 133733 -230357 -419959 -393145 -318128 -473915
20282d73915k3934J48773J46749J33663n7800q8347l2549n462l71463p1291J62169
20271e33407K4128q8865P8519p5645J68237L03234J27271k15029p2070r0718P4663
20260b99682K37244K72465l2231J5708J70474K84870Q2166k18502k76181m17872
20250a81541N3264L3212J70812k49208N6088J01076o8951R546j08410k75613k4457
20239d84182K55887m5685k6653J37417K42163R7547j03675m4880k12782m8776
20229b33619R3771J51332k08547j16581j26810K12238J47662j71619R9495k16499
20219c69177P5555K25802j06766J42440j64998j03898P6697j20829J37773K04095
20209c306J9471k49739m05012Q8878L59039j06418q4038J45031J29956P6075l6032
$$ plain form
20282 -473915 -497849 -349076 -202327 -68664 -126464 -214811 -247360 -252822 -624285 -695576 -533407
20271 -533407 -509279 -598144 -519625 -595270 -427033 -123799 3472 -211557 -283627 -374345 -299682
20260 -299682 -62438 210027 177796 193504 363978 648848 731014 512512 236331 -181541
20250 -181541 -128277 -95065 75747 -173461 -117373 -16297 -85248 -75702 -184112 -459725 -484182
20239 -484182 -228295 -273980 -300633 -163216 78947 176494 72819 27939 -184843 -233619
20229 -233619 -139848 11484 -197063 -313644 -440454 -228216 -80554 -252173 -152678 -369177
20219 -369177 -293622 -67820 -174586 -32146 -197144 -301042 -224345 -345174 -207401 -3306
20209 -3306 16165 -233574 -638586 -549708 -190669 -297087 -381125 -236094 -106138 -30063 -66095
20198f6095k76540j04358O1247J80721J65291J26139Q8893j75314J24354j14595
20188I743q6096J20511l7049q6285K50799L76665l4169j50676m53171k26873J56703
20177a59898J38026k25147R7333K43293J12229J25480k25480j59027Q959J62034
20167A17802M8570J1146k3021k2690P5747k57435m2560J31550l249o9670p6225
20156a10035p3335K21754j56577l13811J23702J0579J40490K40611K17410J33719
20146D34507j49731j58998r4239m6514R8008k1645Q0142j36653P9859L2056k83163
20135a66371o2154J88315l4130k22563J68282J9045j37367N8358k95504j94233
20125f78322K34925Q8292J3646L95458J27967R2245j75594j72854k8319J00627
$$ plain form
20198 -66095 -342635 -446993 -385746 -205025 -39734 86405 175298 -16 124338 9743
20188 9743 -76353 44158 7109 -79176 171623 548288 514119 363443 -89728 -316601 -159898
20177 -159898 -21872 -247019 -149686 93607 205836 331316 105836 -53191 -44232 117802
20167 117802 166372 177518 154497 131807 207554 -49881 -92441 39109 35860 -33810 -110035
20156 -110035 -183370 38384 -118193 -432004 -308302 -297723 -157233 83378 300788 434507
20146 434507 284776 125778 31539 -14975 83033 61388 141530 4877 84736 116792 -166371
20135 -166371 -228525 -40210 -74340 -296903 -128621 -109576 -246943 -188585 -484089 -678322
20125 -678322 -443397 -355105 -341459 53999 181966 274211 98617 -74237 -102556 -1929
20115a929P2839O8776J13293J82432j58908j46111N1421j09830o2046J28781Q3982
20104B22700j48615K3755J8166l55626k35011L09015L81915J57918J33773o3706
20094D44284k93019m1946r6969N8275n9246j67950p1945r0226k18040K57802K82987
20083D007m8082J5224K95646j53156l5816J403l4388R2710j10040j21751J862
20072i2381k03586r4251k9806J98276p4322q3049o320L50308K56585J10976J8143
20061C50573R5445J71199J08111R5652q8230l93207j77836k02214n5518l13951
20051d09976j51953J01199R8073K06442M11130J14283l39553N8327J00520Q478
20041A96970j83510J26652L87326J34810l88614l28802m6519j05710K3844k8611
$$ plain form
20115 -1929 70910 139686 252979 435411 276503 130392 181813 71983 9937 138718 222700
20104 222700 74085 97840 116006 -239620 -474631 -165616 216299 374217 507990 444284
20094 444284 151265 109319 12350 70625 11379 -156571 -228516 -318742 -536782 -278980 4007
20083 4007 -44075 -28851 266795 113639 77823 79226 44838 137548 27508 -94243 -92381
20072 -92381 -295967 -390218 -420024 -221748 -296070 -379119 -385439 -35131 221454 332430 350573
20061 350573 446018 617217 725328 820980 732750 339543 161707 -40507 -96025 -409976
20051 -409976 -561929 -460730 -362657 -156215 254915 369198 29645 87972 188492 196970
20041 196970 13460 140112 527438 662248 273634 -55168 -101687 -207397 -183553 -212164
20031b12164K26957K75189j39951l9325o6945J35812j2645k3179J17851j13527
20021A48073o9233l33674Q414j12600j25215J91022J58374K28196j01401Q4159
20011G6115j03748l21533K43601J95480P2239j38176k1717K79341J16277j58758
20001B39121l58779J99161l55078j51233J60112J16753j2082o6255K02587K35499
19991B09806N5072k28484j15188J07342n0990J50687n3535k9908J79689Q7891
19981C12382q3882k69987l19412P6527L69053q7797j70245O1940P1622M30402
19971C90603l8784k11171p2784l5587q2747j63603P2987r8036O9499o1097j11037
19960c41757J21135J05918J69602k85039j78392j26339K77020J37276J0682J30005
$$ plain form
20031 -212164 14793 289982 150031 110706 43761 179573 166928 143749 261600 148073
20021 148073 78840 -254834 -246420 -359020 -484235 -293213 -134839 93357 -8044 76115
20011 76115 -27633 -349166 -105565 89915 162154 23978 2261 281602 397879 239121
20001 239121 -119658 79503 -275575 -426808 -266696 -149943 -162025 -228280 -25693 209806
19991 209806 264878 36394 -78794 28548 -22442 128245 74710 44802 224491 312382
19981 312382 228500 -41487 -360899 -284372 84681 -3116 -173361 -111421 -39799 390603
19971 390603 351819 140648 67864 32277 -50470 -214073 -141086 -239122 -169623 -230720 -341757
19960 -341757 -220622 -114704 54898 -230141 -408533 -534872 -257852 -120576 -109894 20111
19950B0111L7884j34607j20335j57957Q1079K41124m6963m38663K52254K04306
19940f1767O0595o5835q6677J01066J716j51783J66685j92821j81480l0006P5759
19929c64548K11044o1745q3465K18848J0697r018J513k57396M5266R7645K49702
19918E8543m8330m7178L6152j01766K62941J75736o5008l01711R1006K67487K53131
19907E81003K43977q6430l79102j89329j51249j79110Q6324K99191K02433k08274
19897B19434j74103j81442K09350P3511n8315j22328P1863l6969L3008j98595
19887a64586n3493M26869J38449j45458j90695k87411k25983Q3593Q2037K30562
19877a06116l4387n1362J9441K1670J82646Q5712J55505n5347j00474p6879r2208
$$ plain form
19950 20111 57995 -76612 -196947 -354904 -273825 -32701 -79664 -518327 -266073 -61767
19940 -61767 -1172 -67007 -153684 -52618 -50902 -202685 -36000 -228821 -410301 -440307 -364548
19929 -364548 -153504 -215249 -298714 -79866 -69169 -78187 -76674 -334070 -288804 -191159 58543
19918 58543 10213 -36965 -813 -102579 160362 336098 271090 -30621 60385 327872 581003
19907 581003 824980 738550 359448 170119 18870 -160240 -73916 225275 427708 219434
19897 219434 45331 -136111 73239 146750 88435 -33893 37970 1001 34009 -164586
19887 -164586 -218079 208790 347239 201781 11086 -276325 -502308 -418715 -336678 -106116
19877 -106116 -140503 -191865 -172424 -150754 31892 117604 273109 217762 117288 40409 -51799
19866e1799o4332J10512r339l60424J88363J65959K35443Q1209j049N675j1743
19855B88475k01600j1512J1893o8350n3526j57157K08445J31532K58189L00126
19845G06515J0293l87949l77692J65419J64162Q0486K88503j0492l55620l10616
19835b6991J22104p9865k74479J50240P8769j8606J16932k75151j01915K28254
19825h0708K6727q4628r7507P6715j18883j48586l5362l0298J45804Q0609L5616
19814b30501J96335J29305J86949q7247m31966j07088K95186m1388j05694k4965
19804b21074J70710j49721J9571K09855J80717m7581j88915J27628j09879l56302
19794c64991O694J22762J28019n7176J59488m1719N6455Q8753L11705J52178k58472
$$ plain form
19866 -51799 -116131 -5619 -14958 -375382 -187019 -21060 214383 295592 294543 300218 288475
19855 288475 86875 75363 87256 18906 -34620 -191777 16668 148200 406389 706515
19845 706515 716808 328859 -48833 116586 280748 361234 649737 639245 283625 -26991
19835 -26991 95113 15248 -259231 -108991 -30222 -48828 68104 -207047 -308962 -80708
19825 -80708 -53981 -138609 -236116 -159401 -278284 -426870 -462232 -492530 -346726 -266117 -230501
19814 -230501 -34166 95139 282088 194841 -237125 -344213 -49027 -90415 -196109 -221074
19804 -221074 -50364 -200085 -180514 29341 210058 162477 -26438 101190 -8689 -364991
19794 -364991 -358297 -235535 -107516 -164692 -5204 -46923 9532 98285 409990 562168 303696
19783C03696o8629q206P4155k7506k46500N1790o7838o9105r0656j60215J5164
19772b93850J2541J6572k4089P8207K42443K01342j04388j29919J2273j37127
19762a25995o411J28050K62088L17375m4681m47157m9819m8621J33471O2312K49892
19751D30504k2295m41155k99570J75616j2986P687J44160J32418K25550K63109
19741F03038m2126O26j76518j89722N4535k688j45222k0007J61127k7291J01949
19730C17701J51310j57458q2390p7903l1341J81870L14478R2677k43320l17656
19720A47968r4364j36055N3010K22569r4153p4322J05280j38454k3351M5502J41393
19709A55023J38589j42584j59301p357k9766q7324r4138j09437K1791J25627J49386
$$ plain form
19783 303696 235067 226861 301016 273510 27010 78800 10962 -58143 -148799 -309014 -293850
19772 -293850 -281309 -264737 -288826 -210619 31824 233166 128778 -1141 11132 -125995
19762 -125995 -132406 -4356 257732 575107 530426 83269 33450 -15171 118300 180612 430504
19751 430504 408209 -32946 -332516 -156900 -169886 -162199 -18039 114379 339929 603038
19741 603038 560912 561538 385020 195298 249833 247145 101923 81916 243043 215752 317701
19730 317701 469011 311553 229163 151260 119919 301789 616267 708944 465624 147968
19720 147968 53604 -82451 -29441 193128 98975 24653 129933 -8521 -31872 13630 155023
19709 155023 293612 151028 -8273 -15630 -45396 -132720 -226858 -336295 -314504 -188877 -39491
19698c9491k84j73796N4938L44852J60241J7805k19215p3286l77196P4472L19724
19687H8764j49997j24214K56311Q8102J62175J71058m97324j70106Q2290J85910
19677I2969m0903j39947M414k01256P4641R7276m5203J24439K75292J34679n5814
19666C20587j22710r1513l46165j35453P8454K54741J6834J93829L7838K38255
19656D44697l07761j76668K23967j249J7972l6122p2003j90916M7306n7269m70523
19645e78569q8360p7247K27680K59522k9780j81745M4196Q1492J28239J04187
19635a10385j0442j28282r4520j5153M5123K3901R3292J96272K00458p2539k26094
19624i8369j06197K15472J70919p3800j84222J01703J2063K2411Q5501L88127
$$ plain form
19698 -39491 -39775 -213571 -158633 186219 346460 364265 145050 71764 -305432 -230960 88764
19687 88764 -61233 -185447 70864 158966 321141 492199 -5125 -175231 -92941 92969
19677 92969 52066 -87881 -83467 -284723 -210082 -112806 -158009 -33570 241722 376401 320587
19666 320587 197877 106364 -239801 -375254 -296800 -42059 -25225 168604 206442 444697
19656 444697 136936 -39732 184235 182986 200958 164836 92833 -98083 -50777 -108046 -578569
19645 -578569 -666929 -744176 -516496 -256974 -286754 -468499 -424303 -342811 -214572 -110385
19635 -110385 -120827 -249109 -343629 -358782 -313659 -289758 -196466 -194 200264 127725 -98369
19624 -98369 -204566 10906 181825 108025 -76197 25506 37569 59980 145481 533608
19614E33608J50749l30103m52055K9853L1610N2062J03231j21025O5108n353j25234
19603f7549q2560k4811M145J12734l5490l2848j7427k418M949n6171Q297K71783
19591H2634J38793k27787m9957r6772J1441O5821J03247n2452O6261j365k8898
19580A0966m2243l5570P1485Q1284J31887K27874j27118j65678k49858J96549
19570I9578j24534n3066L2800K50199j07726j44847J50591R6626J2635j3723k29446
19559c0913Q2334o3550r7493L3201o5182P7699J95649J97926M09795K47962j80464
19548H06964j71982K2378l00174l23558R404J13053K16611p7884o6942j5018j41350
19537G1502r2159j362K11748N4867j51801o4714j92199J35794N928k46211P4681
$$ plain form
19614 533608 684357 354254 -97801 -67948 -36338 15724 118955 -2070 63038 57685 -67549
19603 -67549 -150109 -174920 -170775 -58041 -93531 -126379 -143806 -146224 -141275 -197446 -189149 82634
19591 82634 221427 -6360 -56317 -153089 -141648 -75827 27420 -25032 41229 39864 10966
19580 10966 -31277 -66847 4638 85922 217809 445683 318565 152887 -96971 99578
19570 99578 -24956 -78022 -45222 204977 97251 -47596 102995 199621 212256 198533 -30913
19559 -30913 51421 -12129 -109622 -76421 -141603 -63904 131745 329671 739466 987428 806964
19548 806964 634982 657360 357186 33628 43032 156085 372696 294812 227870 212852 71502
19537 71502 -20657 -22019 189729 244596 92795 28081 -164118 -28324 -22396 -268607 -193926
19526a93926K7745p1257K19615J90820J08369k98646j36113k6766n2918Q3009
19516a50068q2416J94273k6242p0843R7504J43027J10533J40376j19881k6501
19506B09762J8206j95642r1637j2831N8092j3647l0402N5498K00455j28154m9349
19495B0351p5043j41746j78763j4074P5793R4059O6709J08585j1433k4141L6822
19484d2881n5599K06660J65762J43669j76453k5212r4707j00712J5870J820l32686
19473b94469k10558J58719J73097M1503K3614P3586k46516k25503J93040M7928
19463b65559L41022l3572j5668M069J62649K90478r5506n4285j68940K48497K08018
19452F21203l1535l15344k16348j30573q8282k53825q4873J58065j55916K13337
$$ plain form
19526 -193926 -166181 -237438 -17823 172997 281366 -17280 -153393 -180159 -233077 -150068
19516 -150068 -232484 -38211 -64453 -135296 -37792 105235 215768 356144 236263 209762
19506 209762 227968 32326 -59311 -72142 -14050 -27697 -58099 -2601 197854 69700 20351
19495 20351 -54692 -196438 -375201 -389275 -313482 -219423 -152714 -44129 -55562 -79703 -42881
19484 -42881 -98480 108180 273942 417611 241158 215946 121239 20527 36397 38217 -294469
19473 -294469 -505027 -346308 -173211 -131708 -108094 -34508 -281024 -506527 -313487 -265559
19463 -265559 75463 41891 26223 30292 192941 483419 387913 333628 164688 413185 621203
19452 621203 589668 274324 57976 -72597 -160879 -414704 -499577 -341512 -497428 -284091
19442b84091J14469J26898J22475Q1619J17242l7769l7188L09236j232k77943
19432B33716m0404j86989Q6091J58171j85568k80766n6463K01103J33730J40769
19422B03390P1821q2776j82816k08739J33472K47462K11326o0641j61627k1022
19412A49850q230q0456j98522q1389l9663m9013N8007M5052M6705O0177K75013
19401A77531R1885q5615O5649m7544M6181j20844R9482j06021Q7038j13226J06981
19390B01497R9126R3148J28827j12096k2239l4880J94403k31654l78992q7751
19380a50611J38434l50624l22M3241J3925J93177J33455l057Q4898J04659k23738
19369a6563l1639j30661k72524J02484J82192P7998R647q6733k2025J40152m7163
$$ plain form
19442 -284091 -169622 -42724 79751 161370 278612 240843 203655 512891 511659 233716
19432 233716 193312 6323 92414 250585 65017 -215749 -272212 -71109 62621 203390
19422 203390 275211 192435 9619 -199120 -65648 181814 393140 332499 170872 149850
19412 149850 141620 61164 -137358 -218747 -258410 -307423 -249416 -204364 -157659 -97482 177531
19401 177531 269416 183801 249450 201906 248087 127243 226725 120704 207742 94516 201497
19390 201497 300623 393771 522598 410502 388263 353383 547786 316132 -62860 -150611
19380 -150611 -12177 -362801 -363123 -319882 -305957 -112780 20675 17618 102516 207175 -16563
19369 -16563 -48202 -178863 -451387 -348903 -166711 -88713 -79066 -165799 -187824 -47672 -94835
19358i4835M0963j42749k7506o3483K56090L84060J00115k53914j47639k01433
19348a50331J68698K24184J58323j68242j08948n5185q5046K37111Q7939O2766
19338C71269j52222j01786k4150j22560o8407k2071O7296J82986k15825P1011
19328a4459P9504P362k40268k17663J51879J76072M01994L9958j31754j78765
19318G3860J08409j55250k69690J12554N4570M05192N6919J20251p3349p7581
19308C55885r5870j28781n9971k32912p1545K61886K52334N5791j83044l15212
19298a61439p8712n4136M8K930K33944R7560K1559K5874j06816j85186j3192J92020
19286b5546l377j65504J09059l7133r7888M4209L19300k4545R6320J97011J94836
$$ plain form
19358 -94835 -53872 -196621 -224127 -287610 -31520 352540 452655 198741 51102 -150331
19348 -150331 18367 242551 400874 232632 123684 68499 -16547 220564 308503 371269
19338 371269 219047 117261 93111 -29449 -97856 -119927 -52631 130355 -85470 -14459
19328 -14459 65045 72407 -167861 -385524 -233645 -57573 344421 384379 252625 73860
19318 73860 182269 27019 -242671 -130117 -75547 329645 386564 506815 433466 355885
19308 355885 260015 131234 71263 -161649 -233194 28692 281026 336817 153773 -161439
19298 -161439 -240151 -294287 -294239 -291309 -57365 40195 61754 87628 -19188 -204374 -217566 -25546
19286 -25546 -28923 -194427 -85368 -122501 -220389 -176180 143120 118575 214895 411906 606742
19275F06742K26024r1587k44756l01499k14712K47394L14295M23388l56877q0555
19265E27857k64977k63420p3912j02352J0462J26521k46698J67819Q7331J04260
19255G2891j29439m43272P4945J9376j6047M9763K21826J89988m5905J6605l2894
19244b2163J13497K61300k20215n347o3445j80660k52606L70200J84047k5149
19234A59459N8054k7024m5919l06850o7826J00592K01042o4654k81096K6898J9371
19223b27953J7822J70737P8955p784J69261k7521l05998k0072Q4583J68766L06451
19212D07247N6952K7037O7647N965p5215k57254j49528O1243J13601R2524L82107
19201G32326M4526l26542k60088J10411K4086j04013o6934j82585p3184R1086
$$ plain form
19275 606742 832766 741179 496423 194924 -19788 227606 541901 965289 608412 527857
19265 527857 262880 -540 -74452 -176804 -166342 -39821 -286519 -118700 -31369 72891
19255 72891 -56548 -499820 -424875 -405499 -421546 -371783 -149957 40031 -5874 10731 -22163
19244 -22163 91334 352634 132419 127072 63627 -117033 -369639 561 184608 159459
19234 159459 217513 190489 144570 -162280 -230106 -129514 71528 6874 -274222 -247324 -227953
19223 -227953 -210131 -39394 39561 31777 201038 173517 -132481 -152553 -67970 100796 407247
19212 407247 464199 491236 558883 564848 489633 232379 82851 144094 257695 350219 732326
19201 732326 776852 450310 190222 300633 324719 220706 153772 -28813 -101997 -10911
19191a0911q5849L26373J50212j3406l88234p3331L02949K05226j40051j12633
19181A60345j40533J67406R475r4112j53273K8462j57727R5074J56472K17679
19171B89268P4866j07327j24547j50873R532j14906j71459k00892K20795K42775
19161c2768J00774J24016N0179j51557m2673j0096j60648Q7313R4819M723j48734
19150h4652O7918L07734o0684o5149J5693L9758n1560j67992n5652K30954K14965
19139C91333J9083j79235j88181r3178P0090O8423q5404p1157k1110q6556k78376
19128d54268l5596m630p0507J45490L28705J89241M7970j3406k32039J1303M7573
19117d0164J66589J3379j77794J7084L19544Q5919k35047Q8506l624k08849n6387
$$ plain form
19191 -10911 -96760 229613 379825 366419 -21815 -95146 207803 413029 272978 160345
19181 160345 19812 187218 196693 102581 -50692 -22230 -179957 -84883 71589 289268
19171 289268 364134 256807 132260 -18613 -9081 -123987 -295446 -496338 -275543 -32768
19161 -32768 68006 192022 242201 90644 47971 37875 -122773 -35460 59359 64082 -84652
19150 -84652 -16734 291000 230316 165167 180860 220618 169058 1066 -54586 176368 391333
19139 391333 410416 231181 43000 -50178 19912 88335 2931 -68226 -89336 -175892 -454268
19128 -454268 -489864 -494494 -565001 -419511 -90806 98435 146405 132999 -99040 -87737 -40164
19117 -40164 126425 139804 -37990 -20906 298638 384557 149510 238016 234392 25543 -30844
19106c0844J56502k0123j09377K28632J82503J03158k65126j6134J08527Q7554
19096D25272O5210l74744L7581J35994j06056o1456P324l9468k15454R2477K41773
19085B08453q6583M991Q6756Q895k8104Q2650n8937j60502k97885J07256L4597
19074i8413J20823P1859k7169J87934M2529j73487l02708J9740K07680Q5407K05607
19063C39802j80780j50272k9493Q335K36543N0916M7661J04580N4112r3567j82129
19052B05708J71799k45799r0570L99638q1401n3245L9650J52318J36129K52233
19042H86460M7567K39115P4963k99347k18139j60129j8487q002l8955K16468J28969
19031H50483j42936l1642k6903o9417l4075j06889j33381j74307k9012o2722K3955
$$ plain form
19106 -30844 125658 105535 -3842 224790 407293 510451 245325 229191 337718 425272
19096 425272 490482 115738 153319 289313 183257 121801 129125 89657 -125797 -33320 208453
19085 208453 121870 126861 213617 222512 194408 277058 218121 57619 -240266 -133010 -98413
19074 -98413 22410 94269 67100 255034 297563 124076 -178632 -158892 48788 134195 339802
19063 339802 159022 8750 -20743 -12408 224135 275051 322712 427292 481404 387837 205708
19052 205708 377507 131708 41138 440776 359375 306130 345780 498098 634227 886460
19042 886460 934027 1173142 1248105 948758 730619 570490 552003 544001 505046 721514 850483
19031 850483 707547 675905 649002 579585 545510 438621 305240 130933 101921 39199 63154
19020F3154j2113J07301L04784j3906j06621M9104J27971J88335K8927K82242
19010A019178L2391r2663l8259N1312j37826j98460N2417J64491O6896J69724
19000A089201j64550l08886r5373m6913n6012L21376o5347l53513j92803M8975
18990A76155n8602k89461J07770J08006K32977k218J41179O7942j88867m9243
18980B45638K20767J99244k50572j88323j87769n2781M5030j10513K751k9247
18970a05775P2716J36417J30270P9533k09234m11008J23606J54256p3169j24147
18960b26535L34371K52394P0492j26565O6801J11410j01122q1984q1269j16928
18950A01065k44051P2546J8612O97J58264j08120J34037N0775l05326j7914J23263
$$ plain form
19020 63154 51041 158342 463126 449220 342599 391703 519674 708009 736936 1019178
19010 1019178 1051569 958906 920647 971959 834133 635673 688090 852581 919477 1089201
19000 1089201 924651 615765 520392 473479 417467 738843 673496 319983 127180 176155
18990 176155 117553 -171908 -64138 43868 276845 274627 415806 483748 294881 245638
18980 245638 466405 665649 415077 226754 38985 -13796 31234 -79279 -76528 -105775
18970 -105775 -33059 103358 233628 313161 103927 -307081 -183475 -29219 -102388 -226535
18960 -226535 107836 360230 430722 304157 370958 482368 381246 299262 217993 101065
18950 101065 -142986 -70440 -51828 -51131 107133 -987 133050 183825 -121501 -139415 -16152
18939a6152J69917K20205K0562L6811J79075j65104k42773n72303j9287J71470
18929b17579K3576Q9649j30647J06351K10225j41427p6308k7863N9822q4932J92384
18918C251k9814j34810O1489J49350p2176K0993j91814j41146J99455R1562J47547
18907A03887M79055J66067l02303l67242j65204q5177k76448J19146J91129J41938
18897D848l08352j4478K04093L3714O8744K23487L05773O502k58828k22508j45045
18886a02050Q4977O8442k43435r6852L8488Q6424K11744k68314j54814J76394
18876a98996P0916L3704P2126P2654j31897K7448o2128j24828q5327N6898j02113
18865c71543J19022J83632Q6857J69738Q5782k30048l10904k64589J83897N0898
$$ plain form
18939 -16152 153765 373970 394532 431343 610418 445314 202541 -369762 -389049 -217579
18929 -217579 -194003 -104354 -235001 -128650 81575 -59852 -136160 -164023 -104201 -189133 3251
18918 3251 -26563 -161373 -99884 49466 -22710 -1717 -193531 -334677 -135222 -43660 103887
18907 103887 582942 749009 446706 79464 -85740 -170917 -447365 -328219 -137090 4848
18897 4848 -303504 -317982 -113889 -80175 -11431 212056 517829 524331 265503 42995 -102050
18886 -102050 -17073 51369 -192066 -288918 -250430 -164006 47738 -220576 -375390 -198996
18876 -198996 -128080 -94376 -22250 50404 -81493 -54045 -116173 -241001 -326328 -269430 -371543
18865 -371543 -252521 -68889 17968 187706 273488 43440 -267464 -532053 -348156 -297258
18855b97258m448k19987j4048K71030J34971J8056L06335j2687j10363P7683L3911
18844A83195k04969Q635j1038R7909j38902j93428J54046n4910J64822P4032m0875
18833C8517n3608Q5300J59301j6579j07774Q9448k30988k71701k8771L13200J76528
18822A52873J08693k50579j1103K04975J27197k28148L7104J31799P0318j68533
18812A74596j1746o4122k62299Q6518Q9682M6060k73637M1109j77154l5802Q4682
18801c02113o298J28983L32422N6711k17372P0995Q7272m648O6210K00976R1615
18790E04753j14892k7152j97410j4663N3374j27828J12407p9431m57459j66801
18780e15102J88219K08178L21950J54241L1965m6664k39874m136K25580r3117
$$ plain form
18855 -297258 -301706 -521693 -535741 -264711 -129740 -111684 194651 181964 71601 149284 183195
18844 183195 -21774 -13139 -24177 73732 -65170 -258598 -104552 -159462 5360 79392 38517
18833 38517 -15091 70209 229510 212931 105157 194605 -36383 -308084 -336855 -23655 152873
18822 152873 261566 10987 -116 204859 332056 103908 141012 272811 343129 174596
18812 174596 162850 98728 -163571 -77053 12629 58689 -214948 -173839 -350993 -386795 -302113
18801 -302113 -308411 -179428 152994 209705 -7667 63328 150600 145952 212162 413138 504753
18790 504753 389861 362709 165299 150636 204010 76182 188589 109158 -348301 -515102
18780 -515102 -326883 -118705 203245 357486 389451 342787 102913 98777 324357 231240
18770B31240l7162p9180j50520p7164p427K16149J38660p7265Q7445J98712j49228
18759B94260k22968m1823L79300J36027k86991l91654n1822J76132J22046R4713
18749B07220J19507k606L0464K74455j18290j51384j53203J41288J01591q8747
18739C60295k89729r4107M6881K45406J00811l21989p6634j20288k0736k797K554
18728a70333k0342J74364L16376p0351j18975M824O5032P2698j5241q1670j22365
18717C4017Q2081L9881l9397p151J80180J36478j42083N1582Q5788j41817k50092
18706B9467j38615J6403K38484L8511R8791K02516N2437k96965j19790N3183j27739
18695D6683K02631L0131n7070j12018P6688j24359p3601K3202p1886j02293K8898
$$ plain form
18770 231240 194078 114898 -35622 -112786 -120213 95936 234596 157331 244776 443488 294260
18759 294260 71292 29469 408769 544796 257805 -133849 -185671 -9539 112507 207220
18749 207220 326727 324121 354585 629040 510750 359366 206163 347451 449042 360295
18739 360295 70566 -23541 23340 268746 369557 47568 -29066 -149354 -170090 -172887 -170333
18728 -170333 -190675 -16311 300065 229714 110739 115563 180595 253293 238052 156382 34017
18717 34017 116098 155979 116582 109431 289611 426089 284006 335588 421376 279559 29467
18706 29467 -109148 -92745 145739 184250 283041 485557 537994 241029 121239 174422 46683
18695 46683 249314 279445 222375 110357 187045 62686 -10915 12287 -59599 -161892 -132994
18684a32994R5960l8312j2591k2467p4644K00083L17739O2279l06910j56938J15253
18673D6458K5242L89964K42808j44889k70502q8958J22498J36364j07178j52405
18663A99402K9436M1781J06357l5559o2423J56478j93751j29870k69050M8649
18653a08550K79225K4368r8430M4991J99529J04390j94435j3565k3411J6203J22762
18642C53077K24329Q8733m12295j74824Q4173o9830l3490K12794N3141j20186
18632B05622m0445j13260m798J0608R8145m5188M9551J12710K03407K89764k29918
18621E36198l41254r3429K02335j05085j39912j06147O2631J30195J37926l2245
18611B51213j34706j90962L80029J62006J62421p1057j19725k65457n8426P4201
$$ plain form
18684 -132994 -37034 -75346 -87937 -110404 -185048 15035 332774 395053 88143 -68795 46458
18673 46458 71700 461664 704472 559583 289081 200123 322621 458985 351807 199402
18663 199402 228838 270619 376976 341417 278994 435472 241721 111851 -157199 -108550
18653 -108550 170675 195043 96613 141604 341133 445523 251088 237523 214112 230315 353077
18642 353077 577406 666139 253844 79020 163193 93363 59873 272667 325808 205622
18632 205622 165177 51917 47119 57727 155872 110684 160235 272945 476352 766116 536198
18621 536198 194944 101515 303850 198765 58853 -47294 15337 145532 283458 251213
18611 251213 116507 -74455 305574 467580 630001 558944 439219 173762 115336 189537
18601A89537j82974K55934M10432L9536o7207K38890L9848m54763j64390k5072
18591B79771R1559j52616j630j86234l6752L36368L01546K7066M3595l00242j24427
18580B78004M3970o3250k46725k53166j81996j03015J28397N02933M87330R6028
18570F88510k0904J27887j31669n03960j50152K31917K20485j44198O0859L0171
18560D08946r5245J70944J79823K50250Q5013O3367q4043J74364L60532K66039
18550A779990J63667M31569M7434o56162p20771l36361K05053j43264M1299L29109
18540A141563K83745k82393m53846k44402O0634L17720L16040M22747J62930J74464
18530A899202M68840N56176m44660m93033l01741m5248p5506j45149J7112q1675
$$ plain form
18601 189537 6563 262497 672929 712465 645258 884148 923996 469233 304843 279771
18591 279771 371330 218714 217084 30850 -5902 330466 632012 659078 702673 402431 278004
18580 278004 321974 258724 11999 -241167 -423163 -526178 -397781 105152 592482 688510
18570 688510 667606 795493 663824 159864 9712 241629 462114 317916 378775 408946
18560 408946 313701 484645 664468 914718 999731 1063098 979055 1153419 1513951 1779990
18550 1779990 1943657 2375226 2422660 1766498 1045727 709366 914419 771155 812454 1141563
18540 1141563 1425308 1142915 689069 444667 505301 823021 1139061 1561808 1724738 1899202
18530 1899202 2368042 2924218 2479558 1986525 1684784 1639536 1564030 1418881 1435993 1354318
18520A354318K29643J90681L07192O51245M31943j3600o03779l69612l43124j40831
18510A694076m2324J16386j13068J69803O2160J91115m6700k56229L2586K41356
18500B049161K31729K23246M93823M02494m88441n37216l28224k78838l35410
18491A432324n8899q1086O5581J53960J72986J78218M73762J45213J08401p6026
18481B514434R4091L50474K64537J59796J45440J53229L31746L56691L52726L92563
18471E115727M56583N60475J244701J749017K672602K938095O19056j877660j634551
18462A1844045m28590L1307N32473J293440K140731L319267N021912P958551J3452140
18453D5165276K2390043L4973765M2538395J3148860l1518302l2894204k1033340
$$ plain form
18520 1354318 1583961 1774642 2081834 2733079 3165022 3151422 2547643 2178031 1834907 1694076
18510 1694076 1651752 1768138 1655070 1824873 1887033 2078148 2031448 1775219 1807805 2049161
18500 2049161 2280890 2504136 2997959 3400453 2912012 2374796 2046572 1767734 1432324
18491 1432324 1373425 1292339 1357920 1511880 1684866 1863084 2336846 2482059 2590460 2514434
18481 2514434 2608525 2958999 3223536 3383332 3528772 3682001 4013747 4370438 4723164 5115727
18471 5115727 5572310 6132785 7377486 9126503 11799105 14737200 15356256 13478596 11844045
18462 11844045 11415455 11446762 11979235 13272675 15413406 18732673 23754585 31713136 45165276
18453 45165276 67555319 102529084 145067479 158216339 126698037 93803833 72770493
18446G2770493j4005397p672367j360937N988540J5547484K8496791M2003745
18439A41768352K5136914l1123534m0118591k5615789j7025866j2215734q123492
18432C2682260m860253k524278p99094N75844K502871M615722P670402J3060513
18424E2923987K2113723L3990208L9410350J0573299l0013234l1894153k1078224
18417G6025956j3707849p047846j26394P628996J7970277L2136451M3781494K1605866
18409A78266951l3262785m2709037k8647234j9922258j4618334j0123786o342673
18402B2640844m458476l314600j995473r87993j56351R89403K210565J588237
18394A6516156j515522l338428k674922j817385j255079q50928p31699o21639
$$ plain form
18446 72770493 58765096 51092729 49731792 55720332 71267816 99764607 141768352
18439 141768352 166905266 135781732 95663141 70047352 53021486 40805752 32682260
18432 32682260 27822007 25297729 24498635 25074479 27577350 32193072 39863474 52923987
18424 52923987 75037710 109027918 148438268 159011567 128998333 97104180 76025956
18417 76025956 62318107 55270261 55143867 62772863 80743140 112879591 156661085 178266951
18409 178266951 145004166 102295129 73647895 53725637 39107303 28983517 22640844
18402 22640844 18182368 14867768 12872295 11884302 11727951 12717354 14927919 16516156
18394 16516156 15000634 11662206 8987284 7169899 5914820 5063892 4332193 3710554
18386C710554n28352m54519n6548j2623o7499j60469j30576j35182k26120n39508
18376A399158k14376r7645j88017j78494j91119J00912M3503r6360K47988K8022
18366H53572l75k3973O0877K2343k68983J05862m8291J49820q1589o5361j53252
18355E50650j65235K00538N4117J15941K45649m309j80518J68889m4656j62029
18345G79037r7025Q5586O3095o0541k79241j40540j78139L1427L78547M5133j58707
18334D68632j6712J13271J659J35646m553n5961j00024k86454J60189L17172J33336
18323H66201k09450l676j8439P0975J86715k86712J30909K11342J37747J97307
18313A282919N29604L58672P0142k38870k34241n57599l10170L15981K13003O22645
$$ plain form
18386 3710554 3182202 2727683 2671135 2658512 2591013 2430544 2299968 2164786 1938666 1399158
18376 1399158 1184782 1087137 899120 720626 529507 630419 673922 577562 825550 853572
18366 853572 853197 829224 890101 912444 643461 749323 701032 850852 769263 703902 550650
18355 550650 385415 585953 640070 756011 1001660 997351 816833 985722 941066 779037
18345 779037 682012 767598 830693 770152 490911 350371 172232 203659 582206 627339 468632
18334 468632 451920 565191 566850 702496 697943 641982 541958 255504 415693 732865 866201
18323 866201 656751 653075 634636 705611 892326 605614 736523 947865 1085612 1282919
18313 1282919 1812523 2171195 2241337 2002467 1768226 1210627 900457 1216438 1429441 2052086
18303B052086N19958j50444l97372l56886n70482j85996L22412L09318P6115J19573
18293A738282K33061j98097m57202j33291k89594P1183J31363L21304Q15403O06092
18283B838504p8449n86826n20087m09468j30818j51328L4713P8068J86793L15330
18273A576432J42914j59618j8890P0234n35551o74075j72759j8607J12327J19818
18263D42225m6153l003J63731J43327K63509m2367j46053J79869o7685N4302j8456
18252I23246M8778q5593N17524J46833j15522k23973j72417l753K79018j70442
18242A143699p6596j9574J03948k54688k2728K02382o3837j76413l56709m16519
18232F2965K43994J48200L5108j6570o0263k64619j59196J36605p8673r6321j67586
$$ plain form
18303 2052086 2572044 2421600 2024228 1667342 1096860 910864 1233276 1542594 1618709 1738282
18293 1738282 1971343 1773246 1316044 1182753 893159 964342 1095705 1417009 2232412 2838504
18283 2838504 2760055 2173229 1653142 1243674 1112856 961528 996241 1074309 1261102 1576432
18273 1576432 1719346 1559728 1540838 1611072 1075521 401446 228687 210080 322407 442225
18263 442225 396072 393069 556800 700127 963636 921269 775216 955085 887400 941702 923246
18252 923246 972024 886431 1403955 1550788 1435266 1211293 1038876 1035123 1314141 1143699
18242 1143699 1067103 1047529 1151477 896789 874061 1076443 1012606 836193 479484 62965
18232 62965 306959 455159 490267 473697 413434 148815 -10381 126224 47551 -48770 -216356
18221b16356O2551K55284L51380K19276j24163J07387J34351l55042j13640Q7546
18211D08574j81763j61610k3796j11025L0652o0795K44106L13003O4835j35661
18201C86520J87864j30536k51366k85651j91071J07760L0293m0835J05289L43427
18191B61694O2716k40244j74221R6897J91105J18029p2627J7174K5296K6027j93060
18180A18786Q6377K0454J88643L7769p9546o8932k2073j029n7027K3847P2781
18169C20050Q3603N8532J64452n2793k3902l41602K2454O1200K4990q0445j58510
18158G8029q5316J25379n4101k7875J796J03434K86134j16445k60686R0699M08885
18147E49933j02910k37765o1944j25926Q5218J35880j6643Q115K04350j09828
$$ plain form
18221 -216356 -153805 101479 452859 672135 547972 655359 789710 434668 321028 408574
18211 408574 226811 65201 41405 -69620 -38968 -99763 144343 457346 522181 386520
18201 386520 574384 443848 192482 -93169 -284240 -176480 -146187 -187022 -81733 261694
18191 261694 324410 84166 -90055 6842 197947 315976 243349 260523 285819 311846 118786
18180 118786 205163 225617 414260 452029 372483 303551 281478 280449 223422 247269 320050
18169 320050 403653 462185 626637 573844 549942 208340 230794 291994 316984 236539 78029
18158 78029 -7287 118092 63991 36116 37912 141346 427480 311035 50349 141048 549933
18147 549933 447023 209258 147314 21388 106606 242486 225843 233958 438308 328480
18137C28480j60256K00651j04559N7569l6819m26074j11490j87196L4966R9828
18127c04900J46496J27760J50703J3715J59008j09566k38156j63757j91415J80
18117d09932J4092N8748J81910O8108K4370J23773N4709j62685K6917j54279J24025
18106e0244K57198n9849L6547J24628o322j58357j19486K11741K70462j77637
18096C28681j12804J73509j77237m01186n677J00962r3639K3241K08358n4152
18086i944k36476J37641L11282K83758j37862q0093k46624j09831j5999j47902
18076b52050J1854J97589K17001Q0663R4900j78332k35539J05302Q3617k6970
18066I8035k45247k5801K85027K04892L10216P7030j09427r7993Q6928q0574l12913
$$ plain form
18137 328480 168224 368875 264316 321885 285066 -141008 -252498 -439694 -404728 -304900
18127 -304900 -158404 -30644 120059 133774 292782 183216 -54940 -218697 -410112 -409932
18117 -409932 -395840 -337092 -155182 -87074 -62704 61069 115778 -46907 -19990 -174269 -50244
18106 -50244 206954 147105 183652 308280 301958 143601 24115 235856 506318 328681
18096 328681 215877 389386 212149 -189037 -194714 -93752 -187391 -164150 44208 -9944
18086 -9944 -246420 -108779 202503 486261 348399 268306 21682 -88149 -104148 -252050
18076 -252050 -240196 -42607 174394 255057 349957 171625 -63914 41388 125005 98035
18066 98035 -147212 -173013 112014 316906 627122 704152 594725 496732 583660 503086 190173
18055A90173j53924M9394J29623q01K79578l29749j8044K46345J64039l7687j45206
18044C73741j03800r5816r192K48850K48853k01977k67422k28929r882K8860J12490
18033I5776K38199q6652k83072J99689k3727N1537P8912M9981l0267M09164J70241
18022H69781m00829j00210k12768P9986O8093K91196j2512j39714j8843J03679
18012E27859N8236q0738k76459K076J47930L94139Q97k69772k92611j60148m42
18001E0967O4962K9116j462O0723O4047O5859J50827R1040j78847Q80n767p8066
17989C14279O2042O5800M0266L0979j58564j90974J58493J91320k45337J2031
17979B80335L70432J77530R5727j51280k61043K7575j09929j39466j7552K08732
$$ plain form
18055 190173 36249 85643 215266 214465 494043 164294 146250 392595 556634 518947 373741
18044 373741 269941 174125 164933 413783 662636 460659 193237 -35692 -45574 -16714 95776
18033 95776 333975 247323 -35749 163940 140213 191750 270662 320643 290376 699540 869781
18022 869781 468952 368742 155974 235960 304053 595249 582737 443023 424180 527859
18012 527859 586095 505357 228898 230974 378904 773043 773940 504168 211557 51409 50967
18001 50967 115929 145045 143583 204306 268353 334212 485039 576079 397232 398112 392345 314279
17989 314279 376321 442121 482387 513366 354802 163828 322321 513641 268304 280335
17979 280335 650767 828297 924024 772744 511701 539276 429347 289881 272329 481061
17969D81061J7168n4899K11665R0356N334K3690k51096k46096K18729L7129k68442
17958B64599L11312L82473L2062j90509m39439K8474O4027p9972k8629j31395
17948B13003j05297j09866K1829J97068O0355J52586l8492n7008L7252J57429
17938E28859J08994j31323L418k9782P361o8111K4725r1860k52805q0296k92n6819
17926c7931K98589L52159J22246k6600J1239J95564J47730J94196N7774K02327
17916A517293N69160Q92346J77391l74725n48402l74947j49164R9820L71604M35943
17906B616319J10941q3452n06821m22460j01436r1067k50991j81074j26216o8753
17896H94990o2049K62192K14998k12251l75334k3126J64718J44847K26686K42843
$$ plain form
17969 481061 498229 443330 654995 745351 750685 774375 523279 277183 495912 533041 264599
17958 264599 575911 958384 990446 799937 360498 388972 452999 373027 344398 213003
17948 213003 107706 -2160 19669 216737 277092 429678 391186 334178 371430 528859
17938 528859 637853 506530 509948 480166 487527 419416 444141 352281 99476 19180 18888 -37931
17926 -37931 260658 612817 735063 708463 719702 915266 1062996 1257192 1314966 1517293
17916 1517293 2086453 2978799 3156190 2781465 2233063 1858116 1708952 1808772 2180376 2616319
17906 2616319 2727260 2643808 2136987 1714527 1613091 1522024 1271033 1089959 963743 894990
17896 894990 832941 1095133 1310131 1097880 722546 699420 864138 1008985 1235671 1478514
17886A478514j41634o6173L72446M59666L83071j34514n01752j92849O4818L27588
17876B049181M21406J68942L31374K76701k60822n63855m98966l74756k46690
17867A302515k21382k5080J22167j44853L27802J93773L2429j9269L00340q456
17857A859986k10428N318K13020J12227J485j07015J0830j39589l3498K107j53123
17846A561320n8244J75028r1292O2958K98251J70457M3019o7769j50207j6884
17836A926637k97157k18577l8932R7904L50013M94056J40320j32006j1588K11795
17826B522465J27921l34828k20720l12997J39576Q5893j18533K09010M26457K82047
17816B806291j55502J57133M16081M7095m54697k27502l35862L4868K696j42140
$$ plain form
17886 1478514 1336880 1270707 1643153 2102819 2485890 2351376 1849624 1656775 1721593 2049181
17876 2049181 2470587 2639529 2970903 3247604 2986782 2422927 1923961 1549205 1302515
17867 1302515 1081133 1056053 1178220 1033367 1361169 1554942 1587371 1568102 1868442 1859986
17857 1859986 1649558 1654876 1867896 1980123 1981608 1874593 1885423 1745834 1712336 1714443 1561320
17846 1561320 1503076 1678104 1586812 1649770 1948021 2118478 2161497 2093728 1943521 1926637
17836 1926637 1629480 1410903 1371971 1469875 1819888 2313944 2454264 2322258 2310670 2522465
17826 2522465 2650386 2315558 2094838 1781841 1921417 2007310 1888777 2097787 2524244 2806291
17816 2806291 2650789 2807922 3224003 3271098 2816401 2588899 2253037 2287905 2290601 2148461
17806B148461O5924J47074J91085n5706R5839L7802q5675M1220K67851J24631
17796B978506j02547l3418q3532K4K86367J80085J87501K1010J64625L09261K07044
17785D114926N8528j89970o3037O4120M78177K17681J25987N68478P70413O95022
17775F840325P12684J139588P56697R77058J166556J036355J869554L030674M680051
17766B2209542P341290Q027838J473076m394104l971008j927622o93426J200021
17758B9265607L617560P697892J2992267K0181215K4309952P033516j5782582
17751H9315427j3332741n980542q14468M873005J2436014K3529912M1407094O8495870
17743B19929571R9377973R2874553J5872836l636333L0332157m86225q6336856
$$ plain form
17806 2148461 2214385 2361459 2552544 2496838 2592677 2630479 2544804 2586024 2853875 2978506
17796 2978506 2875959 2842541 2759009 2759033 3045400 3225485 3412986 3433996 3598621 3907882 4114926
17785 4114926 4173454 3983484 3920447 3984567 4462744 4680425 4806412 5374890 6145303 6840325
17775 6840325 7553009 8692597 9449294 10426352 11592908 12629263 14498817 17529491 22209542
17766 22209542 29550832 37578670 39051746 34657642 30686634 28759012 28065586 29265607
17758 29265607 32883167 40581059 53573326 73754541 98064493 105098009 89315427
17751 89315427 75982686 70002144 69187676 74060681 86496695 110026607 151433701 219929571
17743 219929571 319307544 412182097 428054933 424418600 454750757 454264532 367927676
17736C67927676q8707038n1589206k1544579P178926L5531766L9799104k0400815
17729B68195834o5564660n3473191l6405941k6607435j8921626j2944724q644641
17722D5633616n351759k618042o88446J197781L880854P214916J0224952P476295
17714F6970167N093168J4132441K9805046N0075729O4443336K7458357m9141546
17707B08836698o0191581m1057517k9040942k1360863j4425256r232822o277060
17700B7250657m468146l323559k154277j559301j009607n19042J85498R41716
17692A5343939J812548L164759O449924J1725478J8571722K2024086K273789k0609866
17684F0756379j7772597j1238728q250855n632474l952810l068909k093620j484626
$$ plain form
17736 367927676 279220638 227631432 206086853 213265779 248797545 288596649 268195834
17729 268195834 202631174 149157983 112752042 86144607 67222981 54278257 45633616
17722 45633616 40281857 37663815 36975369 38173150 42054004 49268920 59493872 66970167
17714 66970167 72063335 86195776 116000822 166076551 230519887 257978244 208836698
17707 208836698 148645117 107587600 78546658 57185795 42760539 33527717 27250657
17700 27250657 22782511 19458952 17304675 15745374 14735767 14216725 14402223 15343939
17692 15343939 17156487 20321246 26771170 38496648 57068370 79092456 81366245 60756379
17684 60756379 42983782 31745054 23494199 17861725 13908915 10840006 8746386 7261760
17676G261760j380914q42425o79255m26997k22042p4291J4727j53992m07561m35273
17666B653737j97691Q6153k20458k75810l54024K0532K43024Q7857K04603l44368
17656A903555k57302K2891j99379r0009J01360j58822k78529j59047m0610K87014
17646A131122q637r0617m2188j81483M5738j0644m4684m54742j61012K66745J7997
17635D67595p268p4962l5643p0490j82193J46207J17320N3669N4782j32099j56960
17624A79958j77611r0143o5635j0456K39349Q9397j03109K06452K63122K8596
17614E59920K43803J77761l02151m93548Q4195L7768n2553J78683J12359j19123
17604D27114O0793l4956n7506l9478j60482K64172O3987l9998J88417o0833J708
$$ plain form
17676 7261760 5880846 5038421 4359166 3932169 3710127 3635836 3650563 3496571 3089010 2653737
17666 2653737 2456046 2542199 2321741 2045931 1691907 1712439 1955463 2043320 2247923 1903555
17656 1903555 1646253 1669144 1469765 1379756 1481116 1322294 1043765 884718 844108 1131122
17646 1131122 1122485 1031868 989680 808197 853935 843291 798607 343865 182853 449598 467595
17635 467595 460327 385365 349722 279232 97039 243246 360566 414235 469017 336918 179958
17624 179958 2347 -87796 -153431 -163887 75462 164859 61750 268202 531324 559920
17614 559920 803723 981484 679333 185785 269980 307748 255195 433878 546237 427114
17604 427114 487907 452951 395445 355967 195485 459657 523644 483646 672063 611230 612938
17593F12938k21018q3090k08168p5186o5441j65284K54586J80278j50716J68435
17583B47334K62581N109k10363k04822j58538k37803k23461J40488N6218j8600
17573c41857j29690k83370J31836K54901K3886M0950k07690L8609O2571l5315
17563d45169K49051j14007j68080L3647K38947J14443J3567q8146J13452O1704
17553I409j30140j40065l59980j25556K30855J64697j2104M1808O8028l4800j25475
17542d13323M7015R4847j18294J20975L20833q2002P9683k31927j56338j49213
17532d87744p732m7610J3666J66812J93110M3444N49l26101k74329j01351L60768
17521d66518L86461J55096j79537j4633k26821k71911N2751R33N7602K21462Q1072
$$ plain form
17593 612938 391920 308830 100662 25476 -39965 -205249 49337 229615 78899 247334
17583 247334 509915 515024 304661 99839 -58699 -296502 -519963 -379475 -323257 -341857
17573 -341857 -471547 -754917 -623081 -368180 -344294 -303344 -511034 -472425 -409854 -445169
17563 -445169 -196118 -310125 -478205 -444558 -205611 -91168 -77601 -165747 -52295 9409
17553 9409 -120731 -260796 -620776 -746332 -515477 -350780 -362884 -321076 -253048 -287848 -413323
17542 -413323 -366308 -271461 -389755 -268780 52053 -29949 49734 -182193 -338531 -487744
17532 -487744 -495476 -543086 -529420 -362608 -169498 -126054 -125505 -451606 -725935 -827286 -466518
17521 -466518 -80057 75039 -104498 -119131 -345952 -617863 -565112 -564179 -506577 -285115 -204043
17510b04043n0064p8559K08476k49643j7721L11622Q1762l8300J53014J35258
17500B51802j72722l22669l98898L39456L61829P5849j78011R473k18820j15611
17490c68322l8193q8695K3383j20053O0380J46224K19954Q2339n3411n8927P8877
17479a16444R4870k85872k53894Q2294J35041q1456k18650n4589J18314K09524
17469c70862L54486J44750j02212Q0289j79202k52204j10818m32509M588K13018
17459f50676J19680K21130N6364J58282J05840j80946j34892j05969K3968K47918
17449a39301J80569j65023k1511L23207j17833j07419j48456j03535r3527K9623
17439c63206Q1330R5856j90458k18561L79645K20704M3941o1578j26832k86584
$$ plain form
17510 -204043 -254107 -332666 -124190 -373833 -391554 -79932 1830 -36470 116544 251802
17500 251802 79080 -243589 -642487 -303031 58798 134647 -43364 -33891 -252711 -368322
17490 -368322 -406515 -495210 -471827 -591880 -531500 -385276 -165322 -82983 -136394 -195321 -116444
17479 -116444 -21574 -307446 -561340 -479046 -344005 -425461 -644111 -698700 -580386 -370862
17469 -370862 -16376 128374 26162 106451 -72751 -324955 -435773 -868282 -863694 -650676
17459 -650676 -530996 -309866 -253502 -95220 10620 -170326 -305218 -411187 -387219 -139301
17449 -139301 41268 -123755 -145266 177941 60108 -47311 -195767 -299302 -392829 -363206
17439 -363206 -281876 -186020 -376478 -595039 -215394 5310 49251 -12327 -139159 -425743
17429d25743j53284k00025J47027M12277k19025p6098l5349p4007N3229L52709
17419b18289K35999j80550j54235K2695J49982j64813j24732P7145J16756o9326
17409c09368j25393K61369k8260K4577r0604M3301M310J18206j05249k11804K5555
17398c93360K08312L96332k21209l45735J77623m8923j07792J13915q4776J64717
17388a40896O827N7127J11925k15934j05221J00384J82779n9820k34290j81281
17378d78400j4269j04212j13573q1071Q9521K13833P2113K9904m8019R2603J52227
17367a89343n2229j50047j54676j36356K10747O9599j48651R2374J67303J13009
17357a78270Q0495L265J39327J39742O7075J18j42350n3467J66052K22540J677
$$ plain form
17429 -425743 -579027 -779052 -632025 -219748 -438773 -514871 -550220 -624227 -570998 -218289
17419 -218289 17710 -162840 -317075 -294380 -144398 -309211 -433943 -356798 -240042 -309368
17409 -309368 -434761 -173392 -201652 -177075 -267679 -224378 -220068 -101862 -207111 -418915 -393360
17398 -393360 -185048 211284 -9925 -355660 -178037 -226960 -334752 -220837 -305613 -140896
17388 -140896 -134069 -76942 34983 -180951 -286172 -185788 -3009 -62829 -297119 -478400
17378 -478400 -492669 -596881 -710454 -791525 -702004 -488171 -416058 -386154 -434173 -341570 -189343
17367 -189343 -241572 -391619 -546295 -682651 -471904 -402305 -550956 -458582 -291279 -178270
17357 -178270 -97775 -94510 44817 184559 251634 251752 109402 55935 221987 444527 446204
17346D46204L4894k16969l82239k74847P6595n1676j29564J94186J30396j03130
17336b76150Q8083J26312N9748l91342J04103N32169K56118J11727j34777k2227
17326D53764o9436j3890m680k51618k92410k66593J33840L5039J22695j11516
17316b64805N218l07548N7897K72339M3051L37206k04894m60299J49677L83066
17306A0908Q4521M3943k08891k50212o1130R5921P8636J44515k79748m2165J49262
17295b34440J54221j05451J29095k2863k32277q9743m8398J42674K14883k15344
17285c07643j40307J83447J18409l6183J63936l5302j67098j6795P655J63669
17275f6212J12755j08309R8067n70j0831Q6998J22125M9563j83699j27912j94345
$$ plain form
17346 446204 481098 264129 -118110 -392957 -316362 -368038 -497602 -303416 -173020 -276150
17336 -276150 -188067 -61755 -2007 -393349 -289246 242923 499041 610768 475991 453764
17326 453764 384328 370438 365758 114140 -178270 -444863 -311023 -275984 -153289 -264805
17316 -264805 -259587 -567135 -509238 -236899 -193848 143358 -61536 -521835 -372158 10908
17306 10908 95429 139372 -69519 -319731 -380861 -284940 -206304 -61789 -341537 -383702 -234440
17295 -234440 -80219 -185670 -56575 -79438 -311715 -401458 -449856 -307182 -92299 -307643
17285 -307643 -447950 -264503 -146094 -182277 -18341 -53643 -220741 -237536 -229881 -66212
17275 -66212 46543 -61766 36301 35731 24900 111898 234023 283586 99887 -28025 -222370
17264b22370o7239j549K6594M1360n0164L4692K9153R8067l60623k02693M55249
17253b19523M49376n9061p1590p9459r0138P2209O8139j11022n3104J5331k25290
17242c04132k5956K07990Q8844L9652n2494N0154J81421J9720Q7531J37229r6423
17231C33536J0400L03368L10358n5341k34113k55522R5380J79205L45974J56113
17221A189358j8783j57186l45921r0159m885l57410j49204P8049J93561K29775
17211E67195J62661J44136j07420j36130r0075j19173L09549K58043j55445k79402
17201E53939j46136M8056j43793K08611M5678j09047l00658j15430J87545L6249
17191B65014R9184J66983k23580O6583K6093O6653j7349K12280k0386j63776J23810
$$ plain form
17264 -222370 -289609 -291158 -264564 -223204 -273368 -238676 -209523 -111456 -472079 -674772 -219523
17253 -219523 229853 170792 99202 19743 -70395 1814 69953 -41069 -94173 -78842 -304132
17242 -304132 -330088 -122098 -33254 6398 -46096 4058 185479 205199 292730 429959 333536
17231 333536 343936 647304 957662 902321 668208 412686 508066 687271 1033245 1189358
17221 1189358 1170575 1013389 667468 577309 572424 215014 65810 143859 337420 567195
17211 567195 729856 873992 766572 630442 540367 421194 730743 988786 833341 553939
17201 553939 407803 455859 312066 520677 566355 457308 156650 41220 228765 265014
17191 265014 364198 531181 307601 374184 400277 466930 449581 661861 641475 477699 601509
17180F01509J63614j37711j16207m41993J29340K39614q1415l44669p0944K30586
17170A71724j04199j465j23463o9771J84953J54140p0157l10535m9546J28968
17160h9351J29103Q4401J34301L93572N3591o5647k49776J61080k21073l36473
17150f272k19461J13418J86382j93769k59646n8592Q3647r589k03862j08098L47001
17139c28841j86809P1702K73724L10041q3745k45615k61432j97222J72410K16254
17129b59533J19321j36279q306K6252M0707J53010j04369K19831J09159j64941
17119e148j43815K7276N5189j69105k0769J98854J80797Q5237k81299k66031J8233
17108c20581l1742J89285K36725q6024J93219m8666o8307m92270k088J88524k03275
$$ plain form
17180 601509 765123 627412 511205 69212 198552 438166 356751 12082 -58862 171724
17170 171724 67525 66060 -57403 -127174 57779 211919 141762 -168773 -218319 -89351
17160 -89351 39752 124153 258454 652026 705617 639970 390194 551274 330201 -6272
17150 -6272 -225733 -112315 74067 -119702 -379348 -437940 -354293 -363882 -567744 -675842 -328841
17139 -328841 -515650 -443948 -170224 139817 56072 -189543 -450975 -648197 -475787 -259533
17129 -259533 -140212 -276491 -284797 -258545 -217838 -64828 -169197 50634 159793 -5148
17119 -5148 -148963 -121687 -66498 -235603 -256372 -57518 123279 208516 -72783 -338814 -320581
17108 -320581 -352323 -163038 73687 -12337 180882 132216 63909 -428361 -430449 -241925 -445200
17097d45200K2716L75206q2434j08804M4289J66885L5945j22686k30683J77350
17087a67416J87168l8822q0634r1633j72909M4920O7017j62889j82884K04653
17077c93429K23180k0785j47207J76826J89006j07903Q3015j98045q1167K98885
17067B2376p2728N418K08677J01743K13491j14136p5544j61167J37686j25215
17057A40601j89226r9575J41206R5929j18878j81959j88866O6365P3577j27136
17047c87962O3424j47218J17940J21367p7332m0840j69778K9624J21703K61122
17037a07950J32463O8355j51215j17905J58545K46768n9414k76482k34460M51765
17027A10470J58669j32834j44382k4605J29470L692k47893J42796J36480J11207
$$ plain form
17097 -445200 -422484 -47278 -129712 -238516 -194227 -27342 8603 -114083 -344766 -167416
17087 -167416 19752 -19070 -99704 -191337 -364246 -319326 -252309 -415198 -598082 -393429
17077 -393429 -170249 -191034 -338241 -161415 27591 -80312 2703 -195342 -276509 22376
17067 22376 -50352 -44934 163743 265486 478977 364841 289297 128130 265816 140601
17057 140601 -48625 -148200 -6994 88935 -29943 -211902 -400768 -334403 -260826 -387962
17047 -387962 -324538 -471756 -353816 -232449 -309781 -350621 -520399 -490775 -369072 -107950
17037 -107950 24513 92868 -58347 -176252 -17707 229061 169647 -106835 -341295 110470
17027 110470 269139 136305 -8077 -32682 96788 100480 -147413 -4617 131863 243070
17017B43070j68723j23734M047j23294j31244r3771N7198O4799J13080M0949m1535
17006a59158j12181Q5156o636j29229J79991O8507k97334m1398M6134J24112Q0553
16995a61483j0731O3217Q953j98728l7968n7135m8372n2470o4145K13845R9490
16984b45527n1544j04216J09695N4097J93414Q2517q1297k31014O0175l27481
16974e41181j23665J60095l4698J39590J27842O7701K7800j43500p0982K6734
16964c64264K9210J75676K3050j30946j44581R6925J38195N4688l4155J32251
16954b3951l4552J46010J06738j9369P937q9817L7615M8776k5029K37553l15740
16943G6171m74931Q753K25874k59531k90720L77892K46184K30860J68783j79025
$$ plain form
17017 243070 74347 -49387 -45340 -168634 -299878 -393649 -336451 -271652 -158572 -117623 -159158
17006 -159158 -271339 -186183 -192819 -322048 -142057 -73550 -370884 -412282 -366148 -242036 -161483
16995 -161483 -172214 -108997 -100044 -298772 -336740 -393875 -442247 -494717 -558862 -345017 -245527
16984 -245527 -297071 -401287 -291592 -237495 -44081 38436 -42861 -273875 -213700 -541181
16974 -541181 -664846 -504751 -539449 -399859 -272017 -204316 -176516 -320016 -390998 -364264
16964 -364264 -335054 -159378 -136328 -267274 -411855 -314930 -176735 -122047 -156202 -23951
16954 -23951 -58503 87507 194245 174876 182813 92996 130611 179387 154358 391911 76171
16943 76171 -398760 -390007 -164133 -423664 -714384 -336492 -90308 140552 309335 130310
16933A30310j27664q7840O7678q5905o3842l23458K0602M47845J43401r1019j80329
16922a50221k56881J57885K18376J29609j45317m76640j66075L22530L38174J07015
16912G8455J97727k4453l69564j87333K00075K77598r0522l4628m26352l4024
16902d13021L20093J53182N1220l74519j75998J72909j49761k43727L14313J55814
16892a89495L8292j16255P4677M1987Q9806Q1130j10447k47525r8206K60557l2016
16881b07495J07253K86961r7132k44976j25241J66343J87863j53861L7509J73451
16871A30675P6049n0137l47754n6070k0303J16271k6690j98668p3252j03687K01978
16860c51588L3784j3648j15802j36952J23985J81118r3773j18389K26359K62558
$$ plain form
16933 130310 2646 -85194 -17516 -103421 -167263 -490721 -470119 -22274 121127 30108 -150221
16922 -150221 -407102 -249217 -30841 98768 -46549 -523189 -689264 -366734 -28560 78455
16912 78455 276182 251729 -117835 -305168 -105093 172505 81983 47355 -378997 -413021
16902 -413021 -92928 60254 111474 -263045 -439043 -266134 -415895 -659622 -345309 -189495
16892 -189495 -151203 -267458 -192781 -150794 -60988 20142 -90305 -337830 -436036 -175479 -207495
16881 -207495 -100242 186719 89587 -155389 -280630 -114287 73576 -80285 -42776 130675
16871 130675 206724 156587 -191167 -247237 -267540 -151269 -177959 -376627 -449879 -553566 -351588
16860 -351588 -317804 -331452 -447254 -584206 -460221 -279103 -372876 -491265 -264906 -2348
16850b348j8094j47465k02107j24405P0200j2981j54095l0355K10238j41252j23869
16839f76533R9513K82352K82703M230P4085R5767j98379j11173J6034M757J32498
16828E854J73031R9979J16505j29406l59555k01112K28462J46478K52341q7770
16818B44807j19922N4272j590j91635j7333J60405J25735j55704k01777J67073
16808F4331R8025o3039j73350m8489J80606j07184j13510J2307J1977j15032J83242
16797g0116N7670R5892J39386j88267q0878J20029Q5150k88811o0727Q9818m9665
16786a50519p007p9822k5667K01601J94226P0360q8599J43772L98175j40268j23746
16775C92506k98259j47965N221j86839j40310k5364j29021M95194N09805k00779
$$ plain form
16850 -2348 -20442 -167907 -370014 -494419 -424219 -437200 -591295 -621650 -411412 -552664 -676533
16839 -676533 -577020 -294668 -11965 -7735 66350 162117 -36262 -147435 -131401 -126644 5854
16828 5854 178885 278864 395369 265963 -93592 -294704 -66242 80236 332577 244807
16818 244807 124885 179157 177567 -14068 -31401 129004 254739 99035 -102742 64331
16808 64331 162356 99317 -74033 -122522 58084 -49100 -162610 -150303 -138326 -253358 -70116
16797 -70116 -12446 83446 222832 34565 -46313 73716 158866 -129945 -190672 -100854 -150519
16786 -150519 -157526 -237348 -263015 -61414 132812 203172 114573 258345 656520 516252 392506
16775 392506 94247 -53718 -48497 -235336 -375646 -401010 -530031 -34837 474968 274189
16765B74189m04013j41900j07454k40570J28770J36627Q7472j82370M5550L3800
16755c69899J89797K4185L1806K4179p0306j11445J01236p687r0047O2912J33083
16744h2186J67591Q425r8079j51282j88673J52199K19736l7583j06891M7154k33254
16733c02843p3712K44148J33265k9898o6058j1947p9655J0930k11044k4373j2934
16722d24121k30628j31417K25557J81681j85749p7100R7010l3678p0723m5109
16712f94277p2757L79602L06556O5739p6935n2372j28710k6457n9751j33297J89526
16701c03133m0330K19432m8075m133L983J13497K2914J92055k00006k74479N5226
16690b63049J6623m7970Q6705M71476K9764k05646n3201L07937j53669j6658r6398
$$ plain form
16765 274189 -129824 -271724 -379178 -619748 -490978 -354351 -266879 -449249 -403699 -369899
16755 -369899 -180102 -155917 -124111 -99932 -170238 -281683 -180447 -188134 -278181 -215269 -82186
16744 -82186 85405 93830 -4249 -155531 -344204 -192005 27731 -9852 -116743 -69589 -302843
16733 -302843 -376555 -132407 858 -29040 -95098 -107045 -186700 -175770 -386814 -411187 -424121
16722 -424121 -654749 -786166 -560609 -378928 -564677 -641777 -544767 -578445 -649168 -694277
16712 -694277 -767034 -387432 -80876 -15137 -92072 -144444 -273154 -299611 -359362 -492659 -303133
16701 -303133 -343463 -124031 -172106 -176239 -172256 -58759 -35845 156210 -43796 -318275 -263049
16690 -263049 -246426 -294396 -207691 263785 293549 87903 34702 342639 188970 172312 75914
16679G5914k03242j10868L2324R0852J5785m2503l4865j67977L6061M2170K7539
16668b38810k52130P6307N1698L3488J86999J03783L2669k39694K26867l822j89729
16657b12374j07380J41788K62525j48983k51874k48777Q8756M6810m0740K92011
16647a78238M3944j03814o6860J45641m427J58847j02524k68663n5965k17833
16637f49892K7073L13792L69500O0578m9411K3864j36172j44981J5647m1071o7113
16626b78186K0322j4N3159Q4249K0342M2706q0269J67381R978j16811L11994J79032
16614D13883k72779j41654o6623k20268k26761J01030K39077k73140p4618P686
16604e14167J07117M2789O4456M8808L6626p8482N3533j91289o3348M6920L07608
$$ plain form
16679 75914 -127328 -238196 -205872 -115020 -99235 -141738 -176603 -344580 -308519 -266349 -238810
16668 -238810 -490940 -414633 -362935 -329447 -142448 -38665 -5996 -245690 -18823 -22645 -212374
16657 -212374 -319754 -177966 84559 -64424 -316298 -565075 -476319 -429509 -470249 -178238
16647 -178238 -134294 -238108 -304968 -159327 -163754 -4907 -107431 -376094 -432059 -649892
16637 -649892 -622819 -309027 60473 121051 71640 95504 -40668 -185649 -170002 -211073 -278186
16626 -278186 -257864 -257878 -204719 -120470 -100128 -57422 -137691 29690 39668 -77143 234851 413883
16614 413883 141104 -550 -67173 -287441 -514202 -413172 -174095 -447235 -521853 -514167
16604 -514167 -407050 -364261 -299805 -250997 -214371 -292853 -239320 -430609 -493957 -447037 -139429
16593a39429p1876l1079J99250Q9516q2259j17111Q320J05415k05604l39531O3932
16582e20456J31061M2999O9107q2047M33723J08973j66655q1083j47545q5292
16572b97215K28116p9680k06175J72858K75919J36870J01949j49247n34984l90411
16562g42000J53633K53126M07159R7789r6382l56319l61680J64319K70565k42715
16552d52505L65171J58993j27796O893j3145K2892J70837O7504j42031j29507
16542g2694M1089J0584j73050m607J21435Q2468J21558n1167j52313J17437K4829
16531F5569k36283j52394J75434K48934L4376j96063j83543j03649J0293K69863
16521f7463j08326j43110K51114L19291J12246k01811m71592q233L25647J37073
$$ plain form
16593 -139429 -211305 -242384 -43134 46382 -35877 -152988 -144668 -39253 -244857 -584388 -520456
16582 -520456 -389395 -346396 -277289 -359336 74387 183360 16705 -64378 -211923 -297215
16572 -297215 -69099 -148779 -354954 -182096 93823 230693 332642 183395 -351589 -742000
16562 -742000 -588367 -335241 71918 169707 73325 -282994 -644674 -480355 -209790 -452505
16552 -452505 -87334 71659 -56137 -49244 -62389 -39497 131340 198844 56813 -72694
16542 -72694 -31605 -21021 -194071 -198678 -77243 5225 126783 75616 -76697 40740 65569
16531 65569 -170714 -323108 -147674 101260 135636 -60427 -243970 -347619 -337326 -67463
16521 -67463 -175789 -318899 -67785 251506 363752 161941 -309651 -317884 7763 144836
16511A44836m7821r9540j91910Q2814J52521q7611l8309j14209J37259K53100
16501A91130k54133k09253j55949j6199L6669L16233L73248k07478k17992k5181
16491a68905j30207j2151j34500P1867J44919J63535q034M0366R1750J1442l05273
16480b35191j21086R1522J48988Q8863P4952k04897j2041J06956J3444j60405
16470b08895K7836j98810K7672M8108k95971r5080L43914J85916j42296p6913
16460c84519k7341J41820j1057M9404L52176L03513k75080j93526Q9205L3104
16450G7699m12363j68217J38262J01840k5448P8151K67847K26317j43371k64991
16440a24274L8146K57175N0294r2430k34446M039J14735k00292L3128j04762j76147
$$ plain form
16511 144836 97015 -2525 -194435 -111621 40900 -46711 -85020 -199229 -61970 191130
16501 191130 -63003 -272256 -428205 -444404 -407735 -91502 281746 74268 -143724 -168905
16491 -168905 -299112 -311263 -445763 -373896 -228977 -65442 -73476 -33110 58640 70082 -235191
16480 -235191 -356277 -264755 -115767 -26904 48048 -156849 -168890 -61934 -48490 -208895
16470 -208895 -181059 -379869 -352197 -304089 -600060 -695140 -351226 -165310 -307606 -384519
16460 -384519 -411860 -270040 -281097 -231693 120483 423996 148916 -44610 44595 77699
16450 77699 -334664 -502881 -364619 -262779 -288227 -210076 57771 284088 140717 -124274
16440 -124274 -86128 171047 221341 128911 -105535 -101496 13239 -187053 -153925 -258687 -434834
16429d34834J04505m751M5163L9598q1421P9717K05834p8528p1392l06290J22934
16418c79465M62525K97655j31834l72673j29968L08915Q8334l45670l2290K03016
16408c1455K71415M76048l22353n31079p0114K39284J12056k32459k51963K9546
16398c11074R6226k04854j2711K16535J58937j4443M688q9310j06671Q0754N3645
16387a28278j22825j97793K21641J46001j44492j54015n2488K29880M6052P2453
16377h3864J33711j51311m9037L2400J8531J07939L9987K20129J2654j88975J01667
16366A93831J85067j22146k01012j41885j31258k66089k85220K53021L74961O4040
16356g6690N9595J1898k06364l9009J50882J73753n9021k32157j93445n7934J18953
$$ plain form
16429 -434834 -330329 -335080 -289917 -250319 -331740 -252023 -46189 -124717 -196109 -502399 -379465
16418 -379465 83060 380715 248881 -123792 -253760 55155 143489 -202181 -234471 -31455
16408 -31455 239960 716008 393655 -137424 -207538 31746 143802 -88657 -340620 -311074
16398 -311074 -214848 -419702 -432413 -215878 -56941 -71384 -66696 -156006 -262677 -181923 -128278
16387 -128278 -251103 -448896 -227255 -81254 -225746 -379761 -432249 -202369 -156317 -83864
16377 -83864 49847 -101464 -150501 -118101 -99570 8369 48356 268485 281139 92164 193831
16366 193831 378898 256752 55740 -86145 -217403 -483492 -768712 -515691 -140730 -76690
16356 -76690 -17095 -5197 -211561 -250570 -99688 74065 15044 -217113 -410558 -468492 -349539
16345c49539J39912K98363K87334l58255j5635P030K20070Q0526k82727j1529
16335A5550K61658j1490l33034k58438L1842J5497J19049j02788L9639J15040
16325a07475L25061L43390j40639k09459k12619j10175j52073p5933P2540K76180
16315H798J09952r6413k72871K1499J18016m2540J44554p2436Q385k02900q1599
16304c57555M03464L00608k9287k56993j27218M604p7858M7293r3585k9359N8053
16293a57833q0051J29033n6036L9161l7364K23185L7659m4315m51Q0058P4731
16282B07777q2102j85416J87403L75353l5116j70592L1275j91512j53117l23915
16272c39962j38564K05369K25405j32213l15640j84397k1851K39136N2292j82367
$$ plain form
16345 -349539 -209627 88736 376070 17815 2180 9210 229280 309806 27079 15550
16335 15550 277208 265718 -67316 -325754 -293912 -278415 -159366 -262154 -222515 -107475
16325 -107475 217586 560976 420337 210878 -1741 -111916 -263989 -339922 -267382 8798
16315 8798 118750 22337 -250534 -229035 -111019 -153559 -9005 -81441 -73056 -275956 -357555
16304 -357555 45909 346517 317230 60237 -66981 -62377 -140235 -92942 -186527 -215886 -157833
16293 -157833 -237884 -108851 -164887 -125726 -163090 60095 97754 53439 52988 133046 207777
16282 207777 125675 -59741 127662 503015 467899 297307 328582 137070 -16047 -339962
16272 -339962 -478526 -273157 -47752 -179965 -495605 -680002 -701853 -462717 -410425 -592792
16262e92792J02156K90240K90956O5585n13320r7126L83673Q7738n178N2987j94531
16251a29612l2916K29974k23051q9037Q8449o687n5703k34015j81118J04647P848
16240e21221n6845K33602J42409K408j44159j14634J39405K95005J56244J16355
16230B48569l40809k48517m9418N5518R0473J07991J30256P1267m847k5212k88023
16219b52752n750J94003L44820j19673m37972p1369R6813j14728J1300J28897
16209b26411r1677q8084J56827J59512p43J288m9745j74629J62299L10470k75896
16198a16789m1324L44658J05277M6667j72795j40312r1519l8698O9171j00659
16188a36323O8022N543j42351k27410J96877L59712j4063o7181j59144j47712
$$ plain form
16262 -592792 -490636 -200396 90560 156145 -357175 -454301 -70628 17110 11932 64919 -129612
16251 -129612 -162528 67446 -155605 -244642 -156193 -162880 -218583 -452598 -633716 -529069 -521221
16240 -521221 -578066 -344464 -202055 -199647 -343806 -458440 -319035 -24030 132214 248569
16230 248569 -92240 -340757 -390175 -334657 -244184 -136193 -5937 65330 60483 35271 -252752
16219 -252752 -258502 -64499 280321 160648 -277324 -348693 -251880 -366608 -355308 -226411
16209 -226411 -318088 -406172 -249345 -89833 -90576 -89288 -139033 -313662 -151363 159107 -116789
16198 -116789 -158113 186545 291822 338489 165694 25382 -66137 -104835 -35664 -136323
16188 -136323 -68301 -62758 -205109 -432519 -235642 124070 110007 42826 -116318 -264030
16178b64030j48019J59522K37086q4853J03159j6825k41976J91587K78477L15365
16168E29493k4762q3457j54775k45389j21150k55921l02158J62789J62630q7049
16158d19749k74144J75235K79598K3197J03806m2784p2661j04730j83568R406
16148e06394K24511Q3013K30045J30542k04217m18429J56782J26774q0919j19083
16138c77375j1028L60463J52319k09363j27255J42749Q621P4283p773j16867k61390
16127c72616K45265M08448L3484j52234R1379K48355N1437k52064j19398o3329
16117A18727r8437k10997J02297J09893j79535k34687j34762N7195j38196Q506
16107e99996L37472m8038P8046p6572k20758m7337J1402j03460K84112o786r2466
$$ plain form
16178 -264030 -412049 -252527 -15441 -100294 2865 -13960 -255936 -64349 214128 529493
16168 529493 504731 421274 266499 21110 -100040 -355961 -658119 -495330 -332700 -419749
16158 -419749 -693893 -518658 -239060 -215863 -112057 -154841 -227502 -332232 -515800 -506394
16148 -506394 -281883 -198870 31175 161717 -42500 -460929 -304147 -177373 -258292 -377375
16138 -377375 -388403 -27940 124379 -84984 -212239 -69490 -60869 13414 5641 -111226 -372616
16127 -372616 -127351 281097 314581 162347 253726 502081 553518 301454 182056 118727
16117 118727 20290 -190707 -88410 21483 -158052 -392739 -527501 -470306 -608502 -599996
16107 -599996 -262524 -310562 -232516 -309088 -529846 -577183 -565781 -669241 -385129 -391915 -484381
16096d84381J47410L33663J98625j08689k64405k74453K0311O5198J23077K7512
16086b16132M1008K95961m7974l13083l87865J63412R8922p8903j09911P6187
16076d78378J42131J34191K41111j9499j3917j45723j04157o1669r680L17407
16066A817L84498l45629j8995n7205o6924P6541K07089L39775J84811j34375l44009
16055B27394k89895j02289K6954K7852J6057J89935l00651o3290n431K25284J38829
16044I0749P0940J67235j68282O9528P2181j33401k00013k24828P7636J67871
16034a0384q5506M4165J40209K3324j39836R2894n3307J31977J21472j85713p6320
16023B975K0525j13564l65392K8894J47684L47666J91851P4002j25463N3576K59816
$$ plain form
16096 -484381 -336971 -3308 195317 86628 -177777 -452230 -431919 -366721 -243644 -216132
16086 -216132 -175124 120837 72863 -240220 -628085 -464673 -365751 -444654 -554565 -478378
16076 -478378 -336247 -202056 39055 19556 5639 -140084 -244241 -305910 -315590 1817
16066 1817 386315 40686 21691 -35514 -102438 -25897 181192 520967 705778 571403 227394
16055 227394 -62501 -164790 -137836 -109984 -93927 96008 -204643 -267933 -273364 -48080 90749
16044 90749 161689 328924 160642 230170 302351 168950 -31063 -255891 -178255 -10384
16034 -10384 -95890 -51725 88484 111808 -28028 64866 11559 143536 265008 79295 2975
16023 2975 23500 -90064 -455456 -426562 -278878 68788 260639 334641 209178 262754 522570
16012E22570r2056K42914m8566q9042j83534j37787r980n4145J05202q7718p865
16001A59993n0961J19889N0836L9350J9836m63200l67619J10697m5709J30058
15991b96830L03899J17801J73672l09178k38360L06496K37007j77171k0025L24175
15981D21486j50342j46201l10672j16702j82765J42160J11749J22328O5722R3397
15971E0160j83981j36888N0604J57402K40072j54764J426Q5045j0312j57725j94331
15960b53292K51490j04254j19723J142K93289o246l3175L689J66457M03071O4538
15949F66986l2506l64108j76426k24286k14357K25596R8417L5370o8760k38248
15939b92322l9055K33902N4572L2709k38733k03661L28927J06840j7953Q6591
$$ plain form
16012 522570 430514 673428 624862 535820 352286 214499 204519 150374 255576 167858 159993
16001 159993 109032 228921 279757 319107 338943 -124257 -491876 -381179 -426888 -296830
15991 -296830 7069 124870 298542 -10636 -248996 57500 294507 117336 97311 421486
15981 421486 271144 124943 -185729 -302431 -485196 -343036 -231287 -108959 -43237 50160
15971 50160 -133821 -270709 -220105 -62703 177369 22605 24031 109076 98764 -58961 -253292
15960 -253292 -1802 -106056 -225779 -224637 68652 62406 29231 32920 199377 602448 666986
15949 666986 634480 270372 93946 -130340 -344697 -119101 -20684 14686 -54074 -292322
15939 -292322 -331377 -97475 -42903 -10194 -248927 -452588 -123661 -16821 -34774 51817
15929E1817j16996l61912J74851L2340L02902M4404k60838J346J66225J38060
15919A72199J35608R4501j66397j52535J18647J34642k18327j90469n6905K00885
15909G1849q8657l98472O7334P5086J87380J89066j27772k5499P5221j87529j17802
15898b79795J99144O3857Q3765J37126j79779j00147K6669k07570j75729R7744
15888c34715j96718J09581M01373R6766j23718k24569K4118Q0870j13053O7846
15878b12219P0198j71125K357L23475K08879n3990j93141J28598K75070M0813
15868D18915r5026j31403j55698m08785M6573J05081M5853J35524K4568M6897
15858C2499J09221L01601K8282r2618j03714o7204p4878P3102k42201j23063J23776
$$ plain form
15929 51817 -65179 -427091 -252240 -219900 83002 127406 -133432 -132086 34139 172199
15919 172199 307807 402308 235911 83376 202023 336665 118338 -72131 -129036 71849
15909 71849 -16808 -415280 -347946 -272860 -85480 103586 -24186 -49685 25536 -161993 -279795
15898 -279795 -80651 -16794 66971 204097 24318 -75829 -49160 -256730 -432459 -334715
15888 -334715 -531433 -421852 -20479 76287 -47431 -272000 -247882 -167012 -280065 -212219
15878 -212219 -142021 -313146 -310789 12686 221565 167575 -25566 103032 378102 418915
15868 418915 323889 192486 36788 -371997 -325424 -220343 -174490 -38966 -14398 32499
15858 32499 141720 443321 471603 378985 275271 208067 133189 206291 -35910 -158973 -35197
15847c5197J01554j07879j24126J2067m6839J94525m516l78784Q2814J33061J61941
15836a1379L2741P5750j43974k03337m4256j1580N0265k8297P3306r2218P2427
15825b30552M0256L509J74830J33607l04439j74210j62064K7110M0230o4527K15410
15814c00840J93180m1049O2129L6043J09521j08700m0774J07452L29705j0490
15804C36177k10330L5280l6319O3006L0875k1192k20205k47536l859J2212j2402
15793b74293R3479k83585n7088K62277L75523K52244K6314k11348j67820N0146
15783F5849o1268j01064j25370O7921R8269j90386J22651l219j15676N944K36969
15772F20J94075J46465j13501k94486j34747J03541j4935J3134j15591j45611
$$ plain form
15847 -35197 66357 -41522 -165648 -153581 -200420 -5895 -10411 -389195 -306381 -173320 -11379
15836 -11379 21362 97112 -46862 -250199 -294455 -306035 -255770 -284067 -210761 -302979 -230552
15825 -230552 -190296 -186787 -11957 121650 -182789 -356999 -519063 -491953 -451723 -516250 -300840
15814 -300840 -107660 -148709 -86580 -50537 58984 -49716 -90490 16962 346667 336177
15804 336177 125847 161127 124808 187814 218689 197497 -22708 -270244 -274103 -261891 -274293
15793 -274293 -180814 -464399 -521487 -259210 116313 368557 394871 183523 15703 65849
15783 65849 4581 -96483 -221853 -153932 -55663 -246049 -123398 -126617 -242293 -236349 620
15772 620 194695 341160 227659 -66827 -201574 -98033 -112968 -99834 -215425 -361036
15762c61036K01246L77167L07755j38956l73713k33242J95080j7486O032L39402
15752C02249P4828j54546k53538m08789n0589N4123J16230K23559j01279M0638
15742a57114o9711K53798K2623k15662J17144K95099n8541j28011p5848J0056
15732f167m1734j40575m7729p9572j93990J49548J1374J63745N6134K28524o6591
15721C2967l14669j58955K52188L52892J55946r4722j27449J36318P3332j07731
15711B00117J0080J69840n4823K3441M8928j52754j7492O9164q478j97726k89300
15700a99003K26503R3703l62731j54979j6475M10406K92479Q6513m87316k37119
15690c48019j93477k78075K36118J61789K07370J65258K9068P5924j38530j04839
$$ plain form
15762 -361036 -159790 217377 525132 386176 12463 -220779 -25699 -43185 -37153 302249
15752 302249 377077 222531 -31007 -439796 -490385 -436262 -320032 -96473 -197752 -157114
15742 -157114 -226825 26973 49596 -166066 -48922 246177 187636 59625 -16223 -6167
15732 -6167 -47901 -188476 -236205 -315777 -509767 -360219 -348845 -185100 -128966 99558 32967
15721 32967 -281702 -440657 -188469 164423 320369 225647 98198 234516 307848 200117
15711 200117 210197 380037 325214 348655 397583 244829 227337 296501 288023 90297 -199003
15700 -199003 27500 121203 -241528 -396507 -412982 -2576 289903 376416 -110900 -348019
15690 -348019 -541496 -819571 -583453 -421664 -214294 -49036 -19968 55956 -82574 -187413
15680a87413K29490R4786j30630k6174J19440m2297j10509j25371k17859p7647
15670d74184r4739n0552K02991L12928m2248l5840M8491L0706K90253j6359j55253
15659A6194j89152K5837j39439r6386Q8213J17819R3204M7493n9448j77355j17256
15648c90276J01032J51950N0552r7093p604K37596J16150k20097K00450l1743
15638A10917j43740J908j78025J41258L7711r8461j46281K79393K66870l28287
15628e6737r6255Q8014J37170k4667j08702P5156J23444o2335j93085o9393P9900
15617a07490K468o9809P7972J34586j2185j03639J97825J08658J9690k35583j16657
15606a04164k0450j30396K72961j36630j3908K1280k12694K53940Q7823J14316
$$ plain form
15680 -187413 42077 136863 6233 -19941 99499 57202 -53307 -178678 -396537 -474184
15670 -474184 -568923 -619475 -416484 -103556 -145804 -181644 -133153 -102447 187806 171447 16194
15659 16194 -172958 -147121 -286560 -382946 -294733 -176914 -83710 -36217 -95665 -273020 -390276
15648 -390276 -289244 -137294 -86742 -183835 -191439 46157 162307 -57790 142660 110917
15638 110917 -32823 -30915 -208940 -67682 -29971 -128432 -274713 4680 271550 -56737
15628 -56737 -152992 -64978 72192 47525 -61177 13979 137423 75088 -117997 -187390 -107490
15617 -107490 -105022 -174831 -96859 37727 25542 -78097 119728 228386 248076 12493 -104164
15606 -104164 -124614 -255010 17951 -118679 -132587 -111307 -324001 -70061 17762 132078
15596A32078M1203j29215k7075O0606J17616j25790n22524j8664M14322j24301
15586a81744k35765j06453m9264L06573Q9037j2844J58304M4153j9182j12436
15576a19621N6892Q836q5503k5335l1298J14281J31719K80769l20l90514m3427
15565a03521j62193l8732J84524K15140j2781J09463k0422K05840j53938k66128
15555d2748o8642L56969j17581k83972k24147j22558Q1470R4178K16825j71817
15545b82023J08984J35303K21330J18657R4817k45764j81756K0354J3823J16360
15535A20085m2797K04496K32839o5978r6536r038j36264j39928j68649j94135
15525b95905K02275j71326k05975l212K44734K91973Q3211N082N4583l3555j75499
$$ plain form
15596 132078 173281 44066 16991 77597 195213 69423 -453101 -471765 -57443 -181744
15586 -181744 -417509 -523962 -573226 -266653 -177616 -190460 -32156 11997 -7185 -119621
15576 -119621 -62729 -53893 -139396 -164731 -196029 -81748 49971 330740 330420 -60094 -103521
15565 -103521 -265714 -304446 -119922 95218 82437 191900 171478 377318 223380 -42748
15555 -42748 -111390 245579 127998 -155974 -380121 -502679 -421209 -327031 -110206 -282023
15545 -282023 -173039 -37736 183594 302251 397068 151304 -30452 -10098 3725 120085
15535 120085 77288 281784 514623 448645 352109 343071 206807 66879 -101770 -295905
15525 -295905 -93630 -264956 -470931 -474143 -229409 62564 145775 150857 205440 171885 -3614
15514c614K09506J10149N1878q7556j35189R671J9062j4141k20610M453k81558
15503c37949N2656K73165K41618Q5228J04058o4068q9378Q6893J33823j26978
15493C59068j90097J35929J91035m12981K1551J66205p6267j98018j84723M0457
15483a47841j71817j74342K69603Q1455j41095r4283l4944K66376J44337K02203
15473A99652K7693j58845j69546N3280k34302j04934K47930m1329k0535j44721
15463c45657K03883R7448q6557M4086K42624k85871q7752J04261J78390r819p8684
15452b3648N3959n9284j37830m469j67877L25710K49211o5889J15107n8693j7388
15441B08909m9242j53704l71198M27803M54067j01966k29003k64168J1230J24121
$$ plain form
15514 -3614 205892 316041 367919 280363 145174 154845 173907 159766 -60844 -56391 -337949
15503 -337949 -285293 -12128 229490 314718 418776 354708 265330 352223 486046 359068
15493 359068 168971 304900 495935 82954 104505 270710 194443 -3575 -188298 -147841
15483 -147841 -319658 -494000 -224397 -142942 -284037 -378320 -413264 -146888 -2551 199652
15473 199652 227345 68500 -101046 -47766 -282068 -387002 -139072 -180401 -200936 -345657
15463 -345657 -141774 -44326 -130883 -86797 155827 -130044 -217796 -113535 64855 55036 -23648
15452 -23648 30311 -28973 -166803 -171272 -339149 -13439 235772 169883 284990 226297 208909
15441 208909 159667 5963 -365235 62568 516635 414669 185666 -78502 -67272 56849
15431E6849J11166J14283k36404k29898k73265J47576M4300k273R1995j20633
15421b96304J3647M81936j98052k09903J9107j7025L8464j93648m984K42351O7134
15410e7277o0970o5333n9547K17995R9574j08372j27603l62417J22351K14830
15400a86769J98108J26070K02953q1431k87626j40359k29582K00284Q1373J3924
15390a03055l4345K85979M6386r1730J2840k94842k25889J71424J7887R7497q9181
15379b07029k93406j70672K2172J761J32277J66422N7480P1794M2385R423k85008
15368d52401J86489J37259k12536L6692L02975L851M5058J76290J37263o8120
15358B92820k5296q4377J45039L2462l35195m0139j12730o7594J32296k22205
$$ plain form
15431 56849 168015 282298 45894 -184004 -457269 -309693 -265393 -267666 -175671 -296304
15421 -296304 -282657 199279 1227 -208676 -189569 -206594 -168130 -361778 -366762 -124411 -57277
15410 -57277 -118247 -183580 -243127 -25132 74442 -33930 -161533 -523950 -401599 -186769
15400 -186769 11339 137409 340362 258931 -28695 -169054 -398636 -198352 -116979 -103055
15390 -103055 -137400 148579 194965 103235 116075 -178767 -404656 -233232 -215345 -117848 -207029
15379 -207029 -500435 -671107 -648935 -647174 -514897 -348475 -290995 -219201 -176816 -167393 -452401
15368 -452401 -265912 -128653 -341189 -304497 -1522 2329 47387 223677 360940 292820
15358 292820 267524 183147 328186 360648 25453 -14686 -127416 -195010 -62714 -284919
15348b84919K29504J62451j69973j38024j447K44591J42744j79347K3788q579
15338B0789K3171J63997m2130j08196M9884j24360K39020l37j63779j6799J09834
15327A51094r081l34370q0560j71554k8391L46629p4759J5216j90001J15338J90087
15316g0352o4631p8995o0946P1916k2337L1403k6210j39928j8050j9716L36234
15305f1612K61889j74474k89300J27902j3804j13J21255R2639j22105j3520j6727
15294h7970j49631k47133J09898J07300j17655N5255J14057Q4345k5974k27125
15284c84633l4609J11678K05070L58587O7686k09485j42600j73346R240L9157
15274a53255K90152J22368j34278N8006M50746P7600l26625l69323L6446n5567
$$ plain form
15348 -284919 -55415 107036 -62937 -200961 -202408 42183 184927 5580 29368 20789
15338 20789 43960 207957 165827 57631 107515 -16845 222175 221838 58059 41260 151094
15327 151094 142013 -192357 -272917 -444471 -472862 -126233 -200992 -185776 -375777 -260439 -70352
15316 -70352 -134983 -213978 -274924 -203008 -225345 -193942 -220152 -360080 -378130 -397846 -61612
15305 -61612 200277 25803 -263497 -135595 -149399 -149512 -28257 64382 -57723 -71243 -87970
15294 -87970 -237601 -484734 -374836 -267536 -385191 -329936 -215879 -131534 -157508 -384633
15284 -384633 -419242 -307564 -102494 256093 323779 114294 -28306 -201652 -192412 -153255
15274 -153255 136897 259265 124987 182993 633739 711339 384714 15391 51837 -3730
15264c730o9550O7187J17468K8638J26808J89328j58025q3134k35587l8959J45187
15253H5631J88675r6691o6807n1453l49058L8078M40791Q0567Q2095J85841j10939
15242D26730j81423j25208N6452J21068j02332J49418r074k1954j91999q9237
15232C2441m7430j27764M333K16815j6953k0592k0992M1189O4609k19233J27145
15221C3568j73918l1223K3823J15585J90971q7063j46478j77153K16592J40843
15211A05547K5986l35385o6100K71611L65280j11535j64800k45231j42420Q8843
15201b08204j21518R056K19201M2988k28537J28129J66536O328n0692j69150P576
15190a98287L7904J86170K50545Q6465m01907r7187K24772K1768j95145L2132
$$ plain form
15264 -3730 -73280 -6093 111375 140013 266821 456149 298124 214990 -20597 -59556 85631
15253 85631 274306 177615 110808 59355 -289703 -251625 189166 269733 351828 537669 426730
15242 426730 245307 120099 176551 297619 195287 344705 335631 313677 121678 32441
15232 32441 -14989 -142753 -138420 78395 61442 40850 19858 61047 125656 -93577 33568
15221 33568 -140350 -171573 -147750 -32165 158806 71743 -74735 -251888 -35296 105547
15211 105547 131533 -203852 -269952 1659 366939 255404 90604 -154627 -297047 -208204
15201 -208204 -329722 -320666 -101465 -58477 -287014 -158885 7651 13979 -36713 -205863 -198287
15190 -198287 -160383 25787 276332 362797 -39110 -136297 88475 110243 -84902 -52770
15180e2770k0131J57277q5906j51035R6419K98816j01055k94497l36264j1297
15170e00443R1359Q2964J332j30259n5122L7228K03968J6518k98708K03641K11368
15159a36154K29023J57682p0691q8318L8513K26272J46769J95895k20489l01056
15149A77446j63542j08741J2094J59570j04418j54918q9606k2017K14232R1363
15139A1463j58628j86049P1622L00456K58126k7113j41375j56661j07479j08360
15129b43998N5989K67114r8404J1520K23187j76340Q8609J70373m8958k18061
15119C1031k29284p9047L33528J60399j62883l59589J14129l6461o7173R9659
15109a95691Q2611O167j38263j78773J54490n2111m4076R8885K28582j02838L9148
$$ plain form
15180 -52770 -72901 84376 -1530 -152565 -56146 242670 141615 -152882 -489146 -500443
15170 -500443 -409084 -326120 -324788 -455047 -510169 -472941 -268973 -252455 -551163 -347522 -136154
15159 -136154 92869 250551 179860 91542 130055 356327 503096 698991 478502 177446
15149 177446 13904 -94837 -82743 76827 -27591 -182509 -272115 -294132 -79900 11463
15139 11463 -147165 -333214 -261592 38864 296990 269877 128502 -28159 -135638 -243998
15129 -243998 -188009 79105 -19299 -7779 215408 39068 127677 298050 249092 31031
15119 31031 -198253 -277300 56228 216627 53744 -305845 -191716 -228177 -295350 -195691
15109 -195691 -113080 -106913 -245176 -423949 -269459 -321570 -365646 -266761 -38179 -141017 -101869
15098a01869o5951J01336M7650J46992K09751Q4001j15098j54742j28573l1037
15088g540J04238j48203l5309j21625l313J88103k5582J87613n3560j70462k87860
15077c73500r2060L21921N2583J44229K27120j56255k7813N1671J19118k2752
15067B44262l0921l284j22613L9771k1777M666O3429l19353k9663N010m8158J04163
15055a14468J43331J99155k58465k48611J28257Q5091K3663J6535L25895J16746
15045D17129r5114K0119L02601K3787j39529m23642n4199j030j41233q9785L28739
15034A47843n3689J0221p4962k8915M5389j66932j12208j04154J61783J93955
15024A8331p9454K1042n6329M61J90967j11911J73882j32166m62903M8111K64537
$$ plain form
15098 -101869 -167820 -66484 -18834 128158 337909 421910 306812 152070 23497 -7540
15088 -7540 96698 -51505 -86814 -208439 -211752 -23649 -49231 138382 84822 -85640 -373500
15077 -373500 -465560 -143639 -91056 53173 280293 124038 96225 147896 267014 244262
15067 244262 213341 210057 87444 127215 105438 110104 173533 -145820 -175483 -170473 -218631 -114468
15055 -114468 28863 228018 -30447 -279058 -150801 -65710 -42047 -25512 300383 417129
15045 417129 322015 342134 644735 668522 528993 105351 51152 50122 -91111 -180896 147843
15034 147843 94154 104375 29413 498 45887 -121045 -233253 -337407 -175624 18331
15024 18331 -61123 -40081 -96410 -95949 95018 -16893 156989 24823 -438080 -389969 -125432
15013a25432L96181O5555j77375j13927J16603r5389k67177k48877O8964j26444
15003e07318J22885K53807K07580l43742k54693J46635K54856K34075P3157o7271
14993A19971l01759o6389Q5570n4886Q7671j09009k57139K2309j19015R7379K33265
14982b62032O6495J80621L8067j14654O3926K66281J1014l56104L1515N895J19613
14971E0637j85338j16346J53470J92111J90040O789j46888j41670n2172j69610
14961b18977J31212J73466P6585j97983l36516J4592K53964L8622l0149J34809
14951C9625K28126j95283k21781J31685J44354P4453j62572J6811R2308K55337
14941D03063k285j47649r8116J1482J16267j47916l9842P8912j31013n80J63295
$$ plain form
15013 -125432 270749 336304 158929 45002 161605 66216 -200961 -449838 -380874 -507318
15003 -507318 -384433 -130626 76954 -266788 -521481 -374846 -119990 114085 187242 119971
14993 119971 -181788 -248177 -162607 -217493 -129822 -238831 -495970 -473661 -592676 -495297 -262032
14982 -262032 -195537 -14916 23151 -91503 -27577 238704 249718 -106386 -74871 -68976 50637
14971 50637 -134701 -251047 -97577 94534 284574 291363 144475 2805 -49367 -218977
14961 -218977 -87765 85701 162286 -35697 -372213 -357621 -103657 -65035 -95184 39625
14951 39625 267751 72468 -149313 -17628 126726 201179 38607 55418 147726 403063
14941 403063 400778 253129 155013 166495 282762 134846 95004 173916 42903 42323 205618
14930B05618J14534k31406r9996j02132M8017L66585r6163K6727m0680j26456
14920F4648j2920L87749p9817m08341j34520K99241K78761o0305P2642j61823
14910B45315j62903n2347j49305r550J27658l2005j13097J07061r2932k6238K3849
14899a34494k2168j62290K50728K63424j28107j03576j59895K6897J25057k9599
14889g4023j62589J73821J97649j50033M5028O0244k48713O4842L47507p8182
14879A75551n7729j47830J16610K3658l8718j1300j08277l06320M44627K51308
14869C41580l0766k48064k35883j24246j443M7180K96560M8124K7457j10288J6240
14858B6451M0309Q2295p7240j23961M939p853K21505N7517j41855q395J51314
$$ plain form
14930 205618 320152 88746 -11250 -113382 -65365 301220 205057 231784 191104 64648
14920 64648 51728 439477 359660 -48681 -183201 116040 394801 334496 407138 245315
14910 245315 82412 30065 -119240 -128790 -1132 -33137 -146234 -39173 -132105 -158343 -134494
14899 -134494 -156662 -318952 -68224 195200 67093 -36483 -196378 -169481 -44424 -74023
14889 -74023 -236612 -62791 134858 -15175 29853 90097 -158616 -93774 253733 175551
14879 175551 117822 -30008 86602 110260 71542 60242 -48035 -354355 90272 341580
14869 341580 310814 62750 -173133 -297379 -298822 -251642 44918 93042 120499 10211 26451
14858 26451 66760 149055 71815 -52146 -47207 -55060 166445 223962 82107 73712 225026
14847B25026l526l51927m16726n7533L5140M3379J96935K79495l47273j63050
14837e60060L45401K09888q1573p345L36069M61514j92501l62246N9120j94645
14827A3622j9243J65871L45433N5157k53498p9200M5452k23861R1159r7572j28236
14816h4916R2239q768n8174J55796L59572k22106k54652k96706J15595K52201
14806E0081J03453J04126J05071j83962m8938J7690J0473Q7576O5773k44938r2205
14795b5800M1822l1058j68489j72331J03527L41800J34588J77156j81820j07850
14785A11545M088m8085R2282J78196L6053k00245m0342m1609l9495n0809j29023
14774a27444o3366R3295K16257j75827k48071K70272Q492r5350r5334n1001N1199
$$ plain form
14847 225026 221500 -130427 -547153 -604686 -569546 -526167 -329232 -49737 -397010 -560060
14837 -560060 -214659 -4771 -86344 -93689 242380 703894 511393 149147 208267 13622
14827 13622 -5621 160250 505683 560840 307342 228142 273594 49733 140892 43320 -84916
14816 -84916 7323 -1445 -59619 96177 455749 233643 -21009 -317715 -202120 50081
14806 50081 153534 257660 362731 178769 129831 147521 157994 245570 311343 66405 -25800
14795 -25800 16022 -15036 -183525 -355856 -252329 89471 224059 401215 219395 111545
14785 111545 115633 67548 159830 338026 374079 173834 133492 91883 52388 1579 -127444
14774 -127444 -190810 -97515 118742 -57085 -305156 -34884 -26392 -121742 -217076 -268077 -216878
14763b16878j7624L02278N75287j14284k60742j13675J5137j98056K7374Q5892
14753H4709j49489p309j8633Q2885M3647P750p668K2781o2394k78097L7028K00733
14741d4057Q4659R9782J10606j68540l77241O6012O4329K77397j27749k29950
14731b44752N2562j43584j13481J57304n5114K73088K44255j97832p6504j71155
14721b75213j49944o4279j19510m4906K74191O7195L71170J33600O4209Q334n6078
14710B08769J51077l3662o7256Q0073m5448P3850k1311j06598l7742L9225k16885
14699B4092j64493r8413K30416J09116j94097m97368R9039L53372J01479j57424
14689a94281R3004J48780j00721q773K6824k01706q1037K06615M12811O3631l98413
$$ plain form
14763 -216878 -234502 67776 643063 528779 268037 154362 169499 -28557 -1183 84709
14753 84709 -64780 -72089 -90722 -7837 35810 43560 35892 58673 -3721 -281818 -244790 -44057
14741 -44057 40602 140384 250990 82450 -294791 -228779 -164450 112947 -14802 -244752
14731 -244752 -192190 -335774 -449255 -291951 -347065 -73977 170278 -27554 -104058 -275213
14721 -275213 -425157 -489436 -608946 -653852 -379661 -312466 58704 192304 256513 264847 208769
14710 208769 359846 326184 258928 339001 293553 367403 346092 239494 201752 240977 24092
14699 24092 -140401 -238814 -8398 100718 -93379 -590747 -491708 -138336 -36857 -194281
14689 -194281 -101277 47503 -53218 -61991 -35167 -236873 -317910 -111295 301516 365147 -33266
14678c3266j47508k9174R1835L2447Q7560o2113o0699K91785j4715p0645k27206
14667a41699J02476L5313Q604n2702k4436k19874o1814L13287K37255r9056k41358
14656a44004k0512q7144K081J88253J38355J2792k15242Q7878R096l63538k4427
14645d16412K35928K93556J40220j86035j54242m802N4021k3150j9404k72575
14635c52895j28980Q913N3194k19145O8272K05890R6001j36484j15556K18894
14625c01896J87368O5120K42581K18407j47362J19162j3785n04161k54256P2033
14615c16789J16185N6691o8941j78095J69175J52400r8616k9742R8827O0465J59973
14604A21533N7780p2716j45861R878j8010J06746R194J72223M92010p0181l38277
$$ plain form
14678 -33266 -180774 -209948 -118113 -85666 1894 -60219 -120918 170867 156152 85507 -141699
14667 -141699 -39223 -3910 4694 -48008 -72444 -292318 -354132 -40845 196410 97354 -144004
14656 -144004 -164516 -251660 -249579 -61326 77029 89821 -125421 -37543 -28447 -391985 -416412
14645 -416412 -180484 113072 253292 67257 -86985 -91787 -37766 -60916 -80320 -352895
14635 -352895 -481875 -472962 -419768 -638913 -570641 -364751 -268750 -405234 -520790 -301896
14625 -301896 -114528 -49408 193173 411580 264218 383380 369595 -134566 -388822 -316789
14615 -316789 -200604 -143913 -212854 -390949 -221774 -69374 -167990 -197732 -98905 -38440 121533
14604 121533 179313 106597 -39264 -29386 -47396 59350 68544 240767 732777 662596 324319
14593C24319q5968o3739J12489J2362j36722J67679R3928j51203o6517R8892k0937
14582B84583j11852l11882K21776j93778p8757J85955l5635l6520J62919j84402
14572i7593j91775L0825K42669K8189j7645j51781j52312J74566J92280J660R2473
14561A51556Q4449N555q8455j83821l6363Q4931K9781J16192o9626k54833N9788
14550a00846J45673J94199j62473j10317r8134J3405q612n0063J02826k34546
14540c08888q4794K63207R803k6268M8096J67988j94997M4159J28355l3330J25703
14529A39034j66304m62456J07645L33734j3381k2426J21557K0036j8568J85082
14519B23953l20012k52475j9266K14108L43265J51k81128J3623j30144K51361
$$ plain form
14593 324319 238351 174612 287101 299463 162741 330420 424348 273145 206628 305520 284583
14582 284583 172731 -139151 82625 -111153 -189910 -3955 -39590 -76110 86809 -97593
14572 -97593 -289368 -258543 -15874 12315 -5330 -157111 -309423 -134857 57423 59083 151556
14561 151556 236005 241560 153105 -30716 -67079 17852 47633 163825 94199 -160634 -100846
14550 -100846 44827 239026 76553 -33764 -131898 -118493 -127105 -177168 -74342 -308888
14540 -308888 -393682 -130475 -120672 -146940 -98844 69144 -125853 -81694 46661 13331 139034
14529 139034 -27270 -489726 -382081 -48347 -61728 -84154 37403 57439 38871 223953
14519 223953 -96059 -348534 -367800 -153692 189573 189724 -91404 -77781 -207925 43436
14509D3436j41829r5358K18530j21273K7100K56002k11199j10402J2754k16686
14499c38925j87027J96733J34311K8789K13558J44105l2007O4026R7097j46606
14489A74054o5916j86879k13538J08859n0371k14315K6619K19609N0298K29821
14479G8241q9531l46435J85367K09060M9238J9202M2109j97551j89364N717m46662
14468f80609n6308L18452K17479o0211R8261N3955j50856j1533K8692p5161l6834
14457c54673j10219N8233L14874K49820L1675p2856l89263k85583O8670R4580
14447c94742R4984K25663K09956l43191q689K31394k9373J65373M9748p5464k94625
14436a68966k47945J32338J56469K16449J18155k87270j13277K7944L15281O6883
$$ plain form
14509 43436 -98393 -193751 24779 -96494 -69394 186608 -24591 -134993 -122239 -338925
14499 -338925 -525952 -329219 -194908 -166119 47439 191544 159537 223563 320660 174054
14489 174054 108138 -78741 -292279 -183420 -233791 -448106 -421487 -201878 -151580 78241
14479 78241 -11290 -357725 -172358 36702 85940 105142 147251 -50300 -239664 -233947 -680609
14468 -680609 -736917 -418465 -200986 -261197 -162936 -108981 -259837 -271370 -242678 -317839 -354673
14457 -354673 -464892 -406659 -91785 158035 189710 116854 -272409 -557992 -489322 -394742
14447 -394742 -299758 -74095 135861 -207330 -216019 15375 -13998 151375 201123 125659 -168966
14436 -168966 -416911 -284573 -128104 88345 206500 -80770 -194047 -166103 149178 216061
14426B16061R8076q7922l34683q8898L8961K61137K84674p1587m7928k7407P7429
14415C17913R387j77178l2448J6560J03330L6302r4685k68045k23530K80839N3015
14404B1460K47752j19075k81461l7064R1307L3434K6966J78259K21595p4946k52918
14393E5309L3810k649J55982k22037j43726J62349J59674J21804j29538R711j1747
14382A88942k25714N6441J58467R3054L6665Q5170r9939k19004M2212j0680n76657
14371d71043k78823Q7221k1186K1737L99869K62938l687j8390l6181j23726K06840
14360B5569P0826L021J67640P5628l1882j88570j44875J64396J04023R0190n0994
14349B84972j80381O9796K16453J51604r7658j93779J12828P4925j87040l07849
$$ plain form
14426 216061 314137 226215 -108468 -197366 -158405 102732 387406 315819 267891 240484 317913
14415 317913 327300 150122 117674 134234 237564 273866 179181 -88864 -312394 -31555 21460
14404 21460 269212 150137 -131324 -168388 -77081 -43647 -16681 161578 383173 308227 55309
14393 55309 89119 86470 242452 20415 -123311 39038 198712 320516 190978 200689 188942
14382 188942 -36772 19669 178136 271190 307855 393025 293086 74082 116294 105614 -471043
14371 -471043 -749866 -662645 -683831 -662094 -262225 713 -2974 -21364 -57545 -181271 25569
14360 25569 96395 99416 267056 342684 310802 122232 -22643 141753 245776 335966 284972
14349 284972 104591 174387 390840 542444 444786 251007 363835 438760 251720 -56129
14339e6129P3801R1571J68636n5070m62277k00575M80457J03234m0091j48788
14329d5231k20360j9055p2590k865Q6297L71136J19684j90854n07253j71592K00276
14318d52407R6688K99813j26569j83178j5660l8015k5717J84197J74006O0957
14308b5885o1798p1004J51626J38084L16777l368k45690j3350J16831j62761J91145
14297C30607m1050Q7174K1965J06578J036k50401k32410N3815J92720j16831J90571
14286C43774R7781n7955r9967j16858j86863m26268k54781K24115L22225J9609
14276a35188j14855J33936J24394q7463j00928j74686k4396J55473K30976L55780
14266C63043j5955j54909J3208k27494j28118j05267J93875J89477K8301J64673
$$ plain form
14339 -56129 17672 109243 277879 222809 -239468 -440043 40414 143648 103557 -45231
14329 -45231 -265591 -284646 -357236 -360101 -273804 97332 217016 26162 -481091 -652683 -452407
14318 -452407 -355719 -55906 -182475 -365653 -381313 -419328 -445045 -260848 -86842 -25885
14308 -25885 -87683 -158687 -7061 131023 447800 444432 198742 185392 302223 139462 330607
14297 330607 289557 376731 398696 505274 506310 255909 23499 77314 270034 153203 343774
14286 343774 441555 383600 283633 166775 -20088 -446356 -701137 -477022 -154797 -135188
14276 -135188 -250043 -116107 8287 -79176 -180104 -354790 -379186 -223713 7263 363043
14266 363043 347088 192179 205387 -22107 -150225 -255492 -61617 127860 156161 320834
14256C20834P648K98660K28484k41190j55973P1168k19195l29999p4353J82109
14246H8193J1422k37102j15901P4335J46876J35746l7427K15769O4148o5230k36508
14235D4321k09253j7727N1034Q1489r414K15149L13611k29743l6916j44940j465
14224E6146j7840J20523l25283l0718L725j71955k2287J39725L14119N3177j24880
14213e548j14027J05573K16897J91624k30323k65962k74990k67887J60450K12415
14203b71778J29496K57973O4614R8900j03853k18300n4286K18406l52830j6508
14193b48166M373J59487K02677R2087J91716k5190j72287j13816J07290N5706
14183B53877j00790Q429R3171L44332O5496m76245j93320K48487K1199k15712
$$ plain form
14256 320834 328482 627142 855626 614436 458463 529631 310436 -19563 -93916 88193
14246 88193 99615 -137487 -253388 -179053 -32177 103569 66142 281911 346059 280829 44321
14235 44321 -164932 -182659 -131625 -50136 -59550 155599 469210 239467 202551 57611 56146
14224 56146 38306 158829 -166454 -197172 -193447 -365402 -387689 -247964 66155 119332 -5548
14213 -5548 -119575 -14002 202895 394519 164196 -101766 -376756 -644643 -484193 -271778
14203 -271778 -142282 115691 180305 279205 175352 -42948 -97234 121172 -231658 -248166
14193 -248166 -243793 -84306 118371 210458 402174 376984 204697 90881 198171 253877
14183 253877 153087 161516 254687 599019 664515 188270 -5050 243437 264636 48924
14173D8924m4778j05981M643J14653k41375J17452K70780K07662k29697n2918
14163H9365J00261N594K750p4011k55974J37616J32114k01473l54877j89315L16842
14152b91108J25887K66105N1627K14452K3499P7150l05148k5508j15242o2907
14142d1193J55982q6760M7429o8838J80411j69933q3328k6517J1183J10765R1506
14131A20707j74379n296L58989J26555m1074k18732j85841k885R4129l4988J9926
14120E7111n1278J14225N9660k40769K18950J72434q9682J47723J52377k05029
14110C35722J05926o4205l25828k32775q5845K6861J04683J4635l6575J84719
14100B7318j60537j13961K6171K7615J35401K45175N4727r5907o2978q2064J90739
$$ plain form
14173 48924 4146 -101835 -97192 17461 -223914 -106462 164318 371980 142283 89365
14163 89365 189626 195220 197970 123959 -132015 5601 137715 -63758 -418635 -607950 -291108
14152 -291108 -165221 100884 152511 366963 390462 467612 162464 136956 21714 -41193
14142 -41193 114789 28029 75458 6620 187031 17098 -66230 -92747 -81564 29201 120707
14131 120707 -53672 -58968 300021 426576 385502 166770 -19071 -21956 72173 37185 57111
14120 57111 5833 120058 179718 -61051 157899 330333 240651 388374 540751 335722
14110 335722 441648 377443 51615 -181160 -267005 -240144 -135461 -120826 -157401 27318
14100 27318 -133219 -247180 -221009 -193394 -57993 187182 241909 146002 83024 960 191699
14089A91699J1568J6244j81930J90859k46560j0481k2153M8400O4506k38724J71867
14078d705L29889M4030m1868o285j46485r1565L13438p242j20112k90076k02827
14067b23808j55871K43414K58829r808j55787J49165k7200k61441n9980J29020
14057a13467J35735k2647O3220J73068J41908J22385l9585m20912l01391k5261
14047b86947M9710L057m8307J63619J480J64966K8761j57177j80891P8818N5662
14036a27249j08672L9053R7338K36650k13637l31441r9694J06061L43386J66642
14026A08437K311m48596k43742K11426K27449k11870n5797J95719L0027N9104
14016a25532J85561K14610J42875L6112n3455K0329j27L1636n6003k25645m4865
$$ plain form
14089 191699 203267 219511 37581 228440 -18120 -28601 -50754 -2354 62152 -176572 -4705
14078 -4705 325184 369214 327346 321061 174576 83011 396449 389207 269095 -20981 -223808
14067 -223808 -379679 -136265 122564 112756 -43031 106134 78934 -182507 -242487 -113467
14057 -113467 22268 -379 62841 235909 377817 500202 460617 39705 -261686 -286947
14047 -286947 -237237 -234180 -282487 -118868 -117388 47578 76339 -80838 -261729 -182911 -127249
14036 -127249 -235921 -196868 -99530 137120 -76517 -407958 -507652 -401591 -58205 108437
14026 108437 110748 -337848 -581590 -370164 -142715 -354585 -410382 -214663 -184636 -125532
14016 -125532 60029 274639 417514 453626 400171 420500 420373 452009 396006 170361 125496
14005A25496L38273M2515j13163j29133j49952m0172j2076N1025K14205k13067
13995A13951k75147J16672l1238j00820k20093Q6004J77304j00753j17045K60937
13985i0228p7843j98548J11284L23876K24983n3526j86271P6489K6334j2575j3256
13974A30719K49076k02108k27008J52039K24426J93074l15727m66957q6592K58270
13964i0788J27801L428J8385J82164j1199j25147n3179J44803k04852j22790L5511
13953i5863J62539K58918q2256p1747J16988J26347K33086J22730j69020l26649
13943B75073j36945J23823K79126M7264k77638P4899J23563q1377l2126J1707
13933D07369m7303M2274m62011j68264j62887R1478J65170J34589j70676k32410
$$ plain form
14005 125496 463769 506284 393121 263988 114036 73864 61788 112813 327018 113951
13995 113951 -161196 -44524 -75762 -176582 -396675 -310671 -133367 -234120 -351165 -90228
13985 -90228 -168071 -366619 -255335 68541 293524 239998 53727 130216 156550 143975 130719
13974 130719 379795 177687 -49321 102718 327144 520218 204491 -262466 -349058 -90788
13964 -90788 37013 40441 58826 240990 229791 104644 51465 196268 -8584 -131374 -95863
13953 -95863 66676 325594 243338 171591 288579 414926 648012 770742 601722 275073
13943 275073 138128 261951 541077 588341 310703 385602 509165 427788 395662 407369
13933 407369 360066 402340 -59671 -227935 -390822 -299344 -134174 415 -170261 -402671
13923d02671j87825J31390J71124K23327J84980P2637K1089j71994N7625M4107
13913A43789j32657k53510k94066Q5751j6059J04708J38296M0987K38459J92644
13903B48342j27670j90769J31923l8379J04565q828J46658J1005k7775O0760K90678
13892F00510j14889k77537j47392k06430K71029O1805L7241o4886l2454O2397
13882A89394l50484n1983K89137j12019j28692J03728m4094k16411j0163r2565
13872d24152q2143k02449L44191P6242j19430L11668J67165q7127J22767K34525
13862C41257p7635J4443j25697k93859j68526o3629P4734R9343l66966K12299
13852c54236K31511j05459O954m0004o3780l5697n3205K57928K99211r2114j11042
$$ plain form
13923 -402671 -590496 -459106 -287982 -64655 120325 192962 214051 42057 99682 143789
13913 143789 11132 -242378 -536444 -450693 -466752 -362044 -223748 -182761 55698 248342
13903 248342 120672 -70097 61826 23447 128012 119184 265842 276847 249072 309832 600510
13892 600510 485621 208084 60692 -145738 125291 187096 224337 159451 126997 189394
13882 189394 -161090 -213073 76064 -35955 -164647 -60919 -105013 -321424 -331587 -424152
13872 -424152 -506295 -708744 -364553 -288311 -407741 -96073 71092 -16035 106732 341257
13862 341257 263622 278065 152368 -141491 -310017 -373646 -298912 -199569 -566535 -354236
13852 -354236 -122725 -228184 -221230 -261234 -325014 -360711 -413916 -155988 143223 51109 -59933
13841e9933j40426l8138k9973K48949K37556K9422j61544j86455k97575j72882
13831e70999K48910J56913K1627K02843K13905j9130k81082r8974j97069Q4718
13821b38338N74185P6944j56296l85234m0337L6251J5497P0087j44855L5115j21696
13810b78677m8296J59456j17367k55312J48894L0257m6488L90517L2132p0320
13800e5204J35503J79351K883l61496k43928L9397k3822J33608J2005q4955R8970
13789a67688L07074J30923m350j60604k46716k41289q114J65624k24206j59975
13779f09321J56587Q0328Q2694o1585K0396K61284q0332j0359K4471k06774J70062
13768a72549K69122J2679J2815P956J27363Q8605n6647r6422r2074j19435n6806
$$ plain form
13841 -59933 -200359 -238497 -268470 -19521 218035 247457 85913 -100542 -398117 -570999
13831 -570999 -322089 -165176 -143549 59294 273199 254069 -27013 -125987 -323056 -238338
13821 -238338 335847 412791 256495 -128739 -169076 -132825 -117328 -47241 -192096 -156981 -278677
13810 -278677 -326973 -167517 -284884 -540196 -391302 -361045 -407533 -17016 15116 -55204
13800 -55204 80299 259650 262533 -98963 -342891 -303494 -327316 -193708 -181703 -266658 -167688
13789 -167688 139386 270309 265959 105355 -141361 -382650 -390764 -225140 -449346 -609321
13779 -609321 -452734 -372406 -289712 -351297 -330901 -69617 -149949 -160308 -135837 -342611 -172549
13768 -172549 96573 109252 122067 130023 257386 345991 289344 192922 100848 -18587 -75393
13757g5393k09075M0993m4377j72069J98625l5876P9375J89123R699O2429k86376
13746b42922n5992Q2088Q0098l0235o3008L03997l1635J49725l4794j66360k7758
13735c6796k09189R3169N3796j54497r68J92063j1273J43068J81703m7191J45706
13724C49591p6078j66072J61766M5885k76991r3219K8213j36660K83642L4837
13714A54914k72339j10898o9505J96369J95250l10242j10594j703l159J41966
13704a89941N58388M0668j47483p5112k63462j04730m9159M5946J35860K24472
13694A75447L6654j15837l11322Q680j77233J83277K55698K5631J01915M0971
13684B23881j02072P0857M3289r5911l09833n9735K01801K35274p7577j53313
$$ plain form
13757 -75393 -284468 -243475 -287852 -459921 -261296 -297172 -217797 -28674 -18975 43454 -242922
13746 -242922 -298914 -216826 -136728 -166963 -229971 74026 42391 192116 157322 -9038 -36796
13735 -36796 -245985 -152816 -99020 -253517 -254485 -62422 -73695 69373 251076 203885 349591
13724 349591 273513 107441 269207 315092 38101 -55118 -26905 -163565 120077 154914
13714 154914 -117425 -228323 -297828 -101459 93791 -216451 -327045 -328748 -331907 -189941
13704 -189941 368447 409115 261632 186520 -76942 -181672 -230831 -184885 -49025 175447
13694 175447 212101 96264 -215058 -206378 -383611 -200334 55364 80995 182910 223881
13684 223881 121809 192666 235955 140044 -169789 -229524 -27723 207551 129974 -23339
13674b3339l9148J74418J70509M0324j04858n50209j74957O6777q769Q5141L61276
13663b835K42581L7349l71126J04322J24631j61317r9111R6502N251n3351j8470
13652i5574J23502O4102J99276J32409M8995l79225k62419m6861J93058n8217
13642h0954L1487K60253L41292j32415l64897l16754J27139J27966P5321j9264
13632D9174l0668o5679j32462p2468L21370J43853j17231l26926k66859Q6910
13622d10986L50720J74769k39664l5917j69547L22579K73373j31032l5353r6614
13612B328k51932o3670K7993K22234J1804k3892J18348l1492j32984L5025j23080
13601b09318M09630K10373m30707R617J07002k66447L00041K25757j25103l51597
$$ plain form
13674 -23339 -62487 111931 282440 322764 217906 -332303 -507260 -440483 -449252 -364111 -2835
13663 -2835 239746 277095 -94031 10291 134922 -26395 -125506 -29004 -23753 -77104 -95574
13652 -95574 27928 92030 291306 423715 472710 93485 -168934 -215795 -22737 -80954
13642 -80954 -49467 210786 552078 419663 54766 -261988 -134849 -6883 68438 49174
13632 49174 18506 -47173 -179635 -252103 69267 213120 95889 -231037 -497896 -410986
13622 -410986 -60266 114503 -125161 -161078 -330625 -8046 265327 134295 98942 2328
13612 2328 -249604 -313274 -285281 -63047 -51243 -75135 43213 11721 -121263 -86238 -209318
13601 -209318 200312 410685 -20022 -10405 96597 -169850 130191 355948 230845 -120752
13591a20752q4993Q7411K87043k2164o2041R5231m8580n4392p6758k07945n7699
13580b65639R1453K818L0712K91053Q3458j23060l3567o8854l1678J04282J40422
13569B21400Q4615j3564r9102j33650J41158J62958J3524k39130l47850j88008
13559c97649j3911K02594K41319k13287j65807j43540q862M05065O6352J38926
13549A11200J0765O4781K2013m8303j36726k28964Q7488J77358J97753P514r4605
13538A70274j05907P9069l8907j66710N8578J09308K88246R8334l76635K16356
13528C32006O799q4077j66904k50507L6149J6234M5392N709K34681j4810m7132
13517A13540q8463q1510J05518q1901j19971o9230K32730m1287j15283J20754
$$ plain form
13591 -120752 -205745 -118334 168709 146545 84504 179735 131155 76763 5 -207940 -265639
13580 -265639 -174186 -171368 -140656 150397 233855 110795 77228 8374 -23304 80978 221400
13569 221400 306015 292451 193349 59699 200857 363815 377339 138209 -209641 -397649
13559 -397649 -411560 -208966 32353 -180934 -346741 -490281 -499143 -94078 -27726 111200
13549 111200 121965 186746 208759 160456 23730 -205234 -117746 59612 257365 264879 170274
13538 170274 64367 143436 104529 -62181 -3603 105705 393951 492285 115650 332006
13528 332006 338805 254728 87824 -162683 -126534 -110300 -64908 -59199 175482 160672 113540
13517 113540 25077 -56433 49085 -32816 -152787 -222017 10713 -30574 -145857 -25103
13507b5103R0217J24759Q9428O3195k08925j37089K22099n9464J19623j0240J15818
13496C84318n8511j35840j31181O113K58713K8573k52683k31353q2977J58403
13486e6425k4963Q0865J8202O3371J37958j07448j71903j67198P6823K29583O4249
13475A43114n4832k2703j07703k01252P62J66796J38543K89779O406j51795R3844
13464C00959J07148Q4954k12085K10997q3598n9130n1053r7668j57311j53430
13454a10217R9901J47007J64368j39869l52285k03547L23030n8309Q5092k33596
13444b78425j53431K27982N3560j41275K49955J57308K09287j09232j43418J05015
13434A77326R2850o1600k18752j55083P8746j23326J9198K12650K9996O738j52265
$$ plain form
13507 -25103 65114 189873 279301 342496 133571 -3518 218581 159117 278740 268500 384318
13496 384318 325807 189967 58786 64899 323612 352185 99502 -131851 -214828 -56425
13486 -56425 -81388 -523 17679 81050 219008 111560 -60343 -227541 -150718 78865 143114
13475 143114 88282 65579 -42124 -243376 -242614 -75818 62725 352504 358910 207115 300959
13464 300959 408107 493061 280976 491973 408375 349245 298192 200524 43213 -110217
13454 -110217 -10316 136691 301059 161190 -191095 -394642 -71612 -129921 -44829 -278425
13444 -278425 -431856 -203874 -150314 -291589 -41634 115674 324961 215729 72311 177326
13434 177326 270176 208576 -10176 -165259 -86513 -209839 -190641 22009 52005 58743 -93522
13423i3522K10601J78834k85150r7899j01484R8020k6966m28175J21492K83629
13413a40620J63663q5438L8564J37525j51633l4242q9917K11434J12487p0741
13403I1082k3219o1934J4747j797l3766n5813K6867J79454P4621J00310R7193
13392D07745j25084m88732l20035r1069J42304L82450L53104L7988J7090p4698
13382B41063J31137J13695k12033j64940m7198n9096n2723O3967J45337J95010
13372C54219P5391l5056k25870M1569L33940R4253j59695k37596j87423L7672
13362I1404k44248M824n1268Q2590L14574q0152j51012k12014K76725M06799K66610
13351G04832l02512l24615j72453K28661J34182j40759p9774K3688J24216l3986
$$ plain form
13423 -93522 117079 295913 10763 -87136 -188620 -90600 -117566 -545741 -424249 -140620
13413 -140620 23043 -62395 -23831 113694 -37939 -72181 -162098 49336 161823 91082
13403 91082 67863 5929 20676 18879 -14887 -70700 -43833 135621 210242 310552 407745
13392 407745 282661 -206071 -526106 -617175 -474871 -92421 260683 298671 315761 241063
13382 241063 372200 485895 273862 108922 61724 2628 -50095 13872 159209 354219
13372 354219 429610 394554 168684 210253 544193 638446 478751 241155 53732 91404
13362 91404 -152844 -148020 -199288 -116698 197876 117724 -33288 -245302 31423 438222 704832
13351 704832 402320 77705 -94748 133913 268095 127336 47562 71250 195466 161480
13341A61480l462k39873j80251k6534M6263K99712j19841l52908J59688M18898
13331A63172K56786k6224K7950N8215k42581k48201J055L4211L19024R6570o6077
13320C73900k90122P2402O2995j15760P2075J6127P5135j58856m47916P6430M15049
13309A51459P7131Q14m4551o1156J87380K45941N1535q5290k87418k35469p0824
13298g0448m049n3264K0106n0030L16383O0141k55761j9072K87359J62539m7912
13287C45992k70253J80779K55082j24696N5337J64574j03776l9061k63361j19389
13277H1228m9197P0990J16490K42081j26937k01011l61096j81717P7525J00034
13267b31610L21370O3495J86243J39797k04269J22887K0524k76841k33591n5152
$$ plain form
13341 161480 158018 -81855 -262106 -288640 -242377 57335 -62506 -415414 -255726 163172
13331 163172 419958 393734 421684 479899 237318 -10883 -9828 24383 343407 439977 373900
13320 373900 83778 156180 219175 103415 175490 191617 266752 107896 -340020 -263590 151459
13309 151459 228590 229404 184853 123697 311077 557018 608553 523263 235845 376 -70448
13298 -70448 -74497 -127761 -107655 -157685 158698 218839 -36922 -55994 231365 393904 345992
13287 345992 75739 256518 511600 386904 442241 606815 503039 463978 200617 81228
13277 81228 32031 103021 219511 461592 334655 133644 -227452 -409169 -331644 -231610
13267 -231610 89760 153255 339498 479295 275026 397913 418437 141596 -91995 -147147
13257a47147K9683L50879r2228k2295K6431J92250k2908R2159P8866k07264j64759
13246A13667j80004L1616K36469k3006K4996j77004j479j85511j95562J77583
13236a78235J44900K3001J04983J10486O9103n2846M488Q081J00985k06138j29580
13225g72J65275N1725J53754P1196j44180k11992r2241o0132P5915J17949J25826
13214B52323j25857k96226J3611M6537P4855o409K31079J09420p9521o6168l39592
13203a85948j35865j32174J14509M21485M27338N3682j1581l00707j37167P088
13193A20660k5743j69174J11780K95368J16407l22285R146J85711J96377m3834
13183D74413k08147p418k28026j47168o3765j6215p5009K9119J18721K0362J68485
$$ plain form
13257 -147147 -117464 233415 141187 118892 145323 337573 314665 406824 485690 278426 113667
13246 113667 -66337 -34721 201748 178742 203738 26734 25255 -160256 -355818 -178235
13236 -178235 -33335 -10334 94649 205135 274238 221392 225880 233961 334946 128808 -772
13225 -772 164503 216228 369982 441178 296998 85006 -7235 -67367 8548 126497 252323
13214 252323 126466 -169760 -156149 -109612 -34757 -41166 189913 299333 219812 153644 -185948
13203 -185948 -321813 -453987 -339478 82007 509345 563027 551446 250739 113572 120660
13193 120660 94917 -74257 37523 332891 449298 127013 136159 321870 518247 474413
13183 474413 266266 258848 30822 -116346 -180111 -196326 -271335 -242216 -123495 -103133 65352
13172F5352J72252K70191l01504q388J3478k09798r0147m4042k34666L8424K48292
13161h0556R0767R902r2364L58779j08311n4354j45923O108J9860L1881J62478
13150A98267r8934j94443K9405K9044p4758r8871J34723M5403l62k33102j0656
13139b74284J60607K53795k37531K8740J001L0985J29464O0408k0026p6131l5550
13128B1478k09580j50447K78297j102K05027N26798O0595j08971k72470j61844
13118A87781l32523O8706K00957P379p6127j61853K21959Q8862K0778M0656O1199
13107C27774q9179k59137J06356q1768m3887q5395o9180j660o0620p2872Q6403
13096b43165j12039k57631L77979M81477k1317l62669J4844k6665N4154J14782
$$ plain form
13172 65352 237604 507795 206291 197903 211381 1583 -88564 -132606 -367272 -328848 -80556
13161 -80556 10211 20113 -72251 286528 178217 123863 -22060 -15952 3908 35789 198267
13150 198267 99333 -95110 -65705 -36661 -111419 -210290 -75567 -30164 -30526 -263628 -274284
13139 -274284 -113677 140118 -97413 -68673 -67672 -36687 92777 153185 133159 57028 21478
13128 21478 -188102 -338549 -60252 -61354 143673 670471 731066 622095 349625 187781
13118 187781 -144742 -76036 124921 132300 56173 -105680 116279 205141 225919 266575 327774
13107 327774 238595 -20542 85814 4046 -39841 -125236 -194416 -196076 -256696 -329568 -243165
13096 -243165 -355204 -612835 -234856 246621 225304 -137365 -122521 -149186 -95032 19750
13086A9750p543J37055J2297J6565J24643n5616J79465M00007J79086P3160j99122
13075H79747k00601m1875o3312j89169K8760N7983j32145J21665l2365n63481
13065a34793L76235L81566P2593k34871q1494L23027J94544P0638k2629j33585
13055H11231l87577q0306k0200m1368n1015J73906M2397J73214L67907J67538
13045A155727l85530J14128J46924j17589O2248q1822K47301j2988k44181l80804
13035E03414R5765M65859P09376N80685L50859J39007l87836n57105n71410j76545
13025A152069j88285l89063l36888m9295J36234K34554N8215k5860O3261K03163
13015H58105q2700j13757m7983J76621J81507o592l5573j32254k00453j21284
$$ plain form
13086 19750 12207 149262 161559 178124 302767 247151 426616 826623 1005709 1078869 879747
13075 879747 679146 637271 573959 384790 413550 471533 339388 461053 428688 -134793
13065 -134793 241442 623008 695601 460730 379236 702263 896807 967445 944816 811231
13055 811231 423654 343348 323148 281780 230765 404671 447068 620282 988189 1155727
13045 1155727 770197 884325 1031249 913660 975908 894086 1141387 1128399 884218 503414
13035 503414 599179 1065038 1774414 2355099 2705958 2844965 2457129 1900024 1328614 1152069
13025 1152069 963784 574721 237833 188538 324772 559326 617541 591681 654942 858105
13015 858105 775405 661648 613665 790286 971793 965201 929628 797374 596921 475637
13005D75637K15615j70358P3244L7520l28252M22214J36794j16571L40504K66938
12995A353285j80504j29087L8751M9588M9288N9859K01388O31364O79227K08557
12985B961716k52953m14442k20166l31698l10654n07878n16980n9737m8408L5865
12975C34665M31849L41886l07243k92896R0872K82711k02203K8150J32294J01370
12965I41455m9635J91790j6896n5151j46042l08944P8129j80329k26913K11777
12955D39241J80398K3282M4957l2289J22418j00518j9754J73636k01043k33311
12945C97017K83350J65852l9179L28191L23007R5k3310p7917j91629j07215k47930
12934H10332j71599j60770j87600k02728j16289l8227N9862l3111m0218J41484
$$ plain form
13005 475637 691252 520894 594138 631658 303406 725620 862414 745843 1086347 1353285
12995 1353285 1172781 1043694 1082445 1132033 1181321 1241180 1442568 2073932 2753159 2961716
12985 2961716 2708763 2294321 2074155 1742457 1431803 923925 406945 347208 298800 334665
12975 334665 766514 1108400 801157 508261 599133 881844 679641 707791 840085 941455
12965 941455 891820 1083610 1066714 1011563 865521 556577 634706 454377 227464 439241
12955 439241 619639 642921 687878 655589 778007 677489 657735 831371 630328 397017
12945 397017 680367 846219 807040 1135231 1458238 1458333 1435023 1357106 1165477 1058262 810332
12934 810332 638733 477963 290363 87635 -28654 -66881 -7019 -40130 -80348 61136
12924F1136J57745j04546P7930J04236J52435m966q0667O1643k85238l1413p2543
12913C5752j69684p0454J19608J43857J33507J37545K63157j27091p7939j0533
12903C77725j13925J22000j39369j8101J51572j00786Q8812J06755j87696k80916
12893F071R6185K87197J06290j02628j58057J08444p2601O5763K48208q5197o9006
12882D30669l5516o2357M6352m5530j5167o4375J18604J9626j92056l9360j31076
12871B9814J21224K46726q9227r4897n6061J02969K32427P2443O4222k22571J68195
12860E75264K63967j80352k80895q2262j21615j79752m8184R8282K45686R2920
12850C83059j62581J57785M8317j77630j09117M4526J32590N5890M950k16479
$$ plain form
12924 61136 218881 114335 192265 296501 448936 443970 363303 424946 139708 108295 35752
12913 35752 -133932 -204386 -84778 59079 192586 330131 593288 466197 388258 377725
12903 377725 263800 385800 246431 228330 379902 279116 367928 474683 286987 6071
12893 6071 102256 389453 495743 393115 235058 343502 270901 336664 584872 499675 430669
12882 430669 395153 332796 379148 333618 318451 254076 372680 392306 200250 160890 29814
12871 29814 151038 397764 308537 213640 157579 260548 492975 565418 629640 407069 575264
12860 575264 839231 658879 377984 295722 174107 -5645 -53829 44453 290139 383059
12850 383059 220478 378263 426580 248950 139833 184359 316949 372839 377789 161310
12840A61310l2212K12749L9572L800J33294m7508K34698N1025M5590j36040j69396
12829D96882j17375m8657N0826j6700J77027j50256r0570M3180O8467L6178l3308
12818D15694k11818K9794J37964k09025l55012J20537J21180J52808N34460j7266
12808G19316k02710o3355n8406K79734J7945N3155J6097q1606k1188J00442p478
12797G51946J00947K9944j95683k47337j27436r269j28136j70837k41883o3641
12787c01385K19319M06758K90649K7443q9917J89165j84031m5351R2616K18190
12777H23456R7389j91570j68630k43845j87243M3524R3983j16027j60389J03851
12767I4499N9202M24156J34286j50881r7948j06736j14266J05140K13266J43206
$$ plain form
12840 161310 129098 341847 381419 385219 518513 471005 705703 756728 802318 666278 496882
12829 496882 379507 330850 381676 364976 542003 391747 301177 344357 412824 449002 415694
12818 415694 203876 233670 371634 162609 -192403 -71866 49314 202122 736582 719316
12808 719316 516606 453251 394845 674579 692524 745679 761776 680170 658982 759424 751946
12797 751946 852893 882837 687154 439817 312381 303112 174976 4139 -237744 -301385
12787 -301385 -82066 324692 615341 642784 552867 742032 558001 512650 605266 823456
12777 823456 920845 729275 560645 316800 129557 173081 267064 151037 -9352 94499
12767 94499 153701 577857 712143 561262 463314 356578 242312 347452 560718 703924
12757G03924k2845j39887L1006Q7905P4512J36450l1798R7216j6469r3206k03491
12746F23317j76941l45931j22572J35905K03219J93138k70833O7043P9826m4146
12736C42025m4124K84138R1245K02520K94977l02664j89740r2751r2568o4972
12726D28086K3318J18344P6374K9941k30599J14122J19012k0413l6241j29259
12716D92685N0336p2647q7917K59165L6692Q4113Q2039J72584k25318j92216J31052
12705G30568J56139K4107N0865j15006k00206L5363J56951M2031r6468k8056O405
12694G62693k61563p7285J77263K25979j7585P2227R6284O2666n953j47058K4759
12683I12427k68066N3593K48104J22851j15603n8157L892k36529k0079K64744
$$ plain form
12757 703924 681079 541192 572198 660103 734615 871065 839267 936483 920014 826808 623317
12746 623317 446376 100445 -22127 113778 316997 510135 239302 306345 386171 342025
12736 342025 297901 582039 673284 875804 1170781 868117 678377 585626 493058 428086
12726 428086 451404 569748 646122 676063 445464 559586 678598 658185 621944 492685
12716 492685 543021 470374 382457 641622 678314 762427 844466 1017050 791732 599516 730568
12705 730568 886707 910814 961679 846673 646467 681830 838781 880812 784344 756288 762693
12694 762693 501130 423845 601108 827087 809502 881729 978013 1040679 1034726 887668 912427
12683 912427 644361 697954 946058 1068909 953306 895149 899041 662512 642433 907177
12673I07177J23150J5432K68309n9212j8006K01337N2778J08280k03697k42114
$$ plain form
12673 907177 1030327 1045759 1314068 1254856 1236850 1438187 1490965 1599245 1395548 1153434
$$ [...]
##END NTUPLES=NMR SPECTRUM
##END=
