##TITLE=Analysis number 329199
Compound Code cc 62202
Book Reference 518/159
Project Code adrs
Chemist Name colinb
##JCAMPDX= 6.0         $$ Bruker NMR JCAMP-DX V2.0
##DATA TYPE= NMR SPECTRUM
##DATA CLASS= NTUPLES
##ORIGIN= Bruker BioSpin GmbH
##OWNER= nmr
$$ XWIN-NMR		Version 3.5
$$ Thu Aug  9 14:08:31 2007 GMT Daylight Time (UT+1h)  MAYBRIDGE\nmr@NMR_250MHZ
##.OBSERVE FREQUENCY= 250.131544655141
##.OBSERVE NUCLEUS= ^1H
##.ACQUISITION MODE= SIMULTANEOUS (DQD)
##.ACQUISITION SCHEME= undefined
##.AVERAGES= 16
##.DIGITISER RES= 18
##SPECTROMETER/DATA SYSTEM= dpx250
##.PULSE SEQUENCE= zg30
##.SOLVENT NAME= CDCl3
##.SHIFT REFERENCE= (INTERNAL, CDCl3, 0, 16.522)
##AUDIT TRAIL= $$ (NUMBER, WHEN, WHO, WHERE, WHAT)
$$ ##TITLE= Audit trail, XWIN-NMR		Version 3.5
$$ ##JCAMPDX= 5.01
$$ ##ORIGIN= Bruker BioSpin GmbH
$$ ##OWNER= nmr
$$ C:\u/data/dgb/nmr/ADRS/320/pdata/1/auditp.txt
$$ ##AUDIT TRAIL=  $$ (NUMBER, WHEN, WHO, WHERE, WHAT)
(   1,<2007-08-09 14:08:08.98 +100>,<MAYBRIDGE\nmr>,<NMR_250MHZ>,
      <created by zg, POWCHK disabled, PULCHK disabled
       configuration hash MD5:
       76 6E 9A 78 1E 09 19 81 EC 84 63 8F B0 6A 59 2D
       data hash MD5: 64K
       89 BA F0 B9 6D EA FC D5 E5 AC 77 43 EA 59 F8 1E>)
(   2,<2007-08-09 14:08:21.23 +100>,<MAYBRIDGE\nmr>,<NMR_250MHZ>,
      <Start of raw data processing
       ef LB = 0.3 FT_mod = 6 PKNL = 1 SI = 32K 
       data hash MD5: 32K
       DB CA D6 94 78 E6 5B 90 9C 8D 3B FE 12 3D 75 F2>)
(   3,<2007-08-09 14:08:23.04 +100>,<MAYBRIDGE\nmr>,<NMR_250MHZ>,
      <apk 
       data hash MD5: 32K
       A6 91 0C EC 75 DF 67 50 51 23 A6 20 07 3E 12 FC>)
(   4,<2007-08-09 14:08:23.87 +100>,<MAYBRIDGE\nmr>,<NMR_250MHZ>,
      <abs ABSG = 5 
       data hash MD5: 32K
       8B 46 C1 E8 F7 20 2D B7 45 32 0A 9F 0B 6C 42 1A>)
$$ ##END=
$$ 
$$ hash MD5
$$ EB 0D 05 3D A4 0E F8 E0 9C 36 3B E2 0A 58 5A 5E
##$RELAX= 
##$RELAX= 
##$RELAX= 
##$RELAX= 
##$RELAX= 
##$RELAX= 
##$RELAX= 
$$ Bruker specific parameters
$$ --------------------------
##$DU= <C:\u>
##$EXPNO= 320
##$NAME= <ADRS>
##$PROCNO= 1
##$TYPE= <nmr>
##$USER= <dgb>
##$AMP= (0..31)
100 100 100 100 100 100 100 100 100 100 100 100 100 100 100 100 100 100 
100 100 100 100 100 100 100 100 100 100 100 100 100 100 
##$AQSEQ= 0
##$AQ_mod= 3
##$AUNM= <au_zg>
##$AUTOPOS= <1 >
##$BF1= 250.13
##$BF2= 250.13
##$BF3= 250.13
##$BF4= 250.13
##$BF5= 500.13
##$BF6= 500.13
##$BF7= 500.13
##$BF8= 500.13
##$BYTORDA= 1
##$CFDGTYP= 0
##$CFRGTYP= 5
##$CHEMSTR= <none>
##$CNST= (0..31)
1 1 145 1 1 1 1 1 1 1 1 1 1 1 1 1 1 1 1 1 1 1 1 1 1 1 1 1 1 1 1 1 
##$CPDPRG= <>
##$CPDPRG1= <>
##$CPDPRG2= <>
##$CPDPRG3= <>
##$CPDPRG4= <mlev>
##$CPDPRG5= <mlev>
##$CPDPRG6= <mlev>
##$CPDPRG7= <mlev>
##$CPDPRG8= <mlev>
##$CPDPRGB= <>
##$CPDPRGT= <>
##$D= (0..31)
0 1 0 0 0 0 0 0 0 0.06 0 0 0 0 0 0 0.0002 0 0 0 0 0 0 0 0 0 0 0 0 0 0 
0 
##$DATE= 1186664887
##$DBL= (0..7)
120 120 120 120 120 120 120 120 
##$DBP= (0..7)
150 150 150 150 150 150 150 150 
##$DBP07= 0
##$DBPNAM0= <>
##$DBPNAM1= <>
$$ [...]
##$SUBNAM7= <"">
##$SUBNAM8= <"">
##$SUBNAM9= <"">
##$SW= 20.6930455092707
##$SWIBOX= (0..15)
0 0 3 0 0 0 0 0 0 0 0 0 0 0 0 0 
##$SW_h= 5175.983436853
##$TD= 65536
##$TD0= 1
##$TE= 297.16
##$TE2= 300
##$TE3= 300
##$TEG= 300
##$TL= (0..7)
0 120 120 120 120 120 120 120 
##$TP= (0..7)
150 150 150 150 150 150 150 150 
##$TP07= 0
##$TPNAME0= <>
##$TPNAME1= <>
##$TPNAME2= <>
##$TPNAME3= <>
##$TPNAME4= <>
##$TPNAME5= <>
##$TPNAME6= <>
##$TPNAME7= <>
##$TPOAL= (0..7)
0.5 0.5 0.5 0.5 0.5 0.5 0.5 0.5 
##$TPOFFS= (0..7)
0 0 0 0 0 0 0 0 
##$TUNHIN= 0
##$TUNHOUT= 0
##$TUNXOUT= 0
##$USERA1= <user>
##$USERA2= <user>
##$USERA3= <user>
##$USERA4= <user>
##$USERA5= <user>
##$V9= 5
##$VALIST= <valist>
##$VCLIST= <CCCCCCCCCCCCCCC>
##$VD= 0
##$VDLIST= <DDDDDDDDDDDDDDD>
##$VPLIST= <PPPPPPPPPPPPPPP>
##$VTLIST= <TTTTTTTTTTTTTTT>
##$WBST= 1024
##$WBSW= 4
##$XGAIN= (0..3)
0 0 0 0 
##$XL= 0
##$YL= 0
##$YMAX_a= 425788
##$YMIN_a= -442951
##$ZGOPTNS= <>
##$ZL1= 120
##$ZL2= 120
##$ZL3= 120
##$ZL4= 120
##$ABSF1= 16.522
##$ABSF2= -4.171173
##$ABSG= 5
##$ABSL= 3
##$ALPHA= 0
##$AQORDER= 0
##$ASSFAC= 0
##$ASSFACI= 0
##$ASSFACX= 0
##$ASSWID= 0
##$AUNMP= <proc_1d>
##$AZFE= 0.1
##$AZFW= 0.1
##$BCFW= 0
##$BC_mod= 0
##$BYTORDP= 0
##$COROFFS= 0
##$CY= 12.5
##$DATMOD= 1
##$DC= 0
##$DFILT= <>
##$DTYPP= 0
##$F1P= 14.0000005364418
##$F2P= -0.99999901652339
##$FCOR= 0.5
##$FTSIZE= 32768
##$FT_mod= 6
##$GAMMA= 0
##$GB= 0
##$INTBC= 1
##$INTSCL= 1
##$ISEN= 128
##$LB= 0.3
##$LEV0= 0
##$LPBIN= 0
##$MAXI= 10000
##$MC2= 0
##$MEAN= 0
##$ME_mod= 0
##$MI= 0
##$NCOEF= 0
##$NC_proc= -4
##$NLEV= 6
##$NOISF1= 0
##$NOISF2= 0
##$NSP= 0
##$NTH_PI= 0
##$NZP= 0
##$OFFSET= 16.522
##$PC= 1
##$PHC0= -47.29557
##$PHC1= 5.14318
##$PH_mod= 1
##$PKNL= yes
##$PPARMOD= 0
##$PSCAL= 4
##$PSIGN= 0
##$REVERSE= no
##$SF= 250.13
##$SI= 32768
##$SIGF1= 0
##$SIGF2= 0
##$SINO= 400
##$SIOLD= 32768
##$SREGLST= <1H.CDCl3>
##$SSB= 0
##$STSI= 32768
##$STSR= 0
##$SW_p= 5175.98343685301
##$SYMM= 0
##$S_DEV= 0
##$TDeff= 65536
##$TDoff= 0
##$TI= <Analysis number 999999
Compound Code 99
Book Reference 9
Project Code 9>
##$TILT= no
##$TM1= 0
##$TM2= 0
##$TOPLEV= 0
##$USERP1= <user>
##$USERP2= <user>
##$USERP3= <user>
##$USERP4= <user>
##$USERP5= <user>
##$WDW= 1
##$XDIM= 32768
##$YMAX_p= 282702183
##$YMIN_p= -108999
$$ End of Bruker specific parameters
$$ ---------------------------------
##NTUPLES= NMR SPECTRUM
##VAR_NAME=  FREQUENCY,     SPECTRUM/REAL,   SPECTRUM/IMAG
##SYMBOL=    X,             R,               I
##VAR_TYPE=  INDEPENDENT,   DEPENDENT,       DEPENDENT
##VAR_FORM=  AFFN,          ASDF,            ASDF
##VAR_DIM=   32768,         32768,           32768
##UNITS=     HZ,            ARBITRARY UNITS, ARBITRARY UNITS
##FACTOR=    0.157963299565203, 1,           1
##FIRST=     4132.6476996994, 0,             0
##LAST=      -1043.33573715361, 0,           0
##MIN=       -1043.33573715361, -108999,     0
##MAX=       4132.6476996994, 282702183,     0
$$ Real data points
##PAGE= N=1
##DATA TABLE= (X++(R..R)), XYDATA
$$ [...]
$$ plain form
23796 15913 -20315 -33615 -25981 -20217 -28215 -42385 -43594 -59904 -59978 -38968 -12509 -17080 2745
23783 2745 12024 20907 4382 -2053 7536 27240 25830 16218 6022 6310 11873 21848 29048 -3728
23769 -3728 -836 14416 19658 13700 -1302 -3316 -14902 -18064 -31650 -50396 -45911 -25973 4075
23756 4075 -4906 -13684 8036 32430 38271 20435 1750 14100 -1495 7454 36466 42292 38797
23743 38797 31552 -2936 -9670 -8712 6011 361 -3315 15117 31389 26828 -2609 -20498 3118
23730 3118 24026 26193 30155 469 10283 14032 24606 14584 -15295 -13026 -32511 -18832 -10360
23717 -10360 -9747 9461 16887 20647 19995 18204 2031 3598 15112 31028 14443 -6455 -11844
23704 -11844 -12386 4243 25453 31713 29704 30154 33994 42480 53444 50646 35731 19534 6633
$$ packed form
23796A5913l6228j3300P634N764p998j4170j209j6310p4K1010K6459m571J9825
23783B745R279Q883j6525o435R589J9704j410r612j0196K88N563R975P200l2776
23769c728K892J5252N242n958j5002k014j1586l162j3586j8746M485J9938L0048
23756D075q981q778K1720K4394N841j7836j8685J2350j5595Q949K9012N826l495
23743C8797p245l4488o734R58J4723n650l676J8432J6272m561k9437j7889K3616
23730C118K0908K167L962k9686R814L749J0574j0022k9879K269j9485J3679Q472
23717a0360O13J9208P426L760o52j791j6173J567J1514J5916j6585k0898n389
23704a1844n42J6629K1210O260k009M50L840Q486J0964k798j4915j6197j2901
$$ plain form
23691 6633 9341 27104 23376 1508 11187 9662 -3837 22249 49150 43092 20887 11539 23131
23678 23131 45321 51585 62418 34544 22754 18342 20697 2284 15963 34684 23891 26688
23666 26688 14913 -7383 -991 17512 22715 -916 -31653 -11257 -3864 -24668 -41820 -50012
23654 -50012 -36811 -19931 -8389 -2918 1278 -1051 14350 4192 -30636 -8968 -12974 -39838
23642 -39838 -43745 -47498 -24558 12429 1636 20599 38168 7027 -6043 4119 -15238 -42784
23630 -42784 -33488 -12590 -2696 -9391 -1352 22891 31170 10270 -10420 -19184 -25146 -28550 -9751
23617 -9751 12099 11272 5570 5521 21064 -9363 -9501 21322 37961 13359 19283 21202 8719 -2286
23603 -2286 -24475 -25013 -1359 -2078 -18871 -34911 -21769 11362 36218 34800 33792 30193 27359
$$ packed form
23691F633K708J7763l728k1868R679j525j3499K6086K6901o058k2205r348J1592
23678B3131K2190O264J0833k7874j1790m412K355j8413J3679J8721j0793K797
23666B6688j1775k2296O392J8503N203k3631l0737K0396P393k0804j7152q192
23654e0012J3201J6880J1542N471M196k329J5401j0158l4828K1668m006k6864
23642c9838l907l753K2940L6987j0793J8963J7569l1141j3070J0162j9357k7546
23630d2784R296K0898R894o695Q039K4243Q279k0900k0690q764n962l404J8799
23617i751K1850q27n702m9J5543l0427j38L0823J6639k4602N924J919j2483j1005
23603b286k2189n38K3654p19j6793j6040J3142L3131K4856j418j008l599k834
$$ plain form
23590 27359 21814 11289 9241 1604 10857 25028 21793 13145 -1050 6604 16150 28037 11169
23577 11169 13800 381 8967 50568 40657 23934 2363 4149 333 -9793 -9604 -45625 -69178
23564 -69178 -41044 -7064 25376 31711 35567 60085 61594 18178 18168 33831 27495 16666 32919
23551 32919 16391 1150 -4588 2389 7152 -10218 -18263 7165 35706 28335 3982 -11152 207
23538 207 9675 23459 24781 -5916 -16730 -27850 -13011 -17075 5096 25853 9585 681 4534
23525 4534 24843 49887 41410 40466 38857 31893 21112 -7098 -24943 -19028 7052 23162 21019
23512 21019 7318 -15474 19875 16630 3796 -292 15542 1932 -3236 -25831 -46070 -34084
23500 -34084 -3930 -2738 -2450 10288 -5007 15455 15760 3503 22068 24553 33599 18442 -6821
$$ packed form
23590B7359n545j0525k048p637R253J4171l235q648j4195P654R546J1887j6868
23577A1169K631j3419Q586M1601r911j6723k1571J786l816j0126J89l6021k3553
23564f9178K8134L3980L2440O335L856K4518J509m3416j0J5663o336j0829J6253
23551C2919j6528j5241n738O977M763j7370q045K5428K8541p371k4353j5134J1359
23538B07R468J3784J322l0697j0814j1120J4839m064K2171K0757j6268q904L853
23525D534K0309K5044q477r44j609o964j0781k8210j7845N915K6080J6110k143
23512B1019j3701k2792L5349l245j2834m088J5834j3610n168k2595k0239J1986
23500c4084L0154J192K88J2738j5295K0462L05j2257J8565K485R046j5157k5263
$$ plain form
23487 -6821 -43031 -58952 -77132 -78307 -46474 -31389 -51741 -24078 -40597 -44976 -65325 -47017
23475 -47017 -55042 -28790 15909 6629 -1430 -26252 -45746 -54711 -30396 -5741 -11376 -15657 -19839
23462 -19839 -32692 -40765 -29636 -13668 -4745 -79 7410 33174 44560 38242 25816 18833 51091
23449 51091 44279 21212 31719 25408 14351 -160 -3857 19580 11386 -7145 -17976 -20709 -35932
23436 -35932 -35884 -27567 -18636 -1313 -11965 1228 -5771 -27792 -34106 -37495 -24545 4762 33020
23423 33020 30032 -3946 -673 -17528 -40917 -39751 -59199 -60711 -11274 -766 -25955 -38486
23411 -38486 -34582 -52625 -66059 -55182 -14832 -14730 -18043 19233 28700 41294 53727 17880 8289
23398 8289 8406 -14487 -46567 -62394 -42328 -45434 -66807 -73235 -46022 -12315 14239 63944 59169
$$ packed form
23487f821l6210j5921j8180j175L1833J5085k0352K7663j6519m379k0349J8308
23475d7017q025K6252M4699r280q059k4822j9494q965K4315K4655n635m281m182
23462a9839j2853q073J1129J5968Q923M666P489K5764J1386o318j2426o983L2258
23449E1091o812k3067J0507o311j1057j4511l697K3437q194j8531j0831k733j5223
23436c5932M8Q317Q931J7323j0652J3193o999k2021o314l389J2950K9307K8258
23423C3020k988l3978L273j6855k3389J166j9448j512M9437J0508k5189j2531
23411c8486L904j8043j3434J0877M0350J02l313L7276R467J2594J2433l5847r591
23398H289J17k2893l2080j5827K0066l106k1373o428K7213L3707K6554M9705m775
$$ plain form
23385 59169 3590 -9478 -28062 -41789 -24903 10225 29670 32499 -11142 -44591 -42437 -39454
23373 -39454 -56347 -33680 -22387 -25272 9927 66980 81220 63155 27659 17877 14808 27780
23361 27780 53437 37079 20008 -23272 -22032 -12744 3064 17339 28450 18882 5072 3029
23349 3029 10316 1794 -30298 -27693 -19980 -12761 4699 -784 11919 -3881 -28147 -25052 -494
23336 -494 16015 35446 36476 12299 -14970 -7519 -5775 -20434 -34753 -54278 -41162 -32495 -46810
23323 -46810 -87688 -108999 -85865 -76151 -47458 -4063 14798 -12973 -30295 -31246 7450 9085
23311 9085 -24469 -32512 -29419 -27110 -21784 -5454 3152 11717 30712 32237 26160 5540 -12576
23298 -12576 -16790 7779 40648 40397 25803 5013 -8528 -29334 -42010 -9634 -1961 34439
$$ packed form
23385E9169n5579j3068j8584j3727J6886L5128J9445K829m3641l3449K154K983
23373c9454j6893K2667J1293k885L5199N7053J4240j8065l5496r782l069J2972
23361B7780K5657j6358j7071m3280J240R288J5808J4275J1111r568j3810k043
23349C029P287q522l2092K605P713P219J7460n483J2703j5800k4266L095K4558
23336d94J6509J9431J030k4177k7269P451J744j4659j4319j9525J3116Q667j4315
23323d6810m0878k1311K3134R714K8693M3395J8861k7771j7322r51L8696J635
23311I085l3554q043L093K309N326J6330Q606Q565J8995J525o077k0620j8116
23298a2576m214K4569L2869k51j4594k0790j3541k0806j2676L2376P673L6400
$$ plain form
23286 34439 49371 57145 42472 2182 -41536 -37935 -10885 -9205 -17938 4886 1285 -24856 -18848
23273 -18848 -36208 -35158 -6894 -12632 -27478 -19271 11059 6044 -13217 -37489 -29563 5580 2714
23260 2714 13075 14169 24446 3188 -12813 -12644 -4114 -8126 -7611 -27142 -31236 -14800 -38669
23247 -38669 -48090 -30183 -18907 -14281 1367 21576 18647 28956 48675 27509 21113 -9970
23235 -9970 -41124 -44900 -46890 -20426 -3171 7443 36537 34486 17664 -7126 -37880 -35120 -28853
23222 -28853 -11970 -3307 -11375 -5965 -12938 -27974 -28393 -13748 -15810 -20882 -22992 -15160 7508 32051
23208 32051 37557 20728 -16003 -19525 -8837 6652 25466 27994 28526 42217 19803 -7595 976
23195 976 23106 25634 47271 67110 41643 38317 51458 60283 68156 55782 36086 21632 17938
$$ packed form
23286C4439J4932P774j4673m0290m3718L601K7050J680q733K2824l601k6141O008
23273a8848j7360J050K8264n738j4846Q207L0330n015j9261k4272P926L5143k866
23260B714J0361J094J0277k1258j6001J69Q530m012N15j9531m094J6436k3869
23247c8669r421J7907J1276M626J5648K0209k929J0309J9719k1166o396l1083
23235i970l1154l776j990K6464J7255J0614K9094k051j6822k4790l0754K760O267
23222b8853J6883Q663q068N410o973j5036m19J4645k062n072k110P832K2668K4543
23208C2051N506j6829l6731l522J0688J5489J8814K528N32J3691k2414k7398Q571
23195I76K2130K528K1637J9839k5467l326J3141Q825P873j2374j9696j4454l694
$$ plain form
23182 17938 44207 22747 -12445 -20176 -18962 -20078 -352 3207 8955 14014 10638 13466 28045
23169 28045 40736 32755 9837 -13389 -32642 -40993 -13532 -4519 5126 9869 17732 16805 11951
23156 11951 -12693 -21513 -16030 22567 25200 -9473 -36794 -54296 -42450 -309 14685 4718
23144 4718 -11818 -3277 -13865 -25171 -28667 -34904 -8679 26755 23679 25279 34225 22413 10397
23131 10397 -11937 -22725 -17004 -24968 -6815 12698 31931 880 -28404 -16445 3017 14286
23119 14286 37420 35084 360 -12544 -7753 2047 -2420 21549 9476 3825 23221 43520 51836
23106 51836 60053 49235 32464 2568 -15073 11204 -1557 -8727 -3897 -12807 8190 6088 -20284
23093 -20284 -31027 -52389 -74988 -71409 -31861 21450 34372 11970 39345 58275 45857 42974
$$ packed form
23182A7938K6269k1460l5192p731J214j116J9726L559N748N059l376K828J4579
23169B8045J2691p981k2918k3226j9253q351K7461R013R645M743P863r27m854
23156A1951k4644q820N483L8597K633l4673k7321j7502J1846M2141J4994r967
23144D718j6536Q541j0588j1306l496o237K6225L5434l076J600Q946j1812j2016
23131A0397k2334j0788N721p964J8153J9513J9233l1051k9284J1959J9462J1269
23119A4286K3134k336l4724j2904M791R800m467K3969j2073n651J9396K0299Q316
23106E1836Q217j0818j6771k9896j7641K6277j2761p170M830q910K0997k102k6372
23093b0284j0743k1362k2599L579L9548N3311J2922k2402K7375J8930j2418k883
$$ plain form
23081 42974 37202 31479 3374 -28486 -46001 -52577 -58189 -29624 -25641 -25183 -19698 7984 22253
23068 22253 15057 5239 35703 39205 22651 20244 8647 875 -11410 -10964 -5599 -7526 -18227
23055 -18227 -6563 31316 18820 -6252 5766 -3704 -21145 -4394 -11404 -975 3368 21949
23043 21949 43788 52617 31123 24432 8983 -9849 -20006 -4448 2613 -1343 -19483 -10913 -12330
23030 -12330 9077 3839 -23083 -14713 -3049 -9950 486 38310 68170 65575 56069 35393 10510
23017 10510 -1407 -10328 -14311 1025 -1314 -32577 -37019 -17334 -22561 -7461 -20197 -33530 -30597
23004 -30597 -41043 -43054 -43068 -61413 -75214 -53077 -32082 4785 -6495 -22798 -46052 -17600
22992 -17600 2660 -8761 -36524 -48195 -41682 -46658 -34239 -15089 -2329 4118 15843 944
$$ packed form
23081D2974n772n723k8105l1860j7515o576n612K8565L983M58N485K7682J4269
23068B2253p196r818L0464L502j6554k407j1597p772j2285M46N365j927j0701
23055a8227J1664L7879j2496k5072J2018r470j7441J6751p010J0429M343J8581
23043B1949K1839Q829k1494o691j5449j8832j0157J5558P061l956j8140Q570j417
23030a2330K1407n238k6922Q370J1664o901J0436L7824K9860k595r506k0676k4883
23017A0510j1917q921l983J5336k339l1263m442J9685n227J5100j2736j3333K933
23004c0597j0446k011j4j8345j3801K2137K0995L6867j1280j6303k3254K8452
22992a7600K0260j1421k7763j1671O513m976J2419J9150J2760O447J1725j4899
$$ plain form
22980 944 2172 19843 15342 24803 29853 8042 12977 23646 22334 35756 48406 37418 23840
22967 23840 15498 -4791 -17707 -18693 6508 359 -18983 -36298 -39451 -30781 -42427 -48267 -39104
22954 -39104 -20794 2843 -31521 -25296 -10612 10739 10460 7534 -2266 -629 -12078 1987 -11326
22941 -11326 -8399 -5967 7792 8436 17686 -12 -1355 -3531 -24502 -12112 -8201 -8364 -18506 -12046
22927 -12046 -4865 7120 -12014 -41561 -34766 -27883 -43966 -60012 -65027 -22718 1485 3361 3647
22914 3647 6170 35479 21213 23364 29474 -38 -24593 -26027 -26839 -9811 34643 47570 43060
22901 43060 39460 23995 -303 -9501 -8895 9487 36494 36274 28243 1242 541 -3094 -16274 1307
22887 1307 24805 9895 -9002 -17754 -23936 -12464 -818 11742 34802 30673 3737 -2764 666
$$ packed form
22980I44J228J7671m501R461N050k1811M935J0669j312J3422J2650j0988j3578
22967B3840q342k0289j2916r86K5201o149j9342j7315l153Q670j1646n840R163
22954c9104J8310K3637l4364O225J4684K1351k79k926r800J637j1449J4065j3313
22941a1326K927K432J3759O44R250j7698j343k176k0971J2390L911j63j0142O460
22927a2046P181J1985j9134k9547O795O883j6083j6046n015M2309K4203J876K86
22914C647K523K9309j4266K151O110k9512k4555j434q12J7028M4454J2927m510
22901D3060l600j5465k4298r198O06J8382K7007k20q031k7001p01l635j3180J7581
22887A307K3498j4910j8897q752o182J1472J1646J2560K3060m129k6936o501L430
$$ plain form
22874 666 -6621 -18122 -7019 -9709 443 -4989 -15831 4822 -5152 -5858 18894 20187 23824 23633
22860 23633 11382 -2542 -20023 -34299 -40175 -30450 -37043 -30636 -27444 -27324 -53597 -75561 -79187
22847 -79187 -54921 -30499 -16695 -18625 -2770 4126 6325 33032 17508 -15645 -400 14301
22835 14301 18391 21965 6163 -21908 -28307 -45097 -69143 -57690 -37437 -25327 -34144 -22596
22823 -22596 -11910 -25621 -7232 4843 970 -10938 -23136 -16379 -14731 -14052 -13766 12235 28371
22810 28371 2433 1773 -16392 -51825 -60903 -36812 -19994 -2113 15522 36922 55838 60486
22798 60486 54696 28382 -409 -13176 -21074 5596 -41 -2319 -3815 198 11286 15341 17879
22785 17879 40591 30767 9991 10245 20333 18327 39576 20546 34016 25248 37432 37535 36473
$$ packed form
22874F66p287j1501J1103k690J0152n432j0842K0653r974p06K4752J293L637j91
22860B3633j2251j3924j7481j4276n876R725o593O407L192J20k6273k1964l626
22847g9187K4266K4422J3804j930J5855O896K199K6707j5524l3153J5245J4701
22835A4301M090L574j5802k8071o399j6790k4046J1453K0253J2110q817J1548
22823b2596J0686j3711J8389J2075l873j1908j2198O757J648O79K86K6001J6136
22810B8371k5938o60j8165l5433r078K4091J6818J7881J7635K1400J8916M648
22798F0486n790k6314k8791j2767p898K6670n637k278j496M013J1088M055K538
22785A7879K2712r824k0776K54J0088k006K1249j9030J3470q768J2184J03j062
$$ plain form
22772 36473 41802 33781 28332 35169 38991 41178 56386 38613 -1596 -21994 -11868 -35279 -31123
22759 -31123 -1878 22707 11786 10815 20238 5465 -395 -5551 -24042 -34008 -55690 -35102 -13234
22746 -13234 11896 18739 -7471 -54205 -29136 -1530 4791 1949 -4331 230 10463 -6022 -5874
22733 -5874 17952 14709 2434 -40180 -37860 -30871 -16529 -6861 -16619 -8181 -4228 -5998 1280 9060
22719 9060 39340 49856 39681 30823 34037 25721 24924 23454 15611 21867 21121 32578 36036 30791
22705 30791 2700 11215 31736 28566 12280 -7353 -9245 -14812 -27660 -24117 -8779 -1523 -7157
22692 -7157 12337 33089 46963 59801 38285 -6588 2238 24496 19896 17052 18658 2481 -36783
22679 -36783 -69974 -57194 -41020 -25446 -31982 -40966 -14092 10545 -621 -22250 -13588 -8639
$$ packed form
22772C6473N329q021n449O837L822K187J5208j7773m0209k0398J0126k3411M156
22759c1123K9245K4585j0921r71R423j4773n860n156j8491r966k1682K0588K1868
22746a3234K5130O843k6210m6734K5069K7606O321k842o280M561J0233j6485J48
22733e874K3826l243j2275m2614K320O989J4342R668r758Q438L953j770P278P780
22719I060L0280J0516j0175q858L214q316p97j470p843O256p46J1457L458n245
22705C0791k8091Q515K0521l170j6286j9633j892n567j2848L543J5338P256n634
22692g157J9494K0752J3874J2838k1516m4873Q826K2258m600k844J606j6177l9264
22679c6783l3191J2780J6174J5574o536q984K6874K4637j1166k1629Q662M949
$$ plain form
22667 -8639 -1401 16925 22283 5723 22356 23599 22158 27008 3640 2538 -1973 946 -10591
22654 -10591 -29208 -19653 -5959 22584 546 -9365 20673 1424 -10076 -26876 -66340 -51033
22642 -51033 -12110 4178 13885 -16271 -35042 -17445 -29019 -27697 -8409 -15597 -45510 -34560
22630 -34560 9125 20762 15218 10655 28203 37482 46791 7889 -35573 -44140 -42064 -28063 -9999
22617 -9999 9350 2116 -29216 -30227 -5843 20702 17522 -10267 -14353 11768 11225 30410 32982
22604 32982 15023 18126 26523 13957 -2799 -34716 -40732 -17417 -8653 -16742 -33353 -58154 -58003
22591 -58003 -31712 -53185 -55004 -34207 -5956 14010 21887 42648 42760 14706 4550 13174 21989
22578 21989 23990 -3823 646 7492 3848 -16789 8801 24790 32886 -5444 -27 20635 9312
$$ packed form
22667h639P238J8326N358j6560J6633J243j441M850k3368j102m511K919j1537
22654a0591j8617R555J3694K8543k2038r911L0038j9249j1500j6800l9464J5307
22642e1033L8923J6288R707l0156j8771J7597j1574J322J9288p188k9913J0950
22630c4560M3685J1637n544m563J7548R279R309l8902m3462q567K076J4001J8064
22617i999J9349p234l1332j011K4384K6545l180k7789m086K6121n43J9185K572
22604C2982j7959L103Q397j2566j6756l1917o016K3315Q764q089j6611k4801J51
22591e8003K6291k1473j819K0797K8251J9966P877K0761J12k8054j0156Q624Q815
22578B1989K001k7813M469O846l644k0637K5590J5989Q096l8330N417K0662j1323
$$ plain form
22565 9312 9706 -35439 -50751 -31864 -19698 -29198 -34062 -8029 649 -7832 -18594 -8444 -6222
22552 -6222 -1156 14144 -29171 -21397 -6313 17973 26832 12008 -10576 -21983 -4438 -12104 -11421
22539 -11421 -6170 17274 4226 -7143 -5342 -12224 -15007 -31020 -18103 -4696 1315 7632 13178
22526 13178 12269 -8598 -42186 -18846 -5991 34020 22682 7262 -2107 1182 18886 12438 31677
22513 31677 20206 -7655 -7425 -30414 -39495 -13427 5389 -2295 2775 7911 6049 8323 22957
22500 22957 39590 39540 8173 7277 4147 -5546 -4748 3 -7251 1485 12066 -682 -9541 -3937
22486 -3937 6020 8260 37053 5364 -14646 -9644 -26145 -25725 -22413 -30375 -23601 -25287 -6798 -9107
22472 -9107 -28391 -37523 -19237 12584 30098 5007 -4562 -19245 -4868 5172 -14706 -4257
$$ packed form
22565I312L94m5145j5312J8887J2166r500m864K6033Q678q481j0762J0150K222
22552f222N066J5300m3315P774J5084K4286Q859j4824k2584j1407J7545p666O83
22539a1421N251K3444j3048j1369J801o882k783j6013J2917J3407O011O317N546
22526A3178r09k0867l3588K3340J2855M0011j1338j5420r369L289J7704o448J9239
22513C1677j1471k7861K30k2989r081K6068J8816p684N070N136j862K274J4634
22500B2957J6633n0l1367q96l130r693P98M751p254Q736J0581j2748q859N604
22486c937R957K240K8793l1689k0010N002j6501M20L312p962O774j686J8489k309
22472i107j9284r132J8286L1821J7514k5091r569j4683J4377J0040j9878J0449
$$ plain form
22460 -4257 -2796 -25078 -18091 -13741 -24231 -30032 -25478 -31413 -17316 -26972 -29461 -11216 -14057 -16743
22446 -16743 -17640 -18509 -24510 1130 19509 16771 -1668 -10395 -14153 -736 -4065 12854 16698 7039
22432 7039 5884 5032 4736 17994 30028 37876 58029 47925 36085 45115 44634 16085 7290 3705
22418 3705 -19209 -13111 5424 -11441 -5625 -4696 -6966 29519 43189 49584 26384 16770 19204
22405 19204 -1994 -26634 -30044 -38053 -37962 -30409 -20244 -33419 -42415 -58214 -74945 -69392 -34089
22392 -34089 -6539 1459 -25290 -22202 -50277 -56982 -35938 -45962 -49969 -79776 -61026 -36631
22380 -36631 -44382 -50336 -58014 -54488 -43471 -28070 -21175 -332 -6913 -21504 -24442 -20093 -8231
22367 -8231 -20296 -8877 -14007 -36461 -31858 -39740 -23214 4286 31298 4612 -29918 -2115
$$ packed form
22460d257J461k2282O987M350j0490n801M554n935J4097r656k489J8245k841k686
22446a6743q97q69o001K5640J8379k738j8439q727l758J3417l329J6919L844r659
22432G039j155q52k96J3258J2034P848K0153j0104j1840R030m81k8549q795l585
22418C705k2914O098J8535j6865N816R29k270L6485J3670O395k3200r614K434
22405A9204k1198k4640l410q009R1P553J0165j3175q996j5799j6731N553L5303
22392c4089K7550P998k6749L088k8075o705K1044j0024m007k9807J8750K4395
22380c6631p751n954p678L526J1017J5401O895K0843o581j4591k938M349J1862
22367h231j2065J1419n130k2454M603p882J6526K7500K7012k6686l4530K7803
$$ plain form
22355 -2115 3900 3502 -20942 -46574 -35574 -20382 14999 7419 -14180 -15823 -31253 -40999 -21841
22342 -21841 -30644 -33117 -27144 -23188 -2914 17290 37917 27446 16487 6968 -3733 -4016 7407
22329 7407 15595 34608 41112 49201 52995 59779 57884 45090 41325 45073 40291 13253 10686 18525
22315 18525 19067 13232 21720 15180 -8594 10091 13104 5642 8588 28947 26043 17202 8023 10324
22301 10324 17150 3748 781 -5249 -1534 -4483 -20557 -24739 -3221 -15653 -23425 -27777 10638
22288 10638 20775 4897 28254 -6074 -27338 -16518 15259 40201 57001 56264 39685 45905
22276 45905 15570 33537 12900 5822 19353 12772 -336 -7622 11112 21236 28744 18887 29933
22263 29933 34740 32896 28804 30835 33578 23994 21845 24202 18606 10230 13022 -9660 -21777 -35074
$$ packed form
22355b115O015l98k4444k5632J1000J5192L5381p580k1599j643j5430r746J9158
22342b1841q803k473N973L956K0274K0204K0627j0471j0959r519j0701k83J1423
22329G407Q188J9013O504Q089L794O784j895j2794l765L748m782k7038k567P839
22315A8525N42n835Q488o540k3774J8685L013p462K946K0359k904q841r179K301
22301A0324O826j3402k967o030L715k949j6074m182K1518j2432p772m352L8415
22288A0638J0137j5878K3357l4328k1264J0820L1777K4942J6800p37j6579O220
22276D5905l0335J7967k0637p078J3531o581j3108p286J8734J0124P508r857J1046
22263B9933M807j844m092K031K743r584k149K357n596q376K792k2682j2117j3297
$$ plain form
22249 -35074 -21764 -38785 -44995 -44933 -30950 -17765 -3688 -4504 -5831 4721 302 -25469 -28583
22236 -28583 -22274 -39165 -11863 30522 33328 8575 -3708 2254 -13176 -17108 -12476 -19053 -22875
22223 -22875 -11927 -7096 -24491 -14684 14376 22660 29274 58796 41179 3486 -35 -1344 -14925
22210 -14925 -8048 8476 4536 -9154 -29041 -61574 -60914 -28145 -8872 21050 36844 7975
22198 7975 -26599 -892 2387 -23186 -29363 -44489 -21568 -5932 -22330 -15104 -684 2060 18597
22185 18597 13211 -13381 -27057 -26256 -34649 -41917 -45943 -15886 -2001 -18026 -35328 -43029 -28672
22172 -28672 -4202 -3755 -29099 -9913 9370 12490 17218 24299 31586 40091 48409 64091 59087
22159 59087 36262 30662 38881 2550 -14731 -2562 -4013 6267 29359 38809 24114 -8246
$$ packed form
22249c5074J3310j7021o210O2J3983J3185J4077q16j327J0552m419k5771l114
22236b8583O309j6891K7302M2385K806k4753j2283N962j5430l932M632o577l822
22223b2875J0948M831j7395R807K9060Q284O614K9522j7617l7693l521j309j3581
22210a4925O877J6524l940j3690j9887l2533O60L2769J9273K9922J5794k8869
22198G975l4574K5707L279k5573o177j5126K2921J5636j6398P226J4420K744J6537
22185A8597n386k6592j3676Q01q393p268m026L0057J3885j6025j7302p701J4357
22172b8672K4470M47k5344J9186J9283L120M728P081P287Q505Q318J5682n004
22159E9087k2825n600Q219l6331j7281J2169j451J0280K3092R450j4695l2360
$$ plain form
22147 -8246 -39488 -51497 -34136 -24432 -25655 -35458 -28116 -43653 -53954 -46478 -19094 -1051 -14075
22134 -14075 3270 -2840 -14184 -14805 -12663 -1828 11386 7256 -4369 -1889 19939 7010 -19962
22121 -19962 -33915 -15415 -19476 -5213 39662 22121 33564 46602 27474 33941 34244 5261
22109 5261 -44591 -56803 -32312 13365 25207 15960 15945 17835 26507 51252 65366 15268 14089
22096 14089 26974 10364 -5743 -34329 -43421 -36048 -41364 -32557 -33836 -26854 -5644 -21380 -41981
22083 -41981 -15397 1291 6918 -262 -5504 -29992 -35301 -1149 13403 155 -13699 -17267 -13024
22070 -13024 -10663 -24020 -40322 -53337 -32813 -20276 -21811 -24397 -1680 -6016 -24447 -36019
22058 -36019 -24817 -7286 -18722 -26856 -34641 -32613 -4525 1175 -11820 -4282 32956 42428 42381
$$ packed form
22147h246l1242j2009J7361R704j223r803P342j5537j0301P476K7384J8043j3024
22134a4075J7345o110j1344o21K142J0835J3214m130j1625K480K1828j2929k6972
22121a9962j3953J8500m061J4263M4875j7541J1443J3038j9128O467L03k8983
22109E261m9852j2212K4491M5677J1842r247j5J890Q672K4745J4114n0098j179
22096A4089J2885j6610j6107k8586r092P373n316Q807j279O982K1210j5736k0601
22083d1981K6584J6688N627p180n242k4488n309L4152J4552j3248j3854l568M243
22070a3024K361j3357j6302j3015K0524J2537j535k586K2717m336j8431j1572
22058c6019J1202J7531j1436q134p785K028K8088N700j2995P538L7238R472m7
$$ plain form
22045 42381 22507 26157 12871 6749 10395 -10646 -19715 -22596 -24796 -6522 22572 23949 23326
22032 23326 9810 19921 33041 24595 2669 -7943 8235 39176 37219 8286 -6756 -15076
22020 -15076 -20957 -22323 -12294 -20917 -35782 -29617 -35470 -39449 -40610 -37713 -25180 -2147 17165
22007 17165 15900 -10638 -29948 -47464 -50695 -25144 -10298 -21132 -31701 -34799 -55713 -48873
21995 -48873 -19813 -8277 -42276 -51222 -25596 -26549 -38340 -18082 -13599 -10360 13607 13265 8229
21982 8229 -12104 -17704 1471 22014 23875 -1084 -17290 -17602 -8671 10853 19533 19205 6352
21969 6352 7433 19479 16087 12099 -7441 335 5891 -1990 -22432 -10441 -33064 -42683 -45765
21956 -45765 -38273 -32757 13357 28280 28705 -7060 -23413 -27426 -13382 3162 -16694 144 7492
$$ packed form
22045D2381j9874L650j3286o122L646k1041r069k881k200J8274K9094J377o23
22032B3326j3516J0111J3120q446k1926j0612J6178L0941j957k8933j5042q320
22020a5076n881j366J0029q623j4865O165n853l979j161K897J2533K3033J9312
22007A7165j265k6538j9310j7516l231K5551J4846j0834j0569l098k0914O840
21995d8873K9060J1536l3999q946K5626r53j1791K0258M483L239K3967l42n036
21982H229k0333n600J9175K0543J861k4959j6206l12Q931J9524Q680l28j2853
21969F352J081J2046l392l988j9540P776N556p881k0442J1991k2623r619l082
21956d5765P492N516M6114J4923M25l5765j6353m013J4044J6544j9856J6838P348
$$ plain form
21943 7492 -10799 -12961 18839 30442 11891 -14773 -19922 -24182 -20055 -38495 -52918 -46544 -37352
21930 -37352 11552 22810 5945 128 8524 12996 27131 7558 -9667 -7146 15585 29016
21918 29016 14399 14441 24365 9355 6255 -3721 -18418 -9492 1385 2583 -8796 -8364 9622 2856
21904 2856 8884 -2792 -5492 1259 12404 17776 14579 -17530 -42931 -37253 -16686 -4740 -22922
21891 -22922 -24290 8982 6767 5460 3848 5829 36469 69735 66951 37477 6566 -3269 4241
21878 4241 -3959 20279 26308 26226 45311 50046 2880 -24746 -286 40836 40007 24488 2362
21865 2362 -15272 -14636 -18635 -7183 -29819 -37998 -28403 -10597 -9008 -3998 -15598 -11026 -15561 -15817
21851 -15817 -5498 19359 48219 42887 15559 -17585 -27783 -22194 -24930 -10863 4810 23765
$$ packed form
21943G492j8291k162L1800J1603j8551k6664n149m260M127j8440j4423O374R192
21930c7352M8904J1258j6865n817Q396M472J4135j9573j7225K521K2731J3431
21918B9016j4617M2R924j5010l100r976j4697Q926J0877J198j1379M32J7986o766
21904B856O028j1676k700O751J1145N372l197l2109k5401N678K0567J1946j8182
21891b2922j368L3272k215j307j612J981L0640L3266k784k9474l0911r835P510
21878D241q200K4238O029q2J9085M735m7166k7626K4460M1122q29j5519k2126
21865B362j7634O36l999J1452k2636q179R595J7806J589N010j1600M572m535k56
21851a5817J0319K4857K8860n332k7328l3144j0198N589k736J4067J5673J8955
$$ plain form
21839 23765 33255 18637 -10538 -16485 -9149 1346 724 -3448 -14205 -11489 6501 8372 -1437
21826 -1437 -16674 -11933 4996 3770 -24894 -28754 -4132 -34700 -44152 -46001 -36943 -38891 -45442
21813 -45442 -44469 -16450 -26646 -48140 -50976 -52185 -47574 -24135 -37769 -43188 -23431 -4871 -8881
21800 -8881 1228 11034 15277 17877 8812 2112 16830 -19740 -29373 -19356 2784 21601 20589
21787 20589 -1358 -23589 -42556 -33819 1561 1162 2248 -9717 -19746 -37313 -47997 -54877 -63290
21774 -63290 -59060 -34730 11466 1011 -10270 -12204 -19356 -37657 -28562 3257 8978 6138 -19734
21761 -19734 -33259 -54816 -40117 -53261 -74575 -67578 -44570 -43002 -30453 -39906 -36694 -27988 -10554
21748 -10554 -16464 -7203 -14390 -47447 -43537 -35697 -42659 -20213 -3131 -6827 -24552 -23315 -34639
$$ packed form
21839B3765R490j4618k9175n947P336J0495o22m172j0757K716J7990J871r809
21826a437j5237M741J6929j226k8664l860K4622l0568r452j849R058j948o551
21813d5442R73K8019j0196k1494k836j209M611K3439j3634n419J9757J8560m010
21800h881J0109R806M243K600r065o700J4718l6570r633J0017K2140J8817j012
21787B0589k1947k2231j8967Q737L5380l99J086j1965j0029j7567j0684o880q413
21774f3290M230K4330M6196j0455j1281j934p152j8301R095L1819N721k840k5872
21761a9734j3525k1557J4699j3144k1314O997K3008J568J2549r453L212Q706J7434
21748a0554n910R261p187l3057L910P840o962K2446J7082l696j7725J237j1324
$$ plain form
21735 -34639 -41525 -44713 -44577 -48058 -43663 -32171 -23290 -2679 -8376 -26157 -45049 -24802 2146
21722 2146 -23614 -38236 -24290 -11114 10949 9610 14637 35616 11184 9198 -17491 -7618 17714
21709 17714 8150 6237 -7300 11465 6590 -5298 -1806 7286 31758 -2766 -25533 -36395 -41104
21696 -41104 -20696 -17262 -15089 -27877 -25711 -17823 4512 6422 -29179 -31464 -9683 -2709 -1783
21683 -1783 -2856 -13710 -35952 -29143 -51867 -74243 -55306 -36152 -9335 10502 2213 -6965 -18672
21670 -18672 -31462 -32444 -21026 9364 12298 8205 5894 -15582 -26030 -4272 2468 -32458 -19342
21657 -19342 9225 9323 14667 -749 -13086 4832 -2230 13707 15954 1164 -16205 -7888 -19627
21644 -19627 -24100 -3792 -6105 -28893 -22662 7656 -21632 -13385 5691 -6031 -35208 2784
$$ packed form
21735c4639o886l188J36l481M395J1492Q881K0611n697j7781j8892K0247K6948
21722B146k5760j4622J3946J3176K2063j339N027K0979k4432j986k6689R873K5332
21709A7714r564j913j3537J8765m875j1888L492R092K4472l4524k2767j0862m709
21696d1104K0408L434K173j2788K166P888K2335J910l5601k285K1781O974R26
21683a783j073j0854k2242O809k2724k2376J8937J9154K6817J9837q289r178j1707
21670a8672j2790r82J1418L0390K934m093k311k1476j0448K1758O740l4926J3116
21657a9342K8567R8N344j5416j2337J7918p062J5937K247j4790j7369Q317j1739
21644a9627m473K0308k313k2788O231L0318k9288Q247J9076j1722k9177L7992
$$ plain form
21632 2784 19898 30051 37870 26902 7063 3904 9520 -11962 -1376 -13087 178 42087
21620 42087 39393 10198 25279 38973 -4254 5020 4346 -6478 -17230 -30471 -52943 -24355
21608 -24355 -17432 -18994 -42114 -61171 -30316 -29800 -30518 -30868 -38829 -31746 -22740 -1508 850 -432
21594 -432 650 8894 3930 -14188 -7867 18930 19087 9811 -5616 6779 22390 26310 21420 6755
21580 6755 12896 24782 10145 25 17462 57223 80496 59226 24381 10878 7885 9282
21568 9282 21670 17910 -1556 -18873 -9235 5353 -5440 -2442 -1542 4583 1676 -7987 -5047 5517
21554 5517 25492 6320 13417 25530 21523 -4287 -3710 6745 7495 20423 15934 -7785 -34385
21541 -34385 -51301 -44450 -2022 26647 24563 19491 812 2103 889 2606 10003 -7720 -19103
$$ packed form
21632B784J7114J0153P819j0968j9839l159N616k1482J0586j1711J3265M1909
21620D2087k694k9195J5081J3694m3227R274o74j0824j0752j3241k2472K8588
21608b4355O923j562k3120j9057L0855N16p18l50p961P083R006K1232K358j282
21594d32J082Q244m964j8118O321K6797J57r276j5427J2395J5611L920m890j4665
21580F755O141J1886j4637j0120J7437L9761K3273k1270l4845j3503k993J397
21568I282J2388l760j9466j7317R638J4588j0793K998R00O125k907r663K940J0564
21554E517J9975j9172P097J2113m007k5810N77J0455P50J2928m489k3719k6600
21541c4385j6916O851M2428K8669k084n072j8679J291j214J717P397j7723j1383
$$ plain form
21528 -19103 -7993 -12421 -24366 -10528 -2551 9511 -6904 -18218 -28680 -30317 -42012 -47400
21516 -47400 -37306 -25830 -15628 -5736 7664 -23634 -5597 -3398 3097 6105 -4023 -3989 -22894
21503 -22894 -26729 848 24925 3987 -29081 -8842 21460 19234 23435 44690 33957 11819
21491 11819 5328 14620 24555 15005 -6770 -9758 -20155 -15794 -15386 -6720 -1899 7036 12610 3251
21477 3251 -1031 9852 10779 17550 21881 16895 42172 65779 45789 25690 14912 -9376 -45012
21464 -45012 -70902 -42498 -42833 -25760 -2259 -12125 -29913 -14772 -38404 -31081 -11172 -1644 4038
21451 4038 -10926 -5902 10781 -16351 -48973 -45338 -15491 -5073 -10190 -5439 8631 14029 6981
21438 6981 -11491 -25710 -41372 17894 36102 35200 31024 17623 10294 -15233 -73975 -96489 -88744
$$ packed form
21528a9103J1110m428j1945J3838P977J2062j6415j1314j0462j637j1695n388
21516d7400J0094J1476J0202R892J3400l1298J8037K199O495L008j0128L4j8905
21503b2894l835K7577K4077k0938l3068K0239L0302k226M201K1255j0733k2138
21491A1819o491R292R935r550k1775k988j0397M361M08Q666M821Q935N574r359
21477C251m282J0883R27O771M331m986K5277K3607j9990k0099j0778k4288l5636
21464d5012k5890K8404l35J7073K3501r866j7788J5141k3632P323J9909R528N682
21451D038j4964N024J6683k7132l2622L635K9847J0418n117M751J4070N398p048
21438F981j8472j4219j5662N9266J8208r02m176j3401p329k5527n8742k2514P745
$$ plain form
21425 -88744 -58668 -49325 -65045 -61152 -49030 -37358 -13336 6072 26984 26285 25255 36566 44093
21412 44093 26933 5060 -18648 -16537 -4209 -23818 -3390 26136 8727 -13640 -23732 -12855
21400 -12855 -9970 -21779 -22606 -15899 -5321 443 -3188 -21397 -15904 -20805 -29221 -27787 -11613 -33671
21386 -33671 -24953 -19352 -26071 -31021 -37956 -40455 -55012 -45912 -18183 -19045 -13322 -14282 -3341 -1884
21372 -1884 -17876 -11365 20577 49045 14798 -6721 -10135 -14012 4995 -7493 -10192 2268 12430
21359 12430 12661 19297 7604 -7098 -15059 -18104 -3240 -2282 11893 4979 36086 37422 33430 34277
21345 34277 23167 27127 18855 15322 37635 19703 12297 20868 32073 20692 598 -7818 -30776
21332 -30776 -5634 -22441 -39072 -20970 -14753 4657 -2295 -8707 -42321 -46288 -40493 -42154 -41001
$$ packed form
21425h8744L0076R343j5720L893J2122J1672K4022J9408K0912o99j030J1311P527
21412D4093j7160k1873k3708K111J2328j9609K0428K9526j7409k2367j0092J0877
21400a2855K885j1809q27O707J0578N764l631j8209N493m901q416J434J6174k2058
21386c3671Q718N601o719m950o935k499j4557R100K7729q62N723r60J0941J457
21372a884j5992O511L1942K8468l4247k1519l414l877J9007j2488k699J2460J0162
21359A2430K31O636j1693j4702p961l045J4864R58J4175o914L1107J336l992Q47
21345C4277j1110L960q272l533K2313j7932p406Q571J1205j1381k0094q416k2958
21332c0776K5142j6807j6631J8102O217J9410o952o412l3614l967N795j661J153
$$ plain form
21319 -41001 -47976 -29204 -5785 -13242 -31738 -41992 -35430 -32188 -14697 24118 17016 20466 -4266
21306 -4266 -2361 -1363 -23960 -33473 -22470 -9171 11325 20575 19269 12378 14889 20133 32885 40527
21292 40527 17963 -25858 -25428 9830 20398 1655 -24105 -38232 -38414 -18855 -18125 -23673 1391
21279 1391 43505 42374 8874 -2294 -6515 -6750 1269 -2961 -28669 -45772 -21228 -5135 -34512
21266 -34512 -49468 -50130 -40053 -27042 -10805 -3599 -12339 -7839 -18832 -51443 -71971 -65428 -62541
21253 -62541 -34264 -19695 -17209 -31256 -41225 -6517 12179 18325 -4338 -36099 -34544 -31393 -15855
21240 -15855 -5088 -15849 -20399 -2726 -8089 -19939 -20377 -28964 -31858 -32301 -21268 -11552 -23625
21227 -23625 -13553 -16058 -9762 -25587 -25766 -13009 938 -13317 -38920 -7362 -11790 -47890 -18847
$$ packed form
21319d1001o975J8772K3419p457j8496j0254O562L242J7491L8815p102L450k4732
21306d266J905R98k2597r513J1003J3299K0496R250j306o891K511N244J2752P642
21292D0527k2564m3821M30L5258J0568j8743k5760j4127j82J9559P30n548K5064
21279A391M2114j131l3500j1168m221k35Q019m230k5708j7103K4544J6093k9377
21266c4512j4956o62J0077J3011J6237P206q740M500j0993l2611k0528O543K887
21253f2541K8277J4569K486j4047r969L4708J8696O146k2663l1761J555L151J5538
21240a5855J0767j0761m550J7673n363j1850m38q587k894m43J1033R716j2073
21227b3625J0072k505O296j5825j79J2757J3947j4255k5603L1558m428l6100K9043
$$ plain form
21214 -18847 10036 2261 -29117 -43700 -61019 -38327 -17520 -2691 3109 -12260 -8309 -3731
21202 -3731 -36451 -61078 -60127 -72062 -64113 -31307 -4567 -7281 -11377 -34583 -37034 -40761 -29698
21189 -29698 -30559 -24947 -23644 -11598 -32308 -34710 -31007 -21383 -17763 -51850 -62654 -46337 -36271
21176 -36271 -52245 -67107 -57815 -20990 1672 12469 34479 27307 18727 -4773 -25146 -29190
21164 -29190 -42109 -35786 -24504 -6340 11221 33951 32998 20053 10446 -4185 -29430 -32626 -36042
21151 -36042 -28009 -10594 -7969 -2656 27747 17160 354 15853 27977 32537 15756 -169
21139 -169 8742 982 -3285 -12502 -27880 -56696 -50662 -49850 -28818 -10365 3339 21612 7493
21126 7493 -31370 -41552 -45758 -45763 -31279 -35801 -29661 -16954 -27580 -17649 2181 18581 23287 -13551
$$ packed form
21214a8847K8883p775l1378j4583j7319K2692K0807J4829N800j5369L951M578
21202c731l2720k4627R51j1935P949L2806K6740k714m096k3206k451l727J1063
21189b9698q61N612J303J2046k0710k402L703R624L620l4087j0804J6317J0066
21176c6271j5974j4862R292L6825K2662J0797K2010p172q580k3500k0373m044
21164b9190j2919O323J1282J8164J7561K2730r53j2945r607j4631k5245l196l416
21151c6042Q033J7415K625N313L0403j0587j6806J5499J2124M560j6781j5925
21139a69Q911p760m267r217j5378k8816O034Q12K1032J8453J3704J8273j4119
21126G493l8863j0182m206nJ4484m522O140J2707j0626R931J9830J6400M706l6838
$$ plain form
21112 -13551 -26438 -10973 -17370 -3025 -10174 -2667 18142 4450 2411 -20955 -58786 -70679
21100 -70679 -54914 -28612 -31210 -48121 -22056 790 1129 20106 28314 19938 23375 24219 -8044
21087 -8044 -656 12195 27070 33099 38395 25641 867 -40117 -49727 -59131 -59304 -43813 -31921
21074 -31921 3682 29477 22675 15533 -14889 -27750 -17956 5472 1347 7188 11898 -5594 -21192
21061 -21192 -20586 -26119 -21605 -17084 -36279 -54703 -65171 -46457 -63753 -51538 -34363 -5870 16525
21048 16525 34786 26953 11948 -14470 -41319 -47174 -35451 -25937 -49436 -42261 -9979 -15736 -24418
21035 -24418 -33322 -35024 -9860 -9722 -392 -2383 -14831 -19911 -12332 -184 -1264 -1059 45281 49758
21021 49758 44569 18467 -8372 -15525 -21173 -23713 6753 32991 38906 20183 -8131 6433 33601
$$ packed form
21112a3551j2887J5465o397J4345p149P507K0809j3692k039k3366l7831j1893
21100g0679J5765K6302k598j6911K6065K2846L39J8977Q208q376L437Q44l2263
21087h044P388J2851J4875O029N296j2754k4774m0984r610r404j73J5491J1892
21074c1921L5603K5795o802p142l0422j2861R794K3428m125N841M710j7492j5598
21061b1192O06n533M514M521j9195j8424j0468J8714j7296J2215J7175K8493K2395
21048A6525J8261p833j5005k6418k6849n855J1723R514k3499P175L2282n757q682
21035b4418q904j702K5164J38R330j991j2448n080P579J2148j080K05M6340M477
21021D9758n189k6102k6839p153n648k540L0466K6238N915j8723k8314J4564K7168
$$ plain form
21008 33601 32085 -5382 -37016 -599 27241 -902 -22077 -7669 -695 2803 8994 41642
20996 41642 48003 31981 13670 -6119 -19619 -37448 -10136 12665 3648 14930 14926 -4569 -12816
20983 -12816 5418 14020 8198 9629 -5049 -14540 -36866 -37167 -54043 -63575 -42571 -11912 19673
20970 19673 43305 35282 26067 59319 63522 50764 22193 -4914 -26679 -18431 3908 22414
20958 22414 -17386 -43879 -47704 -44441 -41907 -29065 -35567 -48972 -26519 -7843 -9646 -7305 -3064
20945 -3064 -6738 -28241 -49255 -31351 -20728 -29192 -30660 -22682 -6969 7978 8297 13012 6996
20932 6996 -13208 -1000 -30204 -31262 -16037 6081 10608 -11639 -6753 -6589 -13593 -14191 -29708
20919 -29708 -59622 -65229 -20487 3204 -6769 10460 7655 -6352 -9351 -19979 -23795 -33391 -29425
$$ packed form
21008C3601j516l7467l1634L6417K7840k8143k1175J4408O974L498O191L2648
20996D1642O361j6022j8311j9789j3500j7829K7312K2801r017J1282mj9495q247
20983a2816J8234Q602n822J431j4678r491k2326l01j6876r532K1004L0659L1585
20970A9673K3632q023r215L3252M203j2758k8571k7107k1765Q248K2339J8506
20958B2414l9800k6493l825L263K534J2842o502j3405K2453J8676j803K341M241
20945c064l674k1503k1014J7904J0623q464j468P978J5713J4947L19M715o016
20932F996k0204J2208k9204j058J5225K2118M527k2247M886J64p004n98j5517
20919b9708k9914n607M4742K3691r973J7229k805j4007k999j0628l816r596L966
$$ plain form
20906 -29425 -18840 -13979 -1703 30869 36435 25084 40182 17007 -19139 -42882 -36273 -36846 -22477
20893 -22477 -15159 -38492 -55305 -52562 -55524 -44962 -18979 -6013 7046 17337 18567 40619
20881 40619 45805 32706 9343 -11484 -53228 -27695 -21285 -19886 -24489 -16302 5867 31409 44703
20868 44703 33593 -20478 -23165 -8600 -12756 5103 14500 -3906 -19652 -12177 2114 -16254
20856 -16254 -26757 -48772 -50536 -48453 -7589 8573 16282 15569 9923 19521 1023 1020 6629 19
20842 19 -2730 -15352 -25699 -18912 -18270 -20772 -8708 370 -5941 -8209 -45293 -69819 -45730 -45324
20828 -45324 -61642 -45266 -54253 -71959 -39314 -27778 -47280 -45139 -63652 -72529 -64042 -82242
20816 -82242 -57250 -21078 -6409 -13471 -14690 -398 -7140 -9382 -18339 -27040 -36940 -22783 -1004
$$ packed form
20906b9425J0585M861J2276L2572N566j1351J5098k3175l6146k3743O609n73J4369
20893b2477P318k3333j6813K743k962J0562K5983J2966J3059J0291J230K2052
20881D0619N186j3099k3363k0827m1744K5533O410J399m603Q187K2169K5542J3294
20868D4703j1110n4071k687J4565m156J7859R397j8406j5746P475J4291j8368
20856a6254j0503k2015j764K083M0864J6162P709p13n646R598j8498lN609o610
20842A9k749j2622j0347O787O42k502J2064R078o311k268l7084k4526K4089M06
20828d5324j6318J6376q987j7706L2645J1536j9502K141j8513q877Q487j8200
20816h2242K4992L6172J4669p062j219J4292o742k242q957q701r900J4157K1779
$$ plain form
20803 -1004 7684 4480 4875 6504 -15651 -10101 -14867 -15018 -45665 -55877 -46363 -29618 -16482 -38058
20789 -38058 -35353 -23493 -23738 -52931 -60687 -51901 -25749 -38548 -34356 -20270 -2043 25112 20735
20776 20735 -8167 -16265 -3535 5421 -8428 -27703 -48066 -21119 -13618 -16159 -18414 -25824 -30993
20763 -30993 -16707 -21865 -48069 -18510 -10203 -34838 7968 20172 11771 -5337 -2082 15127
20751 15127 8398 494 -2353 -5306 -4587 4547 -6109 -8983 33857 28434 38869 42322 20130 18864
20737 18864 30626 13367 -166 -18059 -9751 -144 -27442 -35089 -44767 -49802 -78617 -77110 -48833
20724 -48833 -23043 -7375 -7871 -10869 -32792 -49702 -41238 7114 26194 13993 -13733 -46753
20712 -46753 -40500 -40024 -27256 -28302 -44265 -60014 -61232 -44799 -44636 -25294 -20719 -18812 -19387 -25318
$$ packed form
20803a004Q688l204L95J629k2155N550m766j51l0647j0212R514J6745J3136k1576
20789c8058K705J1860k45k9193p756Q786K6152j2799M192J4086J8227K7155m377
20776B0735k8902q098J2730Q956j3849j9275k0363K6947P501k541k255p410n169
20763c0993J4286n158k6204K9559Q307k4635M2806J2204q401j7108L255J7209
20751A5127o729p904k847k953P19R134j0656k874M2840n423J0435L453k2192j266
20737A8864J1762j7259j3533j7893Q308R607k7298p647r678n035k8815J507K8277
20724d8833K5790J5668m96k998k1923j6910Q464M8352J9080j2201k7726l3020
20712d6753O253M76J2768j046j5963j5749j218J6433J63J9342M575J907n75n931
$$ plain form
20698 -25318 -38227 -36122 -26372 -46077 -43632 -24597 27 13078 31256 7131 -6293 22928
20686 22928 16568 -12616 -51626 -64458 -50990 -63784 -58408 -18690 9489 17530 7531 -1934 -23939
20673 -23939 -21107 5137 16670 16694 13939 13215 13155 -6491 -17019 -10269 -34933 -46340 -37970 -33425
20659 -33425 -23061 -11353 3991 -8632 698 7577 10657 1191 1384 -26698 -38190 -64858 -74455
20646 -74455 -82278 -70878 -39790 -4651 2836 -172 -12526 -36439 -40963 -59848 -63048 -57269 -53898
20633 -53898 -44503 -34287 -35216 3442 21741 10907 9870 11889 3433 -12678 -35166 -41097 -41234
20620 -41234 -42519 -42762 -42301 1238 39435 27653 6538 3721 10445 10220 33167 43077 55201 56372
20606 56372 43183 32581 3112 -4559 -8160 -31736 -29740 -21297 -21427 -32985 -25782 -27078 -26687 -26488
$$ packed form
20698b5318j2909K105R750j9705K445J9035K4624J3051J8178k4125j3424K9221
20686B2928o360k9184l9010j2832J3468j2794N376L9718K8179Q041r999r465k2005
20673b3939K832K6244J1533K4k755p24o0j9646j0528O750k4664j1407Q370M545
20659c3425J0364J1708J5344j2623R330O879L080r466J93k8082j1492k6668r597
20646g4455p823J1400L1088L5139P487l008j2354k3913m524j8885l200N779L371
20633e3898R395J0216r29L8658J8299j0834j037K019q456j6111k2488n931j37
20620d1234j285k43M61M3539L8197j1782k1115k817O724k25K2947R910J2124J171
20606E6372j3189j0602k9469p671l601k3576J996Q443j30j1558P203j296L91J99
$$ plain form
20592 -26488 -24752 -38873 -48525 -46727 -30442 -8490 -10149 9826 -98 -17446 -2042 3443 26784
20579 26784 38764 32225 22777 29790 21479 16849 10942 76 15186 -1416 -10455 -31854 -40410
20566 -40410 -35609 -51237 -36701 -49271 -45850 -20413 -1927 -11581 -356 9517 -24415 -35661
20554 -35661 -2293 24166 15702 -679 -3600 2153 -4350 -4287 -6647 -15695 -22991 -31944 -42414 -13523
20540 -13523 22611 24043 10237 -33221 -35671 -48453 -22082 -25316 -47868 -64148 -56587 -52070 -46300
20527 -46300 -15118 -20037 -13267 -18107 -2465 19827 24631 17406 -661 7676 27439 -6622 -16620
20514 -16620 -11809 -2586 -15840 18397 41771 22594 384 -28440 -21147 -14519 -7690 4389 9380
20501 9380 -23993 -32894 -580 7704 -25809 -24966 -14395 -5037 -6604 -28405 -50694 -52207 -41380
$$ packed form
20592b6488J736j4121r652J798J6285K1952j659J9975r924j7348J5404N485K3341
20579B6784J1980o539r448P013q311m630n907j0866J5110j6602r039k1399q556
20566d0410M801j5628J4536j2570L421K5437J8486r654J1225R873l3932j1246
20554c5661L3368K6459q464j6381k921N753o503O3k360r048p296q953j0470K8891
20540a3523L6134J432j3806m3458k450j2782K6371l234k2552j6280P561M517N770
20527d6300L1182m919O770m840J5642K2292M804p225j8067Q337J9763l4061r998
20514a6620M811R223j3254L4237K3374j9177k2210k8824P293O628O829J2079M991
20501I380l3373q901L2314Q284l3513Q43J0571R358j567k1801k2289j513J0827
$$ plain form
20488 -41380 -15969 -18271 -25604 7496 753 2890 4114 5867 16745 4132 10547 11789 617
20475 617 10979 23940 8095 -10830 -21759 -11982 -22272 -13555 -33131 -34137 -30959 -29823 -37228
20462 -37228 -49486 -44674 -34313 -5392 41285 37334 27317 39872 17592 26398 38990 25080
20450 25080 8875 20426 11346 23025 25814 748 -21272 -41221 -27381 3990 -5558 -14207
20438 -14207 -8599 -18231 -11284 -32491 -36574 6480 9882 -7023 -40617 -33574 -15164 -4360 -4033
20425 -4033 -10406 -14485 -9062 4227 -13208 -8358 18158 -8895 -8868 -11825 -17741 -23355 -13946 -8316
20411 -8316 1927 -11243 -44401 -35900 11957 33252 24132 -13364 -30321 -22458 -18053 -9381 13976
20398 13976 7667 5454 -1724 4017 44165 30513 20351 3937 6717 -4703 -13227 -13038 -2584
$$ packed form
20488d1380K5411k302p333L3100o743K137J224J753J0878j2613O415J242j1172
20475F17J0362J2961j5845j8925j0929R777j0290Q717j9576j006L178J136p405
20462c7228j2258M812J0361K8921M6677l951j0017J2555k2280Q806J2592j3910
20450B5080j6205J1551r080J1679K789k5066k2020j9949J3840L1371r548q649
20438a4207N608r632O947k1207m083M3054L402j6905l3594P043J8410J0804L27
20425d033o373m079N423J3289j7435M850K6516k7053K7k957n916n614R409N630
20411h316J0243j3170l3158Q501M7857K1295r120l7496j6957P863M405Q672K3357
20398A3976o309k213p178N741M0148j3652j0162j6414K780j1420q524J89J0454
$$ plain form
20385 -2584 14 -17089 9125 27607 20292 17076 8891 -20069 -22532 -33474 -30995 -7983 15693
20372 15693 19599 3937 -16672 -21105 -32803 -32322 -25798 -26445 -29766 -36068 -50026 -62018 -49610
20359 -49610 -41903 -48141 -49690 -28115 -25668 -8346 -14478 19603 49669 41535 37591 26818 23981
20346 23981 16832 1736 2145 -34043 -42841 -515 23375 28125 -9045 -31602 -27015 -30010 -18951
20333 -18951 -17848 12073 22573 15893 27557 6314 -8405 7394 -6836 -989 -22854 -42060
20321 -42060 -53023 -38826 -27507 -6083 -9505 -14430 8739 5096 -9005 -4714 -2278 4351 914
20308 914 -9055 -9990 -8077 -10389 -10439 -22092 -24277 2159 -6524 -28053 -10342 12218 29556 26179
20294 26179 24528 18160 32412 18402 -7346 2255 20356 50069 22118 1604 -2527 -4635 -23918
$$ packed form
20385b584K598j7103K6214J8482p315l216q185k8960k463j0942K479K3012K3676
20372A5693L906j5662k0609m433j1698M81O524o47l321o302j3958j1992J2408
20359d9610P707o238j549K1575K447J7322o132L4081L0066q134l944j0773k837
20346B3981p149j5096M09l6188q798M2326K3890M750l7170k2557M587k995J1059
20333a8951J103K9921J0500o680J1664k1243j4719J5799j4230N847k1865j9206
20321d2060j0963J4197J1319K1424l422m925K3169l643j4101M291K436O629l437
20308I14r969r35J913k312n0j1653k185K6436q683k1529J7711K2560J7338l377
20294B6179j651o368J4252j4010k5748R601J8101K9713k7951k0514m131k108j9283
$$ plain form
20281 -23918 -35810 -22724 -14155 -7586 -3558 19231 61706 64085 43177 46181 29288 32382 16951
20268 16951 21056 17001 24986 30833 22971 2107 12462 44697 43371 49644 32425 18608 -3169
20255 -3169 10264 14152 5339 -7359 16908 19913 -1270 -31370 -35514 -26932 -22028 -926 -13443
20242 -13443 8148 15377 381 8103 761 -5158 -15417 -1141 16217 24817 39069 48982 27363
20229 27363 41469 49919 39515 11509 5443 8050 10261 24423 17400 4896 -2555 -3475 12233
20216 12233 16108 9263 11692 9006 -3161 -2443 -23255 -27728 -3396 24471 42375 34643 21252
20203 21252 -7792 -5888 11159 41484 43279 -8192 -33264 -20385 -33251 -34869 -45822 -27125
20191 -27125 -9513 -10618 -10176 -12086 -22382 -33716 -39702 -8619 -2020 7304 7647 -7346 -14335 -21941
$$ packed form
20281b3918j1892J3086Q569O569M028K2789M2475K379k0908L004j6893L094j5431
20268A6951M105m055P985N847p862k0864J0355L2235j326O273j7219j3817k1777
20255c169J3433L888q813j2698K4267L005k1183l0100m144Q582M904K1102j2517
20242a3443K1591P229j4996P722p342n919j0259J4276J7358Q600J4252R913k1619
20229B7363J4106Q450j0404k8006o066K607K211J4162p023j2504p451r20J5708
20216A2233L875o845K429k686j2167P18k0812m473K4332K7867J7904p732j3391
20203B1252k9044J904J7047L0325J795n1471k5072J2879j2866j618j0953J8697
20191b7125J7612j105M42j910j0296j1334n986L1083O599R324L43j4993o989p606
$$ plain form
20177 -21941 -7097 -17681 -34891 -44630 -25476 251 2871 -1544 6696 -8262 2885 -11823
20165 -11823 -5158 20944 26600 5525 16258 27434 14051 34409 54020 23790 -16442 -14987
20153 -14987 9817 8242 18637 26906 23323 11977 -14915 -19842 -15475 -594 1406 3682 4859
20140 4859 -7901 -8583 -13327 5490 34125 31919 40204 43964 28615 -9889 -27631 -70316 -86136
20127 -86136 -95572 -47412 2069 14580 -2537 7657 9143 25882 3538 -32407 -28145 -22066
20115 -22066 -35475 -42864 -42873 -30263 -16855 -21560 -44793 -53173 -50659 -49774 -50560 -20757 13443 29599
20101 29599 8466 -9210 -546 12658 23667 17456 33037 52604 41351 4456 -20208 11782
20089 11782 40573 35071 19902 10481 5293 16348 22670 15274 -7838 -4940 18405 38058 45073
$$ packed form
20177b1941J4844j0584j7210r739J9154K5727K620m415Q240j4958J1147j4708
20165a1823O665K6102N656k1075J0733J1176j3383K0358J9611l0230m0232J455
20153a4987K4804j575J0395Q269l583j1346k6892m927M367J4881K000K276J177
20140D859j2760o82m744J8817K8635k206Q285L760j5349l8504j7742m2685j5820
20127h6136r436M8160M9481J2511j7117J0194J486J6739k2344l5945M262O079
20115b2066j3409p389rJ2610J3408m705k3233q380K514Q85p86K9803L4200J6156
20101B9599k1133j7676Q664J3204J1009o211J5581J9567j1253l6895k4664L1990
20089A1782K8791n502j5169r421n188J1055O322p396k3112K898K3345J9653P015
$$ plain form
20076 45073 50155 51023 41669 13422 -12013 -13118 -20441 -10506 -33626 -34567 -25934 -22179 4801 2893
20062 2893 -9009 14446 4414 12308 16255 13397 25403 20002 31992 -12903 -28264 -13040 12768
20049 12768 29632 45922 27597 36068 16098 -11219 -22460 -18880 -23480 -22266 -5112 7966
20037 7966 -3578 -5366 4221 -7726 1359 -1233 -909 3084 5519 35065 47573 54717 52411 52641
20023 52641 52917 57089 39883 25142 12921 9402 -19877 -38748 -15537 -11296 -5859 -7327 -20322
20010 -20322 -24129 -21597 19955 42522 38643 49486 39108 45325 35320 14629 5668 -13731 -36585
19997 -36585 -50045 -55966 -37765 -37411 -29376 -31858 -18382 -355 -23533 -42803 -50823 -42432 -41662
19984 -41662 -17155 -31976 -21603 2304 26886 5569 -11396 -12743 -41477 -45874 -20614 -3108
$$ packed form
20076D5073N082Q68r354k8247k5435j105p323R935k3120r41Q633L755K6980j908
20062B893j1902K3455j0032P894L947k858J2006n401J1990m4895j5361J5224K5808
20049A2768J6864J6290j8325Q471j9970k7317j1241L580m600J214J7154J3078
20037G966j1544j788R587j1947R085k592L24L993K435K9546J2508P144k306K30
20023E2641K76M172j7206j4741j2221l519k9279j8871K3211M241N437j468j2995
20010b0322l807K532M1552K2567l879J0843j0378O217j0005k0691q961j9399k2854
19997c6585j3460n921J8201L54Q035k482J3476J8027k3178j9270q020Q391P70
19984d1662K4507j4821J0373K3907K4582k1317j6965j347k8734m397K5260J7506
$$ plain form
19972 -3108 -13092 -17517 -29831 -21027 -23669 -12885 -1449 87 -4283 -10862 9902 23410 1435
19959 1435 -16262 -28859 -47058 -45104 -29427 -33272 -22236 -9835 -1511 -8012 -8747 5522 32010
19946 32010 38030 37077 19369 2813 -12269 -4530 -7076 -7857 -13879 -10226 -13169 -44941 -36866 -26663
19932 -26663 -12761 -7267 -9821 -2049 -14339 -6339 -16482 -12861 -9226 14270 14288 -6145 8492
19919 8492 -12208 -10933 -2448 11974 -14539 -17769 -6043 -7132 -4416 746 -6506 -25678 -31081
19906 -31081 -25646 -15518 -8010 3693 11311 -7317 9861 13254 -13540 -40273 -28745 -23821 -22763
19893 -22763 -41905 -64110 -49265 -29440 -33710 -21178 1026 10259 -16937 -49444 -66992 -80686
19881 -80686 -87363 -45695 -32259 -2187 -10208 -7646 3952 11985 -902 4253 11098 -13724 -31571
$$ packed form
19972c108r984m425j2314Q804k642J0784J1436J536m370o579K0764J3508k1975
19959A435j7697j2597j8199J954J5677l845J1036J2401Q324o501p35J4269K6488
19946C2010O020r53j7708j6556j5082P739k546p81o022L653k943l1772Q075J0203
19932b6663J3902N494k554P772j2290Q000j0143L621L635K3496J8k0433J4637
19919H492k0700J275Q485J4422k6513l230J1726j089K716N162p252j9172n403
19906c1081N435J0128P508J1703P618j8628J7178L393k6794k6733J1528M924J058
19893b2763j9142k2205J4845J9825m270J2532K2204R233k7196l2507j7548j3694
19881h0686o677M1668J3436L0072q021K562J1598Q033j2887N155O845k4822j7847
$$ plain form
19868 -31571 -35702 -57080 -64301 -41695 -33091 -27766 -26964 -11487 14785 26746 27676 4264 -12473
19855 -12473 -20062 -31018 -14197 -8495 11047 33963 10286 -16135 6749 21230 21306 17144 22053
19842 22053 20345 20452 9303 -2291 -9854 -10687 -17772 -8574 -3892 -9687 -4418 6508 186 -3125
19828 -3125 6644 -1383 -11231 -17526 -958 16518 -10667 -24114 -18595 -33398 -61892 -35457 -6243
19815 -6243 -14932 -3446 10670 -9606 -15525 -10623 10455 529 20093 24056 18274 37908 71524
19802 71524 78069 60927 41235 11189 -9328 18250 40403 58459 29996 -20665 -28532 -31518
19790 -31518 -36655 -24122 -12829 -18809 -28468 -33186 -16363 -3455 -25708 -39989 -18517 3452
19778 3452 -564 -2517 9376 7723 -5083 -9472 -11074 -7017 -2857 985 21033 23761 -4014 -20381
$$ packed form
19868c1571m131k1378p221K2606Q604N325Q02J5477K6272J1961R30k3412j6737
19855a2473p589j0956J6821N702J9542K2916k3677k6421K2884J4481P6m162M909
19842B2053j708J07j1149j1594p563q33p085R198M682n795N269J0926o322l311
19828c125R769q027r848o295J6568J7476k7185j3447N519j4803k8494K6435K9214
19815f243q689J1486J4116k0276n919M902K1078r926J9564L963n782J9634L3616
19802G1524O545j7142j9692l0046k0517K7578K2153J8056k8463n0661p867k986
19790c1518n137J2533J1293n980r659m718J6823J2908k2253j4281K1472K1969
19778C452m016j953J1893j653j2806m389j602M057M160L842K0048K728k7775j6367
$$ plain form
19764 -20381 -14423 -6936 -24006 851 31104 6833 21565 26650 31944 23023 35337 37317 5674
19751 5674 -3537 10994 15923 -5572 -28304 -36214 -14090 -14952 -30134 -35260 -17439 -4096 -2707
19738 -2707 17915 31731 35971 32907 10814 2638 -16648 -33507 -5211 2091 -4883 -32455 -36090
19725 -36090 -16446 9149 24666 11579 -4749 26473 25371 28452 32315 24813 22797 19112 19060
19712 19060 30636 31162 21551 -23254 -19319 1203 6964 -6195 -13101 -29069 -42171 -42427 8003
19699 8003 12129 18896 30213 6042 -22584 -45948 -52582 -34875 -19709 -31777 -9214 -5255 -15915
19686 -15915 -5245 -23123 -33593 -24483 -5879 -49 -12412 -29959 -31621 -13931 2810 -2868
19674 -2868 -3408 5166 10078 -2440 -20621 -10625 -13712 -8204 14425 42018 54891 39109 11537
$$ packed form
19764b0381N958P487j7070K4857L0253k4271J4732N085N294q921J2314J980l1643
19751E674r211J4531M929k1495k2732p910K2124q62j5182n126J7821J3343J389
19738b707K0622J3816M240l064k2093q176j9286j6859K8296P302o974k7572l635
19725c6090J9644K5595J5517j3087j6328L1222j102L081L863p502k016l685n2
19712A9060J1576N26r611m4805L935K0522N761j3159o906j5968j3102k56N0430
19699H003M126O767J1317k4171k8626k3364o634J7707J5166j2068K2563L959j0660
19686a5915J0670j7878j0470R110J8604N830j2363j7547j662J7690J6741n678
19674b868n40Q574M912j2518j8181R996l087N508K2629K7593J2873j5782k7572
$$ plain form
19661 11537 6522 10566 -6746 18722 22117 28039 27707 -6884 -8618 -10742 12651 17217 -10457
19648 -10457 -42592 -63553 -41846 -19020 9449 40298 27130 -7454 3486 35503 28040 3312
19636 3312 12979 38572 18732 10472 -6739 10081 21806 14193 7686 11802 12759 4989 -5820
19623 -5820 -5085 -16642 -38686 -35228 -38826 -66495 -44151 -23012 -17033 -26722 -23358 8784 -734
19610 -734 -19972 -44075 -50669 -3859 -5222 -40501 -28690 -13740 3602 4120 18120 22185 12994
19597 12994 10228 16277 29796 59585 44641 28203 -9802 -25007 -11484 6783 -21613 -18155
19585 -18155 -16474 -15695 -16052 -30625 -29418 -44529 -57033 -17469 -603 -13273 -21468 -407 -8120
19572 -8120 -15859 -15013 24956 23994 17714 -4426 -20867 -21231 -11479 -17180 -13083 -6237 5605 -16032
$$ packed form
19661A1537n015M044j7312K5468L395N922l32l4591j734k124K3393M566k7674
19648a0457l2135k0961K1707K2826K8469L0849j3168l4584J0940L2017p463k4728
19636C312R667K5593j9840q260j7211J6820J1725p613o507M116R57p770j0809
19623e820P35j1557k2044L458l598k7669K2344K1139N979r689L364L2142r518
19610g34j9238k4103o594M6810j363l5279J1811J4950J7342N18J4000M065r191
19597A2994k766O049J3519K9789j4944j6438l8005j5205J3523J8267k8396L458
19585a8155J681P79l57j4573J207j5111j2504L9564J6866j2670q195K1061p713
19572h120p739Q46L9969r62o280k2140j6441l64R752n701M097O846J1842k1637
$$ plain form
19558 -16032 -24263 -21629 919 -10631 -46750 -66281 -67004 -60959 -35891 -34797 -52882 -40408 -41473
19545 -41473 -38786 -43629 -69432 -73188 -54458 -31568 -15592 -29720 -15972 -10201 -8119 -921 17831
19532 17831 18467 2096 27792 43493 6029 -15222 -16525 1467 15267 17291 -4957 -37449
19520 -37449 -19587 2359 13075 9370 14794 33355 48639 33840 15323 15039 -4374 -18094
19508 -18094 -258 15846 10483 -9489 -17017 -35223 -34236 -21367 -10807 -12283 -43434 -60059 -83304
19495 -83304 -60182 -43345 -15345 20048 56063 58366 47165 11433 -1905 -11394 -14066 -34745
19483 -34745 -22720 -33943 -28932 -25018 -10857 -5408 988 22649 23682 -3353 18777 28563 29263
19470 29263 14276 -17368 13445 59574 44581 29125 17560 26752 15921 -133 -20622 -11611
$$ packed form
19558a6032q231K634K2548j1550l6119j9531p23O045K5068J094j8085J2474j065
19545d1473K687m843k5803l756J8730K2890J5976j4128J3748N771K082P198J8752
19532A7831O36j6371K5696J5701l7464k1251j303J7992J3800K024k2248l2492
19520c7449J7862K1946J0716l705N424J8561J5284j4799j8517k84j9413j3720
19508a8094J7836J6104n363j9972p528j8206R87J2869J0560j476l1151j6625k3245
19495h3304K3122J6837K8000L5393L6015K303j1201l5732j3338r489k672k0679
19483c4745J2025j1223N011L914J4161N449O396K1661J033k7035K2130R786P00
19470B9263j4987l1644L0813M6129j4993j5456j1565R192j0831j6054k0489R011
$$ plain form
19458 -11611 11372 43393 33596 26737 20675 20513 3396 -21153 -12170 11801 20386 -5233 -3938
19445 -3938 -5625 -17644 -22125 -48816 -36021 -10698 -11935 165 -21403 -15913 -24991 -49414 -49135
19432 -49135 -23070 -29114 -41205 -35973 -27817 -50197 -34755 411 26296 5986 15951 17399 13003
19419 13003 -1146 -9118 -10584 -20336 -7767 -11986 7757 6808 -883 -217 22470 6932 -37648
19406 -37648 -21101 -3498 3638 14327 -28133 -40423 -28498 -7063 -23559 19649 47918 17109
19394 17109 22590 22353 24553 10508 -2615 -11389 -26979 -39303 -27038 -19815 -45200 -20767 19540
19381 19540 27620 3448 -4231 -24202 -24390 -30351 -1121 24014 12704 25584 17898 6278 -16901
19368 -16901 -17849 -14486 -6179 -8651 1299 13815 -262 9394 17411 17083 -941 -31142 -6513 6935
$$ packed form
19458a1611K2983L2021r797o859o062j62j7117k4549Q983K3971Q585k5619J295
19445c938j687j2019m481k6691J2795K5323j237J2100k1568N490r078k4423K79
19432d9135K6065o044j2091N232Q156k2380J5442L5166K5885k0310R965J448m396
19419A3003j4149p972j466r752J2569m219J9743r49p691O66K2687j5538m4580
19406c7648J6547J7603P136J0689m2460j2290J1925K1435j6496M3208K8269l0809
19394A7109N481k37K200j4045j3123q774j5590j2324J2265P223k5385K4433M0307
19381A9540Q080k4172p679j9971j88n961K9230K5135j1310J2880p686j1620k3179
19368a6901r48L363Q307k472R950J2516j4077R656Q017l28j8024l0201K4629J3448
$$ plain form
19354 6935 -529 6074 -1913 -9212 18143 19303 26930 25959 14204 -9346 -41784 -47173 -41878 -40990
19340 -40990 -39191 -31129 -29228 -29691 -10905 -9956 -27655 -19387 -20564 -31116 -27644 15591 55002 52700
19326 52700 30578 16905 -6335 -4387 14683 1282 -7370 17256 40675 18808 -14893 -15087
19314 -15087 14303 15313 22353 587 -28662 2501 10174 13707 13003 14521 9784 -9456 2794
19301 2794 4026 38877 44565 48058 43914 26675 25039 26675 22942 33992 39773 40464 46482 40168
19287 40168 35746 34182 28784 11381 2076 20238 38930 24900 784 -7876 4983 19415 8037
19274 8037 -13948 -37936 -57753 -59176 -40803 -7785 13055 46107 50440 60868 66391 54153
19262 54153 15922 5784 -7125 -18780 -28751 -4497 19387 17683 17755 27941 36173 52165 30317
$$ packed form
19354F935p464O603p987p299K7355J160P627r71j1755k3550l2438n389N295Q88
19340d0990J799Q062J901m63J8786R49j7699Q268j177j0552L472M3235L9411k302
19326E2700k2122j3673k3240J948J9070j3401q652K4626K3419k1867l3701j94
19314a5087K9390J010P040k1766k9249L1163P673L533p04J518m737j9240J2250
19301B794J232L4851N688L493m144j7239j636J636l733J1050N781O91O018o314
19287D0168m422j564n398j7403r305J8162J8692j4030k4116q660J2859J4432j1378
19274H037k1985k3988j9817j423J8373L3018K0840L3052M333J0428N523j2238
19262E4153l8231j0138j2909j1655r971K4254K3884j704P2J0186Q232J5992k1848
$$ plain form
19249 30317 4414 6555 8027 -12748 -12931 -11182 3521 16519 16806 29650 40095 36146 42491
19236 42491 45830 46363 53083 52254 20542 -14523 8808 -2093 -15216 2768 14686 31623 45637
19223 45637 49124 8092 -13086 -9142 -27006 -26150 -14971 -23876 -56861 -53557 -53038 -35741 6736
19210 6736 -12911 -23718 -36526 -61576 -41766 -13058 -2004 14136 17676 1134 -22426 -35822
19198 -35822 -49682 -55494 -47506 -3661 2181 22431 3814 -7049 -2645 4910 15499 28665 7577
19185 7577 -4692 -5284 -13647 -9525 4174 14547 -5146 -9672 -40664 -44765 -34916 -18255 -8123
19172 -8123 -6809 3316 4534 6515 7090 2605 -7205 9148 2657 -10491 -19237 -31828 -24162 -26454
19158 -26454 -42105 -55252 -31105 -16301 8952 -94 6112 17084 -13197 -37076 -26779 -1814
$$ packed form
19249C0317k5903K141J472k0775j83J749J4703J2998K87J2844J0445l949O345
19236D2491L339N33O720q29l1712l5065K3331j0901j3123J7984J1918J6937J4014
19223D5637L487m1032k1178L944j7864Q56J1179q905l2985L304N19J7297M2477
19210F736j9647j0807j2808k5050J9810K8708J1054J6140L540j6542k3560j3396
19198c5822j3860n812P988M3845N842K0250j8617j0863M404P555J0589J3166k1088
19185G577j2269n92q363M122J3699J0373j9693m526l0992m101R849J6661J0132
19172h123J314J0125J218J981N75m485r810J6353o491j3148q746j2591P666k292
19158b6454j5651j3147K4147J4804K5253r046O206J0972l0281k3879J0297K4965
$$ plain form
19146 -1814 5391 -1304 -11365 -19678 -7995 -7089 -9411 -35678 -47926 -58320 -38298 1507 6892
19133 6892 -23341 -20651 -6879 -14838 -14127 -10747 24418 54444 58411 37753 -7310 -15483 1193
19120 1193 33352 25939 10564 -16322 -25593 -40737 -35831 -31133 -24601 -20536 -36781 -48543 -63173
19107 -63173 -26656 14708 20181 16627 4354 -48130 -71077 -65364 -62670 -68291 -55340 -23499 -12866
19094 -12866 -589 15058 4516 19653 31939 36894 40956 34722 31425 6448 -7505 -15260 -14739
19081 -14739 -8755 6518 5325 -17406 -9489 19045 11587 -18265 -13427 -8180 -22606 -3382 8089
19068 8089 -3935 -20199 -31583 -23163 3460 18049 18248 7702 8944 3433 18674 41013 53955
19055 53955 55942 43759 41545 42270 25678 -4824 -5775 -8498 -15017 8882 9183 3804 -8798 -11162
$$ packed form
19146a814P205o695j0061q313J1683R06k322k6267j2248j0394K0022L9805N385
19133F892l0233K690J3772p959P11L380L5165L0026L967k0658m5063q173J6676
19120A193L2159p413j5375k6886r271j5144M906M698O532M065j6245j1762j4630
19107f3173L6517M1364N473l554j2273n2484k2947N713K694n621J2951L1841J0633
19094a2866J2277J5647j0542J5137J2286M955M062o234l297k4977j3953p755N21
19081a4739N984J5273j193k2731P917K8534p458k9852M838N247j4426J9224J1471
19068H089j2024j6264j1384Q420K6623J4589J99j0546J242n511J5241K2339J2942
19055E3955J987j2183k214P25j6592l0502r51k723o519K3899L01n379j2602k364
$$ plain form
19041 -11162 -58121 -53730 -13600 -11136 -24813 -45817 -38000 -7695 6284 30336 35266 28642 -8607
19028 -8607 -33187 -22780 -10248 -11308 -10534 22253 19605 24166 10529 -1535 -11615 -12646 -22729
19015 -22729 -29106 -25591 -23647 -26992 -26116 6433 12034 10158 195 -15177 -23081 -27471 -11974 160
19001 160 -5248 -1772 14171 25685 9552 -6941 7064 7950 15550 11443 15007 -859 -2432 21226
18987 21226 39851 28401 10341 10650 -5612 -1200 11193 -98 -11296 4901 27599 13730
18975 13730 -18263 -27156 -24751 -50432 -66211 -55358 -44867 -33347 9662 46505 48537 24797
18963 24797 14971 30952 44559 75776 70011 39651 12899 19126 38918 39952 30479 27061 12034
18950 12034 -594 -8563 -9958 -5101 6599 23293 13572 10961 25641 30067 24334 6377 4235
$$ packed form
19041a1162m6959M391M0130K464j3677k1004P817L0305J3979K4052M930o624l7249
19028h607k4580J0407J2532j060P74L2787k648M561j3637j2064j0080j031j0083
19015b2729o377L515J944l345Q76L2549N601j876r963j5372p904m390J5497J2134
19001A60n408L476J5943J1514j6133j6493J4005Q86P600m107L564j5866j573K3658
18987B1226J8625j1450j8060L09j6262M412J2393j1291j1198J6197K2698j3869
18975A3730l1993q893K405k5681j5779J0853J0491J1520M3009L6843K032k3740
18963B4797r826J5981J3607L1217n765l0360k6752O227J9792J034r473l418j5027
18950A2034j2628p969j395M857J1700J6694r721k611J4680M426n733j7957k142
$$ plain form
18937 4235 15857 42536 66684 64342 48057 43702 64724 39497 16763 14108 3473 8585 6465
18924 6465 -868 2058 26438 38549 25354 12880 28199 55762 81265 76203 52565 25620
18912 25620 31918 63369 70914 55299 35267 39346 37388 45457 67026 69917 80761 74586 40119
18899 40119 17937 -8807 -14075 5010 14095 34458 84818 88882 85048 79469 76093 84365 88275
18886 88275 116235 167787 236501 367857 508633 611539 602294 515052 414272 320567 267099
18875 267099 280867 323676 427985 599517 622522 474800 287832 175607 148540 102388
18865 102388 82008 73317 76038 81247 82794 91298 83760 85754 105888 148033 175516 207840 301077
18852 301077 447512 596434 665406 598624 456831 344804 312904 311927 333369 432725 561129
$$ packed form
18937D235J1622K6679K4148k342j6285m355K1022k5227k2734k655j0635N112k120
18924F465p333K926K4380J2111j3195j2474J5319K7563K5503n062k3638k6945
18912B5620O298L1451P545j5615k0032M079j958Q069K1569K891J0844o175l4467
18899D0119k2182k6744n268J9085R085K0363N0360M064l834n579l376Q272L910
18886H8275K7960N1552O8714J31356J40776J02906r245q7242j00780r3705n3468
18875B67099J3768M2809J04309J71532K3005j47722j86968j12225k7067m6152
18865A02388k0380q691K721N209J547Q504p538J994K0134M2145K7483L2324R3237
18852C01077J46435J48922O8972o6782j41793j12027l1900r77K1442R9356J28404
$$ plain form
18841 561129 651549 611638 456911 297500 196297 163386 117472 111186 93406 55074 33308
18830 33308 48626 63409 61069 66761 65359 47513 43840 48602 35180 40914 44660 60136 50100
18817 50100 24586 29786 55613 70155 62726 51177 37818 -30 -12911 -505 21364 20378
18805 20378 20228 17170 11448 17355 51970 73938 78555 82789 89058 67868 46004 21518 14729
18792 14729 -4277 -7604 2481 28530 26701 7077 -16538 11244 30264 54838 48646 25984
18780 25984 15287 20033 35166 46130 53924 66745 124247 149204 160608 161477 160129 206992 249915
18767 249915 264914 326105 317572 251310 159135 113569 71616 48527 45947 29396 10325 22958
18755 22958 41176 4407 -15778 -712 27608 20670 3498 -5729 -42341 -60346 -18724 27112
$$ packed form
18841E61129R0420l9911j54727j59411j01203l2911m5914o286j7780l8332k1766
18830C3308J5318J4783k340N692j402j7846l673M762j3422N734L746J5476j0036
18817E0100k5514N200K5827J4542p429j1549j3359l7848j2881J2406K1869r86
18805B0378j50l058n722N907L4615K1968M617M234O269k1190k1864k4486o789
18792A4729j9006l327J0085K6049j829j9624k3615K7782J9020K4574o192k2662
18780B5984j0697M746J5133J0964P794J2821N7502K4957J1404Q69j348M6863M2923
18767B49915J4999O1191q533o6262r2175m5566m1953k3089k580j6551j9071J2633
18755B2958J8218l6769k0185J5066K8320o938j7172r227l6612j8005M1622M5836
$$ plain form
18743 27112 40038 36304 52195 86714 60794 46150 42848 27935 4286 18632 15171 14826 17791
18730 17791 20392 28216 27968 16740 45036 74799 52558 33421 36804 15815 -1513 28338 15499
18717 15499 -12229 -2450 12083 43401 53768 57792 71218 52832 30466 30896 29547 35267 33725
18704 33725 37589 28792 34670 51806 49301 59684 49189 34578 38766 54266 34429 47176 50489
18691 50489 42003 42096 24714 24273 39910 42893 36198 31052 38270 14720 -882 10044 13222 14307
18677 14307 5895 4841 2872 -21507 -34618 -14524 -10193 22211 42536 54892 50140 23821 30106
18664 30106 29785 35862 48507 51059 54021 65243 77366 77632 64912 45846 28946 16900 1520
18651 1520 11442 31912 51450 66078 67500 72333 48929 45518 64479 36216 7994 11150 29734
$$ packed form
18743B7112J2926l734J5891L4519k5920j4644l302j4913k3649J4346l461l45K965
18730A7791K601P824k48j1228K8296K9763k2241j9137L383k0989j7328K9851j2839
18717A5499k7728R779J4533L1318J0367M024J3426j8386k2366M30j349N720j542
18704C3725L864q797N878J7136k505J0383j0495j4611M188J5500j9837J2747L313
18691E0489q486R3j7382m41J5637K983o695n146P218k3550j5602J0926L178J085
18677A4307q412j054j969k4379j3111K0094M331L2404K0325J2356m752k6319O285
18664C0106l21O077J2645K552K962J1222J2123K66j2720j9066j6900j2046j5380
18651A520R922K0470J9538J4628J422M833k3404l411J8961k8263k8222L156J8584
$$ plain form
18638 29734 21069 16416 16651 46232 74056 90175 89667 49982 21878 43791 63270 58110 56903
18625 56903 46277 43243 53404 52086 40984 846 1863 1266 32105 76353 90697 91487 112815
18612 112815 125480 127351 76916 77310 74625 59356 38951 40504 46356 44144 39847 68588 97914
18599 97914 102538 87966 68815 52808 58440 57664 27475 11064 44517 65862 57545 23921 34233
18586 34233 54730 75137 81343 66047 39025 23506 27176 21655 11398 -671 33671 30666
18574 30666 19196 27069 29064 42557 66435 77029 52636 32979 59674 63102 67339 68726 67694
18561 67694 61024 68880 70881 71384 75615 67608 60101 59635 62978 63276 79108 106260 113418 124633
18547 124633 138453 127023 93732 62257 22156 11369 53485 86209 91641 115409 126521 133890
$$ packed form
18638B9734q665m653K35K9581K7824J6119n08l9685k8104K1913J9479n160j207
18625E6903j0626l034J0161j318j1102m0138J017n97L0839M4248J4344P90K1328
18612A12815J2665J871n0435L94k685j5269k0405J553N852k212m297K8741K9326
18599I7914M624j4572j9151j6007N632p76l0189j6411L3453K1345q317l3624J0312
18586C4233K0497K0407O206j5296k7022j5519L670n521j0257j2069L4342l005
18574C0666j1470P873J995J3493K3878J0594k4393j9657K6695L428M237J387j032
18561F7694o670P856K001N03M231q007p507m66L343K98J5832K7152P158J1215
18547A24633J3820j1430l3291l1475m0101j0787M2116L2724N432K3768J1112P369
$$ plain form
18535 133890 133356 122623 110216 114065 94233 75999 75591 71291 73412 88110 87684 107899 106547
18522 106547 106799 108501 135228 140603 142516 121226 107129 113026 118139 96816 70354 99351 137610
18509 137610 142584 148336 142903 150901 162949 137038 96988 106893 115089 92592 88448 93729 112467
18496 112467 123817 114386 112499 108117 77675 54975 55019 44183 38928 52533 53287 39141 61326
18483 61326 67901 56349 61240 67716 77024 57437 42897 36343 37907 44302 61481 80661 85276
18470 85276 81269 66191 92948 134755 161969 148096 145328 126725 101595 129126 122976 76279
18458 76279 47459 70431 82130 98087 116897 123483 159329 179628 171567 139017 120073 91597
18446 91597 56762 69356 87351 88789 109505 148648 217876 255222 251076 223094 178469 141951
$$ packed form
18535A33890n34j0733j2407L849j9832j8234m08m300K121J4698m26K0215j352
18522A06547K52J702K6727N375J913k1290j4097N897N113k1323k6462K8997L8259
18509A37610M974N752n433P998J2048k5911m0050R905Q196k2497m144N281J8738
18496A12467J1350r431j887m382l0442k2700M4j0836n255J3605P54j4146K2185
18483F1326O575j1552M891O476R308j9587j4540o554J564O395J7179J9180M615
18470H5276m007j5078K6757M1807K7214j3873k768j8603k5130K7531o150m6697
18458G6279k8820K2972J1699J5957J8810O586L5846K0299q061l2550j8944k8476
18446I1597l4835J2594J7995J438K0716L9143O9228L7346m146k7982m4625l6518
$$ plain form
18434 141951 123983 117838 138567 157598 193777 192420 187911 222048 234005 261221 297061 310516
18422 310516 305883 327321 325927 265491 206467 190512 184375 196829 210846 240023 282915 299725
18410 299725 335268 352940 334364 273977 214352 183103 182115 181829 178311 168793 179565 194727 186235
18397 186235 198127 222123 254202 278047 294519 334829 351115 330659 288797 255537 262267 264666
18385 264666 256205 240739 261036 301478 349841 368833 319541 281996 262529 249337 206383 195586
18373 195586 202765 216420 233117 221460 214927 241623 268315 290644 331920 344764 361940 365191
18361 365191 385729 405581 383043 372260 404326 442350 465985 505540 569537 641352 712334
18350 712334 757547 848349 976272 1045738 990566 922864 897204 915484 1021132 1206926 1385439
$$ packed form
18434A41951j7968o145K0729J9031L6179j357m509L4137J1957K7216L5840J3455
18422C10516m633K1438j394o0436n9024j5955o137J2454J4017K9177M2892J6810
18410B99725L5543J7672j8576o0387n9625l1249r88k86l518r518J0772J5162q492
18397A86235J1892K3996L2079K3845J6472M0310J6286k0456m1862l3260O730K399
18385B64666q461j5466K0297M0442M8363J8992m9292l7545j9467j3192m2954j0797
18373A95586P179J3655J6697j1657o533K6696K6692K2329M1276J2844J7176L251
18361C65191K0538J9852k2538j0783L2066L8024K3635L9555O3997P1815P0982
18350G12334M5213R0802J27923O9466n5172o7702k5660J8280J05648J85794J78513
$$ plain form
18339 1385439 1396311 1225931 1044629 946267 939178 987145 1015190 1077467 1142243 1199647 1342533
18328 1342533 1569890 1911489 2380655 2970330 3386438 3441773 3282211 3102642 3014876 3120551
18318 3120551 3535586 4186350 4774953 5132806 5439930 6098025 7411278 8947410 9235691
18309 9235691 8184360 7101413 6839025 7183354 7609864 8025029 8766047 10177719 12444625
18300 12444625 15779502 20596366 27724651 38807351 56322802 81634706 105417708
18293 105417708 105049400 82066991 57060147 42086668 35479669 34072312 36859284 44874651
18285 44874651 60492246 85511494 109010717 104296036 76396567 49004798 32916087
18278 32916087 24385659 19701982 17236613 16187160 16208418 16966911 18309763 20518169
$$ packed form
18339A385439J0872j70380j81302r8362p089M7967K8045O2277O4776N7404J42886
18328A342533K27357L41599M69166N89675M16108N5335j59562j79569q7766J05675
18318C120551M15035O50764N88603L57853L07124O58095J313253J536132K88281
18309I235691j051331j082947k62388L44329M26510M15165P41018J411672K266906
18300A2444625L334877M816864P128285J1082700J7515451K5311904K3783002
18293A05417708l68308k2982409k5006844j4973479o606999j407357K786972Q015367
18285D4874651J5617595K5019248K3499223m714681k7899469k7391769j6088711
18278C2916087q530428m683677k465369j049453K1258P58493J342852K208406
$$ plain form
18270 20518169 24105232 29969387 39818771 55962347 79553563 104004996 109928191 91899976
18262 91899976 66524526 48650460 39985084 37840157 40847233 49574660 66042654 91998614
18254 91998614 119222554 121040103 93813407 60722971 38426310 25834311 18654995
18247 18654995 14372635 11646968 9736751 8314777 7320745 6734919 6657900 7044622 7919935
18238 7919935 9205809 10245237 10080352 8516077 6562494 5057807 4109529 3415992 2907754
18229 2907754 2539568 2262879 2115181 2061703 2061836 1921864 1670470 1408357 1242951 1146729
18219 1146729 1061650 992361 922683 855790 784930 719844 681723 663936 653454 661759 677063
18208 677063 639096 621868 587027 545389 552649 579302 600436 629819 675776 726299 705621 642035
$$ packed form
18270B0518169L587063N864155R849384J6143576K3591216K4451433N923195j8028215
18262I1899976k5375450j7874066q665376k144927L007076Q727427J6467994K5955960
18254I1998614K7223940J817549k7226696l3090436k2296661j2591999p179316
18247A8654995m282360k725667j910217j421974r94032n85826p7019L86722Q75313
18238G919935J285874J039428j64885j564275j953583j504687r48278o93537n08238
18229B907754l68186k76689j47698n3478J33j39972k51394k62113j65406r6222
18219A146729q5079o9289o9678o6893p0860o5086l8121j7787j0482Q305J5304
18208F77063l7967j7228l4841m1638P260K6653K1134K9383M5957N0523k0678o3586
$$ plain form
18196 642035 560459 499990 510895 533819 561295 591604 608467 563391 499018 482769 472255
18185 472255 430315 429801 425212 411985 394664 414173 443483 459127 419794 400348 401215 433746
18173 433746 469326 471795 446211 434309 421623 427291 424460 475333 543786 535596 473973 447103
18161 447103 457171 469013 536025 582945 553046 466717 386318 368595 343222 338951 385414 409885
18149 409885 431767 433316 437148 463393 441810 422421 435511 453416 459270 455813 463568 475027
18137 475027 489713 528574 561124 575818 627098 735713 827634 913987 978621 1052381 1216657
18126 1216657 1528432 1978585 2380316 2420593 2205398 2079929 2201980 2476604 2897038 3562277
18116 3562277 4510795 5763608 7010395 8412757 10551496 14286973 20984146 32591418
$$ packed form
18196F42035q1576o0469J0905K2924K7476L0309J6863m5076o4373j6249j0514
18185D72255m1940n14m589j3227j7321J9509K9310J5644l9333j9446Q67L2531
18173D33746L5580K469k5584j1902j2686N668k831N0873O8453q190o1623k6870
18161D47103J0068J1842O7012M6920k9899q6329q0399j7723k5373m271M6463K4471
18149D09885K1882J549L832K6245k1583j9389J3090J7905N854l457P755J1459
18137D75027J4686L8861L2550J4694N1280J08615R1921Q6353O4634P3760J64276
18126A216657L11775M50153M01731M0277k15195j25469J22051K74624M20434O65239
18116C562277R48518J252813J246787J402362K138739L735477O697173J1607272
$$ plain form
18108 32591418 50298821 62847458 54767515 36008398 21224860 13317081 9076370
18101 9076370 6621457 5085280 4114394 3605506 3418470 3296475 2937825 2491068 2150908
18092 2150908 1908813 1616094 1307632 1065904 910564 806195 750598 695704 662652 599511
18082 599511 546414 509813 497799 542276 542429 532698 552233 623665 668253 732848 842743 894887
18070 894887 800143 665074 569790 513380 509793 567839 632175 784569 953990 1006958 928507
18059 928507 816031 738584 669955 589961 514534 468727 456303 451429 440845 399080 360001
18048 360001 348587 352549 335279 310634 296622 295589 299557 280372 240869 202509 201700 215391
18036 215391 228002 240553 241350 250601 282605 301923 301337 305789 307497 287246 265385 215659 195315
$$ packed form
18108C2591418J7707403J2548637q079943j8759117j4783538p907779m240711
18101I076370k454913j536177r70886n08888j87036j21995l58650m46757l40160
18092B150908k42095k92719l08462k41728j55340j04369n5597n4894l3052o3141
18082E99511n3097l6601j2014M4477J53r731J9535P1432M4588O4595J09895N2144
18070H94887r4744j35069r5284n6410l587N8046O4336J52394J69421N2968p8451
18059I28507j12476p7447o8629p9994p5427m5807j2424m874j0584m1765l9079
18048C60001j1414L962j7270k4645j4012j033L968j9185l9503l8360q09J3691
18036B15391J2611J2551P97R251L2004J9318n86M452J708k0251k1861m9726k0344
$$ plain form
18023 195315 203337 185033 167175 179857 211966 250201 272507 261310 225894 201670 244086 233748
18011 233748 227050 228671 246480 270492 289335 308336 311150 335124 315612 270669 228554 203909
17999 203909 228574 263686 313585 347824 362811 432220 499891 492694 447452 416421 445536 451915
17987 451915 462896 470826 459159 422290 418724 417362 392182 349119 318426 313792 294879 285216
17975 285216 325197 320727 258430 240315 267911 279201 281387 245815 234472 241564 228879 236786
17963 236786 263165 290295 289998 292045 309399 335212 383284 434275 475044 544562 596419 610626
17951 610626 604629 565478 526297 542326 569794 617884 652037 658742 640544 642778 625513 666250
17939 666250 733357 765575 798999 860565 910983 882609 857373 901852 966876 933740 791705
$$ packed form
18023A95315Q022j8304j7858J2682L2109L8235K2306j1197l5416k4224M2416j0338
18011B33748o698J621J7809K4012J8843J9001K814K3974j9512m4943m2115k4645
17999B03909K4665L5112M9899L4239J4987O9409O7671p197m5242l1031K9115O379
17987D51915J0981P930j1667l6869l566j362k5180m3063l0693m634j8913r663
17975B85216L9981m470o2297j8115K7596J1290K186l5572j1343P092j2685P907
17963B36786K6379K7130k97K047J7354K5813M8072N0991M0769O9518N1857J4207
17951F10626n997l9151l9181J6029K7468M8090L4153O705j8198K234j7265M0737
17939F66250O7107L2218L3424O1566N0418k8374k5236M4479O5024l3136j42035
$$ plain form
17928 791705 650292 548917 537372 623140 649110 638249 622889 571766 506567 503423 483215
17917 483215 469968 460888 444278 429535 412102 426880 450810 467984 491389 524977 532562 511089
17905 511089 521314 533786 548972 593848 600132 545551 497188 488225 473527 430376 396748 371585
17893 371585 371058 396834 435839 462710 485532 504115 537830 554836 583864 562732 592264 637811
17881 637811 666908 697348 711135 747299 781882 768509 774977 767142 786788 806566 842639 882604
17869 882604 923936 976703 1037339 1111790 1195791 1306943 1406085 1412434 1409467 1414178 1447912 1512978
17857 1512978 1632471 1787407 1934316 2050895 2132219 2118116 2125328 2233265 2391396 2510020
17847 2510020 2642321 2837739 3122894 3506629 4008365 4636601 5465584 6311660 6934949
$$ packed form
17928G91705j41413j01375j1545Q5768K5970j0861j5360n1123o5199l144k0208
17917D83215j3247r080j6610j4743j7433J4778K3930J7174K3405L3588P585k1473
17905E11089J0225J2472J5186M4876O284n4581m8363q963j4698m3151l3628k5163
17893C71585n27K5776L9005K6871K2822J8583L3715J7006K9028k1132K9532M5547
17881F37811K9097L0440J3787L6164L4583j3373O468p835J9646J9778L6073L9965
17869H82604M1332N2767O0636P4451Q4001J11152R9142O349k967M711L3734O5066
17857A512978J19493J54936J46909J16579Q1324j4103P212J07937J58131J18624
17847B510020J32301J95418K85155L83735N01736O28236Q28983Q46076O23289
$$ plain form
17838 6934949 7439702 8255181 9767147 12400641 16695165 22887672 27944799 27846011 24233535
17829 24233535 20947644 19648350 20084563 21902211 25754399 33109970 45522886 62811678
17821 62811678 73153465 65842374 50980528 41215143 38627983 40849866 46659640 56352828
17813 56352828 72057824 98308697 141020389 203878552 264299437 274843823 252700192
17806 252700192 247158368 273010031 282702183 242411840 184882468 151347410 150461531
17799 150461531 174631603 196061188 175566669 126791608 83681170 57840234 43044984
17792 43044984 34325149 28973085 25592096 23438539 22235960 21842661 22061536 23201313
17784 23201313 26186541 31881329 40777482 50095611 55681019 61217306 74391982 100613606
$$ packed form
17838F934949N04753Q15479J511966K633494M294524O192507N057127r8788l612476
17829B4233535l285891j299294M36213J817648L852188P355571J2412916J7288792
17821F2811678J0341787p311091j4861846r765385k587160K221883N809774R693188
17813E6352828J5704996K6250873M2711692O2858163O0420885J0544386k2143631
17806B52700192n541824K5851663R692152m0290343n7529372l3535058q85879
17799A50461531K4170072K1429585k0494519m8775061m3110438k5840936j4795250
17792D3044984q719835n352064l380989k153557j202579l93299K18875J139777
17784B3201313K985228N694788Q896153R318129N585408N536287J3174676K6221624
$$ plain form
17776 100613606 138940826 165719409 150178039 107005937 67925626 44192763 30850006
17769 30850006 23130524 18411803 15376999 13254661 11565012 10215045 9271449 8722708
17761 8722708 8604742 8954767 9788632 11045736 12907383 15970356 21307344 30316939 43532296
17752 43532296 55366368 53262183 39207876 24803176 15965673 11179066 8542633 7010961
17744 7010961 5930858 5003732 4281564 3684087 3171981 2804334 2603825 2540268 2516080 2420725
17734 2420725 2260982 2088597 1937846 1884428 1836775 1706629 1581885 1517710 1519297 1531083
17724 1531083 1517363 1509599 1537270 1563187 1504281 1414127 1344865 1301308 1296084 1256528 1144607
17713 1144607 1023338 984032 1025013 1054578 1023953 981387 938038 1005242 1131141 1324820 1561600
$$ packed form
17776A00613606L8327220K6778583j5541370m3172102l9080311k3732863j3342757
17769C0850006p719482m718721l034804k122338j689649j349967r43596n48741
17761H722708j17966L50025Q33865J257104J861647L062973N336988R009595J3215357
17752D3532296J1834072k104185j4054307j4404700q837503m786607k636433j531672
17744G010961j080103r27126p22168n97477n12106l67647k00509o3557k4188r5355
17734B420725j59743j72385j50751n3418m7653j30146j24744o4175J587J1786
17724A531083j3720p764K7671K5917n8906r0154o9262m3557n224l9556j11921
17713A144607j21269l9306M0981K9565l0625m2566m3349O7204J25899J93679K36780
$$ plain form
17702 1561600 1672160 1567006 1390524 1288043 1252765 1335822 1539398 1828457 2079295 2142758
17692 2142758 1991295 1811926 1783389 1822111 1685933 1462197 1266514 1105707 1059462 1074384
17682 1074384 1118811 1154469 1032954 815145 629754 523430 520818 528681 543607 523196 508151
17671 508151 506044 534412 611376 702282 801796 849574 771191 647388 563087 557478 628935 750022
17659 750022 934025 1054770 1005368 883108 850919 846799 786883 695404 572409 474669 377998
17648 377998 303847 291231 301953 324431 300658 255797 238721 201814 196539 185259 232130 308211
17636 308211 388239 453054 389087 270050 205785 193307 181879 207122 224778 218990 181691
17625 181691 140250 144886 145055 112562 89733 91172 74627 49448 80246 122394 151995 119945
$$ packed form
17702A561600J10560j05154j76482j02481l5278Q3057K03576K89059K50838O3463
17692B142758j51463j79369k8537L8722j36178k23736j95683j60807m6245J4922
17682A074384M4427L5658j21515k17809j85391j06324k612P863J4926k0411j5045
17671E08151k107K8368P6964R0906R9514M7778p8383j23803q4301n609P1457J21087
17659G50022J84003J20745m9402j22260l2189m120n9916r1479j22995r7740r6671
17648C77998p4151j2616J0722K2478k3773m4861j7076l6907n275j1280M6871P6081
17636C08211Q0028O4815o3967j19037o4265j2478j1428K5243J7656n788l7299
17625A81691m1441M636J69l2493k2829J439j6545k5179L0798M2148K9601l2050
$$ plain form
17613 119945 100718 85487 60091 75806 88452 81417 82898 83261 79411 93506 89883 71779 78866
17600 78866 96824 108950 114181 100640 104573 79621 66609 64780 62364 82687 94460 104088 115469
17587 115469 112402 114507 101437 91783 96671 99970 84681 51626 42312 20079 30965 36932 31098
17574 31098 14262 8164 -17282 -1295 11049 23932 23263 37918 31780 7686 38992 61714
17562 61714 62281 75837 79961 66043 54943 71851 68662 61339 65297 86823 80576 74230 77364
17549 77364 68231 60660 52828 38043 70017 103951 82583 28953 -2963 3623 16476 31286
17537 31286 12992 634 8365 27821 16471 28660 56056 82149 101514 75629 78685 58443
17525 58443 48004 61685 101990 98867 93233 85625 85171 96069 66308 37812 29562 35997 50230
$$ packed form
17613A19945j9227j5231k5396J5715J2646p035J481L63l850J4095l623j8104P087
17600G8866J7958J2126N231j3541L933k4952j3012j829k416K0323J1773R628J1381
17587A15469l067K105j3070r654M888L299j5289l3055r314k2233J0886N967n834
17574C1098j6836o098k5446J5987J2344J2883o69J4655o138k4094L1306K2722
17562F1714N67J3556M124j3918j1100J6908l189p323L958K1526o247o346L134
17549G7364r133p571p832j4785L1974L3934k1368n3630l1916O586J2853J4810
17537C1286j8294j2358P731J9456j1350J2189K7396K6093J9365k5885L056k0242
17525E8443j0439J3681M0305l123n634p608m54J0898k9761k8496q250O435J4233
$$ plain form
17512 50230 54585 66547 86098 72286 66190 62524 86808 100961 80872 72920 65193 61458 37334
17499 37334 37274 42777 51096 75674 78389 46220 7947 10751 29494 34767 33716 59615 56745 16079
17485 16079 25143 38061 21527 13413 12502 21239 23091 -2233 2926 -2668 12506 50096 53039
17472 53039 39531 28686 -17827 -48050 -68257 -51815 -31718 -20059 -45340 -75242 -55462 4508
17460 4508 36478 22719 6126 14762 3802 4062 14147 26462 44657 40785 36981 13592 36946
17447 36946 51288 45190 50423 73705 133268 221491 311855 335079 257333 150878 86132 50951
17435 50951 -671 -32485 -28559 -11046 57 -1116 35160 33951 24028 34866 592 -32478
17423 -32478 -25966 -18851 -10302 1228 28534 44594 45480 31302 19242 24653 20880 15398 8803
$$ packed form
17512E0230M355J1962J9551j3812o096l666K4284J4153k0089p952p727l735k4124
17499C7334o0N503Q319K4578K715l2169l8273K804J8743N273j051K5899k870m0666
17485A6079R064J2918j6534q114r11Q737J852k5324N159n594J5174L7590K943
17472E3039j3508j0845m6513l0223k0207J6442K0097J1659k5281k9902J9780N9970
17460D508L1970j3759j6593Q636j0960K60J0085J2315J8195l872l804k3389K3354
17447C6946J4342o098N233K3282N9563Q8223R0364K3224p7746j06455o4746l5181
17435E0951n1622l1814L926J7513J1103j173L6276j209r923J0838l4274l3070
17423c2478O512P115Q549J1530K7306J6060Q86j4178j2060N411l773n482o595
$$ plain form
17410 8803 -3089 -10884 -25954 -23520 -9181 13766 -17307 -26346 -16683 -30292 -2450 4829 10119
17397 10119 -4003 13656 26084 23222 5691 -16263 -31881 -30038 -20781 3582 20665 26958
17385 26958 36056 31638 14401 -16771 -16382 -23271 -10806 -7467 -2726 15856 25724 18903 -13292
17372 -13292 -16855 -22020 -43698 -33152 -12217 18610 39187 62005 61994 61026 60418 64144 27645 -8336
17358 -8336 -14027 -28820 -40183 -24160 -10941 800 -3411 -13593 -14876 -18559 -20158 3705 16814
17345 16814 40775 61384 58422 39563 34502 18501 14550 25764 38899 31382 31218 23012 22152
17332 22152 20885 47540 55128 24338 10562 21602 -3821 -13079 -20559 11411 33927 37840 30685
17319 30685 37154 52286 23782 44935 53962 50596 40344 22617 22398 53132 59413 45352 19265
$$ packed form
17410H803j1892p795j5070K434J4339K2947l1073r039R663j3609K7842P279N290
17397A0119j4122J7659J2428k862j7531k1954j5618J843R257K4363J7083O293
17385B6958R098m418j7237l1172L89o889J2465L339M741J8582R868o821l2195
17372a3292l563n165k1678J0546K0935L0827K0577K2818j1r68o08L726l6499l5981
17358h336n691j4793j1363J6023J3219J1741m211j0182j283l683j599K3863J3109
17345A6814K3961K0609k962j8859n061j6001l951J1214J3135p517j64q206q60
17332B2152j267K6655P588l0790j3776J1040k5423r258p480L1970K2516L913p155
17319C0685O469J5132k8504K1153R027l366j0252j7727k19L0734O281j4061k6087
$$ plain form
17306 19265 34720 77068 112595 149688 181127 219934 311098 476651 659164 690248 548090
17295 548090 405505 347354 370002 457362 594203 685230 583144 432419 302071 232002
17285 232002 194370 177862 165680 145317 158257 181244 229605 295128 437605 611309 855982
17274 855982 1063806 1135978 995378 804665 645702 574604 625639 683129 609357 436197
17264 436197 282107 182814 141699 128384 122468 102833 99323 100111 158765 184574 194978 256406
17252 256406 354249 515826 627271 611322 483879 362511 299488 287220 292811 331939 417954
17241 417954 528869 598510 545216 383274 265121 187520 105977 63311 63906 53447 63774
17230 63774 50022 29406 34023 48677 65105 79562 98862 116576 146913 191988 255246 358820
$$ packed form
17306A9265J5455M2348L5527L7093L1439L8807R1164J65553J82513L1084j42158
17295E48090j42585n8151K2648Q7360J36841R1027j02086j50725j30348p0069
17285B32002l7632j6508j2182k0363J2940K2987M8361O5523J42477J73704K44673
17274H55982K07824P2172j40600j90713j58963p1098N1035N7490p3772j73160
17264D36197j54090r9293m1115j3315n916j9635l510P88N8654K5809J0404O1428
17252B56406R7843J61577J11445j5949j27443j21368o3023j2268N591L9128Q6015
17241D17954J10915O9641n3294j61942j18153p7601q1543m2666N95j0459J0327
17230F3774j3752k0616M617J4654J6428J4457J9300J7714L0337M5075O3258J03574
$$ plain form
17218 358820 487845 562731 517383 384322 232151 119934 57828 31728 28141 32133 9680
17207 9680 25082 19567 15370 13403 14705 17229 -3229 -5717 -19006 7205 41410 39897 18600
17194 18600 -142 8906 11831 -4540 -7106 -1911 -19685 -2000 -20375 -39412 -45851 -43477 -47243
17181 -47243 -23621 -25373 -7310 -8795 -43965 -49865 -42203 -51583 -50325 -46068 -69922 -72931 -48048
17168 -48048 -37677 -13198 -10746 -4793 -9733 -11147 -13928 -2482 24803 49605 25085 -4818 13021
17155 13021 -5081 -27874 -18703 -25104 -14729 -2145 -4100 -15256 -22221 -18555 -18999 -31783 -27475
17142 -27475 -29456 -40123 -33745 -39528 -62441 -59216 -44242 -50577 -52738 -63763 -65150 -51652 -35382
17129 -35382 -15721 -2276 1695 -25223 -56804 -27338 -16221 -14883 -42632 -57450 -50726 -30751
$$ packed form
17218C58820J29025P4886m5348j33061j52171j12217o2106k6100l587L992k2453
17207I680J5402n515m197j967J302K524k0458k488j3289K6211L4205j513k1297
17194A8600j8742R048K925j6371k566N195j7774J7685j8375j9037o439K374l766
17181d7243K3622j752J8063j485l5170n900P662r380J258M257k3854l009K4883
17168d8048J0371K4479K452N953m940j414k781J1446K7285K4802k4520k9903J7839
17155A3021j8102k2793R171o401J0375J2584j955j1156o965L666m44j2784M308
17142b7475j981j0667O378n783k2913L225J4974o335k161j1025j387J3498J6270
17129c5382J9661J3445L971k6918l1581K9466J1117J338k7749j4818O724J9975
$$ plain form
17117 -30751 -32007 -18347 -25881 -22163 -9483 -21021 -6824 -14337 -21110 -6960 32262 64857 69059
17104 69059 42168 9429 -11465 -21355 -27285 -26319 -6504 -4967 -29189 -41105 -18644 6720 -2083
17091 -2083 -4784 -27881 -42592 -25585 -13607 -12808 -18634 -9918 -14196 664 -9934 -43251 -62850
17078 -62850 -70984 -60510 -49401 -15660 -10023 -26069 -42955 -48732 -42764 -57478 -49799 -28439 -6017
17065 -6017 -6916 -31252 -15291 -25390 -35498 -29188 13949 11710 733 -4183 5078 13287 16860
17052 16860 21984 -21852 -50834 -32392 -29036 -48315 -31231 -1952 -895 -17697 -14484 -3498
17040 -3498 -7850 -1944 21929 34676 45873 30267 17537 14991 16685 43152 25799 -5240 -1779
17027 -1779 6339 -2545 -20775 5358 10389 -2207 -11657 -32319 -32409 -35981 -8853 -13353 7242 -18797
$$ packed form
17117c0751j256J3660p534L718J2680j1538J4197p513o773J4150L9222L2595M202
17104F9059k6891l2739k0894r890n930R66J9815J537k4222j1916K2461K5364q803
17091b083k701k3097j4711J7007J1978P99n826Q716m278J4860j0598l3317j9599
17078f2850q134J0474J1109L3741N637j6046j6886n777N968j4714P679K1360K2422
17065f017q99k4336J5961j0099j0108O310M3137k239j0977m916R261Q209L573
17052A6860N124m3836k8982J8442L356j9279J7084K9279J057j6802L213J0986
17040c498m352N906K3873J2747J1197j5606j2730k546J694K6467j7353l1039L461
17027a779Q118q884j8230K6133N031j2596r450k0662r0l572K7128m500K0595k6039
$$ plain form
17013 -18797 -44903 -67432 -60153 -40689 -49128 -46363 -36229 -24460 7731 1125 -15029 -47795
17001 -47795 -79603 -69875 -44149 -31221 -29148 -45989 -39631 -5958 -32144 -82046 -71983 -44433
16989 -44433 -16935 -11167 -19585 -25276 -23926 -24682 -48981 -45497 -40903 -46209 -51870 -38805 -28030 -23296
16975 -23296 -16011 -9909 -15439 -25538 -27653 -24404 -18620 -27041 -31789 -10610 -7941 -11561 -26618 -47273
16961 -47273 -42078 -57301 -48603 -24595 -26311 3846 20441 14844 -2969 -1921 -2830 -28341 -19518
16948 -19518 1986 -4549 -30548 -32080 -27668 -55468 -69409 -44389 -25905 -340 -8533 -20249
16936 -20249 -22581 7374 19406 9381 -6298 7940 -3080 -29225 -45285 -33889 -15476 -13564
16924 -13564 1280 12116 17123 5481 -2383 -26426 -54449 -36403 -18868 -9028 16817 40630
$$ packed form
17013a8797k6106k2529P279J9464q439K765J0134J1769L2191o606j6154l2766
17001d7795l1808R728K5726J2928K073j6841O358L3673k6186m9902J0063K7550
16989d4433K7498N768q418n691J350p56k4299L484M594n306n661J3065J0775M734
16975b3296P285O102n530j0099k115L249N784q421m748K1179K669l620j5057k0655
16961d7273N195j5223Q698K4008j716L0157J6595n597j7813J048r09k5511Q823
16948a9518K1504o535k5999j532M412k7800j3941K5020J8484K5565q193j1716
16936b0249k332K9955J2032j0025j5679J4238j1020k6145j6060J1396J8413J912
16924a3564J4844J0836N007j1642p864k4043k8023J8046J7535R840K5845K3813
$$ plain form
16912 40630 13157 20619 11362 4638 4589 -44782 -47878 -42087 -28875 -26594 -28868 -34151 -20267 -32638
16898 -32638 -19727 -18052 -26469 -33583 -31391 -29755 -5488 10473 18707 7192 -5612 -5922 2206
16885 2206 9583 -13899 -38956 -32539 -17536 -20453 -31293 -30432 -30943 -35374 -33899 -26666 -42386 -26600
16871 -26600 -19571 -13712 -21328 -38000 -40069 -34533 -4426 10065 -10117 -26357 -16352 -33569 -47652
16858 -47652 -40449 -27421 -20393 -21821 -18061 -34421 -10779 12166 -440 -14668 -26038 -38072
16846 -38072 -42196 -21462 -6456 -21009 -39113 -43296 -54983 -48064 -35483 -51797 -49747 -47697 -26323
16833 -26323 -13281 -15894 -13213 -22617 -9616 3639 26397 29367 5092 -20339 -31177 -22566 -18629
16820 -18629 -20896 -41446 -64979 -40055 -17490 -11213 -17259 -12391 -7230 -887 13055 8363 -734
$$ packed form
16912D0630k7473P462r257o724m9m9371l096N791J3212K281k274n283J3884j2371
16898c2638J2911J675q417p114K192J636K4267J5961Q234j1515j2804l10Q128
16885B206P377k3482k5057O417J5003k917j0840Q61n11m431J475P233j5720J5786
16871b6600P029N859p616j6672k069N536L0107J4491k0182j6240J0005j7217j4083
16858d7652P203J3028P028j428L760j6360K3642K2945j2606j4228j1370j2034
16846c8072m124K0734J5006j4553j8104m183j1687O919J2581j6314K050K050K1374
16833b6323J3042k613K681r404J3001J3255K2758K970k4275k5431j0838Q611L937
16820a8629k267k0550k3533K4924K2565O277o046M868N161O343J3942m692r097
$$ plain form
16807 -734 16471 -4909 -30253 -48768 -59520 -67326 -85441 -61049 -2738 32210 36228 44416 35947
16794 35947 15967 -28404 -47040 -34713 -24726 -24208 -18161 -12411 -17919 -30315 -9831 3912 16453
16781 16453 8 12220 3043 -24424 -47584 -49359 -31687 -41668 -44235 -37862 -48118 -40184 -7732
16768 -7732 4413 -5797 -22334 427 6853 -1535 -7281 -47337 -44860 -51033 -50718 -33201 -31134
16755 -31134 -19702 -20778 -33805 -16979 -27054 -16311 -8389 518 4021 6282 20590 6152 9778
16742 9778 7569 10976 7490 7239 39270 37979 21037 -1221 1612 2666 -12497 -43052 -45310 -2669
16728 -2669 439 2044 -634 11770 20677 33178 10403 -10411 -28988 -24510 10561 37341 22307
16715 22307 13571 -2535 23499 37523 12926 -20954 -55423 -71074 -58227 -56714 -53998 -38235
$$ packed form
16807g34J7205k1380k5344j8515j0752p806j8115K4392N8311L4948M018Q188q469
16794C5947j9980m4371j8636J2327R987N18O047N750n508j2396K0484J3743J2541
16781A6453j6445J2212r177k7467k3160j775J7672r981k567O373j0256P934L2452
16768g732J2145j0210j6537K2761O426q388n746m0056K477o173L15J7517K067
16755c1134J1432j076j3027J6826j0075J0743P922Q907L503K261J4308j4438L626
16742I778k209L407l486k51L2031j291j6942k2258K833J054j5163l0555k258M2641
16728b669L108J605k678J2404Q907J2501k2775k0814j8577M478L5071K6780j5034
16715B2307q736j6106K6034J4024k4597l3880l4469j5651J2847J513K716J5763
$$ plain form
16703 -38235 -15600 -12797 6717 -21977 14848 30057 -23367 -35448 -18633 -23405 -34833 -51801
16691 -51801 -55757 -36524 -39100 -52810 -39009 -6209 -9687 -23325 -5558 7525 -11453 -32697
16679 -32697 -49448 -45151 -40288 -4436 11343 21452 11525 -29976 -53026 -46032 -38593 -43366 -57423
16666 -57423 -56459 -28335 -34401 -38889 -4307 10218 12828 7769 5963 -1502 -1536 -18326 -7933 5671
16652 5671 6736 14617 7495 705 -34553 -53370 -75511 -67455 -63973 -65169 -51019 -56779 -62068 -69120
16638 -69120 -73293 -62024 -51825 -35580 -26370 -39974 -41971 -51334 -69024 -16593 -1523 -19326
16626 -19326 -42407 -51280 -51239 -40698 -47985 -50179 -29598 -21992 -4242 -703 2246 2974 -1526 -10938
16612 -10938 -5843 2399 -10743 -37005 -48146 -23730 -22773 -42297 -61380 -61011 -38306 -29858 -24825
$$ packed form
16703c8235K2635K803J9514k8694L6825J5209n3424j2081J6815m772j1428j6968
16691e1801l956J9233k576j3710J3801L2800l478j3638J7767J3083j8978k1244
16679c2697j6751M297M863L5852J5779J0109r927m1501k3050O994P439m773j4057
16666e7423R64K8124o066m488L4582J4525K610n059j806p465l4j6790J0393J3604
16652E671J065P881p122o790l5258j8817k2141Q056L482j196J4150n760n289p052
16638f9120m173J1269J0199J6245R210j3604j997r363j7690N2431J5070j7803
16626a9326k3081q873M1J0541p287k194K0581P606J7750L539K949P28m500r412
16612a0938N095Q242j3142k6262j1141K4416R57j9524j9083L69K2705Q448N033
$$ plain form
16599 -24825 -54042 -48922 -32627 -35120 -56618 -54293 -14954 5175 -14510 -15954 -10387 -7301 -7426
16586 -7426 -10710 -30272 -46517 -23596 -12647 -13178 -462 1212 14104 15187 3632 14543 102
16573 102 -3539 -2767 -1849 606 -16860 -27025 -30477 -45055 -46254 -20557 -11237 -13903 -7923 20762
16559 20762 27943 20341 -1239 -8159 -25646 -12030 -5052 -31011 -41413 -35974 -34623 -9228 5417
16546 5417 924 -14124 -4780 -12574 -9631 -20626 -39615 -28164 -19370 -22753 -27119 -35295 -18992
16533 -18992 -13946 -14885 11890 41315 31949 29316 3469 -24968 -59708 -42167 -21874 13303 24684
16520 24684 -397 -37305 -18512 -7493 5866 23840 11054 -6606 -15843 -15121 -9919 -1061 -8017
16507 -8017 -7828 -5911 2147 15867 -9226 -37512 -44698 -14118 -50735 -53643 -18468 -14243 -42007
$$ packed form
16599b4825k9217N120J6295k493k1498K325L9339K0129j9685j444N567L086j25
16586g426l284j9562j6245K2921J0949n31J2716J674J2892J083j1555J0911j4441
16573A02l641P72R18K455j7466j0165l452j4578j199K5697R320k666N980K8685
16559B0762P181p602k1580o920j7487J3616O978k5959j0402N439J351K5395J4645
16546E417m493j5048R344p794K943j0995j8989J1451Q794l383m366q176J6303
16533a8992N046r39K6775K9425r366k633k5847k8437l4740J7541K0293L5177J1381
16520B4684k5081l6908J8793J1019J3359J7974j2786j7660r237P22N202Q858o956
16507h017J89J917Q058J3720k5093k8286p186L0580l6617k908L5175M225k7764
$$ plain form
16494 -42007 -40453 -31382 -34280 -26691 -32365 -22624 -6005 2752 -15739 -28899 -27982 -35986 -8946 12523
16480 12523 10254 -17198 -14752 1107 22568 9718 -21504 -41713 -35353 -41621 -30060 -25768 -17135
16467 -17135 12784 46909 38063 17120 8367 -3611 -10016 -12761 -20344 -25902 -22495 -1252 -14067
16454 -14067 -139 8939 5507 -8778 105 -12411 -17765 -11676 -33671 -42725 -34888 -46162 -55323
16441 -55323 -41917 -910 17889 -12411 -28501 -22402 -38047 -25419 -24035 -40315 -40947 -9616
16429 -9616 -4366 -14321 -10347 23 -4437 6937 9015 24892 -776 -30094 -24476 -13683 5743
16416 5743 -27208 -32416 -13771 -12286 -14321 -22810 -48670 -58959 -54126 -34133 -10528 -3767 -4894
16403 -4894 -2602 -15156 -30367 -43583 -27673 -22709 -29958 -10876 -7593 -22760 -19866 -13410 -16226
$$ packed form
16494d2007J554R071k898P589n674R741J6619Q757j8491j3160R17q004K7040K1469
16480A2523k269k7452K446J5859K1461j2850l1222k0209O360o268J1561M292Q633
16467a7135K9919L4125q846k0943q753j1978o405k745p583n558L407K1243j2815
16454a4067J3928R078l432j4285Q883j2516n354O089k1995r054P837j1274r161
16441e5323J3406M1007J8799l0300j6090O099j5645J2628J384j6280o32L1331
16429i616N250r955L974J0370m460J1374K078J5877k5668k9318N618J0793J9426
16416E743l2951n208J8645J485k035q489k5860j0289M833J9993K3605O761j127
16403d894K292j2554j5211j3216J5910M964p249J9082L283j5167K894O456k816
$$ plain form
16390 -16226 -18629 8320 34792 20339 3312 -1077 5425 20775 24664 4015 434 -16224 -20769
16377 -20769 -10898 11369 16635 11990 -6713 -2185 -14081 -17376 -4175 -22023 -31625 -3375 -42293
16364 -42293 -52429 -52570 -75858 -72958 -43914 -24624 18290 -14428 -31240 -31479 -42506 -24081 -26401
16351 -26401 -53748 -85816 -83216 -90651 -84650 -67744 -52684 -4325 9148 -9272 -34790 -49948
16339 -49948 -46676 -17582 1931 -2152 -13808 -6752 -38336 -83232 -64640 -53733 -41693 -38022
16327 -38022 -34104 -21028 -1828 11192 11421 -15582 -2598 8541 13602 13435 -7721 -14241 -5632
16314 -5632 -22103 -34748 -38265 -20666 -4550 14304 2660 -21617 -13216 -13809 -36778 -57256 -31644
16301 -31644 -32558 -32120 -29997 -15722 -15757 -26147 -23294 -24575 -16988 2090 -19956 -23515 6647 12808
$$ packed form
16390a6226k403K6949K6472j4453j7027m389O502J5350L889k0649l581j6658m545
16377b0769R871K2267N266m645j8703M528j1896l295J3201j7848r602K8250l8918
16364d2293j0136j41k3288K900K9044J9290M2914l2718j6812k39j1027J8425k320
16351b6401k7347l2068K600p435O001J6906J5060M8359J3473j8420k5518j5158
16339d9948L272K9094J9513m083j1656P056l1584m4896J8592J0907J2040L671
16327c8022L918J3076J9200J3020K29k7003J2984J1139N061j67k1156o520Q609
16314e632j6471j2645l517J7599J6116J8854j1644k4277Q401n93k2969k0478K5612
16301c1644r14M38K123J4275l5j0390K853j281P587J9078k2046l559L0162O161
$$ plain form
16287 12808 7348 -24527 -11735 24658 17473 -340 7473 4866 -18995 -20549 -18986 -14879 -26494
16274 -26494 -16996 3712 4528 -3317 -24 -9030 -4288 13648 22501 4515 -7956 -22523 -13927
16261 -13927 1611 18183 25152 29780 -382 -16071 -6142 3946 -10214 2303 10189 -209
16249 -209 4983 19918 -897 -3372 1021 11202 37279 -8353 -54163 -34468 -15666 23925 29890
16236 29890 5224 -20978 -23333 -10098 -32975 -51782 -36944 -13473 -9246 -96 -11792 -29648
16224 -29648 -21475 6055 9641 -2211 -38411 -28577 -9709 3085 -113 -36931 -18244 -8564 11251
16211 11251 -1233 -27835 -38880 -54514 -55426 -37374 -13246 6582 44598 13219 -1107 8353
16199 8353 2403 12224 30396 5681 10579 -3550 5732 14919 -21745 -64054 -36258 -24551 -9894
$$ packed form
16287A2808n460l1875J2792L6393p185j7813P813k607k3861j554J563M107j1615
16274b6494R498K0708Q16p845L293r006M742J7936Q853j7986j2471j4567Q596
16261a3927J5538J6572O969M628l0162j5689R929J0088j4160J2517P886j0398
16249b09N192J4935k0815k475M393J0181K6077m5632m5810J9695J8802L9591N965
16236B9890k4666k6202k355J3235k2877j8807J4838K3471M227R150j1696j7856
16224b9648Q173K7530L586j1852l6200R834J8868J2794l198l6818J8687R680J9815
16211A1251j2484k6602j1045j5634r12J8052K4128J9828L8016l1379j4326R460
16199H353n950R821J8172k4715M898j4129R282R187l6664m2309K7796J1707J4657
$$ plain form
16186 -9894 -4744 -20342 -22858 -11049 3400 -7468 -11401 5078 -7928 -14279 -22655 -57539 -68627
16173 -68627 -46803 -46971 -38031 -11678 -2869 27797 16625 13541 33846 10507 -15384 -37976 -24326
16160 -24326 -14384 -19957 -24178 -32169 -37425 -50110 -47882 -12792 4908 25400 21967 32499 44678
16147 44678 18387 -1041 -3476 36385 53219 22387 -21529 -66983 -61554 -48662 -29162 -22997
16135 -22997 -21681 -31767 -49236 -47393 -35157 -26832 -28963 -33321 -35158 -3859 26740 12452 -30603
16122 -30603 -28875 2108 -5125 -23441 -22460 -32095 -39780 -42565 13930 50983 51430 28096 24104 -1689
16108 -1689 -7842 -24369 -18140 -17262 -3802 10407 6520 -4015 -63 42270 59484 36046 7841
16095 7841 4083 15682 6605 -2543 5593 855 -12678 37059 62426 41119 5399 -19033 -34920
$$ packed form
16186i894N150j5598k516J1809J4449j0868l933J6479j3006o351q376l4884j1088
16173f8627K1824j68Q940K6353Q809L0666j1172l084K0305k3339k5891k2592J3650
16160b4326R942n573m221p991n256j2685K228L5090J7700K0492l433J0532J2179
16147D4678k6291j9428k435L9861J6834l0832m3916m5454N429J2892J9500O165
16135b2997J316j0086j7469J843J2236Q325k131m358j837L1299L0599j4288m3055
16122c0603J728L0983p233j8316R81r635p685k785N6495L7053M47k3334l992k5793
16108a689o153j6527O229Q78J3460J4209l887j0535L952M2333J7214k3438k8205
16095G841l758J1599r077r148Q136m738j3533M9737K5367k1307l5720k4432j5887
$$ plain form
16082 -34920 -32750 -8405 24779 18806 -7253 -44916 -19091 -15016 -13035 15970 2942 -33033
16070 -33033 -45506 -46152 -33004 2583 22960 25470 33418 46336 34940 24867 -6133 -20094
16058 -20094 16666 7685 -15662 -30951 -36270 -30339 1677 15856 9648 -10830 8751 51168
16046 51168 39828 12679 -1429 -7954 1756 -15806 13568 12846 -6162 8841 16610 -13713 -2309
16033 -2309 -9384 -9500 -12371 -30776 -15573 946 2619 -20316 -39559 -47556 -45097 -27961 -25045
16020 -25045 -36615 -35595 -28928 -14337 -23826 -35999 -36957 -30892 -10132 -2396 -13408 -9859 7904
16007 7904 29848 2442 -15335 -8366 25481 32254 1513 23917 55585 44069 30634 -5453
15995 -5453 -18465 -27247 -9053 3150 -3693 3305 -6347 -13242 -6878 -14292 -20983 7292 -5073
$$ packed form
16082c4920K170K4345L3184n973k6059l7663K5825M075J981K9005j3028l5975
16070c3033j2473o46J3148L5587K0377K510P948J2918j1396j0073l1000j3961
16058b0094L6760q981k3347j5289n319N931L2016J4179o208k0478J9581M2417
16046E1168j1340k7149j4108o525R710j7562K9374p22j9008J5003P769l0323J1404
16033b309p075j16k871j8405J5203J6519J673k2935j9243p997K459J7136K916
16020b5045j1570J020O667J4591r489j2173r58O065K0760P736j1012L549J7763
16007G904K1944k7406j7777O969L3847O773l0741K2404L1668j1516j3435l6087
15995e453j3012q782J8194J2203o843O998r652o895O364p414o691K8275j2365
$$ plain form
15982 -5073 -35214 -25612 -2460 -18964 -44840 -32092 -17969 -6208 -5701 -12299 3513 10120 7308
15969 7308 -1582 -19912 -54049 -55010 -39102 -25585 -10276 8320 -14262 -23626 -124 -7357 -18039
15956 -18039 19281 8785 -16835 -1466 -10399 -25922 -27389 -28186 -30513 -17460 -1578 5326 5437
15943 5437 -3734 -28200 -26334 -31448 -29773 -30317 -25086 -32479 -43241 -28683 12385 39764 39971 11089
15929 11089 25016 24947 35380 21716 4257 10380 -9731 -30470 -39350 -47684 -68189 -66725 -38358
15916 -38358 -41886 -19502 10590 -2472 -3567 4504 11089 -6853 -13796 -9805 14337 31185 12491
15903 12491 12017 25494 28509 46089 36662 16281 13283 7882 -8833 -7572 2372 3283 -12391 -14242
15889 -14242 -126 6575 6144 7979 -25210 -7464 17321 9734 -7214 -14149 2737 22759 39373
$$ packed form
15982e073l0141R602K3152j6504k5876J2748J4123J1761N07o598J5812O607k812
15969G308q890j8330l4137r61J5908J3517J5309J8596k2582r364K3502p233j0682
15956a8039L7320j0496k5620J5369q933j5523j467p97k327J3053J5882O904J11
15943E437r171k4466J866n114J675n44N231p393j0762J4558M1068K7379K07k8882
15929A1089J3927o9J0433j3664j7459O123k0111k0739q880q334k0505J464K8367
15916c8358l528K2384L0092j3062j095Q071O585j7942o943L991K4142J6848j8694
15903A2491m74J3477L015J7580r427k0381k998n401j6715J261R944R11j5674j851
15889a4242J4116O701m31J835l3189J7746K4785p587j6948o935J6886K0022J6614
$$ plain form
15876 39373 40299 32777 44562 36239 25178 29578 33833 27858 -21391 -28490 -30389 -22473 -18941 -14272
15862 -14272 -30257 -27311 -31490 -29307 -45326 -54339 -44838 -27136 -15912 -7967 14161 27861 22787
15849 22787 8542 10555 17377 23379 -12098 -19554 -21030 -42360 -68302 -55563 -18588 -3653 22848
15836 22848 12785 19608 11610 -30315 -42997 -37019 -26831 -15985 -35833 -29702 -124 18050
15824 18050 -7483 -34324 4067 36321 19791 -15904 -13127 -23783 -5378 1994 -19089 -29466
15812 -29466 -24338 -4736 4989 21914 19792 18849 -8036 -34088 -9231 1041 -9375 4590 -30424
15799 -30424 -34249 -26066 -19533 -11832 -2578 7301 10600 14428 19789 37652 44597 46296 28542 2606
15785 2606 -20020 -36561 -46151 -28586 -11534 -6427 -485 4187 10521 4813 7361 -13824 -4136
$$ packed form
15876C9373R26p522J1785q323j1061M400M255n975m9249p099j899P916L532M669
15862a4272j5985K946m179K183j6019r013R501J7702J1224P945K2128J3700n074
15849B2787j4245K013O822O002l5477p456j476k1330k5942J2739L6975J4935K6501
15836B2848j0063O823p998m1925j2682N978J0188J0846j9848O131K9578J8174
15824A8050k5533k6841L8391L2254j6530l5695K777j0656J8405P372k1083j0377
15812b9466N128J9602R725J6925k122r43k6885k6052K4857J0272j0416J3965l5014
15799c0424l825Q183O533P701R254R879L299L828N361J7863O945J699j7754k5936
15785B606k2626j6541r590J7565J7052N107N942M672O334n708K548k1185R688
$$ plain form
15772 -4136 16388 6996 12605 6549 -35357 -40164 -12961 12222 26152 38511 47018 34402 24602
15759 24602 38041 21870 4672 -18245 -20899 -17597 -14201 -723 2447 26411 29289 26518 21267
15746 21267 21809 6474 5934 3123 1446 -15295 -40170 -25501 -29259 -18952 -57167 -44486 -29519
15733 -29519 -4062 -6826 -19230 -5242 -12753 8203 4558 9552 11727 32500 19921 6555 -16347
15720 -16347 -24151 446 32281 10706 1432 5316 3742 -24616 -20136 -6290 -10649 -19128 1210
15707 1210 11113 -19956 -40010 -25271 17124 39240 20651 -11582 -7587 3712 1071 -8286 -23065
15694 -23065 -20444 10640 58262 36153 27187 29081 17656 17885 -2097 -1301 780 -25144 -49085
15681 -49085 -37573 2364 -1643 -11997 3553 -13364 -26091 -33065 -18510 -1847 -10673 -15674
$$ packed form
15772d136K0524r392N609o056m1906m807K7203K5183J3930J2359Q507j2616r800
15759B4602J3439j6171j7198k2917k654L302L396J3478L170K3964K878k771n251
15746B1267N42j5335n40k811j677j6741k4875J4669l758J0307l8215J2681J4967
15733b9519K5457k764j2404J3988p511K0956l645M994K175K0773j2579j3366k2902
15720a6347p804K4597L1835k1575r274L884j574k8358M480J3846m359q479K0338
15707A210R903l1069k0054J4739M2395K2116j8589l2233L995J1299k641r357j4779
15694b3065K621L1084M7622k2109q966J894j1425K29j9982P96K081k5924k3941
15681d9085J1512L9937m007j0354J5550j6917j2727o974J4555J6663q826n001
$$ plain form
15669 -15674 -34524 -53308 -64445 -61062 -60080 -33164 -12332 -25106 -40022 -8307 17832 3634
15657 3634 -17806 -11481 -28566 -25218 -3605 8731 3748 778 -11954 -1297 -8225 -15902 -32395
15644 -32395 -30007 3703 -439 -2614 9132 4839 -14434 -49211 -43774 -44847 -57810 -72927 -46890
15631 -46890 -11084 13043 -6513 -2509 -18986 -18383 -27345 -42961 -46825 -45794 -35497 -49616 -52606
15618 -52606 -53810 -44381 -30950 -54192 -81235 -61392 4189 14409 -5751 -14356 -20264 -21577 -24522
15605 -24522 -50925 -38557 -39504 -33083 -535 -2251 -23221 -16870 -15928 -47675 -43714 -39320 -38477 -50602
15591 -50602 -33626 -28540 -35718 -20872 -18991 -6199 4409 3398 -10716 -25021 -21990 -10715 -13274
15578 -13274 -19136 1311 13343 -14531 3890 21568 15741 20360 38626 18040 -9926 5648
$$ packed form
15669a5674j8850j8784j1137L383R82K6916K0832j2774j4916L1715K6139j4198
15657C634k1440O325j7085L348K1613J2336m983k970j2732J0657o928p677j6493
15644c2395K388L3710m142k175J1746m293j9273l4777N437j073j2963j5117K6037
15631d6890L5806K4127j9556M004j6477O03q962j5616l864J031J0297j4119k990
15618e2606j204R429J3431k3242k7043J9843O5581J0220k0160q605n908j313k945
15605b4522k6403J2368r47O421L2548j716k0970O351R42l1747L961M394Q43j2125
15591e0602J6976N086p178J4846J881J2792J0608j011j4114j4305L031J1275k559
15578a3274n862K0447J2032k7874J8421J7678n827M619J8266k0586k7966J5574
$$ plain form
15566 5648 50580 46122 16317 -12651 -18595 -2773 4118 28268 27324 32423 44534 24308 -2689
15553 -2689 940 -4164 -6165 -26960 -13415 1341 -25590 -30287 -79 20998 787 -12466 -34627
15540 -34627 -15660 -25622 -21350 19059 57136 55568 9590 3598 -838 -27824 -20875 -14773 2989
15527 2989 8392 -16687 4743 -16 6390 13346 327 -6169 -15030 2365 18936 -349 -26313
15514 -26313 -37589 -30969 -46786 -55005 -72842 -62168 -57167 -44306 -22865 -11661 -12712 -10661 25132
15501 25132 33680 49942 45972 38569 -4900 -13479 -11549 -40568 -33684 -35318 -39502 -35451 -36294 -47081
15487 -47081 -58580 -63951 -50448 -35644 -37786 -11889 6147 15301 10868 6845 15923 23713 -24770
15474 -24770 -45860 -23034 -22692 -31904 -41570 8005 2652 -524 3741 9816 20692 -4018 -14718
$$ packed form
15566E648M4932m458k9805k8968n944J5822O891K4150r44N099J2111k0226k6997
15553b689L629n104k001k0795J3545J4756k6931m697L0208K1077k0211j3253k2161
15540c4627J8967r962M272M0409L8077j568m5978n992m436k6986O949O102J7762
15527B989N403k5079K1430m759O406O956j3019o496q861J7395J6571j9285k5964
15514b6313j1276O620j5817q219j7837J0674N001J2861K1441J1204j051K051L5793
15501B5132Q548J6262l970p403m3469q579J930k9019O884j634m184M051q43j0787
15487d7081j1499n371J3503J4804k142K5897J8036R154m433m023R078P790m8483
15474b4770k1090K2826L42r212r666M9575n353l176M265O075J0876k4710j0700
$$ plain form
15461 -14718 -10988 9428 3715 863 17845 48024 35212 6279 -13000 -36128 -14055 -16335
15449 -16335 -8599 -14480 -11192 -24498 -536 16722 19832 30360 53180 45740 23242 8988 14094
15436 14094 19712 -12781 -57376 -48182 -48188 -32225 -14837 -4408 -29762 -39830 -16980 2436 1228
15423 1228 2835 8771 8603 12345 -1136 1476 2214 15353 16306 15533 -12037 -14642 -2225 -7562 -34949
15408 -34949 -25582 -17125 -6680 -16508 -32601 -48573 -36740 -20319 -2947 16262 32798 40294
15396 40294 30617 -8036 -27541 -21322 1928 12580 -5369 -16928 -23505 -25285 -21833 -35736 -49831
15383 -49831 -58357 -40457 -16273 -12594 -6328 -6155 -18893 -26733 -34248 -29242 -31350 -17936 -4673
15370 -4673 -18505 -45087 -75283 -88783 -71208 -35484 -28536 -11393 -6005 -11328 -6217 -1052 23344
$$ packed form
15461a4718L730K0416n713k852J6982L0179j2812k8933j9279k3128K2073k280
15449a6335P736n881L288j3306K3962J7258L110J0528K2820p440k2498j4254N106
15436A4094N618l2493m4595R194oJ5963J7388J0429k5354j0068K2850J9416j208
15423A228J607N936j68L742j3481K612P38J3139R53p73k7570k605J2417n337k7387
15408c4949R367Q457J0445r828j6093j5972J1833J6421J7372J9209J6536P496
15396D0294r677l8653j9505O219K3250J0652j7949j1559o577j780L452j3903j4095
15383d9831q526J7900K4184L679O266J73j2738p840p515N006k108J3414J3263
15370d673j3832k6582l0196j3500J7575L5724O948J7143N388n323N111N165K4396
$$ plain form
15357 23344 32080 13614 -15002 -652 -3728 -19725 -42534 -43115 -16389 -26018 -38341 -20607 7883
15344 7883 3557 10567 32879 18466 -587 -20116 -28418 -38351 -53396 -39608 -12071 21303 40096
15331 40096 50133 32414 -11399 21781 40372 41818 29179 6249 8631 32449 32589 24012 31027
15318 31027 9433 -2748 -27910 -22805 -32028 -31450 -32076 -36908 -33428 -51799 -64441 -69218 -76186 -45914
15304 -45914 -3303 28105 16621 -6832 -30491 -1882 4531 -6803 13828 34786 38780 45577
15292 45577 21421 4776 24419 47547 66227 26637 8856 16579 -22003 -52331 -54847 -20620
15280 -20620 -23805 -43397 -26311 -8958 -2888 -6418 -13340 -22104 -13694 -3617 -8204 -35981 -64825
15267 -64825 -34027 1367 6387 -7681 -8613 -21273 -43450 -48381 -45817 -49829 -40188 -25016 -140
$$ packed form
15357B3344Q736j8466k8616J4350l076j5997k2809n81K6726r629j2323J7734K8490
15344G883m326P010K2312j4413j9053j9529q302r933j5045J3788K7537L3374J8793
15331D0096J0037j7719m3813L3180J8591J446j2639k2930K382K3818J40q577P015
15318C1027k1594j2181k5162N105r223N78o26m832L480j8371j2642m777o968L0272
15304d5914M2611L1408j1484k3453k3659K8609O413j1334K0631K0958L994O797
15292D5577k4156j6645J9643K3128J8680l9590j7781P723l8582l0328k516L4227
15280b0620l185j9592J7086J7353O070l530o922q764Q410J0077m587k7777k8844
15267f4825L0798L5394N020j4068r32j2660k2177m931K564m012R641J5172K4876
$$ plain form
15254 -140 4555 -23425 -14200 21324 19264 -20223 -41107 -38415 -36482 -4026 533 -30826 -35228
15241 -35228 -13890 803 -15752 -787 -3351 -4746 1211 -5312 -15308 -2731 10896 17594 232
15228 232 -22401 -38045 -23154 14424 36275 24936 22930 28694 28195 59403 37963 21294 19628
15215 19628 17581 25244 22213 28547 -10990 2404 5450 -13688 -38374 -37572 -41546 -34461 5615
15202 5615 27158 32420 36450 25873 5179 -16595 -8423 16325 14607 -18152 -26350 -889 -6171
15189 -6171 -3801 -11615 9749 21933 20785 16705 -905 13494 19552 5335 -5252 -7206 -21937
15176 -21937 -19200 6653 29820 36878 12456 24441 14062 -16214 -41154 -67393 -62167 -41760
15164 -41760 -20851 5815 21092 41203 65584 60757 38617 18237 -21302 -13190 -15 -7002
$$ packed form
15254a40M695k7980R225L5524k060l9487k0884K692J933L2456M559l1359m402
15241c5228K1338J4693j6555J4965k564j395N957o523r996J2577J3627O698j7362
15228B32k2633j5644J4891L7578K1851j1339k006N764m99L1208k1440j6669j666
15215A9628k047P663l031O334l9537J3394L046j9138k4686Q02l974P085M0076
15202E615K1543N262M030j0577k0694k1774Q172K4748j718l2759q198K5461n282
15189f171K370p814K1364J2184j148m080j7610J4399O058j4217j0587j954j4731
15176b1937K737K5853K3167P058k4422J1985j0379l0276k4940k6239N226K0407
15164d1760K0909K6666J5277K0111K4381m827k2140k0380l9539Q112J3175o987
$$ plain form
15152 -7002 -24589 -20449 -2557 13930 9124 8593 -5951 19142 -7122 -40498 -40706 -22405 4508
15139 4508 26292 18142 8458 -7447 1365 8715 10896 23182 18054 19078 24766 34697 45680 47215
15125 47215 55341 71591 58503 29488 17163 -10157 -25034 -25070 -29743 -13912 -2767 -1424 10694
15112 10694 17158 13432 4357 4658 1593 -6925 -7440 -5122 -3214 -672 -9238 -39848 -40036 -37939 -15094
15097 -15094 18983 -2599 -25535 -19546 -18751 -15228 -22277 -2976 6300 -786 2927 10006 874 -9351
15083 -9351 -35437 -47245 -35748 -26820 -744 22294 10425 1012 6287 -5318 -18102 864
15071 864 30143 43810 31462 18830 26823 15349 -13960 2787 53081 43283 14737 3084
15059 3084 -1174 7396 25828 22985 36562 48642 62824 42420 16583 37082 37746 24656 10723
$$ packed form
15152g002j7587M140J7892J6487m806n31j4544K5093k6264l3376k08J8301K6913
15139D508K1784q150r684j5905Q812P350K181J2286n128J024N688R931J0983J535
15125D7215Q126J6250j3088k9015j2325k7320j4877l6m673J5831J1145J343J2118
15112A0694O464l726r075L01l065q518n15K318J908K542q566l0610j88K097K2845
15097a5094L4077k1582k2936N989P95L523p049J9301R276p086L713P079r132j0225
15083i351k6086j1808J1497Q928K6076K3038j1869r413N275j1605j2784J8966
15071H64K9279J3667j2348j2632P993j1474k9309J6747N0294r798k8546j1653
15059C084m258Q570J8432k843J3577J2080J4182k0404k5837K0499O64j3090j3933
$$ plain form
15046 10723 26653 7050 -734 -5219 -21910 -23286 -19491 -8399 -2296 -7296 18780 37332 36300
15033 36300 34897 33908 18679 -16155 -22853 -2097 -4889 -25440 -31434 -39241 -19323 7990 11532
15020 11532 -15837 -32886 -19231 -8811 2497 -14048 -18988 6987 25824 21458 43800 69407
15008 69407 46865 26394 3719 -16477 -21219 -16516 8003 -10219 -11410 6801 21748 9544
14996 9544 -13137 -38669 -41490 -35502 -30997 -30091 8799 17941 37801 65315 41814 27920 15967
14983 15967 24919 25398 23001 54947 51961 22313 -3807 10316 21390 -5302 -734 11165 1868
14970 1868 8827 34072 48716 39899 4753 3649 13879 -2428 4203 -8556 -23720 -34680 -7436
14957 -7436 15887 -6127 -32430 -32358 -8305 -9490 -2103 -6499 2538 21033 46624 47945 38156 26437
$$ packed form
15046A0723J5930j9603p784m485j6691j376L795J1092O103n000K6076J8552j032
15033C6300j403r89j5229l4834o698K0756k792k0551n994p807J9918K7313L542
15020A1532k7369j7049J3655J0420J1308j6545m940K5975J8837m366K2342K5607
15008F9407k2542k0471k2675k0196m742M703K4519j8222j191J8211J4947j2204
14996I544k2681k5532k821N988M505R06L8890R142J9860K7514k3501j3894j1953
14983A5967Q952M79k397L1946k986k9648k6120J4123J1074k6692M568J1899r297
14970A868O959K5245J4644q817l5146j104J0230j6307O631j2759j5164j0960K7244
14957g436K3323k2014k6303P2K4053j185P387m396R037J8495K5591J321r789j1719
$$ plain form
14943 26437 27663 39599 14249 1329 -13789 -33354 -43113 -54378 -43961 -54684 -32497 -9572
14931 -9572 12403 18971 21035 2187 25716 33532 28125 2660 -24320 -29344 20366 37547 40795
14918 40795 25088 26537 30169 12128 7430 8031 10865 -1782 13524 5370 -3582 5310 22212
14905 22212 -15516 -43689 -43509 -15467 13987 11236 5734 21366 32632 6192 -24202 -25626 -12923
14892 -12923 13411 29561 29876 44154 44486 2260 -7517 -4034 -23644 -52680 -42187 -20984 -26306
14879 -26306 -4175 23141 4861 -978 -15817 -20130 -38731 -44507 -38745 -48880 -43437 -32833 -23512
14866 -23512 -29031 -45188 -47749 -41380 -27419 -13310 2377 -8024 6874 -4900 2924 18394
14854 18394 886 7556 -6632 11229 23599 31979 846 -3626 -18805 2568 15934 -2627
$$ packed form
14943B6437J226J1936k5350j2920j5118j9565r759j1265J0417j0723K2187K2925
14931i572K1975O568K064j8848K3529P816n407k5465k6980n024M9710J7181L248
14918D0795j5707J449L632j8041m698O01K834j2647J5306q154q952Q892J6902
14905B2212l7728k8173J80K8042K9454k751n502J5632J1266k6440l0394j424J2703
14892a2923K6334J6150L15J4278L32m2226r777L483j9610k9036J0493K1203n322
14879b6306K2131K7316j8280n839j4839m313j8601n776N762j0135N443J0604R321
14866b3512n519j6157k561O369J3961J4109J5687j0401J4898j1774P824J5470
14854A8394j7508O670j4188J7861J2370Q380l1133m472j5179K1373J3366j8561
$$ plain form
14842 -2627 -25472 -21304 -11598 -10942 -31645 -27608 -3228 5942 -1529 4286 13548 2731 4365 -1858
14828 -1858 -16433 -14840 7849 2317 -10767 -2680 -923 2195 8290 10808 -802 -9301 -3302 -10785
14814 -10785 -16652 -23256 -8447 -11132 6340 34253 36240 36591 29254 29449 6889 -6620 -7514 12292
14800 12292 11555 5871 17202 17091 -22583 -28748 -10956 -30650 -27927 -20747 11488 14748 8383 27404
14786 27404 32885 11413 -3736 -17502 8025 35309 12707 -14823 -44809 -48420 -12110 13846
14774 13846 -12375 -20553 -22008 1640 20341 14185 -19399 -36059 -19874 -16637 -24047 -25321 -15959
14761 -15959 -7558 9644 -4887 -35240 -9471 10019 38776 36866 14250 -4097 -17557 -25247
14749 -25247 -16106 -17945 15093 21722 36344 33070 30499 26545 6103 22738 26279 38112 36112
$$ packed form
14842b627k2845M168R706O56k0703M037K4380R170p471N815R262j0817J634o223
14828a858j4575J593K2689n532j3084Q087J757L118O095K518j1610q499N999p483
14814a0785n867o604J4809k685J7472K7913J987L51p337J95k2560j3509q94J9806
14800A2292p37n684J1331j11l9674o165J7792j9694K723P180L2235L260o365J9021
14786B7404N481k1472j5149j3766K5527K7284k2602k7530k9986l611L6310K5956
14774A3846k6221q178j455K3648J8701o156l3584j6660J6185L237p410j274R362
14761a5959Q401J7202j4531l0353K5769J9490K8757j910k2616j8347j3460p690
14749b5247R141j839L3038O629J4622l274k571l954k0442J6635L541J1833k000
$$ plain form
14736 36112 9570 8701 11570 9179 4081 9120 29847 61161 44366 23378 22646 41343 23285
14723 23285 -12496 -22327 -20611 -6141 -6981 -28097 -39726 -32193 -23912 -13350 -10249 -37386 -21726
14710 -21726 547 25131 35519 7155 -7765 27733 26035 30173 11104 4870 18877 8890
14698 8890 -11369 -20334 -18873 -38487 -11171 9464 7083 650 2571 42 11409 20776 39301
14685 39301 24936 13383 30365 30085 29375 -5216 -24478 -17402 -26581 -19333 14300 19579 34269
14672 34269 38434 66811 83947 58977 45308 20894 2148 -28452 -44170 -33374 -24170 -14067
14660 -14067 -10597 13880 12724 -4958 -4125 -25270 -27895 -43323 -33540 -21459 -6636 -14818 -28552
14647 -28552 -39529 -39597 -44884 -39816 -9073 -14054 -19967 -7602 2344 5953 20261 -1259 1166 24169
$$ packed form
14736C6112k6542q69K869k391n098N039K0727L1314j6795k0988p32J8697j8058
14723B3285l5781r831J716J4470q40k1116j1629P533Q281J0562L101k7137J5660
14710b1726K2273K4584J0388k8364j4920L5498j698M138j9069o234J4007r987
14698H890k0259q965J461j9614K7316K0635k381o433J921k529J1367R367J8525
14685C9301j4365j1553J6982k80p10l4591j9262P076r179P248L3633N279J4690
14672C4269M165K8377J7136k4970j3669k4414j8746l0600j5718J0796R204J0103
14660a4067L470K4477j156j7682Q33k1145k625j5428R783J2081J4823q182j3734
14647b8552j0977o8n287N068L0743m981n913J2365R946L609J4308k1520K425K3003
$$ plain form
14633 24169 7751 -7627 -13951 -3023 -8354 -17800 -13759 -1214 -189 16587 15581 2612 18556
14620 18556 26495 -6199 -36747 -23510 -12013 -13481 -16003 -29874 -14154 -7255 -56601 -54958 -40081
14607 -40081 -40908 -25802 -22482 -12939 -6883 -2853 -16761 -21496 -5804 -27670 -46697 -53071 -43197
14594 -43197 -56980 -44927 -35819 -31717 -41505 -18276 -21061 -9646 -21680 -4484 -6760 -7263 -40130
14581 -40130 -40943 -31154 -43374 -49513 -45209 -21083 -8160 15492 20605 30607 23597 1626 -1207
14568 -1207 6385 11593 30923 35016 19191 16930 16844 4185 -17518 -34895 -38757 -32180 -36252 -28599
14554 -28599 -22033 -20110 -21913 3738 -16279 -32462 -25009 -19278 -19895 -17338 -5347 -13981 -13955 -16461
14540 -16461 -18649 38269 51638 17072 8631 9943 1025 -59 1097 6088 16089 24339 20971
$$ packed form
14633B4169j6418j5378o324J0928n331r446M041J2545J025J6776j006j2969J5944
14620A8556P939l2694l0548J3237J1497j468k522j3871J5720O899m9346J643J4877
14607d0081q27J5106L320R543O056M030j3908m735J5692k1866j9027o374R874
14594d3197j3783J2053R108M102r788K3229k785J1415j2034J7196k276n03l2867
14581d0130q13R789j2220o139M304K4126J2923K3652N113J0002p010k1971k833
14568a207P592N208J9330M093j5825k261q6j2659k1703j7377l862O577m072P653
14554b8599O566J923j803K5651k0017j6183P453N731o17K557J1991q634K6k506
14540a6461k188N6918J3369l4566q441J312q918j084J156M991J0001Q250l368
$$ plain form
14527 20971 24494 57942 51167 7002 28401 29231 -5897 12058 63221 59540 38548 38326 25049
14514 25049 -4217 30757 23024 18347 44325 50924 30636 36567 56137 67470 53245 17385
14502 17385 -1459 -21730 -12021 -5979 17686 47020 57438 18879 -19080 -26709 -6880 4217
14490 4217 -22001 -18430 8125 13083 3637 30304 31279 23089 37327 50888 35637 23391 33569
14477 33569 17439 13863 39992 29737 1944 -2346 -4538 21286 16477 4285 -3 9492 -463
14464 -463 32953 4416 -7595 -3824 8637 12010 -5092 13520 9687 -25145 -30738 -41627 -43035
14451 -43035 -30137 -22761 -21367 -8430 5737 -5611 7838 11652 -3624 -5150 -44066 -58866
14439 -58866 -54609 -20067 -3932 -7459 11598 9197 -29445 -16098 -1185 13383 5556 5595 24836
$$ packed form
14527B0971L523L3448o775m4165K1399Q30l5128J7955N1163l681k0992k22j3277
14514B5049k9266L4974p733m677K5978O599k0288N931J9570J1333j4225l5860
14502A7385j8844k0271R709O042K3665K9334J0418l8559l7959p629J9829J1097
14490D217k6218L571K6555M958r446K6667R75q190J4238J3561j5251j2246J0178
14477C3569j6130l576K6129j0255k7793m290k192K5824m809j2192m288R495r955
14464d63L3416k8537j2011L771J2461L373j7102J8612l833l4832n593j0889j408
14451d3035J2898P376J394J2937J4167j1348J3449L814j5276j526l8916j4800
14439e8866M257L4542J6135l527J9057k401l8642J3347J4913J4568p827L9J9241
$$ plain form
14426 24836 39607 51927 38807 22075 -4745 -19924 -23527 -11149 39302 55851 70589 73413
14414 73413 48757 40450 35527 20851 27581 31630 11619 242 7414 -442 -16874 -14986 -6996
14401 -6996 14950 31743 20171 7494 4888 -33760 -36084 -19938 1699 -15327 -10141 -3964 -12324
14388 -12324 -34667 -33081 -19236 -30530 -32659 5682 16931 10930 -2161 33831 48960 34137
14376 34137 20895 9004 27087 26010 10990 -15609 -2996 2894 -7 20201 39501 60999
14364 60999 68826 56392 27512 -23611 -56372 -36246 -26710 55 30500 31840 2686 -17928
14352 -17928 -10613 -8854 19756 26489 2287 -21045 -34243 -33756 -22047 3343 29912 31471 32822
14339 32822 5570 -8079 -3594 -6126 -17029 -12050 -19758 -20168 -18778 6269 23794 20706 24532
$$ packed form
14426B4836J4771J2320j3120j6732k6820j5179l603J2378N0451J6549J4738K824
14414G3413k4656q307m923j4676O730M049k0011j1377P172p856j6432J888P990
14401f996K1946J6793j1572j2677k606l8648k324J6146K1637j7026N186O177q360
14388a2324k2343J586J3845j1294k129L8341J1249o001j3091L5992J5129j4823
14376C4137j3242j1891J8083j077j5020k6599J2613N890k901K0208J9300K1498
14364F0999P827j2434k8880n1123l2761K0126R536K6765L0445J340k9154k0614
14352a7928P315J759K8610O733k4202k3332j3198M87J1709K5390K6569J559J351
14339C2822k7252j3649M485k532j0903M979p708m10J390K5047J7525l088L826
$$ plain form
14326 24532 32571 28086 17901 4380 -22223 -22912 -27369 -18502 -36985 -14284 -168 -8243 -22836
14313 -22836 -25467 -12403 -11015 -15663 -14993 1819 23021 9478 22851 37463 30064 10354 7270
14300 7270 27339 58281 57163 42950 64494 56481 48629 67419 73076 43719 24072 -9468 -11884
14287 -11884 -8942 -12467 -4974 -2000 -10176 -16364 -6273 -4436 -15308 -6455 14012 6273 8575 6399
14273 6399 6415 35789 67622 45642 39097 36603 31003 30647 29174 23133 36210 33160 35700 3949
14259 3949 2693 -6512 -16130 -12650 -3668 -5006 -10489 -20742 -30645 -58009 -69763 -36095 -15718
14246 -15718 -2211 24036 16855 15132 -3490 -10269 -4065 -866 8372 11257 14999 12391 15663 50711
14232 50711 69857 69037 46626 50607 64315 45052 38371 41300 21608 27661 43016 51558 41460
$$ packed form
14326B4532Q039m485j0185j3521k6603o89m457Q867j8483K2701J4116q075j4593
14313b2836k631J3064J388m648O70J6812K1202j3543J3373J4612p399j9710l084
14300G270K0069L0942j118j4213K1544q013p852J8790N657k9357j9647l3540k416
14287a1884K942l525P493K974q176o188J0091J837j0872Q853K0467p739K302k176
14273F399J6K9374L1833k1980o545k494n600l56j473o041J3077l050K540l1751
14259C949j256r205r618L480Q982j338n483j0253r903k7364j1754L3668K0377
14246a5718J3507K6247p181j723j8622o779O204L199R238K885L742k608L272L5048
14232E0711J9146q20k2411L981J3708j9263o681K929j9692O053J5355Q542j0098
$$ plain form
14219 41460 51387 38173 5224 28761 44336 44669 7340 11371 34656 39384 32220 56036 35936
14206 35936 32812 39540 20006 18638 32598 18815 21938 26443 8777 9325 25588 27526 18454
14193 18454 32328 53245 58254 31341 19410 19053 18145 11186 5064 -554 18690 18153 -18179 -2717
14179 -2717 30756 17960 3246 -8585 -18535 -21810 12615 1918 -29208 -34079 -11017 1088
14167 1088 -3013 6835 4329 24241 32248 33644 29666 23252 30711 34448 45797 70258 93363 64113
14153 64113 42659 37786 25482 8895 17739 25101 28930 45288 35950 -11582 -36648 4473 57224
14140 57224 90342 88461 60944 16910 12317 50811 50058 84260 46815 44351 71901 65955 38251
14127 38251 37488 32149 45771 29404 10782 10442 10534 27536 6808 -29537 -28338 4400 19120
$$ packed form
14219D1460R927j3214l2949K3537J5575L33l7329M031K3285M728p164K3816k0100
14206C5936l124O728j9534j368J3960j3783L123M505j7666N48J6263J938r072
14193A8454J3874K0917N009k6913j1931l57r08o959o122n618J9244n37l6332J5462
14179b717L3473j2796j4714j1831r950l275L4425j0697l1126m871K3062J2105
14167A088m101R848k506J9912Q007J396l978o414P459L737J1349K4461K3105k9250
14153F4113k1454m873j2304j6587Q844P362L829J6358r338m7532k5066M1121N2751
14140E7224L3118j881k7517m4034m593L8494p53L4202l7445k464K7550n946k7704
14127C8251p63n339J3622j6367j8622l40R2J7002k0728l6345J199L2738J4720
$$ plain form
14114 19120 20048 1944 7767 586 -1757 -14826 -2073 -8790 -9900 -1835 -3764 -281 6646 9049
14100 9049 48369 54369 33663 28761 33174 26615 5575 24690 21202 2442 13336 28294 44307
14087 44307 24869 17269 -15158 -26812 17069 33693 38866 35266 17837 5787 31577 41066
14075 41066 33056 9150 -9146 -12552 -13553 26551 50218 54567 38517 55765 52100 17669 -1874
14062 -1874 -17949 -19984 -31779 -25948 -4649 -8728 -40045 -46171 -22023 7958 23301 5417 -22335
14049 -22335 -46491 -58599 -53007 -26386 -16392 -31148 -24139 -6084 857 18770 19413 -1402 7212
14036 7212 34894 65336 38017 27451 17158 16090 24544 33818 30465 29301 28380 4409 1294
14023 1294 -7803 -19985 -8979 8428 26932 18847 -10749 -12128 -19056 -14401 2841 -5587 -19316
$$ packed form
14114A9120R28j8104N823p181k343j3069J2753o717j110Q065j929L483O927K403
14100I049L9320O000k0706m902M413o559k1040J9115l488j8760J0894J4958J6013
14087D4307j9438p600l2427j1654M3881J6624N173l600j7429j2050K5790R489
14075D1066q010k3906j8296l406j001M0104K3667M349j6050J7248l665l4431j9543
14062a874j6075k035j1795N831K1299m079l1317o126K4148K9981J5343j7884k7752
14049b2335k4156j2108N592K6621R994j4756P009J8055O941J7913O43k0815Q614
14036G212K7682L0442k7319j0566j0293j068Q454R274l353j164r21k3971l115
14023A294r097j2182J1006J7407J8504q085k9596j379o928M655J7242q428j3729
$$ plain form
14010 -19316 9431 42802 71558 50218 23559 6431 17894 21991 31838 28939 27683 54677
13998 54677 61249 26250 23530 31724 35768 23432 29083 38515 5558 19781 9298 -3623 -6795
13985 -6795 -10671 -3623 15909 59997 53403 36291 9545 -18743 -24251 -16048 -446 23651 40801
13972 40801 63401 67549 52930 23527 4457 4671 -32353 -52713 -39413 -29816 -19932 6282 421
13959 421 -8926 -7034 -6907 -15914 -32061 -12175 -6808 -2032 23884 38057 21971 13350 45742 41509
13945 41509 14852 23449 23138 61005 54234 32238 32270 29089 41185 29687 18372 34529 45846
13932 45846 54540 43177 27728 33480 50914 65447 51289 24195 26296 13321 -2266 -2676 8904
13919 8904 30575 35090 12345 -6241 -37018 -34055 -34566 -15646 -11334 -19383 -9401 14335 34754
$$ packed form
14010a9316K8747L3371K8756k1340k6659j7128J1463M097R847k899j256K6994
13998E4677O572l4999k720Q194M044j2336N651R432l2957J4223j0483j2921l172
13985f795l876P048J9532M4088o594j7112k6746k8288n508Q203J5602K4097J7150
13972D0801K2600M148j4619k9403j9070K14l7024k0360J3300R597R884K6214n861
13959D21r347J892J27r007j6147J9886N367M776K5916J4173j6086q621L2392m233
13945D1509k6657Q597l11L7867o771k1996L2l181J2096j1498j1315J6157J1317
13932D5846Q694j1363j5449N752J7434J4533j4158k7094K101j2975j5587m10J1580
13919H904K1671M515k2745j8586l0777K963n11J8920M312q049R982K3736K0419
$$ plain form
13906 34754 29970 18681 24379 39205 30794 36155 11115 6259 14081 12020 17999 13912 23067 40172
13892 40172 53306 34754 44318 58962 62737 62989 83380 89546 85304 81978 73718 38355 40030
13879 40030 25624 10756 24564 36324 28460 23777 37029 39078 34641 44034 20312 6775 20713
13866 20713 -13371 -12875 16307 9668 -8580 -3798 -5526 2196 7685 8671 19419 30715 66289
13853 66289 70753 45047 19310 19113 22544 36071 14043 12765 72 -13066 -8029 7702 6758
13840 6758 -8355 -13334 -7808 20755 32417 23339 31668 8898 -10088 -8265 -13020 -7274 555
13827 555 23876 45429 35200 25045 29608 -2527 10853 17386 14528 8284 10814 4684 -33120
13814 -33120 -40652 -31182 -13844 -20555 -13956 1670 24834 19815 21880 34502 18503 6084 9684
$$ packed form
13906C4754m784j1289N698J4826q411N361k5040m856P822k061N979m087R155J7105
13892D0172J3134j8552R564J4644L775K52K0391O166m242l326q260l5363J675
13879D0030j4406j4868J3808J1760p864m683J3252K049m437R393k3722j3537J3938
13866B0713l4084M96K9182o639j8248M782j728P722N489R86J0748J1296L5574
13853F6289M464k5706k5737j97L431J3527k2028j278j2693j3138N037J5731r44
13840F758j5113m979N526K8563J1662r078Q329k2770j8986J823m755N746P829
13827E55K3321K1553j0229j0155M563l2135J3380O533k858o244K530o130l7804
13814c3120p532R470J7338o711O599J5626K3164n019K065J2622j5999j2419L600
$$ plain form
13801 9684 31446 38219 37785 23721 11131 29009 27540 22876 47615 65679 47747 37399 45475
13788 45475 53357 25683 36210 54881 51287 46276 40307 36728 42372 56119 5412 -6333 -15342
13775 -15342 -28429 -20713 -22262 -2894 21214 18095 32948 48908 51969 49763 20432 23613 22283
13762 22283 663 -8497 -18360 -11066 20994 27651 26900 33854 6086 3724 8610 24607 29687 25728
13748 25728 25851 57855 76264 61363 55814 56095 62894 52779 47052 50158 70700 46604 22247
13735 22247 32297 21422 9402 3222 19940 54911 46625 35300 29606 22554 31220 20690 33961
13722 33961 54077 49337 -1689 -28603 -15542 -5706 6175 -24605 -40847 -28190 -12991 -5717
13710 -5717 -10553 10818 39151 39370 55600 40497 49425 51342 21450 -39462 -43824 -25954 -32476
$$ packed form
13801I684K1762O773m34j4064j2590J7878j469m664K4739J8064j7932j0348Q076
13788D5475P882k7674J0527J8671l594n011n969l579N644J3747n0707j1745r009
13775a5342j3087P716j549J9368K4108l119J4853J5960L061k206k9331L181j330
13762B2283k1620r160r863P294L2060O657p51O954k7768k362M886J5997N080l959
13748B5728J23L2004J8409j4901n549K81O799j0115n727L106K0542k4096k4357
13735B2247J0050j0875j2020o180J6718L4971q286j1325n694p052Q666j0530J3271
13722C3961K0116m740n1026k6914J3061R836J1881l0780j6242J2657J5199P274
13710e717m836K1371K8333K19J6230j5103Q928J917k9892o0912m362J7870o522
$$ plain form
13697 -32476 3608 36907 41147 28023 46312 75783 58812 24115 27943 37746 31467 9793
13685 9793 -7225 3800 23377 25757 13172 21491 52826 59837 32920 24335 43447 55741 57900
13672 57900 38240 32214 23145 14445 34460 46031 41198 60600 73554 67945 48580 32834 22820
13659 22820 42022 73350 85900 59858 40822 31546 36997 59112 76944 64104 20243 2891
13647 2891 -205 22341 53108 76474 84569 70061 46842 35969 49596 54264 60503 49065 50281
13634 50281 59683 55490 54094 42288 43885 60045 69839 64017 88097 68942 38183 5248 20261
13621 20261 46948 56314 49671 55768 30177 56713 21625 12122 34842 49341 32765 28229 44726
13608 44726 49518 12433 1221 13802 23748 17821 38156 65099 58014 43049 44017 27130 13346
$$ packed form
13697c2476L6084L3299M240j3124J8289K9471j6971l4697L828R803o279k1674
13685I793j7018J1025J9577K380j2585Q319L1335P011k6917q585J9112J2294K159
13672E7900j9660o026r069q700K0015J1571m833J9402J2954n609j9365j5746j0014
13659B2820J9202L1328J2550k6042j9036r276N451K2115J7832j2840m3861j7352
13647B891l096K2546L0767K3366Q095j4508k3219j0873J3627M668O239j1438J216
13634E0281R402m193j396j1806J597J6160R794n822K4080j9155l0759l2935J5013
13621B0261K6687R366o643O097k5591K6536l5088r503K2720J4499j6576m536J6497
13608D4726M792l7085j1212J2581R946n927K0335K6943p085j4965R68j6887j3784
$$ plain form
13595 13346 31683 27582 25851 29385 20999 16432 42093 79088 62102 46430 27272 18485 23372
13582 23372 29203 50273 57129 60864 62146 44099 38377 34800 20761 6055 8047 30271 48508
13569 48508 66086 48920 54113 67882 63770 47456 15534 5153 11751 19480 22747 28504 27996
13556 27996 25136 11818 918 591 37233 5816 6518 36228 54546 41389 55973 56528 66091
13543 66091 53245 54173 60696 65300 76010 81100 94118 65359 20522 36439 51144 60693 63833
13530 63833 59190 87164 80831 41473 28728 45781 64900 64986 50711 36024 26459 13733 21267
13517 21267 22069 -3640 24987 65453 93244 108740 125342 125723 123171 117874 78560 44317 39478
13504 39478 72271 71261 82275 114641 100142 79660 77493 82267 101879 95916 64940 51301
$$ packed form
13595A3346J8337m101j731L534q386m567K5661L6995j6986j5672j9158q787M887
13582B3372N831K1070O856L735J282j8047n722l577j4039j4706J992K2224J8237
13569D8508J7578j7166N193J3769m112j6314l1922j0381O598P729L267N757n08
13556B7996k860j3318j0900l27L6642l1417P02K9710J8318j3157J4584N55R563
13543F6091j2846R28O523M604J0710N090J3018k8759m4837J5917J4705R549L140
13530F3833m643K7974o333l9358j2745J7053J9119Q6j4275j4687r565j2726P534
13517B1267Q02k5709K8627M0466K7791J5496J6602L81k552n297l9314l4243m839
13504C9478L2793j010J1014L2366j4499k0482k167M774J9612n963l0976j3639
$$ plain form
13492 51301 45062 46798 65840 63242 53749 31600 31429 42566 44694 35510 19647 25634 46849
13479 46849 30999 73 -3881 30669 53926 54028 43526 28206 19117 30446 40447 27899
13467 27899 24397 53490 64471 58992 27286 3325 -7039 -16540 38443 43997 29493 22529 22328
13454 22328 42574 27589 36830 29152 9140 -3000 -1627 19468 40988 40747 41404 43063 24645
13441 24645 -1457 18850 41079 50821 75103 76790 74721 60166 61838 40120 54574 43551
13429 43551 54185 64923 58187 56630 42370 45806 50482 62331 71406 77297 69318 59897 55687
13416 55687 61642 62002 89341 110219 99887 90970 79181 75505 71085 75156 70126 91701 126190
13403 126190 150903 145381 127853 107267 80265 70846 94263 108745 102170 91387 74546 70981
$$ packed form
13492E1301o239J736J9042k598r493k2149j71J1137K128r184j5863N987K1215
13479D6849j5850l0926l954L4550K3257J02j0502j5320r089J1329J0001j2548
13467B7899l502K9093J0981n479l1706k3961j0364r501N4983N554j4504o964k01
13454B2328K0246j4985R241p678k0012j2140J373K1095K1520k41O57J659j8418
13441B4645k6102K0307K2229R742K4282J687k069j4555J672k1718J4454j1023
13429D3551J0634J0738o736j557j4260L436M676J1849R075N891p979r421m210
13416E5687N955L60K7339K0878j0332q917j1789l676m420M071n030K1575L4489
13403A26190K4713n522j7528k0586k7002r419K3417J4482o575j0783j6841l565
$$ plain form
13391 70981 50281 46360 65399 79199 71926 87021 101233 99538 91777 84031 73631 38842 6933
13378 6933 1248 -9996 2956 35482 66637 79190 72795 87929 82819 98535 126486 134588 115131
13365 115131 94290 90968 105067 117652 95922 73740 43800 43654 51204 43891 44368 75233 65660
13352 65660 76525 72408 58601 21779 17815 54551 74801 73721 61574 45688 32717 35848
13340 35848 35816 23825 22801 49078 43534 36228 38931 73749 108139 108088 117212 101886 73737 81902
13326 81902 80980 83154 73211 64462 48333 51691 85428 90790 109146 117953 89999 76675 59115
13313 59115 42512 60082 75858 88134 119707 151450 135208 106212 102441 93747 82853 63386
13301 63386 61818 75143 88489 84747 92269 85880 73980 56454 34332 35549 48479 60359 71832
$$ packed form
13391G0981k0700l921J9039J3800p273J5095J4212j695p761p746j0400l4789l1909
13378F933n685j1244J2952L2526L1155J2553o395J5134n110J5716K7951Q102j9457
13365A15131k0841l322J4099J2585k1730k2182k9940j46P550p313M77L0865r573
13352F5660J0865m117j3807l6822l964L6736K0250j080j2147j5886j2971L131
13340C5848l2j1991j024K6277n544p306K703L4818L4390n1R124j5326k8149Q165
13326H1902r22K174r943q749j6129L358L3737N362J8356Q807k7954j3324j7560
13313E9115j6603J7570J5776J2276L1573L1743j6242k8996l771q694j0894j9467
13301F3386j568J3325J3346l742P522o389j1900j7526k2122J217J2930J1880J1473
$$ plain form
13288 71832 72541 50297 68350 81011 72768 67794 73758 72620 60613 80195 82005 47758 63985
13275 63985 80190 87362 82635 78830 90290 84338 91637 84369 58388 86139 82863 84870 116154
13262 116154 115856 70166 65721 69863 61065 36974 63435 80078 72176 46831 64635 100022 98315
13249 98315 74897 62328 45632 56779 74061 94837 70592 61123 80745 80412 84841 58364
13237 58364 55275 52043 55744 84832 87466 95078 98634 118013 119863 108810 93213 76539 74666
13224 74666 90687 78534 64076 78830 75170 91758 114646 101127 119024 133670 136487 142865
13212 142865 149566 128793 124509 161032 207899 239914 243610 275443 299227 310153 291909 248705
13200 248705 213193 183102 176557 168510 147852 145610 190821 194030 152484 133344 143062 136948 120904
$$ packed form
13288G1832P09k2244J8053J2661q243m974N964j138j2007J9582J810l4247J6227
13275F3985J6205P172m727l805J1460n952P299p268k5981K7751l276K007L1284
13262A16154k98m5690m445M142q798k4091K6461J6643p902k5345J7804L5387j707
13249I8315k3418j2569j6696J1147J7282K0776k4245r469J9622l33M429k6477
13237E8364l089l232L701K9088K634P612L556J9379J850j1053j5597j6674j873
13224G4666J6021j2153j4458J4754l660J6588K2888j3519J7897J4646K817O378
13212A42865O701k0773m284L6523M6867L2015L696L1833K3784J0926j8244m3204
13200B48705l5512l0091o545q047k0658k242M5211L209m1546j9140R718o114j6044
$$ plain form
13187 120904 143163 149718 189188 251757 295852 315589 329036 350586 350981 322046 276550 268181
13175 268181 227045 228520 255705 248237 233243 223736 242508 284244 301579 301205 281526 273179 271250
13162 271250 279175 257572 230904 203126 177221 171747 182405 165008 151637 168029 176360 180833
13150 180833 193825 233462 275907 301113 312833 308854 320348 340160 340239 334027 343724 339094 335192
13137 335192 314366 282630 288295 311499 333304 361026 393141 458539 505827 535408 543752 538709
13125 538709 502276 490177 453595 407589 372385 348613 329542 321701 349460 342112 306230 295743
13113 295743 321116 334156 327561 338451 349512 392315 439972 478420 508389 562922 597804 577151
13101 577151 562402 538096 508321 480712 481360 477140 498741 520481 572667 619739 646354 708837
$$ packed form
13187A20904K2259O555L9470O2569M4095J9737J3447K1550L95k8935m5496q369
13175B68181m1136J475K7185p468j4994r507J8772M1736J7335l74j9679q347j929
13162B71250P925k1603k6668k7778k5905n474J0658j7397j3371J6392Q331M473
13150A80833J2992L9637M2445K5206J1720l979J1494J9812P9o212R697m630l902
13137C35192k0826l1736N665K3204K1805K7722L2115O5398M7288K9581Q344n043
13125E38709l6433j2099l6582m6006l5204k3772j9071p841K7759p348l5882j0487
13113B95743K5373J3040o595J0890J1061M2803M7657L8448K9969N4533L4882k0653
13101E77151j4749k4306k9775k7609O48m220K1601K1740N2186M7072K6615O2483
$$ plain form
13089 708837 720569 690066 657855 606794 547252 474981 415819 377894 346790 342911 335575 339903
13077 339903 352698 356639 341046 359384 383715 380262 418079 478556 523058 566711 593859 606920
13065 606920 597178 564277 563127 519890 442643 378828 364143 359981 341407 354988 334111 325260
13053 325260 299710 286882 279319 275080 241863 239744 226403 210337 194847 224974 238386 219650
13041 219650 215888 225604 214616 191811 167016 157483 164362 186084 191456 180023 188181 192403 210562
13028 210562 259029 279103 284910 292347 311323 350557 383018 437781 528034 625337 724651 791365
13016 791365 772530 732088 649148 561276 518046 457159 413072 450105 481611 463831 448962
13005 448962 459154 477150 502350 534663 590499 663876 746248 833293 892600 892674 839433 739591
$$ packed form
13089G08837J1732l0503l2211n1061n9542p2271n9162l7925l1104l879p336M328
13077C39903J2795L941j5593J8338K4331l453L7817O0477M4502M3653K7148J3061
13065F06920r742l2901j150m3237p7247o3815j4685m162j8574J3581k0877q851
13053C25260k5550j2828p563m239l3217k119j3341j6066j5490L0127J3412j8736
13041B19650l762R716j0988k2805k4795r533O879K1722N372j1433Q158M222J8159
13028B10562M8467K0074N807P437J8976L9234L2461N4763R0253R7303R9314O6714
13016G91365j8835m0442q2940q7872m3230o0887m4087L7033L1506j7780j4869
13005D48962J0192J7996K5200L2313N5836P3377Q2372Q7045N9307P4n3241r9842
$$ plain form
12993 739591 643481 558163 489490 440099 409965 404455 406299 395955 372017 377925 413849 397935
12981 397935 381112 375235 374513 395318 426270 433732 420368 411829 437731 497216 505206 515056 580118
12968 580118 662747 750858 812636 821131 800818 747628 649107 562333 490002 460358 451621 421712
12956 421712 423216 439753 411650 379883 415338 457185 517450 577438 635344 707151 754141 793261
12944 793261 834000 820839 750542 702058 641016 599517 540936 480976 448899 408307 370037
12933 370037 364128 375034 376025 333996 337175 367379 379770 372674 369169 354549 360065 429489 466543
12920 466543 495794 477154 441880 427299 418992 387628 366137 347632 314754 275561 278909 267966
12908 267966 278774 310928 338150 345861 342234 346241 373120 361109 333878 361383 381212 387891
$$ packed form
12993G39591r6110q5318o8673m9391l0134n510J844j0344k3938N908L5924j5914
12981C97935j6823n877p22K0805L0952P462j3364q539K5902N9485P990R850O5062
12968E80118Q2629Q8111O1778Q495k0313n3190r8521q6774p2331k9644q737k9909
12956D21712J504J6537k8103l1767L5455M1847O0265N9988N7906P1807M6990L9120
12944G93261M0739j3161p0297m8484o1042m1499n8581n9960l2077m0592l8270
12933C70037n909J0906R91m2029L179L0204J2391p096l505j4620N516O9424L7054
12920D66543K9251j8640l5274j4581q307l1364k1491j8505l2878l9193L348j0943
12908B67966J0808L2154K7222P711l627M007K6879j2011k7231K7505J9829O679
$$ plain form
12896 387891 377237 368018 391410 414986 466902 516829 566843 604269 608679 579370 563629 524002
12884 524002 491394 440528 415900 424579 436464 431390 452853 452648 436259 426657 450037 479551
12872 479551 515352 578984 594669 608191 598575 572355 561978 523914 505586 493102 493765 478237
12860 478237 447141 448304 452805 430021 412099 424713 440524 475426 491108 471053 484843 487848
12848 487848 480575 462465 453376 435177 412357 433077 433823 430187 436862 439516 473147 483633 489940
12835 489940 488491 465510 455547 440977 435564 429906 418907 441324 466137 488664 506974 509047
12823 509047 544787 580817 598845 620960 665073 688059 692347 703477 707529 713430 723832 771914
12811 771914 828797 895996 956311 995877 1026317 1059448 1052125 1050786 1039328 1025749 1041122 1050782
$$ packed form
12896C87891j0654r219K3392K3576N1916M9927N0014L7426M410k9309j5741l9627
12884E24002l2608n0866k4628Q679J1885n074K1463k05j6389r602K3380K9514
12872D79551L5801O3632J5685J3522r616k6220j0377l8064j8328j2484O63j5528
12860D78237l1096J163M501k2784j7922J2614J5811L4902J5682k0055J3790L005
12848D87848p273j8110r089j8199k2820K0720P46l636O675K654L3631J0486O307
12835D89940j449k2981r963j4570n413n658j0999K2417K4813K2527J8310K073
12823E09047L5740L6030J8028K2115M4113K2986M288J1130M052N901J0402M8082
12811G71914N6883O7199O0315L9566L0440L3131p323j339j1458j3579J5373R660
$$ plain form
12799 1050782 1045037 1041701 1036790 1002486 980838 986986 988939 1000027 1028851 1055639 1098627 1130507
12787 1130507 1142114 1181990 1245622 1281707 1346951 1429839 1493842 1540876 1622560 1715067 1827182
12776 1827182 1937704 2005065 2083118 2168518 2261532 2353863 2455443 2615737 2775812 2938134
12766 2938134 3172550 3436789 3745492 4099929 4562175 5139999 5925381 6882244 8065539
12757 8065539 9415083 11047640 13157629 16007319 19743308 24218896 28946700 33075193
12749 33075193 35642489 36095936 34426291 31040245 26668260 22134240 18184920 15113067
12741 15113067 12916958 11459945 10555993 10175226 10183412 10585468 11396780 12650135 14345231
12732 14345231 16512255 19274036 22731124 26899316 31723787 36794593 41313809 44510201
$$ packed form
12799A050782n745l336m911l4304k1648O148J953J1088K8824K6788M2988L1880
12787A130507J1607L9876O3632L6085O5244Q2888O4003M7034Q1684R2507J12115
12776A827182J10522O7361P8053Q5400R3014R2331J01580J60294J60075J62322
12766B938134K34416K64239L08703L54437M62246N77824P85382R56863J183295
12757H065539J349544J632557K109989K849690L735989M475588M727804M128493
12749C3075193K567296M53447j669645l386046m371985m534020l949320l071853
12741A5113067k196109j457013r03952l80767Q186M02056Q11312J253355J695096
12732A4345231K167024K761781L457088M168192M824471N070806M519216L196392
$$ plain form
12724 44510201 45574556 44107845 40554137 36129120 32150627 29239299 27541218 26955391
12716 26955391 27468444 29028885 31231332 33523583 35293718 36150484 35820667 34200287
12708 34200287 31326590 27623832 23800699 20436758 17759736 15790119 14435778 13574474
12700 13574474 13059821 12934724 13218076 14017923 15403432 17354829 19823690 22873028 26454335
12691 26454335 30368484 34177067 37530377 40329487 42336159 43057905 42314505 40449779
12683 40449779 38117429 36177569 35449582 36356853 39032173 43334365 49159043 56484226
12675 56484226 64759260 72780316 79131870 82378485 81690647 77681189 71665196 64369075
12667 64369075 56149283 47892268 40613528 34761453 30372334 27381865 25742451 25273526
$$ packed form
12724D4510201J064355j466711l553708m425017l978493k911328j698081n85827
12716B6955391N13053J560441K202447K292251J770135Q56766l29817j620380
12708C4200287k873697l702758l823133l363941k677022j969617j354341q61304
12700A3574474n14653j25097K83352P99847J385509J951397K468861L049338L581307
12691B6454335L914149L808583L353310K799110K006672P21746p43400j864726
12683D0449779k332350j939860p27987R07271K675320M302192N824678P325183
12675E6484226Q275034Q021056O351554L246615o87838m009458o015993p296121
12667F4369075q219792q257015p278740n852075m389119k990469j639414m68925
$$ plain form
12659 25273526 25811767 27351298 29873102 33586096 38757574 45469290 53567328 62444715
12651 62444715 71192368 78994812 85304636 89374730 90022695 86761503 80770871 74179996
12643 74179996 68819111 65798688 65450782 67722531 72500428 79418217 87537919 95241102
12635 95241102 100382088 100976774 96214645 86872447 75061695 63224740 52961698 44675799
12627 44675799 38175187 33069147 29143057 26308166 24504933 23716119 23857601 24970931
12619 24970931 27169829 30568198 35388944 41772622 49798323 59339664 69569927 78830142
12611 78830142 85397572 88113637 86210587 79413332 68605349 56275050 44974370 35952265
12603 35952265 29262820 24360797 20512146 17374934 14813261 12750169 11170085 10026828
$$ packed form
12659B5273526N38241J539531K521804L712994N171478O711716Q098038Q877387
12651F2444715Q747653P802444O309824M070094O47965l261192n990632o590875
12643G4179996n360885l020423l47906K271749M777897O917789Q119702P703183
12635I5241102N140986N94686m762129r342198j1810752j1836955j0263042q285899
12627D4675799o500612n106040l926090k834891j803233p88814J41482J113330
12619B4970931K198898L398369M820746O383678Q025701R541341J0230263R260215
12611G8830142O567430K716065j903050o797255j0807983j2330299j1300680r022105
12603C5952265o689445m902023l848651l137212k561673k063092j580084j143257
$$ plain form
12595 10026828 9256823 8765527 8385557 8110301 7944299 7855346 7832781 7864783 8014549 8266750
12585 8266750 8603898 9098985 9726500 10489471 11489171 12793026 14499211 16753151 19632475
12576 19632475 23323507 28033907 34022959 41736105 51653769 63982906 77686285 89930845
12568 89930845 96902773 96052281 87630128 74546298 60639695 48696163 39740354 33695433
12560 33695433 30012765 28201438 28031438 29441070 32500646 37294542 43822082 51861383
12552 51861383 61313176 72442033 84893870 96133979 101888413 99111295 88782549
12545 88782549 74601342 60064988 47423997 37521736 30195285 24821377 20863315 18009970
12537 18009970 16087928 14887941 14177309 13846406 13804495 13967692 14287093 14780966 15525675
$$ packed form
12595A0026828p70005m91296l79970k75256j66002q8953k2565L2002J49766K52201
12585H266750L37148M95087O27515P62971R99700J303855J706185K253940K879324
12576A9632475L691032M710400N989052P713146R917664J2329137J3703379J2244560
12568H9930845O971928q50492q422153j3083830j3906603j1943532q955809o044921
12560C3695433l682668j811327j70000J409632L059576M793896O527540Q039301
12552E1861383R451793J1128857J2451837J1240109N754434k777118j0328746
12545H8782549j4181207j4536354j2640991r902261p326451n373908l958062k853345
12537A8009970j922042j199987p10632l30903m1911J63197L19401M93873P44709
$$ plain form
12528 15525675 16676891 18449463 20958940 24360007 28816941 34560301 41740581 50528577
12520 50528577 61111188 73350155 85635768 94445747 96444228 91460168 82105247 70846690
12512 70846690 59229982 48668673 40392135 34811096 31746208 30807842 31745547 34523538
12504 34523538 39270978 46164071 55105140 65692027 77408156 89526638 100587059
12497 100587059 108372862 110844235 107593809 100424258 91784737 82723620 73277380 63673416
12489 63673416 54457838 45987877 38435749 31895772 26490807 22411923 19569435 17746175
12481 17746175 16742246 16433564 16810809 18022776 20259374 23660678 28110305 32895247
12473 32895247 36920364 39140605 38809145 35968693 31520729 26640519 22135303 18423722
$$ packed form
12528A5525675J151216J772572K509477L401067M456934N743360P180280Q787996
12520E0528577J0582611J2238967J2285613Q809979J998481m984060r354921j1258557
12512G0846690j1616708j0561309q276538n581039l064888r38366R37705K777991
12504C4523538M747440O893093Q941069J0586887J1716129J2118482J1060421
12497A00587059P785803K471373l250426p169551q639521r061117r446240r603964
12489F3673416r215578q469961p552128o539977n404965m078884k842488j823260
12481A7746175j003929l08682L77245J211967K236598L401304M449627M784942
12473C2895247M025117K220241l31460k840452m447964m880210m505216l711581
$$ plain form
12465 18423722 15455576 13134714 11403679 10156177 9178351 8422092 7842504 7454838 7221873
12456 7221873 7109704 7072104 7160409 7344633 7654070 8150700 8945944 10115851 11753688
12447 11753688 13925574 16802034 20685552 25763655 31945676 38618381 44292961 47136038
12439 47136038 46112139 41792458 35982218 30365553 25665569 21749638 18393001 15730229
12431 15730229 13906568 13007845 12943893 13658884 15170954 17670606 21359035 26422995 32738805
12422 32738805 39204350 43844728 44888351 41974799 36285753 29657654 23537770 18574011
12414 18574011 14778330 11877975 9680822 8002954 6749947 5778975 5010971 4395168
12406 4395168 3877840 3478959 3149159 2861498 2585988 2339697 2131490 1988144 1920799 1854090
$$ packed form
12465A8423722k968146k320862j731035j247502r77826p56259n79588l87666k32965
12456G221873j12169l7600Q8305J84224L09437M96630P95244J169907J637837
12447A1753688K171886K876460L883518N078103O182021O672705N674580K843077
12439D7136038j023899m319681n810240n616665m699984l915931l356637k662772
12431A5730229j823661q98723o3952P14991J512070K499652L688429N063960O315810
12422C2738805O465545M640378J043623k913552n689046o628099o119884m963759
12414A8574011l795681k900355k197153j677868j253007r70972p68004o15803
12406D395168n17328l98881l29800k87661k75510k46291k08207j43346o7345o6709
$$ plain form
12396 1854090 1822400 1796724 1741374 1699620 1659982 1623249 1578621 1563489 1580079 1597059 1593226
12385 1593226 1587166 1544195 1482919 1405881 1387313 1372350 1357618 1366381 1390126 1358303 1302676 1227959
12373 1227959 1194233 1187873 1200887 1219514 1252528 1276706 1253842 1172560 1077298 1007411 914999
12362 914999 850108 804704 770601 753534 705807 629543 591635 569691 550200 511968 452686
12351 452686 420764 428788 429537 442737 415750 417841 432907 439549 441885 411228 375968 342749 340121
12338 340121 346496 351861 352147 356921 351094 342004 328873 293480 284948 289767 251773 247515 266031
12325 266031 292395 318184 315893 342959 363490 399805 429444 445649 445235 421650 411988 373266
12313 373266 309436 284470 270713 262102 262608 284294 289138 312179 353586 398382 434558 472318
$$ packed form
12396A854090l1690k5676n5350m1754l9638l6733m4628j5132J6590J6980l833
12385A593226o060m2971o1276p7038j8568j4963j4732Q763K3745l1823n5627p4717
12373A227959l3726o360J3014J8627L3014K4178k2864q1282r5262o9887r2412
12362I14999o4891m5404l4103j7067m7727p6264l7908k1944j9491l8232n9282
12351D52686l1922Q024P49J3200k6987K091J5066O642K336l0657l5260l3219k628
12338C40121O375N365K86M774n827r090j3131l5393q532M819l7994m258J8516
12325B66031K6364K5789k291K7066K0531L6315K9639J6205m14k3585r662l8722
12313C73266o3830k4966j3757q611N06K1686M844K3041M1407M4796L6176L7760
$$ plain form
12301 472318 487867 483709 463028 416505 376101 326152 316395 305169 321813 326333 298855 299536
12289 299536 322828 363176 363484 353645 340158 315390 270115 239443 216259 201165 183852 190798
12277 190798 199342 190824 204548 192041 185634 194283 237502 265233 285608 263607 254881 282049
12265 282049 305201 323098 352237 370636 358483 317668 306638 271479 254167 259917 263627 263125
12253 263125 248930 265024 284079 298069 283436 275142 254734 247569 241983 240092 241113 221523
12241 221523 185811 179840 179236 172340 176958 194440 210881 204437 182246 156108 186376 225006 226182
12228 226182 243758 276792 281993 306731 327537 362334 382858 359754 353965 336739 314841 305871
12216 305871 332811 375702 418912 453539 472181 513280 527716 506771 478334 428878 399684
$$ packed form
12301D72318J5549m158k0681m6523m0404m9949r757j1226J6644M520k7478O81
12289B99536K3292M0348L08r839j3487k4768m5275l0672k3184j5094j7313O946
12277A90798Q544q518J3724j2507o407Q649M3219K7731K0375k2001q726K7168
12265B82049K3152J7897K9139J8399j2153m0815j1030l5159j7312N750L710n02
12253B63125j4195J6094J9055J3990j4633q294k0408p165n586j891J021j9590
12241B21523l5712n971o04o896M618J7482J6441o444k2191k6138L0268L8630J176
12228B26182J7576L3034N201K4738K0806L4797K0524k3104n789j7226k1898q970
12216C05871K6940M2891M3210L4627J8642M1099J4436k0945k8437m9456k9194
$$ plain form
12205 399684 369681 317860 288236 275138 232042 220389 220551 186940 172584 188773 208828 232855
12193 232855 244340 245315 296440 361196 419998 485445 544138 580865 552624 498684 477331 440610
12181 440610 416351 411898 403672 418234 425480 462432 508142 552733 584973 582713 583750 524521
12169 524521 455345 376369 316624 307494 288361 286263 267545 260073 245199 264310 242623 205880
12157 205880 220670 274493 306366 348577 374297 372007 374614 432337 487685 496263 500821 497421
12145 497421 485181 391825 282567 184372 168574 136541 122492 116744 97490 97232 100869 98927
12133 98927 76979 78642 76672 72654 74557 77081 80770 101184 131554 153247 157694 170047 194168
12120 194168 221988 216856 216641 273125 335987 402866 458574 499342 509859 532875 537490 468925
$$ packed form
12205C99684l0003n1821k9624j3098m3096j1653J62l3611j4356J6189K0055K4027
12193B32855J1485R75N1125O4756N8802O5447N8693L6727k8241n3940k1353l6721
12181D40610k4259m453q226J4562P246L6952M5710M4591L2240k260J037n9229
12169E24521o9176p8976n9745r130j9133k098j8718p472j4874J9111k1687l6743
12157B05880J4790N3823L1873M2211K5720k290K607N7723N5348Q578M558l400
12145D97421j2240r3356j09258r8195j5798l2033j4049n748j9254k58L637j942
12133I8927k1948J663j970m018J903K524L689K0414L0370K1693M447J2353K4121
12120A94168K7820n132k15N6484O2862O6879N5708M0768J0517K3016M615o8565
$$ plain form
12108 468925 404358 365136 310408 261118 232787 206932 177837 173567 199169 225771 264005 275894
12096 275894 307001 411903 522934 577474 605780 569103 509709 441696 371264 300788 228925
12085 228925 146741 89737 75798 92603 85682 89227 98392 116203 123224 107288 107102 125150 139627
12072 139627 132015 117888 113892 139542 137787 155298 226129 292023 320553 412541 513532 534579
12060 534579 528497 473640 427851 372232 313351 272063 216193 188779 214688 222355 217117 204060
12048 204060 223862 243693 280723 330529 400182 466126 569503 608753 615374 592641 570401
12037 570401 501074 415959 372496 330728 290064 226968 161466 146543 163492 161991 154209 141005
12025 141005 125959 117532 116148 122224 125161 139530 149737 177165 186487 187042 217823 223841 219408
$$ packed form
12108D68925o4567l9222n4728m9290k8331k5855k9095m270K5602K6602L8234J1889
12096B75894L1107J04902J11031N4540K8306l6677n9394o8013p0432p0476p1863
12085B28925q2184n7004j3939J6805o921L545R165J7811P021j5936j86J8048J4477
12072A39627p612j4127l996K5650j755J7511P0831O5894K8530R1988J00991K1047
12060E34579o082n4857m5789n5619n8881m1288n5870k7414K5909P667n238j3057
12048B04060J9802J9831L7030M9806O9653O5944J03377L9250O621k2733k2240
12037E70401o9327q5115m3463m1768m0664o3096o5502j4923J6949j501p782j3204
12025A41005j5046q427j384O076K937J4369J0207K7428R322N55L0781O018m433
$$ plain form
12012 219408 201112 173750 147056 108908 54871 9405 -988 8096 30878 17410 6251 21044
$$ packed form
12012B19408j8296k7362k6694l8148n4037m5466j0393R084K2782j3468j1159J4793
$$ [...]
##END NTUPLES=NMR SPECTRUM
##END=
