##TITLE=Analysis number 329390
Compound Code cc 62204
Book Reference 518/169
Project Code adrs
Chemist Name colinb
##JCAMPDX= 6.0         $$ Bruker NMR JCAMP-DX V2.0
##DATA TYPE= NMR SPECTRUM
##DATA CLASS= NTUPLES
##ORIGIN= Bruker BioSpin GmbH
##OWNER= nmr
$$ XWIN-NMR		Version 3.5
$$ Tue Aug 28 11:52:55 2007 GMT Daylight Time (UT+1h)  MAYBRIDGE\nmr@NMR_250MHZ
##.OBSERVE FREQUENCY= 250.131544655141
##.OBSERVE NUCLEUS= ^1H
##.ACQUISITION MODE= SIMULTANEOUS (DQD)
##.ACQUISITION SCHEME= undefined
##.AVERAGES= 16
##.DIGITISER RES= 18
##SPECTROMETER/DATA SYSTEM= dpx250
##.PULSE SEQUENCE= zg30
##.SOLVENT NAME= CDCl3
##.SHIFT REFERENCE= (INTERNAL, CDCl3, 0, 16.522)
##AUDIT TRAIL= $$ (NUMBER, WHEN, WHO, WHERE, WHAT)
$$ ##TITLE= Audit trail, XWIN-NMR		Version 3.5
$$ ##JCAMPDX= 5.01
$$ ##ORIGIN= Bruker BioSpin GmbH
$$ ##OWNER= nmr
$$ C:\u/data/dgb/nmr/ADRS/1140/pdata/1/auditp.txt
$$ ##AUDIT TRAIL=  $$ (NUMBER, WHEN, WHO, WHERE, WHAT)
(   1,<2007-08-28 11:51:45.87 +100>,<MAYBRIDGE\nmr>,<NMR_250MHZ>,
      <created by zg, POWCHK disabled, PULCHK disabled
       configuration hash MD5:
       76 6E 9A 78 1E 09 19 81 EC 84 63 8F B0 6A 59 2D
       data hash MD5: 64K
       0B 31 BD 32 94 5A 13 C1 05 6C 05 47 FB DA 1A 5A>)
(   2,<2007-08-28 11:52:15.15 +100>,<MAYBRIDGE\nmr>,<NMR_250MHZ>,
      <Start of raw data processing
       ef LB = 0.3 FT_mod = 6 PKNL = 1 SI = 32K 
       data hash MD5: 32K
       36 BF EF B8 4F 0D BF BD B2 C5 5E DE 51 59 A4 24>)
(   3,<2007-08-28 11:52:20.39 +100>,<MAYBRIDGE\nmr>,<NMR_250MHZ>,
      <apk 
       data hash MD5: 32K
       28 55 FF E5 BA E5 7D AB D7 EC 56 40 6B 1F 66 48>)
(   4,<2007-08-28 11:52:25.31 +100>,<MAYBRIDGE\nmr>,<NMR_250MHZ>,
      <abs ABSG = 5 
       data hash MD5: 32K
       04 C4 96 01 89 C4 BC 3D 68 A3 BC 67 93 37 29 54>)
$$ ##END=
$$ 
$$ hash MD5
$$ E9 09 81 2B F9 67 15 B0 7D 02 EB 20 0E CF 4F 5A
##$RELAX= 
##$RELAX= 
##$RELAX= 
##$RELAX= 
##$RELAX= 
##$RELAX= 
##$RELAX= 
$$ Bruker specific parameters
$$ --------------------------
##$DU= <C:\u>
##$EXPNO= 1140
##$NAME= <ADRS>
##$PROCNO= 1
##$TYPE= <nmr>
##$USER= <dgb>
##$AMP= (0..31)
100 100 100 100 100 100 100 100 100 100 100 100 100 100 100 100 100 100 
100 100 100 100 100 100 100 100 100 100 100 100 100 100 
##$AQSEQ= 0
##$AQ_mod= 3
##$AUNM= <au_zg>
##$AUTOPOS= <31 >
##$BF1= 250.13
##$BF2= 250.13
##$BF3= 250.13
##$BF4= 250.13
##$BF5= 500.13
##$BF6= 500.13
##$BF7= 500.13
##$BF8= 500.13
##$BYTORDA= 1
##$CFDGTYP= 0
##$CFRGTYP= 5
##$CHEMSTR= <none>
##$CNST= (0..31)
1 1 145 1 1 1 1 1 1 1 1 1 1 1 1 1 1 1 1 1 1 1 1 1 1 1 1 1 1 1 1 1 
##$CPDPRG= <>
##$CPDPRG1= <>
##$CPDPRG2= <>
##$CPDPRG3= <>
##$CPDPRG4= <mlev>
##$CPDPRG5= <mlev>
##$CPDPRG6= <mlev>
##$CPDPRG7= <mlev>
##$CPDPRG8= <mlev>
##$CPDPRGB= <>
##$CPDPRGT= <>
##$D= (0..31)
0 1 0 0 0 0 0 0 0 0.06 0 0 0 0 0 0 0.0002 0 0 0 0 0 0 0 0 0 0 0 0 0 0 
0 
##$DATE= 1188298303
##$DBL= (0..7)
120 120 120 120 120 120 120 120 
##$DBP= (0..7)
150 150 150 150 150 150 150 150 
##$DBP07= 0
##$DBPNAM0= <>
##$DBPNAM1= <>
$$ [...]
##$SUBNAM7= <"">
##$SUBNAM8= <"">
##$SUBNAM9= <"">
##$SW= 20.6930455092707
##$SWIBOX= (0..15)
0 0 3 0 0 0 0 0 0 0 0 0 0 0 0 0 
##$SW_h= 5175.983436853
##$TD= 65536
##$TD0= 1
##$TE= 296.16
##$TE2= 300
##$TE3= 300
##$TEG= 300
##$TL= (0..7)
0 120 120 120 120 120 120 120 
##$TP= (0..7)
150 150 150 150 150 150 150 150 
##$TP07= 0
##$TPNAME0= <>
##$TPNAME1= <>
##$TPNAME2= <>
##$TPNAME3= <>
##$TPNAME4= <>
##$TPNAME5= <>
##$TPNAME6= <>
##$TPNAME7= <>
##$TPOAL= (0..7)
0.5 0.5 0.5 0.5 0.5 0.5 0.5 0.5 
##$TPOFFS= (0..7)
0 0 0 0 0 0 0 0 
##$TUNHIN= 0
##$TUNHOUT= 0
##$TUNXOUT= 0
##$USERA1= <user>
##$USERA2= <user>
##$USERA3= <user>
##$USERA4= <user>
##$USERA5= <user>
##$V9= 5
##$VALIST= <valist>
##$VCLIST= <CCCCCCCCCCCCCCC>
##$VD= 0
##$VDLIST= <DDDDDDDDDDDDDDD>
##$VPLIST= <PPPPPPPPPPPPPPP>
##$VTLIST= <TTTTTTTTTTTTTTT>
##$WBST= 1024
##$WBSW= 4
##$XGAIN= (0..3)
0 0 0 0 
##$XL= 0
##$YL= 0
##$YMAX_a= 477659
##$YMIN_a= -426865
##$ZGOPTNS= <>
##$ZL1= 120
##$ZL2= 120
##$ZL3= 120
##$ZL4= 120
##$ABSF1= 16.522
##$ABSF2= -4.171173
##$ABSG= 5
##$ABSL= 3
##$ALPHA= 0
##$AQORDER= 0
##$ASSFAC= 0
##$ASSFACI= 0
##$ASSFACX= 0
##$ASSWID= 0
##$AUNMP= <proc_1d>
##$AZFE= 0.1
##$AZFW= 0.1
##$BCFW= 0
##$BC_mod= 0
##$BYTORDP= 0
##$COROFFS= 0
##$CY= 12.5
##$DATMOD= 1
##$DC= 0
##$DFILT= <>
##$DTYPP= 0
##$F1P= 14.0000005364418
##$F2P= -0.99999901652339
##$FCOR= 0.5
##$FTSIZE= 32768
##$FT_mod= 6
##$GAMMA= 0
##$GB= 0
##$INTBC= 1
##$INTSCL= 1
##$ISEN= 128
##$LB= 0.3
##$LEV0= 0
##$LPBIN= 0
##$MAXI= 10000
##$MC2= 0
##$MEAN= 0
##$ME_mod= 0
##$MI= 0
##$NCOEF= 0
##$NC_proc= -5
##$NLEV= 6
##$NOISF1= 0
##$NOISF2= 0
##$NSP= 0
##$NTH_PI= 0
##$NZP= 0
##$OFFSET= 16.522
##$PC= 1
##$PHC0= -41.18526
##$PHC1= 2.872448
##$PH_mod= 1
##$PKNL= yes
##$PPARMOD= 0
##$PSCAL= 4
##$PSIGN= 0
##$REVERSE= no
##$SF= 250.13
##$SI= 32768
##$SIGF1= 0
##$SIGF2= 0
##$SINO= 400
##$SIOLD= 32768
##$SREGLST= <1H.CDCl3>
##$SSB= 0
##$STSI= 32768
##$STSR= 0
##$SW_p= 5175.98343685301
##$SYMM= 0
##$S_DEV= 0
##$TDeff= 65536
##$TDoff= 0
##$TI= <Analysis number 999999
Compound Code 99
Book Reference 9
Project Code 9>
##$TILT= no
##$TM1= 0
##$TM2= 0
##$TOPLEV= 0
##$USERP1= <user>
##$USERP2= <user>
##$USERP3= <user>
##$USERP4= <user>
##$USERP5= <user>
##$WDW= 1
##$XDIM= 32768
##$YMAX_p= 515492938
##$YMIN_p= -288390
$$ End of Bruker specific parameters
$$ ---------------------------------
##NTUPLES= NMR SPECTRUM
##VAR_NAME=  FREQUENCY,     SPECTRUM/REAL,   SPECTRUM/IMAG
##SYMBOL=    X,             R,               I
##VAR_TYPE=  INDEPENDENT,   DEPENDENT,       DEPENDENT
##VAR_FORM=  AFFN,          ASDF,            ASDF
##VAR_DIM=   32768,         32768,           32768
##UNITS=     HZ,            ARBITRARY UNITS, ARBITRARY UNITS
##FACTOR=    0.157963299565203, 1,           1
##FIRST=     4132.6476996994, 0,             0
##LAST=      -1043.33573715361, 0,           0
##MIN=       -1043.33573715361, -288390,     0
##MAX=       4132.6476996994, 515492938,     0
$$ Real data points
##PAGE= N=1
##DATA TABLE= (X++(R..R)), XYDATA
$$ [...]
$$ plain form
27239 56775 -15348 -48933 1660 61865 37089 17449 13320 -382 11761 48776 48004 -2853
27227 -2853 -61381 -35579 343 24856 -12365 -35778 20958 57940 64738 41097 54821 85075
27215 85075 27093 -38047 -13726 12238 27405 22178 3121 -39233 -87872 -89593 -111668 -109893
27203 -109893 -54101 -16975 11574 4713 -42094 -50060 7221 79853 119851 119749 92000 109538
27191 109538 86544 40672 58708 26551 11198 7493 -38287 -30799 -12862 1482 6257 -40253
27179 -40253 -31839 13609 27867 16398 32351 61344 74088 32192 53603 48243 55164 19578
27167 19578 -41200 -6839 -11159 32852 39782 -1873 1855 33523 26593 11674 -25103 8927
27155 8927 -33678 -31911 -12123 2998 18767 -15929 16907 -6661 -58917 3672 49894 69915
$$ packed form
27239E6775p2123l3585N0593O0205k4776j9640m129j3702J2143L7015p72n0857
27227b853n8528K5802L5922K4513l7221k3413N6736L6982O798k3641J3724L0254
27215H5075n7982o5140K4321K5964J5167n227j9057m2354m8639j721k2075J775
27203a09893N5792L7126K8549o861m6807p966N7281P2632L9998j02k7749J7538
27191A09538k2994m5872J8036l2157j5353l705m5780P488J7937J4344M775m6510
27179d0253Q414M5448J4258j1469J5953K8993J2744m1896K1411n360O921l5586
27167A9578o0778L4361m320M4011O930m1655L728L1668o930j4919l6777L4030
27155H927m2605J767J9788J5121J5769l4696L2836k3568n2256O2589M6222K0021
$$ plain form
27143 69915 -1284 -31052 4563 -31065 -31783 -29153 -15391 57135 55198 51194 -40870 -56050 1701
27130 1701 18781 34840 -45775 -119730 -92479 -26939 -52906 -50427 -21265 58621 67671 50024
27118 50024 -29143 -45608 6097 7454 62400 65611 704 -5871 -3186 -17192 -43451 -30273
27106 -30273 18334 -10967 29772 46732 11599 47446 51981 24863 904 7379 12514 3718
27094 3718 -13138 -24449 -21611 -82859 -111491 -5031 65166 59485 598 9839 -6051 -5809 17058
27081 17058 62943 55889 12849 37836 37349 -11626 2482 -10083 -74354 -45450 -5277 -6068 -29440
27068 -29440 -32894 -39185 -98069 -46876 1442 42130 37279 34037 49682 37597 65535 37186
27056 37186 24175 -8616 -19502 -6159 -5281 29708 59741 39757 17205 18128 35867 85742
$$ packed form
27143F9915p1199k9768L5615l5628p18K630J3762P2526j937m004r2064j5180N7751
27130A701J7080J6059q0615p3955K7251O5540k5967K479K9162P9886R050j7647
27118E0024p9167j6465N1705J357N4946L211o4907o575K685j4006k6259J3178
27106c0273M8607k9301M0739J6960l5133L5847M535k7118k3959O475N135q796
27094C718j6856j1311K838o1248k8632J06460P0197n681n8887R241j5890K42K2867
27081A7058M5885p054m3040K4987m87m8975J4108j2565o4271K8904M0173p91k3372
27068b9440l454o291n8884N1193M8318M0688m851l242J5645j2085K7938k8349
27056C7186j3011l2791j0886J3343Q78L4989L0033j9984k2552R23J7739M9875
$$ plain form
27044 85742 88063 67911 11224 -26269 6631 24614 66939 85692 146077 209777 190524 170035
27032 170035 74486 -12125 12594 20024 -801 30107 28337 -5856 6548 -25221 -62471 -89689
27020 -89689 -66173 -35037 -47467 -50715 -25413 -995 22000 45600 65365 33412 -42744 -32961
27008 -32961 2277 -49610 -56493 -35460 -39541 -29688 2330 -10402 -7683 26321 42124 15454
26996 15454 38223 10433 4780 -15365 11444 31271 32900 98 -47396 -106783 -62541 -66959
26984 -66959 -88215 -54593 -64279 -31655 -15697 -27205 -74823 -73374 -72385 -77891 -57023 -31126 -37942
26971 -37942 -27796 -17948 -9506 3409 33385 39475 15572 -1994 -18316 -78187 -81533 -46297
26959 -46297 -47905 -86715 -75687 43655 69459 56801 91270 100167 50794 76720 122049 102793
$$ packed form
27044H5742K321k0152n6687l7493L2900J7983M2325J8753O0385O3700j9253k0489
27032A70035r5549q6611K4719P430k0825L0908j770l4193J2404l1769l7250k7218
27020h9689K3516L1136j2430l248K5302K4418K2995K3600J9765l1953p6156R783
27008c2961L5238n1887o883K1033m081R853L2018j2732K719L4004J5803k6670
26996A5454K2769k7790n653k0145K6809J9827J629l2802m7494n9387M4242m418
26984f6959k1256L3622r686L2624J5958j1508m7618J449R89n506K0868K5897o816
26971c7942J0146R848Q442J2915K9976O090k3903j7566j6322n9871l346L5236
26959d6297j608l8810J1028J19342K5804j2658L4469Q897m9373K5926M5329j9256
$$ plain form
26947 102793 69466 56167 49680 2204 -14605 -3471 -7129 17864 -14423 -37837 -31984 -32821
26935 -32821 -25361 34513 49162 42931 -31346 13452 58683 38509 29893 33034 49904 46390 -3895
26922 -3895 8899 43333 74274 12693 -43193 -52725 -25236 56117 43673 -3339 18228 33169
26910 33169 53171 25893 24753 8127 -35979 -32157 -11771 -103470 -153691 -57477 17545 62656
26898 62656 99001 85292 72686 95329 83834 63846 81337 64796 44987 43402 39946 54527
26886 54527 68296 2276 8144 12207 -28666 -40499 5849 59992 60699 -22166 -32502 -435
26874 -435 -14976 -12241 -28459 -19714 12690 -4743 23993 67070 36649 -27387 -31886 22536 30255
26861 30255 24356 33156 9791 19811 -28756 -25264 -15280 -36131 -43873 7450 22248 28873 12525
$$ packed form
26947A02793l3327j3299o487m7476j6809J1134l658K4993l2287k3414N853q37
26935c2821P460N9874J4649o231p4277M4798M5231k0174q616L141J6870l514n0285
26922c895J2794L4434L0941o1581n5886r532K7489Q1353j2444m7012K1567J4941
26910C3169K0002k7278j140j6626m4106L822K0386r1699n0221R6214P5022M5111
26898F2656L6345j3709j2606K2643j1495j9988J7491j6541j9809j585l456J4581
26886E4527J3769o6020N868M063m0873j1833M6348N4143P07q2865j0336L2067
26874d35j4541K735j6218Q745L2404j7433K8736M3077l0421o4036m499N4422P719
26861C0255n899Q800k3365J0020m8567L492R984k0851p742N1323J4798O625j6348
$$ plain form
26848 12525 28463 62881 31153 29538 67675 44944 22157 45539 -5080 -16106 -25664 12193
26836 12193 22342 22915 -74666 -117077 -84013 -26998 50723 36477 397 28771 15272 32085
26824 32085 31136 -62198 -137078 -105764 -22443 23397 13183 -5309 59925 64174 -10051 -48123
26812 -48123 -19467 -2464 58460 106870 139788 104157 55528 57641 68924 34687 42218 93731
26800 93731 89925 9257 213 -13004 -33452 20597 52937 37799 6273 11412 30006 20138
26788 20138 94014 97567 76221 46506 51457 53384 79270 40949 33437 73986 72511 13076 -2068
26775 -2068 -11533 -28802 -20444 -13849 18512 30511 62971 96288 118294 40205 -33137 -51407
26763 -51407 3008 -33917 -14783 -18822 -125 -33269 -71502 -98516 -94805 -5421 86533 142958
$$ packed form
26848A2525J5938L4418l1728j615L8137k2731k2787K3382n0619j1026r558L7857
26836A2193J0149N73r7581m2411L3064N7015P7721j4246l6080K8374j3499J6813
26824C2085r49r3334p4880L1314Q3321M5840j0214j8492O5234M249p4225l8072
26812d8123K8656J7003O0924M8410L2918l5631m8629K113J1283l4237P531N1513
26800I3731l806q0668r044j3217k0448N4049L2340j5138l1526N139J8594r868
26788B0138P3876L553k1346k9715M951J927K5886l8321p512M0549j475n9435j5144
26775b068r465j7269Q358O595L2361J1999L2460L3317K2006p8089p3342j8270
26763e1407N4415l6925J9134m039J8697l3144l8233k7014L711Q9384R1954N6425
$$ plain form
26751 142958 142510 93315 49297 82500 57527 66990 135288 146378 113290 67870 37827 -1401
26739 -1401 28512 10012 2309 51268 110433 117097 83557 7157 -33463 12750 31378 -9269
26727 -9269 -47542 -18712 18149 31361 -9343 -77478 -88970 -23361 -20124 -60025 -102535 -48004
26715 -48004 661 6875 -7129 -52160 -80239 -63689 -68815 -50565 1096 57220 54913 84053
26703 84053 68866 20286 -8523 -74562 -85693 -84104 -126761 -136686 -61724 7960 22312 60501
26691 60501 56476 14741 24364 35334 1924 36319 58175 46585 46487 42996 18506 -27690 -46735
26678 -46735 -2630 39179 66251 48516 -4783 -52054 -36489 15937 77520 76488 -6096 12396
26666 12396 36372 53633 68723 92452 79804 56547 59583 41095 18429 87923 95589 75245
$$ packed form
26751A42958m48m9195m4018L3203k4973R463O8298J1090l3088m5420l0043l9228
26739a401K9913j8500p703M8959N9165O664l3540p6400m0620M6213J8628m0647
26727i269l8273K8830L6861J3212m0704o8135j1492O5609L237l9901m2510N4531
26715d8004M8665O214j4004m5031k8079J6550n126J8250N1661N6124k307K9140
26703H4053j5187m8580k8809o6039j1131J589m2657r925P4962O9684J4352L8189
26691F0501m025m1735R623J0970l3410L4395K1856j1590r8l491k4490m6196j9045
26678d6735M4105M1809K7072j7735n3299m7271J5565N2426O1583j032q2584J8492
26666A2396K3976J7261J5090K3729j2648k3257L036j8488k2666O9494P666k0344
$$ plain form
26654 75245 52489 28647 8890 29828 61623 50350 69861 89858 92300 49858 27415 -7311
26642 -7311 -4297 37776 68313 31642 5497 22306 21618 -11382 -23526 5498 52773 69837
26630 69837 97781 74157 17648 -42157 -71425 -95362 -44240 -23076 -24623 -53352 -22959 -3701
26618 -3701 10861 -44937 -53738 -42543 -32656 15938 23452 -31840 -75323 -80946 -101743 -100492 -56515
26605 -56515 -19 19233 47141 46670 62542 -4669 7214 32556 58461 52049 19321 17046
26593 17046 46137 92418 88504 83329 49576 5849 8372 -10746 -45942 -33752 -40433 -13247
26581 -13247 25214 -18521 -61549 -72785 -67808 -55319 -25385 9448 62997 52033 61766 62744
26569 62744 17424 -63714 -67892 -86342 -82963 -77925 -21501 58501 66648 56602 81406 125665
$$ packed form
26654G5245k2756k3842j9757K0938L1795j1273J9511J9997K442m2442k2443l4726
26642g311L014M2073L0537l6671k6145J6809o88l3000j2144K9024M7275J7064
26630F9837K7944k3624n6509n9805k9268k3937N1122K1164j547k8729L0393J9258
26618c701J4562n5798q801J1195R887M8594P514n5292m3483n623k0797J251M3977
26605e6515N6496J9252K7908m71J5872o7211J1883K5342K5905o412l2728k275
26593A7046K9091M6281l914n175l3753m3727K523j9118l5196J2190o681K7186
26581a3247L8461m3735m3028j1236M977J2489K9934L4833N3549j0964R733R78
26569F2744m5320q1138m178j8450L379N038N6424Q0002Q147j0046K4804M4259
$$ plain form
26557 125665 68816 29540 19879 36964 38895 -217 37670 7087 -82469 -101890 -118644 -4308
26545 -4308 68165 96255 118681 46266 18431 1875 -68043 -99452 -120130 -129359 -103103 -95441
26533 -95441 -30120 -16606 -1661 45326 34615 12743 -30652 -64805 -34219 13106 -2582 -2667
26521 -2667 -34166 -77319 -104821 -62655 28922 83243 65327 -3680 -2519 -20631 -50519 -27985
26509 -27985 34960 19811 2205 50282 74791 65665 72987 52062 32778 33184 6709 -58086
26497 -58086 -88685 -49193 10875 11048 -14802 -7353 29043 54590 85247 34390 63980 48832
26485 48832 46295 90450 101298 99277 65996 612 15652 -6903 34329 69921 81827 89396
26473 89396 71092 46811 49631 86423 109691 25531 5820 28020 37763 71615 74787 29864
$$ packed form
26557A25665n6849l9276r661J7085J931l9112L7887l0583q9556j9421j6754J14336
26545d308P2473K8090K2426p2415k7835j6556o9918l1409k0678r229K6256P662
26533i5441O5321J3514J4945M6987j0711k1872m3395l4153L0586M7325j5688q5
26521b667l1499m3153k7502M2166R1577N4321j7916o9007J161j8112k9888K2534
26509b7985O2945j5149j7606M8077K4509r126P322k0925j9284M06k6475o4795
26497e8086l0599L9492O0068J73k5850P449L6396K5547L0657n0857K9590j5148
26485D8832k537M4155J0848k021l3281o5384J5040k2555M1232L5592J1906P569
26473H9396j8304k4281K820L6792K3268q4160j9711K2200R743L3852L172m4923
$$ plain form
26461 29864 14751 57627 87231 45296 6594 2047 52098 60509 46805 19245 17070 53548
26449 53548 97973 10737 -47113 15001 29592 24645 -19180 -13269 5597 -46749 -103254 -112882
26437 -112882 -107711 -56158 -47835 -37355 -25349 -62861 -83929 -13668 -22035 -32555 -38489 -35526
26425 -35526 4627 38229 16965 -9773 14847 -22047 -50890 -37516 -28119 -21732 -29592 -69204
26413 -69204 -55651 -53410 23507 37084 19591 22544 27830 32987 45939 34229 89437 78792
26401 78792 -11370 -28889 -1906 14149 18135 6979 10625 36760 13033 27557 58238 30507
26389 30507 39480 9282 523 -50755 -77936 -54480 -25205 20117 50142 62849 74529 -8464
26377 -8464 -9996 9809 11473 -4447 2225 5554 12616 -10454 -21162 6863 -24019 -54252 -25727
$$ packed form
26461B9864j5113M2876K9604m1935l8702m547N0051Q411j3704k7560k175L6478
26449E3548M4425q7236n7850O2114J4591m947m3825N911J8866n2346n6505r628
26437a12882N171N1553Q323J0480J2006l7512k1068P0261q367j0520n934K963
26425c5526M0153L3602k1264k6738K4620l6894k8843J3374R397O387p860l9612
26413f9204J3553K241P6917J3577j7493K953N286N157J2952j1710N5208j0645
26401G8792r0162j7519K6983J6055L986j1156L646K6135k3727J4524L0681k7731
26389C0507Q973l0198q759n1278k7181K3456K9275M5322L0025J2707J1680q2993
26377h464j532J9805J664j5920O672L329P062k3070j0708K8025l0882l0233K8525
$$ plain form
26364 -25727 880 -19252 -42380 -128572 -147754 -138685 -99146 -47283 -45006 -56866 -19974 -2434
26352 -2434 -18874 -7692 -6736 10582 -20782 15236 32336 -16992 -64223 -72880 -13635 -11527 18053
26339 18053 -25446 -478 -29780 -37728 -31402 -7343 19246 -19810 -46965 -41353 -48801 -72353
26327 -72353 -7732 61852 31180 -30383 -57823 1425 58228 71148 72942 76913 102186 100240
26315 100240 114589 102541 67926 68684 92792 47641 11318 27264 4795 18168 31401 8308
26303 8308 -2202 -21631 -58222 -66842 -86439 -45224 -42792 -53041 -32059 -31427 -54086 -58129 -40609
26290 -40609 -59891 -11256 19111 74377 61622 70106 106082 147554 138530 130499 71273 5980
26278 5980 9696 33598 68350 54401 43220 50057 35618 82657 91424 68236 16283 4784
$$ packed form
26364b5727K6607k0132k3128q6192j9182R069L9539N1863K277j1860L6892J7540
26352b434j6440J1182R56J7318l1364L6018J7100m9328m7231q657N9245K108K9580
26339A8053m3499K4968k9302p948O326K4059K6589l9056k7155N612p448k3552
26327g2353O4621O9584l0672o1563k7440N9248N6803J2920J794L971K5273j946
26315A00240J4349j2048l4615P58K4108m5151l6323J5946k2469J3373J3233k3093
26303H308j0510j9429l6591q620j9597M1215K432j0249K0982O32k2659m043J7520
26290d0609j9282M8635L0367N5266j2755Q484L5976M1472r024q031n9226o5293
26278E980L716K3902L4752j3949j1181O837j4439M7039Q767k3188n1953j1499
$$ plain form
26266 4784 73052 65243 -14784 16655 102148 52820 -17913 -10562 -8750 -43765 -54370 -53492 -64224
26253 -64224 -75347 -33612 -11683 -45985 -114831 -110424 -54227 -13596 47877 50163 33448 67222
26241 67222 80930 40481 74909 75709 47190 17527 26890 -15366 -48251 23690 54417 68392
26229 68392 37769 14663 13150 -6721 -15874 28607 53047 36419 9869 36008 87538 25061
26217 25061 -61704 -72865 -59904 22591 18118 11290 50134 33796 14864 14857 57928 11627 -12574
26204 -12574 -13756 -78845 -83321 -34049 -22160 -67282 -41924 -2189 -55592 -106639 -69031 -53566
26192 -53566 -78577 -101357 -13833 -8210 36339 10405 -6881 -15686 2063 -1428 -5850 -20814
26180 -20814 -6835 -28107 -25690 -18118 19698 20691 7927 -42726 -45590 -77919 -78860 -47914 -35885
$$ packed form
26266D784O8268p809q0027L1439Q5493m9328p0733P351J812l5015j0605Q78j0732
26253f4224j1123M1735K1929l4302o8846M407N6197M0631O1473K286j6715L3774
26241F7222J3708m0449L4428Q00k8519k9663R363m2256l2885P1941L0727J3975
26229F8392l0623k3106j513j9871r153M4481K4440j6628k6550K6139N1530o2477
26217B5061q6765j1161J2961Q2495m473o828L8844j6338j8932pM3071m6301k4201
26204a2574j182o5089m476M9272J1889m5122K5358L9735n3403n1047L7608J5465
26192e3566k5011k2780Q7524N623M4549k5934j7286q805J7749l491m422j4964
26180b0814J3979k1272K417P572L7816R93j2764n0653k864l2329r41L0946J2029
$$ plain form
26167 -35885 -97538 -95138 -27030 50328 106693 109038 95170 80540 64233 -14487 -49551 -8369
26155 -8369 208 29309 28148 -11498 -4432 22017 15683 24148 73412 88097 90945 2042 -73054
26142 -73054 -71114 14264 58720 69164 36063 -75014 -40130 28770 -23282 -15669 -24289 -48804
26130 -48804 -58591 2364 45067 33618 22259 -13797 -21428 -33778 -39262 -29503 47750 26292
26118 26292 20168 58078 113516 67308 66267 85175 64299 72307 31190 22311 15648 -33408 -66509
26105 -66509 -49222 -31463 -38918 -5633 16572 47290 87657 49764 -8861 -45334 -858 20368
26093 20368 -8302 -65704 -65262 -55558 -30585 27680 48001 36385 39489 34244 -5035 -46140 -31989
26080 -31989 -24667 -41313 -47019 -86768 -73970 15816 75254 -2223 -40761 -20138 5431 7345
$$ packed form
26167c5885o1653K400O8108P7358N6365K345j3868j4630j6307p8720l5064M1182
26155h369Q577K9101j161l9646P066K6449o334Q465M9264J4685K848q8903p5096
26142g3054J940Q5378M4456J0444l3101j11077L4884O8900n2052P613q620k4515
26130d8804r787O0955M2703j1449j1359l6056p631j2350n484R759P7253k1458
26118B6292o124L7910N5438m6208j041J8908k0876Q008m1117q879o663m9056l3101
26105f6509J7287J7759p455L3285K2205L0718M0367l7893n8625l6473M4476K1226
26093B0368k8670n7402M42R704K4973N8265K0321j1616L104n245l9279m1105J4151
26080c1989P322j6646n706l9749J2798Q9786N9438p7477l8538K0623K5569J914
$$ plain form
26068 7345 23489 56315 102229 86024 66244 65196 99221 79069 60275 32907 -39870 -9402
26056 -9402 17881 33495 38206 43884 57605 -19375 -69700 -26451 48128 23367 -28068 -104429
26044 -104429 -91617 -7012 27518 71580 69405 -4342 -2920 17517 -35169 -68733 -57643 -14855
26032 -14855 43306 15972 28876 45891 5386 -26714 51999 159850 172705 86534 3885
26021 3885 -12054 -11277 -25944 -19453 -38853 -52617 -63788 -28239 -21379 -51878 -60290 -5944 24159
26008 24159 -396 -44644 -22550 -16209 -22822 -40451 -19777 14907 -9055 -60851 -62167 -94974
25996 -94974 -150582 -97673 -50695 -41247 -21121 2064 13460 -19941 -13850 -15456 -39310 -27060
25984 -27060 -75050 -112211 -95909 -41358 -38263 -34874 -35446 14945 35358 21750 -7655 -52300
$$ packed form
26068G345J6144L2826M5914j6205j9780j048L4025k0152j8794k7368p2777L0468
26056i402K7283J5614M711N678J3721p6980n0325M3249P4579k4761n1435p6361
26044a04429J2812Q4605L4530M4062k175p3747J422K0437n2686l3564J1090M2788
26032a4855N8161k7334J2904J7015m0505l2100P8713J07851J2855q6171q2649
26021C885j5939P77j4667O491j9400j3764j1171L5549O860l0499q412N4346L0103
26008B4159k4555m4248K2094O341o613j7629K0674L4684k3962n1796j316l2807
25996i4974n5608N2909M6978R448K0126K3185J1396l3401O091j606k3854J2250
25984b7060m7990l7161J6302N4551L095L389n72N0391K0413j3608k9405m4645
$$ plain form
25972 -52300 -49738 -41533 -60460 -36658 50558 85273 70941 48789 36322 -109 -12112 14134
25960 14134 -8979 -40494 -22042 -52119 -37232 11333 3325 -35494 -12022 1958 -14506 -59954
25948 -59954 -74818 -76086 12066 -5826 -28990 -18004 -62145 -75038 -32290 31340 -12873 -48861
25936 -48861 890 15681 -42050 -40189 382 33283 -4877 -8125 78437 140280 125307 99306
25924 99306 55054 21076 -2353 -11442 -16646 16535 112559 145259 134205 66251 66709 47856
25912 47856 51455 32278 -11805 -9301 22050 22186 -27833 -54739 -33705 -60507 -93904 -117970
25900 -117970 -56808 -30813 -3920 -11029 -14113 -22637 -10906 -4193 4980 50208 58111 -6331 -62227
25887 -62227 -22283 21308 8753 -43753 -74911 -67578 -48497 7192 27152 52286 53012 -5582
$$ packed form
25972e2300K562Q205j8927K3802Q7216L4715j4332k2152j2467l6431j2003K6246
25960A4134k3113l1515J8452l0077J4887M8565q008l8819K3472J3980j6464m5448
25948e9954j4864j268Q8152j7892k3164J0986m4141j2893M2748O3630m4213l5988
25936d8861M9751J4791n7731J861M0571L2901l8160l248Q6562O1843j4973k6001
25924I9306m4252l3978k3429r089n204L3181R6024L2700j1054o7954M58j8853
25912D7856L599j9177m4083K504L1351J36n0019k6906K1034k6802l3397k4066
25900a17970O1162K5995K6893p109l084q524J1731O713R173M5228P903o4442n5896
25887f2227L9944M3591j2555n2506l1158P333J9081N5689J9960K5134P26n8594
$$ plain form
25875 -5582 -45007 15156 27071 20402 19856 5283 11547 21459 55704 40994 -21568 -25350 47195
25862 47195 79578 21332 -16376 -4291 10790 28865 52310 28728 23570 -25970 -8440 61019
25850 61019 122550 145844 108480 55554 56873 -15358 -52724 3098 24883 8932 33124 19829
25838 19829 38046 6902 2770 58250 36967 23209 85219 37018 48351 65180 28409 -561
25826 -561 -10774 32289 66483 76725 75551 8185 -12327 31077 52031 68316 62607 32395
25814 32395 31416 34594 38295 60846 47226 1633 7362 94528 115142 96336 71005 62749 48850
25801 48850 53567 47533 15225 -58098 -103754 -42611 11376 35229 19710 -38794 -56276 -20691
25789 -20691 -9103 -24962 150 -9085 24843 57436 14080 19840 31542 65485 42879 55075
$$ packed form
25875e582l9425O0163J1915o669n46j4573O264R912L4245j4710o2562l782P2545
25862D7195L2383n8246l7708J2085J5081J8075K3445k3582n158m9540J7530O9459
25850F1019O1531K3294l7364n2926J319p2231l7366N5822K1785j5951K4192j3295
25838A9829J8217l1144m132N5480k1283j3758O2010m8201J1333J6829l6771k8970
25826e61j0213M3063L4194J0242j174o7366k0512M3404K0954J6285n709l0212
25814C2395r79L178L701K2551j3620m5593N729Q7166K0614j8806k5331q256j3899
25801D8850M717o034l2308p3323m5656O1143N3987K3853j5519n8504j7482L5585
25789b0691J1588j5859K5112r235L3928L2593m3356N760J1702L3943k2606J2196
$$ plain form
25777 55075 74310 39979 31306 56028 70163 59269 69409 84513 134535 129560 122428 69718
25765 69718 77047 96671 39223 8517 30153 48928 37942 5960 -12556 -27395 6742 32362
25753 32362 -715 65228 78573 67433 120515 125326 100846 90644 76106 66354 112157 72926
25741 72926 22590 -10439 -23491 -39868 -22234 -13534 -61218 -26436 -4451 -45809 -57932 -12604
25729 -12604 76455 52790 28618 43504 83571 85715 79293 36066 -31135 -14195 7232 -14736
25717 -14736 -39839 -93094 -63211 -76314 -83990 -611 18878 9721 27271 16461 57640 43818
25705 43818 27951 -899 37678 60458 28361 6513 -9760 -17139 -22905 -36151 -4025 -11923
25693 -11923 -64024 -47075 -13958 -20185 -81475 -111156 -96542 -25763 37699 38021 59373 44952
$$ packed form
25777E5075J9235l4331q673K4722J4135j0894J0140J5104N0022m975p132n2710
25765F9718P329J9624n7448l0706K1636J8775j0986l1982j8516j4839L4137K5620
25753C2362l3077O5943J3345j1140N3082M811k4480j0202j4538r752M5803l9231
25741G2926n0336l3029j3052j6377J7634Q700m7684L4782K1985m1358j2123M5328
25729a2604Q9059k3665k4172J4886M0067K144o422m3227o7201J6940K1427k1968
25717a4736k5103n3255K9883j3103p676Q3379J9489r157J7550j0810M1179j3822
25705D3818j5867k8850L8577K2780l2097k1848j6273p379n766j3246L2126p898
25693a1923n2101J6949L3117o227o1290k9681J4614P0779O3462L22K1352j4421
$$ plain form
25681 44952 31343 2863 -2026 40840 35811 -12119 -27519 16726 30161 -1715 -2521 -42410
25669 -42410 -69792 -74217 -67648 -51064 -57086 -79217 6778 8947 28003 59268 6803 -67380
25657 -67380 -18221 34752 15915 44139 52686 35744 10818 -3735 40224 82409 108878 94193
25645 94193 99150 83358 88097 110287 50164 -3218 5126 46591 84558 102331 99957 8931
25633 8931 -49906 -57348 -39380 -28706 -55650 -38626 -32662 -37278 -11628 -19054 -70236 -68254 1229
25620 1229 -72 -30538 -32153 -72887 -35951 3075 -23586 -72898 -99807 -31450 16090 52988
25608 52988 36518 46144 1532 11986 15399 12232 3522 -18122 -13018 6171 19856 27914 -28440
25595 -28440 -60881 -77737 -27385 25056 -14567 -67976 -83731 -100944 -39869 -18281 9838 25240
$$ packed form
25681D4952j3609k8480m889M2866n029m7930j5400M4245J3435l1876q06l9889
25669d2410k7382m425O569J6584o022k2131Q5995K169J9056L1265n2465p4183
25657f7380M9159N2973j8837K8224Q547j6942k4926j4553M3959M2185K6469j4685
25645I4193M957j5792M739K2190o0123n3382Q344M1465L7967J7773k374r1026
25633H931n8837p442J7968J0674k6944J7024N964m616K5650p426n1182J982O9483
25620A229j301l0466j615m0734L6936L9026k6661m9312k6909O8357M7540L6898
25608E2988j6470R626m4612J0454L413l167q710k1644N104J9189J3685Q058n6354
25595b8440l2441j6856N0352N2441l9623n3409j5755j7213O1075K1588K8119J5402
$$ plain form
25583 25240 34920 29371 509 -42518 9017 113898 142548 62040 -19999 -17869 30503 -11302
25571 -11302 11198 47996 45643 34923 18098 35276 69452 59357 22761 -11050 -43491 -34257
25559 -34257 5756 43685 67124 -3574 -44868 -26169 -6739 44079 67220 3120 48 -12532
25547 -12532 -12683 23910 60148 71664 92212 41019 -22140 -20266 -29815 15245 9145 -22841 -23901
25534 -23901 60533 116243 70472 52746 79056 72194 60484 14964 -32253 -48003 -38524 -28911
25522 -28911 23734 59938 12929 46306 59813 10689 10153 -28735 -43859 -14105 -10977 26096
25510 26096 16540 14924 780 26706 23836 -41653 -96117 -76824 -123170 -130496 -159132 -109441
25498 -109441 -40313 -40647 -53140 -39213 -70330 -76504 -12327 -26845 -46949 -65514 -60386 2040
$$ packed form
25583B5240R680n549k8862m3027N1535J04881K8650q0508q2039K130M8372m1805
25571a1302K2500L6798k353j0720j6825J7178L4176j0095l6596l3811l2441R234
25559c4257M0013L7929K3439p0698m1294J8699J9430N0818K3141o4100l072j2580
25547a2532j51L6593L6238J1516K0548n1193o3159J874r549M5060o100l1986j060
25534b3901Q4434N5710m5771j7726K6310o862j1710m5520m7217j5750R479R613
25522b8911N2645L6204m7009L3377J3507m9124n36l8888j5124K9754L128L7073
25510B6096r556j616j4144K5926k870o5489n4464J9293m6346p326k8636M9691
25498a09441O9128l34j2493J3927l1117o174O4177j4518k0104j8565N128O2426
$$ plain form
25486 2040 85885 45577 21872 17920 59973 92465 24917 -56895 -28177 42271 57650 -15736
25474 -15736 -34182 -9655 -39660 -69768 -50750 -2073 25274 36681 52695 25239 -24912 -43920
25462 -43920 -85930 -63373 -9148 -27233 -18035 45291 34313 47557 37353 -62964 -69548 -46453
25450 -46453 15799 24061 -46079 -67982 -67061 -79972 -52310 -57048 -36658 1618 -4349 -18721 30321
25437 30321 79154 59883 -36220 -33530 36931 60377 61434 52704 53338 54829 49420 38108 84387
25424 84387 104460 96342 66777 32017 -16692 -44480 -10079 -35104 -49659 -61372 -128322 -166166
25412 -166166 -111869 -99852 -66299 -55841 -27007 -18984 -18575 540 71508 16903 -6145 16576
25400 16576 84949 86783 132121 79557 17075 21530 36346 27809 83236 129254 122069 147733
$$ packed form
25486B040Q3845m0308k3705l952M2053L2492o7548q1812K8718P0448J5379p3386
25474a5736j8446K4527l0005l0108J9018M8677K7347J1407J6014k7456n0151j9008
25462d3920m2010K2557N4225j8085R198O3326j0978J3244j0204j00317o584K3095
25450d6453O2252Q262p0140k1903R21j2911K7662m738K0390L8276n967j4372M9042
25437C0321M8833j9271r6103K690P0461K3446J057q730O34J491n409j1312M6279
25424H4387K0073q118k9565l4760m8709k7788L4401k5025j4555j1713o6950l7844
25412a66166N4297J2017L3553J0458K8834Q023M09J9115P0968n4605k3048K2721
25400A6576O8373J834M5338n2564o2482M455J4816q537N5427M6018p185K5664
$$ plain form
25388 147733 157452 104399 87365 123927 109467 133269 110705 118626 71849 10881 -39124 -67982
25376 -67982 -30470 12035 22944 7677 -11549 -27704 -27795 -15205 15561 71202 102434 116769
25364 116769 106224 99563 103527 90209 64168 65181 29054 9723 15305 33720 18305 40221
25352 40221 37255 29536 9414 565 -59656 -71934 42942 95142 27212 -33825 -14626 -3294
25340 -3294 -8225 -57117 -33090 1662 -13853 -11460 -96604 -51755 17092 16404 -24065 -46179 -55858
25327 -55858 5417 16067 -39102 -86449 -60916 -74323 -69450 -51097 -4947 -29553 -11618 -5582
25315 -5582 21621 29883 21487 -1935 -26391 -65875 -118065 -108146 -97078 -92142 -70277 -51034 -9192
25302 -9192 7441 -13739 3614 12214 4751 5269 4489 -20100 -10806 13934 6150 -11983 -25515
$$ packed form
25388A47733R719n3053j7034L6562j4460K3802k2564P921m6777o0968n0005k8858
25376f7982L7512M2505J0909j5267j9226j6155r1J2590L0766N5641L1232J4335
25364A16769j0545o661L964j3318k6041J013l6127j9331N582J8415j5415K1916
25352D0221k966p719k0122q849o0221j2278J14876N2200o7930o1037J9199J1332
25340c294m931m8892K4027L4752j5515K393q5144M4849O8847o88m0469k2114r679
25327e5858O1275J0650n5169m7347K5533j3407M873J8353M6150k4606J7935O036
25315e582K7203Q262q396k3422k4456l9484n2190R919J1068M936K1865J9243M1842
25302i192J6633k1180J7353Q600p463N18p80k4589R294K4740p784j8133j3532
$$ plain form
25289 -25515 19689 -7619 -49055 -17124 3434 15244 3026 -34060 -6585 44594 77669 27305
25277 27305 757 31565 52137 39406 18419 16602 -14824 -23541 18593 12410 -11143 -60
25265 -60 12850 19582 -40079 -76241 -74899 -87394 -41691 -42088 -56980 -76123 -18189 78936 119697
25252 119697 70625 52807 36671 14226 7246 30720 54525 -31023 -61904 -62540 -31449 -13875
25240 -13875 26423 -3491 -8318 23206 40918 43420 76914 55051 43349 120500 154731 83333
25228 83333 -20547 -80780 -29307 31490 48118 29375 -25592 -46310 -39293 -53629 -66634 -53568
25216 -53568 -54672 -6214 72539 43664 91 876 34811 25303 4216 -14292 -16727 7640 18285
25203 18285 35320 15651 25948 39900 25371 -51239 -76140 -61703 6563 16920 65997 62516
$$ packed form
25289b5515M5204k7308m1436L1931K0558J1810j2218l7086K7475N1179L3075n0364
25277B7305k6548L0808K0572j2731k0987j817l1426q717M2134o183k3553J1083
25265f0J2910O732n9661l6162J342j2495M5703l97j4892j9143N7934R7125M0761
25252A19697m9072j7818j6136k2445o980K3474K3805q5548l0881o36L1091J7574
25240a3875M0298k9914m827L1524J7712K502L3494k1863j1702P7151L4231p1398
25228H3333j03880o0233N1473O0797J6628j8743n4967k0718P017j4336j3005J3066
25216e3568j104M8458P8753k8875m3573P85L3935r508k1087j8508k435K4367J0645
25203A8285J7035j9669J0297J3952j4529p6610k4901J4437O8266J0357M9077l481
$$ plain form
25191 62516 40722 -26584 -21950 2519 47554 57118 27669 4904 27446 18483 14100 -21089
25179 -21089 -12020 -10925 -22529 -39817 -71804 -61545 -47112 -22267 -26378 22535 54811 47001
25167 47001 47642 17045 -36950 -11912 25834 25907 37828 27040 63529 45986 -6773 55225 94828
25154 94828 145050 157892 56880 -19624 -36007 -50429 -62891 -26746 -14447 -73158 -118875
25143 -118875 -91930 -47613 -10935 6662 14206 -1164 -22490 23696 61234 47880 19722 23703
25131 23703 13698 -19871 -40530 -56581 -21840 5455 -4307 57606 49853 50124 47402 47328 14586
25118 14586 2696 33379 24164 49601 20397 -43940 -101244 -70467 -65321 -101237 -63942 -48320
25106 -48320 -7514 14355 -28551 -33578 30423 8387 57278 65544 92027 186890 224092 133416
$$ packed form
25191F2516k1794o7306M634K4469M5035R564k9449k2765K2542q963m383l5189
25179b1089R069J095j1604j7288l1987J0259J4433K4845m111M8913L2276p810
25167D7001O41l0597n3995K5038L7746P3J1921j0788L6489j7543n2759O1998L9603
25154I4828N0222J2842j01012p6504j6383j4422j2462L6145J2299n8711m5717
25143a18875K6945M4317L6678J7597P544j5370k1326M6186L7538j3354k8158L981
25131B3703j0005l3569k0659j6051L4741K7295r762O1913p753K71k722p4l2742
25118A4586j1890L0683r215K5437k9204o4337n7304L0777N146l5916L7295J5622
25106d8320M0806K1869m2906n027O4001k2036M8891Q266K6483R4863L7202r0676
$$ plain form
25094 133416 77109 90116 94536 91533 87827 30396 19769 102285 111094 63282 -26908 -90683
25082 -90683 -89413 -75551 -51178 15724 5857 -31188 4923 6519 -7267 29290 -8373 -54491
25070 -54491 -9976 -19372 -33168 -64139 -65092 -34469 -17059 -12189 21012 55562 32554 -13597
25058 -13597 -34532 -88472 -117669 -108672 -116326 -116597 -88173 -73289 -66913 -16630 -3676 25463 22247
25045 22247 5093 -2636 -47124 -9615 15701 17335 -9327 -217 -20924 -18515 -2631 -2907 41575
25032 41575 85346 38476 -7864 -44320 -16277 28161 33148 550 5144 15754 -332 -26409
25020 -26409 -36445 -59848 -29462 -38475 -23889 -5514 -40940 -59710 -27231 1492 66739 131190
25008 131190 123625 101672 93381 8158 -68678 -67729 5702 36008 17959 -29579 -43347 2091
$$ packed form
25094A33416n6307J3007M420l003l706n7431j0627Q2516Q809m7812r0190o3775
25082i0683J270J3862K4373O6902r867l7045L6111J596j3786L6557l7663m6118
25070e4491M4515r396j3796l0971r53L0623J7410M870L3201L4550k3008m6151
25058a3597k0935n3940k9197Q997p654k71K8424J4884O376N0283J2954K9139l216
25045B2247j7154p729m4488L7509K5316J634k6662R110k0707K409J5884k76M4482
25032D1575M3771m6870m6340l6456K8043M4438M987l2598M594J0610j6086k6077
25020b6409j0036k3403L0386r013J4586J8375l5426j8770L2479K8723O5247O4451
25008A31190p565k1953q291q5223p6836R49P3431L0306j8049m7538j3768M5438
$$ plain form
24996 2091 -17607 -45696 -41772 -33309 -53805 -35868 -43550 -127812 -88622 -52198 -59947 -5747 -12988
24983 -12988 489 21221 14147 18594 18161 -14138 -41893 -17463 -5086 30716 11306 16360 43970
24970 43970 61524 94321 95385 74648 16400 -96441 -147034 -134860 -72279 -35963 -90689 -135290
24958 -135290 -119377 -37550 -55571 -85181 -90637 -38341 -11525 53981 75421 99285 84338 76693
24946 76693 35814 8623 -35031 -30680 2653 -23786 -49813 -18222 32451 16853 -25839 -63560
24934 -63560 -70831 -33044 -25047 -43453 -33537 -58850 -45861 -38694 -5502 28607 5149 -92850
24922 -92850 -52566 60936 93886 49324 16355 31828 77366 60129 60347 37699 51951 74250
24910 74250 59884 26982 -2290 -19809 -29188 10775 66421 69086 92652 108397 77013 68060
$$ packed form
24996B091j9698k8089L924Q463k0496J7937p682q4262L9190L6424p749N4200p241
24983a2988J3477K0732p074M447m33l2299k7755K4430J2377L5802j9410N054K7610
24970D3970J7554L2797J064k0737n8248j12841n0593J2174O2581L6316n4726m4601
24958a35290J5913Q1827j8021k9610n456N2296K6816O5506K1440K3864j4947p645
24946G6693m0879k7191m3654M351L3333k6439k6027L1591N0673j5598m2692l7721
24934f3560p271L7787P997j8406R916k5313J2989P167L3192L4109k3458r7999
24922i2850M0284J13502L2950m4562l2969J5473M5538j7237K18k2648J4252K2299
24910G4250j4366l2902k9272j7519r379L9963N5646K665K3566J5745l1384q953
$$ plain form
24898 68060 43440 18374 17239 38191 -3739 -14931 -47727 -53758 32001 -1927 -56140 -62749
24886 -62749 -12416 61723 81855 103420 96821 58742 -22245 -103408 -95469 607 -3841 25857
24874 25857 24175 38558 11354 26928 40134 91309 110156 120477 104953 41519 37290 45095
24862 45095 32437 16116 -13401 -41314 -51929 39848 72963 79582 77658 62974 4783 -8909
24850 -8909 6111 17374 -12077 970 -29293 -23191 22251 1898 24813 11696 9387 14513
24838 14513 30055 101351 97355 69843 14776 -8641 -28379 -31557 -66364 -103755 -69358 -34570
24826 -34570 -52524 5669 4514 -60659 -70883 -73502 -93199 -111222 -91383 -72534 -77042 -56737
24814 -56737 -32486 -32506 -35736 -22640 -775 -36889 -76572 -62332 -54075 -42831 -32993 -36102 -40701
$$ packed form
24898F8060k4620k5066j135K0952m1930j1192l2796o031Q5759l3928n4213o609
24886f2749N0333P4139K0132K1565o599l8079q0987q1163P939R6076m448K9698
24874B5857j682J4383k7204J5574J3206N1175J8847J0321j5524o3434m229P805
24862D5095j2658j6321k9517k7913j0615R1777L3115O619j924j4684n8191j3692
24850h909J5020J1263k9451J3047l0263O102M5442k0353K2915j3117k309N126
24838A4513J5542P1296l996k7512n5067k3417j9738l178l4807l7391L4397L4788
24826c4570j7954N8193j155o5173j0224k619j9697j8023J9839J8849m508K0305
24814e6737K4251k0l230J3096K1865l6114l9683J4240Q257J1244R838l109m599
$$ plain form
24801 -40701 -19210 -34060 -30747 -77928 -39832 3694 37560 46911 45809 47452 38900 77690 74158
24788 74158 11694 -28991 -36635 -69537 -57951 -69301 -44187 -23752 -19016 -13211 7125 -20795
24776 -20795 -29693 48228 67194 41718 36547 52482 106219 107335 64625 -20754 -51337 -38361
24764 -38361 13416 51338 44020 41027 12656 -3317 -9566 16331 6767 39535 100680 36885
24752 36885 -433 6750 -59903 -40771 -23054 19954 68678 109544 89086 51632 26798 4897
24740 4897 -39117 -47133 -6268 3606 54456 44460 9780 -29273 -60642 -7805 25594 28245 24525
24727 24525 4960 -5727 10510 -22599 -29432 -6572 -23126 26421 22146 37944 19439 18970
24715 18970 -1314 -15215 -55778 -41910 -79677 -25022 -2946 -16966 -37985 14282 73002 23044
$$ packed form
24801d0701K1491j4850L313m7181L8096M3526L3866R351j102J643q552L8790l532
24788G4158o2464m0685p644l2902J1586j1350K5114K0435M736N805K0336k7920
24776b0795q898P7921J8966k5476n171J5935N3737J116m2710q5379l0583J2976
24764c8361N1777L7922p318k993k8371j5973o249K5897r564L2768O1145o3795
24752C6885l7318P183o6653J9132J7717M3008M8724M0866k0458l7454k4834k1901
24740D897m4014q016M0865R874N0850r996l4680l9053l1369N2837L3399K651l720
24727B4525j9565j0687J6237l3109o833K2860j6554M9547m275J5798j8505m69
24715A8970k0284j3901m0563J3868l7767N4655K2076j4020k1019N2267N8720m9958
$$ plain form
24703 23044 -11079 15726 101780 130423 175485 154676 48743 3689 -49194 -54561 -54967 -21376
24691 -21376 -4539 -38287 -46977 -81523 -99001 -58471 -25416 -18848 -42603 -69919 -26899 -35325
24679 -35325 -47156 -61573 -17273 24130 -30310 -20313 -13505 -33847 -31113 -40114 -40963 -42569 1395
24666 1395 43188 93510 120756 122719 125674 67199 67086 67067 33885 44651 71485 97701 107617
24653 107617 62787 16537 -7984 -6886 -15167 -39036 -4215 3412 24470 27142 39324 80134
24641 80134 70488 39398 38131 27560 46285 17302 -9065 -44131 19979 27843 47540 -6654
24629 -6654 -42074 -52744 -63904 -59018 -51073 -48415 40838 52460 -4526 -2531 16967 25115 -35400
24616 -35400 -54686 11580 51627 43678 51151 23129 -22676 -44318 -76910 -63601 -14683 3462
$$ packed form
24703B3044l4123K6805Q6054K8643M5062k0809j05933m5054n2883n367m06L3591
24691b1376J6837l3748q690l4546j7478M0530L3055O568k3755k7316M3020q426
24679c5325j1831j4417M4300M1403n4440R997O808k0342K734r001q49j606M3964
24666A395M1793N0322K7246J963K955n8475j13j9l3182J0766K6834K6216R916
24653A07617m4830m6250k4521J098q281k3869L4821P627K1058K672J2182M0810
24641H0134r646l1090j267j0571J8725k8983k6367l5066O4110P864J9697n4194
24629f654l5420j0670j1160M886P945K658Q9253J1622n6986J995J9498Q148o0515
24616c5400j9286O6266M0047p949P473k8022m5805k1642l2592J3309M8918J8145
$$ plain form
24604 3462 -36020 -28569 -32861 -59220 2431 18500 3365 -11111 36833 38651 30698 31101 4231
24591 4231 1121 23424 -21736 -62244 -62641 -65794 -10087 -5860 -13268 -9359 40469 35422 -6523
24578 -6523 -57871 -23417 37806 22521 -14330 5454 -20345 -29722 -29419 -20130 -9958 -40314 -29126
24565 -29126 22574 -9347 -27695 -65813 -59944 -8909 -12998 14848 -7206 -11154 1921 -29526
24553 -29526 -55969 -71092 -69348 -81919 -68795 -55557 -63116 -18606 37280 52117 1167 14572
24541 14572 38778 10986 31655 52795 17728 -8034 -28219 -66579 -79348 -65213 -78034 -102649
24529 -102649 -60484 -25265 -51250 -71174 -27286 -5215 45730 81448 97703 68744 75004 66047
24517 66047 60240 52698 72109 95097 37737 -41320 -43805 -51815 -4116 61288 52532 66847 51503
$$ packed form
24604C462l9482P451m292k6359O1651J6069j5135j4476M7944J818p953M03k6870
24591D231l110K2303m5160m0508l97l153N5707M227p408L909M9828n047m1945
24578f523n1348L4454O1223j5285l6851J9784k5799r377L03R289J0172l0356J1188
24565b9126N1700l1921j8348l8118N869N1035m089K7846k2054l948J3075l1447
24553b9526k6443j5123J744j2571J3124J3238p559M4510N5886J4837n0950J3405
24541A4572K4206k7792K0669K1140l5067k5762k0185l8360j2769J4135j2821k4615
24529a02649M2165L5219k5985j9924M3888K2071N0945L5718J6255k8959O260q957
24517F6047n807p542J9411K2988n7360p9057k485q010M7699O5404q756J4315j5344
$$ plain form
24504 51503 8728 42516 74148 79913 73879 20380 -53950 -11008 14699 57669 79242 44773
24492 44773 30574 17456 3295 -16988 1287 7905 20520 10354 24675 21296 -15588 30864
24480 30864 71391 55076 43469 68845 28664 52678 52640 56702 68958 18557 31444 10408
24468 10408 -31121 -18029 -6176 -7578 73461 109450 40890 37424 41189 18501 -24346 10814
24456 10814 34139 -12621 -26902 -66266 -39963 -41013 9150 16857 -26563 -67583 -32683 92698
24444 92698 142409 108164 25658 -17712 -17837 23650 33291 43772 71311 59786 58197 60515 47086
24431 47086 -4171 -40208 -69195 -50018 -8551 31305 36916 10875 -24821 -22862 -53344 -48479
24419 -48479 -8991 16664 1590 -55620 -126325 -148375 -106471 -40955 -15737 -67236 -33587 -33740
$$ packed form
24504E1503m2775L3788L1632N765o034n3499p4330M2942K5707M2970K1573l4469
24492D4773j4199j3118j4161k0283J8275O618J2615j0166J4321l379l6884M6452
24480C0864M0527j6315j1607K5376m0181K4014l8M062J2256n0401J2887k1036
24468A0408m1529J3092J1853j402Q1039L5989o8560l466L765k2688m2847L5160
24456A0814K3325m6760j4281l9364K6303j050N0163P707m3420m1020L4900J25381
24444I2698M9711l4245q2506m3370j25M1487R641J0481K7539j1525j589K318j3429
24431D7086n1257l6037k8987J9177M1467L9856N611k6041l5696J959l0482M865
24419d8479L9488K5655j5074n7210p0705k2050M1904O5516K5218n1499L3649j53
$$ plain form
24407 -33740 -65740 -54792 -12797 -26025 -14687 -9773 -11297 -5892 -19677 3053 21462 94700
24395 94700 136301 97652 57479 30269 66225 51233 3545 -78552 -76668 -51792 -32310 -26397
24383 -26397 -36355 -64907 -58589 -82970 -78383 -53542 -28111 -28820 -14378 28356 109 -10880 34531
24370 34531 13903 -29498 -131263 -122427 -33072 27888 67484 64293 5354 -70220 -19456 22788
24358 22788 19345 10573 12510 313 18379 16654 13122 64023 60702 3772 -41798 -25458 12196
24345 12196 39482 -6177 -18412 -10459 -31178 -35813 6537 -3370 -21834 -15308 -23072 -25845 -26331
24332 -26331 7205 6889 26028 88071 52109 34382 -24050 -59108 -50306 -34276 -23367 -3124
24320 -3124 20563 22191 13469 -7486 -51510 -64070 4009 38999 97447 70846 59857 67226
$$ packed form
24407c3740l2000J0948M1995j3228J1338M914j524N405j3785K2730J8409P3238
24395I4700M1601l8649m0173k7210L5956j4992m7688q2097J884K4876J9482N913
24383b6397r958k8552O318k4381M587K4841K5431p09J4442M2734k8247j0989M5411
24370C4531k0628m3401j01765Q836Q9355O0960L9596l191n8939p5574N0764M2244
24358B2788l443q772J937j2197J8066j725l532N0901l321n6930m5570J6340L7654
24345A2196K7286m5659j2235P953k0719m635M2350r907j8464O526p764k773m86
24332b6331L3536l16J9139O2043l5962j7727n8432l5058Q802J6030J0909K0243
24320c124K3687J628q722k0955m4024j2560O8079L4990N8448k6601j0989P369
$$ plain form
24308 67226 29415 -2998 -15407 -32534 -59761 -81736 -52542 12009 57970 41653 30202 -961
24296 -961 -1715 14566 -22681 -4035 -32806 -49714 -46587 -43094 -58444 -18702 -15614 -26519 -39493
24283 -39493 -73248 -77106 -54868 -29144 32807 56159 40934 -30882 -54721 -102917 -80405 -53013
24271 -53013 -18662 9615 -35137 -55753 -127454 -121532 -45961 -14113 -29381 -49083 -81494 -63187
24259 -63187 -47247 -55694 -63779 -19845 -32096 -35747 -16828 -15096 -28195 -73319 -81842 -60451 -39294
24246 -39294 -50674 -93507 -107622 -50778 1693 -26503 -77981 -31729 -3587 41556 29019 13394
24234 13394 -21191 -55895 -44338 -4200 27894 -14396 14561 36472 11628 -77814 -56898 -21587
24222 -21587 -78445 -73110 -12356 -23655 -84954 -68303 -28434 37764 84585 48206 42670 5369
$$ packed form
24308F7226l7811l2413j2409j7127k7227k1975K9194O4551M5961j6317j1451l1163
24296i61p54J6281l7247J8646k8771j6908L127L493j5350L9742L088j0905j2974
24283c9493l3755l858K2238K5724O1951K3352j5225p1816k3839m8196K2512K7392
24271e3013L4351K8277m4752k0616p1701N922P5571L1848j5268j9702l2411J8307
24259f3187J5940q447q085M3934j2251l651J8919J732j3099m5124q523K1391K1157
24246c9294j1380m2833j4115N6844N2471k8196n1478M6252K8142M5143j2537j5625
24234A3394l4585l4704J1557M0138L2094m2290K8957K1911k4844q9442K0916L5311
24222b1587n6858N335O0754j1299o1299J6651L9869O6198M6821l6379n536l7301
$$ plain form
24210 5369 -16439 -41611 -8770 26180 29691 30909 48363 -18182 -44349 -37215 16242 85303
24198 85303 53095 22992 -31117 -36563 -34034 -38109 -22202 32337 83264 97936 -5653 -45539
24186 -45539 -18575 -37950 -76478 -64095 -4791 -22054 -25759 -2643 -33842 -52110 -76824 -113076
24174 -113076 -119325 -50704 19077 -6925 -46411 -20923 7840 13752 35354 38100 12104 11197
24162 11197 -4508 14716 18734 27696 -24165 -37057 7177 4542 51967 42981 -7546 -42387
24150 -42387 -89705 -94361 12648 -492 -23558 -33638 -78519 -49320 -70136 -44074 -24322 -4053
24138 -4053 22059 37584 70532 14461 -31218 -51424 -61159 -44105 -48086 -15992 -27414 -52145
24126 -52145 -52726 -98742 -77640 -13411 -15759 -49709 -54703 -15648 3342 -19794 -69226 -49547
$$ packed form
24210E369k1808k5172L2841L4950L511J218J7454o6545k6167P134N3457O9061
24198H5303l2208l0103n4109n446K529m075J5907N4539N0927J4672j03589l9886
24186d5539K6964j9375l8528J2383N9304j7263l705K3116l1199j8268k4714l6252
24174a13076o249O8621O9781k6002l9486K5488K8763N912K1602K746k5996r07
24162A1197j5705J9224M018Q962n1861j2892M4234k635M7425q986n0527l4841
24150d2387m7318m656J07009j3140k3066j0080m4881K9199k0816K6062J9752K0269
24138d053K6112J5525L2948n6071m5679k0206r735J7054l981L2094j1422k4731
24126e2145n81m6016K1102O4229k348l3950m994L9055J8990k3136m9432J9679
$$ plain form
24114 -49547 -22569 -55555 -65058 -24140 65690 84814 -18049 -138279 -164670 -112445 -77541
24103 -77541 -64042 -36748 -64153 -49731 -65133 -36563 -43867 -46432 -20707 36198 47043 26358
24091 26358 -77142 -54342 18169 46888 70374 55004 -17605 -75814 -88369 -29011 -38802 -49950
24079 -49950 -14534 -4231 -14423 -13965 17529 10575 -44186 -40414 -19281 17203 -24205 -83740
24067 -83740 -17432 5822 15466 11674 -19110 -30734 -39884 -42877 -1984 -33074 -46602 -49173 -85050
24054 -85050 -46979 8782 1133 -56748 -49300 -21964 -39339 -23605 -17697 -18367 -26915 -9000 46803
24041 46803 45437 -11114 -29815 2069 32534 54740 94996 106321 51438 25150 -11429 -35520
24029 -35520 -76308 -26333 32922 36116 33271 37537 8306 -15351 20524 13432 18803 -5704 -37660
$$ packed form
24114d9547K6978l2986r503M0918Q9830J9124j02863j20230k6391N2225L4904
24103g7541J3499K7294k7405J4422j5402K8570p304k565K5725N6905J0845k0685
24091B6358j03500K2800P2511K8719K3486j5370p2609n8209j2555N9358r791j1148
24079d9950L5416J0303j0192M58L1494o954n4761L772K1133L6484m1408n9535
24067h3740O6308K3254R644l792l0784j1624r150k993M0893l1090j3528k571l5877
24054h5050L8071N5761p649n7881P448K7336j7375J5734N908o70q548J7915N5803
24041D6803j366n6551j8701L1884L0465K2206M0256J1325n4883k6288l6579k4091
24029c5520m0788M9975N9255L194k845M266k9231k3657L5875p092N371k4507l1956
$$ plain form
24016 -37660 -57655 -25489 -34256 -52673 -38000 -25116 -28557 -42695 -39070 45461 62699 32735
24004 32735 -30065 -6857 29180 38134 -14738 -55576 -74295 -28970 -2985 -50747 -53940 29219
23992 29219 42720 30599 25957 54804 44964 8633 7925 44982 41000 19941 31674 -788 -46326
23979 -46326 -1227 93878 87498 21218 5569 10022 40442 66008 82372 96040 81853 43893
23967 43893 26342 44867 11732 -33207 -36755 19159 12481 1315 10908 -16800 -68014 -71411
23955 -71411 -29664 12785 16437 968 -43759 -45341 -73824 -83766 -91293 -77382 -1616 29198
23943 29198 -21210 -2158 52302 43512 13015 -17143 24937 99939 40785 15435 -33171 -81054
23931 -81054 -91593 -86305 -57259 -70523 -52443 -78645 -57829 -17478 -13038 -1220 62554 88077
$$ packed form
24016c7660j9995L2166q767j8417J4673J2884l441j4138L625Q4531J7238k9964
24004C2735o2800K3208L6037Q954n2872m0838j8719M5325K5985m7762l193Q3159
23992B9219J3501j2121m642K8847r840l6331p08L7057l982k1059J1733l2462m5538
23979d6326M5099R5105o380o6280j5649M453L0420K5566J6364J3668j4187l7960
23967D3893j7551J8525l3135m4939l548N5914o678j1166R593k7708n1214l397
23955g1411M1747M2449L652j5469m4727j582k8483r942p527J3911P5766L0814
23943B9198n0408J9052N4460q790l0497l0158M2080P5002n9154k5350m8606m7883
23931h1054j0539N288K9046j3264J8080k6202K0816M0351M440J1818O3774K5523
$$ plain form
23919 88077 41254 -52393 -89491 -17728 -4091 5990 -10637 -34643 -28499 -16508 -43813 -41861
23907 -41861 10610 49114 2067 -872 -10054 -25436 -17206 -19040 -74439 -91310 -118390 -154512
23895 -154512 -135402 -83368 -62252 -48300 -91369 -21058 26831 52489 20803 -5239 -23769
23884 -23769 -42717 -80975 -54316 24432 29720 -893 -30001 -38670 -2294 21852 35861 56814
23872 56814 64537 80208 156402 149626 85315 28684 15882 31451 -6192 -48945 -87159 -110611
23860 -110611 -51573 6194 44504 68177 -21519 -63142 -57217 -80922 -69937 -50480 -45844 -16336
23848 -16336 -13797 1035 12898 562 -6193 497 -32389 15091 12235 -26380 -44032 -62044
23836 -62044 -11940 33434 -26509 -15036 -56157 -33730 17204 -38126 -95008 -102681 -63680 13980
$$ packed form
23919H8077m6823r3647l7098P1763J3637J0081j6627k4006O144J1991k7305J952
23907d1861N2471L8504m7047k939r182j5382Q230j834n5399j6871k7080l6122
23895a54512J9110N2034K1116J3952m3069P0311M7889K5658l1686k6042j8530
23884b3769j8948l8258K6659P8748N288l0613k9108q669L6376K4146J4009K0953
23872E6814P723J5671P6194o776o4311n6631j2802J5569l7643m2753l8214k3452
23860a10611N9038N7767L8310K3673q9696m1623N925k3705J0985J9457M636K9508
23848a6336K539J4832J1863j2336o755O690l2886M7480k856l8615j7652j8012
23836f2044N0104M5374n9943J1473m1121K2427N0934n5330n6882p673L9001P7660
$$ plain form
23824 13980 56972 -364 -59549 -52135 15776 30920 34009 -2633 -11447 -4898 2927 18128 -3401
23811 -3401 17884 9612 -2929 12204 13195 43906 74979 38823 15759 -7265 -98424 -88346
23799 -88346 -54324 -33696 -35536 -13672 -39713 -46345 -27906 -65421 -55412 -19700 -18948 -14869 -35436
23786 -35436 -58704 -62917 -126725 -114906 -53373 -22434 12208 36609 40280 10769 4606 -19914
23774 -19914 -32891 -11522 -15579 -20018 -5838 -74783 -41285 -55479 -103995 -62519 -10271 3327
23762 3327 51309 80376 61366 29340 30579 16635 -36611 -96646 -100373 -76914 -77748 30833
23750 30833 112133 32671 -61806 -42433 68392 75832 38272 -7441 -61823 -135691 -109737 -18865
23738 -18865 11071 68224 50300 1770 -3092 10950 16886 29115 21925 31337 41529 15242
$$ packed form
23824A3980M2992n7336n9185P414O7911J5144L089l6642q814O549P825J5201k1529
23811c401K1285q272j2541J5133R91L0711L1073l6156k3064k3024r1159J0078
23799h8346L4022K0628j840K1864k6041o632J8439l7515J0009L5712P52M079k0567
23786c5436k3268m213o3808J1819O1533L0939L4642K4401L671k9511o163k4520
23774a9914j2977K1369m057m439J4180o8945L3498j4194m8516M1476N2248J3598
23762C327M7982K9067j9010l2026J239j3944n3246o0035l727K3459q34J08581
23750C0833Q1300p9462r4477J9373J10825P440l7560m5713n4382p3868K5954R0872
23738a8865K9936N7153j7924m8530m862J4042N936J2229p190R412J0192k6287
$$ plain form
23726 15242 -18109 -53735 1144 -6360 -43120 -51001 -26197 20185 3240 27849 -48404 -109998
23714 -109998 -156449 -188710 -130250 -104079 -105459 -80906 -28885 6410 -3393 39796 16736 -30275
23702 -30275 -41087 -49927 -26024 -30132 -51980 -84623 -75222 -82141 -34466 -22360 10834 15276 -5155
23689 -5155 26916 40566 2574 13325 44472 37249 22409 37601 12696 5520 -20326 -61828
23677 -61828 -44607 -44976 -107709 -73514 -77290 -84349 -124982 -94933 -68957 8601 29697 -14301
23665 -14301 -22454 496 -12127 -3703 6452 -15430 -14701 -20154 -40381 42057 59012 4131 14645
23652 14645 37862 -7041 -84228 -82323 -83254 -81172 -24822 55147 48359 56484 59813 42793 116090
23639 116090 131250 119991 79774 58119 48486 9280 24717 44576 101544 125670 87194 112769
$$ packed form
23726A5242l3351l5626N4879p504l6760p881K4804M6382j6945K4609p6253o1594
23714a09998m6451l2261N8460K6171j380K4553N2021L5295r803M3189k3060m7011
23702c0275j0812q840K3903m108k1848l2643R401o919M7675J2106L3194M442k0431
23689e155L2071J3650l7992J0751L1147p223j4840J5192k4905p176k5846m1502
23677f1828J7221l69o2733L4195l776p059m0633L0049K5976P7558K1096m3998
23665a4301q153K2950j2623Q424J0155k1882P29n453k0227Q2438J6955n4881J0514
23652A4645K3217m4903p7187J905r31K082N6350P9969o788Q125L329j7020P3297
23639A16090J5160j1259m0217k1655r633l9206J5437J9859N6968K4126l8476K5575
$$ plain form
23627 112769 126022 105309 74893 44687 31142 172 35229 28810 50170 -5909 -12946 341
23615 341 -19652 -39512 -49402 -47207 -9370 1093 -20872 -29632 -47504 -62730 -36440 56220 46107
23602 46107 -25010 -73466 -41100 -33970 -40127 -66265 -15083 -21906 16991 -47363 -76561 -63839
23590 -63839 -85875 -114945 -85308 -67729 -79628 -45484 -37541 -81973 -87987 -37134 27297 23041
23578 23041 8122 -33429 -76198 -33537 21019 60104 46839 1179 -41581 -1086 19440 12148
23566 12148 18342 7240 25794 -5372 -9811 14742 10541 -34062 4194 14502 -10619 -35567
23554 -35567 -36515 -33220 -8857 16103 -3356 -29024 -57353 -41951 -15990 -57804 -55325 -24791
23542 -24791 4351 54265 33733 63242 23906 33569 604 23226 17145 17548 68639 92737
$$ packed form
23627A12769J3253k0713l0416l0206j3545l0970L5057o419K1360n6079p037J3287
23615C41j9993j9860r890K195L7837J0463k1965q760j7872j5226K6290R2660j0113
23602D6107p1117m8456L2366P130o157k6138N1182o823L8897o4354k9198J2722
23590f3839k2036k9070K9637J7579j1899L4144P943m4432o014N0853O4431m256
23578B3041j4919m1551m2769M2661N4556L9085j3265m5660m2760M0495K0526p292
23566A2148O194j1102J8554l1166m439K4553m201m4603L8256J0308k5121k4948
23554c5567r48L295K4363K4960j9459k5668k8329J5402K5961m1814K479L0534
23542b4791K9142M9914k0532K9509l9336R663l2965K2622o081M03N1091K4098
$$ plain form
23530 92737 87209 86630 54414 39473 58077 23175 839 -4339 23501 46530 77098 45430
23518 45430 31717 29690 -38931 -45791 -22248 -21395 26906 45542 46661 3732 -16146 -6621 -74558
23505 -74558 -86539 -77188 -104880 -88315 -87186 -109873 -117092 -117154 -114868 -95740 -74906 -76038 -60612
23492 -60612 -88739 -92992 -70482 -101753 -111588 -108735 -48245 -35809 -92274 -128690 -83012 -85671
23480 -85671 -104072 -131148 -54829 -5908 18530 -4807 -37375 -32633 -15696 -33132 -68292 -30238
23468 -30238 -2526 -24599 -51507 3723 68236 38545 28402 5430 3487 1839 -42051 -37971
23456 -37971 -104490 -136092 -127317 -97934 -79095 -80493 -15271 -5764 -6378 -18325 -30804 -85458 -55820
23443 -55820 -55955 -94993 -18697 39435 -25189 -72162 -46249 -19234 -20105 -23063 422 71111 57720
$$ packed form
23530I2737n528n79l2216j4941J8604l4902k2336n178K7840K3029L0568l1668
23518D5430j3713k027o8621o860K3543Q53M8301J8636J119m2929j9878R525o7937
23505g4558j1981R351k7692J6565J129k2687p219o2K286J9128K0834j132J5426
23492f0612k8127m253K2510l1271r835K853O0490J2436n6465l6416M5678k659
23480h5671j8401k7076P6319M8921K4438k3337l2568M742J6937j7436l5160L8054
23468c0238K7712k2073k6908N5230O4513k9691j0143k2972j943j648m3890M080
23456c7971o6519l1602Q775K9383J8839j398O5222R507o14j1947j2479n4654K9638
23443e5820j35l9038P6296N8132o4624m6973K5913K7015q71k958K3485P0689j3391
$$ plain form
23430 57720 -37453 -59464 -52281 -23240 13374 -17252 -32522 15112 54619 30415 -7536 -12071
23418 -12071 -11693 8694 -19227 -19143 -6992 29984 35481 -5536 28629 57652 10036 -80298 -45867
23405 -45867 26601 18207 -16560 -48179 -34651 -4657 41906 20718 17188 27206 -7283 9562
23393 9562 -11349 -9391 16478 3778 -67809 -110342 -64960 -43346 -22022 -39188 -125067 -178098
23381 -178098 -127302 -75778 -56284 -10936 -51071 -100275 -88221 -50759 -55256 -66003 -25027 -10008
23369 -10008 -44449 -34155 -13000 -14117 -9323 18729 8990 -15808 -4970 -59577 -49756 5624
23357 5624 35836 45760 11173 -32361 -11844 -51455 -76671 -86705 -50950 3426 -21724 15857
23345 15857 31837 16208 1866 17549 32024 -12361 -21689 -50121 767 14470 -30878 12349
$$ packed form
23430E7720r5173k2011P183K9041L6614l0626j5270M7634L9507k4204l7951m535
23418a2071L78K0387k7921Q4J2151L6976N497m1017L4165K9023m7616r0334L4431
23405d5867P2468q394l4767l1619J3528K9994M6563k1188l530J0018l4489J6845
23393I562k0911J958K5869j2700p1587m2533M5382K1614K1324j7166q5879n3031
23381a78098N0796N1524J9494M5348m0135m9204J2054L7462m497j0747M0976J5019
23369a0008l4441J0294K1155j117M794K8052r739k4798J0838n4607R821N5380
23357E624L0212R924l4587m3534K0517l9611k5216j0034L5755N4376k5150L7581
23345A5857J5980j5629j4342J5683J4475m4385r328k8432N0888J3703m5348M3227
$$ plain form
23333 12349 2327 25832 3241 -57187 -37062 -10486 -5558 -40897 -84875 -52892 -24561 -2364
23321 -2364 15202 3401 -29344 -70989 -55488 -48484 -33368 -26487 -67743 -7031 56367 32368
23309 32368 55349 32192 2419 -40241 -31936 -24681 -71694 -84766 -116872 -114515 -46202 -30003
23297 -30003 -63124 -63208 -41164 -13177 9225 44370 11891 20513 -29176 -76545 -23152 -13053
23285 -13053 -13949 26313 -4596 -41903 -19590 -18756 2364 21075 11220 12836 -29018 -67422 -95344
23272 -95344 -72167 -76820 -71561 -50532 -29908 -69984 -75579 -95515 -92765 -49449 -70707 -59559
23260 -59559 -35877 -46072 -30446 -51253 -63484 -69364 -69890 -31316 -30049 -33534 -16147 -43777 -59683
23247 -59683 -26528 -34290 -90991 -62890 -28735 -41721 -47730 -55317 -101785 -50399 17539 6272
$$ packed form
23333A2349j0022K3505k2591o0428K0125K6576M928l5339m3978L1983K8331K2197
23321b364J7566j1801l2745m1645J5501P004J5116O881m1256O0712O3398k3999
23309C2368K2981k3157k9773m2660Q305P255m7013j3072l2106K357O8313J6199
23297c0003l3121q4K2044K7987K2402L5145l2479Q622m9689m7369N3393J0099
23285a3053q96M0262l0909l7307K2313Q34K1120J8711r855J616m1854l8404k7922
23272i5344K3177m653N259K1029K0624m0076n595j9936K750M3316k1258J1148
23260e9559K3682j0195J5626k0807j2231n880n26L8574J267l485J7387k7630j5906
23247e9683L3155p762n6701K8101L4155j2986o009p587m6468N1386O7938j1267
$$ plain form
23235 6272 -27027 -58811 -44529 -56713 -66877 -47386 -21305 -21291 -7833 8614 -24866 -57149
23223 -57149 -56911 -58490 -54909 -37195 -49654 -82293 -41057 7794 13607 -8489 -35517 2016 7865
23210 7865 5852 59715 35912 6420 -32660 -52899 -102078 -87950 -97985 -75252 -9955 6667
23198 6667 45268 73007 87920 90178 -28557 -92028 -81167 -60067 -34088 -16734 -30837 16094
23186 16094 45100 39038 29663 10039 -8322 1585 -28089 -87201 -62384 -27090 -8825 23056
23174 23056 47550 7309 -34957 66045 77430 45027 -42079 -25519 -21640 -74157 -39903 33775
23162 33775 4998 -51259 -69041 -64045 -14840 -2607 -11326 21363 -15650 -3918 26517 -29434
23150 -29434 -61689 -90480 -66346 -5076 18228 -81580 -91937 -47145 -38285 -31889 30132 69678
$$ packed form
23235F272l3299l1784J4282j2184j0164J9491K6081J4J3458J6447l3480l2283
23223e7149K38j579L581J7714j2459l2639M1236M8851N813k2096k7028L7533N849
23210G865k013N3863k3803k9492l9080k0239m9179J4128j0035K2733O5297J6622
23198F667L8601K7739J4913K258j18735o3471J0861K1100K5979J7354j4103M6931
23186A6094K9006o062r375j9624j8361R907k9674n9112K4817L5294J8265L1881
23174B3056K4494m0241m2266J01002J1385l2403q7106J6560L879n2517L4254P3678
23162C3775k8777n6257j7782M996M9205J2233q719L2689l7013J1732L0435n5951
23150b9434l2255k8791K4134O1270K3304r9808j0357M4792Q860O396O2021L9546
$$ plain form
23138 69678 83936 7590 -1083 60295 40931 40489 65251 77539 54080 36614 47227 20613
23126 20613 8209 -1450 33459 49559 6274 -33082 -20815 -18546 -41331 -63501 -50230 -20940
23114 -20940 -62070 -52651 -34644 -44159 -47648 -57653 -40491 -35236 -6218 -6788 -76269 -52197 -44741
23101 -44741 -48640 -56610 -46501 -36953 9215 49241 -18390 -35954 -38600 -59207 -37472 -47249 -50554
23088 -50554 -18563 -29779 -40891 -81602 -97817 -45248 13463 1847 -64733 -36626 -24957 -7211
23076 -7211 26182 71361 69332 50276 24012 -7742 -31931 -13956 7994 5784 -5795 -4810 8982
23063 8982 -9242 10837 35727 27095 34136 42561 30998 9886 -1584 -31061 -26550 -58399 -62513
23050 -62513 -53835 -73726 -102661 -78488 -37577 -21497 -10311 -25594 -22846 6506 4287 13442
$$ packed form
23138F9678J4258p6346q673O1378j9364m42K4762J2288k3459j7466J0613k6614
23126B0613j2404r659L4909J6100m3285l9356J2267K269k2785k2170J3271K9290
23114b0940m1130R419J8007r515l489j0005J7162N255K9018n70o9481K4072P456
23101d4741l899p970J0109R548M6168M0026o7631j7564k646k0607K1735r777l305
23088e0554L1991j1216j1112m0711j6215N2569N8711j1616o6580K8107J1669J7746
23076g211L3393M5179k029j9056k6264l1754k4189J7975K1950k210j1579R85J3792
23063H982j8224K0079K4890q632P041Q425j1563k1112j1470k9477M511l1849m114
23050f2513Q678j9891k8935K4173M0911J6080J1186j5283K748K9352k219R155
$$ plain form
23038 13442 23482 13737 46695 83889 86556 38234 -28378 -18831 -24347 43889 62751 32324
23026 32324 28462 55777 5234 -37712 -67363 -56892 -65149 -70024 -87885 -70529 -45974 -44053
23014 -44053 32771 29059 -5650 25325 35107 -18629 -51874 -45029 -25504 5098 16190 25376
23002 25376 35861 41221 34636 66996 58881 31053 -29696 -24376 37807 14220 50333 88218
22990 88218 103353 34753 -10516 -21639 -20748 -35948 -34421 -59288 -112313 -76804 -50472 -14087
22978 -14087 -37571 -41867 -42056 -53989 -80691 -51533 -49230 -62914 -36325 -22560 -25659 -44580 -16294
22965 -16294 41543 57272 13052 -3777 16070 -8022 15308 -13699 -4682 21689 22306 2623
22953 2623 27680 36582 8865 -12963 -10434 -21671 -83127 -131433 -77567 -64513 -58426 40810
$$ packed form
23038A3442J0040r745L2958L7194K667m8322o6612R547n516O8236J8862l0427
23026C2324l862K7315n0543m2946k9651J0471q257m875j7861J7356K4555J921
23014d4053P6824l712l4709L0975R782n3736l3245O845J9525L0602J1092R186
23002B5376J0485N360o585L2360q115k7828o0749N320O2183k3587L6113L7885
22990H8218J5135o8600m5269j1123Q91j5200J527k4867n3025L5509K6332L6385
22978a4087k3484m296j89j1933k6702K9158K303j3684K6589J3765l099j8921K8286
22965a6294N7837J5729m4220j6829J9847k4092K3330k9007R017K6371O17j9683
22953B623K5057Q902k7717k1828K529j1237o1456m8306N3866J3054O087R9236
$$ plain form
22941 40810 90594 84006 84328 80198 18061 -41844 -74760 -12146 64452 88167 42154 -23071
22929 -23071 9238 28747 -8941 -18217 -7864 15157 30720 -77557 -119822 -135761 -114525 -64699
22917 -64699 -111522 -100702 -32896 -49288 -40019 24512 67044 82115 43728 20027 -25349 -50114
22905 -50114 -74797 -66001 -35528 -51533 -40451 -62317 -80223 -22682 -9029 -66039 -72560 2910
22893 2910 16258 -31220 -46623 1154 -18367 -29820 32199 74476 47313 14060 -21924 -38349
22881 -38349 -9125 33052 78001 75705 37635 43401 4466 14754 -17258 -28432 -49417 -98471
22869 -98471 -45877 -11950 -4689 -7312 16963 39818 17270 71907 72141 9730 16491 22320 -47785
22856 -47785 -61203 755 9330 -35436 -66202 -77136 -101550 -45236 20726 21849 9741 -30118
$$ packed form
22941D0810M9784o588L22m130o2137n9905l2916O2614P6598K3715m6013o5225
22929b3071L2309J9509l7688r276J0353K3021J5563j08277m2265j5939K1236M9826
22917f4699m6823J0820O7806j6392R269O4531M2532J5071l8387k3701m5376k4765
22905e0114k4683Q796L0473j6005J1082k1866j7906N7541J3653n7010o521P5470
22893B910J3348m7478j5403M7777j9521j1453O2019M2277k7163l3253l5984j6425
22881c8349K9224M2177M4949k296l8070N766l8935J0288l2012j1174k0985m9054
22869i8471N2594L3927P261k623K4275K2855k2548N4637K34o2411O761N829p0105
22856d7785j3418O1958Q575m4766l0766j0934k4414N6314O5962J123j2108l9859
$$ plain form
22844 -30118 -45820 -20741 -11472 11653 -29880 -50608 -40480 -60157 -33922 867 -20904 -35403
22832 -35403 -7402 -4478 -4696 -23064 28342 38341 22242 11069 -328 -43390 -49293 -5427 -1755
22819 -1755 -2378 24595 408 -13398 -52271 -75848 -132134 -130541 -87556 -36610 -26857 -41072 -42268
22806 -42268 -105496 -136159 -157974 -158507 -102075 -22915 17549 43032 56404 29216 2473 -32968
22794 -32968 -17619 -21486 -69208 -46884 -54545 -100793 -130022 -87148 -43928 -52505 -47477 -7951
22782 -7951 14992 6112 45901 10447 6593 -8121 -43610 -53791 11535 -2840 60598 54334
22770 54334 20264 11998 -3894 -3292 -16560 -20983 -14590 7019 -49340 -88994 -74245 -51145 -58318
22757 -58318 -66190 -33179 -47478 -24021 -50085 -67278 -86390 -114119 -104719 -80538 -83894 -34512
$$ packed form
22844c0118j5702K5079R269K3125m1533k0728J0128j9677K6235L4789k1771j4499
22832c5403K8001K924k18j8368N1406R999j6099j1173j1397m3062n903M3866L672
22819a755o23K6973k4187j3806l8873k3577n6286J593M2985N0946R753j4215j196
22806d2268o3228l0663k1815n33N6432P9160M0464K5483J3372k7188k6743l5441
22794c2968J5349l867m7722K2324p661m6248k9229M2874M3220q577N028L9526
22782g951K2943q880L9789l5454l854j4714l5489j0181O5326j4375O3438o264
22770E4334l4070q266j5892O02j3268m423O393K1609n6359l9654J4749K3100p173
22757e8318p872L3011j4299K3457k6064j7193j9112k7729R400K4181l356M9382
$$ plain form
22745 -34512 -47028 -37856 -7173 19081 -36818 -38819 -22197 -64414 -56236 -71550 -27206 2302
22733 2302 -44299 -74069 -2137 8311 3155 -20331 1990 -2386 22380 -35190 -48707 -36532
22721 -36532 54004 60689 28734 42109 21177 32164 29634 73558 40964 -25464 -102611 -108785
22709 -108785 -67415 -31359 -41012 -12852 -26633 -41460 12058 7306 -31484 -71140 -93022 -38546
22697 -38546 2511 6606 -17255 -49719 -27122 22452 15070 -1175 -7708 -44916 -7939 40830
22685 40830 -6217 -47132 -52824 -68698 -32032 -14166 -11253 -35110 -53141 -65971 1231 16245
22673 16245 849 18496 9687 -7426 27935 81568 28311 -56268 -37550 -44909 -67007 -56801
22661 -56801 -70216 -18838 -3748 17251 41350 82439 87290 53841 -4778 -45524 -9789 17831
$$ packed form
22745c4512j2516R172L0683K6254n5899k001J6622m2217Q178j5314M4344K9508
22733B302m6601k9770P1932J0448n156k3486K2321m376K4766n7570j3517J2175
22721c6532R0536O685l1955J3375k0932J0987k530M3924l2594o6428p7147o174
22709a08785M1370L6056r653K8160j3781j4827N3518m752l8790l9656k1882N4476
22697c8546M1057M095k3861l2464K2597M9574p382j6245o533l7208L6977M8769
22685D0830m7047m0915n692j5874L6666J7866K913k3857j8031j2830O7202J5014
22673A6245j5396J7647q809j7113L5361N3633n3257q4579J8718p359k2098J0206
22661e6801j3415N1378J5090K0999K4099M1089M851l3449n8619m0746L5735K7620
$$ plain form
22649 17831 -47192 -69430 -34001 39331 51375 45993 21505 -8853 -47692 -87243 -52197 -27364
22637 -27364 -50999 -87677 -55326 -12051 -12637 -19036 15072 49600 52956 71639 72408 61633 -49
22624 -49 -72119 -56781 -50256 -43723 -15912 28443 7139 -53372 -45198 -88414 -49871 11041 27221
22611 27221 9662 27020 -6210 -82022 -100146 -147244 -97715 -34321 -28745 47770 59798 27785
22599 27785 8991 20028 33508 -13883 -13649 47334 69413 69268 17796 20240 9566 -42682 -28073
22586 -28073 -10444 -6760 47536 83072 62512 43982 17135 -630 -16235 10689 -23692 -62235
22574 -62235 -28409 16045 -33259 -13447 -1179 -65348 -48552 -34963 -46394 -57082 -29529 32723
22562 32723 68461 28729 -28918 -44745 35222 81377 54801 68949 67060 47505 57571 52120
$$ packed form
22649A7831o5023k2238L5429P3332J2044n382k4488l0358l8839l9551L5046K4833
22637b7364k3635l6678L2351M3275n86o399L4108L4528L356J8683P69j0775o1682
22624d9p2070J5338O525O533K7811M4355k1304o0511Q174m3216L8543O0912J6180
22611B7221j7559J7358l3230p5812j8124m7098M9529O3394N576P6515J2028l2013
22599B7785j8794J1037J3480m7391K34O0983K2079j45n1472K444j0674n2248J4609
22586b8073J7629L684N4296L5536k0560j8530k6847j7765j5605K6924l4381l8543
22574f2235L3826M4454m9304J9812J2268o4169J6796J3589j1431j0688K7553O2252
22562C2723L5738l9732n7647j5827P9967M6155k6576J4148j889j9555J0066n451
$$ plain form
22550 52120 25173 -20616 1400 -45855 -88265 -126691 -104922 -86885 -63227 -31177 -35809 -42209
22538 -42209 -47270 -14361 -37780 -43441 -62820 -65305 -23129 -2460 -40223 -51327 -25735 13292
22526 13292 3526 -6433 10546 -6149 -25121 -42972 -17675 -17534 -36657 -54865 -57856 -56401 -39054
22513 -39054 -48255 -50359 15376 42295 51913 -127 -76090 -100803 -36934 -4512 -24455 -56809
22501 -56809 -75737 -23647 18985 -31773 -101052 -117539 -82004 -72977 -26659 -51499 -69169 -20217
22489 -20217 12323 11428 31669 36541 4954 -41789 -13779 47279 83125 90324 39041 -17889
22477 -17889 -26713 -21592 -31264 -12970 -25255 27997 4565 -72559 -72260 13239 37007 48542 -14501
22464 -14501 -119196 -104211 -62795 -48156 -49933 -84824 -51217 -59746 -32638 23799 26957 41886
$$ packed form
22550E2120k6947m5789K2016m7255m2410l8426K1769J8037K3658L2050m632o400
22538d2209n061L2909k3419n661j9379k485M2176K0669l7763j1104K5592L9027
22526A3292r766r959J6979j6695j8972j7851K5297J41j9123j8208k991J455J7347
22513c9054r201k104O5735K6919R618n2040p5963k4713O3869L2422j9943l2354
22501e6809j8928N2090M2632n0758o9279j6487L5535R027M6318k4840j7670M8952
22489b0217L2540q95K0241M872l1587m6743K8010O1058L5846P199n1283n6930
22477a7889q824N121r672J8294j2285N3252k3432p7124K99Q5499K3768J1535o3043
22464a4501j04695J4985M1416J4639j777l4891L3607q529K7108N6437L158J4929
$$ plain form
22452 41886 65776 64711 8023 -2450 7226 35334 49948 9881 -73348 -83687 -67957 -42325
22440 -42325 -58931 -36371 -47691 -93565 -51742 -14828 -42280 -31088 -34992 -56775 -73059 -36483
22428 -36483 -54971 -62207 -93689 -87911 -84162 -119801 -148472 -152419 -150714 -95187 -34946 -34577 -15860
22415 -15860 -21840 -58761 -102245 -112577 -52922 -45107 -52369 -99822 -120009 -64827 -38686 -26050
22403 -26050 -45454 23241 -1464 -46020 -11593 -21523 -68692 -54795 -56768 3668 2066 -22033
22391 -22033 -77827 -95567 -66981 -28318 -29832 18876 50660 11660 -5622 7037 55676 45606
22379 45606 33067 -52292 -9485 -5981 -38454 23370 64850 37642 1716 21055 15223 -57083
22367 -57083 -70714 -20453 13122 6712 -13369 14796 61100 54538 55780 89479 74254 47630
$$ packed form
22452D1886K3890j065n6688j0473R676K8108J4614m0067q3229j0339J5730K5632
22440d2325j6606K2560j1320m5874M1823L6914k7452J1192l904k1783j6284L6576
22428c6483j8488p236l1482N778L749l5639k8671l947J705N5527O0241L69J8717
22415a5860n980l6921m3484j0332N9655P815p262m7453k0187N5182K6141J2636
22403b6050j9404O8695k4705m4556L4427r930m7169J3897j973O0436j602k4099
22391b2033n5794j7740K8586L8663j514M8708L1784l9000j7282J2659M8639j0070
22379D5606j2539q5359M2807L504l2473O1824M1480k7208l5926J9339n832p2306
22367e7083j3631N0261L3575o410k0081K8165M6304o562J242L3699j5225k6624
$$ plain form
22355 47630 -28123 -119766 -126075 -55719 -25666 -33733 -36810 -43913 -61535 -38483 16257 12834 -56152
22342 -56152 -68275 -44376 -50391 17611 95588 91143 24827 18839 1826 -16512 6587 -5618
22330 -5618 7632 30411 4209 -5016 6130 -31234 -29146 4642 34872 2383 -34627 -11518
22318 -11518 17970 36010 35578 35303 33599 1446 -31310 69080 119865 111893 -4506 -30255
22306 -30255 -5096 -11519 18301 66439 41491 56803 85117 70712 100985 101474 72407 37850
22294 37850 43857 34114 39984 7835 -24548 -23721 -28445 -2982 -51494 -31119 -10470 -22346 -17733
22281 -17733 -19406 -5426 -11197 21327 41826 30715 22931 6096 -8466 -32116 -96496 -56962
22269 -56962 -31886 -16303 -4653 20461 74966 24651 8487 44118 17311 -26921 -23424 -29372
$$ packed form
22355D7630p5753r1643o309P0356L0053q067l077p103j7622K3052N4740l423o8986
22342e6152j2123K3899o015O8002P7977m445o6316n988j7013j8338K3099j2205
22330e618J3250K2779k6202r225J1146l7364K088L3788L0230l2489l7010K3109
22318a1518K9488J8040m32k75j704l2153l2756J00390N0785p972j16399k5749
22306c0255K5159o423K9820M8138k4948J5312K8314j4405L0273M89k9067l4557
22294C7850O007r743N870l2149l2383Q27m724K5463m8512K0375K0649j1876M613
22281a7733j673J3980n771L2524K0499j1111p784j6835j4562k3650o4380L9534
22269e6962K5076J5583J1650K5114N4505n0315j6164L5631k6807m4232L497n948
$$ plain form
22257 -29372 -28501 10395 102760 109704 148123 133360 135056 68571 4359 -48253 7125 76491
22245 76491 54026 10764 61727 49999 14157 -69983 -96434 -50395 -3331 13589 2020 12632
22233 12632 72812 123182 53856 -20469 -67742 -64077 -31634 9016 29165 21268 14676 15980
22221 15980 23168 34938 -55202 -81525 -131074 -125299 -81921 -52510 -32381 38937 43886 4918
22209 4918 -51067 -53966 -12113 44758 42048 10844 -34554 -49460 -10165 46378 56654 38360
22197 38360 28334 12152 -18336 -1927 50239 97583 75118 19056 -39119 22229 58308 58097
22185 58097 87191 93766 87006 117475 104893 113592 79934 62197 20359 -15377 -2413 25391
22173 25391 64874 56257 38748 -23215 -18587 -17118 -59300 -83347 -80564 -108417 -119162 -89293
$$ packed form
22257b9372Q71L8896R2365O944L8419j4763J696o6485o4212n2612N5378O9366
22245G6491k2465m3262N0963j1728l5842q4140k6451M6039M7064J6920j1569J0612
22233A2632O0180N0370o9326p4325m7273L665L2443M0650K0149p897o592J304
22221A5980P188J1770r0140k6323m9549N775M3378K9411K0129P1318M949l8968
22209D918n5985k899M1853N6871k710l1204m5398j4906L9295N6543J0276j8294
22197C8360j0026j6182l0488J6409N2166M7344k2465n6062n8175O1348L6079k11
22185E8097K9094O575o760L0469j2582Q699l3658j7737m1838l5736J2964K7804
22173B5391L9483q617j7509o1963M628J469m2182k4047K783k7853j0745K9869
$$ plain form
22161 -89293 -70990 -26961 1627 -26153 -53022 -52148 -91440 -103858 -57907 -50248 4658 47989
22149 47989 55450 -18841 -69228 -88951 -74858 -1290 28206 65027 43167 29822 28551 -13718
22137 -13718 -19366 80259 73332 33804 81017 84816 39497 -10945 -15903 -1688 16798 59204
22125 59204 47707 31098 -28821 -40172 -28559 -13456 -2091 -7068 35647 30584 38350 52815
22113 52815 34989 45255 41778 5369 -74635 -98324 -51502 -10641 16291 -6356 -60904 -29406
22101 -29406 -63594 -34020 -24606 -43548 -43314 881 77040 60273 10231 46910 27024 41596
22089 41596 13426 1465 423 6719 20204 38599 41832 11620 49179 63208 56227 104825
22077 104825 163620 202771 140696 83486 49313 7907 26993 -8927 19275 59833 16562
$$ packed form
22161h9293J8303M4029K8588k7780k6869Q74l9292j2418M5951P659N4906M3331
22149D7989P461p4291n0387j9723J4093P3568K9496L6821k1860j3345j271m2269
22137a3718n648R9625o927l9528M7213L799m5319n0442m958J4215J8486M2406
22125E9204j1497j6609n9919j1351J1613J5103J1365m977M2715n063P766J4465
22113E2815j7826J0266l477l6409q0004k3689M6822M0861K6932k2647n4548L1498
22101b9406l4188K9574R414j8942K34M4195P6159j6767n0042L6679j9886J4572
22089D1596k8170j1961j042O296J3485J8395L233l0212L7559J4029o981M8598
22077A04825N8795L9151o2075n7210l4173m1406J9086l5920K8202M0558m3271
$$ plain form
22066 16562 -19034 -23895 4903 -25842 -65645 -44011 -983 44380 66542 46022 29869 17484
22054 17484 56619 96390 106027 115954 162377 276609 304255 306674 347805 390690 437682 448461
22042 448461 391975 343974 304100 308349 323477 431666 636252 870458 1126519 1466345 1866477
22031 1866477 2264127 2557487 2741695 2885674 2766721 2435744 2061181 1660085 1285206
22022 1285206 948651 683698 496536 275231 184313 208721 205540 140645 113245 104890 98838
22011 98838 75916 63306 78733 132080 147488 129912 110309 23170 48213 84821 83641 134541
21999 134541 98782 56311 25509 19680 45654 38600 13543 3030 -16664 -41611 17169 45464
21987 45464 32861 62173 59307 67562 56743 35976 22311 53745 23534 36479 64772 43255
$$ packed form
22066A6562l5596m861K8798l0745l9803K1634M3028M5363K2162k0520j6153j2385
22054A7484L9135L9771R637R927M6423J14232K7646K419M1131M2885M6992J0779
22042D48461n6486m8001l9874M249J5128J08189K04586K34206K56061L39826M00132
22031A866477L97650K93360J84208J43979j18953l30977l74563m01096l74879
22022A285206l36555k64953j87162k21305r0918K4408l181o4895k7400q355o052
22011I8838k2922j2610J5427N3347J5408j7576j9603q7139K5043L6608j180N0900
21999A34541l5759m2471l0802n829K5974p054k5057j0513j9694k4947N8780K8295
21987D5464j2603K9312k866Q255j0819k0767j3665L1434l0211J2945K8293k1517
$$ plain form
21975 43255 -7646 -50957 -49499 19458 44079 -370 -16674 11468 28165 59186 41262 29140
21963 29140 80357 85326 -18805 -58546 -5129 -22797 -698 81426 71369 46484 18554 -7298
21951 -7298 37832 44657 77614 75612 24855 -35177 -33355 -6010 -23988 -70594 -42020 21444
21939 21444 29800 17058 69284 122601 74933 29075 56592 29546 -5644 19657 6319 -5183
21927 -5183 -4641 14812 41013 49891 117141 110405 91460 78004 39291 59100 102337 96832 63172
21914 63172 40413 89400 34872 15950 18475 23281 -24748 -61154 -45522 9299 56717 44352
21902 44352 76548 78228 5700 -17804 7692 58704 74639 115546 132489 97286 125064 146173
21890 146173 168342 89013 47520 121117 142235 114195 167688 149008 121224 50948 36683
$$ packed form
21975D3255n0901m3311J458O8957K4621m4449j6304K8142J6697L1021j7924j2122
21963B9140N1217M969j04131l9741N3417j7668K2099Q2124j0057k4885k7930k5852
21951g298M5130O825L2957k002n0757o0032J822K7345j7978m6606K8574O3464
21939B1444Q356j2742N2226N3317m7668m5858K7517k7046l5190K5301j3338j1502
21927e183N42J9453K6201Q878O7250o736j8945j3456l8713J9809M3237n505l3660
21914F3172k2759M8987n4528j8922K525M806m8029l6406J5632N4821M7418j2365
21902D4352L2196J680p2528k3504K5496N1012J5935M0907J6943l5203K7778K1109
21890A46173K2169p9329m1493P3597K1118k8040N3493j8680k7784p0276j4265
$$ plain form
21879 36683 46644 50992 123374 164660 85741 20560 56477 107272 116611 72399 75977 123769
21867 123769 154444 169078 118079 68721 36336 92832 128150 95724 39119 14304 -25188
21856 -25188 -57028 -50977 -16110 23965 78871 53990 -16804 -22765 2172 51921 54013 21718
21844 21718 30726 63543 76720 63257 97880 131595 134280 127412 84717 42770 33143 60271
21832 60271 88197 112336 46930 -15099 2610 -1115 -5217 -9081 18180 3810 -25179 -30257
21820 -30257 -16299 45284 131834 147185 142708 109596 42556 38484 21848 -25786 -23259 21403
21808 21403 81514 112434 86612 50024 18879 -34149 -42102 -34977 -31586 -4367 12652 43998
21796 43998 56309 85809 71854 20032 8384 26089 73827 95777 106621 128131 72522 53805
$$ packed form
21879C6683R961M348P2382M1286p8919o5181L5917N0795R339m4212L578M7792
21867A23769L0675J4634n0999m9358l2385N6496L5318l2426n6605k4815l9492
21856b5188l1840O051L4867M0075N4906k4881p0794n961K4937M9749K092l2295
21844B1718R008L2817J3177j3463L4623L3715K685o868m2695m1947r627K7128
21832F0271K7926K4139o5406o2029J7709l725m102l864K7261j4370k8989n078
21820c0257J3958O1583Q6550J5351m477l3112o7040m072j6636m7634K527M4662
21808B1403O0111L0920k5822l6588l1145n3028p953P125L391K7219J7019L1346
21796D3998J2311K9500j3955n1822j1648J7705M7738K1950J0844K1510n5609j8717
$$ plain form
21784 53805 64069 85516 -4563 -6817 17878 59064 47036 25143 56706 58674 17405 26956
21772 26956 59141 105470 107265 81575 77292 9861 -13443 22898 -37677 -25287 34583 27504
21760 27504 39837 48286 47703 -6344 -12373 -7944 42449 85007 76485 77481 135079 186480 224099
21747 224099 183392 152141 160115 203815 234168 217161 189180 154491 177508 188006 222123 209967
21735 209967 186337 165199 208386 249971 277840 258244 270371 276949 303617 276760 309448 408775
21723 408775 394223 380919 370676 286116 291050 309286 264860 254640 236382 247708 227743 191831
21711 191831 147338 175173 197406 117779 103445 152683 178676 216983 197921 152686 183880
21700 183880 209751 181354 224010 230360 186702 172632 113674 107137 124188 147784 182180 186195
$$ packed form
21784E3805J0264K1447r0079k254K4695M1186j2028k1893L1563J968m1269R551
21772B6956L2185M6329J795k5690m283o7431k3304L6341o0575J2390N9870p079
21760B7504J2333Q449n83n4047o029M429N0393M2558q522R96N7598N1401L7619
21747B24099m0707l1251P974M3700L0353j7007k7981l4689K3017J0498L4117j2156
21735B09967k3630k1138M3187M1585K7869j9596J2127O578K6668k6857L2688R9327
21723D08775j4552j3304j0243q4560M934J8236m4426j0220j8258J1326j9965l5912
21711A91831m4493K7835K2233p9627j4334M9238K5993L8307j9062m5235L1194
21700A83880K5871k8397M2656O350m3658j4070n8958o537J7051K3596L4396M015
$$ plain form
21688 186195 154971 101237 46732 53804 105219 197380 236377 190034 147948 141179 142154 149494
21676 149494 158696 124154 146519 147914 164401 140297 185133 192365 183931 151723 98451 70958
21664 70958 124447 138821 154385 139929 113654 179364 166828 170261 158364 117173 155785 227169
21652 227169 212130 174489 161895 139061 91125 101392 107210 133239 150360 82764 82269 77635
21640 77635 58850 29651 31939 84737 81692 50587 37887 53853 99386 158663 177646 216436
21628 216436 259231 311025 291614 317261 361814 330335 296835 326567 306012 318246 358804
21617 358804 365664 421918 468793 491733 497657 514519 586494 621904 674518 763920 845621 915498
21605 915498 988291 1128467 1211523 1287229 1360092 1415325 1473519 1485789 1413318 1327518 1221000
$$ packed form
21688A86195l1224n3734n4505P072N1415R2161L8997m6343m2086o769R75P340
21676A49494R202l4542K2365J395J6487k4104M4836P232q434l2208n3272k7493
21664G0958N3489J4374J5564j4456k6275O5710j2536L433j1897m1191L8612P1384
21652B27169j5039l7641j2594k2834m7936J0267N818K6029J7121o7596m95m634
21640G7635j8785k9199K288N2798l045l1105j2700J5966M5533N9277J8983L8790
21628B16436M2795N1794j9411K5647M4553l1479l3500K9732k0555J2234M0558
21617C58804O860N6254M6875K2940N924J6862P1975L5410N2614Q9402Q1701O9877
21605I15498P2793J40176Q3056P5706P2863N5233N8194J2270p2471q5800j06518
$$ plain form
21594 1221000 1104750 981998 857704 697860 563693 528091 549253 506670 473318 466115
21584 466115 479103 479366 461291 453873 431973 447487 447026 478481 531870 563419 608103 591261
21572 591261 527476 541430 533890 510470 474408 459270 474500 503702 534249 533315 546676 564664
21560 564664 613297 610179 605529 604589 608260 625788 683426 728826 810405 880618 999495 1227444
21548 1227444 1521372 1825328 2189589 2622014 3025905 3387304 3657874 3682108 3576356 3314426
21538 3314426 2964723 2614508 2252467 1929886 1677632 1518321 1495876 1473897 1426976 1435610
21528 1435610 1437243 1393182 1430937 1447079 1468408 1513396 1531688 1612669 1729139 1817899 1912496
21517 1912496 2023801 2205765 2387931 2533204 2686435 2804478 2948862 3075946 3262330
$$ packed form
21594A221000j16250j22752j24294j59844j34167l5602K1162m2583l3352p203
21584D66115J2988K63j8075p418k1900J5514m61L1455N3389L1549M4684j6842
21572E91261o3785J3954p540k3420l6062j5138J5230K9202L0547r34J3361J7988
21560E64664M8633l118m650r40L671J7528N7638M5400Q1579P0213J18877K27949
21548A227444K93928L03956L64261M32425M03891L61399K70570K4234j05752k61930
21538C314426l49703l50215l62041l22581k52254j59311k2445k1979m6921Q634
21528A435610J633m4061L7755J6142K1329M4988J8292Q0981J16470Q8760R4597
21517A912496J11305J81964J82166J45273J53231J18043J44384J27084J86384
$$ plain form
21508 3262330 3405607 3560469 3737936 3949228 4121298 4263572 4465280 4687090 5075566
21499 5075566 5513793 5981043 6584162 7170257 7763742 8437923 9246252 10299693 11656595
21490 11656595 13279456 15334244 17917467 21099317 25089555 30168060 36603682 45191597
21482 45191597 56948971 73844001 99342964 137718354 192000460 260048149 334161178
21475 334161178 405586831 466354380 506553822 515492938 490328518 438601019 371463814
21468 371463814 297961145 226080219 163806073 116228091 83421189 61850030 47565185
21461 47565185 37788936 30907314 25805579 21934133 18963803 16582256 14576717 12922778
21453 12922778 11554672 10419163 9404328 8516579 7739245 7032411 6339125 5741633 5236579
$$ packed form
21508C262330J43277J54862J77467K11292J72070J42274K01708K21810L88476
21499E075566M38227M67250O03119N86095N93485O74181Q08329J053441J356902
21490A1656595J622861K054788K583223L181850L990238N078505O435622Q587915
21482D5191597J1757374J6895030K5498963L8375390N4282106O8047689P4113029
21475C34161178P1425653O0767549M0199442Q939116k5164420n1727499o7137205
21468C71463814p3502669p1880926o2274146m7577982l2806902k1571159j4284845
21461D7565185r776249o881622n101735l871446k970330k381547k005539j653939
21453A2922778j368106j135509j014835q87749p77334p06834o93286n97492n05054
$$ plain form
21444 5236579 4833194 4499129 4178409 3871583 3607786 3352405 3116112 2870246 2723505
21435 2723505 2538981 2365850 2223240 2123010 2065637 2006467 1973273 1904488 1821016 1748654
21425 1748654 1746984 1739784 1731260 1681848 1576599 1486591 1415582 1446098 1455561 1487169 1425047 1349939
21413 1349939 1321806 1283072 1242229 1207368 1253270 1415527 1649422 2016309 2340625 2737910
21403 2737910 3139033 3407366 3518042 3457962 3222961 2868471 2435729 2014158 1670786 1325408
21393 1325408 1095361 984291 872348 738461 624173 573152 553697 550400 520475 440148
21383 440148 426647 491205 466982 436210 422808 427870 441790 429041 439038 364433 317103 274346
21371 274346 245542 165616 118872 194975 202315 166189 177931 225297 232156 197045 221543 257087
$$ packed form
21444E236579m03385l34065l20720l06826k63797k55381k36293k45866j46741
21435B723505j84524j73131j42610j00230n7373n9170l3194o8785q3472p2362
21425A748654j670p200q524m9412j05249r0008p1009L0516R463L1608o2122p5108
21413A349939k8133l8734m0843l4861M5902J62257K33895L66887L24316L97285
21403B737910M01123K68333J10676o0080k35001l54490m32742m21571l43372l45378
21393A325408k30047j11070j11943j33887j14288n1021j9455l297k9925q0327
21383D40148j3501O4558k4223l0772j3402N062J3920j2749R997p4605m7330m2757
21371B74346k8804p9926m6744P6103P340l6126J1742M7366O859l5111K4498L5544
$$ plain form
21359 257087 273555 209547 153855 105830 27174 -26170 -77165 -140935 -200064 -192774 -200952 -133925
21347 -133925 9450 76303 48146 114856 166704 140928 127825 114564 132059 129215 93249
21336 93249 2246 22901 73522 36096 -38679 7246 36140 8461 54108 83023 86592 100766
21324 100766 174816 219543 232284 204003 176450 167924 228941 268939 296615 327859 309580 286577
21312 286577 276779 253099 331298 349674 347845 325282 326720 287765 266483 246026 201578 184324
21300 184324 208970 267607 259159 204492 195764 145750 107743 103078 121202 146864 113037 109453
21288 109453 78007 85534 47557 31327 8247 -11977 50882 110794 196506 220558 164842 94978
21276 94978 81885 75001 80747 28551 31324 12387 36847 47861 51130 18232 58460 82160
$$ packed form
21359B57087J6468o4008n5692m8025p8656n3344n0995o3770n9129P290q178O7027
21347a33925J43375O6853k8157O6710N1848k5776j3103j3261J7495k844l5966
21336I3249r1003K0655N0621l7426p4775M5925K8894k7679M5647K8915L569J4174
21324A00766P4050M4727J2741k8281k7553q526O1017L9998K7676L1244j8279k3003
21312B86577r798k3680P8199J8376j829k2563J438l8955k1282k0457m4448j7254
21300A84324K4646N8637q448n4667q728n0014l8007m665J8124K5662l3827l584
21288A09453l1446P527l7977j6230k3080k0224O2859N9912Q5712K4052n5716o9864
21276I4978j3093o884N746n2196K773j8937K4460J1014L269l2898M0228K3700
$$ plain form
21264 82160 98790 103674 111025 23938 -44093 -45620 -21540 42921 -1101 6818 40885 -14185
21252 -14185 -54236 -59979 -27568 -8517 -96 32608 53639 70511 -21765 -116767 -80377 -47214
21240 -47214 -50182 -42450 9834 10376 5420 -25561 13521 -17628 -27613 -17546 -4769 28101 46585
21227 46585 35808 62217 61994 12066 22192 37386 27373 12090 -24585 9143 10222 -45366
21215 -45366 -99543 -110986 -105870 -140271 -58505 -11707 -7650 1902 6766 33788 -25214 -32296 -34148
21202 -34148 -39012 -55599 -56592 -89767 -110788 -86748 -89461 -65248 -62488 -72394 -69826 377 80859
21189 80859 56678 21891 1063 -26982 2883 6200 33258 31317 29044 41486 120229 146647
21177 146647 127979 65229 42037 -19907 -17840 -27772 -1423 10906 31023 -1047 1821 -1730
$$ packed form
21264H2160J6630M884P351q7087o8031j527K4080O4461m4022P919L4067n5070
21252a4185m0051n743L2411J9051Q421L2704K1031J6872r2276r5002L6390L3163
21240d7214k968P732N2284N42m956l0981L9082l1149r985J0067J2777L2870J8484
21227D6585j0777K6409k23m9928J0126J5194j0013j5283l6675L3728J079n5588
21215d5366n4177j1443N116l4401Q1766M6798M057R552M864K7022n9002p082j852
21202c4148m864j6587r93l3175k1021K4040k713K4213K760r906K568P0203Q0482
21189H0859k4181l4787k0828k8045K9865L317K7058j941k273J2442P8743K6418
21177A46647j8668o2750k3192o1944K067r932K6349J2329K0117l2070K868l551
$$ plain form
21165 -1730 -63733 -100449 -98481 -64198 26562 23592 30635 2826 -30146 -43214 -75995 -11051
21153 -11051 14193 -15930 -12654 -6744 -32957 -20625 -16036 1066 -28623 -23537 52907 100193
21141 100193 76182 7220 -21620 -38706 -8514 11946 72220 62474 -29284 -94309 -133753 -78684
21129 -78684 -64225 -10634 15004 18024 52645 31235 26092 -1227 -4106 -95067 -99774 -94203 -106368
21116 -106368 -77517 -88336 -113069 -73684 -42106 -22050 4531 13188 -20732 -21518 24919 11559
21104 11559 -46825 -49442 -47779 2310 -5755 -24403 -36526 -47173 -13561 24249 18966 -36832
21092 -36832 -121889 -130474 -85411 -82894 -64032 -54123 13122 22736 -12041 -36627 -40050 -31224 -41485
21079 -41485 -51815 -52556 -40051 -71606 -82337 -79116 -95350 -145042 -109975 -92504 -40750 -11565
$$ packed form
21165a730o2003l6716J968L4283R0760k970P043k7809l2972j3068l2781O4944
21153a1051K5244l0123L276N910k6213J2332M589J7102k9689N086P6444M7286
21141A00193k4011o8962k8840j7086L0192K0460O0274r746r1758o5025l9444N5069
21129g8684J4459N3591K5638L020L4621k1410n143k7319k879r0961m707N571j2165
21116a06368K8851j0819k4733L9385L1578K0056K6581Q657l3920p86M6437j3360
21104A1559n8384k617J663N0089q065j8648j2123j0647L3612L7810n283n5798
21092c6832q5057q585M5063K517J8862R909O7245R614l4777k4586l423Q826j0261
21079d1485j0330p41J2505l1555j0731L221j6234m9692L5067J7471N1754K9185
$$ plain form
21067 -11565 18324 47608 44951 15852 5855 54562 -5519 -33691 -22568 -39245 -15546 -328
21055 -328 14853 48993 3946 -2926 29388 20945 -42315 -47095 -29451 -25246 -47231 -78117 -127287
21042 -127287 -101179 -51176 -36085 -110958 -72719 -69664 -91987 -170373 -204020 -166672 -95669 -91045
21030 -91045 -113439 -96887 -12629 -15883 -46060 -39001 -61759 -57551 -85486 -67362 -24938 -19920
21018 -19920 -21622 30912 23210 8262 -6494 -60798 -103226 -130501 -139622 -56127 -13415 -63566
21006 -63566 -99842 -61125 -23347 -8138 22177 13506 -32083 -65959 -12124 5759 -38783 -52678
20994 -52678 -52577 -69276 -24627 40490 12788 -15893 -22650 -38113 -39084 -16458 32011 16736 -57525
20981 -57525 -53302 -19406 -10559 14258 13664 -1779 -49589 -52703 -6295 76730 122090 44053 -26474
$$ packed form
21067a1565K9889K9284k657k9099r997M8707o0081k8172J1123j6677K3699J5218
21055c28J5181L4140m5047o872L2314q443o3260m780J7644M205k1985l0886m9170
21042a27287K6108N0003J5091p4873L8239L055k2323p8386l3647L7348P1003M624
21030i1045k2394J6552Q4258l254l0177P059k2758M208k7935J8124M2424N018
21018a9920j702N2534p702j4948j4756n4304m2428k7275r121Q3495M2712n0151
21006f3566l6276L8717L7778J5209L0315q671m5589l3876N3835J7883m4542j3895
20994e2678J01j6699M4649O5117k7702k8681o757j5463r71K2626M8469j5275p4261
20981e7525M223L3896Q847K4817n94j5443m7810l114M6408Q3025M5360p8037p0527
$$ plain form
20968 -26474 -73894 -66391 -36082 -31881 2957 -12384 758 -8182 -47782 -35181 -12214 -2276
20956 -2276 4712 35662 58832 -16297 -41593 -48961 -11152 19822 25053 43314 -14824 9301
20944 9301 -16320 -35524 -4375 -15702 -31380 -1216 -7951 -45777 9052 7804 29855 30729 6444
20931 6444 25884 47587 34162 15159 43055 51734 82807 111490 111230 82924 43697 89020
20919 89020 109933 181305 253793 295949 365507 487555 621855 809916 1079486 1437205 1882862
20908 1882862 2318906 2585194 2721722 2723356 2507575 2165038 1816115 1370197 1047946 737207
20898 737207 528482 388558 290095 242442 201699 161700 151539 125787 81032 88559 69582
20887 69582 76151 46527 -10862 -71131 -123648 -143987 -85005 -26906 -1413 599 -12056 530
$$ packed form
20968b6474m7420P503L0309M201L4838j5341J3142q940l9600J2601K2967R938
20956b276O988L0950K3170p5129k5296p368L7809L0974N231J8261n8138K4125
20944I301k5621j9204L1149j1327j5678L0164o735l7826N4829j248K2051Q74k4285
20931F444J9440K1703j3425j9003K7896Q679L1073K8683k60k8306l9227M5323
20919H9020K0913P1372P2488M2156O9558J22048J34300J88061K69570L57719M45657
20908A882862M36044K66288J36528J634k15781l42537l48923m45918l22251l10739
20898G37207k08725j39924r8463m7653m0743l9999j0161k5752m4755P527j8977
20887F9582O569k9624n7389o0269n2517k0339N8982N8099K5493K012j2655J2586
$$ plain form
20875 530 -12243 -28709 -24761 -73647 -94750 -116779 -119822 -153636 -87031 -16855 33186 21771
20863 21771 9012 -49480 -69091 -38960 25303 44991 53061 -2281 -51817 -61285 3087 61262
20851 61262 29409 -2994 54760 13161 -75792 -102949 -36773 8197 -19448 -64864 -72159 -54640
20839 -54640 -12731 -32155 -58476 -25265 -23760 -57540 -38930 -34076 -70120 -96308 -108125 -71211
20827 -71211 -71411 -50777 -53320 -28903 -39874 -39948 -65429 -91496 -55199 34576 48746 9691 -74445
20814 -74445 -78048 -9492 -16814 -10063 -46108 -63540 -68111 -35063 -80512 -105203 -104119 -14094 17024
20801 17024 98 -4892 -7219 -13030 -69232 -107578 -122008 -71690 -47375 -24954 -42806 -72693
20789 -72693 -40064 -48056 -42158 -63080 -108551 -127582 -88926 -83008 -65484 -53362 -93806 -104784
$$ packed form
20875E30j2773j6466L948m8886k1103k2029l043l3814O6605P0176N0041j1415
20863B1771j2759n8492j9611L0131O4263J9688Q070n5342m9536r468O4372N8175
20851F1262l1853l2403N7754m1599q8953k7157O6176M4970k7645m5416p295J7519
20839e4640M1909j9424k6321L3211J505l3780J8610M854l6044k6188j1817L6914
20827g1211k00K0634k543K4417j0971p4k5481k6067L6297Q9775J4170l9055q4136
20814g4445l603O8556p322O751l6045j7432m571L3048m5449k4691J084R0025L1118
20801A7024j6926m990k327n811n6202l8346j4430N0318K4315K2421j7852k9887
20789g2693L2629p992N898k0922m5471j9031L8656N918J7524J2122m0444j0978
$$ plain form
20777 -104784 -107282 -87464 -96449 -28174 -49918 -81421 -61385 -79483 -70807 -75033 -69197 -30747
20765 -30747 -5786 -31776 20089 10637 -21800 -40551 -77745 -53401 -121833 -144126 -109194 -61941
20753 -61941 -82849 -72170 -95929 -84207 -98007 -121294 -108685 -82585 -153122 -191172 -140960 -144889
20741 -144889 -73067 -16110 -6258 -1443 -2027 17941 -17482 -16665 8575 17743 37634 54387 72135
20728 72135 94702 59564 44811 4562 -15301 -6416 390 -22815 -79474 -87532 -76610 -97973
20716 -97973 -54922 -30574 -24993 -31686 16091 4585 -40043 -64751 -54060 -50319 -6338 34162
20704 34162 41884 56184 -25229 -33346 -18850 -10743 -20161 12147 1247 -12981 -2571 -29422
20692 -29422 -4533 32098 80945 92870 49135 22817 48166 40478 50827 946 -2194 -30357
$$ packed form
20777a04784k498J9818q985O8275k1744l1503K0036j8098Q676m226N836L8450
20765c0747K4961k5990N1865r452l2437j8751l7194K4344o8432k2293L4932M7253
20753f1941k0908J0679k3759J1722j3800k3287J2609K6100p0537l8050N0212l929
20741a44889P1822N6957R852M815n84J9968l5423Q17K5240R168J9891J6753J7748
20728G2135K2567l5138j4753m0249j9863Q885O806k3205n6659q058J0922k1363
20716i7973M3051K4348N581o693M7777j1506m4628k4708J0691L741M3981M0500
20704C4162P722J4300q1413q117J4496Q107r418L2308j0900j4228J0410k6851
20692b9422K4889L6631M8847J1925m3735k6318K5349p688J0349m9881l140k8163
$$ plain form
20680 -30357 -71474 -58133 -44194 -31469 26344 6035 15537 26903 2631 8127 -26975 34794
20668 34794 24322 -15595 -18026 -37185 -11052 11533 -35046 -62780 -72879 15537 7499 -62891
20656 -62891 -43621 -27330 -8461 22196 -22046 -52161 -43607 -34558 -9514 -6072 10890 12528
20644 12528 44686 -9504 -55897 -56654 -102273 -86906 -74613 -37766 -6748 33286 53042 -14737
20632 -14737 -1929 -7295 -34887 -50450 -14495 23329 52345 -9173 -32542 -8566 16821 -60502
20620 -60502 -65993 -43049 -1021 16877 -20443 -65262 -101211 -94667 -28070 -11682 -42109 -83942
20608 -83942 -63015 -72255 -31166 -34926 -84537 -124143 -91356 -126844 -181209 -101115 -7042 7245
20596 7245 -50892 -84084 -59538 -38138 -8388 627 29263 69049 29943 -31424 -50717 -60861
$$ packed form
20680c0357m1117J3341J3939J2725N7813k0309R502J1366k4272N496l5102O1769
20668C4794j0472l9917k431j9159K6133K2585m6579k7734j0099Q8416q038p0390
20656f2891J9270J6291J8869L0657m4242l0115Q554R049K5044L442J6962J638
20644A2528L2158n4190m6393p57m5619J5367J2293L6847L1018M0034J9756o7779
20632a4737J2808n366k7592j5563L5955L7824K9016o1518k3369K3976K5387p7323
20620f0502n491K2944M2028J7898l7320m4819l5949O544O6597J6388l0427m1833
20608h3942K0927r240M1089l760m9611l9606L2787l5488n4365Q0094R4073J4287
20596G245n8137l3192K4546K1400K9750R015K8636L9786l9106o1367j9293j0144
$$ plain form
20584 -60861 -50411 -76598 -84299 -55837 -48273 -44581 -47902 -13848 12396 -57050 -111880 -79585
20572 -79585 -72303 -63537 -10506 552 -21787 -43867 -59786 -85482 -52946 -25345 -6045 -9426
20560 -9426 -25280 -27757 -22510 -13925 -50263 -62680 -65360 -59309 -53869 -102205 -107075 -92410 -68508
20547 -68508 -53234 -69457 -69269 -129846 -128025 -51744 -20045 -32775 -65574 -32919 4804 -37290
20535 -37290 -54818 -50757 -40368 -20043 -49498 -55685 30900 106127 60616 -21692 -56335 -45907
20523 -45907 -65214 -107047 -66946 -13745 7273 37161 50725 21090 19004 -3129 -20681 -41378
20511 -41378 -42954 -41560 -50658 -53709 -32765 -23363 -43576 -56386 -32036 -29549 -24283 -18962 -10470
20498 -10470 -27004 -68645 -73265 -80100 -103740 -110340 -96073 -67035 -125713 -90083 -34533 24459
$$ packed form
20584f0861J0450k6187p701K8462P564L692l321L4054K6244o9446n4830L2295
20572g9585P282Q766N3031J1058k2339k2080j5919k5696L2536K7601J9300l381
20560i426j5854k477N247Q585l6338j2417k680O051N440m8336m870J4665K3902
20547f8508J5274j6223J88o0577J821P6281L1699j2730l2799L2655L7723m2094
20535c7290j7528M061J0389K0325k9455o187Q6585P5227m5511q2308l4643J0428
20523d5907j9307m1833M0101N3201K1018K9888J3564k9635k086k2133j7552k0697
20511d1378j576J394r098l051K0944R402k0213j2810K4350K487N266N321Q492
20498a0470j6534m1641m620o835k3640o600J4267K9038n8678L5630N5550N8992
$$ plain form
20486 24459 40969 43933 38807 5143 -14323 -29908 -66669 -18509 25279 -41639 -148132 -137819
20474 -137819 -72646 8851 9308 -25692 -36267 -5967 37357 -12969 -55804 -1460 83080 120756
20462 120756 82551 59488 57852 28225 6753 17814 37568 -30095 -55064 -1909 31115 16502
20450 16502 58702 52029 26116 12515 12922 31650 15675 6524 -44862 -51272 -55839 -59044 -53852
20437 -53852 -46126 -22942 -11914 -66761 -47391 -20900 -17479 -42160 -23967 -20953 574 -17188
20425 -17188 -82817 -112862 -95950 -63625 -15866 -22690 -13436 9155 12995 -37550 -60601 -103205
20413 -103205 -123468 -110193 -96029 -100176 -106635 -139664 -157939 -156528 -103243 -102504 -89621 44537
20401 44537 73351 14565 -49254 -80033 -75708 -25060 -41979 -26194 -19712 -45639 -50391 -36567
$$ packed form
20486B4459J6510K964n126l3664j9466j5585l6761M8160M3788o6918j06493J0313
20474a37819O5173Q1497M57l5000j0575L0300M3324n0326m2835N4344Q4540L7676
20462A20756l8205k3063j636k9627k1472J1061J9754o7663k4969N3155L3024j4613
20450A6502M2200o673k5913j3601M07J8728j5975r151n1386o410m567l205N192
20437e3852P726K3184J1028n4847J9370K6491L421k4681J8193L014K1527j7762
20425a7188o5629l0045J6912L2325M7759o824R254K2591L840n0545k3051m2604
20413a03205k0263J3275J4164m147o459l3029j8275J411N3285P39J2883J34158
20401D4537K8814n8786o3819l0779M325N0648j6919J5785O482k5927m752J3824
$$ plain form
20389 -36567 1611 6199 -16998 12773 -7187 -42865 -130720 -168183 -121629 -53000 -43552 -50692
20377 -50692 -44167 -49890 26840 15223 -10072 34015 2935 -38900 -30534 -28923 -25831 -61292 -41729
20364 -41729 -33272 8599 19841 -47341 -51900 -27583 13762 634 -89545 -102317 -84015 -46928
20352 -46928 -44387 -20324 23440 2670 -32377 -19471 -58755 -102483 -58372 12622 14587 -17286
20340 -17286 9126 26892 52465 38995 -45680 -72761 -67097 -53427 -8015 34859 21174 -45928
20328 -45928 -22097 -20671 -44940 -30497 -37422 -83606 -104237 -125581 -100776 -61634 -1118 10297
20316 10297 19412 8799 21142 43728 55164 -6124 3772 -23726 -43858 -63305 -84870 -108591
20304 -108591 -86979 -74426 -89282 -106607 -90782 -124683 -106018 -71060 -52502 -67992 -39719
$$ packed form
20389c6567L8178M588k3197K9771j9960l5678q7855l7463M6554O8629R448p140
20377e0692O525n723P6730j1617k5295M4087l1080m1835Q366J611L092l5461J9563
20364d1729Q457M1871J1242o7182m559K4317M1345j3128r0179j2772J8302L7087
20352d6928K541K4063M3764k0770l5047J2906l9284m3728M4111P0994J965l1873
20340a7286K6412J7766K5573j3470q4675k7081N664J3670M5412M2874j3685o7102
20328d5928K3831J426k4269J4443o925m6184k0631k1344K4805L9142O0516J1415
20316A0297R115j0613J2343K2586J1436o1288R896k7498k0132j9447k1565k3721
20304a08591K1612J2553j4856j7325J5825l3901J8665L4958J8558j5490K8273
$$ plain form
20293 -39719 -13950 -9630 23055 51904 -889 -47840 4932 32477 26931 22030 -65630 -95939
20281 -95939 -76910 -34572 3508 58001 61991 1405 -37191 -72231 -96527 -148721 -180331 -138393
20269 -138393 -73046 -26906 -39678 -35060 14597 -23026 -103377 -54786 -38757 -29402 11014 25785
20257 25785 40954 63998 63233 34445 -20120 -86566 -118679 -47046 17776 6353 40714 92934
20245 92934 43632 -6116 -45066 -90007 -72659 1571 -6706 -20791 -46938 -89345 -72159 -70450
20233 -70450 -84755 -94219 -54514 -29520 -69403 -86445 -63107 4036 1915 1542 -58899 -70211
20221 -70211 -42083 -31934 -23637 -53369 -57313 -104616 -115445 -106926 -85442 -63151 -122013 -90450
20209 -90450 -68625 -109784 -104861 -108435 -140544 -144845 -86213 -75307 -101005 -48323 -31458 -59721
$$ packed form
20293c9719K5769M320L2685K8849n2793m6951N2772K7545n546m901q7660l0309
20281i5939J9029M2338L8080N4493L990o0586l8596l5040k4296n2194l1610M1938
20269a38393O5347M6140j2772M618M9657l7623q0351M8591J6029R355M0416J4771
20257B5785J5169K3044p65k8788n4565o6446l2113P1633O4822j1423L4361N2220
20245I2934m9302m9748l8950m4941J7348P4230q277j4085k6147m2407J7186J709
20233g0450j4305r464L9705K4994l9883j7042K3338O7143k121l73o0441j1312
20221g0211K8128J0149Q297k9732l944m7303j0829Q519K1484K2291n8862L1563
20209i0450K1825m1159M923l574l2109m301N8632J0906k5698N2682J6865k8263
$$ plain form
20197 -59721 -121200 -132316 -84968 -74957 -61591 -41348 -12924 -14690 -43240 -26427 23896 40374
20185 40374 -4221 -14385 38786 46264 18728 16955 32208 51773 78694 55319 -36156 -52190
20173 -52190 -6275 -18359 -39082 -21624 -9046 35661 92961 121675 119896 50107 18974 -52178
20161 -52178 6799 48194 4324 -11300 -33099 15360 63220 93848 80237 56728 1561 7334
20149 7334 5766 47404 108310 89444 51584 -22006 -84547 -9602 62992 50866 -1048 34870
20137 34870 30933 57236 52960 5708 -55976 -20826 -16269 -35542 -62914 -66191 -45478 -17769
20125 -17769 -37736 -62251 -81650 -99719 -52495 -36180 -56989 -32373 -23943 -53490 -88553 -59519
20113 -59519 -51242 -55653 -36520 -5376 -31993 -46249 -57754 -35655 -10503 -817 4254 -7196
$$ packed form
20197e9721o1479j1116M7348J0011J3366K0243K8424j766k8550J6813N0323J6478
20185D0374m4595j0164N3171P478k7536j773J5253J9565K6921k3375r1475j6034
20173e2190M5915j2084k0723J7458J2578M4707N7300K8714j779o9789l1133p1152
20161e2178N8977M1395m3870j5624k1799M8459M7860L0628j3611k3509n5167N773
20149G334j568M1638O0906j8866l7860p3590o2541P4945P2594j2126n1914L5918
20137C4870l937K6303m276m7252o1684L5150M557j9273k7372l277K0713K7709
20125a7769j9967k4515j9399j8069M7224J6315k0809K4616Q430k9547l5063K9034
20113e9519Q277m411J9133L1144k6617j4256j1505K2099K5152R686N071j1450
$$ plain form
20101 -7196 -3134 -10178 11518 18783 -16382 -36711 -44040 -44148 -33264 -24555 -41369 -31529 -55540
20088 -55540 27998 31625 -2118 8848 -27075 -31649 30530 20750 -59687 -128887 -188154 -155256
20076 -155256 -84553 -73037 -38523 16878 13748 14723 42141 33376 -5883 -66184 -111180 -79879
20064 -79879 -88305 -48226 29946 17120 -52094 -57377 -94399 -82909 -22971 -4136 9762 -10481
20052 -10481 -21632 -20007 -27057 4366 2791 -26517 -16179 47659 41830 -1685 2943 -9311 19076
20039 19076 -8987 -8763 21972 -7360 -57357 -46823 -12896 -7756 -22097 -50615 -13987 46640
20027 46640 46116 35287 -24715 -80918 -122602 -166133 -113238 -99972 -105576 -101527 -51877 -56252 -25612
20014 -25612 14297 25570 -11864 -43993 -51047 4683 17416 -25043 -122957 -124520 -46900 -36278
$$ packed form
20101g196M062p044K1696P265l5165k0329p329j08J0884Q709j6814R840k4011
20088e5540Q3538L627l3743J0966l5923m574O2179r780q0437o9200n9267L2898
20076a55256P0703J1516L4514N5401l130R75K7418q765l9259o0301m4996L1301
20064g9879q426M0079P8172j2826o9214n283l7022J1490N9938J8835J3898k0243
20052a0481j1151J625p050L1423j575k9308J0338O3838n829m3515M628j2254K8387
20039A9076k8063K24L0735k9332m9997J0534L3927N140j4341k8518L6628O0627
20027D6640n24j0829o0002n6203m1684m3531N2895J3266n604M049M9650m375L0640
20014b5612L9909J1273l7434l2129p054N5730J2733m2459r7914j563P7620J0622
$$ plain form
20002 -36278 -17366 12671 23479 -19509 8178 45101 53235 2671 -62884 -68160 -93897 -87153
19990 -87153 -6500 33337 94811 86209 77407 105656 88687 26884 -47432 -4923 19214 -21639
19978 -21639 -49119 -10722 -46001 -80859 -16444 29228 11554 -43687 -57209 -55435 -47125 3346
19966 3346 9981 56109 67838 87334 85072 26709 12215 -9821 -10128 26730 66806 89937 51946
19953 51946 25224 -8359 10582 22031 -21185 -86325 -43210 -69315 -46685 6666 -10946 -16575
19941 -16575 44195 88211 65994 -10300 -48027 -42216 19765 51611 85958 37705 -2567 -11465
19929 -11465 -30345 -51252 6468 61078 80093 34673 -23733 -12826 -14989 -15958 15859 974
19917 974 -7059 15618 38407 39931 85938 93286 53862 -10265 -30398 32418 64042 -2015 -58733
$$ packed form
20002c6278J8912L0037J0808m2988K7687L6923Q134n0564o5555n276k5737O744
19990h7153Q0653L9837O1474q602q802K8249j6969o1803p4316M2509K4137m0853
19978b1639k7480L8397l5279l4858O4415M5672j7674n5241j3522J774Q310N0471
19966C346O635M6128J1729J9496k262n8363j4494k2036l07L6858M0076K3131l7991
19953E1946k6722l3583J8941J1449m3216o5140M3115k6105K2630N3351j7612n629
19941a6575O0770M4016k2217p6294l7727N811O1981L1846L4347m8253m0272q898
19929a1465j8880k0907N7720N4610J9015m5420n8406J0907k163r69L1817j4885
19917I74q033K2677K2789J524M6007P348l9424o4127k0133O2816L1624o6057n6718
$$ plain form
19904 -58733 -23027 -5044 -44593 -69332 -56585 -52714 -25904 -71326 -54970 5518 -2510 -38084
19892 -38084 -80811 -75772 -9142 -26 -32188 -68132 -61894 -52014 -47673 -63424 -76798 -79194 -41797
19879 -41797 -76455 -54698 -59570 -87905 -42614 6732 -18390 -70795 -70123 -66249 -20302 29897
19867 29897 28651 41595 28450 31822 3615 -4748 -22628 -13293 -13960 18477 -7812 -65718 -83954
19854 -83954 -105639 -76438 -55446 -61442 -32986 20697 5280 -7446 38942 41792 29518 -36922
19842 -36922 -47648 -13640 -2130 -41357 -76752 -54881 -29079 -26497 -69224 -64585 -89577 -83178
19830 -83178 -126163 -72908 -61877 -53026 -37095 -3331 -16336 -13594 82737 129056 104167 112526
19818 112526 73535 51410 97530 98831 34275 16977 47705 52835 63068 76132 40254 68140
$$ packed form
19904e8733L5706J7983l9549k4739J2747L871K6810m5422J6356O0488q028l5574
19892c8084m2727N039O6630R116l2162l5944O238R880M341j5751j3374k396L7397
19879d1797l4658K1757m872k8335M5291M9346k5122n2405O72L874M5947N0199
19867B9897j246J2944j3145L372k8207q363j7880R335o67L2437k6289n7906j8236
19854h3954k1685K9201K0992n996K8456N3683j5417j2726M6388K850j2274o6440
19842c6922j0726L4008J1510l9227l5395K1871K5802K582m2727M639k4992O399
19830h3178m2985N3255J1031Q851J5931L3764j3005K742R6331M6319k4889Q359
19818A12526l8991k2125M6120J301o4556j7298L0728N130J0233J3064l5878K7886
$$ plain form
19806 68140 88555 56823 36010 42382 44807 66255 47375 -4493 17552 72972 74061 32245
19794 32245 3875 -66375 -60165 -33986 -28998 33576 -5089 -37709 -48746 -50034 -46530 -104149
19782 -104149 -109902 -54634 -48120 -16551 -18611 -48386 -71522 -115087 -79015 -81087 -24377 37917
19770 37917 12676 -14080 -34211 10597 6745 -23763 -18364 -60183 -87142 -111826 -164603 -154988
19758 -154988 -160539 -155475 -57131 6174 8658 -4678 -63354 -71402 -58260 -75888 -100581 -58700
19746 -58700 -14038 15970 25934 6662 5952 23169 54319 89019 82881 43838 24443 21335 5732
19733 5732 -4123 35721 29172 27416 -1262 -76324 -117925 -161294 -143924 -67419 -65304 -57032 -29140
19720 -29140 -45242 -56140 -9283 -13718 -40145 -52755 7635 1355 -21426 -18908 -32671 -36631
$$ packed form
19806F8140K0415l1732k0813O372K425K1448j8880n1868K2045N5420J089m1816
19794C2245k8370p0250O210K6179M988O2574l8665l2620j1037j288L504n7619
19782a04149n753N5268O514L1569k060k9775k3136m3565L6072k072N6710O2294
19770C7917k5241k6756k0131M4808l852l0508N399m1819k6959k4684n2777R615
19758a54988n551N064R8344O3305K484j3336n8676q048J3142j7628k4693M1881
19746e8700M4662L0008R964j9272p10J7217L1150L4700o138l9043j9395l108j5603
19733E732r855L9844o549j756k8678p5062m1601m3369J7370P6505K115Q272K7892
19720b9140j6102j0898M6857m435k6427j2610O0390o280k2781K518j3763l960
$$ plain form
19708 -36631 -3384 -17959 -58838 -55539 -55425 -19229 -7967 -20891 -44272 -45809 -48167 -57758 -26925
19695 -26925 -23946 -37438 -56213 -20606 20897 110284 82040 4399 5705 528 31789 28710
19683 28710 29698 6343 -77144 -73582 -65367 -29725 17216 -10973 3000 -5222 18080 4704 5237
19670 5237 34843 36525 -25467 -38484 -13740 7987 23233 7171 -50805 -2224 36027 5246
19658 5246 13011 8695 4993 13500 19725 -1923 -20640 14694 39636 25303 -4391 -29078 -59264
19645 -59264 -13036 -20585 27943 64714 64701 76687 116538 126215 80028 4508 -36337 -57116 -84057
19632 -84057 -77904 -106161 -69054 -4554 3783 -5556 10059 -2466 -57873 -83292 -78495 -10623
19620 -10623 -13467 -35656 23253 63272 31041 25490 87358 38789 18914 -7875 -43886 -7492
$$ packed form
19708c6631L3247j4575m0879L299J14L6196J1262j2924k3381j537k358r591L0833
19695b6925K979j3492j8775L5607M1503Q9387k8244p7641J306n177L1261l079
19683B8710R88k3355q3487L562Q215L5642M6941k8189J3973q222K3302j3376N33
19670E237K9606J682o1992j3017K4744K1727J5246j6062n7976M8581L8251l0781
19658E246P765m316l702Q507O225k1648j8717L5334K4942j4333k9694k4687l0186
19645e9264M6228p549M8528L6771j3J1986L9851R677m6187p5520m0845k0779k6941
19632h4057O153k8257L7107O4500Q337r339J5615j2525n5407k5419M797O7872
19620a0623k844k2189N8909M0019l2231n551O1868m8569j9875k6789l6011L6394
$$ plain form
19608 -7492 6897 -877 -19501 -28789 -2019 27146 23768 -7702 -32688 -69269 -119794 -119618 -36966
19595 -36966 -40973 -36868 -43895 -76705 -29915 -14188 -33461 -32354 -32421 -22032 -37350 -33523 -6567
19582 -6567 15116 29108 59785 56745 38996 29315 -28027 -32940 -43214 -15433 -39479 -28066
19570 -28066 -71470 -58852 -20205 -11646 -6715 16021 71335 59024 33590 -30212 12372 828
19558 828 -14674 -43862 -21641 24277 42291 44859 32105 3964 -18256 -51398 -18362 -8261
19546 -8261 13319 -34204 -72772 -18113 14955 -46073 -109811 -86167 -56115 -106751 -115014 -138296
19534 -138296 -134829 -120246 -52814 -14313 7820 29517 -21143 -18806 3095 35151 22926 4832
19522 4832 5797 15229 53332 94859 79992 -4485 -75520 -76554 -40505 16677 -21164 -68851 -21238
$$ packed form
19608g492J4389p774j8624r288K6770K9165l378l1470k4986l6581n0525J76Q2652
19595c6966m007M105p027l2810M6790J5727j9273J107o7J0389j5318L827K6956
19582f567K1683J3992L0677l040j7749r681n7342m913j0274K7781k4046J1413
19570b8066m3404J2618L8647Q559M931K2736N5314j2311k5434o3802M2584j1544
19558H28j5502k9188K2221M5918J8014K568j2754k8141k2220l3142L3036J0101
19546h261K1580m7523l8568N4659L3068o1028o3738K3644L0052n0636q263k3282
19534a38296L467J4583O7432L8501K2133K1697n0660K337K1901L2056j2225j8094
19522D832R65R432L8103M1527j4867q4477p1035j034L6049N7182l7841m7687M7613
$$ plain form
19509 -21238 4720 6504 47511 38696 3285 -53088 -23458 -13326 -74880 -76434 -4966 16044
19497 16044 56251 111613 96507 80104 7849 35736 45762 6366 -39412 -35999 -91117 -145280
19485 -145280 -121496 -79791 -21928 -26836 -15659 -22810 -46040 -40736 -22558 -19284 -5092 -1835
19473 -1835 -27272 -6768 7823 25622 36620 23438 36651 41307 47750 22983 5026 -27280
19461 -27280 -67583 -90672 -78850 -15647 -11819 -20533 -39467 -37195 -56367 1986 68114 65113
19449 65113 40410 8144 -12036 -31519 -39705 -7582 -38091 -7071 -38292 -37450 -41750 -14479
19437 -14479 -34854 -18374 -68592 -67840 10314 16460 -5172 -30226 -49687 -59654 -16988 -3061
19425 -3061 4536 39187 54252 89518 49104 -10790 -4840 -6461 -10988 21771 48930 33928 15109
$$ packed form
19509b1238K5958J784M1007q815l5411n6373K9630J0132o1554j554P1468K1010
19497A6044M0207N5362j5106j6403p2255K7887J0026l9396m5778L413n5118n4163
19485a45280K3784M1705N7863m908J1177p151k3230N304J8178L274J4192L257
19473a835k5437K0504J4591J7799J0998j3182J3213M656O443k4767j7957l2306
19461b7280m0303k3089J1822O3203L828q714j8934K272j9172N8353O6128l001
19449F5113k4703l2266k0180j9483q186L2123l0509L1020l1221Q42m300K7271
19437a4479k0375J6480n0218P52P8154O146k1632k5054j9461r967M2666J3927
19425c061P597L4651J5065L5266m0414n9894N950j621m527L2759K7159j5002j8819
$$ plain form
19412 15109 22796 23875 47707 50030 42547 28703 7929 46178 69602 60108 4015 15892 4130
19399 4130 20221 26979 29188 37908 45229 114058 117589 33741 7379 19061 111019 80656 14513
19386 14513 -1380 -10735 -26398 -30734 -103167 -158685 -111456 -31521 -16715 19024 14851 -2666
19374 -2666 -34496 -51794 -5796 72531 33061 5378 29624 -9134 16217 -13227 -44931 -55627
19362 -55627 -333 -19950 -38270 -23570 -82507 -108170 -54544 -53046 -28265 -8688 9542 -72
19350 -72 22876 24030 25613 24297 85602 86401 74553 63758 23668 23499 16178 37128 29985 -31113
19336 -31113 -58824 -63420 -75749 -62607 -15508 32866 1302 -26447 18975 62283 10566 -35499
19324 -35499 7082 58623 69049 44106 43912 3608 -26964 -23619 21731 -5872 -16105 -22955
$$ packed form
19412A5109P687J079K3832K323p483j3844k0774L8249K3424r494n6093J1877j1762
19399D130J6091O758K209Q720P321O8829L531q3848k6362J1682R1958l0363o6143
19386A4513j5893r355j5663m336p2433n5518M7229P9935J4806L5739m173j7517
19374b666l1830j7298M5998P8327l9470k7683K4246l8758K5351k9444l1704j0696
19362e5627N5294j9617j8320J4700n8937k5663N3626J498K4781J9577J8230r614
19350g2K2948J154J583j316O1305P99j1848j0795m0090j69p321K0950p143o1098
19336c1113k7711m596j2329J3142M7099M8374l1564k7749M5422M3308n1717m6065
19324c5499M2581N1541J0426k4943j94m0304l0572L345M5350k7603j0233o850
$$ plain form
19312 -22955 -23223 -2146 -1033 -56795 -64790 -70649 -69134 -27145 -19441 19594 31763 39715 86919
19299 86919 77526 -24245 -109767 -80521 -62456 -35775 -63355 -14560 25280 11224 -116 12428
19287 12428 15601 -4524 16947 5105 -5846 56187 53561 25467 29083 61071 73488 63002
19275 63002 32424 -530 17517 -12285 -50189 -84955 -81967 -29362 -9018 -14623 -15645 136
19263 136 -9866 -35708 13585 24874 -19249 -46676 -34289 -34691 26484 3424 -78399 -67059
19251 -67059 -12530 -5841 7385 34615 24540 23228 32542 69110 51162 24854 55721 221047
19239 221047 389776 526147 508210 362944 247270 195766 141347 47446 -8664 -7572 -29708
19228 -29708 -23203 17353 9414 -16997 36600 36912 4494 43031 25705 14411 29586 43825
$$ packed form
19312b2955k68K1077J113n5762p995n859J515M1989P704L9035J2169P952M7204
19299H6919r393j01771q5522K9246J8065K6681k7580M8795L9840j4056j1340J2544
19287A2428L173k0125K1471j1842j0951O2033k626k8094L616L1988J2417j0486
19275F3002l0578l2954J8047k9802l7904l4766K988N2605K0344n605j022J5781
19263A36j0002k5842M9293J1289m4123k7427J2387m02O1175k3060q1823J1340
19251f7059N4529O689J3226K7230j0075j312R314L6568j7948k6308L0867J65326
19239B21047J68729J36371j7937j45266j15674n1504n4419r3901n6110J092k2136
19228b9708O505M0556p939k6411N3597L12l2418L8537j7326j1294J5175J4239
$$ plain form
19216 43825 27478 19358 17885 59434 60880 79856 48880 9011 -32386 -67783 -38085 -39203
19204 -39203 -70094 -46714 -30510 8038 -4296 -18269 14170 56522 34378 30877 -10407 27147
19192 27147 62381 80800 78551 96492 106910 70468 26665 15654 -4532 -7990 -8852 -1909 21202
19179 21202 38757 27252 -24806 -75651 -35292 19787 -16441 2028 50236 17137 8585 22047
19167 22047 20985 30730 10323 20922 27127 83502 89413 64221 44508 41237 33613 7749 19055
19154 19055 47214 70376 67422 41460 30742 5549 30292 60422 84829 73595 65513 70529
19142 70529 72281 50822 80177 86695 63662 160517 143659 94580 117119 127756 160632 141536
19130 141536 95296 69381 36358 37302 61856 79844 44093 49426 55499 72497 92880 96439
$$ packed form
19216D3825j6347q120j473M1549J446J8976l0976l9869m1397l5397K9698j118
19204c9203l0891K3380J6204L8548j2334j3973L2439M2352k2144l501m1284L7554
19192B7147L5234J8419k249J7941J0418l6442m3803j1011k0186l458q62O943K3111
19179B1202J7555j1505n2058n0845M0359N5079l6228J8469M8208l3099q552J3462
19167B2047j062R745k0407J0599O205N6375N911k5192j9713l271p624k5864J1306
19154A9055K8159K3162k954k5962j0718k5193K4743L0130K4407j1234q082N016
19142G0529J752k1459K9355O518k3033R6855j6858m9079K2539J0637L2876j9096
19130A41536m6240k5915l3023R44K4554J7988l5751N333O073J6998K0383L559
$$ plain form
19118 96439 106978 107733 99333 107946 95697 7784 -20118 -48796 -65552 25859 41964 17498
19106 17498 17069 -34100 -35533 -29427 -50937 -64596 -61029 -7917 -5434 -6090 7921 30867 632
19093 632 -10863 -22042 -41782 -28640 -38627 -25114 -6892 -28668 -126 34106 9461 -27493
19081 -27493 -26804 14247 94374 121650 114495 88757 127590 108066 72307 21331 44268 85403
19069 85403 39290 41226 64678 54326 79363 68130 60140 110587 121486 78099 22525 36827
19057 36827 50460 39488 45643 73153 45073 28653 22884 21767 -21544 28905 43357 49339
19045 49339 5706 -24336 -27124 26739 21436 13717 16 -4654 24143 65347 88865 48896
19033 48896 14323 19363 62526 21950 16318 34064 -19704 7309 -49917 -18177 -24169 38340
$$ packed form
19118I6439J0539P55q400Q613j2249q7913k7902k8678j6756R1411J6105k4466
19106A7498m29n1169j433O106k1510j3659L567N3112K483o56J4011K2946l0235
19093F32j1495j1179j9740J3142r987J3513J8222k1776K8542L4232k4645l6954
19081b7493O89M1051Q0127K7276p155k5738L8833j9524l5759n0976K2937M1135
19069H5403m6113J936K3452j0352K5037j1233p990N0447J0899m3387n5574J4302
19057C6827J3633j0972O155K7510k8080j6420n769j117m3311N0449J4452N982
19045D9339m3633l0042k788N3863n303p719j3701m670K8797M1204K3518l9969
19033D8896l4573N040M3163m0576n632J7746n3768K7013n7226L1740n992O2509
$$ plain form
19021 38340 31691 -14720 -65672 -49429 -1207 11219 -40787 -42604 24341 67238 81894 86905
19009 86905 48653 44366 41998 56437 17164 18583 53558 103360 143690 126960 49525 12169
18997 12169 38729 80308 108889 100341 61499 83277 80764 43856 15009 -26581 -53203 -51514
18985 -51514 -20381 23251 41422 13731 36383 78407 85843 75116 116266 195138 163373 119668
18973 119668 71649 13343 21995 30983 59792 151000 206800 165854 113590 75513 54679 45366
18961 45366 98436 105502 79695 60892 57488 71003 31398 42338 37876 79326 37328 8741
18949 8741 14550 -10905 -19151 29808 104095 124956 100746 94322 77594 50203 -29295 -76846
18937 -76846 -53244 12497 8967 36683 44106 54961 33619 34962 29692 41485 39808 61030 84707
$$ packed form
19021C8340o649m6411n0952J6243M8222J2426n2006j817O6945M2897J4656N011
19009H6905l8252m287k368J4439l9273J419L4975M9802M0330j6730p7435l7356
18997A2169K6560M1579K8581q548l8842K1778k513l6908k8847m1590k6622J689
18985e1514L1133M3632J8171k7691K2652M2024P436j0727M1150P8872l1765m3705
18973A19668m8019n8306Q652Q988K8809R1208N5800m0946n2264l8077k0834r313
18961D5366N3070P066k5807j8803l404J3515l9605J0940m462M1450m1998k8587
18949H741N809k5455q246M8959P4287K0861k4210o424j6728k7391p9498m7551
18937g6846K3602O5741l530K7716P423J0855k1342J343n270J1793j677K1222K3677
$$ plain form
18924 84707 67394 70036 58549 61238 79570 89121 93323 110971 159525 137274 100445 124011
18912 124011 110901 90442 74895 92994 64495 102226 135848 123273 159185 124628 85668
18901 85668 86107 179494 228184 203375 137091 91191 134607 103107 96965 99236 79233 120413
18889 120413 103129 87725 60383 -10126 4724 101198 141104 57370 86198 135735 181085
18878 181085 173245 148509 231408 236009 201552 155970 163237 170436 202705 190035 166652 147587
18866 147587 68092 70776 108184 92524 75041 52076 112939 105591 89940 94263 126466 130084
18854 130084 187189 242968 205146 180200 185855 198045 182179 146298 211720 242649 263741 242491
18842 242491 213951 188903 178298 211739 236310 220488 161700 141789 170479 182839 243696
$$ packed form
18924H4707j7313K642j1487K689J8332R551M202J7648M8554k2251l6829K3566
18912A24011j3110k0459j5547J8099k8499L7731L3622j2575L5912l4557l8960
18901H5668M39R3387M8690k4809o6284m5900M3416l1500o142K271k0003M1180
18889A20413j7284j5404k7342p0509J4850R6474L9906q3734K8828M9537M5350
18878A81085p840k4736Q2899M601l4457m5582P267P199L2269j2670k3383j9065
18866A47587p9495K684L7408j5660j7483k2965O0863p348j5651M323L2203L618
18854A30084N7105N5779l7822k4946N655J2190j5866l5881O5422L0929K1092k1250
18842B42491k8540k5048j0605L3441K4571j5822n8788j9911K8690J2360O0857
$$ plain form
18831 243696 396317 603164 868687 1114312 1194400 1112806 932007 748191 711748 846532
18821 846532 1112583 1234481 1145968 869811 627203 487499 325496 223814 151260 156405
18811 156405 176850 162285 196345 216769 234454 251811 240716 216711 210230 196566 212413 303327
18799 303327 420972 561982 763498 1039741 1289134 1308096 1065157 875321 815104 850961
18789 850961 1049637 1249466 1303771 1077950 775440 524108 359407 274892 252764 215755
18779 215755 177512 162854 116454 78925 104954 155602 233536 215182 203055 190090 268677
18768 268677 377280 500924 678515 594858 450824 337092 247042 194542 195221 161690 121720
18757 121720 167109 140468 123670 142959 166651 202417 123748 62820 16980 18771 32861 25591
$$ packed form
18831B43696J52621K06847K65523K45625Q0088q1594j80799j83816l6443J34784
18821H46532K66051J21898q8513k76157k42608j39704j62003j01682p2554N145
18811A56405K0445j4565L4060K0424J7685J7357j1095k4005o481j3664J5847R0914
18799C03327J17645J41010K01516K76243K49393J8962k42939j89836o0217L5857
18789H50961J98676J99829N4305k25821l02510k51332j64701q4515k2128l7009
18779B15755l8243j4658m6400l7529K6029N0648P7934j8354j2127j2965P8587
18768B68677J08603J23644J77591q3657j44034j13732r0050n2500O79l3531l9970
18757A21720M5389k6641j6798J9289K3692L5766p8669o0928m5840J791J4090p270
$$ plain form
18745 25591 5654 -1626 17425 15189 58032 110193 82493 117550 140756 187411 205915 182153
18733 182153 121578 60581 78341 52554 61961 86934 94719 94106 144734 205306 174483 71440
18721 71440 65983 122956 127794 130832 156387 196170 122548 72048 76250 78422 109757 153346 188874
18708 188874 194732 169174 145440 126820 80531 84691 122957 111164 78479 60357 57172 16745
18696 16745 -6756 -30657 16258 60833 -634 -35797 17494 92425 189993 292478 305428
18685 305428 248221 204890 156014 112998 79268 109844 153906 207755 133704 105500 83687
18674 83687 150981 200366 189368 151619 126242 108899 108342 127791 139174 117221 107177 82552
18662 82552 24579 104499 170047 218361 208074 180335 160442 110014 86030 120961 99509 133965
$$ packed form
18745B5591j9937p280J9051k236M2843N2161k7700L5057K3206M6655J8504k3762
18733A82153o0575o0997J7760k5787R407K4973P785o13N0628O0572l0823j03043
18721G1440n457N6973M838L038K5555L9783p3622n0500M202K172L1335M3589L5528
18708A88874N858k5558k3734j8620m6289M160L8266j1793l2685j8122l185m0427
18696A6745k3501k3901M6915M4575o1467l5163N3291P4931R7568J02485J2950
18685C05428n7207m3331m8876m3016l3730L0576M4062N3849p4051k8204k1813
18674H3687O7294M9385j0998l7749k5377j7343n57J9449J1383k1953j0044k4625
18662H2552n7973P9920O5548M8314j0287k7739j9893n0428k3984L4931k1452L4456
$$ plain form
18650 133965 140534 173390 209407 200867 184679 181415 213324 210256 138910 58709 53429 65907
18638 65907 99798 105573 135073 117906 78807 83501 80810 79368 75413 74189 104303 171804 224713
18625 224713 231915 155733 124273 154546 167183 155882 142973 144776 146698 136780 176404 141527
18613 141527 79011 51348 74537 115540 167508 185604 209614 199135 105671 101129 96031 43955
18601 43955 5675 38728 95040 132066 133534 155792 217303 207888 147622 120035 132419 101940
18589 101940 157067 181464 174800 177048 194380 152588 125386 147054 159073 151657 138004 132275
18577 132275 112696 142196 194449 168710 169777 186113 190969 145650 125415 104573 134552 169830
18565 169830 214308 224250 181266 139009 134772 150948 156104 151891 129138 160476 131822 128858
$$ packed form
18650A33965O569L2856L6017q540j6188l264L1909l068p1346q0201n280J2478
18638F5907L3891N775K9500j7167l9099M694k691j442l955j224L0114O7501N2909
18625B24713P202p6182l1460L0273J2637j1301j2909J803J922r918L9624l4877
18613A41527o2516k7663K3189M1003N1968J8096K4010j0479r3464m542n098n2076
18601D3955l8280L3053N6312L7026J468K2258O1511r415o0266k7587J2384l0479
18589A01940N5127K4397o664K248J7332m1792k7202K1668J2019p416j3653n729
18577A32275j9579K9500N2253k5739J067J6336M856m5319k0235k0842K9979L5278
18565A69830M4478R942m2984m2257m237J6176N156m213k2753L1338k8654k964
$$ plain form
18553 128858 168063 178825 152750 180339 175014 183371 213651 285988 259699 217757 213182 186106
18541 186106 186000 133902 117111 141699 101412 119278 145719 154816 124596 81255 19298 31008
18529 31008 125328 164003 166579 140403 109324 179577 217296 207933 202199 225855 207415 189763
18517 189763 174701 224106 268971 314343 282616 276746 233523 199069 225031 238507 193081 197340
18505 197340 235443 194235 174680 207153 242821 285915 258595 281737 275853 236395 152753 214966
18493 214966 249148 197603 180226 179954 179003 215100 274479 249363 279339 318375 321569 299203
18481 299203 252256 259423 274696 300855 317944 312045 373428 393663 376717 339910 289410 321673
18469 321673 354126 402569 378529 338318 335340 319950 306894 294411 285279 292698 342722 382481
$$ packed form
18553A28858L9205J0762k6075K7589n325Q357L0280P2337k6289m1942m575k7076
18541A86106j06n2098j6791K4588m0287J7866K6441R097l0220m3341o1957J1710
18529C1008R4320L8675K576k6176l1079P0253L7719r363n734K3656j8440j7652
18517A89763j5062M9405M4865M5372l1727n870m3223l4454K5962J3476m5426M259
18505A97340L8103m1208j9555L2473L5668M3094k7320K3142n884l9458q3642O2213
18493B14966L4182n1545j7377k72r51L6097N9379k5116K9976L9036L194k2366
18481B99203m6947P167J5273K6159J7089n899O1383K0235j6946l6807n0500L2263
18469C21673L2453M8443k4040m0211k978j5390j3056j2483r132P419N0024L9759
$$ plain form
18457 382481 364182 281768 292543 352667 314003 271668 283269 277958 230195 197375 146513 193063
18445 193063 263090 339068 339635 244659 233902 239116 272152 316854 290598 298859 318159 308066
18433 308066 274300 207711 270034 346334 367606 311115 297512 303229 301443 277303 290668 363539
18421 363539 397781 427896 406379 323535 246220 162921 160279 222944 312968 325596 339169 280357
18409 280357 274628 290327 332938 344219 348938 369863 323469 239437 270040 260273 285759 336574
18397 336574 365033 390426 410186 390834 385999 348691 284905 324214 397376 389333 399352 413228
18385 413228 399589 372819 401934 400778 387505 422874 443786 446834 484793 511353 537123 597571
18373 597571 599897 664988 677584 665912 708493 813203 949671 1033274 1036152 964003 817916
$$ packed form
18457C82481j8299q2414J0775O0124l8664m2335J1601n311m7763l2820n0862M6550
18445A93063P0027P5978N67r4976j0757N214L3036M4702k6256Q261J9300j0093
18433C08066l3766o6589O2323P6300K1272n6491j3603N717j786k4140J3365P2871
18421C63539L4242L0115k1517q2844p7315q3299k642O2665R0024J2628J3573n8812
18409B80357n729J5699M2611J1281M719K0925m6394q4032L0603r767K5486N0815
18397C36574K8459K5393J9760j9352m835l7308o3786L9309P3162q043J0019J3876
18385D13228j3639k6770K9115j156j3273L5369K0912L048L7959K6560K5770O0448
18373E97571K326O5091J2596j1672M2581J04710J36468Q3603K878p2149j46087
$$ plain form
18362 817916 765201 759614 809077 859302 929501 918618 895033 910560 865979 849107 893903 965318
18350 965318 1125692 1309218 1354280 1208579 988290 841401 816955 818812 815473 869690 980720
18339 980720 1025878 997957 1008336 1091321 1243506 1369694 1376554 1361570 1258300 1247148 1358305
18328 1358305 1535386 1794851 1986754 1945148 1729803 1533304 1460211 1523870 1743940 2177994
18318 2177994 2853835 3810773 4368848 4089495 3316879 2551811 2083816 1790740 1633191
18309 1633191 1556374 1479729 1387473 1386126 1390604 1458956 1597381 1776290 2088422 2478354 3120491
18298 3120491 3878955 4125523 3940485 3710567 3619399 3408766 3070092 2737710 2487674 2380458
18288 2380458 2481852 2758191 3285697 3951904 4384703 4193088 3698893 3206189 2890412
$$ packed form
18362H17916n2715n587M9463N0225P0199j0883k3585J5527m4581j6872M4796P1415
18350I65318J60374J83526M5062j45701k20289j46889k4446J857l339N4217J11030
18339I80720M5158k7921J0379Q2985J52185J26188O860j4984j03270j1152J11157
18328A358305J77081K59465J91903m1606k15345j96499p3093O3659K20070M34054
18318B177994O75841R56938N58075k79353p72616p65068m67995k93076j57549
18309A633191p6817p6645r2256j347M478O8352J38425J78909L12132L89932O42137
18298C120491P58464K46568j85038k29918r1168k10633l38674l32382k50036j07216
18288B380458J01394K76339N27506O66207M32799j91615m94195m92704l15777
$$ plain form
18279 2890412 2828306 2789987 2799246 2870976 2939860 3036029 3234783 3546903 3955626 4434193 4796769
18268 4796769 5142402 5704278 6534581 7002754 6930816 6714621 6472467 6319721 6408789 6791776
18258 6791776 7333655 7884285 8379277 8894183 9591029 10632862 12154958 14276016 16994217
18249 16994217 20075828 23708850 28732214 36913255 50815926 73957294 111497107 164160227
18241 164160227 202361437 195131765 160911034 128599988 117105302 128944840 163149372
18234 163149372 202854454 204562134 167081039 117658536 79218643 55981507 42268759
18227 42268759 33841852 28675140 25446762 23223119 21510440 20329713 19999898 20621782
18219 20621782 21959964 24041634 26741360 29855696 34112545 41138475 53472100 74300900
$$ packed form
18279B890412o2106l8319R259P1730O8884R6169J98754L12120M08723M78567L62576
18268D796769L45633N61876Q30303M68173p1938k16195k42154j52746Q9068L82987
18258F791776N41879N50630M94992N14906O96846J041833J522096K121058K718201
18249A6994217L081611L633022N023364Q181041J3902671K3141368L7539813N2663120
18241A64160227L8201210p229672l4220731l2311046j1494686J1839538L4204532
18234A63149372L9705082J707680l7481095m9422503l8439893k3237136j3712748
18227D2268759q426907n166712l228378k223643j712679j180727l29815O21884
18219B0621782J338182K081670K699726L114336M256849P025930J2333625K0828800
$$ plain form
18211 74300900 108538278 162042073 221359966 237589418 207440938 163752618 136906041
18204 136906041 137404126 164560708 212282268 239836883 214411232 159483501 106028287
18197 106028287 70671235 49929024 37273041 29142020 23662269 19862409 16864546
18190 16864546 14505672 12832453 11658032 10829425 10100097 9424440 8596461 7656662 6889609
18181 6889609 6436218 6186048 5813818 5299833 4806251 4392639 4130367 4017597 4014144 3972908
18171 3972908 3727735 3384869 3088917 2779183 2572125 2405329 2240188 2129085 2100524 1972698
18161 1972698 1891722 1824323 1831657 1817806 1783373 1765228 1803971 1821944 1900409 2038202 2186273
18150 2186273 2274948 2165645 2061399 2052021 2087337 2101702 2185559 2243773 2245436 2151123 1992056
$$ packed form
18211G4300900L4237378N3503795N9317893J6229452l0148480m3688320k6846577
18204A36906041M98085K7156582M7721560K7554615k5425651n4927731n3455214
18197A06028287l5357052k0742211j2655983q131021n479751l799860k997863
18190A6864546k358874j673219j174421q28607p29328o75657q27979r39799p67053
18181F889609m53391k50170l72230n13985m93582m13612k62272j12770l453m1236
18171C972908k45173l42866k95952l09734k07058j66796j65141j11103k8561j27826
18161A972698q0976o7399P334j3851l4433j8145L8743J7973P8465J37793J48071
18150B186273Q8675j09303j04246r378L5316J4365Q3857N8214J663r4313j59067
$$ plain form
18139 1992056 1876122 1856981 1769309 1686329 1725508 1829671 1833952 1825716 1835959 1888666 2041280
18128 2041280 2143996 2201391 2235486 2370018 2625687 2874012 3081468 3377882 3840595 4510048
18118 4510048 5297682 6134609 7141378 8462004 10388152 13429651 18433090 26969959
18110 26969959 41513360 66117562 101486695 117346720 99683759 68682240 42405923
18103 42405923 27469111 19436839 14533164 11169665 8778943 7149771 6047612 5302623
18095 5302623 4783862 4376071 4015951 3630037 3320394 3042852 2902686 3059551 3405597
18086 3405597 3626711 3540690 3194524 2864014 2543322 2326398 2322173 2367738 2416683 2325459
18076 2325459 2123778 1842190 1595765 1445585 1343780 1170795 1072343 1085984 1121795 1163634
$$ packed form
18139A992056j15934j9141q7672q2980L9179J04163M281q236J0243N2707J52614
18128B041280J02716N7395L4095J34532K55669K48325K07456K96414M62713O69453
18118D510048P87634Q36927J006769J320626J926148L041499N003439Q536869
18110B6969959J4543401K4604202L5369133J5860025j7662961l1001519k6276317
18103D2405923j4936812q032272m903675l363499k390722j629172j102159p44989
18095E302623n18761m07791l60120l85914l09643k77542j40166J56865L46046
18086C405597K21114q6021l46166l30510l20692k16924m225M5565M8945r1224
18076B325459k01681k81588k46425j50180j01805j72985r8452J3641L5811M1839
$$ plain form
18066 1163634 1194146 1161660 1081479 1056972 1094819 1051073 964265 918119 937649 1015905 1126011
18055 1126011 1284196 1381867 1428647 1511568 1603966 1653924 1683939 1665339 1650837 1644357 1725612
18044 1725612 1755272 1632490 1424934 1258207 1142116 1100836 1078823 1012628 965494 852010
18034 852010 700029 629663 630888 661079 730126 725350 681896 700805 689562 627061 701701 786517
18022 786517 800081 805959 819158 808494 779418 757139 811072 870946 919247 932637 886106 785113
18010 785113 689420 651032 673584 694134 760602 816474 756700 714510 643433 608547 637638
17999 637638 708230 740787 798568 775264 739750 808871 922051 1060163 1224925 1402942 1511287
17988 1511287 1530786 1537365 1608617 1671950 1657102 1760365 1902830 1872921 1770641 1728106 1617224
$$ packed form
18066A163634L0512l2486q0181k4507L7847m3746q6808m6146J9530P8256J10106
18055A126011J58185R7671M6780Q2921R2398M9958L0015j8600j4502o480Q1255
18044A725612K9660j22782k07556j66727j16091m1280k2013o6195m7134j13484
18034H52010j51981p0366J225L0191O9047m776m3454J8909j1243o2501P4640Q4816
18022G86517J3564N878J3199j0664k9076k2279N3933N9874M8301J3390m6531j00993
18010G85113r5693l8388K2552K0550O6468N5872n9774m2190p1077l4886K9091
17999F37638P0592L2557N7781k3304l5514O9121J13180J38112J64762J78017J08345
17988A511287J9499O579P1252O3333j4848J03263J42465k9909j02280m2535j10882
$$ plain form
17977 1617224 1453009 1425653 1377150 1253811 1194240 1137333 1099133 1007692 959055 978828 946826
17966 946826 909602 871961 888153 994451 1097335 1201889 1254066 1202403 1251626 1379448 1487662
17955 1487662 1505427 1492283 1475919 1421253 1370567 1298141 1277254 1302683 1393581 1445038 1518572
17944 1518572 1660962 1865280 2013857 2079480 2093656 2095497 2177367 2359473 2558871 2710237
17934 2710237 2821518 2742186 2570776 2431698 2425770 2541413 2891443 3382780 3966530 4070388
17924 4070388 3709305 3122962 2722040 2633225 2773843 3281196 4020737 4786688 4925445 4477836
17914 4477836 3795198 3175780 2823607 2758691 2912793 3225545 3693664 3989580 3705784 3164745
17904 3164745 2655917 2313875 2172208 2203361 2438046 2946544 3429639 3387238 2892832 2396326
$$ packed form
17977A617224j64215k7356m8503j23339n9571n6907l8200r1441m8637J9773l2002
17966I46826l7224l7641J6192J06298J02884J04554N2177n1663M9223J27822J08214
17955A487662J7765j3144j6364n4666n0686p2426k0887K5429R0898N1457P3534
17944A518572J42390K04318J48577O5623J4176J841Q1870J82106J99398J51366
17934B710237J11281p9332j71410j39078n928J15643L50030M91337N83750J03858
17924D070388l61083n86343m00922q8815J40618N07353P39541P65951J38757m47609
17914D477836o82638o19418l52173o4916J54102L12752M68119K95916k83796n41039
17904C164745n08828l42042j41667L1153K34685N08498M83095m2401m94406m96506
$$ plain form
17894 2396326 1984612 1741483 1728454 1663015 1547356 1518055 1526981 1497463 1513024 1492868 1393756
17883 1393756 1324569 1259804 1207205 1142201 1060364 1057067 1075240 1051196 1013061 1005811 966605 1017654
17871 1017654 1153231 1191783 1192308 1236442 1298179 1364785 1436458 1428707 1404393 1460639 1500226 1536902
17859 1536902 1552507 1600770 1687061 1709038 1767727 1862913 1917545 2001677 2102494 2272741 2497265
17848 2497265 2815681 3243564 3464469 3428022 3299793 3281365 3290688 3417566 3665931 4032599
17838 4032599 4518481 4923885 5200135 5495163 5908468 6491105 6916064 7189938 7442102
17829 7442102 7963333 8921259 10371997 12234259 14714602 17950969 22012952 27728303
17821 27728303 36868748 52414993 78629226 121028067 175914248 203705507 181604352
$$ packed form
17894B396326m11714k43129j3029o5439j15659k9301Q926k9518J5561k0156r9112
17883A393756o9187o4765n2599o5004q1837l297J8173k4044l8135p250l9206N1049
17871A017654J35577L8552N25M4134O1737O6606P1673p751k4314N6246L9587L6676
17859A536902J5605M8263Q6291K1977N8689R5186N4632Q4132J00817J70247K24524
17848B497265L18416M27883K20905l6447j28229j8428R323J26878K48365L66668
17838D032599M85882M05404K76250K95028M13305N82637M24959K73874K52164
17829G442102N21231R57926J450738J862262K480343L236367M061983N715351
17821B7728303R140445J5546245K6214233M2398841N4886181K7791259k2101155
$$ plain form
17814 181604352 134108825 89312379 60593480 44012099 34219298 28102338 24173460
17807 24173460 21787584 20719193 20752376 21507604 22847152 24969428 28316932 33278798
17799 33278798 40723415 52913639 73400317 107325020 160712304 225715409 253003581
17792 253003581 222732751 166249731 117128752 89724823 80409338 85789994 106753655
17785 106753655 144390993 180527762 178194797 143074776 99756882 67553799 48408150
17778 48408150 37110467 29993346 25451272 22673649 21307094 20914079 20917383 21069775 21598069
17769 21598069 23082722 25893378 30554283 38501087 52234296 75541101 113249054 167667386
17761 167667386 212897408 206047283 160073299 106710729 68546104 46341901 33338605
$$ packed form
17814A81604352m7495527m4796446k8718899j6581381r792801o116960l928878
17807B4173460k385876j068391L3183P55228J339548K122276L347504M961866
17799C3278798P444617J2190224K0486678L3924703N3387284O5003105K7288172
17792B53003581l0270830n6483020m9120979k7403929r315485N380656K0963661
17785A06753655L7637338L6136769k332965l5120021m3317894l2203083j9145649
17778D8408150j1297683p117121m542074k777623j366555l93015L304J52392N28294
17769B1598069J484653K810656M660905P946804J3733209K3306805L7707953N4418332
17761A67667386M5230022o850125m5973984n3362570l8164625k2204203j3003296
$$ plain form
17754 33338605 25207009 19809809 16091522 13498927 11640392 10193306 8919458 7827414
17746 7827414 6946306 6271207 5909400 5811404 6008939 6374396 6524628 6146025 5349581 4481747
17736 4481747 3855498 3464827 3180671 3107281 3257079 3398788 3313049 2990738 2576667 2242875
17726 2242875 2095540 2016499 1943630 1930522 1931911 1942776 2055171 2162370 2288281 2432279
17716 2432279 2493592 2504695 2411268 2226436 2083590 1944125 1827792 1801855 1823785 1803719
17706 1803719 1787952 1789477 1714058 1626400 1616334 1677862 1669478 1599976 1511809 1453721 1454922 1474209
17694 1474209 1629107 1927175 2262162 2580542 2860454 3313048 3732243 4292053 4578681
17685 4578681 4309178 3783282 3290184 3015634 3047545 3357466 3863095 4349034 4452346 3994781
$$ packed form
17754C3338605q131596n397200l718287k592595j858535j447086j273848j092044
17746G827414q81108o75099l61807r7996J97535L65457J50232l78603p96444q67834
17736D481747o26249l90671k84156p3390J49798J41709q5739l22311m14071l33792
17726B242875j47335p9041p2869j3108J389J0865J12395J07199J25911J43998
17716B432279O1313J1103r3427j84832j42846j39465j16333k5937K1930k0066
17706A803719j5767J525p5419q7658j0066O1528q384o9502q8167n8088J201J9287
17694A474209J54898K98068L34987L18380K79912M52594M19195N59810K86628
17685D578681k69503n25896m93098k74550L1911L09921N05629M85939J03312m57565
$$ plain form
17675 3994781 3260303 2676608 2347829 2239146 2226952 2340118 2681000 3258354 4087205 4862422
17665 4862422 5075514 4809219 4308080 3822139 3435872 3079680 2868316 2813261 2915168 3357262
17655 3357262 4016031 4523486 4558324 4313721 4064401 4147717 4462570 4882386 5501593 6415290
17645 6415290 7295334 7565316 7246870 6276224 5182369 4333014 3831739 3787071 4077819
17636 4077819 4149660 3876426 3453806 3135336 3034101 2977281 2989032 3015349 3081765 3300949
17626 3300949 3505732 3685030 3949224 4270585 4620179 4728453 4633157 4465798 4437172 4670147
17616 4670147 5122919 5703701 6129266 6347105 6519977 6681045 6900858 7293411 8034653
17607 8034653 8849247 9595562 10452233 11316349 12042212 12809044 13967926 15810160 17966923
$$ packed form
17675C994781p34478n83695l28779j08683j2194J13166L40882N77354Q28851P75217
17665D862422K13092k66295n01139m85941l86267l56192k11364n5055J01907M42094
17655C357262O58769N07455L4838k44603k49320Q3316L14853M19816O19207R13697
17645F415290Q80044K69982l18446r70646j093855q49355n01275m4668K90748
17636D077819P1841k73234m22620l18470j01235n6820J1751K6317O6416K19184
17626C300949K04783J79298K64194L21361L49594J08274r5296j67359k8626K32975
17616D670147M52772N80782M25565K17839J72872J61068K19813L92553P41242
17607H034653Q14594P46315Q56671Q64116P25863P66832J158882J842234K156763
$$ plain form
17598 17966923 20347859 23475894 27856906 33746231 42301798 56283242 79518546 117478399
17590 117478399 176354624 238267133 248471681 212873479 166815450 141492774 145144369
17583 145144369 176632220 229533762 254910904 223122819 164795971 112215650 80164504
17576 80164504 62436711 52361837 46932302 44899920 45591279 49656226 59216483 77458852
17568 77458852 108882842 157692842 205655369 208291712 175224119 136291848 116214992
17561 116214992 120141713 146583355 187929358 202886809 173281280 124954913 82908304
17554 82908304 56819891 41417233 31676575 25236847 20875054 17726387 15478727 13840800
17546 13840800 12649563 11745413 10899852 9946145 8912054 7828783 6930161 6429928 6304660
$$ packed form
17598A7966923K380936L128035M381012N889325Q555567J3981444K3235304L7959853
17590A17478399N8876225O1912509J0204548l5598202m6058029k5322676L651595
17583A45144369L1487851N2901542K5377142l1788085n8326848n2580321l2051146
17576H0164504j7727793j0074874n429535k032382O91359M064947R560257J8242369
17568G7458852L1423990M8810000M7962527K636343l3067593l8932271k0076856
17561A16214992L926721K6441642M1346003J4957451k9605529m8326367m2046609
17554H2908304k6088413j5402658r740658o439728m361793l148667k247660j637927
17546A3840800j191237r04150q45561r53707j034091j083271q98622n00233j25268
$$ plain form
17537 6304660 6189299 5887577 5433610 5045579 4768655 4351981 3797616 3298739 3004753
17528 3004753 2849728 2794209 2799980 2779121 2610579 2381904 2105590 1822180 1668641 1572689
17518 1572689 1490922 1419264 1424205 1467328 1428153 1399252 1354810 1240721 1130890 1112881 1140573
17507 1140573 1136380 1011971 924933 928722 852558 770253 712705 689047 662846 620753 569394
17496 569394 550259 525967 492973 469519 440270 429010 436328 505580 460966 349436 326297
17485 326297 334702 374778 422422 347030 284137 248803 266222 277955 252659 193359 180410 217347
17473 217347 227725 252515 251386 182666 105683 54820 37108 12543 -22329 50209 80760 35589
17461 35589 33771 54303 -15744 -69224 -50543 -10125 22240 26762 58128 62168 50529 40025
$$ packed form
17537F304660j15361l01722m53967l88031k76924m16674n54365m98877k93986
17528C004753j55025n5519N771k0859j68542k28675k76314k83410j53539r5952
17518A572689q1767p1658M941M3123l9175k8901m4442j14089j09831j8009K7692
17507A140573m193j24409q7038L789p6164q2305n7548k3658k6201m2093n1359
17496E69394j9135k4292l2994k3454k9249j1260P318O9252m4614j11530k3139
17485C26297Q405M0076M7644p5392o2893l5334J7419J1733k5296n9300j2949L6937
17473B17347J0378K4790j129o8720p6983n0863j7712k4565l4872P2538L0551m5171
17461C5589j818K0532p0047n3480J8681M0418L2365M522L1366M040j1639j0504
$$ plain form
17449 40025 19064 -11512 -4315 -16370 25346 106983 206291 421075 685261 716029 506034
17438 506034 320493 255157 194630 174077 192423 235098 239338 181142 132339 71051 16243
17427 16243 108228 127232 91018 80094 41954 31631 63256 116375 153897 198643 157030 167081
17415 167081 147056 90750 70270 89133 168808 269637 254216 240237 223907 233230 264734
17404 264734 219918 187045 196003 244630 280330 222209 140115 119715 140578 110187 109346 135642
17392 135642 161982 152412 173847 210296 207436 181729 206294 214616 186490 113059 31819 21554
17380 21554 38124 67740 72983 32325 43967 21462 -30763 -30853 -51236 -105486 -104752 -57496 35030
17367 35030 144381 211821 179404 94668 37636 1513 90610 171478 216051 165683 118901
$$ packed form
17449D0025k0961l0576P197j2055M1716Q1637R9308K14784K64186L0768k09995
17438E06034j85541o5336o0527k0553J8346M2675M240n8196m8803o1288n4808
17427A6243R1985J9004l6214j0924l8140j0323L1625N3119L7522M4746m1613J0051
17415A67081k0025n6306k0480J8863P9675J00829j5421j3979j6330R323L1504
17404B64734m4816l2873Q958M8627L5700n8121q2094k0400K0863l0391q41K6296
17392A35642K6340r570K1435L6449k860k5707K4565Q322k8126p3431q1240j0265
17380B1554J6570K9616N243m0658J1642k2505n2225r0k0383n4250P34M7256R2526
17367C5030J09351O7440l2417q4736n7032l6123Q9097Q0868M4573n0368m6782
$$ plain form
17356 118901 107818 33042 -9195 -48813 -84474 -138229 -185338 -180505 -93477 26108 107892
17345 107892 188069 239708 233622 180606 155318 91208 85809 140249 166964 132005 70581 56268
17333 56268 49787 16865 -21607 -51118 -106147 -153649 -143940 -149228 -184344 -188473 -168893 -137607
17321 -137607 -73193 -24613 37603 87595 71910 9906 -57976 -84676 -67273 -73845 -71103 -68149
17309 -68149 -60543 -53084 -53097 -53718 1240 3341 -3821 2682 -20940 -740 23664 23472 -29476 -47351
17295 -47351 1386 -47331 -60551 -44781 -16276 70335 108265 57787 32291 59887 102001 138247
17283 138247 195632 390620 659468 948300 1040939 906883 640420 509793 360939 248901
17273 248901 168368 80247 13909 6787 45349 74918 107731 140385 109243 165549 179782 209430
$$ packed form
17356A18901j1083p4776m2237l9618l5661n3755m7109M833Q7028J19585Q1784
17345A07892Q0177N1639o086n3016k5288o4110n399N4440K6715l4959o1424j4313
17333E6268o481l2922l8472k9511n5029m7502R709n288l5116m129J9580L1286
17321a37607O4414M8580O2216M9992j5685o2004o7882k6700J7403o572K742K954
17309f8149P606P459j3o21N4958K101p162O503k3622K0200K4404j92n2948j7875
17295d7351M8737m8717j3220J5770K8505Q6611L7930n0478k5496K7596M2114L6246
17283A38247N7385J94988K68848K88832R2639j34056k66463j30627j48854j12038
17273B48901q0533q8121o6338p122L8562K9569L2813L2654l1142N6306J4233K9648
$$ plain form
17261 209430 255924 320209 510762 724629 939900 996062 846178 632545 465713 336762
17251 336762 351711 432064 619595 870313 1094550 1008562 786265 547959 308801 162933
17241 162933 105267 44394 -28351 -34930 -23619 -46186 -58205 -55194 -24305 23967 40364 2863
17229 2863 25494 99737 142485 344611 670449 860461 853759 665768 408678 234424 98337
17218 98337 30836 -14797 -30466 -15651 -54046 -47502 -74323 -35658 -31953 -107631 -51644 5668
17206 5668 39056 55880 12533 -33363 -756 2031 -72789 -74593 -42480 -71380 -91590 -116425
17194 -116425 -185668 -198683 -189304 -187698 -194993 -226480 -192822 -204025 -178987 -195014 -186462 -141255
17182 -141255 -132203 -140079 -159496 -202752 -205730 -130127 -144199 -94890 -35069 -40557 -59396 -88450
$$ packed form
17261B09430M6494O4285J90553K13867K15271N6162j49884k13633j66832j28951
17251C36762J4949Q0353J87531K50718K24237q5988k22297k38306k39158j45868
17241A62933n7666o0873p2745o579J1311k2567j2019L011L0889M8272J6397l7501
17229B863K2631P4243M2748K02126L25838J90012o702j87991k57090j74254j36087
17218I8337o7501m5633j5669J4815l8395O544k6821L8665L705p5678N5987N7312
17206E668L3388J6824m3347m5896L2607K787p4820j804L2113k8900k0210k4835
17194a16425o9243j3015R379J606p295l1487L3658j1203K5038j6027Q552M5207
17182a41255R052p876j9417m3256k978P5603j4072M9309N9821n488j8839k9054
$$ plain form
17170 -88450 -63105 -59317 -67197 -149271 -178524 -175085 -130932 -129076 -121938 -137518 -138844 -78493 -40471
17157 -40471 -69766 -140869 -222520 -283753 -288390 -176800 -46148 5289 17308 44077 -72866
17146 -72866 -141265 -162478 -120266 -81435 -119918 -116775 -63756 -56676 -76051 -146647 -164941 -126455
17134 -126455 -81517 -86717 -65273 -87158 -120624 -153906 -131019 -150088 -165122 -156707 -136959 -113962
17122 -113962 -110514 -83874 -52633 -49474 -51977 -48982 -100067 -94793 -96473 -83584 -64611 -40949 -89515
17109 -89515 -99094 -81609 -91850 -62218 -84547 -109561 -116173 -130799 -135385 -82855 -143652 -178456
17097 -178456 -168201 -143361 -193512 -138170 -60603 -67136 -74402 -55277 -8811 -36867 -80477 -57580
17085 -57580 -9632 -16923 -32228 -57802 -83594 -64636 -45457 -35062 22538 -33614 -70245 -63290
$$ packed form
17170h8450K5345L788p880q2074k9253L439M4153J856P138j5580j326O0351L8022
17157d0471k9295p1103q1651o1233m637J11590J30652N1437J2019K6769j16943
17146g2866o8399k1213M2212L8831l8483L143N3019P080j9375p0596j8294L8486
17134a26455M4938n200K1444k1885l3466l3282K2887j9069j5034Q415J9748K2997
17122a13962L448K6640L1241L159k503K995n1085N274j680J2889J8973K3662m8566
17109h9515r579J7485j0241K9632k2329k5014o612j4626m586N2530o0797l4804
17097a78456J0255K4840n0151N5342P7567o533p266J9125M6466k8056m3610K2897
17085e7580M7948p291j5305k5574k5792J8958J9179J0395N7600n6152l6631O955
$$ plain form
17073 -63290 -44667 -10375 7637 15532 113794 161206 222858 385917 585375 856174 1146057
17062 1146057 1173090 980449 799173 709288 695447 829429 1073751 1087403 848299 564516
17052 564516 330104 204982 181280 193618 130198 91498 101806 123689 193200 294039 481124
17041 481124 847199 1151326 1129716 979914 755452 578083 625999 808424 1061071 1121957
17031 1121957 931276 616558 392037 231353 119965 44707 98325 101060 79667 99631
17021 99631 67765 -1204 -23495 -53180 -27848 -69236 -61124 -367 -31350 -87669 -113807 -75437
17009 -75437 2965 40296 -17003 -81121 -118672 -103643 -98774 -90733 -69346 -48678 -75952 -85796
16997 -85796 -44368 -87886 -127227 -134069 -101512 -111557 -103551 -100701 -112765 -128237 -167655 -129553
$$ packed form
17073f3290J8623L4292J8012P895R8262M7412O1652J63059J99458K70799K89883
17062A146057K7033j92641j81276q9885j3841J33982K44322J3652k39104k83783
17052E64516k34412j25122k3702J2338o3420l8700J0308K1883O9511J00839J87085
17041D81124L66075L04127k1610j49802k24462j77369M7916J82425K52647O0886
17031A121957j90681l14718k24521j60684j11388p5258N3618K735k1393J9964
17021I9631l1866o8969k2291k9685K5332m1388Q112O0757l0983n6319k6138L8370
17009g5437P8402L7331n7299o4118l7551J5029M869Q041K1387K0668k7274r844
16997h5796M1428m3518l9341o842L2557j0045Q006K850j2064j5472l9418L8102
$$ plain form
16985 -129553 -90952 -128238 -82439 -71949 -83171 -75143 -9486 -11498 -96260 -182490 -223918 -185873
16973 -185873 -193522 -203132 -184434 -108418 -101896 -110537 -58769 -20927 1434 -68517 -72478 -49518
16961 -49518 -68060 -93478 -71807 -79105 -91348 -97925 -64620 -36878 -102840 -108145 -132843 -174028
16949 -174028 -97570 -55261 -37032 187 -13730 -2216 -6046 -116901 -202309 -179352 -115719
16938 -115719 -87261 -110661 -121952 -104968 -71423 -44579 -27462 -16605 -57991 -123239 -164745
16927 -164745 -151293 -112578 -113740 -130023 -95257 -99302 -118999 -158938 -191636 -193676 -163613 -146781
16915 -146781 -144552 -121696 -76610 -23995 -91925 -159024 -163426 -118402 -119254 -162944 -181315 -160353
16903 -160353 -93085 -97551 -95986 -91926 -68855 -80167 -88506 -98912 -76457 -78750 -50522 -43460 -80717
$$ packed form
16985a29553L8601l7286M5799J0490j1222Q028O5657k012q4762q6230m1428L8045
16973a85873p649r610J8698P6016O522q641N1768L7842K2361o9951l961K2960
16961d9518j8542k5418K1671p298j2243o577L3305K7742o5962n305k4698m1185
16949a74028P6458M2309J8229L7219j3917J1514l830j10855q5408K2957O3633
16938a15719K8458k3400j1291J6984L3545K6844J7117J0857m1386o5248m1506
16927a64745J3452L8715j162j6283L4766m045j9697l9939l2698k040L0063J6832
16915a46781K229K2856M5086N2615o7930o7099m402M5024q52m3690j8371K0962
16903a60353O7268m466J565M060K3071j1312q339j0406K2455k293K8228P062l7257
$$ plain form
16890 -80717 -78113 -97448 -140080 -154620 -166116 -126601 -82453 -55813 -50467 -69961 -82344 -83302
16878 -83302 -71299 -89662 -78034 -108927 -118829 -122280 -119846 -62734 -65558 -145594 -165003 -100241
16866 -100241 -61265 -71401 -50152 -64473 -72893 -61449 -10597 -7026 -94284 -183411 -103359 -73460
16854 -73460 -60788 -33722 -60663 -80898 -60502 -43071 -59091 -107394 -121519 -66627 -34756 -75768
16842 -75768 -171858 -230657 -151363 -102440 -98070 -96170 -96236 -81034 -26446 -1675 -82032 -157749 -141653
16829 -141653 -163408 -194843 -178447 -103783 -135907 -112072 -68082 -39362 -27512 -17360 -3163
16818 -3163 -8065 -31726 -42079 -17233 -8272 -19390 -60973 -47083 -33375 -40736 -27701 -69669
16806 -69669 -94888 -127613 -143353 -108766 -98471 -123223 -104297 -104774 -103197 -18976 44221 52967
$$ packed form
16890h0717K604j9335m2632j4540j1496L9515M4148K6640N346j9494j2383r58
16878h3302J2003j8363J1628l0893r902l451K434N7112k824q0036j9409O4762
16866a00241L8976j0136K1249j4321q420J1444N0852L571q7258q9127Q0052K9899
16854g3460J2672K7066k6941k0235K0396J7431j6020m8303j4125N4892L1871m1012
16842g5768r6090n8799P9294M8923M370J900o6J5202N4588K4771q0357p5717J6096
16829a41653k1755l1435J6396P4664l2124K3835M3990K8720J1850J0152J4197
16818c163m902k3661j0353K4846Q961j1118m1583J3890J3708p361J3035m1968
16806f9669k5219l2725j5740L4587J0295k4752J8926m77J577Q4221O3197Q746
$$ plain form
16794 52967 -18730 -93369 -52360 -24663 -27078 -90696 -78705 -101966 -74018 -22018 19179 51163
16782 51163 61034 42841 -12040 -20470 -33540 22906 656 -89409 -134302 -143754 -156678 -120035
16770 -120035 -80105 -59428 -79066 -128982 -103792 -22039 11613 -59210 -85502 -48524 -28743
16759 -28743 -39054 -80952 -97394 -56961 -28220 -64996 -61310 -116277 -120518 -97768 -97437 -120678
16747 -120678 -143487 -143259 -127913 -108636 -161820 -139224 -103949 -153875 -197106 -172686 -105747 -79939
16735 -79939 -87069 -97314 -120324 -197457 -180015 -106187 -66127 -104811 -96151 -73886 -72825 -81682
16723 -81682 -48935 -27434 -43987 -72927 -40815 -40138 -35859 -44145 -59406 -56385 -62913 -88880 -88738
16710 -88738 -39554 -23915 -20888 -50197 -99517 -81232 -70459 -67815 -98094 -118947 -60605 -56778
$$ packed form
16794E2967p1697p4639M1009K7697k415o3618J1991k3261K7948N2000M1197L1984
16782E1163R871j8193n4881q430j3070N6446k2250r0065m4893r452j2924L6643
16770a20035L9930K0677j9638m9916K5190Q1753L3652p0823k6292L6978J9781
16759b8743j0311m1898j6442M0433K8741l6776L686n4967m241K2750L31k3241
16747a20678k2809K28J5346J9277n3184K2596L5275m9926m3231K4420O6939K5808
16735g9939p130j0245k3010p7133J7442P3828M0060l8684Q660K2265J061q857
16723h1682L2747K1501j6553k8940L2112O77M279q286j5261L021o528k5967J42
16710h8738M9184J5639L027k9309m9320J8285J0773K644l0279k0853N8342L827
$$ plain form
16698 -56778 -65753 -73750 -113006 -122897 -168869 -162517 -155851 -140340 -134318 -135597 -138902 -171246 -234451
16685 -234451 -204457 -120110 -109018 -107520 -112981 -125190 -120700 -87438 -128422 -159061 -170565 -167700
16673 -167700 -185950 -159772 -100540 -80990 -115042 -107598 -88315 -64971 -35182 -6379 -17614 -58902
16661 -58902 -126128 -144869 -126040 -106357 -83477 -117251 -107350 -109542 -103024 -20103 17953 -48134
16649 -48134 -125102 -111309 -143589 -221225 -234016 -157748 -121341 -165899 -181695 -156146 -127870 -87936
16637 -87936 -90729 -79810 -84916 -94855 -72674 -21195 -21025 -53715 -74405 -103598 -113188 -138477 -159561
16624 -159561 -139996 -94566 -92055 -68198 -61091 -83854 -118774 -104882 -88787 -69224 -71453 -105201
16612 -105201 -111420 -124110 -174370 -171487 -101966 -28508 25556 33577 38415 17151 21557 7563
$$ packed form
16698e6778q975p997l9256r891m5972O352O666J5511O022j279l305l2344o3205
16685b34451K9994Q4347J1092J498n461j2209M490L3262m0984l0639j1504K865
16673a67700j8250K6178N9232J9550l4052P444J9283K3344K9789K8803j1235m1288
16661e8902o7226j8741J8829J9683K2880l3774R901k192O518Q2921L8056o6087
16649d8134p6968J3793l2280p7636j2791P6268L6407m4558j5796K5549K8276L9934
16637h7936k793J0919n106r939K2181N1479J70l2690k0690k9193r590k5289k1084
16624a59561J9565M5430K511K3857P107k2763l4920J3892J6095J9563k229l3748
16612a05201o219j2690n0260K883O9521P3458N4064Q021M838k1264M406j3994
$$ plain form
16600 7563 29645 46390 34594 -15414 -119968 -181311 -227176 -186244 -126384 -110275 -120445 -112780
16588 -112780 -124996 -114233 -83008 -72692 -131700 -105847 -99741 -71401 -86306 -111614 -108596 -136461
16576 -136461 -147644 -75902 -61841 -85067 -111522 -110639 -108179 -116164 -174147 -152414 -78969 -19540
16564 -19540 -27170 -20216 -24867 -50894 -25727 -21198 -15065 -41187 -106450 -177908 -134453 -98699 -78007
16551 -78007 -55097 -94384 -27439 41195 -26838 -115349 -119442 -136730 -150316 -114173 -82631 -84426
16539 -84426 -144651 -181436 -123013 -133578 -162046 -152015 -126540 -90959 -85230 -74856 -141498 -116573
16527 -116573 -86108 -80316 -105674 -131422 -130439 -89069 -9563 29643 16729 -10671 23041 36556
16515 36556 -2097 -15090 -21475 -70491 -120210 -158238 -205086 -155192 -165938 -179922 -150495 -196389
$$ packed form
16600G563K2082J6745j1796n0008j04554o1343m5865M0932N9860J6109j0170P665
16588a12780j2216J0763L1225J0316n9008K5853O106K8340j4905k5308L018k7865
16576a36461j1183P1742J4061k3226k6455Q83K460p985n7983K1733P3445N9429
16564a9540p630O954m651k6027K5167M529O133k6122o5263p1458M3455L5754K0692
16551g8007K2910l9287O6945O8634o8033q8511m093j7288j3586L6143L1542j795
16539h4426o0225l6785N8423j0565k8468J0031K5475L5581N729J0374o6642K4925
16527a16573L0465N792k5358k5748R83M1370P9506L9206j2914k7400L3712J3515
16515C6556l8653j2993o385m9016m9719l8028m6848M9894j0746j3984K9427m5894
$$ plain form
16503 -196389 -157634 -133126 -168594 -172177 -221213 -178818 -156278 -120858 -63260 -2430 -28554 -120307
16491 -120307 -98857 -124476 -163034 -111762 -94454 -130801 -76954 -98775 -104453 -96676 -96567 -120744
16479 -120744 -93589 -86381 -94768 -105025 -149759 -115635 -100460 -73362 -65356 -128616 -169399 -152652
16467 -152652 -89116 -85284 -91623 -75418 -104792 -125759 -129134 -51363 -47466 -73487 -66692 -33037
16455 -33037 -61151 -123106 -140077 -99031 -18078 4392 -47759 -47414 -69163 -10917 -60637 -95892
16443 -95892 -77130 -124546 -140939 -140620 -147574 -157734 -117335 -97809 -107750 -114556 -113403 -128617 -103414
16430 -103414 -91697 -113232 -183399 -164024 -65248 -85519 -107479 -78723 -132456 -160268 -79335
16419 -79335 -37959 -66768 -89913 -89188 -75668 -82415 -43641 -18403 -50269 -83057 -74309 -96483
$$ packed form
16503a96389L8755K4508l5468l583m9036M2395K2540L5420N7598O0830k6124r1753
16491a20307K1450k5619l8558N1272J7308l6347N3847k1821n678P777J09k4177
16479a20744K7155P208q387j0257m4734L4124J5175K7098Q006o3260m0783J6747
16467a52652O3536L832o339J6205k9374k0967l375P7771L897k6021O795L3655
16455c3037k8114o1955j6971M1046Q0953K2470n2151L45k1749N8246m9720l5255
16443i5892J8762m7416j6393L19o954j0160M0399J9526r941o806J153j5214K5203
16430a03414J1717k1535p0167J9375R8776k0271k1960K8756n3733k7812Q0933
16419g9335M1376k8809k3145P25J3520o747L8774K5238l1866l2788Q748k2174
$$ plain form
16407 -96483 -143673 -120317 -109324 -83171 -81212 -42201 -77290 -84189 -96719 -68753 -25309 -57302
16395 -57302 -101637 -85132 -72628 -53315 -114200 -167164 -127185 -134425 -40742 -38548 -96429 -140050
16383 -140050 -130861 -76709 -94183 -96095 -79436 -82254 -73194 -94716 -82682 -68159 -52310 -60623
16371 -60623 -85946 -62521 -38230 -16613 -25561 -20418 -56128 -88458 -100645 -98300 -75206 -64969
16359 -64969 -61859 -90621 -110095 -75088 -22259 -57327 -93170 -69606 -76923 -34303 47539 14975
16347 14975 -1511 -32763 -72215 -73401 -118320 -130385 -105848 -108168 -69289 -56906 -75527 -68549
16335 -68549 -23860 -18752 -66037 -86926 -70085 -65738 -32386 -27898 -37265 -36639 -56276 -46898 15796
16322 15796 53650 54329 49255 82589 108063 124661 172515 194732 140907 70731 46705 62823
$$ packed form
16407i6483m7190K3356J0993K6153J959L9011l5089o899j2530K7966M3444l1993
16395e7302m4335J6505J2504J9313o0885n2964L9979p240R3683K194n7881m3621
16383a40050R189N4152j7474j912J6659k818R060k1522J2034J4523J5849q313
16371f0623k5323K3425K4291K1617q948N143l5710l2330j2187K345K3094J0237
16359f4969L110k8762j9474L5007N2829l5068l5843K3564p317M2620Q1842l2564
16347A4975j6486l1252l9452j186m4919j2065K4537k320L8879J2383j8621O978
16335f8549M4689N108m7285k0889J6841M347L3352M488r367O26j9637R378O2694
16322A5796L7854O79n074L3334K5474J6598M7854K2217n3825p0176k4026J6118
$$ plain form
16310 62823 124426 233386 304539 360504 458592 494234 466632 392943 325351 297945 313176
16299 313176 406171 523570 635284 710804 710421 669893 557277 503834 462165 413618 493329
16288 493329 630124 775379 870672 849250 754034 621019 501522 436927 449800 466353 544074
16277 544074 626607 670170 657216 562310 455274 408865 353355 345024 377373 402978 424357
16266 424357 450567 429192 410894 372321 276455 190859 178933 182504 231577 212294 192782 201521
16254 201521 177384 125973 93375 66088 -16882 -30445 -75487 -81067 -61868 -39391 -65929 -55009
16242 -55009 -40077 -49728 -63121 -46648 -36806 -41238 -58164 -62546 -44444 -59893 -59532 -13393 -3605
16229 -3605 -20740 -2757 -37611 -66149 -103983 -99432 -50038 -16423 27702 7468 -52268 -26729
$$ packed form
16310F2823O1603J08960P1153N5965R8088L5642k7602p3689o7592k7406J5231
16299C13176R2995J17399J11714P5520l83m0528j12616n3443m1669m8547P9711
16288D93329J36795J45255R5293k1422r5216j33015j19497o4595J2873J6553P7721
16277E44074Q2533M3563j2954r4906j07036m6409n5510q331L2349K5605K1379
16266D24357K6210k1375j8298l8573r5866q5596j1926L571M9073j9283j9512Q739
16254B01521k4137n1411l2598k7287q2970j3563m5042n580J9199K2477k6538J0920
16242e5009J4932r651j3393J6473R842m432j6926m382J8102j5449L61M6139R788
16229c605j7135J7983l4854k8538l7834M551M9394L3615M4125k0234n9736K5539
$$ plain form
16217 -26729 11973 -26100 12033 -33552 -76440 -104776 -87957 -63506 -65012 -85594 -107593 -108083
16205 -108083 -86174 -72955 -69265 -29555 -52826 -59127 -83319 -79901 -85697 -89877 -74601 -94244
16193 -94244 -119668 -70112 3193 -13334 -7853 -28439 -120753 -119075 -96513 -55142 -360 25023
16181 25023 73828 54992 32837 -19318 -60811 -80491 -129162 -80164 -17903 -45474 -79672 -29613
16169 -29613 -30026 -33042 -39747 -77647 -32920 -18861 -11094 -10453 38710 63122 72376 51159 12246
16156 12246 19885 25817 -24758 -87652 -79929 -56463 22658 45122 -10384 -35804 -11076 31947
16144 31947 76530 84220 44558 -7273 -50551 -60811 -23676 1802 -25782 -53701 -63347 -61920
16132 -61920 -66271 -63697 -127829 -163757 -126182 -117570 -109725 -88122 -59605 -57843 -72595 -31062 8388
$$ packed form
16217b6729L8702l8073L8133m5585m2888k8336J6819K4451j506k0582k1999m90
16205a08083K1909J3219L690L9710k3271o301k4192L418n796m180J5276j9643
16193i4244k5424M9556P3305j6527N481k0586r2314J678K2562M1371N4782K5383
16181B5023M8805j8836k2155n2155m1493j9680m8671M8998O2261k7571l4198N0059
16169b9613m13l016o705l7900M4727J4059P767O41M9163K4412R254k1217l8913
16156A2246P639N932n0575o2894P723K3466P9121K2464n5506k5420K4728M3023
16144C1947M4583P690l9662n1831m3278j0260L7135K5478k7584k7919r646J427
16132f1920m351K574o4132l5928L7575Q612P845K1603K8517J762j4752M1533L9450
$$ plain form
16119 8388 28250 35197 48311 35105 -54761 -87351 -79671 -64154 -58606 -34012 -85586 -127945
16107 -127945 -71271 -78767 -86585 -80101 -75999 -108649 -75811 21702 24519 28387 25400 18437 -4877
16094 -4877 7524 7912 -46432 -54422 -36097 10826 32641 37220 75686 59943 40687 23739 12057
16081 12057 30379 7233 -48574 -78061 -36908 -36256 -46844 -71834 -95418 -59080 -40287 -59724
16069 -59724 -61032 -29007 -40491 -56010 -47733 -103968 -124090 -84606 -49058 -103428 -102448 -129342
16057 -129342 -101534 -53328 -58561 -51355 -48091 -92425 -116202 -117628 -99328 -60159 -112550 -96305
16045 -96305 -35830 -6132 22056 7403 -22488 -31330 -61422 -79265 -99674 -88912 -112634 -172840
16033 -172840 -154135 -104489 -141431 -125733 -126330 -97154 -73111 -70781 -41726 -1181 -73984 -68623
$$ packed form
16119H388J9862O947J3114j3206q9866l2590P680J5517N548K4594n1574m2359
16107a27945N6674p496p818O484M102l2650L2838R7513K817L868k987o963k3314
16094d877J2401L88n4344p990J8325M6923K1815M579L8466j5743j9256j6948j1682
16081A2057J8322k3146n5807k9487M1153O52j0588k4990k3584L6338J8793j9437
16069e9724j308L2025j1484j5519Q277n6235k0122L9484L5548n4370R80k6894
16057a29342K7808M8206n233P206L264m4334k3777j426J8300L9169n2391J6245
16045i6305O0475K9698K8188j4653k9891q842l0092j7843k0409J0762k3722o0206
16033a72840J8705M9646l6942J5698n97K9176K4043K330K9055M0545p2803N361
$$ plain form
16021 -68623 -54134 -41669 4815 -23261 -94492 -142821 -136631 -76361 -72946 -152962 -156256 -134707
16009 -134707 -85341 -16840 6473 10861 -62177 -122970 -164168 -184822 -157199 -70697 -61070 -114350
15997 -114350 -148962 -60289 -30388 -64337 -93156 -98814 -129532 -123567 -107818 -107968 -106802 -95487
15985 -95487 -80978 -51296 -1637 -43425 -35825 -28025 3494 14802 4714 -10851 -27925 -55388
$$ packed form
16021f8623J4489J2465M6484k8076p1231m8329O190O0270L415q0016l294K1549
16009a34707M9366O8501K3313M388p3038o0793m1198k0654K7623Q6502R627n3280
15997a14350l4612Q8673K9901l3949k8819n658l0718N965J5749j50J166J1315
15985i5487J4509K9682M9659m1788P600P800L1519J1308j0088j5565j7074k7463
$$ [...]
##END NTUPLES=NMR SPECTRUM
##END=
